##TITLE=Analysis number 311492
Compound Code cc 45501
Book Reference 440/42
Project Code qc-cat
Chemist Name craigr
##JCAMPDX= 6.0         $$ Bruker NMR JCAMP-DX V2.0
##DATA TYPE= NMR SPECTRUM
##DATA CLASS= NTUPLES
##ORIGIN= Bruker BioSpin GmbH
##OWNER= NMR
$$ XWIN-NMR		Version 3.5
$$ Wed Jul 13 09:35:18 2005 GMT Daylight Time (UT+1h)  MAYBRIDGE\NMR@NMR_250MHZ
##.OBSERVE FREQUENCY= 250.131544655141
##.OBSERVE NUCLEUS= ^1H
##.ACQUISITION MODE= SIMULTANEOUS (DQD)
##.ACQUISITION SCHEME= undefined
##.AVERAGES= 16
##.DIGITISER RES= 18
##SPECTROMETER/DATA SYSTEM= dpx250
##.PULSE SEQUENCE= zg30
##.SOLVENT NAME= DMSO
##.SHIFT REFERENCE= (INTERNAL, DMSO, 0, 16.522)
##AUDIT TRAIL= $$ (NUMBER, WHEN, WHO, WHERE, WHAT)
$$ ##TITLE= Audit trail, XWIN-NMR		Version 3.5
$$ ##JCAMPDX= 5.01
$$ ##ORIGIN= Bruker BioSpin GmbH
$$ ##OWNER= NMR
$$ C:\u/data/dgb/nmr/ADRS/5710/pdata/1/auditp.txt
$$ ##AUDIT TRAIL=  $$ (NUMBER, WHEN, WHO, WHERE, WHAT)
(   1,<2005-07-13 09:34:53.24 +100>,<MAYBRIDGE\NMR>,<NMR_250MHZ>,
      <created by zg, POWCHK disabled, PULCHK disabled
       configuration hash MD5:
       62 19 C7 07 E1 42 D1 B7 37 6C 3D D0 77 39 F9 E6
       data hash MD5: 64K
       2C 60 69 2F 80 42 6E 0F 7B 0B 81 54 9E 2D C5 30>)
(   2,<2005-07-13 09:35:06.39 +100>,<MAYBRIDGE\NMR>,<NMR_250MHZ>,
      <Start of raw data processing
       ef LB = 0.3 FT_mod = 6 PKNL = 1 SI = 32K 
       data hash MD5: 32K
       CD AD 97 96 11 36 D3 FA 04 47 1A 3B E3 9E 8F D9>)
(   3,<2005-07-13 09:35:08.41 +100>,<MAYBRIDGE\NMR>,<NMR_250MHZ>,
      <apk 
       data hash MD5: 32K
       E3 EE 2F 98 FE C1 31 F8 5A F6 AA 76 1D 73 B5 FD>)
(   4,<2005-07-13 09:35:09.10 +100>,<MAYBRIDGE\NMR>,<NMR_250MHZ>,
      <abs ABSG = 5 
       data hash MD5: 32K
       EE 18 A3 E9 57 B4 68 A2 B1 32 4E E1 A9 C4 3B F3>)
$$ ##END=
$$ 
$$ hash MD5
$$ D8 2D FD 6A B7 DC 72 B4 E7 DE 41 4B 9B 5F 56 F7
##$RELAX= 
##$RELAX= 
##$RELAX= 
##$RELAX= 
##$RELAX= 
##$RELAX= 
##$RELAX= 
$$ Bruker specific parameters
$$ --------------------------
##$DU= <C:\u>
##$EXPNO= 5710
##$NAME= <ADRS>
##$PROCNO= 1
##$TYPE= <nmr>
##$USER= <dgb>
##$AMP= (0..31)
100 100 100 100 100 100 100 100 100 100 100 100 100 100 100 100 100 100 
100 100 100 100 100 100 100 100 100 100 100 100 100 100 
##$AQSEQ= 0
##$AQ_mod= 3
##$AUNM= <au_zg>
##$AUTOPOS= <1 >
##$BF1= 250.13
##$BF2= 250.13
##$BF3= 250.13
##$BF4= 250.13
##$BF5= 500.13
##$BF6= 500.13
##$BF7= 500.13
##$BF8= 500.13
##$BYTORDA= 1
##$CFDGTYP= 0
##$CFRGTYP= 5
##$CHEMSTR= <none>
##$CNST= (0..31)
1 1 145 1 1 1 1 1 1 1 1 1 1 1 1 1 1 1 1 1 1 1 1 1 1 1 1 1 1 1 1 1 
##$CPDPRG= <>
##$CPDPRG1= <>
##$CPDPRG2= <>
##$CPDPRG3= <>
##$CPDPRG4= <mlev>
##$CPDPRG5= <mlev>
##$CPDPRG6= <mlev>
##$CPDPRG7= <mlev>
##$CPDPRG8= <mlev>
##$CPDPRGB= <>
##$CPDPRGT= <>
##$D= (0..31)
0 1 0 0 0 0 0 0 0 0.06 0 0 0 0 0 0 0.0002 0 0 0 0 0 0 0 0 0 0 0 0 0 0 
0 
##$DATE= 1121243691
##$DBL= (0..7)
120 120 120 120 120 120 120 120 
##$DBP= (0..7)
150 150 150 150 150 150 150 150 
##$DBP07= 0
##$DBPNAM0= <>
##$DBPNAM1= <>
$$ [...]
##$SUBNAM7= <"">
##$SUBNAM8= <"">
##$SUBNAM9= <"">
##$SW= 20.6930455092707
##$SWIBOX= (0..15)
0 0 3 0 0 0 0 0 0 0 0 0 0 0 0 0 
##$SW_h= 5175.983436853
##$TD= 65536
##$TD0= 1
##$TE= 295.16
##$TE2= 300
##$TE3= 300
##$TEG= 300
##$TL= (0..7)
0 120 120 120 120 120 120 120 
##$TP= (0..7)
150 150 150 150 150 150 150 150 
##$TP07= 0
##$TPNAME0= <>
##$TPNAME1= <>
##$TPNAME2= <>
##$TPNAME3= <>
##$TPNAME4= <>
##$TPNAME5= <>
##$TPNAME6= <>
##$TPNAME7= <>
##$TPOAL= (0..7)
0.5 0.5 0.5 0.5 0.5 0.5 0.5 0.5 
##$TPOFFS= (0..7)
0 0 0 0 0 0 0 0 
##$TUNHIN= 0
##$TUNHOUT= 0
##$TUNXOUT= 0
##$USERA1= <user>
##$USERA2= <user>
##$USERA3= <user>
##$USERA4= <user>
##$USERA5= <user>
##$V9= 5
##$VALIST= <valist>
##$VCLIST= <CCCCCCCCCCCCCCC>
##$VD= 0
##$VDLIST= <DDDDDDDDDDDDDDD>
##$VPLIST= <PPPPPPPPPPPPPPP>
##$VTLIST= <TTTTTTTTTTTTTTT>
##$WBST= 1024
##$WBSW= 4
##$XGAIN= (0..3)
0 0 0 0 
##$XL= 0
##$YL= 0
##$YMAX_a= 233243
##$YMIN_a= -368110
##$ZGOPTNS= <>
##$ZL1= 120
##$ZL2= 120
##$ZL3= 120
##$ZL4= 120
##$ABSF1= 16.522
##$ABSF2= -4.171173
##$ABSG= 5
##$ABSL= 3
##$ALPHA= 0
##$AQORDER= 0
##$ASSFAC= 0
##$ASSFACI= 0
##$ASSFACX= 0
##$ASSWID= 0
##$AUNMP= <proc_1d>
##$AZFE= 0.1
##$AZFW= 0.1
##$BCFW= 0
##$BC_mod= 0
##$BYTORDP= 0
##$COROFFS= 0
##$CY= 12.5
##$DATMOD= 1
##$DC= 0
##$DFILT= <>
##$DTYPP= 0
##$F1P= 14.0000005364418
##$F2P= -0.99999901652339
##$FCOR= 0.5
##$FTSIZE= 32768
##$FT_mod= 6
##$GAMMA= 0
##$GB= 0
##$INTBC= 1
##$INTSCL= 1
##$ISEN= 128
##$LB= 0.3
##$LEV0= 0
##$LPBIN= 0
##$MAXI= 10000
##$MC2= 0
##$MEAN= 0
##$ME_mod= 0
##$MI= 0
##$NCOEF= 0
##$NC_proc= -5
##$NLEV= 6
##$NOISF1= 0
##$NOISF2= 0
##$NSP= 0
##$NTH_PI= 0
##$NZP= 0
##$OFFSET= 16.522
##$PC= 1
##$PHC0= -93.53136
##$PHC1= 17.09447
##$PH_mod= 1
##$PKNL= yes
##$PPARMOD= 0
##$PSCAL= 4
##$PSIGN= 0
##$REVERSE= no
##$SF= 250.13
##$SI= 32768
##$SIGF1= 0
##$SIGF2= 0
##$SINO= 400
##$SIOLD= 32768
##$SREGLST= <1H.DMSO>
##$SSB= 0
##$STSI= 32768
##$STSR= 0
##$SW_p= 5175.98343685301
##$SYMM= 0
##$S_DEV= 0
##$TDeff= 65536
##$TDoff= 0
##$TI= <Analysis number 999999
Compound Code 99
Book Reference 9
Project Code 9>
##$TILT= no
##$TM1= 0
##$TM2= 0
##$TOPLEV= 0
##$USERP1= <user>
##$USERP2= <user>
##$USERP3= <user>
##$USERP4= <user>
##$USERP5= <user>
##$WDW= 1
##$XDIM= 32768
##$YMAX_p= 320422451
##$YMIN_p= -944127
$$ End of Bruker specific parameters
$$ ---------------------------------
##NTUPLES= NMR SPECTRUM
##VAR_NAME=  FREQUENCY,     SPECTRUM/REAL,   SPECTRUM/IMAG
##SYMBOL=    X,             R,               I
##VAR_TYPE=  INDEPENDENT,   DEPENDENT,       DEPENDENT
##VAR_FORM=  AFFN,          ASDF,            ASDF
##VAR_DIM=   32768,         32768,           32768
##UNITS=     HZ,            ARBITRARY UNITS, ARBITRARY UNITS
##FACTOR=    0.157963299565203, 1,           1
##FIRST=     4132.6476996994, 0,             0
##LAST=      -1043.33573715361, 0,           0
##MIN=       -1043.33573715361, -944127,     0
##MAX=       4132.6476996994, 320422451,     0
$$ Real data points
##PAGE= N=1
##DATA TABLE= (X++(R..R)), XYDATA
$$ [...]
19503 40046 -151914 -189294 -120903 -199616 -495675 -411024 -284061 -111769 -83789 -344 327580
19492 327580 139706 61394 -2257 1253 -13735 -157138 -167083 -200103 -169207 -89696 -118851
19481 -118851 21351 43369 -10083 -3398 100374 111790 61879 89642 210543 171913 171486
19470 171486 329447 361760 571052 328703 281791 295835 132349 -20920 84149 154246
19460 154246 248999 328095 456110 351720 235238 100233 16640 223910 216419 78444
19450 78444 142919 288592 324561 -124710 -185732 94628 157802 65875 238496 421160 344067
19439 344067 215449 147270 282396 366849 467147 334263 9147 -41374 -7501 -46190
19429 -46190 -50246 40066 45375 81953 226373 224686 284158 166670 322530 285888 3396
19418 3396 -43040 -10247 -38129 127007 311998 263334 -93013 -268942 -293172 -41662 82590
19407 82590 90081 174100 198318 345045 437312 173001 135781 227644 302350 412339 498281
19396 498281 394698 399466 342113 172070 88025 -90337 -143285 -1446 177593 240812 290016
19385 290016 330846 242856 -53414 -66344 120662 314070 403032 209852 272921 604177
19375 604177 618161 456868 150879 180184 232866 116066 134472 193158 131665 -22384 220418
19364 220418 371058 113894 -112013 -107303 -154325 23494 125698 266322 555581 551588
19354 551588 306260 85611 187830 400450 448760 349000 99529 -120647 -77843 105957
19344 105957 181894 184778 -27230 -245381 22955 381823 327279 324083 272250 386502 161689
19333 161689 -172140 102989 226955 421990 355979 234400 408003 311352 216895 74678
19323 74678 36896 199546 311100 496171 300696 269398 183356 306365 328023 256805 329859
19312 329859 171170 38851 97319 254025 400373 402494 351476 573444 697388 733820
19302 733820 796022 921626 906819 543472 466591 395527 233395 76637 90009 325180
19292 325180 194905 377152 349615 309891 394398 443551 278003 40897 12149 281749
19282 281749 374865 203455 -141255 -115274 8810 849 137204 66279 226153 256177 448958
19271 448958 481881 433706 525777 509410 336228 376315 494742 622733 769219 663600
19261 663600 526285 721149 705393 763605 783808 825382 617255 549814 380101 309730 147043
19250 147043 8862 139211 170182 41166 157963 324419 501904 643804 795522 535449
19240 535449 293844 460137 537416 438565 427518 400877 265688 466720 576450 654514
19230 654514 594887 636434 642714 618548 308688 249567 279570 398367 377762 475139 523048
19219 523048 569756 693392 787657 796831 784987 948458 739032 667553 719116 816381 890521
19208 890521 840283 807749 957348 1199464 1176075 1156041 1076484 971162 1079358 1217221
19198 1217221 1189328 1040833 971552 1083035 1144156 1088182 980770 1064644 1215656 1101275
19188 1101275 1154910 979603 867743 951801 1120345 1195887 1302085 1461166 1632394 1760139
19178 1760139 1774084 1749760 1899517 2032718 2367174 2480284 2424717 2472956 2646216 2847629
19168 2847629 3246553 3392198 3653390 3973665 4230984 4466979 5148907 6087739 7044485
19159 7044485 8231704 9693782 11728013 14337824 17034651 19399335 20752200 21551867
19151 21551867 22318361 24084730 27424650 33331881 42774779 56183049 73700549 92812849
19143 92812849 108049500 114290279 111937569 104121301 92392041 78792008 65511599
19136 65511599 54087098 46184322 42071249 40690021 40598977 40230573 38039149 33798091
19128 33798091 28375011 23177663 18739505 15177851 12387196 10574285 9434662 8558388
19120 8558388 8309254 8188666 8024355 7876167 7742473 7731750 7743705 8119967 8623686 9121318
19110 9121318 9825974 10785160 12356327 14664703 17886141 22348959 27938647 33968772
19102 33968772 39131576 42015245 42839579 42756767 43104897 45647337 51997093 62674589
19094 62674589 77461301 94623449 111262270 125406941 134174515 132437501 118705862
19087 118705862 97928396 76224813 57792163 44259878 35173269 29348946 26312085
19080 26312085 25154834 24232364 22515730 20051307 16991471 13968671 11155074 8907516
19072 8907516 7336578 5969516 5107673 4482740 4010473 3487734 3071835 3014393 2853767
19063 2853767 2531932 2310962 1911743 1623851 1626374 1390597 1022132 824223 783490 734179
19053 734179 783403 732915 725414 893327 802426 625344 479088 400456 576171 676296 633956
19042 633956 409299 183757 365199 540103 719281 886397 998087 1091573 907363 651420
19032 651420 353946 427657 538208 366492 381995 94899 -98918 95872 238162 138155
19022 138155 147505 214623 282448 301163 280875 343647 246332 303982 -30635 -213559 -283747
19011 -283747 -46831 -51575 -926 233909 489550 351147 204847 -10111 -235280 -43225
19001 -43225 145258 -4587 -286281 -202239 -74068 9518 187411 281454 116469 171315
18991 171315 273331 363123 315545 306458 307391 525971 662324 232480 -165480 -139528 -46147
18980 -46147 286587 445167 362365 171629 71475 181854 304390 296954 363141 339007 185156
18969 185156 -5234 -272000 -224678 -102602 -120175 -18530 35020 -218808 -287045 -114478
18959 -114478 61265 158799 372450 560590 449761 335562 192241 92788 -204693 -309059
18949 -309059 -386213 -320205 -94749 80124 -116547 -195140 -311604 -480102 -556270 -209731
18939 -209731 -9344 108658 147205 96301 241325 269968 241095 135798 104936 -5078
18929 -5078 -3690 -184959 -202908 -91684 56312 11159 -184425 -126364 35928 -22070 -58079
18918 -58079 -142132 -157556 -208410 -380105 -196052 -54450 -48484 29343 -21885 -33601 180633
18907 180633 233494 9414 -157918 -183615 -114164 81957 -158609 -196340 -157032 133718
18897 133718 448502 661239 829487 824354 753668 780420 741711 811354 921595 832199 956135
18886 956135 880137 918050 781452 655784 792545 766855 669640 790059 752776 635254
18876 635254 559855 457258 266362 114617 141312 237529 331699 270406 221457 102358 -72158
18865 -72158 -4736 -54640 -74733 -17267 -181219 -340756 -559170 -433338 -100227 68864
18855 68864 -23289 -8121 172507 277604 275558 649289 578990 342090 309635 255375 21805
18844 21805 65823 246978 143518 132230 413244 579557 547155 544278 681431 510122 440554
18833 440554 411111 462922 561441 454775 275968 261646 204028 -136129 -71591 233891 293615
18822 293615 324932 447829 375298 260941 159894 298087 591498 580111 475843 143627
18812 143627 -72735 48841 -17405 -9516 -223857 -19271 226235 152727 364048 360870 327345
18801 327345 9485 259 -118732 -26929 -72582 -197956 -463313 -516415 -415617 -309082
18791 -309082 -21370 -134668 -312221 -158407 -68031 -169066 -215061 -177683 -141458 166376
18781 166376 344410 205140 94792 -260801 -266544 -270291 -487798 -640380 -462978 -425236
18771 -425236 -499664 -465294 -429605 -304379 -115761 -113573 -283532 -178154 -20265 47029 -122153
18760 -122153 -123086 -224979 -380938 -203084 -277430 -210559 -30186 -105339 -39773 -32421 -15025
18749 -15025 -163022 -150428 -154332 -269210 -350486 -437286 -413293 -393115 -222657 -328114 -467765
18738 -467765 -375734 -292975 -258605 -270118 -290650 -80416 40095 18356 -89626 -74097 -97819
18727 -97819 -129321 32762 213013 59353 -220151 -320853 -146260 10729 -110063 -281424
18717 -281424 -154748 189621 223416 -26506 -226016 -312958 -214251 60481 194300 -31044
18707 -31044 -281611 -283947 -109631 -77088 -76110 -123594 -70668 -298870 -280038 -98209 -154529
18696 -154529 -209821 -227321 -338978 -377903 -298831 -219451 -275138 -329879 -220021 21506 61185
18685 61185 -37801 205218 478197 559686 525099 258517 243542 453430 410614 254186 -5078
18674 -5078 -158967 -169841 -266936 -324374 -333976 -274298 -164556 -112134 -109369 -100123 -66213 -97523
18662 -97523 -64951 1695 110063 218 8783 125911 95853 -28951 176520 191187 461176
18651 461176 598408 404686 108277 298814 64369 -97801 81823 42732 -13757 -183776
18641 -183776 -63620 236032 296019 158601 213773 270252 298669 441275 578276 648225
18631 648225 597298 601721 437485 488040 392793 130475 91623 23483 91857 260727 94187
18620 94187 -102840 87258 40607 106508 150804 -127206 -184807 -128161 55105 39601 -32148
18609 -32148 95361 353141 383372 283091 199781 -15591 -127874 -288139 -235813 -174040
18599 -174040 -167373 -101595 164080 348191 194830 369479 562828 534239 358979 303074
18589 303074 369164 295558 625833 822351 806897 846479 797920 665612 516743 416684
18579 416684 162388 132275 353156 526550 563742 469651 254812 399882 565734 587139
18569 587139 588472 515271 431735 482923 510327 500956 491010 416183 291447 248980 381767 531592
18557 531592 458972 552134 657848 777477 571627 276603 163168 291508 237414 34401
18547 34401 -93385 89776 90230 -150721 -60228 56682 87647 -8932 138000 165945 93882
18536 93882 130378 155620 238154 266056 251813 142061 96150 13429 -43571 7179 168058
18525 168058 194176 354958 387829 234159 34287 103793 326621 627771 264871 191682
18515 191682 316288 472602 303399 152210 246191 466880 473211 93473 32141 37240 -27389
18504 -27389 145461 200528 99165 32111 154705 82962 238672 398671 576089 449571
18494 449571 359791 275413 321593 155145 165253 298608 387519 158125 52316 93691 149726
18483 149726 -2434 206535 435134 500895 402462 402347 418438 440737 686219 747223 556070
18472 556070 486021 478006 506874 396655 594396 729623 617356 464362 379405 506875
18462 506875 533840 488133 746805 842317 798939 925649 1046122 919623 938704 1131512
18452 1131512 989021 624060 563045 573542 457151 440882 655662 924883 911534 770245
18442 770245 736586 716662 621279 552860 461598 549774 581988 609548 605329 687889 656027 626676
18430 626676 893395 1106287 1243075 1156787 1038240 1155543 1286492 1274566 1172681 1267419
18420 1267419 1198774 1041236 974881 1210926 1614132 1974550 2212765 2093184 2218671 2447791
18410 2447791 2580711 2948343 3188930 3490901 3609532 3872305 4281806 4530559 4901787
18401 4901787 5546296 6058049 6806198 7843669 9274802 10816426 12604815 14540362 16732411
18392 16732411 19155914 21542933 23600467 26117324 29473607 34416405 41541867 50795384
18384 50795384 61665522 73598116 86905374 99645041 108069327 110254147 107908142
18377 107908142 102703893 94444818 83989522 73398957 64139504 56623331 50850022 46539093
18369 46539093 43478438 41059342 38003453 34449374 30635124 26618440 22774320 19405006
18361 19405006 16278356 13652629 11949972 10911422 9891913 9001344 8471084 8349944
18353 8349944 8302577 8239915 8172992 8366530 8887350 9733661 10772202 11994337 13819453
18344 13819453 16076740 18876755 22050880 25843085 29789809 33334534 36258738 38514363
18336 38514363 41161549 44839362 49674109 55762276 63321531 72487022 81170863 87668598
18328 87668598 92481525 95758339 94485003 87722920 77658567 66908210 56544033 46734389
18320 46734389 38299789 31583289 26576110 23291258 20968506 18742479 16605020 14365003
18312 14365003 12556176 10844325 9320033 7860037 6616150 5625396 4930941 4094047
18304 4094047 3458148 2964944 2614727 2294173 2112348 2127909 1914437 1736213 1635347 1466029
18294 1466029 1076214 707137 563299 561592 576351 214117 192350 239268 311516 396328 503600
18283 503600 343452 206639 207982 204897 362849 214406 -123311 -29574 166181 138926 -99304
18272 -99304 -188506 39300 247121 470601 414747 321419 303406 400457 283771 102165 195117
18261 195117 82954 92654 61352 1040 101362 257776 183329 -11632 24339 251663 235867
18250 235867 130142 148603 100976 -94997 -159303 -62515 -289477 -475985 -306926 -217663
18240 -217663 -52189 -67178 -248840 -311525 -205380 271037 281104 374501 424460 368901 311881
18229 311881 403747 400916 410773 393824 340953 236205 187095 65488 -72157 115712 155511
18218 155511 211574 320316 452040 517799 586050 440392 41 27372 -196977 -349230
18208 -349230 -393110 -143122 -55993 -175371 9931 323096 324317 172880 -111420 -214242
18198 -214242 -123072 9220 29133 -60902 -110545 99833 128985 -163500 -460688 -215627
18188 -215627 -219019 -293238 101259 460826 508394 473864 451843 259701 187637 -20986 -276786
18177 -276786 -115002 135385 25365 142451 313772 322061 268505 73385 11868 -60749
18167 -60749 90628 99573 60541 49707 -19795 -98983 -287479 -104358 358138 177465 18809
18156 18809 104511 -266227 -241586 13970 569 -66093 -124930 -3752 -69703 -202749 -307535
18145 -307535 -269608 -302272 -261233 -207135 -124824 -182118 -72362 -119621 22485 210966 159952
18134 159952 49682 -212173 -212829 -221995 -246163 -186857 -42740 -99921 -128144 -287677 -271959
18123 -271959 -196721 -76564 -96216 50041 275321 405827 380851 226755 7029 -27072
18113 -27072 56090 3096 2873 -168484 -243055 -66278 99433 73111 91054 80652 396118
18102 396118 537468 372975 412916 155214 -39208 95579 255284 250044 130374 121982
18092 121982 -68229 -46732 112413 136109 82097 89122 58737 -141013 -139398 -4816 35568
18081 35568 -95345 -112168 -206139 -201548 -214243 -227334 -108772 -31903 148918 76768 -65151
18070 -65151 13252 -62659 24446 159639 88842 140125 305916 296940 150120 -93487 -94840
18059 -94840 49942 -7246 53380 54449 -83394 -54546 155044 390090 575707 495345 293617
18048 293617 265727 302957 235721 252739 -13552 -151012 -146556 -176359 792 145822 173549
18037 173549 301248 236956 240951 273075 158764 240335 417430 345054 477093 149634 -154300
18026 -154300 -95443 -6988 -56952 -347094 -428794 -471955 -552135 -465585 -487432 -422212 -260081
18015 -260081 -378192 -487500 -438326 -582524 -338997 -224813 -272190 -497404 -261373 -323987
18005 -323987 -373652 -341239 -346249 -358787 -415773 -566344 -323257 -138899 -4194 -244335 -372851
17994 -372851 -255130 -68752 13144 -16710 -43330 11992 -237079 29787 191825 79018
17984 79018 -9234 -79854 -275772 -498045 -276524 -109986 2579 -78381 -255153 -472432
17974 -472432 -470418 -574998 -391891 -222824 -91964 -295353 -292065 -240107 -230875 -311043 -387709
17963 -387709 -279793 -129752 -226933 -462737 -325463 -483148 -606035 -475752 -190992 -51389
17953 -51389 29977 46159 66589 110351 149910 212711 236817 24168 -201187 -326900 -270917
17942 -270917 -45132 -4617 -125501 -177511 -230624 -304935 -431395 -465979 -461535 -361987 -369235
17931 -369235 -404138 -170079 71485 85769 -116313 -191663 -185991 -184985 -48200 -97775 -164029
17920 -164029 -145231 -157559 -169766 -243975 -374329 -224160 -72992 -175001 -112087 -54600 32218
17909 32218 -103597 -230388 -104637 356405 267972 -292849 -348972 -193695 -157542 -124756
17899 -124756 -19542 90331 71095 -13349 -26831 -214047 -317513 -313511 -453184 -419652 -581300
17888 -581300 -662525 -483315 -239831 -103803 -139092 -127219 -172931 -373798 -227857 -140251
17878 -140251 -173444 -194653 -230448 -344492 -465087 -541865 -273040 -117609 114483 189053
17868 189053 227402 127641 124849 200296 -155897 -175155 -174152 -227262 -420211 -413474 -302551
17857 -302551 -226286 -103491 57692 57621 -97333 -69098 96496 94380 21547 47222 -33042
17846 -33042 -33752 122353 54397 -169057 6492 180558 440019 571301 433898 261393
17836 261393 264290 318597 226999 237032 117655 -2378 133579 126580 243698 187005 327288
17825 327288 544467 446326 507900 318276 71170 190851 130046 -27530 -47294 4381
17815 4381 66791 98569 20409 -175381 -197841 -62035 37048 70008 -28236 14648 227818
17804 227818 319433 93797 20807 109376 -18295 122853 257061 30339 -324583 -307914
17794 -307914 -133295 -82572 -233694 -208822 -40935 61182 69164 35749 -94488 -109869 -286861
17783 -286861 -233636 -325425 -280921 -252875 -222867 -21311 276115 342558 10799 -213648 -385156
17772 -385156 -423677 -171779 172950 -63256 -320045 -363974 -369029 -437769 -219437 -195389 -520778
17761 -520778 -748898 -628365 -404570 -239149 -206312 -196254 -254115 -325025 -126328 -132112 -160172
17750 -160172 -109205 -263379 -318269 -85590 -101393 -168323 -86983 -77930 -49529 126003 -10679
17739 -10679 -77716 -83539 -79471 -105310 -115020 18873 35940 -111711 -136653 -91505 -41414 -246855
17727 -246855 -10760 284249 409156 159841 160433 -11452 21875 4121 -78300 -24889 -148248
17716 -148248 -44469 131355 63442 23102 -35941 -52310 -108389 -166149 -163850 -35190 -18458
17705 -18458 30427 -1923 -244337 -474547 -378076 -420969 -396474 -421575 -268229 4400 170470
17694 170470 180399 -102469 -44171 100885 159361 137181 5547 116349 32005 -25085 -172180
17683 -172180 -51085 -204123 -165036 -88079 -16349 91634 -159603 -202785 -82850 37433
17673 37433 -94005 -275829 -239147 -260391 -380720 -423384 -453393 -516267 -453007 -328542 -181138
17662 -181138 51223 -84843 -178237 -77934 -4629 126716 -87326 -48785 206276 61779
17652 61779 -32871 -161468 -263126 -398925 -643115 -544297 -344746 -63515 366268 298104
17642 298104 155795 253057 6349 -52410 69448 102020 23315 -65099 37657 -99433
17632 -99433 -258177 -331732 -313833 -199358 -100814 -119831 -147010 -226035 -368721 -261652 -172231
17621 -172231 -96828 89407 82274 205587 235907 1009 -136459 -35454 101612 -15330
17611 -15330 -176612 -74979 61044 13724 -140004 -254391 -352430 -144689 161895 226120
17601 226120 11825 -164048 -300013 -324436 -349008 -344380 -367227 -405582 -250770 -164512 -15621
17590 -15621 -45859 46280 -73188 -130419 -70893 -159063 -100858 -100247 -59070 66831 189218
17579 189218 139833 58686 -18153 -84767 -195423 -136750 -202059 -196491 -214413 -227142 -155317
17568 -155317 44176 -47673 -177914 -233433 -173378 -307340 -226267 257683 288784 -1420
17558 -1420 -44963 53344 46413 -78563 144075 72733 -287700 -278629 -4191 -50050 -362583
17547 -362583 -567156 -682625 -466106 -361261 -388106 -202733 -28328 -36639 -158975 -293429
17537 -293429 -417444 -455830 -205966 -235060 -343231 -280556 -211891 -78700 -58046 -107110 -26770
17526 -26770 -170026 -59785 110659 198143 -82247 -169302 -317933 -249338 -151876 -153695 -254965
17515 -254965 -252342 -184865 -406853 -336731 -313459 -215794 -58461 -71276 6802 -12587 -12679 -106380
17503 -106380 -122448 -37596 -29384 16481 -81818 17561 -30486 -84062 -274395 -40718 -10149
17492 -10149 56773 276149 275627 221733 244208 34486 -113522 -15698 -52364 -233142 -416815
17481 -416815 -390460 -208131 -137108 -236137 -104088 78673 -110936 -303338 -432734 -607263
17471 -607263 -544318 -336285 -226281 -276105 -458129 -477971 -270023 -112040 -76 131779
17461 131779 57250 55 -115814 -134293 -89583 31685 -45904 -333884 -289680 -284017 -149677
17450 -149677 -77529 37258 26193 -65359 -208992 -110330 -78290 -224168 -351537 -310225 -242024
17439 -242024 -8770 242704 93975 -1597 -14793 -165852 -211425 -212246 -76120 -79352 -21337
17428 -21337 -68950 -203477 -158426 -228603 -185784 179065 126016 -143549 -346908 -528656 -351288
17417 -351288 -193985 -342044 -366543 64045 280412 237136 -1358 -161336 -55740 42744
17407 42744 -97790 -281770 -384016 -345193 -157744 48783 121523 71151 -8604 -14314 -23284
17396 -23284 -252413 -397978 -250249 41164 6314 136611 4548 -148186 1693 48191
17386 48191 -40184 -122348 -199054 -214144 -425684 -367491 -429266 -280616 -228404 -375947 -254459
17375 -254459 -225440 -250482 -258532 -289897 -105490 -92601 -222098 -425376 -463013 -412963 -361381
17364 -361381 -58585 -197314 -306224 -362480 -385159 -376266 -189359 -94007 -113669 -295668 -238624
17353 -238624 -126381 40601 202819 50915 -236103 -386653 -392385 -244616 117301 196513
17343 196513 43809 -119928 -351447 -319669 -159895 -128000 -41968 -143433 -265293 -272828
17333 -272828 -121532 -187325 -309796 -293119 -298367 -305747 -371906 -298947 -110542 -8252 -99491
17322 -99491 -176249 -194638 -134804 22179 82123 290355 622678 473052 343957 122353
17312 122353 73420 81587 85873 -39296 -191215 -377141 -394939 -362116 -273402 -205022 -324846
17301 -324846 -300524 -177109 -48034 39409 226694 260106 370688 492129 455895 123268
17291 123268 23513 160806 -1045 -81046 -73068 -151144 -393170 -530547 -549227 -603846 -599392
17280 -599392 -670634 -564138 -223771 -224894 -124871 -133691 -165923 -64020 253212 148621 -45752
17269 -45752 52540 -147745 -289008 -232097 -43565 70001 -40603 -237062 -379868 -150759
17259 -150759 75824 -200018 -423397 -428685 -234124 -370049 -314014 137965 117916 -164232
17249 -164232 -210805 -47118 89613 -36408 -173366 -123253 -151384 122010 171266 170113 190264
17238 190264 146632 98286 142720 132568 75394 99974 59803 -5127 -166448 -290154 -138412
17227 -138412 184167 352425 273227 265818 270041 331354 323552 164031 -74080 -70786 107431
17216 107431 -2 888 3392 -89083 -456 -72501 -274169 -225647 -273040 -244050 -56063
17205 -56063 -8877 -100248 -210947 -60622 -39172 -73427 116518 -51676 -136313 98289 276206
17194 276206 202412 -138387 -91042 127311 81481 74307 9028 12061 35586 -24708 -1487
17183 -1487 -106480 12591 30272 27117 184193 443929 503533 240043 252631 300439 78730
17172 78730 68582 2856 -141151 -269271 -101631 181851 228766 184853 239060 275559 229121
17161 229121 95521 90000 153337 118461 -13504 -171909 -120259 83947 2673 -257741 -262338
17150 -262338 -39625 11464 -59393 -55356 3574 -7326 -43161 -52019 -245094 -282934 -233319
17139 -233319 -172050 58855 253610 109828 -206857 -270727 -290759 -270397 -262188 -367514 -463645
17128 -463645 -428646 -89948 -232674 -361622 -373643 -224695 -71723 -95875 -197587 -62542
17118 -62542 63006 -38675 -77987 -146800 -136691 -5272 -161707 -225906 -45022 -31935 -270385
17107 -270385 -163751 -316032 -290667 -200330 -290 40029 -37900 60343 127376 -39861 -80952
17096 -80952 -269144 -487126 -599310 -378133 -342628 -345060 -207695 -74087 -68223 -151232 -239869
17085 -239869 -334089 -408449 -432244 -431570 -493210 -346703 -3959 -30770 -53234 -78061 -20298
17074 -20298 -138580 -34200 88654 26697 147607 49125 137683 93945 57521 56307 83867
17063 83867 73230 183518 319117 268274 153849 80464 -38445 -159714 -206005 -269693 -319237
17052 -319237 -202723 -224440 -221005 -51534 -143896 -199235 -10977 58270 17308 98721 20266
17041 20266 -225242 -355469 -415965 -242326 -7481 105018 125045 66069 -169925 -200019
17031 -200019 -175994 -374019 -129578 -122314 -14722 -18857 66350 155275 182196 273421 321360
17020 321360 157735 185738 326534 221738 14112 3052 127053 222086 183930 31915
17010 31915 58129 48510 -93897 -88609 -22342 -10998 -42665 -104488 -133167 -45741 69223 -50792
16998 -50792 -206300 -102390 -107377 -288115 -226501 -138311 -156973 -27421 -86831 -195245 -180308
16987 -180308 -391153 -601981 -796094 -917154 -829939 -642793 -430989 -87146 -133606 -221547
16977 -221547 -91487 104228 39660 52968 -16931 83813 -19285 -270334 -476202 -555882
16967 -555882 -438367 -299953 -252121 -181460 -8126 -308549 -467892 -342388 -240305 -295377
16957 -295377 -376196 -385910 -103664 -199340 -339114 -375663 -368122 -441457 -237910 -65125 -84192
16946 -84192 -7279 103643 209380 106159 48503 65201 27716 84519 39173 -139171 105050
16935 105050 85857 -25225 -121748 -13712 -27052 -165002 -256197 -234645 -90694 37934
16925 37934 -151288 -390321 -449250 -350383 -181971 -55442 -25343 -13403 -43887 -41862 47823
16914 47823 135449 76500 -76353 -279422 -351846 -327195 -96147 -73585 75295 319201 347321
16903 347321 281526 242292 276049 291093 240841 84058 -63042 133224 69971 -257921 -337708
16892 -337708 -176514 -235299 -387351 -162504 -62735 42064 149710 276275 1098 -248385
16882 -248385 -135649 -152830 -460191 -555800 -582812 -913159 -877500 -653160 -460046 -355606
16872 -355606 -205134 -229181 -408307 -628516 -444635 -150951 -13310 -143547 -287276 -214298
16862 -214298 -256082 -225369 -362658 -411118 -172093 -89025 -158490 -50687 -41900 138770 222366
16851 222366 188403 73303 28274 121532 136492 100060 145286 66654 -23552 -239142 -174438
16840 -174438 -352130 -363523 -178523 32596 178588 136497 73522 -18811 -151878 -219074
16830 -219074 -143815 -34976 -119598 54255 287490 363015 291338 298364 234690 177736 207137
16819 207137 -11604 11000 4226 160764 179580 -34336 -249385 -150254 -59235 54361 -16745
16808 -16745 37438 100038 108196 241410 239346 -47412 -332034 -433403 -299217 -413318 -357043
16797 -357043 -292360 -200896 -121926 -175242 -371805 -304888 -85000 -55745 -195414 -216853 -71149
16786 -71149 170653 156243 -12208 -166170 -236144 18334 77278 -55760 -58679 45255 71481
16775 71481 50033 21373 39297 -8092 137075 265508 211644 242817 436771 332885 174230
16764 174230 148790 3059 -241431 -48332 132380 169500 261533 277800 319388 409289 297448
16753 297448 155668 -247372 -383631 -161704 -197521 -102057 131058 204396 180736 97060
16743 97060 -203399 -359286 -316647 -84095 -47240 -113156 35914 250282 126609 307
16733 307 -213420 -311352 -434907 -631488 -615349 -465923 -207891 75865 -26027 -336377
16723 -336377 -506866 -460626 -193035 40677 137309 155842 -269916 -511195 -561340 -659546
16713 -659546 -742594 -561411 -304352 -148112 -190057 -286211 -237848 -304045 -339793 -140322 -87213
16702 -87213 -237135 -161392 -173180 -36647 209356 197197 138629 200847 185756 -116786 56470
16691 56470 187899 201823 155596 123885 -131518 -547711 -571615 -304888 -132675 -294933
16681 -294933 -276541 -461659 -466802 -357654 -319228 -163521 -229070 -338761 -142174 -228535 -557938
16670 -557938 -422084 -227816 -61715 372 106162 301796 92069 -137520 -85611 -96179
16660 -96179 -154987 -155222 -104125 -128509 -64739 -68566 -45279 -91292 -78067 -123615 -208339 -225326
16648 -225326 -141884 -55194 -7714 101936 73697 -102486 -182132 -304912 -463972 -462100 -561836
16637 -561836 -641774 -500698 -243727 -8493 36725 -72418 -137480 -223513 -24083 302467
16627 302467 449104 376567 226751 371004 253812 17109 -6735 9056 -183499 -462312
16617 -462312 -404517 -111941 10058 263240 198095 22427 114083 42840 -263921 -306181
16607 -306181 -132448 -141915 -150308 -287747 -370851 -607080 -652860 -513927 -481328 -244935 -46226
16596 -46226 -55025 -64626 -10207 -235525 -330543 -300400 -354425 -414946 -366513 -396389 -356330 -283137
16584 -283137 -67754 -120280 -135480 -222243 14350 58397 127463 421152 300853 -50147
16574 -50147 -283742 -289110 -236163 -161545 -383360 -206073 -91539 -141007 -8206 -13490 109275
16563 109275 202874 127875 214509 277917 465382 504565 307002 -45593 -421440 -279774
16553 -279774 232958 395109 214521 -21984 66273 -11955 -150375 -367476 -596917 -351996
16543 -351996 -139759 -330659 -293983 -150467 -72833 33091 -143380 -288384 -279534 -15545
16533 -15545 -106740 -201880 -281136 -68621 -104689 -315402 -467356 -405660 -341851 -130689 -190050
16522 -190050 -307037 -237733 -31586 -188712 -291356 -50917 112357 38778 -145672 -404887
16512 -404887 -370870 -199916 -206952 -35346 124245 374591 148719 -125591 -137238 -88863
16502 -88863 90108 -77818 31228 -14189 -58238 -90787 52693 -21176 -157415 -259587
16492 -259587 -237503 -170162 -397260 -290362 -94729 -136931 -289111 -277203 -43093 109993
16482 109993 -17503 -217881 -230543 -236480 -143990 85506 228411 316590 361829 100416 -131029
16471 -131029 -92209 -37866 -98619 -194653 -269719 -14803 8647 -258369 -280557 -118025 -44409
16460 -44409 12461 -118249 -122341 7211 99104 -117420 -138670 168573 193576 21375 -366204
16449 -366204 -352458 -142676 -142179 49864 84346 -14183 -10997 283483 352604 106265 20835
16438 20835 -53593 210806 195294 157829 261342 209676 139534 96709 51682 -90523 1090
16427 1090 72945 42521 109359 225140 310309 246649 160640 145635 -72243 -167612 -399403
16416 -399403 -360553 -443551 -310915 -250059 -85282 20503 12103 4876 76310 -22816 -51110
16405 -51110 -50443 -207676 -165836 -284465 -288165 -194331 -244998 -225982 95736 251565 225776
16394 225776 278992 433777 279051 -92574 3702 -20645 110912 268267 176222 143151
16384 143151 59279 141408 174229 65308 -180753 -313205 -310609 -530256 -245734 -124555
16374 -124555 -225635 -397702 -201789 -156542 -176477 -200371 -118345 70587 388290 445719
16364 445719 131936 -98620 -32694 44931 7358 -172370 -304492 -103052 -37 -19180
16354 -19180 -19083 -179066 -131925 -181542 -450605 -536177 -106067 -94225 -203039 -206932 11354
16343 11354 202590 385595 336924 75606 93696 96970 -40193 -225688 -128676 -92830 -89527
16332 -89527 86965 238099 252923 -43655 -203176 -279773 -297271 -377744 -466269 -337162 -501708
16321 -501708 -547918 -387968 -275110 -222742 -306625 -433746 -407815 -266960 -57476 -73133
16311 -73133 -206413 -201371 -238295 -218024 139004 37314 -124024 -91006 -61047 38739 -164104
16300 -164104 -314788 -81780 -40976 71263 -20727 -170572 -239397 -194450 -58821 108711
16290 108711 36001 24595 92921 168146 203858 165855 -79840 -155361 -165672 -227196 -109057
16279 -109057 -64619 -66997 -140422 -307861 -206114 -317002 -599661 -556837 -157441 -261175
16269 -261175 -280596 -95443 233234 202660 243393 495205 462448 302341 232448 89914
16259 89914 -85077 -21656 51547 -30626 -446631 -528829 -343293 -355057 -225973 79722 91975
16248 91975 -216911 -191730 -277395 -101661 138792 387050 427421 297318 214014 160554 222081
16237 222081 326367 285360 254747 463300 218835 -64492 -301184 -469902 -378254 -404650
16227 -404650 -436664 -383215 -347576 -553490 -346078 -59937 -184520 -232127 -106131 -122136
16217 -122136 -289850 -433905 -281948 -204654 -135661 -98393 -6940 -53483 -388708 -560235
16207 -560235 -468573 -353481 -221728 -361108 -349117 -312149 -539612 -574202 -552066 -418822
16197 -418822 -282541 -301338 -233385 -222965 -293084 -414269 -322572 -91923 -56766 -171078 -115352
16186 -115352 -226294 -136484 272 39939 -190134 -139052 -149728 -61229 -44330 -102508 -212235
16175 -212235 -170102 -42237 -134456 -348366 -227197 -324873 -351631 -205346 12059 -315896
16165 -315896 -343893 -103922 -93207 23956 170146 184931 129270 151100 272140 313341 169256
16154 169256 -115172 -346243 -401882 -427559 -332974 -224329 -120684 -138905 -141597 69300 59423
16143 59423 -73011 -125637 -32594 -57144 -104112 -210400 -480739 -558769 -395706 -166497 -22864
16132 -22864 -9428 -38520 -63409 -121945 -204423 -201819 -190096 -140873 202366 122847 81035 77141
16120 77141 56418 -12968 -135039 -187970 -211389 -519208 -567936 -313105 -430597 -442613 -242133
16109 -242133 -208477 -148307 -10706 210854 360613 306622 16249 -318221 -315524 -68110
16099 -68110 35715 53170 33843 -82374 -239439 -258650 -98386 -74940 -130258 94010 96121
16088 96121 22301 -58671 -266772 -312692 -210552 95220 63979 61186 217701 129137 50312
16077 50312 103978 80604 -143011 -241423 -129241 -67233 -138761 -195798 -223050 -4975 -164107
16066 -164107 -390186 -198800 -164375 -33522 -71254 -11552 85808 212175 90984 -111518
16056 -111518 56128 30131 -58703 -86996 -284278 -448657 -352655 -231706 -173867 -181288 -386255
16045 -386255 -517694 -447803 -181162 232641 649078 413219 334480 202684 275594 379442
16035 379442 410536 418421 362587 150243 852 4173 -108347 -266857 -113960 -78970 -112865
16024 -112865 -107392 45665 113306 18893 -157176 -68167 -80981 -111517 151481 305604 33529
16013 33529 10897 256331 321583 144448 178298 64618 107359 39593 -129646 -166001 -201163
16002 -201163 -122029 52475 318662 413498 316379 13699 46278 120560 101041 194365 -2208
15991 -2208 -273575 -169638 -67204 -196871 -428768 -404336 -11117 144269 46876 126901
15981 126901 264103 171090 322864 375192 457489 310404 284845 438590 416470 286812
15971 286812 27323 -250106 -75381 10165 -58549 83461 182557 317430 193382 42652
15961 42652 -40987 -184994 -512338 -290400 -224212 -130554 150489 309105 160278 -5283
15951 -5283 -207361 -217570 -454639 -393134 -340172 -284637 -311547 -102906 -29196 -42771 80450
15940 80450 64749 146176 162742 50855 64937 202503 63953 97209 81098 11360 -137315
15929 -137315 165876 268320 144003 36891 -125942 -28057 203522 223350 -50365 4575
15919 4575 2410 -94436 -188792 -143175 147350 50839 -137040 116433 166358 185001 160729
15908 160729 86063 -4445 -97191 -265605 -250908 -310170 -475935 -408575 -249621 -78637 76782
15897 76782 -30024 -20239 34868 -196894 -184221 -248030 -149013 -199525 -421718 -386975 -154842
15886 -154842 -82521 -205514 -47300 -59000 -140294 -98092 -66993 -153098 -116391 -84440 -86813
15875 -86813 -160407 -187006 165486 540692 614213 519361 287326 34185 19911 47401 -132245
15864 -132245 -68153 231910 453280 426270 242925 101823 81337 110725 33054 -77732
15854 -77732 25193 102210 136701 107346 -195615 -417731 -372330 -201396 -32219 33295 33719
15843 33719 -36406 23628 -39086 -203970 -228174 -174539 -304738 -381526 -334540 -365758 -320541
15832 -320541 -228889 -332408 -431333 -527469 -309667 -220191 -134126 79911 238123 245800 107837
15821 107837 82913 10599 36439 -12748 13826 129324 249707 78493 74007 -33658 -29098
15810 -29098 -76709 -100281 -134964 18782 190712 272901 52467 55685 56320 135214 162186 131602
15798 131602 60495 83642 62105 -88015 -119479 39220 64401 -118445 -159196 39715 -55036
15787 -55036 -174651 -74710 -148908 -175983 19702 -248643 -455555 -127531 177510 325008
15777 325008 228224 226584 344358 354770 131636 9310 31653 -44005 39120 317496 269560
15766 269560 -52348 -131881 -130186 -231128 -379910 -296074 -215145 -338819 -449042 -314311
15756 -314311 -254329 -267302 -249334 -263993 -200034 -125119 -105473 -87460 -20640 -176811 -242708
15745 -242708 -451055 -536316 -504570 -230791 -107982 -50341 -185627 -376035 -268263 -154453
15735 -154453 -243774 -538618 -388234 -289979 -205347 -64733 42832 -18104 154134 273179
15725 273179 356260 368713 298545 177160 77766 149111 62432 12974 -29715 66154 187467
15714 187467 314336 306827 286115 182406 36738 42154 152201 286616 202166 65425 -111185
15703 -111185 -212311 -238228 -184756 -157795 -195154 -264883 -449363 -365312 -269462 -70275 5233
15692 5233 46993 -125051 -338924 -354288 -301298 -187861 -289711 -327975 -168650 -472807 -539057
15681 -539057 -574527 -555094 -509251 -248918 -233326 -176641 120750 342525 257897 44598 -59878
15670 -59878 -732 195732 189122 126890 -16028 -112646 -206044 -406783 -306315 -198159 -136374
15659 -136374 -67649 -99098 -299120 -135352 85175 216785 76659 -2199 29058 111387
15649 111387 71925 -311304 -670334 -673967 -680581 -438523 -40744 123440 42034 -170404 -180380
15638 -180380 -309995 -381023 -340348 -91941 184988 170642 182537 184649 148999 5452 -66292
15627 -66292 -778 19543 -7602 223614 184158 252406 23636 -71396 -58924 -6151 -195079
15616 -195079 -280759 -17832 -88847 -111153 -86037 -111627 -105349 -127591 -238155 -377760 -326548
15605 -326548 -149994 -218988 -373581 -382433 -351202 -172467 -3419 -24973 -120902 -108362 -261508
15594 -261508 -355387 -174228 39320 -5351 147534 57733 -46168 20380 -91609 65004
15584 65004 260461 125420 29892 155020 153263 156363 76715 82908 -8593 -19055 71709 -5737
15572 -5737 -164068 -157873 24170 42498 220248 290806 275593 218470 -118603 -392838 -245361
15561 -245361 -82500 -127034 -239002 -317751 -403525 -376329 -7137 312933 272283 29485
15551 29485 -252877 -391456 -220862 -164934 -26139 -121735 -102351 -7372 30850 -231312 -405134
15540 -405134 -239313 -128607 -62312 -130985 -112095 -559 97505 307040 482899 240772
15530 240772 85228 -88362 -105934 243837 409477 327941 4552 -319531 -157778 -11855
15520 -11855 -246744 -344727 -229379 -268885 -214829 -282534 -126315 -18563 -15203 -72577 -73307
15509 -73307 -37434 -18082 145223 382079 336045 347073 215940 217516 52614 -141275 -301549
15498 -301549 -294283 -246596 -269436 -188819 204824 205684 82457 45628 3693 7967 -69678 -136665
15486 -136665 -19872 90999 176798 244140 121199 167097 208375 -140128 -338595 -254673
15476 -254673 -175048 -133345 -308003 -477888 -446724 -209471 -165936 -272122 -157914 101316
15466 101316 273202 59100 170813 334383 204956 106727 36942 -76118 -198322 -239605
15456 -239605 -401515 -446999 -369681 -210344 -130848 -11860 71728 -77925 -210767 -357437
15446 -357437 -335847 -191215 -103063 -90634 28385 77056 190245 131435 157221 -88857 -197441
15435 -197441 -190589 -166384 -210005 -384994 -172418 -155603 -73412 -18916 -83075 -280862 -351994
15424 -351994 -418778 -346791 -146418 40517 185640 209108 149671 13293 -96595 -162264
15414 -162264 97164 84141 39750 35887 191869 149604 169575 82134 -28450 53102 82309
15403 82309 140806 29629 -193433 -152669 -138958 -128890 -244946 -248376 -171827 26201 213627
15392 213627 310201 312068 431342 361866 113984 -91676 -147223 -117179 -80707 -176642 -143026
15381 -143026 4504 52037 -38049 -34533 -375072 -145594 157659 90720 88507 6752 -37344
15370 -37344 57263 184316 87279 103808 20320 -156720 -148521 -35271 -33043 -23559 61971 329886
15358 329886 367412 329308 305771 152783 326734 469625 309374 41285 -173543 106885
15348 106885 240029 67089 -181747 -146019 -141366 -161454 -90726 -218344 -344191 -192524
15338 -192524 74267 30841 -145193 -392498 -180846 37006 -123648 -165949 -109984 63193
15328 63193 -1181 -375867 -380583 -263009 -158088 -242303 -142144 -50816 -248206 -485428 -314073
15317 -314073 -332885 -314250 -41637 -192987 -300818 -225705 21698 -32377 -225088 -359713
15307 -359713 -286612 -92389 5123 172243 261472 354789 337360 374023 401082 245418 129372
15296 129372 177964 278672 259544 253031 258156 278486 215089 161909 -59829 -134029 -77611
15285 -77611 93940 363412 282920 -49766 26058 67060 11735 12096 100317 33747 63104
15274 63104 135241 161413 191739 236012 49349 -29478 228859 230353 -39921 -230859 -168812
15263 -168812 170056 418086 157514 -208792 -138976 118535 454667 533375 320679 362485
15253 362485 378861 361684 419502 397985 271063 277711 162600 42687 -46590 -83964 -7609
15242 -7609 -8068 -1472 37770 126627 220802 211273 167671 118387 95246 183611 55949 43322
15230 43322 57972 130453 193670 284895 267719 455099 148168 -472 -5604 -6007 -77770 -80564
15218 -80564 317786 442258 277059 51087 -74900 -67668 -102307 -94996 18827 93650 78520
15207 78520 11829 76853 200049 136479 184858 71178 -414 70346 91602 158502 107733
15196 107733 24912 -77458 -134173 -35201 -16586 31254 234969 131328 29624 -23120 47863
15185 47863 14616 -85669 -72756 188807 352248 467639 312107 135583 161780 -27650
15175 -27650 -125795 -90439 63569 36598 28139 142575 171865 233765 24577 -110003 -152557
15164 -152557 -164409 36233 -8835 -8673 60238 52039 -92883 -56800 82072 27261 -25709
15153 -25709 -17339 -247658 -500547 -266437 -67984 -202522 -194541 -139755 128720 145338 -116574
15142 -116574 -95240 1341 -40734 85209 112396 166334 140047 -19026 -14127 -12512 -68702
15131 -68702 -138829 148185 233469 -99237 -255473 -319189 -336007 -501964 -267515 40182
15121 40182 -47010 -47323 66834 362887 367142 399468 186202 -112420 -138717 -97815 18354
15110 18354 47944 42995 -89077 -136038 -131676 131156 340415 89668 -39511 -38361 -311991
15099 -311991 -282550 -115055 208869 279114 225390 23172 -65931 -50122 -208985 -136084 -89260
15088 -89260 76112 166678 252951 78402 106245 31570 -106176 -191060 -180458 -69974 -51984
15077 -51984 -104128 -339041 -178069 -48117 -122830 -225366 -213135 -29486 103266 89766
15067 89766 -79321 -214819 -106651 -71598 -101785 -78229 -161785 -177310 -173416 -191459 -217627
15056 -217627 -183538 -29882 -99534 -161810 -302096 -196952 -172758 -204204 -161664 -242410 -144433
15045 -144433 -59017 -113057 -28980 170609 130842 60172 -39436 -171415 -291977 -319161 -242667
15034 -242667 -168123 12399 -52329 106948 181906 96599 -179769 -308039 -331339 -215421
15024 -215421 -260660 -294698 -376844 -270984 -143293 -54144 177653 328922 258063 -30004
15014 -30004 -318635 -253710 -105047 -136720 -111443 -76546 7848 130303 120612 102490 120169
15003 120169 135596 134683 251480 418410 490828 175956 5312 67336 105051 71157 12004
14992 12004 -122361 -10957 -178478 -118956 -215413 -382767 -409780 -250948 -12454 111067
14982 111067 78473 49996 84441 25226 112361 58190 37744 93003 59993 -29484 -100576
14971 -100576 -165141 -86462 91282 264449 49638 -343929 -445240 -317782 -369456 -433629
14961 -433629 -206519 -61177 52539 -25499 -99932 -68511 -142798 -250642 -339654 -340567 -465065
14950 -465065 -506389 -376072 -126124 -196598 -92270 156574 345368 208598 -94085 -77024
14940 -77024 98206 96510 134993 77420 9813 150506 220172 247176 84192 -199811 -142887
14929 -142887 -137699 -38293 -101332 10486 108237 235381 406733 172052 144137 -53283 -106230
14918 -106230 -38183 64555 154190 357529 340417 410377 351407 264323 95149 46046 -62330
14907 -62330 40072 156225 -21097 -157623 -54812 70122 208284 35455 -24979 -216576
14897 -216576 -53909 75430 347453 341901 312928 212115 -160550 -244792 -403304 -297959
14887 -297959 -322454 -385647 -211351 -132222 -88729 -24632 316077 261199 10559 -160055 -96388
14876 -96388 92861 84726 369691 345425 115760 23540 180578 104242 5156 18937 119418
14865 119418 -35861 41021 374959 356854 -102055 -371728 -321079 -119981 -90233 -142446
14855 -142446 -300221 -329218 -202732 -105984 39350 -5169 -82794 77645 226978 317174
14845 317174 474944 482278 272475 -12998 -80919 -92762 -231225 -59672 -186738 -238695
14835 -238695 -213063 -211010 -82649 -135169 -463803 -460643 -253396 -128660 -78549 -211980 -220042
14824 -220042 -148554 46064 189632 240896 443284 236117 67785 -15418 32946 -109329
14814 -109329 -114579 -161322 -151928 -210289 -416957 -276158 -241394 -172365 4210 -10191 -101439
14803 -101439 -228474 -36632 45383 -123350 17105 -145583 -282997 -161045 -69260 -202398
14793 -202398 -96587 18453 -135160 -105885 -51761 -222467 -256595 -41753 -25059 -45410
14783 -45410 33463 -59127 -188259 -193984 -320997 -290653 -191586 -60981 -164620 -454951 -320464
14772 -320464 -103970 54760 153192 94014 21580 81322 103670 -151153 -252604 -31281
14762 -31281 -56598 -147987 -98163 -103303 -102135 1546 -35556 10185 200985 -32571 -126311
14751 -126311 -2810 104742 49601 74040 86837 46411 -35469 114299 297911 243127 247467
14740 247467 82181 -56431 16945 -68441 44493 56350 94897 44331 50149 73086 -140645
14729 -140645 -113815 -10037 58958 -132244 -267487 -25995 156735 28000 70371 92070
14719 92070 103834 38228 206274 232609 179034 128776 129663 18965 13388 171144 319255
14708 319255 257563 350212 352321 106502 -17126 -109537 -25248 82086 274504 250310 321572
14697 321572 254813 182950 49571 147630 194982 245813 329987 364180 393973 263743 -63906
14686 -63906 140406 206868 12287 -59290 160667 78041 -35809 -34257 -1078 -13574 19282
14675 19282 -79029 -154736 -217048 38814 415398 353824 336117 274368 221458 139870 243791
14664 243791 330262 220663 8899 -1264 46573 -165868 -304649 -236862 -302315 -477119
14654 -477119 -226154 128770 60365 -88408 7811 96149 42390 -212162 -389957 -455344
14644 -455344 -388969 -286060 -135716 -114963 -118761 -75549 -223632 -347521 -384550 -178652 -170823
14633 -170823 -149442 -94895 88663 110629 65439 33493 -61109 -97368 -47938 -214266 -210640
14622 -210640 184728 356346 441571 397137 185822 366979 171162 -46378 -58423 -3224
14612 -3224 5459 111775 393012 351614 29898 -53135 60563 28525 23982 122899 190544
14601 190544 161096 -129224 -316465 -245872 -75690 -114691 -226091 -368392 -267255 -229341
14591 -229341 -166887 -384193 -373995 -96077 279 -62833 117312 342623 379575 122421
14581 122421 -7223 -43587 -10662 -35231 15325 22772 -143648 -399304 -426997 -295587 -222472
14570 -222472 -130434 -132990 -197039 -65985 -113182 -315692 -464011 -307101 -21705 351981
14560 351981 519391 452331 15450 -313016 -234909 -281780 -265606 -140535 39458 -60799
14550 -60799 -56971 123505 144335 371738 506480 313815 -33247 -9040 44369 -85604 111202
14539 111202 261314 419524 265724 140815 115112 -37704 -39262 126324 201099 119289
14529 119289 -73009 -257277 -145463 104295 250317 309107 334386 291946 388475 323567
14519 323567 359604 307906 34007 -5811 -2266 -4267 -870 -129059 -216350 121094 398367
14508 398367 261211 32531 -86604 39181 250829 199907 131883 -14684 14984 -31392
14498 -31392 -92798 -147494 -336254 -316250 -271259 -287901 -119244 -43121 -30316 189555 277101
14487 277101 147594 35043 57209 44457 20130 -4943 -54772 -37907 125827 225301 189181
14476 189181 -98553 -126016 -135573 -241399 -62735 -65088 -71584 -280814 -354540 -159827 93643
14465 93643 231801 5605 -139272 -374314 -432978 61032 299200 215789 295340 93729
14455 93729 -30008 116734 230573 303909 380139 69634 59298 52722 -35112 -45217 -173407
14444 -173407 -288843 23925 32973 -71612 298 69528 92198 -21682 -11708 -126657 -114614
14433 -114614 -136883 -226755 -168608 -38275 124593 114912 81961 -278410 -410586 -330187 -183623
14422 -183623 -14272 150223 221279 401215 406877 557346 214935 49008 -70606 -135248
14412 -135248 -238105 -96479 -211995 -314341 -60027 5944 -69038 2391 117127 277599
14402 277599 248329 137889 132668 216973 224928 283333 62550 8654 179641 217206 224402
14391 224402 199918 -15284 -27102 139037 59961 -203483 -152550 8646 -96325 -209672
14381 -209672 -315703 -281765 -122254 -103598 33323 181311 -19577 -204019 -183848 140760
14371 140760 403311 426201 289696 177747 170697 210989 402799 410915 238672 -27509 -203327
14360 -203327 -280891 -336214 -277398 -11194 -199129 -272113 -103236 25013 9435 -62303 -105564
14349 -105564 -32827 116083 114560 97374 148637 8203 -204229 -393084 -488040 -509194 -408064
14338 -408064 -133410 25190 131974 -85747 -137127 66978 174465 162323 180558 76046
14328 76046 136487 -21239 -150509 20131 222567 188108 98203 -10368 -201796 135723
14318 135723 307497 373437 308069 189350 241571 164000 146540 293056 99534 -143336
14308 -143336 -62637 88198 53147 29752 -227390 -315412 -196984 -306882 -218410 -213512 -143877
14297 -143877 36582 60361 -61436 -68600 -49854 -145437 9772 -65671 -315506 -291693 -324515
14286 -324515 -263195 -135394 46558 117008 -51557 -104652 -91271 -176216 -68593 128678
14276 128678 -78563 -149760 -273005 -185920 48119 -137561 -204943 -58972 72974 -26947
14266 -26947 32789 63894 44429 -40674 -94253 -49238 -45460 -262788 -215701 -92157 39255
14255 39255 311049 466122 365604 74246 -192242 -118812 -19462 136678 212124 191542
14245 191542 113255 224554 190200 237769 252160 255313 115217 39039 141092 109648 191592
14234 191592 388471 253289 114452 71485 -18151 -30568 -135869 -113165 -265464 -371078
14224 -371078 -316421 125501 97368 159050 207294 -204764 -355396 -159567 -223341 -195897 -255743
14213 -255743 -245248 -196006 -93347 -55118 15253 5435 -15478 29731 64098 69050 125544 321351
14201 321351 203214 123756 165810 -13165 -159594 -289879 -209625 -58692 81711 293545
14191 293545 553125 645445 444998 251061 329820 485302 422338 255697 151446 273723
14181 273723 269841 51765 -105089 -132063 -295483 -240160 -281046 -50764 38520 -227227 -334387
14170 -334387 -321804 -408655 -410536 -558577 -405421 -221925 -87166 -142328 -91408 11926 -121303
14159 -121303 -66301 -47769 10110 177257 203148 152295 106681 117315 121722 169276 -43071
14148 -43071 -28852 119980 112014 57420 112779 -86640 -73589 -61549 -156285 -174237 -6234
14137 -6234 5820 21773 198582 123385 83858 80409 94291 191247 283551 285691 279154 217354
14125 217354 231505 352649 323290 273013 261460 48351 -150514 86129 156351 344478
14115 344478 311809 -6640 33824 25037 99700 12872 -298110 -409577 -226728 125124 262452
14104 262452 176254 28111 83154 126860 -38594 -142867 -113158 174896 306966 361116
14094 361116 405947 318406 91085 5356 60986 25078 -73183 -253440 -468145 -377463 -118246
14083 -118246 -99086 -296974 -435970 -474805 -410725 -203377 -127982 -24127 101164 109475 41399
14072 41399 -292036 -443272 -304655 -103640 -94296 -998 8567 144590 105652 -110926 -312727
14061 -312727 -326383 -130992 66544 175170 170211 151228 -30624 78007 285381 381393
14051 381393 356024 173204 25802 -94810 -139540 -137809 30168 329812 469166 161461
14041 161461 98541 256451 119107 87304 -10684 -1592 -104624 -160026 -139022 -244491 -290115
14030 -290115 -177213 -30849 180067 107127 225524 194263 154706 252706 114335 25971
14020 25971 131405 192236 -60301 -119033 15469 190996 202185 135814 99545 47513 270481
14009 270481 356013 208604 271760 280413 272774 485415 362258 139677 143256 271024 318896
13998 318896 165966 7874 29329 -117357 -367037 -305380 -40939 -70351 -150281 -141589 -96324
13987 -96324 -156620 -57710 68135 174260 144378 -59789 -165224 43445 190352 33605
13977 33605 20228 758 32951 107500 11410 -7404 166755 161388 351838 241482 138861
13966 138861 15880 532 150678 182178 418557 458760 385936 207698 -48279 -131370
13956 -131370 27333 337099 437808 587245 483976 441416 500492 220459 145945 450294
13946 450294 215131 140537 192380 227262 203702 256713 279088 145689 -157484 -465871 -439933
13935 -439933 -366437 -216504 -74783 -99150 -54440 -108872 -107765 -82294 79004 41558 108063
13924 108063 243556 34301 24594 109156 153039 170296 6922 94743 204669 356073 474652
13913 474652 615109 472561 142947 98840 200311 242336 -33904 -144379 -28326 56504
13903 56504 145561 425804 649292 508156 310649 39463 -233776 -242501 -361921 -110686
13893 -110686 138535 301299 481337 542909 617423 533459 74832 -49627 67067 189504
13883 189504 228152 157833 254714 325816 298308 443670 358605 159075 170808 276357 365219
13872 365219 382447 244793 356628 529577 520105 315117 258256 38796 256154 336910
13862 336910 165267 93563 51371 -38170 70995 105146 126634 147570 329134 456527 322712
13851 322712 286759 84813 -1922 -23063 178610 529000 442008 453563 536122 455007 510665
13840 510665 412586 199798 99592 193273 13780 -32977 47047 129191 215492 163427 13123
13829 13123 -123926 -176834 -220049 -16283 176413 264371 281739 217633 237501 469825 591060
13818 591060 618835 433570 280457 42770 -19521 -36556 -31771 -126626 22392 153567 269024
13807 269024 313801 132201 -86229 -146430 43497 306949 149383 -30354 -87732 -43132
13797 -43132 79753 115169 153806 243746 175228 66203 -9717 32583 -2951 -9148 -58678
13786 -58678 -128898 31351 198147 282981 35182 -55370 -109575 -240711 -88770 35009
13776 35009 175111 166916 151810 271853 337417 199536 56876 -43125 4332 187380 266428
13765 266428 292149 433214 478580 554741 475814 354156 250210 85227 -38099 -159734
13755 -159734 -28994 199657 167201 219457 245209 241858 263759 383696 385287 180399 -27396
13744 -27396 -91476 -272680 -208374 -370476 -536445 -191307 20082 105387 -25125 -248032
13734 -248032 -160830 139258 273698 124079 48126 -170938 -445541 -222305 -59 -115821
13724 -115821 -145724 48329 22930 60228 205536 154656 269415 324549 335738 236530 50561
13713 50561 -41180 -8498 63462 278720 161175 49512 82041 97039 154664 111252 71939
13702 71939 185096 376023 205522 36315 15503 168929 348699 230809 78857 53647
13692 53647 -40595 -954 -67687 -126508 -362319 -130565 622 -224803 -145938 -157321 -186505
13681 -186505 -229323 -313226 -244077 -145880 -272722 -85628 67813 -70137 -341691 -144262
13671 -144262 186014 224116 112927 -140006 -91941 109775 210756 228972 373871 392901
13661 392901 61761 -83830 -245869 -291899 -243551 -9212 38285 156996 217537 69051
13651 69051 221085 525185 564353 577087 673861 577565 417475 393746 384863 313772 218740
13640 218740 163555 46490 -94419 89035 203646 252028 232530 21549 -170027 -419733
13630 -419733 -406837 -112835 -156059 -237332 -296293 -200388 183312 168711 -88051 -15119 229185
13619 229185 114205 127253 320817 274858 228646 251397 201402 484814 527911 360304 361983
13608 361983 328387 129006 -84122 120626 390271 347969 342601 280478 291564 55983 247963
13597 247963 381571 284643 362837 436335 677497 590200 408545 361168 189133 -116493
13587 -116493 -299141 -310125 -36698 517 -32094 26493 96326 225214 320878 397887 370073
13576 370073 181206 7865 31648 868 79251 467378 449897 421260 370145 113650 22781
13565 22781 213338 134714 132035 157829 -29050 -77185 84309 171717 311999 526293 472333
13554 472333 408829 366987 164851 77773 -44723 1459 -14677 -40412 -36611 -164097 -236426
13543 -236426 -74202 172610 270448 278157 375095 404289 402005 247859 221526 284930 194401
13532 194401 159045 260654 358121 350240 220776 69673 51763 100314 47500 68682 279316
13521 279316 272949 187558 399860 525428 593101 435556 247673 282740 555561 517000 280159
13510 280159 -1232 191497 287566 437610 453021 462118 404710 321065 323951 365511 486363
13499 486363 307179 218832 208819 71239 -20563 109795 193858 471329 517423 341723
13489 341723 360803 357427 379615 437685 440504 183340 177334 335449 71487 74038 164783 195613
13477 195613 184917 -794 -115125 -77575 76207 -5279 -58871 -34639 37928 -177346 -147561
13466 -147561 16468 60852 -41031 -101277 -90241 73336 238778 108670 62484 50765
13456 50765 59541 18474 23309 301126 312458 319843 243773 242683 312053 608109 691350 568180
13444 568180 505104 497202 413597 408605 185871 44666 70987 292734 244433 115852 51382
13433 51382 -115333 -142930 -77528 -157549 -65994 35993 97018 268120 209395 238323 220933
13422 220933 -115024 -355775 -217882 -232316 186723 340371 440428 451564 223257 345950
13412 345950 359697 134420 32493 71582 167283 228995 333707 98536 33325 59006 153318
13401 153318 340680 345154 99761 52826 205037 60783 198399 309543 289349 290208 137775
13390 137775 260384 264259 264563 187106 183230 314659 192689 136077 19278 -35893 80250
13379 80250 172652 270269 438880 530735 460919 599303 193677 152206 143688 112107 317145
13368 317145 699199 740997 659635 368560 298814 236152 261002 414521 658371 634860 469800
13357 469800 298333 297271 482809 470305 476927 566642 638844 597098 589425 626446 705466 654919
13345 654919 558398 432872 388395 665984 758955 544930 516921 585308 623268 546772 243678
13334 243678 79343 107652 354765 493268 468539 383659 127014 -3151 -24986 -12432
13324 -12432 122744 320952 350948 393201 553898 575142 401957 313865 260442 346708 620934
13313 620934 768383 791262 804793 748903 619256 303516 445084 341350 439788 574059
13303 574059 360872 189844 201016 242768 188048 130156 213648 199595 147610 284506 371494
13292 371494 204313 369305 275510 229859 35492 173284 188946 -10364 206758 570256
13282 570256 449479 412295 422882 425157 320993 178896 449512 538313 436507 266290
13272 266290 133362 231157 281236 294805 363990 235664 115078 197790 305016 275629 419803
13261 419803 592570 665558 478261 342456 422360 333631 192400 225008 164152 165629 351732
13250 351732 356555 263915 389283 256845 324565 511336 402182 344784 411056 361607 365410
13239 365410 430800 370270 196623 120264 303846 294141 358556 201708 66418 -35820 143354
13228 143354 470865 475963 454779 238370 182794 148 44436 168686 261882 318233 266256
13217 266256 170396 408689 497755 320524 117131 120896 29023 43754 38204 -153583 -66267
13206 -66267 67855 -36283 1796 235462 269968 220576 288820 374348 465688 502879 474972
13195 474972 377123 411713 231677 373036 437946 364806 361495 324300 138089 218382 311835
13184 311835 304698 103890 89563 245275 393502 501606 782995 766023 718040 687367 683207
13173 683207 709810 474887 195612 100268 146306 -41737 -20392 34516 319664 249534 330099
13162 330099 354033 405266 525953 427668 263836 283897 258704 137782 87536 278318 454791
13151 454791 858773 878580 779915 624960 574219 409063 213167 188184 -12770 95993
13141 95993 111780 45190 -28527 30530 62958 249861 453564 368259 307554 395379 303069
13130 303069 217777 178199 343483 475859 452272 292045 412929 318265 144392 159307
13120 159307 211250 331137 363952 259525 50176 44706 140587 -82250 111614 288507
13110 288507 222073 147847 459991 575529 505040 274630 175324 230821 326068 416160 443456
13099 443456 409381 339928 445604 475883 214055 322806 536273 712316 643681 498099
13089 498099 144361 135387 456885 366850 270933 344820 284116 31399 72410 -10058 -37431
13078 -37431 130477 33119 -122051 81631 398355 701290 604345 493743 573989 545273
13068 545273 527862 618833 595990 496365 500463 447935 390216 785831 892164 799123 586014
13057 586014 320832 198533 271808 570087 779336 733128 357318 168427 38898 55171
13047 55171 74945 243401 284842 216791 150371 127436 98821 149052 48171 50945 540896
13036 540896 771410 490214 333563 168448 358266 364032 267568 268290 160787 220593 188143
13025 188143 347228 547813 339250 271250 278746 436767 711809 656378 555815 677095
13015 677095 854427 994696 961994 827173 506700 417687 637420 818402 756896 667721
13005 667721 421592 188620 324520 513731 536436 446406 396955 424331 474508 403354 353810
12994 353810 507084 506451 589143 521565 473194 830282 1036805 772458 326810 134188 61789
12983 61789 -7837 169015 380244 299312 204826 309240 439413 463481 721390 784384 856666
12972 856666 940505 1036993 911810 723383 599420 487388 276363 281148 249139 518203
12962 518203 734757 1010594 714369 337864 184439 336084 457804 504532 389413 146212
12952 146212 316850 389859 470335 656051 689505 444490 583956 546029 528543 725173
12942 725173 575572 367087 290965 157064 503245 661111 876112 956748 633468 377860
12932 377860 508878 508723 312450 248204 307845 544586 664302 819513 774002 353609 318163
12921 318163 482843 558681 700807 619803 321446 296825 434409 400053 360880 467009
12911 467009 588426 815650 909276 490741 244929 223715 375679 427580 434874 354129 206449
12900 206449 152444 255797 535342 823395 932195 673780 413957 420275 580287 559912
12890 559912 648044 796428 821379 796411 737946 593840 579807 703899 808222 714157 641751
12879 641751 597881 575124 484829 330070 252993 246726 448597 385231 467905 300116 297554
12868 297554 351996 384804 543753 619245 610396 529825 389746 381855 370674 509369 581096
12857 581096 791304 830073 815190 779356 621521 649110 965306 1084989 831636 797648
12847 797648 601837 405747 367051 367999 335072 612924 582159 465720 511310 441789 322722
12836 322722 562826 702455 650844 405652 402219 401581 415983 582294 702613 726219 799949
12825 799949 644312 737893 710720 790435 1068726 1202482 1214917 1161448 1158775 933888 844254
12814 844254 674729 768155 749691 731882 801442 640550 374758 313918 365189 464510 531487
12803 531487 573059 740536 900523 1032209 1143381 1105399 1123426 1118558 1400014 1208467
12793 1208467 927693 662669 516316 698056 798213 932316 1050369 1037508 1020958 1162431
12783 1162431 960115 830194 698265 481408 591470 918011 934127 858052 905393 1153782
12773 1153782 1337877 1159026 908818 943857 910390 776017 584693 590887 842868 1062830
12763 1062830 1218201 1175188 1073584 920951 667280 847439 1039648 949906 1064814 1090650
12753 1090650 942657 1011376 1016949 818209 672255 498521 717254 671556 639439 799298
12743 799298 886689 979862 1120793 1239747 1036205 1269403 1286889 1331483 1295918 1216255 1083155
12732 1083155 1028402 940994 892612 798975 763485 712983 856148 907355 885007 841203 725425
12721 725425 911437 1020596 1175700 1181833 1276973 1177933 1065762 1121066 1395006 1393924 1411921
12710 1411921 1601801 1554909 1427166 1285634 1401766 1499311 1534038 1481599 1365983 1323340
12700 1323340 1016084 869259 928054 834273 791828 1031470 1079803 972173 1117374 1180148
12690 1180148 1426505 1423014 1200047 1112519 1209302 1126930 1126410 1224400 1223091 1337236 1384579
12679 1384579 1375174 1293878 1299478 1297394 1059472 1026923 872635 814145 987282 1283816 1275840
12668 1275840 1181863 1146195 1195837 1372413 1198647 1318568 1226956 1163330 1053904 1078342
12658 1078342 1045967 811064 619402 852006 1239179 1376061 1236705 1002559 969258 1214790
12648 1214790 1509348 1425744 1198474 1117823 1195526 1410672 1525693 1752330 1805244 1408850
12638 1408850 1229081 1380799 1549067 1440152 1420341 1505937 1597096 1622374 1641809 1408055
12628 1408055 1339915 1293639 1217412 1216411 1296108 1137840 921896 851711 1061183 1354957 1226732
12617 1226732 1291794 1449223 1406487 1216015 1101920 1204940 1389793 1458856 1667306 1398778
12607 1398778 1560220 1576732 1431157 1521905 1293422 1193489 1440244 1337601 1228066 1468145
12597 1468145 1511450 1356696 1286054 1310773 1510505 1621417 1235429 1129667 1157548 985870
12587 985870 1214968 1408467 1360373 1153773 1199703 1395256 1250459 1176209 1230305 1459412
12577 1459412 1649548 1849653 1897838 1724712 1677939 1781488 1780134 1798897 1964082 2223091
12567 2223091 2277875 2274316 2204339 2106904 2184379 2267137 2418376 2313672 2101563 2316268 2236095
12556 2236095 1908212 1857319 1845097 2096056 2316325 2285372 2114368 1896739 1715042 1841787
12546 1841787 1928558 1885209 1719173 1626513 1529721 1427714 1436520 1361887 1382589 1541629 1805697
12535 1805697 1767413 1582873 1507743 1555896 1696419 1764409 1977968 2077865 2210520 2032441
12525 2032441 1982618 1687781 1534873 1494091 1592506 1732941 1872648 1902117 1661178 1505337
12515 1505337 1668505 1798859 1832966 1892654 1969047 1908813 1723507 1649488 1514641 1490111
12505 1490111 1440892 1517589 1834529 1854931 1696283 1740194 1878280 2065866 2116795 2165400
12495 2165400 2205184 2188163 2133198 2044741 1930245 1968344 2030938 1831769 1754994 1873249 2032619
12484 2032619 2176633 2138979 2017030 2014318 2075589 2102981 1969598 1819251 1817971 1898060 2002818
12473 2002818 2093985 2057623 1839730 2054416 2127626 2183891 2016584 1903983 2055213 2117968
12463 2117968 2277285 2086733 1932634 1753087 1766921 2082623 2369352 2299373 2294064 2435037
12453 2435037 2500859 2427435 2088897 2030540 1957235 2050060 2084231 2166336 2247282 2174049 2215064
12442 2215064 2356136 2475336 2345924 2169073 2012957 1998063 2057178 1930908 2103746 2264866
12432 2264866 2191574 2179483 2201601 2303665 2569416 2799976 2574389 2481467 2309020 2406460
12422 2406460 2446247 2251132 2244184 2240297 2292418 2098420 2036587 2126509 2258343 2309683 2256854
12411 2256854 1947405 2023971 2249474 2452567 2772439 2930717 2783259 2879091 2917870 2911190
12401 2911190 2896015 2867949 2784541 2441876 2568055 2739567 2656452 2653592 2734892 2777639 2854425
12390 2854425 2711442 2558206 2670759 2592702 2675836 2741030 2711644 2746704 2725115 2632946 2534692
12379 2534692 2520106 2493770 2445024 2481597 2468223 2309320 2309351 2703071 2834074 2733288 2920621
12368 2920621 3075954 2877164 2808352 2806100 2636602 2475166 2600328 2892241 3003380 2929418
12358 2929418 2555868 2631253 2655242 2661059 2641206 2918885 3266891 3253193 2860466 2749558
12348 2749558 2738499 2723272 2917844 2837667 2815915 2954596 2845962 2883684 2816303 2879431 2931646
12337 2931646 3254966 3296636 3193354 3151582 2945366 3004314 3128664 3434862 3320237 3255053
12327 3255053 3095240 3191658 3219557 3160879 3321432 3376857 3442112 3442815 3459362 3401375 3492248
12316 3492248 3584175 3627334 3585665 3766171 3800834 3496647 3551239 3707055 3736862 3667800 3522365
12305 3522365 3430821 3242697 3473513 3680949 3627869 3471925 3519294 3413887 3515023 3533698
12295 3533698 3577531 3434034 3332142 3135023 3138665 3276413 3481751 3438584 3518769 3525703 3639568
12284 3639568 3729003 3802267 3908484 3828426 4085499 4232654 3930368 4097636 4408639 4505696
12274 4505696 4379796 4045593 3927109 3988079 3998967 4142990 4248388 4339598 4385891 4289227
12264 4289227 4460461 4450223 4563876 4422171 4164908 3979265 4028196 4055976 4136610 4294712
12254 4294712 4401402 4541104 4599193 4530092 4281193 4189009 4370570 4547752 4739293 4846707
12244 4846707 4706977 4638614 4806516 5030493 4937695 4820379 4518607 4360943 4267228 4469373
12234 4469373 4816550 4767869 4719635 4894872 4960390 5028185 4980409 4947411 5154013 5095704 5037121
12223 5037121 4915943 4970455 4965226 5160882 5300277 5162155 5012008 5064106 5223398 5424860
12213 5424860 5739375 5977154 5696233 5490959 5330789 5499342 5979227 6035081 6045901 5874765
12203 5874765 5807213 5762429 5547326 5571464 5864952 6066149 6064264 6255453 6265426 6493215 6839647
12192 6839647 7156520 7563145 7295987 7094816 7165915 7523588 7736637 7824670 7937641 8172830
12182 8172830 8349049 8563352 8827737 9064384 9389647 9867380 10160606 10501472 11121694
12173 11121694 11755329 12111585 12619592 13670441 14640698 15711025 17064782 18600235 20518116
12164 20518116 22476170 24472853 27060304 29924028 33396499 37798820 43424279 50443224
12156 50443224 59556319 71074675 85210736 102179058 121461189 141981323 161925123
12149 161925123 179941083 194304031 203795563 207588106 204808027 195728631 181736527
12142 181736527 163895278 144496293 124837454 106026937 89244856 75174381 63912968
12135 63912968 55092863 48248137 42654097 37895985 33948097 31080687 28710669 26546098
12127 26546098 24704973 22732227 21067730 19379509 18096061 16975444 16016322 15238269
12119 15238269 14406998 14041570 13627079 13194682 12773849 12762790 12491039 12200466 11765724
12110 11765724 11424711 11269925 11051850 10920880 10590479 10320440 10021402 9734080 9857587
12101 9857587 9979577 10060101 10128385 10199832 9963056 9859045 9614715 9388077 9482895 9325373
12091 9325373 9473254 9447026 9426693 9337822 9189391 8901840 8890217 8925276 8899710 8884623 9128514
12080 9128514 9217591 9404661 9524387 9425831 9398505 9173455 9173847 9630237 9726523 9599255 9356833
12069 9356833 9431391 9596746 9550620 9523259 9319862 9064593 9082345 9154069 9235137 9511706
12059 9511706 9213385 9073569 9062459 9079667 9365842 9238987 9209466 9287253 9308567 9264289
12049 9264289 9425252 9641760 9831574 9901496 9980415 9974322 9687470 9634526 9641947 9693492 9812473
12038 9812473 9832927 9739131 9512379 9505717 9511445 9665463 9623474 9593072 9660135 9560953 9622631
12027 9622631 9793158 9645818 9761275 9859485 9635370 9703475 9964230 10052492 10108160 10148826
12017 10148826 10316022 9930789 9904057 9875181 10114656 10060129 9985124 9979123 9997178 10195385
12007 10195385 10304488 10216500 10206332 10346731 10267545 10394693 10577960 10636305 10584240 10324729
11997 10324729 10387131 10538519 10524487 10531627 10564140 10554189 10529405 10618500 10571651 10480655 10499155
11986 10499155 10401058 10529866 10628078 10397853 10254863 10318047 10440797 10541446 10509577 10330744
11976 10330744 10392987 10329500 10308542 10520094 10446864 10507941 10593729 10588289 10405539 10344765 10362084
11965 10362084 10627683 10708260 10674090 10717854 10715621 10979651 11057678 11025773 10780558 10708144 10969840
11954 10969840 11065054 11134931 10918129 10893704 10905849 11008918 10809382 10987341 11058751 10838947
11944 10838947 10824651 10827588 10755071 10598319 10534245 10798427 10921393 10961989 11013196 11107570 11064622
11933 11064622 10800633 10588137 10640904 10652841 10528088 10557347 10624715 10825296 10948620 10925306
11923 10925306 10753397 10804424 10814208 10875288 11031872 10958394 10752397 10797238 10929144 11047823
11913 11047823 11077455 11052080 11002915 11011501 11072373 10694524 10503043 10866325 11048448 11069736
11903 11069736 11067421 10917908 10991285 10947240 11100465 11177317 10962946 10814061 10667381 10503285
11893 10503285 10475086 10304737 10121557 10172223 10310911 10513673 10440573 10511029 10519839 10419496
11883 10419496 10283200 10127005 10205009 10191049 10071544 10072739 10075756 10193084 10521667 10843401
11873 10843401 10634090 10472170 10460576 10581815 10576130 10524335 10779477 10555177 10314722 10168665
11863 10168665 10247599 10193402 10182952 10392713 10155345 9772382 9810133 9894643 10055455 10012686
11853 10012686 9758224 9660342 9831239 10044433 10281597 10168782 10026166 9843206 9913805 10032369
11843 10032369 9937906 9759814 9675161 9531646 9511062 9621974 9667218 9710858 9764531 9672667
11833 9672667 9564136 9546248 9622200 9682669 9705592 9523999 9312673 9058424 8959982 9047630
11823 9047630 9114245 8954799 9145724 9531737 9413246 9416235 9374618 8997926 8833251 8573338
11813 8573338 8535746 8491349 8707197 8817924 8650521 8382646 8326235 8512103 8734552 8622066
11803 8622066 8512525 8262707 8130676 8222136 8045129 8089918 8083145 7999294 8197527 8183778
11793 8183778 8305168 8249190 8162556 8225666 8224501 8183776 8073109 7843022 7596606 7722010
11783 7722010 7889518 7864969 7646926 7599353 7794376 7802090 7804529 7650510 7510886 7705872
11773 7705872 7913094 7739926 7559552 7751615 7975093 8005358 7819245 7619231 7609791 7574029
11763 7574029 7558677 7695191 7620902 7153917 7203227 7536156 7609275 7199614 6925846 6897142
11753 6897142 6824634 6854338 6941730 6831842 6908215 6916462 6997119 6883157 6862998 6803038 6810592
11742 6810592 6668335 6672455 6650019 6412624 6677221 6856795 6908268 6900374 6950383 7006260 7059671
11731 7059671 7020695 6971192 7185031 7229621 6965612 6841974 7127766 7383120 7242255 6938090
11721 6938090 6653523 6688350 6490143 6462236 6751683 7011948 6981500 6730566 6460929 6035308
11711 6035308 5994489 6074334 6193831 6350645 6436862 6624676 6424687 6383777 6232406 6137587
11701 6137587 6139721 5859182 5676619 5875943 5817653 5666538 5523197 5391652 5457605 5779075
11691 5779075 5731087 5468890 5317783 5330182 5258311 5253363 5155436 5323823 5404167 5272070 5132367
11680 5132367 5038718 4876145 4963391 5232228 5371543 5329559 5005065 4933151 5355458 5657934
11670 5657934 5528441 5271718 4853721 4908148 5254788 5488413 5559392 5281371 5377466 5491508
11660 5491508 5368987 5138948 5055050 4929645 4692478 4728879 4661836 4708846 4804616 4886281
11650 4886281 4757550 4650555 4651716 4553237 4590508 4668909 4629235 4730743 4949491 4947654 4907615
11639 4907615 4869012 4592335 4720336 4825659 4738896 4753319 4889027 4787793 4573771 4559076
11629 4559076 4582346 4429274 4394090 4359330 4125437 4013626 4047698 4201639 4200257 4154969 4028149
11618 4028149 4063026 3837049 3904507 4105182 4330124 4147200 3790472 3673291 3667113 3691805
11608 3691805 3864153 3958124 3704679 3707303 3690452 3776542 3981164 4159022 4063224 4065595 4058867
11597 4058867 4055436 4024100 3887449 3656697 3654238 3695716 3538645 3720676 3750317 3717239 3596017
11586 3596017 3432989 3269341 3253824 3321008 3499232 3476219 3495167 3263416 3259487 3510773
11576 3510773 3637160 3450010 3555583 3680128 3578890 3607065 3738030 3722552 3566038 3670718
11566 3670718 3822919 3599362 3481138 3404460 3455654 3479622 3350968 3293810 3255092 3177364
11556 3177364 3068914 3267248 3501875 3534686 3533130 3340621 3301405 3369359 3440746 3572463
11546 3572463 3583468 3456049 3240897 3179181 3125816 3095502 3170488 3013697 2908280 2902959 3028692
11535 3028692 3228125 3122383 2947851 2855821 2872906 2751873 2754319 2693996 2579636 2750992
11525 2750992 2974948 3162650 3013837 2913380 2917782 2913402 2871799 2858831 2805018 2976595 2989909
11514 2989909 2797690 2718794 2744207 2680156 2815568 2738117 2795119 2832365 2919317 2915349 2870139
11503 2870139 2873566 2791559 2620376 2593912 2452228 2194920 2300466 2645634 2743849 2686245
11493 2686245 2396412 2193640 2393237 2407093 2391568 2330183 2440852 2453908 2466471 2571255
11483 2571255 2564687 2514449 2437810 2440967 2413531 2135469 2087421 2232128 2354801 2250536 2364886
11472 2364886 2418533 2503687 2312785 2170125 2323818 2291928 2200183 2188646 2237140 2229031 2362790
11461 2362790 2531930 2330758 2260156 2313213 2346763 2356803 2372775 2322088 2129949 2221713 2357436
11450 2357436 2323484 2189869 2345216 2321249 2081254 2235532 2421720 2103898 1956110 2265569
11440 2265569 2439202 2305478 2223126 2115070 2209109 2230731 2175390 2123122 2136412 2021893
11430 2021893 1957359 1933753 1889803 1769011 1805492 1643747 1826481 1963406 1759846 1877414
11420 1877414 1908459 1976740 1999234 1940046 1749451 1873873 2090606 2196883 1873356 1821141
11410 1821141 1845520 1967563 2117382 2162887 2037012 2130288 2181625 2144924 1984678 1710076
11400 1710076 1603725 1609429 1659602 1842365 1976070 2157167 2149816 2126755 2219888 2095249 2239660
11389 2239660 2103878 2008542 2049810 1938504 2018139 2217377 2259355 2168194 1968772 1770000
11379 1770000 1591538 1621023 1737009 1925015 2043495 1989926 1893073 1598423 1603370 1550266
11369 1550266 1470065 1415282 1598816 1660583 1471062 1218318 1171079 1278525 1360220 1411351
11359 1411351 1632524 1574770 1370842 1267790 1241670 1443474 1518605 1658616 1722688 1735618
11349 1735618 1786116 1854281 1620953 1508525 1515911 1623869 1625261 1632628 1652649 1453893 1396313
11338 1396313 1316603 1535487 1570003 1572661 1525975 1460072 1553657 1712675 1723169 1682258 1872116
11327 1872116 1952906 1848123 1827734 1722105 1614386 1568679 1577269 1480029 1525697 1431002 1564950
11316 1564950 1608528 1418482 1170012 1188479 1421950 1585189 1463667 1479575 1333618 1162443
11306 1162443 1122310 1022970 1068839 1025503 979386 1233177 1429350 1324986 1304849 1455999
11296 1455999 1229417 1128933 856328 825620 1137280 1274743 1077894 1038765 1339337 1479004
11286 1479004 1371686 1367950 1445452 1479115 1413067 1409411 1151194 1156143 1111032 1309195 1368690
11275 1368690 1331953 1211595 1201092 944800 918753 915349 737557 697018 811396 1031214
11265 1031214 1201396 1168988 966522 843994 931235 1106244 1013644 634537 634705 721419 925724
11254 925724 1108460 1183876 1322695 1162755 1112493 1253908 1227964 1193450 1145658 918734
11244 918734 927393 990427 1066135 953078 888870 1140837 1271673 1243476 1127347 1240918 1089926
11233 1089926 813718 952525 950382 1000668 1003827 839585 924916 1329667 1410716 1450321 1295071
11222 1295071 1060310 1339784 1154890 835476 622276 579722 704189 835204 964167 985078
11212 985078 875571 812987 1129606 1288398 1079060 831714 776231 878900 1070849 885487
11202 885487 530736 585553 736547 729202 565073 574465 685378 828029 1005178 855403
11192 855403 921565 1020417 1123417 1145833 1081207 938216 803341 1016266 966015 996709 1063626
11181 1063626 1135089 1060564 884103 857664 922863 744201 591018 646637 549716 340977
11171 340977 490044 732697 792375 942272 833422 913000 1025577 1040710 934293 832551
11161 832551 778918 870627 857659 904912 953106 1018727 1162734 1305924 995707 734575 688697
11150 688697 798217 825991 800782 745258 691462 736886 712671 671774 712575 767995 796730
11139 796730 691308 579120 850058 912620 789063 613794 547262 616596 733561 710230
11129 710230 601922 712923 595344 331405 264307 586964 770651 571761 481660 454145
11119 454145 636329 633833 667733 528623 515979 399212 362676 344080 587938 812588 893880
11108 893880 921550 1057529 892454 500616 373377 317224 335092 616825 797339 843055
11098 843055 797529 646748 535173 522005 664694 790854 617464 433609 306592 427993
11088 427993 328080 438441 553361 390829 316945 412341 413727 259365 167914 231563 229418
11077 229418 401715 467078 598219 686139 559870 418678 496630 688546 769140 839130
11067 839130 910706 580254 455532 404442 179765 161966 302363 481490 589408 652692
11057 652692 562522 604239 465779 539948 745540 563700 531739 743916 778362 719312 888024
11046 888024 1131624 1427450 1455390 1122550 1012351 918534 972781 991250 1016267 1115938 1344147
11035 1344147 1430688 1256572 986341 1019047 1363231 1618767 1546621 1350822 1084462 1082989
11025 1082989 1218977 1574817 1682872 1910942 2129075 2234669 2265216 2150391 2113982 1837292
11015 1837292 1760714 1765738 1802536 1820485 1817639 1927798 1962619 1836410 1584699 1544477 1474739
11004 1474739 1137932 929558 985609 1072466 1045149 1033821 873717 672689 748791 876382
10994 876382 742044 904877 846748 857689 882011 626142 422212 648562 727008 697029
10984 697029 795641 649348 372033 209374 144594 184459 310331 357859 179493 243585
10974 243585 321218 217611 318461 250977 373940 349335 451164 460516 554338 528326 613958
10963 613958 539258 582933 431668 661401 674747 314333 166464 -35251 75586 310169
10953 310169 299671 337291 314060 262904 353964 430027 525269 598071 496338 297763 70613
10942 70613 269771 450339 482566 506000 564773 679105 579336 483093 470727 401907 197312
10931 197312 337949 265399 88342 165894 114069 156437 237576 77063 143663 190389 120067
10920 120067 192956 619079 580418 472557 191638 124852 329168 276313 161647 215940
10910 215940 234218 90522 260165 485393 537739 392775 117294 -50996 77570 293347
10900 293347 311142 182166 74359 -89048 -278544 -328399 81652 57340 5681 109681
10890 109681 -69200 -57118 -54814 -245058 -401014 -258584 -70628 37611 -22143 251387
10880 251387 326137 378482 227437 182128 346293 383213 561245 662045 377733 360162
10870 360162 257403 291339 184066 144275 -79672 135100 547452 782052 763886 335000
10860 335000 321003 560621 603733 779549 576249 305633 311888 379150 562663 836209
10850 836209 957415 735965 504198 701038 661614 180670 -91848 -24129 -47422 -48780
10840 -48780 181055 378890 458033 209608 191027 447163 495120 467646 534049 294645 372207
10829 372207 127965 -112368 -142117 81309 213399 233390 469453 472045 318856 339415
10819 339415 373049 290452 222128 151348 150129 -51889 -126921 238944 520805 503086 354798
10808 354798 19176 177436 90230 33846 14040 -184181 -207900 -52917 20566 -250504
10798 -250504 -93257 112095 253903 241005 206096 158454 116007 178979 237621 198984 350317
10787 350317 315370 347286 528436 316685 -14398 -38122 -8712 223377 625276 615816 511421
10776 511421 335699 265499 453688 335370 34826 39384 215093 160018 20935 -65900
10766 -65900 39237 76144 90330 254801 429777 570201 496136 375451 323431 382632 521410
10755 521410 576016 554435 463399 513040 422206 525127 433557 272387 213662 146961 153486
10744 153486 269821 404132 582085 698948 418909 230915 193376 266848 211233 316448
10734 316448 552914 775673 569306 218417 104705 375300 489641 374503 319689 368899
10724 368899 364332 395751 506457 476475 413596 427555 690389 868293 875600 777646 708685
10713 708685 679673 446798 277044 420651 409854 507604 607926 283194 167403 141486
10703 141486 38191 149033 356819 451415 491706 362937 300444 219155 387043 632936
10693 632936 636095 814715 713791 559039 606634 541328 398511 276719 105249 91384
10683 91384 209962 224643 338000 475460 546406 556656 126320 73056 -2114 -118888 93564
10672 93564 244817 278972 133269 219081 148785 73230 -4669 -86369 -152162 -49113 85394
10661 85394 236694 219095 171220 249847 314468 211377 157375 144017 255625 622217 773818
10650 773818 602117 439854 646180 751119 606877 261883 298720 472359 335009 411822
10640 411822 679308 1111434 1444397 1584305 1715708 1908195 2145717 2425687 2859996 3481179
10630 3481179 3796641 4094554 4440925 4751113 5278082 5949468 7292027 8717939 10719120
10621 10719120 13342427 16997319 22292289 29488035 39293201 52568167 68511904 84326484
10613 84326484 96162537 100432569 98147498 92851485 88108819 86427798 89400285 98392054
10605 98392054 114941790 139991679 172150451 203958364 223776813 224271006 209522526
10598 209522526 189139156 171267154 160524205 159091354 168500415 189424492 222529531
10591 222529531 264200673 302627364 320422451 309306164 277315222 238703420 204791119
10584 204791119 180614176 167348463 164679190 171913131 188536434 210893844 229491139
10577 229491139 232860709 217155554 189167944 158415569 132232499 113230876 101392375
10570 101392375 95942562 96229992 100346402 105899619 109298137 106490811 96385083 81630633
10562 81630633 66195268 52426238 41339110 33213065 27105580 22582451 19281838 16642409
10554 16642409 14664466 13115825 11961049 10905729 10048835 9388066 8528522 7870082 7168833
10545 7168833 6568200 6264105 6002657 5671937 5550697 5366010 5150063 4854341 4647977
10536 4647977 4451106 4211274 3996102 3730056 3863656 3769237 3617397 3682506 3577914 3323674
10526 3323674 3230180 3097526 2911663 2912750 3036370 2683898 2651702 2962341 3156254 2975719
10516 2975719 2847527 2488043 2350069 2286875 2282543 2340534 2591324 2526833 2290262 2206950
10506 2206950 2136249 2007576 2102161 2214364 2139297 1962986 2186669 2136634 1946294 1931936
10496 1931936 2005869 2051127 2068995 2181620 2090420 2029153 2035313 2137633 1961131 1665202 1500710
10485 1500710 1483108 1727904 1853722 2028443 2062425 1810033 1796459 1762813 1697149 1774723
10475 1774723 1966960 1916493 2136477 2347305 2482600 2445312 2361019 2234375 2450380 2541953
10465 2541953 2467046 2385628 2274351 2055596 1876127 1878553 2128222 2350200 2366211 2228270
10455 2228270 2369628 2508154 2415394 2534829 2663247 2633354 2427045 2316325 2410461 2245273
10445 2245273 2043742 2072577 1889357 2055856 2284604 2382257 2301174 2129200 2157473 2322905
10435 2322905 2031627 2015470 2061731 2189767 2211526 2440878 2426649 2177179 2207975 2283558
10425 2283558 2030142 2074047 2157423 2054537 2221318 2372052 2301682 2315805 2333604 2351476
10415 2351476 2443943 2672860 2784840 2675337 2358204 2294881 2528145 2605782 2328624 2538918
10405 2538918 2739327 2844072 2961856 3033329 3109352 3142866 3127439 3350804 3516684 3491602
10395 3491602 3525248 3534605 3629850 3731057 3798716 3781377 3861824 4029556 4124863 4255878 4219680
10384 4219680 4529801 4688714 4845936 5205790 5454302 5472877 5689283 5851246 6069819 6181655
10374 6181655 6343287 6694187 7036055 6950846 7313868 7364381 7502587 8175119 8858992 9270008
10364 9270008 9637643 9876034 10417788 11328105 12194996 13026655 13635972 14313885 15013586
10355 15013586 15961179 16969385 18262343 19623115 21043820 22665844 24208644 25911168
10347 25911168 27726225 29606726 31751575 34156889 36603068 39087268 41806243 44060653
10339 44060653 46303315 48310453 50547283 52816716 54621956 56251284 57637258 58708765
10331 58708765 59552641 60048021 60482861 60720483 60781528 60914497 60978391 61114495 61617341 62326187
10321 62326187 63039736 64062433 65067538 66003573 67433744 69217373 70949540 72783735
10313 72783735 74719797 76787257 78729027 80639640 82736889 84376940 85736877 87055230
10305 87055230 88074694 88865447 89338829 89349828 89125163 88291227 87314026 86196514 84954299
10296 84954299 83472340 81516495 79628170 77944096 76254627 74561834 72619606 70891431
10288 70891431 69214595 67895331 66572965 65247608 64236987 63576350 63123508 62709508
10280 62709508 62560933 62737089 63009817 63571000 64280121 65037503 65621408 66097296 66787219
10271 66787219 67246704 67394411 67162307 66632141 65525511 64018983 61963891 59700064 57415311
10262 57415311 54851208 52057614 49463854 46641887 43784076 41130094 38367574 35901694
10254 35901694 33721292 31497687 29477209 27714844 26179769 24714571 23220206 21740319
10246 21740319 20501797 19427862 18200836 17144765 16428489 15740802 14915914 14063502 13351138
10237 13351138 12490424 11954023 11539079 11148563 10548923 10029560 9733080 9402224 9121673
10228 9121673 8877485 8555981 8425904 8249702 7976497 7731753 7545256 7153569 6904513
10219 6904513 6523957 6310833 6352312 6246959 5960405 5929918 5853852 5337726 5203948 5370453
10209 5370453 5291207 4984532 5030432 5105062 4900665 4741707 4710112 4739779 4712429 4615334 4553235
10198 4553235 4398369 4211126 3751078 3568445 3302539 3364144 3576944 3771173 3806051 3635900
10188 3635900 3565520 3493638 3461070 3272171 3162924 3139054 3059995 3140591 2998227 3333956
10178 3333956 3498164 3493917 3611910 3896391 3770713 3566005 3490727 3421544 3259047 3333935
10168 3333935 3326629 3242091 3396936 3363705 3491868 3641520 3672709 3533575 3427129 3139077
10158 3139077 2917930 2908891 3431199 3866042 4072093 4218043 4252659 4001418 4026563 3702339
10148 3702339 3403345 2988985 2615196 2735093 2940249 2928230 3029614 3169881 3194174 2982721
10138 2982721 2736448 2655505 2649258 2510803 2214247 2087422 2006462 2041667 2104746 2179029 2152834
10127 2152834 2114031 1761823 1602522 1753658 1604974 1614249 1847431 2144178 2095036 1980233
10117 1980233 1915203 1747409 1595458 1507158 1499918 1472700 1237793 1217281 1331596 1301714 1099837
10106 1099837 1200515 1487181 1560785 1332442 933837 887734 940485 1163695 1369128 1406097
10096 1406097 1436248 1435117 1246563 978450 935417 1001552 972748 1071674 1184883 1330921 1329373
10085 1329373 1216444 1391935 1354557 1385257 1476306 1273820 961080 1156708 1261230 1089743
10075 1089743 889833 654888 483786 640891 771803 816370 775658 809355 585792 553589
10065 553589 1013970 1051660 802017 631548 755479 998856 1099781 1086807 1167797 1055062
10055 1055062 936022 781875 624763 695673 760531 441854 558274 633496 535484 342519
10045 342519 391780 590826 712831 637804 490913 507863 499512 594181 766005 706340 666214
10034 666214 604698 626680 688087 683136 634436 566259 759747 613727 673873 701422 714970
10023 714970 698169 639606 639531 570672 736784 952724 825792 639371 760124 701621 715148
10012 715148 787183 860765 833406 655237 634960 892832 932512 644874 690678 772737 648592
10001 648592 569389 755436 635473 593216 720702 673837 733436 560604 287135 278022 309102
9990 309102 192980 134097 125295 492231 570247 477281 525072 687826 552410 498787 380607
9979 380607 415077 333134 368600 491682 564444 577009 419962 306514 525311 499711 471283
9968 471283 720024 756116 689817 537492 374419 434758 353386 139629 229412 232331 438832
9957 438832 632593 674614 523306 303897 156809 -9381 -197029 -13308 352823 451456
9947 451456 531793 549992 598565 528308 492525 496022 503502 483386 556375 610955 578994 860759
9935 860759 871558 584334 489703 383955 478564 566477 577151 692108 686003 718527 657292
9924 657292 468661 648364 591694 623686 694387 727166 558509 310911 421791 687970
9914 687970 608497 455847 559306 723831 781200 693007 618488 747808 736258 565974 422358
9903 422358 404694 653461 679348 412609 319979 824505 924544 729383 482984 468569
9893 468569 393931 580056 728922 722481 812783 901483 785448 646404 725673 832917 903697
9882 903697 967366 865033 620858 461545 494406 624982 417776 335832 301699 428795
9872 428795 366959 455536 398318 455421 548069 479797 581900 906423 1159507 932882 844631
9861 844631 752489 448365 362763 322944 640382 918358 899716 779220 672841 581769 414464
9850 414464 306042 424535 456976 447588 314960 215016 313610 347109 359598 113426 400536
9839 400536 647475 660313 558925 453073 361665 379544 396685 381715 433758 439936 440638 555197
9827 555197 379883 87813 -132113 -48283 49239 178976 104894 101905 36097 49178 166675
9816 166675 -29536 -18204 -82669 -104679 77924 103150 123336 102795 112484 202291 237534
9805 237534 122807 293714 482419 568440 382399 167812 225239 223827 336226 422936 601471
9794 601471 560978 462870 357127 138204 105845 284460 320577 219495 144937 62242 179020
9783 179020 21644 76485 311691 269873 180166 212052 417006 458498 423846 457949 354224
9772 354224 147122 182121 127635 132947 149190 56814 -52288 -13712 -29842 -173160 -103448
9761 -103448 182162 252827 67613 242098 363516 437399 410689 446765 290530 177552
9751 177552 -17974 131179 337660 146029 -203956 -185836 105020 389550 462129 434425
9741 434425 303557 413527 421940 361140 135182 -126670 -182794 -184913 1318 277952 367038
9730 367038 467306 252949 84615 -39901 -114436 -8745 177046 82081 -6878 14282
9720 14282 -54560 -314378 -190453 112321 76130 -8985 -152788 -88446 -204559 -345056 33469
9709 33469 100258 56170 48051 53817 108729 27483 -16914 321574 517942 420630 124845 -25414
9697 -25414 -68348 19426 182053 319790 363019 124094 87010 81372 274568 127995 174701
9686 174701 81961 -5041 55041 277979 212365 33811 60049 -30997 -48307 99626 281984
9675 281984 241067 -123516 -402320 -21182 136570 18870 -25489 304563 374895 172119
9665 172119 -112121 7023 253905 324087 127243 -105509 -99270 -185998 -84396 193638
9655 193638 408346 426537 627115 985559 1782982 2565831 2528039 2086303 1720104 1394074
9645 1394074 1009136 477789 292494 511484 358405 329144 436078 347789 287800 390462
9635 390462 523996 377070 185597 390883 762993 928488 581645 370298 146048 -315490
9625 -315490 -423647 -375136 -457350 -376750 -23002 -47856 -96577 -13797 131451 -22745 -68223
9614 -68223 -144544 -94396 124527 185166 31014 265402 397866 99558 18253 170462 65449
9603 65449 -59506 -29526 75050 102827 101867 -34765 -84503 -7436 1112 -118743 89191
9592 89191 217777 269256 100230 25356 1383 -52646 30615 61435 -76173 -239878 -517591
9581 -517591 -520434 -217643 -258304 -420066 -625352 -652620 -600682 -385814 -61817 81082 -50614
9570 -50614 -88619 165257 202723 450770 284595 -224149 -274679 -201703 -183849 -224338 -371125
9559 -371125 -156361 19088 25964 51952 67116 214456 -73543 -274214 -240692 -11100 89472
9548 89472 -21368 -335011 -211937 -227011 -126667 -6617 204556 441371 554927 580003
9538 580003 319475 -15412 -90721 -88276 -96817 -61430 53899 260940 58955 -21721 109368
9527 109368 285546 353155 33068 -96136 238746 280907 237948 97127 18726 -32993 61376
9516 61376 118302 -90970 -183845 -233038 -387969 -214791 69694 228874 201242 -39294 -165806
9505 -165806 -16829 201396 229235 125477 78742 221629 191888 214736 46897 -101803
9495 -101803 -62945 17029 65739 185449 332988 312251 123606 14401 -116122 -43655 319624
9484 319624 196249 -29517 -171303 -222397 -133099 -24385 227613 285327 250201 14503
9474 14503 -61975 35756 -183110 -227983 -194512 -126544 -13787 254648 240013 282609 290027
9463 290027 -52456 -259138 -78383 82615 60411 -9915 -120365 -41964 -15552 -82030 36208
9452 36208 -86283 -303603 -119828 9687 -29341 127928 198962 124528 172376 228103 165057
9441 165057 213729 205078 86807 266386 1791 -151150 8178 158783 224731 340305
9431 340305 300115 294085 223655 14435 200498 80487 132589 418540 422227 547888 570606
9420 570606 396905 177999 216911 132805 199133 320759 250305 274560 387838 512546 634875
9409 634875 625890 556383 464859 242816 257904 490080 455801 306951 357023 428661 20622
9398 20622 -216194 -163005 235247 388421 459855 467375 301688 391416 641567 666231 273360
9387 273360 236792 442320 621473 463670 226885 -1140 120728 272952 384604 421379
9377 421379 204007 256648 155150 -8083 -100540 -4428 -124436 -49716 277494 139124
9367 139124 132886 212791 135628 88721 -77736 -100481 224279 316079 165583 56130 131267
9356 131267 145417 334622 441774 352050 96659 -78158 -73282 -44491 24337 187058 289509
9345 289509 455566 437168 320182 423853 207570 90203 6820 40233 128602 96660 43370
9334 43370 -87115 -94708 64680 65572 213261 544252 365091 362406 408011 491918 480841 157429
9322 157429 79732 114102 322092 571082 549256 604960 487631 226293 -88917 -321720
9312 -321720 -383594 -293642 -215466 -78740 -204258 -331076 -174713 -69966 -64331 -18860 37057
9301 37057 153411 125966 -42117 -96034 -179921 -51474 -102101 -56676 -187939 -343041 -257747
9290 -257747 -147763 -130886 -11066 -108019 -174980 -166619 -243397 -396049 -509383 -353746 -273008
9279 -273008 -180068 -59217 -308590 -162045 123057 224868 99234 42399 85367 -120592
9269 -120592 -286665 -118844 -77227 -190644 -116373 -53203 54873 80949 206036 68265
9259 68265 -118444 -68968 -56517 -196119 -264047 -237842 -289610 -67162 -73269 30135 -74748
9248 -74748 -66642 121922 83857 -74339 -177266 -288409 -188949 -59566 -14612 1554 -158408
9237 -158408 95844 284085 303922 265736 101354 178901 165043 212217 65821 119559 70801
9226 70801 37256 -21332 -39331 -66487 64232 154486 160885 131781 89900 8372 17543 -28894
9214 -28894 -26000 -26884 114363 85976 65995 -11695 -50367 -112077 -98840 -27150 -31821 -117492
9202 -117492 -365280 -265519 -117007 105050 190707 306301 108295 -261868 -265521 172396
9192 172396 -35245 -128043 -180330 -17221 108208 161413 103863 221068 144006 23615 196321
9181 196321 133291 287322 310351 226394 230919 111389 19601 -12268 -63190 -262198 -47200
9170 -47200 16776 -119744 -47073 12482 121288 116847 103492 232972 156158 87521 78998 164544
9158 164544 373441 294366 164266 355787 700266 630617 406660 200511 286732 398892
9148 398892 514435 317664 105873 8372 47269 229449 240541 -38294 -152476 -141711
9138 -141711 -95621 111701 73167 -174758 -199051 -240588 -139254 96618 112017 83632 122659
9127 122659 143947 97712 45668 159622 303753 -31456 -273009 -198882 -121294 38554 300639
9116 300639 555815 605579 463684 67344 -255582 43813 372502 356283 329707 327368 326275
9105 326275 466688 395743 336608 435406 472780 780852 1025756 1099230 1084277 854992 723664
9094 723664 651486 758159 767471 1034706 1300031 1500414 1661095 1852810 1992150 2249736
9084 2249736 2472366 2684596 2947691 3431983 3968329 4502881 5263529 5973440 6733667 7339402
9074 7339402 7937555 8709606 9697849 10865333 11799285 12778043 13603024 14308020 15012378
9065 15012378 15390898 15646350 15625230 15495741 15339998 14733870 14246899 13987502 13843241 13886588
9055 13886588 13842851 14058533 14159817 14706510 15660128 16473303 17186777 18186457 19635000
9046 19635000 21041050 22705759 24460695 26432100 28314597 30278188 32331132 34488770
9038 34488770 36620103 38517713 40298587 41943205 43270699 44452713 45603933 46922574
9030 46922574 47919825 48513994 48842817 49135722 49289030 49232668 48913903 48511277 48113134 47825419
9020 47825419 47601302 47003682 46443226 46106851 46118076 46393212 46865714 47553825 48305874 49228666
9010 49228666 50504484 52088418 54117424 56266229 58462334 60649482 63442643 66344403
9002 66344403 69237680 71798930 74276276 76796819 78726887 80337208 81582112 82005325
8994 82005325 81927291 81317444 79951913 78216990 76410344 74400353 72432062 70287744 67967615
8985 67967615 66017452 64107438 62576936 61329547 60090243 59207502 58686257 58237908 58461065
8976 58461065 58715744 59054676 59399461 59938695 61033476 62501376 63785600 64931757 66102312
8967 66102312 67567257 68750302 69624461 70416423 71001630 71201369 70718648 70103635 69321327
8958 69321327 67815773 65947283 64064860 62012075 59821233 57558481 55270724 52816770
8950 52816770 50635748 48327651 46341918 44480224 42667130 41037613 39494653 38310213
8942 38310213 37578116 36808360 36018737 35492330 35083923 34753250 34570521 34182276 34164426 34378897
8932 34378897 34507637 34777612 34938807 34888913 34750358 34162289 33040466 31937600 30942377
8923 30942377 29715272 28506232 27086491 25759656 24381607 22890242 21355234 19850406
8915 19850406 18622348 17568362 16486864 15415960 14489029 13834117 13348962 12905426 12297844
8906 12297844 12014903 11939761 11995136 12171621 12338514 12340740 12483745 12860097 13077406 13402481
8896 13402481 13951632 14548486 15300532 15838706 16350190 16656734 17117923 17728942 18158626
8887 18158626 18604058 18833436 19076594 19570299 20061990 20712880 21172820 21701727 22243871
8878 22243871 22881652 23660433 24172088 24616199 24912935 25228958 25553539 25709796 25778722 25879813
8868 25879813 26160467 26190747 26406207 26539284 26308408 26262775 26331337 26319976 26254829 26193055
8858 26193055 25867593 26061145 26383183 26484102 26956710 27555480 28257956 29033853 29831756
8849 29831756 30878304 31856425 32676812 33611273 34636452 35182987 35494784 35949204 36096311
8840 36096311 36044903 35638162 35335367 34808219 34563926 34257028 33734356 32958960 32291893 31627518
8830 31627518 30845836 30254155 29749227 29190555 28611760 27892355 27730788 27930230 27988094 28420976
8820 28420976 28785413 29303432 30017829 30644185 31245092 31592511 32011451 32350313 32444336 32343212
8810 32343212 32063227 31583191 31082235 30902664 30736367 30249798 29900306 29451311 29060000
8801 29060000 28476475 27762794 27271415 26905734 26301085 25670324 25145424 24591248 24060158
8792 24060158 23607258 23116811 22481486 21919412 21594266 21170132 20645300 20191254 19763460
8783 19763460 19116820 18404878 18121418 17819438 17337004 17343780 17146511 16778716 16605464 16217302
8773 16217302 16053523 16150510 15935077 15727071 15655163 15354616 15097344 15096847 14896846 14567006
8763 14567006 14496149 14262291 13570783 12875998 12406232 11884341 11238211 10690082 9866374 9227976
8753 9227976 8840751 8435315 8281149 8127501 7839223 7441273 7376726 7174343 6996093 6771117
8743 6771117 6622125 6357872 5939836 5672163 5557792 5535989 5409221 5203935 4908630 4774023
8733 4774023 5051331 5250122 5371106 5232329 5041528 4581107 4493669 4343101 4139774 3733103
8723 3733103 3459031 3409449 3336790 3258039 3261319 3151463 3099811 2932877 2886860 2777015 2449682
8712 2449682 2261249 2081232 2053820 2112608 1942528 1960940 2188526 2175507 2005857 1733745
8702 1733745 1645062 1746350 1602688 1469558 1419329 1475154 1719582 1762401 1629171 1499631
8692 1499631 1788448 1871388 1773017 1627416 1458259 1250839 1303942 1337652 1508142 1604812
8682 1604812 1177620 1137096 1294603 1372406 1220557 1102680 1218994 1277249 1119520 1269137
8672 1269137 1342965 1442335 1323633 975463 777999 946630 1086559 1093853 1000976 987868 1008670
8661 1008670 980036 883323 812529 886586 945913 1208367 1183204 1029783 875227 717475 883280
8650 883280 1377542 1624182 1750717 1670092 1581389 1464505 1287971 1109471 1187161 1167053
8640 1167053 1110921 1072914 1076854 926036 1204689 1328413 1246444 1109979 1042871 968616 1095635
8629 1095635 1231155 1237493 1207396 1163549 1091322 1267106 1208348 1060096 1157705 1274428 1299033
8618 1299033 1167878 1285755 1436371 1227868 1010724 1015193 927203 787198 914379 1065106
8608 1065106 1182446 1145980 1092017 1258396 1246513 1082999 1193097 1001118 744613 997134
8598 997134 1222217 1289955 1336789 1162684 1178392 950535 923648 914634 987525 978353 1130376
8587 1130376 1381495 1497722 1581627 1398639 1275297 1036176 978402 1004407 783571 732867
8577 732867 910738 882908 853466 759836 803955 987171 868797 830228 829534 1036241 1183976
8566 1183976 1116650 1114635 1172744 1171031 946013 910919 993348 978568 986375 1045646 1021548 1022400
8554 1022400 1032890 796967 835895 817929 856932 890520 1090742 1240187 1142594 1189289 972592
8543 972592 957821 982570 770021 833593 859618 962851 1244756 1120308 1026019 851663 525394
8532 525394 395925 276496 366158 584451 636644 600405 431058 342502 718946 843356
8522 843356 690293 552992 823063 795739 816036 880299 564693 506096 419361 325479 87873
8511 87873 152580 429442 595739 707022 803960 922663 646829 360417 243808 119807
8501 119807 224677 543433 721307 704255 667544 941625 807975 746863 531074 363653
8491 363653 606390 843948 895606 687233 488926 376445 464163 297138 64382 193671
8481 193671 336260 403322 582089 502232 360857 348890 610993 533795 247292 -95280
8471 -95280 -106137 -28353 213159 91439 120445 357825 464977 289299 463832 517789 423700
8460 423700 569776 665335 654260 706040 880241 1008480 843821 695280 614647 676152 716104
8449 716104 455473 534419 668014 783747 846801 613895 473554 656138 666556 595403
8439 595403 696716 661524 655168 618241 464694 350056 389382 387835 543436 569427 576798
8428 576798 716935 769926 665652 609656 532001 430726 367229 483985 484720 420238 506348
8417 506348 659122 789379 876458 868245 724582 382736 380923 390932 311533 592779 406327
8406 406327 136382 140359 -56282 14340 135343 394480 523179 568942 595263 423341 453658
8395 453658 571694 495895 294387 346534 561925 634794 622861 576579 589230 692292 578672
8384 578672 397958 221909 170058 61769 63286 85322 -12925 185757 354973 375912 299275
8373 299275 179895 284488 537930 630024 570224 533691 466620 357886 288962 354362 307213
8362 307213 234277 -57552 -30184 48278 -4943 116314 143152 344863 394989 315121 299601
8351 299601 257871 45228 42409 255219 336807 382428 400579 295033 161619 169871 312290
8340 312290 268768 236892 300171 172153 96626 216243 231595 131134 252163 145755 368698
8329 368698 422863 324132 233929 144104 -59228 95622 44857 7473 162825 310300 210380
8318 210380 208579 97355 -60800 -7567 126012 137082 -71070 -292941 -270043 -275463 -289318
8307 -289318 -74768 -302436 -450631 -403278 -294735 -121098 -212364 -154988 -140570 -165037 -56136
8296 -56136 211547 178783 37133 52318 276299 225770 249441 226817 220733 331755 299622
8285 299622 153668 14830 80826 304109 230748 224613 264315 235643 123473 109378 271394
8274 271394 129819 -21255 48652 88017 60348 62968 56187 -107912 -236099 -173379 -16737
8263 -16737 30859 38775 146133 356735 396993 510570 433057 261948 263910 304848 268847
8252 268847 332736 291066 155484 5033 118522 346782 588714 418419 91565 -137377
8242 -137377 -192142 47097 192136 10548 -29395 -34968 48773 64924 16890 92143 92898 136953
8230 136953 215275 371739 244378 120772 66674 158896 202206 55082 -87984 -305884
8220 -305884 -106281 -123048 -325801 -528252 -288208 4685 59670 29518 54885 51436 15457
8209 15457 -74983 32735 147412 -65786 -175144 13157 270444 379045 444920 449587 361326
8198 361326 221378 96363 262604 266543 -2136 4927 364425 536862 485969 448573 380426
8187 380426 355978 -1741 -206285 -204532 106269 289944 166524 -151497 -45549 184284
8177 184284 421254 463583 231697 -88339 -292380 24315 163113 228314 225079 265312 149596
8166 149596 160779 233396 131341 281622 411839 314108 316167 311850 157744 66166 -12314
8155 -12314 -125324 -176514 -151157 63768 67656 26332 -59518 -175066 -179060 -117828 -81960 -45268
8143 -45268 97983 275390 504228 132349 -46096 -48990 -181540 -143189 -79124 -51299 -74778
8132 -74778 -178345 -40021 -107616 25406 184055 23223 65207 -10057 -38220 83701 1452
8121 1452 246101 264057 125277 304430 283806 175759 274415 189743 175553 113852 -144464
8110 -144464 -23757 -67176 -59592 -104578 616 -834 59874 169131 1210 -186212 -95107
8099 -95107 116396 207791 168087 143150 122988 114002 28812 -33271 9276 80273 146872 170517
8087 170517 182405 289862 270324 243123 422673 463216 227900 135233 75319 -76844 2500
8076 2500 420714 747330 546810 248410 23748 90775 219672 306031 453681 437224 540289
8065 540289 642903 612338 286292 75412 -68079 -99849 -274464 -228937 -157868 -125632 -19510
8054 -19510 -25412 124497 271588 321535 320345 68675 163919 199525 129473 13511 269655
8043 269655 121764 -90736 -86883 121838 250951 340626 368552 233778 91849 32087 18976
8032 18976 119109 -75501 -131042 8265 190244 56432 -116947 -338799 -338523 -286371 -201836
8021 -201836 49722 392561 249793 223267 297480 436764 403123 513616 425347 339910 426619
8010 426619 318120 -5644 -68065 -37694 -44314 -47762 183186 306777 -25082 -88509 -170465
7999 -170465 -200721 -81030 -38843 -110221 -5 -47608 45707 288982 356700 434578 315753
7988 315753 320225 475883 138116 -42246 -211826 -90222 195105 351143 497630 401569
7978 401569 398477 576494 380990 -25994 49320 122052 45908 421118 400305 332170 308004
7967 308004 428622 409994 127702 94701 218025 21200 -40936 -74374 67945 124153 75702
7956 75702 -47207 84962 217088 310752 394995 427762 346377 101555 97243 103920 152022
7945 152022 244877 178359 82726 174003 235725 269394 122555 219861 401466 337076 285086
7934 285086 333057 308846 27035 80280 267348 -46285 -283087 -302619 -73665 -119606 -9559
7923 -9559 334591 477604 363239 282956 345550 283720 257471 194211 417166 548420 293263
7912 293263 108801 -15593 -28873 53376 136671 49825 34872 55735 -47879 81954 -108524
7901 -108524 -211480 -23979 22798 12762 345251 386072 10837 -254456 -185198 -136258 -85002
7890 -85002 -80016 -53063 61627 354521 154409 -140560 -73811 27402 12779 68231 250063
7879 250063 203806 -129100 -446688 -152493 110524 -85728 -95323 -80219 31751 123387 305895
7868 305895 420989 541932 353362 399277 415386 189007 -40180 -148784 -15248 31794
7858 31794 -127302 -192045 -125668 -94439 167897 211722 -127470 -263160 -196707 -86332 -60352
7847 -60352 257285 265155 163079 150848 54614 -30196 -229646 -215525 -87272 2775 22138
7836 22138 107286 186917 -37940 -85398 -188874 -53529 40906 -288470 -247847 -66907 -139666
7825 -139666 -103582 -64446 -66947 -32851 -176963 -391971 -261662 -146645 53026 318192 418914
7814 418914 215703 76985 147927 257906 136672 47157 -131855 -137401 -163119 7963 -101
7803 -101 -261633 -494685 -365999 -19225 231664 347865 233361 118470 134207 69966 66408
7792 66408 -117110 -326738 -279749 -312817 -304749 -405452 -305404 -195790 -86932 -30131 92627
7781 92627 98649 49519 84158 134957 -10518 -199334 -52635 4543 -106683 -285742 -163376
7770 -163376 90842 280120 398477 301613 314616 269880 116976 191700 363166 238380
7760 238380 206950 278502 171006 15764 94909 198448 115416 201567 195704 -89786 -137800
7749 -137800 -132606 -335458 -207098 -71666 -5544 -55295 -170220 -30385 227343 401259
7739 401259 221457 -78156 -113902 -105960 -236903 -164442 -153186 -296343 -133234 151712 -81893
7728 -81893 -248148 -254350 -330378 -230414 -90881 50638 223629 104912 320889 306661 86939
7717 86939 -153128 -104606 -64920 201541 113055 33180 -176039 -307252 -187999 56219 199704
7706 199704 189558 165226 94757 171899 281853 205747 -21423 -54910 10805 -15409 -135681
7695 -135681 134621 300571 180769 198647 245793 302509 285475 233165 59231 -100479 -258209
7684 -258209 -110292 -39625 -177182 -59743 217428 179216 283372 347780 189490 61276
7674 61276 59547 18079 -4820 33383 125595 286319 429810 437793 382163 501144 519610 250945
7662 250945 132339 230682 150989 -60525 -210854 -123554 -51307 -1522 -7963 -43872 -45437
7651 -45437 -255102 -109354 95887 -73158 -32667 92128 430805 535352 500309 311173
7641 311173 -12930 140345 165256 6763 14701 103386 219804 130749 30600 -276763 -294596
7630 -294596 -166027 -201262 -62678 78169 25923 -53643 -62479 28788 15084 -1116 92509
7619 92509 265997 331365 479444 503496 403097 372153 330423 248998 416729 262558 -75041
7608 -75041 -214918 -62074 215190 195021 -1960 -263108 -272099 52985 113426 24334 -15505
7597 -15505 190515 83289 -124367 -113502 -5601 -43596 -142050 -162800 -68737 -82576 -215096
7586 -215096 -70866 130372 -38144 56616 92617 211886 165672 14070 -283408 -389914
7576 -389914 -437934 -390008 -456056 -364707 -88196 -100388 -303558 -417888 -182363 37930 155226
7565 155226 350361 493032 399487 238476 173154 63072 -210455 -177195 -243053 -374060
7555 -374060 -572014 -466138 -153874 36968 -31654 -60387 -105918 -389147 -252613 -84786
7545 -84786 -188840 -482723 -444253 -198473 -15115 -6860 -94201 -76634 -175493 -353146 -126305
7534 -126305 -101773 32816 44013 77851 56065 -171202 -44388 -119646 -276886 -94604 -247004
7523 -247004 -144909 -37724 -58662 106873 -9613 -224734 -359153 -153456 -31616 2189
7513 2189 -28294 -212983 -95559 -104607 -161008 -138237 18885 106185 114908 135970 167768 155427
7501 155427 169708 50616 -62821 -7345 -97038 -221137 44037 70293 165680 127244 83429
7490 83429 37397 42217 167085 209359 265405 273364 133800 -44317 -28121 116403 115413 -25041
7478 -25041 -50922 97823 180402 144646 -2808 -257493 -148125 -162720 -299885 -181512 -84779
7467 -84779 -174280 -56484 -92760 -142699 8899 168463 165526 2968 46534 -47100 -88366
7456 -88366 -48067 -51095 50172 74883 81081 264819 447912 386713 181781 110007 -102662
7445 -102662 -116613 -124797 -231929 -319730 -559794 -373744 -120718 65418 82539 -12005 244661
7434 244661 325909 135154 47588 38423 78040 129734 154416 187185 183189 -52638 -217100
7423 -217100 -29671 122933 202998 104405 89342 71075 -23023 -70504 83121 286106 305322
7412 305322 225834 214384 194378 224807 203224 220522 160487 337023 520022 410178 176889
7401 176889 56618 -186464 -359716 -235915 -184217 -221070 -273749 -106731 21359 75880
7391 75880 77026 -36333 -19395 6850 51785 97440 241148 127430 -260020 -169093 -51181
7380 -51181 131605 -53895 -47090 -27713 -112323 -122452 -78298 -20851 13284 -59119 61551
7369 61551 23244 153734 72055 -117322 178566 251606 98141 -66898 -246843 -123095
7359 -123095 -13776 73 119871 14200 23673 -36278 -144151 -156269 -268945 -78242 81430
7348 81430 -105216 -120197 -230742 -503275 -405566 -192257 -1631 -174134 -298530 -263788
7338 -263788 -179365 126344 -8368 -149334 -289431 -161576 12559 3364 -65956 4062 -153374
7327 -153374 -318992 -320243 -447483 -387719 -396246 -98415 131316 49563 -210085 -428296 -325301
7316 -325301 -133258 151525 310239 206853 -5850 -52712 -94481 -296313 -279166 2028
7306 2028 168509 138206 -65075 -50094 -83505 119577 312668 439590 244806 195743 219122
7295 219122 51251 180577 151475 49669 -116638 9432 126224 -148289 -196823 -45135
7285 -45135 -32282 19650 11738 -209052 -193854 -114830 12948 161811 -83436 -294427 -484571
7274 -484571 -203218 108478 74720 35238 129376 253379 106172 -127510 -67459 -10191 -51886
7263 -51886 95307 334676 386835 219603 147386 236904 209280 145200 84550 269546 170126
7252 170126 133852 -108505 -222287 -333448 -485274 -360817 -345657 -31276 23632 -116916
7242 -116916 -173016 -264351 -242996 -332047 -6008 273184 193637 82393 45015 -92857 -136766
7231 -136766 -15783 -23800 -29050 -66461 -12544 93584 54970 -9526 -322551 -406814 -270467
7220 -270467 -80900 -22026 107610 31117 -129014 -151758 -131936 -12593 -44656 -68125 -260036
7209 -260036 -236564 -26167 -24477 -98025 70280 299499 222814 256566 337574 266598 -62463
7198 -62463 -116426 -79098 497 108647 21241 -40266 -215328 -260422 55067 216422 -12598
7187 -12598 -225483 -251325 -185852 -44890 40540 -7488 -367230 -654797 -506613 -342940 -187933
7176 -187933 -99092 -245984 -245626 -165806 -372858 -336956 -344924 -231966 -207184 -237979 1281
7165 1281 223645 390972 161135 -151470 -175927 -32409 116963 122216 -139257 -340405 -418768
7154 -418768 -442246 -179215 -80932 34214 194560 214672 -121977 -556375 -508458 -355192
7144 -355192 -102481 -184038 -282081 -197781 -164063 -328323 -557878 -427252 -210583 -74199
7134 -74199 -221174 -223102 -250195 -177363 -206803 -107762 106987 361249 167246 198527 78813
7123 78813 -161164 -172894 -171037 -18111 -271130 -329739 -192411 -105312 -308025 -277920 -378061
7112 -378061 -363867 -320469 -321571 -411365 -486111 -421087 -301966 -260874 -106703 8674 155757
7101 155757 134715 82063 156785 104695 -118588 -122155 -167102 -175084 -27908 -57160 32455 494797
7089 494797 697721 553735 345431 298711 267770 272018 355768 149525 -254502 -183781 -305202
7078 -305202 -434510 -551614 -581823 -379004 -284677 -39778 54292 -43220 -141329 -267280 -261553
7067 -261553 -271867 -190882 -80373 4142 -68580 -41117 57543 71257 -8014 -138474 -83078
7056 -83078 -48614 183992 123691 -64201 -41143 -43274 142434 196865 79101 151470 302863
7045 302863 324574 210249 202706 205419 -19245 -96756 129034 31010 -49338 -74805 35143
7034 35143 36876 15328 -77492 -52344 -23812 -220218 -310078 -175954 -112291 -471068 -541541
7023 -541541 -311495 -34825 -37760 -137697 -69253 53999 33992 86703 202733 -112902 -97987
7012 -97987 -48018 -46207 40209 141286 -7600 -132154 -225489 -296514 -80047 126321 153789
7001 153789 145985 36900 -178756 -188258 68499 184055 191136 178517 317665 429923 370553
6990 370553 320914 440062 253213 -25139 -272455 -377771 -194322 -956 -25917 -77010
6980 -77010 -183548 -61557 -92168 -148865 -228216 -277700 -166543 -320288 -193994 94651 161769
6969 161769 169321 293901 378213 325171 280620 101469 -168257 -321443 -214859 -173692 536
6958 536 145168 35743 125545 192067 51163 -190338 -258135 -98262 -49051 32425 -39522
6947 -39522 -9050 153673 201066 45023 -184844 -76439 22719 -104036 179324 151715 -184491
6936 -184491 -198909 9969 -23117 -103239 -168461 -270104 -190403 -211289 -88361 -293054 -133739
6925 -133739 19699 16314 27558 96383 331570 474066 296023 255726 168437 222102 270457
6914 270457 85705 -204359 -256269 -252893 -256853 -51633 155643 -56624 -241205 -366625 -313641
6903 -313641 -294407 -194760 -159537 77342 198742 -18598 -42628 -90139 -251798 -374584 -346477
6892 -346477 -143312 66216 -30483 -65276 -86828 9601 -151547 -160763 17082 53962 -129975
6881 -129975 -145091 -279103 -111542 -200880 -121433 -9956 -52186 -65356 -297076 -243307 -169774
6870 -169774 -171264 -278971 -301327 -176346 -44436 114461 226473 136377 143339 4196 -396892
6859 -396892 -171391 -28789 4976 55528 -98681 -101199 -80767 -74218 -15900 16010 59505
6848 59505 27068 73676 139456 -58407 -133177 -267661 -342888 -365361 -159550 -101354 -35443
6837 -35443 -59836 -233438 -416096 -459494 -385236 -438729 -332961 -204979 -206564 -104735 -166787
6826 -166787 -288586 -169501 -50999 -142362 -90672 -20795 51187 -97266 -192547 -350741 -267873
6815 -267873 -99111 -64215 -194821 14528 -20688 -166127 -291627 -295316 -5209 322706
6805 322706 215409 187268 163924 -113943 -292454 -256400 24370 299343 318376 109238
6795 109238 -226745 -195098 265208 255618 182193 -42725 -228743 -180782 -312433 -184385 -40805
6784 -40805 -30458 -71148 -54927 -29589 -209129 -143239 -103083 100093 69556 213677 306956
6773 306956 95159 93380 232891 319420 143192 -92935 -27124 -106071 -343157 -319259 -13543
6762 -13543 59458 103912 320163 406860 154634 26671 179205 304880 410922 277094
6752 277094 11160 -88468 -10904 -77190 81623 190927 232623 259460 317488 303558 380363
6741 380363 277931 107458 343485 87485 -144120 -100799 -5840 27904 -97764 5514
6731 5514 251837 50852 -178309 -246653 -111139 -221928 -463339 -135472 -90089 -164169 -282213
6720 -282213 -156324 -230553 -86458 -134318 38614 62125 -54134 90153 348609 355899 41262
6709 41262 -177467 -254005 -98084 -223797 -186130 -158882 -146999 -202968 -307068 -396009 -108968
6698 -108968 -58174 -30611 -151912 -245242 -408810 -350413 -403890 -390044 -443454 -434219 -519828
6687 -519828 -369910 -238103 -190593 56689 115031 -11710 -68909 -364272 -537135 -360181
6677 -360181 -294936 -169348 -158310 -43391 70247 112708 51569 69142 40561 267639 332474
6666 332474 256852 34870 132311 232833 115749 -172924 -298498 -296150 -189776 30267
6656 30267 33613 1326 -49467 -202558 1895 65849 108842 274607 253886 214427 181701
6645 181701 253270 245486 149329 82870 23824 70629 -48490 -39468 -211198 -343987 -216209
6634 -216209 -125091 18491 181804 221286 66252 109815 230789 277508 188557 116724 220318
6623 220318 181677 10297 31427 169380 291021 127813 -139188 -154394 -307980 -503890
6613 -503890 -430891 -285300 -288173 -113914 -50616 -80293 -6048 130619 -162399 -331081 -153857
6602 -153857 258254 214700 -155193 9782 270453 234099 200330 34881 -169971 -377765
6592 -377765 -643504 -603366 -451319 -248058 -229236 -145561 -122785 -104229 -54422 2126 -99515
6581 -99515 -270201 -335447 -207249 184210 143476 -141247 -31784 88227 -76742 -213420
6571 -213420 15340 64778 57137 -106716 -252064 -463140 -335256 -200777 -52632 -11751
6561 -11751 3081 -127887 -319513 -354480 -179004 -183714 -192375 -146734 -174453 -32306 -52311
6550 -52311 56426 96943 -182955 -131904 -265364 -247636 -103608 -164222 -179380 -61823 154514
6539 154514 256325 308586 82470 -1670 -15388 -152047 17429 103965 -38308 -145368
6529 -145368 -321034 -394487 -350347 -242166 -253895 -301059 -427865 -363829 -209100 62410 -166002
6518 -166002 -196921 -128577 -61306 -118547 -272859 -214681 -102681 17563 -47683 -219878 -84104
6507 -84104 -76219 21242 -191456 -329226 -255996 -67558 -44073 -13718 -98193 -223811 -132017
6496 -132017 20769 -168333 -152841 -95300 134385 13899 -170443 -204916 -289973 -319047 -120514
6485 -120514 -50827 -166777 -183406 -302255 -122337 -194534 -383135 -557649 -533230 -287369
6475 -287369 -349172 -546067 -454294 -233483 -232827 -97548 -263917 -342772 -218938 -306344 -295313
6464 -295313 -5962 -76512 -195331 -264556 -229006 13143 314698 433649 228035 144017
6454 144017 100426 -130745 -163830 -129097 -130170 27675 -132242 -382708 -322198 -197834 -262348
6443 -262348 -136955 -91539 -31864 -196552 -58632 22105 70179 49698 25681 59463 -38797
6432 -38797 -280491 -179959 -101013 93989 151897 191515 230914 171947 -1401 -83545 -221012
6421 -221012 -135634 -55578 -3407 128383 25591 -98913 -227810 -191968 -99535 -102604 -349679
6410 -349679 -414925 -467762 -483851 -227454 -173403 -72150 -147289 -271377 -214607 125018 313210
6399 313210 -32296 -309180 -279681 6893 -77417 55176 -757 -264586 -313162 -267535 -298701
6388 -298701 -211907 -25602 50694 64057 -98184 -19239 111077 155529 -86234 -136920 -161261
6377 -161261 71978 123154 152959 115549 259627 159070 -51912 -167096 37438 161283
6367 161283 243416 98078 196590 192401 -66518 -211463 -103548 36551 243548 321581 40807
6356 40807 -309976 -293609 -75136 -104824 107152 130039 116043 151328 155726 218008 236747
6345 236747 214572 272160 294127 110438 62774 298172 242440 -12764 -394881 -250849 -98425
6334 -98425 -118339 -105916 -112890 -210312 -128212 -160894 -303244 -257087 -32955 169991 204252
6323 204252 -68189 -77786 102565 21031 31053 -60051 -112375 -235373 -142572 -153372 -90475
6312 -90475 -197294 -319378 -290415 -143193 -127545 -56607 120165 73836 -26918 -49393 -129201
6301 -129201 120009 97540 47079 -33662 -322323 -437566 -244950 -122602 -344834 -434489
6291 -434489 -349225 -318611 -346461 -194278 60740 570 8040 -32868 -91938 -215859 -71334
6280 -71334 -148723 -167165 -166110 -193971 -68085 -65040 -87996 -391430 -442757 -68002 -63880 -152498
6268 -152498 -252125 -249172 -355934 -238658 -191238 -115999 -131082 -240191 -338895 -209002 -146184
6257 -146184 -247993 -343540 -290832 -194554 -77692 -245090 -276142 -174159 -77057 -35977 16001
6246 16001 42379 2761 -241893 -276340 -161214 -233787 -321796 -254945 -49429 -60900 -159068
6235 -159068 -31839 24638 -20116 34228 -130128 -158238 -167631 -307242 -312289 -296701 -306845
6224 -306845 -111275 -9372 32965 17074 -23272 -181309 -344228 -280482 -305062 21949 -43855
6213 -43855 -90116 22203 130889 77324 -154218 -369115 -499121 -463283 -125039 -107572 -12811
6202 -12811 111596 24530 -139456 -163966 -87279 -33548 91364 76817 158457 216917 213274
6191 213274 -7678 -87719 202093 450409 314370 72797 -76727 -7798 -1994 -6640 8744
6180 8744 -142999 -84263 -81954 -67805 101163 136948 -46140 -233105 -346743 -265159 -292467
6169 -292467 -111778 20899 -51868 -45518 172743 275921 258465 117617 -66235 -86429 -268284
6158 -268284 -369601 -115399 46779 14094 -87619 -355408 -318116 -35909 212042 -98108
6148 -98108 -53104 -189108 -266853 -248908 -130106 108552 144777 102911 22504 40453 35424
6137 35424 -18288 -94537 86416 301915 229836 206903 245626 6521 -244935 -343919 -278628
6126 -278628 -192253 -125202 -281665 -437785 -290911 -360437 -451493 -546541 -450291 -130038 -26272
6115 -26272 -266597 -427903 -450529 -299404 -315987 -340687 -449368 -282683 -949 203402
6105 203402 141784 21509 29382 -8749 257025 498584 210820 -167154 -265891 -217286 52925
6094 52925 -21529 67351 130742 -68029 -341487 -290668 -182843 -87102 -201484 -120720 -319921
6083 -319921 -542787 -342324 -125954 -162556 -47097 114375 174015 207893 212206 166759 89000
6072 89000 187661 93384 41829 -44464 56704 67366 -139441 -162810 33426 114591 -185804
6061 -185804 -159129 -42735 2315 -49207 287135 471263 250871 -19688 -14570 28118 181722
6050 181722 89447 236379 339273 309850 41615 -262593 -189056 -107196 -187946 -175188 -57810
6039 -57810 80107 97387 -29741 -69255 47789 -154641 -299032 -337474 -191784 -137035 -66968
6028 -66968 -99417 -76636 -30297 -212903 -390592 -541027 -560735 -545579 -470864 -167558 -227361
6017 -227361 -240404 -141633 61325 108085 -33107 -192873 -296015 -148254 -253882 -135191
6007 -135191 -183907 -182835 -105033 88918 7387 35221 94074 130568 294542 296172 254407 230620
5995 230620 119346 -157504 -230831 -6654 106308 -45574 -251052 -229535 -62065 -56336
5985 -56336 -50913 56634 -34000 -251610 -244338 -309649 -281458 -132714 20199 190796 89430
5974 89430 104793 117902 -60000 -76003 -47561 35875 -70725 -372393 -270536 -155621 -239483
5963 -239483 -374776 -281707 -180385 -75792 -130101 -344216 -441746 -260679 -347476 -322144 -254507
5952 -254507 -144331 -8623 119929 173647 8222 177769 131029 159141 80379 130587 277743
5941 277743 271136 105646 70658 3414 -29336 26435 47999 -72039 -230309 -85051 28096
5930 28096 224434 -209102 -314450 -191703 -31803 110876 -87234 -164123 -155577 -93160 -27088
5919 -27088 134498 20712 30561 -57012 -48197 -77515 -221199 -336431 -141945 73877 -175484
5908 -175484 -342607 -236484 -124491 -149229 12564 55183 -46987 -167174 -281551 -279619
5898 -279619 -184179 -52782 -49261 -174882 -132709 -6207 -225787 -429244 -241521 45078
5888 45078 -189381 -267786 -152663 -218267 -177266 -312961 -177211 29554 -217404 -149635 -33411
5877 -33411 -74833 -85231 53411 -16184 -166671 -342268 -438756 -212783 -219934 -129684 -105902
5866 -105902 -182778 -201789 -483306 -599376 -409843 -156759 143361 229230 67872 167436
5856 167436 187964 194834 -47441 -90866 186472 114402 -47309 120032 77775 185986 177934
5845 177934 332303 511894 395259 173715 187202 177431 -24502 -257742 -319245 42835
5835 42835 -46436 -68483 9901 52673 -91085 -262394 -251182 -199588 -111969 39830 132923
5824 132923 -132648 -362201 -464958 -190851 -155804 29314 216043 186131 110230 -83745
5814 -83745 -159031 -138893 -229303 -110864 -63248 88375 -99246 -75693 200784 229570 -96349
5803 -96349 -312550 -310191 -408348 -559917 -445381 -409899 -217266 -141304 -204898 -274121 -265050
5792 -265050 -129709 77574 175066 7923 147398 30525 -226580 -439473 -346305 -484579
5782 -484579 -496475 -502981 -535023 -542895 -379904 -228984 -248808 -486550 -566806 -505304 -323296
5771 -323296 -287967 -250631 -192667 -173026 -166707 65120 176162 -85280 -244429 -207717 -194977
5760 -194977 -358155 -195798 4104 -51734 -75637 -85554 -323900 -506942 -355868 -148816
5750 -148816 -209266 -349114 -384284 -198927 -83153 -117409 -88505 -124872 -88028 -270495 -226391
5739 -226391 -357870 -387579 -198144 -126794 -61998 146133 184719 102220 23333 43391 120363
5728 120363 16337 -36441 -138307 -63883 116882 167470 -47495 -119139 -145631 -301224 -238715
5717 -238715 -31135 206759 168444 -18682 3025 110003 335314 336552 113668 45425 -2344
5706 -2344 221986 82955 -92390 -171732 -213849 5843 139327 186841 106813 43018 -31065
5695 -31065 36041 103011 -23267 3446 -5910 -9335 196430 334817 254908 31114 -218448
5684 -218448 -87544 178611 321997 496981 316714 203326 103063 -161675 -328619 -324015
5674 -324015 -271570 -45144 -1631 5751 -56953 -173942 -301538 -234133 -161060 -170349 -116548
5663 -116548 -85285 -142001 -194348 -169698 4984 -20658 -13762 32869 306235 287598 -71522
5652 -71522 -209952 -331328 -482999 -414906 -335461 -97607 -222286 -53299 125387 79389
5642 79389 -126765 -5660 -32440 46415 173521 136092 105684 21579 -20950 -198661 -332433
5631 -332433 -460844 -596841 -310194 -126890 -28584 -128649 -296266 -257160 24543 -27628
5621 -27628 -57924 -86382 -66598 -137153 -221339 -295061 -334501 -319705 -152661 -188640 -35859
5610 -35859 86648 199297 220426 37553 -70772 -55270 -8219 -86644 -161216 -133914 12214
5599 12214 74611 5429 -103135 -58775 63019 -64695 -183162 -139838 -29916 60989 -7248
5588 -7248 -121733 12580 -123932 -241879 -287444 -190742 -92395 -179121 -172601 -135240 -217378
5577 -217378 -204308 -184995 -38005 59072 -36147 -96089 -98967 14439 88164 -145437 -277538
5566 -277538 -135535 144572 -33958 -284269 -122500 87574 53174 -131340 -130518 109573
5556 109573 835 -76568 -93492 -136255 -9194 61047 -44691 106051 117205 191250 267598
5545 267598 273391 246667 54447 -127578 -349454 -218541 28117 265075 59993 -178843
5535 -178843 -356636 -212029 -197430 -292605 -317774 -358936 -302131 -173306 -124855 -72238 -202927
5524 -202927 -218869 -327621 -426956 -314217 -64001 -82489 -298128 -167051 -227 -1729 -149914
5513 -149914 -234134 -109027 115397 140835 -82827 -93965 -62163 -56431 51446 48507 -92062
5502 -92062 -10187 90837 -20517 29840 73520 94497 -55110 -51810 187385 231578 117383
5491 117383 75242 66193 -6119 -251275 -198839 -156536 58353 265867 238383 97300 -153270
5480 -153270 -143399 -261960 -261699 -124332 -71962 142124 374118 352878 322263 341691 256685
5469 256685 246227 343778 145430 65409 92536 48895 2013 31043 -15144 -108093 -90977
5458 -90977 40334 12722 -93261 -12672 125330 139739 132448 -20499 -13791 214836 260527
5447 260527 -75953 -119862 1183 51029 -26660 -206133 -279757 -115836 -158912 -76096 32541
5436 32541 82714 167507 46353 -110551 6794 120867 303686 263140 112001 -108054
5426 -108054 -118305 -49487 -182348 -261211 -474276 -535291 -223909 -229517 -462619 -475100 -128090
5415 -128090 -256272 -201850 -177826 -351755 -201584 -201537 -314694 -382655 -366586 -341457 -212105
5404 -212105 -195827 -211469 12850 11987 -65684 35334 164527 148307 -301526 -419916 -393905
5393 -393905 -347483 -358473 -337189 -266142 -304481 -210166 533 55247 70536 -35785 -150061
5382 -150061 -6648 -30785 67185 138465 169950 -5000 -114890 -97348 -60600 57826 315715
5371 315715 279817 23448 -115570 -329219 -501041 -657801 -684615 -325925 -141860 12826
5361 12826 -136660 -96135 88372 -34446 -247322 -187381 -15943 -40739 29463 85759 191681
5350 191681 -51433 -189244 -270402 -120762 -1829 220888 415987 384255 73327 -52609
5340 -52609 -281149 -195345 -198822 -192207 33504 153341 188852 171705 203075 67099 24746
5329 24746 -21711 -119684 -250595 -440226 -277633 -150162 -139085 -89088 -68798 -90273 -196192
5318 -196192 -317010 -349572 -201932 -241104 -74219 -128317 -181903 -129944 -45025 36665 68624
5307 68624 -57579 -208239 -59560 149722 -112632 -92970 -30683 -136791 -367273 -242756
5297 -242756 -266545 -267870 -162078 -149257 -236269 -81262 -106890 -149947 -114509 -194550 -273792
5286 -273792 -141250 -129502 -74130 -123438 10609 130451 144442 69341 69409 -33962 -62737
5275 -62737 -17463 -40219 -327490 -212812 -183398 -284750 -287629 -86083 -125188 -80210 14948
5264 14948 11579 -135912 -254229 -381684 -265531 -67076 -124842 -73385 -23728 -186806 -115365
5253 -115365 32375 84341 84611 39783 -41186 3227 -13842 -203216 -153565 -3181 20018
5242 20018 70457 -35658 152330 265714 209815 106259 3930 49443 177465 204418 -14088
5231 -14088 -61377 -86792 -125778 -196885 -238496 -331145 -254647 -371980 -80477 -133143 -112216
5220 -112216 -25608 -369241 -424166 -360627 -343061 -414472 -605796 -519708 -486181 -411230 -92045
5209 -92045 -218063 -152726 3570 23331 -26931 -62377 -51635 -56912 -325010 -532012 -602008
5198 -602008 -353255 -205734 -45807 106103 313908 168278 82843 136279 -50410 21686
5188 21686 -29293 129427 -23779 -306212 -82074 35083 106046 209628 278621 119095
5178 119095 -91591 -202867 56919 -124613 -498282 -308625 90840 325287 379960 122481
5168 122481 168658 -7939 21436 -54214 -200124 -326309 -101734 -369327 -629270 -678202
5158 -678202 -510040 -464730 -433811 -276776 -218850 -145980 89449 240656 365343 366844 371328
5147 371328 234878 129467 122479 -109967 -261445 -291319 -209244 -156658 -65588 -180688 -179539
5136 -179539 -57728 91699 -199087 -459239 -301014 -174443 108055 76050 47850 25857
5126 25857 -81529 -167034 -296811 -267429 -235762 -434513 -393886 -183547 40615 27151 114860
5115 114860 63013 -98574 -43883 63697 22320 14131 77767 283250 352358 174106 92299
5104 92299 -46397 -285192 -169466 29661 -132524 -102727 49499 71235 84048 -10776 -277141
5093 -277141 -212557 -203315 -285559 -230371 -67173 35961 -156477 -293399 -349601 -302495 -257951
5082 -257951 -242754 -317577 -447859 -649946 -703812 -549118 -201130 -178678 -205524 48016 122445
5071 122445 128920 111987 -133819 -390033 -323101 -160306 -183039 -129064 -279652 -174978 -9850
5060 -9850 -3042 -46324 3346 138497 172097 300525 177790 -93499 -106721 1113 -155935
5049 -155935 -215732 -366631 -342510 -299641 -309463 -187764 -134689 34665 33707 -77339 6587
5038 6587 176782 293895 365614 233296 136419 74707 22264 -102364 -56236 -37585 -51797
5027 -51797 215810 266281 315870 152411 35950 -219144 -252608 4664 -208102 -256194 -84826
5016 -84826 -66887 -110961 39612 165536 -130187 -417174 -630419 -435116 -25783 169018
5006 169018 -197535 -353720 -208414 -98135 -136453 -92113 -139765 -194995 -285519 -245030 -300096
4995 -300096 -289674 -65467 -1983 -116129 -278660 -265905 -256070 -371053 -197406 -71338 -82002
4984 -82002 -13113 -117247 -246309 -307303 -67446 48105 -25750 -20366 148735 339849 314214
4973 314214 227635 15588 -47750 -3956 -3578 -115596 -109876 116974 224035 201666 54440
4962 54440 -152018 -121067 -34711 -15648 -181100 -224528 -177109 -262830 -336910 -300343 -158846
4951 -158846 71629 271595 201314 106600 206482 -48357 -170935 -98330 -63502 48168 -53123
4940 -53123 -6009 -30344 -253364 -260164 -251094 -32997 23752 -246824 -295220 -280484 -192968 144820
4928 144820 340467 254147 179847 -11751 75033 42913 -46999 -106860 -203528 -22500 15919
4917 15919 -110800 -238216 -367909 -199781 -7872 57280 185497 218231 361713 563895
4907 563895 507013 249161 179632 -17830 -154031 -149837 48974 58176 87018 368137 347779
4896 347779 237614 205478 124435 -51517 -132903 -55986 -127455 -53755 -80919 42936 -38424
4885 -38424 -8979 163759 73316 -63174 -49466 -120382 -53088 74131 93192 100719 111241
4874 111241 -224820 -68030 -94349 -162888 -177331 -192244 -357341 -161905 -23326 -148778
4864 -148778 -79973 -35851 -167508 -193542 -335715 -185865 -128900 -6012 -136932 -294590
4854 -294590 -444224 -322873 -106437 -9520 66226 -44739 -321640 -342558 -415252 -350216 -245567
4843 -245567 -94198 -72868 -219638 -294230 -173186 24728 188073 498983 369875 6178
4833 6178 -98335 -100227 43202 150238 91234 -44463 -625 -75781 -235536 -161070 43981
4822 43981 30958 199364 275361 132852 46538 -110200 -135336 -178032 -330332 -81174 -225302
4811 -225302 -488544 -316754 -192623 -18571 37212 -105141 -390557 -350657 -31081 131060
4801 131060 136541 54187 -12583 115337 400096 576335 409188 340392 351048 311314 204664
4790 204664 24591 40566 218684 344409 261178 -24364 -150962 -366040 -412702 -228884
4780 -228884 -155229 -90980 8352 -1047 -242859 -198594 -213378 -199751 -255375 -242841 -390610
4769 -390610 -430070 -240446 -233287 -196204 224 54742 -36196 35792 45644 66978 -126388
4758 -126388 -269116 -6411 105953 -7953 -1555 178028 27931 -372854 -472114 12705
4748 12705 163952 50113 -79501 -11508 92168 -33263 -271006 -61255 104214 -109898
4738 -109898 -252013 -49653 82979 -37621 -151848 -152814 159625 115865 37641 71004 100439
4727 100439 162603 -20618 113762 -5576 -384993 -450690 -189967 -11923 -105055 -74231
4717 -74231 -13983 893 -21321 -136334 -26465 231870 320704 425167 523406 416451 418172
4706 418172 456504 65485 -257139 -286972 -143579 197695 202148 -46688 -13652 -234197 -313994
4695 -313994 -199338 4786 115374 256716 302185 152960 15353 -129652 -210497 -187797
4685 -187797 -208318 -237755 -199533 -325649 -632511 -619151 -399700 -174497 -90322 59437 98581
4674 98581 78529 95570 202195 60788 166844 192599 -33044 131638 267612 201861 121884
4663 121884 -98955 -268920 -250676 -36512 84223 16398 -126212 -175180 -345184 -554221
4653 -554221 -583902 -465520 -51657 145332 -88721 -33482 16962 37225 255018 282742 138613
4642 138613 -76443 -168502 -171443 33058 101505 -59172 -149659 -23151 350792 348910 -21421
4631 -21421 -31954 -19045 48152 -87186 21799 22999 53876 -193861 -385307 -283844 -244910
4620 -244910 -264214 -199100 -11950 -125628 -101321 -45146 32396 -90570 -135981 -393178 -285309
4609 -285309 64357 364110 294680 202005 304564 208897 175303 -36175 -175462 -100439 159445
4598 159445 154623 71425 -10917 -158118 -198620 -221430 -197811 -53304 11886 87345 365203
4587 365203 365363 141219 84596 252806 187268 19562 -225746 -167244 -40470 -65621 106656
4576 106656 92301 -243318 -362323 -204619 147869 230328 129422 87542 178545 102874 -85852
4565 -85852 -245986 -165510 -151918 -109728 125126 5319 -33603 -175478 -256400 -218094 -19657
4554 -19657 -1181 -101655 -222831 -314242 -350326 -275308 -279351 -192855 -147624 109828 64036
4543 64036 -32240 23716 -56971 -52431 -223427 -339806 -176121 -149312 -52612 227081 307222
4532 307222 96499 95256 475694 692881 748285 452482 12581 -140616 -15293 -84080
4522 -84080 -125830 3358 29341 -16895 -54927 -27219 -125143 -101580 -59031 -226759 -387125
4511 -387125 -164359 -99270 -308241 -397679 -352224 -321841 -167532 -24883 119217 269130
4501 269130 168404 -11465 -183734 -158367 -206398 -73634 -56667 41990 -157782 -327729
4491 -327729 -383939 -286488 -43072 205566 177561 108627 196439 319979 164431 48687 -64852
4480 -64852 -221085 60761 114427 150285 247863 301990 223857 197706 206387 301209 450172
4469 450172 349685 113235 -14347 182325 65082 -110211 -38222 -8057 -277663 -355913
4459 -355913 -235945 -164586 19905 115302 232358 131560 128402 184087 47836 -141383 -69473
4448 -69473 -165171 -384187 -339787 24330 273066 416146 215123 130110 97169 -48003 -108208
4437 -108208 -167672 -136559 -197769 -118405 -49227 185354 261924 156230 85571 -53501 126936
4426 126936 144815 148131 264562 252133 220946 244379 258310 150637 36147 22174 112764
4415 112764 194038 180587 153991 57099 -114777 -299878 -339782 -227153 -110690 -27712 -83809
4404 -83809 53001 227800 229544 167031 -244022 -149760 122018 23392 -56262 -180785 -59796
4393 -59796 206504 385423 413281 297711 294133 -1292 -197740 -138461 -31412 91845 109870
4382 109870 337295 272136 227702 -953 -155264 -298959 -265567 -192320 -199716 -329768 -253576
4371 -253576 -115804 93339 125538 97595 33481 -30930 20157 90224 120335 243948 26594
4360 26594 -152856 -140673 -95563 -86416 41175 144492 80620 -233282 -482963 -610712 -594513
4349 -594513 -418381 -381085 -311070 -177791 -120742 118946 327488 296719 123910 143559 293882
4338 293882 313191 304596 252574 115899 47829 -92635 -158339 -42760 63254 -58137 -101562
4327 -101562 -217203 -395117 -149194 -62605 -283009 -248826 -104127 87269 246860 99888
4317 99888 -159228 -323974 -334265 -581821 -615243 -393923 -220866 -23901 218806 240562
4307 240562 274726 186437 107779 -47740 -170990 -149692 -92251 -26777 -15810 -151829 -94334
4296 -94334 86129 96763 125078 294667 333842 183606 -14730 50788 197406 198643 -187070
4285 -187070 -265350 -247831 -90345 -93042 -65085 -130190 -96034 -2359 -27780 144184 -112875
4274 -112875 -408184 -247746 -19165 47219 271826 259215 289791 184415 52997 36803
4264 36803 77973 160250 26964 -85314 -156938 -94155 -53511 -64137 -41300 22506 -28004
4253 -28004 -61512 -69571 -196337 -311937 -441393 -355375 41766 148246 -66982 -116250 -3645
4242 -3645 -137886 33479 56465 -162329 -63128 8260 -7399 -145760 -254097 -35392 29934
4231 29934 -160784 -69288 -45844 -16539 -9720 15970 220222 268610 91164 -179858 -245573
4220 -245573 -347849 -213890 -167553 -183739 -72465 29896 90516 72813 -99790 111692
4210 111692 371160 436843 288742 156050 152786 88356 49928 106372 57967 76156 22613
4199 22613 -267253 -155979 15682 35374 55954 50363 10222 -211497 -242993 24489 21007
4188 21007 -68502 -192297 -305627 -218780 -133265 -150656 -208703 -303420 -307887 -292668 -450712
4177 -450712 -317803 -242474 -312238 -475274 -501143 -301694 -194338 -342619 -453187 -429472
4167 -429472 -287467 -399528 -391261 -529552 -383458 -400733 -473511 -189567 104177 86512 115233
4156 115233 41503 -150685 -148048 -90830 -86114 -135359 161558 414332 186333 16917 -159511
4145 -159511 -431638 -249168 -101051 -215675 -251427 -251162 -134680 -17019 108774 201614 451415
4134 451415 400666 258241 143346 89286 -120606 -413973 -399430 -187191 89463 -64973
4124 -64973 -170610 -141612 8210 66686 93679 105207 123009 -20913 -29035 135421 123419
4113 123419 -64947 -316738 -477667 -410457 -438124 -306651 -85004 -53649 67371 318187
4103 318187 338864 100066 2839 119933 -94218 -413468 -255288 -94088 -101320 -28197 5921
4092 5921 -34566 352859 437559 169003 -36806 66745 121053 202639 201977 366240 44019
4081 44019 -147626 -367962 -373953 -232335 61931 73463 10503 -72366 -66907 -34870 -119970
4070 -119970 -176996 -88711 -60205 -15438 74028 -21578 -158149 -92801 -24078 85880 223833
4059 223833 118293 -53590 -233925 -243379 14172 207504 133049 7086 110137 248079
4049 248079 189251 94647 26256 103645 103084 1604 -27179 -122334 -214629 -335641 -264119 -136356
4037 -136356 -42365 74056 146329 95434 26163 -16326 118281 38561 -193089 -362479 -176236
4026 -176236 -231009 -401355 -496035 -324556 -212052 -63710 -17714 -7346 96007 -50981
4016 -50981 -153792 -129104 61376 32209 42880 239268 177906 130727 198840 378598 206053
4005 206053 -103130 -65719 35560 82135 -65036 -110930 52337 96936 213269 251540 213426
3994 213426 34481 -242355 -409341 -374910 -93566 -62564 -2971 207117 428216 381219
3984 381219 -59413 -161937 21712 -51909 82927 147688 9309 121152 79297 4172
3974 4172 -187245 -168143 -23798 -100557 -168393 -61796 -34526 24034 162670 139149 -148592
3963 -148592 -102833 112162 75820 -25696 -226678 -139424 51235 68756 106524 96212 42054
3952 42054 -107339 -114811 -22965 128874 29111 -38509 -204939 -253804 -358143 -363272 -211338
3941 -211338 -224998 -75254 -41609 -30003 -267968 -412882 -277118 -165584 -42960 -84215
3931 -84215 -148550 -110715 45108 -18962 43596 -113116 -175194 76232 35902 -132090 27761
3920 27761 -3242 -135946 -57927 78041 105954 82940 41764 -140246 -198083 -226703 -340506
3909 -340506 -356850 -150128 -163316 -299329 -329778 -322319 -246109 -63887 -184932 -87535 -43904
3898 -43904 -45194 -72039 10990 72143 78518 71681 -114611 -102226 -40562 -117931 -143490 -94599
3886 -94599 -10239 111193 -13067 127380 247963 118429 -7911 -12674 19210 282037 375604
3875 375604 367645 216587 74727 -49306 -262193 -383245 -337485 -389041 -378450 -291003 43078
3864 43078 41223 -70197 -17776 -57799 63384 81592 235213 148635 -1863 -98923 -16927
3853 -16927 50093 97303 -62884 -215312 -4950 27967 -149697 -331336 -245279 -351481 -328416
3842 -328416 -123215 -151369 -56566 -100807 -203617 -76914 59107 39565 104415 49954 89117
3831 89117 149693 169780 28146 -182508 47947 190319 228495 126191 -192830 -429343
3821 -429343 -405826 -185547 -86857 47603 -38548 -11853 245242 447474 425110 298668 123692
3810 123692 -87763 -76771 237096 430870 341731 254075 237993 168785 27938 6109 -69494
3799 -69494 -160435 34612 342639 192885 10997 -119300 128176 302351 135924 149156
3789 149156 125019 140476 -31544 -179779 -235300 -71009 80675 156979 -106819 -224258
3779 -224258 -307834 -271591 -287195 -162073 -109679 168911 86006 103784 5154 51636 -64397
3768 -64397 61606 194847 -1991 -305220 -355038 -321149 -292286 -142396 -62655 -43682 165027
3757 165027 -45010 -169436 -100933 -220928 -296329 -103103 -19859 42509 148541 -111453
3747 -111453 -195776 -297677 -288104 -74919 135175 138620 250384 239905 130755 152021 189714
3736 189714 202920 272316 146609 241676 274418 128160 415495 569022 228096 -137122
3726 -137122 -55958 -80915 -234690 -96307 -66675 -23459 25666 -61656 -5404 -33721 -116836
3715 -116836 -259335 -392288 -212625 -57554 -154187 -327908 -160142 112238 387039 412997
3705 412997 391554 508117 143734 -22773 116554 91110 -73565 -41555 84461 171323
3695 171323 155619 205173 349531 444707 306310 82777 221672 319488 157792 -46465
3685 -46465 -177153 -175582 66681 245973 141989 -110519 8747 128372 -163365 -334964
3675 -334964 -63297 51296 -93930 -368974 -467306 -105176 113273 100269 245590 417077
3665 417077 527737 515014 393353 226682 112772 245002 315032 187852 213933 349748
3655 349748 494775 493872 352761 460200 455653 371661 273138 157555 101938 -70863 -166956
3644 -166956 -152496 123984 235683 323504 224813 -261949 -354988 -150963 -119257 -129337 -461
3633 -461 65078 73532 248974 224208 152775 -27518 -209635 -300708 -187360 -53148 -18689
3622 -18689 -103780 -61381 -101034 -102941 -373039 -297198 -5055 102981 147555 226860 394737
3611 394737 348588 128613 157514 -19190 -398018 -345259 -112649 -96559 73272 247591
3601 247591 422817 236809 27658 -114734 -130729 -110625 -220030 -168089 -256211 -426752
3591 -426752 -305558 -188668 -115731 -69263 -108127 -42236 -121366 -283303 -400302 -390354 -368271
3580 -368271 -426961 -264165 -264652 -156995 21311 11380 -141639 -258561 -286966 -120135 -155884
3569 -155884 -226877 -76940 -117155 -188963 -397746 -365451 39210 121065 -100150 -236457 -313898
3558 -313898 -47698 236198 91806 -200376 -127021 -206894 -129660 2563 100421 90903 69563
3547 69563 -23910 -225978 -169758 -40 -269499 -464721 -381585 -440211 -672058 -540012 -329309
3536 -329309 -262910 -274694 -445851 -529378 -208918 -68310 -215699 -369428 -52198 284828
3526 284828 394859 414422 256946 -85707 -82385 -207799 -249494 -169675 32591 -27194 -238033
3515 -238033 -403609 -384094 -240874 -406086 -436828 -398324 -309991 -343034 -224442 68739 2875
3504 2875 25264 201690 361651 178469 -116377 -184737 -235932 -118790 69941 188087 368243
3493 368243 367521 228828 -5383 79210 237049 412390 336994 317032 203473 107597 139576
3482 139576 536589 483069 138314 -11490 16550 -17337 32142 281795 302908 65798 303799
3471 303799 173155 -111029 -284573 -317626 67324 -68620 -192170 -330188 -62634 -11363
3461 -11363 -233290 -140143 42720 222528 275688 162715 -31123 -258471 -356355 -323811 -142841
3450 -142841 -42391 66503 -184755 -203778 -183505 -329776 -284939 -179655 -83556 -149446 -248179
3439 -248179 -80530 -96469 -328688 -251262 -76340 -43225 -32747 230686 155941 223261 93883
3428 93883 -94605 10389 244659 246709 78738 204332 325083 410550 408013 217629 252372
3417 252372 195279 68862 14247 -280059 -343535 -338590 -465463 -533301 -434839 -238857 -262711
3406 -262711 -287126 -376928 -516700 -522359 -390326 -249531 -86898 -8555 -76924 -185698 -116633
3395 -116633 -92754 -40049 7885 -175801 -453814 -656078 -563139 -255655 -171884 -165759 -178115
3384 -178115 -250066 -51450 -160948 -259451 -67042 -116786 -272920 -238113 -167085 -295589 -235303
3373 -235303 -138937 -302907 -365284 -263651 -207623 -113676 -75929 -121801 84476 152523 -65351
3362 -65351 -149721 -306614 -390014 -377965 -508809 -395616 -177040 -74761 77250 291878
3352 291878 136508 117855 318006 317847 346151 119403 -25870 7145 234511 290978 188824
3341 188824 160331 19726 11884 64578 383703 418223 139404 -214869 -55949 32470 41093
3330 41093 -42848 9271 130048 171209 -151536 -246029 -113928 -93751 -51768 -8910 -46470
3319 -46470 22298 20356 7818 -47542 99031 125454 135532 -89557 -209556 -170500 -363771
3308 -363771 -368453 -177488 -30033 231949 186617 -17585 67858 147666 84306 -213116 -195599
3297 -195599 11355 45069 30143 -74826 -176307 -15388 -67958 -145648 -170190 -111562 -34915
3286 -34915 121146 14819 -129855 -29057 34012 94690 280085 314788 147185 122635 -18321
3275 -18321 -137616 -5017 9080 -111 -13164 58469 -154243 -364678 -256521 -128854 60326
3264 60326 182432 281363 7231 -190044 -99496 -30953 12053 -94835 -34150 126871 -145471
3253 -145471 -238581 -375899 -311266 -166947 -3708 34896 292813 517546 683008 772496
3243 772496 447536 92434 -114745 -245564 -214254 -106649 134229 146876 -80670 -126042
3233 -126042 -201925 -385257 -235741 -28711 149085 153333 273470 202493 133295 27420 -42268
3222 -42268 -98699 -157112 -282963 -263308 -82340 1977 -59734 -29694 -52337 -98690 -345104
3211 -345104 -397030 -127740 -14576 32874 -152535 -235825 7252 95136 -21364 -258575
3201 -258575 -467649 -519259 -442951 -436307 -449954 -502129 -409850 -157434 -143739 -238389 -134556
3190 -134556 31737 -206826 -194344 161464 336262 429734 439047 323126 188429 61943
3180 61943 -63717 55811 131214 24484 -125216 -268359 -368465 -212226 -147143 56409
3170 56409 -186668 -433446 -437005 -313678 -17872 -51034 -76485 157389 139393 269566 60311
3159 60311 -108324 -364671 -348883 -149860 -97902 -14954 912 -172304 -167721 -256966 -187346
3148 -187346 -18321 129370 167197 -45581 -248060 -140464 -195397 -244432 -80571 148087
3138 148087 213700 351151 352274 145419 35686 -38846 -44181 134073 161395 166789 267793
3127 267793 300745 412015 373915 367930 315094 166492 80010 65696 8597 -4557 172474
3116 172474 57016 -75564 -73124 -185913 -86596 166669 268665 333805 148506 71233 116998
3105 116998 106528 -37408 -200766 -96705 -164976 120453 134910 66281 80073 -35685 19732
3094 19732 104732 81668 79351 69033 661 -18793 227108 217798 106865 98415 163394 52286
3082 52286 3756 -163820 -480554 -453584 -311714 -176236 -7957 90869 -26729 -398266
3072 -398266 -519561 -501452 -325611 -114490 27509 -44042 -2100 -62115 -51880 -119834 -214297
3061 -214297 -54990 64859 48059 274941 154991 103943 140657 163327 19176 -6207 -62228
3050 -62228 41936 107094 97739 312972 283076 179069 5088 -181495 -30562 -112199 164280
3039 164280 331789 229139 197348 34242 -57805 -254382 -542578 -483802 -339507 -378906
3029 -378906 -308532 -231174 -135686 -162156 -25605 173683 22049 32602 -17890 101288 156921
3018 156921 98797 -127485 -150615 -263404 -209201 -249975 -186138 101645 185196 144328 67278
3007 67278 -160430 -236365 -192285 -203007 -70942 55101 81243 55953 65557 -102396 -122466
2996 -122466 287688 153026 -24445 -214653 -187378 -232562 -257515 -205124 -138198 -165880 -147992
2985 -147992 -166720 -456379 -616803 -489368 -308394 -70954 274874 47499 -72767 222061
2975 222061 164975 -13437 91006 85231 263208 265551 162361 251969 320987 394207 261934
2964 261934 92941 146585 108323 58633 176046 351523 343719 303151 29093 -189537 -224904
2953 -224904 -7975 62842 -16380 -11997 -346452 -547120 -365058 -383826 -353738 -77692 206678
2942 206678 331213 190041 152244 -55024 -170559 -43539 168202 194903 304109 388789
2932 388789 523509 439692 373268 44174 -188124 -166902 -50376 -26208 -104797 -14203 62341
2921 62341 -123712 -356098 -347155 -183524 78780 144894 -4575 -45164 -183518 -25376 107341
2910 107341 167198 23274 -30586 39542 153085 178674 -19324 -239307 -414190 -410168 -266344
2899 -266344 -119695 -84123 -124810 -193035 -99323 -117949 -122249 29922 -114853 -128023 -27661
2888 -27661 55265 154749 270885 310173 347760 390993 186998 -104954 -120994 -103605 6162
2877 6162 -12658 -107483 -244248 -166498 -187500 18589 121092 134100 180005 227059 93440
2866 93440 -131756 -285166 -185831 -196535 1026 -27939 21492 58376 68258 146456 116098
2855 116098 16653 -108300 -361417 -426976 -363474 -148859 154509 132047 41939 -177513 -182253
2844 -182253 -278509 -168317 -117694 141976 75579 -95626 -28520 199624 153613 141223 181504
2833 181504 201205 218430 162581 113053 26973 40825 -89704 -460197 -341500 -63802 8061
2822 8061 126450 141830 46204 85074 83263 -144743 -238426 -105178 5603 -17741 -127653
2811 -127653 -174383 -215337 -216005 -291254 -189912 -237210 -413725 -456679 -104181 117763 293812
2800 293812 29058 36873 161032 54825 -133548 20549 132299 238095 13624 -31928
2790 -31928 -91161 -78771 22849 103604 175367 247228 323349 459028 340462 77526 -35034
2779 -35034 -80982 -120167 -59547 -20900 -223301 -241621 -186753 -288342 -426793 -106251 36526
2768 36526 848 -83458 -124887 -55382 -155636 -270205 -355941 -312201 -303275 -300003 -298799 72251
2756 72251 105349 -18214 -239991 -371048 -313419 -320439 -260507 -99876 76648 -46531 116760
2745 116760 158728 -71212 -121098 -141212 -210339 -211441 -80471 161383 180391 39466 -152816
2734 -152816 -252378 -292827 -341754 -247161 -232596 -49606 -40665 63969 23215 -117175 -379603
2723 -379603 -246240 -102066 -302982 -384975 -272122 -296228 -291411 -398 222260 186793 18801
2712 18801 17088 -87289 1432 221376 198240 27255 -121207 -296565 -285786 -113803 -178812
2701 -178812 -240983 -380285 -70573 201791 189658 117255 -259454 -420306 -154894 -10490
2691 -10490 -156802 -344234 -315823 -142495 -22388 49600 1693 -32035 -80673 -271506 -387230
2680 -387230 -174796 151400 241344 11095 -160622 -162939 -44327 7647 4236 129440 97754
2669 97754 227575 266316 358789 169450 -105073 -113919 -331647 -155843 -20497 -25919 55186
2658 55186 126092 -189 -116237 -136915 50264 132105 175218 48994 -88376 -56120 -2025
2647 -2025 218347 50585 -132517 -114694 -18581 126246 282440 196512 -86250 -124462 -124571
2636 -124571 -203152 -23800 268439 386833 251070 4712 -113892 -30042 130128 199668
2626 199668 -156710 -128970 -112898 -142966 -151801 40618 68832 67163 -101140 -45851 175017
2615 175017 366666 123737 -15123 -72770 -60374 107488 243537 273324 154837 -8244
2605 -8244 -77800 -72508 -67608 9815 35721 -95796 -12679 -134112 -210774 -195804 -116140 -113251
2593 -113251 -212925 -112616 -131649 -292245 -264883 -148740 -122296 -205236 -173212 -44953 -94980
2582 -94980 -217090 -116214 48432 237837 210017 177956 55202 -33160 -260798 -388618
2572 -388618 -495243 -323913 -20575 80187 27953 -33631 56824 63041 -30050 -112053 70627
2561 70627 25362 -41494 -173823 78397 353443 438849 173274 319120 383458 404301 333525
2550 333525 45061 -37582 34393 71801 157643 39377 -114523 -68535 209769 333432 437148
2539 437148 404779 472902 170360 63832 235370 145889 38874 141030 89692 137485 106203
2528 106203 152916 144413 55065 76885 263901 199930 -42175 -201082 -141548 34280 201505
2517 201505 130614 62169 -4370 42931 99124 168041 142989 196624 273539 400649 437194
2506 437194 174193 78992 -98650 -249456 -65938 115244 85202 22511 90491 257001
2496 257001 164861 -80632 -64075 295640 357798 239186 94940 111846 90439 147831 252340
2485 252340 146454 -28462 26951 102022 99558 109353 183748 204676 268677 293281 157619
2474 157619 73781 72052 217240 -80570 -294181 -183100 -24743 -6029 -102161 -335789 -135201
2463 -135201 43585 196465 115507 331 67226 104896 149865 40849 -14451 -20416 -61769
2452 -61769 -306561 -257133 -60654 105026 49623 -203941 -217043 -4624 184275 143596 19557
2441 19557 -48251 -184304 -13027 5092 -169098 -330537 -100407 96335 295001 320507
2431 320507 315832 109401 -169922 -247328 -111759 -65720 -18688 29675 169016 197782 308142
2420 308142 294688 182497 -78764 -58930 23544 -25110 -33662 -25074 -251296 -126800 66226
2409 66226 231540 255557 154100 36098 -260286 -307149 -286161 -157101 -135185 -2837 76816
2398 76816 9440 -226227 -157245 240798 255714 142010 276210 420592 502708 653705 409928
2387 409928 175319 46377 -235672 -229324 -195562 -70239 -34937 -16684 -28705 -231055 -262824
2376 -262824 -171721 -134567 -14978 148858 127823 19878 20587 -133239 -186451 -332588 -707797
2365 -707797 -557581 -347790 -320894 -166209 -106382 -44690 35394 23167 -132537 -57039 -68254
2354 -68254 -74907 -143572 -89402 -364829 -365445 -106928 165802 131323 3321 157861 113438
2343 113438 42044 -82969 -112195 -16220 -56399 45275 2464 53137 176635 139281 275330
2332 275330 204818 51723 -277425 -188710 -42160 -99770 11103 286116 178591 95875
2322 95875 131578 181253 196560 238799 356578 103932 63007 65928 -214408 -119151 -6664
2311 -6664 105510 -7502 -33268 -31146 189412 71444 -96836 -275134 -302683 -136777 -24837
2300 -24837 44511 25603 -55169 -174523 -63782 -120807 -164383 -310839 -250236 -57826 25836
2289 25836 -78021 9660 64997 6750 -898 86587 -55662 -108241 -135393 -184270 -65287
2278 -65287 69538 -166407 -199281 -97084 -237103 -375142 -267018 -214032 -108886 -304646
2268 -304646 -295245 -261341 -116186 -96732 -118109 93474 232906 201993 76366 14988 -148999
2257 -148999 21940 218264 375680 566432 541350 279819 -70975 -205006 19877 89481
2247 89481 133088 85245 -132684 1729 197046 325649 546792 611583 267470 2355
2237 2355 172542 37849 139427 127654 -89995 -88024 -217973 -214975 -59369 109074 15580
2226 15580 -161564 70340 117960 223805 446275 420350 153517 -105927 132585 466213
2216 466213 745844 611877 371742 50509 -222824 -434573 -455523 -315014 -256150 -220639
2206 -220639 -43244 732 -240525 -289645 1079 196526 147397 -32661 -79278 -198209
2196 -198209 -63791 -27590 -147344 -241959 -444637 -574719 -334490 -156773 73649 88553
2186 88553 -32501 -213081 -142060 50454 294015 520538 446230 239961 360126 125301
2176 125301 40275 160781 376186 291860 -52142 -73211 -134891 -207073 -286428 -213798 -95467
2165 -95467 -21220 57497 172195 192392 327356 214559 23083 71289 34905 -78404 44738
2154 44738 -42523 171266 133886 167624 28488 62362 -2688 2832 -184702 -226729 -105738
2143 -105738 47367 36372 -109600 -88405 -23614 63466 143782 -161870 -70268 -47254 -6397
2132 -6397 72992 104998 -70625 -156073 -195591 -104228 34590 -33753 9503 88686 308333
2121 308333 89493 -133013 -990 -1544 -114974 -74404 -5000 128372 -170900 -51684 193922
2110 193922 111660 76794 228113 205226 73915 -189574 -182644 -236242 -238919 -228577 65969
2099 65969 192416 203105 332352 176520 235559 254073 118006 -78831 -330831 -373178 -235655
2088 -235655 -4790 -173765 -284522 -16844 136547 27991 -209283 -16932 136361 -67073
2078 -67073 -13640 177696 176832 88553 183206 363909 221830 86980 49198 -58401 -255036
2067 -255036 -358558 -340379 -115458 -26306 -5787 -320437 -228466 -145355 -229519 -72750 -92808
2056 -92808 -248447 -300435 -84807 -25505 57413 145884 255461 317552 337036 201159 221126
2045 221126 275552 -15322 -99228 4032 -9578 -169810 -188877 18175 183813 2021
2035 2021 -247754 -355927 -196266 -66305 131822 97090 -34350 104954 181488 237597 340662
2024 340662 565039 664811 509760 241703 214322 310992 369090 237875 -172451 21161
2014 21161 178642 275339 267533 78001 -76864 -138994 -150429 -46349 72990 -735 -71068
2003 -71068 -8384 179062 7277 -381056 -318487 -100440 -76662 -305877 -415599 -340458 -172744
1992 -172744 -123870 -125930 209306 350489 232373 279041 188509 2379 -103436 110123 415633
1981 415633 393154 197524 82287 -74859 16477 201632 358747 512279 650471 504009
1971 504009 297418 -134769 -172512 -12929 100318 170975 171263 -32877 -158965 -51773 -170280
1960 -170280 -254777 -228185 -17250 151141 68016 -227845 -142413 -148039 90868 153690 -19722
1949 -19722 -98308 74957 156182 192532 268589 352033 339244 158403 284560 287161 107274
1938 107274 58410 -44082 -326063 -411706 -399674 -404994 -104227 78822 -91806 -130102 112198
1927 112198 120433 66342 41427 195052 356966 398156 14621 152622 73133 -107590 -133147
1916 -133147 -13238 -53662 58953 307297 432005 370237 466368 594580 403245 354159
1906 354159 447255 395908 310712 165841 25515 -81212 -42288 160779 324063 150418
1896 150418 -38301 -154899 -36225 163069 214003 285084 310124 184826 113299 193407 38416
1885 38416 -23092 -159795 -308479 -78159 300707 326335 132685 189726 46980 -60834
1875 -60834 -151498 -80144 -137575 -6210 87441 -130122 -302860 -107148 63253 40169 -14125
1864 -14125 74061 302806 131823 30720 54440 168556 290035 196406 31686 188754
1854 188754 241748 344318 389243 541074 491624 363048 325966 105868 21120 29802 -171008
1843 -171008 -354934 -354287 -28650 -222356 -170862 -16077 -57467 -102779 -297691 -487704 -472533
1832 -472533 -419884 -245090 -230683 -246608 -176637 -169278 -10956 42543 3338 -61181 -77625
1821 -77625 4071 58103 -348263 -414546 -332281 -406088 -289523 -58463 44625 150621 115123
1810 115123 142483 102795 13389 108397 221330 190690 6004 -114380 131694 224593 215482
1799 215482 173152 -65101 -228169 -88654 117623 -57120 311622 413338 289101 16933
1789 16933 -7695 137048 138220 13239 -119613 -78015 151831 310170 147284 -77593 -141000
1778 -141000 -306314 -329816 -401075 -230151 23597 -46599 223212 269915 201826 153022 87891
1767 87891 165646 250918 114254 31375 -106175 20359 140618 246178 12154 -118930
1757 -118930 103837 440759 219281 152450 50765 -59208 74466 207445 23614 -108336
1747 -108336 -152058 -26836 -16417 7180 -42988 -104734 -88086 -83491 -155879 -7003 236812
1736 236812 333063 369869 439413 370804 507363 342908 104639 60131 72194 89898 182091
1725 182091 226686 216509 309580 266654 301654 238967 -17463 -234936 -248539 -171764 -249
1714 -249 189679 88457 286372 151121 -126896 10258 140874 67515 130555 162929 -5198
1703 -5198 -5789 220531 288963 185423 181353 102819 -180688 -73194 37561 103868 143416 81885
1691 81885 89889 -32095 -388933 -405629 -364373 -357805 -337073 -260912 -168129 -30845 -71745 -25089
1679 -25089 26460 37913 -14268 91249 82454 170469 241406 161973 188375 146821 100523 -39547
1667 -39547 -199958 -40269 149071 100967 -80969 -322350 -375251 -398041 -263528 -103792
1657 -103792 -27808 117781 223343 323828 230368 104119 81205 106274 -64370 -339622
1647 -339622 -233533 -92020 25276 143541 110495 162397 421745 390042 -10989 -230232
1637 -230232 -88244 -114274 -109554 -148253 -31309 133911 167845 126847 180613 246377 250799
1626 250799 236840 46143 9416 -2961 127020 101355 109910 111506 53557 30009 180920
1615 180920 169077 -127900 -51840 260117 294889 -31616 -194964 -126485 -54958 3423 337623
1604 337623 378576 292856 208877 106485 -2960 235581 194200 243121 115280 53794 244973
1593 244973 102255 -65575 110410 173369 -92257 -121892 -44289 91272 -14716 -41130
1583 -41130 -57308 -37286 54133 29755 -146108 -205682 43370 68418 49083 89484 -104277
1572 -104277 -116133 86209 300619 229888 209037 100644 -94851 -243507 -216467 157335
1562 157335 387459 263629 134828 106686 127849 111988 77189 144231 109148 65220 -39054
1551 -39054 -175723 -272357 -253865 -49608 110752 -922 -31777 -140054 -285251 -38236
1541 -38236 47619 68217 28362 64902 -115037 -300604 -316662 -291633 -292202 -76202 1915 127396
1529 127396 294701 361898 314383 252428 33612 53547 470 149709 318760 222927 5888
1518 5888 -340643 -467067 -263948 -345791 -182932 37631 47864 -190125 -328738 -262808 -115472
1507 -115472 -205070 -411503 -428475 -317710 -429727 -266253 -136316 -65231 -106515 -81443 -51279
1496 -51279 -141107 -197364 -311050 -224861 22094 78365 15788 587 -114812 -33170 33455
1485 33455 -76285 -113359 -82855 -257136 -129138 67558 181186 69002 355356 365229 238498
1474 238498 287962 397653 342040 68422 -132182 -90295 -101213 -140052 -51797 218131 249108
$$ [...]
##END NTUPLES=NMR SPECTRUM
##END=
