##TITLE=Analysis number 310965
Compound Code cc 45504
Book Reference 440/40
Project Code adrs
Chemist Name craigr
##JCAMPDX= 6.0         $$ Bruker NMR JCAMP-DX V2.0
##DATA TYPE= NMR SPECTRUM
##DATA CLASS= NTUPLES
##ORIGIN= Bruker BioSpin GmbH
##OWNER= NMR
$$ XWIN-NMR		Version 3.5
$$ Wed Jun 29 09:48:57 2005 GMT Daylight Time (UT+1h)  MAYBRIDGE\NMR@NMR_250MHZ
##.OBSERVE FREQUENCY= 250.131544655141
##.OBSERVE NUCLEUS= ^1H
##.ACQUISITION MODE= SIMULTANEOUS (DQD)
##.ACQUISITION SCHEME= undefined
##.AVERAGES= 16
##.DIGITISER RES= 18
##SPECTROMETER/DATA SYSTEM= dpx250
##.PULSE SEQUENCE= zg30
##.SOLVENT NAME= CDCl3
##.SHIFT REFERENCE= (INTERNAL, CDCl3, 0, 16.4513)
##AUDIT TRAIL= $$ (NUMBER, WHEN, WHO, WHERE, WHAT)
$$ ##TITLE= Audit trail, XWIN-NMR		Version 3.5
$$ ##JCAMPDX= 5.01
$$ ##ORIGIN= Bruker BioSpin GmbH
$$ ##OWNER= NMR
$$ C:\u/data/dgb/nmr/ADRS/4930/pdata/1/auditp.txt
$$ ##AUDIT TRAIL=  $$ (NUMBER, WHEN, WHO, WHERE, WHAT)
(   1,<2005-06-29 09:48:16.82 +100>,<MAYBRIDGE\NMR>,<NMR_250MHZ>,
      <created by zg, POWCHK disabled, PULCHK disabled
       configuration hash MD5:
       62 19 C7 07 E1 42 D1 B7 37 6C 3D D0 77 39 F9 E6
       data hash MD5: 64K
       3E A3 6B 01 F4 A2 29 40 19 BA 0F 47 A8 B2 2D 4A>)
(   2,<2005-06-29 09:48:37.77 +100>,<MAYBRIDGE\NMR>,<NMR_250MHZ>,
      <Start of raw data processing
       ef LB = 0.3 FT_mod = 6 PKNL = 1 SI = 32K 
       data hash MD5: 32K
       79 C2 E8 5E 7A B0 0B 48 F0 0D A6 AB 9C E1 D0 E7>)
(   3,<2005-06-29 09:48:43.00 +100>,<MAYBRIDGE\NMR>,<NMR_250MHZ>,
      <apk 
       data hash MD5: 32K
       B7 AC 31 95 BA 08 E9 B3 A9 FB 94 E9 E0 84 87 7B>)
(   4,<2005-06-29 09:48:44.55 +100>,<MAYBRIDGE\NMR>,<NMR_250MHZ>,
      <abs ABSG = 5 
       data hash MD5: 32K
       EB 72 42 BD 7A 7B 90 60 3F 5E 53 AB 4D 23 1D 5F>)
$$ ##END=
$$ 
$$ hash MD5
$$ 81 97 79 3E 15 37 EA 23 43 06 23 26 20 F1 31 DA
##$RELAX= 
##$RELAX= 
##$RELAX= 
##$RELAX= 
##$RELAX= 
##$RELAX= 
##$RELAX= 
$$ Bruker specific parameters
$$ --------------------------
##$DU= <C:\u>
##$EXPNO= 4930
##$NAME= <ADRS>
##$PROCNO= 1
##$TYPE= <nmr>
##$USER= <dgb>
##$AMP= (0..31)
100 100 100 100 100 100 100 100 100 100 100 100 100 100 100 100 100 100 
100 100 100 100 100 100 100 100 100 100 100 100 100 100 
##$AQSEQ= 0
##$AQ_mod= 3
##$AUNM= <au_zg>
##$AUTOPOS= <4 >
##$BF1= 250.13
##$BF2= 250.13
##$BF3= 250.13
##$BF4= 250.13
##$BF5= 500.13
##$BF6= 500.13
##$BF7= 500.13
##$BF8= 500.13
##$BYTORDA= 1
##$CFDGTYP= 0
##$CFRGTYP= 5
##$CHEMSTR= <none>
##$CNST= (0..31)
1 1 145 1 1 1 1 1 1 1 1 1 1 1 1 1 1 1 1 1 1 1 1 1 1 1 1 1 1 1 1 1 
##$CPDPRG= <>
##$CPDPRG1= <>
##$CPDPRG2= <>
##$CPDPRG3= <>
##$CPDPRG4= <mlev>
##$CPDPRG5= <mlev>
##$CPDPRG6= <mlev>
##$CPDPRG7= <mlev>
##$CPDPRG8= <mlev>
##$CPDPRGB= <>
##$CPDPRGT= <>
##$D= (0..31)
0 1 0 0 0 0 0 0 0 0.06 0 0 0 0 0 0 0.0002 0 0 0 0 0 0 0 0 0 0 0 0 0 0 
0 
##$DATE= 1120034895
##$DBL= (0..7)
120 120 120 120 120 120 120 120 
##$DBP= (0..7)
150 150 150 150 150 150 150 150 
##$DBP07= 0
##$DBPNAM0= <>
##$DBPNAM1= <>
$$ [...]
##$SUBNAM7= <"">
##$SUBNAM8= <"">
##$SUBNAM9= <"">
##$SW= 20.6930455092707
##$SWIBOX= (0..15)
0 0 3 0 0 0 0 0 0 0 0 0 0 0 0 0 
##$SW_h= 5175.983436853
##$TD= 65536
##$TD0= 1
##$TE= 295.16
##$TE2= 300
##$TE3= 300
##$TEG= 300
##$TL= (0..7)
0 120 120 120 120 120 120 120 
##$TP= (0..7)
150 150 150 150 150 150 150 150 
##$TP07= 0
##$TPNAME0= <>
##$TPNAME1= <>
##$TPNAME2= <>
##$TPNAME3= <>
##$TPNAME4= <>
##$TPNAME5= <>
##$TPNAME6= <>
##$TPNAME7= <>
##$TPOAL= (0..7)
0.5 0.5 0.5 0.5 0.5 0.5 0.5 0.5 
##$TPOFFS= (0..7)
0 0 0 0 0 0 0 0 
##$TUNHIN= 0
##$TUNHOUT= 0
##$TUNXOUT= 0
##$USERA1= <user>
##$USERA2= <user>
##$USERA3= <user>
##$USERA4= <user>
##$USERA5= <user>
##$V9= 5
##$VALIST= <valist>
##$VCLIST= <CCCCCCCCCCCCCCC>
##$VD= 0
##$VDLIST= <DDDDDDDDDDDDDDD>
##$VPLIST= <PPPPPPPPPPPPPPP>
##$VTLIST= <TTTTTTTTTTTTTTT>
##$WBST= 1024
##$WBSW= 4
##$XGAIN= (0..3)
0 0 0 0 
##$XL= 0
##$YL= 0
##$YMAX_a= 314687
##$YMIN_a= -401431
##$ZGOPTNS= <>
##$ZL1= 120
##$ZL2= 120
##$ZL3= 120
##$ZL4= 120
##$ABSF1= 16.45132
##$ABSF2= -4.241852
##$ABSG= 5
##$ABSL= 3
##$ALPHA= 0
##$AQORDER= 0
##$ASSFAC= 0
##$ASSFACI= 0
##$ASSFACX= 0
##$ASSWID= 0
##$AUNMP= <proc_1d>
##$AZFE= 0.1
##$AZFW= 0.1
##$BCFW= 0
##$BC_mod= 0
##$BYTORDP= 0
##$COROFFS= 0
##$CY= 12.5
##$DATMOD= 1
##$DC= 0
##$DFILT= <>
##$DTYPP= 0
##$F1P= 14.0000005364418
##$F2P= -0.99999901652339
##$FCOR= 0.5
##$FTSIZE= 32768
##$FT_mod= 6
##$GAMMA= 0
##$GB= 0
##$INTBC= 1
##$INTSCL= 1
##$ISEN= 128
##$LB= 0.3
##$LEV0= 0
##$LPBIN= 0
##$MAXI= 10000
##$MC2= 0
##$MEAN= 0
##$ME_mod= 0
##$MI= 0
##$NCOEF= 0
##$NC_proc= -5
##$NLEV= 6
##$NOISF1= 0
##$NOISF2= 0
##$NSP= 0
##$NTH_PI= 0
##$NZP= 0
##$OFFSET= 16.45132
##$PC= 1
##$PHC0= -78.28139
##$PHC1= 5.534514
##$PH_mod= 1
##$PKNL= yes
##$PPARMOD= 0
##$PSCAL= 4
##$PSIGN= 0
##$REVERSE= no
##$SF= 250.130017677816
##$SI= 32768
##$SIGF1= 0
##$SIGF2= 0
##$SINO= 400
##$SIOLD= 32768
##$SREGLST= <1H.CDCl3>
##$SSB= 0
##$STSI= 32768
##$STSR= 0
##$SW_p= 5175.98343685301
##$SYMM= 0
##$S_DEV= 0
##$TDeff= 65536
##$TDoff= 0
##$TI= <Analysis number 999999
Compound Code 99
Book Reference 9
Project Code 9>
##$TILT= no
##$TM1= 0
##$TM2= 0
##$TOPLEV= 0
##$USERP1= <user>
##$USERP2= <user>
##$USERP3= <user>
##$USERP4= <user>
##$USERP5= <user>
##$WDW= 1
##$XDIM= 32768
##$YMAX_p= 267880972
##$YMIN_p= -223324
$$ End of Bruker specific parameters
$$ ---------------------------------
##NTUPLES= NMR SPECTRUM
##VAR_NAME=  FREQUENCY,     SPECTRUM/REAL,   SPECTRUM/IMAG
##SYMBOL=    X,             R,               I
##VAR_TYPE=  INDEPENDENT,   DEPENDENT,       DEPENDENT
##VAR_FORM=  AFFN,          ASDF,            ASDF
##VAR_DIM=   32768,         32768,           32768
##UNITS=     HZ,            ARBITRARY UNITS, ARBITRARY UNITS
##FACTOR=    0.157963299565203, 1,           1
##FIRST=     4114.96912455602, 0,            0
##LAST=      -1061.01431229699, 0,           0
##MIN=       -1061.01431229699, -223324,     0
##MAX=       4114.96912455602, 267880972,    0
$$ Real data points
##PAGE= N=1
##DATA TABLE= (X++(R..R)), XYDATA
$$ [...]
17906D44048O5585j3871K8693Q298k9890J7056O7784N4404j9645J1291J02200
17895G35953j2459j07097j2675K8131J1839k7407N1686Q3831p36l8557J1822L5490
17883G59821k5751k6220j7261o6733p7941m6972j9158m0021J8995J5940m7184
17872D27515n0834l5257k1170J1012M0285m3068r6099j4799M9731j7742m5587
17861B03987K5774K4043k880K9318l3451J2086K7385p3837l0258J4306N264M784
17849B06521k5557m3956k7855K5537O2273n2221n0335K8147O0150K4108j5758
17838A91054l6113J277n4963j7530j2263k9662N220O6716N0111L0071p3422m4878
17826G5618j5780m125l789k5423m5014j6977M3336M4293n564m8553l8972m1246
$$ plain form
17906 444048 509633 495762 524455 532753 502863 519919 587703 642107 622462 633753 735953
17895 735953 723494 616397 603722 631853 643692 616285 667971 751802 751066 712509 724331 759821
17883 759821 734070 707850 690589 623856 545915 498943 479785 439764 458759 474699 427515
17872 427515 376681 341424 320254 331266 371551 328483 232384 217585 267316 249574 203987
17861 203987 229761 253804 250924 280242 246791 258877 286262 212425 182167 196473 201737 206521
17849 206521 180964 137008 109153 134690 196963 144742 94407 122554 182704 206812 191054
17838 191054 154941 156218 101255 83725 71462 41800 47020 113736 163847 193918 120496 75618
17826 75618 59838 55713 51924 26501 -18513 -35490 7846 52139 46575 -1978 -40950 -82196
17814h2196J9302J08868M1717q337K1006J817j1885j9799j6187L1194M4916K3939
17802A54355j2982r599k3430m3014l1130m8988m716K8269N184J7243r610j4975
17790F607J3488P6063L7968o209m5023l7483k2453J862R469O5411Q226p0917k0403
17777A6606j6349P1007k0448k4111k0547o462N4722j7159n401O19j6037p629N4794
17764F3605j8416j4099K6953N5677q803r1883o4260N7868M8080L7779J213l0441
17752F3273j5536L0667l6642j4704k9725j2251L794M3891J9720l775j6683P5746
17740A07775J3851n3104n568k1863L5055M4677l2693j5579j1494m4450k3618p046
17728a4057J6954L2895J6678Q024L0558J0881j0365R577j1046m4952P491O2192
$$ plain form
17814 -82196 -62894 45974 87691 79354 100360 102177 90292 70493 54306 85500 130416 154355
17802 154355 141373 131774 108344 65330 34200 -14788 -19504 8765 13949 31192 21582 6607
17790 6607 20095 96158 134126 127917 82894 45411 22958 24820 34289 99700 107926 37009 16606
17777 16606 257 71264 50816 26705 6158 -304 54418 37259 31858 32477 16440 8811 63605
17764 63605 45189 31090 58043 113720 104917 13034 -51226 6642 54722 92501 93714 63273
17752 63273 47737 78404 41762 27058 -2667 -14918 -11124 32767 52487 48712 32029 107775
17740 107775 121626 68522 62954 41091 76146 120823 88130 72551 61057 16607 -7011 -14057
17728 -14057 2897 35792 52470 60494 91052 101933 91568 101145 90099 45147 52638 114830
17716A14830K6420n7652k2570k0566l3444J4595N1553r758k5998m2687q698J898
17704a2077p583m1862N6N2434J3827p059L3808j8967j4986j9311j5507K0277K4904
17691G954K8324J7081L3402j2223J764p763m3456n9596J1359j543M544l2288o26
17678e3067j1529M7896p505m4434K572M8998k818o033M2241J2767k407k1821J5311
17665B0171j0998J7271M5411j2450j2312J9962k6462l6633K0726j2118J4897K6904
17653E4369m0747r1455L4366M7475J3873l3944k6648M998k126J4251k953J4630
17641a3911K4314N5509K3231k5137o7064l0611K6937l0118M9187k2675n8215j5809
17629h4362J2620j1135N3254O2561K1165K0227J4390p648K0198o2735m2265M277
$$ plain form
17716 114830 141250 83598 61028 40462 7018 21613 73166 63408 37410 -5277 -13975 -12077
17704 -12077 -19660 -61522 -61466 -9032 4795 -2264 31544 12577 -2409 -21720 -37227 -16950 7954
17691 7954 36278 53359 86761 74538 76302 68539 25083 -34513 -23154 -24697 -20153 -52441 -53067
17678 -53067 -64596 -16700 -24205 -68639 -66067 -17069 -19887 -25920 16321 29088 26681 4860 20171
17665 20171 9173 26444 71855 59405 47093 67055 40593 3960 24686 12568 27465 54369
17653 54369 13622 -77833 -43467 4008 17881 -16063 -42711 -37713 -39839 -25588 -28541 -13911
17641 -13911 10403 65912 89143 64006 -3058 -33669 -6732 -36850 12337 -10338 -68553 -84362
17629 -84362 -71742 -82877 -29623 32938 54103 74330 88720 81072 101270 38535 -3730 547
17617E47j1726L5731N2676L9355L9485M170n00k7076m6264k7327j5836J1749k9569
17604B5415l4189J0001L1985j7539k3449K2173Q7874K4392r6895o5295L8020O5301
17592F7794M575l2151m5138k235o107m9765K7166L5385k5947K7516J9530p5436
17580e4813j1250K2693l8093o0110l5318O8421P2367J5370j7906j3745o677K4531
17568c4530M0824p2067J3712L4851K7357O381N2013j920J720J5650o20o7673k5315
17555i617J8007Q839n1260J7637j8672m5104m7535k1250L8066K8616J2697L6047
17543c3529l1783K2442L680L5114K3450l53k8707J6414M2054k2157l6625k1694
17531c1694L997L6278L3662j3991m0874o7629j4538j119K260k4118O659J4273
$$ plain form
17617 547 -11179 24552 77228 116583 156068 160238 159738 132662 86398 59071 43235 54984 25415
17604 25415 -8774 1227 33212 15673 -7776 14397 102271 126663 29768 -35527 2493 67794
17592 67794 72369 40218 -4920 -7155 -13262 -63027 -35861 -476 -26423 1093 20623 -54813
17580 -54813 -66063 -43370 -81463 -141573 -176891 -108470 -36103 -20733 -38639 -52384 -59061 -34530
17568 -34530 6294 -65773 -52061 -17210 10147 16528 68541 66621 68341 83991 83371 15698 -9617
17555 -9617 8390 17229 -34031 -16394 -35066 -80170 -127705 -148955 -110889 -82273 -69576 -33529
17543 -33529 -65312 -42870 -39190 -4076 19374 19021 -9686 6728 48782 26625 -10000 -31694
17531 -31694 -27697 8581 42243 28252 -12622 -80251 -94789 -95908 -93648 -117766 -111107 -96834
17519i6834m487L748L6394L2092K245k7467j7800k2315N3927O3768J9936K6772
17507F9979m5077n4472j0501K5927p427K2305O061L741J4194l3928j6500R2814
17495F7116J9048j0772m5634l0443l5179m757J3587M1327q680J921j4902N709
17483a659o409m3250K8635J0934J4743j4033k434n208L409L207o124m8470k4579
17470i1238m7642J2675K4501P236N8359L4142j2201j4932k5957r454j472m3738
17458a09721N8750O0381N5061l911q1556K6534L1183m836l127L419K8924K7194
17446H8295L2930j693j0022M5615J36261Q2463j04453r7920k2112k9834o2644
17435E6886Q18K3722P065O1726n2331k0656R691k5125R550l002M1168n5008p1385
$$ plain form
17519 -96834 -101321 -97573 -61179 -29087 -26842 -54309 -72109 -94424 -40497 23271 43207 69979
17507 69979 24902 -29570 -40071 -14144 -21571 734 6795 10536 24730 -9198 -25698 67116
17495 67116 86164 75392 29758 -685 -35864 -40621 -27034 14293 5613 7534 -7368 -1659
17483 -1659 -8068 -51318 -22683 -11749 2994 -11039 -13473 -18681 -15272 -12065 -18189 -66659 -91238
17470 -91238 -138880 -126205 -101704 -94468 -36109 -1967 -14168 -29100 -55057 -64511 -65983 -109721
17458 -109721 -50971 9410 64471 60560 -20996 5538 36721 31885 28758 32177 61101 88295
17446 88295 121225 119532 109510 155125 291386 373849 269396 171476 149364 119530 56886
17435 56886 57704 81426 88491 150217 97886 77230 86921 61796 71346 68344 109512 54504 -16881
17422a6881j723p576j619J28M0648L0518R028k1057j3978j461l480j4488j0118
17409a2059k454q218k3783L0133Q913J723L575l2635K1687K1364K3188R665n1008
17396i909l6271M5677M4618M176n382j3439P437j2979O00k5880k089M9180k4491
17383B1248J7009j7675l182L7106L8120j9782p572j6840o6965k615O212M0548
17371B5612N5541m4848k034k601p802M4240n9207J2748K4451Q591Q33n3489m0232
17358c8197L5858J7756j6770M0113j7211o5678k2227L8888K2488Q295P054n7984
17346d7615o110Q002O1669L960m5273L8433K0340l5794j1601L938L4185k6354
17334b220n5502q015j9726o682P330J3619R2L355M6293K270K2633L9507k3032
$$ plain form
17422 -16881 -18604 -26180 -27799 -27671 12977 43495 52523 31466 17488 16027 12547 -1941 -12059
17409 -12059 -14513 -22731 -46514 -16381 -7468 -5745 -2170 -34805 -13118 8246 31434 41099 -9909
17396 -9909 -46180 -503 44115 48291 42909 29470 36907 23928 24528 -1352 -3441 45739 21248
17383 21248 38257 20582 17400 54506 92626 72844 65272 48432 -18533 -21148 -14936 25612
17371 25612 81153 36305 34271 31670 23868 68108 8901 21649 46100 54691 55524 2035 -38197
17358 -38197 -2339 15417 -1353 38760 21549 -44129 -66356 -27468 -4980 3315 10369 -47615
17346 -47615 -53725 -45723 15946 19906 -25367 13066 33406 -2388 -13989 -10051 24134 -2220
17334 -2220 -57722 -65737 -85463 -92145 -84815 -71196 -71104 -67749 -21456 -19186 3447 42954 19922
17321A9922o1426K7620J2889K3644n1752k1775K6146N6049j515q1406n188n486
17309f2278O400J2012K1021L898k3649n9914n6810N7972P6104K26m807J0013j377
17296b1189n4224m4918J3328m58j4940M0599O930O1176M0262k0026o0575l4944
17284h8979k5415N1551Q9728M2411m1331q4670o530m54j8693J0131K5328J4640
17272c2283l7756K1005O2138m7577j3863P2460K1993j5991r20l8444j0463J2610
17260g091M0277n1450P946r643L7710K1008j189j3558r224K4367j1518n2575j1423
17247c6363j3729J5315K7640k2979p3229j154j1102L1092J1372L1147K2660j721
17235b1051k9202J7330N429j9906K2707J1824l8874o6418q439M3537L9739n313
$$ plain form
17321 19922 -41504 -13884 -995 22649 -29103 -50878 -24732 31317 29802 -51604 -56792 -62278
17309 -62278 -55878 -43866 -22845 -18947 -42596 -102510 -159320 -101348 -25244 -25018 -29825 -19812 -21189
17296 -21189 -75413 -120331 -107003 -107461 -122401 -81802 -74872 -13696 26566 6540 -54035 -88979
17284 -88979 -114394 -62843 26885 69296 27965 -56705 -63235 -63689 -82382 -72251 -46923 -32283
17272 -32283 -70039 -49034 13104 -34473 -48336 24124 46117 30126 29206 -9238 -19701 -7091
17260 -7091 33186 -18264 -10318 -19961 17749 38757 37568 24010 14786 39153 27635 -24940 -36363
17247 -36363 -50092 -34777 -7137 -30116 -103345 -104499 -115601 -84509 -73137 -41990 -19330 -21051
17235 -21051 -50253 -32923 -27494 -47400 -24693 -12869 -51743 -118161 -126600 -83063 -43324 -48637
17223d8637k233Q477j8099j945j5669J1210N3792K1163o6533J4013j292j3767
17211e9520K789M8810N8534J6856j1254m092K6836k2461k7873L8678m4820n3218
17199c0735l984N4159M1156k5624r3427N938K7947P203m5309N147R827p90m7955
17186i6447m7178J0427M3237N4548J8852K2915K541L4907M804K812o085p5032
17174b9699o541K31l8755M8429L2348k0388J6143L736j5995j4454j3575p458M7199
17161A221L729q2799n1768Q721J0341j0472L2082j9208l53J3132N26L4595M525
17148e5728k3463J7905O415N1673L2034J3920j308o2341q0203l215K6885K3908
17136e3518j1416j5301k3233K3522K6428O4572J730R43m2624m194J8728N768k0616
$$ plain form
17223 -48637 -50870 -42393 -60492 -62437 -78106 -66896 -13104 8059 -58474 -44461 -45753 -59520
17211 -59520 -56731 -7921 50613 67469 56215 52123 78959 56498 28625 67303 22483 -30735
17199 -30735 -34719 19440 60596 34972 -58455 -52517 -24570 -17367 -62676 -57529 -47702 -48492 -96447
17186 -96447 -143625 -133198 -89961 -35413 -16561 6354 8895 43802 48606 51418 45333 -29699
17174 -29699 -36240 -36009 -74764 -26335 6013 -14375 1768 5504 -10491 -24945 -38520 -45978 1221
17161 1221 4950 -77849 -129617 -120896 -110555 -121027 -88945 -108153 -108506 -95374 -94848 -60253 -55728
17148 -55728 -79191 -61286 -54871 -3198 28836 42756 41448 -20893 -101096 -104311 -77426 -53518
17136 -53518 -64934 -80235 -103468 -79946 -53518 11054 12784 13727 -28897 -33091 -14363 -8595 -29211
17123b9211j5691j6399J4631N5102K6908n2333R650j2695m6925k0212j2286L2536
17111f6925k2388M045M0521P412k7014k1684l1423K004J7556K6330q588K9613
17099e0541K0983q693R885K0060L931l9255J5068j29K1480j3601k5676j6504M7021
17086a5971k7662n5524k8331K8725k9251L3319L3505K8438J2322K13K8260J326
17074I369l4251r275M0722q543j1125p0118J7409L3129J8429j0313j1396j9986
17062e5949l8253J631J0539N916J3973N39l4715k1848L0560K6182K1600J0539
17050b9286p315o214k821N907J3044m4273l2207J01396L9369j1079j9173j2848
17038e500j3829N706M1773l4327j5765J9797N4797M1799q7694q9327j7006M4228
$$ plain form
17123 -29211 -44902 -61301 -46670 8432 35340 -16993 -7343 -20038 -66963 -87175 -99461 -66925
17111 -66925 -89313 -85268 -44747 -37335 -64349 -86033 -117456 -115452 -97896 -71566 -80154 -50541
17099 -50541 -29558 -38251 -28366 -8306 -4375 -43630 -28562 -28691 -7211 -20812 -46488 -62992 -15971
17086 -15971 -43633 -99157 -127488 -98763 -128014 -94695 -61190 -32752 -20430 -20217 8043 9369
17074 9369 -24882 -34157 6565 -1978 -13103 -83221 -65812 -32683 -14254 -24567 -35963 -55949
17062 -55949 -94202 -92571 -82032 -76116 -62143 -61604 -96319 -118167 -87607 -61425 -39825 -29286
17050 -29286 -36601 -42815 -45636 -39729 -26685 -70958 -103165 -1769 37600 26521 7348 -5500
17038 -5500 -19329 -13623 28150 -6177 -21942 -2145 52652 94451 6757 -82570 -99576 -55348
17026e5348n7152P6292L2895j1052n4411J0015J8297m118k3702L3296N7943J2385
17014C5340J5934L2972n3110p1678j8164j0157L6503O0966K4790N881M9527L175
17002A11979R199l6313q4435l5639O3517r82K0551M1948m5434n551k0338J1594
16990C0096K3570k7014K2915o021l9417m6290K0554K7426M089J6113l375o2448
16978c9802q771M6420j7428O301N357M9554Q868l5535r64K462j9178l5986j7956
16965e6658K9190N4283n3701k872m4227m1768K9760O6441n63K0336K0189j5969
16953D441j1229O7083k106n824L9751j7487K710j9964l3332k2402k663l2978k7739
16940f1739K4306j2113J0503K3724J5103k9819J2696k2730n6744K7033j3704J4817
$$ plain form
17026 -55348 -112500 -36208 -3313 -14365 -68776 -58761 -40464 -44582 -68284 -34988 22955 35340
17014 35340 51274 84246 31136 -40542 -58706 -68863 -32360 28606 53396 59277 108804 111979
17002 111979 121178 84865 430 -35209 28308 27326 47877 89825 44391 38840 18502 30096
16990 30096 53666 26652 49567 43546 4129 -42161 -21607 5819 9908 26021 22646 -39802
16978 -39802 -48573 -2153 -19581 -13280 -7923 41631 50499 14964 14000 16462 -2716 -38702 -56658
16965 -56658 -27468 26815 -26886 -29758 -73985 -115753 -85993 -19552 -20115 221 20410 4441
16953 4441 -6788 60295 58189 52365 92116 74629 77339 57375 24043 1641 -1022 -34000 -61739
16940 -61739 -37433 -49546 -39043 -15319 -216 -30035 -17339 -40069 -96813 -69780 -83484 -68667
16928f8667Q187j9237p971j3414M5186K3784N7326K5536k6308l0844j1643L026
16916a5039P795K7976n1827L1230P185K4312K0561p295J3669L4066L4965L3722
16904A61320p787j3825n7958q301m0532n5667o5709j2535J8552R487j3376L6972
16892d9359N0139J7350j9684J4114K3260R286n8413p1419k1194M6041K9678m043
16880c4244J1388L2354N318l0414j1157K2366k3042m3807R73J5587N5142j3307
16868a2843m310q6045n6287L0372M1876M7138Q6306j4060l6917o6092l7907j5448
16856a24217K2714R1668M077k4238l9712k2966K5662M5690k3023K1723Q985L5021
16844B1384L5396R356J5799m9001n2986n2815J6343K4235p214j0128L767k0015
$$ plain form
16928 -68667 -60480 -79717 -87688 -101102 -55916 -32132 25194 50730 24422 -6422 -18065 -15039
16916 -15039 -7244 20732 -31095 135 7320 31632 52193 44898 58567 92633 127598 161320
16904 161320 153533 139708 81750 73449 32917 -22750 -88459 -100994 -82442 -72955 -86331 -49359
16892 -49359 780 18130 -1554 12560 35820 45106 -13307 -84726 -105920 -59879 -30201 -34244
16880 -34244 -22856 9498 14816 -15598 -26755 -4389 -27431 -71238 -70265 -54678 464 -12843
16868 -12843 -17153 -103198 -159485 -129113 -87237 -40099 46207 32147 -4770 -70862 -108769 -124217
16856 -124217 -101503 -9835 -5758 -29996 -69708 -92674 -67012 -21322 -44345 -22622 -13637 21384
16844 21384 56780 66136 81935 32934 -20052 -72867 -56524 -32289 -39503 -49631 -45864 -65879
16832f5879K5798K1428M497L544K9170k1666p5411j5201J5851P0278M4648j936
16820C5121o0540m6155J7504Q8660m0031m7851r326k885L0198O044l9294K380
16808f6175O6243j6235q0686O5635P503n2001K9559K4950k5373o9471N905K9983
16796h0163q504L9447K3045P090n6395o2779J5708L4963N8073J8004n8171p516
16784g7198L3892n1474k3990j1814R690M730l285J3936J6387l1093j2694l3619
16772a66532J3806O9768J0098L7575J5046K9453K4501m757k8085K230l3570j6260
16760d6727j734M0665m159k9713k5844j5622j5325M588l2852P7788O8802j8462
16748A405j4958l7052m122l0986R740J971M423L0957l5932K1703L5303R510J8108
$$ plain form
16832 -65879 -40081 -18653 -14156 -10612 18558 -3108 -78519 -93720 -77869 -7591 37057 35121
16820 35121 -25419 -71574 -54070 34590 -5441 -53292 -62618 -65503 -35305 -29261 -68555 -66175
16808 -66175 68 -16167 -96853 -31218 -23715 -75716 -46157 -21207 -46580 -116051 -110146 -80163
16796 -80163 -88667 -49220 -26175 -19085 -75480 -138259 -122551 -87588 -29515 -11511 -69682 -77198
16784 -77198 -43306 -94780 -118770 -130584 -120894 -116164 -119449 -105513 -89126 -120219 -132913 -166532
16772 -166532 -152726 -82958 -72860 -35285 -20239 9214 33715 28958 873 3103 -30467 -46727
16760 -46727 -48461 -7796 -11955 -41668 -67512 -83134 -98459 -93871 -126723 -48935 19867 1405
16748 1405 -13553 -50605 -54727 -85713 -75973 -74002 -69579 -38622 -74554 -52851 -17548 -8038 10070
16735A0070l9020k4592k2997L38L4247K5573k041k7697k1157l631K4476K4150
16723b2281j8698l6320k0588J832M1708O570k2873m7695m3977N799N8841K7875
16711f9807L1089L0997N1626l5154l0306o6967o537J8935l0348M2220L3231Q690
16699b2331L0594L7274m369m0289r968p796N0096l7169k9617K32n424M4820M885
16686A0938l7254k4584p520K5669K0231j0469L5388J0407K6359J8012p8714p5212
16674h6749j8671N6835J4340K1335k6476K1212R289O341J497L6049l8470n7215
16662f0683o656M1619Q1246P819j6841L7039J6754k1835k0779J6861R708l3838
16650E0414j6589j4436m0266j106l2184k6766N8980O6390L7738p2819m8720J0185
$$ plain form
16735 10070 -28950 -53542 -76539 -76201 -41954 -16381 -18422 -46119 -67276 -70907 -46431 -22281
16723 -22281 -40979 -77299 -97887 -96055 -54347 -47777 -70650 -118345 -162322 -156523 -97682 -69807
16711 -69807 -38718 -7721 43905 8751 -21555 -88522 -95059 -76124 -106472 -64252 -31021 -22331
16699 -22331 8263 45537 41168 879 -9089 -16885 33211 -3958 -33575 -33343 -38767 6053 10938
16686 10938 -26316 -50900 -58420 -32751 -12520 -22989 12399 22806 49165 67177 -11537 -86749
16674 -86749 -105420 -48585 -34245 -12910 -39386 -18174 -8885 -2544 -1047 35002 -3468 -60683
16662 -60683 -67339 -25720 55526 63345 46504 83543 100297 78462 57683 74544 84252 50414
16650 50414 33825 19389 -20877 -21983 -54167 -80933 -21953 44437 82175 9356 -39364 -29179
16638b9179P4569J5473j749l5607m6207N7720J7537J0894k7122K3140M2999n7208
16626D5260q8129J3376K5635J838m393l9765n9098j7094j798K2636K9500L1037
16614d0995L1296J1401K4432k7020l338N2228J4153m5280n6310k5999J9137L0525
16602a5770j411j3988J9710o259l3860k1912O6857k049L3523K50n9468J3160P6007
16589E4790J5782m9132l6522J0774k0586P0540K891p0720l6819N576J1386N4057
16577A2017J5479n018m6529m4103p683k803M7683N374j8697K8608K6165Q913j6038
16564C368o6573j6375j939L0520q144j8809j8879j5099J3487L1261L2869k5616
16552e9929O7512J1673q9071k9096k6512j4953Q8823L8318O004m9493k1209m1842
$$ plain form
16638 -29179 45390 60863 59114 23507 -22700 35020 52557 63451 36329 59469 102468 45260
16626 45260 -42869 -29493 -3858 -2020 -6413 -46178 -105276 -122370 -124168 -101532 -72032 -40995
16614 -40995 -9699 1702 26134 -886 -4224 48004 62157 16877 -39433 -65432 -46295 -15770
16602 -15770 -17181 -31169 -11459 -17718 -51578 -73490 -6633 -8682 24841 25091 -34377 -21217 54790
16589 54790 70572 21440 -15082 -4308 -24894 45646 48537 -22183 -59002 -53426 -42040 12017
16577 12017 27496 22478 -24051 -68154 -75837 -78640 -30957 -25583 -44280 -15672 10493 19406 3368
16564 3368 -63205 -79580 -81519 -50999 -59143 -77952 -96831 -111930 -98443 -67182 -34313 -59929
16552 -59929 7583 19256 -69815 -98911 -125423 -140376 -51553 -13235 -7231 -56724 -77933 -119775
16540a19775Q590M1642K9109l804O45j5945o2625j7277N767K9891K8858N112Q140
16527f1672p4130o5051M8234M3964K001O8905k5795o7164O035R9571M3127l2681
16515a4656J5121p481P951M4533P858k0491k6534J5944j149n4789J5738p995k4113
16502e0063N3209K2901n369j8817l4254l1828K7980J166j3730k975j7146m0154
16490a09080r882O2765J1349n110p380J0054j1961j6223q943m1957j5425R1481
16478e0312O7878O518n3361j0839l4774k2153O538Q092K7308j435m755L6623k0815
16465d5487L3274j1255k3418j0763l220L4739N8970n064L8186J0983j6376J467
16453F2036O3720l969o3451q0613j6600L0458m0197j501K1057l087n6336K2247
$$ plain form
16540 -119775 -111185 -69543 -40434 -44238 -43593 -59538 -122163 -139440 -133673 -103782 -74924 -69812 -61672
16527 -61672 -135802 -200853 -152619 -108655 -106654 -37749 -63544 -130708 -124673 -25102 18025 -14656
16515 -14656 465 -7016 935 45468 53326 32835 6301 22245 21096 -33693 -17955 -25950 -50063
16502 -50063 3146 26047 20678 1861 -32393 -64221 -36241 -35075 -48805 -51780 -68926 -109080
16490 -109080 -118962 -56197 -44848 -49958 -57338 -47284 -59245 -75468 -84411 -126368 -141793 -50312
16478 -50312 17566 24084 -29277 -40116 -74890 -97043 -90505 -82413 -55105 -56540 -61295 -24672 -45487
16465 -45487 -12213 -23468 -46886 -57649 -60869 -26130 32840 27776 65962 76945 60569 62036
16453 62036 125756 121787 58336 -22277 -38877 -8419 -48616 -50117 -29060 -32147 -88483 -66236
16441f6236O4110J8135m4076K351K0625R235l3265k4936O2373J3998K8047o864
16429D3497o2116k4067L4244j2648m4088m10K398L6610m4874j8440M8485N4220
16417A2811K6805n5355l5186m975L5297N2416L4866m7879o9081J6604m265n3320
16405i1262K0274r663J1688J2119q906l3383o625J7772O505p272j5353J9444k6085
16392a10747J4053L2112P5505L139p484m03L0092K2727m5541r715J5881m75k5293
16379f149k2509K0115m8036n2028K4210j1035L2396K0620J0614l7271k0143K7533
16367f1683J1167l4001L9519j676o4629L2448P1864l954J6797k8035k4110j6202
16355f2495L1480K2096k6745r830N7030L4381k0882k0364o7117j5751J8572J2149
$$ plain form
16441 -66236 -2126 16009 -28067 -25716 -5091 4144 -29121 -54057 8316 22314 50361 43497
16429 43497 -18619 -42686 -8442 -21090 -65178 -65588 -63190 -26580 -71454 -89894 -41409 12811
16417 12811 39616 -15739 -50925 -55900 -20603 31813 66679 18800 -50281 -33677 -37942 -91262
16405 -91262 -70988 -80651 -68963 -56844 -65750 -99133 -105758 -87986 -81481 -88753 -104106 -84662 -110747
16392 -110747 -96694 -64582 10923 14062 6578 6175 36267 58994 13453 3738 19619 19144 -6149
16379 -6149 -28658 -8543 -56579 -108607 -84397 -95432 -63036 -42416 -31802 -69073 -89216 -61683
16367 -61683 -50516 -84517 -44998 -46674 -111303 -78855 -6991 -10945 5852 -22183 -46293 -62495
16355 -62495 -31015 -8919 -35664 -45494 11536 45917 25035 4671 -62446 -78197 -59625 -47476
16343d7476l0826Q198J3509J2860k2425m970O4256M1728j9382L4644P778r1357
16331c3463n7500K627l4742Q990L1379J6856k4592M492J4317M4009M7175M4695
16319F4243J684o259n1163o0707N925l190L852O1194n2865p8390j9319p248K5140
16306a17103J2118J9883o321K0368K5464j8187n0911M9495L6897l7465n424O203
16294f4983o400j5029K5441R590K8877o226l0958j5074j9047k8665k5169J3708
16282a33935L8006J0173J9606J0536L1667J8132K5468K0826m4835m1435k229R224
16270c8796Q707M910k3644l1139J8919L9012j4471n7330L6256Q4482O7189o4744
16258B9351n2167O9489M8221J3096j2881J348l760J0955j9233L823n7936k2332
$$ plain form
16343 -47476 -78302 -70104 -56595 -43735 -66160 -71130 -6874 34854 15472 50116 57894 -33463
16331 -33463 -90963 -88336 -123078 -114088 -82709 -65853 -90445 -85953 -71636 -27627 19548 64243
16319 64243 65927 59668 8505 -52202 -46277 -49467 -45615 15579 -37286 -115676 -134995 -142243 -117103
16306 -117103 -104985 -85102 -91423 -71055 -45591 -63778 -114689 -65194 -28297 -65762 -71186 -64983
16294 -64983 -71383 -86412 -60971 -51381 -22504 -28730 -59688 -74762 -93809 -122474 -147643 -133935
16282 -133935 -95929 -85756 -66150 -55614 -23947 -5815 19653 40479 -4356 -45791 -48020 -38796
16270 -38796 -30089 -25179 -48823 -79962 -61043 -22031 -36502 -93832 -57576 26906 94095 29351
16258 29351 -22816 46673 94894 107990 95109 96457 92697 103652 84419 88242 30306 7974
16246G974l4766K2087O6636L7347k1830j12260l9415K3090l8635m4851M2534k5488
16234a17577p6029M2559J4093K7737M9875k4616J460K2491M6213m3830O288K7739
16222b3597Q134j3193k0979m6016J5707q507RL0616M9916L5966n211m0681P967
16209i869k6972J1212k4711k1249L7559O7009J7547m9496q5534N826L6684N7877
16197A5883M5867m242m286l0956o0248J3726L5213m1929l1701j7520j1975q788
16185a00956K3418L935m7303k6278K3274L0977J2935J0800K2605j6562l514J2502
16173e4167m748N6366j8930K5253K4829K136l4055L847J7480m1928r504r247m227
16160d6895k4929l0037K3185M9531L064m1875K1169m0320j8914O210j1000K9233
$$ plain form
16246 7974 -26792 -4705 61931 99278 77448 -34812 -74227 -51137 -89772 -134623 -92089 -117577
16234 -117577 -193606 -151047 -136954 -109217 -59342 -83958 -82498 -60007 -13794 -57624 -51336 -23597
16222 -23597 -15463 -28656 -49635 -95651 -79944 -88451 -88442 -57826 -7910 28056 22845 -17836 -9869
16209 -9869 -36841 -25629 -50340 -71589 -34030 32979 50526 1030 -84504 -78678 -41994 15883
16197 15883 61750 57508 53222 22266 -37982 -24256 10957 -30972 -62673 -80193 -92168 -100956
16185 -100956 -77538 -73603 -120906 -147184 -123910 -92933 -79998 -69198 -46593 -63155 -66669 -54167
16173 -54167 -58915 -2549 -21479 3774 28603 30739 -3316 531 18011 -23917 -33421 -42668 -46895
16160 -46895 -71824 -101861 -78676 -29145 -26081 -67956 -46787 -87107 -106021 -99811 -110811 -81578
16148h1578K0431L0821k0651p082k4712L8962M8031K123l300j4806j7313k8638
16136e7712l1677Q882l5453J3985Q8808N876k0203N507j0163o8266L4727R6104
16124C0415J6002J983l1022N7695r012l4479k5473j2429L1125J9835J4314j1518
16112D7436l6638n2361M679J8337m8994K4053J6927L419K7650k5556J9719L4572
16100C3243n0450M9005K9109m7739j9219m1191J3589k4642k3643q507K0188L9747
16088c0510R108J1741k5018M5529j9408k4715l0904J9800K0460j6761j3531M4987
16076i222K370p1922m020J1815l5233L5574O8364j4727p284n770l0914K8922L4817
16063B770J4906O977l4677J696m331k673N238l0146p4294Q234O9083K8507k618
$$ plain form
16148 -81578 -61147 -30326 -50977 -58059 -82771 -43809 4222 6345 3045 -11761 -29074 -57712
16136 -57712 -89389 -80507 -115960 -101975 -13167 -7291 -27494 -21987 -32150 -100416 -65689 30415
16124 30415 46417 48400 17378 75073 66061 31582 6109 -6320 24805 44640 58954 47436
16112 47436 10798 -41563 -36884 -18547 -67541 -43488 -26561 -23142 4508 -21048 -1329 33243
16100 33243 -17207 31798 60907 13168 -6051 -47242 -33653 -58295 -81938 -90445 -70257 -30510
16088 -30510 -21402 -9661 -34679 10850 -8558 -33273 -64177 -44377 -23917 -40678 -54209 -9222
16076 -9222 -6852 -78774 -82794 -70979 -106212 -70638 -2274 -17001 -24285 -30055 -60969 -32047 2770
16063 2770 17676 24653 -10024 -8328 -12659 -15332 -10094 -40240 -114534 -106300 -37217 -8710 -11328
16050a1328O902k2413m3792j3821k5374L1675j3669o708K3789Q5675R302k8670
16038h432o411j3518K4662K2346o8321k2078R567J2188j6518J8479N1862K7141
16026C0967k6993k7118m235J2019l1830m1179K0502M2597L2682J796o506L012
16014E714K0908j0931M1188l5665m7258k0989l3386M3104L2470j6622K2810j008
16002C35N319j2273l9003J313o911M8386J7244Q392J3664M4676m5809m7264j679
15989a3610M923k3319l4781P398j3090M9N8302p866k0447k2367k1127j8632L7043
15976f7524K917K3441m9058l2220L1994J146Q1519O8524L7103k8632o6255j0475
15964g520o141J9839l4256O116N1451N2374j6579j1202n8909r1587k4332L8340
$$ plain form
16050 -11328 -4426 -26839 -70631 -84452 -109826 -78151 -91820 -98528 -74739 10936 20238 -8432
16038 -8432 -14843 -28361 -3699 18647 -49674 -71752 -62185 -49997 -66515 -48036 3826 30967
16026 30967 3974 -23144 -27379 -15360 -47190 -88369 -67867 -25270 7412 9208 2702 5714
16014 5714 26622 15691 56879 21214 -26044 -47033 -80419 -37315 -4845 -21467 1343 335
16002 335 5654 -6619 -45622 -44309 -51220 -2834 14410 22802 36466 81142 35333 -11931 -13610
15989 -13610 -8687 -32006 -66787 -59389 -72479 -72430 -14128 -21994 -42441 -64808 -85935 -104567 -67524
15976 -67524 -64607 -41166 -90224 -122444 -90450 -89304 -7785 60739 97842 69210 2955 -7520
15964 -7520 -13661 6178 -28078 -21962 29489 81863 65284 54082 -4827 -96414 -120746 -82406
15952h2406O004J5113l3527l8674J0310P7869M7518L2702l5343j7562j5118j3940
15940d7054n804M0234n153m0285n0352K5835M2077K9322j2314Q416M6036j3396
15928A7562J477K5189J9596l0469o9176j9095J5239J5855q879p88N617N5946J10
15915B8184o0041p5250N979J0273k4717k1805N8156J7595p665L1528M9998J5138
15903B7373n920j9158k8143n0072O157J4251K4420L8190j6735l6193M496k345
15891d3679L2304M1845o489m4975m9Q159j6933M8259J4872k8239K0775K3038J544
15878E0432j1278k8680j8648r248L9781p132L7729K5986J4181j1840o626m4063
15866C0594j1124j1300m9790j1541K7190M9857L3673M046n7357l9832k9732M9530
$$ plain form
15952 -82406 -76402 -61289 -94816 -133490 -123180 -45311 2207 34909 -434 -17996 -33114 -47054
15940 -47054 -52858 -12624 -17777 -58062 -108414 -82579 -40502 -11180 -23494 -15078 30958 17562
15928 17562 19039 44228 63824 33355 -35821 -54916 -39677 -23822 -32701 -33489 -27872 28074 28184
15915 28184 -31857 -107107 -101128 -90855 -115572 -137377 -79221 -61626 -69291 -37763 12235 27373
15903 27373 21453 2295 -25848 -75920 -69763 -55512 -31092 7098 -9637 -45830 -41334 -43679
15891 -43679 -11375 30470 23981 -20994 -21043 -12884 -29817 18442 33314 5075 25850 48888 50432
15878 50432 39154 10474 -8174 -17422 22359 15227 52956 78942 93123 81283 74657 30594
15866 30594 19470 8170 -41620 -53161 -25971 23886 57559 61605 4248 -35584 -65316 -15786
15854a5786O713l4022K25n814j2830J171k6371l563J1877N5670j200m4361j0461
15841g8752j1682j3508l6783L0316K6335L227L8660R201J059m5553J8011p778
15829f7247j7427j346k263n3330O1009K3158j5283J5174K5437J0064L3466l8028
15817b6616k7067K1737M3839M6582j1294m3858q544J219J5089M7225K6375J0276
15805I4963k6637k3914o7030n2797J8968K6703K1482L3126n025k8478n2391q133
15793f9163J1392O039M4905M1943J2512J6477j8137j8350o2745k7860j169J0273
15781e3883O9390J9518m4713k0850L4917J6229l6708k818j8695l6695l193J3039
15769f4462j2606J3158J3707j5799K6660r258j8798j7960j7184n252K8314j60
$$ plain form
15854 -15786 -9073 -43095 -42870 -48684 -61514 -60343 -86714 -90277 -78400 -22730 -23930 -68291 -78752
15841 -78752 -90434 -103942 -140725 -110409 -84074 -80847 -42187 -32986 -31927 -77480 -59469 -67247
15829 -67247 -84674 -86020 -88283 -141613 -80604 -57446 -72729 -57555 -32118 -22054 11412 -26616
15817 -26616 -53683 -31946 11893 58475 47181 3323 -5221 -4002 11087 58312 84687 94963
15805 94963 68326 44412 -22618 -75415 -56447 -29744 -8262 24864 19839 -8639 -61030 -69163
15793 -69163 -57771 -51732 -6827 35116 47628 64105 45968 27618 -35127 -62987 -64156 -53883
15781 -53883 15507 35025 -9688 -30538 4379 20608 -16100 -18918 -37613 -74308 -77501 -64462
15769 -64462 -77068 -63910 -50203 -66002 -39342 -48600 -67398 -85358 -102542 -107794 -79480 -79640
15757g9640N7249J115j4828K1403m5983o3941M1262K8339L9104j849l3932m9704
15745a01405M1223R327L031k1071k9394L6637K5397L9182J3090j2330K4426l5068
15733f955j4053J0799m2299n5986j2976P5681K4558j8226l357J3157M2508O399
15721A9250k2644p6572j9085j6280k7402r864O027K8630O0423L5865m165k4025
15709d9842K0347m8406Q695L3672J5681M0729l8156p0396J1218K3199K833j5944
15697f6370j4292Q6091M2287o2472m7892j1499Q1670K665n9595o036R007j1538
15685e7974N779L0970r506K7182K0461k9962J2682J7440M2212O7487n9459p9844
15673a2532J8657l860j5851l6716J9120j5198K3822J3092k4557m804L708O6261
$$ plain form
15757 -79640 -22391 -21276 -36104 -14701 -60684 -124625 -83363 -55024 -15920 -17769 -51701 -101405
15745 -101405 -60182 -50855 -47824 -68895 -98289 -61652 -36255 2927 16017 3687 28113 -6955
15733 -6955 -21008 -10209 -52508 -108494 -121470 -45789 -21231 -39457 -42814 -29657 12851 19250
15721 19250 -3394 -79966 -99051 -115331 -142733 -152597 -146570 -117940 -57517 -21652 -25817 -49842
15709 -49842 -29495 -77901 -69206 -35534 -19853 20876 -17280 -87676 -76458 -53259 -50426 -66370
15697 -66370 -80662 5429 47716 -14756 -62648 -74147 7523 10188 -49407 -55443 -46436 -57974
15685 -57974 -52195 -21225 -30731 -3549 16912 -13050 -368 17072 59284 126771 67312 -12532
15673 -12532 6125 2265 -13586 -50302 -31182 -46380 -22558 -9466 -34023 -38827 -35119 31142
15661C1142L1263k1398o9071K266K7598J0540l5836k1905r165J1888r231K4534
15649b7375L9257J5782K9032Q933l6259n3139k1494q883j6472l8226L949O9274
15637c5621J9925k5615o1459L6489P6198O3961L44o2666o1566m6560m584K1100
15625h0054L1233Q4778J3318l9351l0807n328l3524K7622O137J0710Q290j376
15613h352R48J5192l4546m0099j5164L2711J4603l7699j2228O2337O0519l874
15601C4348o6167J0837K6919n0138k0579j3323K0641l9044K7260J8746k6193j2159
15589h8852M0154j6212j1915K7642k6323l467L6155j1757m26o375j1151L0837
15577d1690M3678J8366j2367k7825j4674j917K3111l0029J4276j5799j2419N106
$$ plain form
15661 31142 62405 41007 -28064 -25798 1800 12340 -23496 -45401 -54566 -42678 -51909 -27375
15649 -27375 11882 27664 56696 65629 29370 -23769 -45263 -54146 -70618 -108844 -104895 -35621
15637 -35621 -15696 -41311 -102770 -66281 9917 73878 74222 11556 -50010 -96570 -101154 -80054
15625 -80054 -48821 35957 49275 9924 -20883 -26211 -59735 -32113 -25976 -15266 -6976 -8352
15613 -8352 -7404 7788 -26758 -66857 -82021 -49310 -34707 -72406 -84634 -22297 38222 34348
15601 34348 -31819 -20982 5937 -44201 -64780 -78103 -57462 -96506 -69246 -50500 -76693 -88852
15589 -88852 -48698 -64910 -76825 -49183 -75506 -78973 -42818 -54575 -55001 -61376 -72527 -41690
15577 -41690 1988 20354 7987 -19838 -34512 -36429 -13318 -43347 -29071 -44870 -57289 -52183
15565e2183J0989P73M0465m3787R50M6978k9969l3305J8581M4252N3667K5154
15553H2565m2335k65j1778L224k7046m6334m5488r95L1499J6292K8723l6120j1242
15540e9300R883K4079L0360M192j9142q420K0490j9703J4845K3486p3981k5259
15528g8470L4168P3112J4139M9003N3083l6135l931m6825k5119l4429p1930l8691
15516a12025L4987N4399L6601N6397M6287r976j1926l0132n1723m2520k4721Q991
15504d5361j0365l6183k1218k0602J3894R5121J2106k5858l3236P988m574j3847
15492h2135R983L9432p142L4870J25612J1243q2605k8897Q405Q743N969m2912
15480E66k5777k3219J228K7852k8832N4816j3703N938N458O894J2485m4206o2588
$$ plain form
15565 -52183 -41194 -40421 44 -43743 -42793 4185 -25784 -59089 -40508 3744 57411 82565
15553 82565 40230 39965 28187 31411 4365 -41969 -87457 -88452 -56953 -40661 -11938 -48058 -59300
15540 -59300 -49417 -25338 5022 9214 -9928 -18348 2142 -17561 -2716 20770 -53211 -78470
15528 -78470 -44302 28810 42949 91952 145035 108900 104969 58144 33025 -1404 -73334 -112025
15516 -112025 -77038 -22639 13962 70359 116646 106670 94744 64612 12889 -29631 -54352 -45361
15504 -45361 -55726 -91909 -113127 -133729 -119835 -24714 -12608 -38466 -71702 -63714 -68288 -82135
15492 -82135 -72152 -32720 -39862 -4992 120620 131863 49258 20361 28766 37509 43478 566
15480 566 -25211 -48430 -47202 -19350 -48182 6634 -7069 -1131 4327 11221 23706 -20500 -83088
15467h3088n6925K9778O0478J4754j8658M419K4412N835n6634L0805m3425j2681
15455a00930J5869M1892P0732M5586l2572n5100l8184j1103J1224p23K177j3667
15443f4799J7619q509N736j6992K1552J8257L14j2939j5044k9971r23N400M1725
15430c8574k535k234N168J3478KL7745J8481k204k9505l2470k3718Q978L9172
15417h216N8107k7526p942j4943L298K670j9504O0994J9210j6685o430N50k2972
15404B0611l9679L820L3502k2930k4210M9064J7472J2065n711n9941p177j7613
15392d0727r878N295k5724K7237M071N8880L8222k5891m1347J1891l2709k7631
15380e8311p0282M0342O5521N0470m6323p2539k052R931M0704M0952k1814l8488
$$ plain form
15467 -83088 -140013 -110235 -49757 -35003 -53661 -49242 -24830 -18995 -75629 -44824 -88249 -100930
15455 -100930 -85061 -43169 27563 73149 40577 -14523 -52707 -63810 -52586 -53309 -51132 -64799
15443 -64799 -47180 -55689 -49953 -66945 -45393 -27136 -26822 -39761 -54805 -84776 -85699 -80299 -38574
15430 -38574 -41109 -43343 -38175 -24697 -24695 13050 31531 29327 -178 -32648 -56366 -47388 -8216
15417 -8216 49891 22365 14423 -520 2778 5448 -14056 46938 66148 49463 43033 43583 20611
15404 20611 -19068 -15248 18254 -4676 -28886 20178 37650 49715 44004 -15937 -23114 -40727
15392 -40727 -50605 -45310 -71034 -43797 -39726 19154 57376 31485 -9862 2029 -30680 -58311
15380 -58311 -128593 -88251 -22730 27740 -18583 -91122 -93174 -83243 -42539 -1587 -23401 -61889
15368f1889K4929K7919o4035n3873M9082R1694k727k6155j6023Q027K9625j5078
15356h504o419J0060K2008l470L4729m0120k9178L7889J8913j7672l6113j7195
15344c5072l1502J5126J7508q262m332L0552m3215j5259M6257j9345o0039P8976
15332b8607K1692M0468j9273k8767j190k4881L467N4722J4791k24M441l7599M823
15319C863o606n8071K9780L1695k2829j2194L129K9816m4671l3179j7351K2313
15307g4305M9064q650P358L403k0518K8866L1536n1835L2466J3382n8360K5194
15295b2399R3175K6330o0421m4229l0889m8640R561N4844M9991J9385K5187J6155
15283H8050n4668n4939l3126j0644O9644K1489J6305j0999p4444k6280K5285P6610
$$ plain form
15368 -61889 -36960 -9041 -73076 -126949 -77867 13827 11100 -15055 -31078 -23051 6574 -8504
15356 -8504 -14923 -4863 17145 13675 48404 8284 -20894 16995 35908 18236 -17877 -35072
15344 -35072 -66574 -51448 -33940 -42202 -46534 -15982 -59197 -74456 -28199 -47544 -107583 -28607
15332 -28607 -6915 33553 14280 -14487 -15677 -40558 -37091 17631 32422 32198 36639 -960 3863
15319 3863 -2743 -60814 -31034 661 -22168 -34362 -31233 -1417 -46088 -79267 -96618 -74305
15307 -74305 -25241 -33891 -26533 -23130 -43648 -14782 16754 -35081 -2615 10767 -47593 -22399
15295 -22399 70776 97106 36685 -7544 -38433 -87073 -77512 -22668 27323 46708 71895 88050
15283 88050 33382 -21557 -54683 -65327 4317 25806 42111 31112 -43332 -69612 -44327 32283
15271C2283O0525m1528p8720m2633j9933K5743M9857J2708K7149n684j0065n2996
15259d3294J0311N5947N8306k0721k7518j3510K0621J7128j0584n4086J8622j2144
15247i22l4161M792J0039j9788m6612M0925N7705m0071Q022Q621k5404J4434l1999
15234e4419M3430N7516J9686Q126J3856j5644r884l8782o4585M3065O3767k857
15222F3275j5713M2317p4668n4419M1226J2797n1587m8665l2552j9564N7973L0349
15210d9231o139N9897M1986l3767o0314j4142M5862K0181K3235L6181M589K5957
15198I4295n3110n2386p9776j2178J6170L5764L9114L4950m7813L0440L9195O4223
15186A08888o6210o9161m0369p5949L2827L2379l952J3122R790N8867J6864o6614
$$ plain form
15271 32283 92808 51280 -27440 -70073 -90006 -64263 -14406 -1698 25451 19767 9702 -43294
15259 -43294 -32983 22964 81270 60549 33031 19521 40142 57270 46686 -7400 11222 -922
15247 -922 -35083 -30291 -20252 -40040 -86652 -45727 11978 -28093 -20071 -11450 -36854 -22420 -54419
15234 -54419 -10989 46527 66213 74339 88195 72551 62667 23885 -40700 2365 66132 63275
15222 63275 47562 89879 15211 -39208 2018 14815 -36772 -85437 -117989 -137553 -79580 -49231
15210 -49231 -55370 4527 46513 12746 -47568 -61710 -15848 4333 27568 63749 68338 94295
15198 94295 41185 -11201 -90977 -103155 -86985 -51221 -12107 22843 -24970 5470 44665 108888
15186 108888 42678 -26483 -66852 -142801 -109974 -77595 -81547 -68425 -58635 232 17096 -49518
15174d9518o797k2748J0868M6837K6524L6320k2838m8570k8219N4928N8242l9436
15162A5593K9686p97l5900m3546L8L5693J9490j0078j7960j1261M3353J0190k5403
15149I098k9197K7075K7719k0839m8687j3006K8886K1089m07r434J9086J7941
15137B9324j6627J4420n8297J1094k183r27R397r880J1180m354J5152J64K5810
15124B4273k1784n4505l0273M9402J3397N767l817J7072M3492j8408j6100J3064
15112B1580J0813M0729r848p503K0321M3803j3675k2785k3081k8591K5487L6751
15100I4001o8139j00312K8356J4934n1054q088K255K4616L670l0306K1593P725
15088f0749L9006m225k7782K6496M1444K1767m126o8823n2214M8513L9110j1511
$$ plain form
15174 -49518 -56315 -79063 -68195 -21358 5166 41486 18648 -29922 -58141 -3213 55029 15593
15162 15593 45279 44482 8582 -34964 -34926 767 20257 10179 -7781 -19042 24311 34501 9098
15149 9098 -20099 6976 34695 13856 -34831 -47837 -18951 2138 1731 -7703 11383 29324
15137 29324 12697 27117 -31180 -20086 -22269 -23196 -13799 -23679 -12499 -16853 -1701 -1537 24273
15124 24273 2489 -52016 -82289 -32887 -19490 -13723 -17540 -468 43024 24616 8516 21580
15112 21580 32393 73122 63274 55771 76092 119895 106220 83435 60354 31763 57250 94001
15100 94001 25862 -74450 -46094 -31160 -82214 -90302 -88047 -63431 -59761 -90067 -68474 -60749
15088 -60749 -21743 -25968 -53750 -27254 14190 35957 31831 -36992 -89206 -40693 -1583 -13094
15076a3094M3909L2495q561k5236L0198k1138q0007M293M3825J3812k5680K1197
15064A6013L2169M0469o1697l8387k1137L5098N2256N913m5396m6342M8356M8697
15052F6012K0067M777j0260J986p8711m1375l463K1142M2390K2452k7452j1073
15040F492M2332L4347K6602n6336R62K5431j4044j0967j2703Q254K6621K0744
15028I7735o101m0674O6633L0431M767m7585m0478N0447M4839M5036K3983k0542
15016B08491n1697L824R0992J11029M9422Q3190M8468N5809M5958J338J7721M2597
15004G07142N070M3524J03371J96067K81684L43272N45832Q56631J235892J512964
14994E831449P45629j096311j609721j035711o22006l77468k75759j96165j34694
$$ plain form
15076 -13094 30815 63310 54749 29513 59711 38573 -41434 -37141 6684 20496 -5184 16013
15064 16013 48182 88651 26954 -11433 -32570 2528 54784 60697 15301 -31041 17315 66012
15052 66012 86079 90856 80596 82582 3871 -37504 -40967 -19825 22565 45017 17565 6492
15040 6492 48824 83171 109773 53437 54399 79830 65786 54819 42116 50370 76991 97735
15028 97735 91634 50960 117593 148024 152791 105206 64728 115175 160014 205050 229033 208491
15016 208491 156794 160618 251610 362639 412061 495251 543719 599528 645486 646824 664545 707142
15004 707142 712212 755736 859107 1055174 1336858 1680130 2225962 3082593 4318485 5831449
14994 5831449 6577078 5480767 3871046 2835335 2213329 1835861 1560102 1363937 1229243
14985A229243p4566m8763p9079j40524r6351j2957j159K1901M2145o5397p5482
14974F99011k0216k5869n2540m7388p391n3952l6482J1862M246O5285r194p0591
14962D56781m912L6218O2521r71j1196J4067j232n1747o5739j8119l8332m171
14950C73168L927j7865j3269m624L9923n1934j26785p9469L8855k912j1324K5381
14938A73072M2955m715l9874j6496Q970l7779n4354l275L2226N7669o894L434
14926A54939j5699m2973l8299L1337q516K937L2058K3501J1463l1334p0626j7972
14914C0816P4203l0274n2415n267L0265k028k2177m6613k3031J2805K3749l2882
14902d2849l0297M0085L0366m6517l4446p078M6754r603K3307M3826l6998Q0699
$$ plain form
14985 1229243 1154677 1105914 1026835 886311 789960 777003 775844 797745 839890 774493 699011
14974 699011 678795 652926 600386 552998 545607 491655 455173 467035 471281 536566 527372 456781
14962 456781 451869 488087 550608 549637 538441 552508 551276 499529 433790 415671 377339 373168
14950 373168 377095 359230 345961 341337 381260 329326 202541 123072 161927 159015 147691 173072
14938 173072 216027 211312 171438 154942 163912 126133 71779 68504 100730 158399 151505 154939
14926 154939 139240 96267 57968 89305 80789 83726 115784 139285 150748 119414 48788 30816
14914 30816 105019 74745 22330 17063 47328 45300 23123 -23490 -46521 -33716 -9967 -42849
14902 -42849 -73146 -33061 -2695 -49212 -83658 -90736 -43982 -53585 -30278 13548 -23450 57249
14890E7249O8927l5875j3905m1189k066J8040L9047J3445l2015m5258l8064o7517
14878g9181L0466P4879L8085j199O1310n0499n2857k4943m5956k7186L1227O921
14866c8933J3560J2661J4196O82j9628q080k6641L12J5228M8246K1169m1027k1995
14853c0250J6876O9219r814m1149l1224K7090K3130k0667N92L4498J0473N435
14841E4209Q892j6974J2961m699j1958M324j3412q3689l9436N6187K3069M7148
14829C6622K9279k7324k0697k0782N3159r813m0421R267M7121k0951j3812r751
14817A1897K1736M3750R341m954r291l3852j2513m3958o4o092p741l9106J3007
14804e7840J1917M2765P4267J8469l8070q484l5747m7068j8536J0792O3594K4470
$$ plain form
14890 57249 126176 90301 76396 35207 33141 51181 90228 103673 71658 26400 -11664 -79181
14878 -79181 -48715 26164 64249 63050 124360 73861 21004 -3939 -49895 -77081 -45854 -38933
14866 -38933 -25373 -12712 1484 2166 -17462 -25542 -52183 -51871 -36643 11603 32772 -8255 -30250
14853 -30250 -13374 55845 46031 4882 -26342 748 23878 3211 3803 38301 48774 54209
14841 54209 63101 46127 59088 54389 42431 46755 33343 -50346 -89782 -33595 -10526 36622
14829 36622 65901 38577 17880 -2902 50257 40444 23 9290 56411 35460 21648 11897
14817 11897 33633 77383 86724 81770 72479 38627 26114 -17844 -17908 -24000 -31741 -70847 -57840
14804 -57840 -45923 -3158 71109 89578 51508 43024 7277 -39791 -58327 -47535 16059 40529
14792D0529m8283M8506K7909K1751j6374m8087k7265J7397k2912j3151J2897J9410
14780A2327n4771j8679L8332l381N3596K1051j7798N1808k3375l5262k3213j8870
14768a8235l4813K4913M3360O216k4359j7849k0589j8559J3123J1983L4133J1011
14756A0335K2272J7656k0554o6030N7537r878k9145j4324J8230J9062n8887K0828
14744c2898J6380K7828J8448n215L4988k438p343J1469m532l5013m0203L6765
14732A8236k4198K2551M6465m2880n2840L2297J4666K6150J9969j4178m7244o529
14720g535O883p005j4325J1610l210m4739M3717N6078J3824q31j2232n5434j134
14707a4333j284J2944K4751M4739K2962J0620J3748J4132m510j8374K229m3609
$$ plain form
14792 40529 -7754 40752 68661 90412 74038 25951 -1314 16083 -6829 -19980 -7083 12327
14780 12327 -42444 -61123 -22791 -26172 27424 48475 30677 82485 59110 23848 635 -18235
14768 -18235 -53048 -28135 15225 21441 -2918 -20767 -41356 -59915 -46792 -34809 -676 10335
14756 10335 32607 50263 29709 -36321 21216 11338 -17807 -32131 -13901 5161 -53726 -32898
14744 -32898 -16518 11310 29758 24543 59531 57093 49750 61219 56687 21674 -18529 18236
14732 18236 -5962 16589 63054 20174 -32666 -369 14297 40447 60416 46238 -1006 -7535
14720 -7535 -652 -7657 -21982 -10372 -13582 -58321 -14604 41474 55298 54467 42235 -13199 -14333
14707 -14333 -15617 -2673 22078 66817 89779 100399 114147 128279 123769 105395 107624 64015
14695F4015n7351j7342k3992L9656K339M2269N0002M6051j7572R708j1109k4025
14683A02649l5612l161Q83R796J6961K4849J2252J5291J924Q0007M7842L2318
14671C05999O8706Q1984L8988l2526j1451K5493J08514P6295R2844J85656K87723
14660A228225K60213L52536M10348L19578J86207k6573j75700k73515l30139k85604
14650A665576j93232k07631j64188j07332q4340p6577q8006q8377o7170k0686
14640E68037p8888l9680J5837r905J0624o0483o896O2198N3048j0761j3455k0032
14628D69644o977k1979l1600m517P5862M6074l4403m5534J4419j2758o7213n9011
14616C22007K2341P158l3548j0296l1757m9573k9411L1075j8705p8093k6971P647
$$ plain form
14695 64015 6664 -10678 -34670 4986 7325 49594 99596 145647 128075 137783 126674 102649
14683 102649 67037 63876 64759 74555 91516 116365 128617 143908 145832 225839 273681 305999
14671 305999 374705 456689 495677 463151 451700 477193 585707 662002 754846 940502 1228225
14660 1228225 1488438 1840974 2251322 2570900 2757107 2730534 2554834 2281319 1951180 1665576
14650 1665576 1472344 1264713 1100525 993193 908853 832276 744270 655893 588723 568037
14640 568037 489149 449469 465306 455401 466025 405542 398646 460844 513892 503131 489676 469644
14628 469644 462667 440688 409088 404571 480433 526507 492104 446570 460989 448231 381018 322007
14616 322007 344348 351506 317958 307662 275905 226332 196921 227996 209291 131198 104227 111874
14604A11874k491k9342k2156l1405N6043P8256J0538o3284n6369J259j3180J94
14592C9937L9688k0811r541q045K0804o988k1525r7942N598k386n0601M6881R3098
14579B8167R878m4032J4417l467Q304j017l245K4421n1271m2843J1772J3799L4543
14566e74M3654l5829j1471j5235K0523J4177m5455l7685M0375K5774N867k7163
14554b3042R41j5650Q716J1374J9230m5995n7548k0169K1710M6987L1272k3108
14542d5282k0081K1828N8041M7739J3152n1458l0541J2091j4995p6075l9628j3429
14530a38638N2044P1585N5664j736j7521N630N28j4821n9638L3280N8411r832
14518C4956k7684k6240K085k9117r085N957N529K7129K3675J7392J7977l7649
$$ plain form
14604 111874 109383 80041 57885 26480 82523 160779 171317 108033 51664 52923 39743 39937
14592 39937 79625 58814 49273 41228 62032 55044 33519 -64423 -58825 -61211 -111812 -64931 28167
14579 28167 38045 -5987 8430 4963 13267 12250 9005 33426 -17845 -60688 -48916 -35117 -574
14566 -574 43080 7251 -4220 -19455 1068 15245 -30210 -67895 -27520 -1746 4121 -23042
14554 -23042 -22101 -37751 -29035 -17661 1569 -44426 -101974 -122143 -100433 -53446 -22174 -45282
14542 -45282 -65363 -43535 14506 62245 75397 23939 -6602 5489 -9506 -85581 -125209 -138638
14530 -138638 -86594 -15009 40655 38919 21398 27028 27556 12735 -46903 -13623 44788 34956
14518 34956 7272 -18968 -16883 -46000 -55085 -49128 -43599 -16470 7205 24597 42574 4925
14506D925o2348J3566M5072M3654k8556l6058n694k4717K2735j6940J1295L0832
14494b234O947k3590M5618N7138l6120j16657q3365l813M0220N9187O8223m545
14482G009o3833m9514K5971N8148k343m1020K5523M1307N0091l8128K555K2199
14470C7965n395p2894L3214O0174l0776k6444K5591m9587l1047l3463l070q030
14458a03762O9974k987k8785k6885J6154k466q856Q2955O6772l1151k1095J5693
14446B5561J1196k7790k6533o526k4076P211Q039K259q424k2243N8848k3600l3049
14433e9127L3316l9474n5793k6894K8594Q2934M8642j5813J9968N2714r900l6175
14421B2992j0137l6274k4780K3922J5456K0406k6743o546k8053o280L3470j400
$$ plain form
14506 4925 -57423 -43857 1215 44869 16313 -19745 -25439 -50156 -27421 -44361 -33066 -2234
14494 -2234 4713 -18877 26741 83879 47759 -68898 -152263 -156076 -115856 -56669 11554 7009
14482 7009 -56824 -106338 -80367 -22219 -24562 -65582 -40059 1248 51339 13211 15766 37965
14470 37965 32570 -40324 -7110 53064 22288 -4156 21435 -28152 -59199 -92662 -95732 -103762
14458 -103762 -33788 -36775 -65560 -92445 -76291 -78757 -87613 -4658 62114 30963 9868 25561
14446 25561 36757 8967 -17566 -24092 -48168 -40957 -32918 -30659 -39083 -61326 -2478 -26078 -59127
14433 -59127 -25811 -65285 -121078 -147972 -119378 -36444 12198 -3615 16353 69067 59167 22992
14421 22992 12855 -23419 -48199 -24277 -8821 11585 -15158 -21704 -49757 -56037 -22567 -23967
14409b3967J0835j845P7132L2891J5603n2943J7708l0912m8264K801M6231L011
14397D8281q490j1762m2682M327K9845M279j0907j8144J0136n3364P366Q2543
14385D1428J021j9197K4783P114k5485m915K5553q162m7810k6267k5847m939K7008
14372c5715j0818k1162K3267N4077P638K3426K5225p15M225M3815K2878L0844
14360A66985J0080k4020k4935n5330o8909l3572k495K544O8N8376q662m4143J1940
14347a2073L597L6535K989j2910l5856m5798Q707K1314r244l392K0100N1948j079
14334B4838l3971k1553L7360N9274K0701n2415Q756R963k8033J9123l9420l340
14322A283l863L357R97K6121J0903m6529k9474P139N1499N882m3826K8163l2180
$$ plain form
14409 -23967 -13132 -14977 62155 95046 110649 57706 75414 44502 -3762 -961 45270 48281
14397 48281 39791 28029 -14653 -10326 19519 23798 12891 -5253 4883 -48481 -41115 41428
14385 41428 42449 23252 48035 55149 29664 24749 50302 42140 -5670 -31937 -57784 -62723 -35715
14372 -35715 -46533 -67695 -44428 9649 17287 40713 65938 65223 69448 113263 136141 166985
14360 166985 177065 153045 128110 72780 3871 -29701 -32196 -29652 -29584 28792 20130 -24013 -12073
14347 -12073 -8476 28059 31048 18138 -17718 -63516 -54809 -33495 -42739 -46131 -26031 25917 24838
14334 24838 -9133 -30686 6674 65948 86649 34234 42990 52953 24920 44043 4623 1283
14322 1283 -2580 777 1774 27895 38798 -7731 -37205 -30066 21433 27315 -16511 11652 -20528
14309b0528L1124J9161K6653j3749n992q6806k9793k4767k79N8564K5729L0017
14297I334K3159k1092k8223J4625J6390M6441l8755k2048O417j958k7282j9588
14285d2580R721l294L1784k2409O129J517L147M9933M8887j5843m6857J4879M3101
14272G8115K7366j9541m7629j4900k8448m3091p794J710k4234P249M7339j4277
14260c8135J7727O4167L73l4189m5368m4040p817j2166K3681k292L3445j501O1660
14247A5545K1687l6331n8461m601J3820O840J970q272J2370l5505k4213L3689
14235f1462N1519q300m3419K6704J4028M650L5474R219K268k1698Q291K284J4171
14222C3729J2510j5610m8884m1691j3987k5176j1919N1469M5065j6221m5865O0042
$$ plain form
14309 -20528 10596 29757 56410 42661 36669 -50137 -79930 -104697 -104976 -46412 -20683 9334
14297 9334 32493 11401 -16822 -2197 14193 60634 21879 -169 6248 4290 -22992 -42580
14285 -42580 -32859 -36153 -4369 -26778 -20649 -19132 -15985 33948 82835 66992 20135 35014 78115
14272 78115 105481 85940 38311 23411 -5037 -48128 -55922 -54212 -78446 -71197 -23858 -38135
14260 -38135 -20408 43759 44132 9943 -35425 -79465 -87282 -99448 -75767 -78059 -44614 -46115 15545
14247 15545 37232 901 -57560 -62161 -48341 -41501 -39531 -47803 -35433 -70938 -95151 -61462
14235 -61462 -9943 -18243 -61662 -34958 -20930 -16280 19194 28413 30681 8983 17274 19558 33729
14222 33729 46239 30629 -18255 -59946 -73933 -99109 -111028 -59559 -14494 -30715 -76580 -16538
14210a6538P0339o338n3150p3139o0439j870J9808M4080k829N312N470N5065k590
14197a6819K3032r926n6105N4033K9838k1338m0996J7032N4850l4491m0085q030
14185d9005M7335M4361Q1777k9110L028n1784o8743n6128J3210K9748j4372k8668
14173g8351o0343L0342P2962K5867n1202k4669j9448R414P8687O558o25O914j1438
14160a5332J3787l510j7253r390K4000K9510O895J3404k0422r1344m0380Q4714
14148b5321M6987n7001j2093J1046K4948N0801j350p1261N9549N3086l7115k9614
14136A2662L7858M9054R257o5389m0319l3282r320J2153O4895J916m4688m4163
14124d9366O9419O4029K1755n3534j952q585M5029Q548o57l389q0174m506N32
$$ plain form
14210 -16538 53801 47463 -5687 -78826 -139265 -141135 -121327 -77247 -80076 -74764 -69294 -14229 -16819
14197 -16819 6213 -3713 -59818 -5785 24053 2715 -38281 -21249 33601 -890 -40975 -49005
14185 -49005 -1670 42691 124468 95358 98386 46602 -22141 -78269 -65059 -35311 -49683 -78351
14173 -78351 -138694 -108352 -35390 -9523 -60725 -85394 -104842 -95428 -16741 -10183 -10808 -3894 -15332
14160 -15332 -1545 -5055 -22308 -31698 -7698 21812 28707 42111 21689 -69655 -110035 -25321
14148 -25321 21666 -35335 -47428 -36382 -11434 39367 38017 -33244 26305 79391 42276 12662
14136 12662 50520 99574 108831 43442 3123 -30159 -39479 -27326 37569 39485 -5203 -49366
14124 -49366 20053 84082 105837 52303 50351 41766 86795 95343 94686 91297 11123 6617 7149
14111G149J4988k149k3440j7350k4818q7208N552N4278M3371O643l4958l1836
14099h9778J0426R247K0510Q9598j6562j5367m2826m6491l9432K6700L6614L151
14087e4210l8554l0700J7455K0341N7182j261Q100P3233j2980Q976n604l6337
14075E641o6236l1583J2066l5941j4424P4875J1557k4307J9594M5703R800K4001
14063C0746q010r996K102j7169K5122j8207J6171N3586j1119m4782l3222K9700
14051A4922k7079M6742Q1893p8417j8281m3313m4540K9028N79l5974j5354o806
14039i6600j7915k9322O562N7317M9119Q099j292R933o4828R17O7153K5100m858
14026I385J4313K6274P750j7474k2249j2601M7460J1515l284j4243k5791r939
$$ plain form
14111 7149 22137 19988 -3452 -20802 -45620 -132828 -127276 -72998 -29627 -22984 -57942 -89778
14099 -89778 -79352 -70105 -49595 40003 23441 8074 -34752 -81243 -120675 -93975 -57361 -54210
14087 -54210 -92764 -123464 -106009 -85668 -28486 -29747 -21647 51586 38606 47582 41978 5641
14075 5641 -60595 -92178 -80112 -116053 -130477 -55602 -44045 -68352 -48758 -3055 6745 30746
14063 30746 22736 12740 14842 -2327 22795 4588 20759 74345 63226 18444 -14778 14922
14051 14922 -12157 34585 116478 38061 19780 -23533 -68073 -39045 -38466 -74440 -89794 -96600
14039 -96600 -114515 -143837 -137275 -79958 -30839 -22740 -24032 -14099 -78927 -78010 -10857 14243 9385
14026 9385 23698 49972 57722 40248 17999 5398 52858 64373 61089 46846 21055 11116
14014A1116M85j095L270M1768k4369o6113L21O4940J1449j2919n8523l3600M5868
14001a7402N1775n5853n2871P83N2800N605L56L9689k0048Q913j1506L7263l5897
13988C607p3445M5248j7480L121m7839n503m2371L2497J08180o9j4368Q274j7158
13975a7306J2067k6428N3315N0898L09n8462K999J9716q286r206N846K0067k5860
13962A9669K6314J8526m1539l0221K8813j2187K765l632j0606N6569Q934k5096
13950C8309J3368N6790q806r9792k6385K4283o66j0634L296L2083K501j3844j214
13937I289l4412J2320L9603j1984k6964M0303l1260J0009j2665K5007L5854l4330
13925B0770n5693K8938O6697J6303K3878M1526k1259n6539m5837j2320N797p497
$$ plain form
14014 11116 11601 10506 13776 55544 31175 -34938 -34617 30323 41772 28853 -29670 -63270 -17402
14001 -17402 34373 -21480 -74351 -73568 -20768 -15163 -14807 24882 4834 13747 2241 39504 3607
13988 3607 -69838 -24590 -42070 -38949 -86788 -92291 -134662 -102165 6015 5946 -8422 -148 -17306
13975 -17306 -5239 -31667 21648 72546 72855 14393 17392 37108 28822 19616 25462 45529 19669
13962 19669 45983 64509 22970 -7251 21562 9375 12140 8508 -2098 54471 63405 38309
13950 38309 51677 108467 99661 -131 -26516 -2233 -2899 -13533 -10237 21846 24347 10503 9289
13937 9289 -25123 -12803 26800 14816 -12148 28155 -3105 6904 -5761 19246 55100 20770
13925 20770 -34923 -5985 60712 77015 100893 142419 121160 64621 18784 6464 12261 4764
13913D764R529Q766m6455m4883L1702J0789P445P06M1136N7373O1096J6455o423
13900A52000o9062p2653J9704j014r390q098l5244K8378K2276O623K2998J3174
13888F9692k8320j1827J50N49O370n1708k9868L5703k6613l1361J0579P508J18
13875d9028L0607o834L2343J4633K1848L4081L3208p864K1475j0284m6062l1367
13863C6756O899m2429o658M0955M9675N292j6473Q295R380L8018l5522j8422J354
13850G7120J7749k0608r7626J6049N5732K5670N2722K3361P337j6756q4361o241
13838E0148m3751j1848k8155Q9251O772q304L9615k0907l4225o1033J7556m9196
13826e4077o4571N3013K9990N1927K8238k0148j8731m6358K5665J00639k1486
$$ plain form
13913 4764 14293 23059 -23396 -68279 -36577 -25788 -18343 -17637 23499 80872 141968 158423 152000
13900 152000 82938 10285 29989 28975 19585 11487 -23757 4621 26897 33520 56518 69692
13888 69692 41372 29545 29695 30244 36614 -15094 -44962 -9259 -35872 -67233 -56654 -49146 -49028
13875 -49028 -18421 -25255 7088 21721 43569 77650 110858 102994 124469 114185 68123 36756
13863 36756 43655 1226 -5432 35523 85198 90490 74017 82312 91692 129710 94188 75766 77120
13850 77120 94869 74261 -23365 -7316 48416 74086 126808 150169 157506 140750 56389 50148
13838 50148 6397 -5451 -33606 55645 62417 54113 93728 72821 38596 -22437 -4881 -54077
13826 -54077 -118648 -65635 -35645 16282 44520 24372 5641 -40717 -15052 85587 64101
13815F4101n3567k2519K4719j2637M2064J7446l9364K198O539j2629J6584M0923
13803G3858l9605J6314j0717K9660J4102n947j9966J1455K2709j9535j6717K9067
13791H4678O5200l8297L0885N2593l8236m304k9721p26J9258N851l4292P109K325
13778A22323k5136n254j7376k4162K055M0650m4918J355N2405N3473L1154m5381
13766A41188m8328J6068P408J6887m9509K7345m6534k2941N456p811j8544L1363
13754E2048M125p596N4143N4586p2521m1952q2798p1677K1083M1344k269q375
13742e9859J8081L6673o3912k640L4181L0975O789k5576N67N4024M9141j3095
13730F5349k6055j3089O528L532J8847l511R573Q662M650M7882J1726l7613k3315
$$ plain form
13815 64101 10534 -11985 12734 97 42161 59607 20243 22441 28980 16351 32935 73858
13803 73858 34253 50567 39850 69510 83612 77665 57699 69154 91863 72328 55611 84678
13791 84678 149878 111581 142466 195059 156823 152519 122798 122072 141330 147181 112889 119998 122323
13778 122323 97187 91933 74557 50395 52450 93100 48182 49537 101942 155415 186569 141188
13766 141188 92860 108928 116336 133223 83714 111059 64525 41584 47040 39229 20685 52048
13754 52048 56173 48577 102720 157306 84785 42833 -39965 -111642 -90559 -49215 -51484 -59859
13742 -59859 -41778 -5105 -69017 -71657 -37476 -6501 288 -25288 -24721 29303 78444 65349
13730 65349 39294 26205 32733 36265 55112 51601 61174 69836 74486 122368 134094 96481 73166
13717G3166K5591k1113n9535p1527J4467O7991O299l3124j3534M8331K1839j9169
13705C9682m9755J3741O7407K2548j274p7738k1437J9212J8819j9106k7178K4749
13693I670K5625p80n5967k0877l0811K9431P8520l4064j6162l106J9611K5282
13681B6372k6874J6121K1032k3657q622j4018p054M0376j4346k1839J3406l39
13669E58J1924j4227o5556L8125Q130k5687l4349j5172K7377P9442J2038l1921
13657i318j642M823j0140k660N296M3012K9721l0872p44L7359o665j913k9982
13644B6275n0214j8273Q163J3261J5413k1623q036J2259L7940k2485j7553m547
13632b9420j4977q828M4572K1317j6739m2307l2140J2051M0732Q509l3585J338
$$ plain form
13717 73166 98757 77644 18109 -53418 -38951 29040 35339 2215 -11319 37012 58851 39682
13705 39682 -10073 3668 71075 93623 92349 14611 -6826 12386 31205 12099 -15079 9670
13693 9670 35295 34515 -21452 -42329 -73140 -43709 34811 747 -15415 -18521 1090 26372
13681 26372 -502 15619 36651 12994 4372 -9646 -16700 23676 9330 -12509 897 558
13669 558 12482 -1745 -67301 -29176 -21046 -46733 -81082 -96254 -68877 10565 22603 -9318
13657 -9318 -10960 -6137 -16277 -18937 -13641 29371 59092 28220 27476 64835 58170 56257 26275
13644 26275 -23939 -42212 -34049 -20788 -5375 -26998 -35034 -22775 15165 -7320 -24873 -29420
13632 -29420 -44397 -53225 -8653 12664 -4075 -46382 -78522 -66471 -25739 -17230 -50815 -49477
13620d9477K3876J8367R160j6199l0877j904N1556p440L7454M1963n3825n7420
13608c4766j3185K6246R035m1717n5451k8574J1248R9209N6719M9565k6871k8520
13596B2938O066J0105O502j3168m229N7350P375l8218m5168k2779k5706m6074
13584h5006K3295O1268J893m877k4859P380K990j8024J465K630N5390l3960j6490
13571b6905J7332j2157j7057J9520j7257k0928j8616K416L4665O072m9994K6363
13559e6546K7121l9814k037N2582J5828r307K227K3318P872M0020l506l0767l2593
13546e602k598N2716p627l6241m4257J861J918J7950J1341l2001l9328Q364o065
13533g9569K2339M7267N6885l4529k0140m7780J4647k5161K3282L141K5413J7977
$$ plain form
13620 -49477 -25601 -7234 1926 -14273 -45150 -47054 4502 -2938 34516 76479 22654 -34766
13608 -34766 -47951 -21705 -12670 -54387 -109838 -138412 -127164 -27955 28764 78329 51458 22938
13596 22938 29004 39109 45611 32443 28214 85564 92939 54721 9553 -13226 -38932 -85006
13584 -85006 -61711 -443 1450 -3427 -28286 -20906 -17916 -35940 -34475 -31845 23545 -10415 -26905
13571 -26905 -9573 -21730 -38787 -19267 -36524 -57452 -76068 -73652 -38987 -32915 -82909 -56546
13559 -56546 -29425 -69239 -71276 -18694 -2866 -12173 -9946 13372 21244 61264 57758 26991 -5602
13546 -5602 -8200 44516 36889 648 -43609 -41748 -39830 -21880 -10539 -42540 -81868 -73504 -79569
13533 -79569 -57230 -9963 46922 12393 -7747 -55527 -40880 -66041 -42759 -39618 -14205 3772
13521C772j3580m2375J9964M400l2429J4577O1904l0361Q881L1537M2078L0386
13509I8754j1128l3155r45M3421J8451j5413l3850l0867j9670R814p0060j4758
13497e9406M7710R5126M3888k6359k8376r0567K9682K0538q3303L4044L1034j9206
13485e195l2836j0117L774M2843J55406o973o2414p354q7610m6318K7899O0758
13473C1863J4361r451m221k2300k4846J6753L1168M4262p012l0273J2077k0252
13461C2129k4438N9625M3078k241l9470m6918n614j2017K1471J2104k0510m9210
13449c2011R499L9477m1161l732J4887K9107l283K2237R987j8424j9867M8702
13437E5418N1089M9005K4165k0888Q364n873m0138k19L1221k0092k4024m4731
$$ plain form
13521 3772 -9808 -52183 -32219 -27819 -60248 -45671 16233 -14128 -5247 26290 68368 98754
13509 98754 87626 54471 53526 96947 115398 99985 66135 35268 15598 25412 -44648 -59406
13497 -59406 -11696 83430 127318 100959 72583 -17984 11698 32236 -51067 -17023 14011 -5195
13485 -5195 -38031 -48148 -44374 -1531 153875 146902 84488 77134 -10476 -56794 -28895 31863
13473 31863 46224 36773 32552 10252 -14594 2159 33327 77589 70577 40304 52381 32129
13461 32129 7691 67316 110394 108153 68683 21765 16151 4134 25605 37709 17199 -32011
13449 -32011 -22512 16965 -24196 -27928 -13041 16066 12783 35020 45007 26583 6716 55418
13437 55418 106507 155512 179677 158789 167153 161280 121142 120923 152144 132052 108028 63297
13425F3297l6090K501L88n177l2999m7374N4225J6126K2010k5218j7908J7070
13413A0851J3133J4063k7787n1977k6532q848J7139K1573M1084J1328K7146j9292
13401B1881j0989j2703J2808N3567j8396k3123K5547l1595l0080Q587K0077m289
13389A1292P0218j9635m5262k9357J286J9735N0780o1893K2419L5805P273K6540
13377H9201m7330k9431Q0975L7318j7667k8531k0425r310j2199k0275J6515J2042
13365E0883p225J6708j5916m1888m9235M777O5540K9165k1561l0607j5892K696
13353a2555n770j2650j9295l941j7611L5414l1596L4888K4856l2673K8080k1327
13341c4180L039j7616m0265k0335K7982j1620k0877j4420Q0627K9206j6230k8750
$$ plain form
13425 63297 27207 29708 30096 24919 -8080 -55454 -1229 14897 36907 11689 -6219 10851
13413 10851 23984 38047 10260 -41717 -68249 -77097 -59958 -38385 2699 14027 41173 21881
13401 21881 10892 -1811 10997 64564 46168 23045 48592 16997 -13083 -4496 15581 11292
13389 11292 81510 61875 16613 -12744 -11458 8277 59057 -2836 19583 55388 62661 89201
13377 89201 41871 12440 93415 130733 113066 84535 64110 54800 42601 22326 38841 50883
13365 50883 43658 60366 44450 2562 -46673 -41896 23644 52809 31248 641 -15251 -12555
13353 -12555 -18325 -30975 -50270 -54211 -71822 -36408 -68004 -33116 -8260 -40933 -12853 -34180
13341 -34180 -31141 -48757 -89022 -109357 -81375 -92995 -113872 -128292 -47665 -18459 -34689 -63439
13329f3439J6016M4988K915K0449Q565j2510q1059n163J05211l244K3273K7179
13317H3181o3509o2540M781p9559l7005K9886L4788N2110N4724J8067j514m336
13305B9074n7876l162K4791L2034M7540J6014l4784q4785J8961K2523k4389M0569
13293B6510M8969L30o348J6858O3721j8245l8672k7211M3105j1447p6634K9440
13281E0376o822K345J9844k2590k42J7724n4872p7128k1716o798L246n868K2602
13268g9899J4795J2401O6187L0326M064K2069j2949q1857j2613O0994Q1457m4246
13256F0729p4235O6711Q5436l3472j1411l3477n8635k6189K246k8882q676P139
13244e2716j8301K0617M3084k4229K0158Q84L2684m8435k0918N6697K6067J8220
$$ plain form
13329 -63439 -47423 -2435 480 20929 29494 16984 -64075 -69238 35973 32729 56002 83181
13317 83181 19672 -42868 -38087 -117646 -154651 -124765 -89977 -37867 16857 34924 33410 29074
13305 29074 -28802 -31964 -7173 24861 72401 88415 53631 -31154 -12193 10330 -14059 26510
13293 26510 75479 75809 69461 86319 150040 131795 93123 65912 109017 97570 20936 50376
13281 50376 43554 45899 65743 43153 42911 60635 5763 -71365 -93081 -99879 -96633 -102501 -79899
13268 -79899 -65104 -52703 13484 43810 47874 69943 56994 -24863 -37476 23518 104975 60729
13256 60729 -13506 53205 138641 105169 93758 60281 1646 -24543 -22297 -51179 -59855 -52716
13244 -52716 -71017 -50400 -7316 -31545 -11387 -10503 22181 -26254 -47172 9525 35592 53812
13232E3812N689l0762l3301l6111K3686N884k4943k481k1678P847j8097P593L7361
13219b5501M0152n427l779j9858M4344M602L2798L2104l3084k6769J2198J0811
13207F2591Q701L4905J8070L742l6764p367j9174n5247J9222R845l8978k5449
13195b5903J307K0986k8970k4001J7874k3044j2493O7000K7715l0940m595j8439
13183c3503j8353j8812K5420L3332K9612J9396l6086j8958m7441o173M2576O9469
13171D0479K5969M3791m0689o5623l5249L0496M2419J5073n961k1934K3951J8340
13159G1062J8097k57l3987J2950l068l8704N2021l1674o6072q929r648j6626j2038
13146f6873j4963M0196O4718L7610O001l1920j5194l9793j2576J2313P4872L6080
$$ plain form
13232 53812 59501 28739 -4562 -40673 -16987 -11103 -36046 -38527 -60205 -52358 -70455 -62862 -25501
13219 -25501 14651 9224 5445 -14413 29931 34533 67331 99435 66351 39582 51780 62591
13207 62591 71292 106197 124267 128009 91245 83878 64704 9457 28679 38524 -454 -25903
13195 -25903 -24596 -3610 -32580 -56581 -38707 -61751 -74244 -7244 20471 -10469 -15064 -33503
13183 -33503 -51856 -70668 -45248 -11916 17696 37092 1006 -17952 -65393 -71566 -28990 40479
13171 40479 66448 110239 69550 3927 -31322 -826 41593 56666 50705 28771 52722 71062
13159 71062 89159 88902 54915 67865 64797 26093 78114 46440 -19632 -28561 -38209 -54835 -66873
13146 -66873 -81836 -41640 23078 60688 66689 34769 19575 -20218 -32794 -20481 54391 90471
13134I0471R920P816m1551l9090j8322J2461J0431Q153o9997l4838O971J7262
13122d0313J9966o455N072j3547n376N257l8167o0214L9207P3294N1775j5170
13110A5329l8628O793M6645m0887L6861P487j12818k9518J3385L3710M7449K8936
13098A4744l870K3562K1334J0751k3382j00j3819n931K9148j6299k2484j1273
13086B381k293k338k3514J8873J348n355k4126J7933J4580J2762L6941K1949o613
13073F2528O5817L5240p2734o5041P204n612J3186J467n514L4444J1823j8658
13061F4150n636q274k9521m6522p2473O050M7722L0381K3788j9166R765J1050
13049A1314m661K5992L5536L4695j7448l3107k2860o055J174K5889O877K3057
$$ plain form
13134 90471 100391 108207 66656 27566 9244 21705 32136 40289 -29708 -64546 -57575 -40313
13122 -40313 -20347 -26802 -21730 -35277 -40653 -35396 -73563 -133777 -94570 -21276 30499 15329
13110 15329 -23299 -16506 30139 -10748 26113 33600 -79218 -108736 -95351 -61641 -14192 14744
13098 14744 10874 34436 55770 66521 43139 43039 29220 23289 52437 36138 13654 2381
13086 2381 88 -2250 -25764 -6891 -5543 -10898 -35024 -17091 -2511 10251 47192 69141 62528
13073 62528 128345 163585 90851 25810 33014 27402 40588 42055 36541 70985 82808 64150
13061 64150 58514 50240 20719 -25803 -98276 -92226 -44504 -14123 9665 -9501 264 11314
13049 11314 6653 32645 68181 102876 85428 52321 29461 23406 24580 50469 57346 80403
13037H0403m5617n7781j4748O1173j7730l5582O851k3340R803J7436L9473J9775
13025D0116j9687m496K4069m729N3228M7399q325n0526o2748K9627P2875r312
13013A07491k2120L8030k7920q5270q77J4581O4104K0305n2887l7960L1137J1247
13001E9861l1271J882l9047L0698K3655J4219j0914n8624p6671J0635M2333p585
12989d0829n7646j5676Q2746O1430j6144j0131O0738j2380k8251k3300l7804m7354
12977h4601o0686N7069O5612J075N1514M7522j5433K8818K0079n5904q5814n2653
12965h3402q56P910Q9810J05553q109o1675n2103J0316N6213l516N0122k4825
12953H5438m1714q9662l6162n0j2546M1423L5396J7836q467N206m1074k2339M0995
$$ plain form
13037 80403 34786 -22995 -37743 23430 5700 -29882 -23031 -46371 -36568 -19132 20341 40116
13025 40116 20429 15933 40002 35273 88501 135900 127575 77049 14301 43928 116803 107491
13013 107491 85371 123401 95481 10211 9334 23915 88019 108324 55437 17477 48614 59861
13001 59861 28590 30472 -8575 22123 45778 59997 49083 -9541 -86212 -75577 -33244 -40829
12989 -40829 -98475 -114151 -31405 30025 13881 3750 64488 52108 23857 557 -37247 -84601
12977 -84601 -145287 -88218 -22606 -21531 29983 77505 62072 90890 110969 55065 -30749 -83402
12965 -83402 -84258 -76348 13462 119015 110906 49231 -2872 7444 63657 60141 110263 85438
12953 85438 43724 -45938 -82100 -82150 -94696 -53273 -17877 -41 -8508 -3302 -44376 -66715 -25720
12940b5720L2058O812k4164K9539L8387j5519J0197K6849J110l5628k9878J0950
12928B4993L6013Q585l1125M2049J0310j4268j5776n8285j8067N4931n1912n0589
12916f3141M5199Q216Q3142K9165n7781k0878K1626m685K2062l3839p685N0873
12904G2274m1144j3851j149k149L1094n307k4924L173J6098m020J9822K8802K6205
12891A04924K3457p1578o6429j952M3733l6282K0138J8228n4626m0902j1805J00576
12879B7482R5886k7863k6086m366Q410k3665J74J6919J456M4177M2400o180k3348
12866A25396j8415k1416n9539J7731L3131J9215j6609k1649K539J3492k9433L431
12854D7874K3947r761r268l2775k8761J0954M8081K3028m2049j8957j7048J8101
$$ plain form
12940 -25720 6338 13150 -11014 18525 56912 41393 51590 78439 79549 43921 14043 24993
12928 24993 61006 69591 38466 80515 90825 76557 60781 2496 -15571 39360 -12552 -63141
12916 -63141 -17942 -9726 73416 102581 44800 23922 45548 40863 62925 29086 21401 72274
12904 72274 31130 17279 16130 13981 45075 39768 14844 18017 34115 30095 49917 78719 104924
12891 104924 128381 56803 -9626 -11578 32155 -4127 16011 34239 -20387 -61289 -73094 27482
12879 27482 123368 95505 69419 65053 73463 49798 49972 66891 68347 112524 154924 148744 125396
12866 125396 106981 85565 26026 43757 76888 96103 79494 57845 60384 73876 44443 47874
12854 47874 71821 62060 52792 20017 -8744 2210 50291 73319 31270 12313 -4735 13366
12842A3366p299J1954J9744j1071n132J0227O9405j7638l4277K9273j933j0819
12830F5800L8824j021K6151m6130l8951k0395J7061l5526M11N9390L4155P654
12818A07423m8754L2344M266m74j9408l116O551R011n4790n2084K9183K7180k4607
12805A2725K2211N8084Q749l6829k4793m0185N9353l8362k8423q70l3318k1841
12793f3499J7105K8115j4078q573L1518N100K746N0049j280k8510l5671K6359
12781I381L7915K6352l1863j2277p519L7878K1725p0867L1339P7016N4820l2951
12769A40949q9798l4469K7421K6374M812J4324K6773m5632J3106J9670k7385k3241
12757E2904K9248M0406o1796m4471J8915K2077l7137J5530m6424L4555L3619n4277
$$ plain form
12842 13366 6067 18021 37765 26694 21562 31789 101194 83556 49279 78552 76619 65800
12830 65800 104624 103603 129754 83624 44673 24278 41339 5813 6224 65614 99769 107423
12818 107423 58669 91013 95279 94805 75397 72281 78832 87843 33053 -19031 10152 37332 12725
12805 12725 34936 93020 101769 64940 40147 -38 59315 20953 -7470 -8340 -41658 -63499
12793 -63499 -46394 -18279 -32357 -40930 -9412 -4312 -1566 48483 47203 18693 -16978 9381
12781 9381 47296 73648 41785 29508 21989 59867 81592 10725 42064 119080 173900 140949
12769 140949 51151 16682 44103 70477 75289 89613 116386 70754 83860 103530 76145 52904
12757 52904 82152 122558 60762 16291 35206 57283 20146 35676 -10748 23807 57426 3149
12745C149O9272J1327r281l6183m7377k427J2890R174J3269M4687K5439j935k1709
12732G0295R617L0862l329p1585p0618l346J5435K3150M7788M6643K6308j8449
12720A02771K4660J2041n3383j3366K1891l048K2924m7843j7844l1904L0694J580
12708D9173l314K1270q9413L578L4996K885K3151k0567q958R790k8358K6814j4874
12695F173l5559l9817Q0206K5710M3868N8661j0386k8491k8721j0701k5512J688
12683C7119K8188L1234M5526O3824m0691l4260m105k0356k0408q268k8817M3525
12671I2511K0165k1852K2636J206l9459J267J0268l1315m6808L696J4619p664
12659A9270Q175K3251J9375K8492m1181N954L2574M790K9338j3855K6966M2021
$$ plain form
12745 3149 72421 83748 74467 38284 -9093 -11520 1370 10544 23813 68500 93939 92004 70295
12732 70295 79912 110774 107445 35860 -34758 -38104 -22669 481 48269 94912 121220 102771
12720 102771 127431 139472 86089 72723 94614 91566 114490 66647 48803 16899 47593 49173
12708 49173 45859 67129 -22284 -18706 16290 19175 42326 21759 12801 22591 -5767 21047 6173
12695 6173 -29386 -69203 11003 36713 80581 139242 128856 100365 71644 60943 35431 37119
12683 37119 65307 96541 142067 205891 165200 130940 126835 106479 86071 77803 48986 92511
12671 92511 112676 90824 113460 114666 75207 76474 86742 55427 8619 12315 26934 19270
12659 19270 27445 50696 70071 98563 57382 63336 95910 100700 130038 116183 143149 185170
12647A85170M593o660R696l9472n7230K4891l1096j3354N1991K8241L5781L667
12635A96218M2437K4657K914O756p474P0036M6754J9169J4251R903M6021M4103
12623E15745M0162O2189P9553P1228J09227J64333J73206Q9723j1191J3141N3221
12612A360537J1064p7903o5221r9936j27302j22038r6700m9858m4986j7288r654
12601F60715n4901j17788l0641k3489k3373k8008l0263L1241L3270K3516k0791
12590D19488K505P468k178m4745k245M0609L5892p028j4930K2550q375m9341J6101
12577D15771m0643p6440m6822k547j8475m8489q281L6871J3296j1977K1210l3904
12565A99570k6980k7323O1050K5480J4344K3709m4332n2889n870j5261o5309M0767
$$ plain form
12647 185170 189763 183103 192799 153327 96097 120988 89892 76538 128529 156770 192551 196218
12635 196218 238655 263312 266226 272982 265508 335544 382298 401467 415718 425621 471642 515745
12623 515745 555907 618096 697649 768877 878104 1042437 1215643 1305366 1294175 1307316 1360537
12612 1360537 1371601 1293698 1228477 1128541 1001239 879201 782501 732643 687657 670369 660715
12601 660715 605814 488026 457385 433896 410523 382515 352252 383493 416763 440279 419488
12590 419488 421993 429461 427283 382538 380293 420902 456794 449766 434836 457386 449011 399670 415771
12577 415771 375128 298688 251866 249319 230844 182355 174074 210945 224241 212264 233474 199570
12565 199570 172590 145267 206317 231797 246141 269850 225518 172629 166759 151498 86189 126956
12553A26956M0088p619l3626o2854L146K6440L842O884K5738Q5003m8951q8884
12541G6163q4104M7494N2956R214m5782n8404K9918N2694j1958n6688o798M6488
12529E1193K2390n749K6651j2200M758J0913n0896j9520N0591l034l8179J7536
12517E4454N7179J7425l5097j3473L5880l522l250Q150J5760m1199J4927J4700
12505A21934j6140k1099N546P1962K1782j6357P341J9739k4745m6672k3940k7810
12493G1541M3098K0721n0458j7567N8923q24J1446J5739K6245m3989o8208N5826
12481A22493O5648M6479j4207L9236o39j6886j3375J6623K2583K1361J3168M5277
12469C47761n576J2183K8025o273k513J6574L8392J1385J8294J04660M4028p790
$$ plain form
12553 126956 167044 159425 125799 62945 66091 92531 96373 103257 128995 213998 165047 76163
12541 76163 -7941 39553 92509 101723 55941 -2463 27455 80149 68191 11503 4705 51193
12529 51193 73583 67834 94485 82285 87043 97956 47060 27540 78131 75097 36918 54454
12517 54454 111633 129058 93961 80488 116368 112846 109596 117746 133506 92307 107234 121934
12505 121934 105794 84695 90241 162203 183985 167628 174969 194708 169963 123291 99351 71541
12493 71541 114639 135360 84902 67335 126258 125434 136880 152619 178864 134875 66667 122493
12481 122493 188141 234620 220413 259649 259010 242124 228749 245372 267955 289316 302484 347761
12469 347761 342185 354368 382393 376120 373607 390181 428573 439958 458252 562912 606940 599150
12457E99150p896J7476o084L7494M6291M9265J6066m1765m7980L9946L2707m0354
12445F94316o5296j3025K805n1257r4445p1511j9857m4844j6764K1045J4785K5982
12433C81934q053n3697K3867K7112N09r544J5984l3261j3288j9349K0444M2390
12421C75048L0033j7121k2728l1421j2109l2257j0230L5402J5956r303j3842O5711
12409C73139L4621l2706j1385j8154K914J4377l2134M535P3846J269K928J5875
12397D29125L353O521p384p2937o1461K6122K2014J6229m1420J9077K2746j1147
12385C50838k1428j1789k2750J5125j3620o775M4909K0984L2726j8306m2415j3342
12373C14157L5461J6472p244j2023O0859J22845L1295j2676J4492k356o0112m9044
$$ plain form
12457 599150 591254 608730 602646 640140 686431 735696 751762 709997 662017 701963 734670 694316
12445 694316 629020 615995 618800 567543 473098 401587 381730 336886 320122 341167 355952 381934
12433 381934 373881 320184 344051 371163 371672 362128 378112 344851 331563 312214 332658 375048
12421 375048 405081 387960 365232 333811 321702 289445 279215 314617 330573 321270 307428 373139
12409 373139 407760 375054 363669 345515 348429 362806 330672 335207 409053 410322 413250 429125
12397 429125 432478 438999 431615 358678 297217 323339 345353 361582 320162 339239 361985 350838
12385 350838 329410 317621 294871 309996 296376 289601 334510 355494 388220 369914 327499 314157
12373 314157 349618 366090 358846 346823 407682 530527 561822 549146 563638 561282 501170 452126
12361D52126l4087J0214K6329m3765n1344j2734m8416k7207L8694L6122O0771
12350D06703q040K573P582j3406P0790N6774j9572k5544j4237O880K5048P470
12338E03021N4729P5303j8934o9154n1702j436k4333K7505Q8608K7153k7742r758
12326E73260l1035n963L5879Q671p022J397M1405J3061R932j0459m3560m0538
12314E45028L554K5013n6582K0623P2876k7720k2741Q8787O1767L793K3367L1207
12302G68972K9136K6990L7041m803L6889L0746M2659M9246J4674J03970O2704
12291A198224J1809R030Q6832Q5739J02911J17241O6966J33776Q7645J7950J1752
12280A929875N0932J54653N3813L9290K7737K1491J3361L4093L3074j7415L8211
$$ plain form
12361 452126 418039 428253 454582 410817 359473 346739 298323 271116 309810 345932 406703
12350 406703 398663 401236 408818 395412 466202 522976 503404 477860 463623 470503 495551 503021
12338 503021 557750 633053 614119 544965 493263 491827 467494 494999 583607 610760 583018 573260
12326 573260 542225 536262 572141 580812 573790 575187 616592 629653 639585 629126 585566 545028
12314 545028 548582 573595 517013 537636 610512 582792 560051 648838 710605 714398 737765 768972
12302 768972 798108 825098 862139 857336 894225 924971 967630 1016876 1031550 1135520 1198224
12291 1198224 1210033 1219063 1305895 1391634 1494545 1611786 1678752 1812528 1900173 1918123 1929875
12280 1929875 1980807 2135460 2189273 2228563 2256300 2277791 2291152 2325245 2358319 2340904 2379115
12269B379115j4503L43Q530M1666P2847Q7150J05764N9876K8486M7410M7659M9096
12257B913439Q9208J27914J2650K457N1716K8374O7243O8027P0120R5713R7401
12246C624262J30052J06530J36897J36467J98439K36849J68314J71839K47803
12237E157452K55497K50521K90860M04677M76661N54739N75313O32243O75709
12228I273672P53606Q18563R45027J114067J305678J516352J845949K179873K633729
12219B2386516L138124L553489L867610M164393M304346M272085M214186M190685
12211E4091434M224397M668052N735619P608963J0488490J4625495J9517242K3765971
12203A44725663K6013169K6369446K4791531K1690347J6128685Q162131j742932
$$ plain form
12269 2379115 2364612 2364955 2373485 2415151 2487998 2575148 2680912 2740788 2769274 2816684 2864343 2913439
12257 2913439 3002647 3130561 3143211 3145668 3197384 3225758 3293001 3361028 3431148 3526861 3624262
12246 3624262 3754314 3860844 3997741 4134208 4332647 4569496 4737810 4909649 5157452
12237 5157452 5412949 5663470 5954330 6359007 6835668 7390407 7965720 8597963 9273672
12228 9273672 10027278 10845841 11790868 12904935 14210613 15726965 17572914 19752787 22386516
12219 22386516 25524640 29078129 32945739 37110132 41414478 45686563 49900749 54091434
12211 54091434 58315831 62983883 68719502 76328465 86816955 101442450 120959692 144725663
12203 144725663 170738832 197108278 221899809 243590156 259718841 267880972 266138040
12196B66138040j0970840j7497303k1423791k3288355k3941909k2752977j9967445
12189A26295420j5731146j1531656q436496o410395n040565m170230l660896l282605
12181F8031431l010565k834627k582073k313149k078484j832624j612367j300875
12173E0466667j005249p66627n06627m17925l69816k74869l28922m05667n67631
12164D5823334q86751j119477j400058j572241j706554j798247j856503j873002
12156C3610501j800286j754381j621500j493874j457007j351332j284534j210939
12148B1636648j136654j098396j064423r37837r10412q05379p45996p38955p06086
12139A3492510p23360o13870n92567o06638n24998n12383m32451m56144m65536
$$ plain form
12196 266138040 255167200 237669897 216246106 192957751 169015842 146262865 126295420
12189 126295420 110564274 99032618 90596122 84185727 79145162 74974932 71314036 68031431
12181 68031431 65020866 62186239 59604166 57291017 55212533 53379909 51767542 50466667
12173 50466667 49461418 48694791 48188164 47770239 47400423 47125554 46796632 46390965 45823334
12164 45823334 44936583 43817106 42417048 40844807 39138253 37340006 35483503 33610501
12156 33610501 31810215 30055834 28434334 26940460 25483453 24132121 22847587 21636648
12148 21636648 20499994 19401598 18337175 17399338 16488926 15683547 14937551 14198596 13492510
12139 13492510 12769150 12155280 11562713 10956075 10431077 9918694 9486243 9030099 8564563
12130H564563l93925l78696l45421l56460l32157l55819k41337j74476j82483
12121E803789k47588k87036j82959p8238j05845j40105j60853r4455n0134j02305
12111D354271r4884q555J57N2892J85629K20554K34354K47571J96732J04040M2388
12100E535149p6910j26315r7114n3964L8622M9239l8947j93146l37259l90517
12090D308838l10848k84395k86026k45956k29417j11097j24465q6642n1306n0494
12080B528192j9110m2763r1346l9152j40515l0797k1740o2740q964l0362k7441
12069B013262q3045q8296m0481l9041j34265k3434m7702p3279q561R170j7865
12058A466463o8145j46553r3426n019l2657m6363k794K8323L6231j4914j8796
$$ plain form
12130 8564563 8170638 7791942 7446521 7090061 6757904 6402085 6160748 5986272 5803789
12121 5803789 5556201 5269165 5086206 5007968 4902123 4762018 4601165 4506710 4456576 4354271
12111 4354271 4259387 4250832 4250989 4303881 4489510 4710064 4944418 5191989 5388721 5492761 5535149
12100 5535149 5458239 5331924 5234810 5180846 5219468 5268707 5229760 5036614 4699355 4308838
12090 4308838 3997990 3713595 3427569 3181613 2952196 2841099 2716634 2629992 2578686 2528192
12080 2528192 2509082 2466319 2374973 2335821 2195306 2164509 2142769 2080029 2071065 2040703 2013262
12069 2013262 1930217 1841921 1801440 1762399 1628134 1604700 1556998 1483719 1475158 1484328 1466463
12058 1466463 1398318 1251765 1158339 1153320 1120663 1074300 1071506 1099829 1136060 1121146 1102350
12047A102350j03311K919K9868K2353J3591k2164M0385J9978K470p558L0063N1674
12035A182618j8730n6776K1353L6868N0176J0640L3084l7441m1919J0474N3742
12024A244089M9441M0818K5250o6256q742l8402n3618k74O7477M4972R131j4994
12012A298892J0390k7153k1418m681k6499n9070J1170l2524m4788m5644k8276
12001A030399K3002P0785L6633l8870n6475q4131k2338J2360j5540n1189j2206
11990H92430K2717P281j4732m190l4096m2821K3734n6645p5656j7590K8719J7331
11978G46482J7210L7382J3893j9381l8495K1771n1242j4404n3095o7695j6158
11967E76268J4209n972p5406J3394O4810m1267k2649Q527j2544n0260J1971Q2925
$$ plain form
12047 1102350 999039 1001958 1031826 1054179 1067770 1045606 1085991 1105969 1108439 1100881 1130944 1182618
12035 1182618 1163888 1107112 1128465 1165333 1215509 1226149 1259233 1221792 1179873 1190347 1244089
12024 1244089 1293530 1334348 1359598 1293342 1284600 1246198 1192580 1192306 1259783 1304755 1313886 1298892
12012 1298892 1309282 1282129 1260711 1256030 1229531 1170461 1181631 1149107 1104319 1058675 1030399
12001 1030399 1053401 1124186 1160819 1121949 1065474 981343 959005 971365 955825 904636 892430
11990 892430 915147 922428 907696 903506 869410 826589 850323 793678 718022 700432 729151 746482
11978 746482 763692 801074 814967 795586 757091 778862 727620 713216 660121 592426 576268
11967 576268 590477 584505 509099 522493 587303 546036 523387 531914 519370 469110 481081 564006
11955E64006J414J6221n013j379l7301L5657M0396q543J8347L8208r870K4661
11943F76804k9421p0504o1290j0927q510n1969k2953k4366k8510l7258J1903J7095
11931C60094l5389n2361k2313R992k8672j3345J4556j826k5186K2149J9767L5303
11919B82769m229p5012k4628M164M0295N3562p4163l1982M3171K7822k2181j6544
11907B03044J6415L1212L347K2995o717N401K8674r739o862M1562k3025J8007
11895C24314O531L485n0019l0700K4318L544N0381l710K7164L2218K7383K4938
11883D39847o944k6410m0589k443o285N9930J4051j0130n3706L4427O002k6734
11871C81016N0443K1778N13Q3502J6755m4463o8586m2489K2863k7067j9067O316
$$ plain form
11955 564006 565420 581641 576628 575249 537948 573605 614001 605458 623805 662013 652143 676804
11943 676804 647383 576879 515589 504662 496152 444183 421230 396864 368354 331096 342999 360094
11931 360094 324705 272344 250031 260023 231351 218006 232562 230736 205550 227699 247466 282769
11919 282769 278540 203528 178900 183064 223359 276921 202758 170776 213947 241769 219588 203044
11907 203044 219459 250671 254018 277013 270296 275697 304371 294632 287770 329332 306307 324314
11895 324314 330845 334330 284311 253611 277929 281473 331854 328144 355308 387526 414909 439847
11883 439847 432903 406493 365904 363461 357176 417106 431157 421027 367321 401748 407750 381016
11871 381016 431459 453237 453750 537252 554007 509544 440958 398469 421332 394265 375198 381514
11859C81514K0272M515m0935J4324P792L1759m204k8782M2870k9402j2594l8835
11847C48294j6482M9997O6724k7964M0787l3132n9353k1727N239L8269L1058q341
11835D13369l4945J1231J2149K2144k6629m6381m680Q17N5109K2192J2669M4521
11823D81566K8190n9498j8792j5414K1055j4551n0266n8199K1751M9945k4262
11812C61525l9857k4479j8351J4467j2671r374J1140o028M8892M5306K8669J8667
11800D17906K7801K6337k6086j0250J2611L4815J9860q451l3654r880R8276L7212
11788E86497K1807K5676K9506Q7131O2790Q7430J51298J26886J45954J55917Q8456
11777A569348J5836q09m4329p2680j4910n1737j43072j58023j08490k4633o3163
$$ plain form
11859 381514 401786 406301 365366 379690 387482 419241 415037 386255 429125 399723 387129 348294
11847 348294 331812 381809 448533 420569 461356 428224 368871 347144 352383 390652 421710 413369
11835 413369 378424 389655 401804 423948 397319 350938 346258 347075 402184 424376 437045 481566
11823 481566 509756 450258 431466 416052 437107 422556 372290 314091 335842 385787 361525
11812 361525 321668 297189 278838 293305 280634 271260 282400 276372 325264 370570 399239 417906
11800 417906 445707 472044 445958 435708 448319 483134 502994 494543 460889 451009 549285 586497
11788 586497 608304 633980 663486 750617 813407 900837 1052135 1179021 1324975 1480892 1569348
11777 1569348 1585184 1584375 1540046 1467366 1452456 1400719 1257647 1099624 991134 966501 903338
11766I03338j34131n6844k3512R048J9452J8796r5309j25666q986K3153o7763
11755D61576n7979M4800m4618j20725l346N5815L0339q503l6121j6070M8987J9496
11743C73651K5832J5688k9579M7709O795o2426K5522Q0252j5036n0134q1269n0233
11731B86772p447N1007l130n7463j2256p2186k2370L2651M9647N2050Q778p4700
11719B31353q9559j5889L6546M3110L5574k934m0983O118m220o674J1835O587
11707B10864j9480P430m4916K2597L6928k7463k5917n6122q258N6658R008P156
11695A68485o0794l2495P5176L2470O727m431N4786j2197j09574J1959L2580n663
11683A57029J4853N959M2640k0188p9550l8379J9139K6001N5718k0118m7020m8293
$$ plain form
11766 903338 769207 712363 688851 697899 717351 736147 640838 515172 506186 529339 461576
11755 461576 403597 448397 403779 283054 279708 335523 365862 357359 321238 305168 354155 373651
11743 373651 399483 415171 385592 433301 440096 377670 403192 483444 468408 418274 337005 286772
11731 286772 279325 330332 327202 269739 257483 185297 162927 195578 245225 297275 306053 231353
11719 231353 141794 125905 162451 205561 241135 238201 197218 203336 199116 192442 204277 210864
11707 210864 191384 198814 153898 176495 213423 185960 160043 103921 95663 152321 161329 168485
11695 168485 107691 75196 150372 182842 189569 185138 239924 227727 118153 130112 162692 157029
11683 157029 171882 177841 220481 200293 120743 82364 101503 127504 183222 163104 116084 67791
11671F7791N196J2756k5463L0545J4102j557j3246j1881L640n2483n9188l4194
11659f3982N3593J00378J6869o74j9975k604N0019l3790n1961K0598l3942j6357
11647A8172J4542j5198J2906M0496L1335K385r039R099K4592l9678j0495J8153
11635I7270J8399N6407j4305l7365q5647j13478n94O1392M2948K2563j7582k5988
11623D020j3889M2309J9810M178K8220N771m6066L685m5544j5811Q6571J1783
11611H5037L9336k1054l3265j4821P157j0694j2777k5671L1927r092p614j9826
11599H643q013J3967M8423j287K7635j8666n1618k1290j5018N0074J3386K200
11587D8436N4218K7093l8509k3982N8314l9986p943L3849j3104n995o278J1966
$$ plain form
11671 67791 72987 85743 60280 90825 104927 103370 90124 78243 81883 29400 -29788 -63982
11659 -63982 -10389 89989 106858 106184 86209 83605 133624 99834 47873 68471 34529 18172
11647 18172 32714 17516 30422 70918 102253 104638 95599 104698 129290 89612 79117 97270
11635 97270 115669 172076 157771 120406 34759 -78719 -79313 -17921 25027 47590 30008 4020
11623 4020 -9869 32440 52250 56428 84648 90419 44353 48038 2494 -13317 73254 85037
11611 85037 124373 103319 70054 55233 62390 51696 38919 13248 45175 36083 28469 8643
11599 8643 630 14597 63020 61733 89368 70702 19084 -2206 -17224 32850 46236 48436
11587 48436 102654 129747 91238 67256 125570 85584 77641 111490 98386 92391 86113 98079
11575I8079K7454L476j5630K0859k4580k0002l1267k8968O936M8906j4610l7139
11563C3514N655O989N5974J1753j290j5353o5420k1832r469P197j6063r727O480
11550a1592P9155N4240J8541j7395j53m2782N3554k7658p8021J9835M5838n223
11538H8339l3544K9362M8389m7891j4769m2957j6750N0553l5038K270N0474O025
11526H4463J5258l835n375K791L6383k9528l4486k0031k1052O0311O7079n9859
11514I2119L974j9386M482p265o2847p1148K1322O6033Q1011M1067J4899J7702
11502A81963l8301k4918J2578n9201l2048r735K0740k6217l1396K7204O3631M2963
11490A27263m170k4872K2461j722m7358m673m3398k863L1279K8635L013k9673
$$ plain form
11575 98079 125533 129009 113379 134238 109658 89656 58389 29421 36357 85263 70653 33514
11563 33514 39169 46158 102132 113885 112595 97242 31822 9990 521 7718 -8345 -18072 -11592
11550 -11592 67563 121803 140344 122949 122796 80014 133568 105910 27889 47724 93562 88339
11538 88339 54795 84157 132546 84655 69886 26929 10179 60732 25694 27964 78438 84463
11526 84463 99721 95886 90511 93302 129685 100157 65671 45640 24588 84899 151978 92119
11514 92119 96093 76707 81189 73924 11077 -60071 -38749 27284 108295 149362 164261 181963
11502 181963 143662 118744 131322 72121 40073 30338 51078 24861 -6535 20669 84300 127263
11490 127263 123093 98221 120682 118960 71602 66929 23531 20668 51947 80582 83595 53922
11478E3922J164J5423j4719k0748j6330N7330N5915k0661o6836j5599Q302M5025
11466H2188J6215m5065k0619O4963J7364J9170l5296l970P2219N9125l2902R084
11454B02476P956l2630n599N06k202j3398L9498M3187L7079J6452j3597m0451
11442B39277l7281l2715k6614k6105k577M4794J0679p9892L521N7609Q548J0728
11430A69972Q15M423p8355n2514L3167j5003n4473K3725M4075Q7025k4138k6957
11418A11762J8600l9635P4965L5478k3382O187O8467q5847p7138K2249J5897N2573
11406A80176M2389j8644k4606l942o798L714k3599J925j6901k2613j2107K0702
11394A19696K3508J8332K8421j8167J6564R0798M9280m3411j650j97n659k9339
$$ plain form
11478 53922 55086 70509 55790 35042 18712 76042 131957 111296 44460 28861 37163 82188
11466 82188 98403 53338 32719 97682 115046 134216 98920 94950 167169 226294 193392 202476
11454 202476 210432 177802 172203 172709 170507 157109 196607 239794 276873 293325 279728 239277
11442 239277 201996 169281 142667 116562 113985 158779 169458 89566 93087 150696 159244 169972
11430 169972 170787 175210 96855 44341 77508 62505 8032 31757 75832 162857 138719 111762
11418 111762 130362 90727 165692 201170 177788 183975 252442 166595 89457 111706 127603 180176
11406 180176 222565 203921 179315 175373 168575 172289 148690 150615 133714 111101 98994 119696
11394 119696 143204 161536 189957 171790 188354 279152 328432 285021 283371 283174 277515 248176
11382B48176K5801q539k2448J6754Q245p803l9403K3261m4121k2891n6394m8503
11370G2135k629q270P668M3671M0505O1937K5616j4821J0498M6894l069l2747
11358B47388k6016J3566l7778m0832n271O1837k412k9103k1917J7504j2831j2777
11346A51358j6437M2758j2054l8547m879k1150M4692K4416n914K5172L6544N6977
11334B82936q038n5239j167K0588N503J5787J9727p733o4683l2626l3306l0470
11322A11279j5144k9884K366m7479N3575L5605m280N0119K6242j2192N1554k2420
11310A99341p2390K4336P152Q19j5743O258P2719L3874J2900j663L9975k6803
11298B80775l1771j8825L494k4611m344k724o4779l4960o779L7038N2402Q7092
$$ plain form
11382 248176 273977 265438 242990 259744 267989 260186 220783 244044 199923 177032 120638 72135
11370 72135 69506 61236 68904 112575 153080 215017 240633 225812 236310 283204 280135 247388
11358 247388 221372 234938 197160 156328 151057 212894 210482 181379 159462 176966 164135 151358
11346 151358 134921 177679 165625 127078 122199 101049 145741 170157 164243 189415 225959 282936
11334 282936 274898 219659 218492 239080 244583 260370 280097 272364 207681 175055 141749 111279
11322 111279 96135 66251 68617 21138 74713 110318 106038 156157 182399 170207 221761 199341
11310 199341 126951 151287 158439 159258 143515 149773 222492 256366 269266 267603 307578 280775
11298 280775 249004 230179 233673 209062 204718 201994 137215 102255 95476 132514 184916 272008
11286B72008L8704J5382J4170j3223j8037j3447o499m4489J9999K3392n0268q6134
11274A51558J3234P2614k8542k1161O525K4320j8394p005J0580J4595m4462o1990
11262A11872m170L733K3111M0369J2387l1803l3388J9750J3951m065l7632m2702
11250G1413M9848O8509j4105l0253p974L7971N0455j5658r0351k5366O490M80
11238A01459P071K5119P742P276m5800J4842j5785l1030l5435O2572L8128k2426
11226A13733p820J3606L3981R497k8510J2645k6999L0205J1056o5184K8959M9785
11214A74954q861J3466j3216k0930L744o750j2832j6165m3159m8267j5315N4063
11202F0732M3434K3891L5908k8140l845M2528K029R896l4259m2213K6214K3759
$$ plain form
11286 272008 310712 326094 340264 327041 309004 295557 289058 244569 264568 287960 237692 151558
11274 151558 164792 237406 208864 187703 194228 218548 200154 193149 203729 218324 173862 111872
11262 111872 107702 111435 134546 174915 187302 155499 122111 141861 155812 151747 114115 71413
11250 71413 121261 189770 175665 145412 137438 175409 225864 210206 119855 94489 100979 101459
11238 101459 108530 133649 141391 148667 102867 117709 101924 70894 35459 98031 136159 113733
11226 113733 105913 119519 153500 162997 134487 147132 120133 150338 161394 96210 125169 174954
11214 174954 166093 179559 166343 145413 149157 142407 129575 113410 70251 21984 6669 60732
11202 60732 104166 128057 163965 135825 131980 174508 176537 186433 152174 109961 136175 159934
11190A59934J5363k5719m2936J0915K2121L2311K7749J2061n4513j1143m072K843
11178A44914K3279L2626N6575J9442J42P768l787j8309O6713N7444k2233n1821
11166C12753k7701n6787k6603k1360k1845J8895O0661M5965k4509p4738n2356
11155A32375j8653j3152L5433J6368J1780k4352l9433J2992j5896K1915k0779
11144I8598n2796K6024L6376K3511J5365j3986L7120n7360O489k2591j0157q541
11132G8052N6087K9947J5249l1379m4794m3981K3908M0340j9574M4600J4119o4644
11120I7930k3637L7906O2832K99p055L336J42k5738r573J257L2063K0336l8487
11107A51611J7486K7345J7662j1988J1233k6547m2519k2291M752L765l1470O220
$$ plain form
11190 159934 175297 149578 106642 117557 139678 171989 199738 211799 157286 146143 142071 144914
11178 144914 168193 200819 257394 276836 276978 284746 280959 262650 329363 386807 364574 312753
11166 312753 285052 228265 201662 180302 158457 177352 238013 283978 259469 184731 132375
11155 132375 113722 100570 136003 152371 164151 139799 100366 113358 97462 119377 98598
11144 98598 45802 71826 108202 131713 147078 133092 170212 112852 119341 96750 86593 78052
11132 78052 134139 164086 179335 147956 103162 59181 83089 123429 103855 148455 162574 97930
11120 97930 74293 112199 175031 175330 168275 171611 171753 146015 136442 137699 169762 190098 151611
11107 151611 169097 196442 214104 202116 213349 186802 144283 121992 126744 130509 99039 105259
11095A05259J6010J3403p653j9537O2620K1809K0533o740j2966q100J8766k4110
11083A79294P091j5346j4207K463L8035N4682M055j8784l6186o7726L7924M3291
11071B14586m9838K4254L2613k3860k6273k324K8808K4718K9194j6392j7581L317
11059B21222l0366J7227j128o4104k8692J9501M666r881N9010L8618R61k2302
11047B04732l0696J1828N159k588j4496l0429Q615J0710L8728L0577Q530k6594
11035B14076m1428j3877j5486l032n9326l110M5946K1090K1810k7472n2792K8237
11023A14636M4054J1000k7146J1371K5050k799k940J4228o160r719M9705m5326
11011A75954q778K734q999n0191J4039L7102Q5690N9040k1252n7372j1086m3863
$$ plain form
11095 105259 121269 134672 127019 107482 170102 191911 212444 205704 192738 184638 203404 179294
11083 179294 186385 171039 156832 159295 197330 252012 256067 237283 201097 133371 171295 214586
11071 214586 164748 189002 221615 197755 171482 169158 197966 222684 251878 235486 217905 221222
11059 221222 190856 208083 206955 142851 114159 133660 138326 128445 187455 226073 227034 204732
11047 204732 174036 185864 191023 188435 173939 143510 152125 162835 201563 232140 240670 214076
11035 214076 172648 158771 143285 140253 80927 77817 123763 144853 166663 139191 86399 114636
11023 114636 158690 169690 142544 153915 178965 176166 173226 187454 181294 171575 221280 175954
11011 175954 167176 169910 160911 110720 124759 161861 247551 306591 285339 227967 216881 173018
10999A73018l5420m930P607M8033P18j6269o640Q571R367j8429R218Q678J7624
10986B01146M0622j0795j7910j3994m186N3466j7841o3193L4160m452n0969n677
10974A40377K8710J254k4827n060M65k1104J1149P1247M9889K5988l6825k8012
10962B13251k2836o925l4611k5087M9879L5107J1111p311Q296N0602L4476j1039
10950B94913k1639n1050m7861N408K2966k1990M007j0796l6309J0176J0507L2585
10938A90917Q5551r312j7060j7187N3343l387k9203j9205l5520l0237L5426M7599
10926B51725M4718N9948J2149k2467l5954l6162j8843M0264J4779l0697J7195
10915B96655Q272k0215j3185M42K9489J7478K3530L9387k910r2005l625p015o8873
$$ plain form
10999 173018 137598 132668 140275 188308 189026 172757 166117 174688 184055 165626 174844 183522 201146
10986 201146 241768 230973 213063 199069 194883 248349 230508 167315 201475 197023 146054 140377
10974 140377 169087 170341 145514 140454 140919 119815 130964 202211 252100 278088 241263 213251
10962 213251 190415 183490 148879 123792 173671 208778 219889 212578 220874 271476 305952 294913
10950 294913 273274 222224 174363 179771 202737 180747 184754 173958 137649 147825 158332 190917
10938 190917 276468 267156 250096 232909 286252 282865 253662 234457 198937 168700 204126 251725
10926 251725 296443 356391 368540 346073 310119 273957 255114 295378 310157 279460 296655
10915 296655 304927 284712 271527 271969 301458 318936 342466 381853 378943 286938 283313 276298 207425
10902B07425J8693Q3682L5523p832k7597l4714k7158J8240M1185K2836k8942K3418
10890C24759O4173l563l765p82j9010l5822j4840L8521M5318l3419j214l2609
10878C27747o7858N246J9148L9767J3448l6003K9672K8719K9843L3541k9714q6413
10866C07143q817M9188J6642K2560K7326J2952j9965l5928q058j7333k0751M7844
10854C72803R260L4294N1356K8756k1283m1805p9775j2374J6884O889L121M1375
10842D09501N2619K281j1733j0732M9130L3777K4459n768N0797L4989k9622J1079
10830F10777L7958l2433J8688K2167j2060k1590O6366L6155L9135P3642N177o5463
10818G78519n3739N478P5664j9339k4598p486J5195P4584O5831J118n882k349
$$ plain form
10902 207425 226118 309800 345323 337491 309894 275180 248022 266262 307447 330283 301341 324759
10890 324759 388932 385369 381604 380822 361812 325990 311150 349671 394989 361570 360356 327747
10878 327747 259889 265135 284283 324050 337498 301495 331167 359886 389729 423270 393556 307143
10866 307143 298326 347514 364156 386716 414042 426994 407029 371101 363043 345710 324959 372803
10854 372803 382063 416357 467713 496469 475186 433381 353606 341232 358116 365005 368126 409501
10842 409501 462120 464401 452668 441936 491066 524843 549302 543534 594331 629320 599698 610777
10830 610777 648735 616302 634990 657157 645097 623507 689873 726028 765163 838805 843982 778519
10818 778519 724780 730258 805922 786583 761985 754499 769694 844278 910109 911227 905345 902996
10806I02996j5087O829Q1226N6250O5762N140k8624m8629J4323L5032l5288K8735
10794A068665L7817M1069N261L2969K5258j6270J068m1344o666r106j6001o1229
10782A061491l4043M9986J1568L8695K889o735n524o1897n3636Q411O0208M6290
10770A117703l6010J7041O6344o564q908j2073m6026o293p08O031j6336k8809
10758A045392M693j5487J831K4907L1667N031j7232K7876O3251k5137l1k3062
10746A123699l1375p912P195q5255k6279k2567k1099m1622m4493J0301k306l5394
10734H22893N765m29j0587k7549l8548l9369P4315O0027K3979m775J6558L1151
10722I13431j3644l3252m7915k2655j00376l5186P0448o689m2996N7944O0062
$$ plain form
10806 902996 887909 894738 975964 1032214 1097976 1103116 1074492 1025863 1040186 1075218 1039930 1068665
10794 1068665 1106482 1147551 1152812 1185781 1211039 1194769 1195837 1154493 1147827 1138721 1122720 1061491
10782 1061491 1027448 1077434 1089002 1127697 1130586 1123851 1118327 1056430 1002794 1011205 1071413 1117703
10770 1117703 1081693 1098734 1165078 1158514 1149606 1137533 1091507 1085214 1084506 1090537 1074201 1045392
10758 1045392 1050085 1034598 1036429 1061336 1093003 1098034 1080802 1108678 1171929 1146792 1146761 1123699
10746 1123699 1092324 1084412 1091607 1006352 980073 957506 936407 894785 850292 860593 858287 822893
10734 822893 828658 828229 817642 790093 751545 712176 786491 846518 870497 865722 882280 913431
10722 913431 899787 866535 818620 795965 695589 660403 730851 724162 681166 739110 799172
10711G99172L1397l6263m7013n62O6229M6971l4890k0973l6086l1532k4256K1124
10699G33318j2683k8627J6316O5525L4123n3992n8087l161J9536K7120M1332r520
10687G71200p2949k9824q005M6097N4288J2265J346j2046L868J0493R465K2779
10675H08977m2534Q997O5931P852j0223K064J5782N3655O6440R729j9104k5037
10663I42529n787m9595n3488K5880R8225R4175M0062k5377n4632L1248P2111L1941
10651A147292q543l7063k9086j00796N2678R8595K8248l2094M461P900Q269R608
10639A149469o1867j1423K9533P4484K5191m1600L1714K5186k7961O947J8096
10628A217769j530K2014J7486m3499J2220J2166J1886M9211n985k0283j6758K4428
$$ plain form
10711 799172 830569 794306 747293 746731 812960 859931 825041 804068 767982 736450 712194 733318
10699 733318 720635 692008 708324 773849 807972 753980 695893 692732 712268 739388 780720 771200
10687 771200 698251 668427 660422 706519 760807 773072 774418 762372 766240 776733 786198 808977
10675 808977 766443 775440 841371 849223 839000 841064 856846 910501 976941 986670 967566 942529
10663 942529 936742 887147 833659 859539 957764 1051939 1092001 1066624 1011992 1043240 1115351 1147292
10651 1147292 1138749 1101686 1072600 971804 1024482 1123077 1151325 1119231 1123692 1131592 1139861 1149469
10639 1149469 1087602 1076179 1105712 1180196 1205387 1163787 1195501 1220687 1192726 1199673 1217769
10628 1217769 1216239 1238253 1255739 1212240 1224460 1236626 1248512 1297723 1291738 1271455 1254697 1279125
10616A279125k8218L4172M2443n318l5184O1169M1752k8382n0700K1886P0840
10605A403585L836j2830L5476L2293j1820L4799O864m7733k128R909M4587m238
10593A492600l3066m5645M3681N371K3686O4414m6591m6260q160O9828L0114k222
10581A547750K312j4901P755N6880M6103l5641n1339M7376L5312k89m440j7440
10569A619438J617R29M6346L5264L230o318Q84p905M3677N931L4483M3200O837
10556A827613k586K0536J58L8743N0319K3960N8419L0108N4333k3652m488r303
10544B064160l7356L5171O2075L9000N2711q744k2987L3471M4876J01100M4944
10533B408421K647L9610P8690M8946O0710K1152k4695R1332M5705K6923P4423
$$ plain form
10616 1279125 1250907 1285079 1327522 1322204 1287020 1348189 1389941 1361559 1310859 1332745 1403585
10605 1403585 1407421 1394591 1430067 1462360 1450540 1485339 1492203 1444470 1442342 1452251 1496838 1492600
10593 1492600 1459534 1413889 1457570 1462941 1486627 1551041 1504450 1458190 1450030 1519858 1549972 1547750
10581 1547750 1550062 1535161 1542916 1599796 1645899 1610258 1558919 1606295 1641607 1641318 1636878 1619438
10569 1619438 1621055 1621984 1668330 1703594 1706824 1700506 1701390 1693485 1737162 1743093 1777576 1820776 1827613
10556 1827613 1825027 1845563 1845721 1884464 1934783 1958743 2017162 2047270 2101603 2077951 2073463 2064160
10544 2064160 2026804 2061975 2124050 2163050 2215761 2207017 2184030 2217501 2262377 2363477 2408421
10533 2408421 2411068 2450678 2529368 2578314 2639024 2660176 2635481 2726813 2772518 2799441 2873864
10522B873864P8443J4126O3374J3709Q603R714J0135Q558L3777j0644J09993J32758
10510C346410Q2683M1070k9558J2767J38326P9085J03611Q6114O7232N2402Q0299
10499D060441N3486Q9359O9678J23042J07222J32144R3589O4611L0283J08853
10489D932708J40622J12944P7620J50831J07998O6117Q6321J75848K10353J20789
10479F182151J17061J20423J00759J29965K07017K90137J67739J67457J71629
10470G654338P0529J32371J12955J48069J88000J99851J65601J65545K37848K43720
10460I318827K36321J89854K28886L33405K47882K59984K98862L34349L34791
10451A1783161L38084L48975L79295L85522M28261L72591M00763M87579M93938
$$ plain form
10522 2873864 2952307 2966433 3029807 3043516 3052119 3061833 3071968 3080526 3114303 3103659 3213652 3346410
10510 3346410 3429093 3470163 3440605 3453372 3591698 3670783 3774394 3860508 3927740 3980142 4060441
10499 4060441 4113927 4203286 4272964 4396006 4503228 4635372 4728961 4793572 4823855 4932708
10489 4932708 5073330 5186274 5263894 5414725 5522723 5588840 5675161 5851009 6061362 6182151
10479 6182151 6299212 6419635 6520394 6650359 6857376 7147513 7315252 7482709 7654338
10470 7654338 7724867 7857238 7970193 8118262 8306262 8506113 8671714 8837259 9075107 9318827
10460 9318827 9555148 9745002 9973888 10307293 10555175 10815159 11114021 11448370 11783161
10451 11783161 12121245 12470220 12849515 13235037 13663298 14035889 14436652 14924231 15418169
10442A5418169N25514N20896N82863O25124O39665P41391P89689Q64578R13437
10433B1621326R82210J109073J175261J198268J301548J325940J412812J570665
10425C1697103J716611J846916J944729K044640K128639K325453K411788K556791
10417D8672670K664617K870398L063120L188214L195304L290929L331068L251566
10409G3527886L261319L131375K818599K560794K227835J852673J535982J244636
10401I2161099R57982P62857O07622N49582N83440N97953P02665Q58899J070578
10392I8852677J238098J381669J578506J798538K005907K206434K421582K579820
10384A14063231K715167K849163K927662K917606K871329K725152K588894K314726
$$ plain form
10442 15418169 15943683 16464579 17047442 17672566 18312231 19053622 19843311 20707889 21621326
10433 21621326 22603536 23712609 24887870 26086138 27387686 28713626 30126438 31697103
10425 31697103 33413714 35260630 37205359 39249999 41378638 43704091 46115879 48672670
10417 48672670 51337287 54207685 57270805 60459019 63654323 66945252 70276320 73527886
10409 73527886 76789205 79920580 82739179 85299973 87527808 89380481 90916463 92161099
10401 92161099 93119081 93881938 94489560 95039142 95622582 96220535 96923200 97782099 98852677
10392 98852677 100090775 101472444 103050950 104849488 106855395 109061829 111483411 114063231
10384 114063231 116778398 119627561 122555223 125472829 128344158 131069310 133658204 135972930
10376A35972930J983021J615398J323648R13073M85887J17555j80985n17028q98878
10367A40814621j114633j274354j446739j633751j797362j812861j752022j725625
10359A28257274j643002j588988j505623j335454j075997q57965o79829m58556
10351A19111860l06907j62522M9063K53824M93703O23294O81882P12401O62745
10342A22119343N57126L09240l2419m34212q25800j322059j836518k321769k761497
10333A13451435l122685l347958l489794l541627l627787l614047l568508l333985
10325H5805044l254782l185585k974795k882689k728221k525416k371768k317410
10317F3564378k122331k036214k026725j853974j730973j639416j553909j510551
$$ plain form
10376 135972930 137955951 139571349 140894997 141808070 142293957 142411512 142230527 141713499 140814621
10367 140814621 139699988 138425634 136978895 135345144 133547782 131734921 129982899 128257274
10359 128257274 126614272 125025284 123519661 122184207 121108210 120250245 119570416 119111860
10351 119111860 118804953 118642431 118691494 118945318 119439021 120062315 120744197 121456598 122119343
10342 122119343 122676469 122985709 122953290 122519078 121693278 120371219 118534701 116212932 113451435
10333 113451435 110328750 106980792 103490998 99949371 96321584 92707537 89139029 85805044
10325 85805044 82550262 79364677 76389882 73507193 70778972 68253556 65881788 63564378
10317 63564378 61442047 59405833 57379108 55525134 53794161 52154745 50600836 49090285
10309D9090285j515213j420889j359524j374857j265212j222482j235375j182602
10301C8514131j191010j167127j137520j144400j125073j072849j010324r62219
10293B9703609r37915r54347r66539r43420q86730q28266q16419p17752o97139
10284B1955082p16057p39974p02542o50091o44888n64480n69756n76118n40254
10275A6250922m85452m37743m68881m48474m27482m13918m53499l82646k76080
10266A2456747l21800l21727k99678l48704l34133l16483k87387j92793j61278
10257I872764k40847k75240j66487k01399k42668j97657k24984j97109j36562
10248G989811j21464r2627j72224k27706j32726q3836j17202j50140j07186j04802
$$ plain form
10309 49090285 47575072 46154183 44794659 43419802 42154590 40932108 39696733 38514131
10301 38514131 37323121 36155994 35018474 33874074 32749001 31676152 30665828 29703609
10293 29703609 28765694 27811347 26844808 25901388 25014658 24186392 23369973 22652221 21955082
10284 21955082 21239025 20499051 19796509 19146418 18501530 17937050 17367294 16791176 16250922
10275 16250922 15765470 15327727 14858846 14410372 13982890 13568972 13115473 12732827 12456747
10266 12456747 12134947 11813220 11513542 11164838 10830705 10514222 10226835 10034042 9872764
10257 9872764 9631917 9356677 9190190 8988791 8746123 8548466 8323482 8126373 7989811
10248 7989811 7868347 7775720 7603496 7375790 7243064 7159228 7042026 6891886 6784700 6679898
10238F679898j09324r6728r5888j62744j39689j43479m3649l1539q4523r6442
10228E675893l6189r2474j00518p1860J3526k4280j08982o9820l3553m6018l3276
10217E072449j129k3049j20399j32073p5550k5342L3019J274n7171o8667q0306
10206D523056j3152k0161n4947l3754n1857p7693n7650Q695k2067n8596j00108
10195D041766o3182k0309m2296n2496n944k8869n5228p32j9281r2021q4917m9328
10183C527163p924J0247l2300m5112r891K66l6309k3207k7136J1257J0548o144
10171C371458p0279l4416j5972j3705o8320k9568l0192o9503j6186J2431k3754
10160C011994o5728m2066J8386k719K5978q354q9091o3270l6403K644j2768j6675
$$ plain form
10238 6679898 6570574 6473846 6377958 6215214 6075525 5932046 5888397 5856858 5772335 5675893
10228 5675893 5639704 5547230 5446712 5374852 5388378 5364098 5255116 5185296 5151743 5105725 5072449
10217 5072449 5071320 5048271 4927872 4795799 4720249 4694907 4727926 4729200 4672029 4603362 4523056
10206 4523056 4509904 4489743 4434796 4401042 4349185 4271492 4213842 4222537 4200470 4141874 4041766
10195 4041766 3978584 3958275 3915979 3863483 3857539 3828670 3773442 3772710 3753429 3661408 3576491 3527163
10183 3527163 3519239 3529486 3497186 3452074 3442183 3442449 3406140 3382933 3355797 3367054 3377602 3371458
10171 3371458 3301179 3266763 3250791 3237086 3168766 3139198 3109006 3039503 3023317 3035748 3011994
10160 3011994 2946266 2904200 2922586 2919867 2945845 2937491 2848400 2785130 2748727 2751371 2738603 2721928
10148B721928j04146o8194k1498j0831m3114J1355o6944l6369Q834k8439m4157
10137B318425m5221o063l2094k3387j8175k4937l8534o5638l5235K2437m8266
10126B003312n9592j09876n2043L2210O4834O3515n2334l1588m2918n1784o8034
10115A695702r2155j1950K5421K0982j8424l4284k9473p731R875J6728k9258p7456
10103A467977r81J5902J4802l9801m1067m486J1433O002j6153j5293n791k528
10091A390016O2037m272j1222n0061n2389L766k5809m3305J113j764k5681L4798
10079A277227L0951k6001k9115L6566k6507k3451K8788L033p143O1819M3839L7818
10067A407824m217N20Q154R4338J44903L8548R360R0438R1448O2755P9413J7346
$$ plain form
10148 2721928 2617782 2549588 2528090 2517259 2474145 2485500 2418556 2382187 2391021 2362582 2318425
10137 2318425 2273204 2267141 2235047 2211660 2193485 2168548 2130014 2064376 2029141 2051578 2003312
10126 2003312 1943720 1833844 1781801 1814011 1878845 1942360 1890026 1858438 1815520 1763736 1695702
10115 1695702 1603547 1591597 1617018 1638000 1619576 1585292 1555819 1548088 1557963 1574691 1545433 1467977
10103 1467977 1466996 1482898 1497700 1457899 1416832 1412346 1423779 1429781 1413628 1398335 1392544 1390016
10091 1390016 1452053 1447781 1436559 1386498 1334109 1337875 1312066 1268761 1269874 1268110 1242429 1277227
10079 1277227 1308178 1282177 1253062 1289628 1263121 1239670 1268458 1271491 1264348 1326167 1370006 1407824
10067 1407824 1403607 1404127 1412281 1506619 1651522 1690070 1699430 1789868 1881316 1944071 2023484 2040830
10055B040830P5214L0284k0164K3105J18725J73549K81513M19797N65272Q57326
10045D565451J322654J954258K317919J017979j967359k399643j559134r40046
10037D312079n69584l78047k94542k11092j20090j01340j32982j07579r0217j0904
10027B295702O557q1043q0399o3838o2038l2483n4660j2254J5505m8547j9177
10016A863325J3222m299J6184N5915O0610l139r43J5326k5174m3916Q12l9335
10004A908588l3995k8155j4883q2000n1625l8537k5374q0604l2065M7965n0379
9993A518936k2292P041p403k6561j4079k4139p040L9113M7999O851n2181M1026
9981A507271o036q2190l1828J0154J580o393J9893l2248p2298k5253K9149L0451
$$ plain form
10055 2040830 2116044 2146328 2126164 2149269 2267994 2441543 2723056 3142853 3708125 4565451
10045 4565451 5888105 7842363 10160282 11178261 9210902 6811259 5252125 4312079
10037 4312079 3742495 3364448 3069906 2858814 2738724 2637384 2504402 2396823 2306606 2295702
10027 2295702 2302259 2221216 2140817 2076979 2014941 1982458 1927798 1915544 1931049 1882502 1863325
10016 1863325 1876547 1872248 1888432 1944347 2004957 2001818 2000875 2016201 1991027 1947111 1947923 1908588
10004 1908588 1874593 1846438 1831555 1749555 1697930 1659393 1634019 1553415 1521350 1569315 1518936
9993 1518936 1496644 1503685 1496282 1469721 1455642 1431503 1424463 1463576 1511575 1518426 1466245 1507271
9981 1507271 1501235 1419045 1387217 1397371 1398951 1392558 1412451 1380203 1307905 1282652 1311801 1342252
9969A342252p86m6381L9460L4270l1052j6375K5320k0349K3992M7491L8056o598
9957A429300J0384O0462o014J3259K0488r802j673N4273N1124L9838K5724N046
9945A692409L6960J3607J3355P1419O5108K8999M0557P2289M8662L3206R869O1688
9933B188128J71657L04123M38747N90490Q58021J090148J030326K34512p28002
9924F178150j166336r60886n88508l79456l20359k19207j22652q2213r0165p5275
9914B173093n1977j18273j30085n5802j9335n0429l7316k2758L299p4761q1060
9903A534596m0539j537K0096k1043k1134j0584o8149J5565L184J1360P776j0164
9891A419427p5276p7381l7599m3174m6961n2160m5730N7671K4096J5161m0571
$$ plain form
9969 1342252 1341466 1295085 1334545 1368815 1337763 1321388 1346708 1326359 1350351 1397842 1435898 1429300
9957 1429300 1439684 1500146 1494132 1507391 1527879 1518077 1516404 1570677 1621801 1661639 1687363 1692409
9945 1692409 1729369 1742976 1756331 1827750 1892858 1921857 1962414 2034703 2083365 2116571 2126440 2188128
9933 2188128 2359785 2663908 3102655 3693145 4551166 5641314 6671640 6906152 6178150
9924 6178150 5011814 4050928 3462420 3082964 2762605 2543398 2420746 2338533 2248368 2173093
9914 2173093 2121116 2002843 1872758 1816956 1797621 1747192 1709876 1687118 1690417 1615656 1534596
9903 1534596 1494057 1492520 1512616 1491573 1470439 1459855 1391706 1407271 1410455 1421815 1429591 1419427
9891 1419427 1344151 1266770 1229171 1185997 1139036 1086876 1041146 1098817 1122913 1138074 1097503
9880A097503p1929q3766m5721r451p7896n0591N608j3677m7437N2769k8070K241
9868G29583j5360p521M0892J5536l0188m3563k9282l6245J3196M546j0767l941
9856F26886K356l9681K775K0588O562k5923l5116J3020J9137o075m2082k4657
9844E17790j0586J2108O0165k7129n1476n2609m0828K0872N4969J6592j2708k2346
9832D64814o273J5283j945n0760l4107k0203l7864j0642k4065k7307L1348N2394
9820C50673K8304K1732K2229P715J7252L157k5654m6360k028K7n026n2338l7373
9807B82310K4157P2522J9752m2730R284J2864j4209l4924P59j0173j6560J9846
9795C22898Q730j6630j3656K7602M4364L9397j5036o7156l3337M0592q013o078
$$ plain form
9880 1097503 1025574 941808 896087 886636 808740 758149 763757 750080 702643 755412 727342 729583
9868 729583 714223 706702 747594 763130 732942 689379 660097 623852 637048 641594 630827 626886
9856 626886 629242 589561 592336 612924 619486 593563 558447 571467 590604 584529 542447 517790
9844 517790 507204 519312 579477 552348 500872 448263 407435 428307 483276 499868 487160 464814
9832 464814 458541 473824 471879 421119 387012 366809 328945 318303 294238 266931 298279 350673
9820 350673 378977 400709 422938 430653 447905 451062 425408 379048 377020 377047 372021 319683 282310
9807 282310 306467 378989 398741 356011 365295 378159 363950 329026 329785 319612 303052 322898
9795 322898 331628 314998 301342 328944 373308 412705 397669 330513 297176 337768 329755 323677
9783C23677k3386N1987J6954m264J4162J5197l110M4816k5495j0993k6110j4182
9771C59253j3969k9820k9030K8896n315k3407O353K4006N0575J7640O729J8667
9759D10578K203l0452q2k0018L089k5471k3062M1127M009l5468J1573K2601J4612
9746C75239J8832p4380l0157N30P6969P0365m1837m8754L945l3146j7710J3231
9734C13127M0139M2834k3650j9829k154N3637l859j077o3700n0381J535L2888
9722C19510j8715j4424L0569M3687l9195r577j4633j7437J9562m7260j8601J493
9710B34979k7811J450O5555K2603k7577k2945N9540k8469j3161k8846K541L0785
9698B68644j4406P29K0229K9850J8064n1556O599J5357k9796J3712M5892l548
$$ plain form
9783 323677 300291 352278 369232 364968 379130 394327 391217 436033 410538 399545 373435 359253
9771 359253 345284 315464 286434 315330 310015 286608 292961 316967 367542 385182 391911 410578
9759 410578 412781 382329 382247 362229 365318 339847 316785 357912 361921 326453 338026 360627 375239
9746 375239 394071 319691 289534 290064 367033 437398 395561 346807 350752 317606 299896 313127
9734 313127 353266 396100 372450 352621 350467 404104 400245 399168 335468 285087 286622 319510
9722 319510 300795 286371 316940 360627 321432 311855 297222 279785 299347 252087 233486 234979
9710 234979 207168 208618 274173 296776 269199 246254 305794 277325 264164 235318 237859 268644
9698 268644 254238 254967 275196 305046 323110 271554 278153 293510 263714 277426 323318 319770
9686C19770K4272J9415j0116j5403l0638m2128k8555k993M7640M2609K7301n4034
9674B97140m7079m4536K2282k6560J1857L5266k9820P212L0762N702J8550Q9106
9662C69882l0177K038j0431k2535J7542k1803k123J1329m2946N2877J3064k4581
9650C12136J2887q701Q918k2632J9484L2235j2119L7662K9855o3893J0453L5360
9638C91645l7730N641L9701M074n3646l0837m839M1391N6447K3554j1413o2275
9626C61713m7269J5963K2920m2078o2440l6693J654L3644O5797j98J7576J5724
9614C46313j4576k6543M8260J8172Q9q1768k541J0307K2872J1078L0617J9496
9602C81776J0605n8254n5105L2239M5403j0915M2822L8221R308l8923l0679j3409
$$ plain form
9686 319770 344042 363457 353341 337938 307300 265172 236617 233624 281264 323873 351174 297140
9674 297140 250061 205525 227807 201247 213104 248370 218550 225762 256524 262226 280776 369882
9662 369882 339705 341743 331312 308777 326319 304516 302393 313722 270776 323653 336717 312136
9650 312136 325023 316322 325240 302608 322092 354327 342208 379870 409725 345832 356285 391645
9638 391645 353915 359556 399257 403331 349685 318848 314009 355400 411847 435401 423988 361713
9626 361713 314444 330407 353327 311249 248809 212116 213770 247414 313211 313013 330589 346313
9614 346313 331737 305194 353454 371626 371715 289947 287406 297713 320585 331663 362280 381776
9602 381776 392381 334127 279022 311261 356664 345749 388571 426792 436100 397177 366498 353089
9590C53089n521K4954l9698J4576J0826J2178N2511M2838L5748P0234Q732l0569
9578E49898l5190o0326k2927O196K0048n119j1l7838n575O42O536K6108O795M96
9564D49733L4255k7962p1765K4160M0919q315P9505O7568q5121l253P5752L6068
9552F11544k0173j0867M5874N6796k5272K9668N341K6731K2129M6956k346k5684
9540G60697m5579L6562N3442j434j5992n927l7670J414J7432l3535m160l1490
9528F93760l2235M8232L739l5677L4620M5009K620j8913l3439M1197R468j2458
9516G45923J4993Q4579P8640r763J8419N6503R879P008J8404K0324M9800m154
9504A090555K4994J240l4065p4215l2796n796O3417N6258n6703p5623k9405L4384
$$ plain form
9590 353089 347568 372522 332824 347400 358226 370404 422915 465753 501501 571735 580467 549898
9578 549898 514708 454382 431455 437651 457699 452580 452569 414731 409156 409798 416334 442442 449237 449733
9564 449733 483988 456026 384261 408421 449340 441025 520530 588098 502977 499724 575476 611544
9552 611544 591371 580504 626378 683174 657902 687570 692911 719642 741771 788727 786381 760697
9540 760697 715118 751680 805122 803688 787696 781769 744099 745513 762945 729410 725250 693760
9528 693760 661525 709757 713496 677819 712439 757448 760068 741155 707716 748913 758381 745923
9516 745923 760916 845495 924135 914372 932791 989294 999173 1006181 1024585 1044909 1094709 1090555
9504 1090555 1115549 1116789 1082724 1008509 975713 969917 1033334 1089592 1032889 957266 927861 962245
9492I62245k1769j7620l6134k3528k3954m6559n3364M1957J5604j5981N1423L7494
9480H69814L9321l857o1164K6289P5314m7430j6326P387j8623j7078L5113K7777
9468I16537j2929L3157j346M067J5244k1596l8852k8690j4588o0290n096J8529
9456H04147m5724o6078n8372j5195K0999O206n2390Q455o349l6785O090M7162
9444F12166K5586l4984p096m3542J712L4763K3819L6425L8781L4838O313j3755
9432G15026m398J4126K7357k9321j4276K194m2258q2467j4834l2860j8835k6812
9420D92642K241l5208m6674j2875k9749J7025L3461L0162Q0486k3160j144L22
9408E07529R104O3631M0174q2907n1540J8844N0360M4648K0063P573k0209L75
$$ plain form
9492 962245 940476 922856 886722 863194 839240 792681 739317 781274 796878 780897 832320 869814
9480 869814 909135 905278 844114 870403 945717 898287 881961 889348 870725 853647 888760 916537
9468 916537 903608 936765 935419 939486 954730 933134 894282 865592 851004 790714 785618 804147
9456 804147 758423 692345 633973 618778 639777 645983 593593 602048 595699 558914 565004 612166
9444 612166 637752 602768 595672 552130 553842 588605 612424 648849 687630 722468 728781 715026
9432 715026 710628 724754 752111 722790 708514 710708 668450 585983 571149 538289 519454 492642
9420 492642 494883 459675 413001 400126 370377 387402 420863 451025 531511 508351 507207 507529
9408 507529 516633 580264 620438 537531 485991 504835 555195 599843 619906 627479 607270 607645
9396F07645N3179k6780n3757M1925L5051j8463J8867L2552j0491l9078j7369l7208
9384E86073L2517l0115j6797J4807N4043M2493k5220m381J1778J4480l3719J2027
9372F57986M4426J5671k0790P284p677K3206O162N4272l0223l1780N2152L2499
9360H03188N6708j2159p6258n9032R415M500L9708L6291r4970J0O4326J5633J5410
9347H02770L1171L7175J3379K0224j898o8166m7816j2944n552L9779J5481K4677
9335H48280M419j2028k0222O6294Q5523L950q719K0498R3739K965m880j6629J7574
9322A080764j2225J3026k7535L227k4484k0658J504l984J8024K9533P486m8286
9310A016392K3246J8069l1836J9039j3985j5894K4055J981L818O843L6927J8067
$$ plain form
9396 607645 660824 634044 580287 622212 657263 638800 657667 690219 679728 640650 623281 586073
9384 586073 618590 588475 571678 586485 640528 683021 657801 653420 665198 679678 645959 657986
9372 657986 702412 718083 697293 704577 696900 720106 726268 780540 750317 718537 770689 803188
9360 803188 859896 847737 771479 712447 721862 726362 766070 802361 707391 707401 771727 787360 802770
9347 802770 833941 871116 884495 904719 902821 834655 786839 773895 768343 808122 823603 848280
9335 848280 852699 840671 820449 886743 972266 976216 967497 987995 1081734 1084699 1079819 1063190 1080764
9322 1080764 1068539 1081565 1054030 1057257 1032773 1012115 1013619 1009635 1027659 1057192 1064678 1016392
9310 1016392 1039638 1057707 1025871 1044910 1030925 1015031 1039086 1041067 1044885 1051728 1088655 1106722
9298A106722K7140J3483M3810L630l3739P6874M231R977K0971J7175O3818k6240
9286A327852l9907K1252K7502M460q135K9299J4414k4070p993L5587N7063j2983
9274A424341l264K6794K5194m05l4987O8450P5121L3900M6937j9432J665l666
9262A640648M0732N0749P727j0221J3310K9216O936J8809K7386N3934K8944N825
9250A913995K4681M4061J4629J7924K9115k4718M491k920J085M3861M6367O7095
9238B179666P5591N7385O6614O9459k1553l8766Q8341J16773M1476O1484P3489
9227B769959P1435N2977J1103R017O1525Q7090N8418N8092Q6834J14776Q0741
9216C461967J08917Q6335P2603J13727J20013J85927J80507J44080J54565J92640
$$ plain form
9298 1106722 1133862 1147345 1191155 1194785 1161046 1237920 1242151 1252128 1273099 1290274 1354092 1327852
9286 1327852 1287945 1309197 1336699 1341159 1333024 1362323 1376737 1352667 1344674 1380261 1437324 1424341
9274 1424341 1421077 1447871 1473065 1472660 1437673 1506123 1581244 1615144 1662081 1642649 1644314 1640648
9262 1640648 1681380 1732129 1739856 1729635 1742945 1772161 1779097 1797906 1825292 1879226 1908170 1913995
9250 1913995 1938676 1982737 1997366 2015290 2044405 2019687 2024178 2021258 2022343 2066204 2112571 2179666
9238 2179666 2255257 2312642 2379256 2448715 2427162 2388396 2476737 2593510 2634986 2696470 2769959
9227 2769959 2841394 2894371 2905474 2914491 2976016 3063106 3121524 3179616 3266450 3381226 3461967
9216 3461967 3570884 3657219 3729822 3843549 3963562 4149489 4329996 4474076 4628641 4821281
9206D821281K06511K15275K62397K19535K75640L76031N16781M71928M63069M95210
9196H323658O31008O90254P67352Q05239R07729R82753J142909J212531J353879
9187A6817312J483319J719572J774046J842584J862325J792283J534578J037317
9179B9863336M48132j50500o89270r32281q97621p94649n97659l87690j97306
9170B5664492Q1110L09620N52336P63269J002444J319873J580458J753866J922177
9161C4949645K092846K274079K485598K636729K930223L177067L498217L636600
9153E7681004L678887L500149L242523K954928K629652K265622K009209J803374
9145G9765348J534968J437278J156402Q12376L92863j36509o45642r41381j100637
$$ plain form
9206 4821281 5027792 5243067 5505464 5724999 6000639 6376670 6893451 7365379 7828448 8323658
9196 8323658 8954666 9644920 10412272 11217511 12125240 13107993 14250902 15463433 16817312
9187 16817312 18300631 20020203 21794249 23636833 25499158 27291441 28826019 29863336
9179 29863336 30311468 30160968 29471698 28539417 27641796 26847147 26249488 25861798 25664492
9170 25664492 25745602 26055222 26607558 27370827 28373271 29693144 31273602 33027468 34949645
9161 34949645 37042491 39316570 41802168 44438897 47369120 50546187 54044404 57681004
9153 57681004 61359891 64860040 68102563 71057491 73687143 75952765 77961974 79765348
9145 79765348 81300316 82737594 83893996 84706372 85099235 84962726 84317084 83375703 82275066
9136H2275066j098468r92888q12302o60455m32404m8356L95126P72551J207117
9127H0604987J637744J965960K246605K538168K755775K982992L266479L528267
9119A01526977L719113L956731M153988M239351M160759M034105L865669L672828
9111A33329521L441361L014861K328769J409903K3632j484488k611091l448748
9103A36003720l922927m084722m047946l893511l523443l042440k598822k163911
9095A08725998j706810j295612r52576m76754o3233K73712N77208Q96983J183128
9086A07162044J457160J780345K180719K413105K588991K651739K604076K404665
9078A25242844K085121J640057J043280L63100n55936j371522k284174l097256
$$ plain form
9136 82275066 81176598 80183710 79371408 78710953 78278549 78230193 78625319 79397870 80604987
9127 80604987 82242731 84208691 86455296 88993464 91749239 94732231 97998710 101526977
9119 101526977 105246090 109202821 113356809 117596160 121756919 125791024 129656693 133329521
9111 133329521 136770882 139785743 142114512 143524415 143548047 142063559 139452468 136003720
9103 136003720 132080793 127996071 123948125 120054614 116531171 113488731 110889909 108725998
9095 108725998 107019188 105723576 104771000 104294246 104231013 104504725 105081933 105978916 107162044
9086 107162044 108619204 110399549 112580268 114993373 117582364 120234103 122838179 125242844
9078 125242844 127327965 128968022 130011302 130374402 129818466 128446944 126162770 123065514
9070A23065514l719862m087386m270150m290927m120075l914902l771054l405843
9062I1485315l089603k878562k673005k416313k172511j969806j769530j499904
9054G3016081j293522j046399p75928m86255j66150J24401L44730M64453N72553
9045G0753964M25151J13484k13144m16876o94329j212438j752876k263903k576398
9036F2162635k742836k796466k665676k424957k176326j964266j881628j739837
9028D3770643j626930j663355j656057j644278j572103j514257j501434j380205
9020C1212024j255149j189959j085012r76923r53140q29934q00209p19933o13964
9011B2787801o04530n55736n46507n42238n50570n82555o10273n83269m92907
$$ plain form
9070 123065514 119345652 115258266 110988116 106697189 102577114 98662212 94891158 91485315
9062 91485315 88395712 85517150 82844145 80427832 78255321 76285515 74515985 73016081
9054 73016081 71722559 70676160 69900232 69413977 69247827 69372228 69716958 70181411 70753964
9045 70753964 71179115 71292599 71079455 70662579 69968250 68755812 67002936 64739033 62162635
9036 62162635 59419799 56623333 53957657 51532700 49356374 47392108 45510480 43770643
9028 43770643 42143713 40480358 38824301 37180023 35607920 34093663 32592229 31212024
9020 31212024 29956875 28766916 27681904 26704981 25751841 24921907 24121698 23401765 22787801
9011 22787801 22183271 21627535 21081028 20538790 19988220 19405665 18795392 18212123 17719216
9002A7719216n00795n35255m90790m18754m26304m09267l34812k66511k22127
8993A4114601k68864k66356j93475j15300j06727j55650k04421j86802q6924n3307
8983A2476775p3182m2721M331N1639O9393J64955K25165J72704J86482K66617
8973A3502158K83296L68051M54707M81960M76915N48500N74393O41275N53859
8964A7885114N84293O24596O45490O91386P19724O80509O89579P49846P58591
8955B4029128P68932Q24687Q48338R35880R94513J001786R68503R78643Q68983
8946C2219393O36336M16101K57478J47464n7035k06289j05510N0509K63017M68070
8936C4089534O23762P80920Q20157Q58613Q13164O97596O18721N46876M90186
$$ plain form
9002 17719216 17218421 16683166 16192376 15773622 15347318 14938051 14603239 14336728 14114601
8993 14114601 13845737 13579381 13385906 13270606 13163879 13008229 12803808 12617006 12530082 12476775
8983 12476775 12403593 12360872 12365203 12416842 12486235 12651190 12876355 13049059 13235541 13502158
8973 13502158 13785454 14153505 14608212 15090172 15567087 16115587 16689980 17331255 17885114
8964 17885114 18469407 19094003 19739493 20430879 21150603 21831112 22520691 23270537 24029128
8955 24029128 24798060 25622747 26471085 27406965 28401478 29403264 30371767 31350410 32219393
8946 32219393 32855729 33271830 33529308 33676772 33619737 33413448 33307938 33358447 33621464 34089534
8936 34089534 34713296 35494216 36314373 37172986 37986150 38683746 39302467 39849343 40339529
8927D0339529N30805N78343O99364P17445P99714J015564J109788J263902J397111
8918D8451565J496670J458106J414339J325808J130740R02043O80004M12190K59538
8909E7531003J46369N8891p6689j44202k14055l46304m72781n59798n88380o47104
8899E4686950p01831p64540p43826o15847m52566l61420j68427K225K01494M15807
8889E1498019O38137P97016J011518J203312J318318J328592J387250J293248
8881F0475410R98382O54646L24270J5790k55571n21888q10126r67858j044002
8872E8869053j038312j050736j092129j120779j132114j083969r88080r21334
8864E0441600q80779q23553o75522n81517m95714m52231n81991o57804o75762
$$ plain form
8927 40339529 40870334 41448677 42148041 42865486 43665200 44680764 45790552 47054454 48451565
8918 48451565 49948235 51406341 52820680 54146488 55277228 56179271 56859275 57271465 57531003
8909 57531003 57677372 57736263 57659574 57515372 57301317 56955013 56482232 55922434 55334054 54686950
8899 54686950 53985119 53220579 52476753 51860906 51408340 51046920 50878493 50880718 51082212 51498019
8889 51498019 52136156 52933172 53944690 55148002 56466320 57794912 59182162 60475410
8881 60475410 61473792 62128438 62452708 62468498 62212927 61691039 60880913 59913055 58869053
8872 58869053 57830741 56780005 55687876 54567097 53434983 52351014 51362934 50441600
8864 50441600 49560821 48737268 48061746 47480229 46984515 46532284 45950293 45292489 44616727
8855D4616727p15972p33087o77912n55747m76342l81191l17708k44829j62258
8846D0351681j89867k54960l63484m24282m65428m70536m55786m42729m43126
8837C6841483m12262l89519m28604m95846n63617p47482r05285r89250j131233
8828C0778385j192916j188039j126303j064462j019767r37430q95696q51557o63573
8819B1838642n81486n53244l94501l66484l81868k48258k69095k52425k57600
8810A8533681l05077m38077m80438m20626m29938m33260l31926k37227l11775
8801A5145337l40459l54308l13380l89181m79304n35319n71350n65260m56369
8792A1140407m64329m39120m31583l52918l22094l40325l97522l30359k40235
$$ plain form
8855 44616727 43900755 43167668 42489756 41934009 41457667 41076476 40758768 40513939 40351681
8846 40351681 40161814 39906854 39543370 39119088 38653660 38183124 37727338 37284609 36841483
8837 36841483 36429221 36039702 35611098 35115252 34551635 33804153 32898868 31909618 30778385
8828 30778385 29585469 28397430 27271127 26206665 25186898 24249468 23353772 22502215 21838642
8819 21838642 21257156 20703912 20309411 19942927 19561059 19312801 19043706 18791281 18533681
8810 18533681 18228604 17790527 17310089 16889463 16459525 16026265 15694339 15457112 15145337
8801 15145337 14804878 14450570 14137190 13748009 13268705 12733386 12162036 11596776 11140407
8792 11140407 10676078 10236958 9805375 9452457 9130363 8790038 8392516 8062157 7821922
8783G821922k15180k17678k54895j95093j87212j17865k08202k06450j33063n9347
8773F026937j58269j54514o8875l2609j2569l3663K398P2692J067r7459j91990
8762E353146k35133k41245k00778j79240j91464j19000j18042j74848j31545j20173
8752C641678n5664q3596o1184k3520K6265n4916j38717o0247j1096m3972m7787
8741C087244l2785J0646r569p6856m6124r889o0204k0234k1485o0210o2195m6393
8729B651946P646L1648k6299o4119p4037j23711m9562K4761k6387m9398m6360
8718B256128l4171Q616K8701k2841q5144l8636m282r607M7921P1348r453k0675
8706B187905k6914l2592K0713M93M6679K7406J514K0864k0818n472k2728p5586
$$ plain form
8783 7821922 7606742 7389064 7134169 6939076 6751864 6633999 6425797 6219347 6086284 6026937
8773 6026937 5868668 5714154 5645279 5612670 5600101 5566438 5568836 5641528 5642595 5545136 5353146
8762 5353146 5118013 4876768 4675990 4496750 4305286 4186286 4068244 3893396 3761851 3641678
8752 3641678 3586014 3502418 3441234 3417714 3443979 3389063 3250346 3190099 3179003 3135031 3087244
8741 3087244 3054459 3065105 3055536 2978680 2932556 2922667 2862463 2842229 2820744 2760534 2698339 2651946
8729 2651946 2659592 2691240 2664941 2600822 2526785 2403074 2353512 2378273 2351886 2302488 2256128
8718 2256128 2221957 2230573 2259274 2236433 2151289 2112653 2108371 2098764 2146685 2218033 2208580 2187905
8706 2187905 2160991 2128399 2149112 2149605 2196284 2223690 2225204 2246068 2225250 2219778 2197050 2121464
8694B121464o0712l9488p9925n1238n6687k3804L416l3104k2762l9220M207l4889
8682A687258K4542Q949o0570o0739l7981j3645J9788m9762l9769L2326L8495r700
8670A539192Q512p788l6716J5085j4480j003N919J4203n240j0294k9287k6388
8658A451715k7644m4556J3056J9063l7411l5809J3556k4616l1194L694k701p074
8646A290079k8695J2708K3821l514L2816l2777l0907k8624J6349J10905M0979
8635A403140K3943O9502J45751J39499K09433J85962L0474j41623k20994j88559
8625A656528j61143j05722q3082m2523l6114n3717p018K0929j2408l1548n6928
8614A087254k170k0110r8913n102M6742k4164k1168O3901L1064j2935L4041p516
$$ plain form
8694 2121464 2060752 2021264 1941339 1890101 1833414 1809610 1813026 1779922 1757160 1717940 1722147 1687258
8682 1687258 1711800 1720749 1660179 1599440 1561459 1547814 1567602 1517840 1478071 1510397 1548892 1539192
8670 1539192 1547704 1539916 1503200 1518285 1503805 1502802 1508721 1522924 1517684 1507390 1478103 1451715
8658 1451715 1424071 1379515 1392571 1411634 1374223 1338414 1351970 1327354 1296160 1299854 1297153 1290079
8646 1290079 1261384 1274092 1297913 1294399 1327215 1294438 1263531 1234907 1251256 1362161 1403140
8635 1403140 1427083 1496585 1642336 1781835 1991268 2177230 2207704 2066081 1845087 1656528
8625 1656528 1495385 1389663 1306581 1264058 1227944 1174227 1167209 1188138 1175730 1144182 1087254
8614 1087254 1085084 1064974 966061 960959 1007701 983537 962369 1026270 1057334 1044399 1078440 1070924
8602A070924m2618n4586n9072m3055Q0256O5298N507q101K2048p256K171K7855
8590A059371K0450j101L037l6635p7087m6764l1144l4685Q432K1911K0372q63
8578I05294K981K0412J0957n6438n2015J2315K8465K1280j0782J1213l4883j5939
8566H42860N326L9032K0908P5703P2721N6605j9486J6398l3720p3370r9496J9595
8554I23076j8915j0773n1871J5531m0862k0906L8364M6097O068l7835q9794J958
8542G60138O675r491M9966o1509r258J5847L4440R6187m853l947K0135M8280K0436
8529I63046P7206M0077J49315J77445J64425K39787R1449j36016j83304j15470
8519A467960q4054o0649j56373j22671o2251l3159m2728n237K1585k0251r542
$$ plain form
8602 1070924 1028306 973720 914648 871593 951849 1017147 1022654 1014553 1036601 1029345 1031516 1059371
8590 1059371 1079821 1078720 1081757 1045122 968035 921271 890127 855442 863874 885785 906157 905294
8578 905294 908275 928687 939644 883206 831191 843506 871971 893251 882469 893682 858799 842860
8566 842860 848186 887218 908126 983829 1056550 1113155 1093669 1110067 1076347 1002977 903481 923076
8554 923076 904161 893388 841517 857048 816186 795280 833644 879741 885809 847974 758180 760138
8542 760138 766813 757322 807288 745779 736521 752368 786808 882995 878142 874195 894330 942610 963046
8529 963046 1040252 1080329 1229644 1407089 1571514 1811301 1902750 1766734 1583430 1467960
8519 1467960 1383906 1323257 1166884 1044213 981962 948803 906075 900838 922423 902172 892630
8508H92630o4949r1856k7274K0212q048p84J0720j656N9553N7145o5144q4472
8496F96077n6921l1222j9957k578O7852J5142p979J7458j5196L0401P3984j5925
8484G51136J280L423l7400m3149P731L5013l7963n220j2134l9278p628L1044m809
8471F42046j9456j872L2414j821n6456r766J3993K406J5343p1218o5979j1197
8459D68437L2027j3950K5770O953j6219l8464m5395k0239K7705O4548K0304m1886
8447D69591n4430j6158N4863J7986J7842l054m0491n0742l733K2669j6293P746
8435D05796L3405M9552J5258o0803j2077N923j9541l7240n1609J4490M3033K639
8423C88826j4465j7724m064K8134L0279l2932K387j096M907k9953k1290o7501
$$ plain form
8508 892630 827681 735825 708551 728763 720715 719931 730651 728995 788548 845693 780549 696077
8496 696077 639156 607934 587977 585399 653251 668393 660414 677872 662676 693077 767061 751136
8484 751136 752416 755839 718439 675290 683021 718034 680071 674851 662717 623439 615811 646855 642046
8471 642046 622590 620718 653132 651311 594855 585089 599082 601488 616831 545613 479634 468437
8459 468437 500464 486514 512284 519237 503018 464554 419159 398920 426625 491173 511477 469591
8447 469591 415161 399003 453866 471852 489694 486640 446149 395407 391674 414343 398050 405796
8435 405796 439201 488753 504011 443208 431131 437054 417513 380273 328664 343154 386187 388826
8423 388826 374361 356637 352573 380707 410986 378054 380441 379345 384252 354299 333009 265508
8411B65508j4345Q495j035J2651j1844K9167M630m0186L3142L8824L213l3268
8399B94952m0407m2617n5565j054J0129l002K2189K2510L833J1746K0349p967
8387B35096L4129j5596l4096k5797J282K8647k5446l1819P422k2296N8158j6612
8375A93072J2213K2591k7579P976m5617n3064m3725M9436K6189L368J3827n3866
8363A04821J4284o566J0858j1277L091k0454M1379K1879q050j1358p932m238J6432
8350A42869J1378k4869K2085L7343K167N5942j6446l1812l8574o233l6574m0781
8338G6495J7819M5150J0992N969J5633M0450K8924J357l9442Q019P148o4312o4302
8325H9900J960o307j5143l7918L2063K1425J7410K7148j2887l0842K4067j0642
$$ plain form
8411 265508 251163 259658 258623 271274 259430 288597 293227 253041 286183 325007 328220 294952
8399 294952 254545 211928 156363 155309 165438 162436 184625 207135 210968 222714 243063 235096
8387 235096 269225 253629 219533 193736 195018 223665 198219 166400 173822 151526 209684 193072
8375 193072 205285 227876 200297 208273 162656 109592 65867 115303 141492 144860 158687 104821
8363 104821 119105 112539 123397 112120 115211 94757 136136 158015 149965 138607 130675 126437 142869
8350 142869 154247 129378 151463 188806 190973 246915 230469 198657 160083 153850 117276 76495
8338 76495 94314 139464 150456 156425 172058 212508 241432 242789 203347 211366 218514 154202 89900
8325 89900 91860 85553 70410 32492 64555 85980 103390 130538 117651 86809 110876 100234
8313A00234m3169K0163J1563N456L20o497j3042k9633l8175N4784O4072k0520
8301A05556m2141J2149L678j0374j5999J1758N2296Q038m4892j703K2090j2847
8289H7609j8126M895q3837J6091M6975L3363J034K4778P861K7131j4815l735M8538
8276A77762P863K089n9008m2237M4463n469l6649O934M5596q459p4867l2548K3031
8263D8501N2725o565k6537o951l5578l3792M7543K0189M0728L5370R003l1227
8251A13409r739k8528L2456q64k1520L85M5020P8790L23n4760n226l8070M072
8238A15748J3330n2201m5298L781L0365l4528l9225J8886P5373K5778o3408m2907
8226E694J5911L8034m3905k0645L4954J7754L1854r954o3663k0536J5697K0241
$$ plain form
8313 100234 57065 77228 88791 94247 94567 88070 75028 45395 7220 62004 126076 105556
8301 105556 63415 75564 79242 68868 52869 64627 116923 124961 80069 78366 100456 87609
8289 87609 69483 74378 -9459 6632 53607 86970 88004 112782 120643 147774 132959 129224 177762
8276 177762 185625 187714 128706 86469 130932 125463 88814 95748 141344 132885 58018 25470 48501
8263 48501 101226 94661 68124 61173 25595 -8197 39346 59535 100263 135633 144636 113409
8251 113409 103670 75142 107598 106734 85214 85599 130619 209409 209732 154972 149746 111676 115748
8238 115748 129078 76877 31579 35360 65725 31197 -8028 10858 86231 112009 48601 5694
8226 5694 21605 59639 15734 -4911 30043 47797 79651 69697 6034 -14502 1195 21436
8214B1436M4540j691L2431j9052k6412O3830N0113n3660l0100p6230m615J24968
8202A25558K9580m894J6233p5494p3333J8795m2086k5491Q192K8631L6898k2113
8190B0476n7151M702N0680Q8280P1958k8313N2808k6583l3346L7304J2291l3091
8178A60015j8857l3732j1942J6680J3724J3910k3985q973J402J4390o3040j9634
8166C9958J3216K1010j7921n420O563J3792l6420J06L0782K6749q438j2388K4318
8153I5907k3182m0382k1149M3303J11m014m5754J1939j5597L3932M5273K2872
8141A03259j9346k0207l9565J0226J7524K276m0105P643N7394M7135l9847j13311
8129b6924l9303k8963M5835Q535j1976M5082P261k7653J4073j203M751N449K3313
$$ plain form
8214 21436 65976 64285 96716 77664 51252 115082 165195 111535 81435 5205 590 125558
8202 125558 155138 150244 166477 90983 17650 36445 -5641 -31132 -22940 5691 42589 20476
8190 20476 -36675 -31973 18707 106987 178945 150632 203440 176857 143511 180815 193106 160015
8178 160015 141158 107426 95484 112164 125888 139798 115813 106840 108242 122632 59592 39958
8166 39958 53174 74184 56263 50843 57406 71198 34778 34884 65666 92415 83977 71589 95907
8153 95907 72725 32343 11194 54497 54608 50594 4840 16779 1182 35114 80387 103259
8141 103259 83913 63706 24141 34367 51891 54167 14062 21705 79099 126234 86387 -26924
8129 -26924 -66227 -95190 -49355 -40820 -52796 -7714 -453 -28106 -14033 -15236 -10485 -5036 18277
8116A8277L2350k9811L3483K6792r251n1772j5757M2386M8569J5135m6026m7596
8104A6779N344k1089K2983Q163J639m1158O179l437K5813O3830l409k4158k9786
8091B7693j4026M0320j1933k6559l6831P0884L7785n6707N5764J8979J122j7032
8079H9459j4721K0014j921o1541k4434N0511L4921k7085l0167q486O808l8130
8067d772k8283N278O7965O761L510J405k3417m131P8365J6824l8316J1071j456
8054I0804L6065m825j4431j3841p232N1026L6693l7979j5912k4131l1602K2987
8042H7622M5502J0446P634m0640j3969L9769L9291n0592m7298M4637K7204n7546
8030I2060L0230J1065L2171O142n7497j5166K7240k7808n5842L4342N7443J3732
$$ plain form
8116 18277 50627 20816 54299 81091 71840 20068 4311 46697 95266 110401 64375 16779
8104 16779 22123 1034 24017 32180 33819 -7339 -1160 -4597 21216 85046 81637 57479 27693
8091 27693 13667 53987 42054 15495 -21336 49548 87333 30626 86390 105369 106491 89459
8079 89459 74738 94752 92831 31290 6856 57367 92288 65203 35036 26550 33358 -4772
8067 -4772 -33055 -27777 40188 46949 50459 51864 28447 24316 102681 119505 81189 92260 90804
8054 90804 126869 122044 107613 93772 86540 137566 174259 136280 120368 96237 64635 87622
8042 87622 133124 143570 151204 110564 96595 136364 175655 125063 77765 122402 149606 92060
8030 92060 122290 133355 165526 171668 114171 99005 126245 98437 42595 76937 134380 148112
8018A48112J3755J6511K7113p7134r0529L674M8027r573l3773N059J8207K6391
8006I5840o1221k8323k7213M1251J11957M0026j7113o9397J7469J3011M7558R715
7994A73560J2481P338n0036K186L5748J3488m3776k2255J2098n4895l3447j2145
7982D0345M578M5283J8352q505Q722r652J8404J011q669m1633O3661K2795n2586
7969A02106l3001L0898Q703J0448J3621J5645k4840O886M4415K7970j0075p2117
7957A20659m7073M3104J8909M784j2018M8726o3215n2528M9872J2347J131R097
7945A33795m6049k445j4098k4285j7145M3440K1835P0936J160n3316k1238R051
7933A01641p159J9700M9366j2409j9874j2244J4916l5517j1175m385m552l1671
$$ plain form
8018 148112 161867 178378 205491 128357 37828 41502 89529 79956 46183 51242 69449 95840
8006 95840 34619 6296 -20917 20334 132291 172317 155204 85807 103276 116287 163845 173560
7994 173560 186041 193379 143343 145529 181277 194765 150989 128734 140832 85937 52490 40345
7982 40345 44923 90206 108558 100053 108775 99123 117527 118538 109869 68236 131897 154692 102106
7969 102106 69105 100003 108706 119154 132775 148420 123580 130466 174881 202851 192776 120659
7957 120659 73586 116690 135599 140383 128365 177091 113876 61348 111220 123567 124698 133795
7945 133795 87746 85301 71203 46918 29773 73213 95048 165984 167144 113828 92590 101641
7933 101641 94482 114182 163548 151139 131265 119021 133937 98420 87245 82860 78308 46637
7921D6637p0605J9610Q2656Q347k7587j5992J5079M1007J6385n6867j2963k3105
7909B2602L0068K2966L7240K3321k2525k5143j3863k043k689J569o28L6623j4228
7896I3270l258M206m4052m6227K1712J8998J9428L4030n5300l5700L8790m8739
7884b842J4847K2588j8362L9756L1425j6470j6496J4100J3275R489m3024k5093
7872B3193J6998K3267p413l3478j3355J5696J3681N5705L664K7664M208K673m3295
7859H9208r0046J2751L3104j7853j0055R764p008j3952K3731N6372p830O1090
7847A39276K3128n2734o942j8049o8284l1168m1848k741K6484R528L7188R977
7835B3815J8363J7829n824j7908J0932J2714M9096N8029n238p8733l8487j3652
$$ plain form
7921 46637 -23968 -4358 78298 86645 59058 43066 58145 99152 115537 58670 45707 22602
7909 22602 52670 75636 112876 136197 113672 88529 74666 72623 69934 71503 70875 107498 93270
7896 93270 90012 94218 50166 3939 25651 44649 64077 98107 42807 7107 45897 -2842
7884 -2842 12005 34593 16231 55987 87412 70942 54446 68546 81821 91310 48286 23193
7872 23193 40191 63458 56045 22567 9212 24908 38589 94294 97958 125622 129830 132503 89208
7859 89208 -838 11913 45017 27164 17109 26873 19865 5913 29644 86016 78186 139276
7847 139276 162404 109670 102728 84679 16395 -14773 -56621 -59362 -32878 -23350 13838 23815
7835 23815 42178 60007 54183 36275 47207 59921 109017 167046 161808 83075 44588 30936
7823C0936j3115m2607K5227J6272K4014K328j711j8541R552K3534k2586k1840
7811A1463k9813j4796J6230K2249n195m6632o655L845R4246m7808n8961K5866
7799c5961J4335J7382q851l8251j0479n893k3083N148l7354J1111N9898P1605
7787A9607J9424m1471m4259l4247L3876j9904n694Q504j4851k0793K2997L8295
7775c8516N8653P935k9307q040j357P930J9772j9863l0371n457K8863J5464r294
7762c588J492l0516j7287o335r978P8780j4837n9799J6532k317P882L6355K0744
7749A7128j5002l6052N425J2030l519o4930m0779P7643N7202j9566k5256m7724
7737h3400L964L8654M9673n98J1049o1154l0510M6551M1137K2979k3310j913l1897
$$ plain form
7823 30936 17821 -24786 441 16713 40727 43055 41344 22803 32355 55889 33303 11463
7811 11463 -18350 -33146 -16916 5333 138 -46494 -53149 -49304 44942 -2866 -61827 -35961
7799 -35961 -21626 -4244 -13095 -51346 -61825 -67718 -90801 -85653 -123007 -111896 -51998 19607
7787 19607 39031 -2440 -46699 -80946 -47070 -66974 -72668 -64164 -79015 -99808 -76811 -38516
7775 -38516 20137 28072 -1235 -9275 -10632 -2702 17070 -2793 -33164 -38621 -9758 5706 -3588
7762 -3588 -2096 -32612 -49899 -56234 -66212 12568 -2269 -62068 -45536 -47853 -39971 -3616 17128
7749 17128 2126 -33926 -28501 -16471 -19990 -84920 -125699 -48056 9146 -10420 -35676 -83400
7737 -83400 -79436 -40782 8891 8293 19342 -41812 -72322 -25771 15366 38345 15035 13122 -18775
7724a8775q740k783j980L4192J8382k1846j2273K6112K6017K9793o3566n5494
7712e0961J3816L7375P445P103J2775K6404n3957l7952n7995k3310l2679R5822
7700e6114M5659k0736j81p652J2380K3999j4628m7184k0830L7145j0238n914M1516
7687b2778M949P044j478j4764j7572j7816M7049K0737l209j1195J5517j3273j2292
7674a9081J2649k8205o0387J9997N8879M3208O2247l2688m1207k720q160o719
7662b187K0558P349n4426n0391R142R674j6174L5494J4531K2627p144L0027J8119
7649C7199j4773n927o804k4742L9543J716l8084p4639l6691K8559O1869L638j4563
7636d3699P5670Q385j8116l8148k3659J0110L5927J7042j5640l341l7128j869
$$ plain form
7724 -18775 -27515 -30298 -32278 1914 20296 -1550 -13823 12289 38306 68099 4533 -50961
7712 -50961 -37145 230 7675 14778 27553 53957 0 -37952 -95947 -119257 -151936 -56114
7700 -56114 -10455 -31191 -31372 -39024 -26644 -2645 -17273 -64457 -85287 -48142 -58380 -64294 -22778
7687 -22778 -17829 -10785 -12263 -27027 -44599 -62415 -15366 5371 2162 -9033 6484 -6789 -19081
7674 -19081 -6432 -34637 -95024 -75027 -16148 27060 89307 56619 15412 12692 4532 -2187
7662 -2187 18371 25720 -28706 -79097 -69955 -60281 -76455 -40961 -26430 -3803 -10947 19080 37199
7649 37199 22426 16499 9695 -15047 24496 26212 -11872 -86511 -123202 -94643 -32774 -29136 -43699
7636 -43699 31971 40356 22240 -15908 -39567 -29457 6470 23512 7872 4531 -32597 -34466
7624c4466K2622j2961J1424K1014k3047J462L3405J3886m287o8263n1380j0203
7612a00794J7749K767J0897J4134k8702Q170M5439j237L2484l7918n5465M2264
7600e0212L3076J8479O49j4875K9977j8630k0958r527j8754M522J8945j5549N867
7587c6990J3134K104M0344j5663k7108N667P540J880K1450L4364n8550l0084K1834
7574b0078j6736J4265R765J0292n6772o181M0461M5276K0715k6933J7167j8183
7562A3058k6553r4611j4558J5371k2813K3388N1608N950P321O8661P38j142K647
7549B9065o3568k7979N7487L8705K7084l3397l0864n3258J7577P5010k749n4495
7537b1382N0069K143K5172j8537n3965j6583j505K0926k825n5285k5582O0507
$$ plain form
7624 -34466 -11844 -24805 -13381 7633 -15414 -13952 19453 33339 29052 -39211 -90591 -100794
7612 -100794 -83045 -80278 -69381 -55247 -83949 -75779 -30340 -31577 907 -37011 -92476 -50212
7600 -50212 -17136 1343 1992 -12883 17094 -1536 -22494 -32021 -50775 -46253 -27308 -42857 -36990
7587 -36990 -23856 -21752 18592 2929 -24179 -18512 -10972 -9092 12358 46722 -11828 -41912 -20078
7574 -20078 -36814 -22549 -12784 -2492 -59264 -65445 -24984 20292 41007 14074 31241 13058
7562 13058 -13495 -108106 -122664 -107293 -130106 -106718 -55110 -49160 -41839 26822 27560 26418 29065
7549 29065 -34503 -62482 -4995 33710 60794 27397 -3467 -56725 -39148 35862 33113 -21382
7537 -21382 28687 30830 56002 37465 -16500 -33083 -34588 -13662 -16487 -71772 -97354 -36847
7525c6847O8900J9995m7228l4428p3356j3948N7003K167N501k6700k8649j7114
7513a24704N9186J04639K1026m6883l8764M2784o06o145K3016j412J926r2945
7501e8882j5483j1893K2566K7977m6641j8743q828K5941j566J3069O2747n1761
7489f1497l2952R2592L8989J4287j5264m4530l9421K7458N281q379J1643M8247
7477C6454J9009n259k5167o383k3734j8086l9155n5700P8416R2475k3640o5139
7465c5909O143L9780j7430J5179l3331p0092R6037M0709j2990o400j7089k5210
7453b0603j1331J8517K0470l7214j7226J2253k1368l0630l5703J0561N6404j1217
7441f7087n486J2856j0982K0074N321L1924J6422K8795j9375n5728p1189k6550
$$ plain form
7525 -36847 32053 52048 4820 -29608 -102964 -116912 -59909 -57742 -52241 -78941 -107590 -124704
7513 -124704 -65518 39121 60147 13264 -25500 17284 16678 10533 33549 32137 34063 -58882
7501 -58882 -74365 -86258 -63692 -35715 -82356 -101099 -109927 -83986 -85552 -72483 -9736 -61497
7489 -61497 -94449 -1857 37132 51419 36155 -8375 -47796 -20338 -15057 -23436 -11793 36454
7477 36454 55463 50204 25037 18654 -5080 -23166 -62321 -118021 -39605 52870 29230 -35909
7465 -35909 -29766 10014 -7416 7763 -25568 -95660 377 41086 28096 21696 4607 -20603
7453 -20603 -31934 -13417 7053 -30161 -47387 -35134 -56502 -87132 -122835 -112274 -55870 -67087
7441 -67087 -72573 -59717 -70699 -50625 -45304 -13380 3042 31837 12462 -43266 -114455 -141005
7429a41005J7161P792M5817P3262j2854l1740M3657n4614l4553M8464Q047j1776
7417d2342R911J5876J3151N7452M0983K5546p4886k7689M3571j6037k5052l426
7405A7058K0125K5342k6896K7496N2513k1063o8435l1072P0685k8103j1782L2083
7393E7951n647n5662l238R518L0216j655R047k3013j3266J2355P834j524K4619
7380D7535J163j2995k2657n7031Q8226Q8311n2565o7466n2731k4718o15J2045
7368e3498o212l9455P295j0056J9217O004n726J9717M1948J2407m5162k120Q0414
7355B4773J8535n3507L058K2613L4071k5925q9233j05134O103l1344K0045M1198
7343a34747K1520K0401L0652L8071J2935J5343m3159J0897M6310L0526L3486j6575
$$ plain form
7429 -141005 -123844 -116052 -70235 3027 -9827 -41567 2090 -52524 -87077 -38613 -30566 -42342
7417 -42342 -32431 -16555 -3404 54048 95031 120577 45691 18002 61573 45536 20484 17058
7405 17058 37183 62525 35629 63125 115638 94575 26140 -4932 65753 37650 25868 57951
7393 57951 52304 -3358 -6596 2922 33138 31483 40530 17517 4251 16606 24440 22916 47535
7380 47535 48698 35703 13046 -43985 44241 132552 79987 12521 -40210 -64928 -65543 -53498
7368 -53498 -59710 -99165 -91870 -101926 -82709 -76705 -82431 -62714 -20766 -8359 -53521 -55641 24773
7355 24773 43308 -10199 -7141 15472 49543 23618 -65615 -170749 -164646 -195990 -175945 -134747
7343 -134747 -113227 -92826 -62174 -24103 -11168 4175 -38984 -28087 18223 48749 82235 65660
7331F5660m0862k7756J0684K5283k3095k4235L8567O5586L598l249l0617L081
7319F2645k1727k8113k2626l4343K645j7527P671K4238k3685m229j6028K8200
7307d2879K2085m7288l9081k0987o4215Q8541P6865k3742J9159l0041K361K2054
7295c7168K0637Q02j0616j2187j8743n620k595j7945O5620L4003R174q824J8643
7282C5181k0118n0444L9524K9351l4932L3781O118r993K248k4906L6746r251l7701
7269d396l3107K5446P0589J7240j6431m6624k2619K4786K0889J0959J196j9296
7257B8632o3199m8439K9745O5936K2672K2646N9806k7399O524k4869l7295j3847
7245B0913m0143k4134j5109j1032q821p086k109j830l1428M5412j622k2120j1096
$$ plain form
7331 65660 24798 -2958 7726 33009 9914 -14321 24246 89832 93430 90181 59564 62645
7319 62645 40918 12805 -9821 -44164 -41519 -59046 -51375 -27137 -50822 -55051 -71079 -42879
7307 -42879 -20794 -68082 -107163 -128150 -192365 -103824 -26959 -50701 -31542 -61583 -59222 -37168
7295 -37168 -16531 -15729 -26345 -38532 -57275 -62895 -65490 -83435 -17815 16188 25362 16538 35181
7282 35181 15063 -35381 4143 33494 -1438 32343 38461 28468 30716 5810 42556 33305 -4396
7269 -4396 -37503 -12057 58532 75772 59341 12717 -9902 14884 35773 46732 47928 28632
7257 28632 -34567 -83006 -53261 12675 35347 57993 117799 90400 96924 72055 34760 20913
7245 20913 -19230 -43364 -58473 -69505 -78326 -85412 -87521 -89351 -120779 -75367 -76989 -99109 -110205
7232a10205J4220O3493N0374k0264M52l3695m476K7665j6967n5173l7262N5843
7220f5995M527o262j4789p344N870L4395K880J1773J0825j882J563J4839j4273
7207b3873Q026q06J5421M68K7220J0888l8008o6057L58K3087N3957M3186l4166
7194A9701n6320K374K5121q977n628r26K7298n901j8614o473q038K3613K7696
7181A4926Q76K5400n6926m484J4613L402K9202M6069p1890n2921L6580J4315l0784
7168c1622R487j0849J3007K485K5134K6117l8868L2241K8177q729l5122k6696
7156a5238j1211K2977l0907m5573L3005j062m702r016n526Q1852J9855l9404p044
7143a1994k7684m1516n327j8690Q098L0616P430l0812l9557J7619L2960M4534
$$ plain form
7232 -110205 -95985 -32492 17882 -2382 -1930 -35625 -40101 -12436 -29403 -84576 -121838 -65995
7220 -65995 -61468 -67730 -82519 -89863 -83993 -49598 -46718 -34945 -24120 -26002 -24439 -9600 -23873
7207 -23873 -15847 -16653 -1232 -764 26456 37344 -664 -66721 -66363 -43276 10681 53867 19701
7194 19701 -36619 -34245 -9124 -18101 -23729 -24655 2643 -3258 -21872 -28345 -36383 -12770 14926
7181 14926 15802 41202 -15724 -20208 -5595 -2193 27009 73078 1188 -51733 -15153 -838 -31622
7168 -31622 -22135 -32984 -19977 -17492 7642 33759 -5109 27132 55309 46580 11458 -15238
7156 -15238 -26449 -3472 -34379 -79952 -46947 -48009 -52711 -61727 -67253 14599 34454 -4950 -11994
7143 -11994 -39678 -81194 -86521 -105211 -97113 -66497 -59067 -89879 -129436 -111817 -78857 -34323
7131c4323Q988J9064m6097o3092J6762M7240K7281O5823k5359L0078J1944K0199
7119G8508l6442n4379k6769K4630M51l8140K018O3788M2986M1598l4353l371l8215
7106B2310q259K6530O11k8082K4611j8331m6031K0651L5793N126o8876j7719K8776
7093b2890m1592n391M7199j866m5114J4387L2754O377j1318J4468J243m300K2527
7080F484j9509o6761L3144L2984K1233K4958L6503k6365k1920K1206L353k544
7068D2766l05l5523j9328J4474k579L513k1192m7674p325K0905Q374l9761l464
7055h7119K1867L4454P6151J3107o4306M037Q233k647L860j8083J9164K1892k364
7042B8246p8372o304R511L2102M502l5011Q628J0072N6124k515l7131o2526k8909
$$ plain form
7131 -34323 -25335 -6271 -52368 -115460 -98698 -51458 -24177 41646 16287 46365 58309 78508
7119 78508 42066 -12313 -39082 -14452 -14001 -52141 -50123 13665 56651 98249 63896 60525 22310
7106 22310 14051 40581 41192 13110 37721 19390 -26641 -5990 29803 34929 -33947 -51666 -22890
7093 -22890 -64482 -69873 -22674 -24540 -69654 -55267 -22513 -16136 -27454 -12986 -11743 -16043 6484
7080 6484 -13025 -79786 -46642 -13658 7575 32533 69036 42671 20751 41957 45310 42766
7068 42766 42461 6938 -12390 2084 -495 3018 -18174 -65848 -73173 -52268 -43894 -83655 -87119
7055 -87119 -65252 -30798 45353 58460 -5846 -1809 6424 3777 7637 -10446 8718 30610 28246
7042 28246 -50126 -56430 -46919 -14817 -10315 -45326 -36698 -26626 29498 26983 -10148 -72674 -101583
7029a01583O7444M2705J4820n9061q3664l9941M2285Q4559K3394k1602K0517k1944
7017c2071m9903J2464K9954j86k0955P0023k8018k2968r77J1027j6733M109N6422
7004A2188j6749j3980o938K0669k5379n6099J5165O0864J9823l1548p881R298
6992b0567l78M9831K0345m007l7634J0178j0039M654Q899k2194j714J9038l3331
6979a6919k3297R053P8213k3975n7982l2580M0255J9667L5726j31j9452J7033
6967B5611M618n1378K837K519j0003Rj4460K8226M0055L0941r445O80j8952j9039
6953A2219p923j6851J3758L1518Q7p4569n6468O5419k8223O552J5979P07J9203
6940a8592N254K9882K3231j919j0634k5203j9093J942P7973R05k5453m8421o5474
$$ plain form
7029 -101583 -34139 8566 23386 -35675 -119339 -159280 -116995 -32436 -9042 -30644 -10127 -32071
7017 -32071 -81974 -69510 -39556 -39742 -60697 9326 -18692 -41660 -42637 -31610 -48343 -44234 12188
7004 12188 -4561 -18541 -25479 -4810 -30189 -86288 -71123 -10259 9564 -21984 -29865 -20567
6992 -20567 -20945 28886 49231 45224 7590 17768 7729 12383 21282 -912 -2626 16412 -16919
6979 -16919 -40216 -31163 47050 23075 -34907 -67487 -27232 -7565 28161 28030 8578 25611
6967 25611 30229 -21149 -18312 -15793 -25796 -25787 -40247 -12021 28034 58975 49530 50210 31258 12219
6953 12219 4296 -12555 1203 32721 32808 -41761 -98229 -32810 -61033 -54481 -38502 -37795 -18592
6940 -18592 -13338 16544 39775 37856 27222 2019 -17074 -15132 62841 63746 38293 -10128 -75602
6927g5602P134N6834k7561J9160K2985m0977m7328J6479P2707k4762L129J2576
6915e226k3848m3257l6775J1098J7673L126K762l0210n434J7181j6275L5243N8625
6902a5317J4311N0532L1872M122q014j8359j2555K493o9875n0797j8423L9487
6890e0523Q0674L4565q132L0134J0382n472j1707k6070o2M264m0118M925M1370
6877F4230j2157o9659j2461J7878j1933p010j3949R825L276k9383j3148L9129
6865c5362O33K0999K2705J8759J9649P109l2175k7142j0702K1869k2268M849n8244
6852f9321l7676Q854M5665L6071j4653m799j4557J2349J6336r436n9469r579N6877
6839d3338Q731m11N384L8002M5616l786K126j8189o3458m5205m5670L4494K2524
$$ plain form
6927 -75602 -68468 -11634 -39195 -20035 2950 -38027 -85355 -68876 3831 -20931 -17802 -5226
6915 -5226 -29074 -72331 -109106 -98008 -80335 -77209 -74447 -104657 -110091 -92910 -109185 -73942 -15317
6902 -15317 -1006 49526 81398 85520 77506 59147 46592 49085 -20790 -71587 -90010 -50523
6890 -50523 30151 64716 56584 86718 97100 91628 79921 53851 53789 58053 17935 22860 64230
6877 64230 52073 -17586 -30047 -12169 -24102 -31112 -45061 -35236 -31960 -61343 -74491 -35362
6865 -35362 -34729 -13730 8975 27734 47383 54492 22317 -4825 -15527 6342 -15926 -11077 -69321
6852 -69321 -106997 -98143 -52478 -16407 -31060 -35859 -50416 -38067 -21731 -31167 -90636 -100215 -43338
6839 -43338 -34607 -35018 -29634 8368 53984 50198 52324 34135 -29323 -74528 -120198 -85704 -63180
6826f3180J7598N3597L8027L0846O566l4054k8091m3627P569j4846J9025q413
6814a8983L5721O550k7020k2865o851p959M7546J6549l8646L6173M1718n1883
$$ plain form
6826 -63180 -45582 8015 46042 76888 83454 49400 21309 -22318 -14749 -29595 -10570 -18983
6814 -18983 16738 23288 -3732 -26597 -33448 -41407 6139 22688 -15958 20215 61933 10050
$$ [...]
##END NTUPLES=NMR SPECTRUM
##END=
