##TITLE=Analysis number 310660
Compound Code cc 45509
Book Reference 440/34
Project Code adrs
Chemist Name craigr
##JCAMPDX= 6.0         $$ Bruker NMR JCAMP-DX V2.0
##DATA TYPE= NMR SPECTRUM
##DATA CLASS= NTUPLES
##ORIGIN= Bruker BioSpin GmbH
##OWNER= NMR
$$ XWIN-NMR		Version 3.5
$$ Wed Jun 22 10:50:45 2005 GMT Daylight Time (UT+1h)  MAYBRIDGE\NMR@NMR_250MHZ
##.OBSERVE FREQUENCY= 250.131544655141
##.OBSERVE NUCLEUS= ^1H
##.ACQUISITION MODE= SIMULTANEOUS (DQD)
##.ACQUISITION SCHEME= undefined
##.AVERAGES= 16
##.DIGITISER RES= 18
##SPECTROMETER/DATA SYSTEM= dpx250
##.PULSE SEQUENCE= zg30
##.SOLVENT NAME= CDCl3
##.SHIFT REFERENCE= (INTERNAL, CDCl3, 0, 16.522)
##AUDIT TRAIL= $$ (NUMBER, WHEN, WHO, WHERE, WHAT)
$$ ##TITLE= Audit trail, XWIN-NMR		Version 3.5
$$ ##JCAMPDX= 5.01
$$ ##ORIGIN= Bruker BioSpin GmbH
$$ ##OWNER= NMR
$$ C:\u/data/dgb/nmr/ADRS/4510/pdata/1/auditp.txt
$$ ##AUDIT TRAIL=  $$ (NUMBER, WHEN, WHO, WHERE, WHAT)
(   1,<2005-06-22 10:50:15.22 +100>,<MAYBRIDGE\NMR>,<NMR_250MHZ>,
      <created by zg, POWCHK disabled, PULCHK disabled
       configuration hash MD5:
       62 19 C7 07 E1 42 D1 B7 37 6C 3D D0 77 39 F9 E6
       data hash MD5: 64K
       B8 36 3C CF 91 E8 0E 5A 27 A1 8A 80 ED 0F 1A 75>)
(   2,<2005-06-22 10:50:31.99 +100>,<MAYBRIDGE\NMR>,<NMR_250MHZ>,
      <Start of raw data processing
       ef LB = 0.3 FT_mod = 6 PKNL = 1 SI = 32K 
       data hash MD5: 32K
       20 89 1A 4F AB 46 9A 3C 21 2A 1D 05 9A 4D DC 06>)
(   3,<2005-06-22 10:50:33.97 +100>,<MAYBRIDGE\NMR>,<NMR_250MHZ>,
      <apk 
       data hash MD5: 32K
       8F D1 7B 2F CF 5A BF 4D BE 4F C9 10 18 39 5F 82>)
(   4,<2005-06-22 10:50:34.66 +100>,<MAYBRIDGE\NMR>,<NMR_250MHZ>,
      <abs ABSG = 5 
       data hash MD5: 32K
       79 91 BF 71 23 48 3E D8 DD 3E 08 83 95 B4 9B 8A>)
$$ ##END=
$$ 
$$ hash MD5
$$ 35 B1 05 DC 98 6E 11 FD 61 E8 7A 73 E2 2B 41 B4
##$RELAX= 
##$RELAX= 
##$RELAX= 
##$RELAX= 
##$RELAX= 
##$RELAX= 
##$RELAX= 
$$ Bruker specific parameters
$$ --------------------------
##$DU= <C:\u>
##$EXPNO= 4510
##$NAME= <ADRS>
##$PROCNO= 1
##$TYPE= <nmr>
##$USER= <dgb>
##$AMP= (0..31)
100 100 100 100 100 100 100 100 100 100 100 100 100 100 100 100 100 100 
100 100 100 100 100 100 100 100 100 100 100 100 100 100 
##$AQSEQ= 0
##$AQ_mod= 3
##$AUNM= <au_zg>
##$AUTOPOS= <12 >
##$BF1= 250.13
##$BF2= 250.13
##$BF3= 250.13
##$BF4= 250.13
##$BF5= 500.13
##$BF6= 500.13
##$BF7= 500.13
##$BF8= 500.13
##$BYTORDA= 1
##$CFDGTYP= 0
##$CFRGTYP= 5
##$CHEMSTR= <none>
##$CNST= (0..31)
1 1 145 1 1 1 1 1 1 1 1 1 1 1 1 1 1 1 1 1 1 1 1 1 1 1 1 1 1 1 1 1 
##$CPDPRG= <>
##$CPDPRG1= <>
##$CPDPRG2= <>
##$CPDPRG3= <>
##$CPDPRG4= <mlev>
##$CPDPRG5= <mlev>
##$CPDPRG6= <mlev>
##$CPDPRG7= <mlev>
##$CPDPRG8= <mlev>
##$CPDPRGB= <>
##$CPDPRGT= <>
##$D= (0..31)
0 1 0 0 0 0 0 0 0 0.06 0 0 0 0 0 0 0.0002 0 0 0 0 0 0 0 0 0 0 0 0 0 0 
0 
##$DATE= 1119433814
##$DBL= (0..7)
120 120 120 120 120 120 120 120 
##$DBP= (0..7)
150 150 150 150 150 150 150 150 
##$DBP07= 0
##$DBPNAM0= <>
##$DBPNAM1= <>
$$ [...]
##$SUBNAM7= <"">
##$SUBNAM8= <"">
##$SUBNAM9= <"">
##$SW= 20.6930455092707
##$SWIBOX= (0..15)
0 0 3 0 0 0 0 0 0 0 0 0 0 0 0 0 
##$SW_h= 5175.983436853
##$TD= 65536
##$TD0= 1
##$TE= 295.16
##$TE2= 300
##$TE3= 300
##$TEG= 300
##$TL= (0..7)
0 120 120 120 120 120 120 120 
##$TP= (0..7)
150 150 150 150 150 150 150 150 
##$TP07= 0
##$TPNAME0= <>
##$TPNAME1= <>
##$TPNAME2= <>
##$TPNAME3= <>
##$TPNAME4= <>
##$TPNAME5= <>
##$TPNAME6= <>
##$TPNAME7= <>
##$TPOAL= (0..7)
0.5 0.5 0.5 0.5 0.5 0.5 0.5 0.5 
##$TPOFFS= (0..7)
0 0 0 0 0 0 0 0 
##$TUNHIN= 0
##$TUNHOUT= 0
##$TUNXOUT= 0
##$USERA1= <user>
##$USERA2= <user>
##$USERA3= <user>
##$USERA4= <user>
##$USERA5= <user>
##$V9= 5
##$VALIST= <valist>
##$VCLIST= <CCCCCCCCCCCCCCC>
##$VD= 0
##$VDLIST= <DDDDDDDDDDDDDDD>
##$VPLIST= <PPPPPPPPPPPPPPP>
##$VTLIST= <TTTTTTTTTTTTTTT>
##$WBST= 1024
##$WBSW= 4
##$XGAIN= (0..3)
0 0 0 0 
##$XL= 0
##$YL= 0
##$YMAX_a= 369952
##$YMIN_a= -514031
##$ZGOPTNS= <>
##$ZL1= 120
##$ZL2= 120
##$ZL3= 120
##$ZL4= 120
##$ABSF1= 16.522
##$ABSF2= -4.171173
##$ABSG= 5
##$ABSL= 3
##$ALPHA= 0
##$AQORDER= 0
##$ASSFAC= 0
##$ASSFACI= 0
##$ASSFACX= 0
##$ASSWID= 0
##$AUNMP= <proc_1d>
##$AZFE= 0.1
##$AZFW= 0.1
##$BCFW= 0
##$BC_mod= 0
##$BYTORDP= 0
##$COROFFS= 0
##$CY= 12.5
##$DATMOD= 1
##$DC= 0
##$DFILT= <>
##$DTYPP= 0
##$F1P= 14.0000005364418
##$F2P= -0.99999901652339
##$FCOR= 0.5
##$FTSIZE= 32768
##$FT_mod= 6
##$GAMMA= 0
##$GB= 0
##$INTBC= 1
##$INTSCL= 1
##$ISEN= 128
##$LB= 0.3
##$LEV0= 0
##$LPBIN= 0
##$MAXI= 10000
##$MC2= 0
##$MEAN= 0
##$ME_mod= 0
##$MI= 0
##$NCOEF= 0
##$NC_proc= -3
##$NLEV= 6
##$NOISF1= 0
##$NOISF2= 0
##$NSP= 0
##$NTH_PI= 0
##$NZP= 0
##$OFFSET= 16.522
##$PC= 1
##$PHC0= -79.74747
##$PHC1= 7.424922
##$PH_mod= 1
##$PKNL= yes
##$PPARMOD= 0
##$PSCAL= 4
##$PSIGN= 0
##$REVERSE= no
##$SF= 250.13
##$SI= 32768
##$SIGF1= 0
##$SIGF2= 0
##$SINO= 400
##$SIOLD= 32768
##$SREGLST= <1H.CDCl3>
##$SSB= 0
##$STSI= 32768
##$STSR= 0
##$SW_p= 5175.98343685301
##$SYMM= 0
##$S_DEV= 0
##$TDeff= 65536
##$TDoff= 0
##$TI= <Analysis number 999999
Compound Code 99
Book Reference 9
Project Code 9>
##$TILT= no
##$TM1= 0
##$TM2= 0
##$TOPLEV= 0
##$USERP1= <user>
##$USERP2= <user>
##$USERP3= <user>
##$USERP4= <user>
##$USERP5= <user>
##$WDW= 1
##$XDIM= 32768
##$YMAX_p= 291142369
##$YMIN_p= -56522
$$ End of Bruker specific parameters
$$ ---------------------------------
##NTUPLES= NMR SPECTRUM
##VAR_NAME=  FREQUENCY,     SPECTRUM/REAL,   SPECTRUM/IMAG
##SYMBOL=    X,             R,               I
##VAR_TYPE=  INDEPENDENT,   DEPENDENT,       DEPENDENT
##VAR_FORM=  AFFN,          ASDF,            ASDF
##VAR_DIM=   32768,         32768,           32768
##UNITS=     HZ,            ARBITRARY UNITS, ARBITRARY UNITS
##FACTOR=    0.157963299565203, 1,           1
##FIRST=     4132.6476996994, 0,             0
##LAST=      -1043.33573715361, 0,           0
##MIN=       -1043.33573715361, -56522,      0
##MAX=       4132.6476996994, 291142369,     0
$$ Real data points
##PAGE= N=1
##DATA TABLE= (X++(R..R)), XYDATA
$$ [...]
29331 -9424 -16518 -13446 1424 124 -10672 -8210 11336 9352 -1437 -3069 -7322 -13346 -15859 -16653
29317 -16653 -12796 -13306 -11353 -5968 -10372 -13300 -3259 11787 22054 12228 3652 15278 15035 5419
29303 5419 4146 -6111 1440 162 -1736 -5120 -1397 -537 3443 1876 -4588 -1453 3557 10197 15709
29288 15709 10266 1296 -7213 -8430 -6098 -7028 -10582 -18969 -11418 7421 15709 18276 5599 -844
29274 -844 -7327 1359 8166 1550 7351 5477 4618 11129 -7024 -22788 -23359 -5322 11384 20073
29260 20073 24534 13982 6843 3603 17048 13135 3977 10773 19400 33381 30418 21480 13324 19869
29246 19869 20236 17743 15079 10267 -2176 -13490 -21248 -18703 -22224 -19946 -9844 -2584 -12999 -17454
29232 -17454 -9370 1328 -2833 -7644 -9260 -2584 1014 2289 4531 14550 16349 13725 -2496 -23021
29218 -23021 -24395 -28900 -16282 -1053 -8828 -14916 -19058 -23236 -22063 -10354 2056 1776 3636 4648
29204 4648 4403 -686 61 2898 -16899 -30113 -26533 -16601 -11444 -2668 -8486 -14318 -15243 -32044 -29846
29189 -29846 -23478 -22544 -15645 -1471 -4492 -2200 -493 2324 -1704 9944 16993 11878 12906 22906
29175 22906 17294 19055 19536 26724 26472 19923 18420 2315 -13019 -25223 -15540 -2285 4484 2236
29161 2236 4040 3963 -2250 7076 5539 -1147 5801 10951 7999 15255 18904 14625 10790 10248 11594
29146 11594 12583 14202 11873 13820 11020 7703 -2930 -9958 -13769 -23954 -13039 -2883 13884
29133 13884 20329 14858 15605 10866 13806 17215 12432 17628 20482 18130 21249 13725 6584 5287 11818
29118 11818 16991 3302 8523 22154 20845 7407 1744 -4436 3062 1839 -2903 4400 8628 1222
29104 1222 -7272 -15420 -18862 -19839 -5814 7110 10888 8673 3346 8914 11431 15498 10227 4756
29090 4756 2207 5064 9848 9269 15279 9613 1297 -5069 -2492 -8749 -13357 -3201 7011 -1684
29076 -1684 -13441 -16577 -18604 -11874 -4250 5396 -1478 -6232 3017 1903 12766 18010 13859 -2987
29062 -2987 -10789 -14735 -19657 -12853 -9649 -35393 -31457 -22770 -19425 -7112 -4350 -8853 -3309 5370
29048 5370 2974 -9898 -12748 -1977 1126 -4427 -5657 -2657 765 2443 3984 4077 729 -10116
29034 -10116 -17194 -16221 -13733 -13034 -16506 -13864 3379 5278 14911 14042 15757 21311 22937 3934 -2091
29019 -2091 -3680 -8000 7688 14041 19413 10966 -5991 -6445 -17830 -27192 -22463 -13903 -4524 -10892
29005 -10892 -16343 -18925 -21366 -21442 -22238 -14137 -3686 1329 4866 1472 5162 11906 12258 4605 -11008
28990 -11008 -21003 -23917 -32656 -23141 543 365 1771 563 -12316 6455 12101 6066 -8802 -12337
28976 -12337 -10459 -7288 9458 16815 14393 11161 10993 16325 6746 9495 6420 -4730 3923 1191
28962 1191 5155 -422 4259 9093 730 -14967 -14514 -5664 -22492 -14886 512 10957 22428 28612
28948 28612 21754 6033 3841 -2645 -17073 -12471 2057 19879 21394 7291 -3084 -10621 -5154
28935 -5154 10923 17523 13530 13522 5670 -8972 -13524 -3828 -5413 -482 -835 1095 3629 -772 -2755
28920 -2755 3404 8948 2787 -21082 -23330 -1583 -1871 -5258 1823 -6555 -10499 -17106 -7786 -9557
28906 -9557 -19436 -10709 -6524 -12436 -13679 -7249 2500 4532 6713 5679 11724 24232 15145 1563
28892 1563 10623 36449 41751 28972 24227 17191 3685 6453 9416 -3233 -4565 -13939 -26516
28879 -26516 -23136 -19362 -13107 -14265 2299 -5330 -2856 5581 1523 -1649 820 -622 -9670 -10047
28865 -10047 -4711 -2291 -6940 -5678 -5435 -15961 -14657 -4940 -3180 -9744 -2878 104 -1491 5903
28851 5903 -8597 -6867 -744 -585 4017 18897 19181 3760 3729 10727 11387 2038 -5191 -2008 1015
28836 1015 -1003 -3925 -237 15573 9744 -3933 -6164 -9844 -2542 5381 8939 5004 2398 -14068
28822 -14068 -17398 1603 4011 10896 9691 6220 28577 24831 20732 17967 10764 4395 8030 -549
28808 -549 -7546 3300 1999 -11202 -11520 1612 -4860 -4741 -1116 -1950 3977 10793 -1611 -1232 1342
28793 1342 -4611 -20212 -28577 -25361 -451 14566 -3114 -1509 -4464 -10951 -16523 -11834 1942
28780 1942 -40 -8428 -16276 -18651 -7889 -15768 -15124 3929 9572 -6528 2233 15211 6255 18757
28766 18757 12300 -494 6732 16238 -574 -1387 -7421 -9757 -970 -6094 -16116 -4921 2493 -1784
28752 -1784 2828 18776 13848 -4149 6935 10765 16365 18752 -1347 -921 -3157 2636 17789 29645
28738 29645 25996 20975 32574 23151 21738 27394 23396 12696 14473 16911 14218 17733 17469 9993
28724 9993 17410 20840 34330 23247 9742 11787 9233 14382 13409 12115 12777 9252 9487 10964 15909
28709 15909 -1245 -6433 -14038 -7559 8062 18206 8755 1972 3601 19026 19624 23526 15417 10988
28695 10988 7036 13327 13830 10488 10719 18088 3674 -6371 -6227 706 6300 -14671 -12904 -6432
28681 -6432 88 1199 9642 1849 2075 6303 12302 12039 -308 -9779 3479 3486 -11362 -11309 -17906 -19351
28665 -19351 -6197 -4205 -14027 -11745 781 17892 16571 12378 7775 17588 17169 8943 14981 16466
28651 16466 6006 1608 6115 -10531 -13346 -11072 -14032 -20578 -21323 -11366 1492 -868 -25290 -15649
28637 -15649 5037 6453 4641 7249 9802 16857 5446 -2413 -6514 -7989 -16203 -13254 -926 -4999
28623 -4999 -14450 -7411 -9096 -11923 -4980 2195 -701 -3199 -4560 -7082 -6317 3270 1865 8524 -1659
28608 -1659 -4372 4431 7473 7638 16328 13132 10531 8514 6771 9855 -998 -8936 1206 -2419
28594 -2419 -7959 -13204 -8933 573 17043 17462 15914 22326 22808 14134 2311 -3055 6684 17693
28580 17693 8612 4972 -7294 -8249 -2750 -5425 19564 35414 29520 16268 14782 20126 16962 16265
28566 16265 10510 2131 -2092 -5099 -10495 -8945 -6134 -9839 -6842 -6044 -7343 1757 10817 15751 21462
28551 21462 11922 -205 -2718 2224 3958 9994 7161 1615 -752 2628 -2637 -11843 -19669 -24621
28537 -24621 -12912 1277 4420 609 -4076 5704 10201 10216 5989 -2574 888 10902 7126 7120 -2228
28522 -2228 -2708 9809 15779 18934 16089 6954 -6162 -2084 -2059 -6922 -5697 12192 21256 12019 4374
28507 4374 -8548 -17074 -27001 -14569 6221 18165 16011 21561 17178 5078 2967 8749 1927
28494 1927 -8679 -14461 -5543 -199 -11954 -10390 372 10433 3127 -4182 5937 2059 -1551
28481 -1551 2351 4514 12586 4955 -7416 2286 -3057 -7137 -14376 -8329 152 -11554 -13627 -2440
28467 -2440 -3666 -4564 -1334 1427 1628 4291 2594 -10552 -14040 -6529 -3476 5498 9770 9016 734
28452 734 -2103 -541 -1735 -2016 12872 14627 9663 9124 2421 2715 1806 27 9052 9584 14886 8401
28436 8401 -7999 -13893 -6173 2288 -1160 -8557 -10712 -19837 -9720 -18385 -20068 -21193 -17580 -27061
28422 -27061 -27387 -15427 -9414 3664 2473 5899 23852 23553 14031 1435 -11737 -13087 -17435 -7023
28408 -7023 -4083 -5104 -1267 629 -6629 2487 -1422 -2829 1172 5256 6325 1004 10146 -6218
28394 -6218 -7288 6741 9196 4223 4249 3150 7677 18593 14493 10348 3320 1424 3837 14688
28380 14688 23899 16639 -2472 -10983 -6979 -10827 3088 11611 6359 -6861 3429 4406 7479 9026
28366 9026 4125 -7699 -20251 -13608 -8638 -18580 -7246 -2621 -8489 -14776 -7605 11077 16671 6108
28352 6108 7674 4380 2771 4208 16254 12966 5547 -5082 1392 5477 7085 11613 6541 10756
28338 10756 6625 -6031 -12036 -3986 7145 15578 643 -2106 11539 15512 19415 5507 -6370
28325 -6370 -13143 -26625 -19145 -19726 -16450 -13849 -20008 -18055 -10206 -4816 -2311 8451 14068 10235
28311 10235 11743 17245 5379 -1927 -9384 -2663 14853 16331 18778 15317 20548 15789 7650 13953
28297 13953 5724 3854 5033 280 -7592 -5974 -11295 -23834 -22851 -17387 -8789 -7073 -17372 -20717
28283 -20717 -7711 -7655 -13861 -16380 -9715 -1847 -2064 -14514 -17949 -16776 -17551 -26581 -28026 -18633 -8928
28268 -8928 -5770 -7495 -6601 -380 -1195 -1992 4282 14492 12828 -907 402 4320 11763 21943 22164
28253 22164 14954 9080 -2346 -13097 -24516 -26795 -9880 -10633 -14423 -11875 -13241 -25841 -24340
28240 -24340 -19089 -19104 -8543 -5209 -4872 -14823 -18789 -5254 -8206 -14434 -3605 -8426 -6320 -6155 -18909
28225 -18909 -14028 4224 17719 17577 11213 -624 2675 5501 5240 1432 4947 -3375 -12551 -16793
28211 -16793 -16933 -12207 -12942 -25421 -22730 -11734 -3602 -2641 -11026 -13774 -19541 -28411 -15925 4624
28197 4624 2288 3071 1341 -4405 -4647 5515 10517 4278 -1962 3333 17247 13604 -790 -9588
28183 -9588 -17263 -16219 -4908 3762 -1391 8269 13553 9862 14626 12679 17777 21340 15455 4559
28169 4559 -3478 -15189 -15503 -19049 -3495 -7123 -5218 7336 14791 2642 -9579 -3822 -1784 77
28155 77 -3487 -5551 -11153 -1702 18928 8434 -5698 -2020 1216 370 9018 16048 15008 6917 -3741
28140 -3741 -6163 -2859 -6615 -3822 -856 -2923 5370 12504 12015 -5989 -16785 -8746 -12329 -4791
28126 -4791 13203 16920 11476 13815 6612 -5539 -19449 -7960 -8797 -9154 -1164 -2031 -2028 4824 15180
28111 15180 9154 -7591 -7418 11504 15496 6826 15718 12857 887 1576 4262 463 -3382 -9526
28097 -9526 -13768 -8719 -8070 -9650 -11343 -5893 4208 -1234 338 10793 19927 33026 22596 9922
28083 9922 3766 -9576 -20847 -7758 8420 20958 20446 19400 10375 9872 14619 7894 14911 18498
28069 18498 24595 16145 -1452 1561 -4413 -5826 658 -7389 -5061 -6286 -15244 -13334 493 196
28055 196 -4787 -3077 -5294 4864 5309 11239 7452 -8504 -11902 -1336 5716 186 -11643 -19670
28041 -19670 -22704 -14779 -6922 15399 13880 1171 5494 14623 7309 -4222 -14197 -10200 3545
28028 3545 -24 9376 3566 3047 6386 10296 12670 16916 25861 26678 22495 12391 10683 7050 -4140
28013 -4140 -11986 -10997 -16676 -15805 -7000 -7463 -3429 9069 4595 8183 8850 1744 -14077 -12294 -2849
27998 -2849 -4128 -9577 -7168 -10618 -2760 -4847 -9191 -17073 -23068 -25368 -19091 -16734 -8677 -5258 -10187
27983 -10187 -10223 -6971 -9917 -6486 4561 7464 -5752 -7760 -3034 2512 1923 -902 -8583 -10299 -6240
27968 -6240 -5089 -15324 -23775 -25702 92 2509 6389 22364 35316 22201 17214 27465 20624
27955 20624 7621 2537 21772 24467 10870 2616 -1348 -3419 -6996 522 -6458 -8348 9622
27942 9622 21886 16197 11458 10798 10200 20715 27674 39869 26039 14934 6470 -2013 8593 2182
27928 2182 1317 8508 6276 9821 12840 13077 10188 13594 742 -7967 -6330 13628 29765 34446
27914 34446 26865 12448 11116 7663 1976 2911 3647 92 -9181 -27422 -26992 -18824 1977 18586
27900 18586 15997 9953 6099 7806 -193 9854 6978 1686 1305 11149 2268 -14194 -22772 -23401
27886 -23401 -24440 -14424 -23296 -17796 -15738 -6981 2264 21437 23258 25430 16176 12052 13095 16798
27872 16798 19470 13464 -1702 -7026 9867 -4916 -3807 7715 9586 -2226 -15500 -3785 9267
27859 9267 7031 -3767 4067 9711 13103 5918 8361 10204 2957 -1708 -7516 -8113 -5397 -13832 -22079
27844 -22079 -12263 -5001 -9149 -8978 -9762 -13741 -9614 -3018 -3222 -3903 -4460 5342 4163 3923 -11078 -7954
27828 -7954 7226 2342 -8054 -5360 -3162 -9107 -23707 -18215 -10477 -3933 -4393 -147 17173 25317
27814 25317 22139 24157 15168 2339 1156 3426 -3140 -8181 -7138 -10564 -14688 -8523 -1945 -7105
27800 -7105 -8208 -14963 -15612 -6692 -14536 -7381 9759 1980 1202 -6238 -14879 -15966 -12302 1438 1805
27785 1805 -8608 -11439 -4110 -2864 -5165 -7558 1720 6545 8942 19431 18040 5393 876 13641
27771 13641 29545 28733 6447 8755 2005 -1920 -6817 -521 6267 -275 645 8117 14507 8359
27757 8359 7841 -1260 -11762 -11116 -803 -4332 -11400 -9153 -12089 -3123 513 1574 10672 6509 -5949
27742 -5949 -4326 -490 -4668 -10915 1107 13523 5671 -620 -6960 -1190 5128 127 -3960 -20499
27728 -20499 -21547 -21466 -15845 -13826 -8634 -4407 1805 -3563 1177 -6059 -11835 -9521 -9370 -1327 -7338
27713 -7338 -16347 -24799 -6838 -669 -6867 -11657 -25003 -21541 -11472 -3509 -7755 -8646 8056 10119
27699 10119 10089 46 -10544 -6156 -12157 -16957 -20454 -14250 234 3121 13 6729 15393 22978
27685 22978 13726 2508 3833 9792 6977 3306 5493 10254 6573 -6278 -14245 -11662 -7238 1491
27671 1491 6091 3297 -2971 1423 8280 6491 12681 15953 18677 11542 1729 -9758 -4019 6845
27657 6845 1069 10051 -864 12565 17708 21060 20807 1799 3557 17206 -866 -9162 -400 -1612
27643 -1612 6420 11799 5471 11301 16608 8738 -649 5574 22406 30594 23309 7261 4479 14660
27629 14660 25242 28326 27204 24634 7119 -15422 -15639 -13819 -5209 7584 6947 -15596 -16862 -1816
27615 -1816 -3964 -15261 -11173 -2256 10916 17223 11412 5611 11354 16113 11403 3638 -10428 -7346
27601 -7346 2172 19631 40121 30031 19593 7592 -3875 -828 9461 4822 -3102 -7781 -10437
27588 -10437 -7534 -4909 4323 7991 3128 -5731 32 4627 10238 4281 11626 12514 16695 13765 11133
27573 11133 6203 -3524 2630 -8583 -14700 -6990 3449 4758 2547 4186 4261 8189 19367 21087
27559 21087 18552 15104 3647 1021 15140 26849 10175 -7283 6928 26668 10264 -16105
27547 -16105 -24629 -16974 -4457 225 783 17103 17717 14192 13185 8263 18102 27055 30377 32156
27533 32156 29888 13170 -438 -4507 13700 20240 15134 1663 -2677 7518 -1467 -5814 -8723
27520 -8723 -19953 -20785 -4043 3218 3673 -6153 -10483 -1104 8599 15187 8313 4270 3773 7883 6048
27505 6048 1198 457 -1885 1808 3823 3498 1661 -1841 -4784 -1873 -2952 -17146 -14228 -13624 -16212
27490 -16212 -2488 3825 -5283 -583 18465 32765 22660 27648 19013 -6164 -6623 -7771 -3365
27477 -3365 3112 12740 14416 10691 14318 27402 22433 18273 21403 12346 6353 23175 28989 21760
27463 21760 5381 -1264 -8958 -7057 -1813 -5341 -460 12773 32014 41697 38259 29927 31678 32347
27449 32347 28291 9324 2271 1668 1395 -7379 -19030 -16523 -15345 -19424 -11245 42 18539 14078
27435 14078 4483 257 7093 6002 -772 -4364 -10516 6345 25189 26406 22287 12821 6446 6858
27421 6858 17059 15672 14578 16735 7494 6672 14753 16429 -10262 -19172 -8516 7306 14199 5909
27407 5909 -10765 -11307 -10283 137 7798 2974 -7532 310 12031 7063 20910 28359 28741 20217
27393 20217 -7877 -6824 4486 13379 21613 13785 10469 10268 5442 -4906 -2994 8042 1955 4128
27379 4128 8898 16453 11385 11985 5314 8575 13327 9300 -9898 -12931 -12406 -15081 -9734 -12431 -1196
27364 -1196 -6650 -5918 -7674 -7950 -12176 -19697 -3311 -105 5698 6287 6589 2567 7241 10999 1243
27349 1243 -7111 -12895 -3161 8238 356 2897 19833 28944 27498 14694 12058 2095 5212 2393
27335 2393 -5593 -11829 -8147 -795 -13313 -17890 -18227 -7678 -10534 -27380 -46831 -41888 -20669 -19668
27321 -19668 -19195 -6737 3255 2573 12225 20175 9852 12393 16765 26941 23378 16274 19159 12181
27307 12181 6425 678 1390 18185 33322 21623 -2730 -11819 -11889 -7814 -4273 7162 3974 -10032
27293 -10032 -25191 -37457 -27990 -10288 -4115 6328 20626 18514 24965 22361 19808 14962 9911
27280 9911 19081 25515 19113 4544 -11358 -5217 9817 1863 -3943 -4094 11792 4661 -6082 -8564
27266 -8564 8849 20274 22358 14444 8220 4250 63 -4415 -14712 -19364 -13237 -2946 -3608 934
27252 934 4633 -4740 -6091 -1886 8819 16107 7135 3900 -2218 -1766 -6081 -6512 5756 13919 7113
27237 7113 2773 15341 2764 -9890 -9562 3023 3526 -5895 -6116 171 -404 -11996 10249 31741
27223 31741 14066 -3276 880 -12551 -9804 -11242 -22400 -24596 -20252 2257 6004 9036 18836
27210 18836 -1169 -5300 -3737 -9215 -14471 -351 4037 2051 -1658 -7079 3195 6576 7928 15303
27196 15303 15824 -4054 -6444 -5081 -17186 -29501 -14822 -2141 -903 -3977 -6359 -492 -2255
27183 -2255 -14042 -17586 -15593 -5062 1728 578 -6385 -1251 -2178 -14343 -16951 -15771 -3157 -1231
27169 -1231 3636 8019 12043 5281 -4751 -3125 -3306 -3066 2374 -558 4333 3121 -8275 -7354 1166
27154 1166 12624 14477 2216 -6562 -5808 764 6076 -3831 -10868 -18222 -11761 -9994 -17509 -15759
27140 -15759 -20649 -21309 -15838 -661 6162 8622 5943 9265 -1873 -5455 -757 16045 21439 19612
27126 19612 20837 26293 29142 20706 6744 -2228 -5360 -18310 -10668 -1914 -1562 8104 9244 11889
27112 11889 7200 7932 20369 17075 6439 12945 15101 9074 10220 10 -3720 597 -2246 -16575
27098 -16575 -33904 -31200 -20807 -16547 -11041 -9722 5253 12883 9532 1722 -4430 658 -2333 -4162
27084 -4162 3718 5471 52 4208 10707 -2849 794 261 -12913 -13725 -11823 -7016 6131 9227
27070 9227 5870 -7224 1814 11705 2950 -3899 66 -5940 -376 20070 29980 31330 23807 19253
27056 19253 19732 25989 24433 26586 19933 17264 2780 -6726 -135 -2852 -13149 -20109 -12183 4624
27042 4624 28640 36960 29715 12748 -2660 -6074 17226 23901 13278 -1337 -649 7772 12060
27029 12060 14676 9741 2108 -1787 -6628 -13331 -3578 5560 5243 18287 22261 8351 -235 -2299
27015 -2299 2245 -156 -12377 -22266 -30583 -28950 -11928 -515 1925 6336 -8948 -13639 -15833 -3729
27001 -3729 5216 5838 19557 21145 19209 12276 2795 -7281 -10090 -10137 -8056 -291 13178 16596 15482
26986 15482 -1852 -9742 -1801 -3979 -3230 3630 13640 14100 3781 10823 14894 1790 -3420 7895
26972 7895 14409 17548 2196 -13026 -11099 5781 3913 -1567 -9613 1042 -2797 -12829 -579
26959 -579 12388 6199 -168 2974 4898 -3447 -16343 202 4764 -2071 2167 11258 -3569 -19742
26945 -19742 -15445 -4375 -5676 -1942 6406 -5673 -439 22506 9109 4211 20819 10170 -5258
26932 -5258 -8860 7399 14088 21059 11261 5337 -4449 -5421 -28592 -24699 -26084 -34716 -28835 -28476 -16173
26917 -16173 -7200 -15825 -35842 -41447 -31263 -17968 2479 10536 9235 20106 30049 25659 10804
26904 10804 -3513 -14303 -26043 -9791 -1339 -3811 -13959 -17137 -1742 -1283 -3538 -1913 -9161
26891 -9161 1172 13689 5957 -3916 1048 7986 12262 -3616 -15266 -12516 -9644 -8612 -9654 -1999
26877 -1999 17861 25982 12104 -1333 -6034 -20098 -16808 -10167 -10125 -19702 -25707 -20775 -8280 -9052
26863 -9052 871 6671 11361 761 -16798 -8235 9143 21974 28197 16992 11152 7123 611
26850 611 10409 17465 23884 13531 2865 10084 6371 -692 -11133 -18829 -18873 -21166 -31153 -15570
26836 -15570 -16845 -25668 -23802 -14364 8866 20370 10236 9026 2293 -8919 -10153 3346 905
26823 905 8522 15983 6261 -18490 -18686 -6366 -12828 -13165 -14783 -19214 -11725 -6152 -19095 -36734
26809 -36734 -40963 -38321 -27737 -22723 -19008 -974 2575 7398 8901 -3924 -28926 -35229 -28322
26796 -28322 -10214 -2687 -3159 12451 23483 15917 3546 2781 -215 -5502 3516 7224 -6043 -2321
26782 -2321 -3966 -15459 -12931 -10741 -15175 -15769 -11032 786 6951 -2774 -11719 -15446 -4191 3890
26768 3890 5779 11240 19371 -1313 -17170 -21615 -17313 -11863 3622 -483 -8453 -7532 2010 14098
26754 14098 23300 12834 -4654 -7803 -3107 -9974 -11066 856 9940 11020 11157 17995 26982 26590
26740 26590 8848 -6463 -812 2244 2660 8050 11446 9186 2795 -10627 -13771 -7755 -11133 -14717
26726 -14717 7665 13659 15728 23981 17583 21167 17207 3634 -2577 -11715 -16531 -13069 -10286 4238
26712 4238 -5908 -12548 -3098 112 -17169 -27050 -7971 -3556 -8136 -11132 -6213 -2285 6336 7340
26698 7340 4170 5741 9278 9875 18001 16875 18480 9594 -1413 -15175 -23078 -17208 234 2110
26684 2110 3365 10288 4114 11808 10776 9666 -2666 -166 13413 3986 2557 8737 13598 10134
26670 10134 -7235 -14899 -16323 -13877 -24616 -30200 -22785 -15484 -6409 -8313 -3449 -114 3872 -11152
26656 -11152 -26168 -6363 10390 11853 11030 4307 4589 23271 35785 27447 29419 15183 7823
26643 7823 891 -19551 -18514 2560 12629 11443 16646 29510 29719 24629 24710 29432 21610 9914
26629 9914 17116 24497 16461 4671 4632 10440 18378 8243 -1122 1943 8152 15604 11306 3323 11140
26614 11140 8609 12468 23896 23243 12669 1783 1862 162 197 9013 15923 21889 22401 -1479 -25476
26599 -25476 -23847 -9140 -6716 -10519 3660 12888 4874 -5762 1252 22903 28312 17688 27766
26586 27766 26634 14408 12100 19257 14102 -867 -1156 1168 3934 8076 13854 11795 9148 -346
26572 -346 5255 1435 -2183 -9582 1545 12768 14561 13681 -284 -18170 -21274 -21946 -16155 757
26558 757 7944 3500 7680 17700 14841 8330 2015 2571 1427 -66 -932 -44 5339 16829 22465
26543 22465 12226 -1078 -11477 -19458 -10924 -9210 -3130 -929 -2872 3955 8164 14651 11442 -1122
26529 -1122 -8185 -4281 14579 10836 12796 9208 2172 737 -3450 -17343 -23361 -12839 -4933 -7295
26515 -7295 -6621 -983 -1613 -3061 -10287 -12787 -3897 17053 18443 21501 17951 6456 -1666 -14133
26501 -14133 -18170 -9329 -4866 -10115 -3462 4982 13674 14774 23901 20699 22289 29116 9350 3272
26487 3272 8555 13650 3000 -8305 -6104 6834 12060 16463 15514 1734 4210 13546 6563 3129
26473 3129 -421 1903 12559 15500 16806 8161 4817 -6310 -11860 1604 15947 25178 19062 14213
26459 14213 15579 13503 -2901 -6486 6404 14106 4116 -3160 -13667 -6569 -9348 -8533 -6645 -8955
26445 -8955 -8363 -8271 -5387 -3129 -4882 -13474 -22741 -16067 1774 15546 8321 -951 -5177 13991 21800
26430 21800 22134 26557 17417 13772 4680 -7555 -19452 -18779 -15263 -27794 -22146 -7027 -1857 228
26416 228 -371 453 -6649 -14236 -4536 -2470 -10931 -5676 -2673 -12176 -28470 -18059 -4856 -4875 -18025
26401 -18025 -7954 4376 8670 7845 -2854 -850 6400 5623 -1233 10849 10261 -3043 -18443 -23456
26387 -23456 -29019 -25425 3355 12384 -1794 -14683 -13913 2244 18722 17479 3198 3516 16381
26374 16381 25367 24747 15710 4336 -15331 -19399 -13678 -20830 -17408 -9957 -3632 -5097 -791 -864 -7716
26359 -7716 2716 10434 9947 8822 14400 3922 -3117 -1527 -10979 -2009 14198 20149 13811 12236
26345 12236 14286 5755 5210 13357 19128 10994 -3221 1970 7370 -14047 -18268 -4700 -14037 -14763
26331 -14763 1424 10054 3990 -262 -15671 -11912 -8286 -4081 -740 -1121 -6987 632 9708 3591
26317 3591 3958 16779 31404 28687 9659 5146 1751 18505 20278 10404 12859 15781 17401 15290
26303 15290 -4387 -9600 -5024 -7266 -970 -2577 2650 -22557 -22449 -20780 -13598 4678 -431 -11456
26289 -11456 -20757 -17061 -17877 -8666 -2947 -3018 7812 4479 788 2403 16349 27870 18290 7660
26275 7660 2849 234 -2037 -2765 -18499 -15701 2781 6089 2422 2859 -272 681 4093 -3549 655
26260 655 -3019 -2690 2470 8976 17881 26275 23526 8182 -3629 -1122 -8974 -15026 -12260 -7206 -12008
26245 -12008 -22542 -25369 -8190 5864 13353 17622 8555 3770 -6527 -6117 3210 3775 -4524 -5309
26231 -5309 -4057 -1461 -12435 -10980 1813 9242 6227 1171 -10914 -19636 -11775 -4368 -2946 11
26217 11 4263 -7994 -11142 2029 -5355 -21498 -17843 -17390 -17253 -5405 7390 21838 23540 26057
26203 26057 28252 11461 1641 13319 7246 720 2056 4916 4241 7978 3693 1431 10169 14844
26189 14844 13371 22995 22522 20777 6850 -4794 1667 8143 5044 9721 11473 -111 9184 11240
26175 11240 -1069 -4825 -11880 -13342 -8991 -12948 -14120 -15602 -28655 -22744 -6694 2793 1914 16745
26161 16745 4659 -151 712 -1269 13082 13762 14479 22004 25713 17891 15589 373 -3190 -7412
26147 -7412 -6901 -2658 14626 10142 -12011 -22233 -14682 -20009 -15055 -18362 -19388 -19693 -22362 -25199
26133 -25199 -29591 -28903 -10073 4595 -3555 -17265 -10786 1966 5485 5573 1780 4944 13673 7285
26119 7285 4891 5859 -858 1405 2005 7111 2742 -845 9282 2190 2506 14110 14749 16864 34910
26104 34910 43988 27665 14361 12911 -1335 13272 13190 4907 -526 -7940 9775 27404 24567
26091 24567 13770 9697 -2068 -2195 17212 15829 3806 11975 17628 17008 9702 4835 -10580 745
26077 745 2818 -3789 2854 192 -8581 -8983 813 2077 -4937 -11809 -21479 -9259 12560 23779
26063 23779 24978 10352 13279 19046 22674 13051 10834 1875 5909 9205 13492 20367 20364 12739 19093
26048 19093 7438 2871 -8907 -17212 -7806 -10995 -6215 13461 7196 -2360 -10943 -15647 -7196 -1786
26034 -1786 21918 35302 28078 13254 5659 -269 -6009 3334 13747 2562 622 -9931 -9341
26021 -9341 5403 2912 1080 4160 13938 13949 7121 10715 21876 35108 38815 43610 33789 10684
26007 10684 1010 13300 20199 21416 11087 -4246 -12095 -2317 -2240 -2780 -16545 -24847 -19022 -1900
25993 -1900 -11440 -13710 -4857 -2975 -5346 -10682 -6417 -3196 -1747 2863 19979 13471 -1731 -4544
25979 -4544 10196 18386 9038 -3556 1559 -3520 -5210 -8417 -15524 -10631 1270 3708 -2101 -8248
25965 -8248 -11952 -17803 -17461 -93 -2472 -12594 -7175 5373 24012 35846 22824 14774 17620
25952 17620 11995 12889 6929 -11852 -25560 -12167 605 -1389 -20332 -20109 -18288 -11529 -8562 -9627
25938 -9627 -8304 -2411 -4976 -8043 -7402 2863 6842 1297 496 6465 5627 178 -3317 -9143 -5156
25923 -5156 4818 18051 15672 15491 32523 28149 14729 -2984 3405 935 5229 6730 -2438 -2360
25909 -2360 3465 -5129 -17914 -11868 7260 3910 -1376 13054 28403 33739 21328 17482 21446
25896 21446 13197 4234 -13228 -20446 -23445 -12824 -3320 -645 790 -4376 -14167 -13683 -2590 6596
25882 6596 2165 -3607 -2882 -4971 -7324 -83 9318 1215 -742 4331 12921 17822 9857 7095 -1806
25867 -1806 -18391 -24932 -14018 -16433 -20411 -12366 -6206 8756 9582 -2977 -2003 16502 28052 30675
25853 30675 39331 34657 13338 -598 -4672 1324 8965 823 -19617 -21908 -13918 -12452 -9684 -14173
25839 -14173 -19120 -11217 119 6263 9097 17833 16793 17764 19034 4464 -5112 -4865 -10276 -14541
25825 -14541 -13350 -5027 8076 15955 29584 29002 18417 6967 4800 -349 -4913 3215 11760 11367
25811 11367 1089 -5610 -7823 -8186 -7256 -8275 -4613 6930 15794 14005 6049 10214 6770 -262
25797 -262 -4048 10834 19473 14630 10793 4118 -2154 4481 15527 23618 26884 32780 36667 43332
25783 43332 26731 9998 10596 11054 -2934 -6331 -16408 -5627 -3233 -3873 -6107 -13627 -16528 -11271
25769 -11271 37 3795 -7620 -15458 -13376 4240 13695 10025 -886 -8147 -6249 -8666 -13360
25756 -13360 -19026 -19300 -12032 -22831 -23786 -13110 471 11991 14481 7463 -238 -8666 -5672 -1584
25742 -1584 3978 3869 1941 -238 257 3585 -8477 -8559 -614 12815 27703 24562 8694 3664 7092
25727 7092 25785 13693 -7264 -19110 -11945 1795 6298 10687 3931 2479 1423 -1174 -13934
25714 -13934 -20881 -467 1020 16937 18473 10609 13597 13511 14266 6039 -11873 -19336 -11230 -10968 -7460
25699 -7460 -3847 7533 2271 -7558 -1190 -4206 1624 20573 12800 2231 13382 22032 13622 12000
25685 12000 11549 20415 12934 10863 11659 11932 17954 20997 12985 24480 17451 12002 615 -3249 5268
25670 5268 17765 12482 5000 -1570 -9437 -10764 -6164 -5300 -2209 8736 10869 -4690 -12803 -8547
25656 -8547 -15503 -21788 -20136 -29703 -22617 -5745 -786 13193 17483 18726 26664 10676 3617 5672
25642 5672 8163 5409 16519 15382 18728 19502 23495 14382 7305 3608 2772 9658 13221 10785 -9054
25627 -9054 -13120 -9228 -10374 -7691 1339 3744 4681 13106 17910 11079 5391 4647 -1501 1588 4845
25612 4845 4357 15460 32283 27691 18621 12868 -859 -11211 -8486 9171 9517 5618 2299 7251
25598 7251 11142 11355 3908 -4921 -14187 -1109 5326 -728 3267 5111 16849 6639 -6015 -6208
25584 -6208 -5000 -8297 -4947 6568 1878 -2614 4220 1531 401 2975 -1277 -8242 -10064 4987
25570 4987 10780 8488 4868 8441 14624 21097 13463 1443 -7473 -13427 -4363 -683 -17926 -18222
25556 -18222 -3505 8251 22854 12834 -5199 867 5455 1046 -16356 -11970 -7304 -7644 -10782
25543 -10782 4824 16794 10677 3808 773 6414 14423 19361 17143 14649 13086 8742 8232 12271
25529 12271 16076 4649 -3211 -13389 -1205 1902 5211 8593 -286 9095 -249 -21637 -21714 -10530
25515 -10530 -7876 -9031 1253 13663 16626 2779 2130 6819 4398 -5104 -11040 -8590 3396 3269
25501 3269 -7023 -4759 3950 3948 -971 1789 6453 -6716 -7816 -15409 -25161 -23533 -14862 -18404 -17300
25486 -17300 -11738 -28770 -32851 -22685 -9452 -13909 -983 9107 1921 5400 16596 13816 14199
25473 14199 13390 15093 10731 -2813 6240 12642 6548 -859 -378 6981 -1536 -6062 -10512 -4913 -3685
25458 -3685 2653 10306 1656 -9563 -7397 -9870 -15411 -24133 -14627 -12257 -9251 -19212 -26230 -12166
25444 -12166 5806 21971 12292 -7918 -12934 -2314 -5837 -8537 -16497 -17824 -14806 -10185 -12988
25431 -12988 -14069 -6784 -2614 -2439 -3785 -11312 -12300 -11612 -7429 -69 1789 12278 10159 5465 11251
25416 11251 7275 11697 12563 5385 1129 8661 2730 9797 8880 8248 6349 16900 15625 3218 4001
25401 4001 3835 11854 13311 12978 10220 5354 -3744 -703 4901 11114 7659 -9261 -13879 -21300 -20933
25386 -20933 -13393 -18495 -21062 -28847 -33672 -20692 -6187 8051 2393 1894 -678 46 -5752 -5930
25372 -5930 4573 2657 2939 4619 12430 17518 18779 16769 11969 -271 -10945 -5541 -909 2800
25358 2800 137 -11756 -15996 -3470 4580 4303 16369 12204 -5135 -4054 -909 11113 18173 12503
25344 12503 335 -16271 -28081 -38073 -33158 -21739 -6113 3395 6133 6421 8370 4710 -4420
25331 -4420 -14665 -7968 -7424 -6847 -1583 2713 13813 26530 16737 11628 18126 14529 13336 10633
25317 10633 1172 -4577 -2519 2718 7060 4603 -3074 -7412 -12910 -8518 -2577 4989 6530 4697
25303 4697 5572 2841 -5350 -23268 -20353 -8912 -7876 -6221 -6975 3125 6907 -119 -20285 -22734
25289 -22734 -4255 1433 9177 12736 8543 -4366 -4170 6087 13124 11009 19039 18030 21427 11359
25275 11359 1326 8717 21067 26792 18681 5380 -5775 -2790 1706 6560 21495 25411 4800
25262 4800 10637 9834 -1442 -6592 -1001 3257 1818 -4638 -16664 -6564 7135 10594 6910 -2578
25248 -2578 12531 19325 11408 16962 33021 26351 23917 9759 3455 6073 -998 -5895 2091 20544
25234 20544 22761 11258 5076 2394 3100 -837 -817 8665 3278 -10741 -24060 -12361 -7967 1134
25220 1134 5022 -5372 -5079 4080 4506 -21774 -21123 -2802 26012 24247 17005 14594 13323 684
25206 684 -9369 -11729 1619 -5536 4619 17292 17899 3318 1552 17748 14985 -4179 -10336
25193 -10336 -10043 -9271 -27540 -22070 -10813 -16063 -5928 -2893 -6839 -2059 -7846 -6848 -4486 -7419
25179 -7419 -1088 8266 12261 15960 7297 8130 13730 16032 5513 153 -2578 -18513 -14466 -568
25165 -568 8594 7467 -1635 3253 7055 6883 1664 351 9340 15478 10921 685 1507 541 -813
25150 -813 2025 4811 4020 -3681 -13295 -2918 -3977 7283 9188 10117 12272 14258 14994 -2703 -4550
25135 -4550 -6709 -33 14263 17885 9276 4372 11409 21676 9000 -941 2327 5647 -648 -8350
25121 -8350 3318 -297 443 -12479 -19355 -30798 -40992 -30490 -19663 -5088 8701 8504 -2439
25108 -2439 -2553 -3028 -5247 -19276 -10689 -12552 -9483 -1889 6492 6725 10386 12057 18262 19865 11535
25093 11535 -4400 -5529 4652 1932 585 5862 6673 6577 13814 8460 6007 4407 2147 4723 846
25078 846 490 6943 32886 32773 21841 15476 11735 -3219 -22819 -23694 -16702 -9214 3464 -7414
25064 -7414 -11192 -11087 5421 -88 -1317 2903 -4528 929 7250 14454 15821 9694 -10485 -14409
25050 -14409 -6605 -196 4071 -6291 -20289 -19863 -14990 -4202 1857 -2436 -3829 -6514 12480 13345
25036 13345 -9653 -14560 -2662 -1687 2706 -971 -12438 -11227 -8084 -11748 -9647 -4072 18825 20905
25022 20905 12757 -3235 2719 1002 -2970 -7193 -9006 -3624 16760 29429 29472 13222 4369 6158
25008 6158 8110 2427 232 194 -10902 -22903 -24285 -14818 -7490 -17916 -15557 -10099 5073 -2030
24994 -2030 3205 -3801 3506 15963 8872 3217 11052 6667 -2701 -1328 -12571 -8247 -2154 -3740
24980 -3740 -5667 -6527 -8265 -9332 -8897 -8210 -17590 -9252 18398 34658 37939 16442 12993 21011 20777
24965 20777 24022 17665 12473 14334 16764 470 -7694 -2821 3146 17314 11165 3058 5121 11823
24951 11823 3456 -10669 -7835 -5542 -11351 -10946 -6545 3421 11289 6499 -1502 4875 1047 15166
24937 15166 21239 7941 9339 7122 -1701 3842 7472 6286 6019 2170 1215 851 1468 1695 -3023
24922 -3023 -14495 -13777 -7120 -10436 -53 7848 -5704 -12191 -4873 -852 7577 12517 3404 -5607
24908 -5607 -7252 -5892 -1935 -9477 -24 4295 3193 2737 -4783 -5664 9183 20847 10009 1214
24894 1214 -3850 -17934 -27983 -20194 -12596 -15079 -4068 -645 2340 12514 14019 9650 2671 9
24880 9 14221 12157 -3165 -232 -9067 -11407 -1691 5640 1226 781 -13519 -13870 1812 16652 12726
24865 12726 -1535 -7276 -4977 -2933 2779 6421 8569 5992 8701 8455 -5646 -5375 -4915 -11337 -6
24850 -6 13044 16949 16185 11422 -2795 -8830 -1745 5627 8179 10956 15326 4361 25312 32037 18866
24835 18866 9893 21494 22731 27309 19114 18131 8357 3397 -14957 -14387 -4038 -11223 -12009 -1658
24821 -1658 -4690 -9890 -13957 -8221 15052 7400 9217 20421 21085 9141 5352 6068 13125 5215
24807 5215 -2272 -2511 -12146 -6847 -2398 3155 6300 5870 18521 23323 6171 8097 12413 9624 9575
24792 9575 17165 15587 4730 -9462 -12222 -11317 -9873 -7018 -660 5743 4945 -7677 -18058 -10504
24778 -10504 -14068 -21453 -14893 -15047 -10652 -12174 -14594 -17865 -17439 -131 11552 5236 7188 3315
24764 3315 -5784 -2481 -10427 -15245 -943 -275 -1986 -3729 -4259 -15229 -12173 8771 18158 11028
24750 11028 495 421 -4853 -14991 706 506 -5373 -14856 -18358 -15089 -11486 1510 1980 8963
24736 8963 11904 11490 4864 -4776 -13192 -14591 -18229 -10704 -13368 -13924 3313 7101 -1183 -292 733
24721 733 -24170 -18146 11328 21050 8306 9185 11808 3378 -873 3714 -3470 -18228 -27846 -28961
24707 -28961 -20404 -15192 -19619 -17610 2365 -4612 -8715 -6209 3472 10772 24869 20095 12443 16842
24693 16842 14290 18533 13554 16784 21957 22922 26976 26361 14402 17415 16926 9202 5037 -4228 -9482
24678 -9482 -15191 -15004 737 13410 8251 4610 -10202 -18784 -19856 -5160 9774 8563 -633 -2536
24664 -2536 11277 -6096 -4053 -2064 -198 -5231 -12383 967 18640 -1824 -14103 -4993 1039
24651 1039 6391 13039 11609 7834 1466 -5077 -10912 -6071 1588 -4793 -7713 2809 -348 -8611
24637 -8611 -5121 1598 15855 12501 12616 12641 13899 9721 12094 14938 8471 1030 1093 -2146 -6008 -4966
24621 -4966 -917 -11589 -3987 2759 6799 4568 1270 -13160 -13254 -10480 -18691 -13965 -9492 -163 -2826
24606 -2826 5158 -51 -12026 -2478 8710 6997 -816 5397 3590 -6480 -12399 -4746 -8228 -18865
24592 -18865 -19030 -13355 6302 18665 9197 2397 8907 13132 935 -4109 -15155 -23534 -17683 -8143
24578 -8143 -15694 -22915 -23054 -22678 -18727 2177 14586 21365 23960 23838 12173 -10711 -14078 -14204 -5298
24563 -5298 7 -1877 -6913 1137 -753 -1420 10002 1975 1433 11151 8745 6241 1871 1760 80
24548 80 -7006 -9607 -5235 -2632 142 286 2962 14919 6049 -4948 -6473 -18460 -29549 -23377
24534 -23377 -18927 -22905 -28909 -23574 -5691 6254 -4087 -3398 -8923 -8081 -14983 -9798 -5318 -7865
24520 -7865 -8376 1977 4399 3360 6058 12166 11336 -3085 -1882 -3431 531 -732 4990 -3192 -8159
24505 -8159 -3075 3459 958 -20472 -25423 -12500 -1995 -841 -14320 -12889 3264 3030 8348 -2515
24491 -2515 -12723 -17686 -14851 -18133 -20058 -20418 -17951 -11889 -5191 -4329 -5124 -8211 -4919 -11059 -11637
24476 -11637 -17244 -20223 -23937 -17832 -13751 -6378 611 5216 3750 860 -3082 -10746 -6243 3673
24462 3673 8867 16887 16477 4915 5997 17317 12065 6218 428 -5918 -12746 -8485 -927 -5226
24448 -5226 -6971 -3986 1553 15771 19097 31760 23510 5581 13164 16092 2583 -11549 -908
24435 -908 1281 -3263 1444 3820 9900 3720 -10567 -26781 -19804 -8909 8047 15566 27815 15857
24421 15857 1238 207 -6371 -5595 11329 10034 -6171 -6623 4493 4067 -1278 -9426 -98 5619
24407 5619 7275 9382 2878 2085 6396 -2823 -8232 -9701 -74 10138 28438 15888 -9227 -8578
24393 -8578 -1467 -2476 10547 6976 -10481 -15180 -16189 -6370 -4950 4514 10596 17414 25596 15016
24379 15016 7196 5382 2842 1263 1568 3734 -4655 1076 10231 13730 16855 1420 -1821 3368
24365 3368 310 3516 1817 65 -10896 -3644 13158 11877 7248 16390 21847 9316 3454 -7428
24351 -7428 -2758 5191 22925 12040 10609 6002 6601 8855 12939 9862 1666 -9061 -6631 -6126
24337 -6126 -27896 -37395 -29777 -16999 -9711 -9361 -8630 -1960 -6757 -6737 -673 -5074 -9036 -2475 1070
24322 1070 173 -544 4286 -8320 -16471 -9638 -312 -14391 -12162 -12144 8649 -3220 -13897 -14306 -6821
24307 -6821 974 -4971 -17413 -5386 10258 2867 6695 11975 1115 -10532 -20457 -11149 2814
24294 2814 3396 5573 8065 5339 595 -9077 -4247 7510 7790 -1893 -13085 -10527 -11656 540
24280 540 -688 -11523 -7163 5933 10225 8606 303 5494 -433 -12271 -63 13013 2196
24267 2196 -3498 1362 -6475 -13825 -11361 -5629 671 10372 2780 2889 1454 -9222 -11977 -9385 20339
24252 20339 42426 53189 65333 81434 84249 74316 59661 27976 1946 -6531 -4573 -16761
24240 -16761 -9149 -7787 -11244 -19229 -19455 -18424 -16977 -5156 3314 -7319 -6815 -6849 -10433 -10491 -15471
24225 -15471 -16902 -15811 -16735 -22071 -15589 -4884 3453 16505 18281 18515 17117 6092 -4595 -12134
24211 -12134 -18613 -19723 -18714 -19576 -20527 -11420 5116 12679 12945 14746 3864 -1982 -4448 -2322 3549
24196 3549 3082 -4868 -3202 12328 18129 7639 -9465 -11941 4393 -7537 -12070 -2340 -13111
24183 -13111 -14668 -8038 -5029 -6981 2253 4886 -1595 3593 5221 -3880 -329 -8820 -19487 -9827
24169 -9827 -1089 1540 -11710 -14360 5918 2609 -4500 -3326 -3288 2467 4948 2271 1956 13451 7166
24154 7166 834 -6267 -2015 -5271 -7470 -9854 -23902 -14677 -514 10402 660 -2032 502 1779
24140 1779 7806 6143 4155 9839 9829 15578 18422 10627 10128 8291 4426 -1232 17572 28797 23174
24125 23174 17363 5906 -3518 5114 25865 23354 21841 13817 756 -1802 -2205 -2675 4645 9274
24111 9274 8744 7225 -5875 -9673 -18626 -5932 9983 4311 -6335 -76 7268 16635 10836 -15303
24097 -15303 -21261 -12568 -7096 -2099 -6000 -1716 7173 6302 -4519 -6722 3884 13450 13754 -7735
24083 -7735 -23860 -26706 -18837 -16353 -11471 -10194 -12098 -18511 -17376 -3297 2370 -871 -10720 -4984
24069 -4984 -10189 -11327 -10408 -6505 -5105 2511 -934 5635 6058 -2756 5923 23994 27438 35540 29729
24054 29729 17996 4813 839 4945 -236 -13615 -11704 -10264 -9246 -13646 -5104 7735 -177
24041 -177 -1397 4463 5885 3917 3962 13863 15772 19190 17735 346 -3128 -2033 17588 22597 13014
24026 13014 9575 14342 7953 251 870 1801 2528 1416 -5446 1611 5453 -4688 1826 6402 3638
24011 3638 2763 1805 -7742 4308 16775 8673 5374 7649 3510 5208 5039 -1657 -7985 -4354 -5846
23996 -5846 9656 4685 -3637 -9980 -2431 -2508 -2420 -6523 -412 -8962 -17444 -9434 -4096 -12537 -14656
23981 -14656 -6017 -16053 -12208 -8019 4242 16242 12407 6407 918 541 6231 1229 -6270 -4966
23967 -4966 -6273 -2093 952 -7271 -31287 -27871 -12781 2358 3608 -162 1800 6765 3277 23
23953 23 3985 8861 21001 25922 19595 7197 -2754 -4971 -3772 -3551 -7652 -14014 -6987 -3964 9117
23938 9117 18228 33555 22176 2690 9193 9382 7009 -3269 -15754 -4765 1093 1796 -4231 -5014
23924 -5014 10763 18324 10231 4023 3386 16373 21341 8524 -2598 820 5981 2426 -2026 -3347
23910 -3347 -4379 4463 -6988 -21109 -31639 -18678 -5321 -2093 2680 11102 9519 3705 -908
23897 -908 6044 15975 10876 11193 7074 5537 15218 15431 15018 11807 15221 9873 6239 -367 -8289 5470
23881 5470 20487 18363 10619 3559 -9259 -11481 -1090 -215 -8125 -22608 -21861 -20396 -8781 537
23867 537 -1429 8351 13223 -54 -11134 -11148 -2182 -3412 10803 1808 -6258 -5267 -8439 -5700 623
23852 623 8197 4004 -98 -7161 -23311 -22371 -18597 -17913 -12588 -2010 15957 17182 2275 -9795
23838 -9795 -12015 -10073 -11793 -19354 -33321 -33041 -28101 -33487 -34737 -39295 -27617 -29399 -20383 4750
23824 4750 9348 15109 13612 18692 28405 33237 37556 28426 16385 3405 -11571 -15693 -16546 -36342
23810 -36342 -40481 -17029 -1396 -1591 7115 11459 9744 12731 10122 1211 -17516 -21453 -5180 -3081
23796 -3081 -13492 -19997 -8801 -10480 -13779 -20545 -26756 -18120 -2534 3136 -5010 397 -1560 -4925
23782 -4925 -6481 -10115 -6548 -2317 9800 11250 4780 9411 6663 4268 -2901 -17568 -27645 -22444
23768 -22444 -22231 -23319 -12364 8025 21870 3772 -5574 -3281 -596 13715 14694 1584 -3741
23755 -3741 4550 9795 345 -88 -1508 -7154 -7136 -3072 -4474 -23540 -29801 -20460 -8743 -11409 -12093
23740 -12093 -10168 -8317 1809 16009 21554 15335 3412 1080 9838 18049 19532 12328 -1894
23727 -1894 7607 10045 1486 -1665 -9081 -16942 -13586 -12618 -19460 -19312 -11557 -18223 -9500 -4376 926
23712 926 370 -2704 -456 8652 16283 21410 14243 -6393 -21826 -13961 -1687 -2121 -12441 -12131 -1739
23697 -1739 5128 5954 -1500 -16014 -12257 7248 10209 -8785 -22003 -11020 -14315 -22679 -32160 -17605
23683 -17605 3206 13320 8167 -12472 -19335 -16683 -3028 11177 10434 8532 5982 6262 7026 11449
23669 11449 11599 7072 2058 11747 18396 1886 -9129 -8785 -13140 -16801 -16999 -21468 -17024 -4457
23655 -4457 -2890 -4373 1210 2424 -1779 -883 2878 -3687 -3496 -11225 -26140 -21527 -12642 -13187 -18415
23640 -18415 -13598 -13221 -8389 12614 14676 -9891 -16982 -16953 -2939 -3250 -22 -3257 623 612 -6576
23625 -6576 -5081 -20393 -30360 -24155 -21771 -27698 -30535 -22093 -15782 -8757 435 -5564 -15326 -9212
23611 -9212 9108 21468 10056 1297 3656 2193 2985 20015 22950 8566 16140 12158 -7694
23598 -7694 -12821 -15534 -12271 -4241 10364 22210 20712 13724 10298 9315 14463 8469 -7022 -18216
23584 -18216 -9797 2645 11395 -260 -12180 -13937 -17656 -19871 -18449 -10349 4526 4917 -4172 -5509
23570 -5509 2618 7855 8022 8405 14897 9245 5365 -6308 -12334 -4932 -3044 8069 16338 14064 21784
23555 21784 16389 10996 11559 6166 7151 5550 7077 15098 7821 -4316 -17647 -23546 -16437 -5060
23541 -5060 -1602 -4397 -10213 -1528 5464 12903 -1936 -12167 -15818 -16896 -8156 3568 74 -1256
23527 -1256 7262 4699 -8910 -25917 -33204 -24052 -10497 -12817 -23224 -14980 1823 10251 12977
23514 12977 12680 -251 2227 12433 19426 17658 -7142 -21507 -17964 -12166 -3890 -2792 -8638 -2566
23500 -2566 9988 6733 3093 -1593 -12689 -10512 -9779 1332 8813 7222 -2333 -12781 -20806 -7171
23486 -7171 782 -359 -1555 5680 2259 -8324 -7187 -10609 5921 11281 18023 20170 9396 4802
23472 4802 -2067 -18096 -2324 11580 4180 6465 -3667 -3493 2297 1713 1970 4949 2933 110
23458 110 -4677 -7049 5100 1494 -874 9119 -795 -6476 -2881 11154 9646 5409 8192 2582
23444 2582 8400 9153 2733 -7727 -12620 3038 -3033 -6787 -1295 779 -2871 -5295 5031 -3175
23430 -3175 -346 2262 8524 -6772 -17927 -24172 -13335 -6449 -12171 -5660 290 2792 -4072 1262
23416 1262 -4572 5227 11727 13353 -2214 -21198 -25722 -19586 -7371 3164 4389 6953 14735 22351
23402 22351 14567 -6049 -7259 1718 6348 11424 13254 7767 -1830 -3907 -6763 -10985 -15612 -6082
23388 -6082 8682 15084 9089 -665 249 -9430 -10463 1375 13409 19812 10227 -16454 -25622 -9768
23374 -9768 -14533 -16796 -14455 -21475 6007 21612 18295 18793 25733 26405 23539 5386 3247 3333 18418
23359 18418 9925 13864 17578 -4168 -6281 8590 9818 6287 -1180 -7352 -2509 8783 13938 8785
23345 8785 -847 -995 -6365 479 -1079 -5481 3780 -467 -5010 -520 2576 8599 11837 8916 12296
23330 12296 18605 16611 11298 5660 -15148 -5542 -9049 -16343 -9414 -9410 -10078 4559 8177 -8482 -10068
23315 -10068 -13689 -14788 -1591 17692 9143 -7749 -5546 -1770 -10578 -15641 -13368 -10738 -7534 -14582
23301 -14582 -13420 -6899 -5774 -16720 -6745 -556 8816 4955 -5032 3156 6170 9360 7191 8554
23287 8554 7774 2865 -9415 -4276 175 -10982 -9099 3903 21234 26163 26764 10373 -10092 -14452
23273 -14452 -774 9810 5733 2004 16298 32108 14345 -5755 -11766 -11859 -8718 -8509 -14026 -11492
23259 -11492 -12671 -8955 -13128 -24209 -32908 -15027 -1565 -95 2537 7069 11543 14699 9866 12
23245 12 -4722 4348 2187 -8798 -8717 -7268 -3965 -1637 1421 806 1654 11779 7396 987 9880 11218
23229 11218 17631 11764 -677 -6792 3367 13646 -563 -3787 6554 12192 14441 24758 11320
23216 11320 4318 13434 8252 5192 13878 15110 -5774 -5820 -8652 -5530 -20949 -9774 -4393 -1465
23202 -1465 -10151 -7882 -16831 -26605 -27202 -16456 4087 228 -6515 -12821 -22965 -22442 -10525 -10302
23188 -10302 -3714 3016 59 -9874 1245 9930 21743 10919 5906 3424 7088 -979 -3602 3247
23174 3247 -1841 -8677 -3832 -8765 -5107 671 3062 7365 10605 8205 5263 8538 14509 -4864
23160 -4864 -15932 -10188 -3848 4664 5316 15383 19085 2616 -4814 4233 9826 2192 7559 5419
23146 5419 -652 -8584 -16564 -11764 -15624 -11147 -2018 -7269 387 -7174 -3219 5578 -679 -17608
23132 -17608 -25921 -31668 -29109 -14936 -14327 -12220 -11492 -10424 -7331 -12227 -23013 -35680 -33286 -4298
23118 -4298 8720 5335 -14389 -22627 -19748 -3347 6376 5944 7065 -3354 -15077 -10779 1958
23105 1958 2960 3762 4575 445 945 730 27855 28312 20815 16730 19035 24690 26584 11521 343
23090 343 -8603 -9555 -7448 4246 10053 11846 -4632 -20127 -18112 11595 18099 17472 25501 19640
23076 19640 5947 7497 9438 4998 12787 8302 -8805 -11492 -16116 -18548 -12462 -7125 -9889 -11032
23062 -11032 -7175 12788 1573 3091 2773 -3706 -11561 -17645 -6733 7880 -2137 -6957 5463
23049 5463 148 -3140 3596 1976 -440 565 -4966 -5369 2230 26445 35303 32772 23521 13226
23035 13226 -7380 -14043 -8352 -26873 -23438 -15878 -5664 -7322 -853 17352 6632 -15658 -19917
23022 -19917 -16779 -21884 -12428 -9352 -8803 -10827 -18848 -16840 -15519 -7672 -3509 3760 1362 -1758 513
23007 513 -3483 -4641 5760 18913 13187 -3060 -4069 5934 5830 7825 5438 -3852 -6151 584
22993 584 -7487 -3016 2154 3202 8043 10607 928 -10848 -7823 -5531 15678 16338 6286 -1190
22979 -1190 -378 7999 333 -25860 -12659 -1910 -1027 -2753 1165 6151 2606 1595 7673 20056
22965 20056 21417 7190 -8172 -18232 -17512 -11653 -18001 -22654 -11347 2389 1012 -17725 -23263
22952 -23263 -22609 -11596 -10504 -9524 1444 1399 -2729 -5033 -14219 -25102 -26097 -21558 -26536 -28069 -27992
22937 -27992 -18534 -4160 5422 2069 -9213 -24731 -14021 -5595 -16629 -13884 -11884 -8040 -3556
22924 -3556 3541 5565 1204 10478 2426 -24518 -32388 -23376 -8709 7618 16530 8863 -2360 2796
22910 2796 -6030 -12932 -394 5895 15 1590 8307 5170 -2845 -602 501 -5472 -4557 4117 -1591
22895 -1591 5720 1517 -8952 -28533 -43957 -35277 -27468 -32887 -30369 -11534 -1200 -7290 -13540
22882 -13540 -7595 3023 2713 3917 3643 4938 7413 3371 -1694 -3848 2903 -2698 -9448 -12703 -2282
22867 -2282 120 -9484 -4033 -10429 -4109 -3749 -11565 -26564 -13021 -1177 -1882 -3712 13173 22216
22853 22216 23102 12790 8898 13488 -1765 -5640 -5994 -5425 7959 6879 -1496 -5406 126 3290
22839 3290 5547 2800 4432 6380 3829 -7860 -6712 -6375 1046 -11535 -16982 -22678 -17260 -14706
22825 -14706 -22392 -28668 -29517 -35231 -34423 -25410 -16792 -6673 4143 -5674 -16748 -7097 11322 2022
22811 2022 -8932 1301 15808 20220 21788 -1805 -8177 -10882 -6752 5933 -3107 -6443 -8697
22798 -8697 -7258 7550 18375 23220 9227 6445 2951 -6467 -11769 -7622 4765 6559 -2275 6788
22784 6788 16562 11374 2982 -2209 126 9580 4987 -6797 -6691 -2984 -11431 -17176 -11341 -10654 -9906
22769 -9906 -12017 -9040 -4646 7882 22012 14630 1605 -3239 -9215 -9154 -3615 3686 8091 13008
22755 13008 14545 16737 6021 -4653 -6527 -3498 3265 -2638 -5619 6673 -1353 -11632 -7743
22742 -7743 -4017 3085 7862 2500 -10852 -8422 -6722 -15479 -7106 -11362 -24344 -32836 -28511 -18955
22728 -18955 -19577 -12488 -10090 -114 4128 734 6921 12143 22900 25140 24017 20961 21299 13393 6005
22713 6005 -4570 -12979 -5385 -9013 -4842 -8324 -7993 -3754 -7690 -15348 -11796 -4170 -1647 -7123 -9264
22698 -9264 -2054 9330 7671 -14237 -3736 11978 13117 9272 -4388 7288 17936 23282 22067
22685 22067 6663 5398 17042 26481 12873 9924 14013 4716 11258 14520 14704 8946 -1918 -7724
22671 -7724 -9663 -3887 -4421 2370 5183 9136 4573 6807 11322 16475 12556 2912 2170 757 6483
22656 6483 13656 7441 1297 -2083 3322 -3482 -18751 -14675 -2624 7531 -880 -10070 -20588 -15873
22642 -15873 -10940 -14287 -15715 -13746 -5742 9876 7918 830 -14653 -13283 -7024 -7206 -14728 -12780
22628 -12780 -8576 -5958 3164 16681 19913 14438 4688 1256 -26689 -29273 -13335 -5523 17611
22615 17611 24801 27536 12301 825 -8494 -3591 295 -3126 -1561 2613 18815 24465 13835
22602 13835 5181 5023 -2271 -10822 143 -4218 93 -6019 -18952 5089 11341 -371 1457 7937
22588 7937 11266 7376 12711 15934 10727 -4234 -8486 -7745 -7853 -8687 4349 10522 7335 5985 5797
22573 5797 -2738 -2142 11839 14256 8675 4560 -8516 -1005 5460 -2005 3663 -343 11012 13414
22559 13414 18621 21253 17654 11885 7406 -3383 -18612 -15331 -835 -4685 -12077 -14610 -2640
22546 -2640 -2656 -9882 -9002 -10791 -19956 -11099 -2599 5612 8392 13671 17560 22173 27178 15897 -8352
22531 -8352 -11780 650 9056 17747 16598 2101 4861 7672 -9613 -19403 -18751 -5631 5113 4745
22517 4745 -4719 3948 7140 -6357 -15309 -28 18703 18098 21766 25002 27725 10117 241 -2191
22503 -2191 -15509 -16486 -14243 -18361 -9836 -4726 -22621 -27588 -18329 -10633 -21684 -27183 -6721 -33
22489 -33 -5177 -1585 6388 9987 -7021 -16488 -10420 -4129 9127 11030 -717 5039 19633 23028
22475 23028 15351 5186 9649 19859 21779 6216 -19752 -12679 -5683 -10879 1307 12323 19525
22462 19525 10965 8446 9814 13859 4011 5194 -1942 -9888 -7210 2517 28339 45883 60521 76980
22448 76980 86196 88695 82166 71512 46624 36165 43248 49074 47037 31120 32812 22020 9460
22435 9460 14450 17150 930 -15043 -8052 -1997 4146 12270 2182 -4209 -3039 3277 4832 9706
22421 9706 21001 22719 8952 -9747 -12649 -11837 -11979 -3120 5738 438 -10576 -5317 -5332 1330 12963
22406 12963 11168 -954 -12449 -4638 2268 6120 11019 1448 -3173 -5552 -11854 -2895 272 5418
22392 5418 13003 3873 3504 -9420 -8525 -16363 -24529 -26529 -22358 -24104 -24724 -36052 -37284 -28252 -15717
22377 -15717 -7611 1785 14093 10241 -3376 -1641 -1044 -9625 -758 10461 10217 11008 2160 4319
22363 4319 -2277 -5154 -12632 -8523 -5572 15850 22240 9705 18239 13867 -270 9709 10281 18422
22349 18422 23479 15342 4802 6285 17032 13035 20566 35416 35424 39853 59321 53941 36931 5525
22335 5525 -14299 -24117 -24745 -1602 21059 17510 1430 -12560 -2996 16265 15369 -374 -17259
22322 -17259 -22897 -12564 -5158 -1309 -1837 -4245 -5180 -15904 -16399 -16872 -9112 -7260 -11727 -28261 -21990
22307 -21990 -18432 -13436 -5798 3484 6993 6395 18939 23310 23857 25608 5970 -5065 -20232 -12986
22293 -12986 12279 11808 -4552 3467 18661 6115 -6436 -10115 -11006 -11485 690 -1821 -11604 -21216
22279 -21216 -19003 -2363 -4394 -5592 -2918 -1515 12099 8441 1734 4809 2247 -10391 -12907 -544
22265 -544 13659 15712 12052 10077 20177 11071 18288 24179 6478 -5682 -8154 -1300 7452 4163
22251 4163 9051 9281 -4738 -5533 7823 5643 -6123 -1015 -7200 -19280 -13222 6740 20519 19506
22237 19506 19021 -433 -10286 468 -6637 -11929 -6663 11094 5472 2759 9124 10155 -2464 -6535
22223 -6535 282 -402 -12053 -21064 -10805 -3788 -5087 -9290 -556 5020 -15286 -16308 -12369 175
22209 175 3989 -5348 -5167 355 9097 15245 3103 -5482 -13492 -12546 -10223 -8989 -7015 -9452 -13606
22194 -13606 -8246 -6551 -7624 2281 13644 16266 2849 -703 -9304 -10304 6485 1762 -3830 324
22180 324 6007 2840 18928 19712 20868 13306 5440 599 -4403 2157 2516 -5036 -6521 -4407 -14047
22165 -14047 -21427 -20886 -15613 -11754 -2736 -870 2735 -6183 -19940 -15975 1517 20313 11827 -668
22151 -668 -18477 -20744 -18770 -4831 7279 7179 -4517 -14198 -12064 -7005 4312 3485 -3053 -8467
22137 -8467 -5899 -2578 -1405 3282 -5380 -19177 -13234 -5879 -3392 385 13870 15557 13936 4566
22123 4566 -7055 -7694 -2729 -6388 -7756 -9792 8133 21248 7792 5228 10475 -8586 -21215
22110 -21215 -4113 -5816 -8956 -5616 -2074 -7175 -7924 -10183 1597 7751 910 -3120 2266 1396
22096 1396 4642 -5046 -8337 -184 -901 -6676 -13990 -5766 8540 -3217 -9282 6484 11675 14812
22082 14812 13147 8611 -8735 -9416 -18051 -2912 7430 4716 -2392 2934 194 -8519 -16655 -26019
22068 -26019 -26493 -25764 -18728 -11180 -8527 -9709 -7106 -5117 -2191 7393 7313 16829 5876 5521 7089
22053 7089 1162 -1495 1062 -2630 -5754 -15900 -23339 -21850 -19914 -11404 -5589 -29 5563 8964
22039 8964 -1941 -6351 -5535 980 8684 -4998 -7096 -4460 356 -11442 -12052 -7267 -9782 -7474
22025 -7474 2375 -2590 -6837 -10136 -11099 -7553 -3484 9309 22023 13760 -296 -10738 -15823 -8750
22011 -8750 -17011 -19201 -16861 -8805 -9943 -8721 -9171 -7357 -5713 2076 -3221 1924 7141 16372 12627
21996 12627 5232 -2564 -1287 -5278 3693 3567 6468 23134 25011 21582 14942 12322 8913 3525
21982 3525 -3075 -104 -1790 -5754 -17299 -7129 5137 18763 20972 21334 6989 -10652 -24933
21969 -24933 -20132 -6459 -676 -4884 6362 5530 -2142 -765 -9044 -7418 -12113 4138 13150 5355
21955 5355 8901 8030 5974 -10252 -13387 -8580 2322 7340 5696 -9029 -6098 -5562 -635 6992
21941 6992 2457 -1419 11613 8609 4635 -4288 -670 12517 20271 15662 12585 11901 9964 10986
21927 10986 1705 -268 6712 4173 7069 3289 -11681 -25365 -22025 -14398 -9992 -11601 -14003 9896
21913 9896 14298 2454 -9519 -20627 -18343 -23503 -7236 10265 8016 7101 6971 -6193 -17196
21900 -17196 -14404 -3970 -1090 -8601 -4347 6942 14618 6330 -1794 1618 9701 11727 3141 -3410
21886 -3410 -11795 -21113 -35032 -36672 -24282 -10562 -12857 -15769 -22114 -28402 -18996 -15860 -22501 -15274
21872 -15274 7712 10002 7018 14913 25207 15596 3474 -282 1022 -3173 1826 -11231 -15952
21859 -15952 -11322 4466 9895 -4538 -6111 -1016 9286 -1871 -9698 -2449 5307 -1033 -2672
21846 -2672 -2967 6500 14533 14954 1504 3314 1375 6866 9883 8283 -1351 -5667 -18068 -7104
21832 -7104 17242 15403 12200 16277 11671 -5090 -13867 -5287 -13858 -28131 -26735 -30176 -31891 -24358
21818 -24358 -26391 -27543 -21501 4603 9594 4285 389 3741 -1062 -3870 -4926 -3143 -12888 -15351
21804 -15351 -19914 -20530 -21838 -17090 989 9839 6712 2284 -1699 -10174 -12713 -2007 1819 1460
21790 1460 7887 7101 5565 4492 -8882 -13712 -6849 -9134 -7434 3809 5678 289 -9426 -12944
21776 -12944 -3579 -9116 -1029 10463 5572 9559 17551 15365 4829 4593 -8560 -18195 -19567 -10896
21762 -10896 -3850 2685 11389 11702 21992 14883 13681 20220 23334 18689 9691 -1044 -14590 -11468
21748 -11468 -16582 -9981 -7602 -4133 193 -5543 -10928 5712 16364 21400 11890 13581 22087 20786
21734 20786 13052 9405 5128 8167 6047 8557 16505 23580 26807 12586 -10201 -13491 -15512 -11001
21720 -11001 -11688 -16547 -15816 -9605 -7534 -18032 -7238 3098 9378 9994 -1379 -5766 2958 647
21706 647 -7114 -17431 -26342 -19603 -18034 -16001 -16117 -3242 247 2737 7618 10398 25438 15027
21692 15027 -10028 -8769 -2530 6520 20237 19056 16691 11524 -1098 -11631 -23326 -21102 -25343
21679 -25343 -23049 -22426 -17420 -25752 -15103 -24386 -22773 -29192 -39437 -25438 -12294 -15203 -23408 -22130
21665 -22130 -17175 -6104 -4769 -2728 -4462 -3014 -3810 5174 861 -6636 1805 4098 10961 10103 3337
21650 3337 -7351 -15567 -17551 -16015 -4139 7340 2373 -12002 -8486 -23952 -31258 -27095 -31739
21637 -31739 -41732 -37161 -14269 3095 5295 3081 2672 -1661 3712 5201 11833 18845 14474 13923
21623 13923 11800 7067 3559 890 5625 -7151 -6657 -12314 -20699 -13616 -16777 -15489 -2850 -10675
21609 -10675 -17227 -14605 2821 9723 6619 13825 4561 -17862 -18993 -9842 -6134 -9078 -1021 14312
21595 14312 8793 12143 9720 5048 -1262 -7737 -18103 -22473 -11545 -6707 -2557 -8504 -18015 -13659
21581 -13659 -1111 3654 -1205 -6523 9866 19036 18149 486 -19374 -13420 6126 6889 9733 16653
21567 16653 21173 25317 20614 13887 5083 -1008 -10950 -16366 -5093 10116 4614 9251 8373 4427
21553 4427 -13839 -21769 -29740 -26658 -16062 -97 5981 -1317 -19766 -32504 -21293 4573 13331
21540 13331 -4172 -16035 -17956 476 3982 3490 7395 -5712 -1423 7172 6258 -4557 -8632 -3680
21526 -3680 8921 -3989 -8823 -3764 4363 10808 6189 1599 698 -12124 898 3417 -2323 -10284
21512 -10284 -11052 1366 10225 10288 3062 -450 -2876 593 648 -1909 5483 3749 759 -814 10772
21497 10772 13833 15975 14422 -3677 -18732 -24414 -10806 -2120 3635 12337 4310 -6611 -5248
21484 -5248 -12972 -10735 1005 2834 6127 14832 15232 -1886 5029 9886 11511 21898 16882 75
21470 75 993 3664 -2778 -5442 -1438 5268 3540 -6159 -1522 10933 -5049 2688 5124 7459 1771
21455 1771 6082 22422 23213 19626 24391 14665 18113 12740 7131 3432 -5549 -10393 -12018 -14552 -10763
21440 -10763 -14013 -12570 30 3904 350 -5332 3339 4262 -3051 -180 -2344 -4668 -15778 -19444
21426 -19444 -9389 -627 -10345 -12591 -14770 -23600 -19891 -12529 -14933 -13922 -6913 8797 7529 -10734
21412 -10734 -7499 -5238 700 11528 12786 9762 6145 -10341 -4490 2744 5890 -6540 -3306 15309
21398 15309 27810 12036 -13645 -22479 -31490 -28196 -24653 -21681 -12797 2998 16117 7713 2432
21385 2432 23349 31729 22210 19542 27185 22763 12583 6345 6842 2315 -21188 -32583 -22927 -14206
21371 -14206 8214 34392 32411 25613 17817 14842 589 -3221 -6193 -3601 -10893 -16920 -11268 -7213
21357 -7213 -3275 4364 9995 5138 5753 6258 5340 4833 -5254 1160 1452 10253 11931 6376 -1611 2665
21341 2665 4121 4206 14877 11677 5246 -5554 2564 1095 -1592 104 -4797 -7698 -9795 -18166 -18229
21326 -18229 -22153 -22401 -19609 -18098 -9192 -2402 -4810 -5119 -14347 -24675 -33445 -26705 -13503 6404
21312 6404 9564 4727 1685 -2750 1720 20 -8862 -19268 -25269 -9140 -7497 -14504 -15471 -15747 3883
21297 3883 11690 -887 -2033 8966 19829 24065 16104 24618 34265 14486 9129 10539 18140 23233
21283 23233 24366 4059 -18659 -16954 -5238 -1068 -1755 -3114 -4914 -13475 -17501 -25611 -23357 -7814
21269 -7814 -7419 -8356 -16364 -21779 -13602 -9939 -2257 -13371 -23098 -12486 839 -3245 -12007 -15345
21255 -15345 -6464 1313 7129 6690 6020 22617 18591 15327 10841 -3167 -4476 -7782 -9348 -14533
21241 -14533 -17187 -11842 -11046 -6629 3247 -2521 -162 -15865 -19631 -4217 5126 9336 9341 1077 -3104
21226 -3104 -3908 -4392 5148 13598 24314 18628 23196 26836 9664 13114 19114 14588 -7016 -19556
21212 -19556 -24686 -37164 -31880 -19729 -13487 -19883 -10046 2626 7011 -824 -517 10341 -12528
21199 -12528 -15489 11472 8409 3487 8435 20146 16343 -544 -14102 -21030 -7950 15837 22532
21186 22532 22380 18600 15479 3315 -4408 -2714 -15502 -27704 -20216 -4563 -4993 -15335 -11999 -4926
21172 -4926 1855 3728 12146 -802 -3837 13270 13584 5142 16159 18222 16686 17623 7068 -814
21158 -814 6005 23633 36469 34129 29403 25775 3809 -4620 -1883 -1601 99 4510 15312 11044
21144 11044 18996 16416 8879 10207 4010 -6 -3365 -11539 -13519 -11573 -18808 -7586 -8323 -5477
21130 -5477 8710 15424 4474 -10397 -7412 -1927 -2532 -177 -2056 10590 5085 4291 2220 609
21116 609 1452 2055 -1047 -2811 7834 20208 8978 -1089 -14357 -21489 -20276 -20999 -22104 -12461
21102 -12461 -8289 -6376 -6971 -17361 -18894 -23506 -14657 -13342 -13170 -17833 -24620 -8279 -17349 -25144
21088 -25144 -32730 -18665 -15953 -11642 465 13858 16107 8687 714 12781 16808 5756 11494
21075 11494 10750 5529 -8964 -11871 -1171 7904 -1511 -2549 10723 9765 6766 7314 12882 7261
21061 7261 13960 9554 -3838 -20207 -25284 -29210 -22990 -18293 -6022 6352 5597 11855 4953 -5383
21047 -5383 2967 5322 -3925 -1189 -23 -2889 3317 2235 -14149 -26955 -19223 -5995 13320 14580
21033 14580 14153 15267 12135 -10292 -28261 -15807 4923 -1219 -6659 13343 29188 29173 17512
21020 17512 -3901 -4511 -42 8659 10981 7775 8354 12794 -2614 -17097 -19182 -23184 -26161 -5255
21006 -5255 -10803 -27774 -28939 -29156 -13413 -6562 -7532 -7880 -11032 -12472 -6809 -5919 -1020 7974 2605
20991 2605 -1310 -9586 -10243 -4826 -3528 -1080 2868 -9 -4972 546 7200 15339 11626 2566 1903
20976 1903 11153 22682 23135 27506 10473 -2373 -6406 -25504 -37596 -30237 -31067 -35430 -14847 -5642
20962 -5642 -1795 -1194 -8794 -810 19742 11075 -1462 6068 5428 1766 1136 226 -11165 -15624 -4023
20947 -4023 -6232 -14844 -14132 -12708 -4928 -3911 -10192 -10919 -13224 -3591 3608 -8061 -12569 -7906 -23159
20932 -23159 -25060 -12081 -20446 -21042 -15794 -18391 -7840 4818 817 -17207 -19400 -1785 12580
20919 12580 6202 -5210 -15631 -15519 4622 1828 -3641 -11212 -20990 -12735 -3137 2282 6525 1669
20905 1669 -5484 -7950 -1953 3179 -339 -6657 -14964 -17212 -7581 -5423 -10089 9488 8078 6886
20891 6886 -1915 -7498 -10525 2460 16131 13510 8161 8133 -3767 -1914 -6982 -18748 -20762 -7985
20877 -7985 1136 14158 7894 -9733 -14464 -10153 -4284 -5007 -3910 -5569 4827 9089 7585 2165
20863 2165 -15876 -28632 -18774 -3443 9449 -3209 -28002 -21948 -19817 -14013 -12431 -12028 -7825
20850 -7825 -1570 -3249 -860 2465 -694 -17265 -3018 5434 4906 15812 10672 8247 3725 -14320
20836 -14320 -31504 -30898 -15144 -10059 -1160 -6474 -7594 -11601 -10252 -7287 -6398 -5781 -6428 -12133 -11707
20821 -11707 -6329 8870 4479 -8716 -14616 -4923 -956 7413 3586 -3505 8374 5471 3769 2174
20807 2174 3079 -1196 -6930 -6982 5745 12356 2915 -7762 -11087 1684 7746 2752 -721 -10631 -6292
20792 -6292 -4615 -19338 -8486 -4426 -12021 -10926 -14947 -197 6891 3680 -2 -3201 -17531 -17517
20778 -17517 7054 14568 13608 11473 9553 2432 -15471 -14451 -15276 -14850 -21006 -20836 -26901 -19438 -3415
20763 -3415 2535 5428 5645 7156 14232 5524 4482 -5024 -8531 2049 7352 12922 3185 -7710
20749 -7710 -160 5374 2403 16850 20990 7230 395 424 -4650 -12273 -8580 -49 8967 12425 12965
20734 12965 10329 4859 -1565 -138 7988 -9871 -16168 -7104 -6805 -4529 -10726 -11973 -16281 -21708
20720 -21708 -19827 -17174 -3516 15747 25282 21862 17540 16709 12917 14063 9931 7587 9201 -4611
20706 -4611 -9275 -4241 -1614 3625 -478 6794 2132 -3100 -7717 -12309 -8422 6209 26714 30284
20692 30284 21110 7596 -11760 -12851 -14012 -16619 -14565 -9549 5110 4101 747 8184 6897 1384
20678 1384 -1345 7144 9324 6221 -13004 -11744 -16316 -24603 -18948 -1045 -5784 -11501 -1460 282
20664 282 1232 4593 11600 22273 21890 29805 33931 25697 8359 1302 3981 -467 -2451 -1570 -4012
20649 -4012 7372 -1124 -956 -11082 -19823 -16641 -13513 -20261 -19274 -15851 -2389 2753 9859 11897
20635 11897 11329 13589 -3616 -8478 -13176 -6040 12487 12556 819 -6234 -7437 -12763 -10657 -9887 -12301
20620 -12301 -18474 -17733 -20302 -20449 -16396 -9765 -11361 -1600 -8350 -21865 -28134 -19106 -1008 -5307
20606 -5307 -10364 -3579 3552 5944 -3814 -7993 -6005 -10344 -8925 -6944 -12293 -24761 -22992 -14184
20592 -14184 -16578 -26171 -26799 -11170 -6600 -6781 -1483 -1636 1721 7423 1030 641 93 -4016 -4507 -11780
20576 -11780 -26471 -29172 -14207 -14202 -331 -3888 -12917 -17719 -17639 -8405 -11316 -15107 -10137 3946 10484
20561 10484 13289 4701 -524 -5951 4298 3345 -9196 -5368 -4615 1094 -6692 -7610 -1677 5110 -4272
20546 -4272 -11731 -3904 -7179 -3047 -2044 -8237 -13092 1994 5042 -19293 -25168 -22746 -4764 21219
20532 21219 31684 26289 31301 16071 5189 1799 9354 5298 9781 -100 1435 11722 1037
20519 1037 739 3835 9056 186 5664 3094 -7186 -9965 15829 18111 14525 7637 8580 7384 9819
20504 9819 4657 4359 6162 780 1383 -4964 -7738 -2284 8120 12860 -3790 -24594 -25662 -19378
20490 -19378 -8582 4678 16061 12643 -4413 -16010 -4915 -815 -4155 -9883 -20076 -24305 -7979
20477 -7979 -3778 3924 -2652 5964 12219 24725 23623 17761 9110 2042 7496 6547 -11460 -21544
20463 -21544 -12878 10190 9597 3831 -8461 -22389 -22542 -2189 5137 880 1382 -6631 -8178 -14801
20449 -14801 -9008 -2341 -1334 465 1615 -8462 -2638 -1634 -5566 -872 8692 6261 7204 7158 9848
20434 9848 8301 -10049 -15163 -22731 -25677 -5535 3179 -11043 -17139 -11563 -5092 943 -96 8814
20420 8814 11258 4572 1989 2030 8957 10719 1392 -12260 -16077 -11594 -6557 -11892 -15067 -16059 -23948
20405 -23948 -18576 -11774 -1056 3028 2792 827 -9852 -13226 -8273 -8577 -12183 -23344 -11322 3186
20391 3186 18677 26442 14938 4767 5527 12379 14109 17678 24950 29536 16452 7844 5221 8616
20377 8616 -5000 -13393 4409 6148 1796 8992 6263 -2592 8207 15049 9742 -341 3352 324
20363 324 7779 12775 9014 11502 -531 -7294 -10032 -8882 -2750 11560 13125 -6195 -12699 -4440
20349 -4440 -5622 5582 14043 3092 2983 4813 12611 7711 -3678 -5079 -3030 2069 19604 25610
20335 25610 17163 4477 4773 -1893 -13958 -19111 -15152 -5349 -818 305 -364 -2445 -7620 -11090
20321 -11090 -7606 -18012 -23021 -29094 -22534 -6488 -6453 -17890 -21012 -6445 -3736 3493 12340 22308
20307 22308 16447 1880 -4978 -4792 2672 2281 -18009 -29525 -10131 -3812 2334 7889 3068 4117
20293 4117 -6371 -19045 -26603 -16228 -5200 -653 -17212 -24323 -6763 6133 3787 7515 11477
20280 11477 -5902 -31896 -45978 -38849 -36133 -40504 -38101 -19497 -13270 -8184 -10844 -12204 -11150
20267 -11150 -13342 -15040 -8194 13853 23489 26760 22032 8666 -10295 -7981 -6805 -14723 -19052 -6276
20253 -6276 7487 11218 10005 5670 8684 11455 7844 13084 14939 12255 4520 2759 18554 15741
20239 15741 8015 -4974 -12167 -7970 -10062 -3735 -11638 -13542 -3526 370 -12859 -8912 -11937 -9312
20225 -9312 -11417 -14200 -10073 -15599 -16235 -3531 7718 6031 8268 6617 -339 -11370 -21333 -23279
20211 -23279 -12428 10962 8105 -13459 -11816 -20859 -13974 -3327 -5978 -1579 4759 10714 8217
20198 8217 -7732 -17453 -16684 -3764 -3611 -12547 -12134 -24520 -15147 14442 14561 7380 -1161 5914 16963
20183 16963 14022 20092 13656 16904 14019 7581 20520 18178 1732 -3594 4919 7792 4949 -1950
20169 -1950 -9886 -17031 -12010 -8201 -11051 -14414 -19167 -28511 -29415 -28791 -30536 -21135 -17801 -2405 7952
20154 7952 5477 5538 656 -20390 -25121 -20040 -12103 -3296 2034 19894 26448 -1201 -15974 -3826
20140 -3826 -6863 -12300 -12743 -7215 -6310 -4982 -10616 -17912 -14441 -25309 -28891 -13520 2214 -2544
20126 -2544 -11027 -16872 -13858 -17635 -15157 3553 3219 8017 11134 -7777 -16307 -23472 -20218 -22183
20112 -22183 -11806 -16981 -14544 -12765 -16011 -16074 4058 8977 -7605 -5260 -12287 -29471 -17021 -7499
20098 -7499 -10644 -4762 -524 -3299 -522 6403 13742 16566 12597 -12432 -28030 -23228 -9981 2160
20084 2160 -236 -3166 -10539 -19514 -16750 -15969 13248 19057 11615 17464 23753 14529 23803 26600 27214
20069 27214 25039 7628 1908 17269 24270 15239 7250 -2874 -3844 -415 488 -9652 -6764 -10249
20055 -10249 -11732 -10033 -2580 12626 20784 6124 -11224 -2222 -14500 -27476 -31451 -36706 -24503
20042 -24503 -29330 -16164 -1289 -2777 -2580 -3563 -17701 -21823 -27418 -37625 -22884 -2302 5379
20029 5379 6751 5927 853 -6365 -13034 -19626 -16274 -9981 -7372 -5991 -2995 5174 20784 22730 18865
20014 18865 17264 16769 15095 34513 35797 23365 13841 -1412 6908 8234 578 5224 -9449 -14476
20000 -14476 -10405 336 7276 -2340 -9544 -24391 -27603 -19638 -10486 -11121 -10570 -5550 5193 9324
19986 9324 2376 5886 11687 1965 3900 -6956 -17507 -16248 -22617 -26896 -12296 1488 20 -3661
19972 -3661 -5995 -9168 -10150 -22462 -13671 -13036 -17992 -25395 -21612 -13869 -9447 -12779 -7021 -5831 1749
19957 1749 5006 6338 -3205 -2600 -1324 3700 11853 17931 19111 13579 -989 -9384 -10341 -904 1957
19942 1957 -3057 -801 -1237 1295 3586 11159 2417 4243 -1947 -8798 -7076 -13873 -8751 -1433 3930
19927 3930 6071 13827 17133 17629 1831 -14372 -29700 -22691 -16443 -14070 -3387 -6703 -1309 -9077
19913 -9077 -6280 -9518 -24482 -19401 -11875 -9981 -13844 -5023 19664 32591 25183 9156 -5594
19900 -5594 -1473 -7650 -13649 -19280 -16974 -18872 -26125 -22736 -2179 -4260 -19183 -14020 3920 8346
19886 8346 -2395 -2127 7983 15573 11935 -2898 -4692 -4154 -34 -4492 -16242 -16758 -1210 -4877
19872 -4877 -13812 -7719 -3735 -11674 -6962 7296 8880 6659 7287 -8961 -5231 10518 21228 25734
19858 25734 16412 18385 33985 29247 16136 7525 -2031 -19799 -28291 -11225 -12411 -28797 -21555
19845 -21555 -10817 -14513 -16266 -9412 -13444 -28551 -25902 -8873 2202 422 755 2429 2907 6410
19831 6410 -11256 -20284 -12488 -647 2711 13063 17593 16110 19590 15127 9751 19801 23228 17746
19817 17746 8152 8269 7094 -406 2579 -4238 -2797 4412 -8574 -14427 -15271 -12312 -15374 -18913 -6588
19802 -6588 -30 -1607 -10195 -12646 -8833 -9555 -10744 -10118 -283 8993 -10153 -16782 -7256 504 10197
19787 10197 24094 23505 12520 16383 33556 24881 17093 13690 10201 13018 12364 9009 2425 2696
19773 2696 -2194 -5996 -7322 -7599 -16334 -5899 -12577 -23728 -13841 -4699 -2088 4811 10378 -3697
19759 -3697 -15561 -18917 -187 -517 -1868 -3832 -2206 -7903 -21673 -28627 -11083 6496 2829 11010
19745 11010 20355 10109 1458 -3029 562 -2001 6957 12001 12873 26933 25884 20690 21637 12719
19731 12719 2735 2447 -4989 -3093 -8431 -4063 2125 7474 2323 -620 -16196 -20224 -8343 7627
19717 7627 23404 23028 22121 22966 18417 28618 32573 28420 23933 19043 21779 21400 14222 19377 6801
19702 6801 2473 18508 18492 14219 14859 7718 6928 1782 -12126 -12572 1105 6915 5299 14547 6316
19687 6316 3140 16513 26184 18556 22328 20214 10411 13340 -6258 -12606 -14886 -5545 -637 2993
19673 2993 13521 13940 -3409 -8446 -5293 -6075 -4204 4672 15065 25419 18803 8749 -6083 296
19659 296 13003 18339 11724 20097 23370 14763 2670 -3126 1841 915 3350 -4825 -4953 -1821 10711
19644 10711 3439 -18158 -18244 370 16370 12257 3392 -1109 -3090 -12473 320 1640 -11159 -6834
19630 -6834 8238 8365 -12835 -11051 4658 7260 -5959 1829 3955 -11009 -7779 4359 13281
19617 13281 -5805 -7462 -12191 -3171 -3865 -14146 -21878 -17622 -21623 -19283 -8285 -6865 -8825 -15034
19603 -15034 -24963 -11826 11455 5545 -4119 -17903 -17766 7035 17821 11400 1390 -732 1445
19590 1445 -1409 -13340 -23746 -22474 -3742 2723 12327 18725 20720 20890 12934 15278 27688 13280
19576 13280 18294 25936 21949 13705 12997 -2741 -12118 531 13448 10007 5420 5849 9555 15500
19562 15500 17767 16233 35571 37599 23034 32217 29792 6952 15042 15819 11104 7879 21733 20226
19548 20226 18014 11092 12661 6203 3377 1238 -7044 -12289 -3216 7429 -5815 -6109 -6345 -1250
19534 -1250 4111 11518 17002 5198 -11049 -1419 656 -7309 -1849 8278 9684 10446 15667 20036
19520 20036 34211 30209 16205 15232 18924 25327 22260 6193 3238 -2732 -6441 -5357 -10062 -11672
19506 -11672 -8155 -9142 -12178 10470 2604 -10295 -12665 -12594 -19884 -27765 -12872 1414 -6075 -11026
19492 -11026 -8033 -7901 -9607 -11770 -11854 -2541 4306 -12184 -18818 -3658 5610 13525 11775 22223
19478 22223 13665 10929 11635 12239 17220 7546 5205 3642 -10594 -18122 -17315 -12673 -3620 -2094 -6538
19463 -6538 -9712 -15251 -10719 -14467 -24700 -18676 -813 -1447 3142 -1485 -8465 -9715 -3079 3243
19449 3243 10920 18940 14733 14107 10884 11452 31151 25933 14619 3547 -2216 -14017 -16062 -10343
19435 -10343 -3166 -4812 -1151 22385 30799 21833 8756 11763 21225 20086 19313 19219 12660 11743 11814
19420 11814 22424 22093 17253 22869 21399 7536 5925 4635 1317 15822 26094 16245 4443
19407 4443 9859 5617 -2399 -7617 -11528 -5327 8281 12052 13554 8751 8277 4965 5571 10043 14094
19392 14094 23611 11289 -2723 1268 -882 -6022 -4679 7599 17968 5291 3091 4533 -10835
19379 -10835 -6213 8281 12640 17721 9886 2632 2219 5073 -8835 -5902 -13216 -5372 878 9773
19365 9773 14274 10658 3044 4618 -882 850 -3702 -8322 -15587 -20342 -14985 -698 -532 -2453 3002
19350 3002 2087 -1292 -2054 4094 15177 10299 -4493 -11685 -8775 -4740 -3412 -3085 -1731 -4862 -6812
19335 -6812 -6813 -2182 -4397 -7313 4686 16821 5579 -9965 3385 -2828 1104 4555 854 -843
19321 -843 -7430 -8719 2399 12657 14399 7848 5477 -2619 -2846 11311 14096 15376 12302 19383
19307 19383 19617 11950 4358 9805 -876 -3429 -5986 -4323 -5869 5286 9483 3393 7825 6439
19293 6439 -19055 -22806 -17318 -460 2500 -2460 -3099 9581 5921 -9611 -13942 -3613 -1792 -12824
19279 -12824 -22883 -17355 -9995 5019 18491 24564 19120 6867 -254 -8516 -9642 2592 3970
19266 3970 8575 12654 1150 -15588 -26341 -25544 -15599 -9487 -14544 -961 8411 8028 213 -7938
19252 -7938 -6263 1277 9157 17743 12484 -9204 -25212 -23398 -15229 -14633 -10822 -13520 -11963 15479
19238 15479 22218 19272 8009 4330 4870 -1655 -3161 7551 1528 -7624 -17343 -20084 -4791 3025
19224 3025 5263 -4959 11730 17735 14249 -1878 -2652 6305 10001 3700 10302 18128 24600 18773
19210 18773 14561 22286 8584 7032 14247 10635 19289 21216 2257 -13329 -16287 -10585 1841
19197 1841 1513 2551 5118 6729 4155 5709 4622 -2510 -374 -10173 -9244 -6162 -2942 12475 18430
19182 18430 18215 13425 12109 12760 13818 20923 17430 20502 14728 8642 20375 17363 15077 18042 13229
19167 13229 11055 6528 341 6714 194 -3056 8991 23608 10732 17877 17718 7268 -8888
19154 -8888 -1687 7337 9990 14412 21870 14643 12236 14021 13079 14225 12022 18443 665 10278 7127
19139 7127 -9674 -1107 -587 -2049 -1620 -3477 4175 25745 26122 16822 5200 -11098 -15813 -835
19125 -835 2166 -2284 -4365 3150 10780 21372 14597 6983 -438 -2899 -368 5207 23303 36680
19111 36680 28290 27095 25103 28404 24614 31893 33021 32346 31708 33883 36163 45845 41989 43794 44738
19096 44738 43192 42872 44445 43111 45333 42642 25650 8592 12480 26392 32047 43431 39381 19886
19082 19886 -5431 -13801 -13524 -15318 2546 23537 17089 12310 26794 41855 33690 20760 13252
19069 13252 18528 12196 7639 14433 10939 6360 7509 17492 32167 35569 28756 29018 20570 5311
19055 5311 11752 22768 30389 43961 56535 61391 63751 61212 59618 54259 47850 63071 55529 31340
19041 31340 4090 5676 7424 24177 43675 45504 41178 29956 19803 5337 -3933 -351 14163
19028 14163 25220 24473 19247 12801 9548 18376 23160 20330 27498 30076 18067 23341 13284 8529
19014 8529 26141 41628 45366 33502 34221 28276 13086 9071 7920 4832 -4988 5543 -265 864
19000 864 3371 13062 5042 3011 2807 14307 18466 9690 4556 3598 16787 25672 24606 26418 31624
18985 31624 28927 32551 23146 20049 14458 4068 -1387 3481 4912 2845 8244 10700 -808 -6979
18971 -6979 4145 4449 -2029 -8449 -4241 8209 20483 19855 9621 10156 10114 13376 13132 8793 5138
18956 5138 1642 8376 19123 29435 34347 16483 2613 8212 14827 24555 26736 18862 18111 4748
18942 4748 2598 18273 26927 20993 13286 11405 7656 9931 19941 7708 10879 16593 14501 7165
18928 7165 6146 10508 7144 -1866 -148 12879 20405 35023 30157 20057 17159 22546 23763 15438
18914 15438 14936 26849 17008 8342 3415 -2766 1598 8263 30826 36746 25712 15217 12735 1720
18900 1720 -1030 15785 20491 22807 27859 22416 11176 12449 24294 29410 36499 47535 51223 44317
18886 44317 28271 28308 25977 17339 12136 13558 16374 21338 20269 15060 14089 28630 36455 39816 41092
18871 41092 32830 19606 15655 16391 26268 26377 33539 24390 14620 13324 14225 8847 11592 10858 11290
18856 11290 28950 33249 23535 12034 18353 28013 25841 19522 16544 25010 33159 33257 21268 29796
18842 29796 34863 21064 20475 24671 34834 36547 26073 21607 33848 36809 38534 32865 20095
18829 20095 11217 19072 22914 21706 20256 37698 52502 42078 40386 40535 28511 19745 18250 13586
18815 13586 6632 -7500 -2588 4228 17834 25779 40366 49924 55173 39713 21334 20820 22657
18802 22657 17781 20857 21409 21507 10481 12521 24542 36157 28285 25349 35239 39777 35028 31316
18788 31316 41356 46273 46259 44294 34927 25993 16772 16548 21762 36085 35393 38660 57182 57970 51544
18773 51544 49956 49187 55960 69021 86509 115376 140003 157913 145330 122284 91221 63837
18761 63837 60044 56007 50023 40513 26171 25021 27787 32608 40391 46692 44309 41034 27628 32673
18747 32673 24965 38514 32122 25644 23958 24730 22612 25723 27987 35992 34056 33390 32955 32704 20577
18732 20577 7802 6584 14430 30880 37411 29184 31674 31829 32065 42607 52991 48456 49362 41089
18718 41089 27481 25621 25272 24848 28763 37304 53734 53511 48254 40138 42996 47664 56085 65196 69985
18703 69985 71745 74152 92777 123410 141229 137878 162233 191156 207212 230553 250748 261404
18691 261404 271520 275946 286572 277451 280897 286249 296869 305016 287638 271576 267163 258088 250103
18678 250103 234815 219761 194820 179968 177971 183166 172631 164346 162708 162491 162143 164741 149993
18665 149993 130862 125581 130586 125164 124389 121089 115630 114301 106002 112762 130225 134954 130023 146890
18651 146890 167289 162764 161843 179789 209748 236030 244165 263127 282539 289180 294204 303722 324003
18638 324003 352787 375170 400876 409434 408697 415939 411485 397834 382337 351230 319061 296157
18626 296157 267513 243456 222991 190487 165346 143893 135613 137221 125698 112342 120192 120750
18614 120750 122721 114782 100110 90007 85158 82096 80766 75893 76676 82618 90937 97089 113451 117770
18600 117770 116347 111620 105287 98911 95370 91017 114705 121237 104355 93878 102767 100015 95838
18587 95838 78660 85564 97533 91858 93295 104017 97355 93543 80990 78613 81794 81280 75164 73130
18573 73130 64614 59418 51715 62346 79462 82725 88693 89512 87017 91166 97128 98309 101810 112145
18559 112145 118764 116432 104548 105035 123106 134273 136454 131132 146234 161033 162314 167010 164361
18546 164361 147152 134371 130862 115242 116125 133579 134986 133536 143698 140412 129221 119510 108297
18533 108297 107992 105925 101483 99924 95919 101068 94702 88078 77024 82716 96477 78212 82912 82574
18519 82574 77430 80346 71304 58329 67807 64994 61494 61036 80368 87326 92084 87392 86225 114615
18505 114615 135029 134501 132747 126612 113064 112417 111351 108809 104633 99914 99874 96091 95395 98105 98537
18490 98537 95494 99419 104702 94658 89527 97160 104599 120884 128368 119715 100848 86420 65813
18477 65813 48455 25260 266 -21497 -23038 -17475 -13663 -15673 -16083 -16921 -11322 -12039 -2067 21108
18463 21108 18465 22797 30710 28900 23986 31359 37062 35665 40656 32764 39309 57730 71204 68853
18449 68853 47720 33789 28738 34530 31744 19690 31979 47486 52102 59332 61530 70500 74680
18436 74680 61781 60349 63345 82208 100961 107626 108112 132074 150920 163312 188366 200693 206554
18423 206554 232236 263415 288482 302180 305065 301480 281504 248282 215645 192068 168635 159813
18411 159813 154637 128601 119479 109118 93941 81215 66948 76325 73686 67226 75111 85363 96747
18398 96747 98404 90481 94680 81739 75252 61217 64385 77557 79507 68540 60567 64507 67991
18385 67991 73817 74927 71376 65535 49356 47655 58883 65866 67735 56258 54848 50296 44313 62804
18371 62804 79408 83434 81902 94732 109946 112806 110598 98072 91507 94106 97169 103070 91555
18358 91555 85666 96964 110115 98666 108825 112499 121998 125000 123874 129969 145053 150984 149319
18345 149319 169318 183807 195027 203238 199915 207319 207377 199248 202456 207209 216692 204051 192783
18332 192783 187809 182448 170060 159146 148044 148599 145845 129091 119508 108294 109775 132904 159769
18319 159769 202465 227418 233476 234397 211964 200149 200251 227288 236588 239564 242417 259495 269696
18306 269696 275975 283278 300961 305443 302431 322260 334662 355238 368172 374940 377098 380864 363233
18293 363233 347372 354745 413413 508741 600578 654188 648628 636658 613272 567565 530983 500141
18281 500141 467203 454303 454802 442848 411578 402386 407326 418492 433984 445050 445061 445050 463098
18268 463098 468301 471155 476673 504794 543015 571655 610985 652464 688852 713978 772459 830123
18256 830123 900315 983622 1102764 1280569 1523249 1824254 2111555 2222056 2128660 1909661
18246 1909661 1656711 1444712 1275962 1167906 1105942 1080579 1077710 1081158 1091622 1109486 1139264
18235 1139264 1161144 1183582 1202771 1236919 1265387 1289445 1305217 1325007 1366209 1411865 1435558
18224 1435558 1482411 1534703 1570889 1620697 1706204 1788747 1833051 1850659 1870674 1893519 1917058
18213 1917058 1941552 1977466 1999864 2015335 2036715 2086655 2136405 2193376 2242346 2295841 2384211
18202 2384211 2501632 2636603 2783705 2922089 3083279 3254191 3446668 3637547 3849207
18193 3849207 4081555 4352493 4633540 4941778 5302274 5734518 6230520 6830158 7527951
18184 7527951 8332285 9274399 10345820 11612911 13144316 15082213 17595690 20722741
18176 20722741 24505061 29039187 34511459 41220681 49590517 60267818 74611686 95298368
18168 95298368 126336249 171541257 228042614 277154886 291142369 262352374 213091756
18161 213091756 165517731 126552798 97066561 76082666 61494736 51171286 43594571
18154 43594571 37928663 33656296 30334593 27643274 25374505 23381648 21657591 20176623
18146 20176623 18932494 17879477 16981079 16211045 15547406 14944368 14415346 13939393 13528155
18137 13528155 13210045 12958760 12757399 12615418 12507736 12438875 12428577 12463195 12538523 12584709
18127 12584709 12480531 12145813 11672234 11152610 10639702 10178463 9805510 9495078 9254649
18118 9254649 9085789 8965269 8917232 9014033 9322113 9881187 10878899 12578307 15464911
18109 15464911 19852191 24231457 24660872 20539009 16244233 12953968 10281395 8365673
18101 8365673 7031108 6081261 5377365 4839660 4430928 4105348 3830478 3617633 3409234
18092 3409234 3227570 3056679 2919298 2810457 2709003 2625867 2558232 2476295 2406648 2345689
18082 2345689 2296407 2251466 2206422 2171653 2159214 2152946 2147566 2161909 2220138 2325510 2517689
18071 2517689 2808693 3132104 3300343 3191301 2870713 2486552 2139221 1851469 1619800
18062 1619800 1451205 1322033 1213559 1130961 1043257 971764 928312 895739 858276 815877 775430
18051 775430 724591 689673 668032 644845 636382 616662 612535 608816 614332 606832 589437 577400
18039 577400 590201 624128 673571 702124 710975 718314 734898 731689 713130 687706 654269 611802
18027 611802 574746 538081 486627 441487 403717 372004 330445 304601 282776 271382 263722 248076
18015 248076 221231 214567 198854 172858 184213 201412 243846 299099 310250 292387 282834 287456
18003 287456 286868 276614 270270 280200 291918 286582 286953 288773 285030 291854 300420 315179 308510 309044
17989 309044 336086 352976 361338 358988 363311 378185 386999 390149 398970 403765 393026 383278 369145
17976 369145 361203 363542 353218 360229 363151 354803 336382 327511 322276 326578 314295 302845 310794
17963 310794 299836 292639 300977 296564 292159 283889 273621 263459 260121 255150 258792 258279 264970 264577
17949 264577 261543 246398 227193 219238 206911 197501 207975 214779 212001 206290 209844 209558 204672
17936 204672 197632 203576 197535 186258 172502 179755 188336 207723 236484 255190 266104 248737
17924 248737 227079 216498 207538 199749 198103 209153 217897 218247 224124 238322 264660 293749 302099
17911 302099 300779 299414 308093 323236 325333 325866 329719 344876 375629 412947 458993 500277 518675
17898 518675 530388 545830 552695 523884 481544 445874 407471 372627 341290 305981 290937 283957
17886 283957 290119 279490 269708 258463 240583 214515 189084 182616 188091 177228 180505 181420 176532
17873 176532 180517 178360 175606 186870 195387 198589 200071 201203 218851 235407 241110 257944 275480
17860 275480 291554 305205 325398 347497 401238 439139 441017 425976 422058 442389 470927 504153
17848 504153 530025 528966 504969 469631 445983 411692 366249 322577 277192 257809 251056 241534
17836 241534 223640 206981 198864 181983 165044 168406 165786 162737 142135 120776 121376 123089 132819
17823 132819 136061 113179 108936 94571 91545 99405 93863 103886 110463 96929 86970 89234 89770
17810 89770 92706 90547 90256 80278 89701 98553 96983 80240 75406 73541 74607 67058 60233 61829
17796 61829 73945 70954 70510 64140 47631 49184 42423 48962 50035 56605 60288 65206 54133 65819
17782 65819 71493 85517 78775 71576 57753 42524 37744 27811 32174 36556 33710 22873 7821
17769 7821 16111 37715 51117 48245 43495 43297 44053 34354 31383 34091 33284 21489 8561 2143
17755 2143 -1888 8742 17384 24363 53301 45500 37314 34102 35127 37525 34339 35898 34665 26825
17741 26825 23607 16594 7589 2539 13676 20129 4890 5397 7690 9074 25227 27243 22944 12618
17727 12618 2365 5700 11136 18941 26454 35295 40670 44102 49852 47608 43268 49947 54128 56845
17713 56845 63507 62454 74322 69788 85950 94880 98738 110285 115851 130898 152892 178487 200996
17700 200996 227644 278098 334982 407475 468934 519230 565925 609645 632680 648369 657394 642295
17688 642295 611005 579615 559384 533228 508712 472996 440981 415517 383737 356632 324381
17677 324381 303342 283049 268861 278445 267353 256835 259453 258878 276400 292768 308651 322852
17665 322852 335793 349960 351636 347165 340621 345533 340218 342468 330967 309986 308080 305291 297462
17652 297462 302828 308334 311312 321041 347422 379228 396759 417655 425175 437072 449300 456550 463897
17639 463897 462458 455225 444748 420143 401757 381199 363248 350855 335873 330746 316585 287352
17627 287352 272192 262546 247198 228654 195411 150997 129702 136117 137876 113081 105044 95580
17615 95580 64138 48592 63317 66123 70195 68358 57566 34276 34071 38958 48014 62802 57863
17602 57863 53847 43870 33959 37143 40524 43638 37003 27224 26019 31363 37779 30032 19245 7254
17588 7254 4899 12467 10682 19021 16545 6402 2853 9078 6469 1339 6053 -7022 -5125 16560
17574 16560 18243 14524 21389 19300 9295 14244 20138 24314 24628 23185 6604 -1150 -7399 -17798
17560 -17798 -17333 -3008 -5778 -2275 8421 2006 -7445 -5094 -3617 -2384 -1686 8334 21533 32081
17546 32081 30033 14546 3922 11646 11477 20688 23863 7255 -343 -16655 -22737 -20037 -10015
17533 -10015 6638 -1019 5406 4835 7379 -3920 -10704 -17019 -15263 -9887 -10651 -1485 -5802 -18659
17519 -18659 -20368 -9 12176 1342 6356 4294 -5394 -5764 -482 3793 5167 -965 -3722 -580
17505 -580 -3030 -12896 -4784 5394 17671 20553 17214 14921 2263 11215 3174 -5212 -990 1834
17491 1834 -294 9745 17685 24234 13368 -4441 -19113 1868 27041 27132 14949 2986 -3810
17478 -3810 -5763 -9819 -20713 -24322 -18067 -5872 -13358 -9562 -6017 770 2331 11142 -2893 -128
17464 -128 14450 15331 2436 -5931 358 -10168 -8563 -3548 -3997 2965 5918 6939 12200 2036
17450 2036 -223 6295 16059 15219 23338 27460 44000 77562 97044 102806 90232 70748 60037
17437 60037 53307 37731 5564 -13875 -13387 -9415 2686 17188 15211 10020 20267 19127 19171 8716
17423 8716 7170 20238 26276 23914 21880 24537 26099 2918 -2831 18804 30217 27224 18392 11796
17409 11796 4856 4993 -7033 -8358 1997 8544 11101 17188 17612 19543 27087 25026 25180 24757 14941
17394 14941 9809 8060 2673 5887 13650 18370 11515 9490 3415 -9075 -4527 13761 16591 12644
17380 12644 17906 20752 17008 21685 19499 -339 -4382 5583 7356 -4326 -7085 8908 8057 -2863
17366 -2863 -1950 -2866 -9674 -17405 -16077 -5406 -13630 -14420 -2454 -4396 -23706 -24723 -9617 -13730
17352 -13730 -10341 1173 3487 -5653 -5911 -4177 9793 17421 22523 14638 -6968 -18891 -15594 4172
17338 4172 9650 8931 3419 -3242 -4110 -4625 -4227 -3052 -8441 -3722 -3911 -51 891 1939 4495 1351
17322 1351 -6721 -6161 -5514 -13027 -21564 -19371 -23696 -23965 -19121 -10555 737 -3066 -2445 -4330 -3884 -13529
17306 -13529 -13999 -16382 -13952 -15517 -13882 -9288 -26685 -25664 -23536 -21748 -10241 -24 12625 15549
17292 15549 3095 -3807 -1440 1313 2975 7083 21921 8199 -11461 -11852 -11679 -13238 -1261 -4625
17278 -4625 -9763 -97 7773 23455 23029 8805 13157 14435 -3886 -16035 -14739 -11901 -7557 -8307
17264 -8307 -16323 -6181 -6399 -14771 -14311 -8351 -15750 -13273 -9971 -2080 -11250 -18268 -18487 -3242 2200
17249 2200 9920 2589 -3938 -5405 1160 5745 8833 11658 -570 3426 1790 5047 6540 -1768
17235 -1768 -3559 -22532 -18177 -15637 -12603 7534 4924 5401 5638 -10846 -22830 -21597 -16127 -24679
17221 -24679 -6768 3724 -1584 -16916 -5550 -1469 -2685 -1365 -12073 -21711 -16423 -7966 -4887
17208 -4887 -2245 10494 12236 5327 -14289 -27443 -38332 -32642 -12163 -12830 -25469 -20282 -12015
17195 -12015 -10015 -4901 -16699 -15445 -8311 8952 20309 11748 -1541 -2039 -631 7401 -9129
17182 -9129 -29479 -20881 -11284 6977 20503 14036 566 -12337 -16034 -8730 -800 -1288 -4882 5621
17168 5621 -4625 -34178 -19348 3268 8907 -6598 -23819 -27004 -26328 -13330 -14586 -5772 4345
17155 4345 -7406 -15500 -9266 -10745 -9143 -866 1627 2585 224 -7035 -21490 -17115 -10413 -7745
17141 -7745 5007 5395 5888 8847 10283 4427 -16522 -31529 -19577 -24430 -38385 -39269 -29053 -29493
17127 -29493 -34474 -34420 -32515 -6968 -2796 -15491 -19939 -21428 -19743 -14467 -18182 -18724 -8312 3031
17113 3031 4790 3080 -1532 -4823 -24201 -33190 -24520 -11458 -6086 485 -1019 -1661 7000 8434
17099 8434 -14 3802 9773 9526 7973 2135 -20518 -23840 -20200 -26381 -20897 -14542 -17849 -16558 219
17084 219 -9556 -20448 -17302 -13116 -9965 -19354 -16144 -26076 -46577 -45601 -32481 -22543 -8772 -4686
17070 -4686 -2451 -738 4591 8272 17991 14281 15051 21276 14250 6931 2027 -148 -797 840 -7804
17055 -7804 -641 -3791 -14984 -23628 -26265 -16195 -13925 -14201 -12677 -9179 1785 7861 6588 3292
17041 3292 2511 -6031 -10841 -16893 -21646 -17831 -9205 -11106 -17314 -15512 -2048 -7566 -19133 -22400
17027 -22400 -22825 -10428 -16129 -17699 -14266 -6314 274 1927 8135 17888 11703 13653 12271 30515
17013 30515 28702 24489 28254 39876 37062 29058 11325 12798 9188 2807 -7758 -17089 -10717 -13938
16999 -13938 -4753 12862 6550 -9731 -15783 -13667 -9807 -15614 -11262 999 3733 1933 -1551 1610
16985 1610 -4066 -8291 31 9494 -922 3276 -5454 -8736 -6246 -2122 -8044 -7345 -5852 -15900
16971 -15900 -26850 -20337 -6384 -5343 -1250 -10512 -23608 -22849 -18768 -6586 -150 -13169 -23958
16958 -23958 -12204 -6137 -5480 -6751 -9037 -14198 -9135 -7018 -1126 6883 7984 8591 -9245 -12870
16944 -12870 -6067 -4034 -18258 -23961 -24743 -19209 -16025 -23559 -37266 -25734 -8689 995 2798 5598
16930 5598 4903 -11135 -9025 -5486 -25617 -24896 -6049 7174 2458 -8718 -18901 -22303 -20894 -6916
16916 -6916 -8343 -3390 1899 8358 15652 10753 1840 10085 6493 -9377 -16922 -13656 -7826 -6337
16902 -6337 -14862 -16197 -21724 -25030 -17351 -8987 -5159 2149 13171 6994 2052 696 4143 9113
16888 9113 17734 16638 13146 -358 -782 4048 1215 -17693 -31474 -23386 -30933 -18267 -13107 -28943
16874 -28943 -36232 -31330 -18096 -22326 -33869 -27486 -22081 -9882 5740 -3678 -5573 -13514 -11081
16861 -11081 -10989 -15403 -13368 -7695 -7063 -613 -318 -11464 -21189 -16329 -13460 -4077 -4320 -7427 -5023
16846 -5023 1416 4611 6130 8411 -4985 -4633 -11463 -17689 -17551 -5860 -11236 -7743 -11512 -8615 7423
16831 7423 12086 8029 8316 11889 7631 -1354 -3937 -15120 -24548 -3994 3866 -6313 -12133 -16362
16817 -16362 -18004 -7195 -5398 -8495 -12895 -6802 -9085 -10056 -13843 -21629 -16370 -3227 -769 -5634
16803 -5634 -8332 -2682 -10743 -17675 -7795 5627 -3692 -14419 -9856 -10303 -12243 -7410 -6914 -9507 -12223
16788 -12223 -11933 -3946 7981 18536 774 -11305 -12933 -15534 -12865 5925 3229 -5260 -10759
16775 -10759 -16840 -17307 -17671 -10359 -23359 -23358 -18127 -19999 -19644 -13497 -10506 -11117 -17052 -21417 -9002 -3395
16759 -3395 -13638 -18692 -12778 -12235 2040 14484 12920 18840 13122 14996 14896 1381 -11514 -7331
16745 -7331 -6462 -572 2229 2683 10109 11137 7276 1406 -6700 -1941 -3452 -8982 -10373 2504 4345
16730 4345 16695 10889 -9516 -18110 -13678 -367 8714 7839 -3553 -15622 -25158 -27126 -25428 -22427
16716 -22427 -23407 -24519 -19090 -4633 -5736 -12693 -18494 423 6601 -3250 -13550 -20465 -25771 -16492
16702 -16492 -18522 -21578 -11229 -5759 956 6674 1111 869 -2259 -6727 -21289 -48364 -56522 -27819
16688 -27819 -38 15442 4301 -9795 -15976 -11975 -1359 3754 4865 13659 -4073 -13253 -17840
16675 -17840 -25290 -20004 -7922 -7907 -2542 15621 13378 -7360 -7411 -3771 -7509 -14343 -20215 -17983 -7454
16660 -7454 -9427 -14817 -12602 -9934 -4831 1005 2584 2548 -8648 -8553 -10322 -18528 -15827 -7149 -11903
16645 -11903 -3755 3360 479 -6818 -18071 -8877 -12807 -10311 2464 5955 8229 12300 7997 953
16631 953 -6299 -4208 7208 4486 -4053 -7794 -20035 -27474 -19804 -196 -1444 -9754 -7576 -4852
16617 -4852 -7224 -13240 -12989 -10266 -7964 4152 2106 -3758 -8719 -18733 -17089 8162 -1539 -12715
16603 -12715 -23111 -36137 -34121 -14212 -13119 -14473 -12318 -12823 -13631 -11588 -8245 -62 -456 -5493
16589 -5493 -12557 -8849 -12035 -4472 3313 -1906 -5393 -3751 14983 24550 14978 11788 17731 16575
16575 16575 10752 -15825 -35872 -38560 -31442 -25112 -13889 -12354 -16347 -19939 -14719 -10670 -18556 -18037
16561 -18037 -7043 -5636 -122 -6201 -8585 -19854 -23894 -18187 3047 7061 9048 845 -20941
16548 -20941 -23815 -11228 1520 1793 -2854 -6590 -10908 -14992 -8505 97 8861 4177 -6548 -13733
16534 -13733 -16999 -32939 -26918 -20054 -11312 -9304 -5907 7070 3243 -4628 8626 7698 4346 -8091
16520 -8091 -3894 12068 24957 10754 -7308 -10154 -7952 -10230 -7407 -6752 -17578 -15232 -7929 -6524
16506 -6524 1704 12261 22042 16765 11521 4345 -869 2048 6988 4412 -12973 -13890 -14956 -5833
16492 -5833 -2309 -11589 -10203 6887 688 -10765 -25729 -18862 -9802 -9204 -11981 -17591 -14026 -6695
16478 -6695 -2853 -10822 -17818 -17590 -17339 -13302 -5199 -7766 -12115 70 6537 5971 5316 10083 -5173
16463 -5173 -19380 -15917 -20852 -17305 -10443 3957 2435 6244 18481 1679 -13170 -9928 -3108
16450 -3108 -6959 -18982 -31693 -26440 -24209 -27257 -12401 -7453 -19503 -25003 -25396 -31586 -28837 -29706
16436 -29706 -26143 -29385 -30696 -21998 -11918 -7251 -7104 -9356 -6448 -6958 -12290 -14659 -5158 -12369 -9647
16421 -9647 -54 1832 -3160 669 11352 8418 2846 -4510 -12351 -10496 -5302 -15408 -13351 -354
16407 -354 4642 3234 -11050 -22686 -17611 -10220 -13266 -16950 -17062 -15146 -5542 1819 -1845 -13531
16393 -13531 -16557 -5400 2829 -10336 -18164 -12582 1875 -8167 -13691 -12639 266 4916 3364
16380 3364 -8255 -18004 -15156 -10512 -8494 -15986 -13965 -4801 788 2688 4152 9832 2918 -1869
16366 -1869 5825 15714 5946 -280 942 15089 29785 27780 12229 8957 15304 9028 -3569 -11518
16352 -11518 -11049 -9350 -8870 -12175 -12645 -15977 -10927 -3452 6584 3582 -2331 -10554 -17991 -16067 -19619
16337 -19619 -10104 3520 741 -3743 -14141 -18702 -18199 -9643 -16497 -18211 -15697 -26452 -28586 -17851
16323 -17851 -9801 -12065 -13343 -3778 -5379 -12260 -13830 -8612 -3499 -7255 -18120 -21763 -14552 -12471
16309 -12471 -6105 4841 6342 7307 6188 889 -15121 -13469 -6078 -7453 -5917 4510 -143 -4782
16295 -4782 -11762 -11612 -8655 -1607 -11496 -17173 -20337 -29565 -34609 -27987 -9134 7654 9204 88
16281 88 -2552 -6743 -832 -9740 -3880 -7576 -21412 -15553 -9603 -1890 2738 -1742 -5476 -9975 728
16266 728 -4649 3921 14675 11744 559 3998 14236 17958 10570 -673 7661 406 -5094 5640
16252 5640 4630 5041 8732 7793 -4641 -16414 -31649 -33803 -21646 -13663 -24082 -42289 -38822 -26563
16238 -26563 -21749 -26716 -35345 -30740 -15009 -3849 -9044 -12805 -10276 1681 6658 -7856 -13688
16225 -13688 -10116 -4796 -3814 -12446 -18462 -13728 -17849 -11819 -69 4557 -283 -13336 -16212 -13826
16211 -13826 -12496 -12704 -9827 -6771 -5173 -3413 1850 1332 5687 10640 12829 11099 4525 -11134 -24456
16196 -24456 -20550 -9169 1674 -4643 -7899 7535 11870 -2515 -984 4186 6117 1185 -8356
16183 -8356 -3597 -4295 5880 7962 603 -4859 -7222 -9993 -14492 -5550 3481 -2545 225 -3436 -11027
16168 -11027 -24814 -28422 -22889 -5301 7186 17149 16310 1997 -15244 -8034 -7073 -18970 -16634
16155 -16634 -16921 -271 144 -9533 -1320 1407 3510 12726 4403 -6608 -17469 -8795 -4917 -18223
16141 -18223 -15588 -9597 -4727 -8572 -16713 -15567 -13745 -11309 -1876 6135 -9921 -18603 -14263 -4344
16127 -4344 2677 113 -3949 -17621 -37698 -31517 -20325 -6398 -1671 -2055 -8382 -14167 -21676 -24742
16113 -24742 -17324 2904 13433 6606 -5776 -5187 7663 1654 3269 7852 7383 2986 -485 1204
16099 1204 -6955 -11019 -4561 4902 317 -11748 -18890 -19252 -10825 -3199 -768 -8583 -26460 -16924
16085 -16924 -11802 -2965 -4251 -4015 872 14526 8668 -6732 -22574 -29663 -27747 -30306 -11100 1816
16071 1816 1078 12103 16409 -3970 -15743 -2749 6164 4466 -1617 -8597 -29476 -29365 -25053 -11521
16057 -11521 -1682 15334 21612 15939 8787 -4415 -13315 -17908 -26477 -14083 -11494 -17051 -10218 -1671
16043 -1671 -1921 11429 14383 9611 6315 2608 6028 515 -16425 -29795 -9513 -4038 4857 9566
16029 9566 -11210 -15513 -6899 -11854 -13875 -12437 -13960 -805 8351 300 -13476 -24507 -25891 -5405
16015 -5405 2760 18431 19279 9159 18133 15000 -4749 -3590 11947 5327 -3739 -4619 -3082 4477
16001 4477 3526 13195 14406 6586 10875 15455 4624 -6173 -6239 7942 -4162 -3918 10366 1913
15987 1913 8486 5381 4552 4252 741 -1189 -3268 -10259 -12389 -4374 -6815 1494 564 -12539 -21757
15972 -21757 -10428 2753 -7952 -13135 -1996 2892 7122 5651 -418 11970 17598 9779 14392
15959 14392 28680 22042 12168 -2359 -9126 22 14227 11435 -1311 -9118 7703 23229 29197
15946 29197 33078 19644 -3466 -1289 4039 -5170 -8961 -7790 2782 13931 10295 -2142 -18272
15933 -18272 -32749 -25055 -1560 -4029 -7408 -320 6281 3156 -7489 -3531 -3991 -11606 -19254 -6521
15919 -6521 1994 -749 1400 -10610 -18255 -19739 -6103 -3808 -1253 236 11312 16214 14475 5754
15905 5754 -3963 -7550 -13111 -17395 -20575 -16675 4491 13913 10055 1954 -5961 -3226 -3545 -8780 -15090
15890 -15090 -13045 -20577 -16885 18219 27213 23287 -389 -7749 -3779 -11211 -1082 1275 10844 20727
15876 20727 7483 -353 -5848 -7546 -19220 -19041 -17431 -9025 -7958 -14218 -10274 -12458 -12353 -16582
15862 -16582 -8824 -490 -72 2844 -6293 -5149 -3392 -6413 -18833 -15159 -14083 -29460 -27432 -23007
15848 -23007 -29339 -26403 -10099 -7563 -17803 -26042 -30128 -20066 -7090 6123 4352 4521 2096
15835 2096 -10559 -26627 -21134 -14428 -9020 -17103 -20318 -26158 -26133 -13357 -2056 -6717 -5108 -8794
15821 -8794 -19402 -19172 -3984 2739 845 -511 -10255 -16582 -16316 -11548 -11853 -9911 -5619 -18686 -28697
15806 -28697 -27868 -27724 -38404 -25491 -9138 -16705 -34580 -33514 -33158 -34122 -41632 -46524 -38561 -19335
15792 -19335 -1016 -5863 -12919 -7583 -3077 6655 1885 -6257 667 -6266 -17950 -23628 -18841 -14135
15778 -14135 -10602 -6506 1220 -6316 -7455 -10414 -11137 -11249 -899 -931 3146 10266 19792 19284 13615
15763 13615 6689 -245 6827 853 -3675 -2081 -11997 -17822 -14028 5621 30774 29841 15038 -1737
15749 -1737 -7336 -11305 -8281 2821 8790 1133 3900 9416 7836 144 4934 17416 20380 41
15735 41 -20082 -15511 -9349 4400 14100 -657 -772 9021 -7114 -24062 -17761 -12649 1103 -2297
15721 -2297 -11080 -7491 -6255 -933 9453 18992 13719 -2710 -7199 -7741 349 898 -2956 3125 4104
15706 4104 12000 23520 17435 2761 -11025 7033 2629 -7153 -9255 -13613 -14485 -13686 -11219 -9930
15692 -9930 -13197 -1503 -5089 -844 -2759 -2710 -3981 -4836 -294 -705 -1050 1333 -6440 -13664 -20178 -20194
15676 -20194 -24459 -19314 -11229 -20924 -15535 2555 4853 -5189 -9826 -8228 -7157 -8708 -19347 -21811
15662 -21811 -18352 -26553 -31360 -35936 -29710 -16818 -9542 -8009 -14604 -2981 -2498 724 8630 8607 5994
15647 5994 -539 3532 3963 -2671 -12710 -16909 -7288 -15993 -11814 -7269 -14316 -14192 1232 14558
15633 14558 3154 7831 8968 9548 17051 21097 19494 9176 2126 -6862 -2514 -7152 -15881 -22379
15619 -22379 -17120 -2429 -2112 8958 1906 2364 1309 -2625 -1435 -4208 4222 3142 -2838 -5500
15605 -5500 -3763 -3074 -13473 -12853 2392 8140 2744 3644 7180 6651 -1612 -7011 -12615 -11422 -18971
15590 -18971 -23758 -12086 9238 1550 -16951 -5930 -10548 -25020 -22486 -11088 -290 -6005 -19461
15577 -19461 -23993 -26233 -28791 -31324 -18421 -22526 -24365 -28823 -33893 -33983 -20986 -17420 -11695 -3771
15563 -3771 16054 17835 -2414 -20054 -20442 -18475 -23377 -20246 -8629 -26396 -34859 -23008 -31938
15550 -31938 -27335 -11156 -5159 -4143 -3231 -4224 -6069 -4441 2446 -3902 -17577 -15836 -5608 -12012
15536 -12012 -5839 -6313 -7340 -21608 -23538 -20503 -14533 -7937 -4718 -623 4545 8232 5147 2827
15522 2827 -3220 -6929 2653 8227 -9036 -20370 -14669 -4501 -9879 -9968 -1938 1416 -2653 -15611
15508 -15611 -22484 -8688 -8055 -4733 -13057 -19540 -27605 -20747 -13674 -12280 -4240 -753 -2776 -12841
15494 -12841 -20214 -24000 -24261 -12076 -11836 -12206 -7573 1703 -547 -12646 -5712 -16051 -19340 -13551
15480 -13551 -9830 -7736 -6932 14454 16369 -5753 -13677 -11379 -17473 -24859 -24137 -26388 -33516 -32186
15466 -32186 -23145 -16834 -23551 -21561 -19964 -27672 -32244 -36919 -40995 -42534 -22537 -11367 3023 354
15452 354 -11926 -24126 -22096 -6470 5218 6962 -7269 -19281 -27743 -27428 -10316 -11546 -2033
15439 -2033 -4753 -13030 -18761 -14678 -11261 -3021 -5911 -6976 2311 2690 -4922 -4938 -8483 -17201 -19641
15424 -19641 -20951 -27448 -33730 -22713 -12579 -16222 -11806 -11694 -7152 603 5220 -12290 -10744 5032
15410 5032 6321 6340 8346 1299 -4170 -8704 -16404 -13861 -7059 -5058 12454 8561 -1346 -5801 -8173
15395 -8173 -7502 -10540 -10682 -6903 -10895 -18179 -6482 -11440 -18068 -20418 -10502 -13537 -20564 -22377 -20728
15380 -20728 -15108 -10695 -17493 -21405 -3818 -5699 -25942 -28851 -34931 -24847 -24421 -20308 -13729 -10376
15366 -10376 -12074 -19816 -13181 -6409 -10651 -5255 -1021 -12049 -22813 -18602 -16065 -19283 -20733 -21350
15352 -21350 -21750 -15564 -5746 -1128 -10747 -5226 -9768 -4019 -3365 1219 -141 -7038 -8571 -10710 -6538
15337 -6538 -20103 -34139 -27397 -9877 -11447 -7014 12595 7998 -11698 -26688 -27709 -11008 -7247
15324 -7247 -9630 -17457 -12307 -2020 4292 5953 11216 18156 31216 18492 -3917 -9589 -23654
15311 -23654 -27085 -30253 -11402 4906 10917 10431 -2905 -9432 -4752 -7485 -12873 -5331 -11650 -21652
15297 -21652 -15488 -21982 -27097 -14363 -9367 -4642 -366 -5812 -24047 -26718 -12897 -10507 -10463 -11688
15283 -11688 -2093 6353 4336 2745 6124 -5107 -1964 1753 -4622 -20568 -26327 -20251 -21376 -18869
15269 -18869 -13366 -10609 -7180 -7130 -5149 -13174 -8814 -10142 -5129 -3953 -18026 -20746 -14050 -15222 -9346
15254 -9346 -1379 -3889 -7559 -9693 -879 11295 15458 10887 888 -298 -5160 -9000 -16431 -13903
15240 -13903 -9728 -10354 2001 5331 5958 6631 7966 5357 6450 2224 6009 10303 7636 -9717 -11063
15225 -11063 -13706 -22771 -4436 -79 -311 1754 3399 201 -5872 -19385 -24711 -24780 -16101 -14064 -11915
15210 -11915 -21289 -26009 -22410 -5194 7456 5907 -207 -16853 -22371 -15979 -12715 -15893 -14948 -11357
15196 -11357 -7671 -5658 -351 17600 13762 9624 16464 1879 -17174 -14032 -11453 -10343 892
15183 892 13468 5556 -4875 -4109 1303 -4166 -220 -1801 -19335 -17228 -8681 -16527 -18651 -28809
15169 -28809 -22442 -1433 -4284 -1720 2269 8573 643 4469 -6753 -14714 -8357 -9088 -14854 -19737
15155 -19737 -13873 -12021 -18868 -9619 -4011 -10183 -16937 -23260 -5850 2491 4313 6248 5771 -4074
15141 -4074 -13565 -14598 -14559 -15562 -7384 -2673 -6937 -14914 -24165 -19624 -10413 -12160 -17483 -14187 -7694
15126 -7694 -6916 -2375 -8254 5331 13351 9764 14838 14892 9170 12314 22267 11891 10668 6065 5454
15111 5454 5346 259 4777 730 -9110 -6191 -3963 11534 15495 -5806 -8079 -2800 -11575 -9992
15097 -9992 -11540 2202 6230 2750 10267 14030 -2840 2632 14675 19453 8538 -4278 -6870
15084 -6870 -8834 -8477 1248 -8660 -4198 -2838 -5424 -4500 -5115 -8859 -8498 113 -7576 -4916 -6964 -7213
15068 -7213 -11722 -21203 -23697 -21337 -13923 -10908 -19598 -5232 5139 2363 -5720 -11564 -18377 -9614
15054 -9614 -1025 3945 -2766 -3965 -5240 -3745 -8090 -14744 -20695 -22180 -31431 -36874 -23564 -13592
15040 -13592 -2693 14824 4649 -9604 -10359 -5227 1674 11149 13820 -754 -3814 -594 3911
15027 3911 7011 -8682 -32014 -40374 -26893 -10381 1188 -3011 -3171 -2020 3364 -10155 -14712
15014 -14712 -16459 -19800 -14784 -5561 -6223 -21381 -11920 -6135 -1745 -8355 -17181 -12508 -3161 -3509 8588
14999 8588 9454 9559 3315 -10274 -15030 -36196 -43065 -33598 -10778 -2348 -14134 -11145 -78 -4014
14985 -4014 -917 8674 -244 8390 8803 1297 12132 3417 994 3981 3266 -7404 -13133 -12737 -10075
14970 -10075 -15477 -12839 -16613 -16054 -12668 -12295 -5145 -4766 -11157 -7973 -5084 13420 14115 2374 -3051
14955 -3051 -3856 -3417 -15077 -6311 -4265 3193 3918 -4608 -398 2820 -4995 -6172 -7118 4425 10331
14940 10331 -1182 -1114 -1662 6643 10927 7206 4727 4361 -5116 -13956 -8029 -7634 -6552 -1000 7650
14925 7650 -6111 -21140 -13234 208 -8159 -7179 -16277 -19510 -31190 -38816 -32997 -29194 -20196 -2737
14911 -2737 695 1275 -1955 -1841 -13164 -22679 -21919 -2293 4197 -4609 -19886 -18305 -18765 -16157 -7507
14896 -7507 -9868 2848 21105 21920 23609 27437 28474 11233 -8536 -13342 -7678 -20478 -22098 -11458
14882 -11458 -6748 -709 -5482 -9588 -4055 -2839 -7722 -16692 -13285 -5648 377 -18107 -33777 -28702
14868 -28702 -13005 -7470 -900 -4353 -1974 -5850 -7294 -3349 9050 -5749 -11552 -23379 -20064
14855 -20064 -9227 -1991 -7139 502 -3877 -14739 -11396 9558 25051 15483 13250 30541 29525
14842 29525 15014 3146 494 -3039 -13608 -1417 16819 15720 3474 -8355 -6663 6106
14830 6106 1806 -3378 -5098 -11060 -10244 -9375 -5613 -5394 -10904 -10006 3262 -2 6018 9763 6596
14815 6596 6286 207 1042 2046 -17859 -16567 -25411 -23535 -23078 -18251 -1590 2628 -9960 -22569
14801 -22569 -15333 -8355 -8283 -8908 -11315 -29805 -32400 -18346 -9226 1281 4733 -2185 -19465 -18325
14787 -18325 -2512 -5546 -11209 -14695 -14819 -8043 -2328 2316 -586 4564 21368 8903 10061 1525
14773 1525 383 1577 -2538 -6050 -2588 2420 13415 16951 10006 5192 -1067 -7844 9720 10191
14759 10191 13860 23517 13460 7085 1897 -10454 -13175 -10777 -9794 -13701 11553 22558 21380 13539
14745 13539 2738 -13695 -20928 -21887 -9765 -2961 -1331 4370 14131 5357 -8473 -5125 491 2484
14731 2484 2856 -3919 -500 -5516 -916 3049 13069 30727 36582 19622 5942 3032 5452 12183
14717 12183 22169 20506 21583 15199 15729 12150 4685 3119 8039 12023 -194 9924 24422 24178
14703 24178 15235 1350 -5872 7964 9470 -3111 -10617 -6070 5573 26207 17071 2863 6830
14690 6830 -3833 8028 8027 -395 13687 22602 17108 23717 42145 55410 49535 38976 42674 40746
14676 40746 56057 68716 80856 86174 93207 91946 98172 99563 101826 123321 148130 172969 221486
14663 221486 286242 353988 455011 592279 735847 851712 952624 997078 958163 878805
14653 878805 757145 625083 512562 414539 329716 271646 228534 190985 159973 138007 114347
14642 114347 101625 98221 99070 108766 107851 94953 75548 63379 65154 60816 57705 52626 40647
14629 40647 33710 36027 32389 41329 57089 52492 63231 65575 56598 59511 53906 44184 50368 58627
14615 58627 56077 56836 48997 29873 30827 42656 43004 43387 36125 38597 45496 39991 44257 53811 44289
14600 44289 32001 29285 27317 35501 37461 27689 16864 13601 10586 16574 22155 20938 8322 -850
14586 -850 6116 14116 19900 31139 21130 20305 27270 19094 9347 3595 1701 7017 806 12396
14572 12396 32525 44906 45556 41632 32039 36441 35230 42693 47609 52889 51739 44317 61645 79741
14558 79741 116161 139084 136872 127679 114980 87165 75323 78897 77166 50759 37850 30369 18046
14545 18046 10921 9287 6058 10972 12479 12025 20113 28075 38976 41316 28380 14073 4262 16880
14531 16880 16898 19884 27694 41451 52661 57882 58417 51774 52174 62077 74171 83755 78637 63673
14517 63673 56841 55540 68468 80207 89620 91695 78250 73772 63390 59353 77030 89011 81336
14504 81336 88544 98583 90209 64212 56332 58297 56552 57034 48935 49933 47380 37311 34110 35899
14490 35899 29207 24749 30179 33574 28195 26474 21028 28543 42099 41536 28645 27960 40376 37846
14476 37846 39218 29829 24805 40749 42131 29133 23647 29479 34525 42828 47429 46447 32997 28724
14462 28724 38027 36312 31855 36086 48953 57694 58534 51513 51702 40985 40453 53494 52190 60263
14448 60263 84862 94431 97610 110767 129231 165289 209778 269388 329769 394402 472775 541804
14436 541804 596837 635541 616036 551996 463647 386446 327834 277250 229171 198103 169124
14425 169124 163405 164142 167318 164623 164277 162367 146664 130233 127451 122718 114366 106025 85888 92269
14411 92269 95511 97499 89325 90833 92720 78762 65201 60389 53978 51293 49257 46122 48584 43487
14397 43487 36191 32584 50414 59666 46554 42953 28927 22823 24813 19960 37677 43305 52592
14384 52592 42044 33119 23896 22425 30207 27436 17177 11603 20282 32537 33917 28897 25791 16965
14370 16965 21016 31616 36666 25310 3108 11435 25514 29025 24918 25222 15534 6972 16664 23469
14356 23469 21979 21577 20998 27187 19624 7287 4422 -9479 -22405 -21280 3413 17522 7716 10871
14342 10871 15591 29781 25239 11539 7299 6683 -2085 8549 27418 45378 46590 27303 11783
14329 11783 -7708 6516 16352 13735 2552 5815 28138 36776 21453 5826 10365 26315 40953
14316 40953 50440 47231 32553 31611 31003 23091 24190 42801 55951 48086 30184 25696 11398 15438
14302 15438 7388 -12128 -19889 -9722 -2215 -5265 -20151 -28538 -31081 -29221 -19416 -17853 -25189 -32591
14288 -32591 -33663 -26066 -16650 -4011 8386 4713 11777 17002 -4561 5275 14634 19946 3225
14275 3225 11930 23664 19595 21197 24743 22108 15569 -1452 6719 736 10478 39545 49144 51607
14261 51607 59909 59190 56635 46403 33564 36906 46772 55896 70661 63195 65208 69176 79645 96253
14247 96253 109159 107314 100297 106103 103308 90652 97297 104049 91647 73942 62478 56836 58096
14234 58096 76327 72349 57219 55963 51367 36533 31840 35166 29435 28304 25644 22607 26486 24925
14220 24925 30993 27886 35475 42674 40304 23682 8027 5192 21296 9037 8037 13037 20479
14207 20479 15767 15939 11604 9105 7963 5612 -1222 1383 5932 16714 17550 19084 26419 32693 25027
14192 25027 13126 4144 11635 28983 47570 54946 38781 26634 18886 27271 34525 36503 32526
14179 32526 35757 48526 71943 91861 89233 92201 98489 105703 126538 125265 113318 115341 129317
14166 129317 138645 149664 146625 120955 115209 92551 82271 79025 58843 49786 47705 55462 32378
14153 32378 30507 30924 29045 25701 31096 22616 25432 37725 43820 54145 68391 80785 83993 85812
14139 85812 87393 95366 93404 94111 88869 94085 102345 99876 91682 90790 99248 90534 97270 102138 105135
14124 105135 121818 135723 149742 156444 135886 111553 93800 100604 126264 154676 197817 211585
14112 211585 217762 218406 218138 205787 206988 206705 198404 186437 177181 168859 164041 165301 168924 172586
14098 172586 180463 194222 200740 192774 186067 182932 181047 190317 202364 205845 224196 235140 234905
14085 234905 239888 253792 265922 259481 263750 273672 285731 296835 300986 310470 307494 313682 333203
14072 333203 356585 358424 370788 376867 382785 399749 419289 429524 442998 463141 501343 525203
14060 525203 542980 565038 574421 578680 604082 632890 652357 677371 704155 730056 752044 783055
14048 783055 812232 839875 860279 876658 901614 924388 928717 942518 950935 952156 959541 962092
14036 962092 974785 993792 1021907 1050416 1094453 1137683 1179797 1246066 1330366 1410786 1503731
14025 1503731 1618218 1732550 1864168 2016606 2192604 2430817 2717777 3046422 3357019
14016 3357019 3571062 3645413 3641270 3618300 3664838 3800377 4022709 4336079 4753104 5284481
14006 5284481 5951965 6764084 7743459 8926849 10351450 12069458 14153669 16724476 19962402
13997 19962402 24143299 29684208 37108241 47049198 59987124 75702243 92655227 107673794
13989 107673794 116707541 116944285 108580215 94505137 78432652 63261542 50479367
13982 50479367 40451562 32898694 27340013 23265845 20253191 17974330 16173898 14686022
13974 14686022 13425400 12340618 11392607 10557283 9816670 9185068 8642689 8178804 7779246
13965 7779246 7445234 7173341 6947048 6744360 6573045 6435871 6344342 6262082 6197016 6155107
13955 6155107 6131240 6097893 6060386 5986824 5868283 5703666 5506512 5277043 5020432 4790413
13945 4790413 4580363 4364839 4161370 3972026 3777459 3593179 3438505 3295712 3158689
13936 3158689 3038822 2950423 2863617 2783557 2715329 2646781 2580047 2498456 2406748 2302175 2177726
13925 2177726 2055639 1942817 1820182 1704376 1586590 1479488 1395259 1325520 1263210 1192656
13915 1192656 1127428 1067222 1018868 979364 931843 903575 863012 817706 796188 772493 746957
13904 746957 725904 704460 675383 648401 624740 604305 590579 578191 564485 542122 503443
13893 503443 466920 440732 426585 414526 400305 375639 358559 341942 321664 312357 295649 275415
13881 275415 258799 239612 237579 231201 218071 211824 200114 197801 201665 206700 204727 210619 211393
13868 211393 202645 194816 184214 182642 193802 196133 204244 226190 238411 216925 197327 179597
13856 179597 185670 181063 164468 159672 156323 137015 114006 92026 98218 95803 94600 105893 118987
13843 118987 111042 101323 91422 99780 107460 102380 105609 126169 141871 157336 182356 208264 233805
13830 233805 259625 299490 346951 394832 435356 485365 527895 572771 625183 656021 659426 645707
13818 645707 625513 592340 543005 510428 498542 474787 431979 400683 396183 367300 344193 326857
13806 326857 309738 311957 307989 298348 283041 279341 275791 249336 232133 231025 224415 227504 224616
13793 224616 201014 195715 196543 195146 201686 202148 207185 199196 179405 179825 168820 150351 163907 177033
13779 177033 167055 163020 147824 153089 153746 157117 164120 151361 138818 127940 127390 133876 127284 118290
13765 118290 108425 113853 120782 114945 112841 94670 100940 101110 97082 92816 85583 85936 85231 85711 86431
13750 86431 101178 104110 96109 97543 109770 125465 107119 110012 115729 120279 124193 140539 159231
13737 159231 176766 192335 204652 227844 237967 221833 198173 178763 148102 130065 114138
13726 114138 99938 81760 71285 70637 62579 54905 47634 57406 61692 55788 54452 48421 51287 49082
13712 49082 54890 62116 60342 59732 56309 58189 58475 48414 32529 27231 19676 25923 37794 39476
13698 39476 51191 51295 53097 47755 51376 59549 60583 58544 63630 52992 59673 79476 87060 78048
13684 78048 73974 80268 84166 87696 76288 67588 63626 49903 60220 60211 51072 51032 34882 14978
13670 14978 3767 14118 13669 16799 11042 12394 20380 21150 16260 4036 -3724 14211 24292 23437
13656 23437 22583 25854 21078 30127 28715 17184 26551 27814 36984 33514 25558 16470 26299 50081
13642 50081 64513 62329 55704 53481 39543 12346 21551 43625 50912 43986 38408 37229 49087
13629 49087 42862 34632 45407 49630 46844 35816 26132 9035 1564 6327 7720 15662 18219 23932
13615 23932 31563 21167 26179 36083 34210 29924 31245 26808 30628 22877 17860 14338 10549 3710
13601 3710 -1034 4279 6682 12621 16487 25179 26823 19032 27515 24116 12941 12503 21788 25467 17024
13586 17024 17242 27250 38454 41223 44217 31194 2472 -3417 -23 -3366 -6956 1954 9535 8095
13572 8095 13361 16752 18866 5714 5464 3809 14326 26442 24881 32866 37650 35047 30285 33867
13558 33867 30179 36586 33603 36848 44301 45373 49044 38956 38893 65748 74270 74395 83039 96966
13544 96966 121123 145576 176603 223435 286078 363908 444722 517945 589272 610875 586149 532238
13532 532238 465526 390776 326271 267594 226096 188541 142333 124701 130275 111819 98264 88700
13520 88700 80009 74250 76657 82932 81504 86854 90731 82993 71590 74115 79828 78042 75071 58267
13506 58267 62302 77525 70907 67149 59150 53831 65415 57563 55793 41883 39956 42477 35833 29384
13492 29384 38774 42450 41047 33167 27546 32628 48557 59935 33968 23275 17490 13652 22175
13479 22175 28592 24172 22089 30048 38202 22913 -673 -13968 -23603 -17950 -5556 12037 17086
13466 17086 12424 16430 25896 30260 26262 8316 3029 3036 8926 11324 1978 11615 22698 13291 8278
13451 8278 6880 12304 8949 -2099 1631 10062 17702 22629 15419 15612 9051 -4110 -10779 3302
13437 3302 3972 -2666 -5914 -7844 -3428 -7408 -3106 -175 -1405 4891 7093 -8183 -7041 -2036 864
13422 864 -3575 -12225 -9968 -13821 -26849 -36183 -49047 -42150 -36138 -22808 -21521 -9328 5856 -7602
13408 -7602 -18753 -19762 -13843 -12086 -5189 9064 5070 4066 15605 14771 17003 27515 24570 15776
13394 15776 -8725 -21353 -8957 -12042 -3606 -7467 -7913 -5343 -3560 -5555 -12100 -11181 -3684 13365
13380 13365 23619 24104 28535 25996 22898 12619 7466 2747 438 2594 2918 5641 10967 -142
13366 -142 -4355 6279 -691 31 -2973 -814 2219 -3802 -4503 11956 22022 21605 19123 22022 23937
13351 23937 21548 25158 28595 27920 24295 19307 8271 2887 4935 20132 17242 13785 32256 20495
13337 20495 11559 7485 9558 6151 1502 -5375 -11983 -1773 15495 15424 2895 -2867 -9500 1872
13323 1872 3394 -4175 -1149 -2163 6553 14223 13472 2011 13083 23645 23871 26498 30647 35734
13309 35734 34263 20174 14267 15303 24744 24283 26129 25664 10902 4803 523 -4394 -4029 153 454
13294 454 3911 -5759 -20662 -25093 -8521 2000 5777 5285 5931 7659 6979 -5659 -6570 -6016 -6885
13279 -6885 -12537 -14686 6361 9053 8709 5523 -10462 -20462 -1199 5764 -5915 -13604 -13719 -14677
13265 -14677 -10809 -12132 -9280 -8974 -2674 5908 9956 14496 7778 3752 -4376 -12563 -14669 -16124 -12949
13250 -12949 3544 13298 24200 19111 -129 -5247 1718 -3791 2366 9654 12392 3198 -7976
13237 -7976 -6220 -2570 -3487 1922 4757 -4118 -4485 12415 -2105 -22684 -21772 -9166 7683 13014
13223 13014 16715 2544 -2479 16996 22869 19876 14483 10150 2995 2224 -1926 -1922 -4922 943 8426
13208 8426 18707 29667 27038 25384 21586 20968 41398 47013 67671 84459 78876 74707 67705 59565
13194 59565 49704 40157 31388 20829 17114 15638 23352 28997 30215 14548 8135 13403 30091 41500
13180 41500 47037 43891 47261 61145 74138 86716 71277 60071 50526 36624 38009 40190 35190
13167 35190 27065 30182 25682 30684 26192 32500 52980 62855 70595 77884 90762 114590 161632
13154 161632 216209 257335 274247 276909 272009 268043 246378 230296 197932 149392 117352 93736
13142 93736 86400 76006 55561 48163 46250 39290 36903 32797 27221 40183 43116 37416 35730 38042
13128 38042 33838 29855 24435 31098 32774 11042 3665 16619 22514 12297 14708 21957 26762 28841
13114 28841 39683 59839 89718 113287 152233 181904 200762 214094 201221 161844 137351 118862
13102 118862 91274 75472 62579 60649 52917 51564 42394 34131 27854 9686 7181 10922 18232
13089 18232 17755 -1826 2616 6979 7037 6073 -1903 -445 4572 11664 11220 10769 19761 26079 25601 20359
13073 20359 24436 26807 29683 34096 40766 43225 42113 35626 42493 66491 69703 76271 63419 59266
13059 59266 52493 41041 30441 17611 10741 10811 13536 11936 4727 -7596 1434 14656 17920 20545
13045 20545 15830 4810 -2009 20194 30673 30084 24769 13208 1922 -7725 -8726 -7468 -7349 -17423
13031 -17423 -10946 -4709 -4194 -7120 -3719 -3030 -2079 -8782 -1702 11255 22197 4282 -810 547
13017 547 -8380 -16200 -5488 -10371 -10926 -6415 -6359 -6479 -8961 -13728 -27246 -30740 -22322 -20343 -25926
13002 -25926 -22433 -14310 1647 12728 13232 7047 4438 3483 -5652 -22266 -9172 -6537 -6464 7058
12988 7058 18461 20880 11190 829 4137 14826 9232 2323 2767 461 4612 -1740 6001 7383
12974 7383 5205 2268 -6352 -6113 -12420 -15241 -764 -9467 -32077 -21956 -6003 -2949 -2575 2798
12960 2798 4374 2014 -5703 40 3507 -260 6616 2244 -11851 -17707 -26389 -29794 -19878 -12935
12946 -12935 -7320 -871 14564 26915 23727 19806 5730 6678 15923 14930 18643 21673 10619 -3096
12932 -3096 -5193 1798 9965 -5507 -11824 -14668 -20280 -23856 -18949 1785 3241 -7438 -11895 -16510
12918 -16510 -18128 -8070 -3699 -2891 -7195 -5197 -7662 358 9308 12017 20294 24762 14521 21350
12904 21350 24648 13007 17919 19557 15825 17502 12424 4670 15685 18868 17626 12520 11283 6226
12890 6226 435 6469 11227 1283 -13166 -15630 -10976 11 -757 11320 13089 17433 14554 -2857
12876 -2857 -11252 -2327 9079 16844 17747 24516 24189 25732 17122 12359 6545 -147 4802 7798 -9345
12861 -9345 -11009 -12401 -8296 10661 14729 12693 6662 -3102 3594 10036 15825 15614 8237 10619 3869
12846 3869 2713 8799 20177 15471 -4998 -17967 -10077 -12569 -10417 -9605 3884 -2489 -4889 -918
12832 -918 -6269 5350 16109 11761 9899 21420 16531 -6580 -17807 -8127 5115 2338 3816
12819 3816 7846 8270 18822 28684 32129 44147 33997 29907 20272 16631 18847 8226 -610 -5807
12805 -5807 1839 428 -5337 -6216 -8210 -11200 -13138 -10233 -11624 -1943 -6386 -11622 -599 4809 12112
12790 12112 -436 345 13364 18201 19304 7402 -810 -11973 -10824 -12130 -11929 -8668 -8715 -4632
12776 -4632 -8555 -7301 -3676 8677 1953 -2627 12530 34154 16168 3088 -11547 -24529 -20646
12763 -20646 -7988 5316 17509 20447 11917 13822 22483 25774 22317 15038 24555 24900 22440 15256
12749 15256 8254 557 -3214 2398 8088 -2251 -5851 -7837 -10960 -10129 -8143 3602 -2910 -3635
12735 -3635 -10202 -8290 -7883 -13393 -12123 -11645 -6740 -118 9662 15068 11428 -5088 -4471 5294 13531
12720 13531 27940 32213 29710 15355 4100 5904 17642 16263 22085 22332 35189 39408 42841
12707 42841 45931 44949 35660 29725 29939 23479 19896 20083 17515 2042 -7192 -5256 8017 9273 7965
12692 7965 6683 16563 15034 9493 9125 2861 6998 16599 15060 15397 23714 35658 37008 36638 28631
12677 28631 29123 48007 46618 45783 38174 34225 40109 45150 25127 18850 28702 27459 37143 31760
12663 31760 13256 14077 20933 23720 30961 31721 23627 16799 19814 13878 8489 13216 14282 4259
12649 4259 -4467 -949 9621 20798 25775 20953 15838 12483 19427 17192 27628 32123 28268 28832
12635 28832 36196 49683 40817 32137 21495 9508 10130 11145 14985 14532 21953 24416 28122 29464
12621 29464 20428 11513 18771 28809 32359 30975 23789 13771 18103 27160 11874 316 13360
12608 13360 18266 3625 5109 27772 31187 10516 8486 -1895 -5438 4619 15905 3842 2637
12595 2637 8163 12838 6818 641 2428 9208 17874 22222 20808 16595 11814 3764 4167 -877 -10895
12580 -10895 -10044 -9427 -1338 7543 19312 7842 13041 17345 18543 16470 25488 37474 36659 27273
12566 27273 22782 22162 23877 13730 19317 28107 39625 40373 28719 28472 48646 60370 51733 43688
12552 43688 51014 44590 42382 28369 25208 22971 22689 42987 45734 33562 30855 44096 52422 40751
12538 40751 34548 46405 59729 63558 64869 76250 78136 80256 77902 62183 55629 54999 61081 47279
12524 47279 34493 24596 28006 37007 48765 54311 58399 56084 63642 63834 64088 72051 83928 95620
12510 95620 98397 93124 101391 116898 118527 133978 166663 190039 210487 254191 310971 379524
12498 379524 464258 530554 578234 617249 604932 544163 476330 410615 339090 287918 241625
12487 241625 204501 172389 153305 137592 129546 110106 98427 92004 89113 70446 60170 63145
12475 63145 57718 64038 66135 69416 89088 88618 94542 95634 94489 80049 65936 59696 54245 46193
12461 46193 41130 50011 46222 38635 39682 41722 46901 70724 69061 45742 45697 55413 51312 50798 51379
12446 51379 47577 40176 44662 58922 73393 64403 72155 84507 86701 95002 98560 91927 85119 69102
12432 69102 53122 49370 56908 66815 78394 71731 53796 54548 72734 79555 75423 70789 72933 70133
12418 70133 85378 98677 85039 74070 85389 107427 108454 111183 107687 102253 100474 106039 109361
12405 109361 125665 130970 143273 159502 192088 214489 212824 193451 195893 187009 157179 129508
12393 129508 110247 91745 82785 60190 58774 63109 67750 62989 78664 80089 71695 72647 62395
12380 62395 58741 69927 67793 54313 60701 66024 59886 51817 51764 60357 67753 67972 61629 65678 72871
12365 72871 78279 92215 93347 100745 99312 96916 95628 102250 104144 101992 101619 110624 105351 114763
12351 114763 112293 117407 127866 124613 111595 105243 114800 116104 111217 115230 132531 151513 159430
12338 159430 161626 152884 151023 158893 154838 151623 139219 130448 124725 125805 139577 139255 131367 140463
12324 140463 143865 135335 137128 132466 128748 110321 95391 89654 72360 69787 60961 53006 54121
12311 54121 52886 51710 50023 44757 47905 56228 57466 56400 65376 68626 64136 54122 57859 60013
12297 60013 68029 84331 83959 82335 85449 89773 103470 109783 99010 76553 58492 53849 62237
12284 62237 59072 46925 30814 42178 43483 35263 34666 31071 28375 27967 23999 23236 34448 46162
12270 46162 57776 60345 64410 71479 83621 85500 78434 87198 94417 108344 111538 104775 102497 108974
12256 108974 96636 87843 77905 69604 47231 57867 62077 64257 61885 65559 65895 56535 63285 60764
12242 60764 54917 49391 41621 40615 38650 23757 15234 31819 31474 52119 68098 55113 54634 67101
12228 67101 74174 82544 90503 106477 110383 106697 99639 95800 96304 100622 91700 92433 97974 100513 105571
12213 105571 114546 119453 125063 133339 123613 137784 152832 169249 191262 216943 224721 230385 231279
12200 231279 221543 198960 176689 172704 181938 186881 195584 198876 195982 186867 184544 190531 192167 197772
12186 197772 199163 200761 207344 197751 198896 196847 183869 187906 202554 211982 213519 224396 238215
12173 238215 242012 242324 255561 264003 269112 286534 294562 287853 300105 310985 313108 319157 323524
12160 323524 326183 346869 353835 363248 380278 399765 411653 425602 421557 418853 437896 457893
12148 457893 468111 482061 496632 504676 530144 550029 564845 561164 576898 612520 638748 653037
12136 653037 684163 727072 772838 784433 798314 821734 840954 849927 858421 854525 865850 877722
12124 877722 902733 914045 939634 983145 1033195 1072411 1118693 1192157 1274795 1351107 1425659
12113 1425659 1506892 1582871 1661961 1785834 1912047 2036971 2191981 2372373 2584985 2817691
12103 2817691 3108795 3459988 3899191 4437479 5102344 5885538 6793081 7815985 8931392
12094 8931392 10124753 11425753 12910003 14728188 17076433 20201016 24410520 30136968
12086 30136968 37979746 48665837 62679102 79542380 97067681 111438214 118632288
12079 118632288 116541161 106293117 91270788 75058109 60161686 47853255 38354896
12072 38354896 31280881 26119199 22405952 19772485 17895104 16517100 15431347 14472567
12064 14472567 13549770 12637310 11745035 10928282 10231126 9669343 9240403 8949107 8789823
12055 8789823 8705515 8594564 8386419 8069787 7703204 7354229 7056469 6823318 6653549 6520084
12045 6520084 6403304 6298509 6181942 6035697 5828237 5602615 5368970 5116699 4864008
12036 4864008 4619644 4395780 4170087 3957540 3755026 3555010 3374708 3212730 3056905
12027 3056905 2920749 2782892 2647852 2512829 2391049 2279280 2166912 2067911 1966658 1874632
12017 1874632 1782516 1694714 1618497 1533787 1468983 1406292 1339640 1258144 1205108 1147673 1094897
12006 1094897 1052220 1015697 985234 949543 923935 893662 846775 802615 757211 720695 690579
11995 690579 658930 614080 578778 547739 526166 504514 488369 474881 455135 435841 416612
11984 416612 389419 378581 374731 362797 350392 334005 317263 299813 299266 297387 289093 281999 260163
11971 260163 227515 228638 221363 209611 211032 206687 197749 191806 189584 206073 189705 183313 181294
11958 181294 166584 163581 168152 176084 186856 187044 208250 225209 212092 207218 223371 206109 184177
11945 184177 160181 154225 142066 115146 111160 115454 103404 97401 89996 85683 81955 72363 66828
11932 66828 73091 86443 94142 89838 79399 88254 97332 110923 114858 128256 147808 161174 143831
11919 143831 138184 140350 133825 133219 126780 131586 131569 126916 141943 146497 143000 152267 168651 169905
11905 169905 172723 174743 172864 193378 209710 203663 191781 188086 178590 182777 197116 199468 201923
11892 201923 226082 227406 233620 249617 268203 255624 254436 248601 237939 227633 216208 207198
11880 207198 198529 186970 190065 183157 174765 179045 177134 177326 170685 176704 185590 187348 182731 185593
11866 185593 183316 160813 149723 154340 149656 157271 158934 149096 145027 142657 144503 135614 129868 139981
11852 139981 140706 132723 117216 113013 113198 107050 109527 124414 131505 135718 132921 128268 122995 125425
11838 125425 129072 135143 143932 147150 139430 128080 130530 136706 127966 121872 110044 109322 119220 116205
11824 116205 101673 81137 67496 79160 87696 90775 79325 74870 72285 78968 72462 58537 51842
11811 51842 54178 55366 51876 40442 48993 40735 36528 45574 50989 59026 57124 58092 56698 57755
11797 57755 62027 71261 71838 78057 82661 79559 84248 85190 102171 110094 111259 109865 111419 114512 110890
11782 110890 112139 112789 116523 109370 107559 95971 101654 109330 108678 107509 105237 96909 86600 93065
11768 93065 98494 90224 81923 71417 65692 64028 70338 81975 101165 117180 107790 81305 69868
11755 69868 79426 83979 85647 93372 88522 78075 79165 86154 93737 97020 95041 94534 96000 93165
11741 93165 100648 86743 81007 81761 75258 81174 93840 93111 74163 65640 67645 71653 57271 46537
11727 46537 31298 29304 34722 44065 45007 48695 56049 54449 52459 50164 56998 57841 60506 60858 58893
11712 58893 56176 50981 48045 48894 50000 40420 35658 32071 27062 31617 45013 47593 46104 36972
11698 36972 32387 37579 52509 61265 47591 35007 42227 45026 45736 56783 49095 44068 34529 27034
11684 27034 28477 30898 43752 49301 52660 59339 55746 53636 64843 82273 86533 89087 98645 92057
11670 92057 93365 121448 137705 157344 183653 213010 251881 303236 365651 445575 524673 576645
11658 576645 590960 564353 515431 466810 395263 318813 267107 221057 175894 144112 116177
11647 116177 95126 87930 90167 91881 90402 85052 84529 84866 76424 61819 74582 75847 71797 69651
11633 69651 60362 56813 65228 83515 78238 82687 95415 90537 66040 58702 65726 51260 52460
11620 52460 73157 75597 75579 70248 55493 45769 43231 41636 49111 53474 40925 35078 36351 38993
11606 38993 48195 58693 58768 60485 45697 20567 3929 11958 13406 11307 16804 28549 33903 32416
11592 32416 41906 39344 32353 21074 27110 35875 30398 35653 41937 47899 44581 30693 20345 17102
11578 17102 4996 13421 -1124 -15314 -14801 -6010 9089 14418 23966 19183 12223 8366 13372 16490
11564 16490 11441 7020 21251 36719 20903 28528 37047 31837 31285 23570 18689 21496 14384 4751
11550 4751 17949 24100 34878 31768 23421 27779 18216 18249 22180 6985 -1423 -2258 9093 24761
11536 24761 11855 14949 11613 4300 10307 16515 28455 16598 10145 17759 20958 19411 4293
11523 4293 3077 23258 17845 12275 10602 8971 11050 17264 11649 315 -11340 -10274 3874 17692
11509 17692 13606 8824 15091 15628 -5853 -14873 -3043 5752 13359 9089 6677 10253 11574 10519
11495 10519 17697 19792 22020 31072 27590 18896 14717 20098 17482 5613 10193 13807 16274 13123
11481 13123 5777 15005 35987 35874 44577 60373 61975 65826 60130 49692 56139 64454 68896 90766
11467 90766 116767 119872 115507 101928 77621 65879 79186 73172 61991 52261 60859 56012 44926
11454 44926 46300 53087 51100 42808 48702 48001 50665 46373 56678 50046 34480 19398 22921 27182
11440 27182 27720 33819 49661 43925 44699 37387 38642 44607 42148 45321 47570 45199 34227 31102
11426 31102 20271 17352 18601 19484 24437 23635 10040 10913 31669 37687 40633 36668 39185 48581
11412 48581 61382 54511 63071 78651 100099 95018 81506 64968 63476 59077 65886 75915 84886
11399 84886 76888 72717 68283 61333 59473 64115 55090 44462 49518 57475 68177 67438 62466 51837
11385 51837 66240 84702 89041 98649 97575 76320 58564 56771 48502 41731 36547 41544 29660
11372 29660 34157 33972 38564 43402 35986 44225 49892 42173 27678 11774 7517 4940 18947 38253
11358 38253 56181 45233 24232 15495 32705 49950 50812 36393 35923 36192 27122 37735 60590
11345 60590 55827 35217 26385 28324 27399 24240 28287 32298 38832 42882 44188 42094 34639 39462
11331 39462 37042 38053 35806 46635 47521 56127 57403 48880 63950 75898 88576 87763 74869 71943
11317 71943 59554 50126 40814 40245 35601 39079 32920 21586 25812 24758 9418 7601 12566 14002
11303 14002 10622 4139 11163 13688 3271 9218 19782 22288 19824 19587 18215 23423 22142 27266
11289 27266 19878 20725 33086 40856 36775 37442 39902 42764 48580 39167 23483 12577 17732 23272
11275 23272 24280 18223 8392 19932 19832 24544 19161 12006 23502 26125 9810 16815 21458 17726
11261 17726 12915 20463 28068 39512 48725 48272 53800 46759 30365 14594 17159 19256 11971 20097
11247 20097 17300 22246 28117 31988 16969 25257 35223 39387 31327 25090 9945 7453 11901 23678
11233 23678 30533 33213 32153 32358 41168 45878 34885 36931 36110 34504 33800 21293 15581 21316 14663
11218 14663 14289 18412 15893 30622 37823 32356 29468 35472 29417 36550 38044 45155 53789 45469
11204 45469 27772 29433 40475 48629 35649 35461 33097 38977 40269 39846 25112 18532 12490 20567
11190 20567 22928 29056 26623 24769 24939 22504 26256 31844 18565 21893 13787 18557 22952 37088
11176 37088 38322 45739 53213 43737 25094 17458 25268 28052 26769 20993 17999 16190 20941 20271
11162 20271 21636 26849 32464 28683 25395 25023 21703 15001 14644 23755 29467 35301 44154 41400 24450
11147 24450 20711 28632 37192 46940 57818 61101 50701 45568 55819 64441 72043 64102 46074
11134 46074 51106 39495 31524 22515 23940 26203 24778 41854 36737 35631 35994 31864 28412 28978
11120 28978 25545 30967 27115 39436 41588 39853 35095 31836 21760 31867 26037 29873 35787 37349
11106 37349 40235 56155 67982 60885 63285 76112 87154 90831 86452 79871 62640 42935 40559
11093 40559 43588 47016 43893 41559 38599 44961 49773 44334 49909 55886 51348 44433 41942 45538
11079 45538 49046 36833 34719 34834 29933 23674 26430 25422 29882 43260 41304 32327 21401 34689
11065 34689 30411 29002 28919 26972 34105 29397 24485 26327 60672 67342 46152 26700 24880 29133
11051 29133 37595 38981 37585 32502 37795 45985 38081 41197 51105 43439 41963 37978 41107 60889
11037 60889 61738 47809 29173 24654 42289 45289 45064 44543 55328 61640 62534 52632 34469 29729
11023 29729 43140 53397 55459 52209 55341 68261 69136 59144 50155 47836 42531 43599 42014 47543
11009 47543 40541 45541 54595 49057 46433 47869 35550 32138 39779 45623 65722 78186 74653 81761
10995 81761 85550 83326 105119 122890 130322 120144 112928 115457 107232 96081 95005 102197 103373
10982 103373 82364 73531 76256 72885 66905 70158 67175 74729 94294 105862 114647 119333 108637
10969 108637 100852 105846 114682 122327 116836 112287 112181 116258 133960 138382 132706 127664 134234 135736
10955 135736 146238 153568 148675 137421 137096 149128 144726 146113 152920 151259 144648 144858 143064 132201
10941 132201 122398 114275 106341 97581 113729 108009 93697 98511 111321 120872 125464 137814 134669
10928 134669 130369 125057 131127 128697 122623 119585 118746 115633 123613 120806 111944 104575 102339 110220
10914 110220 107193 88125 89471 105795 102044 92997 75625 77258 95277 101357 99110 94117 104580
10901 104580 106408 112644 126408 134101 133471 135041 129117 125775 117672 122124 107774 113739 127381 122553
10887 122553 113281 116273 113929 110934 112975 113299 105427 85251 79829 92472 99524 105345 107173 116200
10873 116200 120038 109953 104558 128862 136966 136646 134204 141577 155848 153122 162558 166088 160681 148640
10859 148640 144644 154743 163363 146136 135359 139945 125808 121387 124844 130864 135044 134575 127768
10846 127768 118805 117491 120228 117658 124937 105729 104426 111703 111431 124881 137809 128400 138966
10833 138966 145367 138430 142382 145483 154884 161396 168161 174069 163400 142058 139487 144755 146133 145621
10819 145621 133666 124878 124857 120247 115509 123790 122279 133860 153609 150273 139644 122842 128533
10806 128533 136837 141866 145676 153159 159419 170379 157858 153210 163313 185043 190514 192761 201598
10793 201598 203386 214711 219058 217865 225835 224648 209164 204019 208001 220443 230636 239742 254414
10780 254414 247182 237229 224824 219529 221118 226754 229463 230072 232653 236879 244629 262041 267858 269688
10766 269688 271455 268082 277164 282085 297230 306364 317133 332225 335411 316343 312223 325674 329601
10753 329601 322081 325320 323678 308862 295129 299398 302395 298341 300435 299585 299814 287415 282201 279271
10739 279271 284501 292485 299029 299084 301172 291209 295020 288755 283251 274301 271272 284987 301558 300380
10725 300380 293976 293057 277538 269078 262206 279412 292627 292439 282636 282949 291684 302345 303885 295472
10711 295472 286250 277844 287730 291189 279198 253351 244386 252396 256006 260856 268837 265585 257914 255418
10697 255418 252874 240706 235749 243895 251681 243304 239788 235965 230294 224479 227065 236517 254415 243525
10683 243525 232414 227361 230899 235826 244951 249001 249055 251938 252607 249869 257565 243504 225899 217757
10669 217757 226205 248371 259570 257622 257969 265563 269137 268597 271461 287833 287461 289896 298686 294518
10655 294518 280075 271887 278099 280052 277919 255080 237647 239797 256015 254057 242339 244447 250842
10642 250842 253955 255894 253609 245845 247924 250875 261197 267555 287025 276990 276172 293440 295101
10629 295101 283738 281673 292295 297930 288200 286524 284569 288171 298023 313977 305449 307056 293952
10616 293952 295135 301977 283445 279799 292187 310977 304455 304614 303133 308491 312420 312100 307185 302549
10602 302549 297374 292662 302478 303121 297940 306155 310200 309520 317502 329584 327015 320297 324582 308918
10588 308918 295385 296573 303871 319485 324368 331928 346141 345995 338250 334347 341090 335834 325185
10575 325185 325397 334189 340572 350366 360081 361384 364101 365735 359301 366568 378042 378840 384214 382762
10561 382762 378005 372412 370199 369167 368101 376146 391445 398216 410692 411533 407401 412628 411040 425356
10547 425356 426328 409406 401158 422478 433166 430192 433860 429266 430117 444121 455267 448372 439851
10534 439851 443001 456455 460585 460104 467526 465491 470785 483345 507574 524519 528024 538078 533229
10521 533229 525559 521015 524022 537989 561017 576296 585163 598888 600947 598862 616068 610454 613766
10508 613766 624341 644438 667499 686065 699446 691401 681419 688210 707918 730801 750701 762691
10496 762691 767843 760800 774702 801927 815223 819338 821449 843893 853203 863562 889500 901213
10484 901213 917162 943231 953345 953354 947721 953568 985778 1010668 1035694 1052727 1082737 1096152 1113872
10471 1113872 1142750 1164107 1173701 1185522 1208982 1230471 1257098 1272247 1296833 1316315 1330925
10460 1330925 1342631 1365854 1382846 1409518 1441366 1466758 1487031 1522219 1565908 1604441 1627559
10449 1627559 1648390 1678855 1724206 1759687 1790987 1828218 1859315 1896089 1952251 1986346 2028030
10438 2028030 2082135 2133816 2178862 2236796 2282936 2328163 2383004 2434708 2499819 2553308 2600232
10427 2600232 2647136 2705749 2767035 2842093 2918996 2983072 3043900 3142870 3238639 3336388 3436156
10416 3436156 3531564 3628854 3729065 3847548 3988009 4142569 4299479 4452555 4626221 4807387
10406 4807387 4998408 5205066 5427746 5667647 5905876 6155471 6427781 6728473 7045380
10397 7045380 7398619 7772185 8177622 8609692 9071730 9565503 10110801 10691058 11315117
10388 11315117 11992261 12718200 13470532 14279476 15124408 16002538 16908518 17836404 18795536
10379 18795536 19768922 20709850 21613218 22484929 23263913 23973586 24613530 25150486 25577865
10370 25577865 25926913 26201594 26407481 26554272 26666288 26772208 26858207 26960638 27120937
10361 27120937 27337257 27590486 27883186 28227669 28660860 29162370 29740377 30357033 31030975
10352 31030975 31732687 32460916 33231594 34000276 34751726 35473609 36157546 36772642 37298117
10343 37298117 37722268 38046347 38276832 38405841 38428960 38347026 38172298 37904530 37563384 37155696
10333 37155696 36681004 36153949 35594949 35001077 34405962 33835699 33251074 32684069 32180543
10324 32180543 31707527 31296749 30936907 30651027 30434629 30285524 30208628 30200101 30232976 30322809
10314 30322809 30455813 30618453 30780769 30942657 31080774 31166055 31163377 31059786 30870177 30565176
10304 30565176 30117590 29546595 28871159 28095685 27215616 26278314 25301504 24308528 23311682
10295 23311682 22309760 21326606 20373961 19459887 18599735 17778062 16996967 16277725 15594382
10286 15594382 14932327 14303909 13719220 13183885 12686456 12207678 11767506 11359336 10958628
10277 10958628 10588117 10251590 9925348 9622098 9335828 9064784 8810198 8574706 8340757
10268 8340757 8103581 7882112 7670315 7468047 7283313 7102676 6933489 6770714 6616468
10259 6616468 6463884 6317147 6174079 6046736 5925657 5811073 5693016 5587168 5496880 5409833
10249 5409833 5331043 5229546 5143840 5082063 5018972 4970054 4906288 4827577 4777752 4746414 4706843
10238 4706843 4670161 4655889 4648394 4635365 4618950 4613370 4620894 4624354 4631626 4656914 4675894 4708075
10226 4708075 4740208 4775303 4808898 4855637 4917964 4991686 5061235 5131481 5220835 5313398 5416414
10215 5416414 5522993 5653541 5795414 5930228 6080854 6244146 6416798 6573857 6716895
10206 6716895 6864397 7022805 7183660 7333876 7492634 7657616 7863789 8064143 8284578
10197 8284578 8510107 8748184 8990579 9239445 9487891 9747532 10008472 10267343 10511940
10188 10511940 10765747 11022351 11263074 11504226 11712464 11901235 12086546 12247808 12384131
10179 12384131 12499144 12582597 12644811 12673900 12670464 12640971 12592514 12500558 12396570 12269755 12119799
10168 12119799 11941239 11746336 11540814 11334452 11116555 10875022 10622324 10398783 10168349
10159 10168349 9929282 9674028 9443538 9218634 8978601 8730819 8485687 8245307 8026032
10150 8026032 7821187 7615381 7395647 7200496 7013890 6820414 6628738 6455127 6290302
10141 6290302 6123522 5966011 5817276 5661040 5520711 5383049 5252785 5115624 4977749
10132 4977749 4866766 4751109 4638869 4529301 4411777 4289089 4178687 4081984 3983901 3880708
10122 3880708 3785701 3710540 3619298 3534710 3464454 3383791 3296106 3212285 3136945 3061717 2990817
10111 2990817 2924211 2861076 2786060 2725356 2664156 2596031 2527950 2474159 2415751 2370629 2323837
10100 2323837 2266882 2224605 2170697 2122069 2086311 2040028 2015778 1976249 1938259 1899051 1849538
10089 1849538 1811569 1781513 1744708 1711057 1668217 1627192 1596839 1577677 1557221 1544957 1518604
10078 1518604 1494031 1467283 1423718 1402258 1380009 1354365 1338981 1315172 1285914 1263986 1232680
10067 1232680 1202087 1177296 1160380 1150847 1134935 1121987 1096342 1080673 1067054 1058022 1043577 1024384
10055 1024384 1016305 1003778 982402 971997 974054 973818 957012 930429 923997 917573 912132 900314 890829
10042 890829 868486 856149 855504 822492 794844 789926 784625 768207 762181 771213 784346 792415 775435
10029 775435 746567 739593 738883 729284 703634 699785 688309 675187 666343 667074 657607 649630 637431
10016 637431 642415 635280 627164 635556 635446 613219 605077 617772 615537 621912 617638 611533 606584 586330
10002 586330 572300 561382 564120 557133 552638 550356 552137 561100 574078 568710 564547 563014 567632
9989 567632 550611 538516 529337 522116 515338 518847 510011 509826 521196 528922 534987 520491 516465 516579
9975 516579 514444 502168 502531 496776 492801 489849 495537 490244 487495 490570 481361 493216 508635 503678
9961 503678 498835 510439 522318 527535 513834 514763 518485 526847 535588 529406 523442 531374 549311 540273
9947 540273 552554 555167 551559 536655 533609 560301 580701 589694 618956 655638 695365 740889
9935 740889 799861 892497 1005722 1176849 1441067 1814825 2250633 2531077 2465896 2137776
9925 2137776 1772567 1472035 1236291 1069022 938499 846771 776193 736385 705885 674796
9915 674796 651377 638507 624615 607834 574765 546491 531478 533429 537139 524740 538956 535293
9903 535293 521837 511591 499171 501469 496344 489148 491921 491904 495867 499009 501974 496643 504543 504534 498700
9888 498700 491281 479941 480249 484100 475751 466339 457683 445997 437810 438729 428454 413719 399536 386716
9874 386716 380933 379885 385737 388880 366962 355399 353944 330742 323923 334701 332946 331447 330681 339353
9860 339353 339697 338842 336813 351831 361192 356293 365001 378083 381341 390888 399265 443491 497916 576251
9846 576251 703320 890901 1075697 1161525 1116371 965464 799724 646215 531819 453978
9836 453978 406878 379272 352501 333206 313808 301923 302782 296813 292996 298939 298434 296758 303859
9823 303859 310785 304708 303807 299489 295761 303318 336603 361646 358368 341500 323649 298235 283813
9810 283813 280338 276172 264036 256019 244115 239599 243410 247021 238066 227847 225668 219563 210861 203570
9796 203570 202565 198086 198174 196076 195952 195112 187687 197139 190775 190851 180550 183624 192382 189534 184381 176924
9780 176924 176828 194430 192494 181164 177359 175475 185931 183498 184771 181597 174602 181405 192715 201264
9766 201264 188932 180749 165345 175481 175520 161215 155494 154563 134366 131772 143677 165719 174516
9753 174516 157279 156815 151316 154665 153391 154895 146022 151392 155895 157628 161221 163097 147279 153661
9739 153661 148219 133825 132217 138120 142406 143179 149297 147385 145733 133105 129661 129134 124266 129447
9725 129447 132187 130250 137017 132502 128317 105774 91297 86240 97964 118784 138775 153702 137164
9712 137164 128459 137313 136029 129572 120408 114981 111306 112759 111898 100365 97475 111115 113141 109786
9698 109786 115001 121717 112074 92889 94528 99954 112924 115427 108475 113918 126094 128583 118172
9685 118172 116065 121886 131910 127125 111286 102182 96821 99187 102216 101043 96341 99283 101712 80319
9671 80319 77204 81798 86381 90290 102479 100066 100119 99541 91765 87915 97996 101883 109792 108427 100498
9656 100498 79582 73509 77554 90773 102727 91451 85895 90416 84260 72349 68433 66860 89048
9643 89048 102230 92111 82217 81194 94187 99490 89262 104465 100178 98882 88134 73399 67902
9630 67902 63682 75254 84466 90595 85101 92403 104352 111067 111213 87504 85363 87123 87512 86485
9616 86485 80231 84890 85093 81244 83677 88791 81321 67017 67149 83267 96721 98233 85478 81040
9602 81040 83442 82738 82388 97926 108739 99687 91183 94115 97073 83494 71726 83180 96959 83625
9588 83625 81799 92820 92076 95998 89604 75285 81121 96708 104151 102116 96075 87530 102445 120263
9574 120263 111080 88947 98242 107282 105055 109010 105947 101534 95884 84157 80950 97477 108236
9561 108236 114450 112549 115308 135148 149806 144773 133469 129617 128524 126640 134449 143440 149272 142090
9547 142090 142559 147960 155156 151661 154263 150165 153676 141066 134504 137456 142461 147631 160613 160869
9533 160869 149523 141388 137590 128775 142576 153895 151160 145382 170022 185237 204139 205815 210841
9520 210841 205452 209921 217208 235639 251298 260633 251778 252672 273138 276490 282609 286997 284609 271241
9506 271241 262603 259946 252749 237650 227797 226384 221518 224725 231496 230223 216336 214101 204914 191290
9492 191290 195566 205826 211594 214141 223662 235798 254182 261501 244129 233190 252223 276580 290217
9479 290217 305163 317288 317577 328442 341780 320703 317364 318946 310355 314734 317360 303423 296738
9466 296738 282036 267445 258965 242683 242904 249292 242792 227910 226285 221200 207165 204825 212298
9453 212298 218245 224051 228171 219749 231147 238602 239878 247556 262769 266477 269013 273036 279465 279752
9439 279752 265337 276511 284686 283523 277852 272607 262038 241742 233713 243629 234469 211411 194187
9426 194187 188517 191785 188173 183948 177811 161069 160081 166659 163102 158238 157966 160680 171808 174442
9412 174442 162426 157469 158281 160836 162760 156617 158414 163727 164576 162870 167705 158573 154547 165429
9398 165429 166000 161062 154209 138273 128262 124329 123844 120725 116223 124445 126422 120585 115605 120336
9384 120336 120896 123145 117054 114284 117766 109437 114122 130067 137372 136511 145059 133649 126350 126769 125236
9369 125236 134685 141237 150545 140904 122315 113885 112395 118527 131942 143785 129110 122963 114057
9356 114057 106658 103502 96354 102091 121833 117851 114582 121510 107486 92359 108759 127792 122557
9343 122557 133126 141823 155967 153507 144164 148118 137013 127630 134317 145423 145589 141784 143957 122643
9329 122643 114047 129528 140092 137035 135650 114706 110870 121435 120756 131948 129667 138153 139320
9316 139320 150026 144060 129806 133263 138284 140231 142959 136598 141730 161903 171002 170617 164265 173741
9302 173741 172914 181659 195317 192343 192418 198613 188830 180005 185051 186202 185003 189532 178966 181115 176595
9287 176595 175622 195239 213983 222377 228919 238124 256060 255814 258397 270862 260576 240167 236369
9274 236369 227521 221873 226682 235055 252239 273967 288860 303307 309334 303811 308178 320000 325655
9261 325655 315069 303848 299650 292897 289838 296776 299391 316318 328943 338163 333794 335844 354639
9248 354639 381422 394688 409723 427203 455724 475434 475224 461684 446569 422391 409374 415948
9236 415948 413637 410501 412502 417233 418964 427764 416112 412732 419453 438460 444482 448655 457376 461831
9222 461831 459283 449512 442449 449700 467161 475782 474748 478777 481545 479275 495879 517064 521158 529123
9208 529123 538339 558102 561934 565227 577051 592551 593022 598289 597443 599452 610865 614077 628910 628171
9194 628171 633789 640569 658218 662261 661437 664716 674501 701789 732865 755397 757011 762584 788107
9181 788107 808422 829138 854998 895878 928958 971600 1016582 1063287 1106035 1173367 1241452 1318134
9169 1318134 1414867 1529146 1662123 1786472 1952831 2160755 2392792 2669111 3002318 3384524
9159 3384524 3805220 4271547 4784119 5338119 5957411 6599149 7240128 7857495 8411494 8867256
9149 8867256 9149632 9195841 9039356 8730667 8329528 7882826 7461718 7097787 6782452 6545173
9139 6545173 6403125 6360284 6403464 6529972 6744858 7068964 7497442 8031144 8629135 9300769
9129 9300769 10059545 10915590 11852634 12881246 14021097 15241705 16542128 17856848 19143559
9120 19143559 20344818 21428364 22374753 23180838 23843181 24399183 24856113 25220818 25468624
9111 25468624 25563662 25476030 25210008 24769756 24205759 23564828 22901072 22265390 21660714 21120676
9101 21120676 20696506 20414173 20295686 20350342 20565094 20920210 21434269 22103847 22919233 23855300
9091 23855300 24930783 26143114 27462156 28890611 30408397 31991804 33596922 35193610
9083 35193610 36737505 38197118 39542340 40758581 41774870 42493626 42838424 42713070 42126316
9074 42126316 41121928 39779548 38207285 36507711 34783932 33111362 31536791 30097409
9066 30097409 28863839 27814045 26951833 26274218 25782257 25466060 25315263 25345204 25547412
9057 25547412 25896269 26414450 27081974 27866531 28790431 29820904 30923283 32056737 33177471
9048 33177471 34245822 35190773 35960387 36510683 36760071 36679778 36255521 35486649 34417204
9039 34417204 33112577 31628597 30041220 28442502 26870190 25362174 23948453 22654377
9031 22654377 21466510 20395301 19441415 18577569 17823476 17179844 16630551 16188314 15871764
9022 15871764 15656841 15535780 15540501 15645146 15852922 16149275 16485575 16848682 17183048 17430469
9012 17430469 17591838 17630122 17534329 17269392 16808982 16190515 15452345 14626536 13786929 12964536
9002 12964536 12179239 11472766 10849372 10278257 9752134 9247393 8784649 8335966 7910870
8993 7910870 7496097 7100230 6722508 6379221 6045314 5739213 5463154 5198727 4976995 4765254
8983 4765254 4573689 4415451 4259658 4128899 4015562 3907333 3798949 3695680 3605050 3524468
8973 3524468 3448759 3377007 3299018 3216170 3132268 3063645 3022431 2979728 2923082 2869297 2834963
8962 2834963 2806801 2781985 2742425 2711676 2685741 2655210 2638882 2631538 2643536 2638131 2632400 2642478
8950 2642478 2645771 2663231 2694842 2723140 2764868 2814820 2876905 2961719 3062217 3170032 3278100
8939 3278100 3387854 3523021 3676557 3847362 4015056 4172754 4336587 4517252 4699022 4891787
8929 4891787 5087999 5299976 5500718 5700672 5933670 6152132 6375168 6646503 6927734 7212977
8919 7212977 7518391 7828154 8134672 8445911 8735707 8968618 9134328 9228275 9229827 9171560
8909 9171560 9095689 9022974 8986575 8985864 9038489 9141892 9281475 9470174 9688953 9907494 10126701
8898 10126701 10340110 10530474 10710590 10871063 11022448 11202268 11388777 11610259 11881316
8889 11881316 12215817 12584491 13003753 13501409 14043036 14625970 15236575 15866396 16532048
8880 16532048 17228488 17972115 18650914 18983336 18826925 18395084 17944093 17501374 17078517
8871 17078517 16696757 16323331 15961258 15595476 15238164 14876059 14500434 14155161 13843341
8862 13843341 13574715 13356842 13215092 13145268 13161929 13266612 13442313 13681737 14008544 14411414
8852 14411414 14869223 15361647 15861286 16332429 16732610 17046262 17255859 17343857 17312223 17160370
8842 17160370 16933996 16655648 16318020 15938084 15541939 15148357 14751813 14353010 13979319
8833 13979319 13628922 13279114 12950923 12655809 12378561 12146886 11934608 11732808 11541043
8824 11541043 11350426 11148885 10927428 10714946 10508062 10328093 10163795 10019111 9929873 9870624
8814 9870624 9830556 9796351 9760464 9709466 9646576 9579417 9489269 9392223 9302544 9209948 9115388
8803 9115388 9005611 8873924 8740554 8590673 8412721 8184211 7924954 7628192 7290365 6928768
8793 6928768 6584113 6249959 5923027 5619765 5351576 5093079 4868523 4693434 4557338 4448749
8783 4448749 4351915 4276234 4231286 4191390 4153255 4115596 4079725 4015390 3935881 3844565 3755382
8772 3755382 3668977 3588130 3521373 3464523 3393489 3317428 3238180 3130470 3016965 2890508 2768395
8761 2768395 2631851 2493809 2351024 2210365 2091711 2003910 1898328 1781003 1703147 1650220
8751 1650220 1592212 1531323 1489243 1453953 1403794 1359174 1328362 1308653 1275549 1242683 1212847
8740 1212847 1179020 1160510 1142071 1122646 1101155 1078433 1045862 1020831 998283 974872 945911
8729 945911 912233 881414 858202 835269 825844 821152 802057 773498 770454 769594 751222 734804 724232
8716 724232 714263 705625 698139 690024 693697 702859 707883 705000 708073 708143 714767 718868 717204 716718 706671
8701 706671 710249 700269 690351 674517 655776 649860 636449 629520 614646 596241 586730 561884 539711
8688 539711 539979 536016 531694 513189 510188 501138 482046 491285 502826 516068 508855 508178 517580 521440
8674 521440 521232 527663 559513 571952 575300 578876 562424 549166 536304 527216 541410 536576 519240
8661 519240 517788 503413 497018 494434 479903 476897 463368 452332 448094 446684 454878 474755 512747
8648 512747 566423 606947 646441 648391 618192 582630 541917 508089 477665 446461 432655 429890
8636 429890 426589 412223 400449 401286 393863 390148 393877 399944 390690 381144 369101 366172 366710 363419
8622 363419 356748 354138 353205 352874 334657 321234 305824 306687 308175 321928 337005 330225 317823 327804
8608 327804 347993 354189 366535 394414 451579 527649 635713 740577 762349 682079 587894
8597 587894 516155 453678 408715 388535 376432 358634 332115 307526 286516 282283 284640 277382
8585 277382 266747 273925 257241 240405 236460 241016 239199 244197 226044 218507 214445 203605 194235
8572 194235 197605 205400 195914 205369 219694 204089 208495 220094 223156 234622 271174 272718 265839
8559 265839 280483 305814 341814 394119 424832 405117 363509 317653 275055 253637 234198 224656
8547 224656 215117 194388 184928 169717 168316 184955 202412 210970 225403 222208 212523 215754 222681
8534 222681 217204 215046 222069 264056 308752 367570 434039 467558 481659 459229 409208 354315
8522 354315 318849 298973 293287 266415 244561 220612 203181 192093 188280 179427 176043 168916 164655
8509 164655 167807 148079 131940 138378 149811 153077 158691 160395 168269 162570 161438 174631 177950
8496 177950 159902 145668 148518 168438 184838 188162 188567 188182 183925 177717 181201 194602 201079 192785
8482 192785 201394 215557 210924 201488 202882 208937 211506 214082 206430 194824 186159 186293 174398 173849
8468 173849 175345 167387 157470 135282 123455 133192 152385 166728 171208 161325 159282 159128 168209 173927
8454 173927 176873 180237 166038 159695 165804 194550 204061 197564 202510 206814 198100 192788 186455 188090
8440 188090 191003 189079 193550 181224 164717 162631 158628 145821 143470 141669 160504 157345 148602
8427 148602 151311 148626 151012 151423 142503 133157 125038 127997 136348 135168 134929 130856 133980 128187 126251
8412 126251 128836 124630 121049 137940 145867 139183 139292 131803 129126 140340 132143 122752 120898 114161
8398 114161 113747 105000 98257 93327 97524 106535 103195 113183 122511 122879 119074 123587 110782 102235 103590
8383 103590 100093 87960 88232 76900 82088 90167 86949 76070 73935 82114 81991 80700 78014 79550
8369 79550 82902 95351 93724 89300 95421 97616 89406 90175 90083 84352 77361 72911 73441 72536 61830
8354 61830 63490 62400 46692 38904 61236 68186 65969 72427 60437 57656 48991 59263 68425 79251
8340 79251 77481 68059 70176 65235 63245 62737 54629 52939 48003 46818 61067 56348 46587 32083
8326 32083 19188 28233 41922 41856 40620 39752 33913 29576 44330 43368 49496 65783 71755 59757
8312 59757 60193 48376 36384 35500 25169 35931 37168 35428 40021 46550 50444 44849 46269 50588
8298 50588 39602 41945 44929 44070 62743 65609 60388 46611 38210 39699 43439 49447 50644 42715
8284 42715 45862 40517 36741 34083 25272 34273 37302 33771 33696 28625 30205 29109 19979 35118 37365
8269 37365 37288 33657 40970 41352 34624 31992 35441 32848 31603 26521 37050 52259 51447 35627 30047
8254 30047 24207 17189 11504 -1269 -5789 11966 29403 35756 36013 28679 26262 31325 48899 49884
8240 49884 57215 72866 65356 55157 42156 46324 41395 31640 17975 23004 38896 50989 50961 54088
8226 54088 54977 48196 40582 40399 38804 50933 54458 37083 29818 26674 25774 20935 29286 30759 32541
8211 32541 42281 43173 42473 39674 36328 39512 44926 44389 37225 50430 62421 48710 43548 36380 32709
8196 32709 31261 37630 54806 51705 43330 44850 48711 41724 29809 20601 34792 46653 48012 57935
8182 57935 61206 52653 45278 28928 33436 45636 45009 46426 34999 28952 22801 21298 14982 35793
8168 35793 41811 38746 41407 43323 45155 47228 40729 34237 34869 33763 44383 52196 43766 41772 48692
8153 48692 36526 39039 33995 34871 38947 32687 40806 39361 32710 22723 15395 18836 31061 34499
8139 34499 27483 24940 29667 35718 36984 32704 32032 34098 40858 43003 43636 40365 41158 39959 32221
8124 32221 45978 50844 48464 44318 34424 37237 45155 41900 31945 11915 23139 29090 23752 17938
8110 17938 25438 36565 34821 30261 15672 20360 28167 24104 12694 15189 31656 23630 22107 25996
8096 25996 34435 40907 39030 28975 27766 29150 41838 42375 29714 18818 20647 29744 22816 31251
8082 31251 32326 24623 24019 32311 28978 38085 58843 46676 21995 26179 15915 8522 8774 15903
8068 15903 26419 30522 25294 19486 22117 17541 22835 30992 42089 39386 41774 45908 51224 54265
8054 54265 55255 65047 57275 42486 33953 40321 51516 52838 57161 58675 57747 45553 51977 43346
8040 43346 39438 33495 49335 39475 32194 38934 51572 50367 42569 41482 45450 43790 40627 33692
8026 33692 41185 50472 49874 49264 42219 27970 20724 18187 24702 26156 27570 41336 38025 42364 55498
8011 55498 68789 56101 47888 51123 45708 47073 54632 59652 71149 62772 57285 67330 54977
7998 54977 50695 50727 49015 51986 60928 64937 61214 56429 61698 68364 60780 64845 66886 55823 49233
7983 49233 57430 70675 58085 59474 76546 60486 61695 58005 43147 29626 32386 40287 38509
7970 38509 44713 48888 47672 47366 53910 48459 61826 59194 42995 35831 42034 45913 42297 38708
7956 38708 40754 26623 30866 40011 41714 36555 37442 53388 57625 50598 53335 64212 64460 65746
7942 65746 54881 49240 51062 58410 66380 68608 67558 73453 66411 58520 43350 48837 62467 62250
7928 62250 55724 62414 58691 49212 56207 50340 48739 49250 37521 24372 19263 17430 22302 37302
7914 37302 49293 46863 57347 67117 75386 62272 59998 56515 56243 66150 71132 60840 38945 22451
7900 22451 36104 38804 30650 26245 32738 23921 5934 601 20496 36296 27003 23320 32912 47758
7886 47758 44387 24782 35056 38637 38337 39236 33387 37071 44686 46974 38735 21251 20249 21430
7872 21430 20776 22647 22356 23095 32892 45468 40829 30890 32004 30387 22471 22937 46296 53179 42475
7857 42475 25910 30077 31595 25353 25051 26545 8355 1164 6025 3204 -3745 4296 72 -2664
7843 -2664 2028 -1348 9416 20519 18001 16380 20300 10241 3866 14488 23453 30759 17745 7469
7829 7469 11705 9961 11064 274 -1940 7401 11451 11895 20257 29978 34050 29841 27910 20081 9048
7814 9048 10668 18624 8857 -661 5400 20328 18693 17236 23445 30420 25828 18243 21228 33001
7800 33001 24977 -4003 -22292 -24520 -16643 -5537 5329 18176 15676 -7144 -2635 1291 5704
7787 5704 18391 31055 32146 19280 870 356 499 13596 19321 20320 36979 27279 9938 7183
7773 7183 16409 17487 11057 6394 11263 20661 27191 30160 27188 22394 22764 27663 22097 24927 28057
7758 28057 26080 28172 19503 12246 20332 11090 6781 1172 2542 20035 25700 23426 33597 28511
7744 28511 18713 3606 -11398 -5994 -6415 -7778 2761 -2806 -16460 -14194 -14550 -25423 -17528 1035
7730 1035 15417 9759 -2330 2938 15586 11935 7517 16520 16585 4498 -4403 -1970 3301 8086
7716 8086 16840 26362 17722 14814 10698 19848 22579 22460 18268 9776 3004 -2289 -932 7889 9162
$$ [...]
##END NTUPLES=NMR SPECTRUM
##END=
