##TITLE=Analysis number 310140
Compound Code cc 45522
Book Reference 440/28
Project Code adrs
Chemist Name craigr
##JCAMPDX= 6.0         $$ Bruker NMR JCAMP-DX V2.0
##DATA TYPE= NMR SPECTRUM
##DATA CLASS= NTUPLES
##ORIGIN= Bruker BioSpin GmbH
##OWNER= NMR
$$ XWIN-NMR		Version 3.5
$$ Tue Jun 14 10:36:45 2005 GMT Daylight Time (UT+1h)  MAYBRIDGE\NMR@NMR_250MHZ
##.OBSERVE FREQUENCY= 250.131544655141
##.OBSERVE NUCLEUS= ^1H
##.ACQUISITION MODE= SIMULTANEOUS (DQD)
##.ACQUISITION SCHEME= undefined
##.AVERAGES= 16
##.DIGITISER RES= 18
##SPECTROMETER/DATA SYSTEM= dpx250
##.PULSE SEQUENCE= zg30
##.SOLVENT NAME= CDCl3
##.SHIFT REFERENCE= (INTERNAL, CDCl3, 0, 16.522)
##AUDIT TRAIL= $$ (NUMBER, WHEN, WHO, WHERE, WHAT)
$$ ##TITLE= Audit trail, XWIN-NMR		Version 3.5
$$ ##JCAMPDX= 5.01
$$ ##ORIGIN= Bruker BioSpin GmbH
$$ ##OWNER= NMR
$$ C:\u/data/dgb/nmr/ADRS/4050/pdata/1/auditp.txt
$$ ##AUDIT TRAIL=  $$ (NUMBER, WHEN, WHO, WHERE, WHAT)
(   1,<2005-06-14 10:36:25.16 +100>,<MAYBRIDGE\NMR>,<NMR_250MHZ>,
      <created by zg, POWCHK disabled, PULCHK disabled
       configuration hash MD5:
       62 19 C7 07 E1 42 D1 B7 37 6C 3D D0 77 39 F9 E6
       data hash MD5: 64K
       39 74 6A 23 C2 FB 2C 87 99 FC F0 4D DA 08 8A CA>)
(   2,<2005-06-14 10:36:37.60 +100>,<MAYBRIDGE\NMR>,<NMR_250MHZ>,
      <Start of raw data processing
       ef LB = 0.3 FT_mod = 6 PKNL = 1 SI = 32K 
       data hash MD5: 32K
       82 1A BB 5F 8A 85 3C 35 DB C5 DF 84 79 FE 60 B7>)
(   3,<2005-06-14 10:36:39.57 +100>,<MAYBRIDGE\NMR>,<NMR_250MHZ>,
      <apk 
       data hash MD5: 32K
       87 D7 F0 73 D6 E8 72 6E CE D2 BB 81 ED 92 F7 B9>)
(   4,<2005-06-14 10:36:40.30 +100>,<MAYBRIDGE\NMR>,<NMR_250MHZ>,
      <abs ABSG = 5 
       data hash MD5: 32K
       F2 F1 09 29 7E 3B E9 F8 8B 6A 12 86 73 7F F5 C5>)
$$ ##END=
$$ 
$$ hash MD5
$$ D4 76 F3 4F B8 F2 40 53 B5 0E C6 5C F3 C4 F6 D1
##$RELAX= 
##$RELAX= 
##$RELAX= 
##$RELAX= 
##$RELAX= 
##$RELAX= 
##$RELAX= 
$$ Bruker specific parameters
$$ --------------------------
##$DU= <C:\u>
##$EXPNO= 4050
##$NAME= <ADRS>
##$PROCNO= 1
##$TYPE= <nmr>
##$USER= <dgb>
##$AMP= (0..31)
100 100 100 100 100 100 100 100 100 100 100 100 100 100 100 100 100 100 
100 100 100 100 100 100 100 100 100 100 100 100 100 100 
##$AQSEQ= 0
##$AQ_mod= 3
##$AUNM= <au_zg>
##$AUTOPOS= <15 >
##$BF1= 250.13
##$BF2= 250.13
##$BF3= 250.13
##$BF4= 250.13
##$BF5= 500.13
##$BF6= 500.13
##$BF7= 500.13
##$BF8= 500.13
##$BYTORDA= 1
##$CFDGTYP= 0
##$CFRGTYP= 5
##$CHEMSTR= <none>
##$CNST= (0..31)
1 1 145 1 1 1 1 1 1 1 1 1 1 1 1 1 1 1 1 1 1 1 1 1 1 1 1 1 1 1 1 1 
##$CPDPRG= <>
##$CPDPRG1= <>
##$CPDPRG2= <>
##$CPDPRG3= <>
##$CPDPRG4= <mlev>
##$CPDPRG5= <mlev>
##$CPDPRG6= <mlev>
##$CPDPRG7= <mlev>
##$CPDPRG8= <mlev>
##$CPDPRGB= <>
##$CPDPRGT= <>
##$D= (0..31)
0 1 0 0 0 0 0 0 0 0.06 0 0 0 0 0 0 0.0002 0 0 0 0 0 0 0 0 0 0 0 0 0 0 
0 
##$DATE= 1118741784
##$DBL= (0..7)
120 120 120 120 120 120 120 120 
##$DBP= (0..7)
150 150 150 150 150 150 150 150 
##$DBP07= 0
##$DBPNAM0= <>
##$DBPNAM1= <>
$$ [...]
##$SUBNAM7= <"">
##$SUBNAM8= <"">
##$SUBNAM9= <"">
##$SW= 20.6930455092707
##$SWIBOX= (0..15)
0 0 3 0 0 0 0 0 0 0 0 0 0 0 0 0 
##$SW_h= 5175.983436853
##$TD= 65536
##$TD0= 1
##$TE= 295.16
##$TE2= 300
##$TE3= 300
##$TEG= 300
##$TL= (0..7)
0 120 120 120 120 120 120 120 
##$TP= (0..7)
150 150 150 150 150 150 150 150 
##$TP07= 0
##$TPNAME0= <>
##$TPNAME1= <>
##$TPNAME2= <>
##$TPNAME3= <>
##$TPNAME4= <>
##$TPNAME5= <>
##$TPNAME6= <>
##$TPNAME7= <>
##$TPOAL= (0..7)
0.5 0.5 0.5 0.5 0.5 0.5 0.5 0.5 
##$TPOFFS= (0..7)
0 0 0 0 0 0 0 0 
##$TUNHIN= 0
##$TUNHOUT= 0
##$TUNXOUT= 0
##$USERA1= <user>
##$USERA2= <user>
##$USERA3= <user>
##$USERA4= <user>
##$USERA5= <user>
##$V9= 5
##$VALIST= <valist>
##$VCLIST= <CCCCCCCCCCCCCCC>
##$VD= 0
##$VDLIST= <DDDDDDDDDDDDDDD>
##$VPLIST= <PPPPPPPPPPPPPPP>
##$VTLIST= <TTTTTTTTTTTTTTT>
##$WBST= 1024
##$WBSW= 4
##$XGAIN= (0..3)
0 0 0 0 
##$XL= 0
##$YL= 0
##$YMAX_a= 367741
##$YMIN_a= -328743
##$ZGOPTNS= <>
##$ZL1= 120
##$ZL2= 120
##$ZL3= 120
##$ZL4= 120
##$ABSF1= 16.522
##$ABSF2= -4.171173
##$ABSG= 5
##$ABSL= 3
##$ALPHA= 0
##$AQORDER= 0
##$ASSFAC= 0
##$ASSFACI= 0
##$ASSFACX= 0
##$ASSWID= 0
##$AUNMP= <proc_1d>
##$AZFE= 0.1
##$AZFW= 0.1
##$BCFW= 0
##$BC_mod= 0
##$BYTORDP= 0
##$COROFFS= 0
##$CY= 12.5
##$DATMOD= 1
##$DC= 0
##$DFILT= <>
##$DTYPP= 0
##$F1P= 14.0000005364418
##$F2P= -0.99999901652339
##$FCOR= 0.5
##$FTSIZE= 32768
##$FT_mod= 6
##$GAMMA= 0
##$GB= 0
##$INTBC= 1
##$INTSCL= 1
##$ISEN= 128
##$LB= 0.3
##$LEV0= 0
##$LPBIN= 0
##$MAXI= 10000
##$MC2= 0
##$MEAN= 0
##$ME_mod= 0
##$MI= 0
##$NCOEF= 0
##$NC_proc= -4
##$NLEV= 6
##$NOISF1= 0
##$NOISF2= 0
##$NSP= 0
##$NTH_PI= 0
##$NZP= 0
##$OFFSET= 16.522
##$PC= 1
##$PHC0= 134.6597
##$PHC1= 5.085333
##$PH_mod= 1
##$PKNL= yes
##$PPARMOD= 0
##$PSCAL= 4
##$PSIGN= 0
##$REVERSE= no
##$SF= 250.13
##$SI= 32768
##$SIGF1= 0
##$SIGF2= 0
##$SINO= 400
##$SIOLD= 32768
##$SREGLST= <1H.CDCl3>
##$SSB= 0
##$STSI= 32768
##$STSR= 0
##$SW_p= 5175.98343685301
##$SYMM= 0
##$S_DEV= 0
##$TDeff= 65536
##$TDoff= 0
##$TI= <Analysis number 999999
Compound Code 99
Book Reference 9
Project Code 9>
##$TILT= no
##$TM1= 0
##$TM2= 0
##$TOPLEV= 0
##$USERP1= <user>
##$USERP2= <user>
##$USERP3= <user>
##$USERP4= <user>
##$USERP5= <user>
##$WDW= 1
##$XDIM= 32768
##$YMAX_p= 431527936
##$YMIN_p= -38545
$$ End of Bruker specific parameters
$$ ---------------------------------
##NTUPLES= NMR SPECTRUM
##VAR_NAME=  FREQUENCY,     SPECTRUM/REAL,   SPECTRUM/IMAG
##SYMBOL=    X,             R,               I
##VAR_TYPE=  INDEPENDENT,   DEPENDENT,       DEPENDENT
##VAR_FORM=  AFFN,          ASDF,            ASDF
##VAR_DIM=   32768,         32768,           32768
##UNITS=     HZ,            ARBITRARY UNITS, ARBITRARY UNITS
##FACTOR=    0.157963299565203, 1,           1
##FIRST=     4132.6476996994, 0,             0
##LAST=      -1043.33573715361, 0,           0
##MIN=       -1043.33573715361, -38545,      0
##MAX=       4132.6476996994, 431527936,     0
$$ Real data points
##PAGE= N=1
##DATA TABLE= (X++(R..R)), XYDATA
$$ [...]
19048B90148j6174k237q194j5531o621p404Q483M624k640J0724M853P447J1287
19035B78765J262Q131J325M255l056m222J5509n827N333N805O282L736J2080K450
19021C31828l225q446J1q09j4581l526K538K61j7622r180j916q009p97r350j4681
19006B42496k0192n735P394n440n026r137J545j595j309M052K0566J6059J1214
18993B54892l789j6418L20Q059q819m017n580O074J0896K1628R717K322J1136
18980B86421Q398j666P054J2667P687J0482L3502M8016O1646P3412Q6568N9393
18968F93580J7384J3527l482k3820m7339m8846l7227j9925p744P198M168J3065
18956E60539R45R257O437J832M831J2435J5977J7795L0360M0523N0256N6162N9535
$$ y = [290148, 273974, 271737, 263543, 248012, 241391, 233987, 242470, 247094, 244454, 255178, 260031, 267478, 278765, 280027, 288158, 289483, 293738, 290682, 286460, 301969, 296142, 301475, 307280, 313562, 317298, 329378, 331828, 328603, 320157, 320168, 319359, 304778, 301252, 303790, 304051, 286429, 277249, 275333, 267324, 266527, 257177, 242496, 222304, 216569, 223963, 218523, 213497, 204360, 205905, 204310, 203001, 207053, 227619, 243678, 254892, 251103, 234685, 235005, 243064, 234245, 230228, 224648, 230722, 241618, 263246, 272963, 275285, 286421, 294819, 293153, 300207, 312874, 320561, 331043, 364545, 412561, 474207, 547619, 634187, 693580, 710964, 724491, 721009, 697189, 649850, 601004, 563777, 543852, 536108, 543306, 547474, 560539, 561484, 570741, 577178, 579010, 583841, 596276, 612253, 630048, 660408, 700931, 751187, 807349, 866884]
18943H66884N9590N8304M0531J9515j610j0218j6550l1665m1376l7824l8490l5900
18931H31191k7668j5894j5256j3027j1737j1940p394k2090k6824p405J4445J8189
18919G04590M3277M4630M7094N4546J2901m4307n7039n9592o0190n5493m3475
18908E86942k0003j6137l425K335K1089J2406R733J4466J6373J0776J9594K3138
18896F77287J2148K0792K6365K8198K9574L0961L0115K6129R706M52j1523k8631
18884H51573m4587m3210m8811n6133n3417m4739l7377k6108k6443l3661k1094
18873D15993k4394k4058j7353j8196j7950j9376j1662j7471j4552K086j2190n965
18861B34912r234j1727P29J369l849j1533p990J238J430J503j1960k7l559l81
$$ y = [866884, 926474, 984778, 1025309, 1044824, 1043214, 1032996, 1016446, 984781, 943405, 905581, 867091, 831191, 803523, 787629, 772373, 759346, 747609, 735669, 728275, 706185, 679361, 671956, 686401, 704590, 747867, 792497, 839591, 894137, 907038, 862731, 805692, 746100, 685910, 630417, 586942, 566939, 550802, 547377, 549712, 570801, 583207, 592940, 607406, 623779, 634555, 654149, 677287, 689435, 710227, 736592, 764790, 794364, 825325, 855440, 881569, 891275, 891727, 880204, 851573, 806986, 763776, 714965, 658832, 605415, 560676, 523299, 497191, 470748, 437087, 415993, 391599, 367541, 350188, 331992, 314042, 294666, 283004, 265533, 250981, 253067, 240877, 234912, 225678, 213951, 214680, 216049, 212200, 200667, 192677, 193915, 195345, 196848, 184888, 184861, 181302, 180921]
18847A80921L865m897j5854p805N249J1413m337k939J0462K1511K3305K5020K1076
18834B66990K3692K4984L6562L7450L193p465k820j3838r428j1400n369R146J1674
18821C63371O031O912M992J4528N657o755j6032j1661j4477l4255k5515j1834
18809B80962j3883l4242k8029k0132p341o161j0447r838k544j5954j0888J443
18797A22946j938L918O470j13K882P367J268N198J591N636J1342P727K115R001
18783A85410O573J8542J5978J5477K2620K5352K2703K9301J8082R509J5873J0542
18771C95962j868K137o223q234K955n098l8041k1429j3243j5408j9052k0196k3361
18758B28901k2363j1056j4293j1554J846l178r814j3498r400Q459p52p497J3519
$$ y = [180921, 184786, 179889, 164035, 156230, 161479, 172892, 168555, 165616, 176078, 197589, 220894, 245914, 266990, 290682, 315666, 352228, 389678, 392871, 385406, 382586, 368748, 359320, 347920, 342551, 351697, 363371, 369402, 376314, 381306, 395834, 401491, 394736, 378704, 367043, 352566, 318311, 292796, 280962, 267079, 232837, 204808, 184676, 177335, 171174, 160727, 150889, 148345, 132391, 121503, 122946, 121008, 124926, 131396, 131283, 134165, 141532, 142800, 147998, 149589, 155225, 166567, 174294, 176409, 185410, 191983, 210525, 226503, 241980, 264600, 289952, 312655, 341956, 360038, 369547, 385420, 395962, 394094, 396231, 390008, 381774, 384729, 379631, 341590, 320161, 306918, 291510, 272458, 252262, 228901, 206538, 195482, 181189, 169635, 171481, 168303, 158489, 144991, 135591, 144050, 143298, 135801, 149320]
18745A49320J3437Q831J0436J1687J7562M2212L7093K1148J4487R629J0154J1972
18733C57968J2256L065m326m974O986J8638J2695l137o212k1588k6667k8016m5285
18720B71403l2243k6780k2646k8593j9674o307M746P872K028P1k696K888J202
18707A51271J254n357j3867n279j081k755n598o180L393P042J1137J3931J1726
18694A59637N185K4600L2557L8509M9253N2569K4051O877M737J2722m389j5059
18682C91249j5974k6315m7108k9727m788q05K1848L2422L6699M5178L8486M675
18670D45840k6730l5647n1076m6722m3454l9398k0028k0818j3667q188m122r566
18658A26424q141M288j287r883k395o438p225m027r074p15J294k421p418M146
$$ y = [149320, 162757, 171588, 182024, 193711, 211273, 253485, 290578, 311726, 326213, 335842, 345996, 357968, 370224, 373289, 368963, 363989, 370975, 389613, 402308, 399171, 392959, 371371, 344704, 316688, 271403, 239160, 212380, 189734, 161141, 141467, 135160, 139906, 147778, 149806, 149877, 147181, 150069, 151271, 152525, 147168, 133301, 128022, 126941, 124186, 118588, 112408, 115801, 122843, 133980, 147911, 159637, 164822, 189422, 221979, 260488, 309741, 362310, 386361, 393238, 397975, 410697, 406308, 391249, 375275, 348960, 301852, 272125, 267337, 266532, 288380, 320802, 357501, 402679, 441165, 445840, 419110, 383463, 332387, 285665, 242211, 202813, 182785, 161967, 148300, 140112, 135990, 126424, 118283, 122571, 121284, 111401, 109006, 102568, 95343, 91316, 82242, 81527, 82821, 80400, 72982, 77128]
18644G7128M642N123q594o552n69O4o272M15P07j0570q111K917Q48K194j835N30
18628E2065N848R93j0429l239N789o28Q095J289N946j973k840P329J1675R221
18614H9141m166r647o352K725O745K329j5256j0961j187L383L495q112K421M55
18600E5013r794p711J13l237p3Q6N462O031J413j195L817m086p627L934L950J892
18584D7988P710R100P708J2859J6108M519J612J6640J1689J788k216R966R614
18571A55085l038n484o662l105j0887l497N237n989j2498k521P810p520j4632
18558I2299j3993n327M331m0j4010q479m253J0063n764q216R30L255k809j0328
18544C7659K751J3763N588l607Q306M569n112Q850J3647J924O8k594L070J1082
$$ y = [77128, 81770, 86893, 78299, 71747, 71178, 71242, 64970, 65385, 66092, 55522, 47411, 50328, 51176, 53370, 51535, 52065, 57913, 58906, 48477, 45238, 51027, 50399, 58494, 59783, 65729, 63756, 60916, 68245, 79920, 89141, 84975, 75328, 68976, 71701, 78446, 80775, 65519, 54558, 53371, 56754, 60249, 52137, 54558, 55013, 45219, 37508, 37621, 34384, 34311, 34397, 39859, 45890, 47303, 46108, 49925, 45839, 38212, 42146, 46096, 47988, 55698, 64798, 72506, 85365, 101473, 105992, 107604, 124244, 135933, 137721, 135505, 145471, 155085, 152047, 146563, 139901, 136796, 125909, 122412, 127649, 121660, 109162, 106641, 114451, 106931, 92299, 78306, 72979, 77310, 77270, 63260, 54781, 50528, 60591, 54827, 46611, 47541, 50796, 47987, 37659, 40410, 54173, 59761, 56154, 64460, 69029, 63917, 72767, 86414, 88338, 88406, 85812, 88882, 99964]
18530I9964J5924J0652J3358P731M170J2862L740q10Q075m971K072K742M088Q980
18516A88577L010o624M743j3179k5257q325n084j328q981j6749q197p327q678
18503H6601q048n027l873P410J4056N582j2358q864j78K010K249q536m025K245
18489F9244l638m382J0598Q462n617N064J466n514n546J881P601J1047N576J9636
18475A15878J5394l791k703P954N136N986J112P577M04l258O958Q98j103K797
18461A59239k352m53L389j341m140J4o970m8M729M446J5272M326L99j49l04k202
18445A73855n391n562J3160Q181J164j579n822p22K909l862o220q689n910M622
18431A60134J3169k757j130J3370Q167N969N364J691J0535J9252N781J3918K0235
$$ y = [99964, 115888, 126540, 139898, 147629, 151799, 164661, 168401, 167591, 175666, 170695, 172767, 175509, 179597, 188577, 191587, 184963, 189706, 176527, 151270, 142945, 137861, 136533, 127552, 110803, 102606, 95279, 86601, 78553, 73526, 69653, 77063, 91119, 96701, 84343, 75479, 75301, 77311, 79560, 71024, 66999, 69244, 65606, 61224, 71822, 80284, 74667, 79731, 81197, 75683, 70137, 72018, 79619, 90666, 96242, 115878, 131272, 127481, 124778, 132732, 137868, 143854, 144966, 152543, 152947, 149689, 156647, 157545, 156442, 159239, 156887, 156434, 159823, 158482, 154342, 154356, 147386, 147338, 152067, 156513, 171785, 176111, 176510, 176361, 176057, 173855, 168464, 162902, 176062, 184243, 185407, 183828, 178006, 177284, 180193, 176331, 170111, 161422, 155512, 160134, 173303, 170546, 169416, 182786, 190953, 196922, 202286, 203977, 214512, 233764, 239545, 253463, 273698]
18418B73698N114r04R81N593M845L355J9n917p18O900K24K063J7885K3924J2538
18403C49600J39N742J3945J3521R996Q6J1129O300P833J4503J1117O446P977J5444
18389D73778K0777P576K1291J7140J1991J4673J948J8851J3164J533N556P031
18377F15309P474J4448J9045J8637M962J2105K5727J1818K9949K6292N162J9164
18365H10092L1492K3557L1244L1874L6679L6368M2412N7996O4111O9308Q1170
18354A316303R6187J20784J41386J49755J66342K07260K19409K13237K23155K66593
18344C120411L27175L89282M88718O52057Q85999J144132J305387J358170J548724
18335A1220055J860402J923329J614928J735780K512468L506381M817440O472819
$$ y = [273698, 278812, 277908, 278889, 284482, 289327, 292682, 292701, 286784, 286066, 292966, 293190, 295253, 313138, 337062, 349600, 349739, 355481, 369426, 382947, 392943, 393029, 404158, 410458, 418291, 432794, 443911, 450357, 458334, 473778, 494555, 502131, 523422, 540562, 552553, 567226, 569174, 588025, 601189, 602722, 608278, 615309, 622783, 637231, 656276, 674913, 679875, 691980, 717707, 729525, 759474, 785766, 790928, 810092, 841584, 865141, 896385, 928259, 964938, 1001306, 1043718, 1101714, 1165825, 1235133, 1316303, 1412490, 1533274, 1674660, 1824415, 1990757, 2198017, 2417426, 2630663, 2853818, 3120411, 3447586, 3836868, 4325586, 4977643, 5863642, 7007774, 8313161, 9671331, 11220055, 13080457, 15003786, 16618714, 18354494, 20866962, 24373343, 29190783, 35663602]
18327C5663602P344984P452751R006184J0740672Q201937K552503J461396J661470
18319H4085499k574777o868865o695816n642946o031475o045221m718516l097171
18311D2410712k262514k546505k960498k619117k465051k880173l062687k746533
18303B0867634k328365j994496j626493j222170q71970n92453m23993k92938j56414
18294A1358342n7722K1894J21725K85155N07732P75694J181367J692212K153649
18285A8040048K347806K420652K781096L127637K632878J790261K039467K877881
18277C8057726L239760L401149M519886O585084P321459N098131L678136N002119
18269G6903450L823776k229017n625596m807347n605314p874530p975815o435595
$$ y = [35663602, 43008586, 50461337, 59467521, 70208193, 78410130, 80962633, 82424029, 84085499, 81510722, 74641857, 67946041, 62303095, 56271620, 50226399, 45507883, 42410712, 40148198, 37601693, 34641195, 32022078, 29557027, 26676854, 23614167, 20867634, 18539269, 16544773, 14918280, 13696110, 12824140, 12231687, 11807694, 11514756, 11358342, 11300620, 11322514, 11444239, 11729394, 12237126, 13012820, 14194187, 15886399, 18040048, 20387854, 22808506, 25589602, 28717239, 31350117, 33140378, 35179845, 38057726, 41297486, 44698635, 49218521, 55803605, 63125064, 68223195, 71901331, 76903450, 80727226, 78498209, 72872613, 68065266, 62459952, 54585422, 46609607, 40174012]
18261D0174012n349211m486617l299220k431686k213937j966289j574062j491547
18253A7361443j586098j503946j286649j097847r42278p73872o23719m89204l96173
18244H661657l40231l13935k87794k50337k50366k31951k11654j82355j67079
18235F425955j42936j38834j41096j45925j32548j42672j62784j83657k07205
18226E028298k07234k08741k05712k08095k00326j96730j81967j62076j44236
18217C313181j50029j58410j45732j28693j27991j14197j23080j06542r6392q9326
18207B072789p5203p6533p2384o8873o9881n0994n8872n6150n6089m1301m6659
18196A399850n2950m4286m6427m9797n3111m3272m7506n0813m8717m4968k8253
$$ y = [40174012, 34824801, 30338184, 27038964, 24607278, 22393341, 20427052, 18852990, 17361443, 15775345, 14271399, 12984750, 11886903, 10944625, 10170753, 9547034, 9057830, 8661657, 8321426, 8007491, 7719697, 7469360, 7218994, 6987043, 6775389, 6593034, 6425955, 6283019, 6144185, 6003089, 5857164, 5724616, 5581944, 5419160, 5235503, 5028298, 4821064, 4612323, 4406611, 4198516, 3998190, 3801460, 3619493, 3457417, 3313181, 3163152, 3004742, 2859010, 2730317, 2602326, 2488129, 2365049, 2258507, 2162115, 2072789, 1997586, 1921053, 1848669, 1779796, 1709915, 1658921, 1600049, 1543899, 1487810, 1446509, 1399850, 1346900, 1302614, 1256187, 1206390, 1153279, 1110007, 1062501, 1011688, 962971, 918003, 889750]
18185H89750l5735l9298l9689l3923l4567k6361k5743k0751j5963k0430k9509
18174E67781j7838k7739j8606j1314q383q280j4218k2861r895p882j719r57k219
18161D15870k852N169Q346O027j1860k002J9607P071m293K1J443o06P785O837
18147D56563O622L082q06N804j321o430j868k481K54j4572j4943r613j5398j2289
18133C92604j0239j662q380k556J619O096J0269K2199K5214K6211K7908L9197
18121E28480M4730N7966O8769R2230J31364J77354K43992L91814N98015R18559
18111C253273J476807K429079L687803L112703j004598j821507j009575j876005
18103H247980k295342j640703j040446o83065m63145l13721k35670j73416j34052
$$ y = [889750, 854015, 814717, 775028, 741105, 706538, 680177, 654434, 633683, 617720, 597290, 567781, 549943, 522204, 503598, 492284, 483901, 475621, 461403, 438542, 428647, 420765, 419046, 418089, 415870, 413018, 418187, 426533, 432560, 420700, 418698, 438305, 445376, 441083, 441104, 442547, 441941, 449726, 456563, 463185, 466267, 465461, 471265, 469944, 463514, 461646, 459165, 459419, 444847, 429904, 420291, 404893, 392604, 382365, 380703, 372323, 369767, 371386, 377482, 387751, 409950, 435164, 461375, 489283, 528480, 573210, 631176, 699945, 792175, 923539, 1100893, 1344885, 1736699, 2334714, 3253273, 4730080, 7159159, 10846962, 13959665, 12955067, 11133560, 10123985, 8247980, 5952638, 4311935, 3271489, 2588424, 2125279, 1811558, 1575888, 1402472, 1268420]
18094A268420j09848q6866o3908m6883l0416m0081l2717l1367k3118j7252q731
18083G77233k6455k4455k0758j0836j0926q700o371m381K395N441J4634R150L565
18070F99536J5861Q957q004k0779k3112l7150l7259k8078l3058k1909k1834k0656
18058D72515j7320j2713k4750j8959j4881j6577j0963j6706j7455j2364j6331
18047B93496j0630j2305j1283J096k661j7696q624n118n328n960r068m984j1264
18034A89671M49J4681j979p122K47l986r747l196J719l903Q270l854K34J948n457
18019A77975P952j349k667P492R979n518j519n293n267m84J4332k172o272N872
18005A93061J342M8J1209K801O946p95j2838j1700m788m286j1415j200o362P688
$$ y = [1268420, 1158572, 1071706, 1007798, 960915, 930499, 890418, 857701, 826334, 803216, 785964, 777233, 750778, 726323, 705565, 694729, 683803, 675103, 668732, 664351, 666746, 672187, 686821, 695971, 699536, 715397, 724354, 716350, 695571, 672459, 635309, 598050, 569972, 536914, 515005, 493171, 472515, 455195, 442482, 417732, 398773, 383892, 367315, 356352, 339646, 322191, 309827, 293496, 282866, 270561, 259278, 260374, 257713, 240017, 231393, 226275, 220947, 214987, 205919, 200935, 189671, 190120, 204801, 202822, 195700, 195947, 191961, 182214, 179018, 180737, 176834, 185104, 181250, 181484, 183432, 177975, 185927, 184578, 181911, 189403, 199382, 193864, 192345, 187052, 181785, 181301, 195633, 193461, 187189, 193061, 194403, 194451, 205660, 208461, 215407, 214612, 201774, 190074, 185286, 181000, 169585, 168385, 162023, 169711]
17991A69711o04q567R70N594L316N383j671n101R967J244j843J3796K5494J9756
17977B37445M296Q665L1552M3247O1593O9951N3015N2063K7451O3r089l1803l8701
17964E09748l9992m2642k3532k8752k7545m076l620j1788p758q226j2039o524
17952B93254k0096j4984l09r703j8760k3383n150N91j470r659N357r65j3813r373
17938A71537O369Q617N501J690K457m03N898Q635K2700J6585J5995J0979L135
17925B79695n885P683J8737K8336K9490M6518M1540M0839M0908J3276m625l0428
17913E06084n8656o0790n0477m8230l8750j5224j1150j4609j5735r790j143j0705
17901A70825j7906p422l319k625r38p989j1665r70M671N15j524q90k396j2026
$$ y = [169711, 169107, 160540, 161510, 167104, 170420, 175803, 174132, 169031, 178998, 180242, 178399, 192195, 217689, 237445, 241741, 250406, 281958, 325205, 386798, 456749, 509764, 561827, 589278, 589341, 580252, 548449, 509748, 469756, 427114, 403582, 374830, 347285, 343209, 339589, 327801, 320043, 311817, 299778, 293254, 273158, 258174, 257865, 248162, 229402, 206019, 200869, 201460, 199990, 190331, 195688, 194723, 180910, 171537, 177906, 186523, 192024, 193714, 196171, 195768, 201666, 210301, 233001, 249586, 265581, 276560, 279695, 273810, 281493, 300230, 328566, 358056, 404574, 446114, 486953, 527861, 541137, 536512, 506084, 447428, 386638, 336161, 287931, 249181, 233957, 222807, 208198, 192463, 182673, 181530, 170825, 152919, 145497, 142178, 139553, 138615, 130626, 118961, 117991, 122662, 123177, 121653, 120763, 118367, 106341]
17887A06341r164k893L800l592M958J5651j952j1663o837o032L897q951r73P474
17873I0064R65o694k064k02j106l125J139M806o611J7N698m630o962N533M062
17858H0890m765m558J033L055K557j895N881O344j4920n017M133j642N854j4882
17844F2068n199k967R301p48m249N22M692M857M526J240N76R131J1730R264L331
17829A08075J6087L656Q344J3150R902K7207L3567J7792J9317K0319J5033K7736
17817C20185K3765J4413K5749K7646N587J531K377Q946r004j5197k7906k1429
17805C56663j9937k8414l2503l5787l3352j2882J983j7368j2514M698N351J717
17793A77655j2590k0095m277l738p74n556p533l121L530m107l334O023q61J113
$$ y = [106341, 97177, 94284, 98084, 94492, 99450, 115101, 113149, 101486, 94649, 88617, 92514, 83563, 82590, 90064, 91029, 84335, 82271, 82069, 80963, 77838, 78977, 83783, 77172, 77189, 82887, 78257, 71295, 76828, 80890, 76125, 71567, 72600, 75655, 78212, 76317, 82198, 88542, 73622, 68605, 72738, 71096, 76950, 62068, 56869, 53902, 63203, 62455, 58206, 58728, 63420, 68277, 72803, 74043, 74619, 83750, 95480, 104744, 108075, 124162, 127818, 136162, 149312, 159214, 186421, 219988, 237780, 257097, 277416, 292449, 320185, 343950, 358363, 384112, 411758, 417345, 418876, 421253, 430199, 421195, 405998, 378092, 356663, 336726, 308312, 275809, 240022, 206670, 193788, 195771, 178403, 165889, 170587, 175938, 177655, 165065, 144970, 140693, 136955, 136181, 130625, 123092, 119971, 123501, 119394, 116060, 122083, 121222, 122335]
17779A22335J0632J9181J2727J8346K4716K3746L4953K3757J3114J5315K0392
17768C39214J5224O480L621P314p847j42P796O821N917J9151J3633J1075K7135
17755D55392K4653K9631M3548M4274L0931K8633Q289q540j7595k3278m6754n6489
17743E12695n4503m5526m7670k5609n289j3607k7630k4741k0757j5372j5689j9339
17731A96963j9341p653N67p193q080j2008q657m878p472P23J9676k255j6973l352
17717A20067R313n410K395K249K323J5005J9153J3992J4914J2871N806M647J5253
17704B32578J2719J7124K5478L2035K4364L6184K2561L8760K9418J0343n637p439
17692D68488m1312n6191n1504m3151l6142l3050k1010o525j2484k0924p654m321
$$ y = [122335, 132967, 152148, 164875, 183221, 207937, 231683, 266636, 290393, 303507, 318822, 339214, 354438, 360918, 364539, 371853, 364006, 363864, 371660, 378481, 384398, 403549, 417182, 428257, 455392, 480045, 509676, 553224, 597498, 628429, 657062, 665351, 656811, 639216, 615938, 569184, 512695, 458192, 412666, 364996, 339387, 334098, 320491, 292861, 268120, 247363, 231991, 216302, 196963, 177622, 169969, 170536, 163343, 155263, 143255, 134598, 129720, 122248, 122971, 142647, 140392, 123419, 120067, 129380, 123970, 126365, 128614, 130937, 145942, 165095, 179087, 194001, 206872, 212678, 217325, 232578, 245297, 262421, 287899, 319934, 344298, 380482, 403043, 441803, 471221, 481564, 475927, 468488, 427176, 370985, 319481, 276330, 240188, 207138, 186128, 179603, 167119, 146195, 138541, 134220]
17680A34220r125j3660n770o697p098o155m465m947l481j889o482K314m350j842
17666F0573j042o259n505o24q895j0541P387J3467q48l238q718m250k999K48L707
17651C2463L667O388O329n8j894l216p192K022L283N700k524J778O975p080n644
17636D0997n065K26J443J411n004k796L447j1629m43K529N614L446o409r001m400
17621A4366j0q802m701qJ4924l172j029J278l628M60J0281M203p222j149j777
17606A4014P921N070j2014p024o780J337L770L695J036j942N39L911P483O300
17592B7316p307j3818m183J1330J2752L067j093r50n602q33r243j2423O368N900
17578A1281r929l772l649k30k329R754O653j643K403k856R26r134O355M512Q656
$$ y = [134220, 125095, 111435, 105665, 98968, 91870, 85715, 81250, 76303, 72822, 70933, 64451, 66765, 62415, 60573, 59531, 53272, 47767, 47143, 38248, 27707, 35094, 48561, 47713, 44475, 35757, 31507, 28508, 28756, 32463, 36130, 42518, 48847, 48789, 46895, 43679, 36487, 38509, 41792, 47492, 44968, 46746, 53721, 46641, 40997, 35932, 36158, 37601, 39012, 34008, 31212, 34659, 23030, 22587, 25116, 30730, 34176, 27767, 18766, 14366, 14356, 5554, 853, 845, 15769, 12597, 11568, 12846, 9218, 9678, 19959, 24162, 16940, 15791, 14014, 21935, 27005, 14991, 7967, 1187, 2524, 6294, 9989, 11025, 9083, 9622, 13533, 21016, 27316, 20009, 6191, 2008, 13338, 26090, 29157, 28064, 27114, 21512, 20679, 11436, -987, 5381, 11281, 1352, -2420, -6069, -6299, -8628, 1126, 7779, 6136, 8539, 5683, 6609, -2525, 3830, 8342, 16998]
17563A6998O302j6313M14J975O197L122M291P1J616l581o65J890k610j581l389
17548A4737L918o061O464M910j5233o46O322k622M362k642L007o95k928l158k333
17533G402P883o01j413k389J405O049M316n902p981p194p146k551J325Q70R410
17518C483R293L657N440L399j777k932j0384J099j676K884K978L36j853M117O81
17503A8745o630k286J0402N460r171r250p642O78Q862k560Q089r771p150P01M276
17488B753R138J2350m82m692l118r313l65j945l12p121O720Q025R513o293o320
17473H538k210O047j420j315m807m622j384J248J3834M964j384n485M100O475
17459B2579m530p27j205J323j014j738M228n515p670r481p608P153J8287P057
$$ y = [16998, 23300, 6987, 7401, 9376, 15573, 18695, 22986, 23057, 24673, 21092, 20427, 22317, 19707, 18126, 14737, 18655, 12594, 19058, 23968, 8735, 8089, 14411, 11789, 16151, 13509, 16516, 15821, 12893, 9735, 7402, 15285, 14684, 13271, 10882, 12287, 18336, 22652, 16750, 8769, 1575, -5571, -8122, -6797, -5927, 3483, 12776, 16433, 21873, 25272, 23495, 20563, 10179, 11278, 9602, 12486, 15464, 15800, 13947, 18064, 18745, 12115, 9829, 20231, 25691, 16520, 7270, -372, 306, 9168, 6608, 14697, 4926, -2224, -1523, 2753, 11891, 24241, 23759, 19067, 15949, 6636, 6271, 4326, 4014, -3107, 3613, 11638, 21151, 14858, 8538, 6328, 12375, 10955, 9640, 4833, 211, -1173, 75, 13909, 18873, 17489, 12004, 16104, 22579, 18049, 17322, 16117, 17440, 16426, 14688, 18916, 13401, 5731, -3750, -11358, -4205, 14082, 21139]
17445B1139P294J0055J9085J8918J5271j1374n239r758j6762j1324p559o466r468
17432A3812K871m687o173p228j344Q667o19l279P815Q765Q654J354k872j0490
17418A5246M588k224J866j955P108O58n522k973r782k760N532K171j122O481O430
17403B3742j048p624p1M33p790j454O345m360q280N428O169Q47J268j551J035
17388A3089R349K199k020o136q249r199K912M649R049M673j00m607l113p133k685
17373B678Q93J1419k217m750j058K051M173L843q698r07N779L026m612j773j110
17358H737l125o352K368k74n7O328M704J890N470M993j1717j4415o239J585K0844
17343A4740J0151l098o369k022r975r330o03J0841J638q416L553J476k54O378
$$ y = [21139, 28433, 38488, 57573, 76491, 91762, 80388, 75149, 65391, 48629, 37305, 29746, 23280, 13812, 16683, 11996, 5823, -1405, -2749, 5918, 5299, 2020, 9835, 18600, 27254, 28608, 25736, 15246, 19834, 17610, 19476, 17521, 24629, 25287, 19765, 16792, 7010, 4250, 9782, 11953, 10831, 17312, 23742, 22694, 15070, 14999, 15432, 7642, 6188, 12533, 8173, -107, 5321, 11490, 12337, 13605, 12054, 13089, 22438, 24637, 22617, 16481, 8232, -967, 1945, 6594, 15643, 20316, 20216, 15609, 12496, 5363, 2678, 3571, 14990, 12773, 8023, 6965, 9016, 13189, 17032, 8334, 7427, 13206, 16232, 11620, 9847, 8737, 5612, -740, 1628, 1354, 1297, 7625, 12329, 14219, 19689, 24682, 12965, -1450, -7689, -6104, 14740, 24891, 21793, 15424, 13402, 3427, -5903, -6506, 4335, 5973, -2443, 1110, 2586, 2332, 8710]
17329H710j2173l489O102J177J495K319P0K824o544O116m40j64N364L70j435j7611
17313g309n63L523J772K818O322J651J0049k408p137k171L835J64k735J165m4
17298H932o929J439P446m568j0773j793p998o643J923J5970L836L08o356L212
17284a994J634N510q3J896L624J784l485J1879N482l398o826k288o952J091P310
17269A5184j607r09n794R11N789m35J357R98m020k963M049J845q045M403n885
17254D878k19M992R048q668q274j765O231J0496l94K87l766n396L112k989k33
17239G340l664o084q52Q091N171l710k527n428p945j53O407R152k33n237N10R680
17223A0518K907p151l635O929n754J530m461j0223L844L276l58M789P367k769
$$ y = [8710, -3463, -6952, -850, 327, 1822, 4141, 4211, 7035, 491, 6607, 6167, 6003, 11367, 11737, 10302, -7309, -7872, -4349, -2577, 241, 6563, 8214, 18263, 15855, 8718, 6547, 10382, 10546, 7811, 8976, 8932, 2003, 3442, 10888, 6320, -4453, -6246, -14244, -20887, -18964, -2994, 842, 1150, -5206, -1994, -360, 5150, 5067, 6963, 10587, 12371, 8886, 20765, 26247, 22849, 16023, 13735, 6783, 7874, 15184, 13577, 12668, 6874, 7785, 13574, 13139, 14496, 15494, 11474, 8511, 12560, 14405, 6360, 10763, 4878, 4659, 9651, 18699, 10031, 1757, -8, 6223, 16719, 16325, 16612, 12846, 7450, 10562, 7573, 7340, 3676, -2408, -3260, 4831, 10002, 6292, 3765, -1663, -9608, -9761, -3354, 5798, 5565, 328, 838, 10518, 13425, 6274, 2639, 9568, 3814, 5344, 883, -9340, -5496, -2220, -2578, 2211, 9578, 6809]
17209F809K675K510j0586M289L527o926l423J2493Q362K151j0773j906M800M18
17195A4420m688l420m60L481J304J0248Q728l689l546l73N646q42q589j8030P11
17180I01k300R769M798o232j2000n28J2648J0540m499q481J0697l115j2541j3040
17166a3383l168P764K415M656M883m819L488P596p57m40n135o212M815M228K142
17151H073J965j921p156l222k897O415L571P260M516q079K246l328q00R372M454
17136B0469p02l908k97m835O31k19o043k18O461L073n066p934L576Q160N084L651
17120B1883M832P75j0294p992q16j1065L082M384J908M565K909o902p380K448
17106B337N182k48P194l326n419q139K775n949p925k522R005o858o104L251J4102
$$ y = [6809, 9484, 11994, 1408, 5697, 9224, 2298, -1125, 11368, 19730, 21881, 11108, 9202, 14002, 14420, 9732, 6312, 5852, 9333, 10637, 20885, 29613, 25924, 22378, 22005, 27651, 26809, 18220, 190, 901, -1399, 8370, 13168, 6936, -5064, -5592, 7056, 17596, 13097, 4616, 15313, 12198, -343, -13383, -16551, -8787, -6372, -1716, 3167, -1652, 1836, 9432, 8675, 8235, 3100, -3112, 1703, 5931, 8073, 10038, 8117, 961, -2261, -5158, 1257, 4828, 12088, 16604, 8525, 10771, 7443, 6643, 16015, 20469, 19767, 15859, 15562, 10727, 11358, 11139, 5096, 4878, 11339, 14412, 9346, 1412, 4988, 13148, 18232, 21883, 26715, 27490, 17196, 9204, 8388, -2677, 405, 4789, 6697, 11262, 14171, 7269, -111, 2337, 7519, 7271, 14465, 11139, 5720, -2419, 356, -5593, -13518, -16040, -7035, -13893, -19997, -16746, -2644]
17091b644M834o652J654o390L504J5311q532o65n599l712J82n077M939J1286Q501
17076A0940j1651j3562Q2K730P263P656l448l737r95o45L193M549j0005j1060
17062a8690j228O203j160k948n537M076n75J332M648N296J551N86J054J260L308
17047h24N130n492L372R397N951m598r139N952O484r94p400l168k695O426M428
17032A2830l774Q51j896J561J360j0330j0097J382j872K206N53N3P571J528J356
17017C282k545N646O198J616q563j1269j71P551j030K326k273j0124L645K892
17003b819m995J1455J566j07Q623k667m662L623m258J573n808l796L409j602k115
16988b580K222J940L340k84n395N052M386q433j371M833j0089p210P505J694l720
$$ y = [-2644, 2190, -4462, -2808, -9198, -5694, 9617, 1085, 420, -5179, -8891, -8709, -13786, -8847, 2439, 10940, -711, -14273, -14191, -11461, -4198, 3458, 10, -3727, -4722, -5367, -2174, 2375, -7630, -18690, -19918, -13715, -14875, -17823, -23360, -19284, -19859, -18527, -13879, -8583, -7032, -6446, -5392, -4132, -824, 4306, -1186, 2186, 11583, 17534, 12936, 3797, 9749, 16233, 15239, 7839, 4671, 1976, 8402, 12830, 9056, 9907, 8011, 9572, 10932, 602, -9495, -8113, -9985, -7779, -7226, -7173, 398, 1926, 3282, 737, 6383, 12581, 14197, 5634, -5635, -5806, 1745, 715, 3041, 768, -9356, -5711, -2819, -7814, 3641, 5207, 5100, 13723, 11056, 6394, 10017, 5759, 7332, 1524, -2272, 1137, -465, -2580, -358, 1582, 4922, 4638, -757, 4295, 8681, 248, -1123, 3710, -6379, -13589, -6084, -4390, -8110]
16973h110k953N25n820L035J459K878M619J2123j222J94R92r399n676J271J641
16958d443q185o571R357N853o175K005K92j433O885J1661K845o668J2133K654
16944B0210j373l589n887k815j218r89O245j287l010l732R88n031M22M845M31
16929D210k237K696j238L41j476l476J06l406p099l771J3443J0041l392l312m093
16914b663k297k88m708n669N237J11O047l987N457J5081l061o346q338J170n548
16899i802L878K372Q32K21r706m422N966P784l642K547Q047m560L471n195p823
16884a0032r892j135K149O287Q117j259j938n538R46J1634m530p569j829O61J0189
16869c739Q468M716l277j857k958m669n440k475m088o013K536O129N701l01M286
$$ y = [-8110, -11063, -10538, -16358, -13323, -11864, -8986, -4367, 7756, 6534, 6728, 7720, -1679, -7355, -6084, -4443, -12628, -19199, -9842, -3989, -10164, -8159, -7867, -9300, -2415, 9246, 12091, 5423, 17556, 20210, 18837, 15248, 9361, 6546, 5328, 4339, 10584, 9297, 6287, 2555, 3543, -1488, -1066, 3779, 4210, 1973, 4669, 3431, 3772, 2296, -1180, -1074, -4480, -11579, -15350, -1907, 8134, 4742, 1430, -2663, -4960, -5248, -9956, -15625, -10388, -10277, -4230, -8217, -2760, 12321, 9260, 2914, -5424, -4254, -9802, -5924, -3552, -2720, -2499, -12205, -16627, -10661, -2877, -6519, -3972, 4075, -485, 2986, -2209, -10032, -19924, -21059, -18910, -12623, -4506, -5765, -7703, -13241, -12295, -661, -5191, -12760, -14589, -13928, -3739, 4729, 9445, 6168, 4311, 1353, -3316, -8756, -11231, -15319, -21332, -18796, -12667, -6966, -7267, -2981]
16854b981M245k227M454J1687j3366j3712K772K697R22m921J1825k665m030K645
16840b655K462j522k001q093p364K837L754J5087O964l242r349k930J019N137
16826A04O72J988L945J513m455j059N942m666j0527n363O647K832K939L12o491
16811e667N80N140O981r68o429p287J0042Q914j148J995o96o871M705J541j019
16796I813l43j0o341j233o442q413M829L283q62k897P330K752K504n589p315k574
16780a1508l848K234P950O069J303n095L245R160N829l564L549J793j1018j091
16766E008j621n040K48Q032m946m93J101L733l961j1233p902J3415L552l389o803
16751a0299P23L397L780N144k233l912p31k977k524j76L920M18M153N675o361
$$ y = [-2981, 1264, -963, 3491, 15178, 1812, -11900, -9128, -6431, -5509, -10430, 1395, -1270, -5300, -2655, -193, -1715, -3716, -11809, -19173, -16336, -12582, 2505, 9469, 6227, -3122, -6052, -5033, 104, 776, 2764, 6709, 8222, 3767, 2708, 8650, 3984, -6543, -11906, -5259, -2427, 512, 824, -5667, -5087, 53, 7034, 6066, -363, -7650, 2392, 11306, 10158, 12153, 11457, 4586, 9291, 10832, 9813, 9470, 9460, 3119, 1886, -4556, -12969, -8140, -4857, -5719, -8616, -1286, 1466, 3970, -1619, -8934, -11508, -15356, -13122, -5172, 897, 2200, -2895, 350, 9510, 15339, 11775, 15324, 17117, 6099, 5008, 3387, -1653, -1405, 6627, 1681, 1188, 2289, 6022, 2061, -9172, -17074, -3659, -107, -3496, -10299, -9576, -6179, -2399, 2745, 512, -3400, -4131, -7108, -9632, -9808, -5888, -5470, -1317, 4358, -2003]
16736b003j261K761q87n374r359M731J297O201L266J656M406K930j3622n60L760
16721b058J318o69o933j266J937K86L035j0970M973l114o303k8P047O075O130
16706e40j999O072R001q01j1554o299j980l873O771j846p200K680P989P582R601
16691A3604K023P07J613r895j1097m04Q060l39o709R15j652M920K556l785K000
16676B517k408M013M664m758Q42j1118m165p408n638N712J3213O863k944m021
16662d636q6m007m925j793J3097J0012j361r770n994Q166M63K723N015q699K048
16647B53Q958k737p067l299p910L07Q059m250K730K917l372Q26P304p835n943
16632a1059L607j427J458O338j597K919K439k044K319n500j3740q502K533P041
$$ y = [-2003, -3264, -503, -1390, -6764, -16123, -11392, -10095, -3894, -628, 1028, 5434, 8364, -5258, -5818, -2058, -740, -1409, -8342, -9608, -7671, -7385, -4350, -15320, -10347, -13461, -19764, -19792, -12745, -6670, -540, -2539, 3533, 12534, 11733, 179, -6120, -8100, -11973, -5202, -7048, -14248, -11568, -3579, 4003, 13604, 15627, 16334, 17947, 8052, -3045, -3449, 4611, 4272, -2437, -1522, -3174, 1746, 4302, 517, 2517, 109, 4122, 8786, 4028, 4870, -6248, -10413, -17821, -23459, -17747, -4534, 2329, -615, -4636, -4722, -8729, -13654, -15447, -2350, 7662, 6301, -3469, -9463, -1297, -834, 1889, 6904, -1795, 253, 9211, 6474, -593, -3892, -11802, -11495, -3436, -7686, -4956, -2039, -5411, -4585, 2719, -5116, -11059, -7452, -8879, -7421, -1083, -2680, 239, 2678, 634, 2953, -2547, -16287, -24789, -22256, -15215]
16618a5215k47n749N35J1080J275r428J0684M327M636J555j0255M362Q161n008
16604G13J878l205j5102k990Q634R50L515M11R170Q04n420m27l180M604j2325
16589a1970j73N393j0111j305Q157R579K621l120J413J1892l496j1926J644o500
16575g902o903M073P813M168J843j652l017l146Q128O855n789L9r19o062j055
16560c526N12m77l634j3614o078J860p716L055M447N252N049J1665K626l527l155
16545g261K100n823j0125Q51r109k013O456J0895P6p091k335R782L439j204k568
16530a3930K098R579M510l439l731j600m569k500n11M951o078l377O052k894L816
16515a1623O622j4370p193M54K160K059K807J478J2029M617j290j834j158P448
$$ y = [-15215, -15462, -21211, -20676, -9596, -8321, -17749, -7065, -2738, 1898, 3453, -6802, -2440, 5721, 713, 2591, -614, -15716, -18706, -10072, -9122, -5607, -5196, 3974, 4778, -642, -1069, -4249, 355, -11970, -12143, -6750, -16861, -18166, -10009, -430, 2191, -929, 484, 12376, 8880, -3046, -1402, -7902, -14805, -10732, -2919, 1249, 3092, 1440, -1577, -4723, 3405, 10260, 4471, 4510, 3591, -2471, -3526, -3014, -3491, -7125, -20739, -26817, -24957, -32673, -29618, -25171, -19919, -14870, -3205, -579, -4106, -7261, -5161, -10984, -21109, -20258, -29367, -31380, -24924, -14029, -13953, -21044, -23379, -13597, -10158, -11362, -13930, -11832, -2253, 2257, -1182, -4913, -6513, -11082, -13582, -14093, -9142, -15220, -18597, -12545, -15439, -11623, -5001, -19371, -26564, -26110, -23950, -21891, -19084, -17606, -5577, -960, -2250, -4084, -5242, 2206]
16501B206m31j792N225K125l91N864l275j514J276K681o914j1203p262N95J621
16486a1189J902r652j544M558l199l520R436P422J1002J412j769r510p07l629
16472h987L125q98J211J3281j0835j309O220J395l014P259O438P982Q708K483
16458C3059j811j0859j4468m874J2066k633k870q661o916N323J2693j697k037
16445F315N126k340q982k65o223L752j54L997J765M853n730j1273K154R591P636
16430A0222J112N208L281q169q416K23k519O415n413J610p313n145n617m674M698
16415a4497J2922k213o428L798r28j402L73k24m085j582J204M414l969J6246K43
16400C872p777J594K736J745L151m877R49Q206N416k506L209j6906l257L598J135
$$ y = [2206, 1775, -17, 5208, 7333, 6942, 12806, 9531, 8017, 9293, 11974, 5060, -6143, -13405, -12810, -11189, -9287, -18939, -20483, -15925, -19124, -22644, -13208, -5786, 5216, 6628, 4859, -4651, -5358, -8987, -5862, -6760, -5549, 7732, -3103, -4412, 1808, 3203, 189, 7448, 13886, 21868, 30576, 33059, 31248, 20389, 5921, 1047, 13113, 10480, 7610, -1051, -7967, -2644, 10049, 8352, 6315, 11441, 9101, 119, -146, -6369, -2617, -2771, 1226, 2991, 7844, 2114, -9159, -7005, 2586, 10222, 11334, 16542, 19823, 11654, 3238, 3461, 942, 7357, 1944, 3554, -3759, -8904, -14521, -19195, -14497, -1575, -3788, -10216, -6418, -7346, -8748, -8375, -8599, -12684, -14266, -13062, -8648, -12617, 3629, 3872, -3905, -2311, 425, 2170, 5321, 444, 1393, 9599, 15015, 12509, 15718, -1188, -4445, -847, 288]
16385B88p152l549M015k134J353J375P239m228K98J1547K4l470l777l990M73M481
16369B793J2546J725o218J122p642l179o960p757l768Q288J3113K188r455k869
16355f073M737J443o149J09J809l248L01l328K085j990J15J3537K53j0015q047
16340a4461K288O268l703p905O224J5288j738K273P729o852M558p599j0234O377
16326a487L001o623k37J590L938r02o127q44Q696K561k922P323l909n615j1210
16311a2767k44j688p469M396Q733J0188O56n17m466k258o154m138N084L136N205
16296b303m558J067R082J7269q588p168O446K305j0253k00J0916j1155l732R754
16282H882K587j0074j0629p467l05Q262P965m51J546p017q792R88N627o589l411
$$ y = [288, -6864, -10413, -6398, -8532, -7179, -5804, 1435, -2793, -2495, 9052, 9076, 5606, 1829, -2161, -1688, 2793, 15339, 17064, 10846, 11968, 4326, 1147, -5813, -13570, -17338, -9050, 4063, 6251, -3204, -6073, -1336, 107, -6042, -5933, -4124, -7372, -7071, -10399, -8314, -10304, -10189, 3348, 3601, -6414, -14461, -12173, -5905, -9608, -17513, -11289, 3999, 2261, 4534, 12263, 5411, 9969, 2370, -7864, -1487, 1514, -5109, -5346, -3756, 182, -720, -6847, -7691, 1005, 3566, 644, 7967, 4058, -1557, -12767, -13011, -14699, -22168, -17772, -9039, 1149, 1805, 1288, -3178, -5436, -11590, -15728, -10644, -7508, -2303, -6861, -5794, 3288, 20557, 11969, 4801, 11247, 13552, 3299, 3099, 14015, 2860, -872, 8882, 11469, 1395, -9234, -16701, -17006, -8744, -779, -1230, 316, -6701, -15493, -14505, -8878, -15467, -18878]
16267a8878J349J0984M060o839P713Q030j6292m818K551P16l097l824m759K25
16253b2879J864O520K022J152K646O673M937p8j1268r01P410L854n146l263k380
16238h837K818L658Q898k543q662p60J535K887p7k079m193r257l771O175P678
16223f530N905L330L358m487k298M863O970m973j713j303n33P802n057K067L627
16208A1028K595k0236o734J1198O891k664q216o650l987N296l658L736N719J0536
16194D854P331N710j2694j0340o311L186k452L073k06J010R622M368j4j127K451
16179H461j059J633p667n351M471k510j557k782m890q516mM247Q486k162r326
16164a8526k793J4279J5646m616m719l714P379p857J069M750K56P91j54j989j1337
$$ y = [-18878, -17529, -6545, -2485, -9324, -1611, 6419, -9873, -14691, -12140, -11424, -14521, -18345, -23104, -22879, -21015, -14495, -12473, -11321, -8675, -2002, 2935, 2857, -8411, -9312, -1902, 1952, -3194, -6457, -8837, -6019, -2361, 6537, 3994, -4668, -5428, -3893, -1006, -1083, -3162, -7355, -16612, -20383, -14208, -6530, -625, 2705, 6063, 1576, -722, 4141, 11111, 6138, 4425, 3122, 2589, 10391, 5334, 7401, 11028, 13623, -6613, -13347, -2149, 4742, 2078, -6138, -12788, -16775, -11479, -15137, -11401, -5682, 4854, 12185, 17895, 5201, -5139, -11450, -8264, -10716, -7643, -7849, -6839, 2783, 7151, 7137, 6010, 8461, 7402, 9035, 1368, -3983, 488, -2022, -3579, -6361, -11251, -19767, -19771, -15524, -7038, -9200, -18526, -21319, -7040, 8606, 3990, -729, -4443, 2936, -4921, -3852, 898, 1154, 1945, 1791, -198, -11535]
16149a1535K134M957P821J533m012l290p057J0336Q270j0286n661J294J578J854
16135b064M87j192l50L147N989k023n703L501K22p224K943Q161J71j0614K139
16120b410j233Q070J16n586q513l163N957M475n270q010N558O528m740O653n844
16105g412p983M067k798q356j0565L085R389P408j676L006M716k859m027Q93K332
16090a0780P729N044k220m283j4809p162J0525O911j803K826K488J520K741M817
16076C544l272q115M643Q997m391m812l108j1350p218J915R477J5073q10M433
16062E006M61k546r117m125j70j384Q329O471J2l579m151k718Q320M805m089l78
16046A147L907l991k317N934r446l118r730o098N627J905o05q404o232j988J2337
$$ y = [-11535, -9401, -4444, 3377, 4910, 898, -2392, -9449, 887, 9157, -1129, -6790, -5496, -3918, -2064, -1577, -2769, -3119, 28, 6017, 3994, -1709, 1792, 2014, -5210, -2267, 5894, 6065, -4549, -2410, -3643, 4427, 4543, -1043, -9556, -12719, -6762, -2287, -7557, -15567, -10009, -3481, -8221, -1568, -7412, -15395, -11328, -14126, -22482, -33047, -29962, -20573, -13165, -14841, -11835, -7119, -9978, -14005, -13112, -10780, -3051, 1993, -227, -4510, -19319, -26481, -15956, -9045, -10848, -8022, -5534, -4014, -1273, 3544, 272, -7843, -3200, 5797, 1406, -3406, -6514, -17864, -25082, -23167, -13690, 1383, 573, 5006, 5467, 2921, -6196, -10321, -10491, -11875, -3546, 2925, 2937, -642, -4793, -7511, 809, 5614, 1525, 1147, 5054, 1063, -1254, 4680, -4766, -7884, -17614, -23712, -18085, -16180, -16785, -25189, -31421, -33409, -21072]
16031b1072J2217r73J1095L859P326N913n384K08k936p407k529P979j0364j3330
16017a5398K432O214k033j1422L632N954K892n247p095r67j951J0393O492l430
16003i534J219R37n547L293O363J235o821l214M016K351P731n167m637q626l393
15988a9794j251N199K975K819l629J0632O61n501q130R71J1098K284K651K470
15974C455n809K008l094p011L81p28J0808k48q991J934Q538J136q131n727m359
15959a5838R510Q693j8882j402m090N182J0665l178r044Q351o87m260N964J910
15945g106m713m435p634J850K694N858M155K593j0598J750O571j47L473l398K210
15930f877J0319m721P67l050k753N008M980j995o227L727o314q985P313M874M381
$$ y = [-21072, -8855, -9828, 1267, 5126, 12452, 18365, 12981, 13189, 10253, 2846, 317, 8296, -2068, -15398, -12966, -6752, -8785, -20207, -16575, -10621, -7729, -12976, -20071, -21038, -22989, -12596, -6104, -9534, -8315, -7378, -12925, -9632, -3269, -2034, -8855, -12069, -8053, -5702, 2029, -3138, -7775, -16401, -19794, -21045, -15846, -12871, -10052, -13681, -3049, -2388, -7889, -16019, -15048, -3950, -1666, 985, 3455, -2354, -346, -3440, -10451, -10070, -10798, 10, -238, -9229, -7295, 1243, 2379, -5752, -11479, -15838, -6328, 2365, -16517, -17919, -22009, -16827, -6162, -9340, -18384, -10033, -10720, -14980, -9016, -7106, -11819, -16254, -23888, -22038, -19344, -13486, -9331, -6738, -17336, -15586, -9015, -9162, -5689, -9087, -6877, 3442, -1279, -512, -3562, -6315, -1307, 3673, 1678, -4549, -822, -7136, -16121, -8808, -3934, 447]
15915D47M138P437j4352j1171J4611J0268k627j020N326k76n613q809j2764P31
15901a3674O368O544o00j157q864L650J179K650J171K365m270j431j0096j588
15887a7753j374N395M335j660K336m97m460j0860N50J1047N341J627k842o379
15873a5194n997K410N170j286K989J114J690j883k42l73k741J918P29k063Q647
15858e112P180q628j2409Q838Q157K708O096m689n483k766n013P059k871j594
15844h527r73l896J719J108O444J526R958o22m798M240M63k347q714j534Q135
15829B182J0516m693n610k061q825N4p395o082m15r71J1537R371J960L620j171
15814B017n650j934O928n036l956m659Q802l545j587k805j945J735J700o345N459
$$ y = [447, 4585, 12022, -2330, -13501, 1110, 11378, 8751, 7731, 13057, 12781, 7168, -1641, -14405, -13674, -7306, -762, -1362, -2519, -11383, -7733, -6554, -3904, -2733, -368, -4638, -6069, -16165, -17753, -19127, -13732, -9397, -11057, -8721, -9218, -13678, -24538, -23988, -12941, -7600, -5973, -8815, -15194, -21191, -18781, -13611, -14897, -11908, -10794, -9104, -10987, -11229, -11602, -14343, -12425, -11696, -13759, -5112, 2068, -6560, -18969, -10131, -1974, 734, 6830, 2141, -3342, -6108, -11121, -4062, -6933, -8527, -9500, -13396, -11677, -10569, -4125, -2599, 7359, 6737, 1939, 6179, 6642, 4295, -4419, -5953, 2182, 12698, 8005, 2395, 334, -8491, -8437, -15832, -21914, -22329, -23300, -11763, -2392, -432, 3188, 2017, -3633, -5567, 1361, -3675, -7631, -12290, -3488, -7033, -8620, -11425, -13370, -11635, -9935, -16280, -10821]
15799a0821O275r4J550N831j088k806K486l167l271l31R591P006o338k163J2243
15784A4903M925o534j1803q244N374J563J404k195r203M867M171M076n6l886o57
15769a295p632K929L751m098q698j721L852O898R15q716r364J976O195N457J953
15754g598N969L240l899L944J0509l013j9976m69N054J71L62r48k902r88l934
15739a4478L492K793m507l940O165L01k468K182O816k931j2592m897K055K887
15725a9122N655N088j4820l472Q746Q785R563N818r640j2230L942q404K694P852
15711i545k566j723o181p64J077n601p274P789R097N998M468N88L33m155j1599
15696b0058m752M145L136m376j411N146P063j503M096K568q89m068k344l031J0375
$$ y = [-10821, -4546, -4640, -3090, 2741, 1653, -1153, 1333, -1834, -5105, -5436, 4155, 11161, 4823, 2660, 14903, 19828, 13294, 1491, -6753, -1379, 184, 1588, -607, -9810, -4943, -772, 3304, 3248, -638, -1295, -8927, -5998, -2247, -6345, -15043, -16764, -12912, -6014, -5099, -13815, -23179, -21203, -15008, -9551, -7598, -1629, 1611, -2288, 1656, 12165, 9152, -10824, -11293, -6239, -6068, -5706, -6654, -9556, -10544, -14478, -10986, -8193, -12700, -16640, -10475, -10174, -12642, -10460, -3644, -6575, -19167, -24064, -22009, -19122, -13467, -8379, -23199, -26671, -17925, -9140, 423, 6241, -3399, -15629, -11687, -20091, -17397, -9545, -12111, -13834, -20015, -20779, -19702, -25303, -32577, -24788, -15691, -9693, -5225, -4637, -4304, -8459, -20058, -24810, -20665, -17529, -21905, -23316, -18170, -11107, -12610, -8514, -5946, -6835, -10903, -13247, -16278, -5903]
15681e903L174j3890j1356O903K980k504J0900O442J1901L170j5366o336p018
15668a6903O966k467p539J678L230P438O973N375q315j825K22L303o898r859j0532
15653b9153Q298P242o788r815q329M782K57L524J6265P130n679m211R03P282L924
15638d368n770K835J0408N920K730o993k55m962l13l850o425m901Q621N662P693
15623F032l726j0036p63N471q943O468J0802Q855n650j2095m401j0280r987j29
15609b8382K977J5566N93k527L24r665o149P540J3049L549k415j0956l673K159
15595a8010P822n026K786N902J068j833l971m955M943L43o36R788J908N878m941
15580A066m006r406L648J652J0358l087K6q91q815o317P855J2536L821j3723r971
$$ y = [-5903, -2729, -16619, -27975, -21072, -18092, -20596, -9696, -3254, 8647, 11817, -3549, -9885, -16903, -9937, -12404, -19943, -18265, -15035, -7597, -624, 4751, -3564, -5389, -5167, -1864, -8762, -18621, -29153, -20855, -13613, -20401, -30216, -38545, -33763, -33506, -29982, -13717, -6587, -12266, -16477, -15574, -8292, -4368, -10138, -7303, 3105, 9025, 11755, 4762, 4507, -455, -768, -4618, -11043, -15944, -7323, -1661, 6032, 2306, -7730, -8493, -3022, -11965, -5497, 5305, 14160, 8510, -3585, -7986, -18266, -28253, -28382, -25405, -9839, -9246, -11773, -11449, -21114, -27263, -19723, -6674, -3125, -5540, -16496, -20169, -18010, -10188, -15214, -12428, -6526, -5458, -7291, -11262, -16217, -11274, -10931, -11567, -1779, 129, 6007, 1066, -2940, -12346, -8698, -7046, 3312, 225, 251, -640, -9455, -15772, -7917, 4619, 8440, -5283, -15254]
15565a5254L682p570K506K428q88K644N987R063m66k818q620P401K581j534l286
15550d144j2743m220N006j1637J363J0144l42R87J839P827M261q95o758M385N077
15535A50K083J835k344p793o269m909J308M571K695L695K185j59J609O43L239
15520B539q800m894O791M581l679j1519M751j450j307N156N174L561R687l019
15506G572k741k423O18M019O85j436o857n54n641l942O244m15n081o085M313M406
15490g318K699n903r199n070J2073K286P723J674k803p071k641l295j984j529
15476b0358J2457P887m038j435R27n108L226l396j0844L869J0889J2498M365j456
15462I483l425m512p488j028q569r450j988O473m77o382J254r99L986n428K533
$$ y = [-15254, -11572, -19142, -16636, -14208, -15096, -12452, -6465, 2598, 2132, -686, -9306, -1905, 676, -858, -4144, -16887, -21107, -16101, -27738, -26375, -16231, -16573, -15586, -13747, -5920, -1659, -2554, -9312, -4927, 150, 2233, 4068, 1724, -6069, -12338, -17247, -15939, -11368, -8673, -4978, -2793, -2952, -1343, -700, 2539, -6261, -11155, -4364, 217, -3462, -14981, -10230, -11680, -12987, -7831, -2657, 904, 10591, 7572, 4831, 2408, 3026, 7045, 7730, 6294, -563, -1117, -6758, -10700, -4456, -4871, -9952, -16037, -11724, -7318, -4619, -10522, -19721, -24791, -12718, -10432, -2709, -1035, -3838, -10909, -13550, -16845, -18829, -20358, -7901, -14, -4052, -5487, -4560, -9668, -6442, -9838, -20682, -16813, -5924, 6574, 10939, 9483, 6058, 1546, -5942, -6970, -15539, -24989, -26977, -20504, -20981, -27363, -26109, -27108, -23122, -28550, -26017]
15447b6017J525P51n40J646P067P602l559m570j256r02Q966R665o694J0715L105
15432G504j0935j2922p2J943O097P91J119r779r93J0902R674p00N131p16J734
15417H778K296j1149j2138L890j958k678k952O297J1441r611j1046m597k423L684
15403b2166N533L569N320k173j065o308N525l354P142P599k636r914o549J2676
15389f801L693r18q137K934o372j6057m792O453M332n128P987O059m057j0294
15375c1098m71L790J7591K619k658o710Q192L915J794l352k72J1938O546j0990
15361H34j5455m100P608L880j2425L098Q732p212N151K123P31k179n16q039l666
15346b1435N364P400L375o336m50L077l166N323J0684j228k68m87j0629j269J93
$$ y = [-26017, -24492, -23741, -24281, -22635, -15568, -7966, -11525, -16095, -17351, -18253, -9287, 378, -6316, 4399, 7504, -3431, -16353, -16425, -14482, -8385, -7594, -6475, -16254, -17247, -6345, 3329, 2629, 7760, 7044, 8778, 11074, -75, -12213, -8323, -10281, -12959, -15911, -9614, 1827, -7784, -18830, -23427, -25850, -22166, -16633, -13064, -7744, -9917, -10982, -17290, -11765, -15119, -7977, -378, -3014, -12928, -19477, -6801, -3108, -4026, -12163, -9229, -15601, -31658, -36450, -29997, -25665, -30793, -22806, -16747, -20804, -31098, -31569, -27779, -10188, -7569, -10227, -16937, -8745, -4830, -3036, -6388, -6660, 5278, 11824, 834, -14621, -18721, -11113, -7233, -19658, -16560, -7828, -15040, -9889, -7766, -7035, -9214, -9730, -17769, -21435, -16071, -8671, -5296, -11632, -12082, -9005, -12171, -6848, 3836, 2608, 2340, 1853, -8776, -10045, -9852]
15331i852K592n552L737Q27p63K046j796Q88k060o409M863J2264J0026l534l045
15316D232m39o356p642j3589j303J0776L117m759Q17O077O188J306J583m645N30
15301d107k472q650k285j642k498k340Q952j572j142M743P39O234j664j862j006
15286a0572j372p908k472M227O244Q746M911n653l562M089r56j40q653J93J20
15271a2758J489J4473K292j6787q50N413n904j694J445J07K365L96J436q55mL528
15255e908n407P293L768r065q150J883J3350L636l194o664l9J599M174Q556N59
15240F391N62l058M68Q719j0313p586k933L915j98m695p61o18q116p034J0856
15225a4401P752q009j875j0443N15M352Q038m572N517P783k172j708J2648j002
$$ y = [-9852, -7260, -12812, -9075, -8248, -9011, -6965, -8761, -7873, -9933, -16342, -11479, 785, 10811, 7277, 4232, 3793, -2563, -10205, -23794, -25097, -14321, -11204, -15963, -15146, -9069, -2881, -1575, 8, -4637, -4107, -6579, -15229, -17514, -19156, -21654, -23994, -15042, -16614, -17756, -13013, -12274, -6040, -7704, -9566, -10572, -11944, -19852, -22324, -18097, -11853, -3107, 1804, -3849, -7411, -3322, -4278, -4418, -13071, -12878, -12758, -11269, 3204, 5496, -11291, -12141, -6728, -12632, -14326, -12881, -12774, -10409, -10013, -8577, -9432, -9436, -5908, -11315, -4022, -254, -9319, -17469, -15586, -2236, 1400, -1794, -8458, -8497, -6898, -2724, 5832, 6391, 6953, 3895, 4363, 13082, 2769, -4817, -7750, -3835, -4033, -8728, -9489, -10107, -18223, -25257, -14401, -6649, -14658, -16533, -26976, -26461, -22109, -14071, -18643, -13126, -5343, -7515, -9223, 3425, 2423]
15211B423o844n41J0938j174o594j0744j528J2385J311q543n479O180P234Q289
15197G313L968O12l436l250k956o261N898J0693L954j1689r673P194M797K173
15183I337j893p540L092P666J766M670o764q689m434l331N093R102p557J077O250
15168G845O333k783r535k716K739q35K037n728n185j245p73l162n128P593J2810
15153B267J7978J1739K957m061J3367k342j3876o217j721p34l225M194M55L978
15139B4759l210m735j804N35n071o727l304Q665k012L060o754p878m326L006J1443
15124E647K545m829n476K277P098Q768K706p707j3901J515K895n783j610J25M367
15109a363O845p320J151p56m977p11M080M780l03O405L246m794p775J530O78r549
$$ y = [2423, -4421, -4962, 5976, 4802, -1792, -12536, -14064, -1679, -368, -8911, -14390, -8210, -976, 7313, 11281, 11893, 8457, 5207, 2251, -4010, 1888, 12581, 16535, 4846, -4827, 2367, 7164, 9337, 7444, -96, 2996, 10662, 12428, 17098, 10334, 1645, -2789, -6120, -1027, 8075, 518, 1595, 7845, 14178, 11395, 1860, -856, 1883, 1048, 3085, -2643, -7828, -9073, -9846, -13008, -18136, -10543, 2267, 20245, 31984, 34941, 30880, 44247, 41905, 28029, 21812, 20091, 19357, 16132, 20326, 20781, 24759, 21549, 16814, 15010, 15545, 10474, 3747, 443, 9108, 7096, 10156, 3402, -4476, -8802, -5796, 5647, 8192, 3363, -2113, 164, 7262, 16030, 18736, 11029, -2872, -1357, 1538, -4245, -5855, -5730, -1363, 5482, -1838, -687, -1443, -6420, -7131, -3051, 1729, 1426, 7831, 11077, 6283, -1492, 38, 716, -8833]
15093h833n780J260P582j207o1k056j198n64N40L778R2R71J891P685J0864J982
15077A6946K263o479O461N631l380l629L503L846K572j100m79j1470r731j829
15063C125R847j675R803M027j693l951n233J62M829P683o878n897k466j626q285
15048A772j233j731L376N097Q537N093m933J414r270j828K0K745k434J190J219
15033I034l757N949L5L359K221N24j071J404K771R54r641M585O353O340R791M385
15017D3236J58R565k263j0986j412P021J4967N940o813q437k678k171k997k82
15003D2848L003P714j856n16K011q35k855K806L536J2244K891r043L769P746L298
14988G6761J1033L136o948O907J7132O635Q031J2033N832J4202K3407K6616L8045
$$ y = [-8833, -14613, -13353, -5771, -6978, -7039, -9095, -10293, -10857, -10317, -6539, -6447, -5476, -3585, 4100, 14964, 16946, 19209, 12730, 19191, 24822, 21442, 17813, 21316, 25162, 27734, 26634, 26155, 14685, 4954, 3125, 12972, 11297, 21100, 25127, 23434, 19483, 14250, 14412, 19241, 26924, 20046, 14149, 11683, 10057, 1772, 539, -1192, 2184, 7281, 15818, 20911, 15978, 17392, 8122, 6294, 6314, 9059, 6625, 7815, 9034, 5277, 11226, 11261, 14620, 16841, 17365, 16294, 17698, 20469, 21423, 11782, 16367, 22720, 29060, 38851, 43236, 43394, 52959, 50696, 39710, 38298, 45319, 60286, 66226, 59413, 50976, 48298, 46127, 43130, 42848, 45851, 53565, 51709, 51193, 53204, 52369, 49514, 52320, 55856, 68100, 70991, 61948, 65717, 73463, 76761, 87794, 90930, 83982, 90889, 108021, 114656, 122687, 134720, 140552, 154754, 178161, 204777, 242822]
14975B42822N3666P6268J28865J91488J83636k3486q6810l7174p4582j02081n9498
14964D93114m2032k3436j8711r760O180J3800Q259J5875K3172J4681K6220L6589
14952E43951K0346J4482K3704K5134K1582J9826J9500K7613J8120K1702O622N569
14940G68151O509l679j2764j5372o348r810p366j7859k5231p325k8607k5567j6995
14927E97737k4292k4564k4166k8488k0912k4796k7346p827q068j7405k5719j0883
14915C53271j0494j4317r782j8254j4869j4120j5174j0548k241J70l875j0291
14903B29476j0175j2231j0434j854l495l237o195q224j000l095j6178m098j0142
14890A39118j034L27j1059j3284j61k211j3887n66r27J5K926k127n559m254j0819
$$ y = [242822, 296488, 372756, 501621, 693109, 876745, 853259, 766449, 729275, 654693, 552612, 493114, 451082, 427646, 408935, 399175, 405355, 419155, 427414, 443289, 466461, 481142, 507362, 543951, 564297, 578779, 602483, 627617, 649199, 669025, 688525, 716138, 734258, 755960, 762582, 768151, 774660, 770981, 758217, 742845, 736497, 726687, 719321, 701462, 676231, 668906, 640299, 614732, 597737, 573445, 548881, 524715, 496227, 475315, 450519, 423173, 415346, 407278, 389873, 364154, 353271, 342777, 328460, 318678, 300424, 285555, 271435, 256261, 245713, 243472, 243642, 239767, 229476, 219301, 207070, 196636, 194782, 191287, 188050, 181855, 173631, 172631, 169536, 153358, 149260, 139118, 138084, 138411, 127352, 114068, 113907, 111696, 97809, 97243, 96316, 96331, 99257, 97130, 91571, 87317, 76498]
14875G6498k74R569K208N1q460O82o263r979j2829j048J1710J5639k098n043p04
14860F9659n189j3587p426m826l392P687M728l842q620O0K198K273m445r2k571
14845C2615l523L291n891n476p483q4J3000j851l540R788M489p234j134L532J738
14830C2237m083K9r692m137O757N364n421j5842l398O863K279K577J555k232P58
14815A3614l27k716m957K678R375K954q694k51rn959q956l542o256k376N724J908
14799g790J439K622R044j686J757k651r558m242o941P891J5526P37m553k49l758
14784b412l35J092R126N149p004l29O142J870P820k359j4175j8580m169L517J2693
14769a954P869Q499M953m020l625O89n67k358L395l187j3061M358R909l310P38
$$ y = [76498, 76224, 85793, 88001, 88052, 79592, 80274, 74011, 64032, 51203, 50155, 61865, 77504, 75406, 70363, 69659, 64470, 50883, 43457, 38631, 35239, 42926, 47654, 43812, 35192, 35252, 37450, 39723, 35278, 35186, 32615, 29092, 32383, 26492, 21016, 13533, 13449, 26449, 24598, 21058, 30846, 35335, 28101, 26967, 30499, 32237, 28154, 28183, 18491, 14354, 21111, 26475, 21054, 5212, 1814, 8677, 10956, 13533, 15088, 12856, 13614, 13287, 10571, 5614, 8292, 17667, 20621, 11927, 11676, 11667, 5708, -3248, -6790, -13046, -15422, -9698, -7790, -6351, -3729, 5315, 3629, 5386, 2735, -6823, -11065, -18006, -10115, 5411, 6148, 1595, 1346, -2412, -2747, -1655, 7471, 12620, 5616, 5287, 11429, 13299, 21119, 18760, 4585, -13995, -18164, -14647, -1954, 5915, 14414, 19367, 15347, 11722, 12411, 11844, 9486, 12881, 9694, -3367, 991, 10900, 7590, 8328]
14754H328R69J056n312N700J0156l423n356n479L934K979j1693O338m213j968
14740B016K128j019m236P618m02p994J770R606p217m149M521J0397L163o717o807
14725B678L184O06n742M981J131j042K076K812k493p228k300l190J0776j278J363
14710F334l152q531l237L825J308j158n211l455M824M48l714J949J5655K475r237
14695h77l327n035j494j893m389o908L801J1174M515J365j0820K66J981N512O141
14680A2L005j563p264J688M263M17o38P555l21o138M853n729K710O177K225K525
14664A3777l093q220o576M206Q066n72Q70q421j8536j3383J439M879K48k508O755
14649b1069M611n083P438L935m63R805L001n998O518L348j0967k097n44O651P689
$$ y = [8328, 9297, 10353, 5041, 10741, 20897, 17474, 12118, 6639, 10573, 13552, 1859, 8197, 3984, 2016, 4144, 3125, -1111, 6507, 6105, -1889, -119, 9487, 2270, -1879, 2642, 13039, 16202, 9485, 2678, 5862, 6468, 726, 5707, 6838, 5796, 7872, 10684, 8191, 963, -1337, -4527, 6249, 4971, 6334, 3182, -5349, -8586, -4761, -3453, -4611, -9822, -13277, -8453, -8005, -11719, -9770, 5885, 8360, -877, -4204, -9239, -10733, -12626, -17015, -23923, -20122, -8948, -4433, -3068, -13888, -13622, -11641, -6129, 12, 3017, 1454, -5810, -4122, 141, 558, -80, 7475, 7154, 1016, 5869, 140, 2850, 9027, 11252, 13777, 10684, 2464, -4112, 94, 8160, 7588, 8458, 37, -18499, -31882, -30443, -25564, -25316, -27824, -21069, -16458, -21541, -14103, -10168, -10631, -826, 2175, -3823, 2695, 6043, -4924, -7021, -7565, -914, 6775]
14634F775p389m382n219j465O232l327j5860M202j11Q92Q610K824l198J404K382
14619g630O413p806l507J529L380k011r389j113R132K580l927m183K418P274J1742
14604D902P9j7621j353Q451L552J092r48m089j3677L337J5063L471j0970p978
14590a6689J1345J847J0183K723m312M312j618o660m580j484p686l782J1335K297
14576b769N595o86N069l24L679q060r61k893n463r253L213J2337M757o823K297
14561b85R112o324j0688p433j963P333O219k216r95j263j691P220L591L352P490
14546A1459K263m078m336q628m278j0278M605P025k207M25o104m095R321l513
14532a2419l811P187O587m137o156l660j638m903L601P911Q274p829k515O052
$$ y = [6775, -614, -4996, -10215, -11680, -5448, -8775, -24635, -20433, -20544, -19652, -11042, -8218, -11416, -10012, -7630, -1217, -9023, -12530, -11001, -7621, -9632, -19021, -20134, -11002, -8422, -12349, -16532, -14114, -6840, 4902, 4981, -12640, -13993, -5542, -1990, -898, -1846, -5935, -19612, -16275, -1212, 2259, -8711, -16689, -5344, -3497, 6686, 9409, 5097, 9409, 7791, 1131, -3449, -4933, -12619, -16401, -5066, -2769, 2826, 2140, 7209, 6885, 10564, 2504, 1543, -1350, -6813, -16066, -12853, -516, 4241, -2582, -285, 8827, 2503, -8185, -15618, -17581, -10248, -4029, -6245, -7240, -8503, -10194, -2974, 617, 3969, 11459, 13722, 9644, 5308, -3320, -7598, -17876, -13271, -6246, -8453, -8028, -14132, -18227, -8906, -12419, -16230, -9043, -2456, -6593, -12749, -16409, -18047, -22950, -19349, -11438, -3164, -10993, -13508, -7456]
14518g456Q793M086M594p693r672o921J422L261O762N154l196m791j532m737k852
14503a4778q592l168M991N100O684j236J5P512j1962n068K995M958j689n036N621
14488a3653R250o07Q12l944M374N379j6407j957J2129N89J780k837M374J744J717
14473B743J0453M123r670k0116l991O372R530M490j3526N61m11j06Q229p84j0480
14458a2583n060M622O234K361l416q348L146M919N243Rk825l032l512J745m762
14443a5259J245O268L309O62L044L882J016l980l374m077P072L497o360n483j062
14428i600R031l005J598J913O463m637j839L513m923j2674O708K366N113o906
14414f879n680j39R56J0562j783K868O149j0133r793p845K709L474M375P046M110
$$ y = [-7456, 1337, 5423, 10017, 2324, -7348, -14269, -12847, -9586, -2824, 2330, -866, -5657, -7189, -11926, -14778, -23370, -26538, -21547, -16447, -9763, -10999, -10984, -3472, -15434, -20502, -17507, -12549, -14238, -19274, -13653, -4403, -5010, -4198, -8142, -3768, 1611, -14796, -16753, -4624, -4035, -2255, -5092, -718, 1026, 2743, 13196, 17319, 7649, -12467, -16458, -10086, -556, 3934, -9592, -9031, -9442, -9548, -1319, -2103, -12583, -17643, -13021, -6787, -4426, -7842, -16190, -13044, -8125, -2882, -2873, -5698, -8730, -12242, -10497, -15259, -14014, -7746, -4437, -3775, -731, 3151, 4167, 187, -3187, -7264, -192, 3305, -3055, -8538, -9600, -569, -3574, -1976, -63, 6400, 1763, -76, 3437, -1486, -14160, -7452, -5086, 27, -6879, -12559, -12698, -11742, -1180, -2963, -95, 6054, -4079, -13872, -21717, -19008, -15534, -11159, -4113, -3]
14399cl544R363K752o810J289l903n037m569L077M075k613q517j1235L979P972
14384a3724J0384K914M67n6j3062J24j0986m367N186k343J7198L901o166k467
14370a2997M334J014o718m555N384k334J4305P602K649j0429o868j2757L162k918
14356b1126l590P998P582p148M984J0790o25j5010M697N215M826M51O85l905j6670
14341b0846L289J523K865m448j0131P027L415l135k103r39J370j0847k968Q054
14327b7874r62l84k869j927M731M0J994Q344k638O238J2094L05o547o053k181
14312a7689N606O376j267m340Q779L603n811p027J342k272q152j485M094L30N760
14297a2153M211P54K463j0756n286M88J913L386k188N391J712L998K433O579k293
$$ y = [-3, -3547, 5816, 8568, 1758, 3047, -856, -5893, -10462, -7385, -3310, -5923, -14440, -25675, -21696, -13724, -3340, -426, 41, -15, -13077, -12953, -23939, -28306, -23120, -25463, -8265, -4364, -10530, -12997, -8663, -7649, -14367, -18922, -13538, -15872, -1567, 6035, 8684, -1745, -8613, -21370, -18208, -21126, -24716, -16718, -9136, -16284, -11300, -510, -1135, -16145, -11448, -6233, -1407, -956, -271, -4176, -20846, -17557, -16034, -13169, -17617, -27748, -20721, -17306, -20441, -22544, -23483, -22113, -32960, -35928, -27874, -28836, -29220, -32089, -34016, -29285, -29245, -27251, -18907, -21545, -15307, -3213, -2908, -9455, -15508, -17689, -12083, -5707, -6974, -11314, -2535, 1068, -4743, -11770, -10428, -12700, -20852, -22337, -18243, -17913, -12153, -7942, -7188, -4725, -15481, -20767, -20279, -18366, -14980, -17168, -11777, -10065, -6067, -3634, 2945, 652]
14282F52n695k492P18l985j174n144o657K060J3691n553j3110O474L764j41J90
14267a6402K677O015l023J721p479L296m223m186M257J3760O230K712j1715n705
14253a2065J4525M237l192q332J69M895K843r548j1238M976L517L073Q726P363
14239I949j0957n425K757l156k584m954K850Q272O413l935j9637o451M99Q742
14225a7617J1855k257p468l114q625P737R280L88n673k375M743k215N426L793
14211f122L202K790n570q652k631J557o729r83J1495P146m36M152p999m581M0
14196a3321K696l48M162P752M893n463o299k779P47k175L375J1651J091l094K784
14181E672l995k466k484J094l961j2020o294L466J1900R384p727r89O387l030
$$ y = [652, -5043, -7535, -6817, -10802, -11976, -17120, -23777, -21717, -8026, -13579, -26689, -20215, -16451, -16592, -16402, -13725, -7710, -10733, -9012, -16491, -13195, -17418, -21604, -17347, -3587, 2643, 5355, -6360, -12065, 2460, 6697, 3505, -4827, -4658, 237, 3080, -6468, -17706, -12730, -9213, -6140, 2586, 9949, -1008, -6433, -3676, -6832, -9416, -14370, -11520, -3248, 3165, -770, -20407, -26858, -26359, -17617, -5762, -8019, -15487, -18601, -27226, -19489, -10209, -9821, -15494, -17869, -13126, -15341, -9915, -6122, -2920, -130, -5700, -14352, -16983, -15426, -22155, -23138, -11643, -4497, -4933, -781, -8780, -13361, -13321, -10625, -10973, -6811, 941, 5834, 371, -5928, -8707, -7960, -10135, -6760, 4891, 5982, 2888, 5672, 1677, -789, -3273, -2179, -6140, -18160, -24454, -20988, -9088, 296, -7431, -8420, -2033, -5063]
14167e063K232m683P746J2690l390o874L08K208N067p405j0121m047K131K849
14153f352j67J380K674q342L530J73N227L445L352j2095r891p115K581J4114J1284
14138C798m418Q75N69k063k595r977o89K707J1307J345q887j1036o05O786R383
14123c500J949r256l667k482M467J1777J1654M638K200O125Q63K025l58j3187
14109A3248n001J2144L800k18q665q241r39k140n282l371O201q97q813n843j31
14094a4148Q230L852K26M570K694j651j056k257N31m130l655J2328P566q796j0872
14079f568m793O62R07J0749J0641j0619n619M502O6m531o417q036l623J318J0718
14064a0643R383m406k982j984L154p208l487O512j174k083J803M856p842N588
$$ y = [-5063, -2831, -7514, 232, 12922, 9532, 2658, 2966, 5174, 10241, 2836, -7285, -11332, -9201, -6352, -6519, -5139, -2465, -10807, -7277, -7104, -1877, 1568, 4920, -7175, -17066, -24181, -21600, -7486, 3798, -620, 255, 824, -1239, -3834, -13811, -14500, -11793, -486, 859, -8028, -19064, -19669, -12883, -3500, -1551, -10807, -14474, -16956, -12489, -712, 10942, 15580, 17780, 23905, 24768, 26793, 26435, 13248, 8247, 20391, 24191, 23973, 15308, 7067, 6128, 3988, -1294, -4665, 1536, 639, -8174, -14017, -14148, -5918, -2066, -1840, 2730, 5424, 3773, 2717, 460, 991, -3139, -6794, 5534, 13100, 4304, -6568, -11361, -10699, -9792, 957, 11598, 979, -4640, -138, -72, -4603, -11020, -19056, -22679, -21361, -10643, -1260, -5666, -8648, -10632, -7478, -14686, -18173, -11661, -12835, -14918, -13115, -8259, -16101, -10513]
14050a0513J1598m052m775J406L832O202o7k316l368K153Lp67p490j6886r13R33
14034b5020P31r690k438J1061M1N3P376J5793N984R749l423o628J11K616L12q651
14018b023k299N674k03l136K784K071k300J300p33m964O807l125M703O039p696
14003B899P748P653r913n603j698M21J900J227M367R351L820j2180q859j2946
13989a1813N587J5113J4359n391j0361j0013O548R549k694j1993m076J002n369
13976i552J668n805M058l922j989N528Q205M046r119k609m802l118k02j331k188
13961b1132J3747R922l107j064o00N160o444N350K537n85m68j565k363K91l71
13946f92k797l804K251m709q292o568l29J262p7M049O337j745j166K173P268j680
$$ y = [-10513, 1085, -2967, -7742, -6336, -2504, 3698, 3631, 1315, -2053, 100, 103, -664, -8154, -25040, -25953, -25020, -24289, -33979, -36417, -25356, -25315, -25262, -17886, -2093, 3891, 13640, 10217, 3589, 3700, 6316, 6628, -2023, -4322, 1352, 1149, -1987, 797, 2868, 568, 1868, 1135, -3829, 2978, -147, 4556, 10595, 2899, 10647, 18300, 8387, 2784, 1086, 1507, 3407, 4634, 9001, 18352, 22172, 9992, 1133, -11813, -6226, 8887, 23246, 17855, 7494, -2519, 4029, 13578, 10884, -1109, -5185, -4183, -9552, -7884, -13689, -9631, -13553, -15542, -10014, -1809, 2237, -6882, -9491, -14293, -17411, -17613, -18944, -21132, -7385, 2537, -570, -1634, -2234, 2926, -3518, 1832, 4369, 3784, 3316, 1751, -612, -321, -692, -3489, -7293, -5042, -9751, -18043, -24611, -24940, -23678, -23755, -19706, -13369, -15114, -16280, -14107, -6839, -8519]
13930h519p25K487Q94j640m971m20m550Q79N050l985P448P830L906j4443o533
13915a7292O304N24m75K469j439M237r60M474N825n141M412m730q521Q874L142
13900A703N458m206m650j2947J583Q524l944j0599R299K0160R619J2379p552k720
13886B2107O44J06j084l18j0288r237J463O078p46o662l441k856P420m494J248
13871f0m700m62P110k187q899o454l118J1171M336J004M02K972p494p834J694
13856a2519N6M64M152K50K691P440l364J160j223m994M468J0611j006p82L26m97
13840G233j549j96k71K541p01r03p333N622k25j2060R23o470j972K864o137r866
13824b8500k997l26j100N676N719N023M457m172m579m631L581L374O614j40L490
$$ y = [-8519, -9244, -6757, -5863, -7503, -12474, -12894, -17444, -16565, -11515, -15500, -8052, -222, 3684, -10759, -17292, -10988, -10464, -10939, -8470, -9909, -5672, -6632, -2158, 3667, -1474, 2938, -1792, -10313, -1439, 1703, 7161, 2955, -1695, -14642, -13059, -4535, -8479, -19078, -9779, 10381, 20000, 32379, 24827, 22107, 22751, 22857, 21773, 21455, 11167, 1930, 3393, 9471, 8725, 2063, -1378, -4234, 3186, -1308, -60, -4760, -5222, 1888, -299, -9198, -15652, -18770, -7599, -3263, -2259, -1857, 1115, -6379, -14213, -12519, -12463, -11999, -7847, -7597, -4906, 2534, -830, 330, -893, -5887, -1419, 9192, 8186, 7404, 7730, 7233, 5684, 5488, 5217, 7758, 7057, 6154, -1179, 4443, 4218, -7842, -6919, -13389, -15361, -12497, -18634, -28500, -31497, -31823, -32923, -27247, -21528, -16505, -12048, -16220, -20799, -25430, -21849, -18475, -11861, -12001, -8511]
13809h511K206j486o07M716L484j139j981o760o229N075P342L945j176o735J582
13794f274N322j901j405j2732l010O901J262m906l384m113n312N251R469L953
13780a0879j2631n309R370P579K846p534k22M716K78p008j728J7704J5270l831
13766H621j2831j725j2654K660j289q638L187L753J0222P182o737r759Q154K713
13752g141M138k572p914l176M636K944p11L351J546k94l265j909J0266P751m519
13737C131q599j550m387J997P600L536q092l886K797p354J677M586K77l048j44
13722a1459Q405m240M80J036K862R862P053m81p413m107l571k47J04P946K133
13707H363o477l787j2440M235N934J3958j508j3029j505J5888J5202J726j1315
$$ y = [-8511, -6305, -7791, -8398, -3682, -198, -1337, -3318, -10078, -16307, -11232, -3890, 55, -1121, -7856, -6274, -952, -2853, -4258, -16990, -20000, -13099, -11837, -16743, -20127, -24240, -29552, -24301, -14832, -10879, -23510, -28819, -19449, -11870, -9024, -16558, -16780, -12064, -11786, -18794, -20522, -2818, 12452, 8621, -4210, -5935, -18589, -15929, -17218, -25856, -22669, -18916, -8694, -1512, -8249, -18008, -9854, -7141, -3003, -5575, -13489, -16665, -12029, -9085, -9796, -6445, -4899, -5193, -8458, -10367, -101, 7650, 3131, -5468, -7018, -11405, -9408, -1808, 1728, -6364, -10250, -7453, -14807, -13130, -8544, -8267, -11315, -11459, -3054, -7294, -6814, -5778, -2916, 6946, 13999, 13518, 6105, 1998, -1573, -1820, -1716, 6230, 8363, 1886, -1901, -14341, -10106, -4172, 9786, 8278, -4751, -6256, 9632, 24834, 26560, 15245]
13694A5245p265J5082P670j242o269j8802K1N003K938o686l989j589J850Q701
13680A0668J198r714q601p447m597N88J211Q45R096p72M361J009q086L338l601
13665a0504j325J05O736L873R114N183L017K102n912J801l566p880k736O69Q210
13650H887m93p549q389l514J1133O956k203K350q032M37K371M201m114N117j254
13635E904l275J0594O280j0712o913p164j4364j4466R942J4471M429M985r777
13622a0066l805L417N921K620J891K468J888k186k59K588K797L307l354K783L763
13607A3773n10k804r364j0899J1438R551p322j3084p877n53R360L505Q841K001
13593F056r934q506P615O756K132P55j1256o85Q256O615o217o318O813Q730j498
$$ y = [15245, 7980, 23062, 30732, 29490, 23221, 4419, 4440, 9443, 12381, 5695, 1706, 117, 1967, 10668, 11866, 2152, -6449, -13896, -18493, -17905, -16694, -15849, -6753, -7525, -3164, -2155, -10241, -6903, -10504, -11829, -11724, -4988, -1115, 7999, 13182, 16199, 18301, 12389, 14190, 10624, 2744, 8, 677, 8887, 8394, 845, -7544, -11058, 75, 7031, 4828, 7178, -854, -417, 1954, 6155, 2041, 7158, 5904, 2629, 13223, 19503, 8791, 1878, -5286, -19650, -34116, -24174, -9703, -5274, -289, -10066, -13871, -10454, -4533, -1913, -22, 2446, 4334, 2148, 1889, 4477, 7274, 10581, 7227, 10010, 13773, 13263, 10459, 1095, -9804, 1634, 11185, 3863, -9221, -17098, -17651, -8291, -4786, 4055, 6056, -3878, -12384, -4769, 1987, 4119, 4874, -6382, -7067, 1189, 7804, 1587, -4731, 2082, 10812, 9314]
13578I314k363M397K083q20P605p73j262o964n928J970P008m942p522Q88K319
13563E010j732k390L656o459L737N376r419Q686J456l983M295n20P348J353l255
13548A3159J846r833j4062M905M388k561n926m464o007J0068M75P307J12m430
13534e023P637L78K122m590J223Q298N015q94o256p377o747O776K864J535m489
13519D72J971k674J171j473j524N5J551k188K455P251P951n944q328m683N957
13504B020r320J815P410n938p684p31j832k835k597K420Q822M183m20j833j217
13489g737M463J2889Q983m499j802J1920J045r88N539r012j8766j1585K213O54
13475f683O73J0633R196N245k688j1902q89K933l884M570Q220j841j5323j2177
$$ y = [9314, 6951, 11348, 13431, 12611, 20216, 19443, 18181, 11217, 5289, 7259, 14267, 9325, 1803, 2691, 5010, 3278, 888, 4544, -1915, 1822, 7198, -2221, 6465, 7921, 3938, 8233, 7713, 15061, 16414, 13159, 15005, 5172, -8890, -3985, 403, -2158, -8084, -12548, -18555, -8487, -8012, -705, -593, -5023, 2614, 2992, 5114, 524, 1747, 10045, 15060, 14166, 7910, 533, -6214, 562, 3426, 4961, 472, 2443, -231, 940, -533, -2057, -2002, -451, -2639, -184, 7067, 15018, 9074, 746, -3937, 2020, -7300, -5485, 1925, -4013, -11697, -12428, -14260, -17095, -19692, -17272, -8450, -4267, -4687, -6520, -7737, -3274, 9615, 18598, 14099, 12297, 24217, 25262, 24274, 29813, 20801, 2035, -9550, -7337, -6683, -6010, 4623, 13819, 19064, 16376, 4474, 3585, 6518, 2634, 7204, 15424, 13583, -1740, -13917]
13461a3917P586P883l541L305J959K556Q24q341r66M269k683J447K159r363j0767
13446a7590J294L947n03L847P941n141j624j755K685N649n004p252r44J0718L165
13431e67o669o445P259J1211J0398k41r279j860K031K197l011o342m814J173M659
13416c00J981q31l593L509j406j0870Q963J1441P913m322J2687J9470K0100J5500
13402H0242J8558J2405j36o596l438j4156j9680j8104j4904j9290j2984o619J606
13389c096j684j369l903o325o933J2495J2189L762r641J825n120n77p828n185
13375b1390l867Q331J5516k558N864J1021j1371j1274J592l839O407k56m16j0614
13361a6854l962J1381j479k347J1650R724J3162J41Q6n799o743j789j5115q331
$$ y = [-13917, -6331, 1552, -1989, 1316, 3275, 5831, 6655, -1686, -2652, 1617, -1066, 381, 2540, -6823, -17590, -16296, -12349, -12852, -9005, -1064, -6205, -7829, -9584, -6899, -1250, -6254, -13506, -14450, -3732, -567, -7236, -13681, -6422, 4789, 15187, 14946, 5667, 3807, 5838, 8035, 5024, -1318, -6132, -4959, -300, 1681, 850, -2743, 766, -640, -11510, -2547, 8894, 16807, 12485, 25172, 44642, 64742, 80242, 98800, 111205, 111069, 104473, 101035, 86879, 67199, 49095, 34191, 14901, 1917, -4702, -3096, -4780, -6149, -10052, -16377, -23310, -10815, 1374, 5136, -4505, -2680, -7800, -8377, -16205, -21390, -25257, -16926, -1410, -3968, 1896, 12917, 1546, -9728, -8136, -11975, -5568, -5824, -6240, -16854, -20816, -9435, -10914, -13261, -1611, 8113, 21275, 21416, 21502, 15703, 8960, 7171, -7944, -16275]
13347a6275O083J0253K728o990m553K057J6482R267r009j381q71m174L150L937
13333A0704p9P638O542j0174j2313J1857J1334O831k432M694Q446P524N445J2781
13319F8798R021R989O407Q136O524R229K620M820L000p85r266j6516j7471q342
13305G6164L148n015l734o68l618M781k867o364m488l470o056l651L012o739N792
13290D6227N340q451p927J764L217m189r549M161o444j4813l778l919L738R426
13276A4803N603J0335L082n137n151p697M187R600J612m897j2364K351J0113l915
13262B2525m796L904J6473N972j055J03M55L316R911N190J086r432r590P169M733
13247E5964q510L004J7184J0987J1423K3096K8054J3948J6283L0157L0928N0754
$$ y = [-16275, -10192, 61, 2789, -4201, -8754, -6697, 9785, 19052, 10043, 8662, 7791, 3617, 6767, 10704, 10625, 18263, 24805, 14631, 2318, 14175, 25509, 32340, 29908, 34602, 43048, 50572, 56017, 68798, 77819, 87808, 94215, 102351, 108875, 118104, 120724, 125544, 128544, 127759, 118493, 101977, 84506, 76164, 79312, 74297, 70563, 69895, 66277, 71058, 68191, 61827, 57339, 53869, 47813, 44162, 47174, 40435, 46227, 51567, 43116, 35189, 36953, 40170, 35981, 26432, 30593, 24149, 9336, 5558, 1639, 5377, 14803, 20406, 30741, 33823, 28686, 23535, 15838, 20025, 29625, 31237, 26340, 13976, 16327, 26440, 22525, 17729, 21633, 38106, 44078, 43023, 43126, 43581, 46897, 56808, 61998, 63084, 53652, 44062, 51231, 55964, 47454, 50458, 67642, 78629, 90052, 113148, 141202, 155150, 171433, 201590, 232518, 283272]
13235B83272Q3169J20189K02131K95403M16741M90446L39478m2493k06425k05159
13225A776752l01036l36247k78157j92940j36580r2782o1900n0155m7159l2844
13215B46952k4307k0996k3775j0505j7490j5654j1811J317p20q503j0848j467
13203A02193K408M305K690J537R068l887l900o5k624j509J855J828R6k139M697
13188A16553O231j951j0439m416k032l900l273L023M621j141l511J588j2884j1759
13174G6710J200l725P0m416j0394j4924n861M272L204j54P87N267m370L52R762
13159E7780O895J189p93M21K07M176J886O885p904o940k334N953L642N682L27
13144G7072m19m732k0345j0525K97j375K571K3192J8004K0092J0908m391J484
$$ y = [283272, 366441, 486630, 688761, 984164, 1400905, 1891351, 2230829, 2188336, 1981911, 1776752, 1475716, 1139469, 861312, 668372, 531792, 439010, 377110, 326955, 279796, 246952, 222645, 201649, 177874, 167369, 149879, 134225, 122414, 123731, 123011, 114508, 103660, 102193, 104601, 108906, 111596, 113133, 122201, 118314, 114414, 114349, 111725, 110216, 112071, 113899, 113995, 111856, 116553, 122784, 120833, 110394, 105978, 103946, 100046, 96773, 99796, 104417, 103276, 99765, 101353, 88469, 76710, 77910, 74185, 74255, 69839, 59445, 44521, 38660, 42932, 46136, 45982, 46769, 52036, 47666, 48018, 57780, 64675, 65864, 65071, 65492, 65699, 69875, 71761, 78646, 70742, 63802, 61468, 67421, 71063, 76745, 77072, 76653, 71921, 51576, 41051, 41348, 39973, 42544, 65736, 83740, 103832, 114740, 110349, 111833]
13131A11833K970r153n644j5900k0907j1582l187Q63j679P002J7637p26p325K910
13117F7112j935J070j722m965p137q959n320R474l507J1790J233j3601j1609K114
13103C4038J0053r57o465p609K835K305n533p500J1330R570O727N882J2432J9624
13089H6732J5209J2836j2388j7222k2822k3444r013j1365k6094j5328K805J3768
13077f326N087j992J8518J7730J0829R177q66m65J0477k723r522l270j951L013
13063D7716J3648k75j2272j521O649q267q509J343o81k158n926N70q257K411J6468
13048D0939J3841R899R45M851O413N547L318L914k720j4361p134R010Q114O479
13034H9055J257N712O240J1143J8206K6304K6640K3570N2824N3992N6002O7385
$$ y = [111833, 114803, 105650, 100006, 84106, 63199, 51617, 48430, 49293, 47614, 54616, 72253, 71527, 64202, 67112, 65177, 66247, 64525, 59560, 52423, 43464, 38144, 47618, 44111, 55901, 57134, 43533, 31924, 34038, 44091, 43134, 36669, 29060, 31895, 34200, 28667, 21167, 32497, 42067, 48794, 54676, 67108, 86732, 101941, 114777, 102389, 85167, 62345, 38901, 29888, 18523, -7571, -22899, -20094, -6326, -1239, -3231, 15287, 33017, 43846, 53023, 52157, 51692, 62169, 59446, 49924, 46654, 44703, 47716, 61364, 61089, 48817, 47296, 53945, 45678, 37169, 38512, 37831, 35673, 29747, 30317, 22060, 24471, 40939, 54780, 64679, 65624, 70475, 76888, 82435, 85753, 89667, 86947, 72586, 65452, 74462, 82576, 89055, 90312, 96024, 102264, 113407, 131613, 157917, 184557, 208127, 260951, 314943, 370945, 438330]
13022D38330P9383N7738J1185l6382m7079m9937o3258n6932l5142l6916l8119
13011B22871l2898j7602j0667j4120m472m226N12N870o34q135o515m489j1966
12998A13529j5859o364j3980k634M325J8255J9736J433m296j649N02p659o990
12985I8349j4571k067Q913J5363J9407Q689P557J0745K791k7866j3874N711J0873
12972A30020J6512j821k038j038J4391L2598K2728J2104J7271K8043L2855L2519
12960C34144K2038O70p221k9016m1423n2511n0743m3239k1030n729o197l287N615
12947A02071J8398J1740k955J2787J0101L323K926R058K314l662K609O153J1670
12934A86533j1310j3937q209q655q84m984j141k307m999p130J0230L5081M1679
$$ y = [438330, 517713, 575451, 586636, 550254, 503175, 453238, 389980, 333048, 297906, 260990, 222871, 189973, 172371, 161704, 147584, 143112, 138886, 139398, 145268, 144634, 136499, 129984, 125495, 113529, 97670, 91306, 77326, 74692, 79017, 97272, 117008, 118441, 114145, 112496, 112998, 105339, 98349, 83778, 81711, 90624, 105987, 125394, 134083, 141640, 152385, 155176, 127310, 113436, 119147, 130020, 146532, 144711, 142673, 141635, 156026, 188624, 211352, 223456, 240727, 268770, 301625, 334144, 356182, 356852, 349631, 320615, 279192, 226681, 175938, 132699, 111669, 105940, 99743, 96456, 102071, 120469, 132209, 129254, 142041, 152142, 155465, 158391, 167449, 169763, 166101, 168710, 174863, 186533, 175223, 161286, 153077, 144422, 143538, 138554, 137413, 135106, 130107, 122977, 133207, 168288, 209967]
12921B09967L7812K4542K7163J6306Q640P267R266j9368k8937r756k738k1618
12909B58546j1984J0284J5863N858p649K694J7644K6334K2144K9626M2877M9599
12897D61836K8850K1855P016j5828k2418l8874J4076O798k367L190q03J3363O669
12884D83363j2920n761P83o505q198r715K724J5270J8761K1970K6900M5533M2811
12871F15016M3565N5593P7103J11597J57240K49177L74670N63751Q12587P63889
12861C824188K5539l72029k62325l92793n18927m10672k73470j67364r4204n5381
12851A302562k0993J7562L2516L3032M4963O7263Q2631Q2374J18120J65636K32132
12840B157798L09490M14116N57677P14349Q52455Q61577M40291j86687l37862
$$ y = [209967, 247779, 272321, 299484, 315790, 324430, 331697, 340963, 321595, 292658, 282902, 280164, 258546, 246562, 256846, 272709, 278567, 270918, 273612, 291256, 317590, 339734, 369360, 412237, 461836, 490686, 512541, 519557, 503729, 481311, 442437, 456513, 463311, 460944, 464134, 463331, 476694, 483363, 470443, 464682, 465465, 458960, 450762, 441047, 443771, 459041, 477802, 499772, 526672, 572205, 615016, 658581, 714174, 791277, 902874, 1060114, 1309291, 1683961, 2247712, 3060299, 3824188, 3849727, 3477698, 3215373, 2822580, 2303653, 1892981, 1619511, 1452147, 1357943, 1302562, 1281569, 1299131, 1331647, 1364679, 1409642, 1476905, 1559536, 1641910, 1760030, 1925666, 2157798, 2467288, 2881404, 3439081, 4153430, 5005885, 5867462, 6307753, 6121066, 5783204]
12831E783204m18931n91829o05379m80867l62314k68404j84435j20177p8991m7171
12821B624706l7057j8350K705J2142J5922K8631N4894O7468P6177O1796J9087
12810B908121K7019P5275Q0056K5017p696K1730K4750K7807M9097Q4119J27409
12799C442704J70647K27746K71786K87580L01853L45580M16278M39967M57566
12790F361707M97781N55559O14111P00479Q66220J071152J353893J699944K177382
12781A5898228K794226L383097L776143M458479O020337Q105682J1195462J6137956
12773G1769610K3525477L4798258N2072606P6225765R7797084P5339136q597427
12766D22930509m3362585l7028227n3482772o6494885n5195240l9070343k7095754
$$ y = [5783204, 5364273, 4772444, 4167065, 3686198, 3323884, 3055480, 2871045, 2750868, 2671877, 2624706, 2587649, 2569299, 2572004, 2584146, 2600068, 2628699, 2683593, 2751061, 2827238, 2889034, 2908121, 2935140, 3010415, 3090471, 3115488, 3107792, 3129522, 3154272, 3182079, 3231176, 3315295, 3442704, 3613351, 3841097, 4112883, 4400463, 4702316, 5047896, 5464174, 5904141, 6361707, 6859488, 7415047, 8029158, 8729637, 9595857, 10667009, 12020902, 13720846, 15898228, 18692454, 22075551, 25851694, 30310173, 36330510, 44436192, 55631654, 71769610, 95295087, 130093345, 182165951, 258391716, 356188800, 431527936, 422930509, 379567924, 342539697, 289056925, 222562040, 167366800, 128296457, 101200703]
12759A01200703j9026512j3470967r736261p184037n636486m714795l750919l010409
12751C4670317k531465k191793j929254j583857j274044r95431p04164m40247
12743B3020062k47931l77122o11033n87742n42576n60123n39506m63085l61915
12734A8729029k73908j93351q0566N6641J27643K2273k83298o01573p82990q40751
12724A5879149q53893q26912p86566p51563p05376o57146n91583n52356n12026
12715I641728m91263m49118m04884l89493l79676l63285l31501k93229k65309
12706F273970k33366j95598j58518j15162p8013K02R9266K11891K32800l2088
12696F005384l08582l29468l64267m48872m25059l44284k98363k45961j98251
$$ y = [101200703, 82174191, 68703224, 58966963, 51782926, 46146440, 41431645, 37680726, 34670317, 32138852, 29947059, 28017805, 26433948, 25159904, 24164473, 23460309, 23020062, 22772131, 22395009, 21783976, 21196234, 20653658, 20093535, 19554029, 19090944, 18729029, 18455121, 18261770, 18181204, 18237845, 18365488, 18387761, 18104463, 17502890, 16719900, 15879149, 15025256, 14198344, 13411778, 12660215, 11954839, 11297693, 10706110, 10153754, 9641728, 9150465, 8701347, 8296463, 7906970, 7527294, 7164009, 6832508, 6539279, 6273970, 6040604, 5845006, 5686488, 5571326, 5493313, 5493515, 5592781, 5804672, 6037472, 6005384, 5696802, 5367334, 5003067, 4554195, 4129136, 3784852, 3486489, 3240528, 3042277]
12687C042277j70383j49273j33150j25496j13688r4917q7544j02540j07926j02412
12677A854948p7392o8328o5488o0171n1936o0775o5587n7430m8585n6691n1239
12666A191326n7915o3065n5853l0792l3382l2880j8319k2241k3438j8188j5847
12655H19406k3946k0200k1054q010J2990K0612L8611L9067M8388M0482L5495K9796
12643A011637N3396M2604l5047m5269p0549p1194n6577o6860o2768n1879m8108
12632E99386m3746m3866m1915l3757m0191l5843k6463k1967j8913j2026k0583
12621B60116k5506k2941k5243k4309k3239M430K1371K0464K2383K9532L4861K3380
12609B95299K9243K9883J9442J6900M062M537L344k806n46N654J761R199J6169
$$ y = [3042277, 2871894, 2722621, 2589471, 2463975, 2350287, 2255370, 2167826, 2065286, 1957360, 1854948, 1777556, 1709228, 1643740, 1583569, 1531633, 1470858, 1405271, 1347841, 1299256, 1242565, 1191326, 1133411, 1070346, 1014493, 983701, 950319, 917439, 899120, 876879, 853441, 835253, 819406, 795460, 775260, 754206, 746196, 759186, 779798, 818409, 857476, 905864, 946346, 981841, 1011637, 1065033, 1107637, 1072590, 1027321, 956772, 885578, 829001, 762141, 699373, 647494, 599386, 555640, 511774, 469859, 436102, 395911, 360068, 333605, 311638, 292725, 280699, 260116, 234610, 211669, 186426, 162117, 138878, 143308, 164679, 185143, 207526, 237058, 271919, 295299, 324542, 354425, 373867, 390767, 394829, 399366, 402710, 399904, 399358, 405012, 406773, 415972, 432141]
12596D32141N445N851J4493j171l340M972J2375K7320J1819J4304J1703N292Q048
12583E49252J458k1966l1033m3795n0193o1866n0716k0380j6225M574J7992K1747
12571B98849J7231K7928L9142K9682J0280J2806J8600J9713J9887R445K2476L2215
12559E58254L3702N5496O7993P9383R1927J04760R7108Q4149O1666M4713J5578
12548A294729l0770n7556q4462r9152r6824q3291p2273p9926o7202m3390m3110
12537E36773l8279k8575k2640k0136k3744q115j7386j0971j0120r445j427M591
12525C50526M682M420K915J862p586l523K646L291L352M877l13n633Q59l064q510
12510C50801j3730j027p760j7459p714l08k1507j5214j0171n492r680j2082j785
$$ y = [432141, 437586, 443437, 457930, 456759, 453419, 458391, 470766, 498086, 509905, 524209, 535912, 541204, 549252, 550710, 528744, 497711, 453916, 403723, 341857, 291141, 270761, 254536, 259110, 277102, 298849, 316080, 344008, 383150, 412832, 423112, 435918, 454518, 474231, 494118, 503563, 526039, 558254, 591956, 647452, 715445, 794828, 886755, 991515, 1088623, 1172772, 1234438, 1279151, 1294729, 1263959, 1206403, 1121941, 1022789, 925965, 842674, 770401, 690475, 623273, 579883, 536773, 498494, 469919, 447279, 427143, 403399, 395284, 377898, 366927, 356807, 347362, 345935, 350526, 355208, 359628, 362543, 364405, 356819, 353296, 355942, 359233, 362585, 367462, 367149, 361516, 362375, 359311, 350801, 337071, 336044, 328284, 310825, 303111, 302803, 281296, 266082, 255911, 250419, 240739, 228657, 226872]
12497B26872P152m510r619o82r722k667m936n604p175j1446K066q26j3733K535
12483A67705P849M773n127q670j799P17n986r793j4520L381J5311P504j308j1978
12469A48059j1802Q971O357j640q512L357O708p424J1218J8882J2869J6534J4572
12456B18149J6613N206r167l130r003K897m003j5617j1552r054n716K734Q805
12443A87162J786R569q432J253N853J428J2668J0715m327j0808l654l081m307
12430A95825J002j258M91q358n447K777j3842m108N794l163k506O73m257r437
12416A54186K718o980P460P529J3755K035J895j054Q03P224j2673o451J5393J3283
12402A99123O887O732O246J4918J7401J0818J6204K5227L1072K0799K8040K6699
$$ y = [226872, 234024, 229514, 219895, 219213, 209491, 206824, 201888, 196284, 189109, 177663, 179729, 178903, 165170, 167705, 175554, 180327, 175200, 166530, 164731, 165448, 159462, 149669, 135149, 138530, 153841, 161345, 160037, 148059, 136257, 145228, 151585, 149945, 141433, 144790, 151498, 144074, 155292, 174174, 187043, 203577, 218149, 234762, 239968, 230801, 227671, 218668, 221565, 217562, 201945, 190393, 181339, 175623, 178357, 187162, 188948, 198517, 190085, 191338, 197191, 198619, 211287, 222002, 217675, 206867, 203213, 200132, 195825, 196827, 195569, 196060, 187702, 182255, 185032, 171190, 167082, 172876, 169713, 167207, 167880, 163623, 154186, 156904, 149924, 157384, 164913, 178668, 180703, 182598, 181544, 182347, 189571, 176898, 170447, 185840, 199123, 206010, 212742, 218988, 233906, 251307, 262125, 278329, 303556, 334628, 355427, 383467, 410166]
12390D10166J0654L831J0435n907l032k994j7426k2561k5031k9659k4399j9685
12378B84392r627j9456j4983Q350J744K727m291l648K697R157J7196P399N804
12365B87461m14P995L350o430n086j3185j6752j0823j2459m073K415M479m332
12352B32146j0643k702q61J1406M477L96K749O494R61J2645J0884M860M255K862
12338B79929O259J9152O686J4131K2187K2674K1015K0455L2757L4225K7987J0072
12326E17529q184k3881k5158j8990k9374k3070n326r337o249P928J9384J5282
12314D10554O797K2754K6262K1098J4352L3781N1265N1669N8893R2564J33242
12303I23231J93434K77608L75861M73428L73662r809k08274k24192l04372l56348
$$ y = [410166, 420820, 424651, 435086, 429179, 426147, 423153, 405727, 383166, 358135, 328476, 304077, 284392, 274765, 255309, 240326, 248676, 250420, 253147, 248856, 245208, 247905, 257062, 274258, 281657, 287461, 287047, 295042, 298392, 291962, 286876, 273691, 256939, 246116, 233657, 229584, 231999, 236478, 232146, 221503, 218801, 217940, 229346, 233823, 234219, 236968, 243462, 244423, 257068, 267952, 272812, 277067, 279929, 286188, 305340, 312026, 326157, 348344, 371018, 392033, 412488, 445245, 479470, 507457, 517529, 509345, 485464, 460306, 441316, 411942, 388872, 383546, 374209, 367960, 375888, 395272, 410554, 417351, 440105, 466367, 487465, 501817, 535598, 586863, 638532, 697425, 789989, 923231, 1116665, 1394273, 1770134, 2243562, 2617224, 2607415, 2399141, 2174949, 1870577, 1514229]
12293A514229k96579k10605j41578q1646n4165l7263l4301j4240j9529k2726k4438
12282E77159j4411m503r009j1033N321O75M638N360J1394J9200K0597J4089J7506
12269F36983K7704K3379O316J2064J2181k244j2615j501M895j7907k1855j1695
12257F55705j7098j3668j3455l128K033j2697k3207j0951l733o485l198r566j4514
12244E26038K157L570k727K239L72P342J5395L141K051R380J1092O512J404P885
12230E95851J6060J0430J5097O41J169J1287K0885R492m11J3778K0143J6744J8278
12217G49444K1820J4796J3565K2009Q675J2521K1817L1167L5604J2609J3418J7913
12205I75358J5958K5225K3359K3000L0828K3630K0395K5906K4300J9779K0569
$$ y = [1514229, 1217650, 1007045, 865467, 783821, 729656, 692393, 658092, 643852, 624323, 601597, 577159, 562748, 558245, 549236, 538203, 543524, 544199, 548837, 554197, 565591, 584791, 605388, 619477, 636983, 664687, 688066, 694382, 706446, 718627, 716383, 703768, 702267, 707162, 689255, 667400, 655705, 638607, 624939, 611484, 608356, 610389, 597692, 574485, 563534, 559801, 553316, 550118, 540552, 526038, 528195, 531765, 529038, 531277, 531649, 538991, 554386, 557527, 559578, 568958, 580050, 586562, 587966, 595851, 611911, 622341, 637438, 638079, 639248, 650535, 671420, 680912, 680501, 694279, 714422, 731166, 749444, 771264, 786060, 799625, 821634, 830309, 842830, 864647, 895814, 931418, 944027, 957445, 975358, 991316, 1016541, 1039900, 1062900, 1093728, 1117358, 1137753, 1163659, 1187959, 1207738, 1228307]
12194A228307K1404K1970K2241L3618L0328K4219J9774K4383L7760L0022J8511
12183A512537K8948L3338L0149L2621L0858L5999K8269K8417M5505N8474O8583
12172A933698O0047O7753Q3977R7699J27297J45046J62720J77282K21181K58204
12162C334904L00054L24369L77698M53476N48283O68773Q16816R82339J143177
12153H949889J313024J471209J651340J857080K134223K517011L135421M097481
12145B7126678N602844P830711J0859822J4288482J7255585J9420232K0521091
12138A22905445K0259557J8381103J4512592Q861065K084651m152848r750364
12131A73101201j4251912j7505545j9055730j8945494j7289104j4684955j1983476
$$ y = [1228307, 1249711, 1271681, 1293922, 1327540, 1357868, 1382087, 1401861, 1426244, 1464004, 1494026, 1512537, 1541485, 1574823, 1604972, 1637593, 1668451, 1704450, 1732719, 1761136, 1806641, 1865115, 1933698, 1993745, 2061498, 2145475, 2243174, 2370471, 2515517, 2678237, 2855519, 3076700, 3334904, 3634958, 3959327, 4337025, 4790501, 5338784, 6007557, 6824373, 7806712, 8949889, 10262913, 11734122, 13385462, 15242542, 17376765, 19893776, 23029197, 27126678, 32729522, 40560233, 51420055, 65708537, 82964122, 102384354, 122905445, 143165002, 161546105, 176058697, 184919762, 187004413, 182851565, 173101201, 158849289, 141343744, 122288014, 103342520, 86053416, 71368461, 59384985]
12124E9384985r398583p065771n229684l944243l096593k534481k175957j922088
12116B4017585j732575j573752j410604j258432j093620r23350p82681o55024
12108A4587547n38014m45076l58643k94240k43784j85284j57015j32322j08457
12099A2124712j16940j40812j64372k02113k59228l05530l42416l79635m22735
12090I790931m46637m51115m48744m20513m05237l98896l68359l39518l13478
12081F198434k96689k95282k74323k44721k30265k30415k17336k09390j90844
12072D009169j81188j80091j66587j39817j37409j41156j33830j26553j12324
12063B690214j09088r8096r5988r1275r0905q1458p5486q1436p7981p2066o7281
$$ y = [59384985, 49986402, 42920631, 37690947, 33746704, 30650111, 28115630, 25939673, 24017585, 22285010, 20711258, 19300654, 18042222, 16948602, 16025252, 15242571, 14587547, 14049533, 13604457, 13245814, 12951574, 12707790, 12522506, 12365491, 12233169, 12124712, 12007772, 11866960, 11702588, 11500475, 11241247, 10935717, 10593301, 10213666, 9790931, 9344294, 8893179, 8444435, 8023922, 7618685, 7219789, 6851430, 6511912, 6198434, 5901745, 5606463, 5332140, 5087419, 4857154, 4626739, 4409403, 4200013, 4009169, 3827981, 3647890, 3481303, 3341486, 3204077, 3062921, 2929091, 2802538, 2690214, 2581126, 2483030, 2387042, 2295767, 2204862, 2123404, 2047918, 1966482, 1888501, 1816435, 1749154]
12052A749154p6686o9589o1425n7396m9040n0989n7927m7042m6696m8482n5061
12041A128821n0250l1200l1447m2092m0129m0637l0563k8653l9763l3609l4268
12030G26210k7432j8558j8011j2888j8055r360l109m855m215r389l089J371K346
12017F00966J8103J8208J1063K1483L0869K0079R54R73p367l478j2433j4360j9575
12004F65485j9475k9421l4118k0219j6621j6067k0679j4548j0555j7614k6495
11993D39673l1165l0282k3224l9248k0864j7320j4275n364n773j5142j1464j861
11981B23691J5335J8886J0889J0497J8401J5763J6833J0811J0199K338l267Q994
11969C59370J5088J3444J1361J2701P888J5652J6380P658J2534J2062J738n602
$$ y = [1749154, 1672468, 1602879, 1541454, 1484058, 1435018, 1384029, 1326102, 1279060, 1232364, 1183882, 1128821, 1078571, 1047371, 1015924, 973832, 933703, 893066, 862503, 833850, 794087, 760478, 726210, 698778, 680220, 662209, 649321, 631266, 621906, 618797, 613942, 609727, 600338, 597249, 598620, 600966, 619069, 637277, 648340, 669823, 700692, 720771, 721725, 722698, 715331, 711853, 699420, 685060, 665485, 646010, 616589, 582471, 562252, 545631, 529564, 508885, 494337, 483782, 466168, 439673, 408508, 378226, 355002, 315754, 294890, 277570, 263295, 257931, 252158, 237016, 225552, 223691, 239026, 257912, 268801, 279298, 297699, 313462, 330295, 341106, 351305, 353643, 350376, 359370, 374458, 387902, 399263, 411964, 419852, 435504, 451884, 459542, 472076, 484138, 485876, 480274]
11957D80274j604L144k278j4548m705j9807r689q105j7767k8255j6648j1426j9643
11944C28943k0289j7988j7775q894J1749N262P407J4831p54L214Q944N253M286
11931C24189j598j323J62J1672L453K42P08K072J1068l692m329J4178J3242K154
11917C72198N732J1879P280J4979r59L231M765p316j1850j6781j4881j0916j0996
11904C46365j6529j7598K15l052j3660q638l563LL274Q917j496j692L984m955
11890B91575j009Q942O857J0792P908l438P750J6233L84m072k547J0233J5878
11877C65486O941q089k2048j2572j3853j5418j2899j553J2201j5620j6207j2108
11865B54261p290p500L407m50K616j487M090J003n099K0852K2572J0172J3311
$$ y = [480274, 478670, 481814, 479536, 464988, 460283, 440476, 430787, 422682, 404915, 376660, 360012, 348586, 328943, 308654, 290666, 272891, 263997, 275746, 281008, 288415, 303246, 302492, 305706, 314650, 319903, 324189, 322591, 321268, 321430, 333102, 336555, 336797, 337505, 339577, 350645, 346953, 342624, 356802, 370044, 372198, 377930, 389809, 397089, 412068, 411109, 414340, 419105, 411789, 399939, 383158, 368277, 357361, 346365, 329836, 312238, 312453, 309401, 295741, 287103, 283540, 283543, 286817, 295734, 294238, 292546, 296530, 291575, 290566, 299508, 306365, 317157, 325065, 321627, 329377, 345610, 345994, 341922, 339375, 349608, 365486, 372427, 364338, 342290, 329718, 315865, 300447, 287548, 285995, 298196, 282576, 266369, 254261, 246971, 239471, 242878, 242428, 245044, 243557, 247647, 248650, 243551, 264403, 286975, 297147, 310458]
11852C10458O905J0540O596m208p921l298j4629j8529j4629j7636j1547k086Q53
11839B40869l168m292j2102j619o078L58M394q229k650r79K948M244j094L373
11825B15975J4332J6037M930o898j042L840q203j1608l151J087J013n398o909
11812B14005p973M723J0328J2225P018j776p250O650o684r321j351l790J1259
11799B28063J982m899n760o983O7L253q617K190J614o29j47o246q88k231o603
11784A94166K669L977o55k486q684N91J2347J0148K073J174L134o61r526j0879
11770A97388p98J1395N803j3865j0233N897J0390n477j3146L647J555K963J340
11757A96859M561L73j233J34j640k369J923o977j2935j857Q147L712O346P529
$$ y = [310458, 317363, 327903, 334499, 330291, 322370, 319072, 304443, 285914, 271285, 253649, 242102, 240016, 240869, 237701, 233409, 221307, 219688, 213610, 213968, 218362, 210133, 207483, 206504, 209452, 213696, 212602, 215975, 230307, 246344, 251274, 244376, 243334, 247174, 238971, 227363, 224212, 225299, 226312, 220914, 214005, 206032, 210755, 221083, 233308, 240326, 238550, 231300, 237950, 231266, 221945, 220594, 216804, 228063, 230045, 225146, 219386, 212403, 212470, 215723, 207106, 209296, 210910, 210281, 210134, 203888, 203000, 200769, 194166, 196835, 200812, 200157, 197671, 188987, 189578, 201925, 212073, 214146, 215320, 218454, 217793, 208267, 197388, 196590, 207985, 213788, 199923, 189690, 195587, 205977, 200500, 187354, 191001, 192556, 195519, 196859, 201420, 201793, 200560, 200694, 199054, 196685, 198608, 191631, 178696, 176839, 184986, 188698, 195044, 202573]
11743B02573J966j1545j0508l954o380M32O238J2466O305P856N890O232J1335
11730B28906O465l522P570J6074J5875J1617K7190L2602M2765N5938P0251R3018
11718F04749J06649R8610R2266P4911P3687K9674p267k4223n1455q1248r1367
11707H24986j02523r6545q2523p0043m1490k7111k7075k3933j7815j8758k2845
11696B94325n896r057j3214m404o302j2146p973n495j933o38k868m923m323N975
11682B21128r49K757Q120J3758R728p467R236K929m966m662j1624K415q545j464
11668B30394N075l7J0l996n211o795j1168j082M885O67q979j0140M064q523m658
11653A84506k797J567P98q394J946Q601K648r00K295K164o196k196J0347L995
$$ y = [202573, 204539, 192994, 182486, 178532, 172152, 172584, 178822, 191288, 197593, 205449, 211339, 217571, 228906, 235371, 231849, 239419, 255493, 271368, 282985, 310175, 342777, 385542, 441480, 511731, 604749, 711398, 810008, 902274, 977185, 1050872, 1080546, 1073279, 1049056, 997601, 916353, 824986, 722463, 625918, 543395, 473352, 431862, 404751, 377676, 353743, 335928, 317170, 294325, 288429, 279372, 266158, 261754, 255452, 243306, 235333, 229838, 227905, 227267, 224399, 219476, 215153, 221128, 220179, 222936, 231056, 244814, 254542, 247075, 256311, 259240, 254274, 249612, 237988, 240403, 231858, 230394, 235469, 235432, 235442, 231446, 226235, 219440, 208272, 207190, 212075, 212742, 203763, 193623, 197687, 189164, 184506, 181709, 183276, 184074, 175680, 177626, 186227, 188875, 187975, 190270, 192434, 186238, 184042, 194389, 198384]
11639A98384K25j0051j1359J133Q110n925o354k926M363k248k556k4L254j979
11625A72047l82o005j4332K58N511o44k215q065q3O218O025p20o397j0326N684
11610A46574k105O768P6l790P776L443n529k729m289J431K185r583R18R289L312
11595A53747K349O488p187j5228n205j174N162N787k869n847l47J955l53j4087
11581A23191j471J0199N639O029L203M149N36p02p23j5155j2803p569M148O185
11567A24856M127M29j948K438r911n049K279J235o967O55J0253O128M309L923
11553A36757R04R609L91o954n02j916K409n057n422Q692L295o479j915m552m049
11538A25211n615O400J3410n02k743M466k782o810j0265K429J1159n390q829M703
$$ y = [198384, 198609, 188558, 177199, 178332, 186442, 180517, 174163, 171237, 175600, 173352, 170796, 170772, 174026, 172047, 171665, 165660, 151328, 151586, 157097, 156453, 154238, 146173, 146090, 152308, 158333, 157613, 151216, 140890, 146574, 144469, 151237, 151313, 147523, 155299, 158742, 153213, 150484, 146195, 147626, 149811, 140228, 141146, 150435, 153747, 156096, 162584, 155397, 140169, 134964, 133790, 138952, 144739, 141870, 136023, 135676, 137631, 137278, 123191, 121720, 131919, 137558, 143587, 146790, 150939, 151475, 150773, 150050, 134895, 122092, 114523, 118671, 124856, 128983, 129412, 127464, 129902, 119991, 114942, 117221, 118456, 111489, 112144, 122397, 128525, 132834, 136757, 137661, 147270, 147661, 140707, 140205, 138289, 140698, 135641, 130219, 138911, 142206, 135727, 133812, 129260, 125211, 119596, 125996, 139406, 138904, 136161, 140627, 137845, 131035, 120770, 123199, 134358, 128968, 120139, 124842]
11524A24842N077j937P12N557K851O129j1984n166m37l18M441P591K017m546L226
11509A38055P864k792m925O06j142J535N412N909J111p547k575l089o604Q240
11495A40058n795m693q65j0366m716N239N581K483L137m46j011j4527j5042P745
11481A06782J1261P081q87J75m05o296l091j1986K537P002m827m351L344l111
11467A03228m795P963L578l732L487p243m740J0684J0440n606j3357n027O266
11454A01146N345O475J0008k169j1259o311J777Q416k088M79r330r355j239M641
11440I6536J2409q245j507R77J915k610K085m98k668N515k379q176l14J0810J0538
11425A14388K136j105k694m022k615j110k404O420P174K559n416j0223r34j740
$$ y = [124842, 129919, 127982, 128694, 134251, 137102, 143231, 131247, 126081, 125644, 125326, 129767, 137358, 139375, 134829, 138055, 145919, 143127, 138202, 138808, 137666, 139201, 144613, 150522, 151633, 144086, 141511, 138422, 131818, 140058, 134263, 129570, 128705, 118339, 113623, 118862, 124443, 126926, 130063, 129617, 128606, 114079, 99037, 106782, 118043, 125124, 124237, 124412, 124007, 117711, 114620, 102634, 105171, 112173, 107346, 102995, 106339, 103228, 98433, 106396, 109974, 106242, 109729, 102486, 97746, 108430, 118870, 113264, 99907, 94880, 101146, 106491, 112966, 122974, 120805, 109546, 103235, 105012, 113428, 111340, 111819, 102489, 93134, 91895, 96536, 108945, 100700, 99193, 100170, 102085, 99475, 101560, 101062, 98394, 103909, 101530, 93354, 93040, 103850, 114388, 116524, 115419, 112725, 108703, 106088, 104978, 102574, 108994, 116168, 118727, 113311, 103088, 102154, 100414]
11411A00414o5p843K798Q6J0686J0344N5j011p61r757j597j912R360j618J610
11396A10789J2255Q372o787j0217n754J769J479Q190L725Q172J3996J0667J4512
11383A71168K2449R489N247J3245L326J044k483j1757n146l943j4335j1137r452
11370A67715k0130j7569j5385K688M212q925k636O795L370k655p536K041p55J310
11356A12540k008k856n988p149m726j51k538p138N180O177M102O443l030p75J243
11341I9326m48R933N21n635j300J1672R08j436L738K50M557N963P964O139O193
11326A48345j1777O451J8748J3238J2767N937P694Q951j851Q5p450j3080k3291
11313A64767j9912j035p853q944n78P690N674n895J093J2723M490o79Q824J5798
$$ y = [100414, 100349, 92506, 95304, 95390, 106076, 116420, 116475, 115464, 114703, 104946, 103349, 101437, 110797, 109179, 110789, 123044, 131416, 124629, 114412, 108658, 110427, 111906, 120096, 123821, 131993, 145989, 156656, 171168, 193617, 203106, 208353, 221598, 224924, 225968, 223485, 211728, 206582, 202639, 188304, 177167, 167715, 147585, 130016, 114631, 117319, 121531, 112606, 109970, 116765, 120135, 117480, 109944, 111985, 111230, 112540, 110532, 107676, 101688, 94539, 89813, 89662, 87124, 79986, 85166, 91343, 95445, 101888, 98858, 98083, 99326, 98878, 108811, 109332, 103697, 102397, 114069, 114977, 113541, 117279, 117529, 122086, 128049, 136013, 142152, 148345, 136568, 143019, 161767, 175005, 187772, 193709, 201403, 210354, 208503, 208588, 201138, 188058, 164767, 144855, 143820, 135967, 127023, 126445, 134135, 139809, 133914, 135007, 147730, 152220, 151541, 160365, 176163]
11299A76163J0132J7347N667l447m44o365p69j608j4311j3621m725j2527n612
11286A45880j489j2599m829k470R822M309l967o592r063L854P718M624l462r018
11272A22718q094m130m85O647Q464j799k158o804o148M517J0346N164Q214p843
11258A28609q137k044K082m755k571N416J1650K558M326J0424QM847R826K963
11244A65202O501R708k159J776R003J9735J7211J0076Q831n66p678n742j2761
11231B19137J02J0455k722j0023p617Q409R223L346j0989L892J8782L693O211
11218B51899J5318K2502K5118K2395J6133J7871K4460K6239M7532M0134M3705
11207E53306L9705K5377K2606K0011K8895K1806J1105J0312J1435J9558J1310
$$ y = [176163, 186295, 203642, 209309, 205862, 205418, 199053, 198284, 196676, 182365, 168744, 164019, 151492, 145880, 144391, 131792, 126963, 124493, 134315, 138624, 134657, 128065, 119002, 122856, 130574, 135198, 131736, 122718, 114624, 110494, 110009, 116656, 125120, 123321, 121163, 114359, 108211, 112728, 123074, 128238, 136452, 128609, 120472, 118428, 120510, 115755, 113184, 118600, 130250, 132808, 137134, 147558, 147566, 152413, 162239, 165202, 171703, 181411, 179252, 181028, 190031, 209766, 226977, 237053, 245884, 245318, 237640, 231898, 219137, 219239, 229694, 226972, 216949, 209332, 217741, 226964, 230310, 219321, 223213, 241995, 245688, 251899, 267217, 289719, 314837, 337232, 353365, 371236, 395696, 421935, 469467, 509601, 553306, 593011, 618388, 640994, 661005, 689900, 711706, 722811, 733123, 744558, 764116, 775426]
11196G75426L751P54J4300J3118J1792R760J1344J7632J1786K1910J0491N669
11184I07733J6959K1745K6216K0359K5616L5176L2702K5468J5427J6473J4936
11173A158810l962J227J653j008j4150l3830k3395k1660k8371k6134k2749k4879
11161I61552l1130l2702k0890j6412j4833o493j298q332k3O01J411R242J8302
11148H58995K7199N3747O6185P5160Q1537Q5008O6061K5635j2465k9933m8855
11137A248274p2978p2243p5091p1757q2576q3840p0470n7116m0003m3615m8159
11126E30426k9384k7222k8810k6909j8474n609k0795j5069k669j4826j0875j1738
11114C18046j0534p514j3203j1530k2006Q992P600k117j391o690n220j1953j3268
$$ y = [775426, 779177, 779931, 794231, 807349, 819141, 828901, 840245, 857877, 869663, 891573, 902064, 907733, 924692, 946437, 972653, 993012, 1018628, 1053804, 1086506, 1111974, 1127401, 1143874, 1158810, 1154848, 1156075, 1157728, 1156720, 1142570, 1108740, 1085345, 1063685, 1035314, 1009180, 986431, 961552, 930422, 897720, 876830, 860418, 845585, 839092, 837794, 829462, 829439, 830040, 831451, 840693, 858995, 886194, 939941, 1006126, 1081286, 1162823, 1247831, 1313892, 1339527, 1327062, 1297129, 1248274, 1175296, 1103053, 1027962, 956205, 873629, 789789, 719319, 662203, 622200, 578585, 530426, 501042, 473820, 445010, 418101, 399627, 394018, 373223, 358154, 355485, 340659, 329784, 318046, 307512, 299998, 286795, 275265, 253259, 262251, 269851, 267734, 266343, 259653, 254433, 242480, 229212]
11101B29212m613k865j0372r196j3099q244Q41o097M961m063j471j0146J367M12
11087A66627k368k655R18j95q241n298m438o707M489k359o518Q412L967p849j4306
11072A23479N18m624j834K394Q835j0327n815L831M544M136K881R61n505j0600
11058A12874m418N810P912j2161j249K947M086l138l178l543K181l325j15P700
11044A12383L047q216j1627N0J0553N399m581p301O11J866k412n40o74J536q059
11029I2035K713K374R298N705j1214o221M293R162K159Q261K097o137r24L663
11015A17264l512n798n069R20J904M004P955K573M706N651k238n235q061K847
11001A17911K847K502L983k131J49m171n872P268N328O627K692j692R654K603
$$ y = [229212, 224599, 221734, 211362, 202166, 189067, 180823, 181664, 175567, 180528, 176465, 174994, 164848, 166215, 166627, 164259, 161604, 162522, 162327, 154086, 148788, 144350, 137643, 142132, 139773, 133255, 141667, 145634, 137785, 123479, 123997, 119373, 117539, 119933, 128768, 118441, 112626, 116457, 121001, 125137, 128018, 128979, 123474, 112874, 108456, 114266, 122178, 110017, 108768, 111715, 115801, 112663, 109485, 105942, 108123, 104798, 104683, 112383, 115430, 107214, 95587, 95637, 106190, 111589, 107008, 99707, 100318, 102184, 99772, 99232, 98558, 100094, 92035, 94748, 97122, 106420, 112125, 100911, 94690, 98983, 108145, 110304, 118565, 120662, 114525, 113601, 117264, 113752, 107954, 102885, 103805, 105709, 109713, 117668, 120241, 124947, 130598, 128360, 123125, 115064, 117911, 120758, 123260, 127243, 125112, 125261, 121090, 115218, 122486, 127814, 134441, 137133, 135441, 145095, 147698]
10987A47698j217O574K679j4928m60r9r248n359m357J537j0285n06O716L153l183
10972A18715N667m945n719n709K624M862J312j0197l300n243N845J2550m910l800
10958A07752Q31R268M484N014N931L485K385J206n884j5235m554o61O053M92N725
10943A26292k229l287j59o567P7J5188J792o289o386N96M202O34m28K126N753
10928A31315o333n041K308N07K042j4036j601J1870k367l064k34Q460O80j223
10914A23283r207j0924J870j165L362O520N209l272R69k661K109L395k457p755
10900A09276n782N481O204k838k040J4873j753J839o005n400n821l883L894K5210
10886A33255Q541o871m318j7917K142J115j488P042L16r500Q049J097j1256j3573
$$ y = [147698, 146481, 153055, 155734, 140806, 140346, 140247, 130999, 125640, 121283, 122820, 112535, 112029, 118745, 121898, 118715, 124382, 119437, 113718, 108009, 110633, 115495, 116807, 106610, 103310, 98067, 103912, 116462, 111552, 107752, 108583, 117851, 122335, 127349, 133280, 136765, 139150, 140356, 134472, 119237, 114683, 114022, 120075, 120567, 126292, 124063, 120776, 120617, 114050, 114127, 129315, 131107, 124818, 118432, 119028, 123230, 123864, 123436, 125562, 131315, 124982, 119941, 122249, 122756, 124798, 110762, 109161, 121031, 118664, 115600, 115366, 123826, 124506, 123283, 114076, 103152, 105022, 103857, 107219, 113739, 118948, 115676, 116645, 113984, 116093, 119488, 117031, 109276, 103494, 108975, 115179, 112341, 110301, 125174, 123421, 125260, 119255, 113855, 108034, 104151, 108045, 133255, 141796, 134925, 130607, 112690, 114832, 115947, 114459, 121501, 121817, 112317, 120366, 121463, 110207, 96634]
10872I6634R01Q857J0001n765j3171l694k689O994N956R901M452M259M466Q207
10858A35309j989j0034O018O240o278r063M258J0644q23n791M207P105q595n736
10844A25472N214J395J1624O192N690n338k473p080j3417p34O358J0279L94k730
10830A40846l386M873l346n896M150L982l288N532o30J5269M250J264M620o625
10816A61615O981j256k079K482k388M856K568j51R598K100L22o67R259J1232J1723
10801B16195p326k643N137K180O397O555K31O280l394J473J415P407J2648K1839
10787B74394M585P318J1128J6298J6533J5095J0700J4750J8066J3497j820M404
10775D04948Q164N298J0724m254q591n27m01J905J2747N866Q088N904k496J206
$$ y = [96634, 97535, 106392, 116393, 110628, 97457, 93763, 91074, 98068, 104024, 113925, 118377, 122636, 127102, 135309, 133320, 123286, 129304, 135544, 129266, 120203, 124461, 135105, 134282, 128491, 132698, 139803, 131208, 125472, 130686, 132081, 143705, 149897, 155587, 150249, 147776, 140696, 127279, 126545, 132903, 143182, 143576, 140846, 137460, 142333, 138987, 133091, 137241, 141223, 137935, 143467, 142837, 158106, 162356, 163620, 168240, 161615, 168596, 167340, 165261, 167743, 165355, 170211, 172779, 172628, 182226, 184326, 184648, 183981, 193240, 204472, 216195, 208869, 206226, 211363, 213543, 219940, 226495, 226726, 233006, 229612, 231085, 232500, 239907, 252555, 274394, 278979, 286297, 297425, 313723, 330256, 345351, 356051, 370801, 388867, 402364, 400544, 404948, 413112, 418410, 429134, 424880, 416289, 415762, 415361, 417266, 430013, 435879, 443967, 449871, 447375, 448581]
10761D48581j703P208J3490J0512J3089N914Q246J2809J2558P222P237J1281O282
10748E62726N034l212L590J0363P009Q641L774J073j3027J83n001k444l725k670
10734E72314m831r316j7435j0401P393Q167j0883q729K570j0198q115r161J924
10721E03299M354J207O710L124R942J5719m250M270j80p190l68N728j095N979
10707E47249k488j6426j9151r333j4043j3556j3995j5095l328q146j0670n893
10695D15125r522m723j3328r848r647n738J105m467m377q090m348m71m728k976
10681C33967O071R639o557J598L720l919q264l375l853o817K710N36m05J0394
10667C35445Q92l403p968M899k721o355m414m37J411o181l500L145Q910p458r276
$$ y = [448581, 446878, 454086, 467576, 478088, 491177, 497091, 505337, 518146, 530704, 537926, 545163, 556444, 562726, 567760, 564548, 568138, 578501, 585510, 594151, 597925, 598998, 585971, 586154, 581153, 578709, 574984, 572314, 567483, 558167, 540732, 530331, 537724, 545891, 535008, 526279, 528849, 518651, 510536, 501375, 503299, 507653, 508860, 515570, 518694, 528636, 544355, 540105, 544375, 544195, 537005, 536637, 542365, 541270, 547249, 544761, 528335, 509184, 499851, 485808, 472252, 458257, 443162, 439834, 431688, 421018, 415125, 405603, 400880, 387552, 377704, 368057, 362319, 363424, 358957, 354580, 346490, 342142, 341671, 336943, 333967, 340038, 349677, 343120, 344718, 348438, 344519, 336255, 332880, 329027, 322210, 324920, 325456, 325051, 335445, 336337, 332934, 324966, 329865, 327144, 320789, 316375, 315938, 317349, 311168, 307668, 310813, 319723, 312265, 302989]
10652C02989q491L107r275O300J3552j37r67r82R249R479J543j307M527N640M513
10637C39740k084o392N011J367m201j86J9277K610J556K916L673L951l543j1055
10623C52640L555J3847J6320J265P897j896p651L770J1665P52q956N457P373M571
10609D10609q08o041K110R039J1865m786k453Q306Q421n686N503L991Q640J6424
10595D65134Q093o27J896O161L350P454N102k18J2167J2352J121P35J0359k49
10581E32830l735J1675J1475L309N539L650P58Q79J1649Q243L80n282m777K260
10567E78853k440Q454O08J130Q733R679O436K258n216J2905J6522M935m982L224
10553F41099L162K700N552M287M697K760j391l282J2576J4087O114J3759k679
$$ y = [302989, 294498, 297605, 288330, 294630, 308182, 308045, 307078, 306096, 315345, 324824, 326367, 325060, 329587, 335227, 339740, 337656, 331264, 336275, 337642, 333441, 333255, 352532, 355142, 356698, 359614, 363287, 367238, 363695, 352640, 356195, 370042, 386362, 387627, 395524, 393628, 385977, 389747, 401412, 402164, 393208, 398665, 406038, 410609, 409801, 403760, 405870, 414909, 426774, 421988, 419535, 427841, 436262, 430576, 436079, 440070, 448710, 465134, 473227, 472600, 474496, 480657, 484007, 491461, 496563, 496345, 508512, 520864, 521985, 522720, 533079, 532830, 529095, 540770, 552245, 555554, 561093, 564743, 565501, 566380, 578029, 586272, 586652, 581370, 576593, 578853, 576413, 584867, 585475, 586605, 595338, 605017, 611453, 613711, 608495, 621400, 637922, 642857, 637875, 641099, 644261, 646961, 652513, 656800, 661497, 664257, 662866, 659584, 672160, 686247, 692361, 706120, 703441]
10540G03441m107j402P058J3226J5333M30R886M671k102M0R212O781J0432O969
10526G79868k905j509O911P815J3576J2534J2631P570J2157P251k464P343m068
10513H56710O234J7968K1791J3115J1699O014K4J0915K1156J6062Q458J2223J8203
10500A020572J5211J7304J1513J5326K7367J8679J8262K0075J8694J6428J9396
10489A218827L2619K1717J7271J4432J2569L2154K3089J1161L0191K3422K5930
10478A463382J0977N074K6845K7760K4385L3352L5296K5851L0466K3638K2934
10467A729960K4653L2739K9409L0528K9680K4905K7988K7790L1748K3611K9366
10456B042377L0573L6461L9142L8751L8579L5826M4591O7101N6859N9982N6681
$$ y = [703441, 699334, 697932, 704990, 718216, 733549, 733979, 743865, 748536, 746434, 746474, 755686, 762467, 772899, 779868, 776963, 775454, 782365, 790180, 803756, 816290, 828921, 836491, 848648, 855899, 853435, 860778, 856710, 862944, 880912, 902703, 915818, 927517, 933531, 933555, 944470, 965626, 981688, 990146, 1002369, 1020572, 1035783, 1053087, 1064600, 1079926, 1107293, 1125972, 1144234, 1164309, 1183003, 1199431, 1218827, 1251446, 1273163, 1290434, 1304866, 1317435, 1349589, 1372678, 1383839, 1414030, 1437452, 1463382, 1474359, 1479433, 1506278, 1534038, 1558423, 1591775, 1627071, 1652922, 1683388, 1707026, 1729960, 1754613, 1787352, 1816761, 1847289, 1876969, 1901874, 1929862, 1957652, 1989400, 2013011, 2042377, 2072950, 2109411, 2148553, 2187304, 2225883, 2261709, 2306300, 2373401, 2430260, 2490242, 2546923]
10445B546923N9459O0838O2070O7726O6543N8512O1397N7847O3361N6801O8348
10434C229825O2697N3198N0600N2256N2953O4263P2121O6140N9236N7248P5075
10423C895612Q2808Q4662P4824Q8161J02950J07537J12261J19390J29043J36859
10413D934107J35229J49688J67448J63397J68786J87834K08145K06233J89542
10404F510409J95895K10436K17510K40890K61078K65051K84154K97516L23847
10395H806786L39398L52861L92851M37019M74266N19676N52615N98045O60091
10386A3133608P15331P78331Q48043R25546J025750J111280J199345J306635J416760
10377B2460629J529469J644063J756156J856979J956082K037389K093393K126782
$$ y = [2546923, 2606382, 2667220, 2729290, 2797016, 2863559, 2922071, 2983468, 3041315, 3104676, 3161477, 3229825, 3292522, 3345720, 3396320, 3448576, 3501529, 3565792, 3637913, 3704053, 3763289, 3820537, 3895612, 3978420, 4063082, 4137906, 4226067, 4329017, 4436554, 4548815, 4668205, 4797248, 4934107, 5069336, 5219024, 5386472, 5549869, 5718655, 5906489, 6114634, 6320867, 6510409, 6706304, 6916740, 7134250, 7375140, 7636218, 7901269, 8185423, 8482939, 8806786, 9146184, 9499045, 9891896, 10328915, 10803181, 11322857, 11875472, 12473517, 13133608, 13848939, 14627270, 15475313, 16400859, 17426609, 18537889, 19737234, 21043869, 22460629, 23990098, 25634161, 27390317, 29247296, 31203378, 33240767, 35334160, 37460942]
10369C7460942K121105K057986J946739J798390J620411J400622J150704Q90222
10361E0447121O43202M26167K35409J04146J6714l2969l2104J422P7629J90753
10351E2077490L28230M67531O24453P99639R74242J134352J288647J442869J576871
10342F0714324J677836J761037J795511J798417J743744J644309J508214J336423
10334G3979815J108135Q64366O06321L49862R5898j52384l97200o22351q16188
10325G5016274r96957j141480j252601j348782j393811j411194j396459j367612
10317F4707378j299319j216565j092853r62900q20681o54557m84755l07388j24271
10308E7744089M4807J96236L64093M95750N97315O51477O62794O07438N08739
$$ y = [37460942, 39582047, 41640033, 43586772, 45385162, 47005573, 48406195, 49556899, 50447121, 51090323, 51516490, 51751899, 51856045, 51872759, 51839790, 51807686, 51809108, 51886737, 52077490, 52405720, 52873251, 53497704, 54297343, 55271585, 56405937, 57694584, 59137453, 60714324, 62392160, 64153197, 65948708, 67747125, 69490869, 71135178, 72643392, 73979815, 75087950, 75952316, 76558637, 76908499, 77004397, 76852013, 76454813, 75832462, 75016274, 74019317, 72877837, 71625236, 70276454, 68882643, 67471449, 66074990, 64707378, 63408059, 62191494, 61098641, 60135741, 59315060, 58660503, 58175748, 57868360, 57744089, 57788896, 57985132, 58349225, 58844975, 59442290, 60093767, 60756561, 61363999, 61872738]
10299F1872738L35847J04185j71483m84261q08284j146057j453661j712594j927987
10290E4608443k098720k211529k256343k253100k227065k169761k087747j984215
10282C7319963j874638j782239j674679j562606j461053j364141j271324j190935
10274B5138348j114651j034048r63615r14206q49200p88497p30583o89365o56734
10265A7397449o18705n83654n52412n25160m97253m68775m61567m42121m16911
10256A2830891m08007m05685l88351l61575l49206l48436l34047l25159l20083
10247I590342l08535k89777k82449k89210k66169k56919k41776k30769k25728
10238G199010k21732k11287j95803j93774j87941j90494j82214j69422j55000
$$ y = [61872738, 62208585, 62312770, 62141287, 61657026, 60848742, 59702685, 58249024, 56536430, 54608443, 52509723, 50298194, 48041851, 45788751, 43561686, 41391925, 39304178, 37319963, 35445325, 33663086, 31988407, 30425801, 28964748, 27600607, 26329283, 25138348, 24023697, 22989649, 22026034, 21111828, 20262628, 19474131, 18743548, 18054183, 17397449, 16778744, 16195090, 15642678, 15117518, 14620265, 14151490, 13689923, 13247802, 12830891, 12422884, 12017199, 11628848, 11267273, 10918067, 10569631, 10235584, 9910425, 9590342, 9281807, 8992030, 8709581, 8420371, 8154202, 7897283, 7655507, 7424738, 7199010, 6977278, 6765991, 6570188, 6376414, 6188473, 5997979, 5815765, 5646343, 5491343]
10229E491343j61163j57271j43577j34238j25206j20191j16800j19171j17608
10220D296118j11266j04055r6592r7192r6619r5965q9236p4629q1204q6316p4899
10209C288145n9445o3374o6373o0383o1490n7715o1094n3460n7481m8017n0279
10198B649034m1063n1017m4573m4174m6032m3371l4500l6301m4297l1034l7122
10187B195550l7401l2846k6211l0907k3322j6168k8612k6742k4212k4207k0082
10176A904840k1265k0412j7806j0633k1572l5409k2408j8009k3916k8342k9753
10165A655315j5728j3140j9315k2064k9386k2715k8157k8101k1663q350j4375
10154A432321k5143k8189j0782m331j4662j3054j4208k0280k8283k3228n210k1893
$$ y = [5491343, 5330180, 5172909, 5029332, 4895094, 4769888, 4649697, 4532897, 4413726, 4296118, 4184852, 4080797, 3984205, 3887013, 3790394, 3694429, 3605193, 3530564, 3449360, 3363044, 3288145, 3228700, 3165326, 3098953, 3038570, 2977080, 2919365, 2858271, 2804811, 2747330, 2699313, 2649034, 2607971, 2556954, 2512381, 2468207, 2422175, 2378804, 2344304, 2308003, 2263706, 2232672, 2195550, 2158149, 2125303, 2099092, 2068185, 2044863, 2028695, 2000083, 1973341, 1949129, 1924922, 1904840, 1883575, 1863163, 1845357, 1834724, 1813152, 1777743, 1755335, 1737326, 1713410, 1685068, 1655315, 1639587, 1626447, 1607132, 1585068, 1555682, 1532967, 1504810, 1476709, 1455046, 1446696, 1432321, 1407178, 1378989, 1368207, 1363876, 1349214, 1336160, 1321952, 1301672, 1273389, 1250161, 1244951, 1223058]
10142A223058j3543j3456l566r386j5793j1734k1590j4324l299r950j2455M841
10130A098803o137j1520o378r945j2762j2552k839q321r763j5474j7261j2152
10118I73699j1123j2419L255K555q061j2578j0791r825j1279j7430o021n07j4647
10105H64828j1363j1272j536j3621j6606l873q957j1785q878j1127p31J275l722
10092G62632j1627n711M620o758j2841j1629p296j7219m104O22l283j0560q700
10079F68146j3972n953K153o449J642Q21O07j0785n740j1726j3500J539O005k925
10065F09863q974j0444j3824n656p26k769P729O941r88k5244r395K889j1604n908
10051E31890N622j678j874k035o962l807k021n793J226L912R992K039l942j2477
$$ y = [1223058, 1209515, 1196059, 1192493, 1183107, 1167314, 1155580, 1133990, 1119666, 1116367, 1106417, 1093962, 1098803, 1092666, 1081146, 1074768, 1064823, 1052061, 1039509, 1036670, 1028349, 1018586, 1003112, 985851, 973699, 962576, 950157, 953412, 955967, 947906, 935328, 924537, 914712, 903433, 886003, 879982, 879475, 864828, 853465, 842193, 840657, 827036, 810430, 806557, 797600, 785815, 776937, 765810, 765079, 766354, 762632, 751005, 745294, 749914, 743156, 730315, 718686, 711390, 694171, 690067, 690689, 687406, 676846, 668146, 654174, 648221, 650374, 643925, 645567, 646388, 646995, 636210, 630470, 618744, 605244, 606783, 612788, 609863, 600889, 590445, 576621, 570965, 570239, 567470, 575199, 582140, 581152, 555908, 546513, 549402, 537798, 531890, 537512, 535834, 533960, 531925, 524963, 521156, 519135, 513342, 514568, 518480, 528472, 530511, 526569, 514092]
10037E14092r5n776n697o020o867N089L960k726q082O813J1325R425J802M686
10023E21929J8137L9441N8487M2883q390l7975k3573j0956k2699j9951j6844n478
10011E35011L040r485m164l575k223N443O140K325j802m552l064j41J442K109
9997E26504R76N332l164M86N36J0419J0205R047R827o17l160P269m103K670J0110
9982E82337P706M142P999P59N686j438J2645N589N924J1644J2083N092L66l930
9968F56604m814r379M132J1021K0118J5442L670k551K915j54j476P043J1410Q975
9954G22956J4747J5115Q375N209K3342K0324J9028J1453J0639J4889Q603O286
9942H80966J2675m89P339J413L06J1594Q108k94k952K04j2115j6687l320L567
$$ y = [514092, 513997, 508221, 502524, 496504, 489637, 494726, 498686, 495960, 487878, 494691, 506016, 515441, 517243, 521929, 540066, 579507, 637994, 680877, 672487, 634512, 610939, 599983, 577284, 557333, 540489, 535011, 538051, 528566, 524402, 520827, 518604, 524047, 530187, 532512, 530710, 526158, 523094, 522953, 524395, 526504, 527480, 532812, 529648, 530134, 530670, 541089, 551294, 560341, 570168, 569551, 566391, 573660, 569557, 572227, 582337, 590043, 594185, 602184, 602943, 608629, 607191, 619836, 625425, 631349, 642993, 655076, 660168, 660534, 656604, 651790, 642411, 646543, 657564, 677682, 693124, 696794, 694243, 697158, 697004, 695528, 702571, 713981, 722956, 737703, 752818, 761193, 766402, 789744, 810068, 829096, 840549, 851188, 866077, 874680, 880966, 893641, 893152, 900491, 901904, 902210, 913804, 921912, 921618, 918666, 918870, 906755, 890068, 886748, 890315]
9928H90315m9n526K98O687J490K412N067L683J8013N135R90R547p86J159n87K458
9912I40306J3311J1630n167n774n61J240m868M44n087q034j4583j3330j0477j4211
9898H84839j8914r815q869j5201j6045o422k416p652j3427j4283m683J06Q95k912
9884G65201l355K79q696q304o87O528Q15M41o264L09n99j3403j1772k6789j4248
9869F79456j8421j9466j8110k0099o599k463q268r413j2478k4765k1100j3974
9857E04300j2101L451o158j4433j7114o173j1034j6396o193j2191q669r381j5468
9844C72440Q42M449p974m040r006j0654M062o426m724P123L096j1620j271P38
9830C37035Q926K5408L7924L3354N5934Q2000Q7840K8136l6161n1235n4805o9208
$$ y = [890315, 890266, 884740, 885038, 891725, 893215, 895627, 900694, 904377, 922390, 927525, 928515, 938062, 937276, 938435, 937848, 940306, 953617, 965247, 960080, 954306, 953745, 954985, 950117, 950561, 945474, 937440, 922857, 909527, 899050, 884839, 865925, 856110, 847241, 832040, 815995, 809573, 807157, 799505, 786078, 771795, 767112, 767218, 768113, 765201, 761846, 762125, 753429, 745125, 744438, 750966, 751781, 752222, 745958, 746267, 745668, 732265, 720493, 693704, 679456, 661035, 641569, 623459, 603360, 596761, 594298, 586030, 576617, 564139, 539374, 518274, 504300, 492199, 495650, 489492, 475059, 457945, 451772, 440738, 424342, 418149, 405958, 397289, 387908, 372440, 373282, 377731, 369757, 365717, 356711, 346057, 350119, 343693, 338969, 346092, 349188, 337568, 336297, 337035, 345961, 371369, 409293, 442647, 498581, 580581, 668421, 696557, 660396, 609161, 554356, 485148]
9818D85148o3521m9911k8235j8483k1966j2581p843o713j0969q997j3659j3568
9806B28702N271j475l718L812j0179L37m023J0438J4064K13q043o973m102M448
9792B28772o85j4619q659l984O83q85L508J116r698j262r283r82m412K003q42
9777A80771J228P369K461p864j1629r587j548P254j917n421k112K643M829K880
9763A69357N516m995o701J557o47m844m428l533l732L791N406o10j2386J692M266
9748A49709J912M94k4k813o670p864M517N645j229L518P460k681p332K371j771
9733A45242P291n310p88J715l372P44L542O695l069N543L464j2080M603M712r569
9718A49363l181M056J924k995J129m718o79N12j240K400l789m229k784P061L26
$$ y = [485148, 421627, 371716, 343481, 324998, 303032, 290451, 282608, 275895, 264926, 255929, 242270, 228702, 233973, 232498, 228780, 232592, 222413, 222750, 218727, 229165, 243229, 243442, 235399, 228426, 224324, 228772, 228087, 213468, 204809, 200825, 201508, 200623, 204131, 205247, 195549, 194287, 185004, 184022, 179610, 181613, 180771, 181999, 189368, 191829, 183965, 172336, 162749, 161201, 168455, 166538, 161117, 159005, 161648, 166477, 169357, 174873, 169878, 163177, 164734, 164087, 159243, 154815, 151282, 147550, 151341, 156747, 156137, 143751, 145443, 149709, 151621, 152115, 152091, 149278, 142608, 134744, 139261, 144906, 143677, 147195, 154655, 151974, 144642, 147013, 145242, 152533, 147223, 146435, 148150, 144778, 145522, 149064, 155759, 152690, 158233, 161697, 149617, 154220, 158932, 149363, 146182, 150238, 152162, 149167, 150296, 145578, 144899, 145411, 144171, 146571, 142782, 138553, 135769, 142830, 143156]
9703A43156k513l369j0412L751m785l293R86J0027O340r42n496l144j072K592
9689A31826M325O695j646j0005m994K799l987n506k068j876K749O077p18L531
9675A27202K14o71L275m190q63N139j020n519J592L192J6714J566k0766j1389
9661A14476j2416j290O396P054L250m700j0271J985j880k151k060M637N289k956
9647A05363j8636j0640J7990J6182j329Q48n104o099J2199O807N826m057o822
9634A12528N226l070M200l496q079p012o866P414L748P997r481j0198J713L489
9620I8113J2053O894j4474j2686P657J1901O150q551p809K189M401j384J0740
9607A15194J12N963O649N224p395q284n617k473K308N691n795m523r88j3074l353
$$ y = [143156, 140643, 137274, 126862, 130613, 125828, 122535, 123521, 133548, 139888, 138946, 133450, 130306, 129234, 131826, 136151, 142846, 141200, 131195, 126201, 129000, 125013, 119507, 117439, 115563, 118312, 124389, 123671, 127202, 127416, 126745, 130020, 125830, 124967, 130106, 129086, 123567, 125159, 128351, 145065, 146631, 125865, 114476, 102060, 100770, 107166, 114220, 117470, 112770, 102499, 104484, 102604, 100453, 98393, 103030, 108319, 105363, 86727, 76087, 94077, 110259, 108930, 109778, 104674, 98575, 110774, 117581, 123407, 119350, 112528, 117754, 114684, 118884, 115388, 107309, 100297, 93431, 100845, 104593, 112590, 103109, 92911, 94624, 98113, 110166, 117060, 102586, 89900, 97557, 109458, 115608, 107057, 99248, 101437, 105838, 104454, 115194, 115306, 121269, 127918, 133142, 125747, 117463, 111846, 109373, 111681, 117372, 111577, 107054, 106066, 92992, 89639]
9592H9639J2324l651L730P379J4943L37j1928K853k693M216J0142n595j864J953
9578A21785n569n128J732O508K576R824N88P500j844P02n401p751J418n669L583
9563A24854Q602J063j695N214P220k262K548K126l19J2415Q013j497m865q70j967
9548A58580K5388K4917M979J516P467R735J177k366m695m11j0226j1517p050j352
9534A96142n035j0627j168J762m334R406J9563N693m85j411K354N775J8256K2715
9520B58606J1304J8281J2028J5868J3011J7300R073J2757O007J4894J6615J0214
9508D15958K886P852k480k766K309j5227m076r026o329o390j0434r853l65o793
9494C55266j1413J585L112M72O910J954N575K888M071J6206K2820J2019R423J1592
$$ y = [89639, 101963, 98312, 102042, 109421, 124364, 124701, 112773, 115626, 112933, 117149, 127291, 121696, 119832, 121785, 116216, 111088, 112820, 119328, 121904, 131728, 132316, 139816, 137972, 138674, 133273, 125522, 126940, 121271, 124854, 133456, 134519, 132824, 138038, 145258, 142996, 145544, 147670, 147351, 159766, 167779, 166282, 161417, 160547, 158580, 183968, 208885, 213864, 215380, 222847, 232582, 233759, 231393, 226698, 226287, 216061, 204544, 197494, 196142, 191107, 180480, 179312, 181074, 176740, 186146, 205709, 211402, 210917, 209506, 211860, 217635, 235891, 258606, 269910, 288191, 300219, 316087, 329098, 346398, 355471, 368228, 374235, 389129, 405744, 415958, 418844, 426696, 424216, 421450, 423759, 408532, 404456, 395430, 389101, 382711, 372277, 362424, 362059, 355266, 343853, 345438, 348550, 349022, 355932, 357886, 363461, 366349, 370420, 386626, 409446, 421465, 430888, 442480]
9480D42480J3596K7094L4501K7687J7863J5567M642J2641J3300J509K590k26j8547
9467E94697k3471k0771k2168k2282k6616p341k117j8590k2957k3525o433L178
9455D01604o624n354n972j544J8618R834M537R358J1409O337J2968P020l275K051
9441D60967J5374O047O586J2405N575J639L835j598r146r490j8746j7738j3623
9428D42087j4848k5967j8207j2569j7301j2231k937j9272j0310r468p795m236
9416B86946N077M582l883P5p60L72l681m018N912N29m278Q413J2765O097J1148
9401C25296L353m076j861j0781j5066n864j8727k2091j8081P33L207o957K835
9388B31920K09M50r789l179M184K875P716K463k604p520%O112j807k533K376P699
$$ y = [442480, 456076, 483170, 517671, 545358, 563221, 578788, 583430, 596071, 609371, 610880, 613470, 613244, 594697, 571226, 550455, 528287, 506005, 479389, 472048, 469931, 451341, 428384, 404859, 398426, 401604, 394980, 389626, 383654, 382110, 400728, 410562, 415099, 424457, 435866, 442203, 455171, 462191, 458916, 460967, 476341, 482388, 488974, 501379, 506954, 508593, 512428, 510830, 501684, 492194, 473448, 455710, 442087, 427239, 401272, 383065, 370496, 353195, 340964, 338027, 318755, 308445, 298977, 291182, 286946, 292023, 296605, 292722, 292797, 292037, 292409, 288728, 284710, 290622, 291151, 286873, 295286, 308051, 314148, 325296, 328649, 324573, 322712, 311931, 296865, 291001, 272274, 250183, 232102, 232835, 236042, 229085, 231920, 232129, 232579, 222790, 219611, 223795, 226670, 234386, 236849, 234245, 226725, 226725, 232837, 231030, 228497, 230873, 238572]
9372B38572n189l812K0801J0763j863j2724m342q54l505O617R634l495n883k513
9358B42207K139m964n860k001O284R673N979N163o001j342M971J2622K751N239
9344B76860N809L500N22N318m376J868J5480J4840R273k948K722J0103M112R083
9330C52166M927L907N46n283J191M053k799k732J021K631M510o122p603j011R293
9315C58695N215O552O98M988L258M859P799M625R511J3051J2996R326K903J624
9301D46100J305P923J0930R636M363j118M01M468k857q445J166O168N900k401
9287D83539j3380J0350O816P471k377k97Q117J7754J6814J3541q68L526J6274
9274E67280J5699L892J1013P175N478P296J290K578J5859J5561J3015J7716O784
$$ y = [238572, 233383, 229571, 250372, 261135, 259272, 246548, 242206, 241352, 237847, 244464, 254098, 250603, 244720, 242207, 244346, 239382, 233522, 231521, 237805, 247478, 253457, 258620, 252619, 251277, 256248, 268870, 271621, 276860, 282669, 286169, 286691, 292009, 287633, 289501, 304981, 319821, 329094, 326146, 328868, 338971, 343083, 352166, 357093, 361000, 361546, 356263, 357454, 361507, 358708, 355976, 356997, 359628, 364138, 358016, 350413, 349402, 358695, 363910, 370462, 371160, 376148, 379406, 384265, 392064, 396689, 406200, 419251, 432247, 441573, 444476, 446100, 447405, 455328, 466258, 475894, 480257, 479139, 479540, 484008, 481151, 472706, 473872, 480040, 485940, 483539, 470159, 480509, 487325, 494796, 492419, 492122, 500239, 517993, 534807, 548348, 547480, 551006, 567280, 582979, 586871, 597884, 605059, 610537, 617833, 619123, 621701, 637560, 653121, 666136, 683852, 690636]
9261F90636P455M978L287P27k68J1702o83O336J3155j589j279O441J1104J4277
9247G66279J2984J5389J3890O670Q238J3565J0822M831J0945J977P813J6983O818
9234H97204Q029M906P948l170J1480J8636J0576J7827J2768J4418K0453K4134
9222A045209J9806J0096l42K0078J5349P833J7989J4662J8274K5445J5679K3479
9210A233557K3716K6103K7959L2899J7605J8366K1895J8426P534J6155J6800K0831
9198A481846J4161J1414J3507J9429J1845K4945K3352K3450K9853M0290L6523
9187A730615L8477M2582M2058L3506M5332N6707N8004N4401N5894O7576O4489
9176B289641P4277P0344P4965P6679Q9675R8705R6944J09535J34478J57654J79981
$$ y = [690636, 698091, 703069, 706356, 707083, 706815, 718517, 717834, 724170, 737325, 735736, 734457, 740898, 752002, 766279, 779263, 794652, 808542, 815212, 823450, 837015, 847837, 852668, 863613, 865590, 873403, 890386, 897204, 905233, 910139, 918087, 914917, 926397, 945033, 955609, 973436, 986204, 1000622, 1021075, 1045209, 1065015, 1075111, 1074769, 1094847, 1110196, 1118029, 1136018, 1150680, 1168954, 1194399, 1210078, 1233557, 1257273, 1283376, 1311335, 1344234, 1361839, 1380205, 1402100, 1420526, 1428060, 1444215, 1461015, 1481846, 1496007, 1507421, 1520928, 1540357, 1552202, 1577147, 1600499, 1623949, 1653802, 1694092, 1730615, 1769092, 1811674, 1853732, 1887238, 1932570, 1989277, 2047281, 2101682, 2157576, 2225152, 2289641, 2363918, 2434262, 2509227, 2585906, 2675581, 2774286, 2871230, 2980765, 3115243, 3272897, 3452878]
9165C452878K18925K56107L03768L68695M45540N31732O12847P25029Q13484R15040
9155H644045J028253J130272J223915J287161J327264J310356J183180R42460
9147A8076906N84432J81117j97242n06456p30550q53862q62706p90653o76452
9138A4224534n10954l28125j44545L3530K23322M14397O00993P84088R58295J131628
9128A7387163J279370J435135J602620J799500K006814K207937K389848K490713
9120C2599100K514532K441354K276512K058550J811851J569135J327753J112049
9112D7710836R22789P31305M90463K02601j27260m84861q05236j058302j211559
9103D6370776j297655j292138j240165j095200q86329o19449l18445j968L07303
$$ y = [3452878, 3671803, 3927910, 4231678, 4600373, 5045913, 5577645, 6190492, 6915521, 7729005, 8644045, 9672298, 10802570, 12026485, 13313646, 14640910, 15951266, 17134446, 18076906, 18661338, 18842455, 18645213, 18138757, 17408207, 16554345, 15691639, 14900986, 14224534, 13713580, 13385455, 13240910, 13274440, 13497762, 13912159, 14513152, 15297240, 16255535, 17387163, 18666533, 20101668, 21704288, 23503788, 25510602, 27718539, 30108387, 32599100, 35113632, 37554986, 39831498, 41890048, 43701899, 45271034, 46598787, 47710836, 48633625, 49364930, 49855393, 50057994, 49930734, 49445873, 48640637, 47582335, 46370776, 45073121, 43780983, 42540818, 41445618, 40559289, 39939840, 39621395, 39619427, 39926730]
9094C9926730O25342R20439J207246J470093J730354J987903K240568K480200
9086E2588875K700503K902655L042267L116692L124579L055784K938576K760719
9078G6230650K521244K131905J523056P42728j50383j046053j846391k501989
9070G7604767k985802l256348l334965l244006l034932k754728k442335k090534
9062E4461117j717261j345071j016080o75192l25480K737L17419O26654R41859
9053E1270702J231563J515583J784725J989599K125934K217771K194953K076589
9045F6407419J850665J522713J076657N40736q2651p37013j382613j959821k421353
9036F4814739k756098k965484l026730k998866k885878k725298k539686k340728
$$ y = [39926730, 40552072, 41472511, 42679757, 44149850, 45880204, 47868107, 50108675, 52588875, 55289378, 58192033, 61234300, 64350992, 67475571, 70531355, 73469931, 76230650, 78751894, 80883799, 82406855, 83149583, 82999200, 81953147, 80106756, 77604767, 74618965, 71362617, 68027652, 64783646, 61748714, 58993986, 56551651, 54461117, 52743856, 51398785, 50382705, 49707513, 49382033, 49384770, 49702189, 50328843, 51270702, 52502265, 54017848, 55802573, 57792172, 59918106, 62135877, 64330830, 66407419, 68258084, 69780797, 70857454, 71398190, 71315539, 70578526, 69195913, 67236092, 64814739, 62058641, 59093157, 56066427, 53067561, 50181683, 47456385, 44916699, 42575971]
9028D2575971k118460j896908j698200j500864j288344j085344q88497o93897
9020C1405457m76618k53151j6527J99618M23978O00104P02292P04873O23806N00913
9010C4414745L35024J01319k03024n61254r12152j204795j441495j574427j620607
9001B7333334j592035j498126j354659j226391j127612j024924r65465r25750
8993A7618372q92029q63185q41095p94629p63612p14803o58312o08427n53401
8984A0928879m99837m44632l94974l64238l23255k90680k63798k43130k21637
8975G882698j98916j83282j78667j77853j71185j72757j67738j55063j49886j39997
8965F187354j29223j18686j11584r1039q0390q2673p0966o1414m6664l0569l0654
$$ y = [42575971, 40457511, 38560603, 36862403, 35361539, 34073195, 32987851, 32099354, 31405457, 30928839, 30675688, 30659161, 30858779, 31282757, 31882861, 32585153, 33290026, 33913832, 34414745, 34749769, 34851088, 34648064, 34086810, 33174658, 31969863, 30528368, 28953941, 27333334, 25741299, 24243173, 22888514, 21662123, 20534511, 19509587, 18544122, 17618372, 16726343, 15863158, 15022063, 14227434, 13463822, 12749019, 12090707, 11482280, 10928879, 10429042, 9984410, 9589436, 9225198, 8901943, 8611263, 8347465, 8104335, 7882698, 7683782, 7500500, 7321833, 7143980, 6972795, 6800038, 6632300, 6477237, 6327351, 6187354, 6058131, 5939445, 5827861, 5736822, 5656432, 5573759, 5502793, 5441379, 5394715, 5364146, 5333492]
8954E333492m5417k9208p122k438K282M962K0485L8163N7856Q5762R2892J15015
8942E666724J43086J65175J94216K11421K36076K60061K81788L05390L17695L37248
8932H118880L37571L41806L66482L69872L89826L99444M11186M16791M32468M39752
8922A2024078M63358N01507N39940N84561O26986O59043O66446O14392N07210
8913A7187521L80861K26079O5856o2938j57758j79147j43358p0617J9670J21595
8903A7387764K40044L41081L93405M31968M43530M00031L49386L02743K62201
8894B0552153K26226K46565K68567L22474M10134M99436O15813P30394Q31479
8885B4703241R40031R95637J011843R90345R01125P91776O48632M81245L25804
$$ y = [5333492, 5288075, 5258867, 5251745, 5249307, 5251589, 5256551, 5277036, 5315199, 5373055, 5458817, 5551709, 5666724, 5809810, 5974985, 6169201, 6380622, 6616698, 6876759, 7158547, 7463937, 7781632, 8118880, 8456451, 8798257, 9164739, 9534611, 9924437, 10323881, 10735067, 11151858, 11584326, 12024078, 12487436, 12988943, 13528883, 14113444, 14740430, 15399473, 16065919, 16680311, 17187521, 17568382, 17794461, 17860317, 17797379, 17639621, 17460474, 17317116, 17246499, 17266169, 17387764, 17627808, 17968889, 18362294, 18794262, 19237792, 19637823, 19987209, 20289952, 20552153, 20778379, 21024944, 21293511, 21615985, 22026119, 22525555, 23141368, 23871762, 24703241, 25643272, 26638909, 27650752, 28641097, 29542222, 30333998, 30982630, 31463875, 31789679]
8876C1789679K01277P8013m4500j45538k47813l33118m04934m91417n67598o21752
8866B9212299o77039p06305o98511o64767o00155m93131l68511k21666p2424R9684
8856B4809474K69047M44128O10860P67349Q95080R97755J038774J017057R27318
8847C1776842P68513N57348L28831Q6016j48469l35366m95083o19267p22090p68828
8837C0428447p78265p72666p55284p46588p18944o77782o43952n94330n32945
8828B4207691m59563m14224l84802l79929l80283l96385m30195m43321m28225
8819B0490764l98482l29917k62615k09094j54332r6636o8974n4838o5851r5117
8809A8754908j12128j44137j61310j69628j65760j62800j66085j72714j93827
$$ y = [31789679, 31990956, 32068969, 32024469, 31878931, 31631118, 31298000, 30893066, 30401649, 29834051, 29212299, 28535260, 27828955, 27130444, 26465677, 25865522, 25372391, 25003880, 24782214, 24709790, 24809474, 25078521, 25522649, 26133509, 26900858, 27795938, 28793693, 29832467, 30849524, 31776842, 32545355, 33102703, 33431534, 33517550, 33369081, 33033715, 32538632, 31919365, 31197275, 30428447, 29650182, 28877516, 28122232, 27375644, 26656700, 25978918, 25334966, 24740636, 24207691, 23748128, 23333904, 22949102, 22569173, 22188890, 21792505, 21362310, 20918989, 20490764, 20092282, 19762365, 19499750, 19290656, 19136324, 19039688, 18970714, 18915876, 18850025, 18754908, 18642780, 18498643, 18337333, 18167705, 18001945, 17839145, 17673060, 17500346, 17306519]
8800A7306519k34134l01299l73764m72028n51759o28542o81983p10101p19789
8791A2633120o86158o45274n85858n28447m55161l86789l23551k62758j91397
8782H567727j25097r5901p1617n4634o3247q8307j22326j52894j69998j73172
8772G450534j68973j55050j41528j29108j20479j19494j50686j79767k03662k35678
8762E846109k50710k76314k76641k63622k49463k27247k15921j91743j85626j52356
8752C556466j41527j36103j20762j09892r3212q7952r0113q1535p6030p7886o3684
8741B477770p1693o4699n4649n2844m9762m7397m4499m1200m3074l8540n1751
8730A917662o0848m1109m1621l3823l0362l9937l4087l1951l9019l5843l3035
$$ y = [17306519, 17072385, 16771086, 16397322, 15925294, 15373535, 14744993, 14063010, 13352909, 12633120, 11946962, 11301688, 10715830, 10187383, 9732222, 9345433, 9021882, 8759124, 8567727, 8442630, 8346729, 8275112, 8220478, 8157231, 8068924, 7946598, 7793704, 7623706, 7450534, 7281561, 7126511, 6984983, 6855875, 6735396, 6615902, 6465216, 6285449, 6081787, 5846109, 5595399, 5319085, 5042444, 4778822, 4529359, 4302112, 4086191, 3894448, 3708822, 3556466, 3414939, 3278836, 3158074, 3048182, 2954970, 2867018, 2776905, 2695370, 2619340, 2541454, 2477770, 2406077, 2341378, 2286729, 2233885, 2184123, 2136726, 2092227, 2051027, 2007953, 1969413, 1917662, 1856814, 1815705, 1774084, 1740261, 1709899, 1669962, 1635875, 1603924, 1564905, 1529062, 1496027]
8719A496027j9433j9783j7197k0344k6869p680j1482p998j0010q376m672l666
8707A338517q916k609P078p609j0689j8210j4294J905j6367k6881j5109j8113
8695A208703k6633l6362k6285k5931j9600j9150j5048k3957j6507j4873n586m994
8683I73777o888k771K375q695o521l158o846M848M918Q687Q223l57R358N257k482
8668I79725J3717p74O62j2717o184j4228k6351k1797k8323j9737o097o827j2774
8655H38295l2300j4787j18j4591k2870j5028j206J83j8159r570p518k448j2570
8642F87313j5317Q435P16m630r82N779L316J2263j0278o108l760k399k528o385
8628F65435o069J198J3192J1844J0570k492k0754j9822k2207k3927l3104k6841
$$ y = [1496027, 1476594, 1456811, 1439614, 1419270, 1392401, 1384721, 1373239, 1365241, 1355231, 1346855, 1342183, 1338517, 1329601, 1326992, 1334070, 1326461, 1315772, 1297562, 1283268, 1285173, 1268806, 1241925, 1226816, 1208703, 1182070, 1145708, 1119423, 1093492, 1073892, 1054742, 1039694, 1015737, 999230, 984357, 978771, 973777, 966889, 964118, 966493, 957798, 951277, 948119, 941273, 946121, 951039, 959726, 967949, 967592, 976950, 982207, 979725, 993442, 992668, 993330, 980613, 974429, 960201, 933850, 912053, 883730, 863993, 857896, 851069, 838295, 805995, 791208, 791090, 776499, 753629, 738601, 737395, 737578, 719419, 709849, 702331, 699883, 687313, 671996, 680431, 681147, 676517, 675535, 681314, 684630, 696893, 686615, 680507, 676747, 674348, 671820, 665435, 659366, 660564, 673756, 685600, 696170, 693678, 672924, 653102, 630895, 606968, 573864, 547023]
8616E47023q486q983j6282j3205j2184j2238r027o493p528q923n55L969O156l807
8602D49437j1507n87n111N792j2457n916J679q034p045o693K018J463j2948n385
8588C84706K056J0136L952m53K854J2125R671J5885L5227M9052K3960j4635j5748
8575E18788p567l0045m1214m0096k3230j5640j0432q399r557p809q330q733j8555
8562B89181p248J78N684n376m697k182j307P34j880q420m932j663p385k961K989
8547B50715K150r82k045Q088N794O559L380o585j057K037k04J8019J4535K6555
8533C26959L1332j0406j3111l739j570k6111j7863K443J728l833J466n618r666
8520B72011k898n532K099J244j2799r120p390K092o320m865n992n897M201L153
$$ y = [547023, 538537, 529554, 513272, 500067, 487883, 475645, 466618, 460125, 452597, 443674, 443119, 447088, 453244, 449437, 437930, 437343, 432232, 438024, 425567, 419651, 421330, 413296, 406251, 399558, 401576, 403039, 390091, 384706, 386762, 396898, 400850, 400397, 403251, 415376, 425047, 440932, 476159, 525211, 549171, 534536, 518788, 511221, 481176, 439962, 399866, 376636, 360996, 350564, 342165, 332608, 324799, 316469, 307736, 289181, 281933, 282111, 287795, 282419, 277722, 275540, 274233, 274967, 273087, 264667, 259735, 258072, 250687, 247726, 250715, 252865, 251883, 249838, 257926, 263720, 270279, 273659, 267074, 266017, 268054, 267850, 285869, 300404, 326959, 358291, 347885, 334774, 331035, 329465, 303354, 285491, 287934, 289662, 285829, 287295, 281677, 272011, 269113, 263581, 265680, 266924, 254125, 245005, 237615, 239707, 233387, 228522, 222530, 216633, 220834, 223987]
8506B23987J0424M870Q010p163l521J935K791j285P068M365n893m03P62N480N423
8491B56850P620N715m366N87Q156Q772O754k852o34J0575j545j756q17n499K393
8476B89953p070n847L267K075r6p040p720L573p545m678L491l882n111l861P382
8461B56891j109J95O097q52j832P411J0001R421O179O931j239R683Q670R932J4875
8446C41254k162N865l959k043R76p868p019n483o877n87p005j0914j2660j2456
8432B69062j2454r365L508q836j0211K532O783m935Q182M714M249q234m662K396
8418B42729q021m705m61m222j48N716K910k34L390L840P443j310L487r016l301
8403B38097K32q720L245J54n050n738j625o140j0836q684q330j6034n517N464
$$ y = [223987, 234411, 239281, 247291, 240128, 236607, 238542, 241333, 240048, 247116, 251481, 245588, 245185, 245947, 251427, 256850, 264470, 270185, 265819, 266406, 274562, 283334, 290088, 287236, 286602, 297177, 295632, 293876, 293059, 287560, 289953, 282883, 277036, 280303, 282378, 282282, 275242, 267522, 271095, 263550, 258872, 262363, 258481, 253370, 249509, 256891, 255782, 255977, 262074, 261222, 259390, 266801, 276802, 286223, 292402, 299333, 298094, 307777, 316447, 326379, 341254, 339092, 344957, 340998, 338955, 339931, 332063, 325044, 319561, 312684, 312097, 305092, 294178, 281518, 269062, 256608, 247243, 250751, 241915, 231704, 234236, 241019, 236084, 244266, 248980, 253229, 244995, 240333, 242729, 234708, 230003, 229542, 225320, 225172, 230888, 233798, 233564, 236954, 240794, 248237, 246927, 250414, 241398, 238097, 238329, 229609, 232854, 233008, 227958, 222220, 220595, 214455, 203619, 194935, 186605, 170571, 165054, 170518]
8389A70518m784r596k056P932m157q051q211M095J987K22l031m865R847J7230
8375A67080J440j215l224n863j2496J798M818l222J178r493l020k363j11K905
8361A38212j4119j0937O155p387l671J007j596J668k661L105J0560o900r705o306
8347I7425l094L957L963J1600L942j5536r483q631m720M919p2l44N528k309K607
8332H9752p368m134j67k292J42Q981o274j0497P135R778j3241m258L865j808J0136
8317G9750J1455l935o614L148N983l853j3364m584M672r728O02J0253K817R2O05
8302G7299j644j1986K085M644N386q68L538n6p719J02n74P51k044l082J087m23
8286F6496N789j165r733j057J1214O606j2448n801j119k809M111J0648L925k826
$$ y = [170518, 165734, 156138, 154082, 162014, 157857, 149806, 141595, 145690, 147677, 147899, 144868, 140003, 149850, 167080, 168520, 167305, 164081, 158218, 145722, 147520, 152338, 149116, 150294, 140801, 137781, 135418, 135307, 138212, 124093, 113156, 119311, 111924, 108253, 109260, 107664, 109332, 106671, 109776, 120336, 113436, 103731, 97425, 94331, 98288, 102251, 113851, 117793, 102257, 92774, 84143, 79423, 84342, 84270, 83926, 89454, 87145, 89752, 82384, 78250, 78083, 75791, 75933, 84914, 78640, 68143, 75278, 85056, 71815, 67557, 71422, 69614, 79750, 91205, 87270, 80656, 83804, 89787, 85934, 72570, 67986, 72658, 62930, 63532, 73785, 76602, 76694, 77299, 75655, 63669, 65754, 70398, 75784, 74916, 78454, 78398, 70679, 70781, 70207, 70958, 68914, 65832, 66919, 66496, 72285, 71120, 61387, 60330, 71544, 78150, 65702, 59901, 58782, 55973, 60084, 70732, 74657, 71831]
8272G1831q979j1163L217J999M65o588o259N65k436l990k93R980J474j0670Q779
8257D7932R902L410p161m08N724j4576j2717L420J7638P118M24J2991l228l892
8243F6577m645k944N430m712l396k29M503p24q042l678J684L794L572L779J450
8228F2419j0160n377j803P792O437K557j841m160m783o26L627Q224o649n405K846
8213E3098j374K757p402j469O688J2050n092m426R397M414k147p308K114j806
8199E9494J325l088l601j19m951R02L861K949j1448l885K619m35p72O287P512
8184E6650J2688p006o823M183M534L675o064p134n1q502K510Q408J4721O701o735
8169G1755m743n957k265q034j3853p865J047M356l064K613L766L763q032M310
$$ y = [71831, 62852, 51689, 54906, 56905, 57370, 50782, 44523, 45088, 42652, 38662, 38369, 48349, 49823, 39153, 47932, 57834, 61244, 54083, 53675, 59399, 44823, 32106, 35526, 53164, 60282, 60706, 73697, 70469, 66577, 61932, 58988, 64418, 59706, 56310, 56081, 60584, 59860, 51818, 48140, 49824, 53618, 57190, 60969, 62419, 52259, 46882, 45079, 52871, 59308, 61865, 60024, 55864, 51081, 50455, 54082, 62306, 55657, 50252, 53098, 51724, 54481, 47079, 45610, 52298, 64348, 59256, 54830, 64227, 68641, 66494, 59186, 61300, 59494, 60819, 57731, 54130, 54011, 49060, 49962, 53823, 56772, 45324, 41439, 44058, 43623, 42851, 49138, 56650, 69338, 62332, 55509, 59692, 64226, 67901, 61837, 54703, 54652, 46150, 48660, 57068, 71789, 78490, 71755, 67012, 61055, 58790, 50756, 36903, 29038, 30085, 34441, 31377, 33990, 37756, 41519, 33487, 37797]
8155C7797N047L857o34P219k311m270l125M8j2839o950M222r10N637P481N168
8140D5437l845q837j018j02O030L300N352k461k469K07l325q634m543N100J5740
8125D5932J2656L298j0310r353k911Q05K564j5793j4258o091J8010J0496j0705
8112B4340N814P897L535m319r57J119n968P841P091q523k831J080j734O796k368
8097C8813l142O693m507K120J920j759m359k432L805l5p556j027J0308R326J874
8082E0042k092p888M454m295k065O203p708j127N768K668L69J79j1480N25K962
8067C6515K121k566N01m971J979J475J3961l225L765p193l713J48M423M323P698
8052E5241Q25l841K967N353k398o76J0141L466o075P193l246p578L26M587p034
$$ y = [37797, 42844, 46701, 46067, 53286, 50975, 46705, 43580, 43628, 30789, 23839, 28061, 27151, 32788, 40269, 45437, 41592, 32755, 31737, 31635, 37665, 40965, 46317, 43856, 41387, 41594, 38269, 29635, 25092, 30192, 45932, 58588, 61886, 51576, 42223, 39312, 40117, 42681, 26888, 12630, 6539, 24549, 35045, 24340, 30154, 38051, 41586, 37267, 36310, 37429, 31461, 39302, 46393, 37870, 35039, 36119, 34385, 41181, 38813, 35671, 42364, 37857, 39977, 41897, 40138, 35779, 33347, 37152, 37117, 29561, 28534, 38842, 48168, 50042, 47950, 40062, 44516, 40221, 38156, 44359, 36651, 35524, 41292, 43960, 44329, 44508, 33028, 33553, 36515, 38636, 36070, 36571, 31600, 33579, 35054, 49015, 45790, 49555, 42362, 38649, 38797, 43220, 47543, 55241, 56066, 52225, 55192, 60545, 58147, 57471, 67612, 71078, 65003, 72196, 68950, 61372, 61698, 66285, 59251]
8037E9251Q177J2574O959o421n922Q187M073p525j0159j302p040n333n407M715
8023E4827o905n788J76m101k983k231M516J2640O159q121l251N744J038L172j513
8008E3379j3587j512M471M06k810Q552J2275K713j0158l207J209r321L890M131
7994E0431O973n932n410j061L763q677j820Q745j494O465L453j452m029L536k473
7979E1018l178o164l888J860L793k542r672m734O055o83L503R891k087l337m809
7964C5026K196l302M623j066N789J315L561j555j520j029p045L425J264l677O77
7949C8682K279j995l91m772m872k042m983P765J5837o93n231N294m008K130k379
7934D0621L464J716Q871L810K153M272r817n718P36j498Q07k841l77r82J996m355
$$ y = [59251, 67428, 80002, 86961, 80540, 74618, 82805, 86878, 79353, 69194, 67892, 60852, 55519, 50112, 54827, 47922, 42134, 42310, 38209, 35226, 32995, 37511, 50151, 56310, 48189, 44938, 50682, 51720, 54892, 53379, 39792, 38280, 42751, 43157, 40347, 48899, 61174, 63887, 53729, 50522, 51731, 42410, 46300, 50431, 57404, 51472, 46062, 45001, 48764, 40087, 38267, 47012, 45518, 51983, 55436, 53984, 49955, 53491, 51018, 47840, 41676, 37788, 39648, 43441, 40899, 31227, 26493, 32548, 31865, 35368, 45259, 43172, 39835, 35026, 37222, 33920, 38543, 37477, 43266, 44581, 48142, 46587, 45067, 44038, 36993, 40418, 41682, 38005, 38682, 40961, 38966, 38575, 33803, 28931, 26889, 21906, 29671, 45508, 44815, 39584, 44878, 40870, 43000, 40621, 44085, 45801, 54672, 58482, 60635, 64907, 55090, 49372, 50108, 48610, 49417, 46576, 46199, 45217, 47213, 42858]
7918D2858l640q056n34M40O096O741M16R543m699M811O707k076q097k752o341
7903D1417N456P216j731m123n667m601n588o475j723l88Q647M663M936N735Q446
7888E6220o043p65k526K398L629r933l187J243N180m074j4268k229J361R160m483
7873C1683K670O754m571j2054k751l922l792j090K585P010N280J0090N855L846
7859D7593M43o610j1541n733l866R961k096m895r862r863P04Q697j259J92j564
7844A0301q520L576Q430J0529k086p622k640M716J0324R195o648M130m198K415
7830C1902j682m632L805q920K653l283M70k665n558m772r3Q015M148M111L24k181
7814B1642p708k412P340N29k173J696m35j808J52k257l531j4516N631R803J807
$$ y = [42858, 39218, 31162, 30628, 31068, 37164, 43905, 44321, 53864, 49165, 53976, 60683, 58607, 50510, 47758, 41417, 46873, 54089, 52358, 48235, 42568, 37967, 32379, 25904, 24181, 23793, 32440, 37103, 42039, 47774, 56220, 50177, 49412, 46886, 49284, 52913, 42980, 39793, 41036, 46216, 42142, 27874, 25645, 27006, 36166, 31683, 34353, 41107, 36536, 24482, 21731, 17809, 14017, 12927, 15512, 22522, 27802, 37892, 43747, 47593, 48036, 41426, 29885, 24152, 20286, 30247, 28151, 23256, 13394, 3531, 4235, 12932, 11673, 11865, 10301, 1781, 5357, 13787, 24316, 22230, 14608, 11968, 16684, 27008, 36203, 29555, 33685, 29487, 31902, 30220, 25588, 29393, 20473, 23126, 19843, 20313, 17648, 12090, 7318, 7225, 15240, 19388, 23499, 23823, 21642, 13934, 11522, 18862, 19391, 17218, 18914, 18479, 16671, 16823, 14566, 11035, -3481, 2150, 11953, 13760]
7799A3760j1912n995P979P069J361K816N333J507j0533m322p523N44O269J527
7785G880O925j541M59P678O657n616j2238k346P88K269L266K518O85q427j2004
7770c047J799p88L51M089J1486L306j2974j3304m147P148J5642N60k951N131L012
7755A5313o092j504J1701o52k801m505l59Q823J1591m378n692n012o385n295l710
7740A043l568L612P900m99N665L834o698j1943o88J646P446L674l874q07J836
7725H579k071O019M822P678R311j1574j3049M205N563m455l187j630j925j143
7711G143j509n501j14O289O395m047k197Q151m122k915k66R06j345K801O502p121
7695I050p936M971k400M718J2471Q830m466p899N40m766l211m031L227M379o94
$$ y = [13760, 1848, -4147, 3832, 10901, 12262, 15078, 20411, 21918, 11385, 7063, -460, 84, 6353, 7880, 14805, 13264, 13723, 21401, 28058, 22442, 10204, 7858, 8646, 10915, 14181, 16699, 17384, 8957, -3047, -1248, -2036, -1685, 2404, 13890, 17196, 4222, -9082, -13229, -6081, 9561, 10121, 7170, 12301, 15313, 9221, 7717, 19418, 18766, 15965, 11460, 11101, 19924, 31515, 27137, 21445, 16433, 10048, 4753, 1043, -2525, 1087, 8987, 8488, 14153, 17987, 11289, -654, -1342, 304, 7750, 11424, 7550, 6743, 8579, 6508, 12527, 17349, 25027, 34338, 22764, 9715, 13920, 19483, 15028, 11841, 10211, 8286, 7143, 5634, 133, 19, 6308, 12703, 8656, 6459, 14610, 10488, 7573, 7307, 8213, 6868, 9669, 16171, 9050, 1114, 6085, 3685, 8403, 20874, 29704, 25238, 17339, 17879, 13113, 9902, 5871, 9098, 13477, 12783]
7680A2783p116m450M69n56j512j0667q56J975q71Q923M020J1407P426m568K215
7665A8622k160j699m204p055M826k469M991J2242O6j080r794n013p4l74k80J2591
7649A9136J181m114q915r859M774N041o66k476Q510L590l756j0697O753P499j0831
7634E170M302L625R4K001o471k710j011l93k43o833Q821J2626l712l139J980L489
7618A7596n138m593K337N396J731M91o714n30O845J183j690j691k396j864j61
7603A0802n814M702Q420q704k69P484j09p478n595o519L663M127j00r093m712
7588i195L026l204J2774J1642O55k604J421j534J349l267j4787N179m25m087O831
7573C774J2413j685j3988M032M028o355r836m29Q187K905m745L63p459P55K61
$$ y = [12783, 5667, 1217, 1686, 1130, -382, -11049, -11905, -9930, -10801, -1878, 2142, 13549, 20975, 16407, 18622, 16462, 14763, 10559, 3504, 8330, 5861, 10852, 23094, 23160, 22080, 12286, 7273, 7199, 6825, 6545, 19136, 20317, 16203, 7288, -2571, 2203, 7244, 6578, 4102, 12612, 16202, 12446, 1749, 8502, 16001, 5170, 9472, 13097, 13191, 15192, 8721, 6011, 5000, 4607, 4364, -2469, 6352, 18978, 15266, 12127, 14107, 17596, 12458, 7865, 10202, 15598, 17329, 17820, 11106, 10576, 17421, 18604, 16914, 15223, 12827, 10963, 10802, 4988, 9690, 18110, 9406, 9137, 16621, 16512, 9034, 3439, -3080, 583, 4710, 4610, -4483, -9195, -6169, -9373, 3401, 15043, 15698, 13094, 14515, 12981, 14330, 11063, -3724, 1455, 1030, -3057, 3774, 16187, 14502, 514, 4546, 8574, 2219, -7617, -8046, 141, 3046, -1699, -1336, -8795, -8040, -7779]
7558g779N188J1101kN304J2048k085j1998m668o210k88O600n590m284j900l275
7543g838j902Q907J0938O934J858j871J350J122j583n302j2331O085J0722k928
7529A4161O266p50q501N347m774l996n678K650K765N894O82Q631l95q025n958
7514H319j809j1416l670J262K785J547N141M826k522N147l50q024q684N017J848
7499e83J173K244K68j902k032j406L08M335r45n230L538N191M104j932n945M697
7483E883m536K152Q734p390k564r73J3877P548o182l750j090l709p446N125j513
7468D166m618n173P865J207j502N859r298J841N411j383P76P422M466J527p95
7453A7771L404k419m813m97K607J194j4219l167O453L301L154K202K816R070M358
$$ y = [-7779, -2591, 8510, 8508, 13812, 25860, 23775, 11777, 7109, 899, 611, 7211, 1621, -2663, -4563, -7838, -9740, -833, 10105, 17039, 18897, 17026, 18376, 19498, 17915, 12613, 282, 6367, 17089, 14161, 20427, 19677, 11176, 16523, 11749, 7753, 2075, 4725, 7490, 13384, 14066, 22697, 22302, 14277, 8319, 6510, -4906, -8576, -7314, -4529, -2982, 2159, 6985, 4463, 9610, 9260, 1236, -7448, -2431, -583, 590, 2834, 3102, 1200, -832, -2238, -1930, 2405, 1460, -3770, -232, 4959, 9063, 7131, 1186, 5883, 1347, 3499, 12233, 4843, 2279, 1306, 15183, 22731, 16549, 12799, 11709, 8000, 554, 5679, 4166, -452, -5625, 2240, 3447, 1945, 7804, -1494, 347, 5758, 4375, 5151, 12573, 17039, 18566, 17771, 21175, 18756, 13943, 13446, 16053, 17247, 3028, -139, 6314, 9615, 12769, 14971, 17787, 26857, 31215]
7438C1215L063n523j2359j6323l451J0497M549J0001j925j7199p202Q422N648
7425I413n826n724o62K232j0009r16R935J1665k344J855m956p034M275P215l676
7410E443n819L978o055N62j768n654J2183L806m617j61P8n252O474N387o337n842
7394c594l887O766J17N758J729l180m239J408O411o930n089J2002R283p922j550
7379G083l984o820j672J201j062P898O01o168m343J144R475O14n05N497k271r961
7363c273K827J6251o021j511L023r431M858J2165O922o881j6020k761m174j152
7349e178K258N734m121j205J0023M028o453k738M996k007j0495O296J1545l01
7335A2382r252n955k2N329K736K138m465Q83l765K491J764q416o460r54l559Q62
$$ y = [31215, 34278, 28755, 16396, 73, -3378, 7119, 11668, 21669, 19744, 2545, -4657, 3765, 9413, 3587, -2137, -2799, -567, -10576, -11492, -1557, 10108, 7764, 9619, 4663, -2371, 1904, 9119, 5443, -376, 3602, -2453, -1891, -3659, -9313, 2870, 6676, 2059, 1898, 1976, -3276, 3198, 8585, 2248, -3594, -7481, -715, -598, 5160, 6889, 3709, -530, 878, 7289, 359, -4730, 7272, 16555, 8633, 7083, 3099, -3721, -5393, -4192, -5254, 2644, 3245, -2923, -7266, -6122, 3353, 3967, 3462, 8959, 6688, -3273, -446, 15805, 9784, 8273, 11296, 1865, 6723, 18888, 25810, 18929, 2909, 148, -4026, -5178, -2920, 2814, -1307, -2512, 7511, 11539, 5086, 2348, 7344, 5337, -5158, 1138, 12683, 12382, 3130, -2825, -2847, 2482, 5218, 7356, 2891, 3774, 9, 2500, 4264, -4152, -10612, -11566, -15125, -14263]
7319a4263J1656J2724L685j863k164p897R71m982M889J295m001j850N81M635m04
7304C012k571k493N848p423p374J0063O898m051O45J57q239P258N567P027J519
7289A5843M438K837q604J019L56j1222r673j891N64M291l932p631o117M462J392
7274a3868k892O936O646Q429N950p025J4302J3168K455j890j242M401K510k0635
7260A7245q313m582J853O170q726p291k356j208k341j842o087m731o727L430P592
7245a7914j291J787N987N262R803J090n396l657K742l463p131K683m050o312n823
7230b5683J394N755J128N020R342O736j2544l797k239L67J0078p249M444J2995
7216E747J3883O879O65L381M741m089j9098q026m685m592n609j0235o308R446
$$ y = [-14263, -2607, 10117, 13802, 11939, 9775, 1878, 2849, -2133, 2756, 4051, 50, -1800, -1219, 3416, 3012, 441, -2052, 3796, -3627, -11001, -938, 5960, 1909, 2554, 2711, -5528, 1730, 7297, 14324, 15843, 20281, 23118, 14514, 15533, 15889, 4667, -5006, -6897, -6333, -2042, -5974, -13605, -19722, -15260, -13868, -16760, -9824, -3178, 5251, 11201, 4176, 18478, 31646, 34101, 32211, 30969, 35370, 37880, 17245, 8932, 4350, 6203, 12373, 3647, -3644, -6000, -7208, -9549, -11391, -17478, -22209, -28936, -25506, -17914, -19205, -17418, -11431, -6169, 3634, 4724, -672, -4329, -1587, -5050, -12181, -9498, -13548, -19860, -25683, -24289, -18534, -17406, -12386, -3044, 3692, -8852, -12649, -14888, -14521, -4443, -11692, -7248, 5747, 19630, 26509, 27174, 30555, 35296, 31207, 12109, 4083, -602, -5194, -10803, -21038, -27346, -17900]
7202a7900P053K928o133o840O230J2492Q46o582J34O829J3790j9851m916J2625
7188G05k056M718K827k408l887j2529p821N712J7764o379j0808j286N325J1154
7174A031j084m78j342j2490n294K501J161k816K618J4147J3256j36l390j0264
7160b580p913K947M807P577L277J706l708j3303m25O835l627m689m563J6180J1750
7145A4271Q65k773j0076o516k033n671q827N211R170N382j243m798j485p04J154
7130h073R134L887n438O889k584m103Q738N581M725p941Q688j285o620l937k895
7115D766M851P011k886n958n821j531N908r792n666l953P658J1182R59o983k354
7100b609n639k139l477m269q286O332J2006J528k972M388K195R810N427Q58n731
$$ y = [-17900, -10847, -7919, -14052, -20892, -14662, -2170, -1324, -7906, -7772, -943, 12847, -7004, -11920, 705, -1351, 3367, 6194, 3786, -101, -12630, -20451, -14739, 3025, -3354, -14162, -15448, -10123, 1031, -53, -531, -1873, -14363, -19657, -17156, -15995, -18811, -16193, -2046, 11210, 11074, 7684, -2580, -10493, -7546, -2739, 4838, 8115, 9821, 6113, -7190, -7615, -780, -4407, -9096, -13659, 2521, 14271, 15136, 12363, 2287, -4229, -6262, -11933, -20760, -15549, -6379, -997, -2240, -7038, -8523, -9227, -8073, 1061, 4948, -490, 6399, 3815, -288, 8450, 14031, 18756, 10815, 19503, 18218, 11598, 7661, 4766, 9617, 16628, 13742, 7784, 1963, 432, 6340, -3452, -9118, -13071, -5413, 5769, 6728, -255, -2609, -8248, -10387, -13864, -18133, -26419, -20087, -8081, -6553, -9525, -5137, -2942, 6868, 12295, 13153, 7422]
7085G422j6031K426N509n483N984L107N37M153Q17j3038j5O369L17o000j005J452
7069c479n981p078J2679J1206p823j1039P269L953J363r12o636J009l074J839
7055f704O066r06k149n714L440J663l848o569J485P959J0616M076l246O752o962
7040E959j931J065j788m85J571J741m468M156m119n200k46m967M517J6481P308
7025A9594n131l483j3462N008M127o69M374m57o94J34r93M296j959k457o273j611
7009C44O245L537N90P016K085j0248m986n542N095k988n898K289L537l324N403
6994C155M998O845m243K991O067m473j255m720n44r426J025P459l421j0251p531
6979a3324o564N477Q342j3706o710M79K570M618n38j906N106J0135K304k32O919
$$ y = [7422, -8609, -6183, -674, -6157, -173, 2934, 3471, 7624, 8441, -4597, -4612, 1757, 2074, -3926, -4931, -3479, -9460, -16538, -3859, 7347, -476, -11515, -4246, -293, 1070, 158, -6478, -5469, -8543, -6704, -638, -1544, -3693, -9407, -5967, -4304, -8152, -14721, -13236, -5277, 5339, 9415, 6169, 12921, 5959, 4028, 5093, 3305, 2820, 4391, 6132, 1664, 5820, 1701, -3499, -3745, -8712, -4195, 12286, 19594, 14463, 10980, -2482, 2526, 6653, 5984, 10358, 9901, 9207, 9341, 8348, 12644, 10685, 8228, 1955, 344, 6589, 10126, 10716, 17732, 19817, 9569, 4583, -959, 4136, 1148, -4750, -2461, 1076, -2248, 3155, 8153, 14998, 10755, 13746, 19813, 15340, 14085, 9365, 8821, -605, 420, 7879, 4458, -5793, -13324, -19888, -14411, -6069, -19775, -26485, -26006, -23436, -18818, -19356, -21262, -16156, -6021, -3717, -3949, 2970]
$$ [...]
##END NTUPLES=NMR SPECTRUM
##END=
