##TITLE=Analysis number 312125
Compound Code cc 45596
Book Reference 440/46
Project Code adrs
Chemist Name craigr
##JCAMPDX= 6.0         $$ Bruker NMR JCAMP-DX V2.0
##DATA TYPE= NMR SPECTRUM
##DATA CLASS= NTUPLES
##ORIGIN= Bruker BioSpin GmbH
##OWNER= NMR
$$ XWIN-NMR		Version 3.5
$$ Tue Jul 26 15:13:48 2005 GMT Daylight Time (UT+1h)  MAYBRIDGE\NMR@NMR_250MHZ
##.OBSERVE FREQUENCY= 250.131544655141
##.OBSERVE NUCLEUS= ^1H
##.ACQUISITION MODE= SIMULTANEOUS (DQD)
##.ACQUISITION SCHEME= undefined
##.AVERAGES= 16
##.DIGITISER RES= 18
##SPECTROMETER/DATA SYSTEM= dpx250
##.PULSE SEQUENCE= zg30
##.SOLVENT NAME= DMSO
##.SHIFT REFERENCE= (INTERNAL, DMSO, 0, 16.522)
##AUDIT TRAIL= $$ (NUMBER, WHEN, WHO, WHERE, WHAT)
$$ ##TITLE= Audit trail, XWIN-NMR		Version 3.5
$$ ##JCAMPDX= 5.01
$$ ##ORIGIN= Bruker BioSpin GmbH
$$ ##OWNER= NMR
$$ C:\u/data/dgb/nmr/ADRS/6610/pdata/1/auditp.txt
$$ ##AUDIT TRAIL=  $$ (NUMBER, WHEN, WHO, WHERE, WHAT)
(   1,<2005-07-26 15:13:28.07 +100>,<MAYBRIDGE\NMR>,<NMR_250MHZ>,
      <created by zg, POWCHK disabled, PULCHK disabled
       configuration hash MD5:
       62 19 C7 07 E1 42 D1 B7 37 6C 3D D0 77 39 F9 E6
       data hash MD5: 64K
       5F 08 48 99 17 4B 4F A4 CF BA 3C 8A D2 EF 8A E4>)
(   2,<2005-07-26 15:13:40.16 +100>,<MAYBRIDGE\NMR>,<NMR_250MHZ>,
      <Start of raw data processing
       ef LB = 0.3 FT_mod = 6 PKNL = 1 SI = 32K 
       data hash MD5: 32K
       DB 2F 1C 30 9E 52 1E A4 4D 02 43 B0 51 D4 6B 0E>)
(   3,<2005-07-26 15:13:41.93 +100>,<MAYBRIDGE\NMR>,<NMR_250MHZ>,
      <apk 
       data hash MD5: 32K
       85 FE ED 67 B2 0B 8E 0C ED 2D F2 95 B6 73 17 E9>)
(   4,<2005-07-26 15:13:42.80 +100>,<MAYBRIDGE\NMR>,<NMR_250MHZ>,
      <abs ABSG = 5 
       data hash MD5: 32K
       02 88 00 ED 84 39 10 E2 98 90 9F 1F 26 7B 8D A2>)
$$ ##END=
$$ 
$$ hash MD5
$$ 87 31 F9 BB B5 3D 03 E5 4C E8 A6 E3 70 9B 34 EF
##$RELAX= 
##$RELAX= 
##$RELAX= 
##$RELAX= 
##$RELAX= 
##$RELAX= 
##$RELAX= 
$$ Bruker specific parameters
$$ --------------------------
##$DU= <C:\u>
##$EXPNO= 6610
##$NAME= <ADRS>
##$PROCNO= 1
##$TYPE= <nmr>
##$USER= <dgb>
##$AMP= (0..31)
100 100 100 100 100 100 100 100 100 100 100 100 100 100 100 100 100 100 
100 100 100 100 100 100 100 100 100 100 100 100 100 100 
##$AQSEQ= 0
##$AQ_mod= 3
##$AUNM= <au_zg>
##$AUTOPOS= <49 >
##$BF1= 250.13
##$BF2= 250.13
##$BF3= 250.13
##$BF4= 250.13
##$BF5= 500.13
##$BF6= 500.13
##$BF7= 500.13
##$BF8= 500.13
##$BYTORDA= 1
##$CFDGTYP= 0
##$CFRGTYP= 5
##$CHEMSTR= <none>
##$CNST= (0..31)
1 1 145 1 1 1 1 1 1 1 1 1 1 1 1 1 1 1 1 1 1 1 1 1 1 1 1 1 1 1 1 1 
##$CPDPRG= <>
##$CPDPRG1= <>
##$CPDPRG2= <>
##$CPDPRG3= <>
##$CPDPRG4= <mlev>
##$CPDPRG5= <mlev>
##$CPDPRG6= <mlev>
##$CPDPRG7= <mlev>
##$CPDPRG8= <mlev>
##$CPDPRGB= <>
##$CPDPRGT= <>
##$D= (0..31)
0 1 0 0 0 0 0 0 0 0.06 0 0 0 0 0 0 0.0002 0 0 0 0 0 0 0 0 0 0 0 0 0 0 
0 
##$DATE= 1122387207
##$DBL= (0..7)
120 120 120 120 120 120 120 120 
##$DBP= (0..7)
150 150 150 150 150 150 150 150 
##$DBP07= 0
##$DBPNAM0= <>
##$DBPNAM1= <>
$$ [...]
##$SUBNAM7= <"">
##$SUBNAM8= <"">
##$SUBNAM9= <"">
##$SW= 20.6930455092707
##$SWIBOX= (0..15)
0 0 3 0 0 0 0 0 0 0 0 0 0 0 0 0 
##$SW_h= 5175.983436853
##$TD= 65536
##$TD0= 1
##$TE= 296.16
##$TE2= 300
##$TE3= 300
##$TEG= 300
##$TL= (0..7)
0 120 120 120 120 120 120 120 
##$TP= (0..7)
150 150 150 150 150 150 150 150 
##$TP07= 0
##$TPNAME0= <>
##$TPNAME1= <>
##$TPNAME2= <>
##$TPNAME3= <>
##$TPNAME4= <>
##$TPNAME5= <>
##$TPNAME6= <>
##$TPNAME7= <>
##$TPOAL= (0..7)
0.5 0.5 0.5 0.5 0.5 0.5 0.5 0.5 
##$TPOFFS= (0..7)
0 0 0 0 0 0 0 0 
##$TUNHIN= 0
##$TUNHOUT= 0
##$TUNXOUT= 0
##$USERA1= <user>
##$USERA2= <user>
##$USERA3= <user>
##$USERA4= <user>
##$USERA5= <user>
##$V9= 5
##$VALIST= <valist>
##$VCLIST= <CCCCCCCCCCCCCCC>
##$VD= 0
##$VDLIST= <DDDDDDDDDDDDDDD>
##$VPLIST= <PPPPPPPPPPPPPPP>
##$VTLIST= <TTTTTTTTTTTTTTT>
##$WBST= 1024
##$WBSW= 4
##$XGAIN= (0..3)
0 0 0 0 
##$XL= 0
##$YL= 0
##$YMAX_a= 272062
##$YMIN_a= -463824
##$ZGOPTNS= <>
##$ZL1= 120
##$ZL2= 120
##$ZL3= 120
##$ZL4= 120
##$ABSF1= 16.522
##$ABSF2= -4.171173
##$ABSG= 5
##$ABSL= 3
##$ALPHA= 0
##$AQORDER= 0
##$ASSFAC= 0
##$ASSFACI= 0
##$ASSFACX= 0
##$ASSWID= 0
##$AUNMP= <proc_1d>
##$AZFE= 0.1
##$AZFW= 0.1
##$BCFW= 0
##$BC_mod= 0
##$BYTORDP= 0
##$COROFFS= 0
##$CY= 12.5
##$DATMOD= 1
##$DC= 0
##$DFILT= <>
##$DTYPP= 0
##$F1P= 14.0000005364418
##$F2P= -0.99999901652339
##$FCOR= 0.5
##$FTSIZE= 32768
##$FT_mod= 6
##$GAMMA= 0
##$GB= 0
##$INTBC= 1
##$INTSCL= 1
##$ISEN= 128
##$LB= 0.3
##$LEV0= 0
##$LPBIN= 0
##$MAXI= 10000
##$MC2= 0
##$MEAN= 0
##$ME_mod= 0
##$MI= 0
##$NCOEF= 0
##$NC_proc= -5
##$NLEV= 6
##$NOISF1= 0
##$NOISF2= 0
##$NSP= 0
##$NTH_PI= 0
##$NZP= 0
##$OFFSET= 16.522
##$PC= 1
##$PHC0= -88.10585
##$PHC1= 7.756453
##$PH_mod= 1
##$PKNL= yes
##$PPARMOD= 0
##$PSCAL= 4
##$PSIGN= 0
##$REVERSE= no
##$SF= 250.13
##$SI= 32768
##$SIGF1= 0
##$SIGF2= 0
##$SINO= 400
##$SIOLD= 32768
##$SREGLST= <1H.DMSO>
##$SSB= 0
##$STSI= 32768
##$STSR= 0
##$SW_p= 5175.98343685301
##$SYMM= 0
##$S_DEV= 0
##$TDeff= 65536
##$TDoff= 0
##$TI= <Analysis number 999999
Compound Code 99
Book Reference 9
Project Code 9>
##$TILT= no
##$TM1= 0
##$TM2= 0
##$TOPLEV= 0
##$USERP1= <user>
##$USERP2= <user>
##$USERP3= <user>
##$USERP4= <user>
##$USERP5= <user>
##$WDW= 1
##$XDIM= 32768
##$YMAX_p= 292938492
##$YMIN_p= -1132638
$$ End of Bruker specific parameters
$$ ---------------------------------
##NTUPLES= NMR SPECTRUM
##VAR_NAME=  FREQUENCY,     SPECTRUM/REAL,   SPECTRUM/IMAG
##SYMBOL=    X,             R,               I
##VAR_TYPE=  INDEPENDENT,   DEPENDENT,       DEPENDENT
##VAR_FORM=  AFFN,          ASDF,            ASDF
##VAR_DIM=   32768,         32768,           32768
##UNITS=     HZ,            ARBITRARY UNITS, ARBITRARY UNITS
##FACTOR=    0.157963299565203, 1,           1
##FIRST=     4132.6476996994, 0,             0
##LAST=      -1043.33573715361, 0,           0
##MIN=       -1043.33573715361, -1132638,    0
##MAX=       4132.6476996994, 292938492,     0
$$ Real data points
##PAGE= N=1
##DATA TABLE= (X++(R..R)), XYDATA
$$ [...]
15626f1855p1996J0799j32749k3198J40065P5511n3908N0930M7033J09106j28404
15615c8666o2398N4196j04859R492q7712n9306J67950N2002q9267j04053p7173
15604c39794M4454K09955J5742q9589J86433j5387J2549k0462j44797j0005J14146
15593c6755J58193L5264r9319M187j1204P1170o7843j85356J1888R5615p7076
15582a01236j29004K6352J9738N5088P6422p2812p1019n1769J7440M8288p8015
15571b60527r712L629R6654K1917J21981Q2578J9658O256m4883k18809J1206N5687
15559a14365Q3115M442J07962j11402P1584N1123N1730L509l6458j48541R421
15548b7880J3276j81813o0799N6411M7828Q611J47274l1136P2848j5667J28091
$$ plain form
15626 -61855 -133851 -123052 -255801 -278999 -138934 -63423 -117331 -66401 -19368 89738 -38666
15615 -38666 -101064 -46868 -151727 -142235 -229947 -289253 -121303 -69301 -158568 -262621 -339794
15604 -339794 -295340 -85385 -69643 -159232 27201 11814 24363 3901 -140896 -150901 -36755
15593 -36755 121438 156702 57383 61570 50366 121536 53693 -131663 -119775 -24160 -101236
15582 -101236 -230240 -203888 -184150 -129062 -52640 -125452 -196471 -248240 -230800 -182512 -260527
15571 -260527 -270239 -266610 -169956 -148039 -26058 56520 76178 82434 37551 -181258 -170052 -114365
15559 -114365 -31250 -26808 81154 -30248 41336 92459 144189 147698 111240 -37301 -27880
15548 -27880 -14604 -196417 -257216 -200805 -152977 -144366 2908 -28228 44620 28953 157044
15537A57044N0138J6745l8730j53936n7562J15461l8945k2237q3621l4876P7512
15526a3007Q8250j65652j24659p065M0301P7259Q7221K1758J34902R1155j45151
15515H5312j81627j12224n465l2108Q5314N4176M4255Q6868l2972n3140o8601
15504a30212j22488L4581O3744o6909j42042R3220P0385n2550R9708O2006J5046
15493g5511J1255O164n4538o5525Q2660o0987j5065J43979O0876o171j38377j81703
15481b92943q8244J29111N4971m2403m5831l8146R7636J15763N219L8173n223
15470g1917k2665J1491L3568J2466J2584j3081P828l8503j22691m2106n690J89057
15458d9659P5412j75116j21146J9017K8374J66278M7346p2591m3399M8693R0896
$$ plain form
15537 157044 207182 223927 185197 31261 -26301 89160 50215 27978 -55643 -90519 -13007
15526 -13007 75243 -90409 -215068 -222133 -181832 -104573 -17352 4406 139308 230463 85312
15515 85312 -96315 -208539 -214004 -246112 -160798 -106622 -62367 24501 -8471 -61611 -130212
15504 -130212 -252700 -218119 -154375 -221284 -363326 -270106 -199721 -252271 -152563 -90557 -75511
15493 -75511 -64256 -58092 -112630 -178155 -95495 -156482 -171547 -27568 33308 27137 -111240 -292943
15481 -292943 -381187 -252076 -197105 -239508 -285339 -323485 -225849 -110086 -104867 -66694 -71917
15470 -71917 -94582 -83091 -49523 -37057 -24473 -37554 -29726 -68229 -190920 -233026 -238716 -49659
15458 -49659 25753 -149363 -270509 -251492 -223118 -56840 -9494 -82085 -125484 -76791 14105
15447A4105R5868o49k22631o0976o35k5648r0631m4089O1417J0996n3212l874
15435c19959m6342J1331J25559J29146j1354N4384L4519J9535P4528n563K5236
15424I1020P1512p3175N6666J589L4257j56668n1152k1022q219j05447p1748M8684
15412a83703J37236O4149m4612J48686J10258o6184o1313K5334q1643j75732R6805
15401c0719Q5022q4556J06131O6470m1540n4129M682j68412r6882O5324N4961
15390i3648k2693J11221q9524j26629j3410k2132l6126K3438J27056J43176n9834
15379e9105J1686J19386n9190j36724j43408P4214J54198J5438o5736J26988j8430
15368A9317m720k6282j50862J5001k7221k6886R2963n1123K6542R9664K11704
$$ plain form
15447 14105 109973 109324 -113307 -174283 -174918 -200566 -291197 -335286 -273869 -262873 -316085 -319959
15435 -319959 -366301 -354970 -229411 -100265 -111619 -57235 -22716 -3181 71347 65784 91020
15424 91020 162532 89357 146023 147612 181869 25201 -25951 -46973 -55192 -160639 -232387 -183703
15412 -183703 -46467 17682 -26930 121756 232014 165830 104517 129851 48208 -127524 -30719
15401 -30719 54303 -30253 75878 142348 100808 46679 51361 -117051 -213933 -148609 -93648
15390 -93648 -116341 -5120 -94644 -221273 -234683 -256815 -292941 -269503 -142447 729 -59105
15379 -59105 -47419 71967 12777 -123947 -267355 -193141 -38943 -23505 -89241 37747 19317
15368 19317 14597 -11685 -162547 -147546 -174767 -201653 -108690 -159813 -133271 -33607 178097
15357A78097J00487j7489M8269o0650j15796j49074J9802j58830q5759M0738M2737
15346a57468J06415r3259o7815q110P3620R7597J20156o3865P6204r9196O014
15335i707O1885q4481k6212m6962Q4951J12943L1700k03167m7518Q6224K515O5500
15323B7671Q7272M3447m9446J1045j73828r5001r3449O8395K2498Q2786N1536
15312a7074J51508j05259j55466J54244K00191q0258j47551j38666r0378L263
15302b25446O3965N6834m186P0690l3310m1500J8901O6781J16824L4172o6909
15291E6816l0945j18494j2834R8345O3146l8908j16716j32807K5624O4406O7467
15280g4900q8856N4087J3444k2569j5185j53442L5231J35518J62480j44908J3097
$$ plain form
15357 178097 278584 261095 309364 248714 132918 -16156 3646 -155184 -240943 -200205 -157468
15346 -157468 -51053 -144312 -212127 -220237 -146617 -49020 71136 7271 83475 -15721 -9707
15335 -9707 52178 -32303 -58515 -105477 -20526 92417 124117 -79050 -126568 -40344 -37829 27671
15323 27671 114943 158390 108944 119989 -53839 -148840 -242289 -173894 -151396 -68610 -17074
15312 -17074 134434 29175 -126291 27953 228144 147886 335 -138331 -228709 -225446
15302 -225446 -161481 -104647 -108833 -38143 -71453 -112953 -94052 -27271 89553 123725 56816
15291 56816 25871 -92623 -105457 -7112 56034 17126 -99590 -232397 -206773 -142367 -74900
15280 -74900 -163756 -109669 -96225 -118794 -133979 -287421 -252190 -116672 45808 -99100 -86003
15269h6003K9671r8303l3559J15784J96940K4625J55982j26668j81895m389j61696
15258a69511j79154p2j1279N305J69707K24420Q8099o2907j12209J5413J31555
15247I9367R7402O8944n3059j09498n6862m4898n3363k1640p489j31959j5346
15236b28401J15974J67298k756j85167K6308K5189q7570k7468K14156p518j50863
15225a40818J21572p8471J0687j54753J3817L6005J20625M9390k9089J2971j35426
15214a73490m5941O1675J16731K09852N4141p7499r1870j08542M6022M2488j06139
15203g2572q7942o6212j0944J6840O8826N0942J8226J4928J9460j17382p3037
15192b38867j9966P4469j0511P0218O6918m6356J1702l8932k8662q2817Q8991
$$ plain form
15269 -86003 -56332 -154635 -188194 -72410 124530 149155 305137 178469 -3426 -7815 -169511
15258 -169511 -348665 -348737 -360016 -354711 -185004 39416 127515 64608 -47601 -32188 99367
15247 99367 196769 265713 212654 103156 46294 1396 -51967 -73607 -81096 -213055 -228401
15236 -228401 -112427 54871 52115 -133052 -106744 -81555 -169125 -196593 17563 10045 -140818
15225 -140818 -19246 -97717 -87030 -241783 -227966 -191961 -71336 -21946 -51035 -38064 -173490
15214 -173490 -219431 -157756 -41025 168827 222968 145469 53599 -54943 -8921 33567 -72572
15203 -72572 -160514 -226726 -237670 -220830 -152004 -101062 -82836 -67908 -48448 -165830 -238867
15192 -238867 -258833 -184364 -194875 -124657 -57739 -104095 -92393 -131325 -159987 -242804 -153813
15181a53813J26446q6891j40013o3792Q3090M2793J35506P7728r796J21187n467
15170A26978M3847J375l4914n2665p2074o7183o7153p2749M7691K1694j15713
15159b40866Q823L5986J69779R9313r7779j35905r1164N4294J97474J87229q3156
15148A04028o2666P7175J40349j26407l01304J37106J83206Q3606o3447k16195
15138d4549o2395j0848J12279p5443J66252J2036J2168R0314J47112n1676k04051
15127I1199p1165r9673k02329J40995K07467q479n8160J2680j65600n5585L3915
15116a74735J07493J46526J40095j0910p3252l891j8183M3094J62293M6629j79088
15105A86071j13398K4771P9904R0968j51336j42670K5298O5392k10417j19077
$$ plain form
15181 -153813 -27367 -114258 -254271 -318063 -234973 -192180 -56674 21054 11258 132445 126978
15170 126978 170825 172200 137286 84621 12547 -54636 -121789 -194538 -146847 -125153 -240866
15159 -240866 -232043 -196057 -26278 73035 -24744 -160649 -251813 -197519 -45 187184 104028
15148 104028 41362 118537 258886 132479 -168825 -31719 151487 235093 171646 -44549
15138 -44549 -106944 -117792 -5513 -80956 85296 97332 109500 199814 346926 295250 91199
15127 91199 20034 -79639 -281968 -140973 66494 58015 -145 12535 -153065 -208650 -174735
15116 -174735 -67242 79284 219379 208469 135217 131326 113143 156237 318530 365159 186071
15105 186071 72673 97444 177348 268316 116980 -25690 -392 65000 -145417 -264494
15095b64494l9263J4960N4859J03791J25101J03932m54L4517J17548o1823j41780
15084D6894J00391N6541n8347l8763J12920l5827j43427n7701P1743N791P8593
15073A38808l5524J2043p3818q6413q0761O3697J63455P1836r5680R8020R418
15062A85081l28748k26524M5153J09429J95653r636J6876j3269m7405J08307J64285
15051A99202j22075n9950m8050K628N9766J43473M9632n3013p8295m9978M0111
15040H3451L2077p27k8955l2139n2968n385k3956L2302M3518Q1932J13203J4r4570
15027A47797k00517m3258J05181O7882j5936K13223O4613j27309k82299j85176
15017b55799P0501J39652m6040J9002P0674J44249p085r4487o0953m8375J07572
$$ plain form
15095 -264494 -303757 -288797 -233938 -130147 -5046 98886 98432 132949 250497 188674 46894
15084 46894 147285 203826 145479 106716 219636 183809 40382 -17319 54424 60215 138808
15073 138808 103284 115327 41509 -44904 -125665 -61968 101487 173323 77643 175663 185081
15062 185081 -143667 -370191 -325038 -215609 -19956 -29592 -12716 -25985 -73390 34917 199202
15051 199202 77127 17177 -30873 -28245 31521 174994 224626 171613 93318 43340 83451
15040 83451 115528 114801 85846 53707 739 -4646 -28602 3700 47218 129150 242353 242367 147797
15027 147797 -52720 -95978 9203 77085 61149 274372 338985 211676 -70623 -255799
15017 -255799 -185298 -45646 -91686 -72684 -2010 142239 135154 40667 -20286 -68661 38911
15006C8911J04080J50691m0126k76614m6626J14465J61720K00235O0758J0651
14996D78145k50263j55979M3048R9507p7591J46058k9197j16490j31898r1335
14986h5995o6810J76251J94743j50422j56803J779j33037J45468K22218p5690
14976G1702m0838m3474K147j7438r0547k1303K24761J1155R4851j58394j18956
14965h6334R8893N9821J23400q3170j57262L2418N9195j37951k0611O2200J04330
14954E4929l5225k9382k25011j29038J06170J44611J48938n4997r3063N7241J23226
14943F8399M7984m6188n3752j9893j06530q6965J26486Q5621M094J9572K0296
14932E9124r2648n485l063P8233k8993J14107L1509m4462L0692Q0815j60402k7933
$$ plain form
15006 38911 142991 293682 253556 -23058 -69684 44781 206501 406736 467494 478145
14996 478145 227882 71903 114951 214458 136867 282925 253728 137238 5340 -85995
14986 -85995 -152805 23446 218189 67767 -89036 -87257 -220294 -74826 147392 71702
14976 71702 30864 -12610 -10463 -27901 -118448 -139751 85010 96165 191016 32622 -86334
14965 -86334 12559 72380 195780 112610 -44652 -12234 46961 -90990 -111601 -49401 54929
14954 54929 19704 -9678 -234689 -363727 -257557 -112946 35992 -19005 -112068 -54827 68399
14943 68399 116383 70195 16443 -3450 -109980 -196945 -70459 15162 19256 38828 59124
14932 59124 -33524 -39009 -42072 36161 7168 121275 152784 108322 139014 219829 59427 31494
14920C1494k4324j9137J02372M9972p6975j09687J4052M2056J06433O0483j14831
14909F1908j09308N7948o937M0702K4728L4600L7813o6845r0778j29857N4528
14898i1498J39497O8728j97672o0624Q0753r7642j05815K12009J14176o5071R5547
14887I2388j8325O7735Q7352j19934j94764p5309K4597m1629J27577J21889o8114
14876C463q7456L4311O029P4793j99041j370J43613l4396q8176k5996K1368J23813
14864b9045o8684j54905L3902J87825J7221j7492P647J89465o8337J2558N6400
14853A66555k17203j42775K9770l387J04395J3742j52387J5093P9826Q0110j9570
14842d5831m687P1334N0524k0653N5922j64549M5385K31885J78311j41300r7110
$$ plain form
14920 31494 7170 -11967 90405 140377 63402 -46285 -32233 9823 116256 176739 61908
14909 61908 -47400 10548 3611 44313 69041 103641 141454 74609 -16169 -146026 -91498
14898 -91498 47999 116727 -80945 -141569 -60816 -158458 -264273 -52264 61912 -3159 92388
14887 92388 74063 141798 229150 109216 -85548 -160857 -136260 -177889 -50312 71577 3463
14876 3463 -83993 -49682 -43653 31140 -167901 -169271 -25658 -60054 -148230 -174226 -152858 -29045
14864 -29045 -97729 -252634 -218732 -30907 -13686 -31178 -23531 165934 97597 110155 166555
14853 166555 -50648 -193423 -163653 -167040 -62645 -48903 -201290 -186197 -106371 -26261 -45831
14842 -45831 -50518 20816 71340 50687 106609 -57940 -12555 219330 397641 256341 159231
14831A59231j39817j3435N5889l4030M394j544j04681o9223n349P8551J52687
14820H2673j7675k44482J3564P0120R6942O8672k64848m9634L04382J58236j1586
14809B06364J5809j10599j99820p0483J10935Q1628j42557q0568J4788J0732l79
14798a64150K2825J19790j73005O5376J04572J39411N7702Q9375j2804j64745
14788H4347j47305o2539j716M2253k576J05958l2121N1179J58097J16491R91j39596
14776A73463j08435R8723J21005q5861J3076j35303j46434o6317P230k3638J18484
14765c4007J8057o26R9881j60230n2821j7279j8554J5793j993J10432J31400j6766
14753G3287Q011j15710l098R0716J20656m0754Q554J9845k43934K4967N7437j2307
$$ plain form
14831 159231 19414 5979 61868 27838 32232 30688 -73993 -143216 -148565 -70014 82673
14820 82673 64998 -179484 -165920 -95800 1142 69814 -195034 -244668 59714 217950 206364
14809 206364 222173 111574 -88246 -158729 -47794 33834 -108723 -189291 -174503 -163771 -164150
14798 -164150 -141325 -21535 -194540 -129164 -24592 114819 172521 261896 249092 84347
14788 84347 -62958 -125497 -127213 -84960 -87536 18422 -13699 37480 195577 312068 313059 173463
14776 173463 65028 163751 284756 198895 211971 76668 -69766 -136083 -128853 -152491 -34007
14765 -34007 -15950 -16576 83305 -76925 -129746 -147025 -165579 -149786 -151779 -41347 90053 73287
14753 73287 81298 -34412 -37510 53206 173862 133108 141662 161507 -82427 -57460 -23 -12330
14741a2330O1357q9402P1211N7202k07884k5755R8335J21666Q0519L5906O8160
14730B58985j35579j13828P3356J09233j60719J1374J18645J60730L0j34661j24992
14719F2574O841m6813Q6403J0145r827m9715j35133M1040J44635j12310j1845
14708a4005P3031n9947O5790m647j36983p8842L028Q8964r914k7971J48299J84596
14696B31399j68328j38582J67099p8783n9572N793r7818q8757K6097K4381M5110
14685a31961J44711K3475k804r8857M2033P0706M5728o8575j1262M9369o1946
14674F17l5606n1408m939j37335m1380Q338J2689K9313P7540J229j69692J8384
14662b92250K32413J5399N1546j26392M7224j2904j01689J30763j12645o8687
$$ plain form
14741 -12330 49027 -40375 30836 88038 -119846 -145601 -47266 74400 154919 190825 258985
14730 258985 123406 9578 82934 192167 31448 42822 161467 322197 322227 187566 62574
14719 62574 69415 22602 109005 119150 109323 59608 -75525 -34485 110150 -2160 -14005
14708 -14005 59026 -921 64869 60222 -76761 -155603 -152575 -63611 -73525 -101496 46803 231399
14696 231399 63071 -75511 91588 12805 -46767 -40974 -138792 -227549 -201452 -177071 -131961
14685 -131961 12750 36225 33421 -65436 -23403 47303 93031 24456 13194 62563 617
14674 617 -34989 -86397 -91336 -228671 -270051 -261713 -249024 -219711 -142171 -140942 -310634 -292250
14662 -292250 -59837 -44438 7108 -119284 -72060 -84964 -186653 -55890 -168535 -237222
14652b37222J03997R9260j01977r2301r1890p2046K09395j3675K3651K15756k1071
14641B1877j28148o2688l4135L1559O2572L9829j50366R5845J71652J36735m8278
14630A36454k15381j50575N1696J00982L2204J084j7573j34260j34651O3145L54233
14619H7358k414j04781P6763R024N1879K4159O6525R123o4186r9285J48151L3018
14607B35334m7107l7419o7807J5936N2668k5293n4263l1008j07190o1565M8872
14596g8842J36212J18716N9730l3135j11945k13146k0814Q0484p154j8260J4674
14585g3480l7879r1515O9700N2760k7680K11689J05849p1519n3682j66598p8197
14574a60552P5729J0946L3235o3559j46372L8938J10868r6489l3474j5375o4052
$$ plain form
14652 -237222 -133225 -33965 -135942 -228243 -320133 -392179 -182784 -196459 -172808 42948 21877
14641 21877 -106271 -168959 -203094 -171535 -108963 -69134 -219500 -123655 47997 184732 136454
14630 136454 -78927 -229502 -177806 -76824 -44620 -43536 -61109 -195369 -330020 -266875 87358
14619 87358 84944 -19837 56926 65950 117829 141988 208513 217636 153450 54165 202316 235334
14607 235334 188227 150808 83001 98937 151605 126312 72049 41041 -66149 -127714 -78842
14596 -78842 57370 176086 235816 202681 90736 -122410 -143224 -62740 -69894 -88154 -73480
14585 -73480 -111359 -202874 -133174 -80414 -108094 103595 209444 137925 84243 -82355 -160552
14574 -160552 -84823 -73877 -40642 -104201 -250573 -211635 -100767 -197256 -230730 -246105 -310157
14563c10157M4160M7084n2543K2583J1259l8364N9174R2620j85096p6734J51477
14552b34537J61797J54401r316n2066m079o0858J17176J70178p490j30100j89307
14541h4201l3832m5034j3484J4013Q8124L7751j15665q1219J11286J26302l8805
14530c4764j69641p2563J27947J63158Q0688j6603o6230l9434o4851l4037O861
14519a19469Q0394j10791o1626M0141K58767L9688j2559m3429L0067k2568J11838
14508A90453P2390l9374j28247K1042j22525J4785J30577k8632J3670J2151r6617
14497C9673p3942R7209J10602L0168j03789K810j30619j04122K4411j7161k0811
14486a45571J20463j06156j39744j1152l3790M9079P9841m3113o7321k4639K1246
$$ plain form
14563 -310157 -265997 -218913 -271456 -248873 -237614 -275978 -216804 -124184 -309280 -386014 -234537
14552 -234537 -72740 81661 72345 20279 16200 -44658 72518 242696 235206 105106 -84201
14541 -84201 -118033 -163067 -176551 -162538 -74414 -36663 -152328 -233547 -122261 4041 -34764
14530 -34764 -204405 -276968 -149021 14137 94825 78222 11992 -27442 -92293 -126330 -119469
14519 -119469 -39075 -149866 -211492 -171351 87416 127104 114545 71116 101183 78615 190453
14508 190453 262843 223469 95222 116264 -6261 8524 139101 110469 124139 136290 39673
14497 39673 -34269 62940 173542 203710 99921 102731 -27888 -132010 -107599 -124760 -145571
14486 -145571 -25108 -131264 -271008 -282160 -315950 -266871 -187030 -230143 -297464 -322103 -300857
14475c00857k4550M8794j263J6453O8991J25837N7062o8197M1283n4404r0055
14464a80906o7212J23246J23077L8768K4358n1053j50464J4560j7258O2700N7758
14453b2426Q5314m0497q0607P2600M5939k092Q4790n5795r8111n2705k35301j1404
14441c10295J20698O9514j41924J12871N6932K3365j1273J03304K6383J45434
14431A95009j03913q431J6544p5153j08883m3633p5499j4599K23702K3989r3373
14420f4240n0936P7250O1707j5429O192J34616J07571o23j02482k76687p801j867
14408a32729M1922N4813R808K089j069O1132P0389o6815J168o5886L2474K8951
14396C6247m4804O1143m2025N9674K6965q2289L502Q6890J0276J3190l2036j64202
$$ plain form
14475 -300857 -325407 -276613 -277876 -261423 -192432 -66595 -9533 -77730 -36447 -90851 -180906
14464 -180906 -248118 -124872 -1795 36973 61331 10278 -140186 -125626 -142884 -80184 -22426
14453 -22426 62888 22391 -58216 14384 60323 58231 143021 87226 -10885 -63590 -298891 -310295
14441 -310295 -189597 -120083 -262007 -149136 -92204 -68839 -80112 23192 49575 195009
14431 195009 91096 82665 99209 24056 -84827 -128460 -203959 -218558 5144 29133 -64240
14420 -64240 -115176 -37926 23781 8352 14544 149160 256731 256108 153626 -123061 -130862 -132729
14408 -132729 -90807 -35994 -26186 -24097 -25166 35966 106355 39540 40708 -25178 7296 36247
14396 36247 -8557 52586 10561 70235 97200 14911 18413 105303 115579 128769 96733 -67469
14384f7469k14891n7709K04285R5406m1132o9795p2393L125R2892O4017Q0523
14373A6859j27842n7354R86L3912O1833k9501q2829j9100Q8781N5401J22542n2674
14361A1014N702M722k6005J00682R2360N0194o9955p4375J89472l6393j04749
14350A42669j90552q6669K5031L9653N8865j2804K5453J34013N7482r8558j0496
14339H4087o251k5212J39187j23276j57274J8390Q7146M7389J1804J33398j69239
14328D0149j4481m4767j26182O3088N5755j10892J61916n6720n4010n583R1445
14317b82o4747j16815n240M9126L1747J38614L6982j57470l5070J1428j55k7049
14305a38931J2640J8190N6924k4196K5649p097n7265l1562J3971K7316J22380
$$ plain form
14384 -67469 -282360 -340069 -135784 -40378 -81510 -151305 -223698 -220573 -127681 -63664 16859
14373 16859 -110983 -168337 -167351 -133439 -71606 -101107 -183936 -203036 -114255 -58854 63688 11014
14361 11014 16716 21438 -4567 96115 188475 238669 168714 94339 283811 247418 142669
14350 142669 -47883 -134552 -109521 -69868 -11003 -23807 1646 135659 193141 94583 84087
14339 84087 77836 52624 191811 68535 -88739 -70349 16797 64186 75990 209388 40149
14328 40149 25668 -19099 -145281 -82193 -26438 -137330 24586 -32134 -86144 -91727 -282
14317 -282 -65029 -181844 -187084 -137958 -106211 32403 69385 -88085 -123155 -111727 -111882 -138931
14305 -138931 -126291 -108101 -51177 -75373 -49724 -56821 -114086 -145648 -131677 -104361 18019
14294A8019l5927j14667J4142J08980R8247J26627j8973q8310l96l8019n3682
14283A6041m2042J15073j14193j85336M5068j42805J25394J78819L4320P913k36922
14272a98670N1755J60211j2942m710r7232N7756P4263j93824p0107R4976K04860
14261F6336Q5849R2906m1895m3362j21410l0523l5190m1791N4211j3964p2945
14250a01778n4319O6292j19684K9677J91490p3091n3792J51593k4558O4370J68572
14239B44772Q2560j8552N9667j7820j68031k52311j9330n3143j08174m2057P3865
14228b18554M1853J32065R5473k3755m2155Q2393R6431q6630q5209j06138R9438
14217a4788O1159N0884n146P1294r6284L3451p945k949J86239N5295j12262j61964
$$ plain form
14294 18019 -17908 -132575 -118433 -9453 88794 215421 196448 108138 107742 69723 16041
14283 16041 -26001 89072 -25121 -210457 -165389 -308194 -182800 -3981 30339 38252 -198670
14272 -198670 -146915 13296 354 -4356 -101588 -43832 30431 -163393 -233500 -138524 66336
14261 66336 152185 245091 203196 159834 38424 7901 -27289 -69080 -14869 -28833 -101778
14250 -101778 -156097 -89805 -209489 -179812 11678 -61413 -115205 36388 11830 76200 244772
14239 244772 327332 308780 368447 350627 182596 -69715 -89045 -142188 -250362 -292419 -218554
14228 -218554 -176701 -44636 50837 27082 -15073 67320 163751 77121 -8088 -114226 -14788
14217 -14788 46371 97255 92109 163403 67119 100570 92625 89676 275915 331210 218948 56984
14205E6984O5839m5883M3398j466J00301j00555j16556k0012O707l7292J05591
14194E7056J04602N4697j64974p2946j10737P702J30077L2987J55948o1104m4078
14183H9230P823j06152L7856J00175J3056O9467o0706k19803O8889O3556k4928
14172C8463k2209k3277j4231K4628J26629r524N8883j05111j32155J15746K12363
14161B70205N7301p0776n2696q5953k1226O8585j6708j9956j04578j32214K4847
14150h3169K05284k1501j15458q2529J05315j5938q7387J57498J33651J04176
14140B99942n0758n4492M7326J9955q9767l1098J10898l0230j04076j87965n7035
14129a27300M1607P0814N6039P3377m2714n5066J01910k4196j10298L3042l0992
$$ plain form
14205 56984 122823 76940 120338 118872 219173 118618 2062 -17950 -11243 -48535 57056
14194 57056 161658 216355 51381 -21565 -132302 -124600 5477 38464 194412 133308 89230
14183 89230 97053 -9099 28757 128932 141988 211455 150749 -69054 -165 63391 38463
14172 38463 16254 -7023 -21254 3374 130003 120479 179362 74251 -57904 57842 270205
14161 270205 327506 256730 204034 118081 96855 165440 148732 128776 24198 -108016 -83169
14150 -83169 122115 100614 -14844 -97373 7942 -7996 -95383 62115 195766 299942
14140 299942 249184 194692 242018 261973 172206 141108 252006 221776 117700 -70265 -127300
14129 -127300 -85693 -14879 41160 114537 71823 16757 118667 94471 -15827 17215 -13777
14118a3777j226l3944P4413k2210r0487Q8860Q3446N3992m0565n4843R8433J81314
14106C23406r3744k26966M8362Q6457L444j01650R0024Q8532l1285j04048L1778
14095A14310j23211l1585J17938m8211j42958k1252K620K00691O2515m139j1386
14084A15332K6871l3184M7282J64788O1968j06677j6292M4669l620j87470j57174
14073d3507m9518L1567J95461O9921p8406j1812j6831J77631Q1r010J58O0684
14061C26419k087L6k4091j1673j08506j97774l7052L1142j08749j26465J39595
14050a19205J92669p4332o2066R1076J02963P4448m9394j1729J2821O2319j2875
14039B06695n6671k3621L7336m8043k5590N1555J0599p6407m4146M7620K17085
$$ plain form
14118 -13777 -15003 -48947 25466 3256 -87231 1629 85075 139067 98502 43659 142092 323406
14106 323406 229662 2696 51058 137515 140959 39309 129333 217865 186580 82532 114310
14095 114310 -8901 -40486 77452 29241 -113717 -134969 -132349 68342 130857 126718 115332
14084 115332 142203 109019 156301 321089 383057 276380 260088 304757 301137 113667 -43507
14073 -43507 -93025 -61458 134003 203924 125518 113706 96875 274506 274587 265577 265735 326419
14061 326419 324332 324368 300277 288604 180098 -17676 -54728 -23586 -132335 -258800 -119205
14050 -119205 73464 -868 -62934 28142 131105 205553 156159 144430 157251 219570 206695
14039 206695 150024 126403 163739 115696 90106 141661 152260 75853 31707 79327 296412
14028B96412o238o6220j0351J4337P2880L4803j29149P500N5058m3734M5044k1368
14016B48974j02746J2875M7389J45r3272R6723q0529j30461p3758p3297J54062
14005F105k351K2607J81021O5696q5158j71957m9506r598J56198M6198j08908
13994E0347n797j66441K32P6283M3038O0436J8564m3041J49782J29068J44589
13983D57060o3183q3758j337j76740k6976j3165j49655p250Q2845j18934Q7277
13972a3816P8063m3554q033P0658L7650K7665n9795j9972R3392m2089L235M9200
13960A72604J59465j12302j50907j0256Q191O6704K15103N7455j82909j52052
13950G1096j65561l2615k5501j606j01780L4193J29321K6638n1865M4726M1501
$$ plain form
14028 296412 290174 223954 213603 227940 300820 335623 206474 213974 269032 225298 270342 248974
14016 248974 146228 159103 206492 206637 113365 210088 129559 -902 -74660 -147957 6105
14005 6105 3754 26361 207382 273078 187920 15963 -33543 -43141 113057 159255 50347
13994 50347 44550 -121891 -121659 -45376 -2338 58098 76662 33621 183403 312471 457060
13983 457060 393877 310119 308782 132042 105066 91901 -57754 -65004 17841 -101093 -13816
13972 -13816 64247 20693 12660 83318 120968 148633 88838 68866 162258 120169 123404 172604
13960 172604 332069 219767 68860 58604 66795 133499 348602 406057 223148 71096
13950 71096 -94465 -127080 -152581 -154187 -255967 -221774 -92453 -65815 -117680 -72954 -31453
13939c1453k2179k7953J55916j19131o6889J02441J04099M4188K4953P3113J20199
13928C57304j08294j53260n7094j45196l394J07888J6437j18715p441K06509p4356
13917B0388j16122O5696R5165P9010M2102k40683k51871p1780K29362K86797R7353
13906B35417P1086p3867j94603L1173n283K99682K20197r6439j92436n7803n1431
13895A85693k9079K2313r4613m5764L7711L6558m0301n6148P4879J20277J01968
13884C13494M2910q761M091j31974r6191r2622j8780L7170O233q131J88341j7620
13872B18160J3680O1714J19058J06066l3000o4205o3424j51968k15080o5666O205
13861f8460J46120M3124k9396O3914N0323P4904N7567O4414O2480j33712r8743
$$ plain form
13939 -31453 -53632 -81585 74331 -44800 -111689 -9248 94851 139039 163992 237105 357304
13928 357304 249010 95750 38656 -106540 -109934 -2046 14391 -104324 -111765 94744 20388
13917 20388 -95734 -30038 65127 144137 186239 -54444 -306315 -378095 -148733 138064 235417
13906 235417 306503 232636 38033 69206 63923 363605 583802 487363 294927 237124 185693
13895 185693 156614 178927 84314 38550 76261 112819 72518 16370 91249 211526 313494
13884 313494 356404 347643 351734 219760 123569 30947 12167 49337 55570 47439 235780 218160
13872 218160 231840 293554 412612 518678 485678 421473 358049 206081 -8999 -74665 -68460
13861 -68460 77660 120784 91388 155302 205625 280529 338096 402510 464990 331278 232535
13850B32535P8548J04391j0847j62475o5944J25639L2932k22872j8368o6238Q7719
13839A15020J05484J18317J52073Q6190L20r3311j66322N6671J38592Q2945N6155
13828F52134j58180J6699P5888m4618K6210N6597O2825m6289l18362J6753N4896
13817C94553R2188L2157N9193m0809j43564J4267J30029J3832Q2493M1735j07445
13806E68629r9750m5987N8396n1975K4910K61604J90919J20517J01078M0131k5139
13795A143333J67341L11946J72411N8260q778P4428J18828J95366R2054p356k163
13784B315670q3401p8509L8621K0936j37413j37514L470j91011k29445j58473
13774A362931j76908k5423j80400q0113k4182j51811p3441M1299J7022p7664j29339
$$ plain form
13850 232535 311083 415474 404627 242152 176208 301847 334779 111907 93539 27301 115020
13839 115020 220504 338821 490894 577084 577404 484093 317771 374442 513034 595979 652134
13828 652134 493954 510653 586541 541923 568133 624730 687555 641266 322904 339657 394553
13817 394553 486741 518898 578091 537282 393718 407985 538014 551846 634339 676074 568629
13806 568629 468879 422892 481288 429313 454223 715827 906746 1027263 1128341 1168472 1143333
13795 1143333 1310674 1622620 1795031 1853291 1844513 1918941 2037769 2233135 2325189 2317833 2315670
13784 2315670 2232269 2153760 2192381 2213317 2075904 1938390 1941860 1750849 1521404 1362931
13774 1362931 1186023 1160600 980200 900087 875905 724094 650653 691952 708974 631310 501971
13763E01971j01183Q1496J17218J07705L159j36220P6699p4760j24930N1362J6364
13752E18881p1090o2239l1572L0243j1312o865j34579P5434J99623L0338J3847
13741E50709R6952J71077M8649j06404j87704r6198L3119q6341J2157M3841k6086
13730D53771k0483N9479j0819m5112k07939j29369J20895J64634M2572J32012
13720E59641J07263j10984j72899j877k2315k37827L0817J30228K09123P8374
13710E69544K6382p8864j71107k3301Q0391j22285j3033Q5466Q3967j01291n7502
13699B78367K65406N2312j25303m9750P6525J30649L0127j05930m9025j49075
13689C54303M7216J92108j35374j04456l5229O6256J27654m6055J730M6578M6627
$$ plain form
13763 501971 400788 482284 599502 707207 710366 574146 650845 576085 451155 502517 518881
13752 518881 447791 385552 353980 384223 372911 366046 231467 306901 506524 536862 550709
13741 550709 647661 818738 867387 760983 573279 477081 510200 423859 436016 479857 453771
13730 453771 433288 492767 481948 436836 228897 99528 220423 385057 427629 559641
13720 559641 666904 555920 383021 381144 358829 121002 151819 282047 491170 569544
13710 569544 595926 517062 345955 322654 403045 280760 267727 353193 437160 335869 278367
13699 278367 543773 596085 470782 421032 497557 628206 658333 552403 503378 354303
13689 354303 401519 593627 458253 353797 318568 384824 512478 466423 468153 514731 561358
13678E61358J55283j87195j29285L3765J6598j21281P2563J37057L3829j78607
13668C94085J5915r1595j70799j13361q7828J27415J18876J1989J10381m5405
13658B69673N1033J53661l2246J67065P0441R0755p2855j42607k4496R1998J06769
13647G29191k3470j04118j52204L3433r143j11504N1555L2006k4041M1298N7960
13636E20963M9560k404j44443n9406N9249j37197n8268J62650K92390j3274L3025
13625G02845M2333m0540k01524L212J78567K01081q2021J3066o071q1759j4405
13614G14784j63620j28386O7424N495O9062J64665K4830k59197r7384J21044P4477
13603E93194j20322l7110J50797n562L0190k3877K4646J26165P3874k3893l6061
$$ plain form
13678 561358 716641 529446 400161 433926 450524 329243 401806 538863 572692 394085
13668 394085 410000 318405 147606 34245 -53583 73832 192708 204697 315078 269673
13658 269673 320706 474367 442121 609186 679627 770382 697527 554920 530424 622422 729191
13647 729191 705721 601603 449399 482832 473689 362185 413740 445746 421705 463003 520963
13636 520963 570523 568119 423676 364270 423519 286322 228054 390704 683094 669820 702845
13625 702845 745178 704638 503114 506326 684893 885974 803953 817019 810948 729189 714784
13614 714784 551164 422778 490202 495697 564759 729424 754254 495057 397673 518717 593194
13603 593194 472872 435762 586559 580997 611187 587310 611956 738121 811995 788102 752041
13592G52041k21073l0353J32469O7912O3297r9539j65285J3844J06727K2787J0312
13581F53139l7598r1315m6007O5941R1096j15584J4753Q1453Q7302O809J0661
13570G20650J02832Q7831q6212j21832j54288j01407K5560J05851K20407j09617
13560F89775j62583p100J11296J2078J19298o2333j96855n0534J93456p5831O91
13549E71358K1299j38889l1799J28994k0860L1955l7362j37207k84J33885R9818
13538F20908l6499p3216j53146N6602P9147R6963N9243q091J13773p3806r3571
13527E88307L0634k5797k5938n5110Q6139l8972O7388J7728q4650P3214J48589
13516G81532P0848k4052o1287q350J21805n8423q31J02504m4533r5811J042O3677
$$ plain form
13592 752041 530968 500615 633084 700996 764293 664754 499469 513313 620040 642827 653139
13581 653139 615541 524226 478219 544160 635256 519672 534425 615878 703180 709989 720650
13570 720650 823482 911313 825101 703269 548981 447574 473134 578985 799392 689775
13560 689775 527192 520092 631388 643466 762764 700431 503576 453042 646498 570667 571358
13549 571358 592657 453768 421969 550963 530103 562058 524696 387489 387205 521090 620908
13538 620908 584409 511193 358047 414649 493796 590759 650002 641911 755684 681878 588307
13527 588307 618941 593144 567206 512096 598235 559263 626651 644379 559729 632943 781532
13516 781532 852380 828328 767041 758691 880496 822073 821242 923746 879213 783402 784444 848121
13504H48121R6966P3173J0177j25420r9340K7675O928N9505r8752p0682J5208
13493G43559K33554Q0303k3686r1691j26916l5464k4934O5265L6595Q6679j2141
13482I31123J36623J6210p7770J12383M2788q692M6457J47421l6213p6272j30207
13471A103851J26455K69827J75562Q4488k0261m8401K4913J00896o838n7050J6342
13460A769784Q3113R0415J98984O6359r4689K2429K4680R3062J93208L1641L2038
13449B511024J2471j530J96953K09498K21470K41622K3148K67813J50979J06833
13439C940281K47046J65798J42201K22028N695K13315K19129Q8315M1625N2343
13429E337776P424N9377J24361P5902N3717K64324K01676q925L94957L02169J41886
$$ plain form
13504 848121 945087 1018260 1028437 903017 803677 831352 838280 897785 799033 728351 743559
13493 743559 977113 1057416 1033730 942039 815123 779659 754725 819990 856585 943264 931123
13482 931123 1067746 1083956 1006186 1118569 1161357 1152665 1199122 1346543 1310330 1234058 1103851
13471 1103851 1230306 1500133 1675695 1760183 1739922 1691521 1716434 1817330 1810492 1753442 1769784
13460 1769784 1852897 1943312 2142296 2208655 2113966 2136395 2161075 2254137 2447345 2478986 2511024
13449 2511024 2523495 2521965 2718918 2928416 3149886 3391508 3414656 3682469 3833448 3940281
13439 3940281 4187327 4353125 4495326 4717354 4723049 4936364 5155493 5243808 5285433 5337776
13429 5337776 5345200 5404577 5528938 5604840 5658557 5922881 6124557 6115632 6510589 6812758 6954644
13418F954644J44505K73376M04733L81698M63108M82672L95529M43893M74757
13409A0418915L79464N01388N70657O79164R25865J028329R69426Q92471J118142
13400A7483821J196286J165229J410192J694336J741783J952043K203788K370466
13392C1217944K635233K996379L212800L495667L842811M018606M082664L911712
13384E9413816L834492L466378K793923J999508J256912L65736l06393r34817
13376G1889555j608209k107960k182435k321631k420281k325824k175743j870075
13368E4877397j530294j468589j192821p27358l26110o3356J39846N07385P10513
13359E0926613J149391J425471J757249K052373K208890K587925K834427K634266
$$ plain form
13418 6954644 7099149 7372525 7777258 8158956 8622064 9104736 9500265 9944158 10418915
13409 10418915 10798379 11299767 11870424 12549588 13475453 14503782 15473208 16365679 17483821
13400 17483821 18680107 19845336 21255528 22949864 24691647 26643690 28847478 31217944
13392 31217944 33853177 36849556 40062356 43558023 47400834 51419440 55502104 59413816
13384 59413816 63248308 66714686 69508609 71508117 72765029 73130765 72824372 71889555
13376 71889555 70281346 68173386 65990951 63669320 61249039 58923215 56747472 54877397
13368 54877397 53347103 51878514 50685693 49958335 49632225 49568869 49708715 50216100 50926613
13359 50926613 52076004 53501475 55258724 57311097 59519987 62107912 64942339 67576605
13351F7576605K564255K556790J981526J309303P31799j29517j175484k043437
13343G3371840k846403l568024m040315m334365m367124m366091m222755l823753
13335D1803010l508347l498388l243737k693909k495941k240659k006104j819262
13327B0296663j610070j537082j270437j074130j054102q44478p47659o26820
13319A1531885n82054r27482o37170k97879m93949l47244j75372k93527k33041
13310G544167k39286l04329k46531k54825k72526p3816j04026n6597m03624j61688
13300E426919k07147l34375k48045p9514M1919j37223q0247q0326j62100j55527
13290C984334j11056p1673o0575j35940L0285M2507P270m2698M8021J55870O2175
$$ plain form
13351 67576605 70140860 72697650 74679176 75988479 76720278 76590761 75415277 73371840
13343 73371840 70525437 66957413 62917098 58582733 54215609 49849518 45626763 41803010
13335 41803010 38294663 34796275 31552538 28858629 26362688 24122029 22115925 20296663
13327 20296663 18686593 17149511 15879074 14804944 13750842 12906364 12158705 11531885
13319 11531885 10949831 10022349 9385179 9087300 8593351 8246107 8070735 7777208 7544167
13310 7544167 7304881 7000552 6754021 6499196 6226670 6152854 6048828 5992231 5588607 5426919
13300 5426919 5219772 4885397 4637352 4557838 4599757 4462534 4382287 4301961 4139861 3984334
13290 3984334 3873278 3801605 3741030 3605090 3635375 3677882 3685152 3642454 3690475 3846345 3908520
13279C908520j9115q4530j23518j9422N6862j02904j84627L7333R1423n050M0674
13268C595646k9527j99600k86232j8769j04264o7484L3341k140p7303q4991k3934
13257B734743P181J2571m6938J09586K1473j4349P5136K6709r1228l84952N6198
13246B506130J86435J97967o459J30327K56705N2107o6903J85928j1944p4009
13236C356284J61647J6654J12797J58003O7485J38532J51873K71180K54007K39854
13226D928316K81159J46548K12409J97435K83936L84374M48185M12829M14238
13217G709429M84104K11957L62396N61163N72588O20487P01489P49448Q55647
13208A2828708Q18947R62611J023815J006694R90497J111247J184629J053040
$$ plain form
13279 3908520 3889405 3804875 3681357 3661935 3718797 3615893 3431266 3468599 3560022 3554972 3595646
13268 3595646 3566119 3366519 3080287 3061518 2957254 2889770 2923111 2920971 2843668 2758677 2734743
13257 2734743 2741924 2754495 2707557 2817143 2838616 2824267 2899403 2926112 2834884 2449932 2506130
13246 2506130 2692565 2890532 2884073 3014400 3271105 3323212 3256309 3442237 3430293 3356284
13236 3356284 3517931 3534585 3647382 3805385 3872870 4011402 4163275 4434455 4688462 4928316
13226 4928316 5209475 5356023 5568432 5765867 6049803 6434177 6882362 7295191 7709429
13217 7709429 8193533 8405490 8767886 9329049 9901637 10522124 11223613 11973061 12828708
13208 12828708 13647655 14610266 15634081 16640775 17631272 18742519 19927148 20980188
13200B0980188J269036J287400J033765J190662J371830J218577J085883J038762
13192C0476103J107617R42130Q86155Q96075R43899Q66815Q27798P74617O96729
13183C8417938P16662O79161O73157P77335P35942P39255Q68815R47898R64009
13174D5520172J085674J017004J048920J022719J002978J136746J114933J131145
13166E4080291J136006J030788P23942P21278O24073N84709M08147J76393J02369
13157E9587996j84103l40317n17934o88434o22167o77598j017243j011126r54263
13148E3574811j143481j279536j234520j023261j005123j274099j036894q78037
13140D4699860r66710p11909q71987p27346o06614r11471p93342p35909o11251
$$ plain form
13200 20980188 22249224 23536624 24570389 25761051 27132881 28351458 29437341 30476103
13192 30476103 31583720 32525850 33412005 34308080 35251979 36118794 36946592 37721209 38417938
13183 38417938 39134600 39813761 40486918 41264253 42000195 42739450 43608265 44556163 45520172
13174 45520172 46605846 47622850 48671770 49694489 50697467 51834213 52949146 54080291
13166 54080291 55216297 56247085 56971027 57692305 58316378 58901087 59309234 59485627 59587996
13157 59587996 59403893 59063576 58545642 57857208 57235041 56557443 55540200 54529074 53574811
13148 53574811 52431330 51151794 49917274 48894013 47888890 46614791 45577897 44699860
13140 44699860 43733150 43021241 42149254 41421908 40815294 39903823 39110481 38374572 37763321
13131C7763321p57580q00127r22143q62308p73192q93073j058005q66647q43827
13122B9986419j131168j151654j094855j076357j075592j385187j234896j151455
13114B0685255j048395j130835j247942j043895r64796p45121q14405q25957p20483
13105A2143426p32492q13406o52166m41070n72726o57502o84018l40138l66798
13096F883110l85174m24480m17126j71099j43629j79631m38988k98962j70498
13087D253523j71175j57234k01814k03649j3561M2894M9825j29858j40457j03181
13077C225313j62099j14882L404q1436j77120j12514k10083r1243p8280k0765
13067B180295J60357P8479p5192j19933q0454p3232k5185k7348L1836k9392o5630
$$ plain form
13131 37763321 37005741 36205614 35283471 34421163 33647971 32754898 31696893 30830246 29986419
13122 29986419 28855251 27703597 26608742 25532385 24456793 23071606 21836710 20685255
13114 20685255 19636860 18506025 17258083 16214188 15249392 14504271 13689866 12863909 12143426
13105 12143426 11410934 10597528 9945362 9504292 8931566 8274064 7590046 7249908 6883110
13096 6883110 6497936 6073456 5656330 5485231 5341602 5161971 4722983 4424021 4253523
13087 4253523 4082348 3925114 3723300 3519651 3506090 3548984 3598809 3468951 3328494 3225313
13077 3225313 3063214 2948332 2951736 2870300 2693180 2580666 2370583 2279340 2201060 2180295
13067 2180295 2340652 2419131 2343939 2224006 2143552 2070320 2045135 2017787 2049623 2020231 1954601
13056A954601j45089k51444p6427m8544j15313m3267o567J7090k9402q9627p9992
13045A086019L5294J3746Q5401M8060N9479o5015L0472o6606p7463j56502j6963
13034I75922J16727K18616k9204j47584l6190Q4265J19638k55249j05039J35293
13024A077195J9830j10698j16178N7841j09520j15124j36856J88905O8879N6205
13014H80479o4444j50453M129O2796J02103p2096p1474K2835N1973l7991j3956
13003G13901p0646m1716J50383J33575N6361J18057n8941r5499q0264r7228n4959
12992F73024R047J06561J37174o4993Q046R8157p2050N695n3502j16842j23837
12981F06480J15291j3213M4675R4568j02786k13680k50555K6248R7991o2579p2291
$$ plain form
13056 1954601 1809512 1558068 1481641 1433097 1317784 1274517 1267950 1285040 1255638 1166011 1086019
13045 1086019 1121313 1135059 1220460 1268520 1327999 1262984 1293456 1226850 1149387 992885 975922
13034 975922 1092649 1311265 1282061 1134477 1098287 1182552 1302190 1046941 941902 1077195
13024 1077195 1097025 986327 870149 927990 818470 703346 566490 755395 824274 880479
13014 880479 816035 665582 669711 732507 834610 762514 691040 713875 765848 727857 713901
13003 713901 643255 601539 751922 885497 941858 1059915 1000974 905475 825211 727983 673024
12992 673024 682071 788632 925806 860813 868859 967016 894966 900661 847159 730317 606480
12981 606480 721771 708558 753233 847801 745015 531335 280780 307028 405019 342440 270149
12970B70149k4178M322M4288k6147n3191K49510J23519j57510j25864j21761r575
12959A73562J09830N7326Q5058j8641J8079n1325j1800J03323J59678K5475j74111
12948D76454j34746K05285K21472p060r1706q1021n9758l6921m2293j38809p7887
12937B33010Q7832J22347J30124Q7537J0250J26873j3849j09946m170j23548r3687
12926D52773R8290R9153O745p2578o7123l1330J08899K37898j42953j26488k7922
12915E35364J21033J0100o530m1953o7102J29084N3156J6556L0988K9875L9429
12904H50000n5386j10880L7012J47393L753N1483Q8231j0311q629r4899j04509
12893G93258o074J34194R0152r4202p0899n8324l710j28385j77785o7790P1264
$$ plain form
12970 270149 245971 250293 294581 268434 215243 464753 588272 430762 304898 183137 173562
12959 173562 283392 340718 425776 407135 425214 373889 362089 465412 625090 650565 476454
12948 476454 341708 546993 768465 761405 669699 588678 528920 491999 449706 310897 233010
12937 233010 320842 443189 573313 660850 671100 797973 784124 674178 670008 546460 452773
12926 452773 551063 650216 656961 584383 517260 485930 594829 832727 689774 563286 535364
12915 535364 656397 666497 659967 618014 550912 679996 733152 749708 780696 810571 850000
12904 850000 794614 683734 720746 868139 871892 923375 1011606 1001295 992666 897767 793258
12893 793258 787184 921378 1011530 917328 846429 788105 784395 656010 478225 410435 481699
12882D81699J49517J19485R7803j650j50668j54701l2641r4329N4409J30435l0332
12871E69027q9216K0164n3500L1002k6921m6030J5574m825J5875j53655O9659
12860C47154J14040j04185N3734R561n7975k58819j2178J69502o108l7205J17000
12849C34521n4693L9746N3087Q806k8726P1727J1371j06065j95124N0249j945
12838A82954J28073J29990M9317j2902O8971J1519q7455o1187m2637o3151M7550
12827C51042m1918j91563J7591N2803M7833J64995L335l0427l6698j18914p0496
12816A47583n6728j4105p9836Q9010R1445J4632J27262r2069p6243K7815J07351
12805B86117M4879k1182k35184j60123o1634n2928J36371J2004J25298K74536
$$ plain form
12882 481699 631216 750701 848504 846854 696186 541485 508844 414515 468924 599359 569027
12871 569027 479811 499975 446475 477477 450556 404526 420100 415275 431150 277495 347154
12860 347154 461194 357009 410743 420304 362329 103510 91332 260834 254726 217521 334521
12849 334521 279828 319574 372661 381467 352741 424468 435839 329774 134650 184899 182954
12838 182954 311027 441017 490334 477432 546403 557922 470467 409280 366643 303492 351042
12827 351042 309124 117561 135152 187955 235788 400783 404118 373691 336993 218079 147583
12816 147583 90855 76750 -3086 85924 177369 192001 319263 227194 150951 178766 286117
12805 286117 330996 309814 74630 -85493 -147127 -200055 -63684 -51680 73618 348154
12795C48154J19877j00190n9107J2495j5062k52057n9298P2328Q0694j76803L747
12784b5222K00439R9483p9697r35j95399p9m1829j34089M2969J10234K9570L5742
12772D1187M7135J26022k3906J33424K03977J01142j77731j42915o8809n9147
12762A80379j9957L2227p134j04804l9118L5031M2580m8836O2197j08175O8733
12751I3123j04033O0606m0722j72617J42760L18853K13205L7322n6444m5089j06846
12740C40118q4641Q4367J31237L0810p557k8057l3350j16632q1426L584r5920
12729A42533j8750k1101O4120k9498j03271N2415Q8454M0532L4861j31177J8487
12718A37605Q2540o1015K0205n4184J73129L3542P0269P1666j7075J7486M5737
$$ plain form
12795 348154 468031 367841 308734 321229 306167 54110 -5188 67140 147834 -28969 -25222
12784 -25222 175217 274700 195003 194068 -1331 -1410 -43239 -177328 -134359 -24125 5445 41187
12772 41187 88322 214344 190438 323862 527839 628981 451250 308335 239526 180379
12762 180379 160422 192649 185515 80711 41593 76624 119204 70368 132565 24390 93123
12751 93123 -10910 49696 8974 -163643 -20883 297970 511175 548497 492053 446964 340118
12740 340118 255477 339844 471081 501891 494334 466277 432927 316295 234869 238453 142533
12729 142533 123783 102682 166802 137304 34033 86448 174902 215434 250295 119118 137605
12718 137605 220145 159130 179335 125151 298280 331822 402091 473757 456682 474168 519905
12707E19905Q5939J24336J6107L2897j03782l3609n0687j64695j77528Q198j19424
12696A37657J6730J04429J64132N1342P4340j39072j6641r8746l6813J31396J14510
12685E03264L7815q6964M000J61530j2687j74894j31510M6835k3526m9931N2406
12674C26338n0389j00274j90696l3641O4520o8401j38o211J00825O9871Q8154
12663A99958r0445L4603q860j7780K45796J16155r6528l7424j07063J621l7811
12652B02222M3685M9983J30465j03952j65733j10080Q0152J20276m3888N5046
12642B58176J73868N240k02993q9413o987P9020K2654Q3987K2305n4835n7300
12631B33722R6197p5283n792J03522P137J16431Q400j68458L19j23957r1930J63827
$$ plain form
12707 519905 605844 730180 746287 779184 675402 641793 591106 426411 248883 257081 137657
12696 137657 154387 258816 422948 474290 548630 409558 392917 294171 257358 388754 503264
12685 503264 541079 454115 458115 619645 606958 432064 300554 347389 323863 273932 326338
12674 326338 275949 175675 -15021 -48662 15858 -52543 -52681 -58892 41933 111804 199958
12663 199958 109513 144116 135256 117476 363272 479427 382899 345475 238412 240033 202222
12652 202222 245907 295890 426355 322403 156670 46590 126742 247018 203130 258176
12642 258176 432044 437284 234291 144878 137891 216911 239565 323552 345857 291022 233722
12631 233722 329919 254636 248844 352366 359503 475934 484334 315876 316195 192238 100308 264135
12619B64135N3709O9184j44069j7551P72l3685k09715j61519n7348K1463J36102
12608g8522J84945J76445m0684j7016P6430j04233p0702r9271l2913k9917N0990
12597A5552j542J4925q9074n3184l7894Q9492K320m2641R2461J17476M6380l2340
12585A21931k44654m6996J18134J48465Q2581L9216n5216p4641k2152j95777k22017
12574c51126l5178K01884Q1687m9598K1362L0053m3670K08581O6913k504q1472
12563D6932O2344K3542J9493J8128l4404p0119L3160j93181L8595l3605L5736
12552e3379P0625L2965j22298R0511o3310K669J86l2539j1826k2743J58795R322
12540E8978q668o5716j34376j3993J88920J16703k3708j5711k2552n2863J00319
$$ plain form
12619 264135 317844 387028 242959 225408 226180 192495 -17220 -178739 -236087 -214624 -78522
12608 -78522 106423 282868 242184 225168 301598 197365 126663 27392 -5521 -35438 15552
12597 15552 14010 28935 -60139 -113323 -151217 -61725 -59405 -102046 -9585 107891 154271 121931
12585 121931 -122723 -169719 -51585 96880 179461 218677 163461 88820 66668 -129109 -351126
12574 -351126 -386304 -184420 -102733 -152331 -130969 -100916 -144586 63995 130908 128404 46932
12563 46932 109276 132818 152311 170439 136035 65916 99076 -94105 -55510 -89115 -53379
12552 -53379 17246 50211 -72087 18424 -44886 -42217 -42031 -74570 -86396 -109139 49656 58978
12540 58978 50310 -15406 -149782 -163775 25145 141848 118140 102429 79877 27014 127333
12529A27333n9089r8244N2836J13083J40691J0079M908k06079N0651p8354j86632
12518a28817n455K21736R7078L8138R8460N8135j20545q7547q0403q7208j0276
12507f704J81479k9080M9900N3124n5302q676m8742r0164J8591P111J63346k8668
12495B06215n4633R949K7361m6146o0386j8767l6211J4838J8629K01182j64667
12484I7364j17845J76333M9823Q8112j6285j4122j43096p2691j5640J05647J0891
12473A48491j12700P4209P6533J23658k21079n4565k2555N8509K0004p4170K7330
12462D3665l144O0885J82191J6308o2401q5014L145k1034n8688r6554M6172K4092
12450D9623R0317M4835L380m6701q4377L7562m516p5256M975K0150J974j71899
$$ plain form
12529 127333 68244 -30000 22836 135919 276610 286689 291597 85518 136169 57815 -128817
12518 -128817 -134272 87464 184542 222680 321140 379275 258730 171183 90780 3572 -6704
12507 -6704 174775 145695 195595 248719 193417 184741 135999 45835 64426 71537 234883 206215
12495 206215 151582 161531 188892 142746 82360 63593 27382 42220 60849 262031 97364
12484 97364 -20481 155852 205675 293787 277502 263380 120284 47593 31953 137600 148491
12473 148491 35791 110000 186533 310191 89112 34547 11992 70501 90505 16335 43665
12462 43665 40521 101406 283597 299905 237504 152490 155635 134601 75913 -20641 25531 49623
12450 49623 139940 184775 188155 141454 57077 94639 90123 14867 19842 39992 41966 -129933
12438a29933j4411P9370L4425L9165J21140J57261q9059j26773O6193j2226J1030
12427A36182q0626O3509J81894r2813j99551J4060m8941l0553o8463J01771J14927
12416I1396m8602j84163J13652k3112O4300J50793J1917j5149J5870J6920O0488
12405B54310L7926r3688m5794l8123O4024j42054j46615R0864Q9925n4917m0024
12394b4166O0545k351J08564K29385O9090j48467j35555k9102o9623j1998j19329
12383g3007Q0320J10105k7217N9503M069K2501R3099K44576o103j26580j8236
12372C63030j91137r3164L174j05543J15287K47742p1353k50306m2570m1086K7557
12361c8369J40989q77j7373r4373m2580J75978Q7142l38p6256k6810L2105j00211
$$ plain form
12438 -129933 -144344 -64974 -30549 8616 129756 287017 197958 71185 137378 125152 136182
12427 136182 55556 119065 300959 208146 8595 22655 -26286 -56839 -125302 -23531 91396
12416 91396 42794 -141369 -27717 -50829 13471 164264 176181 161032 176902 193822 254310
12405 254310 292236 198548 152754 114631 178655 36601 -110014 -19150 70775 15858 -24166
12394 -24166 36379 34028 142592 371977 441067 292600 157045 127943 58320 46322 -73007
12383 -73007 7313 117418 90201 149704 153773 176274 269373 513949 507846 381266 363030
12372 363030 171893 78729 81903 -23640 91647 339389 268036 17730 -24840 -65926 -38369
12361 -38369 102620 101743 84370 -10003 -52583 123395 210537 210199 133943 107133 139238 39027
12349C9027R1610k6123L9608N5392j42410r8169M7383m3160m4613j04651J21124
12338f4982J55019k5267J66992R4412k04710j83581Q3234j9026l2264K1778P0591
12327F2196n3077k481K38320N8624j27005q8574m4744L8379L5218m7668L3802
12316A02990J36438J16360q7784k98207m3643R9177J96485J51565q3037o0773
12306B29571j76043K3050K24689J4025k71655o3305J14972J78359O6377m5834
12296B94206k82910j2335Q0100Q1602R548j08201R5801J27979K1632O0355N9555
12285D27332m7147j64563o5512j3560K5568r1815L6907J35429K74194J57870Q3139
12274G57842l6871P3914r2637j17076j29967k3781l1352j03629r6137q1558r7225
$$ plain form
12349 39027 130637 104514 144122 199514 57104 -41065 6318 -36842 -81455 -186106 -64982
12338 -64982 90037 64770 231762 326174 121464 -62117 21117 2091 -30173 -8395 62196
12327 62196 9119 6638 244958 303582 176577 88003 43259 81638 116856 69188 102990
12316 102990 239428 355788 268004 -30203 -73846 25331 221816 373381 290344 229571
12306 229571 53528 76578 301267 315292 43637 -19668 95304 273663 340040 294206
12296 294206 11296 -1039 79061 160663 170211 62010 157811 285790 307422 367777 427332
12285 427332 380185 215622 150110 136550 162118 70303 107210 242639 516833 674703 757842
12274 757842 720971 794885 702248 585172 455205 431424 400072 296443 200306 118748 21523
12263B1523n4229K0343K949K5830M429Q4129J8200P2459J4862n8986J69566R6118
12251D17193o5808o8393m0729J66141m696r0910K0631p1142m9487J04957m4189
12240B73568j20611R6543J58244N7951N7369j36461o0633j00710J43259J34427
12230E02946k5884n9003r4039k08709j49573J96697J44287m9175J38983N5768
12220D52298m7351l2864l1591N140q2984K1418n6777L4524Q2042M7520j01370
12209B90005o4320R7328M0048j35966k20736j63104N4627J82563K98848J93378
12199E72671K5687R7719J73662j23415o8654k1316j55976n0973P874j47755j47767
12188A61757N9564R2177J72138J9650j6357K62163P3566q8359j44602k7608j00676
$$ plain form
12263 21523 -32706 -12363 -9414 16416 20845 104974 123174 195633 210495 151509 321075 417193
12251 417193 351385 282992 242263 408404 403708 312798 333429 262287 212800 317757 273568
12240 273568 152957 249500 407744 465695 523064 386603 325970 225260 368519 502946
12230 502946 477062 418059 324020 115311 -34262 162435 306722 257547 396530 452298
12220 452298 404947 372083 340492 345632 262648 284066 227289 261813 343855 391375 290005
12209 290005 225685 323013 363061 227095 6359 -156745 -102118 80445 379293 572671
12199 572671 598358 696077 869739 746324 677670 656354 500378 449405 457279 309524 161757
12188 161757 221321 313498 485636 505286 488929 751092 824658 736299 591697 564089 463413
12177D63413J39060q3029R9776q983k01431j15179j17254k2176J09871k5592P3194
12166C11670K1875j22790N1540P8503O195K7806n7242K3924R9107L1071m3341
12155D28318N4318j18071K08304m9972j0665j9622p8896l876j25300j24575J2392
12144A72355J51836N37N3278n1880k2843P6686P2747J2188j72294k08417k3342
12133F0851K50902j27988k9022m4254J46309k0448L2077k0224m5093K2557k9882
12122A95785q041J72584M1489q9773j1165K4702J60272L4671j16921l0174M2171
12111D15600j41179j26733j08924J58272J5607l4771J37112n6246l2248k0636
12101B05854J11928Q8798j73879j17232m4052k4588k5028l2019n2308n5559J79440
$$ plain form
12177 463413 602473 519444 619220 610237 408806 293627 176373 154197 264068 238476 311670
12166 311670 333545 210755 262295 340798 346993 374799 317557 341481 440588 471659 428318
12155 428318 482636 364565 572869 522897 512232 492610 413714 409838 284538 159963 172355
12144 172355 324191 324728 378006 326126 303283 379969 452716 464904 292610 84193 60851
12133 60851 311753 183765 154743 110489 256798 236350 268427 248203 203110 225667 195785
12122 195785 187744 360328 401817 312044 300879 325581 485853 520524 403603 373429 415600
12111 415600 274421 147688 38764 197036 212643 177872 314984 258738 226490 205854
12101 205854 317782 406580 232701 115469 71417 46829 21801 -10218 -62526 -118085 61355
12090F1355J29469Q4352n9260q4669n2176J60248J86392l2123k42926L7455K89124
12079D77241Q0336o2302R6035K6801L9504J6051Q1291J9089J0198l0664j48873
12068F04707p9639J42243K75999J36708R8860J05546M6427j12206o0733k30524
12058I27388j73227m5665p878J8312M1768q2847j04840J05570K30118j07118l7985
12047G63596J32856r4457j26056O7607Q209J28209J58310O8619j64243j44072
12037G98578r3517R1778j2148N0736N1954P5048p3576o8783K9563L962O0118j97019
12025G16694q8998M6153K16198K62681J73582L7122O2413R4473j89429Q82J17739
12014A449510m6946k5908P4723p2896P9359m0397l2848K3806N8397P2791Q1921
$$ plain form
12090 61355 190824 275176 215916 131247 79071 239319 425711 393588 150662 188117 477241
12079 477241 557577 495275 591310 618111 657615 673666 754957 774046 784244 753580 604707
12068 604707 525068 667311 943310 1080018 1178878 1284424 1330851 1218645 1157912 927388
12058 927388 754161 708496 700618 718930 760698 677851 573011 678581 908699 801581 763596
12047 763596 896452 801995 675939 743546 751755 879964 1038274 1106893 942650 798578
12037 798578 705061 796839 784691 835427 887381 962429 888853 820070 849633 853595 913713 716694
12025 716694 627696 673849 890047 1152728 1326310 1363432 1425845 1520318 1330889 1331771 1449510
12014 1449510 1402564 1376656 1451379 1378483 1457842 1417445 1384597 1408403 1466800 1539591 1621512
12003A621512O6082R7740k7949n8256p992o8955k1063r2828R367j7138K25284
11992A725804J65338l0429L9843J47135J00842J82191K55442J75713m5612p3509
11982B642758P4590R2503K17159K93304k0209M6862J19940L10841J48913K01961
11972D128622K15400J53020J29816K81165N28449L36894M38174M90052L90025
11963G091617M24755M85522O16376Q22284Q09765Q05096R00290J124397J297714
11954A4377816J525922J874822K215942K550358K886263L639391M497251N403217
11946C8970982O782052Q682024J0964538J3833548J7917266K3200749K9377775
11939A49728934L5739638L9282586L5932311K3282754M464154j3938764k7226755
$$ plain form
12003 1621512 1687594 1785334 1757385 1699129 1691137 1622182 1601119 1508291 1517658 1500520 1725804
11992 1725804 1891142 1860713 1900556 2047691 2148533 2330724 2586166 2761879 2716267 2642758
11982 2642758 2717348 2809851 3027010 3320314 3300105 3346967 3466907 3777748 3926661 4128622
11972 4128622 4344022 4497042 4626858 4908023 5436472 5773366 6211540 6701592 7091617
11963 7091617 7516372 8001894 8618270 9440554 10250319 11055415 11955705 13080102 14377816
11954 14377816 15903738 17778560 19994502 22544860 25431123 29070514 33567765 38970982
11946 38970982 45753034 54435058 65399596 79233144 97150410 120351159 149728934
11939 149728934 185468572 224751158 260683469 283966223 288430377 274491613 247264858
11932B47264858l3911171l4527104l1133453k6340637k1399284j7242941j3824296
11925F8885972j0978840r017992p179906n721669m824506l980089l296094k770579
11917B1116297k332121j888340j681339j292476j052329j058557r82293p79256
11909A0049586q32091o33581o06994n31107l01686k82141l61382m37838j29604
11900E933162l72802m96815m19275q9134n2649k11742l07073k38622j18335M1986
11890C668701q5656j31901r6748r284j09032r1885o4868o4521q6369j24963k59175
11879B544299p3788L2401m2243M2171l2316o5736p4236j67151m2309J56111p3549
11868B203654j76097o1748l3974p0213J33663J61193K8609k05096r0522J56954
$$ plain form
11932 247264858 213353687 178826583 147693130 121352493 99953209 82710268 68885972
11925 68885972 57907132 48889140 41709234 35987565 31163059 27182970 23886876 21116297
11917 21116297 18784176 16895836 15214497 13922021 12869692 11811135 10828842 10049586
11909 10049586 9217495 8583914 7976920 7445813 7144127 6861986 6500604 6062766 5933162
11900 5933162 5560360 5063545 4644270 4555136 4502487 4290745 3983672 3745050 3626715 3668701
11890 3668701 3583045 3451144 3354396 3345112 3236080 3144195 3079327 3014806 2928437 2803474 2544299
11879 2544299 2470511 2502912 2460669 2502840 2470524 2404788 2330552 2163401 2121092 2277203 2203654
11868 2203654 2027557 1965809 1931835 1861622 1995285 2156478 2185087 1979991 1889469 2046423
11858B046423L6912r3098J25972R4459L6702p8949o8548J19903O7006N0729q5036
11847B252475L4755o4726n1390J30644l6155k0353L7610R9576J09412M2613J10489
11836B644950K23712P9221Q999J10149J41711L5797M927J47400L46769Q2682J20343
11825C946660K11845K04500K00880J21143J09279K62571L13031K73647L24869
11816E968425J39439L52913L88823M01847M69598M47845M89918P67137N47671
11807I973616K65379L77397L76006O20973O98052O15792M60013O17242N10921
11798A4515391N51362Q93208Q05008O81223O54934O72555O97434P36251R34439
11789B1141805Q15897R50466P14937P41413O84552Q27713O88702P84152R29793
$$ plain form
11858 2046423 2083335 1990237 2116209 2210668 2247370 2168421 2099873 2219776 2286782 2337511 2252475
11847 2252475 2287230 2222504 2171114 2301758 2265603 2245250 2282860 2382436 2491848 2534461 2644950
11836 2644950 2868662 2947883 2956882 3067031 3208742 3244539 3249466 3396866 3743635 3826317 3946660
11825 3946660 4158505 4363005 4563885 4685028 4794307 5056878 5369909 5643556 5968425
11816 5968425 6107864 6460777 6849600 7251447 7721045 8168890 8658808 9425945 9973616
11807 9973616 10238995 10616392 10992398 11613371 12311423 12927215 13387228 14004470 14515391
11798 14515391 15066753 15959961 16764969 17446192 18101126 18773681 19471115 20207366 21141805
11789 21141805 21957702 22908168 23623105 24364518 25049070 25876783 26565485 27349637 28279430
11780B8279430P91147P53819N75747L11006M12082M19965L68927M07860J00157
11771C2420140K39814K09875O7797P0503Q3711m0870k17151j93233j44051m04469
11761C2092066j52190m58303o22744n28530m53662o69790n21853m45546n00698
11752B7738750o14420n33006n30824n19848m44989m39058n93596m78734k84937
11743B3299338k83110l19330l90935k13205k34169j37348j30639k40316j57455
11734B1192831m7766q7440j27688J38180J61966J69142L50029L18227K69980M24283
11724B2761744M36539M68569N20995N74877O51130M47431O29149R31949O62461
11715B8084844O32640O52331P28036Q89295P01114Q74395P91928Q34341O04488
$$ plain form
11780 28279430 29070577 29824396 30400143 30711149 31123231 31543196 31912123 32319983 32420140
11771 32420140 32659954 32869829 32937626 33008129 33091840 33050970 32833819 32640586 32496535 32092066
11761 32092066 31939876 31481573 30858829 30330299 29876637 29206847 28684994 28239448 27738750
11752 27738750 27124330 26591324 26060500 25540652 25095663 24656605 24063009 23584275 23299338
11743 23299338 23016228 22696898 22305963 22092758 21858589 21721241 21590602 21350286 21192831
11734 21192831 21145065 21057625 20929937 21068117 21230083 21399225 21749254 22067481 22337461 22761744
11724 22761744 23198283 23666852 24187847 24762724 25413854 25861285 26490434 27422383 28084844
11715 28084844 28717484 29369815 30097851 30987146 31688260 32562655 33354583 34188924 34793412
11706C4793412O40906P98959O75874N80191N92808N42008M71193N57360M99573
11697D0152284L44581J50851J5236o1361J36531j72223k31807k22626j42760l99582
11687C9569124n87091m72312o23756o16764o33031p95273n81095p92029r89940
11678C3477833j061196q78662r17881r43939r91514r61681q88103r45316j026362
11669B4863179r17897r33908j042106j003860p28975q28046q21714p04506q84690
11660A6997477r28977q74051r59292q86617q92241n76597m73806o58235p11219
11651A0036442p84021l63095m19385n35483n46404l32301k84269k93150n03887
11642E974447l16266l29627j85719k84757m12964k05370j90722j65534k72163
$$ plain form
11706 34793412 35434318 36233277 36909151 37489342 38082150 38624158 39095351 39652711 40152284
11697 40152284 40496865 40647716 40662952 40601591 40738122 40565899 40334092 40111466 39968706 39569124
11687 39569124 38982033 38509721 37885965 37269201 36636170 35840897 35259802 34467773 33477833
11678 33477833 32416637 31537975 30620094 29676155 28684641 27722960 26834857 25889541 24863179
11669 24863179 23945282 23011374 21969268 20965408 20236433 19408387 18586673 17882167 16997477
11660 16997477 16068500 15194449 14235157 13348540 12456299 11879702 11405896 10747661 10036442
11651 10036442 9252421 8889326 8469941 7934458 7388054 7055753 6771484 6478334 5974447
11642 5974447 5658181 5328554 5142835 4858078 4445114 4239744 4049022 3883488 3611325
11633C611325j39467k62069j05976k42290j66715o7841l3415j79304Q0245p9697
11623B414796q7906p5887R665j0982k19903k14730J23165J01136n8385j08010
11613A872959q3081N6110r7462j57110j66262Q9567K02024r6082l0433M7527j0586
11602A627171m9753j48840j46450J00008k8145k0171m6696j44856l0849K6364
11592A137783J26480P5711p9855J299o744o305j3747o09R5393P3140O2557j22366
11580A342737m8828j29094j94759j26550j07312L0401J8676M6152J51336R5689
11570A078448M8673K4045j04302j52261q5503J28835K5931n290q266p1151j85578
11559F93581n5646P7628n0223J07167q1521Q981l1284L633J42952J12647m8928
$$ plain form
11633 3611325 3471858 3209789 3103813 2861523 2694808 2626967 2593552 2414248 2494493 2414796
11623 2414796 2326890 2251003 2260668 2249686 2029783 1815053 1938218 2039354 1980969 1872959
11613 1872959 1789878 1845988 1748526 1591416 1425154 1514721 1716745 1620663 1590230 1637757 1627171
11602 1627171 1577418 1428578 1282128 1382136 1353991 1333820 1287124 1142268 1111419 1137783
11592 1137783 1264263 1339974 1260119 1261418 1254674 1248369 1234622 1234013 1329406 1402546 1465103 1342737
11580 1342737 1293909 1164815 970056 843506 736194 766595 785271 831423 982759 1078448
11570 1078448 1127121 1151166 1046864 894603 809100 937935 963866 958576 950310 879159 693581
11559 693581 637935 715563 665340 772507 690986 699967 668683 672316 815268 927915 878987
11548H78987k10254n1515J33Q6049J2205K3681o8873L3552J07695P4125m3845
11537H41940k0828k638o1490k9705j62377j75840J28053J5187j32336p2320K2958
11526C50604L5468P8506O5720J34394K09647q098j32515p9670L7790j27873m9411
11515E14562j07679p2644K03397J70564J45575M0471O1137r3144j95023J55452
11505H22668M2278o2371l3019l0970j10034J15773r6527J3233q2445j57650J51282
11494E72218K9597J855k8542r6999j53492O1376J17982j8538n4444J72498N2624
11483F56135k9410k23005q7977o2485L1045J53419l6387J43936L02169J00443
11473I47883j75151k75339j72308n8008K6872N9110R7713L9580p5890K2189M7156
$$ plain form
11548 878987 668733 617218 617351 703400 715605 739286 670413 703965 811660 885785 841940
11537 841940 821112 818474 756984 727279 564902 389062 517115 532302 399966 327646 350604
11526 350604 386072 464578 530298 664692 874339 866241 733726 654056 691846 563973 514562
11515 514562 406883 334239 537636 708200 853775 894246 955383 862239 667216 822668
11505 822668 864946 802575 769556 738586 628552 744325 647798 661031 578586 420936 572218
11494 572218 601815 603670 575128 478129 324637 386013 503995 485457 431013 603511 656135
11483 656135 626725 403720 315743 253258 284303 437722 401335 545271 847440 947883
11473 947883 772732 497393 325085 267077 293949 353059 450772 490352 414462 436651 483807
11462D83807J56599J2713K3991m7930k2348l0975l2618Q8222j54730n7333N4877
11451D74275M1486m7114R0540j13079K194o1333R877r737L4107Q4773M3578j5481
11439E34086j13339q6207M9897j21009J50560J98312m6550m434j1143r4256n0479
11428D05438L6692J8948p9934k9213j00148K3420P3535k12635k7132M3086J33526
11417B85583J75216K1545J8570J46837J2941j93437o4409M1450J70598N7007k36910
11406D34991r2308Q1524k8359n7220L7454K448r3445O5959O090k9589j54532l8414
11394A34599j07196P8771P1621P4475K2744Q6229J06173J3962m7537J3666j1011
11383D36496R3070R9421o3336j44355j23799P3921j96923j30164K4841J82065
$$ plain form
11462 483807 640406 653119 677110 629180 606832 575857 543239 631461 476731 419398 474275
11451 474275 515761 468647 559187 446108 448302 386969 396846 387109 421216 505989 549567 534086
11439 534086 420747 334540 384437 263428 413988 612300 565750 561316 550173 455917 405438
11428 405438 442130 461078 381144 351931 251783 275203 348738 136103 108971 152057 285583
11417 285583 460799 482344 500914 647751 660692 467255 402846 444296 614894 671901 434991
11406 434991 342683 424207 395848 338628 376082 378530 285085 351044 357134 327545 173013 134599
11394 134599 27403 106174 177795 252270 275014 361243 467416 481378 433841 447507 436496
11383 436496 529566 628987 565651 421296 297497 371418 174495 44331 69172 251237
11373B51237K0831k7317Q9806O6589R1522L9493o2779j27432k96029j8286P8129
11362A05764J75283j8990m5778L8306K94J28839O5366J6480k61212q9661O5398
11351A80089K06308J29557j58981r3037M0174J3670N2864Q429R0596L8935J0698
11340E19302j841P245L3436q9153J43141N1532K5597O531j6085j72256O1888M9897
11328F19234m8605J5803O0649L0381j13770j9259L2932j8192K5905J66606l1894
11317G19790p4561j3068r0611j88728J7637K63676K5915L6762K04816J8190k5106
11306H94712q2986o6813j20568p8938o6839R3584J09276L8158n475J07295o3697
11295G57709p0781k426O7670k9898l576K3187P238k8119m9505j07469j2103J10961
$$ plain form
11373 251237 272068 244751 334557 401146 492668 532161 469382 341950 45921 27635 105764
11362 105764 281047 262057 216279 254585 254879 383718 449084 465564 204352 114691 180089
11351 180089 386397 515954 356973 263936 304110 317780 370644 379073 469669 508604 519302
11340 519302 517461 524706 558142 468989 612130 663662 689259 695790 679705 507449 569337 619234
11328 619234 570629 586432 647081 677462 563692 544433 577365 559173 585078 751684 719790
11317 719790 645229 632161 541550 352822 370459 634135 660050 696812 901628 919818 894712
11306 894712 811726 744913 624345 545407 478568 572152 681428 719586 714111 821406 757709
11295 757709 686928 684502 752172 722274 718698 741885 749123 721004 671499 564030 551927 662888
11283F62888J38648l7068k27391j32535O2982K1285K16819N8116p5922P0673J22979
11272H81474N2660J66068K8367p1522K01985K41280j22449n0198r903m3460L8909
11261A313211j4957K1543j57661j13071J74169N5659k8038L4619q4872l2036Q5347
11250A253913P5915k11510j08208P7392K02633J39717J92668K1888q0635N6231
11240A620004N5920J34275Q337J3470J14596J10134J70807R3912j09120J0961
11230B223296n7454J48790L94741J09968q9328J49281J11757O2503J05636J22504
11220C281694K13792K49792K08728K87014K99891M13010Q8074J88027M19395L70000
11210F019417J34701L91667M74112M21069L91345K33780K97608N09991K39871
$$ plain form
11283 662888 801536 764468 537077 404542 467524 488809 705628 763744 687822 758495 881474
11272 881474 934134 1100202 1128569 1057047 1259032 1500312 1377863 1327665 1317762 1274302 1313211
11261 1313211 1298254 1319797 1162136 1049065 1223234 1278893 1250855 1285474 1200602 1168566 1253913
11250 1253913 1329828 1118318 1010110 1087502 1290135 1429852 1622520 1644408 1563773 1620004
11240 1620004 1675924 1810199 1818536 1832006 1946602 2056736 2227543 2321455 2212335 2223296
11230 2223296 2165842 2314632 2709373 2819341 2730013 2879294 2991051 3053554 3159190 3281694
11220 3281694 3495486 3745278 3954006 4241020 4540911 4953921 5041995 5230022 5649417 6019417
11210 6019417 6154118 6545785 7019897 7440966 7832311 8066091 8363699 8873690 9113561
11201I113561K42972J55603J18170J28490J48408q6845j30077M7233R9076P9871
11191I916462r99n0458J12292O0208p0414M9149K74306K55562L87823K48647K6440
11180A1209018K21042L19260L47882K76731J28692J88962K45187L06170K04596
11171A3447540q3810o3652j46966j28496j5505j96337l28571j11253L0695j77825
11161A2225820M8441L3185J48620J46060K8547J5321J47198L15035L26163L80950
11151A3815340N41100L33575K43568M43891N50567M55136L62709M87316O30546
11142A7863748N20738N32888M89416M90206M90089M40130M37706M86530N46034
11133B2297485M91607M61585L34226K08990M26971O08571O33753N09966K79210
$$ plain form
11201 9113561 9356533 9512136 9630306 9758796 9907204 9820359 9690282 9737515 9836591 9916462
11191 9916462 9915463 9865005 9977297 10037505 9967091 10016240 10290546 10546108 10933931 11182578 11209018
11180 11209018 11430060 11749320 12097202 12373933 12502625 12691587 12936774 13242944 13447540
11171 13447540 13363730 13300078 13153112 13024616 13009111 12812774 12484203 12372950 12403645 12225820
11161 12225820 12274261 12307446 12456066 12602126 12630673 12645994 12793192 13108227 13434390 13815340
11151 13815340 14356440 14690015 14933583 15377474 15928041 16383177 16745886 17233202 17863748
11142 17863748 18384486 18917374 19406790 19896996 20387085 20827215 21264921 21751451 22297485
11133 22297485 22789092 23250677 23584903 23793893 24220864 24829435 25463188 25973154 26252364
11124B6252364K98051J94112K79644K47578o5976O4329R3757K03822J5010J75020
11114B7757711j2708p6570k3295j87500r6455n9438j27984k42501k5410R3734
11104B6999584j20185j08869k30303j56961l21338l25363k93404m83946l55275
11095B4603940l57370m09613m74379m28944m23338j85357l05489n05331l47594
11086B1166525k20854j02931m6124J4122M7528O325R1215J5779Q2048L83390M18584
11075B1855607K63019K43619M25054K65111K54865K27062J13202K11542J75518
11066B4034599K3564K1995m0044R6699L25548J55880J68398J96331K77479K93410
11056B5553859Q0235N8301K19969K12870J64331K50263M39683K96976K44800M4661
$$ plain form
11124 26252364 26550415 26744527 27024171 27271749 27205773 27270102 27363859 27567681 27582691 27757711
11114 27757711 27745003 27668433 27645138 27457638 27361183 27301745 27173761 26931260 26905850 26999584
11104 26999584 26879399 26770530 26540227 26383266 26061928 25736565 25443161 24959215 24603940
11095 24603940 24246570 23836957 23362578 22933634 22510296 22324939 22019450 21514119 21166525
11086 21166525 20945671 20842740 20796616 20810738 20858266 20864591 20955806 20971585 21053633 21437023 21855607
11075 21855607 22118626 22362245 22787299 23052410 23307275 23534337 23647539 23859081 24034599
11066 24034599 24058163 24080158 24040114 24136813 24462361 24618241 24786639 24982970 25260449 25553859
11056 25553859 25634094 25692395 25912364 26125234 26289565 26539828 26979511 27276487 27521287 27565948
11046B7565948k8756R939j05929j33957l41713j72957l48511n87499p57452o53313
11036B4445800m51088m65869n50166m76875m39075n70436m72876n01105p47347
11027A9770963p66632o07144l88109m76976l31635k48770m72439l84689l70926
11018A5723643m35479n99772n07761n48518n83889l85497k81528k02004p4277
11009A2104918N8471j21442K951j95981k72260J42158P4913j6013j67744Q307
10999A1618278K15687m1129j24891p6073j32509j9944o8084l63043j15341p1616
10989A0821335q7612j79330k19154k64148k37370j07539o2313j93073j44571m8226
10979I277999q9466j97982j1098P4142M8664J34852Q2751o7247n5886J06939N3170
$$ plain form
11046 27565948 27537192 27547131 27441202 27307245 26965532 26792575 26444064 25856565 25099113 24445800
11036 24445800 23994712 23528843 22978677 22501802 22062727 21492291 21019415 20518310 19770963
11027 19770963 19004331 18397187 18009078 17532102 17200467 16951697 16479258 16094569 15723643
11018 15723643 15288164 14688392 14180631 13632113 13048224 12662727 12381199 12179195 12104918
11009 12104918 12163389 12041947 12044898 11848917 11576657 11718815 11793728 11777715 11609971 11618278
10999 11618278 11833965 11792836 11667945 11591872 11459363 11439419 11371335 11008292 10892951 10821335
10989 10821335 10733723 10554393 10335239 10071091 9833721 9726182 9663869 9470796 9326225 9277999
10979 9277999 9188533 8990551 8979453 9053595 9102259 9237111 9319862 9252615 9196729 9303668 9356838
10968I356838j45069k00369l1491k91366l47330l64431m15306m17848l02745j94034
10958F646849l51988l64398k81837l45338m42071l26161k36356j97603j33867
10949C967230j47259k32961o9890r0759k13999k00643j61479l4818j19617j76454
10939B519351k28487j26457j5038j2494L460p5776m8088l6402j77265o6366J26912
10928A863350P9765J43557o0266j10362r0710j91919n1838P8053j36785k4903
10918A497942J63464K03853k04665n1463j82360K280K0026n2588q425Q0627j66322
10907A302369j77802o26K42675O2439K6965P9537O3562m918q3782j37496j9729
10896A353194M7236O0165K61108K17654j68951q9412l7361K01556Q9726k8324
$$ plain form
10968 9356838 9211769 9011400 8979909 8688543 8341213 7976782 7561476 7143628 6840883 6646849
10958 6646849 6294861 5930463 5648626 5303288 4861217 4535056 4298700 4101097 3967230
10949 3967230 3819971 3587010 3517120 3426361 3212362 3011719 2850240 2815422 2695805 2519351
10939 2519351 2290864 2164407 2149369 2136875 2140335 2064559 2016471 1980069 1802804 1736438 1863350
10928 1863350 1943115 2086672 2026406 1916044 1825334 1633415 1581577 1659630 1522845 1497942
10918 1497942 1661406 1865259 1660594 1609131 1426771 1429051 1449077 1396489 1388064 1468691 1302369
10907 1302369 1124567 1123941 1366616 1429055 1456020 1535557 1599119 1594201 1510419 1372923 1353194
10896 1353194 1400430 1460595 1721703 1939357 1770406 1680994 1643633 1845189 1934915 1906591
10886A906591J11083K38268K24856J47972j728K96207M86695K09270M2001J27200
10876C788415L96728M03701K99205L69331L06265L88837N11397L29900J18681
10867F912460J8051O6521K09966J85536J19023j30926q1367P9083k4223k0341
10857G333783o1811n8864p3679J41616J74979J9133j14085j76817J72264L24467
10847G680986J63523j9480J7074j9815j18740k81330l64067l01893k65744l25361
10837F165153m99111l93706l34148k74209l38838m71743m23073k88805k93422
10828B848098k16228M0478k08795k30184k68460j50801j41442j18823j63599k9294
10818A360950K6178J2668m4285j07164k40076p4075M2954J08611M0613k05519
$$ plain form
10886 1906591 2017674 2255942 2480798 2628770 2627042 2923249 3409944 3619214 3661215 3788415
10876 3788415 4185143 4588844 4888049 5257380 5563645 5952482 6463879 6793779 6912460
10867 6912460 6930511 6997032 7206998 7392534 7511557 7380631 7299264 7378347 7354124 7333783
10857 7333783 7271972 7213108 7139429 7281045 7456024 7475157 7361072 7184255 7356519 7680986
10847 7680986 7844509 7825029 7842103 7822288 7703548 7422218 7058151 6756258 6490514 6165153
10837 6165153 5666042 5272336 4938188 4663979 4325141 3853398 3430325 3141520 2848098
10828 2848098 2631870 2672348 2463553 2233369 1964909 1814108 1672666 1553843 1390244 1360950
10818 1360950 1387128 1399796 1355511 1248347 1008271 934196 977150 1085761 1126374 920855
10808I20855j03138L4974J64165Q8009K2711j4995L5425j23972k24205j81854
10798F17975J6322j14606L4909K3396o9522j00812j38605j20539m9206J38147
10788B37459K07067J86182J81954k9341m1555j44964j65965M7353J62591m5593
10778E95188j36209j9135o9310N076P0633J29014l8363j77274K3671J01593P3392
10767E58276j50873j30273K8750m3607R649l1773J16093M2469P0415J15212q4413
10756D99925p8535O7621J09402P2241P5585J06393n9100j7390j52870q8978r8223
10745D36071J82873K42787J42206j31350j10052R0156P7545O5360n4245k0109
10735I21242j45400n2461J42030J50643J03363K25289J29631L2683L2072l5872
$$ plain form
10808 920855 817717 852691 1016856 1104865 1127576 1112581 1148006 1024034 799829 617975
10798 617975 634297 519691 554600 577996 508474 407662 269057 148518 99312 237459
10788 237459 444526 630708 812662 783321 741766 596802 430837 478190 640781 595188
10778 595188 458979 439844 370534 375610 446243 575257 536894 359620 383291 484884 558276
10767 558276 407403 277130 305880 262273 271922 240149 356242 398711 469126 584338 499925
10756 499925 421390 489011 598413 670654 746239 852632 793532 776142 623272 534294 436071
10745 436071 618944 861731 1003937 872587 762535 852691 930236 995596 941351 921242
10735 921242 775842 723381 865411 1016054 1119417 1344706 1474337 1507020 1539092 1503220
10725A503220j19090M7048M7139L8871J73202N40L7642J61305J26047m5652N5183
10714B025455J13534J14956M2728L9514n4863R616m1632M2080M0217p7578K1413
10703B275440J15496O1965M8093N0590p3275M8374J35063J76827R2883O8933j28872
10692B871517l4186J39521L16446J4059k9758J01708l4486J82533K85114p0385
10682C742083M8140P858K42497J88983K33006J62270J55616L61929J35980J65517
10672E443879J84713K66490K75191M59674M37687L10833L07395O08068L55317
10663H649247N36548O35089O37317N75930O25385R17864Q63953J013751J030113
10654A5485197J233931J394693J271018J288493J682859J825965J826250J958242
$$ plain form
10725 1503220 1384130 1431178 1478317 1517188 1690390 1690930 1728572 1889877 2015924 1970272 2025455
10714 2025455 2138989 2253945 2296673 2336187 2281324 2290940 2249308 2291388 2331605 2254027 2275440
10703 2275440 2390936 2452901 2500994 2551584 2478309 2526683 2661746 2838573 2931456 3000389 2871517
10692 2871517 2837331 2976852 3293298 3307357 3277599 3379307 3344821 3527354 3812468 3742083
10682 3742083 3790223 3798081 4040578 4229561 4462567 4624837 4780453 5142382 5278362 5443879
10672 5443879 5628592 5895082 6170273 6629947 7067634 7378467 7685862 8293930 8649247
10663 8649247 9185795 9820884 10458201 11034131 11659516 12577380 13441333 14455084 15485197
10654 15485197 16719128 18113821 19384839 20673332 22356191 24182156 26008406 27966648
10646B7966648K177143K302042K329439K329119K234822K344109K550049K297638
10638D6531009K206934K262161K144556J956280J872389J942389J988883J758707
10630F2663308J847368J876529J886672J936389K231864K438961L015715L110580
10622H1007386L463912M253318N203961O589870Q179583J0307350J2515656J3647474
10614A45168510J2805359R894715O219742K972693R46834M67721J522948L902482
10606A83901004P454962J1835061J6191531J8407330J5709339P894967j405981
10599B59988213q528348j2260657j2479245r235228l617102L614759J1724511
10592B29206903J9313065K2289393J7166765M962366q042623j7335276k2201553
$$ plain form
10646 27966648 30143791 32445833 34775272 37104391 39339213 41683322 44233371 46531009
10638 46531009 48737943 51000104 53144660 55100940 56973329 58915718 60904601 62663308
10630 62663308 64510676 66387205 68273877 70210266 72442130 74881091 77896806 81007386
10622 81007386 84471298 88724616 93928577 100518447 108698030 119005380 131521036 145168510
10614 145168510 157973869 167868584 174088326 177061019 178007853 178475574 179998522 183901004
10606 183901004 191355966 203191027 219382558 237789888 253499227 261394194 259988213
10599 259988213 251459865 239199208 226719963 217484735 213867633 217482392 229206903
10592 229206903 248519968 270809361 287976126 292938492 284895869 267560593 245359040
10585B45359040k1961034j7813430j1297671m382322K756173Q451457J0181605
10578B11293818N902473k857262j1156054j7069785j9446449j8625458j5437295
10571A32603988j1181756p121915l622693r03683k62692k151206n323055q373064
10563I3663924j0680423j1250397j0726114r342322p757530o309598m989617l949054
10555B8658869l105727k527030k174513j888274j631086j334390j454203j094932
10547A3448714r72696p93834o63746n68984n62864p04669n18566k98590k72216
10538H092549m27299m04505k81910k43467l56218k68576j55909j19843m09122
10529E425700k70196j28108k34362l75092j23844l1050j59012j25791k39712k03709
$$ plain form
10585 245359040 223398006 205584576 194286905 189904583 192660756 201112213 211293818
10578 211293818 217196291 214339029 203182975 186113190 166666741 148041283 132603988
10571 132603988 121422232 114300317 110677624 109773941 109511249 107360043 102036988 93663924
10563 93663924 82983501 71733104 61006990 51664668 43907138 37597540 32607923 28658869
10555 28658869 25553142 23026112 20851599 18963325 17332239 15997849 14543646 13448714
10547 13448714 12476018 11682184 11018438 10449454 9886590 9181921 8663355 8364765 8092549
10538 8092549 7665250 7260745 6978835 6735368 6379150 6110574 5954665 5834822 5425700
10529 5425700 5155504 5027396 4793034 4417942 4294098 4263048 4104036 3978245 3738533 3534824
10519C534824k4561J3719n7287o4417j57162n9556k87910j51918l1587P4950j8122
10508B770973n7888J4711J58471l3354j61775r2041j08525r5042r689p4037l0163
10497B281641p2670R151j96520j56960J61668J9361l6310j17652j10793k4235
10487A756681K4585m8125K3700r4083O3815K87770J36308K8820m9490k49331p7171
10476A803479l3063k3192k3451j40604n8401J74202o232l1901J40877R5680Q9351
10465A986745l7232p7916r0920M9538p5765k9937j05144m8738j9932O5040J90884
10454A806623Q9889q0113j33479p910r9546k6326M0835J21958J14220j20462j5051
10443A690638j4240N762n8000j81485l6616M4255M5547N4151m7701J76263K7975
$$ plain form
10519 3534824 3510263 3523982 3466695 3402278 3245116 3185560 2897650 2745732 2714145 2789095 2770973
10508 2770973 2713085 2727796 2886267 2852913 2691138 2599097 2490572 2395530 2385841 2311804 2281641
10497 2281641 2208971 2218122 2021602 1864642 2026310 2045671 2009361 1891709 1780916 1756681
10487 1756681 1781266 1733141 1756841 1662758 1726573 2014343 2150651 2179471 2129981 1880650 1803479
10476 1803479 1770416 1747224 1723773 1583169 1524768 1698970 1692738 1660837 1801714 1897394 1986745
10465 1986745 1949513 1871597 1780677 1830215 1754450 1724513 1619369 1570631 1550699 1615739 1806623
10454 1806623 1896512 1816399 1682920 1675010 1575464 1549138 1589973 1711931 1826151 1705689 1690638
10443 1690638 1676398 1682160 1624160 1442675 1406059 1450314 1495861 1550012 1502311 1678574 1706549
10432A706549l06561j48603P1426K7555j37007m8179R5312O071r1444J0615N7320
10421A243054Q8822J32633K0492j41009j96993j01087j0101L0106n7262r5089
10411I13566J23710M6911k44476l9796n2619n6775J88093p8449J3303q6605j26533
10400F00330J5274k1716q062j58724J6829J54429P6287J67222Q3201q6888j37396
10389G00786P3766N3207j03305p2259n5534R4775j04338L2136M1595q2115l319
10378E75395L1170K0305P9349j44356o7971m3711m6962j02834q166n4205Q1608
10367C19622J9842K61182R8926q1490j06874p6795l9878K7847j270J54170M5350
10356F20632M289j14609j05078L392l5217j22310Q9796J31956J29184N6909j5317
$$ plain form
10432 1706549 1399988 1251385 1322811 1350366 1213359 1165180 1260492 1266563 1175119 1185734 1243054
10421 1243054 1331876 1464509 1485001 1343992 1146999 1045912 1035811 1065917 1008655 913566
10411 913566 1037276 1084187 839711 799915 747296 690521 878614 800165 813468 726863 600330
10400 600330 615604 593888 585826 427102 443931 598360 674647 841869 925070 838182 700786
10389 700786 774552 827759 724454 652195 596661 691436 587098 619234 660829 578714 575395
10378 575395 606565 626870 706219 561863 493892 450181 403219 300385 292219 238014 319622
10367 319622 339464 600646 699572 618082 511208 434413 394535 422382 421112 575282 620632
10356 620632 624921 510312 405234 408626 373409 251099 340895 472851 602035 658944 643627
10345F43627j32178j22837m8363m6577o3189N7075J33432J4785k01982j1457R4200
10334C16536J10696J13603k21098j6044J93156M9728r1881j09983m2064J52970
10324D55619n0554n6450J32546m713k6269j8221l1044j66905M1061j8978j00229
10313A55863r3863J05364J42014k4490o216J31163J66983r3328k5508k6244j60240
10302B71498k5118k6895Q9267J82861J65786K6460j35669p5624o7285R0079l2155
10291D63205l7008l1949m3187n659n8018K0141J07218M5123j18934r7766q7097
10280A56069n4261r2732N401n1189p8044N8837l911N1493M8664l3250Q34M5999
10268E3910P2450J09768J17874J29228J27581j17323j27586J6372J10917k9014
$$ plain form
10345 643627 511449 388612 340249 293672 230483 287558 420990 435775 233793 222336 316536
10334 316536 427232 540835 319737 303693 496849 546577 454696 344713 302649 455619
10324 455619 405065 348615 481161 476448 450179 431958 400914 234009 275070 256092 155863
10313 155863 62000 167364 309378 284888 278672 409835 576818 483490 457982 431738 271498
10302 271498 246380 219485 308752 491613 657399 683859 548190 472566 405281 495360 463205
10291 463205 426197 394248 351061 345402 287384 307525 414743 459866 340932 243166 156069
10280 156069 101808 9076 14477 -36712 -114756 -55919 -59830 -8337 40327 7077 7911 53910
10268 53910 126360 236128 354002 483230 610811 493488 365902 382274 493191 464177
10258D64177L9633j19222j20623j16696N05m4956n6561R9165J07818J9972R7672
10247C70884m6679M1331R606R6448m5681j19574j97094R8172K23185k9581j56019
10236B44998j2626J21316N5108P3196J6452k6937L254j60971J13284M5594k9119
10225D43549j76928j15695j0095k0533L1067N7373j7639j84359k5019K10829M9190
10214B41740m6594L449m7828K0330M5990L1127n5529J96282q0193m6340r2336
10203A70098M2598L6870m062M4895M6795o7535J7332N859R257o0158p9660M6644
10191B08933J95685R8016k5470N447o1593q8867M798R036Q9638J01239R5393J65178
10179G97433K24924M59j26227K6323L2454P1014J29708p1540j00186j63190L860
$$ plain form
10258 464177 503810 384588 263965 147269 147774 102818 46257 145422 253240 273212 370884
10247 370884 324205 365536 375142 471590 425909 306335 109241 207413 430598 401017 244998
10236 244998 232372 353688 408796 481992 498444 471507 474761 313790 427074 472668 443549
10225 443549 266621 150926 140831 120298 151365 208738 191099 6740 -18279 192550 241740
10214 241740 195146 198595 150767 171097 217087 248214 192685 388967 308774 262434 170098
10203 170098 212696 249566 245504 290399 337194 269659 286991 292850 302107 241949 162289 208933
10191 208933 404618 502634 477164 482611 421018 332151 336949 345985 435623 536862 632255 797433
10179 797433 1022357 1022816 896589 922912 955366 1026380 1156088 1084548 984362 821172 825032
10168H25032R7161L7368L3215J02678K49260Q6701j45301k10454J05373J74508
10158A355541o014Q5028J72349K35608J14147k9454r5661Q7876j7881n3808j38514
10147A709217j32096j38796j88759M8606K05148K73673K1686j99378j51163k67669
10137A180469k00677K7052n9113m6321l4189J65031M9559n4151k788j513k59999
10126G63360j26565m1064k01529k32892R329K4136J55181N2012J7472j52919j28740
10115A37781j46007M9481J14898N280q5443Q3907J03063P4481J14553j12186k01141
10104A38667J00924J48647j45712J9003L2442j5134q9625O1715l7366j23079q3317
10093G165l2185q121K37856J21691M1265l1775l4359O5267k0088j7969j8285p9151
$$ plain form
10168 825032 922193 959561 992776 1095454 1344714 1431415 1286114 1075660 1181033 1355541
10158 1355541 1349527 1434555 1606904 1842512 1956659 1927205 1831544 1919420 1901539 1847731 1709217
10147 1709217 1577121 1438325 1249566 1298172 1503320 1776993 1798679 1599301 1448138 1180469
10137 1180469 979792 1006844 947731 901410 867221 1032252 1081811 1027660 1024872 1023359 763360
10126 763360 636795 595731 394202 161310 170639 194775 349956 401968 419440 266521 137781
10115 137781 -8226 41255 156153 161433 75990 159897 262960 337441 451994 339808 138667
10104 138667 239591 388238 242526 261529 293971 278837 189212 250927 213561 90482 7165
10093 7165 -25020 -33141 204715 326406 367671 335896 301537 366804 346716 328747 310462 231311
10081B31311j22930q934N107N7693J36755n3250j27796M1467Q9464k11925j00671
10070f3709J20586R1355J06435J14498O6570p4439k00413L4195J27444j16337
10060B06185p1543k3837Q2852J46414Q475n3674k38493p7760J12296J9488j58387
10049d7984j4142J86397k416n8985J544R8905J02734m4698m0398Q7097J14533
10038C82587j57848N6402M968m021J64265J06450j4413j53336j35969j62580l1301
10027E5204N5505N3227J32433k1840k822l8591j7003M795j08660O0064J03379
10016B75691N8786J37656K2650j54752j50412R9540j63334J9653N9669P5928M4993
10005C26068l8092P3166l6106P2723l861n901m0195j62213j9167M4907N1272J6113
$$ plain form
10081 231311 108381 99447 104554 162247 299002 245752 117956 159423 248887 36962 -63709
10070 -63709 56877 148232 254667 369165 435735 361296 160883 195078 322522 206185
10060 206185 134642 110805 193657 340071 348546 294872 56379 -21381 90915 110403 -47984
10049 -47984 -62126 124271 121855 62870 64414 163319 266053 221355 180957 268054 382587
10038 382587 224739 281141 286109 282088 446353 552803 538390 385054 249085 86505 55204
10027 55204 110709 163936 296369 274529 271707 233116 216113 220908 112248 172312 275691
10016 275691 334477 472133 494783 340031 189619 289159 125825 145478 205147 281075 326068
10005 326068 287976 361142 325036 397759 393898 387997 347802 185589 166422 211329 262601 278714
9993B78714J54648R4233M6669o0141k1106O7532M2061k53986j53961o6897N4150
9982A81916j17354k6893N5208J47324q0483n8735m1617k0500J83406p6297J16235
9971B62210m9653q6720j6706q473Q6187J48878j6892N0174M7657k2887n4522M4385
9959C83638N1808K3244J3790L4129J1903o4234r1750j32279m6151R2947J80518
9948D57563j2045n3541R1058q8774l7968j4409n5446l1099j8545P0123l9844q1780
9936A85293K0595J35480K34748K61967L43226Q74544J174049N94731j47242o01838
9926C075553p40395o02155l83730k23330l29713k48914J86287L0794j61332j54051
9916D49014j19735J18514Q0167M6043J31025P0933j9508j7296q7789q5257P8043
$$ plain form
9993 278714 433362 527595 574264 514123 493017 560549 602610 348624 194663 127766 181916
9982 181916 64562 37669 92877 240201 159718 100983 59366 38866 222272 145975 262210
9971 262210 212557 125837 109131 100658 186845 335723 318831 369005 416662 393775 339253 383638
9959 383638 435446 458690 472480 506609 518512 454278 362528 230249 184098 277045 457563
9948 457563 445518 391977 483035 394261 356293 341884 286438 255339 236794 306917 267073 185293
9936 185293 205888 341368 576116 838083 1181309 2055853 3229902 3824633 3677391 3075553
9926 3075553 2335158 1733003 1349273 1125943 796230 547316 733603 764397 603065 449014
9916 449014 329279 447793 527960 574003 705028 775961 756453 739157 651368 566111 644154
9905F44154J4492k06877k72991K40616J31063K09196P599j62196j94248N9964
9895D70772J27433Q8235j14521j46842j3144L8900j15054j51229k1835K07738
9885C70453J37349r1413k1674J02378L115k80828P781K10579l4119P8282m1453
9874D40450r6130J1044J34424n5104j4087O1204M635L9115N4139J21516O8241
9863G69447p0905p2473J36673r6984j41048J175N283k12508k2484J54790J77346
9852F28312J10703R4366q7075k0336l328P6718P093j09808k8014K1766j42203
9841E48194n3635m4370L4218R3770l947L9052O628M7628M1586j26044q2557q11
9829D99712k8132j03170J4755J32306N7005N7270J9306Q7152L5086L4216q8249
$$ plain form
9905 644154 658646 451769 178778 419394 550457 759653 767252 605056 410808 470772
9895 470772 598205 686440 571919 425077 411933 450833 335779 184550 162715 370453
9885 370453 507802 416389 394715 497093 500208 219380 227161 437740 403621 481903 440450
9874 440450 344320 355364 489788 434684 420597 481801 486436 525551 579690 701206 769447
9863 769447 698542 626069 762742 665758 524710 525885 531168 318660 296176 450966 628312
9852 628312 739015 833381 746306 725970 722642 799360 806453 696645 668631 690397 548194
9841 548194 494559 450189 484407 578177 574230 613282 619910 667538 709124 583080 500523 499712
9829 499712 471580 368410 383165 515471 572476 629746 649052 736204 771290 805506 717257
9818G17257k71408j27300L0356M0804J56366J30588j33503j03772J11588K1298
9808E72274o10R6645j25796K812M7181m8482M9655k4224O2474R7179M7797n5389
9796G21516j64488j33081j65487J4574O6476r6256J0677J77072N4301j34540j73460
9785A77304L136J17274J37790R1762j3425p9440n0178M1968K1798O4850O9503
9774E82342q9175m4296q3276j10665N2963J007J59387n9388o1163J50758R7148
9763E95642o5147P2463M7931J721k5031j21102J358m3543p6791q768P8441k1796
9751D35378k0847n272L4535m5800n5215J66597L449J06555p9440k3351J18250
9740F34839L4605j02315K7971r2177o5461Q8019k8461j55514j9941L7309j4539
$$ plain form
9818 717257 445849 318549 348905 389709 546075 676663 543160 439388 550976 572274
9808 572274 571664 668309 542513 545325 592506 544024 593679 569455 631929 729108 776905 721516
9796 721516 557028 423947 258460 273034 339510 243254 253931 431003 485304 350764 177304
9785 177304 180440 297714 435504 527266 513841 434401 384223 426191 447989 512839 582342
9774 582342 493167 448871 365595 254930 307893 308900 468287 408899 347736 498494 595642
9763 595642 530495 602958 650889 652610 627579 506477 507835 464292 387501 378733 457174 435378
9751 435378 414531 409259 443794 397994 342779 509376 512825 619380 539940 516589 634839
9740 634839 669444 567129 595100 502923 437462 525481 497020 341506 321565 358874 344335
9729C44335J52021j1832J29027K14262r870M1753m4465p9891M9943n9671j48919
9718E76693r8637Q4168m5365j05547N8197J90947P636J05862J28291p178P7690
9707I72757J9338N1737j52883L5288o4051m710K13334k7289j27131L6714L2978
9696I86082O6406k5688l7144K56427J08486Q3990J77631p5655N146J19836J09660
9685A775177J53105J28741p580o345j1420P2560J96869K04888K77480P7123n5659
9674B804939K37725J35032l8527N7401M5922J67953o9003P2841J32844q0633P1889
9663C538383J58444L41097J40538J06277J78754N3754R8750J64667L41590K27903
9653E350157R6586J77120K30045K06426j09559M8320j10421k02639q8737k18475
$$ plain form
9729 344335 496356 484524 613551 827813 817943 859696 815231 735340 785283 725612 576693
9718 576693 478056 562224 516859 411312 469509 660456 668092 773954 902245 895067 972757
9707 972757 992095 1043832 890949 926237 862186 857476 1070810 1043521 916390 953104 986082
9696 986082 1052488 1026800 989656 1246083 1354569 1438559 1616190 1540535 1545681 1665517 1775177
9685 1775177 1928282 2057023 2049443 2043098 2031678 2104238 2301107 2505995 2783475 2860598 2804939
9674 2804939 3042664 3177696 3139169 3196570 3242492 3410445 3341442 3414283 3547127 3466494 3538383
9663 3538383 3696827 4037924 4178462 4284739 4463493 4517247 4615997 4780664 5122254 5350157
9653 5350157 5446743 5623863 5853908 6060334 5950775 5999095 5888674 5686035 5597298 5378823
9643E378823j48346j61106o3921o7270j20657j5426J07789n8718j11316p7292
9633D662560l4798r7452l5816J76190n9910J06775J11439N104K3981j0405J70103
9622E017771Q4414L4252p4244j29365j80119k0779J00449Q6516R3700m5374P1413
9611E038634J99680N8167O8911K57642K34570K26275K12931K95711L75612L54662
9601G322795K25052J1513K8563K82640L69949M43474J99290J55508N15808M74675
9591A0029267L47436M93377L36010K62048M24039N97284N57021L72020K53733
9582A3672235L72762M19239K44040J98140L35078L09462J13214Q5864J29216J21889
9572A6001139K28839K68956K89745N8111R9004L31494M16991J92895L1258K13392
$$ plain form
9643 5378823 5230477 5069371 5005450 4938180 4817523 4802097 4909886 4851168 4739852 4662560
9633 4662560 4627762 4530310 4494494 4670684 4610774 4717549 4828988 4834092 4858073 4847668 5017771
9622 5017771 5102185 5136437 5062193 4932828 4752709 4731930 4832379 4918895 5012595 4967221 5038634
9611 5038634 5238314 5296481 5365392 5623034 5857604 6083879 6296810 6592521 6968133 7322795
9601 7322795 7547847 7559360 7587923 7870563 8240512 8683986 8883276 9038784 9554592 10029267
9591 10029267 10376703 10870080 11206090 11468138 11892177 12489461 13046482 13418502 13672235
9582 13672235 14044997 14464236 14708276 14906416 15241494 15550956 15664170 15750034 15879250 16001139
9572 16001139 16229978 16498934 16788679 16846790 16945794 17277288 17694279 17887174 17918432 18131824
9562A8131824L60158M5098J16085N2563J62354J99706K210j50383k28503j28212
9552A8562900k20349k32627j31855k85826l09675j51517j04377k91950j98793
9543A6635931j93365o012n2692j44173j58118j29854p2742p7038r315j220k05689
9532A5585713k10026q4923j17740O3686L32726K44683l0540k132J61291J54135
9522A6096873J31208L56838N67471N62890N71136N45268P15678O45479O91734
9513B0884575O62067O27573O39668N10851N34468N66154M43988O11951M73905
9504B5955200K83628L87993M37246M12782N46221O07310P27358P95852R23585
9495C1077175R14481R70403J044382J075090J230692J271264J432400J174837
$$ plain form
9562 18131824 18491982 18537080 18653165 18705728 18868082 19067788 19069998 18919615 18691112 18562900
9552 18562900 18342551 18109924 17978069 17692243 17382568 17231051 17126674 16834724 16635931
9543 16635931 16442566 16436554 16383862 16239689 16081571 15951717 15878975 15801937 15792622 15791402 15585713
9532 15585713 15375687 15290764 15173024 15236710 15569436 15814119 15783579 15781447 15942738 16096873
9522 16096873 16228081 16584919 17152390 17715280 18286416 18831684 19547362 20192841 20884575
9513 20884575 21546642 22174215 22813883 23324734 23859202 24425356 24869344 25481295 25955200
9504 25955200 26238828 26626821 27064067 27476849 28023070 28630380 29357738 30153590 31077175
9495 31077175 31991656 32962059 34006441 35081531 36312223 37583487 39015887 40190724
9487D0190724Q16886R15893P95394O56790N80479J56034R4161J50113J01587M4597
9477D4502658M9589M0898J66819K90731M63561M14014J96301N16856P04442O64349
9467D8010218R47452J049086O91902P82874P94239Q00968P68077N37389O90660
9458E5072865N12932M61685L29689L58364K88081K66530M21114M44410N53366
9449E8709036N94499P52792P42543P42616O19420N76174O76284P08702P55890
9440F4877956P26777M36542K65456J69322N7218m1472k77393k03418j04175k76580
9430F5630233k82648l80185m34172n71366m43062l73292k61603j02817j52968
9421F2628120p9940n9699l67683j31786q7104j62355j79282m72643n65394o01376
$$ plain form
9487 40190724 41007610 41923503 42718897 43375687 43956166 44112200 44206361 44356474 44458061 44502658
9477 44502658 44552247 44593145 44759964 45050695 45514256 45928270 46124571 46641427 47345869 48010218
9467 48010218 48957670 50006756 50698658 51481532 52275771 53076739 53844816 54382205 55072865
9458 55072865 55585797 56047482 56377171 56735535 57023616 57290146 57711260 58155670 58709036
9449 58709036 59303535 60056327 60798870 61541486 62160906 62737080 63413364 64122066 64877956
9440 64877956 65604733 66041275 66306731 66476053 66533271 66491799 66214406 66010988 65906813 65630233
9430 65630233 65347585 64967400 64533228 63961862 63518800 63145508 62883905 62781088 62628120
9421 62628120 62548180 62488481 62120798 61989012 61901908 61739553 61560271 61087628 60522234 59920858
9411E9920858p02918p31176q60381j166072j018123j053301j129677j103972j134120
9402E1021118j225085j178826j113814r88585r38091q34458q31959q40778p87621
9393D2281901m78665n19529m91851p79105n32623m25011n93765o02016n93918
9384C7265418o66410p92618q47807q56148q49817p20352p33948n90726n22143
9375C0685449m61536m54038l43203l17076l02507k80123l27974l67113k63793
9366B7568086Q4327J20993M7627P666K33243J94857J63896J42774Q6724O2645
9356B8712838j0129R71L5130J33078n4988j63816j32944l8767P487j77432l32479
9345B7978949j54811k22762j72720j89144l17731n33354o03734n09978n59785
$$ plain form
9411 59920858 59217940 58486764 57626383 56460311 55442188 54388887 53259210 52155238 51021118
9402 51021118 49796033 48617207 47503393 46514808 45576717 44742259 43910300 43069522 42281901
9393 42281901 41803236 41283707 40791856 40012751 39480128 39055117 38461352 37859336 37265418
9384 37265418 36599008 35806390 34958583 34102435 33252618 32532266 31798318 31207592 30685449
9375 30685449 30223913 29769875 29426672 29109596 28807089 28526966 28198992 27831879 27568086
9366 27568086 27652413 27773406 27821033 27828699 28061942 28256799 28420695 28563469 28650193 28712838
9356 28712838 28702709 28703680 28738810 28871888 28816900 28653084 28520140 28481373 28488860 28311428 27978949
9345 27978949 27824138 27601376 27428656 27239512 26921781 26388427 25784693 25274715 24714930
9336B4714930k96863m30612m47019m97197m94479n72967o69689p24727n68645
9327B0012732m37996m33262n05532o16147n32694m49744m82169m58138l68300
9318A5728750m26552m54569l38768l26614k69455l46937k11273j17977j58277
9309A3078328p3122q9644l36993k65314l8698k19133j70835J2848J03672J74044
9299A2175153L1940l2626p5124r8745j4033J26909K30291L6231Q3112K43492L48282
9288A3054882K11485J31953J75486K76822M06680M60532K39487L62503N21746
9279A5841576L09784K52040K56173K78749L7731K51103L41945K36196J34850L625
9269A7943772K2330L1455P4428J3597L4496J10370J89777K4554k680N6606J45269
$$ plain form
9336 24714930 24418067 23987455 23540436 23043239 22548760 21975793 21306104 20581377 20012732
9327 20012732 19574736 19141474 18635942 18019795 17487101 17037357 16555188 16097050 15728750
9318 15728750 15302198 14847629 14508861 14182247 13912792 13565855 13354582 13236605 13078328
9309 13078328 13005206 12915562 12578569 12313255 12274557 12055424 11884589 11897437 12001109 12175153
9299 12175153 12207093 12174467 12099343 12000598 11986565 12113474 12343765 12379996 12463108 12706600 13054882
9288 13054882 13266367 13398320 13573806 13850628 14257308 14717840 14957327 15319830 15841576
9279 15841576 16151360 16403400 16659573 16938322 16976053 17227156 17569101 17805297 17940147 17943772
9269 17943772 17966102 17997557 18071985 18085582 18120078 18230448 18420225 18444779 18442099 18498705 18643974
9258A8643974J21083K54380K91477K19526Q6881r5497k79419k51553j02652O968
9248A8895168j54006m95883m29562l60142l02152l86781o10016n11123m30473
9239A5215030k42134l24750l88429j53267k38223l43061l00265k89067j81075
9230A2754759l24014n28192l60533k87449n34728m00971l60524l39007l95983
9221I223358l07796m88364k72087k52890k30679l01932m51424l43713k87356k43459
9211F043658k06244k89104k08887k29644k65463k62799q9518j35893l7800j10978
9201D207328q7145j70983m32149k76722j17348J3064j38003l18692k74528p0119
9191B334703m8762m7637n6874l6687p8874j00671q5031r5063n6782k5865j53051
$$ plain form
9258 18643974 18765057 19019437 19310914 19530440 19617321 19521824 19242405 18990852 18888200 18895168
9248 18895168 18741162 18245279 17815717 17455575 17153423 16766642 16156626 15645503 15215030
9239 15215030 14972896 14648146 14259717 14106450 13868227 13525166 13224901 12935834 12754759
9230 12754759 12430745 11902553 11542020 11254571 10719843 10318872 9958348 9619341 9223358
9221 9223358 8915562 8427198 8155111 7902221 7671542 7369610 6918186 6574473 6287117 6043658
9211 6043658 5837414 5548310 5339423 5109779 4844316 4581517 4491999 4356106 4318306 4207328
9201 4207328 4120183 3949200 3517051 3240329 3122981 3136045 2998042 2679350 2404822 2334703
9191 2334703 2285941 2238304 2181430 2144743 2065869 1965198 1880167 1785104 1728322 1702457 1549406
9180A549406J0550L8118K6312Q982L0634j66219L6977P4946j71441q7924J00992
9169A451333J15452J11149L546k14499j64254m5757p8605n3246L5770L7884L6131
9158A234904L5017Q1121j56513n5191m5186j10731o9969K9669m2429N5615R6508
9147A052815j7311p7725L7242p1342j59984m3555P5300J97487M2176p7396n5651
9136I02056j4626J59210Q1049j39633P969k0668j97193p5932K3014q8460J78057
9125H14843R7312m0295l1717R4812j5563j63473k353P6502m7883J4093M1004j58365
9113F78917N1004J19542P5132j12123j4778J6868N3132j9534j71529N080N562
9102F87273k01007O5323P0237J09070l1125P7578k5312J56121j50530j05218m6726
$$ plain form
9180 1549406 1559956 1598074 1624386 1633368 1664002 1497783 1534760 1609706 1438265 1350341 1451333
9169 1451333 1566785 1677934 1681480 1466981 1302727 1256970 1178365 1125119 1160889 1198773 1234904
9158 1234904 1269921 1351042 1194529 1139338 1094152 983421 913452 943121 900692 956307 1052815
9147 1052815 1035504 957779 995021 923679 763695 720140 795440 992927 1035103 957707 902056
9136 902056 887430 1046640 1127689 988056 996025 975357 778164 702232 725246 636786 814843
9125 814843 912155 871860 840143 934955 919392 755919 753566 830068 782185 796278 837282 678917
9113 678917 729921 849463 924595 812472 797694 814562 867694 848160 676631 681711 687273
9102 687273 486266 551589 621826 730896 699771 777349 752037 908158 757628 652410 605684
9091F05684p828J2941J28151O9472j31830r4002J31224J74265j31676k1870l3236
9080G01295n7966J54369k8350r2329j6991J4086K5049j12992K5858k8991j25640
9069D57398K7098l4302P3558L1432J4739P8711l099P289n3480m455R7957J99599
9057H92445M6232p5863L39m7510p0900j09607Q8152k8455O0900K06493j32240
9046H29986n2507k2972K2709j0388o1215m529n6471M604r2409o9052J48595R6668
9034G33019J1316j15721p1941J59504P3224Q586j23339q1628L4984J26552J29213
9023H83769j58376q2171p025O3845N2461Q1423j16099j40346R6949J41898q463
9012H07865J895j38918J1798J51699k2345j97011Q6662R7569j58644j85790r4051
$$ plain form
9091 605684 597856 610797 738948 808420 676590 582588 713812 888077 756401 734531 701295
9080 701295 643329 797698 769348 677019 660028 674114 699163 586171 612029 583038 457398
9069 457398 484496 450194 523752 555184 569923 648634 645535 652824 599344 594889 692846 892445
9057 892445 938677 862814 863153 815643 744743 635136 723288 694833 755733 962226 829986
9046 829986 777479 754507 777216 766828 705613 701084 644613 649217 556808 487756 636351 733019
9034 733019 744335 628614 556673 716177 789401 797987 674648 593020 628004 754556 883769
9023 883769 725393 643222 636197 700042 752503 833926 717827 577481 674430 816328 807865
9012 807865 809760 670842 682640 834339 811994 614983 701645 799214 640570 454780 360729
9001C60729J63137K00472L2167r6593K4837J41262k9462q2632j6157o9499p3708
8990E54553K943L115o6011q376M4172K13152J1596l9989n9451l6022l8517P0932
8978F52097l7163l5798j01005m1900J44674n269M5812o0698l0007L6334m4098
8967E22979k1464p7136p6752J18714R7927L8776L3739m2882R5681n4888n7388
8956E77306j12837j1476j9514k9767N5018q383J05607J51322J45506J09689m9890
8945I12581j92691j45913R9395M643J20069O4939n8717r3852M0861l7591m9877
8934F63847j34311l476J10663J87133M0409l853J43195n7907j63197j4413J920
8923G70010j594O7393J35963L19690o7237j52289Q59p5698Q4409L6106J15278
$$ plain form
9001 360729 523866 724338 756505 659912 684749 826011 796549 713917 697760 628261 554553
8990 554553 557496 560611 494600 486224 530396 743548 755144 715155 655704 619682 581165 652097
8978 652097 614934 579136 478131 436231 580905 575636 621448 560750 530743 567077 522979
8967 522979 501515 424379 347627 466341 564268 603044 636783 593901 689582 634694 577306
8956 577306 464469 452993 433479 403712 458730 450347 555954 707276 852782 962471 912581
8945 912581 719890 573977 673372 678015 798084 863023 804306 710454 751315 713724 663847
8934 663847 529536 526060 636723 823856 864265 860412 1003607 945700 782503 768090 770010
8923 770010 768416 835809 971772 1291462 1224225 1071936 1072795 997097 1081506 1117612 1232890
8912A232890o516k1015l2510N8425J7059n2402N4594L8039N5000O0582j7083m9690
8900A337373r400L8151L05905K76510o6409J559M2799K67138J75060O8651P6121
8889B513458J17129n941J31055J19507P1820J54831K63015J96958K42173J87499
8879C991504J06517n4543j22863j99362p091M3465J18670m2132K9573P4663K4040
8868C962441l2180J03527P3532K21668K52843J53630J20867J75871J10465J82162
8858E324826L28634K67309N9837J73064K50579K49745J35634R8620n4847K9970
8848F863371n1376l8260J34942j3027n9709R930j50100j12493k03117j13769l7312
8837F229080m2606p0696p3131r8846j64756l0197N6986K77181K83916K47434J71586
$$ plain form
8912 1232890 1226374 1205359 1172849 1231274 1248333 1195931 1250525 1288564 1343564 1404146 1387063 1337373
8900 1337373 1327973 1366124 1672029 1948539 1882130 1883689 1926488 2193626 2368686 2437337 2513458
8889 2513458 2630587 2624646 2755701 2875208 2947028 3101859 3364874 3561832 3804005 3991504
8879 3991504 4098021 4043478 3920615 3721253 3714162 3757627 3876297 3834165 3863738 3938401 3962441
8868 3962441 3930261 4033788 4107320 4328988 4581831 4735461 4856328 5032199 5142664 5324826
8858 5324826 5653460 5920769 5980606 6153670 6404249 6653994 6789628 6888248 6833401 6863371
8848 6863371 6811995 6773735 6908677 6895650 6835941 6845871 6695771 6583278 6380161 6266392 6229080
8837 6229080 6186474 6115778 6042647 5943801 5779045 5748848 5805834 6083015 6366931 6614365 6785951
8826F785951J98246J46190j4469J13408K30617J95652J37165L32656J68780J65341
8816H459537J02823O2298j81831j25530k006J17044J92790Q6750J19389J29583
8806H960847q2220J54709r8165M4258P6148J61587L9591j588J26024N8609J29661
8795I569461L1928Q2869J38283r1062n9519M5644K36019K91827K37389P5312J97624
8784A0755775K50838K53772J74421L60663M42425M60680K82659K00435J88297
8775A3369965O6205m2152p240J5099M7521J06391J82185j90704k35647o5596j27258
8764A3118769q974j99503k59464j42513q1236k06375j84182j33389p027j10350
8754A1785756j49312r5625m0203Q3729J49881N4690j25046p7895r2598L5383r9209
$$ plain form
8826 6785951 6984197 7130387 7115918 7229326 7459943 7655595 7792760 8125416 8294196 8459537
8816 8459537 8562360 8624658 8442827 8317297 8315291 8432335 8625125 8711875 8831264 8960847
8806 8960847 8878627 9033336 8935171 8979429 9055577 9217164 9256755 9255167 9381191 9439800 9569461
8795 9569461 9601389 9684258 9822541 9731479 9671960 9717604 9953623 10245450 10482839 10558151 10755775
8784 10755775 11006613 11260385 11434806 11795469 12237894 12698574 12981233 13181668 13369965
8775 13369965 13436170 13394018 13386778 13401877 13449398 13555789 13737974 13547270 13311623 13246027 13118769
8764 13118769 13109795 12910292 12650828 12508315 12427079 12220704 12036522 11903133 11896106 11785756
8754 11785756 11636444 11540819 11500616 11584345 11734226 11788916 11663870 11585975 11493377 11528760 11429551
8743A1429551k83638q5011j7034k24276j63881K9857J702l2610r2593R0217j75824
8732A0476460j22124J763K5706m8351J06571j71770j77864j23012n0376j32464
8722I784539j37502O1247K40861N4220k03186k86994j61503J18181J420J13557
8712I584840Q4873J30722j7872j44926R5418K63879K60426J91195O0873R9567
8702A0608995K9372R8119J06522J34548M7077Q1668K0078K2260Q1210J02377j69017
8691A1163209k53338k79011k44183j43900k66910l59065k86602k04957j86915
8682H938328k90617j96699p9660j31973j75687l45530o4103N6142o4562r29p909
8671G636801q1734J7913Q69j866M0325k51303q3415j28180j17611j75928j70614
$$ plain form
8743 11429551 11145913 11060902 11043868 10819592 10655711 10685568 10687270 10654660 10562067 10652284 10476460
8732 10476460 10354336 10356099 10381805 10333454 10440025 10268255 10090391 9967379 9917003 9784539
8722 9784539 9647037 9708284 9949145 10003365 9800179 9513185 9351682 9469863 9471283 9584840
8712 9584840 9669713 9800435 9782563 9637637 9733055 9996934 10257360 10448555 10509428 10608995
8702 10608995 10638367 10736486 10843008 10977556 11024633 11106301 11126379 11148639 11229849 11332226 11163209
8691 11163209 10909871 10630860 10386677 10242777 9975867 9616802 9330200 9125243 8938328
8682 8938328 8647711 8451012 8371352 8239379 8063692 7718162 7654059 7710201 7645639 7644710 7636801
8671 7636801 7555067 7572980 7573849 7571983 7612308 7361005 7277590 7149410 7031799 6855871 6685257
8660F685257j01839j21863r8550k30041j70870k10340j66746q0150j27050j60343
8650E217465k76136k11684K2368l5729k25459k3225p9823k47300k23113j62131
8640C755233k9097j79457o7882k3174n2473j5138o533J5724l3306O7134L8949
8629C469980J02514k2130O1069L8109Q9914j02652o5971k8946N4858R7026N013
8618C698784O0089j37449k76312l38326l8424O6960j53057j15770p1705l5020
8608B659770j74899m6782M0905j58251R6057J90833j4285k09643j44665j06768
8598B132272n1140J8000J25694M6249P3454m0666j09621j18351j14397j20276
8588A841218j0493L2580j94820j51207k7795m1263J05927J76899K3247k6289p7719
$$ plain form
8660 6685257 6583418 6461555 6363005 6132964 5962094 5751754 5585008 5504858 5377808 5217465
8650 5217465 4941329 4729645 4752013 4716284 4490825 4467600 4387777 4140477 3917364 3755233
8640 3755233 3726136 3546679 3478797 3455623 3403150 3388012 3381479 3397203 3363897 3431031 3469980
8629 3469980 3572494 3550364 3611433 3649542 3739456 3636804 3570833 3541887 3596745 3693771 3698784
8618 3698784 3758873 3621424 3345112 3006786 2968362 3035322 2882265 2766495 2694790 2659770
8608 2659770 2484871 2438089 2478994 2320743 2416800 2607633 2593348 2383705 2239040 2132272
8598 2132272 2081132 2099132 2224826 2271075 2344529 2303863 2194242 2075891 1961494 1841218
8588 1841218 1830725 1863305 1668485 1517278 1489483 1448220 1554147 1731046 1754293 1728004 1650285
8577A650285j93058k53226j06683j06395r6129J17931Q2846k33312j78105N6422
8567G40576R2703m3713k52328j84643Q9335J48384O3141n5501r8770Q643k4213
8556D83614O5003O8285q7736R3669P2174j76605l7745N1946N1182M1954O744r7740
8544E34745m4659M8208j66585o0665P0717J85162m4580j1875k73583r1743M7641
8533A92783R1998l3737P7643N781k4364n6801P0698j38664K4407M9758o7220j27514
8521F4768O0680J66470N8696L3295L233j29411r1526k2272L5870l6027j4545Q9295
8509B18526J09843J14621q2054l2381o6367l8732j0207J83720P8033j33212m4154
8498B97636l3371M7898J47397k7586m9203l0498j65793q8513O7360k5504o165
$$ plain form
8577 1650285 1457227 1204001 1097318 990923 894794 1012725 1095571 862259 684154 740576
8567 740576 833279 789566 537238 352595 441930 590314 653455 597954 499184 507827 483614
8556 483614 548617 616902 529166 622835 695009 518404 480659 532605 583787 625741 632485 534745
8544 534745 490086 538294 371709 311044 381761 566923 522343 510468 236885 145142 192783
8533 192783 284781 251044 328687 334468 310104 253303 324001 185337 209744 259502 192282 64768
8521 64768 125448 291918 350614 383909 387142 257731 166205 143933 179803 143776 129231 218526
8509 218526 328369 442990 360936 328555 262188 223456 213249 396969 475002 341790 297636
8498 297636 264265 312163 459560 431974 382771 352273 186480 97967 165327 139823 133658
8487A33658l1561R9811k9705n7698O7544K487M4858N9372p8049o5474l5636l912
8475A05695J58137L6758n0838k7294j6810O2582L7365O9699K14872m9937j13794
8464D26435M2313J07513N5420j57950m9298l9086N305j00079o614j33916r1087
8453E8956N2528P7460N6814J46057J1088j70063l1958J63867L569k55156k5545
8442H7617l6109l8178K99648p0438j2749j41490J2273J04156J92104K1740k49901
8431A68673q3898l9555M5126o1761l6920J33619M4136L0649J69098L8978j27430
8420B80715L7311Q8112j11624m8777P7945Q2512P380j01235M6267K0279o2980
8409C15905j47586M2219n0345p880J70192k8943N091P2139k9257j43399q7203
$$ plain form
8487 133658 102097 201908 172203 114505 182049 184536 229394 288766 210717 145243 109607 105695
8475 105695 263832 300590 249752 222458 205648 268230 305595 375294 590166 540229 426435
8464 426435 468748 576261 631681 473731 424433 385347 390652 290573 283959 150043 58956
8453 58956 111484 188944 245758 391815 402903 232840 200882 364749 368318 113162 87617
8442 87617 51508 13330 312978 242540 229791 88301 100574 204730 396834 418574 168673
8431 168673 84775 45220 90346 28585 -8335 125284 169420 200069 369167 408145 280715
8420 280715 318026 406138 294514 245737 323682 406194 413574 312339 358606 378885 315905
8409 315905 168319 210538 160193 152313 322505 293562 298653 370792 341535 198136 110933
8398A10933P0707n6813j3886Q6731j4022p2526N7758n757l0576P3906M4031O625
8386B57111J55339o4376j00459r6130j0714j15624q0838J82137J24216l3146L0457
8375B47973n6391k9154q7127J2699J34860O0961m8414j28936k3051R0635N4886
8364B28941M0136J07542P9979k09824P507K5517m8887p1604o5118K21k605j04888
8352a3083M5485J45327l1544L5910o3811n6266k2157J78391R0058j59463r770
8341A39077p9107j16504k4897J32972J19092J72770J97553l6645k20393j22980
8331A60938p5869N2108q1304J68063J30112j62809k2673p01o6803j45398j37176
8320a81512M8734L3877O9055p647p866j09614J22146J18970M6386o1619j48328
$$ plain form
8398 110933 181640 124827 110941 197672 183650 111124 168882 163125 132549 206455 250486 257111
8386 257111 412450 348074 247615 151485 140771 25147 -55691 126446 250662 217516 247973
8375 247973 191582 162428 75301 88000 222860 283821 235407 106471 83420 174055 228941
8364 228941 269077 376619 456598 246774 254281 279798 230911 159307 94189 94410 91805 -13083
8352 -13083 32402 177729 146185 182095 118284 62018 39861 218252 308310 148847 139077
8341 139077 59970 -56534 -81431 51541 170633 343403 540956 504311 283918 160938
8331 160938 85069 137177 55873 223936 354048 191239 168566 167865 101062 -44336 -181512
8320 -181512 -132778 -98901 -29846 -37493 -45359 -154973 -32827 86143 132529 70910 -77418
8309g7418j22141L9355J82741j768K0552K66618o8443j99299j20996R5916J04291
8298A19408O981j07975j40223M7521K5015j5364K7494l2367K6057J80698K5824
8287A63069o3602j67578J60025K20062l632J89291q7141k41380j10109L2540J40931
8276B32476N1023j86312j60638P2415n0365N3071J17629J49162K16628p7992k13458
8265B03639J16431R5757j5793q2663l11755m3614J45322J05907O1567Q5303p2179
8254B87922k5247J2170o1854J16027j15244P8497K9895K3542N9115j59926l4387
8243B10510j3481K2882N350l4551j02604O7867j02497j42409k27759m3273R6642
8232b63323J42599J14660J0596k7396Q7660Q6146J10726Q1527J8540r9558P048
$$ plain form
8309 -77418 -199559 -160204 22537 20769 41321 307939 239496 40197 -80799 15117 119408
8298 119408 126389 18414 -121809 -74288 -49273 -64637 -37143 -69510 -43453 137245 163069
8287 163069 99467 -68111 91914 311976 308344 497635 410494 169114 59005 91545 232476
8276 232476 283499 97187 -63451 8964 -41401 11670 129299 278461 495089 417097 203639
8265 203639 320070 415827 400034 317371 5616 -37998 107324 213231 274798 360101 287922
8254 287922 262675 274845 212991 329018 213774 292271 322166 345708 404823 244897 210510
8243 210510 197029 219911 225261 190710 88106 155973 53476 -88933 -316692 -359965 -263323
8232 -263323 -120724 -6064 4532 -22864 64796 150942 261668 343195 361735 262177 269225
8221B69225M9450J0927q6454M2001J8648l8030j73632j65921L7587P2907j82045
8210a45337n8790N8919J04373m1131n583P3189j4997P8272M7253m8005r4863J96405
8198A49705k994j28272Q9553Q0654j90444k4040R0907J8835Q0037n251j407l1355
8186A25928j7635L4954P321o5754j3967p6226n3373J5413J16966p3060j54469
8175a53902j2557K7440J14843J76817n3499q7173P161R0510P6297l6423o7726
8164H1788J05820R2983n5184j02727r4121J33497j08868k60J00892N723j48109
8153A1434l4813R5997N9134o907j39092m3304M7912l4816j13208P0464m4532J68466
8141C6735J24385o0253l2334j2027M8371j7712L3286O7060n1196j20764j07607
$$ plain form
8221 269225 318675 329602 243148 285149 303797 265767 92135 -73786 -36199 36708 -145337
8210 -145337 -204127 -145208 -40835 -81966 -87549 -14360 -29357 48915 96168 48163 -46700 149705
8198 149705 146711 18439 107992 188646 -1798 -25838 65069 83904 163941 158690 157283 125928
8186 125928 108293 143247 150568 84814 70847 -5379 -58752 -43339 73627 567 -153902
8175 -153902 -166459 -139019 -24176 152641 99142 11969 19130 109640 185937 149514 81788
8164 81788 187608 280591 225407 122680 28559 162056 53188 52928 153820 159543 11434
8153 11434 -23379 72618 131752 124845 -14247 -57551 -9639 -44455 -157663 -87199 -131731 36735
8141 36735 161120 100867 68533 56506 104877 87165 120451 187511 136315 15551 -92056
8130i2056O1204L3338J79927J67211o5649j55209j59017K5762R3813j623J09964
8119A97665J27160q7096l1109j10693j46319l5354j2943j17825K9990m534J04918
8108h6140J4094n3410M884J04105n3719k1173P1230J30141j79816L2248P9673
8097D2117J8349n7112J52905l2438r4959j00430j36499J52064J87894J67504N5208
8086C54603l3404j30708K616J33360O2353K0381j51515j36494m2876J73892N2708
8075C04916r0418n1635q0761j33910j2914J23602j1530j05346Q0323p078o461
8064H788M9764M5269O7027L6694M3798Q6651l1074j12162j82390n1870R0260j731
8052D9024M128O5354J29219j05742q1119P8683r5736j92553o9015J1944O5568
$$ plain form
8130 -92056 -30852 2486 182413 349624 283975 128766 -30251 -4489 89324 87701 197665
8119 197665 324825 237729 206620 95927 -50392 -85746 -98689 -216514 -186524 -191058 -86140
8108 -86140 -72046 -125456 -120572 -16467 -70186 -91359 -20129 110012 -69804 -37556 42117
8097 42117 60466 3354 156259 123821 28862 -71568 -208067 -56003 131891 299395 354603
8086 354603 321199 190491 193107 326467 388820 409201 257686 121192 78316 252208 304916
8075 304916 214498 162863 82102 -51808 -64722 58880 47350 -57996 22327 15249 8788
8064 8788 58552 103821 170848 207542 251340 337991 306917 194755 12365 -39505 50755 49024
8052 49024 53152 118506 247725 141983 60864 139547 43811 -148742 -217757 -205813 -140245
8041a40245M065m3432J08895K7056p7524n4712L02636J59323m9771j27897N8414
8030A66808j0955m103k937n0755J66784l0734r9252j46838j20183J7834O6670
8019d7661K19212q7967j18520o9971M1510J78932J31235n4949j15432Q6194Q1361
8008B43944j34351n3842P6740J07798J4348o3280q2734l8409o3637L0877o0176
7997b2722j55516M0726K5288L4221j38951j13899K6423J22120j61829R6395K12526
7986c5218K847k1165R4412O5312j35293l9596J09077K16220M9566j25220r9849
7975H1093m7551J33102M7910J17831j02572k09059J05475M7620k8467j41974j29205
7964a25797M4350L03333M9029j8850L0033r9204l8401J5729o652M9554p9827r4209
$$ plain form
8041 -140245 -136180 -179612 -70717 -43661 -121185 -175897 126739 286062 236291 108394 166808
8030 166808 155853 151750 148813 98058 264842 234108 134856 -11982 -132165 -114331 -47661
8019 -47661 171551 83584 -34936 -104907 -63397 115535 246770 191821 76389 162583 243944
8008 243944 109593 55751 132491 240289 254637 191357 108623 70214 6577 37454 -22722
7997 -22722 -178238 -137512 -112224 -78003 -216954 -330853 -304430 -182310 -344139 -247744 -35218
7986 -35218 -32371 -53536 40876 106188 -29105 -68701 40376 256596 306162 180942 81093
7975 81093 33542 166644 214554 332385 229813 20754 126229 173849 145382 3408 -125797
7964 -125797 -81447 221886 270915 252065 282098 182894 144493 160222 153570 203124 123297 29088
7952B9088J67078j01089k55286O6423k1945J19594J17075J5712N8156M1881L610
7941B40297p2268k7820j15592j10869j05975N0616J38895m1779q6233J06738K36708
7930B12718R2073M1399j52790j69241K2478J03507k19j381J85375J52622m9684
7919D36857q9307j48322j39817j588j93806K6851J14607J37033K38j77456m7268
7908h1978J38366J14519l9746p4098k722o6794k9342M3139o5458j56697K5396
7897a95415J31772J52475k1224O7684j6246M1007l5081j52604j63696M065L7090
7886a50173K00343q6033o7920J75648Q5750K5511j9705p9047r346l4792q000j09434
7874g7198r8879R3393K13278q2862j02331J38241K926L1235J04531J2628j1579
$$ plain form
7952 29088 196166 95077 -160209 -93786 -115731 3863 120938 136650 194806 236687 240297
7941 240297 168029 140209 24617 -86252 -192227 -141611 -2716 -44495 -130728 -23990 212718
7930 212718 304791 346190 193400 24159 46637 150144 149925 148544 333919 486541 436857
7919 436857 347550 199228 59411 57823 -135983 -109132 5475 142508 142746 -34710 -81978
7908 -81978 56388 170907 131161 57063 54341 -12453 -41795 1344 -64114 -220811 -195415
7897 -195415 -63643 88832 67608 135292 119046 160053 124972 -27632 -191328 -187263 -150173
7886 -150173 50170 -35863 -103783 71865 157615 183126 163421 84374 75028 40236 32236 -77198
7874 -77198 -176077 -82684 130594 47732 -54599 83642 86568 117803 222334 234962 223383
7863B23383j24991j25664j02974J01832J91485k1970R751P5318j10229j02918
7853A3023O8522o3866J09220r5459o2951M9490m3462n9222K4810N48O4005o5652
7841f0994P845J90173J1195j34612N515J12033J5518j47167M3149Q7870n3456
7830G7069l7857K295M0947j64763p2948J29382M3354J5891J9325L6189K65779
7819C54663Q4766j29834J5530j94136l7520j69989N8202N7082L6471L0716K20704
7808C26655m2999K9780k4360k48881p6860J70160J07785m6789j76397M9488o0059
7797G523l4113J06908o4801j56608j114J79373r3017j69658J0286L1973M3108
7786a40140l9638M2070K3796J6426N9460N5352N5442l9336j21403M6121l2255
$$ plain form
7863 223383 98392 -27272 -130246 -28414 163071 141101 150852 226170 115941 13023
7853 13023 81545 17679 126899 31440 -31511 17979 -25483 -84705 -59895 -59347 4658 -60994
7841 -60994 -53149 137024 148219 13607 19122 131155 146673 -494 42655 130525 77069
7830 77069 39212 41507 82454 -82309 -155257 -25875 17479 33370 52695 88884 354663
7819 354663 439429 309595 325125 130989 93469 -76520 -18318 38764 75235 105951 326655
7808 326655 283656 313436 289076 40195 -36665 133495 241280 194491 18094 67582 7523
7797 7523 -26590 80318 15517 -141091 -142205 37168 -55849 -225507 -215221 -183248 -140140
7786 -140140 -179778 -137708 -113912 -97486 -38026 17326 72768 33432 -87971 -41850 -74105
7775g4105j12998J30599J54186P0848J5953j33977k18598M5216P727j03540J7497
7764b01192k1447K7020J05075K8787J8755l7238M6871r8748O808k2317j4874q406
7752a70906n3690k6223L4257J60656R8618K5178Q3510l3968j14306k20900j61052
7741c78826j5129J41440O7900m9117R9706K8269Q138R9124M4966j7540J7988P2421
7729A19340j06105O6948K7683N2837J6302Q6560j62347q192K6724k7181p7476
7718A5093l2553O5202J8796m0397k08244L3483Q9854L9315j13298P0315J72001
7707A09567j7045l3636j78680q8216L5697P5245R8790L4547m0215j17808N4865
7696f6889M0639M643Q2046K400r1907k508P6451r871n2516j33681j41495n7214
$$ plain form
7775 -74105 -187103 -56504 97682 168530 184483 50506 -168092 -122876 -115149 -218689 -201192
7764 -201192 -222639 -195619 -90544 -61757 -43002 -80240 -33369 -132117 -125309 -147626 -162500 -170906
7752 -170906 -224596 -250819 -216562 -55906 42712 67890 151400 117432 3126 -217774 -378826
7741 -378826 -393955 -252515 -184615 -233732 -134026 -105757 -97619 1505 46471 28931 46919 119340
7729 119340 13235 80183 107866 160703 177005 263565 101218 93026 119750 92569 15093
7718 15093 -17460 47742 66538 26141 -182103 -148620 -58766 -19451 -132749 -62434 109567
7707 109567 92522 58886 -119794 -208010 -172313 -97068 1722 36269 -3946 -121754 -66889
7696 -66889 -26250 -21607 60439 62839 -29068 -31576 44875 35004 -17512 -151193 -292688 -349902
7684c49902R19J04597J37525j28107L1455L9937R4736J72945k3194o4877N6923
7673G2957n4689m3370K9643m691r517j22159j15219J10620j6899N416j7644o1364
7661b26916Q1311J13223J8300N1564p4242J02979J34817j05481P4652n9332o4587
7650D6288j8515M2292O9010K41876j21572P8966j34200k78379n2104o1028K7390
7639a59976J58117o3768q6498O3420m2251m9781O1940J84143n1475n7374J29356
7628H5853n624m2515j38393K0886J05971Q3374j19477N4345N4420j42053J227
7617d1986P8112l9570l1927Q0473k1610j66250j3747J3070j25611j9411j9175
7606c07632P8394J74908j1635r364j8650L166J25162n3631j68407j07744J63679
$$ plain form
7684 -349902 -348983 -244386 -106861 -234968 -203513 -163576 -68840 104105 80911 16034 72957
7673 72957 18268 -25102 4541 -150 -9667 -131826 -247045 -136425 -153324 -147908 -165552 -226916
7661 -226916 -145605 -32382 -14082 37482 -36760 66219 201036 95555 170207 110875 46288
7650 46288 27773 70065 139075 380951 259379 338345 204145 -74234 -126338 -187366 -159976
7639 -159976 -1859 -65627 -152125 -88705 -130956 -180737 -118797 65346 13871 -43503 85853
7628 85853 80229 37714 -100679 -79793 26178 109552 -9925 44420 98840 -43213 -41986
7617 -41986 36126 -3444 -35371 45102 23492 -142758 -156505 -143435 -269046 -288457 -307632
7606 -307632 -229238 -54330 -65965 -75329 -93979 -90813 34349 -19282 -187689 -295433 -131754
7595a31754K039M598o09k3402N686N4325J43219o4103l2968K749m5509Q3904N0948
7582D9123Q2243m0324j1295K8923L7067k5629M5650o94Q7012j28659p2497j79810
7570a28890k20958j692J31542K01248J43449J33276j27225j13083o8523j02247
7560a53103Q3873J74544k2677n3079O5954p2233p0189L2883R9621m4776j21702
7549h0884p81Q6905k794m7659n1642K2045J03040R5725J15625K2711q8705j89513
7537a5927r6812O581Q4994J26641n0084k15833k9035P9004r5345j1527l6557L9067
7525b14833J53874J00750J6115N9476j1599j71258j34536N5416M8499r0337j6227
7514b04660N1700n4768J26698L2944J35092K3341j00577r3897l372J89177q2400
$$ plain form
7595 -131754 -129715 -125117 -125726 -149128 -143442 -89117 54102 -10001 -42969 -40220 -85729 -1825 49123
7582 49123 131366 91042 79747 108670 145737 120108 165758 165064 252076 123417 50920 -128890
7570 -128890 -349848 -351540 -219998 -18750 124699 257975 130750 17667 -50856 -153103
7560 -153103 -69230 105314 82637 29558 95512 23279 -46910 -14027 85594 40818 -80884
7549 -80884 -81665 5240 2446 -45213 -96855 -74810 28230 123955 239580 262291 173586 -15927
7537 -15927 -112739 -106158 -21164 105477 55393 -160440 -189475 -110471 -205816 -217343 -253900 -214833
7525 -214833 -60959 39791 55906 115382 103783 -67475 -202011 -146595 -98096 -188433 -204660
7514 -204660 -152960 -207728 -81030 -48086 87006 110347 9770 -84127 -87499 101678 19278
7503A9278J89470J08977j0495j59841o3937J26570p9862k52155j1882J31236J24285
7492A21644R8004j24908j21014r4791j23755K5123J39565J729l644j08190L1492
7481a58745J04953l098J1330j16900R2673K67786O1300K9145j48783l3629M5493
7470A51525J8638j10768m8803M5349M3445p1029l3380J00164N5723j48308l7710
7459c5154q0675q1163O4396p0813J5713J51188j7023m4753k227q4838j27497O4758
7447b48088J28093P4692N5459k5689K6912R512J40974M8341k74475j16465R1601
7436h9133L6787N7642O2134r5843j47849l6715Q1944J69131m5486o5106k646O6162
7424h978l4852K6794p8732j79322N9268J44512m5153O4566j9990J25648L5302
$$ plain form
7503 19278 208748 317725 307230 147389 83452 210022 130160 -121995 -133877 -2641 121644
7492 121644 219648 94740 -26274 -121065 -244820 -219697 -80132 -78403 -82047 -190237 -158745
7481 -158745 -53792 -56890 -45560 -162460 -69787 197999 259299 288444 139661 106032 151525
7470 151525 170163 59395 10592 55941 99386 28357 -5023 95141 150864 2556 -35154
7459 -35154 -115829 -196992 -132596 -203409 -187696 -36508 -53531 -98284 -100511 -185349 -312846 -248088
7447 -248088 -119995 -45303 10156 -15533 11379 20891 161865 210206 -64269 -180734 -89133
7436 -89133 -52346 5296 67430 -28413 -176262 -212977 -131033 38098 -7388 -72494 -75140 -8978
7424 -8978 -43830 -17036 -95768 -275090 -215822 -71310 -116463 -51897 -71887 53761 89063
7413H9063j31053n0358j8097K4456m0138P8373J28966L78Q4654j7535k46970J1307
7401h6954m8053P6616J23140J34543r1486p2061o1343j3841N8101O2631l0357
7390E0936o6575L6278q9286k50896J07647O3974K7690j5987J27874R5521j06293
7379a9117n0026K2473Q6204P7712k43919q3490o883J29254k8327R8503l8509j68705
7367b24830j99262m0143K11854J15397m0595j04095j31752O6963J09594J22720
7357a14149j918o2195p2250R7606J47721m9268J5164m3039n2573Q5794J37646
7346H8539j29287j0006K27773j69242o9206N8282P5588J58184L9477q9935j37813
7335D2354n9610J00407K815M7330L1185j46198k34530J50811J39430J51288J39461
$$ plain form
7413 89063 -41990 -92348 -110445 -85989 -126127 -47754 81212 81590 166244 148709 -98261 -86954
7401 -86954 -135007 -58391 64749 199292 107806 35745 -25598 -39439 18662 81293 50936
7390 50936 -15639 20639 -68647 -319543 -211896 -147922 -120232 -136219 -8345 87176 -19117
7379 -19117 -69143 -46670 39534 117246 -126673 -210163 -217046 -87792 -116119 -17616 -56125 -224830
7367 -224830 -424092 -464235 -252381 -136984 -177579 -281674 -413426 -346463 -236869 -114149
7357 -114149 -116067 -178262 -250512 -152906 -5185 -54453 -39289 -82328 -134901 -49107 88539
7346 88539 -40748 -50754 177019 7777 -61429 -3147 72441 230625 270102 180167 42354
7335 42354 -17256 83151 85966 133296 164481 18283 -216247 -65436 73994 225282 364743
7324C64743M0391R681J0855n6667n7688r7746j20225k0890J7265q0331O5547j23731
7312d8796k19080L7057K35372J36553o1385Q3561J69583j872j28940n9731j15657
7301B6665r9808O7958j10844k64767P6258M453O2876J46550P0276l182R0749j55179
7289h7995k62970q7456J98606P4841R0354q1761j23642L5087N0176j147Q2437
7278a13470k8588j9075J6708J39724j26450K6987N62p4283j49634n0216K50891
7267a26844R0610K0774j01433j38594J23572n52j09045P5207R7032N6792J91690
7256A79209q7188p704q2627K8990J43010k9452r2676j39254l9195J35115P3581
7245H1809n3453P6525r4807k60150j00265q3583J72156K63363O1908m0827l0081
$$ plain form
7324 364743 405134 414815 425670 369003 311315 213569 93344 72454 89719 9388 74935 -48796
7312 -48796 -267876 -230819 4553 141106 79721 163282 332865 330993 202053 142322 26665
7301 26665 -73143 -5185 -116029 -380796 -304538 -300085 -237209 -90659 -20383 -23565 67184 -87995
7289 -87995 -350965 -438421 -239815 -164974 -74620 -156381 -280023 -244936 -194760 -195907 -113470
7278 -113470 -142058 -161133 -144425 -4701 -131151 -104164 -103602 -177885 -327519 -377735 -126844
7267 -126844 -36234 -15460 -116893 -255487 -131915 -132467 -241512 -166305 -69273 -12481 179209
7256 179209 92021 84317 1690 30680 173690 144238 51562 -87692 -126887 8228 81809
7245 81809 28356 104881 10074 -250076 -350341 -433924 -261768 1595 63503 22676 -7405
7234g405O5715q4935L5978m3900j17300k1270P4745J83153k0592j4472N8605j19047
7222a0725M8915O7229j49066q9955K64488K23235k87258J9643M7095j1424O4283
7211A86460j37393P646j74290k39594k2120Q677J8162J02186J83272M1384j57405
7200a83015J5319O7678J6426K3800p118q3240K5520J91660K6351M233j97185k1739
7188a21310j03231N1182J88901q7106R5707J45533M3750J05815R6281k62737j53870
7177a085j21896j31088R0987K5746j64939l1585P3142j8037J53399O5169R5082
7166C4895q591j83029l3412P6561J29712J15148J6046p9844j14193n9029J4959
7155i0777Q0304P2871j24718p4976K012J4760L9315j1065j37923K3297o337O7996
$$ plain form
7234 -7405 58310 -26625 9353 -34547 -151847 -173117 -98372 84781 64189 49717 108322 -10725
7222 -10725 38190 105419 -43647 -133602 130886 354121 66863 86506 133601 122177 186460
7211 186460 49067 56713 -117577 -357171 -379291 -370614 -352452 -250266 -66994 -25610 -183015
7200 -183015 -167696 -100018 -83592 -59792 -66910 -150150 -124630 67030 93381 97614 -99571 -121310
7188 -121310 -224541 -173359 15542 -71564 24143 169676 213426 319241 415522 152785 -1085
7177 -1085 -122981 -254069 -163082 -137336 -302275 -333860 -260718 -278755 -125356 -60187 34895
7166 34895 26304 -156725 -190137 -113576 16136 131284 147330 67486 -46707 -105736 -90777
7155 -90777 -10473 62398 -62320 -137296 -135284 -120524 -81209 -92274 -230197 -206900 -213237 -145241
7143a45241J1319o270J53362L3439L9543J8867p7792j06468k8659R5959J28874
7132A16933L3967m4036j6989j02543j28387M2160p8382r6979J2000J41708q732
7121a29280j09167J08348N7814J02506J9836n6429O7971N5975K32095O483j09962
7110B46190O7171l9771O5996j09016k29247m7193J10734r2797j37910j4523k2340
7099b02706K4911l3832o348l7913L0053J53985j32372j6825r8329J8317J75340
7088a25719J36516K7309P8061l9183L1481j7842j59163r9381j592J0976P093j09809
7076b61253m1760n8723O3933O3871J49186K6926O4673J33699K0247p3253j08737
7065b1191L1144o7960q9057r9052n595J06439R4797K8316K9028l0442Q5218R5480
$$ plain form
7143 -145241 -133922 -140192 13170 46609 86152 105019 27227 -79241 -107900 -11941 116933
7132 116933 150900 106864 89875 -12668 -141055 -98895 -177277 -274256 -262256 -120548 -129280
7121 -129280 -238447 -130099 -72285 30221 50057 -6372 61599 117574 349669 356152 246190
7110 246190 313361 273590 339586 230570 1323 -45870 64864 -27933 -165843 -180366 -202706
7099 -202706 -177795 -211627 -217975 -255888 -225835 -71850 -204222 -221047 -319376 -301059 -125719
7088 -125719 10797 38106 116167 76984 108465 90623 -68540 -167921 -169513 -158537 -151444 -261253
7076 -261253 -303013 -361736 -297803 -233932 -84746 -57820 6853 140552 160799 87546 -21191
7065 -21191 9953 -58007 -147064 -246116 -251711 -145272 -50475 -22159 6869 -23573 61645 157125
7053A57125m0168q7810j50943Q3681J04521j52898q3596l0694m419J14263K5637
7042f5301n0584j921K02589J31862k2336p8263n5648k9483p5380r0886l3200J25200
7030d3351J53138l3439m7079j64172j48251j33291o7998O4483J84841J25318J09310
7019d91R9002n1051j85588p949K827j20516j04269J43356J67530K5311J72328
7008A40490J03070J84324J437j18588k25180k6214J04341Q5282p5361q0294K07657
6997C00964J54278P0474k8473j47283j29300q9430J366n0317N0486q977m971l8404
6985H0413r5513j06972l0388p9138j26803n9234K31319O0232K3747J9112J7727
6974f5498Q129j81744p2580m8517N3120J22206L8668J52373O4697n2275j78042
$$ plain form
7053 157125 116957 29147 -121796 -38115 66406 -86492 -170088 -200782 -205201 -90938 -65301
7042 -65301 -115885 -117806 84783 216645 194309 116046 60398 30915 -44465 -135351 -168551 -43351
7030 -43351 109787 76348 29269 -134903 -283154 -416445 -484443 -419960 -235119 -109801 -491
7019 -491 98511 47460 -138128 -146077 -143250 -263766 -368035 -224679 -57149 -31838 140490
7008 140490 243560 427884 429321 310733 85553 59339 163680 248962 173601 93307 300964
6997 300964 455242 525716 497243 349960 220660 131230 132596 82279 132765 123788 118817 80413
6985 80413 -15100 -122072 -152460 -231598 -358401 -417635 -186316 -126084 -102337 -83225 -65498
6974 -65498 -57369 -239113 -311693 -360210 -307090 -184884 -146216 6157 70854 18579 -159463
6963a59463j23046n9395L9463Q1346l0544K03042J98764K7199j69414l8375L1475
6952A052O00O6481j8744J26089j21090j21179J96935L3029L9515O4484j08573
6941A58599k91963M7927J55909j28061j21024k4058J63360k6655j29872L7543
6931a58295r418M704J16897Q9465N780R2639m8913j26580P4356N2696l8245O1928
6919A17014J42748J26117j31193k52929p6690O4271O0220O6104M7297J3230r7738
6908G8451R2934q1822l2393J13848M2683p9986M9716j23924k10979P6620J69627
6897I4775n3194r1007r651k4216q7033n1792j09394P5324J51247j5330r3943R1775
6885a22439J44916N149o2231j6593l5558K04029Q0306k7136j28054N677J3138
$$ plain form
6963 -159463 -282509 -341904 -302441 -221095 -251639 -48597 150167 177366 7952 -30423 1052
6952 1052 1652 68133 49389 175478 54388 -66791 130144 163173 202688 267172 158599
6941 158599 -133364 -85437 70472 -57589 -178613 -202671 -39311 -65966 -195838 -158295
6931 -158295 -167713 -163009 -46112 43353 49133 141772 92859 -33721 40635 93331 55086 117014
6919 117014 259762 385879 254686 1757 -74933 -10662 49558 115662 162959 176189 78451
6908 78451 171385 89563 57170 171018 213701 133715 183431 59507 -151472 -74852 94775
6897 94775 41581 -49426 -59077 -83293 -170326 -222118 -331512 -256188 -104941 -120271 -214214 -122439
6885 -122439 22477 27626 -34605 -51198 -86756 117273 197579 170443 42389 48066 61204
6874F1204n9608L9889j65942j77203J5068N5988R4122N533L7191J18364l438j47676
6862a26508k2578L119J5516J16928N5882L6580r187N1721n0756r9853j52821K3645
6850a58312K5648q9273K3791M2183J14373J8595n0518J01002l5553p9428n3490
6839a40982n8555J16612J74900j46646k472j0949N3050L9710R6486o671j60537
6828d6054p2515M9492O9907q6625M8909M1314j20457J28822J150p2988L5282r724
6816c3487j43055K60255k457o8497l7045l4121j04471j8383J93105p2757l1233
6805i2146N5109L3234J180P0991R0991j14525k04608J01848L7714j7489J14070
6794G6369n7762n8367M5336K8571k11432r5712j2933O6797K0754q3110p0486l1537
$$ plain form
6874 61204 1596 41485 -124457 -301660 -286592 -230604 -136482 -130949 -93758 24606 21168 -126508
6862 -126508 -149086 -145967 -130451 -13523 42359 78939 69752 121473 70717 -29136 -181957 -158312
6850 -158312 -132664 -221937 -198146 -155963 -41590 -22995 -73513 27489 -8064 -87492 -140982
6839 -140982 -199537 -82925 91975 -54671 -57143 -68092 -15042 24668 121154 114483 -46054
6828 -46054 -118569 -69077 830 -85795 -36886 4428 -116029 12793 13943 -59045 -23763 -33487
6816 -33487 -176542 83713 81256 12759 -24286 -58407 -162878 -181261 11844 -60913 -92146
6805 -92146 -37037 -3803 -2623 68368 159359 44834 -159774 -57926 -20212 -37701 76369
6794 76369 18607 -39760 5576 34147 -177285 -272997 -285930 -219133 -198379 -281489 -351975 -383512
6782c83512N3010M8254Q279L8665N5482q783O0095p3876n2613P3422j62208o9917
6770d13702R8934J32060O1840P2874o0832p8466j48129L4643N6061R3700r2204
6759b43221L5704P1688J59991J10375J29083l667k08037j58777r3679M5733K02093
6748D7286J84427N181m3685j75665j70640N8446l4534n1676P6158P4701M7484
6737A7483k4123O9517p4078p6015J1594J16615j0885j40711j4787R7263J4973
6726a3154J53785K6768j1704k24879k49856j3725J41712P2353Q3245K09499K3294
6715A97338r3867P1000P153j58699k756J1544q2500R2383M0006o4434j4206Q343
6703A1305j88299m6241J8409P6385K74843J06914j14454o3379l5435J4605o3393
$$ plain form
6782 -383512 -330502 -282248 -273969 -235304 -179822 -188605 -128510 -202386 -254999 -181577 -343785 -413702
6770 -413702 -314768 -182708 -120868 -47994 -108826 -187292 -335421 -300778 -244717 -151017 -243221
6759 -243221 -207517 -135829 24162 134537 263620 259953 51916 -106861 -200540 -154807 47286
6748 47286 231713 236894 193209 17544 -153096 -94650 -129184 -180860 -104702 -30001 17483
6737 17483 -6640 62877 -11201 -87216 -75622 40993 30108 -110603 -125390 -28127 -13154
6726 -13154 140631 167399 155695 -69184 -319040 -332765 -191053 -118700 -35455 174044 197338
6715 197338 103471 174471 181624 22925 20169 31713 -50787 41596 81602 17168 2962 11305
6703 11305 -176994 -223235 -204826 -128441 146402 253316 138862 75483 40048 54653 -8740
6692h740j6062j4894J54500J5235J0402q7373r9645K4473j57561r9295r3099K9689
6680c42370N0834J97364J28847r1122J20504J83791j396j85046r1298J71548N8848
6669B00504K2659j15064n9260l2287p1800j47678N9611k802m9818M3961J91390
6658C9416K43722p8077l9371n3796j35044j77872q8553K5061J8999K4781J11100
6647a09634J2261o3382O3072J16875O5656o0898p0291J25945j16460l441J56567
6636A16270k5963j9284M9795j7618L1661J51891k97366j9620j0844k995o0434
6625a04507q0104r5008J6293O7060j55898N3351K4801J7971J77994O1486o4570
6614h1131J21625n1947P500n247N0548Q1755L1302n3470o5134J2524N7224k7119
$$ plain form
6692 -8740 -24802 -39696 114804 130039 140441 53068 -46577 -22104 -179665 -278960 -372059 -342370
6680 -342370 -291536 -94172 34675 -56447 64057 247848 246452 61406 -29892 141656 200504
6669 200504 223163 108099 48839 16552 -55248 -202926 -143315 -146117 -195935 -151974 39416
6658 39416 283138 205061 165690 111894 -23150 -201022 -289575 -264514 -245515 -220734 -109634
6647 -109634 -97373 -160755 -97683 19192 84848 23950 -46341 79604 -36856 -40297 116270
6636 116270 90307 71023 120818 103200 134861 286752 -10614 -30234 -41078 -44073 -104507
6625 -104507 -184611 -279619 -263326 -196266 -352164 -298813 -274012 -256041 -78047 -16561 -81131
6614 -81131 40494 -11453 -3953 -9200 41348 123103 154405 100935 35801 48325 105549 78430
6602G8430r4763K184k2540j48778L3624P110J41681L2010R8644n1096J2801J9856
6590A09163p6576m3891j10986n4040j23977J16403J69399J36213l2556j0837r5472
6579a7157l8817J13796M708K8794K2649j3457j38270m2967N3599J19440o7358
6568B4960k7615p747o4631K9260j6279k3129J37008M9951M4942j18122l4715K05708
6556A99591R7879n0334j31940n0391o3776Q27M5477p0382o1982J34743j06362
6545e6650j7625q484q7218J0741J57760r3099N4216Q0544o5374n4988N5733K0867
6533c577O3548k8917r7221l1696m8445K6543J19946j8524m8941l50745n7773P4434
6521d01368K263n9295J22976j9256j30031J64729J69622O5468Q368M0911n386
$$ plain form
6602 78430 -16333 -14149 -36689 -185467 -151843 -144733 -3052 28958 127602 76506 89307 109163
6590 109163 32587 -11304 -122290 -176330 -300307 -183904 -14505 121708 89152 78315 -17157
6579 -17157 -55974 57822 62530 91324 113973 100516 -37754 -80721 -27122 92318 24960
6568 24960 -2655 -10402 -75033 -45773 -62052 -85181 51827 101778 146720 28598 -6117 199591
6556 199591 297470 247136 115196 64805 1029 1856 47333 -23049 -85031 49712 -56650
6545 -56650 -74275 -82759 -169977 -159236 -1476 -94575 -40359 40185 -25189 -80177 -24444 -3577
6533 -3577 59971 31054 -66167 -97863 -146308 -119765 181 -18343 -67284 -418029 -475802 -401368
6521 -401368 -399105 -458400 -335424 -354680 -484711 -319982 -150360 -84892 -76524 -35613 -40999
6510d0999j2547k12882o4123J34904l0587L9092K492P46J26743Q9284r1343M023
6498e5197N6040L6613P248p4569L248n572r55O5857J2763O050n4775o539N7567
6485D7779n0969j33573n1008K7142K54032J74914j10816K6598J8258l9437o756
6474A56164P868l5531j37383j14769n5689k9194R7517k5365o7048J7824Q4526
6463a01080J57717O3718k9842n978j5422q0391j10484p6032Q7642K30659R9950
6452B20457K7125J17262q7690m4495O6395K0649R168Q1205j39403K6070P884m4671
6440B59956K0387j12986m3565n9790q9120Q9870m0058P8910J61841q6796k2676
6429A55973o3420p3774J7644M0535l5832m2585p9768J03392o182n3838J33979
$$ plain form
6510 -40999 -53546 -266428 -330551 -195647 -226234 -187142 -184650 -183904 -57161 32123 -59220 -55197
6498 -55197 843 37456 44704 -29865 -26617 -32189 -33144 32713 45476 51526 -3249 -9788 47779
6485 47779 -3190 -136763 -187771 -160629 93403 268317 157501 184099 202357 162920 156164
6474 156164 164032 128501 -8882 -123651 -179340 -208534 -111017 -136382 -203430 -185606 -101080
6463 -101080 56637 120355 90513 84535 69113 -11278 -121762 -197794 -110152 120507 220457
6452 220457 247582 364844 277154 232659 299054 319703 328871 410076 270673 296743 304627 259956
6440 259956 280343 167357 123792 64002 -25118 64752 24694 103604 265445 178649 155973
6429 155973 92553 18779 36423 76958 41126 -1459 -81227 22165 15983 -37855 96124
6418I6124o662r4070j38438N6350J91407M4348r2480k42571l7683K7139j06361
6407c02897J29461J75637q7359m5166P0933J57190j19390j07319P4684J59163
6397A04937M6147o159q1236j66031p8917J47887Q5748J4955J62232r3502q6469
6386D9592M8575l1577L6727J11218o1525j59806k92357j68347M1797R8504J20857
6375b06342j4330R4683J6009O6999K21865p6509k33679J14077o3856r8289Q4395
6364i4977J59929m8898j35615k942J51327O1932r7502r8277Q2243n0528q7226
6353a60534j16990J73476N6638n8028J21624M8851k0418j08388n9231j2863J30048
6342e815M2054p838p0040j06980n5411Q7847J15749j56027j51893Q2765Q2915
$$ plain form
6418 96124 89462 -4608 -143046 -86696 104711 149059 56579 -185992 -223675 -196536 -302897
6407 -302897 -173436 2201 -85158 -130324 -59391 97799 -21591 -128910 -54226 104937
6397 104937 151084 144925 63689 -102342 -181259 -33372 52376 67331 229563 136061 49592
6386 49592 98167 66590 103317 214535 153010 -6796 -299153 -467500 -425703 -327199 -206342
6375 -206342 -220672 -125989 -109980 -42981 178884 102375 -131304 -17227 -81083 -179372 -94977
6364 -94977 64952 16054 -119561 -122503 28824 90756 -6746 -105023 -22780 -73308 -160534
6353 -160534 -277524 -104048 -47410 -105438 16186 65037 44619 -63769 -123000 -135863 -5815
6342 -5815 36239 28401 -41639 -148619 -204030 -116183 -434 -156461 -308354 -225589 -142674
6331a42674R9200J7551j694L0682J3514p4698L7223P0673j10877M3714J68030
6320A50644O7507p7363k8272J84362J02178p1362k39862j70561O2094p7384o4154
6309a62173j45108O8754k3374O7525J69535N623q4516l6431p9254o6286M2674
6298b43031O1480J10542k3761j71706L4728K24054n7983p1029K3181M25J0699
6287a02401O0701N137j32976K8988P3546L3312N8022m5195J38340J64083k7903
6276B53654J7548k7499J0114J22059j24183m0146n1566J02615K25987j6570j96977
6265B75036r9934K2832M282j529O0425l445M6285J4107j12620j08040k14619m5769
6253a62989J6418n9128P1004Q9961O016q831n4907O5667J27882k2726k1284L6922
$$ plain form
6331 -142674 -43474 -25923 -27617 3065 16579 -58119 -20896 49777 -61100 -17386 150644
6320 150644 218151 140788 112516 296878 399056 327694 87832 -82729 -20635 -98019 -162173
6309 -162173 -307281 -238527 -261901 -194376 -24841 -19218 -103734 -140165 -219419 -285705 -243031
6298 -243031 -181551 -71009 -94770 -266476 -231748 -7694 -65677 -136706 -113525 -113100 -102401
6287 -102401 -41700 -36563 -169539 -140551 -67005 -33693 24329 -20866 117474 281557 253654
6276 253654 271202 243703 253817 375876 251693 211547 159981 262596 488583 472013 275036
6265 275036 175102 197934 202216 200687 261112 257667 303952 318059 205439 97399 -117220 -162989
6253 -162989 -146571 -205699 -134695 -44734 -38718 -47549 -102456 -36789 91093 68367 47083 84005
6241H4005R8355j08253j27340m692j43448k9612K05104J06009P1465J40983o9314
6230B23262j54152r647L4777J13157j3858l9693Q2149N5646j5622k4488j05765
6219A45766j30464m8732P1432N128J65154m0972J9571j5174o2166P8966j73966
6208A4543j19651m5917J13314J51152Q7746r9225j25770Q6873Q5166j66542k3661
6197d1972l3288R7908Q4952r8629O9032R596j03050j32787J62847j7137J0330
6186G802j06932j92877J12073R4593n2413q9371l4601J8792J6951J11673Q5989
6175b8321j62576j26285J63930M5956L8277Q6816Q5544q0683p2707r0236J12927
6164b7358J45035o3483q7797L1570N2611m9154q684Q6840j17514m187o1134j50241
$$ plain form
6241 84005 182360 74107 -53233 -57925 -201373 -230985 -25881 80128 151593 292576 223262
6230 223262 69110 59463 94240 207397 193539 153846 235995 291641 276019 251531 145766
6219 145766 15302 -33430 38002 43130 208284 167312 186883 171709 109543 188509 14543
6208 14543 -105108 -151025 -37711 113441 201187 101962 -23808 63065 148231 -18311 -41972
6197 -41972 -75260 22648 107600 8971 78003 87599 -15451 -148238 14609 -2528 7802
6186 7802 -99130 -292007 -179934 -85341 -137754 -227125 -261726 -242934 -225983 -114310 -28321
6175 -28321 -190897 -317182 -153252 -107296 -69019 17797 103341 22658 -50049 -140285 -27358
6164 -27358 117677 54194 -33603 -2033 50578 1424 -7260 79580 -37934 -42121 -103255 -253496
6152b53496j48233Q3697K63594J13901p5852j0265l9313l1489l3571J01770O6724
6141C7467M6400K5788j38848r8683K6198P1166J0434R6923N3140j16496j7151
6130c662m5J78461J05970J29038p4246p1290j3402R7016j15091k0522p7143j59005
6118b3921n3977M3078k3894r0432j07078l6514O2634k4599j9909P0186K21370
6107A6944k6194K09198n2500n6930p3387l5403j4474p8126Q779L5254l9309K0824
6095h5324n2921L6925P870J33210J11445j3632j21099r676J38520q5084Q2437
6084A42671J9870K3220P0139q2686k39433J47801K26531m2329N1959K7803j28629
6073B16917j17115k1258K2869j27257o0220j2341J85071K9303j36115j61646m3806
$$ plain form
6152 -253496 -401729 -318032 -54438 59463 -16389 -26654 -65967 -97456 -131027 -29257 37467
6141 37467 83867 109655 -29193 -127876 -101678 -30512 -20078 76845 129985 13489 -3662
6130 -3662 -3707 174754 280724 409762 335516 264226 250824 347840 232749 212227 135084 -23921
6118 -23921 -77898 -34820 -58714 -149146 -256224 -292738 -230104 -254703 -274612 -204426 16944
6107 16944 -9250 199948 147448 90518 17131 -18272 -32746 -110872 -102093 -66839 -106148 -85324
6095 -85324 -138245 -101320 -93450 39760 151205 137573 16474 6798 145318 60234 142671
6084 142671 162541 185761 255900 173214 -66219 81582 308113 265784 317743 345546 216917
6073 216917 99802 78544 101413 -25844 -86064 -98405 86666 115969 -20146 -181792 -225598
6062b25598m8158m2193J04595J75922J6595j25501L3663n7098J1241J34721N0887
6051B9076l5816R070L2820K1043j10053J44720J10422p5773j01195k06336Q8171
6040i3851J64862M5317m4340l1059q5178P856j7415J15009m6259j70499k3589
6029a79146n5041O034q8878j07805J87142M2569R7897J85367m7780M9070O0864
6018A50293k8097L8221K1166k014r9869n3906M1559o7985j0134K748K948j10977
6006a16047j30259j5722R931K15158J50175L6214q0657N0023r2562k07791K2090
5995a59447J98221J08868K7365j30818r7854p0090j0383n971q6120o7369J27122
5984a66476j02219R3421K13147J56701l948O6685n1198M9947K5275j42564j96190
$$ plain form
6062 -225598 -273756 -315949 -211354 -35432 -18837 -144338 -110675 -167773 -156532 -21811 29076
6051 29076 -6740 2330 35150 56193 -53860 90860 201282 125509 24314 -182022 -93851
6040 -93851 71011 116328 71988 40929 -44249 -36393 -53808 61201 14942 -155557 -179146
6029 -179146 -234187 -228153 -317031 -424836 -237694 -195125 -97228 88139 40359 89429 150293
6018 150293 122196 160417 181583 179569 79700 25794 67353 -632 -10766 -8018 -5070 -116047
6006 -116047 -246306 -262028 -252097 -36939 113236 149450 68793 118816 26254 -181537 -159447
5995 -159447 38774 147642 175007 44189 -53665 -123755 -134138 -140109 -226229 -293598 -166476
5984 -166476 -268695 -175274 37873 194574 190626 257311 206113 256060 281335 138771 -57419
5973e7419o3724o1456l8729Q048O3647J18291o3006k08015m0519J42840J64792
5962c5250Q934Q4066o2284o5500k2251Q127P135k4181P9934R3923K9109j03994
5950b232n2579O2916j34720q7912J77k2453p5781N7938J82790J04240q878n9764
5938c6258J53698J23707J05506j60721j1777q2846M7212J22625j10171N279p8916
5927G7338p4115N2651l1875j50851k28696j66868p9367J14365J20113P7118J27033
5916a63154j5805j1050l34Q7356J7953j17603j08876J0282R0373k4052K11782
5905b3128k1736M0460J83234M093l3876p035N8473j93942k06027j1067O7414J0854
5893a32283J50465j8207n494N1739q5053M4123J1845o3642j29964J17131J89200
$$ plain form
5973 -57419 -121143 -182599 -221328 -213280 -149633 -31342 -94348 -302363 -342882 -200042 -35250
5962 -35250 -26316 57750 -4534 -70034 -92285 -84158 -77023 -101204 -21270 72653 101762 -2232
5950 -2232 -54811 8105 -126615 -214527 -214350 -236803 -312584 -254646 -71856 32384 23506 -36258
5938 -36258 117440 241147 346653 185932 174155 91309 138521 261146 150975 156254 77338
5927 77338 3223 55874 23999 -126852 -355548 -522416 -601783 -487418 -367305 -290187 -163154
5916 -163154 -178959 -190009 -190343 -102987 -85034 -202637 -311513 -301231 -210858 -234910 -23128
5905 -23128 -44864 -4404 178830 182923 149047 142012 200485 6543 -199484 -210551 -143137 -132283
5893 -132283 18182 -25 -5519 46220 -38833 5290 17135 -46507 -176471 -59340 129860
5882A29860J13210j8510l1188J9463P2670j4850j00800Q5030O6643j8946q8475
5871B14107j01458m066l2028j6161P3096J03308j03189j14614m8034Q4766O1918
5860A17645j3167K0949M6034P1767r8049L3040j26099m7069J36952K8781r371
5849A61413j09919L9452R3818n2237j8476k1736j33897j8568l7303N2553j5452
5838f0352k08300k3250J06406J3973O7158K8846N5235k1897q0332k5890n300L9053
5826a14650M4133J43730J47945M2703L0504p2001j35200N3226M1770K6870l9000
5815A70030N4524r2177M577j45539k6454K1098l0097k8307k2006P0587N6401j09522
5803g6885l3494N5583J60480M0814L9137J0479j8839j05356o2631P1144K3640
$$ plain form
5882 129860 243070 224560 193372 212835 285505 270655 169855 254885 321528 302582 214107
5871 214107 112649 108583 76555 60394 133490 236798 133609 18995 -29039 55727 117645
5860 117645 104478 125427 171461 243228 145179 178219 52120 5051 142003 170784 161413
5849 161413 51494 90946 184764 132527 114051 92315 -41582 -60150 -97453 -44900 -60352
5838 -60352 -268652 -291902 -185496 -171523 -104365 -75519 -20284 -42181 -122513 -148403 -153703 -114650
5826 -114650 -70517 73213 221158 263861 294365 222364 87164 140390 182160 209030 170030
5815 170030 224554 132377 136954 -8585 -35039 -13941 -44038 -72345 -94351 -23764 32637 -76885
5803 -76885 -110379 -54796 105684 146498 185635 196114 177275 71919 9288 80432 104072
5792A04072m1603J23673R5019k07464k7798J69955J40395j54740j97053j2927
5782h471K07736J6277j23937j39253J180N6319m8592m4636n4217o9836j08305
5771c15735J32582L22325J49392o8462j62432J6075m1582o526J0759q1327n4009
5760i8940n4866j52613o1727R385J2547p2138m8785K6058J52513J94132M2069
5749e2365l1428k29128j13205J31202J05576L263J5569p277K34079J61818m9959
5738A68145j51790j51725J13858j33237N0944l1268m4021K0727n6651o0305Q4187
5727a91136M3868N584Q663J69301l1469k01952j19642J18585m3801O070J47169
5716h8760J40031n8877M9243P5204r889j14040j0738n671K996O5661k291O2376
$$ plain form
5792 104072 62469 186142 281161 73697 45899 215854 356249 201509 4456 -8471
5782 -8471 199265 215542 91605 -47648 -46468 9851 -38741 -83377 -137594 -207430 -315735
5771 -315735 -183153 139172 288564 220102 57670 73745 32163 25637 36396 -44931 -98940
5760 -98940 -153806 -306419 -368146 -358761 -346214 -418352 -467137 -441079 -288566 -94434 -52365
5749 -52365 -83793 -312921 -426126 -294924 -189348 -186085 -170516 -177793 56286 218104 168145
5738 168145 16355 -135370 -21512 -154749 -103805 -135073 -179094 -158367 -215018 -275323 -191136
5727 -191136 -147268 -141684 -133021 36280 4811 -197141 -316783 -198198 -241999 -235929 -88760
5716 -88760 51271 -7606 41637 116841 106952 -7088 -17826 -23497 -20501 45160 42869 105245
5704A05245q0170j39528p0502P119m1464J108m654J51820K02491J7364J2325Q3664
5692B44818r1533L1366J5529m7774j30012p9682o1642L1705l2369q385K22448
5681I4469m1310p5253o066q3562L4676l4754L6826M9249J29008j1945j0600M2427
5669A23165j08634j79360n9968q534P7235M3804o3339Q8639J03162L3387j72960
5658a23403j94425Q3767J60660M0350j28070L1834J38657R6151n8818j30102q1283
5647a64682J36286p8489r6493O0230J47383N3714n4477P4680j47586j36710J36600
5636f9544J82337J06860J9476J8615j43100n7975L5894J32106r1548K6055J44864
5625C04040O94r5852m0656k6370M0525j34259p6249j76147J71656K56105M1846
$$ plain form
5704 105245 25075 -114453 -184955 -177836 -219300 -218192 -222846 -71026 131465 148829 161154 244818
5692 244818 153285 184651 200180 152406 22394 -57288 -118930 -87225 -119594 -127979 94469
5681 94469 53159 -22094 -28160 -111722 -77046 -111800 -74974 -25725 103283 91338 80738 123165
5669 123165 14531 -164829 -224797 -233331 -156096 -112292 -175631 -86992 16170 49557 -123403
5658 -123403 -317828 -234061 -73401 -33051 -161121 -129287 9370 105521 46703 -83399 -164682
5647 -164682 -28396 -106885 -203378 -143148 4235 57949 3472 78152 -69434 -206144 -69544
5636 -69544 112793 219653 239129 257744 114644 56669 92563 224669 133121 159176 304040
5625 304040 304734 208882 168226 141856 182381 48122 -28127 -204274 -32618 223487 265333
5614B65333j11433N0146j08326j25006q3514J3416l885K8807r4013p9428K73522
5603B5619J777l0058p4463L1873q8125O6218j32794l6723j1632J34382J43604
5592B9678K5911J05636J22883j12433K9911k5967n4610j42646p8299n4634O6231
5581h8339P3218o4782J01210j03810p9489p5841M7815p254R635M0239k17911J12481
5569b52828R9471J08663M9323n0861L8424J64585p6058j68968R8677R3353j248
5558A02533m9463j04087k8059M9076Q6936q9367j7089M6694N3005J44349m8792
5547A45736K4741K9017n6577m8945j0103J47356J4453j47198q1624j65772m2645
5536a91561K4788J05951J24059J09765J454j56259j13716n6109K1826O390J68035
$$ plain form
5614 265333 153900 204046 95720 -29286 -112800 -99384 -103269 -74462 -168475 -247903 25619
5603 25619 27396 -2662 -77125 -45252 -133377 -67159 -199953 -236676 -248308 -113926 29678
5592 29678 55589 161225 284108 171675 201586 175619 121009 -21637 -99936 -154570 -88339
5581 -88339 -15121 -79903 21307 -82503 -161992 -237833 -190018 -197272 -187637 -147398 -365309 -252828
5569 -252828 -153357 -44694 4629 -46232 -7808 156777 80719 -88249 10428 103781 102533
5558 102533 53070 -51017 -79076 -30000 56936 -32431 -49520 -2826 50179 194528 145736
5547 145736 170477 199494 142917 93972 83869 231225 245678 98480 16856 -148916 -191561
5536 -191561 -166773 -60822 63237 173002 174456 18197 -95519 -151628 -129802 -123412 44623
5525D4623J03962n606p7635j9526N1874J62121J3923r5416j01483M0555M4811
5514A62203j2327M3032o749q7134l4810K2150r2201M7968k4865p3687K15091m3949
5502A14722j78257k9209J06343J36000o7951L1266j11850j35055Q4321j6004m3597
5491a09271N1426M0135R6822K4837q7882j10367R8862R7962Q3018L9388l8917
5480A86013l4780r611q8368j63008M7946J3015J18332N5564J7712p2934j608J01401
5468A69674J49522P1167j42674k54366o8720N0951R7116P428P3015k0410q4271
5457D8432Q5233R016p7893j12845p8844j62853O8054Q1863J18095J24405p7542
5446B5121j9060q5956n8924q941K93243N0305k7j6687k3495j43059k06151J36807
$$ plain form
5525 44623 148585 142979 65344 45818 97692 259813 273736 178320 76837 117392 162203
5514 162203 149876 192908 186159 99025 64215 86365 -5836 42132 17267 -56420 158671 114722
5502 114722 -63535 -92744 13599 149599 81648 112914 1064 -133991 -49670 -65674 -109271
5491 -109271 -57845 -17710 79112 103949 16067 -94300 4562 102524 185542 224930 186013
5480 186013 151233 141622 53254 -109754 -61808 -48793 69539 125103 142815 69881 68273 169674
5468 169674 319196 390363 247689 -6677 -75397 -24446 72670 80098 153113 132703 48432
5457 48432 133665 142681 64788 -48057 -126901 -289754 -221700 -139837 -21742 102663 25121
5446 25121 6061 -79895 -138819 -147760 145483 195788 195761 179074 155579 12520 -193631 -56824
5434e6824J31187l4002L5532O1896o8266k50947k77291L5423M893K19284J64523
5423c4592J00476q1994k13730L7438K29584R2412o2604j91279M922O6821Q2927
5412C0381M5451p5842K1258n5465P3805j11749q1306J29572o3357l0265J3478
5401a04039o240o6797J8640K8777r600l5909K0471O3411R7677L584J69292p080
5389A72187j85321o7410j69541k0863R2780J30840R8852j1989N5140J28687j27264
5378I6098j17748J14185N8607n9786N3147P1836o4049N0292L0805n9135m9818
$$ plain form
5434 -56824 74363 40361 75893 137789 69523 -181424 -458715 -423292 -418399 -199115 -34592
5423 -34592 65884 -16110 -229840 -192402 37182 129594 66990 -124289 -119367 -52546 30381
5412 30381 75832 -10 21248 -34217 39588 -72161 -153467 -23895 -87252 -117517 -104039
5401 -104039 -110279 -177076 -158436 -129659 -139259 -175168 -154697 -91286 6391 9975 179267 172187
5389 172187 -13134 -80544 -250085 -270948 -178168 -47328 51524 39535 94675 223362 96098
5378 96098 -21650 92535 151142 91356 144503 216339 152290 202582 233387 174252 124434
$$ [...]
##END NTUPLES=NMR SPECTRUM
##END=
