##TITLE=Analysis number 310757
Compound Code cc 45622
Book Reference 440/30
Project Code adrs
Chemist Name craigr
##JCAMPDX= 6.0         $$ Bruker NMR JCAMP-DX V2.0
##DATA TYPE= NMR SPECTRUM
##DATA CLASS= NTUPLES
##ORIGIN= Bruker BioSpin GmbH
##OWNER= NMR
$$ XWIN-NMR		Version 3.5
$$ Thu Jun 23 09:42:53 2005 GMT Daylight Time (UT+1h)  MAYBRIDGE\NMR@NMR_250MHZ
##.OBSERVE FREQUENCY= 250.131544655141
##.OBSERVE NUCLEUS= ^1H
##.ACQUISITION MODE= SIMULTANEOUS (DQD)
##.ACQUISITION SCHEME= undefined
##.AVERAGES= 16
##.DIGITISER RES= 18
##SPECTROMETER/DATA SYSTEM= dpx250
##.PULSE SEQUENCE= zg30
##.SOLVENT NAME= CDCl3
##.SHIFT REFERENCE= (INTERNAL, CDCl3, 0, 16.4571)
##AUDIT TRAIL= $$ (NUMBER, WHEN, WHO, WHERE, WHAT)
$$ ##TITLE= Audit trail, XWIN-NMR		Version 3.5
$$ ##JCAMPDX= 5.01
$$ ##ORIGIN= Bruker BioSpin GmbH
$$ ##OWNER= NMR
$$ C:\u/data/dgb/nmr/ADRS/4580/pdata/1/auditp.txt
$$ ##AUDIT TRAIL=  $$ (NUMBER, WHEN, WHO, WHERE, WHAT)
(   1,<2005-06-23 09:42:08.63 +100>,<MAYBRIDGE\NMR>,<NMR_250MHZ>,
      <created by zg, POWCHK disabled, PULCHK disabled
       configuration hash MD5:
       62 19 C7 07 E1 42 D1 B7 37 6C 3D D0 77 39 F9 E6
       data hash MD5: 64K
       A7 36 DD D6 13 19 E1 AA 1B 5F DA C2 D8 9A 18 FB>)
(   2,<2005-06-23 09:42:30.58 +100>,<MAYBRIDGE\NMR>,<NMR_250MHZ>,
      <Start of raw data processing
       ef LB = 0.3 FT_mod = 6 PKNL = 1 SI = 32K 
       data hash MD5: 32K
       A9 36 3A EC 32 5B DF C8 A8 A6 52 7F CF 21 E3 F6>)
(   3,<2005-06-23 09:42:36.14 +100>,<MAYBRIDGE\NMR>,<NMR_250MHZ>,
      <apk 
       data hash MD5: 32K
       5A 7A 05 4D EF AE 54 12 98 A5 E5 B9 70 09 D9 45>)
(   4,<2005-06-23 09:42:37.75 +100>,<MAYBRIDGE\NMR>,<NMR_250MHZ>,
      <abs ABSG = 5 
       data hash MD5: 32K
       0A 13 9B 91 98 2F 47 D7 8E 8D BA 8C 6B 30 01 2C>)
$$ ##END=
$$ 
$$ hash MD5
$$ 10 46 12 D8 84 92 61 F2 88 58 0C 40 E7 D3 19 EA
##$RELAX= 
##$RELAX= 
##$RELAX= 
##$RELAX= 
##$RELAX= 
##$RELAX= 
##$RELAX= 
$$ Bruker specific parameters
$$ --------------------------
##$DU= <C:\u>
##$EXPNO= 4580
##$NAME= <ADRS>
##$PROCNO= 1
##$TYPE= <nmr>
##$USER= <dgb>
##$AMP= (0..31)
100 100 100 100 100 100 100 100 100 100 100 100 100 100 100 100 100 100 
100 100 100 100 100 100 100 100 100 100 100 100 100 100 
##$AQSEQ= 0
##$AQ_mod= 3
##$AUNM= <au_zg>
##$AUTOPOS= <58 >
##$BF1= 250.13
##$BF2= 250.13
##$BF3= 250.13
##$BF4= 250.13
##$BF5= 500.13
##$BF6= 500.13
##$BF7= 500.13
##$BF8= 500.13
##$BYTORDA= 1
##$CFDGTYP= 0
##$CFRGTYP= 5
##$CHEMSTR= <none>
##$CNST= (0..31)
1 1 145 1 1 1 1 1 1 1 1 1 1 1 1 1 1 1 1 1 1 1 1 1 1 1 1 1 1 1 1 1 
##$CPDPRG= <>
##$CPDPRG1= <>
##$CPDPRG2= <>
##$CPDPRG3= <>
##$CPDPRG4= <mlev>
##$CPDPRG5= <mlev>
##$CPDPRG6= <mlev>
##$CPDPRG7= <mlev>
##$CPDPRG8= <mlev>
##$CPDPRGB= <>
##$CPDPRGT= <>
##$D= (0..31)
0 1 0 0 0 0 0 0 0 0.06 0 0 0 0 0 0 0.0002 0 0 0 0 0 0 0 0 0 0 0 0 0 0 
0 
##$DATE= 1119516126
##$DBL= (0..7)
120 120 120 120 120 120 120 120 
##$DBP= (0..7)
150 150 150 150 150 150 150 150 
##$DBP07= 0
##$DBPNAM0= <>
##$DBPNAM1= <>
$$ [...]
##$SUBNAM7= <"">
##$SUBNAM8= <"">
##$SUBNAM9= <"">
##$SW= 20.6930455092707
##$SWIBOX= (0..15)
0 0 3 0 0 0 0 0 0 0 0 0 0 0 0 0 
##$SW_h= 5175.983436853
##$TD= 65536
##$TD0= 1
##$TE= 295.16
##$TE2= 300
##$TE3= 300
##$TEG= 300
##$TL= (0..7)
0 120 120 120 120 120 120 120 
##$TP= (0..7)
150 150 150 150 150 150 150 150 
##$TP07= 0
##$TPNAME0= <>
##$TPNAME1= <>
##$TPNAME2= <>
##$TPNAME3= <>
##$TPNAME4= <>
##$TPNAME5= <>
##$TPNAME6= <>
##$TPNAME7= <>
##$TPOAL= (0..7)
0.5 0.5 0.5 0.5 0.5 0.5 0.5 0.5 
##$TPOFFS= (0..7)
0 0 0 0 0 0 0 0 
##$TUNHIN= 0
##$TUNHOUT= 0
##$TUNXOUT= 0
##$USERA1= <user>
##$USERA2= <user>
##$USERA3= <user>
##$USERA4= <user>
##$USERA5= <user>
##$V9= 5
##$VALIST= <valist>
##$VCLIST= <CCCCCCCCCCCCCCC>
##$VD= 0
##$VDLIST= <DDDDDDDDDDDDDDD>
##$VPLIST= <PPPPPPPPPPPPPPP>
##$VTLIST= <TTTTTTTTTTTTTTT>
##$WBST= 1024
##$WBSW= 4
##$XGAIN= (0..3)
0 0 0 0 
##$XL= 0
##$YL= 0
##$YMAX_a= 436879
##$YMIN_a= -535358
##$ZGOPTNS= <>
##$ZL1= 120
##$ZL2= 120
##$ZL3= 120
##$ZL4= 120
##$ABSF1= 16.4571
##$ABSF2= -4.236073
##$ABSG= 5
##$ABSL= 3
##$ALPHA= 0
##$AQORDER= 0
##$ASSFAC= 0
##$ASSFACI= 0
##$ASSFACX= 0
##$ASSWID= 0
##$AUNMP= <proc_1d>
##$AZFE= 0.1
##$AZFW= 0.1
##$BCFW= 0
##$BC_mod= 0
##$BYTORDP= 0
##$COROFFS= 0
##$CY= 12.5
##$DATMOD= 1
##$DC= 0
##$DFILT= <>
##$DTYPP= 0
##$F1P= 14.0000005364418
##$F2P= -0.99999901652339
##$FCOR= 0.5
##$FTSIZE= 32768
##$FT_mod= 6
##$GAMMA= 0
##$GB= 0
##$INTBC= 1
##$INTSCL= 1
##$ISEN= 128
##$LB= 0.3
##$LEV0= 0
##$LPBIN= 0
##$MAXI= 10000
##$MC2= 0
##$MEAN= 0
##$ME_mod= 0
##$MI= 0
##$NCOEF= 0
##$NC_proc= -4
##$NLEV= 6
##$NOISF1= 0
##$NOISF2= 0
##$NSP= 0
##$NTH_PI= 0
##$NZP= 0
##$OFFSET= 16.4571
##$PC= 1
##$PHC0= -79.64129
##$PHC1= 6.827907
##$PH_mod= 1
##$PKNL= yes
##$PPARMOD= 0
##$PSCAL= 4
##$PSIGN= 0
##$REVERSE= no
##$SF= 250.130016231508
##$SI= 32768
##$SIGF1= 0
##$SIGF2= 0
##$SINO= 400
##$SIOLD= 32768
##$SREGLST= <1H.CDCl3>
##$SSB= 0
##$STSI= 32768
##$STSR= 0
##$SW_p= 5175.98343685301
##$SYMM= 0
##$S_DEV= 0
##$TDeff= 65536
##$TDoff= 0
##$TI= <Analysis number 999999
Compound Code 99
Book Reference 9
Project Code 9>
##$TILT= no
##$TM1= 0
##$TM2= 0
##$TOPLEV= 0
##$USERP1= <user>
##$USERP2= <user>
##$USERP3= <user>
##$USERP4= <user>
##$USERP5= <user>
##$WDW= 1
##$XDIM= 32768
##$YMAX_p= 303555001
##$YMIN_p= -143659
$$ End of Bruker specific parameters
$$ ---------------------------------
##NTUPLES= NMR SPECTRUM
##VAR_NAME=  FREQUENCY,     SPECTRUM/REAL,   SPECTRUM/IMAG
##SYMBOL=    X,             R,               I
##VAR_TYPE=  INDEPENDENT,   DEPENDENT,       DEPENDENT
##VAR_FORM=  AFFN,          ASDF,            ASDF
##VAR_DIM=   32768,         32768,           32768
##UNITS=     HZ,            ARBITRARY UNITS, ARBITRARY UNITS
##FACTOR=    0.157963299565203, 1,           1
##FIRST=     4116.41466875014, 0,            0
##LAST=      -1059.56876810287, 0,           0
##MIN=       -1059.56876810287, -143659,     0
##MAX=       4116.41466875014, 303555001,    0
$$ Real data points
##PAGE= N=1
##DATA TABLE= (X++(R..R)), XYDATA
$$ [...]
$$ plain form
18523 197241 207016 182426 160538 170334 183054 221792 197980 145363 134331 142008 140955 129123
18511 129123 152117 170670 167204 168670 206360 252432 266231 264816 239946 237126 277976 309584
18499 309584 314867 299271 299715 286860 237552 208657 231037 250175 237350 211803 195325 213855
18487 213855 215500 194755 193835 200860 258085 253535 224207 223416 221702 240796 286559 281248 279888
18474 279888 298401 275307 263602 285295 312793 307605 296010 261211 266918 297168 271194 232489
18462 232489 246399 283758 308965 352086 349248 363785 380110 404766 423043 427679 434610 433865
18450 433865 413600 393492 413602 463325 459239 459908 460743 481666 537456 549476 544446 522017 497534
18437 497534 503491 510514 470075 448881 522163 605224 656852 641684 641735 644233 651351 662249 693163
$$ packed form
18523A97241R775k4590k1888R796J2720L8738k3812n2617j1032P677j053j1832
18511A29123K2994J8553l466J466L7690M6072J3799j415k4870k820M0850L1608
18499C09584N283j5596M44j2855m9308k8895K2380J9138j2825k5547j6478J8530
18487B13855J645k0745r20P025N7225m550k9328p91j714J9094M5763n311j360
18474B79888J8513k3094j1705K1693K7498n188j1595l4799N707L0250k5974l8705
18462B32489J3910L7359K5207M3121k838J4537J6325K4656J8277M636O931p45
18450D33865k0265k0108K0110M9723m086O69Q35K0923N5790J2020n030k2429k4483
18437D97534N957P023m0439k1194P3282Q3061N1628j5168N1K498P118J0898L0914
$$ plain form
18424 693163 711274 736778 773985 780866 799512 821932 835095 833625 887054 886653 889158 926608
18412 926608 950681 942345 923069 923802 960442 1029389 1062165 1055298 1083464 1142460 1167993 1181205
18400 1181205 1186949 1218783 1279067 1269209 1291581 1318027 1322742 1366856 1451048 1519878 1577936 1644176
18388 1644176 1733966 1823359 1922998 1991428 2081098 2227411 2315147 2451232 2609024 2831307
18378 2831307 3033582 3252494 3510253 3801588 4119026 4465434 4826122 5239455 5692600
18369 5692600 6226116 6775660 7427626 8204225 9090833 10088099 11161069 12381054 13746024
18360 13746024 15085880 16376127 17724927 19074380 20286983 21310223 22586630 24543192
18352 24543192 27416310 31296301 35917266 40882990 46313452 52271315 57649067 60448352
$$ packed form
18424F93163J8111K5504L7207O881J8646K2420J3163j470N3429m01K505L7450
18412I26608K4073q336j9276P33L6640O8947L2776o867K8166N8996K5533J3212
18400A181205N744L1834O0284r858K2372K6446M715M4114Q4192O8830N8058O6240
18388A644176Q9790Q9393R9639O8430Q9670J46313Q7736J36085J57792K22283
18378B831307K02275K18912K57759K91335L17438L46408L60688M13333M53145
18369E692600N33516N49544O51966P76599Q86608R97266J072970J219985J364970
18360A3746024J339856J290247J348800J349453J212603J023240J276407J956562
18352B4543192K873118L879991M620965M965724N430462N957863N377752K799285
$$ plain form
18344 60448352 60516354 59520825 57829707 54601377 50232692 46076953 42758795 40021167
18336 40021167 37786391 36141119 35015993 33972007 32525519 30760252 28985806 27336795
18328 27336795 25691717 24115090 22762834 21736982 20991912 20497448 20206294 20045127 19985138
18319 19985138 20051922 20223270 20490357 20850582 21296328 21828006 22475623 23288186 24272385
18310 24272385 25476436 26951458 28523906 30031020 31498430 33039415 34411364 35297219
18302 35297219 35943657 36857868 38343607 40325637 42926164 46405542 50526462 54228955
18294 54228955 56671497 58459703 59843046 59358797 56027258 51300342 46777614 42520842
18286 42520842 38251981 34308572 31131067 28771540 27040726 25742667 24512637 23162060
$$ packed form
18344F0448352O8002r95529j691118l228330m368685m155739l318158k737628
18336D0021167k234776j645272j125126j043986j446488j765267j774446j649011
18328B7336795j645078j576627j352256j025852p45070m94464k91154j61167n9989
18319A9985138O6784J71348K67087L60225M45746N31678O47617Q12563R84199
18310B4272385J204051J475022J572448J507114J467410J540985J371949Q85855
18302C5297219O46438R14211J485739J982030K600527L479378M120920L702493
18294E4228955K442542J788206J383343m84249l331539m726916m522728m256772
18286D2520842m268861l943409l177505k359527j730814j298059j230030j350577
$$ plain form
18278 23162060 21849595 20642028 19552810 18513914 17537461 16677927 15987698 15414937 14917652
18269 14917652 14456844 14033529 13635259 13350793 13106660 12876835 12604553 12325839 12035689
18260 12035689 11783977 11541507 11270626 10916399 10527896 10119677 9671282 9220699 8747130
18251 8747130 8275777 7861412 7483431 7110360 6784449 6440888 6087610 5753047 5489314
18242 5489314 5240022 5033213 4797434 4565889 4351335 4109351 3918247 3719758 3539834
18233 3539834 3363736 3154916 2961443 2809290 2705676 2574642 2450970 2351874 2194468 2054872
18223 2054872 1976511 1875924 1790567 1698430 1641052 1600813 1541999 1445055 1363296 1287886 1249586
18212 1249586 1188859 1120567 1096452 1096361 1074245 1000208 923287 852833 823121 817756 795864 754061
$$ packed form
18278B3162060j312465j207567j089218j038896r76453q59534o90229n72761m97285
18269A4917652m60808m23315l98270k84466k44133k29825k72282k78714k90150
18260A2035689k51712k42470k70881l54227l88503m08219m48395m50583m73569
18251H747130m71353m14365l77981l73071l25911l43561l53278l34563k63733
18242E489314k49292k06809k35779k31545k14554k41984j91104j98489j79924
18233C539834j76098k08820j93473j52153j03614j31034j23672r9096j57406j39596
18223B054872p8361j00587q5357r2137n7378m0239n8814r6944q1759p5410l8300
18212A249586o0727o8292k4115r1k2116p4037p6921p0454k9712n365k1892m1803
$$ plain form
18200 754061 733865 721961 740341 725306 698279 695924 690228 612864 595652 629452 641038 621144
18188 621144 618098 623315 586135 577817 606659 607984 597199 598587 605107 581177 568981 618859 648869
18175 648869 627541 634018 676557 692678 703430 669971 646268 669475 675321 658613 680926 693031
18163 693031 683425 670540 657892 615653 631699 623625 600843 604765 636894 672165 702308 698483
18151 698483 729035 751478 775218 789887 783298 773088 763933 814370 846254 832930 860507 925682
18139 925682 986848 1041247 1100043 1166674 1251333 1370482 1509324 1658175 1835751 2060701
18129 2060701 2349040 2657416 2990655 3318260 3694380 4077155 4426335 4681918 4859037
18120 4859037 4968666 5064254 5159136 5306210 5602093 6205395 7263618 8967796 11708638
$$ packed form
18200G54061k0196j1904J8380j5035k7027k355n696p7364j7212L3800J1586j9894
18188F21144l046N217l7180q318K8842J325j0785J388O520k3930j2196M9878L0010
18175F48869k1328O477M2539J6121J0752l3459k3703K3207N846j6708K2313J2105
18163F93031r606j2885j2648m2239J6046q074k2782L922L2129L5271L0143l825
18151F98483L0552K2443K3740J4669o589j0210r155N0437L1884j3324K7577O5175
18139I25682O1166N4399N8796O6631Q4659J19149J38842J48851J77576K24950
18129B060701K88339L08376L33239L27605L76120L82775L49180K55583J77119
18120D859037J09629R5588R4882J47074K95883O03302J058223J704178K740842
$$ plain form
18111 11708638 16356804 23910987 33193078 38874149 35535202 27157637 20005333 15496292
18103 15496292 12675852 10781210 9443379 8434990 7647763 7016864 6508882 6082530 5736119
18094 5736119 5475207 5211745 4991463 4825787 4675538 4500936 4320390 4207144 4106860
18085 4106860 4006325 3943161 3858852 3789819 3774719 3813867 3855833 3923130 3961207 4000414 4072420
18074 4072420 4027929 3883398 3690558 3513152 3286241 3043159 2838173 2651452 2511393 2369822
18064 2369822 2244016 2101857 1991123 1902527 1754929 1624558 1536748 1438397 1359064 1300067
18054 1300067 1269574 1169819 1065174 1005376 972663 908909 838641 798734 777184 743734 721269
18043 721269 698140 683033 658945 643537 621625 590019 510488 451710 420954 347381 355244 332388
$$ packed form
18111A1708638M648166P554183R282091N681071l338947q377565p152304m509041
18103A5496292k820440j894642j337831j008389p87227o30899n07982m26352l46411
18094E736119k60912k63462k20282j65676j50249j74602j80546j13246j00284
18085D106860j00535o3164q4309o9033j5100L9148M1966O7297L8077L9207P2006
18074D072420m4491j44531j92840j77406k26911k43082k04986j86721j40059j41571
18064B369822j25806j42159j10734q8596j47598j30371q7810r8351p9333n8997
18054A300067l0493r9755j04645n9798l2713o3754p0268l9907k1550l3450k2465
18043G21269k3129j5107k4088j5408k1912l1606p9531n8778l0756p3573P863k2856
$$ plain form
18031 332388 320060 354033 345641 279458 221322 244895 302628 303652 270478 211772 185704 142067
18019 142067 133419 144337 156302 162526 150889 159515 180285 202041 195078 181553 155743 127489
18007 127489 87522 65609 84374 109208 67126 43783 73621 65246 72194 85268 82165 59282
17995 59282 25718 -3194 6674 19890 46139 72554 72375 49908 56975 77790 80498 109463 100888
17982 100888 70243 53016 62519 84366 67680 54831 23576 -1032 -22054 -25488 -29997 -666
17970 -666 34621 67375 55621 56288 83608 85837 76436 73668 35156 -44584 -45202 -13015 11182
17957 11182 50518 60849 48259 -294 -2353 45497 83926 78588 79282 70572 78690 102558 102453
17944 102453 92037 116456 134916 98608 35325 14909 270 14825 30822 19801 15648 2853
$$ packed form
18031C32388j2328L3973q392o6183n8136K3573N7733J024l3174n8706k6068m3637
18019A42067q648J0918J1965O224j1637Q626K0770K1756o963j3525k5810k8254
18007A27489l9967k1913J8765K4834m2082k3343K9838q375O948J3074l103k2883
17995E9282l3564k8912R868J3216K6249K6415j79k2467P067K0815K708K8965q575
17982A00888l0645j7227R503K1847j6686j2849l1255k4608k1022l434m509K9331
17970f66L5287L2754j1754O67K7320K229r401k768l8512p9740o18L2187K4197
17957A1182L9336J0331j2590m8553k059M7850L8429n338O94q710Q118K3868j05
17944A02453j0416K4419J8460l6308o3283k0416j4639J4555J5997j1021m153j2795
$$ plain form
17932 2853 39727 67766 75969 60805 48179 54947 78483 79613 95785 98431 147482 113055 92869
17919 92869 75485 22399 -12593 -8243 56850 88831 89649 88372 61477 47427 35306 31500 63402
17906 63402 42208 31492 48190 58745 50422 22156 3154 36853 48381 42847 24420 22710
17894 22710 40446 30296 20567 2670 -12264 -7256 -10733 -11439 -16728 -5001 55945 68071 46615
17881 46615 13136 20155 36165 54074 35441 16879 5144 13186 37581 71999 71373 32134
17869 32134 20200 32905 72951 90711 94826 77768 58374 53021 85570 74978 71348 47674
17857 47674 67448 68756 60682 60544 69649 84116 52331 25374 49573 73305 108675 125012 134807
17844 134807 180211 170321 159403 158950 129170 162327 194300 188619 195260 204349 226880 243663 228296
$$ packed form
17932B853L6874K8039Q203j5164j2626O768K3536J130J6172K646M9051l4427k0186
17919I2869j7384n3086l4992M350O5093L1981Q18j277k6895j4050j2121l806L1902
17906F3402k1194j0716J6698J0555q323k8266j9002L3699J1528n534j8427j710
17894B2710J7736j0150r729j7897j4934N008l477p06n289J1727O0946J2126k1456
17881D6615l3479P019J6010J7909j8633j8562j1735Q042K4395L4418o26l9239
17869C2134j1934J2705M0046J7760M115j7058j9394n353L2549j0592l630k3674
17857D7674J9774J308q074j38R105J4467l1785k6957K4199K3732L5370J6337R795
17844A34807M5404r890j0918m53k9780L3157L1973n681O641R089K2531J6783j5367
$$ plain form
17831 228296 245355 259659 236129 226188 199980 144396 134782 127689 87707 82518 91846 95803 109242
17818 109242 125527 144582 160900 160423 130358 122809 135741 136096 145128 119721 108393 123545 81392
17805 81392 69858 62502 73857 81920 68519 20035 5439 49658 75196 111654 155594 175818
17793 175818 173231 183735 199535 205986 199924 238779 259535 212645 174113 170769 206304 202641
17781 202641 232959 203772 173524 151368 175470 214592 218499 170592 179740 168365 157083 156533
17769 156533 148966 146530 130929 120814 103728 81012 47153 55726 83161 102605 107692 137641
17757 137641 102263 77351 111566 113659 72767 76501 86985 77869 70549 34380 50737 99967
17745 99967 77880 55275 41623 19138 23085 52517 28204 4718 -1369 37681 39466 -20568
$$ packed form
17831B28296J7059J4304k3530r941k6208n5584r614p093l9982n189R328L957J3439
17818A09242J6285J9055J6318m77l0065p549J2932L55R032k5407j1328J5152m2153
17805H1392j1534p356J1355Q063j3401m8484j4596M4219K5538L6458M3940K0224
17793A75818k587J0504J5800O451o062L8855K0756m6890l8532l344L5535l663
17781B02641L0318k9187l0248k2156K4102L9122L907m7907R148j1375j1282n50
17769A56533p567k436j5601j0115j7086k2716l3859Q573K7435J9444N087K9949
17757A37641l5378k4912L4215K093m0892L734J0484r116p320l6169J6357M9230
17745I9967k2087k2605j3652k2485L947K9432k4313k3486o087L9050J785o0034
$$ plain form
17733 -20568 -22297 -8769 -3418 -11949 3200 6177 11939 11529 -7624 -9103 -14618 -49681 -58121 -63529
17719 -63529 -76468 -66156 -14050 -956 -12503 -29982 -23996 -10625 21831 14498 -28829 -55436
17707 -55436 -55100 -61809 -54229 -44070 -54152 -55567 -66445 -60409 -35415 -45023 -15521 -4757 9698
17694 9698 6773 -12826 -2276 36535 19638 -12437 13945 -469 -27417 -5464 6412 4365
17682 4365 35212 21503 17351 18288 7957 -31137 -32026 -19998 -4431 -85 14792 28823 10318
17669 10318 -39631 -74032 -33086 7527 -10356 -26387 -21204 8513 13133 -20313 -27971 -35588
17657 -35588 -43643 -43805 -12484 4025 -19063 -48006 -16334 19038 14735 -29856 -50370 -66412
17645 -66412 -101357 -100541 -85999 -74323 -74019 -69858 -67623 -70484 -63073 -56427 -62680 -63119 -42297 -36623
$$ packed form
17733b0568j729J3528N351q531J5149K977N762m10j9153j479n515l5063q440n408
17719f3529j2939J0312N2106J3094j1547j7479N986J3371L2456p333m3327k6607
17707e5436L36o709P580J0159j0082j415j0878O036K4994r608K9502J0764J4455
17694I698k925j9599J0550L8811j6897l2075K6382j4414k6948K1953J1876k047
17682D365L0847j3709m152R37j0331l9094q89J2028J5567M346J4877J4031j8505
17669A0318m9949l4401M0946M0613j7883j6031N183K9717M620l3446p658p617
17657c5588q055j62L1321J6509k3088k8943L1672L5372m303m4591k0514j6042
17645f6412l4945Q16J4542J1676L04M161K235k861P411O646o253m39K0822N674
$$ plain form
17631 -36623 -21627 2040 -7727 -68114 -78842 -35434 -30659 -17329 -15989 -7766 35739 -8559
17619 -8559 -13678 34456 61455 52433 58088 46810 28341 7782 -13334 -2125 14573 42306
17607 42306 56682 56782 5284 -20677 -7856 20197 44506 17300 -30963 -57201 -70852 -41826
17595 -41826 -15279 -6850 -25482 -55456 -38471 -33199 -9272 -18892 -12126 -38443 -80511 -64539
17583 -64539 -48505 -968 27165 26002 -3324 -25021 -12466 -16058 3145 10863 4370 -7277
17571 -7277 -21927 -30754 -18162 1405 30514 1654 -18913 -34872 -20706 -23530 -58830 -34257
17559 -34257 -13724 14978 26226 -2592 -4427 10583 34567 27671 35399 33178 13301 -12825
17547 -12825 -6953 10992 25307 18545 31585 -6502 26005 23014 8041 -2235 1823 6823 -8265
$$ packed form
17631c6623J4996K3667r767o0387j0728M3408M775J3330J340Q223M3505m4298
17619h559n119M8134K6999r022N655j1278j8469k0559k1116J1209J6698K7733
17607D2306J4376J00n1498k5961J2821K8053K4309k7206m8263k6238j3651K9026
17595d1826K6547Q429j8632k9974J6985N272K3927r620O766k6317m2068J5972
17583f4539J6034M7537K8133j163k9326k1697J2555l592J9203P718o493j1647
17571g277j4650q827J2592J9567K9109k8860k0567j5959J4166k824l5300K4573
17559c4257K0533K8702J1248k8818j835J5010K3984o896P728k221j9877k6126
17547a2825N872J7945J4315o762J3040l8087L2507k991j4973j0276M058N000j5088
$$ plain form
17534 -8265 -30045 -60856 -15961 686 -3328 -14963 28685 51017 7293 16979 52722 56652
17522 56652 31635 -8722 -29268 -19874 -632 24172 14809 -17591 -18714 9800 -28252 -50136
17510 -50136 -35470 -61391 -58391 -28210 18575 14931 -8037 -7185 -42730 -102479 -103134 -116891 -89613
17497 -89613 -50864 -62268 -48775 -85685 -71096 -75568 -60043 -39570 1874 -28822 -55237 -43967
17485 -43967 -39791 -62136 -76369 -64389 -44924 -39788 -41806 -43974 -61506 -54550 -28627 -6638 -17879
17472 -17879 -13467 -10624 -12800 -20263 -41161 -40751 -54560 -55778 -74998 -92153 -110864 -112839 -49647
17459 -49647 13394 6641 -19579 -20763 -35610 -54661 -30868 35636 39766 33721 14812 -15528
17447 -15528 -8444 6446 53104 70276 132366 189022 181698 112649 55938 29769 51 -9246
$$ packed form
17534h265k1780l0811M4895J6647m014j1635M3648K2332m3724R686L5743L930
17522E6652k5017m0357k0546R394J9242K4804r363l2400j123K8514l8052k1884
17510e0136J4666k5921L000L0181M6785l644k2968Q52l5545n9749o55j3757K7278
17497h9613L8749j1404J3493l6910J4589m472J5525K0473M1444l0696k6415J1270
17485d3967M176k2345j4233J1980J9465N136k018k168j7532O956K5923K1989j1241
17472a7879M412K843k176p463k0898M10j3809j218j9220j7155j8711j975O3192
17459d9647O3041o753k6220j184j4847j9051K3793O6504M130o045j8909l0340
17447a5528P084J4890M6658J7172O2090N6656p324o9049n6711k6169k9718r297
$$ plain form
17435 -9246 9757 21687 35715 33226 41451 5685 -5070 -26935 -14979 -8724 21366 830
17423 830 -19136 -10116 -28316 -15273 1630 -40428 -33772 -25212 -57877 -51162 -4035 -5738 -1363
17410 -1363 2711 -19423 -6518 9267 10137 -18764 18812 41341 7390 -30601 -49303 -66397
17398 -66397 -71230 -15556 -5575 -5996 -37126 -53057 -39400 -13146 -20756 -16149 -18841 -22922 -39345
17385 -39345 -50860 -38950 -25251 -40536 -45238 -28427 -34429 -72586 -34914 -34583 -48102 -49827 -48480
17372 -48480 -84558 -104223 -109239 -92884 -78173 -63749 -68563 -42761 -56633 -33402 -6733 -24442
17360 -24442 -58966 -59930 -50489 -39354 -21161 -24234 -32105 -51675 -54185 -50869 -61677 -90421 -78301
17347 -78301 -80712 -79156 -80030 -72380 -49134 -78984 -76885 -31800 -26484 774 8504 -8680 -22737
$$ packed form
17435i246J9003J1930J4028k489Q225l5766j0755k1865J1956O255L0090k0536
17423H30j9966R020j8200J3043J6903m2058O656Q560l2665O715M7127j703M375
17410a363M074k2134J2905J5785Q70k8901L7576K2529l3951l7991j8702j7094
17398f6397m833N5674R981m21l1130j5931J3657K6254p610M607k692m081j6423
17385c9345j1515J1910J3699j5285m702J6811o002l8157L7672L31j3519j725J347
17372d8480l6078j9665n016J6355J4711J4424m814K5802j3872K3231K6669j7709
17360b4442l4524r64R441J1135J8193l073p871j9570k510L316j0808k8744J2120
17347g8301k411J556q74P650K3246k9850K099M5085N316K7258P730j7184j4057
$$ plain form
17334 -22737 -57993 -66543 -39866 -53701 -77449 -50840 -29119 -11876 -35221 -40318 7632 18640
17322 18640 -24402 -104602 -75577 -2962 13785 -23783 -21847 -19081 -2635 -2627 -13669 -20209 -27678
17309 -27678 -44786 -67020 -88369 -83853 -47568 16989 15655 347 -7685 -23606 -11004 1885
17297 1885 -6503 -5933 -18277 -1650 -43182 -23174 -5536 -13392 11800 2950 -36370 -51485 -23944
17284 -23944 20727 33940 12277 18191 2417 -5739 -16913 -31534 -6398 29027 6619 -59212
17272 -59212 -58062 -52803 -75385 -73287 -52869 -56864 -24419 -13467 -23326 -49701 -23583 -14797 35627
17259 35627 13877 1318 -7521 -9991 -16177 -4429 -3343 -5232 -13811 -1239 -14584 -3484 3947
17246 3947 85 -1398 -31534 -23787 -10658 -5537 -29038 -31347 -5577 -3279 -19425 -17277 -8691
$$ packed form
17334b2737l5256q550K6677j3835k3748K6609K1721J7243k3345n097M7950J1008
17322A8640m3042q0200K9025P2615J6747l7568J936K766J6446Qj1042o540p469
17309b7678j7108k2234k1349M516L6285O4557j334j5308q032j5921J2602J2889
17297A885q388N70j2344J6627m1532K0008J7638p856K5192q850l9320j5115K7541
17284b3944M4671J3213k1663N914j5774q156j1174j4621K5136L5425k2408o5831
17272e9212J150N259k2582K098K0418l995L2445J0952r859k6375K6118Q786N0424
17259C5627k1750j2559q839k470o186J1748J086j889q579J2572j3345J1100P431
17246C947l862j483l0136P747J3129N121k3501k309K5770K298j6146K148Q586
$$ plain form
17233 -8691 -24760 -17136 -28868 -30222 -50759 -37225 -12846 -23939 -13358 3363 29075 12343
17221 12343 -16756 -26435 -59110 -79372 -72777 -19135 10198 53818 61594 34196 10374 6516
17209 6516 5165 -6045 -20454 -80516 -85031 -73828 -90709 -106629 -73385 -20621 -28062 -41953
17197 -41953 -37000 -31544 -42491 -79606 -57211 -30740 -10487 43977 17029 -16949 -2236 -9938
17185 -9938 -8163 27956 23189 -50650 -95179 -60478 -11290 18674 -6291 -1830 -19913 -33662
17173 -33662 -55971 -52530 -46025 -34541 -75266 -70839 -38699 -36219 -60582 -55225 -19391 4406 6112
17160 6112 31109 27419 2832 -20933 -7449 818 -15142 -61379 -79741 -46218 -23446 11110
17148 11110 -4126 10492 42736 50865 13002 -23999 -73363 -76666 -91393 -99737 -90426 -67111
$$ packed form
17233h691j6069P624j1732j354k0537J3534K4379j1093J0581J6721K5712j6732
17221A2343k9099r679l2675k0262O595N3642K9333M3620P776k7398k3822l858
17209F516j351j1210j4409o0062m515J1203j6881j5920L3244N2764p441j3891
17197d1953M953N456j0947l7115K2395K6471K0253N4464k6948l3978J4713p702
17185i938J775L6119m767p3839m4529L4701M9188K9964k4965M461j8083j3749
17173c3662k2309L441O505J1484m0725M427L2140K480k4363N357L5834K3797J706
17160F112K4997l690k4587k3765J3484Q267j5960m6237j8362L3523K2772L4556
17148A1110j5236J4618L2244Q129l7863l7001m9364l303j4727q344R311K3315
$$ plain form
17136 -67111 -63018 -53652 -56947 -55101 -4557 26223 -9899 -39115 -53584 -34410 -24645 -46517 -46425
17123 -46425 -36806 -20043 -45263 -57238 -26621 -9415 -18414 -41187 -46722 -50722 -62989 -29479
17111 -29479 -25375 -21249 -49815 -68716 -81463 -64727 -32383 -7294 -16286 -26125 -318 14207
17099 14207 3131 -5579 -11517 16125 -9539 -32721 -35361 -28172 -40975 -32842 -35720 -24766 -22914
17086 -22914 -24617 -9469 7361 -23985 -16 25675 10709 -19437 -26170 -8101 -34794 -30884
17074 -30884 -26349 -6245 14621 36446 2737 -31490 -1669 -3693 12384 -7941 -29795 -18183
17062 -18183 4955 7375 -17107 -3697 -26834 -24042 -20525 2718 -3266 -21724 -16424 3250 8276
17049 8276 -12945 -27171 -49506 -275 -1202 -20206 -2879 11887 7237 12791 27563 -1978 -43857
$$ packed form
17136f7111M093R366l295J846N0544L0780l6122k9216j4469J9174R765k1872R2
17123d6425R619J6763k5220j1975L0617J7206q999k2773n535m000j2267L3510
17111b9479M104M126k8566j8901j2747J6736L2344K5089q992r839K5807J4525
17099A4207j1076q710n938K7642k5664k3182k640P189j2803Q133k878J0954J852
17086b2914j703J5148J6830l1346K3969K5691j4966l0146o733J8069k6693L910
17074c0884M535K0104K0866K1825l3709l4227K9821k024J6077k0325k1854J1612
17062a8183K3138K420k4482J3410k3137K792L517K3243n984j8458N300J9674N026
17049H276k1221j4226k2335M9231r27j9004J7327J4766m650N554J4772k9541m1879
$$ plain form
17036 -43857 -65005 -41536 -30136 -16794 3849 7943 -24994 -13371 -5189 2131 -1725 -26266
17024 -26266 -57305 -42208 -41279 -61444 -50026 -63483 -55667 -58789 -84043 -71527 -3680 14425
17012 14425 13641 -15363 -27835 -20723 -33950 -85105 -103740 -106615 -91050 -60456 -8942 -16779 -25442
16999 -25442 -14568 -16903 -30830 -41929 -55695 -100837 -102377 -117064 -125369 -106026 -77619 -64380
16987 -64380 -30624 -16444 -39519 -55100 -54421 -97301 -113356 -114978 -103387 -83295 -33629 1795
16975 1795 4809 -6879 -11971 2693 40546 47044 44682 12036 14035 21963 39661 34107 32376
16962 32376 4755 -30945 -36762 -5716 -24226 15764 27969 11742 3931 -32384 -55017 -80407
16950 -80407 -94711 -75422 -44113 -8554 34683 39670 21060 -3086 -9402 -2977 -11182 -6550 -39575
$$ packed form
17036d3857k1148K3469J1400J3342K0643M094l2937J1623Q182P320l856k4541
17024b6266l1039J5097R29k0165J1418j3457P816l122k5254J2516O7847J8105
17012A4425p84k9004j2472P112j3227n1155j8635k875J5565L0594N1514p837q663
16999b5442J0874k335j3927j1099j3766m5142j540j4687q305J9343K8407J3239
16987f4380L3756J4180k3075j5581O79m2880j6055j622J1591K0092M9666L5424
16975A795L014j1688n092J4664L7853O498k362l2646J999P928J7698n554j731
16962C2376k7621l5700n817L1046j8510L9990J2205j6227p811l6315k2633k5390
16950h0407j4304J9289L1309L5559M3237M987j8610k4146o316O425q205M632l3025
$$ plain form
16937 -39575 -52174 -74154 -71567 -75162 -72669 -63605 -51040 -31097 -11768 15504 24446 8316 5183
16924 5183 23988 45063 15178 19107 15774 -6868 -24071 -21379 -50605 -46789 -16527 15259 44788
16911 44788 15832 -60786 -68582 -34986 -13916 29871 1250 -43057 -59745 -40352 -46421 -44145
16899 -44145 -50550 -43544 -61790 -63954 -13559 207 -28954 -35300 -30401 -25479 -37236 -48555 -15801
16886 -15801 15260 15204 9357 16437 26572 -13330 -65480 -59116 -63342 -45043 -54915 -56821 -50599 -61225
16872 -61225 -89712 -70795 -61196 -42170 -50795 -22067 -24391 -31984 -86415 -84114 -54924 -54472 -36495
16859 -36495 -49045 -76868 -42382 -3874 11880 25899 21012 3095 -7715 -50156 -74628 -78914
16847 -78914 -75067 -53690 -58668 -56447 -57096 -50081 2742 5489 -48299 -73780 -21515 34584 1482
$$ packed form
16937c9575j2599k1980K587l595K493R064J2565J9943J9329K7272Q942j6130l133
16924E183J8805K1075k9885L929l333k2642j7203K692k9226L816L0262L1786K9529
16911D4788k8956p6618p796L3596K1070M3787k8621m4307j6688J9393o069K276
16899d4145o405P006j8246k164N0395J3766k9161o346M899M922j1757j1319L2754
16886a5801L1061n6n847P080J0135l9902n2150O364m226J8299r872j906O222j0626
16872f1225k8487J8917R599J9026q625K8728k324p593n4431K301K9190M52J7977
16859c6495j2550k7823L4486L8508J5754J4019m887j7917j0810m2441k4472m286
16847g8914L847K1377m978K221o49P015N2823K747n3788k5481N2265N6099l3102
$$ plain form
16834 1482 -57624 -70089 -62187 -44972 -42798 -35799 -71211 -80918 -79473 -85355 -73987 -48586 -36997
16821 -36997 -56070 -35058 -29937 -26311 -33334 -55565 -90885 -79819 -93438 -118619 -66023 -49586
16809 -49586 -39568 1889 -22940 -25913 -26076 -51216 -58661 -51807 -62945 -60795 -54003 -8606 -13149
16796 -13149 -20522 -22968 43360 70614 29852 536 7712 -10347 3906 -17927 -57473 -68358
16784 -68358 -62636 -47469 -26342 -31359 -39268 -33187 9028 7548 -12864 -34988 -2499 2751 -2257
16771 -2257 -54206 -53753 -31094 -37137 -25143 -37454 -49620 -70389 -61282 -65625 -88375 -73988 -36128
16758 -36128 -4711 -18855 -31926 -59413 -69589 -64554 -58024 -61244 -36668 -24895 -22730 19924
16746 19924 23875 9600 -30528 -31130 -32079 -9850 -4161 -19343 -37370 -31585 -32706 -46700 -31337
$$ packed form
16834A482n9106j2465P902J7215K174O999l5412r707J445n882J1368K5401J1589
16821c6997j9073K1012N121L626p023k2231l5320J1066j3619k5181N2596J6437
16809d9586J0018M1457k4829k973j63k5140p445O854j1138K150O792M5397m543
16796a3149p373k446O6328K7254m0762k9316P176j8059J4253k1833l9546j0885
16784f8358N722J5167K1127n017p909O081M2215j480k0412k2124L2489N250n008
16771b257n1949M53K2659o043J1994j2311j2166k0769R107m343k2750J4387L7860
16758c6128L1417j4144j3071k7487j0176N035O530l220K4576J1773K165M2654
16746A9924L951j4275m0128o02r49K2229N689j5182j8027N785j121j3994J5363
$$ plain form
16733 -31337 -10799 18186 9298 1450 -14272 4782 28633 18317 14732 -9782 -56270 -71876
16721 -71876 -101932 -100283 -81475 -73335 -101203 -92664 -50731 -50058 -96978 -78072 -98419 -51910 -20491
16708 -20491 16091 30982 9623 -20587 -18447 19068 42135 37300 44975 44466 20914 -36368 -46994
16695 -46994 -16193 -26693 -77012 -82931 -69341 -42699 -23605 2758 15355 15756 -11780 -28022
16683 -28022 -30054 -36868 -12272 -18264 -22040 -33465 -43606 -25735 -17586 -72657 -103579 -108348 -132073
16670 -132073 -106161 -86863 -54429 -32684 -15067 -17115 -69280 -96078 -72387 -28411 -18418 -50524
16658 -50524 -57057 -55046 -53897 -29104 -16791 -27469 -1245 -43389 -82990 -32326 10035 -7276
16646 -7276 -8930 -2378 47606 40841 9531 -60683 -74215 -56381 -10198 8405 -20955 -61868
$$ packed form
16733c1337K0538K8985q888p848j5722J9054K3851j0316l585k4514m6488j5606
16721g1876l0056J649J8808Q140k7868Q539M1933O73m6920J8906k0347M6509L1419
16708b0491L6582J4891k1359l0210K140L7515K3067m835P675n09k3552n7282j0626
16695d6994L0801j0500n0319n919J3590K6642J9094K6363J2597M01k7536j6242
16683b8022k032o814K4596n992l776j1425j0141J7871Q149n5071l0922m769k3725
16670a32073K5912J9298L2434K1745J7617k048n2165k6798K3691M3976R993l2106
16658e0524o533K011J149K4793J2313j0678K6224m2144l9601N0664M2361j7311
16646g276j654O552M9984o765l1310p0214j3532J7834M6183J8603k9360m0913
$$ plain form
16634 -61868 -64437 -46590 -65952 -76640 -28221 2518 -32004 -45933 -37505 -10707 -15967 -30873
16622 -30873 -57635 -56647 -20426 25210 46154 40967 47855 33191 6209 28417 -15758 -47156
16610 -47156 -73762 -76615 -64040 -40234 -25731 -3057 -46949 -67286 -72124 -31863 24588 23588
16598 23588 -19851 -9044 -907 -10936 -10573 -9018 -11463 -19096 -52964 -91184 -100104 -74268 -31853
16585 -31853 -27201 -58196 -34507 -19324 -8395 19034 43353 51839 30331 -27225 -50853 -21275
16573 -21275 -11865 -9370 -10840 -44204 -37523 -58823 -86103 -70579 -65138 -54171 -49610 -11552 -20536
16560 -20536 -14826 -4567 2489 25261 21423 -4831 -33694 -64664 -55961 -47377 -81329 -90252 -58631
16547 -58631 4740 33989 40596 8990 -31644 -21509 -10749 -6444 -21373 -1016 9776 31059
$$ packed form
16634f1868k569J7847j9362j0688M8419L0739l4522j3929Q428K6798n260j4906
16622c0873k6762R88L6221M5636K0944n187O888j4664k6982K2208m4175l1398
16610d7156k6606k853J2575K3806J4503K2674m3892k0337m838M0261N6451j000
16598B3588m3439J0807Q137j0029L63J555k445p633l3868l8220q920K5836M2415
16585c1853M652l0995K3689J5183J0929K7429K4319Q486k1508n7556k3628K9578
16573b1275R410K495j470l3364O681k1300k7280J5524N441J0967M561L8058q984
16560b0536N710J0259P056K2772l838k6254k8863l0970Q703Q584l3952q923L1621
16547e8631O3371K9249O607l1606m0634J0135J0760M305j4929K0357J0792K1283
$$ plain form
16535 31059 9649 2592 34798 58442 5714 -50013 -64995 -68444 -45444 -56131 -48859 6736
16523 6736 -543 -14553 -25755 -11337 24841 14757 5229 -26364 -19469 -4455 9245 28835
16511 28835 55613 96807 78236 41537 33256 36131 32073 3102 -212 -3109 -32784 -78885 -96882
16498 -96882 -77196 -40882 -53232 -54197 -29203 -4460 -4799 21185 41852 57367 27422 11543
16486 11543 13111 -23893 -57275 -35717 -24359 -36844 -56807 -79041 -117308 -108451 -62646 -43156
16474 -43156 -42048 -16001 -55230 -48384 -29064 -38842 -39782 -36535 -34417 -19487 -10265 -12134 -8455 -6171
16460 -6171 -35397 -21310 -10903 -17345 1346 19939 19020 -7916 -17031 -14330 21795 21921 27851
16447 27851 23170 14741 -13799 -40583 -55185 -71001 -62965 -41399 -16695 9493 4711 -11462
$$ packed form
16535C1059k1410p057L2206K3644n2728n5727j4982l449K3000j0687P272N5595
16523F736p279j4010j1202J4418L6178j0084r528l1593O895J5014J3700J9590
16511B8835K6778M1194j8571l6699q281K875m058k8971l314k897k9675m6101j7997
16498i6882J9686L6314j2350r65K4994K4743l39K5984K0667J5515k9945j5879
16486A1543J568l7004l3382K1558J1358j2485j9963k2234l8267Q857M5805J9490
16474d3156J108K6047l9229O846J9320r778r40L247K118J4930R222j869L679K284
16460f171k9226J4087J0407o442J8691J8593r19k6936r115K701L6125J26N930
16447B7851m681q429k8540k6784j4602j5816Q036K1566K4704K6188m782j6173
$$ plain form
16435 -11462 7693 -26164 -29491 -26408 -11394 -18554 -24336 21460 36728 -1872 -13181 -13354 -16450
16422 -16450 -1290 10241 39571 68259 58351 19058 -8423 -7424 7121 9537 -2048 4464 -12663
16409 -12663 -25042 -23978 -4054 -6805 11171 30889 38552 17060 1225 11380 29451 27060
16397 27060 -1250 -15701 4693 47534 28925 -7583 -31008 -65066 -79335 -70334 -64625 -55571
16385 -55571 -67230 -78321 -57501 -37194 -43514 -14988 17659 7226 -21482 -43996 -99024 -112109
16373 -112109 -98743 -87385 -55163 -65026 -47653 -41287 -29495 -29603 -52968 -66769 -39628 476
16361 476 3554 -34848 -20105 -6581 -28965 -7587 -2341 41080 24624 -3799 -5924 2365 -14719
16348 -14719 -15403 17539 22973 -20931 -37583 -46443 -48489 -18117 -18600 4399 -44673 -100372 -68626
$$ packed form
16435a1462J9155l3857l327L083J5014p160n782M5796J5268l8600j1309j73l096
16422a6450J5160J1531K9330K8688r908l9293k7481R99J4545K416j1585O512j7127
16409a2663j2379J064J9924k751J7976J9718P663k1492j5835J0155J8071k391
16397B7060k8310j4451K0394M2841j8609l6508k3425l4058j4269R001N709R054
16385e5571j1659j1091K0820K0307o320K8526L2647j0433k8708k2514n5028j3085
16373a12109J3366J1358L2222r863J7373O366J1792j08k3365j3801K7141M0104
16361D76L078l8402J4743J3524k2384K1378N246M3421j6456k8423k125Q289j7084
16348a4719o84L2942N434m3904j6652q860k046L0372m83K2999m9072n5699L1746
$$ plain form
16335 -68626 -25950 -29890 -8482 -23884 -42865 -13735 17766 26739 -10787 -20193 -4668 12178
16323 12178 -35740 -77810 -60957 -29899 -5374 6469 1088 -18624 -7672 17236 38489 41463
16311 41463 21342 38851 44938 27710 9768 -27856 -61642 -85835 -51526 -24143 -28798 -18680
16299 -18680 -14591 -25572 -24518 -25501 -3629 21558 -725 -14175 -26761 -71925 -74205 -51464 -29841
16286 -29841 -8254 5781 10946 -7593 -38299 -47440 -25434 732 21275 12657 9506 8953 28946
16273 28946 -9931 -43346 -78202 -98226 -49101 -5259 11074 -10414 -34884 -31959 -17778 -5708
16261 -5708 3015 -7365 16479 -185 -11282 -40295 -19953 -39832 -38495 -59429 -94999 -69258
16249 -69258 -49279 -53279 -46030 -10164 7366 5627 -1151 8759 -2345 -31846 -62776 -25163 -41184
$$ packed form
16335f8626M2676l940K1408j5402j8981K9130L1501Q973l7526r406J5525J6846
16323A2178m7918m2070J6853L1058K4525J1843n381j9712J0952K4908K1253K974
16311D1463k0121J7509O087j7228j7942l7624l3786k4193L4309K7383m655J0118
16299a8680M089j0981J054r83K1872K5187k2283j3450j2586m5164k280K2741K1623
16286b9841K1587J4035N165j8539l0706r141K2006K6166K0543q618l151n53J9993
16273B8946l8877l3415l4856k0024M9125M3842J6333k1488k4470K925J4181J2070
16261e708Q723j0380K3844j6664j1097k9013K0342j9879J337k0934l5570K5741
16249f9258J9979m000P249L5866J7530j739o778R910j1104k9501l0930L7613j6021
$$ plain form
16236 -41184 -48097 -55603 -17698 -13625 -37427 -54044 -71562 -108546 -108785 -81997 -64274 -26873 26624
16223 26624 24461 12335 1424 1349 -3114 14948 25777 26955 -1808 -23712 16568 -30686 -36242
16210 -36242 -15597 22556 32026 14283 -9445 -3311 -8578 -37540 -19541 6341 15735 31968
16198 31968 -1729 -36248 -33812 -35896 -50334 -29618 -27271 -15084 -1868 -9986 -18040 -9311 11796
16185 11796 28458 16573 -19313 -17840 -27390 -53271 -61815 -64247 -28880 -49176 -56421 -46705 -35429
16172 -35429 -19124 5277 -10170 -58931 -81835 -78685 -63935 -55359 -58540 -29155 -31177 -74629
16160 -74629 -84236 -58130 1128 34637 34950 20573 -9496 -25257 -26868 -29850 -39393 -24402 15041
16147 15041 57393 73352 4549 -36730 -19249 -2068 -4010 -9849 -5904 -48049 -97643 -81070
$$ packed form
16236d1184o913p506L7905M073k3802j6617j7518l6984k39K6788J7723L7401N3497
16223B6624k163j2126j0911p5m463J8062J0829J178k8763k1904M0280m7254n556
16210c6242K0645L8153R470j7743k3728O134n267k8962J7999K5882R394J6233
16198C1968l3697l4519K436k084j4438K0716K347J2187J3216q118q054Q729K1107
16185A1796J6662j1885l5886J473r550k5881q544k432L5367k0296p245R716J1276
16172c5429J6305K4401j5447m8761k2904L150J4750Q576l181K9385k022m3452
16160g4629r607K6106N9258L3509L13j4377l0069j5761j611k982r543J4991L9443
16147A5041M2352J5959o8803m1279J7481J7181j942n839L945m2145m9594J6573
$$ plain form
16135 -81070 -67866 -44828 -50364 -33921 17287 10358 -32486 -23833 -16113 20513 16856 30993 17539
16122 17539 10388 7802 45092 39104 24971 29743 -5998 -38279 3287 36071 49981 70244
16110 70244 52957 42484 42134 22049 15187 26227 -12614 -16465 -41098 -54450 2645 25488
16098 25488 13482 33669 58102 70384 61563 27151 26299 32716 35590 41923 12263 33630 47955
16085 47955 26423 -16534 -5086 39238 53375 54746 70742 40854 57022 106446 111708 95721
16073 95721 103101 134176 169887 172609 164887 151443 156923 162324 225160 317803 365231 375003 409406
16060 409406 444820 473541 439719 425597 425303 385881 341685 259051 211675 229057 267191 264000
16048 264000 242218 218868 209355 159659 128115 125719 123272 99828 94977 80489 94725 135963
$$ packed form
16135h1070J3204K3038n536J6443N1208o929m2844Q653P720L6626l657J4137j3454
16122A7539p151k586L7290n988j4133M772l5741l2281M1566L2784J3910K0263
16110G0244j7287j0473l50k0085o862J1040l8841l851k4633j3352N7095K2843
16098B5488j2006K0187K4433J2282q821l4412q52O417K874O333k9660K1367J4325
16085D7955k1532m2957J1448M4324J4137J371J5996k9888J6168M9424N262j5987
16073I5721P380L1075L5711K722p722j3444N480N401O2836R2643M7428R772L4403
16060D09406L5414K8721l3822j4122k94l9422m4196q2634m7376J7382L8134l191
16048B64000k1782k3350r513m9696l1544k396k447k3444m851j4488J4236M1238
$$ plain form
16036 135963 139688 133296 151104 141720 117387 94317 111949 123662 128677 117449 72090 56000
16024 56000 78882 58807 56457 69462 77692 72035 61866 17558 16143 35890 82021 96411
16012 96411 86268 94104 105701 66762 42745 36800 39696 50235 48671 39863 62810 61392 59189
15999 59189 47731 56073 84694 87956 35341 18400 22501 11176 46027 36781 10785 -12775
15987 -12775 -2559 17379 6627 -3465 9329 9235 -7562 -41484 -48405 -40361 -7814 -12336 -36537
15974 -36537 -46174 -26634 53159 49527 15518 -28490 -19820 10449 14835 -15573 -22658 6337 -3772
15961 -3772 -3928 -8224 -5509 11858 -398 -11636 -29843 -63984 -60682 -48560 -35055 -53591 -74817
15948 -74817 -66863 -79363 -61238 -24959 -21967 7594 5090 -29023 -10393 31003 23789 6961
$$ packed form
16036A35963L725o392J7808r384k4333k3070J7632J1713N015j1228m5359j6090
16024E6000K2882k0075k350J3005Q230n657j0169m4308j415J9747M6131J4390
16012I6411j0143P836J1597l8939k4017n945K896J0539j564q808K2947j418k203
15999E9189j1458Q342K8621L262n2615j6941M101j1325L4851r246k5996k3560
15987a2775J0216J9938j0752j0092J2794r4j6797l3922o921Q044L2547m522k4201
15974c6537r637J9540P9793l632l4009m4008Q670L0269M386l0408p085K8995j0109
15961c772j56m296K715J7367j2256j1238j8207l4141L302J2122J3505j8536k1226
15948g4817P954j2500J8125L6279K992K9561k504l4113J8630M1396p214j6828
$$ plain form
15936 6961 -24819 -13993 -19388 -15855 2061 -6854 -30033 23962 49015 40753 46128 38410 16399
15923 16399 -13789 -23742 -4697 7826 5488 12796 21855 38789 29031 -14483 -16261 -60299 -69409
15910 -69409 -98467 -100892 -74453 -1151 4692 -30785 -27126 -12764 -50968 -72429 -49824 -72367
15898 -72367 -60652 -60650 -19514 12111 13877 -10078 11879 -28390 -53452 -74958 -53641 -44809 -15314
15885 -15314 -19313 -35576 -20987 14243 -8533 -56303 -93959 -97012 -77066 -34666 -12262 -43476
15873 -43476 -60284 -47016 -34707 -1941 -4320 33843 14916 -3926 -38838 -34676 -27772 -47444
15861 -47444 -57791 -68082 -52517 4541 26068 37044 20051 1231 19127 20940 16021 32234
15849 32234 44488 5734 -6614 -17624 -8860 -2381 -1865 -5911 13706 2523 -8353 -3951 -21349
$$ packed form
15936F961l1780J0826n395L533J7916q915k3179N3995K5053q262N375p718k2011
15923A6399l0188r953J9045J2523k338P308R059J6934r758m3514j778m4038r110
15910f9409k9058k425K6439P3302N843l5477L659J4362l8204k1461K2605k2543
15898g2367J1715KM1136L1625J766k3955K1957m0269k5062k1506K1317Q832K9495
15885a5314l999j6263J4589L5230k2776m7770l7656l053J9946M2400K2404l1214
15873d3476j6808J3268J2309L2766k379L8163j8927j8842l4912M162O904j9672
15861d7444j0347j0291J5565N7058K1527J0976j6993j8820J7896J813m919J6213
15849C2234J2254l8754j2348j1010Q764O479N16m046J9617j1183j0876M402j7398
$$ plain form
15836 -21349 -42761 -20942 -23885 -40166 -63164 -81729 -97128 -71481 -43089 -27683 -6719 -9334
15824 -9334 11507 5954 11397 42613 18791 -34911 -25694 -8466 -22550 30040 42068 16460
15812 16460 -26314 -64701 -61585 -53697 -67088 -29814 -11616 -9120 -13551 -2287 10430 -11742
15800 -11742 -37154 -18251 -31546 3083 30446 25967 16955 -15891 -61555 -89909 -67539 -64900
15788 -64900 -64984 -42610 34603 74476 66880 50946 16912 -10189 -7853 9640 -3592 -2772 -36572
15775 -36572 -58381 -63943 -79813 -53479 -63004 -71419 -58447 -34305 -11561 4382 10594 13778 43910
15762 43910 40110 33988 12347 21523 16741 7921 22137 28249 -4297 -17552 -35207 -53952 -54424
15749 -54424 -32085 -5120 33356 70327 35626 -5111 -25867 -49815 -26436 -31273 -47640 -56256
$$ packed form
15836b1349k1412K1819k943j6281k2998j8565j5399K5647K8392J5406K0964k615
15824i334K0841n553N443L1216k3822n3702R217J7228j4084N2590J2028k5608
15812A6460m2774l8387L116P888j3391L7274J8198K496m431J1264J2717k2172
15800a1742k5412J8903j3295L4629K7363m479r012l2846m5664k8354K2370K639
15788f4900q4K2374P7213L9873p596j5934l4034k7101K336J7493j3232Q20l3800
15775c6572k1809n562j5870K6334r525q415J2972K4142K2744J5943O212L184L0132
15762D3910l800o122k1641R176m782q820J4216O112l2546j3255j7655j8745m72
15749e4424K2339K6965L8476L6971l4701m0737k0756k3948K3379m837j6367q616
$$ plain form
15737 -56256 -24860 682 11640 -37385 -33947 -10972 -2799 925 9783 17028 20472 -2115 -10597
15724 -10597 -4175 -24823 -50996 -22833 15656 -7676 -48399 -56046 -38424 -5790 35565 21113
15712 21113 -20451 -25932 -14130 -13106 -8586 -27787 -36576 22973 18665 5795 18475 25085 -58
15699 -58 -41970 -25851 25015 24470 34395 44718 35936 -12896 -57749 -49407 -43579 -49409 -37118 7639
15685 7639 11222 9457 -11491 -16604 11686 27406 25303 11248 -11841 -17745 3203 8129 2308
15672 2308 -32603 -51810 -35371 -15972 -28208 -34106 28773 88178 102297 55719 6225 4645
15660 4645 -16984 -39150 -39211 -31513 13695 43188 47996 77099 35817 -39268 9845 45913 14428
15647 14428 -7154 9194 -30113 -45002 -49426 -49178 -44138 -49012 -53670 -57862 -18036 8844 -17554
$$ packed form
15737e6256L1396K5542J0958m9025L438K2975Q173L724Q858P245L444k2587q482
15724a0597O422k0648k6173K8163L8489k3332m0723p647J7622L2634M1355j4452
15712B1113m1564n481J1802J024M520j9201q789N9549m308j2870J2680O610k5143
15699e8m1912J6119N0866n45R925J0323q782m8832m4853Q342N828n830J2291M4757
15685G639L583j765k0948n113K8290J5720k103j4055k3089n904K0948M926n821
15672B308l4911j9207J6439J9399j2236n898O2879N9405J4119m6578m9494j580
15660D645k1629k2166o1P698M5208K9493M808K9103m1282p5085M9113L6068l1485
15647A4428k1582J6348l9307j4889m424K48N040m874m658m192L9826K6880k6398
$$ plain form
15634 -17554 -21512 23672 31291 41522 60784 774 -58343 -99910 -86449 -8206 -8206 -34543 3931
15621 3931 12761 21996 50797 47062 7005 10182 12939 -10322 -20934 -4201 -27051 -13698 -32250
15608 -32250 -80335 -54085 2717 48194 41687 36265 37337 -10124 -45682 -68012 -61758 -63771 -25677
15595 -25677 5683 292 -5889 3890 148 -41681 -75874 -60489 -47435 -6259 17727 3006
15583 3006 -42786 -82301 -39876 -47108 -23955 -40477 -58197 -45044 -8489 3736 -5569 -1210
15571 -1210 -30706 -47862 -26319 -7980 9494 8756 10227 -22662 -35177 -23102 -4755 -15302
15559 -15302 6073 18672 3076 10317 1106 -7149 -41600 -77041 -76217 -34086 2049 20187 40765
15546 40765 37219 38919 9494 -38799 -44779 -3244 28377 33190 18840 4485 -8855 -66850
$$ packed form
15634a7554l958M5184P619J0231J9262o0010n9117m1567J3461P8243%k6337L8474
15621C931Q830R235K8801l735m0057L177K757k3261j0612J6733k2850J3353j8552
15608c2250m8085K6250N6802M5477o507n422J072m7461l5558k2330O254k013L8094
15595b5677L1360n391o181R779l742m1829l4193J5385J3054M1176K3986j4721
15583C006m5792l9515M2425p232K3153j6522j7720J3153L6555J2225r305M359
15571a210k9496j7156K1543J8339J7474p38J471l2889j2515J2075J8347j0547
15559a5302K1375J2599j5596P241r211q255l4451l5441Q24M2131L6135J8138K0578
15546D0765l546J700k9425m8293n980M1535L1621M813j4350j4355j3340n7995
$$ plain form
15534 -66850 -30641 -33124 -36932 -34715 -32084 -18304 -20588 -13029 -37411 -55419 -52071 -52460 -65439
15521 -65439 -44997 -25492 -14070 3721 -13417 627 15390 34009 50733 -699 6822 13845
15509 13845 -16597 -56954 -42799 -27739 -39159 -25366 -9290 17916 11015 28980 22554 14000
15497 14000 9993 -4080 -23133 -25335 12914 47739 80558 87820 85620 47524 -3930 -5681 728
15484 728 -37296 -6008 4224 6832 5325 33090 16962 -17994 -24016 -35619 -12573 12960 5197
15471 5197 -6004 17168 2458 10569 23632 17111 15362 5200 -25028 -19713 -3096 12309 -13810
15458 -13810 -30016 -5294 25034 19077 -7095 -2061 -15196 15440 32443 21341 -3956 17290
15446 17290 18630 31721 8735 -7505 7965 5379 6255 10911 -21108 -25339 -763 20544 4082
$$ packed form
15534f6850L6209k483l808K217K631J3780k284P559k4382j8008L348l89j2979
15521f5439K0442J9505J1422J7791j7138J4044J4763J8619J6724n1432P521P023
15509A3845l0442m0357J4155J5060j1420J3793J6076K7206o901J7965o426q554
15497A4000m007j4073j9053k202L8249L4825L2819P262k200l8096n1454j751O409
15484G28l8024L1288J0232K608j507K7765j6128l4956o022j1603K3046K5533p763
15471E197j1201K3172j4710Q111J3063o521j749j0162l0228N315J6617J5405k6119
15458a3810j6206K4722L0328n957k6172N034j3135L0636J7003j1102k5297K1246
15446A7290J340J3091k2986j6240J5470k586Q76M656l2019m231K4576K1307j6462
$$ plain form
15433 4082 7156 -20524 -47508 -32079 1434 10093 5673 -22207 -11495 27971 23071 7585 -16145
15420 -16145 3162 -15021 -10057 17516 34008 29477 -22301 -38045 -92903 -83868 -54898 -65131
15408 -65131 -77606 -85185 -88956 -97418 -48656 -37043 -80141 -36832 -24739 -39481 -48296 -24971
15396 -24971 -30435 -26465 -27784 -6981 -2871 19127 -19348 -34309 -7041 19229 10287 -415 833
15383 833 15791 1734 13163 -3598 -19888 -43992 -22978 -14001 -11716 -23877 361 -23427
15371 -23427 -29733 -37201 -68512 -87811 -73837 -53808 -43042 -4015 -53621 -110130 -75417 -57755
15359 -57755 -59875 -49272 -67540 -28902 -18319 -33976 877 73775 112667 111076 93677 111236
15347 111236 118601 99389 47584 7433 10282 13986 -20057 -7017 3813 19912 36847 10381
$$ packed form
15433D082L074k7680k6984J5429L3513Q659m420k7880J0712L9466m900j5486k3730
15420a6145J9307j8183M964K7573J6492m531n1778j5744n4858R035K8970j0233
15408f5131j2475p579l771q462M8762J1613m3098M3309J2093j4742q815K3325
15396b4971n464L970j319K0803M110K1998l8475j4961K7268K6270q942j0702J248
15383H33J4958j4057J1429j6761j6290k4104K1014Q977K285j2161K4238k3788
15371b3427o306p468l1311j9299J3974K0029J0766L9027m9606n6509L4713J7662
15359e7755k120J0603j8268L8638J0583j5657L4853P2898L8892j591j7399J7559
15347A11236P365j9212n1805m0151K849L704l4043J3040J0830J6099J6935k6466
$$ plain form
15335 10381 -58510 -54502 -49389 -41520 -48753 -28196 5637 -607 -9276 -4756 26560 36036 27527
15322 27527 -18039 -52009 -6394 -20147 -27359 -2839 -24065 -6750 13612 40470 33416 -8722
15310 -8722 -11822 333 -30776 -41450 -35736 -25347 11463 4627 -11028 -21858 -40120 -39777 -2527
15297 -2527 32610 3468 -13733 -27092 -16779 -15957 -21835 -22463 -9804 19469 -4885 -22804 -35053
15284 -35053 -28 19755 -16495 19528 48495 45358 41075 18944 8795 -14728 -33172 -3676
15272 -3676 36301 39451 -23099 -31339 -21482 -27395 -15818 1833 8543 9225 34609 44729 64424
15259 64424 49888 11824 -19382 -3273 -31314 -58759 -64611 -41438 -10725 3327 5278 -13364
15247 -13364 -51543 -56840 -23944 -17301 -48790 -26149 -41316 -77058 -68091 -23225 -28009 -19649 815
$$ packed form
15335A0381o8891M008N113P869p233K0557L3833o244q669M520L1316R476q509
15322B7527m5566l3970M5615j3753p212K4520k1226J7315K0362K6858p054m2138
15310h722l100J2155l1109j0674N714J0389L6810o836j5655j0830j8262L43L7250
15297b527L5137k9142j7201j3359J0313Q22n878o28J2659K9273k4354j7919j2249
15284c5053L5025J9783l6250L6023K8967l137m283k2131j0149k3523j8444K9496
15272c676L9977L150o2550q240R857n913J1577J7651O710O82K5384J0120J9695
15259F4424j4536l8064l1206J6109k8041k7445n852K3173L0713J4052J951j8642
15247a3364l8179n297L2896O643l1489K2641j5167l5742Q967M4866m784Q360K0464
$$ plain form
15234 815 -34831 -48483 -8496 -330 19678 19461 24434 33391 31824 2422 -14503 17371 -9510
15221 -9510 -34304 -15379 16548 4341 106 4189 10738 28146 17229 27179 33896 15642 380
15208 380 -21122 -23566 -16080 -26450 -16440 -19953 -32989 -32976 15876 52263 -1003 -40546 -39674 -41991
15194 -41991 -29309 6912 42707 57044 30157 -6338 -32709 -47279 -25773 12009 17767 -16113
15182 -16113 -19181 21179 15110 -8303 -18615 -10171 -23395 -46024 -39646 -24396 -17068 -11248 -9826
15169 -9826 -6484 -8773 -15617 -24266 -45321 -44093 -7670 -2311 -7870 30844 33646 -9800 -17972 16991
15155 16991 59469 45635 46357 50999 38749 27818 19532 -25111 -6795 4471 -43590 -69770
15143 -69770 -22419 -32956 -43439 -51396 -15892 21473 42817 3629 -76845 -90272 -61222 -68416
$$ packed form
15234H15l5646j3652L9987Q166K0008k17M973Q957j567k9402j6925L1874k6881
15221i510k4794J8925L1927j2207m235M083O549J7408j0917R950O717j8254j5262
15208C80k1502k444P486j0370J0010l513j3036J3M8852L6387n3266l9543Q72k317
15194d1991J2682L6221L5795J4337k6887l6495k6371j4570K1506L7782N758l3880
15182a6113l068M0360o069k3413j0312Q444j3224k2629O378J5250P328N820J422
15169i826L342k289o844q649k1055J228L6423N359n559L8714K802m3446q172L4963
15155A6991M2478j3834P22M642j2250j0931q286m4643J8316J1266m8061k6180
15143f9770M7351j0537j0483p957L5504L7365K1344l9188q0474j3427K9050p194
$$ plain form
15131 -68416 -53962 -3742 50132 62417 76858 85742 68871 47029 63090 75707 59766 46476
15119 46476 28173 -11955 -33286 13729 23415 1160 3784 20190 1350 -5706 15394 17206
15107 17206 15465 -14397 -26843 -18743 -28816 -11369 -29904 -32477 -16208 43442 85012 72299
15095 72299 21787 27230 43742 18508 -13703 -22582 5177 29668 40227 21802 33850 43809
15083 43809 30457 16151 -6635 -1138 2572 -7499 443 -16896 -28517 3895 2933 3018 73426
15070 73426 65274 17766 24134 40995 20101 31895 43269 102948 88014 32736 10899 -21745
15058 -21745 -6566 -2137 -4029 1053 -423 4629 31018 60677 64294 29666 23058 29377 -9413
15045 -9413 -13952 -35159 -38010 8210 44855 42922 48610 27794 11535 27201 28722 25563 54680
$$ packed form
15131f8416J4454N0220N3874J2285J4441Q884j6871k1842J6061J2617j5941j3290
15119D6476j8303m0128k1331M7015R686k2255K624J6406j8840p056K1100J812
15107A7206j741k9862j2446Q100j0073J7447j8535k573J6269N9650M1570j2713
15095G2299n0512N443J6512k5234l2211q879K7759K4491J0559j8425J2048R959
15083D3809j3352j4306k2786N497L710j0071P942j7339j1621L2412r62Q5P0408
15070G3426q152m7508O368J6861k0894J1794J1374N9679j4934n5278k1837l2644
15058b1745J5179M429j892N082j476N052K6389K9659L617l4628o608O319l8790
15045i413m539k1207k851M6220L6645j933N688k0816j6259J5666J521l159K9117
$$ plain form
15032 54680 38600 46943 60023 46610 16084 20743 31439 40536 55845 83289 82905 67702 81582
15019 81582 37806 -15093 -13003 17416 18017 81446 70239 28196 31956 50105 58636 92546 121914
15006 121914 81138 57503 78065 96782 79933 77630 68309 69405 46597 61750 102611 90943
14994 90943 84954 89234 149205 200549 300602 326955 295567 216527 158743 113342 103764 119407
14982 119407 124147 135538 110753 39971 33035 24606 19441 2645 -12335 9039 52673 52306 32090
14969 32090 20299 24628 5473 -14109 20701 42165 35997 35677 71063 90777 79293 53686
14957 53686 33008 44913 35364 40346 49513 63230 57161 46172 50547 51422 68254 30484 -8642
14944 -8642 -20146 -10444 -29880 -32163 -14975 -6171 50251 97275 59850 14696 65911 85794
$$ packed form
15032E4680j6080Q343J3080j3413l0526M659J0696R097J5309K7444l84j5203J3880
15019H1582m3776n2899K090L0419O01O3429j1207m2043L760J8149Q531L3910K9368
15006A21914m0776k3635K0562J8717j6849k303r321J096k2808J5153M0861j1668
14994I0943n989M280N9971N1344J00053K6353l1388p9040n7784m5401r578J5643
14982A19407M740J1391k4785p0782o936q429n165j6796j4980K1374M3634l67k0216
14969C2090j1791M329j9155j9582L4810K1464o168l20L5386J9714j1484k5607
14957E3686k0678J1905r549M982R167J3717o069j0989M375Q75J6832l7770l9126
14944h642j1504R702j9436k283J7188Q804N6422M7024l7425m5154N1215J9883
$$ plain form
14932 85794 77648 36921 8848 -2127 3684 -5057 -22860 -21060 -11928 -17674 -32814 -22079 -14811
14919 -14811 -5538 9141 18528 1830 22775 41076 31568 40540 55568 40455 24653 33356 15239
14906 15239 12394 12545 22267 12702 6204 11111 3889 162 -8033 80 -3644 21489 17519 -16427
14892 -16427 -27768 -27973 -24721 -14368 -30868 454 27403 24946 31708 30822 46430 15258 -13068
14879 -13068 -27122 -21510 -59985 -70690 -48219 -29662 -4383 28932 34144 9934 -47215 -53930
14867 -53930 -25755 12254 52621 42280 27992 11746 2110 -1901 -11196 17361 11659 3061 -12508
14854 -12508 -20649 -39703 -24479 13904 18449 62633 61631 47398 29072 22462 10079 -17899
14842 -17899 -4703 4954 -30979 -56841 -34604 -15732 -24616 -48583 -49028 -32932 -27394 -748 33775
$$ packed form
14932H5794q146m0727k8073j0975N811q741j7803J800R132n746j5140J0735P268
14919a4811R273J4679R387j6698K0945J8301r508Q972J5028j5113j5802Q703j8117
14906A5239k845J51R722r565o498M907p222l727q195Q113l724K5133l970l3946
14892a6427j1341k05L252J0353j6500L1322K6949k457O762q86J5608l1172k8326
14879a3068j4054N612l8475j0705K2471J8557K5279L3315N212k4210n7149o715
14867e3930K8175L8009M0367j0341j4288j6246r636m011r295K8557n702q598j5569
14854a2508q141j9054J5224L8383M545M4184j002j4233j8326o610j2383k7978
14842a7899J3196R657l5933k5862K2237J8872q884k3967m45J6096N538K6646L4523
$$ plain form
14829 33775 13629 4548 -788 4254 6328 -26540 -3522 30535 28063 28073 52359 24742 31506
14816 31506 44661 47400 48188 -1311 -41102 -22986 -26854 -60729 -21754 23377 26297 -26163 -30713
14803 -30713 6383 2811 -53965 -58838 -41952 -31632 -5800 29564 2213 -34705 -25674 7419
14791 7419 33957 24409 21294 23144 46445 46438 66795 75675 95212 95977 110266 118654 93262 50899
14777 50899 9970 -11058 -27338 -10546 -19987 6334 49763 65822 32661 -4879 -11339 7372
14765 7372 20864 12095 27103 33830 23964 -6868 -7488 14598 39638 27374 3838 -15826 -9934
14752 -9934 26872 58397 55825 13677 11772 7023 -16413 11293 69916 69528 66053 6426 -47160
14739 -47160 -49754 4787 14218 30403 15167 -25461 -30481 -21763 37619 54737 30628 19125
$$ packed form
14829C3775k0146r081n336N042K074l2868K3018L4057k472J0K4286k7617O764
14816C1506J3155K739P88m9499l9791J8116l868l3875L8975M5131K920n2460m550
14803c0713L7096l572n6776m873J6886J0320K5832L5364k7351l6918R031L3093
14791G419K6538r548l115J850K3301pK0357Q880J9537P65J4289Q388k5392m2363
14777E0899m0929k1028j6280J6792r441K6321M3429J6059l3161l7540o460J8711
14765G372J3492q769J5008O727r866l0832o20K2086K5040j2264k3536j9664N892
14752i934L6806L1525k572m2148j905m749k3436K7706N8623l88l475n9627n3586
14739d7160k594N4541R431J6185j5236m0628n020Q718N9382J7118k4109j1503
$$ plain form
14727 19125 -8022 -41349 -40999 -28811 -37582 -49816 -47481 -37554 -14759 5878 26198 29571 28743
14714 28743 16721 37007 56287 49089 1658 -36106 -20815 9005 3740 3021 1005 9024 18373
14701 18373 -5482 -13175 -24571 -23933 -54000 -31645 1714 25887 47115 25744 23153 66454
14689 66454 80398 54643 37870 19988 8423 10860 11460 25543 11103 -3620 -28731 -28258 5381
14676 5381 13473 5850 -6402 6438 20644 39369 47116 39351 55560 63044 68259 60961 42577
14663 42577 39521 40806 27889 22642 9719 21536 8612 24862 16176 -10837 -5876 16151 23071
14650 23071 37922 30014 8957 -3431 -2847 46970 38942 36582 35048 11920 2765 -1419 649
14637 649 8147 -28505 -5823 5181 5690 -18635 -59974 -68487 -80489 -65186 -36407 -38316 -25656
$$ packed form
14727A9125k7147l3327L50J2188q771j2234K335R927K2795K0637K0320L373q28
14714B8743j2022K0286J9280p198m7431l7764J5291K9820n265p19k016Q019R349
14701A8373k3855p693j1396O38l0067K2355L3359K4173K1228k1371k591M3301
14689F6454J3944k5755j6773j7882j1565K437O00J4083j4440j4723k5111M73L3639
14676E381Q092p623j2252J2840J4206J8725P747p765J6209P484N215p298j8384
14663D2577l056J285j2917n247j2923J1817j2924J6250q686k7013M961K2027O920
14650B3071J4851p908k1057j2388N84M9817q028k360j534k3128r155m184K068
14637F49P498l6652K2682J1004N09k4325m1339q513j2002J5303K8779j909J2660
$$ plain form
14624 -25656 -27533 -33750 -21981 -16904 -39891 -22721 18558 13129 18564 39100 12317 -30812 -14038
14611 -14038 -8988 -3819 -1682 -9856 -21453 -2541 14779 59786 83267 74675 93352 92898 99272
14598 99272 103073 72004 49148 70860 110521 131325 104642 82515 53025 21135 3802 32055
14586 32055 38926 20154 26416 31837 19050 30095 49811 86015 89911 69769 41445 49770 62051
14573 62051 55386 47404 54998 46147 12923 -5674 -10767 -22175 -25934 -15488 19474 71608 115283
14560 115283 132057 99776 48539 24448 37157 35905 27009 29553 35721 32456 42063 70539 103467
14547 103467 122061 104647 75391 62312 84350 59730 27343 29360 23681 14485 -27820 -18488
14535 -18488 14091 57211 101461 73378 -1799 -56057 -17878 28192 42458 52864 37376 -277
$$ packed form
14624b5656j877o217J1769N077k2987J7170M1279n429N435K0536k6783m3129J6774
14611a4038N050N169K137q174j1597J8912J7320M5007K3481q592J8677m54O374
14598I9272L801l1069k2856K1712L9661K0804k6683k2127k9490l1890j7333K8253
14586C2055O871j8772O262N421j2787J1045J9716L6204L896k0142k8324Q325J2281
14573F2051o665p982P594q851l3224j8597n093j1408l759J0446L4962N2134M3675
14560A15283J6774l2281n1237k4091J2709j252q896K544O168l265R607K8476L2928
14547A03467J8594j7414k9256j3079K2038k4620l2387K017n679r196m2305R332
14535a8488L2579M3120M4250k8083p5177n4258L8179M6070J4266J0406j5488l7653
$$ plain form
14523 -277 19550 5246 -9206 32442 63027 94264 86386 85548 84919 71321 62319 41885 36077
14510 36077 23968 22335 17579 2669 -27515 -37011 -33616 -21896 9417 27190 30274 36788 52757
14497 52757 45456 63280 51125 9956 -54525 -68962 -20200 11712 44558 64203 78669 93131
14485 93131 91158 72993 54849 28686 -5523 1796 -12137 -16944 -28664 -21651 3458 14276
14473 14276 -9851 -2143 25948 8206 24594 26760 22587 -5558 -20993 -13613 7869 19175
14461 19175 63524 33246 5222 -8723 280 -19349 -56727 -32465 -15961 -9632 -9526 -24062
14449 -24062 -42793 -46386 -22176 -294 12834 -15020 -31833 -61397 -45467 -24985 8214 45797
14437 45797 39272 56362 45617 -693 -45771 -34632 15280 17978 1994 7793 12502 31309
$$ packed form
14523b77J9827j4304j4452M1648L0585L1237p878q38o29j3598r002k0434n808
14510C6077j2109j633m756j4910l0184r496L395J1720L1313J7773L084O514J5969
14497E2757p301J7824j2155m1169o4481j4437M8762L1912L2846J9645J4466J4462
14485I3131j973j8165j8144k6163l4209P319j3933m807j1720P013K5109J0818
14473A4276k4127P708K8091j7742J6388K166m173k8145j5435P380K1482J1306
14461A9175M4349l0278k8024j3945R003j9629l7378K4262J6504O329J06j4536
14449b4062j8731l593K4210K1882J3128k7854j6813k9564J5930K0482L3199L7583
14437D5797o525J7090j0745m6310m5078J1139M9912K698j5984N799M709J8807
$$ plain form
14425 31309 6239 3143 -4109 -45543 -91256 -74105 -39502 -8787 -35986 -28985 -4880 49921
14413 49921 61524 63802 57957 51019 31370 26193 19608 -14112 -4599 37949 62137 38484 14298
14400 14298 27971 36279 20568 2611 1870 27550 65475 50482 36822 20320 -4372 -270
14388 -270 4110 -9282 12496 47372 22310 -11175 9736 -24618 -31610 -8106 -25341 6144
14376 6144 22553 27794 52390 58958 28483 10946 -17477 3767 -2478 -23235 -14669 -19608 -17083
14363 -17083 -20924 -430 26354 39118 52140 25256 17162 -27148 -53701 -5053 1102 11729
14351 11729 15333 -48773 -71274 -55079 -31748 -12357 -28625 -62571 -68035 -48695 -37708 -22462
14339 -22462 6329 13379 20600 8112 -11505 -21191 -825 679 2410 22074 33865 39854 41331
$$ packed form
14425C1309k5070l096p252m1434m5713J7151L4603L0715k7199P001K4105N4801
14413D9921J1603K278n845o938j9649n177o585l3720R513M2548K4188k3653k4186
14400A4298J3673Q308j5711j7957p41K5680L7925j4993j3660j6502k4692M102
14388b70M380j3392K1778L4876k5062l3485K0911l4354o992K3504j7235L1485
14376F144J6409N241K4596O568l0475j7537k8423K1244o245k0757Q566m939K525
14363a7083l841K0494K6784J2764J3022k6884q094m4310k6553M8648O155J0627
14351A1729L604o4106k2501J6195K3331J9391j6268l3946n464J9340J0987J5246
14339b2462K8791P050P221j2488j9617r686K0366J504J731J9664J1791N989J477
$$ plain form
14326 41331 20958 -2312 3173 9360 -547 10445 13369 -3917 11394 25586 12366 20801 47017
14313 47017 34248 8714 12589 10642 9612 -8728 -23957 -41579 17276 59354 21971 32895
14301 32895 24598 30229 49851 46311 4821 -18910 -20203 -12148 5776 51884 75268 45035 21430
14288 21430 54173 56939 70347 94487 60735 44113 38811 39561 9484 -11043 -5410 13727 11770
14275 11770 3118 -3912 -12502 -16547 11364 60816 60180 59599 53893 20566 15757 53423 38338 46679
14261 46679 45395 24821 29716 50408 28568 -4149 25931 20782 25206 -2682 2328 60522 63814
14248 63814 15493 -13268 -31280 -55763 -45245 -13248 35095 62323 73685 81102 68387 83984
14236 83984 73165 51298 58852 64311 52271 58202 57714 58678 51983 34273 19602 -2009 -22145
$$ packed form
14326D1331k0373k3270N485O187r907J0992K924j7286J5311J4192j3220Q435K6216
14313D7017j2769k5534L875j947j030j8340j5229j7622N8855M2078l7383J0924
14301C2895q297N631J9622l540m1490k3731j293Q055J7924M6108K3384l0233k3605
14288B1430L2743K766J3408K4140l3752j6622n302P50l0077k0527N633J9137j957
14275A1770q652p030q590m045K7911M9452o36n81n706l3327m809L7666j5085Q341
14261D6679j284k0574M895K0692k1840l2717L0080n149M424k7888N010N8194L292
14248F3814m8321k8761j8012k4483J0518L1997M8343K7228J1362P417j2715J5597
14236H3984j0819k1867P554N459j2040N931m88R64o695j7710j4671k1611k0136
$$ plain form
14223 -22145 -57599 -47148 -60885 -34595 -25572 -39960 -7245 -33830 -55074 -44961 -61885 -37024
14211 -37024 -35606 -14568 -3618 7340 7308 -14308 -32379 -10452 -10189 11481 4278 4177 -23972
14198 -23972 -8066 5 4365 11523 17664 8693 19285 47659 43524 28721 11519 51523 65639
14185 65639 22186 -2706 -12483 -14815 33160 24170 25760 -334 12018 28871 38221 12563 -456
14172 -456 13597 17904 14519 35303 31950 7412 -37896 -11065 24222 40587 42047 14114 -36961
14159 -36961 9913 51438 54300 41329 29267 46650 83748 72774 37214 44132 36669 15767
14147 15767 8317 9605 26921 6804 5793 -26587 -40850 -22720 13905 16422 29364 28057 -9013
14134 -9013 40512 65545 54559 63929 78733 113031 149253 131194 107317 66761 24241 33425
$$ packed form
14223b2145l5454J0451j3737K6290R023j4388L2715k6585k1244J0113j6924K4861
14211c7024J418K1038J0950J0958l2k1616j8071K1927K63K1670p203j01k8149
14198b3972J5906Q071M360P158O141q971J0592K8374m135j4803j7202M0004J4116
14185F5639m3453k4892r777k332M7975q990J590k6094J2352J6853R350k5658j3019
14172d56J4053M307l385K0784l353k4538m5308K6831L5287J6365J460k7933n1075
14159c6961M6874M1525K862j2971j2062J7383L7098j0974l5560O918p463k0902
14147A5767p450J288J7316k0117j011l2380j4263J8130L6625K517J2942j307l7070
14134i013M9525K5033j0986R370J4804L4298L6222j8059k3877m0556m2520R184
$$ plain form
14122 33425 47463 78630 72738 49343 7456 13997 37262 52493 34104 37195 36593 38031 84502
14109 84502 111471 81684 79997 61157 53041 60762 74882 66495 85082 85980 63374 71471 105822
14096 105822 85495 80104 65143 47574 23911 22967 11573 -29950 -20937 -23522 -52241 -15325
14084 -15325 20171 47254 54159 88091 70113 55218 59154 44622 65314 66040 36779 26703
14072 26703 28805 75279 69186 17859 -6722 19611 74144 67762 8427 -1606 26953 75357
14060 75357 97555 54074 47745 40998 8855 -15484 -52672 -32762 -4574 26539 22275 41917
14048 41917 63792 52009 40770 47252 61506 39009 26291 46027 60434 71408 63975 63895 33701
14035 33701 -11826 -33441 9353 -18611 -22301 -28452 -13595 26685 22883 21771 -13746 -26752
$$ packed form
14122C3425J4038L1167n892k3395m1887O541K3265J5231j8389L091o02J438M6471
14109H4502K6969k9787j687j8840q116P721J4120q387J8587Q98k2606Q097L4351
14096A05822k0327n391j4961j7569k3663r44j1394m1523R013k585k8719L6916
14084a5325L5496K7083O905L3932j7978j4895L936j4532K0692P26k9261j0076
14072B6703K102M6474o093n1327k4581K6333N4533o382n9335j0033K8559M8404
14060G5357K2198m3481o329o747l2143k4339l7188J9910K8188L1113m264J9642
14048D1917K1875j1783j1239O482J4254k2497j2718J9736J4407J0974p433q0l0194
14035C3701m5527k1615M2794k7964l690o151J4857M0280l802j112l5517j3006
$$ plain form
14023 -26752 -26435 414 34636 14519 -10480 1078 57825 54004 51040 38340 35621 34737 34032
14010 34032 24201 -12439 8394 22006 19716 34340 47758 21526 22518 45112 68096 85344
13998 85344 61949 31322 40579 48944 52904 34499 277 16181 42099 49461 26425 29562 10155
13985 10155 10264 18901 69797 59549 39305 29396 53338 64839 73967 73406 63136 68689 38189
13972 38189 6344 13950 43176 47626 69282 131166 146007 107780 60897 45711 60961 29462
13960 29462 38078 67760 110002 133034 118782 84954 -2925 -21424 28220 38688 53235 70639
13948 70639 55458 39773 37701 28747 54515 74997 81626 80454 65890 40199 29450 11323
13936 11323 45560 34196 10918 33978 67117 34718 15616 6849 28986 18269 -13046 -8442
$$ packed form
14023b6752L17K6849L4222k0117k4999J1558N6747l821k964j2700k719q84p05
14010C4032r831l6640K0833J3612k290J4624J3418k6232R92K2594K2984J7248
13998H5344k3395l0627R257Q365L960j8405l4222J5904K5918P362k3036L137j9407
13985A0155J09Q637N0896j0248k0244r909K3942J1501R128n61j0270N553l0500
13972C8189l1845P606K9226M450K1656O1884J4841l8227m6883j5186J5250l1499
13960B9462Q616K9682M2242K3032j4252l3828q7879j8499M9644J0468J4547J7404
13948G0639j5181j5685k072q954K5768K0482O629j172j4564k5691j0749j8127
13936A1323L4237j1364k3278K3060L3139l2399j9102q767K2137j0717l1315M604
$$ plain form
13924 -8442 17793 33690 44329 53952 74906 52376 48523 56190 19361 13604 21113 11456 39547
13911 39547 70886 102335 110694 76901 55105 36650 18429 1534 -39963 -45474 -35572 -30037
13899 -30037 -262 30695 -2226 -29427 -16720 19107 29764 15389 -5136 11898 25044 46605
13887 46605 49049 22872 24808 216 11111 16958 6598 8901 9535 -8754 -7062 -1469 -6708
13874 -6708 14808 5240 4196 39312 30967 63433 93681 90261 33895 2960 17839 22620 20748
13861 20748 10627 9836 21375 24454 31010 44052 49720 68969 46195 63575 75653 89665 44775
13848 44775 23423 53382 66285 59926 44818 63076 71416 68277 39062 58695 83761 107499
13836 107499 117263 110543 108526 101272 120491 122802 110604 105219 98971 100256 87558 40960 20340
$$ packed form
13924h442K6235J5897J0639R623K0954k2530l853P667l6829n757P509r657K8091
13911C9547L1339L1449Q359l3793k1796j8455j8221j6895m1497n511R902N535
13899c0037K9775L0957l2921k7201J2707L5827J0657j4375k0525J7034J3146K1561
13887D6605K444k6177J936k4592J0895N847j0360K303O34j8289J692N593n239
13874f708K1516r568j044L5116q345L2466L0248l420n6366l0935J4879M781j872
13861B0748j0121p91J1539L079O556J3042N668J9249k2774J7380J2078J4012m4890
13848D4775k1352K9959J2903o359j5108J8258Q340l139k9215J9633K5066K3738
13836A07499R764o720k017p254J9219K311j2198n385o248J285j2698m6598k0620
$$ plain form
13823 20340 26219 11782 33811 35713 66778 59945 52124 46982 61910 77161 79867 53903 5184
13810 5184 24818 57458 49025 56152 103673 117881 118580 113759 117894 91578 80061 42216 15127
13797 15127 38387 37108 18308 28363 28142 -4148 -30653 19520 54128 56893 35075 6393
13785 6393 -8704 33457 26367 66034 57874 49131 65012 95822 103098 129048 88624 60741 28349
13772 28349 28197 30886 36393 37417 39829 33856 39592 29582 24274 43999 41572 59805 58765 27779
13758 27779 32752 70920 91875 79843 61395 77598 87796 54186 46602 46064 60005 51377 23824
13745 23824 12420 30279 41122 14432 13454 3252 28995 49293 27994 26207 26607 25907 32546
13732 32546 47675 43561 56424 84174 88819 107212 103859 80916 95613 71536 59580 63652
$$ packed form
13823B0340N879j4437K2029J902L1065o833p821n142J4928J5251K706k5964m8719
13810E184J9634L2640q433P127M7521J4208O99m821M135k6316j1517l7845k7089
13797A5127K3260j279j8800J0055k21l2290k6505N0173L4608K765k1818k8682
13785F393j5097M2161p090L9667q160q743J5881L0810P276K5950m0424k7883l2392
13772B8349j52K689N507J024K412n973N736j0010n308J9725k427J8233j040l0986
13758B7779M973L8168K0955j2032j8448J6203J0198l3610p584n38J3941q628k7553
13745B3824j1404J7859J0843k6690r78j0202K5743K0298k1299j787M00p00O639
13732C2546J5129m114J2863K7750M645J8393l353k2943J4697k4077j1956M072
$$ plain form
13720 63652 99272 128062 160904 147542 143566 123733 91826 68835 94132 113287 89165 81878
13708 81878 89151 101720 52337 5723 -19894 7188 31060 38092 51150 38843 76862 88710
13696 88710 64048 65836 57892 89344 100862 87939 103136 90457 109539 113827 75593 49829
13684 49829 40190 29796 33316 39000 27746 29681 30277 44941 67544 136982 129256 97799 116551
13671 116551 82420 8309 2845 -31654 -27559 22517 45848 53141 57227 32672 34187 48488
13659 48488 70047 42468 38672 34802 27892 75523 131710 112925 67786 63576 42210 64056
13647 64056 70127 71447 49746 38973 43168 67913 79901 78062 71695 43509 37498 45776 53184
13634 53184 37723 6540 3233 13728 48252 62332 66380 34145 30909 64086 50809 14519
$$ packed form
13720F3652L5620K8790L2842j3362l976j9833l1907k2991K5297J9155k4122p287
13708H1878P273J2569m9383m6614k5617K7082K3872P032J3058j2307L8019J1848
13696H8710k4662J788p944L1452J1518j2923J5197j2679J9082M288l8234k5764
13684D9829r639j0394L520N684j1254J935N96J4664K2603O9438p726l1457J8752
13671A16551l4131p4111n464l4499M095N0076K3331P293M086k4555J515J4301
13659D8488K1559k7579l796l870o910M7631N6187j8785m5139m210k1366K1846
13647F4056O071J320k1701j0773M195K4745J1988j839o367k8186o011Q278P408
13634E3184j5461l1183l307J0495L4524J4080M048l2235l236L3177j3277l6290
$$ plain form
13622 14519 -7229 -10144 9284 16153 -7830 3068 19023 29163 64000 50557 24960 -10458
13610 -10458 14674 59938 72545 65366 74343 62302 66654 47808 56447 56816 45996 36208 54117
13597 54117 34296 16713 17363 13907 -20713 -14979 23691 21866 6990 9379 26512 24456 -12195
13584 -12195 -44153 -27995 -7060 16491 45713 57123 60233 86391 81582 72800 65954 83110
13572 83110 82190 82185 114254 120107 109977 115297 96102 111853 144215 122863 89889 43929 25547
13559 25547 50066 76309 78478 76759 63285 65299 86094 92714 71798 75961 56498 45785 62786
13546 62786 57904 26138 6555 42764 41973 48170 56576 82583 85247 104449 95140 73866 78018
13533 78018 119416 136471 142617 107332 89330 67218 71381 86190 72630 63059 59818 61887 61256
$$ packed form
13622A4519k1748k915J9428O869k3983J0898J5955J0140L4837j3443k5597l5418
13610a0458K5132M5264J2607p179Q977j2041M352j8846Q639L69j0820r788J7909
13597E4117j9821j7583O50l456l4620N734L8670j825j4876K389J7133k056l6651
13584a2195l1958J6158K0935K3551K9222J1410L110K6158m809q782o846J7156
13572H3110r20nL2069N853j0130N320j9195J5751L2362k1352l2974m5960j8382
13559B5547K4519K6243K169j719j3474K014K0795O620k0916M163j9463j0713J7001
13546F2786m882l1766j9583L6209p91O197Q406K6007K664J9202r309k1274M152
13533G8018M1398J7055O146l5285j8002k2112M163J4809j3560r571l241K069o31
$$ plain form
13520 61256 76596 72779 89080 90164 73959 85150 54917 93500 105100 46937 65469 140702
13508 140702 148105 93350 59706 68955 113427 167967 158942 132835 135058 147859 129204 122295
13496 122295 148458 100252 51460 20658 19423 36558 84839 98673 112551 90040 118774 115204
13484 115204 98822 89720 83294 97635 96553 78171 119335 125798 140957 123490 80850 40230
13472 40230 22026 31481 21590 10969 13304 8967 31643 48104 87953 140937 140862 90641 64216
13459 64216 57007 63841 42950 10605 6105 17332 31219 34132 7123 -21708 7576 13653 33660
13446 33660 62400 59639 59093 111601 100477 35538 43771 59504 39316 -6376 -28151 -7938
13434 -7938 -20475 8501 29843 22810 13186 -8707 18464 33847 50458 28646 8733 25183
$$ packed form
13520F1256J5340l817J6301J084j6205J1191l0233L8583J1600n8163J8532P5233
13508A40702P403n4755l3644R249M4472N4540r025k6107K223J2801j8655o909
13496A22295K6163m8206m8792l0802j235J7135M8281J3834J3878k2511K8734l570
13484A15204j6382r102o426J4341j082j8382M1164O463J5159j7467m2640m0620
13472D0230j8204R455r891j0621K335m337K2676J6461L9849N2984p5n0221k6425
13459F4216p209O834k0891l2345m500J1227J3887K913k7009k8831K9284O077K0007
13446C3660K8740k761n46N2508j1124o4939Q233J5733k0188m5692k1775K0213
13434g938j2537K8976K1342p033r624k1893K7171J5383J6611k1812j9913J6450
$$ plain form
13422 25183 4381 -6756 -29047 -28155 15699 29654 47912 39481 25952 69881 76723 97093
13410 97093 122496 91702 56736 50828 56419 51563 43524 39620 36844 60520 72830 49487 31291
13397 31291 -8496 41642 82310 65037 30236 44928 80483 82933 22846 -32673 -13703 40408
13385 40408 107917 116180 73427 73042 49222 18001 26984 36746 39382 23844 38702 64658 91121
13372 91121 104722 120836 112515 80869 46035 56973 47000 60169 83435 72856 83080 103357
13360 103357 87209 74138 38987 22803 29106 46054 78589 102479 93809 106778 133742 132540
13348 132540 97728 66034 61362 43297 51101 73911 83426 69310 75285 75141 47586 89679 124507
13335 124507 161460 104873 56081 49888 68718 80367 85479 90272 74515 82120 99494 89732
$$ packed form
13422B5183k0802j1137k2291Q92M3854J3955J8258q431j3529M3929O842K0370
13410I7093K5403l0794l4966n908N591m856q039l904k776K3676J2310k3343j8196
13397C1291l9787N0138M0668j7273l4801J4692L5555K450o0087n5519J8970N4111
13385D0408O7509Q263m2753l85k3820l1221Q983R762K636j5538J4858K5956K6463
13372I1121J3601J6114q321l1646l4834J0938r973J3169K3266j0579J0224K0277
13360A03357j6148j3071l5151j6184O303J6948L2535K3890q670J2969K6964j202
13348A32540l4812l1694m672j8065P804K2810R515j4116N975j44k7555M2093L4828
13335A24507L6953n6587m8792o193J8830J1649N112M793j5757P605J7374r762
$$ plain form
13323 89732 97240 111266 112825 112085 127842 134005 119780 122695 131767 86558 90823 110489 131631
13310 131631 127721 100515 52791 48745 59498 19340 -2993 22079 89191 103031 104541 125135
13298 125135 121078 126894 103464 109490 119907 151736 140077 87370 87860 124140 89938 67097
13286 67097 92325 99743 102715 105042 87212 65080 80937 105391 81867 78494 108151 106457 87732
13273 87732 115560 134243 148818 168585 179164 200138 208355 210102 215551 256865 298841 324985
13261 324985 340786 338103 351759 350875 383190 355248 347750 376169 444478 504284 617073 783694
13249 783694 998655 1237855 1492762 1674498 1638783 1422037 1177570 957407 789358 715142
13239 715142 627906 538960 488269 455494 455633 455593 454676 388364 360242 351376 374855 367510 330355
$$ packed form
13323H9732P508J4026J559p40J5757O163j4225K915R072m5209M265J9666K1142
13310A31631l910k7206m7724m046J0753m0158k2333K5072O7112J3840J510K0594
13298A25135m057N816k3430O026J0417L1829j1659n2707M90L6280l4202k2841
13286F7097K5228P418K972K327j7830k2132J5857K4454k3524l373K9657j694j8725
13273H7732K7828J8683J4575J9767J0579K0974Q217J747N449M1314M1976K6144
13261C24985J5801k683J3656q84L2315k7942p498K8419O8309N9806J12789J66621
13249G83694K14961K39200K54907J81736l5715k16746k44467k20163j68049p4216
13239G15142q7236q8946n0691l2775J39m0r17o6312k8122q866K3479p345l7155
$$ plain form
13226 330355 322736 340362 328799 326030 328563 311191 293453 303515 314702 303155 351316 363203
13214 363203 354396 351208 312965 312182 297202 243674 257128 285667 298647 262852 233890 231121
13202 231121 244021 234434 228764 246443 272572 273498 271152 257885 286058 346704 365530 368707 421813
13189 421813 433559 413248 402130 373521 336201 294051 282849 242262 217411 202976 225422
13178 225422 233061 234950 215429 200754 232156 239211 252632 246541 227827 221868 210530 204531 214102
13165 214102 241397 275192 291831 335916 351136 341283 322982 303755 291839 286820 273858 276657
13153 276657 289007 299743 321508 355962 389833 434851 533388 653062 740004 758384 730031
13142 730031 634949 560992 497455 451472 420280 375622 337962 299206 298512 304328 323198 310347
$$ packed form
13226C30355p619J7626j1563k769K533j7372j7738J0062J1187j1547M8161J1887
13214C63203q807l188l8243p83j4980n3528J3454K8539J2980l5795k8962k769
13202B31121J2900r587n670J7679K6129R26k346j3267K8173O0646J8826L177N3106
13189D21813J1746k0311j1118k8609l7320m2150j1202m0587k4851j4435K2446
13178B25422P639J889j9521j4675L1402P055J3421o091j8714n959j1338n999R571
13165B14102K7295L3795J6639M4085J5220r853j8301j9227j1916n019j2962K799
13153B76657J2350J0736K1765L4454L3871M5018R8537J19674Q6942J8380k8353
13142G30031r5082p3957o3537m5983l1192m4658l7660l8756o94N816J8870j2851
$$ plain form
13130 310347 260191 227438 210085 216315 207708 212157 233691 254387 253478 268365 269402 290790 288170
13117 288170 306266 338916 351375 349821 342486 384121 409329 406157 370054 339378 342877 361858
13105 361858 358320 363614 406123 488696 644716 813832 902391 913401 877806 796879 731894
13094 731894 703045 642339 572237 488692 499264 504989 475257 470714 426819 394701 337614 326132
13082 326132 319946 329417 316030 343522 353348 350545 342007 344566 331584 318173 315745 314718 363031
13069 363031 393451 394146 399624 395572 392262 392347 344430 335233 310858 309565 285465 339426 390139
13056 390139 432401 488431 545407 560074 509965 523989 536819 525036 499298 515807 560861
13045 560861 575253 582419 650870 693027 723883 812648 837011 793014 725181 656462 587878 535194
$$ packed form
13130C10347n0156l2753j7353O230q607M449K1534K0696r09J4887J037K1388k620
13117B88170J8096L2650J2459j554p335M1635K5208l172l6103l0676L499J8981
13105C61858l538N294M2509Q2573J56020J69116Q8559J1010l5595q0927o4985
13094G31894k8849o0706p0102q3545J0572N725k9732m543m3895l2118n7087j1482
13082C26132o186R471j3387K7492R826k803q538K559j2982j3411k428j027M8313
13069C63031L0420O95N478m052l310Q5m7917r197k4375j293k4100N3961N0713
13056C90139M2262N6030N6976J4667n0109J4024J2830j1783k5738J6509M5054
13045E60861J4392P166O8451M2157L0856Q8765K4363m3997o7833o8719o8584n2684
$$ plain form
13033 535194 506017 480892 472815 444871 436032 436865 404099 408290 423022 399879 368961 341357
13021 341357 328975 336084 338222 356090 359273 333393 284387 268285 297533 308819 339648 365998
13009 365998 370730 362548 368388 361268 368816 330818 277436 277393 311553 327246 268632 244450 248858
12996 248858 267845 294640 310486 313972 303998 288043 278362 278078 267623 289873 277375 305757
12984 305757 333341 367178 395159 390295 364925 370360 374347 381179 361612 331052 316944 310546
12972 310546 267558 265004 280382 262254 240373 268860 287722 285027 268845 258968 273205 303441
12960 303441 302360 252830 283008 317328 263430 258735 268740 280817 267191 272527 273268 303097
12948 303097 324986 335519 358384 403546 406100 401393 376120 433766 475914 429995 413298 408294
$$ packed form
13033E35194k9177k5125q077k7944q839Q33l2766M191J4732k3143l0918k7604
13021C41357j2382P109K138J7868L183k5880m9006j6102K9248J1286L0829K6350
13009C65998M732q182N840p120P548l7998n3382m3L4160J5693n8614k4182M408
12996B48858J8987K6795J5846L486r974j5955r681k84j0455K2250j2498K8382
12984C05757K7584L3837K7981m864k5370N435L987O832j9567l0560j4108o398
12972C10546m2988k554J5378j8128k1881K8487J8862k695j6182r877J4237L0236
12960C03441j081m9530L0178L4320n3898m695J0005J2077j3626N336P41K9829
12948C03097K1889J0533K2865M5162K554m707k5273N7646M2148m5919j6697n004
$$ plain form
12936 408294 424315 463062 480155 474024 476967 497486 498584 512383 482998 422569 386298 399177
12924 399177 408879 421624 433309 399032 411339 451685 478354 493905 532641 560470 571401 610871
12912 610871 664570 744520 732756 671851 617483 619059 632472 635208 652194 633093 663862 683033
12900 683033 710683 758703 760789 812025 862156 902611 967959 1036769 1051972 1094291 1146027 1196446
12888 1196446 1201761 1242451 1323484 1371149 1448663 1626004 1842270 2142886 2622064 3270153
12878 3270153 3910848 4092019 3733625 3201562 2790902 2558754 2423979 2376844 2331091 2290619
12868 2290619 2309507 2304428 2303320 2321137 2318139 2318854 2329402 2354332 2393297 2447789 2514111 2536911
12856 2536911 2586842 2637780 2691438 2773938 2875635 2944152 2992053 3041142 3133185 3189331 3217358
$$ packed form
12936D08294J6021L8747J7093o131K943K0519J098J3799k9385o0429l6271J2879
12924C99177R702J2745J1685l4277J2307M0346K6669J5551L8736K7829J0931L9470
12912F10871N3699P9950j1764o0905n4368J576J3413K736J6986j9101L0769J9171
12900F83033K7650M8020K086N1236N0131M0455O5348O8810J5203M2319N1736N0419
12888A196446N315M0690Q1033M7665P7514J77341K16266L00616M79178O48089
12878C270153O40695J81171l58394n32063m10660k32148j34775m7135m5753m0472
12868B290619J8888n079j108J7817k998P15J0548K4930L8965N4492O6322K2800
12856B536911M9931N0938N3658Q2500J01697O8517M7901M9089R2043N6146K8027
$$ plain form
12845 3217358 3254907 3288943 3338394 3412245 3517593 3615923 3684940 3724824 3755835 3809581 3918166
12834 3918166 4006695 4138261 4315279 4479850 4634452 4774103 4908410 5048414 5232253 5435928
12824 5435928 5630999 5862049 6159504 6500210 6912321 7398405 7984888 8711471 9523165
12815 9523165 10251106 10846955 11455673 12177337 13071854 14206489 15567647 17173070 19066626
12806 19066626 21313452 23914954 26797311 29947778 33294186 36704928 40074173 43141929
12798 43141929 45633884 47656852 49362238 50884005 52795513 56130916 61966264 71364498
12790 71364498 85915882 108219243 142553652 193229891 254839250 302585535 303555001
12783 303555001 259890958 206031991 163602058 134136928 113613025 98674080 87360268
$$ packed form
12845C217358L7549L4036M9451P3851J05348R8330O9017L9884L1011N3746J08585
12834C918166Q8529J31566J77018J64571J54602J39651J34307J40004J83839K03675
12824E435928J95071K31050K97455L40706M12111M86084N86483P26583Q11694
12815I523165P27941N95849O08718P21664Q94517J134635J361158J605423J893556
12806A9066626K246826K601502K882357L150467L346408L410742L369245L067756
12798D3141929K491955K022968J705386J521767J911508L335403N835348R398234
12790G1364498J4551384K2303361L4334409N0676239O1609359M7746285R69466
12783C03555001m3664043n3858967m2429933k9465130k0523903j4938945j1313812
$$ plain form
12776 87360268 78614280 71856161 66649123 62572253 59080854 55785167 52733052 50005415
12768 50005415 47697227 45712711 43933097 42400143 41064193 39966965 39014254 38209643
12760 38209643 37554586 37065638 36729444 36521319 36419126 36522429 36858200 37386759 37897439
12751 37897439 37854207 36992549 35565332 33821667 31992788 30158805 28409856 26753135
12743 26753135 25178079 23665906 22271413 20969840 19812882 18725974 17677086 16644271
12735 16644271 15663090 14756325 13962778 13245525 12527294 11821806 11167392 10559181 10012921
12726 10012921 9501271 9014079 8572608 8155341 7769735 7362055 6962656 6611010 6252434
12717 6252434 5964591 5708419 5455110 5210030 4922666 4720350 4596807 4396957 4140027
$$ packed form
12776H7360268q745988o758119n207038m076870l491399l295687l052115k727637
12768E0005415k308188j984516j779614j532954j335950j097228r52711q04611
12760C8209643o55057m88948l36194k08125j02193J03303L35771N28559N10680
12751C7897439m3232q61658j427217j743665j828879j833983j748949j656721
12743B6753135j575056j512173j394493j301573j156958j086908j048888j032815
12735A6644271r81181r06765p93547p17253p18231p05488o54414o08211n46260
12726A0012921n11650m87192m41471m17267l85606m07680l99399l51646l58576
12717F252434k87843k56172k53309k45080k87364k02316j23543j99850k56930
$$ plain form
12708 4140027 3937187 3720446 3534579 3391682 3260891 3101490 2962214 2837723 2724229
12699 2724229 2521756 2382802 2301191 2187200 2091403 1988719 1842389 1722779 1659601 1609889
12689 1609889 1545161 1483212 1451898 1416582 1341381 1273597 1206378 1149590 1086121 1045907 1044288
12678 1044288 1067130 1038717 996595 998346 954069 900354 870978 856227 836485 855083 855837 848622
12666 848622 891733 942615 953126 918997 960531 1003151 999500 990003 975467 928191 901985 872473
12654 872473 804109 735091 700159 695572 687095 684410 676082 659290 666833 682012 712500 748807
12642 748807 793905 854889 934239 989285 1030260 1056552 1058399 1023906 1019236 988372 953274 910538
12630 910538 847975 836802 808975 797086 828999 832574 821250 849671 847744 871210 894285 920768
$$ packed form
12708D140027k02840k16741j85867j42897j30791j59401j39276j24491j13494
12699B724229k02473j38954q1611j13991r5797j02684j46330j19610o3178m9712
12689A609889o4728o1949l1314l5316p5201o7784o7219n6788o3469m0214j619
12678A044288K2842k8413m2122J751m4277n3715k9376j4751j9742J8598P54p215
12666H48622M3111N0882J0511l4129M1534M2620l651r497j4536m7276k6206k9512
12654H72473o8364o9018l4932m587q477k685q328j6792P543J5179L0488L6307
12642G48807M5098O0984P9350N5046M0975K6292J847l4493m670l0864l5098m2736
12630I10538o2563j1173k7827j1889L1913L575j1324K8421j927K3466K3075K6483
$$ plain form
12618 920768 910948 954594 961096 974454 998631 1042521 1078392 1073526 1052096 1048720 1052192 1047758 1022438
12605 1022438 1020789 1092652 1105006 1101282 1096909 1086967 1107421 1099796 1092806 1050205 973502 916786
12593 916786 877095 879570 860393 874089 878939 821189 765765 750664 771152 770290 754418 715512
12581 715512 715170 697140 693039 672344 665287 691955 712471 699996 676213 654520 607902 587421
12569 587421 568422 547714 558747 573727 568655 547587 531754 503690 481107 472476 510470 526767
12557 526767 510172 456301 374242 357001 374070 360722 319343 288478 317535 311771 328875 342489
12545 342489 366913 417714 400924 402006 399369 355262 402974 432957 456896 486270 493055 503403
12533 503403 490431 483913 477091 392898 356862 355504 382038 368001 338560 301544 263516 236898
$$ packed form
12618I20768r820M3646O502J3358K4177M3890L5871m866k1430l376L472m434k5320
12605A022438j649P1863J2354l724m373r942K0454p625o990m2601p6703n6716
12593I16786l9691K475j9177J3696M850n7750n5424j5101K0488q62j5872l8906
12581G15512l42j8030m101k0695p057K6668K0516j2475k3783k1693m6618k0481
12569E87421j8999k0708J1033J4980n072k1068j5833k8064k2583q631L7994J6297
12557E26767j6595n3871q2059j7241J7069j3348m1379l0865K9057n764J7104J3614
12545C42489K4424N0801j6790J082k637m4107M7712K9983K3939K9374O785J0348
12533E03403j2972o518o822q4193l6036j358K6534j4037k9441l7016l8028k6618
$$ plain form
12521 236898 216593 211347 224204 275476 271476 264292 249784 207088 210732 218254 241893 258092
12509 258092 303718 316855 318386 298794 302590 323038 352187 359583 348667 329710 331662 368307
12497 368307 414789 438186 471090 529173 557080 610554 650549 708314 736728 760705 799675
12486 799675 841563 829464 841815 826558 761268 733358 762868 718464 679353 646352 632437
12475 632437 624193 637915 655099 695297 658926 607022 610408 609084 605407 601568 625875 629908 635588
12462 635588 575351 557688 537591 490445 511770 570911 561534 536162 485079 439856 460184 483343
12450 483343 487965 457668 447024 441587 436363 456571 477334 461849 452025 414854 374090 348216
12438 348216 371376 376490 361749 347282 336877 341377 369450 374324 371196 349114 360070 395181
$$ packed form
12521B36898k0305n246J2857N1272m000p184j4508m2696L644P522K3639J6199
12509B58092M5626J3137J531j9592L796K0448K9149P396j0916j8957J952L6645
12497C68307M6482K3397L2904N8083K7907N3474L9995N7765K8414K3977L8970
12486G99675M1888j2099J2351j5257o5290k7910K9510m4404l9111l3001j3915
12475F32437q244J3722J7184M0198l6371n1904L386j324l677l839K4307M033N680
12462F35588o0237j7663k0097m7146K1325N9141r377k5372n1083m5223K0328K3159
12450D83343M622l0297j0644n437n224K0208K0763j5485r824l7171m0764k5874
12438C48216K3160N114j4741j4467j0405M500K8073M874l128k2082J0956L5111
$$ plain form
12426 395181 420745 421327 394460 357975 313417 289515 320263 322660 298908 304384 353977 350222
12414 350222 324140 307850 314768 345347 365003 340412 302425 328849 362077 369504 364756 328066
12402 328066 299911 311375 359845 402540 384228 329812 313577 304275 290402 285547 281415 270536
12390 270536 263498 264069 293373 286654 277097 279088 254230 263734 283563 268361 317755 346361 318839
12377 318839 317906 305517 302232 288714 314431 341136 352724 371372 353984 351982 376890 373337
12365 373337 358296 333347 324921 330772 325513 309715 311727 347314 368228 336553 341689 350039 387037
12352 387037 380344 386562 387179 408083 460289 482204 519811 545772 546357 565040 574180 592867 598567
12339 598567 592430 606252 618593 646742 631209 631715 707213 748783 768215 784718 789928 789277 810200
$$ packed form
12426C95181K5564N82k6867l6485m4558k3902L0748K397k3752N476M9593l755
12414C50222k6082j6290O918L0579J9656k4591l7987K6424L3228P427m748l6690
12402C28066k8155J1464M8470M2695j8312n4416j6235r302j3873m855m132j0879
12390B70536p038N71K9304o719r557J991k4858R504J9829j5202M9394K8606k7522
12377C18839r33j2389l285j3518K5717K6705J1588J8648j7388k002K4908l553
12365C73337j5041k4949q426N851n259j5798K012L5587K0914l1675N136Q350L6998
12352C87037o693O218O17K0904N2206K1915L7607K5961N85J8683R140J8687N700
12339E98567o137J3822J2341K8149j5533N06P5498M1570J9432J6503N210o51K0923
$$ plain form
12326 810200 810251 821336 860451 952290 1018937 1071936 1191373 1391522 1669661 1976927 2279565
12315 2279565 2397678 2277423 2072131 1909688 1766863 1686556 1606377 1572495 1552012 1550081
12305 1550081 1521514 1538892 1551856 1536556 1560284 1554658 1573485 1585216 1636807 1701261 1765646
12294 1765646 1802047 1817232 1847057 1875336 1859791 1899976 1955630 2000512 2038262 2058103 2093595
12283 2093595 2160045 2255299 2301244 2336428 2402628 2459909 2526086 2633223 2765275 2903960 3028398
12272 3028398 3145328 3265694 3362837 3392743 3354031 3351912 3371380 3386854 3446245 3501385 3589084
12261 3589084 3703628 3789396 3926127 4083000 4249757 4457248 4698783 5005645 5339399 5732800
12251 5732800 6150460 6608393 7176301 7805937 8556997 9450134 10402891 11487992 12779620
$$ packed form
12326H10200N1J1085L9115R1839O6647N2999J19437K00149K78139L07266L02638
12315B279565J18113j20255k05292j62443j42825q0307q0179l3882k0483j931
12305A550081k8567J7378J2964j5300K3728n626J8827J1731N1591O4454O4385
12294A765646L6401J5185K9825K8279j5545M0185N5654M4882L7750J9841L5492
12283B093595O6450R5254M5945L5184O6200N7281O6177J07137J32052J38685J24438
12272C028398J16930J20366R7143K9906l8712k119J9468J5474N9391N5140Q7699
12261C589084J14544Q5768J36731J56873J66757K07491K41535L06862L33754L93401
12251E732800M17660M57933N67908O29636P51060Q93137R52757J085101J291628
$$ plain form
12242 12779620 14243173 15872885 17672793 19627312 21637568 23645023 25683270 27682258
12234 27682258 29654602 31666443 33791109 36297392 39441292 43785356 49824147 57835004
12226 57835004 67790887 79087362 91060843 102835929 113404049 121705653 126758508
12219 126758508 127756093 124715330 118378382 109607115 99364687 88591078 78075155 68591175
12211 68591175 60672531 54463749 49628774 45845464 42867088 40423701 38327414 36451246
12203 36451246 34790023 33234830 31819050 30542218 29376931 28379690 27536741 26832443
12195 26832443 26203458 25736739 25409271 25184832 24942908 24693095 24467132 24201506 23916814
12186 23916814 23536742 23028068 22404456 21635451 20756914 19838715 18893677 17954304 17003601
$$ packed form
12242A2779620J463553J629712J799908J954519K010256K007455K038247J998988
12234B7682258J972344K011841K124666K506283L143900M344064O038791Q010857
12226E7835004R955883J1296475J1973481J1775086J0568120Q301604N052855
12219A26758508R97585l040763o336948q771267j0242428j0773609j0515923r483980
12211F8591175p918644o208782m834975l783310k978376k443387k096287j876168
12203C6451246j661223j555193j415780j276832j165287r97241q42949p04298
12195B6832443o28985m66719l27468k24439k41924k49813k25963k65626k84692
12186B3916814l80072n08674o23612p69005q78537r18199r45038r39373r50703
$$ plain form
12177 17003601 16098223 15219932 14356655 13596781 12880128 12179647 11519434 10890689 10312609
12168 10312609 9780925 9280038 8817048 8304518 7821910 7392481 7024490 6648802 6310603
12159 6310603 5993740 5688453 5429264 5199147 4969216 4727170 4503048 4283478 4093158
12150 4093158 3928905 3776979 3582792 3396592 3215022 3021059 2894956 2804266 2675206 2559858
12140 2559858 2433944 2305576 2204585 2108009 2030752 1923578 1799200 1680387 1627574 1563940
12130 1563940 1529240 1479637 1381088 1311942 1245422 1155109 1102271 1075732 1044171 987598 969658
12119 969658 945676 894562 825750 803675 783106 750993 744805 731055 739586 699347 633607 644723
12107 644723 671492 692093 712257 698381 654458 668116 702120 705180 694566 704937 706484 674423
$$ packed form
12177A7003601r05378q78291q63277p59874p16653p00481o60213o28745n78080
12168A0312609n31684n00887m62990n12530m82608m29429l67991l75688l38199
12159F310603l16863l05287k59189k30117k29931k42046k24122k19570j90320
12150D093158j64253j51926j94187j86200j81570j93963j26103r0690j29060j15348
12140B559858j25914j28368j00991r6576p7257j07174j24378j18813n2813o3634
12130A563940l4700m9603r8549o9146o6520r0313n2838k6539l1561n6573j7940
12119I69658k3982n1114o8812k2075k0569l2113o188j3750Q531m0239o5740J1116
12107F44723K6769K0601K0164j3876m3923J3658L4004L060j0614J0371J547l2061
$$ plain form
12095 674423 644690 636481 602669 574794 599656 619263 572604 504997 473707 436058 384830 381015
12083 381015 347958 327817 352053 350025 362256 355134 353036 345204 361490 353189 360109 357550 358386
12070 358386 373164 396327 373690 340564 342324 360825 353222 354707 398892 435163 436799 472511
12058 472511 459651 507144 514656 531205 553184 576384 574700 583823 591387 604715 612616 655081
12046 655081 679956 709773 728650 735379 755614 760864 717097 720698 753589 784175 771862 754581
12034 754581 760942 755692 714271 673376 670467 683326 700801 692686 693049 694340 683689 637925 594674
12021 594674 568266 564501 584812 584503 588670 595254 603470 567461 517131 521570 541976 514959 483458
12008 483458 488499 492092 499587 506498 522706 495407 441176 391998 361870 365920 374855 420228 414518
$$ packed form
12095F74423k9733q209l3812k7875K4862J9607m6659o7607l1290l7649n1228l815
12083C81015l3057k0141K4236k028J2231p122k098p832J6286q301O920k559Q36
12070C58386J4778K3163k2637l3126J760J8501p603J485M4185L6271J636L5712
12058D72511j2860M7493P512J6549K1979K3200j684R123P564J3328P901M2465
12046F55081K4875K9817J8877O729K0235N250m3767L601L2891L0586j2313j7281
12034G54581O361n250m1421m0895k909J2859J7475q115L63J291j0651m5764m3251
12021E94674k6408l765K0311l09M167O584Q216l6009n0330M439K0406k7017l1501
12008D83458N041L593P495O911J6208k7299n4231m9178l0128M050Q935M5373n710
$$ plain form
11995 414518 379525 325513 310726 321715 327799 325759 305314 302986 310876 338692 358550 323807
11983 323807 283062 299991 308579 305237 312104 354924 320974 305333 302517 324862 346338 356288
11971 356288 368229 375574 338036 307471 294646 300166 333790 322195 297315 269849 236006 213462
11959 213462 213576 232544 256327 240143 214998 198983 217696 196990 147749 135925 162734 176427
11947 176427 152006 181617 187806 212578 257270 255645 216846 221622 197839 196069 217465 207180
11935 207180 217651 215326 241975 263543 249761 236640 222153 234995 237378 212015 176609 163595
11923 163595 177839 195016 185540 206822 204969 178041 171155 186270 178603 181414 190017 149922 130450
11910 130450 152838 187118 206767 220842 205071 191947 198982 235966 231558 272502 282560 285328
$$ packed form
11995D14518l4993n4012j4787J0989O084k040k0445k328P890K7816J9858l4743
11983C23807m0745J6929Q588l342O867M2820l3950j5641k816K2345K1476R950
11971C56288J1941P345l7538l0565j2825N520L3624j1595k4880k7466l3843k2544
11959B13462J14J8968K3783j6184k5145j6015J8713k0706m9241j1824K6809J3693
11947A76427k4421K9611O189K4772M4692j625l8799M776k3783j770K1396j0285
11935B07180J0471k325K6649K1568j3782j3121j4487J2842K383k5363l5406j3014
11923A63595J4244J7177r476K1282j853k6928o886J5115p667K811Q603m0095j9472
11910A30450K2388L4280J9649J4075j5771j3124P035L6984m408M0944J0058K768
$$ plain form
11898 285328 293217 298334 333216 305719 259060 238541 240584 258201 241025 254734 293947 294012 281442
11885 281442 255160 260296 240081 235277 263544 284696 259551 257286 253861 267650 250491 220908
11873 220908 231114 192446 179798 180608 207381 209701 216571 259596 229563 217452 193493 214922
11861 214922 271557 277411 266065 268407 277302 233640 214082 213925 202488 198658 234485 240542 226023
11848 226023 224621 231431 235111 186502 175897 167042 163595 210802 234113 241836 228526 215727 220779
11835 220779 174170 177624 183175 214357 206670 200680 224983 249790 236050 209791 218277 241246
11823 241246 230198 211978 194528 205749 214593 236127 255405 249918 268687 284039 239593 281164
11811 281164 328291 316421 285023 277467 326590 400879 439195 488407 504655 585971 639483 697425
$$ packed form
11898B85328P889N117L4882k7497m6659k0519K043J7617j7176J3709L9213O5j2570
11885B81442k6282N136k0215m804K8267K1152k5145k265l425J3789j7159k9583
11873B20908J0206l8668j2648Q10K6773K320O870M3025l0033j2111k3959K1429
11861B14922N6635N854j1346K342Q895m3662j9558j57j1437l830L5827O057j4519
11848B26023j402O810L680m8609j0605q855l447M7207K3311P723j3310j2799N052
11835B20779m6609L454N551L1182p687n990K4303K4807j3740k6259Q486K2969
11823B41246j1048j8220j7450J1221Q844K1534J9278n487J8769J5352m4446M1571
11811B81164M7127j1870l1398p556M9123P4289L8316M9212J6248Q1316N3512N7942
$$ plain form
11799 697425 738032 807438 856623 841805 769892 693746 683105 660722 580480 560912 553768 551396
11787 551396 554171 519306 457624 424860 427365 453356 423507 407853 405729 376673 361935 389399
11775 389399 410217 388293 388514 396804 363588 360690 359832 390502 423059 434867 385040 370708 391393
11762 391393 388424 356585 341154 328482 321817 288199 235779 240049 241491 258653 272914 292229
11750 292229 312479 308324 302062 316639 340403 346739 302629 291857 296001 275821 321014 377959
11738 377959 368430 344432 357829 372602 367228 329148 298425 287273 243546 217819 225510 258617
11726 258617 235522 203127 201086 223168 231763 254200 276644 262127 247112 227246 242990 235352
11714 235352 239463 237435 201159 198811 214423 233349 246915 213204 161269 178104 178271 177077 149162
$$ packed form
11799F97425M0607O9406M9185j4818p1913p6146j0641k2383q0242j9568p144k372
11787E51396K775l4865o1682l2764K505K5991k9849j5654k124k9056j4738K7464
11775C89399K0818k1924K21Q290l3216k898q58L0670L2557J1808m9827j4332K0685
11762C91393k969l1839j5431j2672o665l3618n2420M270J442J7162J4261J9315
11750B92229K0250m155o262J4577K3764O336m4110j0772M144k0180M5193N6945
11738C77959r529k3998J3397J4773n374l8080l0723j1152m3727k5727P691L3107
11726B58617k3095l2395k041K2082Q595K2437K2444j4517j5015j9866J5744p638
11714B35352M111k028l6276k348J5612J8926J3566l3711n1935J6835J67j194k7915
$$ plain form
11701 149162 176999 248446 259416 227110 198659 172470 153317 146995 145233 198101 205457 170127
11689 170127 178905 175225 201140 209772 188379 178352 189109 221910 193435 173807 195863 192016
11677 192016 147239 122953 114792 137774 166572 186458 198114 211053 261024 256574 247719 217570
11665 217570 257544 243877 194664 179573 211007 237308 197758 185523 218207 220215 200624 231948
11653 231948 273711 301016 283195 267782 237102 251847 261332 209078 206323 239011 195854 182289
11641 182289 223703 220324 204528 223920 221563 210095 208556 196637 225702 251479 237429 219236
11629 219236 213179 226785 205813 172324 173804 209636 228057 241971 222647 189161 209836 188498
11617 188498 164202 170348 199689 181691 150715 200806 263753 262482 264341 258800 225143 188113
$$ packed form
11701A49162K7837P1447J0970l2306k8451k6189j9153o322j762N2868P356l5330
11689A70127Q778l680K5915Q632k1393j0027J0757L2801k8475j9628K2056l847
11677A92016m4777k4286q161K2982K8798J9886J1656J2939M9971m450q855l0149
11665B17570L9974j3667m9213j5091L1434K6301l9550j2235L2684K008j9591L1324
11653B31948M1763K7305j7821j5413l0680J4745R485n2254k755L2688m3157j3565
11641A82289M1414l379j5796J9392k357j1468j539j1919K9065K5777j4050j8193
11629B19236o057J3606k0972l3489J480L5832J8421J3914j9324l3486K0675k1338
11617A88498k4296O146K9341j7998l0976N0091O2947j271J859n541l3657l7030
$$ plain form
11605 188113 177429 181954 171671 157133 160087 158607 176365 211035 235105 258237 249155 238127
11593 238127 252091 288446 293550 248774 219750 206672 196740 184902 153372 159318 219397 246459
11581 246459 257096 259300 235901 214671 205504 228591 216342 163501 170160 202576 195226 188733
11569 188733 189628 182621 204692 230646 228254 230277 232298 245404 227260 224586 233495 257677 255716
11556 255716 265103 274122 219718 199755 174250 188738 181697 205823 259059 285482 291003 284008
11544 284008 251283 253705 233526 256016 260107 238268 205482 221470 250014 227230 225800 217252
11532 217252 236091 253670 253803 219680 211742 239051 236497 235486 248218 291901 330103 339526 321809
11519 321809 299684 294329 280472 270229 309973 290402 247146 263328 253938 232217 248816 275363
$$ packed form
11605A88113j0684M525j0283j4538K954j480J7758L4670K4070K3132r082j1028
11593B38127J3964L6355N104m4776k9024j3078r932j1838l1530N946O0079K7062
11581B46459J0637K204k3399k1230r167K3087j2249n2841O659L2416p350o493
11569A88733Q95p007K2071K5954k392K023K021J3106j8144k674Q909K4182j961
11556B55716R387R019n4404j9963k5505J4488p041K4126N3236K6423N521o995
11544B84008l2725K422k0179K2490M091k1839l2786J5988K8544k2784j430q548
11532B17252J8839J7579J33l4123p938K7309k554j011J2732M3683L8202R423j7717
11519C21809k2125n355j3857j0243L9744j9571m3256J6182r390k1721J6599K6547
$$ plain form
11507 275363 316455 348582 323956 284791 283697 287408 267060 283973 298127 316160 310905 305361
11495 305361 285444 317117 275926 253671 298886 311607 316773 337089 344546 340778 357651 357787
11483 357787 334654 331075 298037 277433 246229 243849 317308 314226 251239 244683 259216 270478
11471 270478 285123 277537 293867 283164 278164 308461 305639 273103 274304 274192 288536 282681 312872
11458 312872 314524 292817 270796 282352 249955 258792 262325 260336 270625 297170 289976 300361
11446 300361 299759 289506 272649 292115 308776 307860 292534 263299 247131 272478 286790 270541
11434 270541 246277 254711 290811 311618 315823 353103 350834 321466 279903 256479 231500 265720
11422 265720 276093 271139 278577 287077 288898 271456 244547 226630 225622 256944 295861 295006 300794
$$ packed form
11507B75363M1092L2127k4626l9165j094L711k0348J6913J4154J8033n255n544
11495C05361j9917L1673m1191k2255M5215J2721N166K0316P457l768J6873J36
11483C57787k3133l579l3038k0604l1204k380P3459l082o2987o556J4533J1262
11471B70478J4645p586J6330j0703n000L0297k822l2536J201j12J4344n855L0191
11458C12872J652k1707k2021J1556l2397Q837L533j989J0289K6545p194J0385
11446C00361o02j0253j6857J9466J6661r16j5326k9235j6168K5347J4312j6249
11434B70541k4264Q434L6100K0807M205L7280k269k9368m1563k3424k4979L4220
11422B65720J0373m954P438Q500J821j7442k6909j7917j008L1322L8917q55N788
$$ plain form
11409 300794 281758 263848 274091 316451 368719 367008 321864 290106 315554 364929 366621 336207
11397 336207 334825 297982 296202 328912 333443 308418 303911 291638 280440 319927 341218 354115
11385 354115 357309 366581 360994 348802 359900 380276 362694 351857 347775 348623 366278 344870 368644
11372 368644 375128 374754 354932 368636 384098 368968 367983 383831 377230 381470 387282 390487 354579
11359 354579 342832 379553 382317 362393 315276 351993 379679 348653 365907 395781 404483 425342
11347 425342 422679 413040 377879 384693 421779 420379 404902 397301 389316 397114 400799 397345 361424
11334 361424 340931 409828 432649 416808 400672 415078 445260 464090 466939 436649 442284 445347
11322 445347 442065 450089 401191 358711 373398 385194 391216 407956 412901 389600 383193 375808 413082
$$ packed form
11409C00794j9036j7910J0243M2360N2268j711m5144l1758K5448M9375J692l0414
11397C36207j382l6843j780L2710M531k5025m507j2273j1198L9487K1291J2897
11385C54115L194R272n587j2192J1098K0376j7582j0837m082Q48J7655k1408K3774
11372C68644O484l74j9822J3704J5462j5130r85J5848o601M240N812L205l5908
11359C54579j1747L6721K764j9924m7117L6717K7686l1026J7254K9874Q702K0859
11347D25342k663r639l5161O814L7086j400j5477p601p985P798L685l454l5921
11334C61424k0493O8897K2821j5841j6136J4406L0182J8830K849l0290N635L063
11322D45347l282Q024m8898m2480J4687J1796O022J6740M945k3301o407p385L7274
$$ plain form
11309 413082 454126 439857 419350 416153 436247 459286 487091 507186 518236 482953 462378 451850
11297 451850 472790 475359 453680 439661 453627 479434 484684 506705 515630 490816 468426 457021
11285 457021 451129 431955 429229 456252 450586 407871 399997 444409 463315 446964 437495 449482
11273 449482 456208 436745 485512 463379 412420 413447 454991 463284 448897 472849 496353 510480
11261 510480 521200 471739 454544 507628 527191 541724 546601 560638 579270 565825 468459 435388
11249 435388 460376 492576 492992 487511 476912 483981 499236 545088 548381 534545 542119 552906 585465
11236 585465 611501 601415 581537 564700 596293 615381 613835 608730 603373 637608 616282 616996
11224 616996 622597 644906 691551 678354 673815 691940 678475 669964 677347 681808 675571 667384 656662
$$ packed form
11309D13082M1044j4269k0507l197K0094K3039K7805K0095J1050l5283k0575j0528
11297D51850K0940K569k1679j4019J3966K5807N250K2021Q925k4814k2390j1405
11285D57021n892j9174k726K7023n666m2715p874M4412J8906j6351r469J1987
11273D49482O726j9463M8767k2133n0959J027M1544Q293j4387K3952K3504J4127
11261E10480J0720m9461j7195N3084J9563J4533M877J4037J8632j3445r7366l3071
11249D35388K4988L2200M16n481j0599P069J5255M5852L293j3836P574J0787L2559
11236E85465K6036j0086j9878j6837L1593J9088j546n105n357L4235k1326P14
11224F16996N601K2309M6645j3197m539J8125j3465q511P383M461o237q187j0722
$$ plain form
11211 656662 658721 644149 643386 635059 625717 612042 605856 604789 625797 647103 670333 658181 627379
11198 627379 608179 611809 584237 600400 596804 624928 675171 679033 673672 640825 650283 701690
11186 701690 727972 719661 718637 739192 707057 694462 740462 747738 753623 741087 730897 742455
11174 742455 773279 797629 776091 740301 705704 700265 712280 686320 725350 758456 785463 787507
11162 787507 806977 826229 834283 837379 853326 826806 812708 812445 800491 760711 732668 733423 732652
11149 732652 719170 729801 760488 789687 805331 811622 801596 822992 832409 808265 822403 805676
11137 805676 800285 820578 811823 820979 821376 845264 881574 911895 912180 903827 852890 818693 841308
11124 841308 874214 907852 895359 875613 843541 817873 844748 888654 903152 876046 868478 888134
$$ packed form
11211F56662K059j4572p63q327r342j3675o186j067K1008K1306K3230j2152l0802
11198F27379j9200L630k7572J6163l596K8124N0243L862n361l2847R458N1407
11186G01690K6282q311j024K0555l2135j2595M6000P276N885j2536j0190J1558
11174G42455L0824K4350k1538l5790l4597n439J2015k5960L9030L3106K7007K044
11162G87507J9470J9252Q054L096J5947k6520j4098k63j1954l9780k8043P55p71
11149G32652j3482J0631L0687K9199J5644O291j0026K1396R417k4144J4138j6727
11137H05676n391K0293q755R156L97K3888L6310L0321K85q353n0937l4197K2615
11124H41308L2906L3638j2493j9746l2072k5668K6875M3906J4498k7106p568J9656
$$ plain form
11112 888134 856769 854787 851443 831179 844467 847531 819848 793426 779497 787634 780232 811732
11100 811732 857617 894740 885534 850336 830514 832874 888436 925259 942416 937294 917191 931862
11088 931862 916919 895664 877013 876630 884657 889092 917098 920080 938482 933558 927090 909049 903683
11075 903683 879244 849730 855226 892410 896243 885216 898464 853022 832275 858794 905783 919779
11063 919779 920370 913381 913184 935410 944626 965957 998798 1025772 1053677 1055277 1004720 980677 945964
11050 945964 925382 925455 954133 963490 963528 973240 960848 989670 1037546 1015477 1021656 1038618 1045025
11037 1045025 1047422 1040399 1003033 990503 1003717 1020258 1050712 1067500 1057586 1041043 1060536 1054408
11025 1054408 1055259 1084961 1060927 1081832 1108324 1117773 1110137 1107917 1143102 1116268 1125107 1132945 1129229
$$ packed form
11112H88134l1365j982l344k0264J3288L064k7683k6422j3929Q137p402L1500
11100H11732M5885L7123r206l5198j9822K360N5562L6823J7157n122k0103J4671
11088I31862j4943k1255j8651l83Q027M435K8006K982J8402m924o468j8041n366
11075I03683k4439k9514N496L7184L833j1027J3248m5442k0747K6519M6989J3996
11063I19779N91o989j97K2226R216K1331L2841K6974K7905J600n0557k4043l4713
11050I45964k0582P3K8678R357L8R712j2392K8822M7876k2069O179J6962O407
11037A045025K397p023l7366j2530J3214J6541L0454J6788r914j6543J9493o128
11025A054408Q51K9702k4034K0905K6492R449p636k220L5185k6834Q839P838l716
$$ plain form
11012 1129229 1121398 1125653 1102778 1100095 1094080 1109306 1124935 1180648 1201683 1207965 1168945 1163515
11000 1163515 1172592 1185307 1236763 1284502 1265568 1241242 1304382 1293462 1291331 1284155 1276706 1272029
10988 1272029 1312071 1368953 1418099 1407258 1420018 1428628 1427685 1459783 1408889 1360145 1378377 1391982
10976 1391982 1354096 1343592 1351911 1331878 1309855 1355224 1405464 1455982 1478860 1455367 1475197
10965 1475197 1446198 1425122 1436289 1454136 1480746 1503997 1502806 1497538 1528091 1529375 1533149 1525676
10953 1525676 1544593 1557832 1579100 1608541 1609209 1614494 1660947 1692676 1674992 1689500 1688194 1677110
10941 1677110 1686466 1692651 1702377 1697943 1684776 1692253 1699175 1728118 1707911 1708392 1698868 1681967 1664477
10928 1664477 1673041 1714712 1734014 1748215 1726751 1730984 1742195 1738688 1757897 1819557 1825639 1809439
$$ packed form
11012A129229p831M255k2875k683o015J5226J5629N5713K1035O282l9020n430
11000A163515R077J2715N1456M7739j8934k4326O3140j0920k131p176p449m677
10988A272029M0042N6882M9146j0841J2760Q610r43L2098n0894m8744J8232J3605
10976A391982l7886j0504Q319k0033k2023M5369N0240N0518K2878k3493J9830
10965A475197k8999k1076J1167J7847K6610K3251j191n268L0553J284L774p473
10953A525676J8917J3239K1268K9441O68N285M6453L1729j7684J4508j306j1084
10941A677110R356O185R726m434j3167P477O922K8943k0207M81r524j6901j7490
10928A664477Q564M1671J9302J4201k1464M233J1211l507J9209O1660O082j6200
$$ plain form
10916 1809439 1780488 1777726 1746425 1746842 1798310 1822367 1833653 1819823 1811526 1845475 1882354 1878363
10904 1878363 1846819 1834871 1783603 1796475 1852808 1854654 1835702 1852587 1862309 1834777 1824522 1845393
10892 1845393 1855371 1849989 1889385 1946400 1967937 1944014 1913636 1926908 1925870 1914863 1892035 1909199
10880 1909199 1915636 1907938 1924864 1958306 1985654 2010595 2003308 2025003 1991771 1981052 1982122 2004926
10868 2004926 2050265 2045602 2036626 2034781 2044966 2063000 2052964 2059751 2068620 2042382 2019232 2043105
10856 2043105 2074111 2091082 2070003 2076337 2119134 2160765 2163304 2153231 2177384 2183043 2184905 2169506
10844 2169506 2148936 2165696 2184150 2202451 2195838 2227396 2249311 2254722 2255007 2252551 2263503 2299283
10832 2299283 2304342 2307427 2282398 2272178 2289083 2304128 2297881 2340128 2412235 2443130 2457513 2466617
$$ packed form
10916A809439k8951k762l1301M17N1468K4057J1286j3830q297L3949L6879l991
10904A878363l1544j1948n1268J2872N6333J846j8952J6885R722k7532j0255K0871
10892A845393R978n382L9396N7015K1537k3923l0378J3272j038j1007k2828J7164
10880A909199O437p698J6926L3442K7348K4941p287K1695l3232j0719J070K2804
10868B004926M5339m663q976j845J0185J8034j0036O787Q869k6238k3150K3873
10856B043105L1006J6971k1079O334M2797M1631K539j0073K4153N659J862j5399
10844B169506k0570J6760J8454J8301o613L1558K1915N411K85k456J0952L5780
10832B299283N059L085k5029j0220J6905J5045o247M2247P2107L0895J4383R104
$$ plain form
10820 2466617 2445093 2450402 2513284 2500552 2487757 2470436 2478304 2504155 2535975 2513184 2534457 2549208
10808 2549208 2572829 2577842 2590119 2601033 2646037 2677343 2657165 2680241 2721283 2726429 2702940 2723098
10796 2723098 2780046 2824247 2820654 2844558 2898594 2929402 2945244 2980759 3002727 2997407 2994524 3001324
10784 3001324 3016812 3047318 3018648 2998766 2977001 3022415 3043487 3035310 3055336 3107048 3143388
10773 3143388 3184419 3232663 3232173 3247897 3240472 3247667 3306062 3367721 3407336 3421232 3410798 3412218
10761 3412218 3420449 3470545 3517177 3552230 3575331 3588862 3604912 3649616 3687397 3709558 3694724
10750 3694724 3722312 3756271 3751677 3783848 3791977 3803725 3809843 3834731 3882970 3902791 3930395 3962199
10738 3962199 4020553 4086099 4141285 4143398 4122078 4150010 4176656 4190899 4223482 4299697 4311241
$$ packed form
10820B466617k1524N309O2882j2732j2795j7321P868K5851L1820k2791K1273J4751
10808B549208K3621N013J2277J0914M5004L1306k0178K3076M1042N146k3489K0158
10796B723098N6948M4201l593K3904N4036L0808J5842L5515K1968n320k883O800
10784C001324J5488L0506k8670j9882k1765M5414K1072q177K0026N1712L6340
10773C143388M1031M8244m90J5724p425P195N8395O1659L9615J3896j0434J420
10761C412218Q231N0096M6632L5053K3101J3531J6050M4704L7781K2161j4834
10750C694724K7588L3959m594L2171Q129J1748O118K4888M8239J9821K7604L1804
10738C962199N8354O5546N5186K113k1320K7932K6646J4243L2583P6215J1544
$$ plain form
10727 4311241 4331839 4385618 4441710 4475102 4511832 4539149 4571762 4632162 4665766 4704238 4740333
10716 4740333 4770557 4818844 4820378 4811411 4871529 4908848 4928984 4986685 5082197 5129798 5177188 5197114
10704 5197114 5211143 5229712 5256140 5323076 5348501 5409789 5493360 5549286 5590612 5635977 5720678
10693 5720678 5771976 5826482 5874565 5975357 6043174 6114815 6181742 6246758 6306091 6384425 6472793
10682 6472793 6548135 6600113 6611484 6674910 6787312 6866739 6937466 6980736 7040951 7128458 7195816
10671 7195816 7301158 7379565 7494277 7591513 7663439 7756736 7848287 7946037 8039638 8174731 8267298
10660 8267298 8347229 8416696 8530144 8661767 8770622 8891763 9038070 9168339 9310161 9410593
10650 9410593 9516582 9675694 9846497 10024627 10170217 10354077 10550567 10778470 11058400
$$ packed form
10727D311241K0598N3779N6092L3392L6730K7317L2613O0400L3604L8472L6095
10716D740333L0224M8287J534q967O0118L7319K0136N7701R5512M7601M7390J9926
10704E197114J4029J8569K6428O6936K5425O1288Q3571N5926M1326M5365Q4701
10693E720678N1298N4506M8083J00792O7817P1641O6927O5016N9333P8334Q8368
10682F472793P5342N1978J1371O3426J12402P9427P0727M3270O0215Q7507O7358
10671G195816J05342P8407J14712R7236P1926R3297R1551R7750R3601J35093R2567
10660H267298P9931O9467J13448J31623J08855J21141J46307J30269J41822J00432
10650I410593J05989J59112J70803J78130J45590J83860J96490K27903K79930
$$ plain form
10641 11058400 11360796 11682006 11915040 12071214 12142007 12178111 12175220 12202075 12262352 12374945
10631 12374945 12494555 12614716 12756898 12895822 13053196 13238182 13419695 13556302 13780988
10622 13780988 14017888 14212958 14402094 14614701 14800625 14985526 15233430 15504738 15795287
10613 15795287 16036033 16316588 16594491 16879418 17174524 17433722 17687076 17968567 18248940
10604 18248940 18574571 18890243 19190098 19505770 19807988 20133459 20496942 20845067 21231104
10595 21231104 21596066 21933262 22305898 22683675 23081261 23530317 23990820 24410975 24854232
10586 24854232 25294930 25691799 26142202 26595659 27101678 27608325 28120713 28606755 29123667
10577 29123667 29628864 30147667 30654749 31163973 31691584 32275652 32881351 33482808 34061826
$$ packed form
10641A1058400L02396L21210K33034J56174P0793L6104k891K6855O0277J12593
10631A2374945J19610J20161J42182J38924J57374J84986J81513J36607K24686
10622A3780988K36900J95070J89136K12607J85924J84901K47904K71308K90549
10613A5795287K40746K80555K77903K84927K95106K59198K53354K81491K80373
10604A8248940L25631L15672K99855L15672L02218L25471L63483L48125L86037
10595B1231104L64962L37196L72636L77777L97586M49056M60503M20155M43257
10586B4854232M40698L96869M50403M53457N06019N06647N12388M86042N16912
10577B9123667N05197N18803N07082N09224N27611N84068O05699O01457N79018
$$ plain form
10568 34061826 34663382 35287487 35916179 36540703 37108517 37726375 38370652 39000295 39656113
10559 39656113 40360106 41022333 41668305 42359820 43024980 43682376 44356958 45028390 45792213
10550 45792213 46532483 47256976 47985673 48740939 49461066 50196931 50977197 51737597 52449241
10541 52449241 53235021 53994445 54745522 55541086 56293584 57051689 57805410 58549297 59314850
10532 59314850 60110976 60887698 61643157 62400817 63094736 63827113 64518908 65228158 65943668
10523 65943668 66659667 67359629 67993674 68624544 69280160 69905216 70505409 71113526 71699476
10514 71699476 72247423 72777190 73273352 73758187 74180657 74575543 74968890 75369126 75720166
10505 75720166 76053629 76322161 76547284 76747312 76926281 77066982 77175475 77218094 77260460 77276922
$$ packed form
10568C4061826O01556O24105O28692O24524N67814O17858O44277O29643O55818
10559C9656113P03993O62227O45972O91515O65160O57396O74582O71432P63823
10550D5792213P40270P24493P28697P55266P20127P35865P80266P60400P11644
10541E2449241P85780P59424P51077P95564P52498P58105P53721P43887P65553
10532E9314850P96126P76722P55459P57660O93919P32377O91795P09250P15510
10523F5943668P15999O99962O34045O30870O55616O25056O00193O08117N85950
10514G1699476N47947N29767M96162M84835M22470L94886L93347M00236L51040
10505G5720166L33463K68532K25123K00028J78969J40701J08493M2619M2366J6462
$$ plain form
10495 77276922 77227198 77170464 77103187 77007320 76863005 76698726 76499137 76255848 75992904 75719675
10485 75719675 75425138 75060212 74712132 74305719 73896497 73507718 73095653 72661614 72193850
10476 72193850 71694293 71153278 70574378 69930725 69303154 68681184 68019976 67366396 66706672
10467 66706672 66050807 65333658 64629499 63965892 63317378 62673010 61990588 61274700 60535938
10458 60535938 59821643 59078601 58365366 57660202 56946287 56225642 55557252 54861953 54100062
10449 54100062 53368540 52696482 52004628 51284881 50582965 49911772 49212043 48501619 47782621
10440 47782621 47097838 46409667 45726866 45074657 44430418 43786437 43163289 42510936 41865247
10431 41865247 41232897 40580582 39962080 39355990 38743487 38158661 37557327 36955617 36391394
$$ packed form
10495G7276922m9724n6734o7277r5867j44315j64279j99589k43289k62944k73229
10485G5719675k94537l64926l48080m06413m09222l88779m12065m34039m67764
10476G2193850m99557n41015n78900o43653o27571o21970o61208o53580o59724
10467F6706672o55865p17149p04159o63607o48514o44368o82422p15888p38762
10458F0535938p14295p43042p13235p05164p13915p20645o68390o95299p61891
10449E4100062p31522o72058o91854p19747p01916o71193o99729p10424p18998
10440D7782621o84783o88171o82801o52209o44239o43981o23148o52353o45689
10431D1865247o32350o52315o18502o06090o12503n84826o01334o01710n64223
$$ plain form
10422 36391394 35866774 35311669 34748859 34196286 33652030 33137544 32637841 32126437 31604890
10413 31604890 31091388 30581691 30027751 29506436 29026174 28587567 28156347 27723340 27323689
10404 27323689 26909606 26455003 26020645 25624565 25206139 24819314 24421301 24018287 23627403
10395 23627403 23264052 22904989 22527021 22185931 21840669 21521387 21161221 20832984 20531324
10386 20531324 20237412 19926451 19628413 19301629 19028568 18788146 18483532 18188449 17925315
10377 17925315 17691510 17486884 17205063 16917239 16680482 16459606 16192833 15929848 15716715
10368 15716715 15502829 15259213 15054152 14878039 14719986 14516713 14300974 14113284 13893887
10359 13893887 13704036 13539359 13344665 13177822 13059359 12919116 12761665 12592357 12389474
$$ packed form
10422C6391394n24620n55105n62810n52573n44256n14486m99703n11404n21547
10413C1604890n13502n09697n53940n21315m80262m38607m31220m33007l99651
10404B7323689m14083m54603m34358l96080m18426l86825l98013m03014l90884
10395B3627403l63351l59063l77968l41090l45262l19282l60166l28237l01660
10386B0531324k93912l10961k98038l26784k73061k40422l04614k95083k63134
10377A7925315k33805k04626k81821k87824k36757k20876k66773k62985k13133
10368A5716715k13886k43616k05061j76113j58053k03273k15739j87690k19397
10359A3893887j89851j64677j94694j66843j18463j40243j57451j69308k02883
$$ plain form
10350 12389474 12270204 12152673 12030890 11928961 11796892 11579773 11418441 11338652 11215322
10341 11215322 11039244 10890370 10765894 10649837 10564371 10510281 10375370 10253955 10114870 10031367
10331 10031367 9970176 9925352 9852522 9755968 9669056 9591829 9516858 9442775 9374677 9278021 9217822
10320 9217822 9164636 9099545 9037349 9004722 8989917 8967965 8899752 8807169 8796088 8745760 8710616
10309 8710616 8693200 8682210 8666342 8636826 8594377 8553043 8527062 8525651 8533792 8511858 8541982 8512011
10297 8512011 8438884 8388149 8362296 8349387 8345646 8361609 8368728 8351460 8300222 8264416 8275173 8283905
10285 8283905 8279333 8325393 8373493 8350155 8363002 8402337 8445188 8455877 8490127 8510213 8502264 8498186
10273 8498186 8513491 8566494 8602836 8616076 8651681 8731666 8813083 8891671 9035128 9159823 9295415
$$ packed form
10350A2389474j19270j17531j21783j01929j32069k17119j61332p9789j23330
10341A1215322j76078j48874j24476j16057q5466n4090j34911j21415j39085q3503
10331A0031367o1191m4824p2830r6554q6912p7227p4971p4083o8098r6656o0199
10320I217822n3186o5091o2196l2627j4805k1952o8213r2583j1081n0328l5144
10309H710616j7416j0990j5868k9516m2449m1334k5981j411Q141k1934L0124k9971
10297H512011p3127n0735k5853j2909l741J5963P119j7268n1238l5806J0757Q732
10285H283905m572M6060M8100k3338J2847L9335M2851J0689L4250K0086p949m078
10273H498186J5305N3003L6342J3240L5605P9985Q1417P8588J43457J24695J35592
$$ plain form
10262 9295415 9461635 9656827 9882920 10134784 10416188 10689650 11017260 11397384 11825777
10253 11825777 12333639 12915584 13577198 14282901 15110440 16081615 17280493 18683210 20296746
10244 20296746 22186788 24443278 27008622 29894747 33103974 36469834 39817636 42906321
10236 42906321 45622509 47876104 49821613 51674466 53728398 56259249 59865184 65335186
10228 65335186 73638571 85956345 103892862 129764140 165611650 209322788 249611648
10221 249611648 267914007 254357196 219910746 182567055 151706245 128478310 111225172
10214 111225172 98099942 87913367 79896813 73544348 68508694 64429765 61069768 58254150
10206 58254150 55939741 53963175 52039855 50159683 48288126 46534601 44990421 43741361
$$ packed form
10262I295415J66220J95192K26093K51864K81404K73462L27610L80124M28393
10253A1825777N07862N81945O61614P05703Q27539R71175J198878J402717J613536
10244B0296746J890042K256490K565344K886125L209227L365860L347802L088685
10236D2906321K716188K253595J945509J852853K053932K530851L605935N470002
10228F5335186Q303385J2317774J7936517K5871278L5847510M3711138M0288860
10221B49611648J8302359j3556811l4446450l7343691l0860810k3227935j7253138
10214A11225172j3125230j0186575q016554o352465n035654m078929l359997k815618
10206E8254150k314409j976566j923320j880172j871557j753525j544180j249060
$$ plain form
10198 43741361 42697701 41797831 41044827 40469445 40051445 39723511 39550371 39602600 39801046
10189 39801046 40024429 39979515 39435572 38385076 36971251 35323405 33602824 31958734 30374632
10180 30374632 28825169 27358102 25955928 24644690 23451169 22319645 21223417 20216615
10172 20216615 19275786 18376041 17501030 16690149 15906300 15196517 14552716 13937034 13367443
10163 13367443 12847082 12351196 11869349 11418707 10974740 10535953 10111530 9764265 9453310
10154 9453310 9145016 8823002 8493750 8188706 7903277 7683255 7447283 7234685 7058994
10145 7058994 6862138 6653098 6475136 6308764 6133725 6000716 5839868 5688715 5548559
10136 5548559 5423238 5287347 5151489 5009667 4885507 4757645 4608375 4509258 4400848 4331410
$$ packed form
10198D3741361j043660q99870p53004n75382m18000l27934j73140N2229J98446
10189C9801046K23383m4914n43943j050496j413825j647846j720581j644090j584102
10180C0374632j549463j467067j402174j311238j193521j131524j096228j006802
10172B0216615r40829q99745q75011q10881p83849p09783o43801o15682n69591
10163A3367443n20361m95886m81847m50642m43967m38787m24423l47265l10955
10154I453310l08294l22014l29252l05044k85429k20022k35972k12598j75691
10145G058994j96856k09040j77962j66372j75039j33009j60848j51153j40156
10136E548559j25321j35891j35858j41822j24160j27862j49270r9117j08410o9438
$$ plain form
10126 4331410 4262666 4195282 4111304 4070202 4006036 3916172 3856731 3820528 3786762 3756392 3737309
10115 3737309 3702247 3685382 3638583 3620105 3583815 3538378 3526537 3481298 3458560 3428994 3389352
10104 3389352 3435933 3460151 3471096 3438649 3439529 3427538 3456618 3438100 3439633 3443943 3410304 3385343
10092 3385343 3337771 3276396 3239454 3152706 3076232 3048025 3039942 3041983 3047237 3029549 3013437 2984374
10080 2984374 2984541 2972853 2956548 2947311 2952607 2954819 2968151 2949424 2929612 2933194 2971545 2966881 2919478
10067 2919478 2879685 2848798 2869693 2904458 2908676 2952642 3024819 3071833 3081037 3078204 3087109 3096616
10055 3096616 3101788 3117212 3150288 3208196 3256686 3246759 3191318 3174163 3151585 3146195 3116809 3071402
10043 3071402 3055203 3077538 3067408 3058575 3059650 3050304 3046374 3019160 3040851 3025152 2987003 2959001
$$ packed form
10126D331410o8744o7384q3978m1102o4166q9864n9441l6203l3766l0370j9083
10115C737309l5062j6865m6799j8478l6290m5437j1841m5239k2738k9566l9642
10104C389352M6581K4218J0945l2447Q80j1991K9080j8518J533M310l3639k4961
10092C385343m7572o1375l6942q6748p6474k8207q083K041N254j7688j6112k9063
10080B984374J67j1688j6305r237N296K212J3332j8727j9812L582L8351m664m7403
10067B919478l9793l0887K0895L4765M218M3966P2177M7014R204k833Q905R507
10055C096616N172J5424L3076N7908M8490r927n5441j7155k2578n390k9386m5407
10043C071402j6199K2335j0130q833J075r346l930k7214K1691j5699l8149k8002
$$ plain form
10031 2959001 2924439 2883098 2774902 2759647 2768980 2760769 2741961 2716773 2687543 2627538 2622171 2656844
10019 2656844 2634819 2613948 2565131 2545116 2518195 2484886 2460190 2436988 2396474 2339417 2326758
10008 2326758 2313889 2297107 2271689 2237646 2189825 2170058 2159763 2122051 2106865 2077881 2060707
9997 2060707 2016839 1981893 1952182 1901662 1897519 1907800 1910797 1895936 1858486 1817664 1797196 1807240
9985 1807240 1809001 1796660 1787309 1792922 1758978 1718019 1693997 1700221 1679816 1672762 1683322 1693930
9973 1693930 1713968 1718007 1689652 1695404 1688955 1679229 1624153 1560003 1528201 1486717 1460981 1436448
9961 1436448 1408423 1403772 1407073 1372760 1344185 1348771 1336338 1335951 1300865 1279018 1280942 1258923 1230418
9948 1230418 1193321 1177759 1150652 1132092 1128039 1109637 1113252 1149855 1168893 1139579 1118078 1059459
$$ packed form
10031B959001l4562m1341j08196j5255R333q211j8808k5188k9230o0005n367L4673
10019B656844k2025k0871m8817k0015k6921l3309k4696k3202m0514n7057j2659
10008B326758j2869j6782k5418l4043m7821j9767j0295l7712j5186k8984j7174
9997B060707m3868l4946k9711n0520m143J0281K997j4861l7450m0822k0468J0044
9985A807240J761j2341r351N613l3944m0959k4022O224k0405p054J0560J0608
9973A693930K0038M039k8355N752o449r726n5076o4150l1802m1484k5736k4533
9961A436448k8025m651L301l4313k8575M586j2433l87l5086k1847J924k2019k8505
9948A230418l7097j5562k7107j8560m053j8402L615L6603J9038k9314k1501n8619
$$ plain form
9936 1059459 1019761 1017724 1031741 1071007 1054423 1015755 1006353 1027307 1058839 1075834 1076773 1064362
9924 1064362 1068088 1090904 1107498 1084515 1059170 1037123 980237 950601 953333 934319 917042 906007
9912 906007 888688 881713 932679 934737 922248 958786 976831 996577 990946 988462 1013625 1047491
9900 1047491 1035350 1022283 1025614 1027953 1002102 970177 966800 946479 930686 954656 967916 961806
9888 961806 957253 966468 990793 1005774 995163 980322 976278 980455 968180 958805 935939 954302 1003787
9875 1003787 999882 962558 948060 973834 964472 943344 952254 913392 875007 904471 905605 903115
9863 903115 904685 910621 906979 887732 892837 915808 955204 979037 971942 986731 1005969 1055112 1081616
9850 1081616 1112534 1143321 1130764 1116054 1153979 1178088 1173796 1219161 1330517 1457123 1671690
$$ packed form
9936A059459l9698k037J4017L9266j6584l8668r402K0954L1532J6995R39j2411
9924A064362L726K2816J6594k2983k5345k2047n6886k9636K732j9014j7277j1035
9912I06007j7319o975N0966K058j2489L6538J8045J9746n631k484K5163L3866
9900A047491j2141j3067L331K339k5851l1925l377k0321j5793K3970J3260o110
9888I61806m553R215K4325J4981j0611j4841m044M177j2275r375k2866J8363M9485
9875A003787l905l7324j4498K5774r362k1128Q910l8862l8385K9464J134k490
9863I03115J570N936l642j9247N105K2971L9396K3833p095J4789J9238M9143K6504
9850A081616L0918L0787j2557j4710L7925K4109m292M5365J11356J26606K14567
$$ plain form
9839 1671690 2008929 2527270 3140601 3560952 3563391 3128523 2558471 2149346 1888816 1674536
9829 1674536 1532809 1425370 1359599 1295989 1242054 1178485 1125346 1113084 1118365 1094007 1052852
9818 1052852 1066618 1076403 1072718 1051291 1040811 1072488 1117072 1090277 1053774 1062152 1065563 1104157
9806 1104157 1123513 1159848 1244248 1300672 1377661 1511399 1680821 1822291 1981434 2039964 2012999
9795 2012999 1898277 1710487 1570826 1435650 1345124 1267097 1192734 1123699 1054758 981976 955004
9784 955004 953429 969210 935932 936139 917513 902717 908585 898931 846968 804801 772381 744059 749083
9771 749083 759977 745565 743278 769841 773650 747575 732251 742875 737894 697608 672565 639257
9759 639257 623215 621191 621581 631823 638232 656259 703524 696393 667448 637681 643313 694523 729820
$$ packed form
9839A671690L37239N18341O13331M20351K439m34868n70052m09125k60530k14280
9829A674536j41727j07439o5771o3610n3935o3569n3139j2262N281k4358m1155
9818A052852J3766R785l685k1427j0480L1677M4584k6795l6503Q378L411L8594
9806A104157J9356L6335Q4400N6424P6989J33738J69422J41470J59143N8530k6965
9795B012999j14722j87790j39661j35176r0526p8027p4363o9035o8941p2782k6972
9784I55004j575J5781l3278K07j8626j4796N868r654n1963m2167l2420k8322N024
9771G49083J0894j4412k287K6563L809k6075j5324J0624m981m0286k5043l3308
9759F39257j6042k024L90J0242O409J8027M7265p131k8945k9767N632N1210L5297
$$ plain form
9746 729820 685294 655936 609774 580368 584413 570163 524452 497436 519504 563990 583436 570087
9734 570087 551136 534004 541914 556139 541872 500863 488950 469400 444893 408354 405115 391715
9722 391715 440562 487636 488756 474177 468837 468227 461245 462398 457688 454402 479629 499629 484039
9709 484039 488731 475548 479467 483026 450145 427238 397478 381690 369043 360460 369624 374051 386168
9696 386168 407498 392254 375006 309440 307879 344001 376378 358494 352377 355218 355156 347169 333433
9683 333433 314043 339620 348725 340759 343240 350739 336280 312150 304363 315217 297299 292478 314450
9670 314450 313213 324577 338477 339677 312742 309233 319492 295146 299305 314909 327002 322635 310881
9657 310881 300348 313066 312325 289603 347729 356681 357803 321500 307346 305223 317676 307861 303669
$$ packed form
9746G29820m4526k9358m6162k9406M045j4250m5711k7016K2068M4486J9446j3349
9734E70087j8951j7132P910J4225j4267m1009j1913j9550k4507l6539l239j3400
9722C91715M8847M7074J120j4579n340o10o982J153m710l286K5227K0000j5590
9709D84039M692j3183L919L559l2881k2907k9760j5788j2647q583R164M427J2117
9696C86168K1330j5244j7248o5566j561L6122L2377j7884o117K841o2p987j3736
9683C33433j9390K5577R105p966K481P499j4459k4130p787J0854j7918m821K1972
9670C14450j237J1364J3900J200k6935l509J0259k4346M159J5604J2093m367j1754
9657C10881j0533J2718p41k2722N8126Q952J122l6303j4154k123J2453r815m192
$$ plain form
9644 303669 314679 311283 286748 292693 296096 279046 249705 237582 306733 331565 297867 269780
9632 269780 270397 255029 271246 276727 297279 329912 355496 365575 313362 256447 246198 293057
9620 293057 292297 302588 304591 310101 297936 311616 305992 282703 270646 271050 289006 283685 258519
9607 258519 244642 243134 244604 226888 228916 201123 188730 176999 174992 182549 228885 244321 246484
9594 246484 236345 229434 246502 259253 251638 231923 266176 293042 248852 194491 222609 258438
9582 258438 257792 276834 294795 297226 282915 274799 241311 245824 255153 273382 266997 221804 208166
9569 208166 219760 220028 204166 165211 125340 134384 189358 209880 208345 218831 240010 257008
9557 257008 231368 214326 209411 179843 178150 187172 167577 174402 168398 141247 160498 179549 157107
$$ packed form
9644C03669J1010l396k4535N945L403j7050k9341j2123O9151K4832l3698k8087
9632B69780O17j5368J6217N481K0552L2633K5584J0079n2213n6915j0249M6859
9620B93057p60J0291K003N510j2165J3680n624k3289j2057M04J7956n321k5166
9607B58519j3877j508J470j7716K028k7793j2393j1731k007P557M6336J5436K163
9594B46484j0139o911J7068J2751p615j9715L4253K6866m4190n4361K8118L5829
9582B58438o46J9042J7961K431j4311q116l3488M513R329J8229o385m5193j3638
9569B08166J1594K68j5862l8955l9871R044N4974K0522j535J0486K1179J6998
9557B57008k5640j7042m915k9568j693R022j9595O825o004k7151J9251J9051k2442
$$ plain form
9544 157107 155687 186567 221455 234450 205602 189843 184926 182876 199947 208967 227160 211864
9532 211864 194345 201261 210117 214418 200898 180427 178021 179371 172241 162677 161788 173283 177300 189384
9518 189384 163204 158541 183285 170249 182852 188472 157435 153562 192258 203184 209195 170720
9506 170720 134706 143081 151382 184111 177168 160404 194742 176218 193893 204778 191358 185742
9494 185742 170695 179282 164497 183379 174421 204940 223016 213584 226683 235987 189392 160523
9482 160523 194586 224292 250547 270578 259900 213075 190458 195196 199779 218223 215805 186683
9470 186683 146031 142007 145604 143555 163397 149188 148654 169202 190309 203439 207990 174156 156322
9457 156322 150020 165699 165401 202622 212770 204213 163593 126328 116557 122437 139215 123050 112068
$$ packed form
9544A57107j420L0880L4888J2995k8848j5759m917k050J7071R020J8193j5296
9532B11864j7519O916Q856M301j3520k0471k406J350p130r564q89J1495M017J2084
9518A89384k6180m663K4744j3036J2603N620l1037l873L8696J0926O011l8475
9506A70720l6014Q375Q301L2729o943j6764L4338j8524J7675J0885j3420n616
9494A85742j5047Q587j4785J8882q958L0519J8076r432J3099R304m6595k8869
9482A60523L4063K9706K6255K0031j0678m6825k2617M738M583J8444k418k9122
9470A86683m0652m024L597k049J9842j4209n34K0548K1107J3130M551l3834j7834
9457A56322o302J5679k98L7221J0148q557m0620l7265r771N880J6778j6165j0982
$$ plain form
9444 112068 129805 178977 188228 185373 174790 163529 169338 179583 231006 219595 190377 184948
9432 184948 192857 227301 222786 174683 145366 151218 145262 147899 177760 175377 163246 139903 124069
9419 124069 134467 141885 135388 132927 128133 127837 139180 156970 150781 141575 137714 137416 145689 153424
9405 153424 125206 98397 113160 116521 102890 111023 128796 122790 139605 150626 140948 140275 163062
9392 163062 172911 161198 115404 122186 174111 189999 164633 153719 135510 116473 141182 151050
9380 151050 150939 168918 143770 138867 129379 133407 126601 79944 71622 70857 56701 93384 115555
9367 115555 118742 123462 122541 106256 102597 123342 122706 100759 133877 173848 167256 122306 78752
9354 78752 68373 74077 91080 162089 175438 170974 182604 159309 163285 132101 116021 114233 133433
$$ packed form
9444A12068J7737M9172R251k855j0583j1261N809J0245N1423j1411k9218n429
9432A84948P909L4444m515m8103k9317N852n956K637K9861k383j2131k3343j5834
9419A24069J0398P418o497k461m794k96J1343J7790o189r206l861k98Q273P735
9405A53424k8218k6809J4763L361j3631Q133J7773o006J6815J1021r678o73K2787
9392A63062R849j1713m5794O782N1925J5888k5366j0914j8209j9037K4709R868
9380A51050j11J7979k5148m903r488M028o806m6657q322p65j4156L6683K2171
9367A15555L187M720r21j6285l659K0745o36k1947L3118L9971o592m4950m3554
9354G8752j0379N704J7003P1009J3349m464J1630k3295L976l1184j6080j788J9200
$$ plain form
9341 133433 111966 103845 95291 133078 153556 144541 142995 151725 141619 120414 103898 76289 86774
9328 86774 107285 103241 151701 156107 136720 145878 134181 102689 105586 120890 136958 166952 168222
9315 168222 144131 148019 145750 111732 94059 97692 104859 101032 99337 128066 137405 124237 119432
9302 119432 91254 63994 93434 123831 132104 106528 76049 94608 96097 63381 54784 73434
9290 73434 133769 155239 159421 165991 95760 63937 76817 100460 88031 86513 104586 110497 89732
9277 89732 72877 90412 142601 130014 111136 105471 147391 164728 135280 108355 112254 125956
9265 125956 122324 129894 127441 113834 136540 141957 93981 83095 123079 141772 141422 139769 129399
9252 129399 122381 88641 66586 57173 1870 -6933 28313 44200 74306 92236 99118 96439 86908
$$ packed form
9341A33433k1467q121q554L7787K0478r015j546Q730j0106k1205j6516k7609J0485
9328H6774K0511m044M8460M406j9387R158j1697l1492K897J5304J6068K9994J270
9315A68222k4091L888k269l4018j7673L633P167l827j695K8729R339j3168m805
9302A19432k8178k7260K9440L0397Q273k5576l0479J8559J489l2716q597J8650
9290G3434O0335K1470M182O570p0231l1823J2880K3643j2429j518J8073N911k0765
9277H9732j6855J7535N2189j2587j8878n665M1920J7337k9448k6925L899J3702
9265A25956l632P570k453j3607K2706N417m7976j0886L9984J8693l50j653j0370
9252A29399p018l3740k2055r413n5303q803L5246J5887L0106J7930O882k679r531
$$ plain form
9239 86908 96928 124440 128968 127589 91846 112348 160208 133921 125692 122090 76471 110603 125444
9226 125444 109750 141698 148800 124533 150762 163914 135249 140664 130598 79827 48090 61445
9214 61445 54143 52318 65056 59031 35830 59906 99937 83291 69445 34872 42926 78901 97592
9201 97592 96991 86197 61501 56432 79009 105529 88530 64127 79206 79425 88801 112129 114286
9188 114286 116119 126930 153807 153298 127825 115341 105424 81360 84759 107601 98793 111769 132533
9175 132533 139628 140886 136169 132471 95948 35721 22328 73697 73609 45849 53287 65363 55116
9162 55116 86311 122394 135981 123213 82613 49959 40908 78408 111660 133872 138252 110551
9150 110551 132988 108939 124077 148632 131467 110484 123647 91203 81538 81935 78355 48181
$$ packed form
9239H6908J0020K7512M528j379l5743K0502M7860k6287q229l602m5619L4132J4841
9226A25444j5694L1948P102k4267K6229J3152k8665N415j0066n0771l1737J3355
9214F1445p302j825J2738o025k3201K4076M0031j6646j3846l4573Q054L5975J8691
9201I7592o01j0794k4696n069K2577K6520j6999k4403J5079K19R376K3328K157
9188A14286J833J0811K6877n09k5473j2484r917k4064L399K2842q808J2976K0764
9175A32533P095J258m717l698l6523o0227j3393N1369q8k7760P438J2076j0247
9162E5116L1195L6083J3587j2768m0600l2654r051L7500L3252K2212M380k7701
9150A10551K2437k4049J5138K4555j7165k0983J3163l2444r665L97l580l0174
$$ plain form
9138 48181 62036 113414 162515 155714 121143 120257 98305 79532 99745 125350 97226 83898
9126 83898 75551 68721 50078 57011 52766 63222 94760 75636 83274 85580 89601 126610 130478
9113 130478 113812 116953 103793 95555 76849 84599 126971 142733 142910 132836 134448 132540 123628
9100 123628 123818 162237 174345 147307 120773 129030 128154 122796 131813 118110 71700 80164 83591
9087 83591 54074 70896 106831 140991 166000 167811 152134 146388 150672 114049 76925 87348
9075 87348 78474 77839 61891 69110 51556 92291 111009 98671 115379 141073 127049 110862 80249
9062 80249 94300 101306 66908 56357 33036 43433 66772 59166 66972 36204 46225 55602 65836
9049 65836 66125 49118 37418 54999 95822 41013 39275 38687 30546 6314 -18174 28806 77821
$$ packed form
9138D8181J3855N1378M9101o801l4571q86k1952j8773K0213K5605k8124j3328
9126H3898q347o830j8643O933m245J0456L1538j9124P638K306M021L7009L868
9113A30478j6666L141j3160q238j8706P750M2372J5762J77j0074J612j908q912
9100A23628J90L8419J2108k7038k6534Q257q76n358R017j3703m6410Q464L427
9087H3591k9517J6822L5935L4160K5009J811j5677n746M284l6623l7124J0423
9075H7348q874o35j5948P219j7554M0735J8718j2338J6708K5694j4024j6187l0613
9062H0249J4051P006l4398j0551k3321J0397K3339p606P806l0768J0021R377J0234
9049F5836K89j7007j1700J7581M0823n4809j738n88q141k4232k4488M6980M9015
$$ plain form
9036 77821 45799 47441 96268 117889 122916 95080 48681 32688 40353 58515 46880 58059
9024 58059 69988 89096 73386 72233 72032 56881 20994 -87 8732 23596 82814 94958 50306
9011 50306 70007 58660 58522 45561 50321 2379 -40276 -20519 12118 59603 79179 46365
8999 46365 42380 62360 59215 37399 19950 -16853 -934 26388 74458 112211 96806 51246
8987 51246 56967 62328 37310 28306 59268 47495 51860 71462 53369 52368 75956 46769 44799
8974 44799 61668 62642 79728 99404 129205 97682 74233 86880 110242 107621 100259 109359 128052
8961 128052 115755 86710 53829 36893 19972 29548 31037 12011 25229 21213 15570 19124 38834
8948 38834 79617 59196 33960 60496 72232 57880 69735 76956 68372 78698 108048 98312
$$ packed form
9036G7821l2022J642M8827K1621N027k7836m6399j5993P665J8162j1635J1179
9024E8059J1929J9108j5710j153k01j5151l5887k1081Q819J4864N9218J2144m4652
9011E0306J9701j1347j38j2961M760m7942m2655J9757L2637M7485J9576l2814
8999D6365l985J9980l145k1816j7449l6803J5919K7322M8070L7753j5405m5560
8987E1246N721N361k5018r004L0962j1773M365J9602j8093j001K3588k9187j970
8974D4799J6869R74J7086J9676K9801l1523k3449J2647K3362k621p362R100J8693
8961A28052j2297k9045l2881j6936j6921R576J489j9026J3218m016n643L554J9710
8948C8834M0783k0421k5236K6536J1736j4352J1855P221q584J0326K9350r736
$$ plain form
8936 98312 60771 20922 15495 54701 114250 94304 39582 15808 14295 37801 78239 88904
8924 88904 81102 105179 96444 77985 92771 89908 55127 42702 63921 72729 62541 82234 98622
8911 98622 89832 76563 84684 52865 53203 90344 79272 43995 33736 -1968 -14016 7169 7484
8898 7484 -9862 28305 39618 64702 73978 48594 36512 13675 -16781 -4718 35831 53944
8886 53944 31290 -4698 -5400 3476 8599 15322 -3485 13126 33008 32354 39111 79598 92745
8873 92745 68748 46907 21341 3186 29705 60745 53552 35920 17789 25213 53440 67146
8861 67146 93947 90576 68420 58281 58696 82280 64249 74240 53925 63149 72277 42243 58117
8848 58117 44355 77785 87906 68125 99352 109460 123181 115845 112805 92502 83535 101321
$$ packed form
8936I8312l7541l9849n427L9206N9549j9946n4722k3774j513K3506M0438J0665
8924H8904p802K4077q735j8459J4786k863l4781j2425K1219Q808j0188J9693J6388
8911I8622q790j3269Q121l1819L38L7141j1072l5277j0259l5704j2048K1185L15
8898G484j7346L8167J1313K5084R276k5384j2082k2837l0456J2063M0549J8113
8886E3944k2654l5988p02Q876N123O723j8807J6611J9882o54O757M0487J3147
8873I2745k3997k1841k5566j8155K6519L1040p193j7632j8131P424K8227J3706
8861F7146K6801l371k2156j0139M15K3584j8031R991k0315R224R128l0034J5874
8848E8117j3762L3430J0121j9781L1227J0108J3721p336l040k0303q967J7786
$$ plain form
8836 101321 126208 98692 71094 42178 35525 44224 68037 82181 137202 151126 112488 97455
8824 97455 87815 79115 31041 18572 10887 -8964 -6445 -2307 52481 70952 28215 20223 -3903
8811 -3903 5776 -6065 -937 27118 56077 78262 42735 39502 16585 -25790 -23153 17855 12161
8798 12161 -22030 8607 49787 31209 8919 -8283 14642 6887 -6730 10819 26003 11491
8786 11491 -13214 1018 52239 41161 28127 34344 37099 26788 2813 61742 97380 91590
8774 91590 79458 65771 25666 51829 69273 73683 75749 30234 27926 70908 49573 64934
8762 64934 68325 57106 71391 48093 27386 13069 5839 34648 30671 43775 10143 -59023
8750 -59023 -65092 -23959 -1420 17250 44883 35648 26543 14227 8683 11486 17055 43940 67221
$$ packed form
8836A01321K4887k7516k7598k8916o653Q699K3813J4144N5021J3924l8638j5033
8824I7455r640q700m8074j2469p685j9851K519M138N4788J8471m2737p992k4126
8811c903R679j1841N128K8055K8959K2185l5527l233k2917m2375K637M1008n694
8798A2161l4191L0637M1180j8578k2290j7202K2925p755j3617J7549J5184j4512
8786A1491k4705J4232N1221j1078j3034O217K755j0311k3975N8929L5638n790
8774I1590j2132j3687m0105K6163J7444M410K066m5515k308M2982k1335J5361
8762F4934L391j1219J4285k3298k0707j4317p230K8809l977J3104l3632o9166
8750e9023o069M1133K2539J8670K7633r235r105j2316n544K803N569K6885K3281
$$ plain form
8737 67221 57323 29113 32832 12491 -18735 2653 57176 82048 75255 81057 69631 39231 31898
8724 31898 68275 80460 81069 67314 57760 35974 53583 82101 125342 129091 109598 60594 43348
8711 43348 26410 49844 34038 3845 34530 51147 77193 69124 48942 35518 28434 -1553
8699 -1553 -1497 42083 69443 110316 103490 83029 52329 57433 58583 51347 62012 72098 61373
8686 61373 18389 -27405 -18258 16305 15432 24713 75018 72387 59357 81957 66960 34215 -13098
8673 -13098 9015 40632 47475 48660 51329 80426 97117 111153 114129 92870 77518 105448 124585
8660 124585 128006 109459 96571 93002 51140 48057 92471 109026 77497 107608 164407 179562
8648 179562 160210 178024 192190 184372 170761 169667 194926 209818 251782 275126 353848 536448
$$ packed form
8737F7221r898k8210L719k0341l1226K1388N4523K4872o793N802j1426l0400p333
8724C1898L6377J2185O09j3755r554k1786J7609K8518M3241L749j9493m9004j7246
8711D3348j6938K3434j5806l0193L0685J6617K6046q069k0182j3424p084k9987
8699a553N6M3580K7360M0873o826k0461l0700N104J150p236J0665J0086j0725
8686F1373m2984m5794R147L4563q73R281N0305k631j3030K2600j4997l2745m7313
8673a3098K2113L1617O843J185K669K9097J6691J4036K976k1259j5352K7930J9137
8660A24585L421j8547j2888l569m1862l083M4414J6555l1529L0111N6799J5155
8648A79562j9352J7814J4166p818j3611j094K5259J4892M1964K3344P8722J82600
$$ plain form
8636 536448 692254 778005 727570 605457 482868 415421 359132 276585 242465 226972 245001
8625 245001 196763 158537 128496 98573 87965 118595 184924 235158 228394 186504 177151 197300
8613 197300 210205 208814 210314 188145 192206 227001 258039 263316 279892 285463 267595 234838 223426
8600 223426 241735 274570 316739 353030 417455 498845 578379 701283 947496 1315370 1611471
8589 1611471 1569165 1274031 967843 758892 632504 546673 480457 457834 457180 446790 409161
8578 409161 356793 342394 358174 408095 413040 359208 305906 284924 279931 293178 327599 366817
8566 366817 346281 309800 307236 322389 317258 291303 276095 284022 294122 293945 283091 276687 295487
8553 295487 285814 283772 315008 300277 318350 358672 469271 640526 784634 843668 779629
$$ packed form
8636E36448J55806Q5751n0435j22113j22589o7447n6289q2547l4120j5493J8029
8625B45001m8238l8226l0041k9923j0608L0630O6329N0234o764m1890r353K0149
8613A97300J2905j391J500k2169M061L4795L1038N277J6576N571j7868l2757j1412
8600B23426J8309L2835M2169L6291O4425Q1390P9534J22904K46213L67874K96101
8589A611471m2306k95134l06188k08951j26388q5831o6216k2623o54j0390l7629
8578D09161n2368j4399J5780M9921M945n3832n3302k0982m993J3247L4421L9218
8566C66817k0536l6481k564J5153n131k5955j5208P927J0100j77j0854o404J8800
8553B95487r673k042L1236j4731J8073M0322J10599J71255J44108N9034o4039
$$ plain form
8542 779629 620950 475135 405395 373091 343000 299681 244631 231135 246728 257513 203826
8531 203826 176814 206978 229118 187969 190433 213806 179306 161174 150035 147966 141249 145125
8519 145125 154766 163391 141876 152782 153851 149711 110338 112761 132293 161389 144319 126320 112536
8506 112536 92082 86835 65603 54980 70427 52628 47971 70517 88210 78031 100925 64405
8494 64405 12192 27377 30219 32248 50774 59971 38375 41626 44036 38945 42501 52361 27364
8481 27364 6307 29936 31837 -13076 -10541 14293 28589 22525 11952 -2789 -1531 30000 42089
8468 42089 70140 88323 64963 34405 15090 -9273 4456 17978 35299 21999 29830 33393
8456 33393 -5549 -21355 -15996 19745 8925 33284 18353 31178 13003 -5622 20446 61492
$$ packed form
8542G79629j58679j45815o9740l2304l0091m3319n5050j3496J5593J0785n3687
8531B03826k7012L0164K2140m1149K464K3373l4500j8132j1139k069o717L876
8519A45125R641Q625k1515J0906J069m140l9373K423J9532K9096j7070j7999j3784
8506A12536k0454n247k1232j0623J5447j7799m657K2546J7693j0179K2894l6520
8494F4405n2213J5185K842K029J8526R197k1596L251K410n091L556R860k4997
8481B7364k1057K3629J901m4913K535K4834J4296o064j0573j4741J258L1531J2089
8468D2089K8051J8183k3360l0558j9315k4363J3729J3522J7321j3300P831L563
8456C3393l8942j5806N359L5741j0820K4359j4931J2825j8175j8625K6068M1046
$$ plain form
8444 61492 56305 33418 11519 -8332 3125 31449 70300 85317 26496 24984 6561 -7743
8432 -7743 5261 -17774 -19366 37438 64133 65639 42200 45459 36874 13216 -6576 10833 15462
8419 15462 2731 -14798 -24175 8549 28856 34117 21661 29313 54766 80647 64358 54821 52805
8406 52805 44054 26745 33098 37914 5196 19261 50624 46484 43206 42341 2042 -52431 -57625
8393 -57625 -51481 -21253 11445 16747 -9187 4297 5893 31879 -1525 -3266 -14437 2600 5280
8380 5280 -8506 4112 -15751 -9000 4482 -14109 -5532 -7401 4276 7068 26980 78276 85164
8367 85164 51985 24685 30268 21006 -91 -445 -24792 -48386 -24646 6389 -32546 -66141 -52341
8354 -52341 477 -3732 -3811 7715 4717 -4856 13164 46863 12756 -12481 2585 -14294 7652
$$ packed form
8444F1492n187k2887k1899j9851J1457K8324L8851J5017n8821j512j8423j4304
8432g743J3004k3035j592N6804K6695J506k3439L259q585k3658j9792J7409M629
8419A5462j2731j7529r377L2724K0307N261j2456P652K5453K5881j6289r537k016
8406E2805q751j7309O353M816l2718J4065L1363m140l278q65m0299n4473n194
8393e7625O144L0228L2698N302k5934J3484J596K5986l3404j741j1171J7037K680
8380E280j3786J2618j9863O751J3482j8591Q577j869J1677K792J9912N1296O888
8367H5164l3179k7300N583r262k1097l54k4347k3594K3740L1035l8935l3595J3800
8354e2341N2818m209p9J1526k998r573J8020L3699l4107k5237J5066j6879K1946
$$ plain form
8341 7652 104558 133811 93875 54696 60830 66506 92845 63672 30880 32729 59668 83562 38757
8328 38757 47168 57402 -342 -19809 -40266 -21170 7711 3672 10846 -6281 5564 -15671
8316 -15671 -17780 -34505 -1151 17360 41292 14045 -600 -12350 25059 46648 35819 -2913
8304 -2913 3559 17467 -7443 -12992 7164 8918 -10136 -11138 -19505 -41643 -45814 -14357 -14265 -8895
8290 -8895 22503 17057 5397 480 10768 51610 33102 12423 -2997 419 27967 56028 16906
8277 16906 -4156 -17811 -18007 6962 16043 37571 3150 -17532 -18898 -8171 -3787 2451 -12988
8264 -12988 -22226 2579 19622 50383 59332 47159 26549 14320 3514 23925 39734 19861
8252 19861 -4934 -17230 7690 -3860 -20879 17142 31306 38079 8996 -10726 3096 -20297
$$ packed form
8341G652R6906K9253l9936l9179O134N676K6339k9173l2792J849K6939K3894m4805
8328C8757Q411J0234n7744j9467k0457J9096K8881m039P174j7127J1845k1235
8316a5671k109j6725L3354J8511K3932k7247j4645j1750L7409K1589j0829l8732
8304b913O472J3908k4910n549K0156J754j9054j002q367k2138m171L1457R2N370
8290h895L1398n446j1660m917J0288M0842j8508k0679j5420L416K7548K8061l9122
8277A6906k1062j3655j96K4969R081K1528l4421k0682j366J0727M384O238j5439
8264a2988r238K4805J7043L0761Q949j2173k0610j2229j0806K0411J5809j9873
8252A9861k4795j2296K4920j1550j7019L8021J4164O773k9083j9722J3822k3393
$$ plain form
8240 -20297 -27806 -35996 -23929 -20649 -9035 34142 49415 35064 29923 29343 19458 8643 -6904
8227 -6904 2870 29703 43187 13898 -8111 -18220 22148 48569 44943 8837 17394 -10188 -16809
8214 -16809 5517 26272 11645 2679 -30689 -20831 8274 9138 -23343 -5724 5995 15308 7414
8201 7414 27459 37596 21082 -14084 -45027 -3624 9700 15524 22631 24176 15565 -29318 13476
8188 13476 31983 2535 1077 24826 20798 -7842 178 13799 -12241 -11502 12150 44903 37697
8175 37697 -2065 -23307 29424 54700 39875 22627 -9406 -7545 3093 56647 84499 68378
8163 68378 31827 1395 9333 6596 -12027 13113 38290 13668 2459 -11075 5690 30614
8151 30614 23690 15014 1690 -7692 -22881 -42498 -49605 -76732 -77909 -52435 -64232 -61438 2589
$$ packed form
8240b0297p509q190J2067L280J1614M3177J5273j4351n141n80r885j0815j5547
8227f904R774K6833J3484k9289k2009j0109M0368K6421l626l6106Q557k7582o621
8214a6809K2326K0755j4627q966l3368R858K9105Q64l2481J7619J1719R313p894
8201G414K0045J0137j6514l5166l0943M1403J3324N824P107J545q611m4883M2794
8188A3476J8507k9448j458K3749m028k8640Q020J3621k6040P39K3652L2753p206
8175C7697l9762k1242N2731K5276j4825j7248l2033J861J0638N3554K7852j6121
8163F8378l6551l0432P938k737j8623K5140K5177k4622j1209j3534J6765K4924
8151C0614o924q676j3324r382j5189j9617p107k7127j177K5474j1797K794O4027
$$ plain form
8138 2589 31573 22206 -6130 -26141 -34063 -5067 -7892 -3605 -30395 -71779 -55119 -5891 14968
8125 14968 -4054 -28555 -46760 -42791 -30330 -46965 -22507 -34401 -98924 -73125 -66931 -47699
8113 -47699 -15234 -7717 16093 7999 20099 34601 50478 51615 6707 -5240 -21489 -42227
8101 -42227 -58591 -50471 -23123 -29839 -64099 -62952 -12457 26375 56631 82267 59635 25282
8089 25282 20828 5889 -16965 -26698 -52328 -41468 21173 25667 40734 47526 37803 38700 42614
8076 42614 24899 19354 25724 7338 8034 -54932 -72129 -48266 -81708 -41006 20837 13540 43507
8063 43507 77231 56950 19835 32810 37093 8843 -49583 -93634 -64529 -30176 -12811 -177
8051 -177 41 -10933 -27981 -25235 -18108 -38384 -55627 -43000 2291 -4293 -4310 -17477 454 23531
$$ packed form
8138B589K8984r367k8336k0011p922K8996k825M287k6790m1384J6660M9228K0859
8125A4968j9022k4501j8205L969J2461j6635K4458j1894o4523K5799O194J9232
8113d7699L2465P517K3810q094J2100J4502J5877J137m4908j1947j6249k0738
8101d2227j6364Q120K7348o716l4260J147N0495L8832L0256K5636k2632l4353
8089B5282m454j4939k2854r733k5630J0860O2641M494J5067O792r723Q97L914
8076D2614j7715n545O370j8386O96o2966j7197K3863l3442M0702O1843p297K9967
8063D3507L3724k0281l7115J2975M283k8250n8426m4051K9105L4353J7365J2634
8051a77K18j0974j7048K746P127k0276j7243J2627M5291o584j7j3167J7931K3077
$$ plain form
8037 23531 25696 19632 -233 -5316 -27210 27238 60425 33962 44571 48739 43297 36938 28765
8024 28765 12081 31921 24768 -5995 -7726 -6730 -1125 -3261 25071 20936 950 -9859 36749
8011 36749 50707 46154 33614 15019 -2416 4436 13576 50527 71666 57209 81586 79631 75769
7998 75769 92268 83253 65744 -10950 -17253 24533 38333 38915 69202 83180 78563 63996 24035
7985 24035 -3830 11550 36815 64011 70510 15325 7128 18200 64183 65596 14328 4111
7973 4111 -15456 -26492 -13446 -12399 -15308 16424 10823 -1648 20948 42237 84458 86117 78266
7960 78266 128670 142896 126098 78131 83406 91343 70751 76207 61182 74009 108483 115932 68408
7947 68408 13264 29010 56554 39898 41516 59023 105157 90797 74931 63403 52116 66527
$$ packed form
8037B3531K165o064j9865n083k1894N4448L3187k6463J0609M168n442o359q173
8024B8765j6684J9840p153l0763j731R96N605k136K8332m135j9986j0809M6608
8011C6749J3958m553j2540j8595j7435O852R140L6951K1139j4457K4377j955l862
7998G5769J6499r015j7509p6694o303M1786J3800N82L0287J3978m617j4567l9961
7985B4035k7865J5380K5265K7196O499n5185q197J1072M5983J413n1268j0217
7973D111j9567j1036J3046J047k909L1732n601j2471K2596K1289M2221J659p851
7960G8266N0404J4226j6798m7967N275P937k0592N456j5025J2827L4474P449m7524
7947F8408n5144J5746K7544j6656J618J7507M6134j4360j5866j1528j1287J4411
$$ plain form
7935 66527 65647 61282 59660 31228 50291 115243 155061 120203 48729 38683 51571 49415 21332
7922 21332 16720 10620 11208 35536 86181 44733 33050 -5022 -1387 -7990 -6758 -14847 10616
7909 10616 6403 -5365 18463 59254 28833 23721 45317 28031 34810 41019 65540 65440 44858
7896 44858 13516 -14405 -24675 38557 75213 83198 73053 62770 61903 34123 -195 -19949
7884 -19949 5263 25629 10378 29231 62686 59367 -605 -860 5028 42599 75100 91816 57601
7871 57601 34664 26954 20252 19000 11643 27642 25381 33241 37255 985 -69656 -103129 -64504
7858 -64504 -23455 753 22881 23760 -6238 28945 41491 43012 45207 30071 23690 6005 6983
7845 6983 11301 -11652 -8563 -16861 -14425 -23983 -22694 -20811 -21848 -19764 -15321 -34729 -9148 35036
$$ packed form
7935F6527q80m365j622k8432J9063O4952L9818l4858p1474j0046J2888k156k8083
7922B1332m612o100N88K4328N0645m1448j1683l8072L635o603J232q089K5463
7909A0616m213j1768K3828M0791l0421n112K1596j7286O779O209K4521j00k0582
7896D4858l1342k7921j0270O3232L6656P985j0145j0283q67k7780l4318j9754
7884a9949K5212K0366j5251J8853L3455l319n9972k55N888L7571L2501J6716l4215
7871E7601k2937p710o702j252p357J5999k261P860M014l6270p0641l3473L8625
7858f4504M1049K4208K2128Q79k9998L5183J2546J521K195j5136o381j7685R78
7845F983M318k2953L089q298K436r558J289J883j037K084M443j9408K5581M4184
$$ plain form
7831 35036 14457 26416 43374 28369 10961 -27102 -32394 -41408 -16878 -11801 -6564 20177 16991
7818 16991 8635 17727 30465 30646 23490 59655 59028 40029 41178 24163 14482 9659 11205 -14315
7804 -14315 -22612 -2887 3811 -20786 -44132 -46760 -38570 -22058 20291 58017 83519 92186 41906
7791 41906 16748 12469 -10482 -27695 -16304 -24853 -21062 19622 -7224 -16834 -27956 -40578 -38531
7778 -38531 -26866 -9371 -42126 -8650 37457 38358 28921 28676 49055 49722 34952 69090 56153
7765 56153 -27951 -37922 -41230 -26078 3258 10187 -926 24709 39985 72094 84633 76859 72737
7752 72737 49577 28444 40629 27920 16847 6102 -10636 -20177 -6605 -9726 11051 -31034
7740 -31034 -45251 -38927 -20075 15754 -1490 -25075 -17460 -21983 -26799 11403 -5545 -54603 -38372
$$ packed form
7831C5036k0579J1959J6958j5005j7408l8063n292r014K4530N077N237K6741l186
7818A6991q356R092J2738J81p156L6165o27j8999J149j7015r681m823J546k5520
7804a4315q297J9725O698k4597k3346k628Q190J6512M2349L7726K5502Q667n0280
7791D1906k5158m279k2951j7213J1391q549L791M0684k6846r610j1122j2622K047
7778c8531J1665J7495l2755L3476M6107R01r437k45K0379O67j4770L4138j2937
7765E6153q4104r971l308J5152K9336O929j1113K5635J5276L2109J2539p774m122
7752G2737k3160k1133J2185j2709j1073j0745j6738r541J3572l121K0777m2085
7740c1034j4217O324J8852L5829j7244k3585P615m523m816L8202j6948m9058J6231
$$ plain form
7727 -38372 -5293 -17070 -25260 -43836 -52674 -53428 -35852 -42029 -58802 -58295 -13050 -5875 -32239
7714 -32239 -21718 15489 54529 50763 21416 -3277 -22934 -49330 -72136 -30613 10665 54259
7702 54259 69436 24617 -6727 -7559 2248 22495 14402 -22544 -30158 -27929 -17859 6641 28218
7689 28218 32663 26280 31270 42616 54709 5991 -29138 -5823 13759 19472 -4248 11066 15903
7676 15903 1258 -35560 -19290 16764 24354 29915 43192 35677 -7519 -45883 -44679 -56782 -63295
7663 -63295 -70380 -11503 31017 44639 17690 55668 124261 126384 77818 47853 45858 10236
7651 10236 -5201 -1273 19333 22278 21943 -11352 5697 11652 -7257 -51238 -46097 -14103 2312
7638 2312 24500 64320 64963 54288 53930 43861 -4748 4879 9967 2262 -5088 -28094 3936 23124
$$ packed form
7727c8372L3079j1777q190j8576q838p54J7576o177j6773N07M5245P175k6364
7714c2239J0521L7207L9040l766k9347k4693j9657k6396k2806M1523M1278M3594
7702E4259J5177m4819l1344q32R807K0247q093l6946p614K229J0070K4500K1577
7689B8218M445o383M990J1346J2093m8718l5129K3315J9582N713k3720J5314M837
7676A5903j4645l6818J6270L6054P590N561J3277p515m3196l8364J204j2103o513
7663f3295p085N8877M2520J3622k6949L7978O8593K123m8566k9965j995l5622
7651A0236j5437L928K0606K945l35l3295J7049N955j8909m3981N141L1994J6415
7638B312K2188L9820O43j0675l58j0069m8609R627N088p705p350k3006L2030J9188
$$ plain form
7624 23124 11613 -2824 -2055 14673 -46111 -77526 -104686 -89381 -33425 6840 25529 25757 51655
7611 51655 52757 50519 43834 33112 13007 3550 -17770 -47473 -52238 -30043 15903 42202 35336
7598 35336 -5984 -3312 8809 1382 13815 -19245 -44989 -21827 -9446 -10281 10471 6269 11433
7585 11433 9939 2391 -19892 -13222 29434 24347 18945 10397 -3381 -12402 2856 -5075 4486 -1853
7571 -1853 -9339 -6735 -18691 -46813 -28039 -4400 -4803 6963 -32882 -52258 -24302 -5700 7607
7558 7607 6455 -1616 -3661 -26912 -10638 -25264 -43010 -31825 -25204 -20205 -3443 38780 35106
7545 35106 -18623 -60610 -55389 -23785 -39245 -55576 -31093 -2896 5198 249 21419 14232 -4670
7532 -4670 -10413 -45252 -57378 -28730 -9710 -24662 -25615 -38349 -31377 -4229 -10731 -67381 -89847
$$ packed form
7624B3124j1511j4437P69J6728o0784l1415k7160J5305N5956M0265J8689K28K5898
7611E1655J102k238o685j0722k0105r457k1320k9703m765K2195M5946K6299o866
7598C5336m1320K672J2121p427J2433l3060k5744K3162J2381q35K0752m202N164
7585A1433j494p548k2283O670M2656n087n402q548j3778r021J5258p931R561o339
7571a853p486K604j1956k8122J8774K3639m03J1766l9845j9376K7956J8602J3307
7558G607j152q071k045k3251J6274j4626j7746J1185O621M999J6762M2223l674
7545C5106n3729m1987N221L1604j5460j6331K4483K8197Q094m949K1170p187j8902
7532d670n743l4839j2126K8648J9020j4952r53j2734O972K7148o502n6650k2466
$$ plain form
7519 -89847 -60260 -5824 -15164 -6643 -31988 -14479 -42632 -68120 -49970 -35589 -1028 -1067 17193
7506 17193 -5008 -34077 -57073 -41369 6762 33616 10758 2928 10734 -16224 -46409 13489
7494 13489 19499 26794 29531 8463 16926 57322 62144 42885 12654 -17893 -18019 -10597 -10098 -10187
7480 -10187 -52794 -39926 4443 14312 32899 57387 57410 24488 6567 44016 14732 3533 55208
7467 55208 39628 -4286 -32615 -51385 -80659 -34203 3055 -31010 -42276 -32361 -40171 -36918
7455 -36918 -33530 -41924 -36519 -28636 -33422 -48711 -48514 -20308 9450 36516 46205 39165 24834 -29707
7441 -29707 -82680 -49760 -63704 -51021 -37423 13035 62427 81214 26889 -13830 -13573 25814
7429 25814 34558 49969 68209 53248 -7506 -47680 -48467 -21380 -19064 9287 -19786 -12334 4689
$$ packed form
7519h9847K9587N4436r340Q521k5345J7509k8153k5488J8150J4381L4561l9J8260
7506A7193k2201k9069k2996J5704M8131K6854k2858p830P806k6958l0185N9898
7494A3489O010P295K737k1068Q463M0396M822j9259l0231l0547j26P422M99q9
7480a0187m2607J2868M4369R869J8587K4488K3l2922j7921L7449k9284j1199N1675
7467E5208j5580m3914k8329j8770k9274M6456L7258l4065j1266R915p810L253
7455c6918L388q394N405P883m786j5289J97K8206K9758K7066R689p040j4331n4541
7441b9707n2973L2920j3944J2683J3598N0458M9392J8787n4325m0719K57L9387
7429B5814Q744J5411J8240j4961o0754m0174p87K7087K316K8351k9073P452J7023
$$ plain form
7416 4689 23435 6333 -11708 -33993 -41857 -28785 -4148 4063 3313 -1745 12717 44810 44915
7403 44915 29143 -2619 -11871 -8751 -11320 12031 -3205 -3352 -9280 24935 45658 5312 -27551
7390 -27551 -35529 -64733 -61979 -36650 -30291 -43339 -78785 -68575 -17202 -25981 11778 22115 -9163
7377 -9163 -24669 -13757 -29968 -28601 -31830 -12646 1749 -3316 -15779 -20992 -29401 -67116 -60506
7364 -60506 -42820 -25136 -5145 25581 55873 22779 7436 17358 25453 31758 29021 13818 37938
7351 37938 61011 64276 38826 -14431 -44405 -36730 14880 35992 8396 -15134 -14081 -36277
7339 -36277 -68737 -79724 -42686 10119 -3571 -19258 2530 -5024 -37770 -50747 -36741 -42444
7327 -42444 -15352 10727 7019 22366 24392 18762 -35561 -62397 -41818 6379 18502 6211
$$ packed form
7416D689J8746j7102j8041k2285p864J3072K4637Q211p50n058J4462L2093J05
7403D4915j5772l1762r252L120k569K3351j5236j47n928L4215K0723m0346l2863
7390b7551p978k9204K754K5329O359j3048l5446J0210N1373q779L7759J0337l1278
7377i163j5506J0912j6211J367l229J9184J4395n065j2463n213q409l7715O610
7364f0506J7686J7684J9991L0726L0292l3094j5343R922Q095O305k737j5203K4120
7351C7938K3073L265k5450n3257k9974P675N1610K1112k7596k3530J053k2196
7339c6277l2460j0987L7038N2805j3690j5687K1788p554l2746j2977J4006n703
7327d2444K7092K6079l708J5347K026n630n4323k6836K0579M8197J2123j2291
$$ plain form
7315 6211 17391 4413 -26336 -48626 -85630 -109625 -79759 -75871 -46440 -29315 -65025 -50217
7303 -50217 -42897 -39752 -6101 38927 80514 89742 57919 37775 26541 17737 941 20574 21364
7290 21364 2941 -23770 -22675 -8738 6929 -2116 8674 3505 17820 -16239 2381 41305
7278 41305 38405 11175 -13370 -17167 -51292 -85478 -92585 -51098 -21764 1838 -6110 687 40704
7265 40704 2522 11810 9227 9609 37888 10317 -8190 -15617 -19086 -39099 -99571 -86283 -59088
7252 -59088 -26645 -25844 -53283 -36497 -2471 33054 30587 14467 11418 6876 -26568 -48571 -64802
7239 -64802 -39545 -23749 -22257 -14457 -23868 11386 10497 -2929 32589 29303 10597 4568 16976
7226 16976 75939 74069 52835 43510 37098 8979 -6431 -24972 -35180 -47256 -24811 4764
$$ packed form
7315F211J1180j2978l0749k2290l7004k3995K9866L888K9431J7125l5710J4808
7303e0217P320L145L3651M5028M1587R228l1823k0144j1234q804j6796J9633P90
7290B1364j8423k6711J095J3937J5667r045J0790n169J4315l4059J8620L8924
7278D1305k900k7230k4545l797l4125l4186p107M1487K9334K3602p948O797M0017
7265D0704l8182R288k583L82K8279k7571j8507p427l469k0013o0472J3288K7195
7252e9088L2443Q01k7439J6786L4026L5525k467j6120l049m542l3444k2003j6231
7239f4802K5257J5796J492P800r411L5254q89j3426L5518l286j8706o029J2408
7226A6976N8963j870k1234r325o412k8119j5410j8541j0208j2076K2445K9575
$$ [...]
##END NTUPLES=NMR SPECTRUM
##END=
