##TITLE=Analysis number 311022
Compound Code cc 45701
Book Reference 436/50
Project Code adrs
Chemist Name williamk
##JCAMPDX= 6.0         $$ Bruker NMR JCAMP-DX V2.0
##DATA TYPE= NMR SPECTRUM
##DATA CLASS= NTUPLES
##ORIGIN= Bruker BioSpin GmbH
##OWNER= NMR
$$ XWIN-NMR		Version 3.5
$$ Wed Jun 29 10:33:27 2005 GMT Daylight Time (UT+1h)  MAYBRIDGE\NMR@NMR_250MHZ
##.OBSERVE FREQUENCY= 250.131544655141
##.OBSERVE NUCLEUS= ^1H
##.ACQUISITION MODE= SIMULTANEOUS (DQD)
##.ACQUISITION SCHEME= undefined
##.AVERAGES= 16
##.DIGITISER RES= 18
##SPECTROMETER/DATA SYSTEM= dpx250
##.PULSE SEQUENCE= zg30
##.SOLVENT NAME= DMSO
##.SHIFT REFERENCE= (INTERNAL, DMSO, 0, 16.522)
##AUDIT TRAIL= $$ (NUMBER, WHEN, WHO, WHERE, WHAT)
$$ ##TITLE= Audit trail, XWIN-NMR		Version 3.5
$$ ##JCAMPDX= 5.01
$$ ##ORIGIN= Bruker BioSpin GmbH
$$ ##OWNER= NMR
$$ C:\u/data/dgb/nmr/ADRS/4980/pdata/1/auditp.txt
$$ ##AUDIT TRAIL=  $$ (NUMBER, WHEN, WHO, WHERE, WHAT)
(   1,<2005-06-29 10:33:05.47 +100>,<MAYBRIDGE\NMR>,<NMR_250MHZ>,
      <created by zg, POWCHK disabled, PULCHK disabled
       configuration hash MD5:
       62 19 C7 07 E1 42 D1 B7 37 6C 3D D0 77 39 F9 E6
       data hash MD5: 64K
       D0 DE DD 17 A7 AC 25 54 28 C0 85 EB 9A 6F 19 7D>)
(   2,<2005-06-29 10:33:19.86 +100>,<MAYBRIDGE\NMR>,<NMR_250MHZ>,
      <Start of raw data processing
       ef LB = 0.3 FT_mod = 6 PKNL = 1 SI = 32K 
       data hash MD5: 32K
       1D 8E C5 95 9C 9C 5A 51 2D E3 84 81 27 7A 43 25>)
(   3,<2005-06-29 10:33:21.74 +100>,<MAYBRIDGE\NMR>,<NMR_250MHZ>,
      <apk 
       data hash MD5: 32K
       38 09 F3 F2 78 FA 8E D6 A6 16 07 E4 B2 EF F8 08>)
(   4,<2005-06-29 10:33:22.41 +100>,<MAYBRIDGE\NMR>,<NMR_250MHZ>,
      <abs ABSG = 5 
       data hash MD5: 32K
       49 6E 0B 90 6F 33 A8 FD AF C8 15 59 87 8E 9E 39>)
$$ ##END=
$$ 
$$ hash MD5
$$ 05 35 0D 9A 69 A1 F0 0F EE AC C3 AB 21 BC 4A C3
##$RELAX= 
##$RELAX= 
##$RELAX= 
##$RELAX= 
##$RELAX= 
##$RELAX= 
##$RELAX= 
$$ Bruker specific parameters
$$ --------------------------
##$DU= <C:\u>
##$EXPNO= 4980
##$NAME= <ADRS>
##$PROCNO= 1
##$TYPE= <nmr>
##$USER= <dgb>
##$AMP= (0..31)
100 100 100 100 100 100 100 100 100 100 100 100 100 100 100 100 100 100 
100 100 100 100 100 100 100 100 100 100 100 100 100 100 
##$AQSEQ= 0
##$AQ_mod= 3
##$AUNM= <au_zg>
##$AUTOPOS= <10 >
##$BF1= 250.13
##$BF2= 250.13
##$BF3= 250.13
##$BF4= 250.13
##$BF5= 500.13
##$BF6= 500.13
##$BF7= 500.13
##$BF8= 500.13
##$BYTORDA= 1
##$CFDGTYP= 0
##$CFRGTYP= 5
##$CHEMSTR= <none>
##$CNST= (0..31)
1 1 145 1 1 1 1 1 1 1 1 1 1 1 1 1 1 1 1 1 1 1 1 1 1 1 1 1 1 1 1 1 
##$CPDPRG= <>
##$CPDPRG1= <>
##$CPDPRG2= <>
##$CPDPRG3= <>
##$CPDPRG4= <mlev>
##$CPDPRG5= <mlev>
##$CPDPRG6= <mlev>
##$CPDPRG7= <mlev>
##$CPDPRG8= <mlev>
##$CPDPRGB= <>
##$CPDPRGT= <>
##$D= (0..31)
0 1 0 0 0 0 0 0 0 0.06 0 0 0 0 0 0 0.0002 0 0 0 0 0 0 0 0 0 0 0 0 0 0 
0 
##$DATE= 1120037584
##$DBL= (0..7)
120 120 120 120 120 120 120 120 
##$DBP= (0..7)
150 150 150 150 150 150 150 150 
##$DBP07= 0
##$DBPNAM0= <>
##$DBPNAM1= <>
$$ [...]
##$SUBNAM7= <"">
##$SUBNAM8= <"">
##$SUBNAM9= <"">
##$SW= 20.6930455092707
##$SWIBOX= (0..15)
0 0 3 0 0 0 0 0 0 0 0 0 0 0 0 0 
##$SW_h= 5175.983436853
##$TD= 65536
##$TD0= 1
##$TE= 295.16
##$TE2= 300
##$TE3= 300
##$TEG= 300
##$TL= (0..7)
0 120 120 120 120 120 120 120 
##$TP= (0..7)
150 150 150 150 150 150 150 150 
##$TP07= 0
##$TPNAME0= <>
##$TPNAME1= <>
##$TPNAME2= <>
##$TPNAME3= <>
##$TPNAME4= <>
##$TPNAME5= <>
##$TPNAME6= <>
##$TPNAME7= <>
##$TPOAL= (0..7)
0.5 0.5 0.5 0.5 0.5 0.5 0.5 0.5 
##$TPOFFS= (0..7)
0 0 0 0 0 0 0 0 
##$TUNHIN= 0
##$TUNHOUT= 0
##$TUNXOUT= 0
##$USERA1= <user>
##$USERA2= <user>
##$USERA3= <user>
##$USERA4= <user>
##$USERA5= <user>
##$V9= 5
##$VALIST= <valist>
##$VCLIST= <CCCCCCCCCCCCCCC>
##$VD= 0
##$VDLIST= <DDDDDDDDDDDDDDD>
##$VPLIST= <PPPPPPPPPPPPPPP>
##$VTLIST= <TTTTTTTTTTTTTTT>
##$WBST= 1024
##$WBSW= 4
##$XGAIN= (0..3)
0 0 0 0 
##$XL= 0
##$YL= 0
##$YMAX_a= 361940
##$YMIN_a= -397698
##$ZGOPTNS= <>
##$ZL1= 120
##$ZL2= 120
##$ZL3= 120
##$ZL4= 120
##$ABSF1= 16.522
##$ABSF2= -4.171173
##$ABSG= 5
##$ABSL= 3
##$ALPHA= 0
##$AQORDER= 0
##$ASSFAC= 0
##$ASSFACI= 0
##$ASSFACX= 0
##$ASSWID= 0
##$AUNMP= <proc_1d>
##$AZFE= 0.1
##$AZFW= 0.1
##$BCFW= 0
##$BC_mod= 0
##$BYTORDP= 0
##$COROFFS= 0
##$CY= 12.5
##$DATMOD= 1
##$DC= 0
##$DFILT= <>
##$DTYPP= 0
##$F1P= 14.0000005364418
##$F2P= -0.99999901652339
##$FCOR= 0.5
##$FTSIZE= 32768
##$FT_mod= 6
##$GAMMA= 0
##$GB= 0
##$INTBC= 1
##$INTSCL= 1
##$ISEN= 128
##$LB= 0.3
##$LEV0= 0
##$LPBIN= 0
##$MAXI= 10000
##$MC2= 0
##$MEAN= 0
##$ME_mod= 0
##$MI= 0
##$NCOEF= 0
##$NC_proc= -5
##$NLEV= 6
##$NOISF1= 0
##$NOISF2= 0
##$NSP= 0
##$NTH_PI= 0
##$NZP= 0
##$OFFSET= 16.522
##$PC= 1
##$PHC0= -89.29251
##$PHC1= 3.747792
##$PH_mod= 1
##$PKNL= yes
##$PPARMOD= 0
##$PSCAL= 4
##$PSIGN= 0
##$REVERSE= no
##$SF= 250.13
##$SI= 32768
##$SIGF1= 0
##$SIGF2= 0
##$SINO= 400
##$SIOLD= 32768
##$SREGLST= <1H.DMSO>
##$SSB= 0
##$STSI= 32768
##$STSR= 0
##$SW_p= 5175.98343685301
##$SYMM= 0
##$S_DEV= 0
##$TDeff= 65536
##$TDoff= 0
##$TI= <Analysis number 999999
Compound Code 99
Book Reference 9
Project Code 9>
##$TILT= no
##$TM1= 0
##$TM2= 0
##$TOPLEV= 0
##$USERP1= <user>
##$USERP2= <user>
##$USERP3= <user>
##$USERP4= <user>
##$USERP5= <user>
##$WDW= 1
##$XDIM= 32768
##$YMAX_p= 461808230
##$YMIN_p= -282926
$$ End of Bruker specific parameters
$$ ---------------------------------
##NTUPLES= NMR SPECTRUM
##VAR_NAME=  FREQUENCY,     SPECTRUM/REAL,   SPECTRUM/IMAG
##SYMBOL=    X,             R,               I
##VAR_TYPE=  INDEPENDENT,   DEPENDENT,       DEPENDENT
##VAR_FORM=  AFFN,          ASDF,            ASDF
##VAR_DIM=   32768,         32768,           32768
##UNITS=     HZ,            ARBITRARY UNITS, ARBITRARY UNITS
##FACTOR=    0.157963299565203, 1,           1
##FIRST=     4132.6476996994, 0,             0
##LAST=      -1043.33573715361, 0,           0
##MIN=       -1043.33573715361, -282926,     0
##MAX=       4132.6476996994, 461808230,     0
$$ Real data points
##PAGE= N=1
##DATA TABLE= (X++(R..R)), XYDATA
$$ [...]
20612A13061k9327M0158Q4727L9915j4958j9471k4453k372J03753Q9702p986j6551
20600C56198O5881O5789q5681q6173k5848M330r308K338K357m013k5250n589j664
20587B53367m8631M1635o629j05307l472l4099K2030P5516K8836K235q130M7245
20575B64596q723J8121O5406K2362j6111k1511k3282l0894j3408N7627L9985L1702
20563C85870M2750J828p7333n4950J2727L9138r4401n4998N7655j3272j7215M9677
20551B77476J8986K0603k6131n9462Q7348J28142p1243o2608N0774k5003N4190
20540C93072n5519o548J06939J10233R385j463J1467J6017r337l4953n8418r0248
20528C90627o5943K9624L0265K7271P9784J13417R1184J1323Q312K4637J0472
$$ plain form
20612 113061 83734 123892 208619 248534 233576 214105 189652 187280 291033 380735 372749 356198
20600 356198 422079 487868 402187 316014 290166 294496 285188 287526 289883 285870 260620 255031 253367
20587 253367 204736 246371 239742 134435 130963 96864 118894 194410 223246 225481 217351 264596
20575 264596 255873 273994 339400 361762 345651 324140 300858 269964 256556 314183 354168 385870
20563 385870 428620 430448 353115 298165 310892 350030 255629 200631 258286 245014 227799 277476
20551 277476 296462 317065 290934 231472 318820 446962 375719 313111 363885 338882 393072
20540 393072 337553 331005 437944 548177 557562 556099 567566 583583 574246 539293 480875 390627
20528 390627 324684 354308 384573 411844 491628 605045 696229 707552 715864 740501 750973
20517G50973j00380j00436L1067J4358L5845j3369N1994Q7257j7055m1262O9590
20506G68582L9113J8798J240J13635J77528J01391J9121j8832P506k233L2517
20495A258366k0371K3427L2945O4082N0735O3583Q2481J92203O8398l8350j5416
20484A762083l5500P5192Q3757J08972M9323L1712J3701J447Q4598J43371P5394
20473B394050o0673o128K8476R062N8747J31273R5185k6013N754M6953N9331P1918
20461B807935N4483P1648P7219J10688J15721J35604J25526R2560J02741K01505
20451C895630J44291K64465L27508L49184M40681M48635M04657L24107J93825
20442F792983J25009k3529n6153K5987L3400J02632K38666K47742K75338K13366
$$ plain form
20517 750973 650593 550157 581224 595582 631427 618058 670052 757309 740254 698992 768582
20506 768582 807695 826493 827733 941368 1118896 1220287 1239408 1220576 1228082 1225849 1258366
20495 1258366 1237995 1261422 1294367 1358449 1409184 1472767 1555248 1747451 1815849 1777499 1762083
20484 1762083 1726583 1801775 1885532 1994504 2043827 2075539 2089240 2090687 2175285 2318656 2394050
20473 2394050 2333377 2327249 2355725 2364787 2423534 2554807 2649992 2623979 2629733 2676686 2736017 2807935
20461 2807935 2862418 2934066 3011285 3121973 3237694 3373298 3498824 3591384 3694125 3895630
20451 3895630 4039921 4304386 4631894 4981078 5421759 5870394 6275051 6599158 6792983
20442 6792983 6917992 6894463 6838310 6864297 6897697 7000329 7238995 7486737 7762075 7975441
20432G975441K50517M53407N66624N36671N52637P88513R57587J259724J513273
20423A4854394J888525K382848K881311L523850M425098N764229P406909R596587
20415E2723751J2523808J6443818K1390479K7550333L4116027L9659186M1918667
20408B46326069L8399326K7719695J1447891o013183k1757352l1860394l5007378
20401B29254674l3311291k8948527k3847879j8973069j4925409j1658171r257728
20394H8332600p385889o011439m913393l965734l295149k784427k469285k110780
20386E5396504j776873j575129j393337j134418r63294p68166n06608k07987k2143
20377D7048549J13812J40613K9151o4492k42666m81429p32464q97535j214826
$$ plain form
20432 7975441 8225958 8679365 9245989 9782660 10335297 11123810 12081397 13341121 14854394
20423 14854394 16742919 19125767 22007078 25530928 29956026 35720255 43127164 52723751
20415 52723751 65247559 81691377 103081856 130632189 164748216 204407402 246326069
20408 246326069 284725395 312445090 323892981 317879798 296122446 264262052 229254674
20401 229254674 195943383 166994856 143146977 124173908 109248499 97590328 88332600
20394 88332600 80946711 74935272 70021879 66056145 62760996 59976569 57507284 55396504
20386 55396504 53619631 52044502 50651165 49516747 48553453 47785287 47278679 47070692 47048549
20377 47048549 47162361 47302974 47332125 47267633 47024967 46543538 45811074 44913539 43698713
20368D3698713j516575j735784j882700k010059k001133k051550j964006j804155
20360B8732751j684162j602855j428753j325966j260577j148113j113557j046916
20352A8121852r79109r39211q76322p79878p28646p25102p01771n96661n49007
20343A1246145n93251n46819m62990m05775l91857m11392l83778l34865l94311
20334G321107l25059k74925k76328j81272j74770j98953j34091j92515q0581R3345
20324E575958J68376K47333L38363N63741Q67918J120188J197582J025340M56745
20315A1561544k26640q89706j183623j204364j107460q62252o35290n53097l72646
20306D526466l83578k38005j91043j41683j77460r5037q2922q9048j99180j12164
$$ plain form
20368 43698713 42182138 40446354 38563654 36553595 34552462 32500912 30536906 28732751
20360 28732751 27048589 25445734 24016981 22691015 21430438 20282325 19168768 18121852
20352 18121852 17142743 16203532 15327210 14547332 13818686 13093584 12391813 11795152 11246145
20343 11246145 10652894 10106075 9643085 9237310 8845453 8434061 8050283 7715418 7321107
20334 7321107 6996048 6721123 6444795 6263523 6088753 5889800 5755709 5563194 5482613 5575958
20324 5575958 5744334 5991667 6330030 6893771 7761689 8881877 10079459 11104799 11561544
20315 11561544 11334904 10445198 9261575 8057211 6949751 6087499 5452209 4899112 4526466
20306 4526466 4142888 3904883 3713840 3572157 3394697 3299660 3216738 3127690 2928510 2816346
20296B816346j19973j05067o9788j39939o7849m3425K5263L7433J5894m0104J4910
20285B323701J9704J4554k6186n1598p3479j64254r0117k4120l3581j01515P35
20274A793844k066q227n1611j23436j50142p6482n7511m4275r6751l5257K4483
20263A172569N2720l6680m3002k9965p3174l1265M3438r888m6675J9490R1406
20252A108974l6099p2839l374J238j2073k8901o8783P3503M3866K2114n5887N6864
20240A028603O2705o5308N6595J1692m6936L9029q513K2220L3079N7464K6213
20229A216843n5083m3378o0158M1914l6283K6192O1495j3035l0661m3743j03858
20218I60245N8526j9012j05521k0714K9759l7538q9044p238Q3032L0828l8830
$$ plain form
20296 2816346 2696373 2591306 2521518 2381579 2313730 2270305 2295568 2333001 2348895 2308791 2323701
20285 2323701 2343405 2357959 2331773 2280175 2206696 2042442 1952325 1928205 1894624 1793109 1793844
20274 1793844 1791778 1783551 1731940 1608504 1458362 1381880 1324369 1280094 1183343 1148086 1172569
20263 1172569 1225289 1188609 1145607 1115642 1042468 1011203 1054641 1044753 998078 1017568 1108974
20252 1108974 1072875 1000036 996662 997900 985827 956926 888143 961646 1005512 1027626 971739 1028603
20240 1028603 1091308 1026000 1082595 1094287 1047351 1086380 1077867 1100087 1133166 1190630 1216843
20229 1216843 1161760 1118382 1058224 1100138 1063855 1090047 1151542 1138507 1107846 1064103 960245
20218 960245 1018771 999759 894238 873524 903283 865745 776701 769463 852495 883323 844493
20207H44493l6585K3994M3097J431j3645K4764l3024J5618m4737m9892O2771M3018
20195H81303j4964m2836O271l7164r9292o4983Q82N9352K0044N2874J7282r310
20183G69459o7177j30460k8655N9311j5283j3643J8226n4930j09038m2710K1348
20172D06448j2081j8744l1788r677K8006Q6167N868k7235p685L756n0040K5544
20160C98539P5614n9833o3267j780j5903P740K625j8376l4612j01506M4374P680
20148B41295m1064J4109Q0359M168K7734m4489k805Q9759o9439q2099J1387N2135
20136B81050L6652p6322p5617K7613Q0636m753m7756K2651q1934q4R844n0112
20124A21868j6297M3298M3953M9359L36j170n091j2029m4697Q358M2958L23L5464
$$ plain form
20207 844493 807908 831902 874999 876430 862785 887549 854525 870143 825406 775514 838285 881303
20195 881303 866339 823503 829774 792610 693318 628335 629217 688569 708613 761487 778769 769459
20183 769459 702282 571822 543167 602478 587195 573552 591778 536848 427810 385100 406448
20172 406448 394367 375623 343835 334158 362164 448331 454199 426964 419279 423035 372995 398539
20160 398539 474153 414320 351053 349273 333370 341110 343735 325359 290747 189241 233615 241295
20148 241295 200231 214340 294699 298867 326601 282112 279307 369066 299627 217528 228915 281050
20136 281050 317702 241380 165763 193376 274012 269259 221503 244154 162220 162136 171980 121868
20124 121868 105571 148869 192822 242181 242517 241347 236256 224227 179530 187888 230846 231169 266633
20111B66633m441n3877l8662j3815N9129M3834p6434l5831L1827M6454l7535p922
20099A79360K0781l640M5999l4431Q0292O0389j3861q2200k3474J9340L1393p1029
20087B08919O748L3777o2832n9800M321J15823j941J3609R8090Q346j32086j04089
20075A28885O0232Q9598N080p9042n7266P1029k3995K4677J5294R0557R2611k0837
20063C96823r5761k4816L2755j3898n8231p8322J2617M4536K2149L3889k2957
20052B48784m309l9886k5888j4307J6953r5535j5033P8864j1832p4189K4279L7537
20040A25438N4340K8775K8251J00287M2252p4834o2343m6975m8925o8134j7527
20029F0605P7495J4332o8472j2132o49J5672J53887O1447k5163m8189n3632k0537
$$ plain form
20111 266633 262192 208315 169653 155838 214967 258801 182367 146536 178363 224817 187282 179360
20099 179360 200141 196501 242500 208069 288361 348750 334889 252689 229215 248555 279948 208919
20087 208919 215667 249444 186612 126812 131133 246956 245015 258624 356714 365060 232974 128885
20075 128885 189117 278715 283795 204753 147487 218516 194521 219198 234492 325049 417660 396823
20063 396823 301062 276246 309001 295103 236872 158550 171167 215703 237852 271741 248784
20052 248784 244475 204589 178701 164394 181347 85812 70779 149643 137811 63622 87901 125438
20040 125438 179778 208553 236804 337091 379343 304509 242166 195191 146266 78132 60605
20029 60605 138100 152432 83960 71828 71179 86851 240738 302185 277022 228833 175201 154664
20017A54664o429j5177J3288k5248M7950j9074k0242k076M7586N8581o5828K3270
20005A91265M4347K4805j6178l8113J9932k3380o1751J7552N6208J1303l3778
19994A92212j5203k6036M2773k0024K0409J02432J06018P4879J18885J19394J59738
19983H75477J44347J61747J53569J56802Q5773R5415K4528q1787j13399j48658
19973A353814k02304j84373j45278j35913j10869m4528J501N764q1124k1442N0577
19962D85825L904L2760j5106n5183p6025o7726k030j8638M2210O0923J1189n4312
19950C47791m8131k3599O886J1880L2715M5200N3779J0285K2097O4987l7002m7448
19938D39440l3106l574l5673q2093J2308j7946n1670j9231K6845j2464Q5037P241
$$ plain form
20017 154664 148235 133058 146346 121098 169048 149974 129732 127656 175242 233823 167995 191265
20005 191265 235612 260417 244239 206126 226058 202678 140927 158479 214687 225990 192212
19994 192212 177009 150973 193746 173722 194131 296563 402581 477460 596345 715739 875477
19983 875477 1019824 1181571 1335140 1491942 1577715 1673130 1697658 1615871 1502472 1353814
19973 1353814 1151510 967137 821859 685946 575077 530549 532050 537814 456690 435248 485825
19962 485825 489729 522489 507383 452200 376175 308449 306419 287781 329991 390914 402103 347791
19950 347791 299660 276061 282947 294827 327542 372742 426521 436806 458903 523890 486888 439440
19938 439440 406334 402760 367087 284994 297302 279356 227686 208455 235300 222836 307873 315114
19926C15114q5270l998M3164J157l0143p7377o8571j712J6349P5163m5885l9207
19914I8784j5033j1654K7071O3216p830m8456J1940J8572j8664k9740k3762n5519
19902H925m3594O4067J9372k8293l5212o291K7923J18993M9003k2621o3274k495
19890H6503M3258M2961m64M684q127k9639j213N7720j3056o6193Q647j7531o5009
19877D2541k3937o1100L6281l6661J9328M5880L3614j9574K4244M7887P2857k4011
19865A57349p5045K0825N9132J6032J6734L602J4889k6016m0690J0172J6085l8318
19853A34751k3140k6509L3649J7453O2663L0127R943O0723J5758q5858r5265k1415
19841A12880O1606L0581j8676j9643P506M5948l2215k5852L7290l2383n3072k6023
$$ plain form
19926 315114 229844 225846 269010 270167 240024 162647 94076 92364 108713 183876 137991 98784
19914 98784 83751 72097 99168 162384 154554 106098 118038 136610 117946 88206 64444 8925
19902 8925 -34669 29398 48770 20477 -14735 -21026 6897 125890 174893 152272 88998 86503
19890 86503 129761 172722 172258 176942 168815 139176 137963 195683 182627 116434 125081 107550 42541
19877 42541 18604 -42496 -6215 -42876 -23548 22332 55946 36372 60616 108503 181360 157349
19865 157349 82304 103129 162261 178293 195027 198629 213518 187502 146812 156984 173069 134751
19853 134751 111611 85102 118751 136204 198867 228994 238937 299660 315418 229560 134295 112880
19841 112880 174486 205067 186391 166748 174254 220202 187987 162135 199425 167042 113970 87947
19829H7947j6024M0152P4341J10477J1153q3404m6864p6325n9954K1238O6242
19818A28979M1987O0279R993l5029P841Q743r1144O098J39006n2403l2096J2213
19806B04467k2216j8750J1868n2963l0397K3049m5694k9374N384Q325N4285k9312
19794G8672M8410Q4909K6534j3475m074N9262K1288k3463J8006j0433k5809p211
19782B52616J828j9391j351K6817M5445o5803r9874L2393O1943j0177J1973k1583
19770B14836J4041j967K0458j1898K8399K4072L7473n679o1245O9718N711q2801
19758B51118L6284M3191N2819l7756k5966k2326K7532k2861m1574O1785Q7808
19747D10054p9420r084K1788J04684J16310j3316l77R9439P5693J34470J99681
$$ plain form
19829 87947 71923 112075 186416 296893 308046 224642 177778 101453 41499 62737 128979
19818 128979 170966 231245 241238 206209 214050 222793 131649 137747 276753 224350 192254 204467
19806 204467 182251 163501 175369 122406 92009 115058 69364 39990 45374 53699 107984 78672
19794 78672 127082 211991 238525 225050 220976 280238 301526 278063 296069 285636 259827 252616
19782 252616 254444 235053 233702 260519 305964 240161 140287 172680 234623 224446 236419 214836
19770 214836 228877 226910 247368 235470 263869 287941 325414 319735 258490 328208 333919 251118
19758 251118 287402 330593 383412 345656 319690 297364 324896 302035 260461 322246 410054
19747 410054 330634 321550 343338 448022 564332 551016 550639 650078 725771 860241 1059922
19736A059922J91147J97152K45101K92648J98181J22630R3177k567j7651r1494
19726B288246k06102j44581p5499n4711P008n560l9291l9252k1433k7655j44037
19715A537133o6416o113n6603q6283j05225p8266o8049o9854m4206m6335n6109
19704H53674j0654P3928K0720j7394M1781l5655L2726J779n2155o066l2803L4195
19692I04076Q6183K678j5518l6561r6365M5405M2501K4710N2539K0908L6882Q6637
19680A154075J3752N9656J01802P7396N1864k9501m3303P771J4758j1114o130
19669A391026k0706l6370o8139m79m7340K7860J265k7098q9108j06782k9356p1409
19657I23364o7651K8648N4611k962r4870j15917m5167J509l9451l0434n2260m4620
$$ plain form
19736 1059922 1251069 1448221 1693322 1985970 2184151 2306781 2399958 2397391 2379740 2288246
19726 2288246 2082144 1937563 1862064 1807353 1814361 1808801 1769510 1730258 1708825 1681170 1537133
19715 1537133 1470717 1464604 1408001 1321718 1216493 1138227 1070178 1000324 956118 909783 853674
19704 853674 843020 916948 937668 920274 962055 926400 959126 960905 908750 902684 869881 904076
19692 904076 990259 992937 977419 940858 844493 889898 932399 957109 1009648 1030556 1067438 1154075
19680 1154075 1167827 1227483 1329285 1406681 1458545 1429044 1385741 1393512 1408270 1397156 1391026
19669 1391026 1370320 1333950 1265811 1265332 1217992 1245852 1247117 1220019 1130911 1024129 994773 923364
19657 923364 855713 884361 938972 936010 841140 725223 680056 681565 642114 611680 559420 514800
19645E14800N0509P055N6061m2636m936j3317j3143J3904n206j13481j893l9839
19633D07878J3437M6111n352J9754K648k5333K8856l2880j1690M2783Q917m5513
19621D49616k3968j9578K9670q463j3122k2840J1991O6800M2706j230J9449L3843
19609E64874j6457Q113K1258n1490m2908P5614J5598O760j7168M3765o0938j8361
19597E28660N4742k0078Q7618k0185M486K6759l8304o1634O8358K8229m0740j0741
19585F07170m7064k7878J3986K4698O4396J2109J7374M222l083Q9444j8699o428
19573G30247k5660j9067p3515n2709j748M4804j24894q1998j1555O194J969O7756
19561D59824P1448M6834J2068o6729k8460m9612J6953P5910l9883L115J7113n2226
$$ plain form
19645 514800 565309 572364 628425 585789 580853 567536 554393 568297 563091 449610 447717 407878
19633 407878 421315 467426 462074 481828 484476 459143 487999 455119 443429 486212 495129 449616
19621 449616 425648 406070 435740 427277 414155 391315 403306 470106 512812 511582 531031 564874
19609 564874 548417 556530 577788 526298 483390 559004 574602 581362 564194 607959 547021 528660
19597 528660 583402 563324 650942 630757 635243 662002 623698 562064 630422 658651 617911 607170
19585 607170 560106 532228 546214 570912 635308 647417 664791 669013 665930 755374 736675 730247
19573 730247 704587 685520 612005 559296 557548 602352 477458 395460 383905 390099 392068 459824
19561 459824 531272 578106 590174 523445 494985 445373 462326 538236 498353 501468 518581 466355
19549D66355n7667M3271m2630R9111L8194J657k2154p7415j8287o6528L3089J622
19537C98618k9131K1530O5653J107Q564Q2345P2544K9191r520k5460J9773J05797
19525G41011Q3693O4376K368k8241K1579o6083k5749K1106n3068j01363l6065
19514F23564K8308n7033J8169m7322k6732l6042l4480n1321r712k7352L5132M8208
19502D63387p4241M6161O2490N127M2848N2026j5648l891L3963J0163Q518O7081
19490F97984M8879J9892n4425q364K7202J1897J5030j5769K699m9650m6402K1616
19478F70589M4104M0506J5033q089M0783L7444k9341p1107K418L9074l3835j958
19466G45621P868J3990K0719P0828J02246Q9751R764k2060j8560r035M3021J00666
$$ plain form
19549 466355 408688 451959 409329 508440 546634 548291 526137 448722 430435 363907 396996 398618
19537 398618 369487 391017 456670 457777 466341 548686 621230 650421 640901 615441 635214 741011
19525 741011 824704 889080 891448 863207 884786 818703 792954 814060 760992 659629 623564
19514 623564 651872 594839 613008 565686 538954 502912 468432 417111 407399 380047 415179 463387
19502 463387 389146 435307 497797 502924 545772 597798 582150 578259 612222 622385 630903 697984
19490 697984 746863 766755 712330 703966 731168 743065 758095 742326 745025 695375 648973 670589
19478 670589 714693 755199 770232 762143 802926 840370 811029 739922 742340 781414 747579 745621
19466 745621 753489 767479 788198 859026 961272 1051023 1060787 1038727 1020167 1011132 1054153 1154819
19454A154819j0638l7158n7386n298K8374j9541m2567L6891L3279N7348N2721
19443A190844P2732J3229o9837o7472L1894N0835l8205n9855k002j7026O1932
19432A167069J12253p021p7191M5143N2629K9247L2805Q3240L2050J3073R2927
19421A576224Q9284K8323o126Q4186M9907M3153O0219J57791L9284J3975Q0390
19410B216610R2169M7755Q1970J27146L6583l605Q4701J1462k1277N0218M2987
19399B766719p8084M7358L9896L6343N5396N5380P5323L7066N4475N0625M2719
19388C183216K3751N1144M6882L1631L1600M7679J27406J43403R5690J24055J37779
19377D044236J81603J71663J89417J23602J08848R7969J34187J24754J77903J59370
$$ plain form
19454 1154819 1144181 1107023 1049637 1044339 1072713 1053172 1010605 1047496 1080775 1138123 1190844
19443 1190844 1263576 1276805 1206968 1139496 1171390 1222225 1184020 1124165 1122163 1105137 1167069
19432 1167069 1279322 1272301 1195110 1240253 1292882 1322129 1354934 1438174 1470224 1483297 1576224
19421 1576224 1665508 1693831 1687705 1771891 1821798 1864951 1925170 2082961 2122245 2136220 2216610
19410 2216610 2308779 2356534 2438504 2565650 2602233 2598628 2683329 2694791 2673514 2723732 2766719
19399 2766719 2688635 2735993 2775889 2812232 2867628 2923008 2998331 3035397 3089872 3140497 3183216
19388 3183216 3206967 3258111 3304993 3336624 3368224 3415903 3543309 3686712 3782402 3906457 4044236
19377 4044236 4225839 4397502 4586919 4710521 4819369 4917338 5051525 5176279 5354182 5513552
19367E513552K09604R7804R6993J18202J24967J46342R7888K72407L45836L76640
19357G400235M70504N26345N70189N57846P27419P80730P15261P12344Q39607
19348A3300480J044348J165892J440851J669227K142895K829666L469235M511154
19340C1573748N795743P282757R429791J2350252J6147893K1099792K7393159
19333A31073135L4298559M0208490M2221127L7227232K4371033O191472j2325846
19326C03265202k6958312l4388426l4809671l1058204k5869946k0755792j6286669
19319A13138182j2680240r980468p870494o322409n098310m156028l494086k843487
19311F0692660k389143k047565j755108j487609j229263j082696j012135q80154
$$ plain form
19367 5513552 5723156 5820960 5917953 6036155 6161122 6307464 6405352 6677759 7023595 7400235
19357 7400235 7870739 8397084 8967273 9525119 10252538 11033268 11748529 12460873 13300480
19348 13300480 14344828 15510720 16951571 18620798 20763693 23593359 27062594 31573748
19340 31573748 37369491 44652248 54082039 66432291 82580184 103679976 131073135
19333 131073135 165371694 205580184 247801311 285028543 309399576 315591048 303265202
19326 303265202 276306890 241918464 207108793 176050589 150180643 129424851 113138182
19319 113138182 100457942 90477474 82606980 76284571 71186261 67030233 63536147 60692660
19311 60692660 58303517 56255952 54500844 53013235 51783972 50701276 49689141 48808987
19303D8808987q25664o69665m20549k31709j93243N820m5193j78052m20490p70000
19293D5060242r63164j197993j315209j393537j485696j586570j680344j712844
19285C3724885j619485j585946j441403j380710j291271j186994j203045j107735
19277B2908296r87871r90174r23912q31472q11103p92407p46675o89449o45698
19268A5489535n25233n36587n10071m86438m91872l40423k55951l46612k86021
19259A1710327l04470k30930j50240j46380k09103j28897j18887k7449L800K6863
19249A0424634Q2401J26941J91780K05249K32642K29106L02807L63333M42376
19240A2601269N66519P11269Q83833R22151J020679R68754J090202J053822J239129
$$ plain form
19303 48808987 47983323 47313658 46893109 46661400 46468157 46473977 46428784 46250732 45830242 45060242
19293 45060242 44097078 42899085 41583876 40190339 38704643 37118073 35437729 33724885
19285 33724885 32105400 30519454 29078051 27697341 26406070 25219076 24016031 22908296
19277 22908296 21920425 20930251 20006339 19174867 18363764 17571357 16824682 16135233 15489535
19268 15489535 14964302 14427715 13917644 13431206 12939334 12598911 12342960 11996348 11710327
19259 11710327 11405857 11174927 11024687 10878307 10669204 10540307 10421420 10393971 10397771 10424634
19249 10424634 10507035 10633976 10825756 11031005 11263647 11492753 11795560 12158893 12601269
19240 12601269 13167788 13879057 14762890 15685041 16705720 17674474 18764676 19818498 21057627
19231B1057627J483032J868478K299332K860213L594550M346719M856173N134161
19223D7500285M942177M547168M629417N435672P226170J0052352J3779573J8320448
19215A16433262K3123016K6993740K7837361K4207944J5933222N550532l460024
19208B36619053j0245704j5152825j7743780j7060835j4206924j0461777o860950
19201A44886258m464890l548403m313988o189357p983278q669223q418004p501611
19193I3797504o356644n234859m157771l151777k449352j726571j112012o93958
19185F8914560k78358J48242M59674P11502R90251J273053J782450K359646L167663
19176G9528683M218906N603777P032329Q367497R184807Q963431P639664N625775
$$ plain form
19231 21057627 22540659 24409137 26708469 29568682 33163232 37509951 42366124 47500285
19223 47500285 52442462 56989630 61619047 67054719 74280889 84333241 98112814 116433262
19215 116433262 139556278 166550018 194387379 218595323 234528545 240079077 236619053
19208 236619053 226373349 211220524 193476744 176415909 162208985 151747208 144886258
19201 144886258 140421368 136872965 132558977 126369620 118386342 109717119 101299115 93797504
19193 93797504 87440860 82206001 78048230 74896453 72447101 70720530 69608518 68914560
19185 68914560 68636202 68784444 69244118 69955620 70945871 72218924 74001374 76361020 79528683
19176 79528683 83747589 89351366 96383695 104751192 113935999 122899430 130539094 136164869
19168A36164869M269040M516177O864961J0819196J5759894K0898474K4679528
19161B23972139K5488354K2515002J6164857P022776n046178j7379785k5437663
19154B47299502k7673078k5764989k1678262j7081769j2938143r588745p023951
19147A25550565n693040n453360n980191o481743o500480o132334n414855m542584
19139G9351978l834436l247232k846908k414396k079630j969331j656732j517445
19131E9785868j339477j227207j067013r93402r23765r97922j112412j252623
19123E0872047j467402j609642j686616j751548j860613j815071j791868j836058
19115C7053229j821668j745777j622115j642889j457409j348788j335384j273540
$$ plain form
19168 136164869 140433909 144950086 151815047 162634243 178394137 199292611 223972139
19161 223972139 249460493 271975495 288140352 295163128 290116950 272737165 247299502
19154 247299502 219626424 193861435 172183173 155101404 142163261 132574516 125550565
19147 125550565 119857525 114404165 108423974 101942231 95441751 89309417 83894562 79351978
19139 79351978 75517542 72270310 69423402 67009006 64929376 62960045 61303313 59785868
19131 59785868 58446391 57219184 56152171 55158769 54235004 53237082 52124670 50872047
19123 50872047 49404645 47795003 46108387 44356839 42496226 40681155 38889287 37053229
19115 37053229 35231561 33485784 31863669 30220780 28763371 27414583 26079199 24805659
19107B4805659j220425j188365j151893j049822j025088j027104r17896q93129
19099A6331937q64915q01176o86045o87651o25388o56446n83463n51874n12790
19090A0362189m16311l71771l88748m43911m10059m27412m44420m05535k98609
19081F755413k33047k26902k54164k07252k94285k75248k50493j87472j85851
19072D640699j46294j70786j88650j77570k03453j76848r6641q2074o1866j07931
19062C228586j63826j21872j4840m4617j31844j76103p5899M6059p0797j28648
19052B346199Q08l3153q090K0005m3847p3317j1524n1242m276O792j4972l5196
19040B098187j6968Q2053J06661P1728l6793l6860l775o35o2550q9250m4980J07724
$$ plain form
19107 24805659 23585234 22396869 21244976 20195154 19170066 18142962 17225066 16331937
19099 16331937 15467022 14665846 13979801 13292150 12666762 12010316 11426853 10874979 10362189
19090 10362189 9945878 9574107 9185359 8741448 8331389 7903977 7459557 7054022 6755413
19081 6755413 6522366 6295464 6041300 5834048 5539763 5264515 5014022 4826550 4640699
19072 4640699 4494405 4323619 4134969 3957399 3753946 3577098 3480457 3398383 3336517 3228586
19062 3228586 3064760 2942888 2928048 2883431 2751587 2575484 2499585 2545644 2474847 2346199
19052 2346199 2347007 2313854 2305764 2325769 2281922 2208605 2197081 2145839 2141563 2148355 2133383 2098187
19040 2098187 2081219 2163272 2269933 2341661 2304868 2268008 2264233 2263598 2201048 2111798 2066818 2174542
19028B174542M0499p2188n2760J3959k6276l2997j30786m5221J2814o1729q2148
19017A737709K021J4248p3283n2870n7740n761M1029L7873n351K207j3330m276
19005A622476M6326j9157K9929k0757q045J3622K8623l9394K0130J5839M9884
18994A739476k9036k3374k7740K0695O0554Q9019Q5420K6546l825j14912o2953
18983A759870K1720J1920L356J9991m7836m149K8020o7734q5129m0699n0738L2027
18971A580619l725p5634r7686j04057M7692q205n5419k6204k9714n4264j5730
18960A157673j0879n606K1357j9834k4262p235N3772L3635P008k018j7676n8452
18948A127483m9450L8955j6165m2235m48p2548l1278p9131K763Q495k7976j0659
$$ plain form
19028 2174542 2215041 2142853 2090093 2104052 2077776 2044779 1913993 1868772 1881586 1819857 1737709
19017 1737709 1739730 1753978 1680695 1627825 1570085 1564324 1605353 1643226 1637875 1640082 1626752 1622476
19005 1622476 1668802 1649645 1679574 1658817 1650772 1664394 1693017 1653623 1673753 1689592 1739476
18994 1739476 1710440 1687066 1659326 1680021 1740575 1829594 1915014 1941560 1937735 1822823 1759870
18983 1759870 1781590 1793510 1796866 1816857 1769021 1764872 1792892 1725158 1640029 1599330 1548592 1580619
18971 1580619 1576894 1501260 1403574 1299517 1347209 1339004 1283585 1257381 1227667 1173403 1157673
18960 1157673 1146794 1141188 1162545 1142711 1118449 1111214 1164986 1198621 1205629 1203611 1185935 1127483
18948 1127483 1078033 1116988 1100823 1058588 1058140 985592 954314 875183 877946 886441 858465 847806
18936H47806o2410q3569M4174J5372p3054q6019l8130M4466M2928m8225J5681
18925F19020q7422j906l0400J6125l2458r56M9347R7150P8706l0147j31841j0734
18913E34484l7764n1861J8454N6104J08m7547O009k8075L777K4830K4899J05041
18901F08459N4031p8325r0639K2515N3370j0653M8678n7337n6556l3538R24N6690
18889E17619k7653m6801p3069n9470M4394J4079K3956J243J5298l1624M2837L2378
18877D53187n188K1304J6761k9062q5670o8323r608Q4920O9000M042M0246o380
18865D85229l7901L0393J9292m3046L4543K0131K2763l4322K4174K4710k3589
18854E22377J9269M928K6748P7858n3601j15043P01Q0970o508J3110k7565N583
$$ plain form
18936 847806 785396 701827 746001 761373 688319 602300 564170 608636 651564 603339 619020
18925 619020 531598 529692 499292 515417 482959 482003 531350 628500 707206 677059 545218 534484
18913 534484 496720 444859 463313 519417 519525 471978 477987 449912 453689 478519 503418 608459
18901 608459 662490 584165 493526 516041 569411 558758 607436 550099 493543 460005 460929 517619
18889 517619 489966 443165 370096 310626 355020 369099 393055 394298 409596 377972 420809 453187
18877 453187 447999 469303 486064 457002 371332 303009 293401 378321 447321 451363 491609 485229
18865 485229 447328 477721 497013 453967 488510 508641 531404 497082 521256 545966 522377
18854 522377 541646 546574 573322 651180 597579 482536 483237 564207 557699 570809 543244 548827
18842E48827M4676O116M3659K6199j06565q1120P9924J7004j9991m2124o6370
18831D50235o4684m5556M0450k799J0103N078O636K621K6487j7008M5479O5291
18819E22333L0877o1517l5949O1771Q7919R1090O0128O0404K4155J01240R0403
18808A032854j9557J2855J00461K1609L2720q058l4651l0198J822j3938r388M1389
18796A127920P8641M7618R140m6816L0855k756k2621n3298m5798j00164j04282
18785I18439k4115l3484N5509l8184m8702j1006k3554K426q8139m3109Q2423k4849
18773G23655m2166j19737n6240l4158Q5334M4960j8520L3837L3913K3900L1730
18762G06508K4928m0435k4324k9528L2118P8192Q3475N5297L4882Q6438J14456
$$ plain form
18842 548827 593503 599619 643278 669477 562912 481792 561716 578720 558729 516605 450235
18831 450235 385551 339995 380445 377646 387749 392827 399463 402084 428571 411563 457042 522333
18819 522333 553210 491693 455744 517515 605434 696524 756652 817056 841211 942451 1032854
18808 1032854 1013297 1026152 1126613 1148222 1180942 1172884 1138233 1108035 1109857 1095919 1086531 1127920
18796 1127920 1206561 1254179 1263319 1216503 1247358 1244602 1221981 1168683 1122885 1022721 918439
18785 918439 894324 860840 916349 878165 829463 818457 794903 797329 709190 666081 748504 723655
18773 723655 681489 561752 505512 471354 556688 601648 583128 616965 650878 674778 706508
18762 706508 731436 691001 666677 637149 669267 747459 830934 886231 921113 1007551 1122007
18751A122007N0695M0879L2226l6390j2695P0637j5619l8840j5734M9376O0123
18740A306665r2549o3274q7794n4192o2782q4693K7966j5999n6654K2719j360
18729H38053j8178p3948j13573p4508k2491r6769j1390P1406P3056n4378K9189
18718E46469N9143n2202n0668K3647M2893m8197r1542L2443O2700j8537L861J0231
18706E20241N4698J08219O1483O242l127O8642J74871J55934Q5499O1474o7268
18695A226908k6784K4070r349O1486L0741L6726J2142J07309N7950o9040n4020
18684A398139r2861n8237K2277L934p4061p956m9095P9337J66012J60097J49014
18673A696600J05583K14675J43487J11294R2038K3545j36070j90449k19877j54985
$$ plain form
18751 1122007 1172702 1213581 1245807 1209417 1196722 1267359 1251740 1212900 1197166 1246542 1306665
18740 1306665 1214116 1150842 1063048 1008856 946074 861381 889347 873348 816694 839413 838053
18729 838053 819875 745927 632354 557846 535355 438586 427196 498602 571658 517280 546469
18718 546469 605612 553410 502742 526389 569282 521085 429543 461986 524686 506149 510010 520241
18706 520241 574939 683158 744641 750883 747756 816398 991269 1147203 1232702 1294176 1226908
18695 1226908 1200124 1224194 1214845 1276331 1307072 1343798 1355940 1463249 1521199 1452159 1398139
18684 1398139 1305278 1247041 1269318 1273252 1199191 1191235 1142140 1221477 1387489 1547586 1696600
18673 1696600 1802183 2016858 2160345 2271639 2363677 2387222 2251152 2060703 1840826 1685841
18663A685841r8685n1085j00444n1249j14421k2236L7813p718j3457j8823K6000
18652A271536O9597N6064N0804N1360O7063P7242M4261J1547j5101n1018m7603
18641A585752r31l4700q9040q261J6806L0123N259M0567J07167R1997j2588j33937
18629A598214j37479p0317q2578j16118p9318q1979n9324l4965j9139l291o7979
18618H45727p9653n4251k1497M3192j8649o619j0694K2381k1918m934o3520J5697
18606F45262J3455N7927K2751k2891o9999J859Q966o2590o6467K6031k2266k6922
18594E05116N218K5588j5554J8000n4608j2416J4457J6026m4875n0436r95n785
18582C99736O8135p6734J5419O7390K9402k3183j4056P553k555j9992k1793m2912
$$ plain form
18663 1685841 1587156 1536071 1435627 1384378 1269957 1247721 1285534 1277816 1264359 1245536 1271536
18652 1271536 1341133 1397197 1448001 1499361 1566424 1643666 1687927 1699474 1684373 1633355 1585752
18641 1585752 1584821 1550121 1461081 1452820 1469626 1499749 1505008 1545575 1652742 1744739 1732151 1598214
18629 1598214 1460735 1390418 1307840 1191722 1112404 1030425 971101 936136 916997 913706 845727
18618 845727 766074 711823 690326 733518 714869 708250 697556 719937 698019 693085 629565 645262
18606 645262 658717 716644 739395 716504 646505 648364 657330 594740 528273 554304 532038 505116
18594 505116 510334 535922 520368 538368 483760 471344 485801 501827 456952 406516 405521 399736
18582 399736 467871 391137 406556 473946 503348 480165 466109 473662 471107 451115 429322 386410
18570C86410L7037K0768J09231j3572j093o0114m9232n0921K3661L2422K7333
18559D61930K2558o7875L3269Q7436O6130L3464p3189j03204n9990Q8158R4233
18548E82920J010m532k8683l2903m5062j157L3624P2557q114m9589L909M0256
18536E64236K8189o6681l3748M6022j3743l849k8353L3642M2568k0630n9017j07
18524D88529P716O913J02644J382O9864M5267k1574l2585n3448k9268j3176r0433
18512D81831p3097m6094n48J55157R0007q673m5812R465K4398Q221n4368L214
18500E43701L8900P35M5893K9525N67j8544K4237j9931L0398n979L40K4642o9019
18487F25465k8352N4659K0384r611p68l1027j927j5438N175p4291N107R0385R338
$$ plain form
18570 386410 423447 444215 553446 539874 538781 478667 429435 378514 402175 434597 461930
18559 461930 484488 416613 449882 537318 603448 636912 563723 460519 400529 488687 582920
18548 582920 583930 579398 550715 517812 472750 471593 505217 577774 569660 520071 523980 564236
18536 564236 592425 525744 491996 538018 524275 520426 492073 525715 568283 547653 488636 488529
18524 488529 496245 503158 605802 607184 677048 722315 700741 668156 614708 585440 572264 481831
18512 481831 408734 362640 362092 517249 607256 598583 552771 562236 586634 594855 540487 543701
18500 543701 582601 583336 629229 658754 659321 640777 665014 645083 675481 669502 669842 694484 625465
18487 625465 597113 651772 672156 662545 661777 630750 628823 613385 618560 544269 549376 639761 649099
18474F49099l9774n8186j3244k8141L2009l8961M9448N5910k1704M386L2093j4714
18462F08221l3488m1496n0047o9768Q8315M9454j8929K1267j2963k0464k1914
18451D98188k8092L7641O8293j5237J7894k8697o5347j9792M6095J33960n3645
18440E91261p1395N6398R57K0350O2334k2944n3789M1826J9308q5460j0935P1819
18428F19730P5005L0265o5702j2647K4683R4057L0726J0923J6460k4409q6550
18417G12541M2786N5930P0311k7747K2771j8522M8819J09059N2682p5361o5600
18406I27669M1312M0489M1225j0646o4240j3205l0628P0302L9000k756M9710k9152
18394A059080P8731K5539M180N0342Q0087R3431Q4955P4646N5501L4806J1954
$$ plain form
18474 649099 609325 551139 537895 509754 541763 502802 552250 608160 586456 590842 622935 608221
18462 608221 574733 533237 483190 413422 501737 551191 532262 553529 540566 520102 498188
18451 498188 470096 507737 576030 560793 578687 549990 484643 464851 510946 644906 591261
18440 591261 519866 576264 577221 597571 659905 636961 583172 624998 644306 558846 547911 619730
18428 619730 694735 725000 659298 646651 671334 765391 796117 807040 823500 799091 712541
18417 712541 755327 811257 881568 853821 876592 858070 906889 1015948 1068630 993269 927669
18406 927669 968981 1009470 1050695 1040049 975809 962604 931976 1002278 1041278 1038522 1088232 1059080
18394 1059080 1137811 1163350 1167530 1217872 1297959 1391390 1476345 1550991 1606492 1641298 1653252
18383A653252O8572J53140P9785K9325Q4057K9095L4326R6392P5232J15069J18298
18372B536543M8917M3748J06484P8553M3998N3476J31445M8750Q42m909m5964
18361C041883l5777M839R7096J33964Q8179P9100Q7087P0490R2248J02061P1537
18350C832707J42428Q9500J52086Q9240O0911J22126J68307K16764K19834K05400
18340E299303K43912L05356L09265L13600L48019M77808N48643N71238N54207
18331H971351M54692M56253L88438K69053J60126K34794L67699M17087M32773
18322A2152266N10348O95131P77731Q87052R69229J022408J226014J475366J796341
18313B1511886K279463K706956L306716L899491M374243M877256N355181N714899
$$ plain form
18383 1653252 1721824 1874964 1954749 1984074 2068131 2097226 2131552 2227944 2303176 2418245 2536543
18372 2536543 2585460 2629208 2735692 2814245 2858243 2911719 3043164 3091914 3092756 3087847 3041883
18361 3041883 3006106 3010945 3108041 3242005 3330184 3409284 3496371 3566861 3659109 3761170 3832707
18350 3832707 3975135 4064635 4216721 4305961 4366872 4488998 4657305 4874069 5093903 5299303
18340 5299303 5543215 5848571 6157836 6471436 6819455 7297263 7845906 8417144 8971351
18331 8971351 9426043 9882296 10270734 10539787 10699913 10934707 11302406 11719493 12152266
18322 12152266 12662614 13357745 14135476 15022528 15991757 17014165 18240179 19715545 21511886
18313 21511886 23791349 26498305 29805021 33704512 38078755 42956011 48311192 54026091
18305E4026091O110223O607199P739078R677658J2369455J5426161J8493924K0960550
18297A51410339K2461908K2721091K0857956J5745422Q320933J283891m068221
18290B38733319q781283j2678353j4336344j3875849j2204312j0312180q476024
18283A58068974o997922o192791o145352o752907p355367p486808p388928o938203
18275A02810696o350969n586244m816898l874459l104360k464090j881449j281833
18267G3450394q73959l83849K9988M43333R75499J555694K189887K893385L591688
18258H3872060M338465N222340N959167O539764O876922O778877O426297O160484
18250A32174376O540109P743509R461575J1391839J3448386J5043679J5361559
$$ plain form
18305 54026091 60136314 66743513 74482591 84160249 96529704 111955865 130449789 151410339
18297 151410339 173872247 196593338 217451294 233196716 241517649 242801540 238733319
18290 238733319 229952036 217273683 202937339 189061490 176857178 166544998 158068974
18283 158068974 151071052 144878261 138732909 131980002 124624635 117137827 109748899 102810696
18275 102810696 96459727 90873483 86056585 82182126 79077766 76613676 74732227 73450394
18267 73450394 72576435 72192586 72222574 72665907 73641406 75197100 77386987 80280372 83872060
18258 83872060 88210525 93432865 99392032 105931796 112808718 119587595 126013892 132174376
18250 132174376 138714485 146457994 155919569 167311408 180759794 195803473 211165032
18243B11165032J3407226R859449O110348J322409n331567j1916286j5893348
18236B08723263j7177019j7180377j6357715j4524316j2200942r933624q112072
18229A13237198o714418n855403n509215n323625n045802m654626m262976l857952
18221G2013181l385717k885202k626975k347472k071380j808768j607599j473404
18213E3806664j301863j113065j095897j031970j052004j101678j189073j216772
18205D4704342j385960j511078j518352j577847j530897j484580j619118j593357
18197C2483153j529796j583631j491962j383363j278458j234429j237249j156523
18189B1587742j062221j044155r82149r89932r49821q32677p38965p16478p53800
$$ plain form
18243 211165032 224572258 234431707 240542055 241864464 236532897 224616611 208723263
18236 208723263 191546244 174365867 158008152 143483836 131282894 121349270 113237198
18229 113237198 106522780 100667377 95158162 89834537 84788735 80134109 75871133 72013181
18221 72013181 68627464 65742262 63115287 60767815 58696435 56887667 55280068 53806664
18213 53806664 52504801 51391736 50295839 49263869 48211865 47110187 45921114 44704342
18205 44704342 43318382 41807304 40288952 38711105 37180208 35695628 34076510 32483153
18197 32483153 30953357 29369726 27877764 26494401 25215943 23981514 22744265 21587742
18189 21587742 20525521 19481366 18499217 17509285 16559464 15726787 14987822 14271344 13517544
18180A3517544p28196o45535n35734n33895n19127m54368m53300m84104m82206
18171H681079n05028l52657l93430l31703l43634l17120k50805k82323k88060
18162E616319k84970k56133j39717j55637k62423k49319j48803j07145k14535
18153C797637j75734j18639j55634j24057j22858j29492j21850m0273k0376j25136
18143B663588n4503n0750j24983q8345l924l9373j04550p9940k3196K1222m6308
18132B068938L676m1379m0784m203Q0039k0218M130r0379n8562J3915N2420J0615
18120A978208o8574J5971O2519O7583k2120m3534M3894o4574p5132m9293N132
18109A850080J8p6435k3307m0838N986o6908o6968q4813j3991J1898P9727Q1495
$$ plain form
18180 13517544 12789348 12143813 11608079 11074184 10555057 10100689 9647389 9163285 8681079
18171 8681079 8176051 7823394 7429964 7098261 6754627 6437507 6186702 5904379 5616319
18162 5616319 5331349 5075216 4935499 4779862 4517439 4268120 4119317 4012172 3797637
18153 3797637 3621903 3503264 3347630 3223573 3100715 2971223 2849373 2809100 2788724 2663588
18143 2663588 2609085 2558335 2433352 2345007 2341083 2301710 2197160 2117220 2094024 2115246 2068938
18132 2068938 2072614 2031235 1990451 1986248 2066287 2046069 2050199 1959820 1901258 1915173 1967593 1978208
18120 1978208 1909634 1925605 1988124 2055707 2033587 1990053 2033947 1969373 1894241 1844948 1850080
18109 1850080 1850098 1773663 1750356 1709518 1715504 1648596 1581628 1496815 1482824 1494722 1574449 1655944
18097A655944q2166o4270p5992M56K6424p7636k6790L3401K6954N9682K3959j7154
18085A482812M025M0263M1731m018o7781J3801J0204m5142j8462k3049k9636j5403
18073A389345M2536M824P6737j3239n6837P885N421K0546m4222j3997L8975o6839
18061A391135K227j0188n6946n774O753K273k2906n6000q486j19378j36761l2754
18049I53195J7589L1362J3971j8626Q9491Q1591o051o8237r6948q2818k1567k4760
18037H68192J3011P8777Q2559Q295m4544o0586m5049l8206J6975K8606m7591l2208
18025H28231o3065m3558M1689L5944j5010o3387j0323L2563r6703j28316J2328
18014E30393m7030r958l6978m9500J7026k913P696K2054M0310j8402K0768k8268
$$ plain form
18097 1655944 1573778 1509508 1433516 1433972 1460396 1382760 1355970 1389371 1416325 1476007 1499966 1482812
18085 1482812 1486837 1527100 1568831 1564813 1497032 1510833 1521037 1475895 1457433 1434384 1404748 1389345
18073 1389345 1431881 1436705 1513442 1500203 1443366 1451251 1456672 1477218 1432996 1418999 1457974 1391135
18061 1391135 1393362 1383174 1326228 1320454 1327207 1329480 1306574 1250574 1242088 1122710 985949 953195
18049 953195 970784 1002146 1016117 997491 1086982 1168573 1162522 1094285 997337 914519 892952 868192
18037 868192 881203 959980 1042539 1050834 1006290 945704 900655 862449 879424 908030 860439 828231
18025 828231 765166 721608 763297 799241 784231 720844 710521 743084 646381 518065 530393
18014 530393 483363 473405 436427 386927 403953 401040 408736 430790 471100 452698 473466 445198
18002D45198n0452k3111J2486J2899O2638N0500K8945n671o7722r302k9007l197
17990D24204j2757j21372n5552J1501J07495M8881k1511J4520j163p844O780Q226
17978D01408P2K3897m433j0165m5286j5952o536n5632K0118R0569L744j59186
17966B42618p190L9124p282L7651K8125N4213k7368m2241p1779J6448O0660K4373
17954C47352k9795J7505K5332j9155o6612o0081K2600P5317k5651r2757q0153
17943A13902M4912O0749K0867J9147O9848O2352m6622p9403l2052j2949j2476
17932B08275J3097l3957L7258L9649J7604m1365j3405n595K1692O003j7610o914
17920B24732J4024L4172P178M4386K7690l5862j0918k1047m6700L9128M9529j201
$$ plain form
18002 445198 394746 371635 384121 397020 459658 510158 539103 533432 465710 456408 427401 424204
17990 424204 411447 290075 234523 246024 353519 402400 380889 395409 394246 386402 393182 401408
17978 401408 401480 425377 420944 410779 365493 349541 343005 287373 307491 398060 401804 242618
17966 242618 235428 274552 267270 304921 333046 387259 359891 317650 245871 262319 322979 347352
17954 347352 317557 335062 360394 341239 274627 214546 237146 312463 286812 194055 113902
17943 113902 158814 219563 240430 259577 329425 391777 345155 265752 233700 220751 208275
17932 208275 221372 187415 224673 264322 281926 240561 227156 221561 243253 249256 231646 224732
17920 224732 238756 272928 280106 324492 352182 316320 305402 284355 237655 276783 326312 325111
17908C25111q130j5765q7302p8954p381L6170M029j5185J0730K9233J3710o2677
17896A43589j6455P705l8874m5841J572J6686m9587M4143J45379K6193j4312J7068
17884B37266r069j3168R301q3886m150Q373M9880j5921m7277K7034j8279L9888
17872A79992n582j0930n3524k6328m5532J7920P4217Q541l3641N1726o7125r1715
17860a981r855Q3257K4864k2399l4696m9173j6807P2712L8582M7798r3162K5717
17848F4857K4273M694n2807k8164k9593M6689M4804j5520r884l5804l6908O3626
17836D0263N2956o0527p103M3915M767L8546j9608P4255P6147l2931m3911O7628
17824B34397K6068j4333R400q4686o1358N502l6399n8852N5901r515N599m35j4541
$$ plain form
17908 325111 316981 301216 213914 134960 127579 163749 167778 152593 163323 192556 206266 143589
17896 143589 127134 134839 95965 50124 51696 68382 18795 62938 208317 234510 220198 237266
17884 237266 228197 215029 224330 140444 136294 144667 194547 178626 131349 158383 140104 179992
17872 179992 174410 163480 109956 83628 38096 56016 130233 138774 105133 156859 89734 -1981
17860 -1981 -11836 71421 96285 73886 39190 -9983 -26790 45922 84504 132302 39140 64857
17848 64857 89130 93824 41017 12853 -16740 29949 74753 59233 49349 13545 -23363 40263
17836 40263 93219 32692 25589 69504 74271 112817 93209 167464 243611 210680 166769 234397
17824 234397 260465 246132 255532 170846 109488 114990 78591 19739 75640 66125 71724 71289 56748
17811E6748j3838K8545O9450P4301O2696N5076m6180K6174n7532o3055n3582n4725
17799H4078O4289Q6947R798j8583L2674Q0312O7860O197K8570J26750Q8855R7104
17787G54851L2076N6206Q846N1041J24743K0431k7461M0083J6301K7180J1604
17776A115901n1744J6787l5588p7374q484o3689j09292m0691l8481O1807J7828
17765G86980r1570m0507p2789k3254P6124l7787p1506j3567K7001K1639j2227
17754E48537L9769O2557k8750p1645j3928J9275q8004K0305R2334j4914M460M2560
17742F12556N8036l60N2099P0614M0204P0685N1924K1815O2912r0371k7668n720
17730I16726K3358p8376q0255J6643k4172O9878N4339L6092L4723L8873q68n4574
$$ plain form
17811 56748 42910 71455 140905 215206 277902 332978 286798 312972 255440 192385 138803 84078
17799 84078 148367 235314 245112 226529 259203 339515 407375 413572 442142 568892 657747 754851
17787 754851 786927 843133 851979 903020 1027763 1048194 1020733 1060816 1077117 1104297 1115901
17776 1115901 1064157 1080944 1045356 967982 959498 895809 786517 745826 707345 769152 786980
17765 786980 695410 654903 582114 558860 634984 597197 525691 512124 539125 560764 548537
17754 548537 588306 650863 622113 550468 536540 555815 467811 488116 580450 565536 569996 612556
17742 612556 670592 670232 722331 792945 833149 903834 955758 977573 1040485 950114 922446 916726
17730 916726 940084 861708 781453 798096 773924 843802 898141 934233 968956 1007829 1006961 952387
17718I52387o2608n1347n3827r2322p1597m6715r5656k6719L6710N350K8510r7628
17706D24538q5141j1414j948l1287k3627m77L2006n2002J8893k7244n1690M3861
17694B34468K3930n2104o3451m9530m4082L4975L4737K2809K387P17Q0892K5587
17682B51335k6465m3724m3418K7741L8330l1790m5118L945O3359M2881J2105p7799
17670A71382m6241k0709N134M9409m7591q0288j0987m0262J4370P8176Q445j4667
17658F6171l4509O8043R5513k9808r023n700k0058l7090M659R308o9020J9143
17646E7629m5432l3100L2864P2603m9332o1529M9858L2535n9778o7620O2690J3352
17634D740k5825j4859K9989o753K6864M1051K7084K1281o344j9507q6022j0628
$$ plain form
17718 952387 889779 838432 784605 692283 620686 573971 478315 451596 488306 493656 522166 424538
17706 424538 339397 327983 326035 294748 271121 270644 302650 250648 269541 242297 190607 234468
17694 234468 258398 206294 142843 93313 49231 84206 118943 141752 144139 144856 225748 251335
17682 251335 224870 181146 137728 165469 203799 172009 126891 130836 194195 237076 249181 171382
17670 171382 125141 104432 109566 158975 111384 31096 20109 -20153 -5783 72393 80838 66171
17658 66171 31662 99705 195218 165410 156387 150687 130629 93539 98198 107506 38486 57629
17646 57629 12197 -20903 11961 84564 35232 -26297 23561 56096 -3682 -71302 -8612 4740
17634 4740 -21085 -35944 -5955 -12708 14156 55207 82291 103572 97228 77721 -8301 -18929
17622a8929N5010M47m3662m4499l9684q2584l6204k147Q0866J53057n7232j3458
17610d9019O7298l4852k881k198P1964L2773K545q730p1632q650K3093L1507Q744
17597E9962J1376m9902k593K4715k1951o8698L3386M1551o0693J0824L2294j1840
17585a569j7103O3486J7727k1034k9306L9261L6375l077j02881m8955Q84k7281
17573i3473O9741J9885m1173j9053k19j7628J8964N2409N8117R235o8779j9466
17561c1440l2717M452J6126k6379q5743o790j273Q5491K196K1098Q1705K4891
17549E1617p7486l3036j8747O5689m1314n1830j3068N1065J12939O3928R110j2407
17537A06460j8573j3210L1488j9168j06766p2905l1473N9676J03538Q481p1672
$$ plain form
17622 -18929 36081 36528 -7134 -51633 -91317 -173901 -210105 -212252 -131386 21671 -35561 -49019
17610 -49019 18279 -16573 -19454 -21652 50312 83085 85630 76900 5268 -3382 19711 51218 59962
17597 59962 71338 21436 18843 43558 21607 -47091 -13705 27846 -32847 -22023 10271 -1569
17585 -1569 -18672 44814 62541 41507 12201 51462 87837 84760 -18121 -67076 -66192 -93473
17573 -93473 -23732 -3847 -45020 -64073 -64292 -81920 -62956 -10547 47570 56805 -11974 -31440
17561 -31440 -64157 -59705 -43579 -69958 -155701 -162491 -163764 -78273 -76077 -54979 26726 51617
17549 51617 -25869 -58905 -77652 -11963 -53277 -105107 -118175 -67110 45829 109757 118867 106460
17537 106460 87887 74677 106165 86997 -19769 -92674 -124147 -64471 39067 47548 -24124
17526b4124l556L4930N6422k8683p5030o1758P3098P6954J1869m1314k9561k1864
17514c2617m2149N1371o325R385J4891M9447M4617n1753p7798M0009L2019L2772
17502F3869L6513o1209r2971o763J8279o991J4436J242o910M206O4302P331o8282
17489c2948k1071O6897N8763k0405q567l1214l4027m5758J0446Q1034N1192l3750
17477D0592o3284l1743R7253q507o6475n5581R9232Q6778m0776K6073j3030l9382
17465C1150k8052k758r8092M663O4413O5818o330K2083L6343o2638M4218J3242
17453H4060K8086n0362k4697J819l9649l2537M3995K2068l5513M574j28372l2289
17441a58817k070n3739j5735L8885M6536l1639R7167P6512m7697n7913N5590J8252
$$ plain form
17526 -24124 -27680 7250 63672 34989 -40041 -101799 -28701 48253 60122 18808 -10753 -32617
17514 -32617 -74766 -23395 -29720 -20335 -5444 44003 88620 36867 -40931 -922 31097 63869
17502 63869 100382 39173 -53798 -60561 -42282 -49273 -34837 -33595 -40505 -36299 28003 35334 -32948
17489 -32948 -54019 12878 71641 51236 42669 11455 -22572 -68330 -57884 23150 74342 40592
17477 40592 -22692 -54435 42818 34311 -32164 -87745 11487 98265 57489 83562 70532 31150
17465 31150 3098 340 -97752 -93089 -28676 37142 30812 52895 89238 26600 70818 84060
17453 84060 112146 61784 37087 38906 -743 -33280 10715 32783 -2730 1844 -126528 -158817
17441 -158817 -160887 -214626 -230361 -191476 -144940 -176579 -79412 -2900 -50597 -108510 -52920 -34668
17429c4668j4038n9832n0731N0030k8171j6287q875L2847j13778O0588J05012
17418g7903O1508j9985o3614q0027J02671P2620n5964r4250M6184N0614O739J1389
17406d0018j5631l3136N4074L4222n0358m0022K8381K9637Q388m6432J176M2761
17394b6958J0695O2529k9700K4740M5024m8924m9415n652K9955o595N9632p6593
17382a1262m7810n8807N353L3404j1443K7405J23352M1208N609L6946l9778q7085
17370A7092n7994n3131k1603N8064N951n978N136n4506N2972O8442k3718M939
17358d334J8855K1452J0460m9352j8342J2759m9214L7076M4691M4763q94k5566
17346D2354K8747L2570p3852q3190k3757L6838N2458M522L6851p7285n6616L4486
$$ plain form
17429 -34668 -48706 -108538 -159269 -109239 -137410 -153697 -162572 -129725 -243503 -182915 -77903
17418 -77903 -16395 -36380 -99994 -180021 -77350 -4730 -60694 -154944 -108760 -58146 -51407 -40018
17406 -40018 -55649 -88785 -34711 -489 -50847 -90869 -62488 -32851 -24463 -70895 -69719 -26958
17394 -26958 -16263 46266 16566 41306 86330 37406 -12009 -17661 12294 5699 65331 -11262
17382 -11262 -59072 -117879 -112526 -79122 -90565 -63160 60192 101400 107009 143955 104177 17092
17370 17092 -40902 -94033 -115636 -57572 -51621 -57599 -52463 -106969 -53997 14445 -9273 -4334
17358 -4334 14521 35973 46433 -2919 -21261 -8502 -57716 -20640 24051 68814 67920 42354
17346 42354 71101 103671 29819 -53371 -77128 -40290 12168 16690 53541 -23744 -80360 -45874
17334d5874P4484K4560n575r7376R1741K6731n4861k9093M5045m717J0976j9312
17322A6729k158k4859P467j609l461K490L2262J1488Q421R61p6863p3161o503
17309a08796P260L9915L7056M1057m3539j9969q49M9741j04083q2812l2070L35
17297b16754R3396N9499m6155l8845l372K8616R648K6153L6597L5215q7208l4475
17285a37685Q4037M2203M371n217N6581L317j1770O533o0825M482N1090K1951
17273E9068L1573o255J7841M0701j01028q8707o3368P8518K9437o0368j2436K0337
17261e4687R7172j4149m5446j4420l5357m1208k2012o3214J8703J15380J8276
17250d0962n5N2888j1200j379r5251j1087K5244j221M9651K9203K5834M4184J7423
$$ plain form
17334 -45874 28610 53170 47595 -49781 41960 68691 13830 -15263 29782 25065 36041 16729
17322 16729 14571 -10288 -2821 -4430 -7891 -5401 26861 38349 46770 47731 -29132 -102293 -108796
17309 -108796 -101536 -61621 -24565 16492 -27047 -47016 -47865 1876 -102207 -185019 -217089 -216754
17297 -216754 -123358 -63859 -110014 -148859 -152231 -123615 -113967 -87814 -51217 -16002 -103210 -137685
17285 -137685 -53648 -11445 -7074 -12291 44290 47607 35837 42370 -18455 -13973 37117 59068
17273 59068 90641 84386 102227 142928 41900 -46807 -110175 -31657 -2220 -62588 -75024 -54687
17261 -54687 42485 28336 -17110 -31530 -66887 -108095 -130107 -193321 -174618 -59238 -40962
17250 -40962 -41017 11871 671 -708 -95959 -107046 -81802 -83023 -33372 -4169 21665 65849 83272
17237H3272N3299k3348j55830o3964J3043P3902O281j4694j0273k1502K9687K7904
17225b223m6932L8159p1956k951L5136K6537N9614K1509r2158q4125M941Q5404
17213b9045M881r2410l3305K1479Q095l916k41l5750J9045P0288L5238N6454p661
17200A3152m6930o281k1559n9875L566L6556k4560r465J8272N1153j4852k543
17188f3366J8450j9231n8189M831M1733M5744q16K1816m4695j00534j0434P0955
17176i3736J02346L1731l9391K4704p175j4193p3424n1244K2423K541l6501j6267
17164a48186m7012K1327n994o590L6522J2929O3591P5614r757j4300l4858k4333
17152h1047l5249J5437L2106L8146J07214K580p6155j0334n996l8922n4692j6662
$$ plain form
17237 83272 136571 113223 -42607 -106571 -93528 -19626 -13345 -28039 -38312 -59814 -30127 -2223
17225 -2223 -49155 -10996 -82952 -85903 -50767 -24230 35384 56893 -35265 -119390 -114449 -29045
17213 -29045 -24164 -116574 -149879 -128400 -120305 -124221 -124462 -160212 -141167 -70879 -35641 20813 13152
17200 13152 -33778 -40059 -61618 -121493 -117927 -81371 -105931 -115396 -97124 -45971 -60823 -63366
17188 -63366 -44916 -64147 -122336 -117505 -75772 -30028 -30844 -9028 -53723 -154257 -164691 -93736
17176 -93736 8610 40341 950 25654 18479 4286 -69138 -120382 -97959 -95418 -131919 -148186
17164 -148186 -195198 -173871 -179865 -186455 -149933 -137004 -73413 2201 -7556 -21856 -56714 -81047
17152 -81047 -116296 -100859 -68753 -30607 76607 79187 3032 -7302 -13298 -52220 -106912 -123574
17140a23574k345J6385m184K3328Q7450L0817m5571k3247o9026n28N8898j7509
17128f9106J8953k1252j5825K519o1646K6924N1558L0771O1617m8488q5387o387
17116a15749N1565N9814r886o7501j8008M4770k344m4778L549L6218P0555k1899
17104a3694k1678k1254n1329L2442Q6196Q942j1139K0658n7124j9500k7981M409
17092g1052M6651P665K4415m6368p5534k387J1386k9933k7466P5442L1296N3960
17080a925O8003j7053o5901j5484J7239j2507P713J8878k8014o2441j2390J1502
17068i2380N2215N5660k1001k9219J0219j0164j17543k5179N428n1769j9177M8330
17056a94580j8139L458L1417J7577K594k1622N98M6279J8374K4687j1340L8477
$$ plain form
17140 -123574 -125919 -109534 -113718 -90390 -2940 27877 -17694 -40941 -109967 -110495 -51597 -69106
17128 -69106 -50153 -71405 -87230 -84711 -146357 -119433 -67875 -37104 24513 -23975 -109362 -115749
17116 -115749 -64184 -4370 -14256 -81757 -99765 -54995 -57339 -102117 -98568 -62350 8205 -13694
17104 -13694 -35372 -56626 -107955 -75513 10683 19625 8486 29144 -27980 -47480 -75461 -71052
17092 -71052 -24401 -16736 7679 -38689 -114223 -116610 -105224 -135157 -162623 -87181 -55885 -1925
17080 -1925 66078 49025 -16876 -32360 -15121 -27628 -19915 -1037 -29051 -91492 -103882 -92380
17068 -92380 -40165 15495 -5506 -34725 -24506 -34670 -152213 -177392 -171964 -223733 -242910 -194580
17056 -194580 -212719 -209261 -177844 -160267 -157673 -179295 -178697 -132418 -114044 -89357 -100697 -62220
17044f2220N2888r5958K2963O3350j519M4581l4773k9536m4659l547O3236K5332
17032A38p781J9583N4010K2806o1644k9310n2133J1870Q1001l6548m538K0074
17020A7528j9234N237N906M1356l9652q5484J6337M6656O0992L2713j05488k0499
17008d3632j7732j819M8449Q0716N7940r232p6036M464K4839l6157l6462m0225
16996d4887J4433K1382o9528J2395M3878L8743K7589k802P644l6073q6978p9288
16984a53492k2861k3164P6047M4707P4278J12515o8302j08658K922K1184J0331
16973c4493N6331N6873l1466l347n6520n535K6093L0464j4636p8724j9721Q5856
16961A1175o4089j14132J4747K8784m447M0323j8644K0667N0294R2822K7195l4539
$$ plain form
17044 -62220 -9332 -105290 -82327 -18977 -20496 24085 -10688 -40224 -84883 -88430 -25194 138
17032 138 -7643 11940 65950 88756 27112 -2198 -54331 -42461 38540 1992 -2546 17528
17020 17528 -1706 3531 9437 50793 11141 -74343 -58006 -11350 49642 82355 -23133 -43632
17008 -43632 -61364 -63183 -14734 65982 123922 114690 38654 43118 67957 31800 -4662 -44887
16996 -44887 -30454 -9072 -78600 -66205 -22327 16416 44005 41203 48847 12774 -74204 -153492
16984 -153492 -176353 -199517 -123470 -78763 -4485 108030 39728 -68930 -66008 -44824 -34493
16973 -34493 21838 78711 47245 43898 -12622 -18157 7936 38400 23764 -54960 -74681 11175
16961 11175 -52914 -167046 -152299 -123515 -127962 -87639 -106283 -85616 -35322 57500 84695 50156
16949E0156r3539P9911K6870m4383n899r1205n5509o201k0861Q8286J06868K6334
16937F0828m9502R743l6924O5142m5800q3706k8232Q6898l5896M4614O6657l19
16925E3503l1703M9137m18L1026j0612K1668M6790l1757N608o5943R219N4743
16913A31261j3635o8958n2124O4224O6086m2425o3745m9349k425N7823K4788J5241
16901F6762l5926o3913Q583j5119k7858m649j5889N1245P9436l7155l2903k1335
16889d8721m6282J445J8187j8800O8240j1853p7088k7707N8375O6463Q161l0250
16877c9830p4084O64p891N205P2091L811m6196K5082L7172P6936P630l140P9014
16864A36464k13q4407K271l2387l4993l7136M3589K8676m6621p8968J0245o707
$$ plain form
16949 50156 -43383 36528 63398 19015 13116 -78089 -133598 -139799 -160660 -72374 34494 60828
16937 60828 11326 21069 -15855 49287 3487 -80219 -108451 -21553 -57449 -12835 53822 53503
16925 53503 21800 70937 70519 101545 90933 112601 159391 127634 133242 67299 76518 131261
16913 131261 117626 48668 -3456 60768 126854 84429 20684 -28665 -31090 26733 51521 66762
16901 66762 30836 -33077 -24494 -39613 -67471 -72120 -88009 -36764 42672 5517 -27386 -48721
16889 -48721 -95003 -93558 -75371 -94171 -25931 -37784 -114872 -142579 -84204 -17741 -9580 -39830
16877 -39830 -113914 -113250 -121141 -115936 -43845 -40034 -86230 -61148 -23976 52960 60590 57450 136464
16864 136464 136251 51844 54115 21728 -13265 -50401 -6812 21864 -24757 -103725 -93480 -100187
16852a00187O8688J83393q535M784q4508n0045M1449p427n1671m6960m479k1167
16840g6665L6676l2575M2741L955m4612k1729N2428K4971L9100K1784j07732l9483
16828a01141O6548N8019K891P8285L1032m2140l7666m0139p8804m3724L3451k079
16816g5467J4487R1351Q4341n3398K3392J075n8841r5229j8551O1217O9m2683
16804f8237R095K9259k144l8825o7745L4919l8240m5836Q8653N9079O4918L4682
16792E9578r8509L703M7435j2233R873M1493J7480J5209m2575j2933o38n6726
16780b8843P683j6963m6449P302M2385L3239q67K5921m0623r6239j5192M7220
16768h1426N7962L5724k7575j11824j9624P3715j7599P154M1475l1447O4419N3905
$$ plain form
16852 -100187 -31499 151894 143359 148143 63635 13590 55039 47612 -4059 -51019 -55498 -76665
16840 -76665 -39989 -72564 -29823 -25868 -70480 -92209 -39781 -14810 24290 46074 -61658 -101141
16828 -101141 -34593 23426 26317 104602 135634 93494 55828 15689 -63115 -106839 -73388 -75467
16816 -75467 -60980 30371 114712 61314 84706 85781 26940 -68289 -86840 -25623 -25554 -68237
16804 -68237 -59142 -29883 -32027 -70852 -138597 -103678 -141918 -187754 -99101 -40022 24896 59578
16792 59578 -38931 -35228 12207 -26 9847 51340 68820 84029 41454 28521 27883 -28843
16780 -28843 -21160 -38123 -84572 -77270 -34885 -1646 -2513 23408 -17215 -113454 -128646 -81426
16768 -81426 -23464 12260 -15315 -127139 -146763 -73048 -90647 -83493 -42018 -73465 -9046 44859
16756D4859l2877J3794K0631j2811N856M443k3163Q063l4935k5106M3593p19j1590
16743C8l9675l1837R584p480M4505R249k0901N179p2006j01524K7094P1117K635
16730a04022L6001J03209n9325o6390J4531j5291K8990N0447O1239r680r6026
16719e6317n92l992J1201K154R3215j1572j10954m8214j8715M5176L649K5406
16707f9555j8949k5292J3149J1266p7413J0001L5525N7916L06m7228O2745L428
16695d4101J0752l825j9712K2587J8303M0797J11451l7748o0474m7111k5059O3194
16683B9054J0198k8908p1458l2357j9899Q9131Q2611o0740j7100k7439n9389Q41
16671a05455K8005j2668k3932K2752L7929K5098K1435O813k2905k8556M1406J7030
$$ plain form
16756 44859 11982 25776 46407 33596 39452 43895 20732 28795 -6140 -31246 12347 11628 38
16743 38 -39637 -71474 -61890 -69370 -24865 -15616 -36517 -31338 -103344 -204868 -177774 -106657 -104022
16730 -104022 -68021 35188 -24137 -90527 -75996 -91287 -62297 -11850 49389 39709 -56317
16719 -56317 -56909 -60901 -49700 -47546 45669 34097 -76857 -125071 -143786 -98610 -94961 -69555
16707 -69555 -88504 -113796 -100647 -89381 -166794 -156793 -121268 -63352 -63046 -110274 -47529 -44101
16695 -44101 -33349 -37174 -56886 -34299 -15996 24801 136252 98504 38030 -9081 -34140 29054
16683 29054 39252 10344 -61114 -93471 -113370 -24239 58372 -2368 -19468 -46907 -106296 -105455
16671 -105455 -77450 -90118 -114050 -91298 -53369 -28271 -6836 -23 -22928 -51484 -10078 6952
16659F952p8548n6469K583Q1516j9395k381J9571M934n240m7599L4821N5202o7787
16646g1840n0460j4150O1640P8176j9512p1139K250K9821O6512j026N7485j5769
16634E1988q8040m356K0576k6722N8418L2900n7654l9774O5405J6425K4697j6237
16622C7626K3432K8418m2350j2337L8798n3688j2973J0438m3205O1595N6674o367
16610H6061n2578p474m26P7566J4320m7453k7477l0401L1947M9981L8367o2191
16598G0242k8128l730m8488l8812K2489j9671l9054R167L5135k1941l0164j7982
16586a10937K9853O6970N9217J2348o5116O0266j2537r3058n7582J0124J4865
16575h5587r10p247l3771J43061N8027p196k7720o2925J8676j5445n2089m6459
$$ plain form
16659 6952 -71596 -128065 -125482 -43966 -63361 -65742 -46171 -41237 -46477 -94076 -59255 -4053 -71840
16646 -71840 -122300 -136450 -74810 3366 -16146 -87285 -85035 -55214 11298 10272 67757 51988
16634 51988 -36052 -40408 -19832 -46554 11864 44764 -12890 -52664 12741 29166 53863 37626
16622 37626 61058 89476 47126 34789 73587 19899 6926 17364 -25841 35754 92428 86061
16610 86061 33483 26009 25583 103149 117469 70016 42539 12138 44085 94066 132433 70242
16598 70242 42114 38384 -10104 -48916 -26427 -46098 -85152 -75985 -40850 -62791 -92955 -110937
16586 -110937 -81084 -14114 45103 57451 -7665 52601 40064 -52994 -110576 -100452 -85587
16575 -85587 -86497 -93744 -127515 15546 73573 66377 38657 -24268 -5592 -21037 -73126 -119585
16563a19585N7431M3164O7214k3523J5865k8862j2271n0546q717M2680J8180J1942
16551A2972l6752l8697o3239k1275J12459J25948k0392j12503j5733N6651K7840
16540B7279j1255N997m4927P941o1210j5547l4885J8098K6260L5423n5632l9528
16528a41986K7306N2215L6964p150J9907j1871k7709j2880o3947k7145k3472M5172
16516a34596N505k1388M3985O0564L1487K7413L5202J9174J2135q6156P250N7711
16504E8286N0086K2897j5050q4522k1063p6631k0978n2224j729R8147L7854n000
16492i927M4121n0282l623J14603n803j5849o414j9216o9323L6245M3265O4019
16480A21816k9549p1675L474L2774K0135q6324p0789M2373L5693k046Q078J9459
$$ plain form
16563 -119585 -62154 -18990 48224 24701 40566 11704 -567 -51113 -59830 -17150 1030 12972
16551 12972 -23780 -62477 -125716 -146991 -34532 91416 71024 -41479 -57212 -561 27279
16540 27279 16024 22021 -22906 -14965 -76175 -91722 -126607 -108509 -82249 -46826 -102458 -141986
16528 -141986 -114680 -62465 -25501 -32651 -12744 -24615 -52324 -65204 -129151 -156296 -179768 -134596
16516 -134596 -129091 -150479 -106494 -45930 -14443 12970 48172 67346 79481 -6675 575 58286
16504 58286 108372 131269 116219 31697 10634 -65997 -86975 -139199 -140928 -42781 -4927 -9927
16492 -9927 34194 -16088 -19711 94892 89089 73240 66826 47610 -21713 14532 57797 121816
16480 121816 92267 20592 24066 56840 76975 -9349 -80138 -37765 -2072 -4118 3960 23419
16468B3419o144o0144l2929M6278J48M6833n0164j4959j9512J3359K7878j8266
16456d4203L3430L8953O0017M6254J9040J359L4020n7443p6514m0921j4926K2989
16444B2055K4560o8410n6840M4041j5791Q0632O1866P546N7677n3675p6349o7914
16432d0602n9632k2358L904N2527m390l3810l9427m0780L2822M8053M1446J4613
16420d7634l5476P826K826O7763l135L8387m732l8469l6489M07l7098Q8496O4590
16407F7262M0979k3344n9475r0422j9511J0152L3227J8256J7641r454R424Q789
16395C524k3844l496k133K9564N0361M1927k075q3228o1417Q6911P1767m8302
16383E9559m3784L520j0327J2405k6980k2553k6077l9118Q4356N8657l8423j6833
$$ plain form
16468 23419 17275 -42869 -75798 -29520 -29372 17461 -32703 -47662 -67174 -53815 -25937 -44203
16456 -44203 -10773 28180 88197 134451 153491 154850 188870 131427 54913 13992 -934 22055
16444 22055 46615 -21795 -78635 -34594 -50385 30247 92113 99659 157336 103661 27312 -40602
16432 -40602 -100234 -122592 -118688 -66161 -70551 -104361 -143788 -184568 -151746 -103693 -62247 -47634
16420 -47634 -83110 -75284 -72458 -4695 -7830 30557 25825 -12644 -49133 -48726 -85824 2672 67262
16407 67262 108241 84897 25422 -65000 -84511 -74359 -41132 -22876 -5235 -14689 -5265 3524
16395 3524 -20320 -23816 -25949 3615 53976 95903 93828 10600 -50817 36094 107861 59559
16383 59559 15775 19295 8968 21373 -5607 -28160 -54237 -93355 -8999 49658 11235 -5598
16371e598P2227N641o4206K3641L2549J3918L6958K217k657j5633K546l1253j417
16358F8933r756q3907n2992m8826J8680Q3106k1154j9392K6255Q9698N9554j6673
16346I3526q54m2186l6342m0954l8418m0412P1156O1609J8060o6427K2162R828
16334A0748j1515N8528O3076n124q3727o4229K8288m5832k6448R2124K5858p2557
16322c0810o4520j8123N9810K4192O5075j3451L1340N6072K9571o0021j01883
16311b2748l3482J8658R6J9395O2185j4761k5239L282k8668l0417p9118M8969
16299h1848R5045n639m9409M2279m2p7855l5145M5304N0121L1297L2265J1129
16287E7502k6721m0500N501k9896n6805m508R6619K2361j445j1983p905L7895
$$ plain form
16371 -5598 66629 72270 8064 31705 64254 78172 115130 117347 114690 99057 101603 70350 68933
16358 68933 59177 -24730 -77722 -126548 -107868 -24762 -45916 -65308 -39053 50645 110199 93526
16346 93526 92672 50486 14144 -26810 -65228 -105640 -34484 27125 45185 -21242 920 10748
16334 10748 -767 57761 120837 115713 31986 -32243 -3955 -49787 -76235 15889 41747 -30810
16322 -30810 -95330 -113453 -53643 -29451 35624 22173 53513 109585 139156 79135 -22748
16311 -22748 -56230 -37572 -37476 -18081 44104 29343 4104 7386 -21282 -51699 -130817 -81848
16299 -81848 13197 7558 -41851 428 386 -77469 -112614 -67310 -17189 14108 46373 57502
16287 57502 30781 -9719 -4218 -34114 -90919 -95427 1192 23553 22108 10125 2220 40115
16275D0115k8606o4894n2217l293O6645N5984k578J5172J01612K0947m2245p3196
16263C3446n820m137o2765O814P0293j5542j4843K2264O4861j1508p8237k7744
16251b2918L7779L5122L6464n0389j2502K8414N5434J10146J1695n2462m0618
16240A36165J2311r7875l3054K2649K2280k1772k5215l066j1078j5312N674P087
16228a206l1143K5343N4227l2105M510L0979n213K2509k9525n6576N2899L0559
16216F5258n242J1204L8519N4999M041j56869p2813M3984l4881l520k8848R986
16204g4182N6638M8456O3353N427m0951K2593m2086p6486K5496N4739l6555K9909
16192C6351k5525q1906J0948M4788L6588K2920J6209J4145L9954M246l7716j1386
$$ plain form
16275 40115 11509 -53385 -105602 -108895 -42250 13734 11156 26328 127940 148887 106642 33446
16263 33446 27626 23489 -39276 -32462 37831 22289 7446 29710 94571 83063 4826 -22918
16251 -22918 14861 49983 86447 36058 23556 51970 107404 217550 229245 176783 136165
16240 136165 148476 50601 17547 40196 62476 40704 15489 12423 1345 -13967 -8293 -1206
16228 -1206 -32349 -7006 47221 15116 19626 50605 45392 67901 38376 -18200 34699 65258
16216 65258 60016 71220 109739 164738 168779 11910 -60903 -16919 -51800 -55320 -84168 -74182
16204 -74182 -17544 30912 94265 99692 58741 81334 39248 -37238 -11742 42997 6442 36351
16192 36351 10826 -71080 -60132 -15344 21244 44164 60373 74518 114472 118718 81002 69616
16180F9616j1910k4464n7370J0706R591m997M8321Q455J2884J1576k9979k8870
16168A3559j3590J737O8761K0832L0328N2075l590l2111l503l1124j4026R926
16156I9274m1735J9482j8717J7880J7287m9925n0720M5516P1638M8071J4036o1759
16144A10328K474J5226L3787J6462o7099n1854q9387J594M1448K5847k2929k962
16132A2935K5323R495l4652l3679k1811o678P7075M1377l8403q755K9061K1271
16120G2559m5091n8585J8268l2628K4664k2507L8085J0768n912N623j3643J6856
16108H457j0003r1349k0647L2012k1531n469Q9569M1354j4976o3448k9670N732
16096g9969L5174J20541p9614J1626K1328K854l456j5511k3968K1562k4377r292
$$ plain form
16180 69616 57706 33242 -24128 -13422 -3831 -8828 39493 47948 60832 72408 42429 13559
16168 13559 -31 1706 70467 91299 121627 173702 170112 138001 134498 103374 89348 99274
16156 99274 57539 77021 58304 76184 93471 43546 -7174 38342 109980 158051 172087 110328
16144 110328 112802 128028 161815 178277 111178 59324 -30063 -28469 12979 38826 15897 12935
16132 12935 38258 47753 13101 -20578 -42389 -49067 28008 69385 30982 22227 51288 72559
16120 72559 27468 -31117 -12849 -45477 -20813 -43320 -5235 5533 -379 5244 -8399 8457
16108 8457 -1546 -92895 -113542 -81530 -103061 -108530 -18961 22393 7417 -56031 -85701 -79969
16096 -79969 -44795 75746 -3868 7758 29086 31940 28484 12973 -10995 10567 -13810 -23102
16084b3102m5480l6332M6504O2990o799J2506J9095J4431m0866j6986J07827K0680
16072A14468n9286J0475O663n3341p991j6158k8526M8097P8204Q370j3633q101
16060G9241J5782K4024m5323O677r5927l5646n484O0766j6873K591N6612J4128
16048F0568M251L9847l820J1031j5638j7106M5563k6320q078j770K9761J8034
16036A36323q7420q286j0456l013O1543l3805l2263M5892J9291L5549Q3420l8607
16024A68168p8288K49l1561l4285k8426J05153L1147k7745m2168p4305k0884N4361
16012B1416N8261q727R843m7890j1176L1248l0877p0806M9768J26959m687q4433
16000C8899m0678L2544M7479j5585k1936J4765L0089o3497r435k9915L5755Q3172
$$ plain form
16084 -23102 -68582 -104914 -58410 4580 -2219 10287 29382 43813 2947 -14039 93788 114468
16072 114468 55182 65657 72320 18979 10988 -5170 -33696 14401 92605 100975 87342 79241
16060 79241 95023 119047 73724 80401 -15526 -51172 -56656 4110 -12763 -10172 46440 60568
16048 60568 64819 104666 100846 111877 96239 79133 124696 98376 90298 88528 118289 136323
16036 136323 48903 40617 30161 27148 88691 54886 22623 68515 87806 123355 206775 168168
16024 168168 89880 90129 58568 24283 -4143 101010 132157 104412 62244 -12061 -32945 21416
16012 21416 79677 70950 80793 32903 21727 52975 22098 -48708 1060 128019 123332 38899
16000 38899 -1779 30765 78244 62659 40723 55488 85577 22080 12645 -17270 18485 101657
15988A01657J1797r6053J6505P0606R607l9191l0590N332m119L1808M945n2678
15976B9626J2407M632l7123k4241J1591N2549p6277j8299O6146K9267K6127O6803
15964A43208j5052k025j2004O8177l3177n7143q8638j6787P1312O6753k3984j9257
15952H1383Q381K6035l95o2120j2617n577o578P2159j5374K589n2325j0441N2293
15939G7413j8184M4868j0991L7915k1319k3279K1244k3221n6945K1165N1580K6051
15927A26297o0740l5463n5223J0582L3359J03059P1049j08652l8571P4052L6130
15916A55879m5768p1875m1782M6899L4227j4255q61K3475l8971k5722Q4564m6573
15904E9237o9451k3106N5213L2175k0292k6280M1442L3112J310Q4420J0523l758
$$ plain form
15988 101657 113454 17401 33906 104512 114119 74928 44338 49670 45551 77359 82304 29626
15976 29626 42033 46665 9542 -14699 -3108 49441 -26836 -45135 21011 50278 76405 143208
15964 143208 128156 126131 114127 182304 149127 91984 3346 -13441 57871 124624 100640 81383
15952 81383 89764 115799 115404 53284 40667 35090 28512 100671 85297 87886 35561 25120 77413
15939 77413 59229 104097 93106 131021 109702 86423 107667 84446 27501 48666 100246 126297
15927 126297 65557 30094 -25129 -14547 18812 121871 192920 84268 45697 119749 155879
15916 155879 110111 38236 -3546 43353 77580 63325 62464 85939 46968 21246 105810 59237
15904 59237 -10214 -33320 21893 54068 33776 7496 48938 82050 83360 167780 178303 174545
15892A74545J7377J0199O82j5243m7866L8564l0081L665L5860R3266l4r843o5735
15879B05356l5738o2469J9240J2946l5023l4415J01353L2692l5644o0287m0727
15868F7284P2292m8857l2376Q4985q451j5311K681J2813k0358m4240M140k4845
15856D9757K4103M6084M6557k2893l2376N1999J5310l4388k8785k1680K9204N658
15844A28550M2567j3489P8887L6093n9046k8724K9L2516N9954P4052j2814J5420
15832C53995J02278M0581Q3677N0600p180J19500M6046R1016R2925J35650K18186
15821A327274J27618O0213K05010J02543J31364J49508R5536Q6224M8941J5898
15811B350129l8420J584o3137p9096j08836j60801j74472n8001j40938r3568n4548
$$ plain form
15892 174545 191922 202121 202803 187560 139694 178258 148177 151842 187702 280968 280934 271091 205356
15879 205356 169618 107149 126389 139335 104312 69897 171250 203942 168298 108011 67284
15868 67284 139576 90719 58343 143328 134877 119566 122247 135060 114702 70462 74602 49757
15856 49757 73860 119944 166501 143608 111232 163231 178541 144153 115368 93688 122892 128550
15844 128550 171117 157628 236515 272608 213562 184838 184867 217383 277337 351389 338575 353995
15832 353995 456273 496854 580531 631131 623951 743451 789497 880513 973438 1109088 1327274
15821 1327274 1454892 1515105 1720115 1822658 1954022 2103530 2199066 2285290 2334231 2350129
15811 2350129 2311709 2313293 2250156 2171060 2062224 1901423 1726951 1668950 1528012 1434444 1379896
15800A379896j37908j30481j0009m3496j20041m1313j7180p9984j7787Q72n2374
15789G30195o093M4627J3127o2237M2996J7597l269N2251N3002m1762q9533n9182
15777F91719n1778N4255N0251r633l5663l0664l4564l7351o7207j2770j2240R3185
15765E97540r635l0546p589o8934o4476l9132K586j3486L4649J0798l2444j027
15753C78304j074k1794M7761j3474j7829Q4246Q610n2677l1155j7715K7188N080
15741C95471p6697j05845N3461O527M4712M0845L0808l0156l1407p2286J790J4631
15729B71854m6488J8512J4092N8676J00704O3088J0844j23174l4891l9178l8904
15718B55135J4338n3473J049K700J1662J00942M0691L7703p0083m5658k2895n3534
$$ plain form
15800 1379896 1241988 1111507 1101498 1058002 937961 896648 879468 799484 781697 782569 730195
15789 730195 724102 768729 781856 719619 762615 780212 776943 829194 882196 840434 750901 691719
15777 691719 639941 694196 744447 734814 699151 668487 633923 596572 529365 516595 504355 597540
15765 597540 587905 557359 549770 480836 416360 377228 379814 366328 400977 411775 379331 378304
15753 378304 377230 355436 403197 389723 371894 456140 464750 412073 380918 363203 390391 395471
15741 395471 318774 212929 266390 272917 317629 358474 389282 359126 327719 255433 257223 271854
15729 271854 225366 243878 257970 316646 417350 480438 491282 368108 333217 294039 255135
15718 255135 269473 216000 217049 219749 231411 332353 373044 410747 340664 295006 272111 218577
15706B18577l8142j2927K2514n2910J4054P4643J8066M9727O987j7577o948J062
15694B77126Q660r987p2810m1435K0895N4697J092L8039l3999j5186P4221N7306
15682C58619j3184O0484O2374o6811j12721j02798N2457O7964j2109N771m1972
15671B58074k9396l7073L5739M4959L7505m873J7877N9517p1641n3387Q8885P261
15659C53447q573K0999O492J5184P796n0595M4144J9720j1844p9405N3640P6271
15647D47276N7907L3481N7814L9142n3297k316P0905J2134q8860o882j6522N5832
15635F06614L8458O2239R6j3104j6879M2300J00700P7832j6853l6299q952J6800
15623H52952J8644m2613l1127k3549K2335O0271J4886J8326K3599O248L6843l5442
$$ plain form
15706 218577 180435 167508 190022 137112 151166 225809 243875 293602 300589 283012 276064 277126
15694 277126 285786 275799 202989 161554 182449 237146 238238 276277 242278 227092 301313 358619
15682 358619 345435 405919 468293 401482 288761 185963 238420 306384 294275 300046 258074
15671 258074 228678 191605 227344 272303 309808 304935 322812 382329 310688 257301 346186 353447
15659 353447 344874 365873 372365 387549 395345 344750 388894 408614 396770 317365 371005 447276
15647 447276 505183 538664 596478 635620 582323 580007 650912 663046 574186 567304 550782 606614
15635 606614 645072 707311 707407 694303 677424 719724 820424 898256 881403 845104 836152 852952
15623 852952 871596 828983 797856 774307 796642 856913 871799 890125 913724 919972 956815 921373
15611I21373K5521k8664R919L4088m28M0562m6161o1041L7290q842n3980n2531
15599H17106n0083n8997j0513j0146j2644m9415k3212P9729o316q5010o0944P160
15587E36715M2816K0527l606N0413N092l7185n0622m683R841M0041r7787m5932
15575D65630N0871K0722J3839K6476M7090J05291J1327j4444n4336K3042N2395
15564G47903O7106k1819j0660m9760J5156J4008R921L9264K9822J2434J5112j0414
15552H58073K371n9745m9502L7964N8417o5065L0194K8438o7296J8017K6756M2983
15540H61605k1223j125r31k5924J864N5408j5652O844l387O726p104O9052M8326
15527I74479r066k7685j9633k068M0117J6349o4224J0876L137L3148L9693k415
$$ plain form
15611 921373 946894 918230 928149 962237 961809 1002371 956210 895169 932459 923617 869637 817106
15599 817106 767023 708026 697513 687367 674723 625308 602096 681825 675509 590499 529555 536715
15587 536715 579531 600058 596452 646865 651957 614772 564150 559467 569308 609349 511562 465630
15575 465630 516501 537223 551062 577538 624628 729919 741246 726802 672466 695508 747903
15564 747903 815009 793190 782530 732770 747926 761934 771855 811119 840941 853375 868487 858073
15552 858073 860444 800699 751197 789161 847578 782513 812707 841145 773849 791866 818622 861605
15540 861605 840382 839257 838326 812402 814266 869674 854022 860866 857479 864205 857101 926153 974479
15527 974479 965413 937728 918095 916027 956144 972493 908269 919145 922282 955430 995123 992708
15515I92708k2088k6813j5740P0968N8280l9486J428K0510k004l9499M1628J19183
15503A159075l3342R193L4995O8200J7517j3752M8637K7636J27805O7393L556
15492A516913m2936J1574N9303N358k2349n9569j2789M4665J25925J37414J2879
15481A776388P191k8737j0568j822K5664M3877O2508R0286O6112k4025L3539O9583
15469B109996J8853N408M6116J17093J39083P5963J66241J67925R2211N9437N0713
15458C049039J47701J59028J25403Q5567J15306J01458R5116J16893Q2600J17249
15448D195360J33193J23833J72438J22329R7561J05010Q4469R8868J38854J43459
15438E415374J16246J55255O3654p927O9423J82263J99399K33127J41488P4023
$$ plain form
15515 992708 970620 943807 928067 999035 1057315 1017829 1019257 1039767 1037763 998264 1039892 1159075
15503 1159075 1125733 1134926 1169921 1238121 1255638 1241886 1290523 1318159 1445964 1513357 1516913
15492 1516913 1473977 1485551 1544854 1550212 1527863 1468294 1455505 1500170 1626095 1763509 1776388
15481 1776388 1783579 1754842 1744274 1742452 1768116 1811993 1874501 1964787 2030899 2006874 2040413 2109996
15469 2109996 2128849 2134257 2180373 2297466 2436549 2512512 2678753 2846678 2938889 2998326 3049039
15458 3049039 3196740 3355768 3481171 3566738 3682044 3783502 3878618 3995511 4078111 4195360
15448 4195360 4328553 4452386 4624824 4747153 4844714 4949724 5034193 5133061 5271915 5415374
15438 5415374 5531620 5686875 5750529 5742602 5812025 5994288 6193687 6426814 6568302 6642325
15428F642325M7725J67629K00594J57022J40200R2556J71288K32967J39447J36167
15418H127920J36282K66430K43111J33519J48383K50606L23122L77753L84736
15409A0391862L41490L49711L29804M34711N69446N97428O16161N93959O62247
15400A4886819P54826P45103Q76077R76382J069457J289542J461578J595535J879720
15391B5535039K122020K403179K850139L322806L939057M622357N350627O225519
15383E6370743P335967Q614546J0311446J2358033J4841036J7888934K1519781
15376A49240486K5626865K9935542L3886511L6998285L8820872L8543696L5861895
15369C88914152L0694867K3391903J4291474M515834n500467j4662585k2106328
$$ plain form
15428 6642325 6690050 6857679 7058273 7215295 7355495 7448051 7619339 7852306 7991753 8127920
15418 8127920 8264202 8530632 8773743 8907262 9055645 9306251 9629373 10007126 10391862
15409 10391862 10733352 11083063 11412867 11847578 12417024 13014452 13630613 14224572 14886819
15400 14886819 15641645 16386748 17262825 18239207 19308664 20598206 22059784 23655319 25535039
15391 25535039 27657059 30060238 32910377 36233183 40172240 44794597 50145224 56370743
15383 56370743 63706710 72321256 82632702 94990735 109831771 127720705 149240486
15376 149240486 174867351 204802893 238689404 275687689 314508561 353052257 388914152
15369 388914152 419609019 443000922 457292396 461808230 456307763 441645178 419538850
15362D19538850k7491228l0636386l1539102l0667105k8429524k5461992k2150739
15355B23162774j8928749j6091500j3546283j1534602r824329q450978p353092
15348A37433241o323000n497082m891522m287601l727220l289585k839723k346248
15340A04231260k035622j775281j677972j528707j489624j533163j650443j774504
15332I0765944j948792k177504k451107k680338k826466l006522l022703l101881
15324F9550631l129411l074089l052236k942320k756920k719271k722663k555222
15316D6598499k281503k230392k140722k106395j974046j860094j721569j644190
15308C0639588j566481j557746j438428j290321j219256j159490j010779j048284
$$ plain form
15362 419538850 392047622 361411236 329872134 299205029 270775505 245313513 223162774
15355 223162774 204234025 188142525 174596242 163061640 153237311 144786333 137433241
15348 137433241 131110241 125613159 120721637 116434036 112706816 109417231 106577508 104231260
15340 104231260 102195638 100420357 98742385 97213678 95724054 94190891 92540448 90765944
15332 90765944 88817152 86639648 84188541 81508203 78681737 75675215 72652512 69550631
15324 69550631 66421220 63347131 60294895 57352575 54595655 51876384 49153721 46598499
15316 46598499 44316996 42086604 39945882 37839487 35865441 34005347 32283778 30639588
15308 30639588 29073107 27515361 26076933 24786612 23567356 22407866 21397087 20348803
15300B0348803j012849j001597q57969q36046p87207q40328o97915p02971o74341
15291A2937580o36668n15875n46125n40963n19645m33811m24865m34644m61274
15282H423710l87386l67371l10574l09543l62912k95365k95650k77863k63103
15273E553943k58821k05080j24450k41469k25119n8108n5645j78691j68077j04326
15263C934157n7940j61511q3836j77008k38108j03272l7878l1962l6600l7055
15253B968987j8748m6043r2313p5831n3516l6538k9660k4935q0169n2637n6287
15242B402310q4769p7717m2680l38m1311p8431N1061k1018J9491m7301m8470n6655
15230A974172p1182r5392p7040m8279p8351o7461J26613L1571j269j3164m6766
$$ plain form
15300 20348803 19335954 18334357 17476388 16640342 15853135 15012807 14314892 13611921 12937580
15291 12937580 12300912 11785037 11238912 10697949 10178304 9744493 9319628 8884984 8423710
15282 8423710 8036324 7668953 7358379 7048836 6685924 6390559 6094909 5817046 5553943
15273 5553943 5295122 5090042 4965592 4724123 4499004 4440896 4385251 4206560 4038483 3934157
15263 3934157 3876217 3714706 3630870 3453862 3215754 3112482 3074604 3042642 3006042 2968987
15253 2968987 2950239 2904196 2811883 2736052 2682536 2645998 2616338 2591403 2511234 2458597 2402310
15242 2402310 2317541 2239824 2197144 2196806 2155495 2077064 2128125 2107107 2126598 2079297 2030827 1974172
15230 1974172 1902990 1807598 1730558 1682279 1603928 1536467 1663080 1694651 1693382 1680218 1633452
15219A633452k0310j7767L6005m4292l6965P0464l9812o4075N3250N6482J753
15208A628185p423L0910Q483K1385J3792J12049P1098P6194R2078N5185j4245
15197B087691R288k0695J04026j7087M2417O5481m3197j05846k2676J70280R4407
15186B364089m021n7886k6713n2540n4559k0957J7094N812m732r074n0770n1400
15174B054343p7984o042M0971L4029l4600N6406N2008J28218O3866J10959K02670
15163B624844K09069J99499K41019K30727K64534K94224L21416N01592M63781
15154E350705M81429M20667L47626K74376J13066m705j28045k56307k88476l06242
15144F004094m21515l93087m26761m26902l15506l17403l17305k47091n4441j33147
$$ plain form
15219 1633452 1613142 1595375 1631380 1587088 1550123 1620587 1580775 1516700 1569950 1626432 1628185
15208 1628185 1620762 1651672 1660155 1681540 1695332 1807381 1878479 1954673 2046751 2101936 2087691
15197 2087691 2096979 2076284 2180310 2163223 2205640 2271121 2227924 2122078 2099402 2269682 2364089
15186 2364089 2360068 2302182 2275469 2222929 2168370 2147413 2164507 2170319 2165587 2156513 2105743 2054343
15174 2054343 1976359 1970317 2011288 2045317 2010717 2067123 2119131 2247349 2311215 2422174 2624844
15163 2624844 2833913 3033412 3274431 3505158 3769692 4063916 4385332 4886924 5350705
15154 5350705 5832134 6252801 6600427 6874803 6987869 6983164 6855119 6598812 6310336 6004094
15144 6004094 5582579 5189492 4762731 4335829 4020323 3702920 3385615 3138524 3084083 2950936
15134B950936j82909j65026j21811l3601l7237r5484j01594r4057r8369o7651
15124A953197n2841J720j2486l6024J1057j5025k8982l9588n763j655o0469r5418
15112A617723r1616q950m5256o4395O568J4236j9353j1619p4193j01665r4844
15101A126636o0166J9002l5449M4907j07163j37143q4050q1891J5068n1704q7210
15090E60837m5539l9483k9984K232K1950l7964k0158N0516M6852J5589j2590m8187
15078D64071j09284o2884M6294P2434Q5177p846o070l8203o2683j3999m0638K3662
15066C50031N3903m2015l9318J6923m0658L6562M8751l5440r942K5841k253q023
15054C54362J7081j3099j3584J7128O488L1814L1581M9427j7681l1568R677k429
$$ plain form
15134 2950936 2768027 2603001 2481190 2447589 2410352 2314868 2213274 2119217 2020848 1953197
15124 1953197 1900356 1902076 1889590 1853566 1864623 1849598 1820616 1781028 1775265 1773610 1713141 1617723
15112 1617723 1526107 1517157 1471901 1407506 1414074 1428310 1408957 1397338 1323145 1221480 1126636
15101 1126636 1066470 1085472 1050023 1094930 987767 850624 766574 684683 699751 648047 560837
15090 560837 515298 475815 445831 448063 470013 432049 411891 462407 509259 524848 512258 464071
15078 464071 354787 291903 338197 410631 495808 487962 481892 443689 381006 367007 326369 350031
15066 350031 403934 361919 322601 339524 298866 335428 384179 348739 338797 364638 362385 354362
15054 354362 371443 358344 344760 361888 368376 400190 431771 481198 463517 431949 441626 439197
15042D39197j2491k3618L7582M727m892j9280n0351k7494N8210l1859m0192N9695
15030C89234L1046j8190k2902j4089j2236P837j252M2941L5829n6201q412l6865
15018C36740j4220L8225m4865j8690k292j4247q2693m3854P9974J6848m7462K3954
15006B27418J3102l1539j3510m1880N0666K7584j04298m802L8326N3430M1963
14995B56460o1659m6101n8383J5107J08639M1180K3787r875k8040Q4935J0321
14984C36371r243J6530n1233r2129j1826M4346k1184p5040k115j5703m0986M2097
14972A19885j2027L7904k3727r0596P4496L6029p5235O75j2416N813K0008l6607
14960D4202K9137M7458L5863K1403J0913k9042o492L5224l3434j9801R656k5464
$$ plain form
15042 439197 426706 403088 440670 445397 440505 421225 370874 343380 401590 369731 329539 389234
15030 389234 420280 402090 379188 365099 352863 360700 359448 402389 438218 382017 373605 336740
15018 336740 322520 360745 315880 297190 294898 280651 197958 154104 234078 250926 203464 227418
15006 227418 240520 208981 195471 153591 204257 231841 127543 122741 161067 214497 256460
14995 256460 194801 148700 90317 105424 214063 255243 279030 269155 241115 326050 336371
14984 336371 327128 343658 292425 200296 188470 232816 211632 136592 134477 118774 77788 119885
14972 119885 107858 145762 122035 31439 105935 141964 66729 67404 54988 60801 80809 44202
14960 44202 73339 120797 156660 178063 188976 159934 153442 188666 155232 135431 145087 119623
14948A19623r951O093J08756K1735l0390j5834P0811k9098m0292j0399K9947j024
14936B19977q483K1610L9833P1112Q8919J06684J0995M7263j6908Q1114J38176
14925H00292k799Q6911J74351O4461J36923J74185J59850J01072J09677J29802
14915A934725J26042M4268l8152n9337j8556K7974o9576j41245j00842j05476
14905A599825o8611j32012j69466k40m517n1530r2670o7343p0569J7058o4285
14894H95640p109j6783p779j20868q9557N4250K4579K5420m9312l0898p941j05534
14882E64108n1215j0160K6202O5186p408P730k7464l2482k0740j8914k9653r4626
14870C70564m4730N2656n1633k5229P5909k4056k3697l7582j6603n75L5303l6672
$$ plain form
14948 119623 109672 115765 224521 246256 215866 200032 270843 241745 201453 191054 221001 219977
14936 219977 211494 233104 272937 344049 432968 539652 550647 597910 581002 662116 800292
14925 800292 797493 884404 1058755 1123216 1260139 1434324 1594174 1695246 1804923 1934725
14915 1934725 2060767 2105035 2066883 2007546 1988990 2016964 1947388 1806143 1705301 1599825
14905 1599825 1531214 1399202 1229736 1229496 1224979 1173449 1080779 1013436 942867 959925 895640
14894 895640 888531 871748 863969 743101 653544 707794 732373 757793 708481 677583 669642 564108
14882 564108 512893 502733 528935 594121 586713 594443 566979 534497 513757 494843 465190 370564
14870 370564 325834 378490 326857 301628 377537 353481 329784 292202 275599 275024 310327 273655
14858B73655k3675q8709o1162k6011m3888j5821M6121L4788J3318J4128O8236
14847A90980J8046l6146n2643M4702n5013j4212l4803R528J1550L6797P2815M9314
14835B40915m3879n9208r289N865M6569j4736j5878N43q6792K183J08990j185
14823A74098q874n7898k2634j2532M5349k1137o6301j5397j1491n4918l0743L5695
14811d6783R0509O0224P4442K6496k0364m0676q3006n0353j2962L1783l083J9688
14799D5915K5941k4106L043N8709l060p5256m4519J1212k5460P0458M5385j3258
14787G5004k8623J2977k5927P5987k4950Q2828J1749o303j07902p4279j104r553
14775b0096J09060P9348M6452J2104l5811r9245k5377L1545l1380M3940l4521
$$ plain form
14858 273655 249980 161271 100109 74098 30210 14389 60510 95298 108616 122744 190980
14847 190980 209026 172880 120237 164939 109926 95714 60911 70439 81989 118786 191601 240915
14835 240915 197036 137828 128539 134404 180973 166237 150359 150902 64110 66293 175283 174098
14823 174098 165224 107326 84692 72160 117509 96372 30071 14674 3183 -51735 -82478 -46783
14811 -46783 43726 103950 178392 204888 184524 143848 60842 10489 -2473 29310 26227 45915
14799 45915 71856 47750 50793 109502 106442 31186 -13333 -2121 -27581 42877 88262 75004
14787 75004 46381 59358 33431 109418 84468 167296 179045 172742 64840 -9439 -10543 -20096
14775 -20096 88964 168312 214764 226868 191057 91812 66435 97980 66600 110540 76019
14764G6019o1058n2013r406m7732L2342R7938O8300l7002p1614l4891O6473k6424
14752I32k4582k4747K2758r1916m0316M5493N5637L2048O1678L8792k9548o68
14740D5561M9173k9124J234l291L7438K3909o4752l3553j1762J7503m665m9327
14728b1656l1069k9941p142K917M2128J13293O0164j51413r7042K1220L0411N6852
14716a1278k2464r539j846P1152m2676l8371m3284L0690O4495j4518K8445Q461
14704A9267p9217L246N544l218L6363j7313n0909N630N177N5599P8801M9063n6695
14691E1338o939L3778J4229p4729o1349Q4524O9781j2694m1331q301n221k3266
14679A9820n0034j5912K6665j1839K0997L2047k2148L0501P2228K1343r0779l8219
$$ plain form
14764 76019 14961 -37052 -46458 -94190 -61848 36090 104390 67388 -4226 -39117 27356 932
14752 932 -23650 -48397 -25639 -117555 -157871 -112378 -56741 -24693 36985 75777 46229 45561
14740 45561 94734 65610 66844 63553 100991 124900 60148 26595 14833 32336 27671 -21656
14728 -21656 -52725 -82666 -89808 -86891 -44763 68530 128694 -22719 -119761 -98541 -68130 -11278
14716 -11278 -33742 -43281 -45127 26025 -16651 -55022 -98306 -67616 -3121 -17639 10806 19267
14704 19267 -59950 -56704 -51160 -54378 -18015 -35328 -86237 -80607 -75430 -19831 58970 108033 51338
14691 51338 44399 78177 92406 17677 -43672 40852 110633 97939 56608 48307 43086 19820
14679 19820 -30214 -46126 -19461 -31300 -10303 21744 -404 30097 102325 123668 32889 -5330
14667e330k2422K0095J5354n1945n5462J4415L2897l7164k257K5655n2955N225
14655a13894M9207J3346K2978M7114N5297J6990k162k8892J6957J1738l0414k4515
14643C3750j632J4295m0584P042k79L2866k771n692l4276p091O495o2365q260
14630f8502K0294O6155q684m3565p3125r287P4576J1018j9861m9646L4625L7174
14618b8828l7708j7912N8608L5469M508O008l5804o1903Q8054J8166l0509j4209
14606a6060M0539j0442l7248P8407m1023r9117l9965J7256l1548N72L7097J6622
14594h4910j2953j6862J9706k8170N5613J0937K9155M0658K1704j1929p63q9854
14582f7668l0206N7822P907K5582L0545k8930p149r6782J6119j5004j7454n521
$$ plain form
14667 -5330 -27752 -7657 7697 -44248 -99710 -85295 -52398 -89562 -91819 -66164 -119119 -113894
14655 -113894 -64687 -51341 -28363 18751 74048 91038 88876 59984 76941 88679 58265 33750
14643 33750 32118 46413 5829 12871 12592 45458 42687 36995 2719 -4372 2123 -60242 -68502
14630 -68502 -48208 17947 9263 -34302 -107427 -116714 -42138 -31120 -50981 -100627 -66002 -28828
14618 -28828 -66536 -84448 -25840 9629 14137 20145 -15659 -77562 10492 28658 -1851 -16060
14606 -16060 24479 14037 -23211 55196 14173 -84944 -124909 -107653 -139201 -138629 -101532 -84910
14594 -84910 -97863 -114725 -95019 -123189 -67576 -56639 -27484 13174 34878 22949 22186 -67668
14582 -67668 -97874 -40052 -32145 -6563 23982 -4948 -12097 -108879 -92760 -107764 -125218 -130739
14570a30739J5950R148j0353k5330N5594m2523m8083l3825l3604P59Q2230O854
14558a53922O037Q0923M2987N0364M2866k1100m8888j1821M6173j2685m0662N5735
14546C6007L205J3522n83m0528l1317J09141J9035o2057q6648q22K2205P3725
14534E4885J19189M7408K0753J2802M5108l3688o0176L2625R4950J8025k5239
14523C26642l6353j03985n4485j5652L1778L9273L0657o5054K0594l2242m7471
14512I3702N3470J12964m6720q0335l4162m6353K9140L3697l5227n575j9504P1667
14500A26764J3851k1910m7827j6047J6415K6402m4250l4812n576P546J2558m1062
14488g948n1190o841J15253N3341n0478m254M7976K5029l6373n2469l6675P2804
$$ plain form
14570 -130739 -114789 -105641 -115994 -141324 -85730 -128253 -176336 -210161 -243765 -243006 -160776 -153922
14558 -153922 -147885 -66962 -23975 26389 69255 48155 -733 -12554 33619 20934 -19728 36007
14546 36007 39212 52734 52151 11623 -19694 89447 108482 46425 -40223 -41045 -18840 54885
14534 54885 174074 221482 242235 255037 300145 266457 206281 238906 333856 351881 326642
14523 326642 290289 186304 131819 116167 147945 187218 217875 152821 173415 141173 93702
14512 93702 147172 260136 213416 133081 98919 52566 81706 115403 80176 74601 55097 126764
14500 126764 140615 118705 70878 54831 71246 97648 53398 18586 13010 20556 33114 -7948
14488 -7948 -59138 -65979 49274 102615 52137 47883 95859 120888 84515 32046 -4629 68175
14476F8175P914r501q909k7729l6254o8533Q4208j172o3026Q5605P2619J2249
14464A15646k0584J5313K6055M8567J6609n4298k0248o3547j535K7251l717L3373
14452A18885J5708r9349k486O4642L4504l5691k8748N908k735k1754N2137k192
14440I8829J0727l2469j7701o8226j2903L5562L4020O4686J0122j8059R375l2864
14428H1099M660K2809O2557N3029J6940l3432R880O8689L6123K8126J1763K128
14416C64371m6842j21202p1725k1901J0480m7318L5370N697N8715l9555k6305
14405I9785n4523K2587p3726J2314P4430K5078p4852J7524p542k426P408J1010
14393E7067N0511P7860j3389j02796m2885O0543J588k7279K1489p9860p7344m8875
$$ plain form
14476 68175 76089 66588 57679 29950 -6304 -74837 9371 8199 -54827 30778 103397 115646
14464 115646 95062 110375 136430 184997 201606 147308 127060 63513 61978 89229 85512 118885
14452 118885 134593 35244 32758 97400 131904 96213 67465 73373 70638 48884 101021 98829
14440 98829 109556 77087 59386 -8840 -21743 13819 47839 112525 122647 104588 113963 81099
14428 81099 85759 108568 171125 224154 241094 207662 217542 286231 322354 350480 362243 364371
14416 364371 317529 196327 124602 102701 113181 65863 101233 106930 165645 126090 99785
14405 99785 45262 67849 -5877 6437 80867 105945 31093 48617 41075 38649 46057 57067
14393 57067 107578 185438 172049 69253 26368 86911 88499 61220 82709 2849 -74495 -123370
14381a23370O2505M0068n3930l1620n34R6794K7114l5982o2891J7641M5091J8881
14369b33O1094L5387K1547q2230m6032m1491q635K8148J1189J3349N0788j3660
14357B9221J2633n1272q8521O1131O8817o4027j4312l7489l9883J3513P2110K948
14345c5131m4095k2680J7814o7193J5174L4709J5804k6834M339J6294k4565J0536
14333a05828k7943L3377Q4362K0857p5583Q3730K6431k3251o3601K736m850n8329
14321a07892M5452N6341J2107K1968l2512O5330K6370K857k4913R993m618k8211
14309D2272m1799k6782n393j3825J4640K1037J7764K9285K0698q0479M333j2111
14297c0360l5283K5551L2605n2013q059J32688L4117k9407L782l2845j2268n887
$$ plain form
14381 -123370 -60865 -20797 -74727 -106347 -106881 -10087 17027 -18955 -81846 -64205 -19114 -233
14369 -233 60861 96248 117795 35565 -10467 -51958 -60593 -32445 -21256 -7907 42881 29221
14357 29221 41854 -9418 -97939 -36808 32009 -32018 -46330 -83819 -123702 -110189 -38079 -35131
14345 -35131 -79226 -101906 -84092 -151285 -136111 -101402 -85598 -112432 -108093 -91799 -116364 -105828
14333 -105828 -133771 -100394 -16032 4825 -70758 12972 39403 16152 -47449 -44713 -49563 -107892
14321 -107892 -62440 -6099 6008 27976 -4536 60794 87164 90021 65108 75101 70483 42272
14309 42272 473 -26309 -31702 -45527 -30887 -9850 7914 37199 57897 -22582 -18249 -30360
14297 -30360 -65643 -40092 -7487 -59500 -67559 65129 99246 69839 73621 40776 28508 22621
14285B2621M7369p1766n3385l868J00761P7573j248q7143o6749L1915r6860l9258
14273a40038K0660m3939K6900Q6402K7739K2869Q9815L7356m1415o0441o1689
14262c5781k6332j1326L8981l4035k8224K4571M8120l260k0698L9492N9433L3227
14250H4168m8300l0264l7789p6320l8310N8007R602k7454J2582O4355M6419K2904
14238C9600k0466N5015o994r7429j7838R597M6173k4221k0044m5069K754J7449
14226f1473n3056N4894j395K0657M4365M847l920n738o8650k5964m1624j2224
14214a49281M9541K2083l3867L5825P9394M099k0429K3087l1567J603L4373k4090
14202i229J5962m3529K2507n6614j1318j7833J1371N238P8959O7648n1781k1101
$$ plain form
14285 22621 69990 -1776 -55161 -59029 41732 119305 118057 30914 -35835 -3920 -100780 -140038
14273 -140038 -119378 -163317 -136417 -50015 -22276 593 90408 127764 86349 25908 -35781
14262 -35781 -62113 -73439 -34458 -68493 -96717 -72146 -24026 -27286 -47984 -8492 50941 84168
14250 84168 35868 5604 -32185 -108505 -146815 -88808 -79206 -106660 -94078 -29723 16696 39600
14238 39600 19134 74149 67155 -30274 -48112 -38515 7658 -16563 -36607 -81676 -78922 -61473
14226 -61473 -114529 -59635 -61030 -40373 3992 8839 4919 -819 -69469 -95433 -137057 -149281
14214 -149281 -99740 -77657 -111524 -75699 3695 7794 -12635 10452 -21115 -19512 14861 -9229
14202 -9229 6733 -36796 -14289 -70903 -82221 -100054 -88683 -83445 -4486 63162 11381 -9720
14190i720L3098L7243R393m0307n6474j0096N4837K8812m9828o9710q3688j4978
14178a71418N0448k5216j3819K9506M5383L3462J3179m2833m954j1264j3540K2508
14166h8558N2277O7373N381o8942k4711l7321o8887M7589m6284j1178N0813L1555
14154i0893j5580L315k8188N8222J4456M3375J9696P442l2230L5328K270o0533
14142d3320k9010m6179k7067Q7318N6360m7984n639L565j4906l0803J3879P7577
14130f209l207p1192K0666R666J0864n4848J2703N1778n8236o5636Q2597Q8650
14118A7596N4415r2933l2566n0087k5728K9677P0764O002q9479j8246P0557K8878
14106c1150K5385J8132m5598R92K1026J0420m9447m4379K6713J16970J3228p0918
$$ plain form
14190 -9720 23378 60621 70014 29707 -26767 -36863 17974 46786 -3042 -72752 -156440 -171418
14178 -171418 -120970 -146186 -160005 -130499 -85116 -51654 -38475 -81308 -86262 -97526 -111066 -88558
14166 -88558 -36281 31092 36473 -32469 -57180 -94501 -163388 -115799 -162083 -173261 -122448 -90893
14154 -90893 -106473 -103158 -131346 -73124 -58668 -15293 4403 11845 -20385 14943 17213 -43320
14142 -43320 -72330 -118509 -145576 -58258 -1898 -49882 -55521 -51956 -66862 -97665 -83786 -6209
14130 -6209 -9416 -80608 -59942 -50276 -39412 -94260 -81557 -29779 -88015 -153651 -71054 17596
14118 17596 72011 -20922 -53488 -103575 -129303 -99626 -28862 -22860 -112339 -130585 -60028 -31150
14106 -31150 -5765 12367 -33231 -32239 -11213 -793 -50240 -94619 -67906 49064 62292 -8626
14094h626n7779j225N7852N3626m4649k4311k4075J9286p9391k2199j476J9859
14082a13108N6744q657l6151o215k3349m10L9925N2450N2246L7279j107k9967
14070A9680n1798P522n3355l4304N8730M4626J6933k1392J4687j3488R727o946
14058i378L0588j1434m0057R516L5229j490J6474q609R428n7121m9758R1613O4343
14045G9344n8173p802k2143L0452j954L7775J9965q8265k7377Q9792O202r5048
14033c7232k6021m4833O5807L7809J5171j5839l3872K7790l0820N8448k0701m549
14021h842j7944N0680L3972p1853o2725j3895R3189J6458L2899P3200K2919l9769
14009A08289p3057k2592o2127P887j1589L4496m6029J8324Q7539K3611K0175O8521
$$ plain form
14094 -8626 -66405 -67630 -9778 43848 -801 -25112 -49187 -29901 -109292 -131491 -132967 -113108
14082 -113108 -56364 -65021 -101172 -107387 -130736 -131146 -91221 -38771 13475 50754 49647 19680
14070 19680 -32118 -24596 -77951 -112255 -53525 -8899 8034 -13358 1329 -12159 -2432 -9378
14058 -9378 21210 9776 -30281 -20765 14464 12974 29448 20839 30267 -26854 -76612 15001 79344
14045 79344 21171 13369 -8774 21678 19724 57499 77464 -10801 -38178 51614 57816 -37232
14033 -37232 -63253 -108086 -42279 -4470 10701 -5138 -39010 -11220 -42040 16408 -4293 -8842
14021 -8842 -26786 23894 57866 -13987 -76712 -90607 2582 19040 51939 125139 148058 108289
14009 108289 35232 12640 -49487 -41600 -53189 -18693 -64722 -46398 41141 64752 84927 153448
13997A53448l4362o5341j396k613k0600L3664L413p0408l3242P6712k2621q9022
13985g2368M7460N3233L3078n7908o0703j7843L4684K4854M2389j1938q669J0797
13973A7066j5112k6133P7624j5055l2361r5200j22073j4083J08054Q1078j0737
13962d6932K180K3706k6991J4534l8880l6254k8149j1930j1900j4741M0842L6990
13950i7525O1851R9266L3249l3378j12007o0901q50k8833j9121Q0885M1895r9062
13938a34531J7063n20j0938K1127M0282L6799J6248K6538n1961k4129l0478P7114
13926a7386N9017k0462p0184n9191O2081P326J4754J0599L3546O709j262L5205
13914F0752n6111p7257l8979j851N1483Q8102k8549J368K6241j4047K7215k2838
$$ plain form
13997 153448 119086 53745 52349 49736 29136 62800 66213 -4195 -37437 39275 16654 -72368
13985 -72368 -24908 28325 61403 3495 -57208 -75051 -40367 -15513 26876 14938 6269 17066
13973 17066 1954 -24179 53445 38390 6029 -89171 -211244 -225327 -117273 -36195 -46932
13962 -46932 -44752 -21046 -48037 -33503 -72383 -108637 -136786 -148716 -160616 -175357 -134515 -97525
13950 -97525 -35674 63592 96841 63463 -48544 -109445 -110295 -139128 -158249 -77364 -35469 -134531
13938 -134531 -117468 -117988 -128926 -107799 -67517 -30718 -14470 12068 -39893 -64022 -94500 -17386
13926 -17386 41631 21169 -49015 -108206 -46125 -38799 -24045 -13446 20100 26809 25547 60752
13914 60752 4641 -72616 -111595 -113446 -61963 26139 -2410 -1042 25199 11152 38367 15529
13902A5529M942l5702k5233j640N7426J9779k199k856k7223k3328O568M3936L4741
13889F4740o0643o1791j6009j0475J5886q108K9271P4033J7470J1754j0966n1913
13877f751P143R59m3837K8485J4692K7826l7400K4974J16457j5882N069j04130
13865A7605j18612j5800K8161L139K7271M3231J8675k7286r050n0929k9376m0961
13853a53932P309n0658J7737j6774J09534L5808L1974J7991M7911j1379K1260
13842E6781l3029p965J7218J9312m159n2391p0158L4216M867J1577L485K4052
13830C806N4862M258p2248m1422J6545M2450M4742J8530m4888n0823k5623j1786
13818f1597l7094k6954o679L854J5145O1527O8808O1647J8270M6366j4713l6185
$$ plain form
13902 15529 20471 -15231 -40464 -42104 15322 35101 32902 30046 2823 -20505 -13937 29999 64740
13889 64740 4097 -57694 -73703 -84178 -68292 -76400 -47129 26904 44374 56128 45162 -6751
13877 -6751 392 1351 -42486 -14001 691 28517 -8883 16091 132548 116666 121735 17605
13865 17605 -101007 -116807 -88646 -85507 -58236 -15005 3670 -23616 -32666 -83595 -112971 -153932
13853 -153932 -146623 -197281 -179544 -196318 -86784 -50976 -19002 -1011 46900 35521 56781
13842 56781 23752 15787 33005 52317 48158 -4233 -74391 -40175 -35308 -23731 -20246 3806
13830 3806 58668 62926 -9322 -50744 -34199 8251 52993 71523 26635 -24188 -49811 -61597
13818 -61597 -98691 -125645 -132324 -128470 -113325 -51798 17010 78657 96927 143293 128580 92395
13806I2395j8509n710m6532k1556m8126k0682K6779L1770N1421k8537k8341l614
13794a9242J0027M8568m2430n0751j5697N3192p723K6599k3801m5538m9336k929
13782a19061K8732Q9019O4775L361l5347n2448J8284n791J7715R511r353n06n262
13769C629J9544l4689m9639M967k8481Q2062M2479l8091l3814M2297L5316k8798
13757A6782n015M6246j1359p3815J1661j365k0284l0981k7227n1495k7460M0960
13745a33352J24299J1367n7502L9473k0085K1001k1875K5782O5770J4206k7131
13734D1953n5537j5085M3437j2477K9498j788j1967q545o1519J2149N0806l8113
13722b7188L788K235N2218j3771K4959J4998j5293J5062N6096K981k5972o3763
$$ plain form
13806 92395 73886 68176 21644 88 -48038 -68720 -41941 -10171 41250 12713 -15628 -19242
13794 -19242 -9215 39353 -3077 -53828 -69525 -16333 -24056 2543 -21258 -66796 -116132 -119061
13782 -119061 -90329 -1310 63465 66826 31479 -20969 -2685 -8476 9239 18750 9397 8891 3629
13769 3629 23173 -11516 -61155 -56188 -84669 -2607 39872 1781 -32033 10264 45580 16782
13757 16782 11767 58013 46654 -27161 -15500 -16865 -37149 -68130 -95357 -146852 -174312 -133352
13745 -133352 -9053 2314 -55188 -15715 -35800 -14799 -36674 -10892 54878 69084 41953
13734 41953 -13584 -28669 14768 2291 31789 30001 18034 9489 -52030 -39881 10925 -27188
13722 -27188 -23400 -21165 31053 17282 42241 57239 41946 57008 113104 116085 90113 26350
13710B6350o3194n0824O2342K944j6374R347N7496L3974O1952o5387n5267n4157
13698e0798K4150M0474n889o5222j3606Q1220K0309k5022M132J478m4445k7129
13686f0348j9226j1751L6303M5732M0118l6253N9586j1253K0991m3997O238k0282
13674E858n144k0649o063J7532N7889O8698j9518M9759n751n8261J2246J7110
13662A13706n7038j3401j0773K622K5177J3707K3054J1125J0339n7062q3916J4599
13650g861J04512p218k7000L1023J692l5632l1733O2238l3426K6044L6220o3170
13638E5689q7646j4653N4146L1200M7267j5279n6259M0050P5197J1547m0655R487
13626A10091M6904m3671j00831R5934O6772n6107k4952K3579L6967P8034l8461
$$ plain form
13710 26350 -36844 -87668 -25326 -22382 -38756 -29409 28087 62061 124013 58626 3359 -50798
13698 -50798 -26648 13826 7937 -57285 -70891 10329 30638 5616 9748 11226 -33219 -60348
13686 -60348 -79574 -91325 -55022 -9290 30828 -5425 54161 42908 63899 19902 26140 5858
13674 5858 714 -19935 -25998 -8466 49423 118121 98603 148362 142611 84350 96596 113706
13662 113706 56668 43267 32494 35116 60293 74000 97054 108179 118518 61456 -22460 -7861
13650 -7861 96651 89433 62433 93456 95148 59516 27783 90021 56595 82639 118859 55689
13638 55689 -31957 -46610 7536 38736 86003 70724 14465 54515 129712 141259 100604 110091
13626 110091 156995 113324 12493 108427 175199 119092 94140 117719 154686 232720 194259
13615A94259o5896j30571k0831M9651J14110O2725k2045n4989R678J5417p7496
13604G4012l9638N6435k7694j930R120L3907L260N28M6397N128m8885o066L5599
13591A40173l4248K374l901M1831L580N3834k1315k0124n6668M6691J14353K2566
13579B89146m1192j7811J7624M8803L6617J7577l2120Q722j5456n4043m870J5532
13567B68529J6463O1021j7214M415L8092k1274J6367k599j3170m4040o9069k7157
13555B10364O6821M6899n5791O634j9737m5896m1190O747M3331M1319M358M271
13543B68130J0009M5747k8769N1969M8778q3318o0155l7908r956J788O646M4513
13531B57474j6638l3154L2938M0081o7597o1878k2512N5092L4483p691k564L7134
$$ plain form
13615 194259 128363 -2208 -23039 26612 140722 203447 181402 126413 136091 151508 74012
13604 74012 34374 90809 63115 61185 70305 104212 107472 108000 154397 159525 110640 104574 140173
13591 140173 105925 108299 104398 146229 149809 203643 182328 162204 105536 152227 266580 289146
13579 289146 247954 230143 247767 296570 333187 350764 318644 327366 311910 257867 252997 268529
13567 268529 284992 346013 328799 333214 371306 350032 366399 363800 350630 306590 237521 210364
13555 210364 277185 324084 268293 274927 255190 209294 168104 174851 218182 259501 263859 268130
13543 268130 278139 323886 295117 347086 395864 312546 252391 214483 204527 206315 212961 257474
13531 257474 240836 207682 240620 280701 213104 151226 128714 183806 218289 210598 208034 245168
13519B45168o323L688r9911k0563O0012L7907L2772J2667k1643p4781K5362O3367
13507B57722k5001n2379j8765k4300K9609N3734k3295j5271k4338n5595n7158
13496D4963J8634M3802O0728M3500M9565K4904k2212n3294q5444K1914l3467o6822
13484D6771L9461N8661n185k1555O810M5833J8058k6376p8174J3939j9766L999
13472H2476Q8217K4229j2889K3193n8441k1715L1807o20k5563K7057N1606k0226
13460A89131o4296K59L1294L3444L6017j8716q184j5238q1451K6118n0133l0764
13448D7481m6045m9571R3236N6039J1336M1519J2979n6061l3920L6113l0211o1225
13436B1670j173N1270K3711k7027k5116O9082l7784j05996K8640M0336J3333N3585
$$ plain form
13519 245168 238845 242533 142622 122059 182071 219978 252750 265417 243774 168993 194355 257722
13507 257722 232721 180342 161577 137277 166886 220620 197325 182054 157716 102121 44963
13496 44963 63597 107399 168127 211627 261192 286096 263884 210590 125146 147060 113593 46771
13484 46771 86232 144893 139708 118153 124963 170796 188854 162478 84304 98243 78477 82476
13472 82476 170693 194922 182033 205226 146785 125070 156877 156257 130694 157751 209357 189131
13460 189131 124835 125094 156388 189832 225849 207133 198949 183711 102260 128378 78245 47481
13448 47481 1436 -48135 45101 101140 112476 153995 166974 110913 76993 113106 82895 21670
13436 21670 20497 71767 95478 68451 43335 112417 74633 -31363 -2723 37613 50946 104531
13424A04531j1290p9256r6791n2852N1918N0300O7502Q50r4955p4380K8784P3128
13412c2511K3115j4421j3511k0896j9493j7394J8072L5477O5591L6565m9307l7205
13400b5918J6302n5841n4165M5004R9798K7211q396Q997m776k0112Q768k8218
13388H654L3567K8633l0762m4464L0613J3649q213Q0688o241l053j6980j1822
13376G4269n9295O3837k4649m1441p3831q3042M7301N750n885l4831Q2310O9657
13364B0150M5569j5547n1340K2293L466K594l4907m8336K5978K2314M1756M8802
13352H2792j777J9847L0431O380K2330k8519r8573J037J09924M8638j2445n4773
13340A25292j53679k208M0976k0420J9664M4112j89O2918l0706o6336r6046N321
$$ plain form
13424 104531 93241 13985 -82806 -135658 -83740 -33440 34062 34912 -60043 -134423 -105639 -32511
13412 -32511 -9396 -23817 -37328 -58224 -77717 -95111 -77039 -41562 24029 60594 11287 -25918
13400 -25918 -9616 -65457 -119622 -74618 25180 52391 43995 52992 48216 28104 36872 8654
13388 8654 42221 70854 40092 -4372 26241 39890 31677 112365 106124 103071 86091 74269
13376 74269 14974 78811 54162 12721 -61110 -144152 -96851 -91101 -96986 -131817 -49507 20150
13364 20150 65719 50172 -1168 21125 24591 27185 -7722 -56058 -30080 -7766 33990 82792
13352 82792 81015 100862 131293 137673 160003 131484 32911 33948 143872 192510 180065 125292
13340 125292 -28387 -30595 10381 -10039 9625 53737 53548 116466 85760 19424 -76622 -71301
13328g1301O7769P266p3114k2157K4865O0288j7186m1848O1218M4976L276J916
13316D5968k1249J3179Q314q252L160l5058j0473K0269J4516L0610K5060j8110
13304F7934j9403k2571k8449m4568K1296J3438J4579R66M089k8615L3966j574
13292A1088k9823L9075J06761M8037M767n2634o1615j11121J0056N5069r56m5805
13280b7101m7862J1457P2909Q9226k6220j5584l0368l3195k5824k0231M9078N3868
13268E0153K9441o368K2636j23692p1596O8419Q3450M5322r263n6511J788l7170
13256c391J6919N7699r272p7756R937Q7237M3326k1233j955J0465k6296m7642
13244C8038K1458M7865k7308n6105j0557l4201L6226L5708j1389N2603M9184o2437
$$ plain form
13328 -71301 -3532 3734 -69380 -91537 -66672 -6384 -23570 -65418 -4200 40776 44052 45968
13316 45968 24719 37898 46212 37960 41120 6062 -4411 15858 30374 60984 86044 67934
13304 67934 48531 25960 -2489 -47057 -25761 -12323 2256 3222 7311 -21304 12662 11088
13292 11088 -18735 20340 127101 175138 179905 127271 65656 -45465 -35409 19660 18704 -27101
13280 -27101 -74963 -63506 9403 98629 72409 56825 26457 -6738 -32562 -52793 -3715 50153
13268 50153 79594 73226 95862 -27830 -99426 -31007 52443 97765 88502 31991 33779 -3391
13256 -3391 13528 71227 61955 -15801 -5864 81373 124699 103466 101511 111976 85680 38038
13244 38038 59496 107361 80053 23948 13391 -20810 15416 51124 39735 92338 141522 79085
13232G9085j3338J2998j0487n2054m0973J1552J0536K9877l3313J329Q4253Q7403
13220A66868n7164o1170j747j8176n6344K7533O7438J5087n5874L2118l3011m5252
13208a9694j3299N9853k5178r374O020k3510K8167J5799J3544o204J1986o7466
13196b9356j0092M9320P6131j0974l2053m150m9494n4762K2831L960m5320Q50
13184h3109R6371N895M7819k2829L5985K0620p7899J8370l415L6169M3947J7996
13172A35920j04878j22280N325R4944K4955Q3741K9395k0523k4469k1627l6483
13161D4020P246M7965n1293O899L2733K8275j0722o7246j0106K84J3282j4421
13149B6916o7034l8452N2357N495K2142L4988K8174K9011j5495k6847l0807j18339
$$ plain form
13232 79085 65747 78745 68258 16204 -24769 -13217 -2681 27196 -6117 -4788 79465 166868
13220 166868 109704 48534 46787 28611 -27733 -200 67238 82325 26451 58569 25558 -19694
13208 -19694 -32993 26860 1682 -7692 -1672 -25182 2985 18784 32328 26124 38110 -29356
13196 -29356 -39448 9872 86003 75029 42976 38826 -10668 -65430 -42599 -38639 -83959 -83109
13184 -83109 13262 19157 66976 44147 80132 100752 22853 41223 37808 73977 117924 135920
13172 135920 31042 -91238 -85913 9031 33986 117727 147122 126599 102130 80503 44020
13161 44020 51266 99231 47938 54837 87570 115845 105123 37877 27771 28055 41337 26916
13149 26916 -40118 -78570 -26213 -20718 1424 36412 64586 93597 78102 51255 20448 -97891
13137i7891n4985K0652R1447l3119K7832R6781j6860J9125j2647m9582L250r303
13125a5300J350K0230J305m2963l7646N2831N6537j8260J8295m4426j0878L5391
13113A6466n4070K430L7979L6629K2159q5999j04684j1812J383Q4046K6896m371
13101c2948K9698j4783O9040P1721K6722l6107m089m4795j8540p614K3810r578
13089E2537j4878P506m6990o7021m1960O6747o380Q5245N101k4589p4855J8722
13077d0815M0881K3969L846m1182K6856Q0706o267n9077q8343J1263m1156R3375
13065D056N7493m5333M6956k532j13157q2880K7714M7505R8204M4613q2m0818
13053D1739K5852l1398J9530j2729k154m012K9756O1344m7139K0911M72l5308
$$ plain form
13137 -97891 -152876 -132224 -40777 -73896 -46064 50717 33857 52982 40335 -9247 -5997 -15300
13125 -15300 -13950 6280 7585 -35378 -73024 -20193 36344 18084 36379 -8047 -18925 16466
13113 16466 -37604 -35174 2805 39434 61593 -24406 -129090 -140902 -139519 -55473 -28577 -32948
13101 -32948 -3250 -18033 51007 122728 149450 113343 109254 64459 45919 38305 62115 52537
13089 52537 37659 45165 -1825 -68846 -110806 -44059 -50439 34806 39907 15318 -59537 -40815
13077 -40815 66 24035 27881 -13301 13555 94261 87994 28917 -59426 -48163 -89319 4056
13065 4056 61549 16216 63172 60640 -52517 -135397 -107683 -60178 38026 82639 82557 41739
13053 41739 67591 36193 55723 42994 40840 36828 66584 127928 80789 101700 102172 66864
13041F6864m8650m4565Q179j1865k2527j860M951N8897R309K2596M1933m5869
13029C7393l9996O360Q980j9979m8311q344R567Q0319M1560O1068l4325l0143
13017F4149L4475l5299m4801j3454j7702o1529N466L1090L4710l4129m0922J2272
13005f5674L6261m110k9334J2738J6608K6795L1902n813l1113L3710L5073P4103
12993A31146q6524k0969K4565m562M2843k9065l9866O0925O6237j5353r3321m7725
12981a1669k217P1932o0569l3293K0868N3192J18498Q7327r0447j35670J3960
12970C1912N2834O2208k8723j3645l2829k9103J3007r071J080O2278j2760q27
12958I6361k8065k7862j2425l842l195K4856m8592p3087k7905O5827N8061L4336
$$ plain form
13041 66864 18214 -26351 -18172 -30037 -52564 -54424 -49473 9424 18733 41329 83262 37393
13029 37393 -2603 3757 12737 -7242 -55553 -63897 -54330 25989 67549 128617 94292 64149
13017 64149 98624 63325 18524 5070 -12632 -74161 -68695 -37605 -2895 -37024 -77946 -65674
13005 -65674 -29413 -33523 -62857 -50119 -33511 -6716 25186 19373 -11740 21970 57043 131146
12993 131146 44622 23653 48218 43656 86499 57434 17568 78493 144730 129377 36056 -11669
12981 -11669 -13886 58046 -2523 -35816 -14948 38244 156742 244069 153622 17952 31912
12970 31912 84746 146954 118231 104586 71757 42654 55661 46590 47670 109948 97188 96361
12958 96361 68296 40434 28009 24167 20972 45828 -2764 -75851 -103756 -37929 20132 54468
12946E4468O320J3772N7270m5787l5949j5723M0218o086j17180p6315J9548J20920
12934A5476J35135N2017o0505q5803j1390M4227q608n4461Q1918J3416j5582Q1519
12922A87359n0646j05230m5660O1813M4719K8293K4354n3729k8668J8609m9586
12911C1628k3820L2842M2192M5808K5650k5302J7955n7858K8579N5531o9754m1803
12899F1648j1475m3314p430N2207P6184J6018K9649j1062m116J4126J65r409k0227
12886A42964l2728k7003l1693M2091K4632k9128M019N2412O392K9365p3623J2690
12874A20390L566o8940l9211l881l7458j0735N8228N3559j3403k1010M8066j2085
12862G7086J8074M1367P877J5215j24544m5586J29174O9370k4854q5066n7147
$$ plain form
12946 54468 60788 74560 131830 86043 50094 34371 74589 68503 -48677 -124992 -105444 15476
12934 15476 150611 202628 142123 56320 44930 89157 80549 26088 108006 121422 105840 187359
12922 187359 136713 31483 -14177 47636 92355 120648 145002 91273 62605 81214 31628
12911 31628 7808 40650 82842 128650 154300 128998 146953 89095 117674 173205 103451 61648
12899 61648 50173 6859 -571 51636 127820 143838 173487 162425 158309 172435 172600 163191 142964
12886 142964 110236 83233 51540 93631 118263 89135 93154 145566 151958 181323 107700 120390
12874 120390 123956 55016 15805 11924 -25534 -36269 21959 75518 62115 41105 89171 77086
12862 77086 95160 136527 144404 159619 35075 -10511 118663 188033 163179 78113 20966
12851B0966l3942k1177o489M6171O186O4696R4743M3985k0483p7227j6978k3477
12839G6974k7309L8239O0332o3499o7814k6160M1050O7759J6086j1570n241N8730
12827A57577j1342r401j0837m3935o8818k6046R0541P371k4451l4807J2055l075
12815C4832m2897k9448O920J4392J7085J9869K5239j664O3806K4799p1167l3730
12803B8036L1852M2390J4613k3392m1646j0551M0737K1210M2338J8197o3375m399
12791I6010K1336K0741m1553J1752N4252M6907m4311j32680o463J5792K8959L4833
12779A05575o664K0016l8739p7440m4786J4089o3636O0910k1187J8920L3063L1490
12767C1611O0034o7000k8455j7808N4830M1619K7889N7500n0989l1846p3491J1655
$$ plain form
12851 20966 -12976 -34153 -40642 5529 11715 76411 171154 215139 194656 117429 100451 76974
12839 76974 49665 87904 148236 84737 16923 -9237 31813 99572 115658 104088 98847 157577
12827 157577 146235 136834 125997 82062 13244 -12802 77739 85110 60659 25852 37907 34832
12815 34832 -8065 -37513 -30593 -16201 884 20753 45992 44328 108134 132933 61766 28036
12803 28036 59888 102278 116891 93499 51853 41302 82039 103249 145587 163784 100409 96010
12791 96010 117346 138087 96534 108286 162538 209445 165134 32454 25991 41783 70742 105575
12779 105575 98911 118927 80188 2748 -42038 -27949 -91585 -30675 -51862 -32942 121 31611
12767 31611 91645 24645 -3810 -21618 33212 74831 102720 160220 109231 77385 3894 15549
12755A5549R769l324L9702k610N936M4186m3391n1936O8144q2436n9986K4725
12743c5672O8186O570J1846m9415N4009o500q5004K2224K5879M141O013j0350
12731A1927J2813J7050K5875J8037J4117J1554J5207o3j2331O470j643m7587m6345
12718B5081j834m043O098l883P85M8916m0723r2317m2679J8383P5145J00710N0413
12705A40052q0554j00667M8265N9426j6195L279M4726r223J8206l565O504J1229
12693A21483n7222j1600K2418o5357K2630j5556m9311m5298P976k5508N5528J46278
12681A06461j817m9415k2786K8661K7407N9107Q388k3960k5023o6437k8461K7148
12669C9273O3041N3459m3140q241m1601l3154J3984R02m2396j706Q3666R331O3445
$$ plain form
12755 15549 25318 21994 61696 59086 65022 109208 65817 13881 82025 -411 -60397 -35672
12743 -35672 32514 39084 50930 1515 55524 49024 -35980 -13756 12123 16264 22277 11927
12731 11927 24740 41790 67665 85702 99819 111373 126580 126517 114186 120656 119013 71426 25081
12718 25081 23247 19204 25302 21419 22204 71120 30397 -61920 -104599 -86216 -11071 89639 140052
12705 140052 59498 -41169 7096 66522 50327 53606 98332 89109 107315 103750 110254 121483
12693 121483 64261 52661 75079 9722 32352 16796 -32515 -77813 -69837 -95345 -39817 106461
12681 106461 104644 55229 32443 61104 88511 147618 156006 132046 107023 40586 12125 39273
12669 39273 102314 155773 112633 104392 62791 29637 43621 44523 2127 421 84087 93418 156863
12656A56863L8872m2247k1690m7004m1667R713J5408j466M629k7287j6447O7473
12644I5150N3305L0932m314n6801R4646Q6473j0544o0255l3812r960j1294j03670
12632F9856n1716J6591j9818j9968l2044Q8415N2200k672K9504J19774K2161p1969
12620B00314K7701J0761m1198n9168j7647k4716K3516R1100m1473p2920J3623
12609A09893K4071m5726j2574n8551l2418K3481M6601L0208L0764j1665k6550
12598G7534J7678Q5779M7838N025M7473j18048j1169L9990J4738j07023k4505
12587G5310L808M2824Q0592K405n1389j877J3224q7759R513k5204L0467M1301
12575A33215K0242O8897l0936n3498O067O680K264p431j9447p0979l2393O088
$$ plain form
12656 156863 195735 153488 131798 84794 43127 52840 68248 66782 71411 44124 27677 95150
12644 95150 148455 179387 175073 118272 212918 299391 288847 228592 194780 184820 173526 69856
12632 69856 18140 34731 14913 -5055 -37099 51316 103516 100844 130348 250122 272283 200314
12620 200314 228015 238776 197578 138410 120763 96047 119563 210663 169190 96270 109893
12609 109893 133964 88238 75664 17113 -15305 8176 54777 84985 115749 104084 77534
12598 77534 95212 180991 228829 233854 281327 163279 152110 192100 206838 99815 75310
12587 75310 79118 121942 202534 204939 153550 151673 164897 77138 86651 61447 91914 133215
12575 133215 153457 222354 191418 137920 143987 150667 152931 145500 126053 55074 22681 28769
12563B8769J756P3917Q5635j1751M331j5912n435O3461m7564m9909j2499L1420
12551A46219K0753L8027p9535j7642K9312j5228q8050k7757L6799K0989O5233
12540A29120L3325m2330r92j0781K3580j8221L108M9244p78J5087L4331K3875
12528B38568M265l464k7911m1475J3376O2348m2141J3926m4694J6519p743r1915
12516H9659k3310L4501l560j5156M8135R90j5793N8723k5447J1453k517r124l8560
12503A09994L8261J01115N5387m7332J6243N5656o0638n9385l731k2998k2461
12492A60111n0880l6633K8831O3842M2434O109o4292K5345J05817p6733l8578
12481A65373K8220K5005J554m97K3729M6464k7560n0836J9078J6541q3437M2633
$$ plain form
12563 28769 30525 104442 190077 178326 182657 166745 161310 224771 177207 127298 114799 146219
12551 146219 166972 204999 125464 107822 137134 121906 33856 6099 42898 63887 129120
12540 129120 162445 120115 119123 108342 131922 113701 116809 166053 165275 180362 214693 238568
12528 238568 242833 239369 211458 169983 183359 245707 203566 217492 172798 189317 181574 89659
12516 89659 66349 100850 97290 82134 130269 131259 115466 174189 148742 160195 157678 148554 109994
12503 109994 148255 249370 304757 257425 273668 329324 268686 209301 205570 182572 160111
12492 160111 109231 72598 101429 165271 207705 213814 149522 174867 280684 203951 165373
12481 165373 193593 218598 220152 219655 243384 289848 262288 211452 230530 247071 163634 206267
12469B06267N9793P88M602j05397l9485Q9026Q9931L008m8211m1048l3614l4044
12457A51616r011J7528L6626m6295J2709K9485O3273J7357K7782N5027R107n7864
12445C07340l1946J5776J5661k2079j0238J7676j7028K265J447o3154N0973M8679
12433C15372L7777N6695M6756o4262o3144k5423K2053l9097r395p0974n1263L9978
12421A95073J6309J0886L5570M8778l9328k6643K789m3520k0183P1570r274o9867
12409A72160n8465M7229Q0704n251j5352j8746Q6428K9950R3102O3826o993k8819
12397D39773j5461M1411l1281P9J8399k0089o1093J440L2517p4060j2746K4592
12385C43481M8362p2674L4395J1447n1224p3605j9023Q6056L3404r7849q4313
$$ plain form
12469 206267 266060 266848 271450 166053 126568 215594 305525 308533 260322 219274 185660 151616
12457 151616 142605 160133 196759 150464 163173 192658 255931 273288 301070 356097 365204 307340
12445 307340 275394 291170 306831 284752 274514 292190 275162 277427 278874 215720 266693 315372
12433 315372 353149 409844 456600 392338 329194 303771 325824 286727 277332 206358 155095 195073
12421 195073 211382 222268 257838 306616 267288 240645 243434 199914 179731 251301 242027 172160
12409 172160 113695 160924 241628 236377 221025 202279 288707 318657 411759 475585 468592 439773
12397 439773 424312 465723 434442 434521 452920 432831 371738 373178 405695 331635 318889 343481
12385 343481 391843 319169 353564 365011 313787 240182 221159 307215 340619 242770 158457
12374A58457J79912R3576r1256r7906j8796Q2390Q5267J00267L0369j22711n7222
12363C42347J7363p086m2543k4643j5765L4769j5196M470J9708J1646O3565L0222
12351D18857K4490o2409k8982O4038O572l891m6115l9618K8202M1506K1155L648
12339D27453o0875L8269N1661L5094O1034k038k8223l0256N207J0848L2197n7880
12327D82491p7131r027K5330O1410l7637o2638o969L1902k5372q592K5747J155
12315D00669n3258P8922J09927p3507l5071m35j74n8957N0592P5774Q263l9386
12303D63359j0533l97l8972j8380J239O5117N932k3588N58m695J5444J59529R4193
12290G08806l4469k1702n9945n7277L2115K6171j7469P4968J4051k2644l7593
$$ plain form
12374 158457 338369 431945 340689 242783 223987 306377 391644 491911 522280 399569 342347
12363 342347 359710 352624 310081 285438 269673 304442 289246 293716 313424 325070 388635 418857
12351 418857 443347 380938 351956 415994 422566 418675 372560 332942 361144 402650 423805 427453
12339 427453 366578 404847 456508 491602 552636 550598 522375 492119 497326 508174 540371 482491
12327 482491 405360 396333 421663 483073 445436 382798 375829 407731 382359 373767 399514 400669
12315 400669 347411 426333 536260 462753 427682 427247 427073 368116 418708 494482 502745 463359
12303 463359 452826 452429 413457 395077 396316 461433 467365 443777 444335 439640 455084 614613 708806
12290 708806 674337 652635 592690 535413 567528 593699 576230 651198 665249 642605 605012
12279F05012n2711l886J7488K2755J9189K8420n0547O0723N3063K5068q000j444
12267G15130K6821q099j1813K1625k5704j0430n5048q4333k5936J5066K9450M1978
12255F28707Q1744K4865n2330k033m766J2229M5747N951q253l8048O168P1293
12243G71274J4571q240L9419j2976q0048p3527M299O0869J01197O2618N3875K9843
12231I63174k0792m9625p6314O5816J15489L0228m2712n0224N6435p345l3140
12220I50990j7265o0817M5044P7202o833J999o6741l2184j2606J9059l6029M8433
12208I10252Q4639L7278K9002K8496n2073l2022O045M0616m367l399k573l6902
12196A004992K4246Q4964L1618n886j0736K0238J3326j7219J5952J1034p37L1380
$$ plain form
12279 605012 552301 548415 565903 588658 607847 636267 585720 646443 699506 724574 716574 715130
12267 715130 741951 733852 722039 743664 717960 707530 652482 568149 542213 557279 586729 628707
12255 628707 710451 735316 682986 680953 676187 688416 734163 740114 731861 693813 699981 771274
12243 771274 785845 777605 817024 804048 724000 650473 654772 715641 816838 879456 933331 963174
12231 963174 942382 892757 816443 882259 997748 1027976 985264 935040 991475 984130 950990
12220 950990 933725 872908 917952 995154 988321 990320 923579 891395 878789 897848 861819 910252
12208 910252 994891 1032169 1061171 1089667 1037594 1005572 1011617 1052233 1047866 1044467 1041894 1004992
12196 1004992 1029238 1114202 1145820 1139934 1129198 1149436 1162762 1145543 1161495 1172529 1171792 1203172
12184A203172o443k341L3923R5956J7818l2576q9241K2818K4004L701k8495J6283
12172A258579L8109n6446l700Q2162J07741L1607M287J5574J1633L1925O8831
12161A590302m5276L770M183m3872J5557O7112M1762j4341M7548K1124J3929R3674
12149A795472L7623K0047Q5354K9018P683J7768j9518k7552Q9337N6043J1922
12138B103197m9525J0198j5404P6219J04151K0689m2380R159R741J2142m1127
12127B197060P306R246J58395M1293J5930j2414j4163j4067j088M0223L6087J8707
12115B482515M8310Q7519P6078J02265J00303N5119L0317J15278J38823R3231
12105C329758L3497J42225K04305M4470L5309P1376J6024q624M9836P379M5896
$$ plain form
12184 1203172 1196729 1194388 1228311 1324267 1342085 1309509 1220268 1243086 1267090 1270791 1242296 1258579
12172 1258579 1296688 1240242 1236542 1318704 1426445 1458052 1462339 1477913 1489546 1521471 1590302
12161 1590302 1545026 1548796 1552979 1509107 1524664 1591776 1633538 1619197 1666745 1687869 1701798 1795472
12149 1795472 1833095 1853142 1938496 1967514 1975197 1992965 1973447 1945895 2035232 2091275 2103197
12138 2103197 2053672 2063870 2048466 2124685 2228836 2249525 2207145 2216304 2226045 2238187 2197060
12127 2197060 2204366 2213612 2372007 2413300 2429230 2416816 2402653 2388586 2387498 2427721 2463808 2482515
12115 2482515 2530825 2618344 2694422 2796687 2896990 2952109 2982426 3097704 3236527 3329758
12105 3329758 3363255 3505480 3709785 3754255 3789564 3860940 3876964 3868340 3918176 3925555 3971451
12094C971451m7984k9238R221L2047l4581l3687L1182N4759M0274L6095O2018
12083D091557P6483K5230m1168n8019P0081J22343P2853J2465M1128P8651Q2713
12072D574317J19371M9493J18735N4848L4663M6648L6438J16776J01958J85606
12062E438853J61271J77120J54914J37424J12561J39246L5986J78270J09084M2312
12052F687041N4928N7903N0938k6018M0794M8919Q8987N2388O6091K3040O1330
12041G206341J55762J23562P7023K06388J02291m6376K9209J14465J05949J98545
12031H273159J36827M7997J28786K57846J74437J41036J00707R5396J30133J86637
12021I672961K61270J83883J44318K32185J74712J83672K64996J09786J32761
$$ plain form
12094 3971451 3923467 3894229 3903450 3935497 3900916 3867229 3898411 3953170 3993444 4029539 4091557
12083 4091557 4168040 4193270 4152102 4094083 4164164 4286507 4359360 4371825 4412953 4491604 4574317
12072 4574317 4693688 4743181 4861916 4916764 4951427 4998075 5034513 5151289 5253247 5438853
12062 5438853 5600124 5777244 5932158 6069582 6182143 6321389 6357375 6535645 6644729 6687041
12052 6687041 6741969 6799872 6850810 6824792 6865586 6914505 7003492 7055880 7121971 7145011 7206341
12041 7206341 7362103 7485665 7562688 7769076 7871367 7824991 7854200 7968665 8074614 8273159
12031 8273159 8409986 8457983 8586769 8844615 9019052 9160088 9260795 9356191 9486324 9672961
12021 9672961 9934231 10118114 10262432 10494617 10669329 10853001 11117997 11227783 11360544
12012A1360544J92826K08504J50211J46771K28798J40172J21415J42011J59151
12003A2850403J75644J98904J45255R9858J42107J83562J89717K13102K04783
11994A4403335Q8660J31398J61468J66480K36519R3025J3488M1694J53827K37162
11984A5727056J69925O2714R6248J02491J67605J04421J0906J6016L5766K2830
11974A6515978L6311P0741P8774o1881k0087M6827O7471k3898o4112k7666n6442
11963A6562016r4721j13132q5345m4868l9868j07762j34156j24802j41979j10623
11953A5564760j18700j01013j30639j80855j76522k24638j19634j79406j35995
11944A4197358p7881j66410n4992j74128j89231j84915k01072j12214j40262j54796
$$ plain form
12012 11360544 11553370 11761874 11912085 12058856 12287654 12427826 12549241 12691252 12850403
12003 12850403 13026047 13224951 13370206 13470064 13612171 13795733 13985450 14198552 14403335
11994 14403335 14491995 14623393 14784861 14951341 15187860 15280885 15294373 15336067 15489894 15727056
11984 15727056 15896981 15959695 16055943 16158434 16326039 16430460 16441366 16457382 16493148 16515978
11974 16515978 16552289 16623030 16701804 16639923 16619836 16666663 16734134 16710236 16646124 16618458 16562016
11963 16562016 16467295 16354163 16268818 16223950 16184082 16076320 15942164 15817362 15675383 15564760
11953 15564760 15446060 15345047 15214408 15033553 14857031 14632393 14512759 14333353 14197358
11944 14197358 14119477 13953067 13898075 13723947 13534716 13349801 13148729 13036515 12896253 12741457
11934A2741457j95005k19734j93288j88848j87293r7456r9518j91235k27461k01890
11924A0939729j60573j96856j58712j47445j22157j37170j02154j95037k15668
11915I503957j85320j28607j38422p8193j32925r7517j29491j45404j28584j77804
11905H161690j92390j44642j44741j25656j49677j66937p8600o2199j27870j16628
11895F852350q8289j46248o1363j09766j27420o2130j11916r4677j13683q2007
11885E854851j09377n8099p8818j23657j76876j05123n8830j07865l8403q0012
11875D917791j46361j38315p4373j7095p8570j1351l8947j05044r4160j38042
11865D075533r5854r665r0985j25651n8047j7695J6936L56p5539p6686j3355n6507
$$ plain form
11934 12741457 12546452 12326718 12133430 11944582 11757289 11659833 11560315 11369080 11141619 10939729
11924 10939729 10779156 10582300 10423588 10276143 10153986 10016816 9914662 9719625 9503957
11915 9503957 9318637 9190030 9051608 8973415 8840490 8742973 8613482 8468078 8339494 8161690
11905 8161690 7969300 7824658 7679917 7554261 7404584 7237647 7159047 7096848 6968978 6852350
11895 6852350 6764061 6617813 6556450 6446684 6319264 6257134 6145218 6050541 5936858 5854851
11885 5854851 5745474 5687375 5608557 5484900 5308024 5202901 5144071 5036206 4997803 4917791
11875 4917791 4771430 4633115 4558742 4541647 4463077 4451726 4412779 4307735 4213575 4075533
11865 4075533 3979679 3970014 3879029 3753378 3695331 3677636 3694572 3694928 3619389 3542703 3529348 3472841
11853C472841r657m0728p7128j2849j6105j08899j6469j6537L4175j13997j16101
11842B978546m3114K1707k4734L5829l2371j18428N410l6064q2959n4660K7500
11831B676662j6732j7805m2118q9016m1385m0820m5384M7020l2213l6590j1749
11820B349870p3116k2014q8689m3111j6026k7307l724Q891M7875L3841j8431J962
11808B150021k8941q3533o8511o3389o3760n3606n3215J382k4267K315J8964O5944
11796A799404K0809j07739q2352k4444p046K2860k0097l6669m7255j1292L6917
11785A543096m904j4088m5509k305M7857J955L9244p7269r8904k795o235k2735
11773A357408M2446P952o8205r3240r633j9338l459j0447K7980q006l1593m9688
$$ plain form
11853 3472841 3463184 3422456 3345328 3332479 3316374 3207475 3191006 3174469 3208644 3094647 2978546
11842 2978546 2935432 2957139 2932405 2968234 2935863 2817435 2822845 2786781 2703822 2649162 2676662
11831 2676662 2659930 2642125 2600007 2510991 2469606 2428786 2383402 2430422 2398209 2361619 2349870
11820 2349870 2276754 2254740 2166051 2122940 2106914 2079607 2075883 2084774 2132649 2166490 2148059 2150021
11808 2150021 2121080 2037547 1969036 1905647 1841887 1788281 1735066 1736448 1712181 1714496 1733460 1799404
11796 1799404 1820213 1712474 1630122 1605678 1598632 1621492 1601395 1564726 1517471 1506179 1543096
11785 1543096 1538192 1524104 1478595 1476290 1524147 1526102 1565346 1488077 1389173 1386378 1380143 1357408
11773 1357408 1399854 1407806 1339601 1246361 1236728 1217390 1213931 1203484 1231464 1223458 1191865 1142177
11761A142177M4082o972l1532l4965K5437J01434K4311n0104l6327o6683r0459
11750A020399k9476N0430O2898K607j13871j52565J0384P7101O8208N2639O125
11739A054879J0601n2533o56K7482o856r3369m4459n2465m365M0207Q5024o8628
11727H94862o9942N6960k63o7421j3873L4166K3316j4671k2305k6938k316j8030
11715G73545J311k5862J8877O5538n5912o1861j7750m4453K7507P276m6059K1278
11703F63435J4457l0352l813J1230K7643K4277k7834K7190K6785l194k5410l9367
11691F65047L5935M7961q9540p0062J21401N314j05808J5013K7892o0776j5152
11680E77225Q0963Q9209j6503j7049n9597n4932N1918N4156n7216m6847L8519
$$ plain form
11761 1142177 1186259 1179287 1147755 1112790 1138227 1239661 1263972 1213868 1177541 1110858 1020399
11750 1020399 990923 1041353 1104251 1106858 992987 840422 850806 927907 996115 1048754 1054879
11739 1054879 1065480 1012947 1012291 1039773 1032917 939548 895089 842624 838259 878466 963490 894862
11727 894862 824920 881880 881617 814196 800323 834489 857805 843134 820829 793891 791575 773545
11715 773545 774856 748994 767871 833409 777497 715636 697886 653433 680940 688216 642157 663435
11703 663435 677892 647540 643727 654957 682600 706877 679043 706233 733018 729824 704414 665047
11691 665047 700982 748943 659403 589341 710742 716056 610248 625261 653153 592377 577225
11680 577225 658188 747397 730894 713845 654248 599316 651234 705390 648174 601327 639846
11669F39846o6097j8252J04794J6480m0071l7438Q70K5654j736l7274j5686J1889
11657E82979l3603q067M639R6300K9210R3965J7791l5922m3469O457l461J3478
11645G20297l9000o5950p2343K6119R0629M0624J6562r6295r5945l8781j553M945
11633D89309K3898o3586j1133m7471P1199O6470m0874o2755N076k0322K7939K399
11621D40149L4487L0363j0352K7948k1336p7089J1745O0167L1252n3241q395j0553
11609D55145r873r41J5212j7026K524o6648P7326K0942N942N1572k763J2479N186
11596E49077m2318m3160L7269j7921j08192r9511Pn116R6999L0082J3208m8154
11584C62270k1579J1036L9892K3233l7541k6783j1454J3293L7956j3420L7585
$$ plain form
11669 639846 573749 555497 660291 676771 636700 599262 600132 625786 624050 586776 571090 582979
11657 582979 549376 541309 545948 642248 671458 765423 783214 747292 703823 710280 706819 720297
11645 720297 681297 615347 543004 569123 659752 700376 716938 620643 524698 485917 484364 489309
11633 489309 513207 449621 438488 391017 462216 528686 487812 425057 430133 409811 437750 440149
11621 440149 474636 504999 494647 522595 501259 424170 435915 496082 527334 474093 465698 455145
11609 455145 445272 444331 459543 442517 445041 378393 455719 476661 482603 534175 531412 543891 549077
11596 549077 506759 463599 500868 482947 374755 275244 275251 270135 367134 397216 410424 362270
11584 362270 340691 351727 391619 414852 377311 350528 339074 352367 390323 376903 414488
11573D14488o9638j9380J3081M94n2127L2353J4510J490j399l2289J5820p175
11561C10228l0789j8131m4288J878O2363M9969k0801r6083N1406N4142l760p6571
11549B39563m5309L542j3926J9909j606l9929M2454J06931l9504l5Q10J6727L3041
11536C22668L6566m63K8272o4943k8814l4165M3687J32p6799m8487R8610l0382
11524B45882M5724M345J2338N523o4360m0534m4965J1395M4098J8273k4640J2892
11512B25971O2397n7018o7578L3395M5484p925l3846n328k6389l6826l2883m4653
11500E4801K5352M6442L7760J2819J4787l4814N22K1348L8179P511o3419J4530
11488A75818N1388P491l6672k6562l1318o1286L9935J04655m191l2858L7814J9469
$$ plain form
11573 414488 344850 325470 338551 339045 286918 319271 333781 335271 333872 301583 317403 310228
11561 310228 279439 261308 217020 218898 281261 331230 310429 214346 265752 319894 316134 239563
11549 239563 194254 197796 183870 203779 202173 162244 204698 311629 272125 272090 272900 289627 322668
11536 322668 359234 358771 387043 322100 293286 259121 302808 302940 226141 177654 276264 245882
11524 245882 291606 295951 308289 313812 249452 208918 163953 175348 219446 237719 213079 225971
11512 225971 288368 231350 163772 197167 242651 234726 200880 195552 169163 132337 99454 54801
11500 54801 80153 126595 164355 177174 191961 157147 157669 179017 217196 224707 161288 175818
11488 175818 227206 234697 198025 171463 140145 78859 118794 223449 219258 186400 224214 243683
11476B43683k3004l5272L060O6537N3455m389Q318J7314N0199L8844n8854j16119
11464B43772j29872l3013O4465M3233j0441J1353k3370N1033L8619n472k5190
11453B25117M4496j8367j01186P315L3121l4586l0604M818j0205j7739Q8038m5158
11441A45060n8950L7971J577p771M323J9411k7974M5069M3947M8068p6205p338
11429A67188M3283m3311o040P8887N506K8035o3069m5622l2479k0175l7543K1483
11417I6143l2017l6644O7894J51896o5169q8261l351P6037r188o9392p3340K5830
11405D0438M4468K7747J6408L4227N5945p019k3468P6320m6571l7697n4718k973
11393A23107q787L0144O0547k5196n4389o4052K8300Q2354n026K8107J7645q168
$$ plain form
11476 243683 220679 185407 188467 255004 308459 304070 312388 329702 379901 418745 359891 243772
11464 243772 113900 80887 145352 188585 178144 189497 166127 217160 255779 250307 225117
11453 225117 269613 251246 150060 157375 190496 155910 125306 130124 119919 102180 190218 145060
11441 145060 86110 124081 125658 117887 122210 141621 113647 158716 202663 250731 174526 167188
11429 167188 210471 167160 161120 240007 245513 273548 210479 164857 132378 112203 74660 96143
11417 96143 64126 27482 95376 247272 182103 93842 90491 166528 157340 87948 14608 40438
11405 40438 84906 112653 129061 163288 219233 212214 188746 265066 218495 180798 126080 123107
11393 123107 114320 144464 205011 179815 125426 61374 89674 172028 167002 195109 212754 204586
11381B04586n3950m330K1572n0232k1997J088K0029m2665j7073N7266L8846K7404
11369A80544Q0418l450j05896l2605m8172K6346L5997M7424J5593m5955m5430
11358A04814M463K3997M853m4540L338k2710J5672L1793q2979l3380R0674R435
11346A05430l9052q4638O922q2M7818K7705n7522n711Q9379N8168L9807l4207
11334A54017k8010l0027l3707J07393J11640m6609p2668l5222j8818O6275J881
11323A76145K8979P7163M9066l8351J9581m0299j13257m0671N4351j7301n1166
11312A04240j8226l5930L4780l19m5798l6564k0184N803Q732O2584N2317j0608
11300A00827Q2337j057m2854j0918J3350l8463n4883J536Q3593m4672m8735q836
$$ plain form
11381 204586 150636 146306 167878 117646 95649 96737 116766 74101 57028 114294 153140 180544
11369 180544 260962 257512 151616 119011 70839 97185 133182 180606 196199 150244 104814
11358 104814 109277 133274 138127 93587 96925 74215 89887 121680 38701 5321 95995 105430
11346 105430 66378 -18260 -11338 -11420 36398 64103 6581 870 90249 148417 188224 154017
11334 154017 126007 95980 62273 169666 281306 234697 162029 126807 107989 174264 176145
11323 176145 205124 282287 331353 293002 312583 272284 159027 118356 172707 155406 104240
11312 104240 86014 50084 84864 84545 38747 2183 -18001 -12198 -3466 59118 111435 100827
11300 100827 183164 182107 139253 128335 141685 103222 48339 49875 133468 88796 40061 31225
11288C1225j8606L8786J02023j7340q1739o5908l0062q513M0356J1862p4006L2492
11276c9430P5696k0129k5806K174J3670L113L0218N126o640J1023M3627K4936
11264A17578J07062K3363p4962n1825l2620n2274p3973O3241L1718O28j8305n6402
11252a6771L6207j8725n3326p229Q1279k2464m6647k0650K1415P5702m1143J4672
11240B320M7085j4381L3982o406J6299L8576n1064r421L2050j7709k1633K6819
11228G6517j7996l1139j2959n262o2073J408J08571N8738J4k5379j22106K9517
11216b149R6186K4989k5984N7474j9134r3665K364K6877K9192k0471k1038n4747
11204a06Q36N6745M6767O111j2046n2799n716L7843k9298r7022J8116O2666r19
$$ plain form
11288 31225 12619 51405 153428 136088 54349 -11559 -41621 -50134 -9778 2084 -71922 -39430
11276 -39430 36266 16137 -9669 -7495 6175 9288 39506 44632 37992 49015 92642 117578
11264 117578 224640 248003 173041 121216 88596 36322 -37651 25590 57308 57936 39631 -16771
11252 -16771 19436 711 -52615 -59844 21435 -1029 -47676 -68326 -46911 28791 -12352 2320
11240 2320 49405 35024 69006 62600 78899 117475 66411 56990 89040 71331 49698 76517
11228 76517 58521 27382 14423 9161 -52912 -51504 57067 115805 115819 90440 -31666 -2149
11216 -2149 94037 119026 93042 150516 131382 37717 40081 66958 96150 75679 54641 -106
11204 -106 730 57475 104242 110353 98307 45508 39792 77635 48337 -48685 -30569 32097 31178
11191C1178K0840L1086o127p1247J7055p556P9394K5342n213l165l4691N6455
11179A33351L7776n4666J7450k1701j0523m4253J169Q4466l1509l8509O8413l1491
11167A09973o2953Q249o4178M5815N352k816J0817l0276K8484K8293J8360K6829
11155A21949p9153l9565J8740J6506K3891M4566j8944l4559M1196M3105K8300
11144A66032o5152o4448N4934o5187K2289N4259k8607p5267l9174k6849J6728
11133e0442M2109M3659j4252K4542j1640O2750N3140q5627n6910l5667k8276M6067
11121a0547k5872K0641N7075N3062J4129k0927j148n7220P5881J2211m2560l1420
11109D3305J3186l9589l1787K625K6734M305p0080r35R7655N8501k023o961L525
$$ plain form
11191 31178 52018 83104 76977 5730 22785 15229 94623 119965 114752 111587 76896 133351
11179 133351 171127 116461 133911 112210 101687 57434 58603 143069 111560 73051 141464 109973
11167 109973 47020 55269 -8909 36906 42258 39442 50259 19983 48467 76760 95120 121949
11155 121949 42796 3231 21971 38477 62368 106934 87990 53431 94627 137732 166032
11144 166032 100880 36432 91366 26179 48468 102727 74120 -1147 -40321 -67170 -50442
11133 -50442 -8333 35326 21074 45616 33976 96726 149866 64239 7329 -28338 -56614 -10547
11121 -10547 -36419 -15778 41297 94359 108488 87561 86413 29193 105074 117285 74725 43305
11109 43305 56491 16902 -14885 -12260 14474 18779 -51301 -52236 45419 103920 101897 94936 98461
11096I8461j17385l5587L0737N7488p391j06640j9892K2814N5905Q3303K3307
11085H5120N9443m1930l382r559L0476M332r337P029l3102q292k9563l7632M3250
11072E6853P6538J4943k7345l5496M0270O5465K0876j1824l5716n191k9124o283
11060A23966l7299k1316k2953l17m2332m6019M2938J9029J3437N8417J5672L1969
11048A35192L4777O7652Q6642M6217n9747l4567M3566J1562K2495m0631q6457
11037B26701K1994M3214Q2800n5602l3087p544K3160j4205o802L3450Q8738J0180
11025D12997K8626O1344L364L0806O5611r439j08293M7321Q5822q2798n3536j10638
11013C71187n0289M6257J18607K4367p9449k3044l8420N2887j6252j1597p6841
$$ plain form
11096 98461 -18924 -54511 -23774 33714 26323 -80317 -100209 -77395 -21490 61813 85120
11085 85120 144563 102633 99251 89692 120168 124500 115163 122192 89090 80798 51235 13603 56853
11072 56853 133391 148334 120989 85493 125763 191228 212104 200280 164564 159373 130249 123966
11060 123966 86667 65351 42398 42081 -251 -46270 -3332 15697 29134 87551 103223 135192
11048 135192 169969 237621 324263 370480 310733 276166 319732 331294 353789 313158 226701
11037 226701 248695 291909 374709 319107 286020 278476 301636 287431 280629 314079 402817 412997
11025 412997 441623 502967 506331 537137 602748 593309 485016 532337 618159 535361 481825 371187
11013 371187 320898 367155 485762 510129 430680 407636 369216 422103 405851 394254 317413
11002C17413o3251M813R1620N869k6834J2524j9213J3917l1380m6022n5844j8888
10990A84724L4200O1824m9651n0966o632M6211K6310K7670l4666K1738j9048m749
10978B36965L9237n1654m1351N7600P741o2171m1428j6852N9706N7002p6527m4716
10966A23552M7815k383n7676K1781k8275N388J9520l0179J0219K3874O2963J9729
10954B16328p562l906j1083q4904L146j6237j736M382K190j2217n3344l226P1829
10941A03660K6485k1046K7500O7164n470o8525J14694K0733o6291L7849K0430
10930B57183l8613K3194J1783l8429l0864m9782r594n5323l551j2272n4978L6469
10918C5223K2905M3534j9504l3445L5471K2368M704M596j3661N6715j09290l8711
$$ plain form
11002 317413 254162 258975 350595 356464 329630 342154 322941 336858 305478 259456 203612 184724
10990 184724 218924 280748 231097 180131 173499 219710 246020 273690 239024 260762 241714 236965
10978 236965 276202 224548 183197 240797 248538 186367 144939 128087 187793 244795 168268 123552
10966 123552 171367 168984 111308 133089 104814 110202 129722 99543 109762 133636 196599 216328
10954 216328 208766 204860 193777 108873 112019 95782 94046 98428 100618 88401 35057 31831 103660
10941 103660 130145 109099 136599 203763 198293 129768 244462 265195 198904 236753 257183
10930 257183 218570 241764 253547 215118 184254 134472 124878 69555 66004 53732 -1246 35223
10918 35223 58128 101662 82158 48713 84184 106552 111256 115852 102191 158906 49616 10905
10906A0905K8798M8259j8060J3798o9424k5737j5388q808m346R2291R6003p425
10894A40866Q248o3870m8329k2321L0612P1897N2605j8532k1205N3267l4000J0901
10882A60139k5315J3670j1297j992k811j2334j6678m2032m0645R703j1974J8716
10870C7150K4480l8624N0223J380l3829K9395j1650P0238L1768o6858L7267n4936
10858G6004J03349N7729l3212j5555j4Q433l0969P4384K8791l719j1231O514q611
10845B51893O99n9287l6832O6191J6755J8824K3815l2084q1156Q274N0068M5415
10833B72575K5123l1508j3983Q6901Q5910O1927j03589p4066l8216j9587j09825
10822A41662l3195J639N0135N2476J8801o1084k9508K8555p2995K0619M8269L228
$$ plain form
10906 10905 39703 87962 69902 83700 14276 -11461 -26849 -35657 -40003 52288 148291 140866
10894 140866 149114 85244 36915 14594 45206 117103 169708 151176 129971 183238 149238 160139
10882 160139 134824 148494 137197 135205 132394 120060 103382 61350 20705 30408 18434 37150
10870 37150 61630 23006 73229 74609 40780 70175 58525 128763 160531 93673 130940 76004
10858 76004 179353 237082 203870 188315 188301 196734 165765 240149 268940 265221 253990 260504 251893
10845 251893 252592 193305 156473 222664 239419 258243 282058 249974 168818 177092 227160 272575
10833 272575 297698 266190 252207 339108 425018 486945 383356 309290 271074 251487 141662
10822 141662 108467 110106 160241 212717 231518 170434 140926 169481 96486 117105 165374 168602
10810A68602n8912O388k0004M000K2168P7570k1204J2505N9132k5855J9367N8142
10798C01899l4180k9031j16193l7297L9665n108K9741M7599K6887n9296o3130
10787A01556q2397M0803O6438K7426L7274N4731k8024l9772m958n1665j5004J2442
10775A18850O4020M8572J0893m3068m1398k9934P9003J8367j02134j5576Q9436
10764A97031L6847p386m5399o4697l5689o1351L6953O2857N5160p1833M2916Q4426
10752B29835n0708n8181q588P9563l4000q928R673m0820j8070J6493M5818J5398
10740A77485P9178Q0139j1451q7439k0537K1847q40K2881k710o9718j6744O6196
10728B38287l3179o4676Q433L8425P2692N358m5034N184p0044L9010O5537K0853
$$ plain form
10810 168602 109690 116078 96074 100074 122242 199812 178608 191113 250245 224390 243757 301899
10798 301899 267719 238688 122495 85198 124863 119755 149496 197095 223982 164686 101556
10787 101556 19159 59962 126400 153826 191100 245831 217807 178035 173077 121412 106408 118850
10775 118850 182870 231442 242335 199267 157869 127935 206938 225305 123171 107595 197031
10764 197031 233878 226492 181093 116396 80707 19356 56309 119166 174326 102493 145409 229835
10752 229835 179127 120946 112358 191921 157921 148993 158666 117846 99776 116269 162087 177485
10740 177485 256663 336802 325351 237912 217375 239222 238382 261263 258553 188835 172091 238287
10728 238287 205108 140432 148865 187290 259982 265340 220306 225490 155446 194456 259993 280846
10716B80846j1182L0733M8872K1903l9876P1984K8699m8901j4451j5495k6195
10705C26937J2584M0102p8944j3016Q5639L1224K1663L1703J4794p635L0007M4647
10693E39705K8510Q67J8644K9477N6359k4503J3356K109n6368M6616N2219q1400
10681F25591k7107J13121l375L0199K7028J0512M7131J07156J9789M307k3497
10670I30855j3539J630k147Q6591P5726O6046O5176L9800n781m5640k0694M313
10658A182336N0964P0366Q4300l6526M0974J00405O6480j2971q1006M4084O7892
10647A577298Q23P452Q9497Q3520J46782O1884J8696Q3588L6695M9L8250J99804
10635B344338J88400J84141K09101K87626K47798J98116L44904L54668L46116
$$ plain form
10716 280846 269664 300397 349269 371172 331296 403280 431979 383078 368627 353132 326937
10705 326937 339521 379623 300679 287663 373302 404526 426189 457892 472686 465051 495058 539705
10693 539705 568215 569082 587726 617203 673562 649059 662415 664524 608156 654772 706991 625591
10681 625591 598484 711605 708230 738429 765457 775969 823100 930256 950045 954352 930855
10670 930855 917316 918946 916799 1003390 1079116 1145162 1210338 1250138 1244357 1198717 1178023 1182336
10658 1182336 1233300 1303666 1387966 1351440 1392414 1492819 1559299 1546328 1465322 1509406 1577298
10647 1577298 1578121 1585573 1675070 1758590 1905372 1967256 1985952 2069540 2106235 2106284 2144534 2344338
10635 2344338 2532738 2716879 2925980 3213606 3461404 3659520 4004424 4359092 4705208
10626D705208L91436N21862P17375R58860J189932J497474J891320K214327K506117
10617A6593911K593666K484540K114451J491180R80680O20505P97843J216576
10609B8893352J847849K665015L517355M326061M656884M253302L018375J401868
10601E4580061J621p56503o51116P8117J200954K529412L821579M804431N090330
10592G0698886M183255K090029n49277k627214l628926l664920k909671j659122
10584F1933040l47364O35708J540809J756978J050892l70413k102415l405113
10576F0692122l898830l663059l011910k302369j462049p97298n63895m48211
10568D4544501p60160j328631j962195k449500k549961k346334k273854j972234
$$ plain form
10626 4705208 5096644 5618506 6335881 7294741 8484673 9982147 11873467 14087794 16593911
10617 16593911 19187577 21672117 23786568 25277748 26258428 26878933 27676776 28893352
10609 28893352 30741201 33406216 36923571 41249632 45906516 50159818 53178193 54580061
10601 54580061 54581682 53825179 53174063 53252180 54453134 56982546 60804125 65608556 70698886
10592 70698886 74882141 76972170 76422893 73795679 70166753 66501833 63592162 61933040
10584 61933040 61585676 62221384 63762193 65519171 66570063 66199650 64097235 60692122
10576 60692122 56793292 53130233 50118323 47815954 46353905 45556607 44992712 44544501
10568 44544501 43784341 42455710 40493515 38044015 35494054 33147720 30873866 28901632
10560B8901632j595588j395564j333835j168741j068589r20317p89315p81506
10552A9848177p25575p02249o78349o31075n29933n59024o70925o35319m85788
10543A4229940o04616n88657n35533n09757m96301m61240m68948l95765n60746
10534I608377m82376m33682l55576l98246l80631m41120l66926l73734l22589
10525F053497k89608l33580k92376j88161k30134k18797k87671k67788k12297
10516C733085k83122j96024j44048k27861j54733j36657j15595j18274q1883m2469
10506B232419j25734k20730j30536k1384o9295j49450j75548n5777n0782n6300
10496A176883L287j15929n3338J7093p340k5165j2530j00411j14402l2191l8973
$$ plain form
10560 28901632 27306044 25910480 24576645 23407904 22339315 21418998 20629683 19848177
10552 19848177 19122602 18420353 17742004 17110929 16580996 16021972 15351047 14715728 14229940
10543 14229940 13625324 13036667 12501134 11991377 11495076 11033836 10564888 10169123 9608377
10534 9608377 9126001 8692319 8336743 7938497 7557866 7116746 6749820 6376086 6053497
10525 6053497 5763889 5430309 5137933 4949772 4719638 4500841 4213170 3945382 3733085
10516 3733085 3449963 3253939 3109891 2882030 2727297 2590640 2475045 2356771 2274888 2232419
10506 2232419 2106685 1885955 1755419 1734035 1664740 1515290 1339742 1283965 1233183 1176883
10496 1176883 1180170 1064241 1010903 1027996 1020656 995491 982961 882550 768148 735957 696984
10485F96984j32609n6756J3937J7564m3451m9181J5918M1593L3153K1222j12266
10474D46108l5003M4773j9352k8165m8031q4908k1700N9107K1441m9136m2586
10463B42548K3363m1227J1909J02921k6726n7280L5425R063k1367n9916p6231
10452A42482N7497O5501J3807k9719m0790n536N7262O6384K1226o5089l5963L4605
10440B81667J04035M9873m8249o6516l262J1660q6016L8458R2056N4171L9090
10429D66967k0352q1792j14852Q0882O7066l2403r277L587M7639K8323M9301J0758
10417D95847l4532j8582o429m3053j8498l7818Q262M1972l699n9112J4579J6843
10405C55780k5182p448k3061k810n632k364j280K8866O5516k0487p0645n1788
$$ plain form
10485 696984 564375 507619 521556 539120 495669 446488 462406 503999 537152 558374 446108
10474 446108 411105 455878 436526 408361 360330 275422 253722 312829 334270 285134 242548
10463 242548 265911 224684 236593 339514 312788 255508 290933 299996 278629 218713 142482
10452 142482 199979 265480 279287 249568 208778 203242 260504 326888 348114 283025 247062 281667
10440 281667 385702 435575 387326 320810 317548 329208 243192 281650 373706 427877 466967
10429 466967 446615 364823 249971 330853 397919 365516 356239 359826 407465 435788 485089 495847
10417 495847 461315 442733 436304 393251 374753 336935 345197 387169 383470 324358 338937 355780
10405 355780 330598 323150 300089 297279 291647 289283 288003 316869 382385 361898 291253 239465
10393B39465N7593K9118L0879P600k9028k4630o9248p4795P5466N2362J9082m1137
10381B72727O7560p3389p8920K2816L7262k81J5950J0070o7394l6256k1575M9627
10369A98197J3401J6574M8872n253p6441j9345j6088K7345l6480q137J401K6070
10357A70116L3941k4172m5876p4468L2597J3932j9962J1791n1631l9854m6346
10346c9932k0154P6297L062p6778j6144M5500P6512J0789j7579P879M638J6629
10334G0719O4943K8864j6650m115k001K2752K7697j7760N7584J7001p2212j16770
10322F0052j04620L3674M9876O650n0631o8354l7759O55K6690M9666k7596k8351
10310i0048P051O8615K6333K9432l517K0044M1662O58m0944r6085l8092K5527
$$ plain form
10393 239465 297058 326176 357055 364655 335627 310997 241749 166954 242420 294782 313864 272727
10381 272727 340287 266898 187978 210794 248056 247775 263725 273795 206401 170145 148570 198197
10369 198197 211598 228172 277044 271791 195350 176005 159917 187262 150782 142645 144046 170116
10357 170116 204057 179885 134009 59541 92138 106070 86108 97899 46268 6414 -39932
10346 -39932 -60086 16211 19273 -57505 -73649 -28149 48363 59152 41573 49452 54090 70719
10334 70719 135662 164526 147876 143761 141760 164512 192209 174449 232033 249034 176822 60052
10322 60052 -44568 -10894 38982 45632 -4999 -73353 -111112 -110457 -83767 -34101 -61697 -90048
10310 -90048 -82997 -14382 11951 41383 37866 57910 99572 100230 59286 -36799 -74891 -49364
10298d9364K5085j488m7504Q1446J51749K0711o3334l4163l8462R5773J3647q2785
10286G1311m7177l5714l7202J465j7933L3337J9873j0466L5529K0464m2870o8599
10274g7982O1469L5903l8844k151J26L8090k3606k4973K7911Q0589m1509l8208
10262c185m0576l0285O2858J710J9754O3935n2765j8191P1960j1902o3226N3601
10250E3688M7197m5004m9968j8594J667M2263P4334j4912j2106J8519k1407n7401
10238A8276n7657n0831k299N8509P6499J01167j3683j9036k3223k742K4345n8505
10226E0820l141L9021m3849p6368n6363l3263J4034J11054J7717n0990o8209k308
10214a01845j8689J333K8196M9509k1148N4894J09583j4113o1604k8278l1427
$$ plain form
10298 -49364 -24279 -25767 -73271 8175 159924 180635 117301 83138 44676 140449 154096 71311
10286 71311 24134 -11580 -48782 -47317 -65250 -31913 -12040 -22506 13023 33487 -9383 -77982
10274 -77982 -16513 19390 -19454 -21605 -21479 16611 -6995 -31968 -4057 76532 35023 -3185
10262 -3185 -43761 -74046 -11188 -9478 10276 74211 21446 3255 75215 63313 87 53688
10250 53688 100885 55881 5913 -12681 -11014 31249 105583 90671 78565 97084 75677 18276
10238 18276 -39381 -90212 -92511 -34002 42497 143664 129981 110945 87722 84980 109325 50820
10226 50820 47679 86700 42851 -33517 -89880 -123143 -109109 1945 19662 -31328 -99537 -101845
10214 -101845 -120534 -119201 -91005 -41496 -62644 -7750 101833 87720 26116 -2162 -33589
10203c3589p5102J6213R9706K8846Q9550R138M314n2965m5992r27O7336n5819
10191E0709k5692n39K0144k8792K3959K9989m523J068L6642k3035n3854L7155
10179F3231M3713L8445J5871k1494L1363o180J4987k0147k0908J3872q5556J9494
10167H6691P7088K8908l7722N038K7477n25J5999o6756L2947N1190J1426O1107
10155B92868J06197j1960l8596k6417Q617K761p1919m4316J3191J23024K5449
10144C78899L5185P5765R319j20844j37832k5217N3184L5912j7206j5391L4059
10133C05833k7939o5331o615Q2838K5081j06172N9n8937p2349K9685P0491J6975
10121A93619r9858l1781O3136J9903j5864k0964m8155l100O0575k6247l7726M2138
$$ plain form
10203 -33589 -108691 -92478 7228 36074 125624 134762 139076 86111 40119 39192 106528 50709
10191 50709 25017 24478 44622 15830 39789 69778 65255 66323 102965 79930 26076 63231
10179 63231 106944 145389 161260 139766 171129 164949 179936 159789 138881 152753 67197 86691
10167 86691 163779 192687 154965 160003 187480 186955 202954 136198 169145 220335 231761 292868
10155 292868 399065 387105 348509 322092 330709 333470 261551 217235 230426 353450 378899
10144 378899 414084 489849 499168 378324 240492 215275 268459 304371 287165 271774 305833
10133 305833 277894 212563 205948 288786 313867 207695 207754 148817 76468 106153 176644 193619
10121 193619 93761 61980 125116 145019 129155 108191 60036 56936 117511 91264 53538 95676
10109I5676L8909m633Q642l2619j21844j20656L9093L2532P2286J01521m7325
10098F1582o9223k6334k1387m06K8361L9494m8319q668o1318k781M0584J3368
10086e5047j5128K4665M5804n7351L8055m261j3142m5201k5097L2075J03269o0915
10074c2274M1099P4911l1394K5155l6741k2116J2166R8774P0331j62691j24628
10063h7408k2695O2864k8944n7350P3441P7120J7681m9397m3925J7111K8308k2756
10051c5950j8335k6807K3062L6355j7046p2308k5226L5111N1321J4235k6581j8561
10039h0730J119Q2761Q455l8474n6276k45k874O1078J5634k2633k4164J5304K2998
10026a8047K520l4198O1901m8893k1970L3876K8318n0722j1034K2613J1094j3299
$$ plain form
10109 95676 134585 129952 138594 105975 -15869 -136525 -97432 -64900 7386 108907 61582
10098 61582 -7641 -33975 -55362 -55768 -27407 12087 -36232 -44900 -106218 -108999 -68415 -55047
10086 -55047 -70175 -45510 294 -57057 -19002 -23263 -36405 -81606 -106703 -74628 28641 -32274
10074 -32274 8825 83736 52342 77497 40756 18640 30806 129580 199911 37220 -87408
10063 -87408 -110103 -47239 -76183 -133533 -60092 17028 34709 -14688 -58613 -41502 -13194 -35950
10051 -35950 -54285 -81092 -58030 -21675 -38721 -111029 -136255 -101144 -49823 -35588 -62169 -80730
10039 -80730 -79611 3150 11605 -26869 -83145 -83390 -86264 -25186 -9552 -32185 -56349 -41045 -18047
10026 -18047 -15527 -49725 12176 -36717 -58687 -24811 3507 -47215 -58249 -35636 -24542 -37841
10014c7841N4570M842M8399o7804p4830J5473j0495M5992J1994K670j03969K3678
10002h7321R2824L6305J3332m0306o3614q028N106p2238k7893n691n3033O302
9990b04255R6824l7956j0238N7960K0120p164J0877K1306k9867N471k9087j0207
9978a16216K8859J2378K4245n1594j2579L3306m1761N0837j0517l1599L726k808
9966a13723j0207K325Q4805N9012k105K6418N0794o236n0406k5099K4703n0609
9954a0328l8897N400j1430l0785N353L0172L4484J10844L4926q4961o2211k9430
9942d6863L5894K1652l7200j0229N39j8351k4183j3982o3901k0297K7935M0074
9930a08912J9233K3883J3238j8094R693o8878L368P5570n1827J8950L2656K3563
$$ plain form
10014 -37841 16729 21571 69970 2166 -72664 -57191 -67686 -21694 -9700 -7030 -110999 -87321
10002 -87321 5503 41808 55140 14834 -48780 -56808 -51702 -123940 -151833 -157524 -210557 -204255
9990 -204255 -107431 -145387 -155625 -97665 -77545 -84709 -73832 -52526 -82393 -76922 -106009 -116216
9978 -116216 -87357 -74979 -50734 -102328 -114907 -81601 -123362 -72525 -83042 -114641 -110915 -113723
9966 -113723 -123930 -121605 -36800 22212 20107 46525 97319 91083 40677 15578 40281 -10328
9954 -10328 -49225 -43825 -55255 -86040 -80687 -50515 -16031 94813 129739 44778 -17433 -46863
9942 -46863 -10969 10683 -26517 -36746 -36207 -54558 -78741 -92723 -156624 -176921 -148986 -108912
9930 -108912 -89679 -65796 -52558 -70652 -60959 -129837 -126469 -50899 -102726 -83776 -51120 -27557
9918b7557n1528J2881J4445m830N4463N0735J5631p7564j01191N0805M1774j4569
$$ plain form
9918 -27557 -79085 -66204 -51759 -56589 -2126 48609 64240 -13324 -114515 -63710 -21936 -36505
$$ [...]
##END NTUPLES=NMR SPECTRUM
##END=
