##TITLE=Analysis number 312005
Compound Code cc 45704
Book Reference 436/60
Project Code adrs
Chemist Name williamk
##JCAMPDX= 6.0         $$ Bruker NMR JCAMP-DX V2.0
##DATA TYPE= NMR SPECTRUM
##DATA CLASS= NTUPLES
##ORIGIN= Bruker BioSpin GmbH
##OWNER= NMR
$$ XWIN-NMR		Version 3.5
$$ Thu Jul 21 13:48:16 2005 GMT Daylight Time (UT+1h)  MAYBRIDGE\NMR@NMR_250MHZ
##.OBSERVE FREQUENCY= 250.131544655141
##.OBSERVE NUCLEUS= ^1H
##.ACQUISITION MODE= SIMULTANEOUS (DQD)
##.ACQUISITION SCHEME= undefined
##.AVERAGES= 16
##.DIGITISER RES= 18
##SPECTROMETER/DATA SYSTEM= dpx250
##.PULSE SEQUENCE= zg30
##.SOLVENT NAME= CDCl3
##.SHIFT REFERENCE= (INTERNAL, CDCl3, 0, 16.522)
##AUDIT TRAIL= $$ (NUMBER, WHEN, WHO, WHERE, WHAT)
$$ ##TITLE= Audit trail, XWIN-NMR		Version 3.5
$$ ##JCAMPDX= 5.01
$$ ##ORIGIN= Bruker BioSpin GmbH
$$ ##OWNER= NMR
$$ C:\u/data/dgb/nmr/ADRS/6280/pdata/1/auditp.txt
$$ ##AUDIT TRAIL=  $$ (NUMBER, WHEN, WHO, WHERE, WHAT)
(   1,<2005-07-21 13:47:32.88 +100>,<MAYBRIDGE\NMR>,<NMR_250MHZ>,
      <created by zg, POWCHK disabled, PULCHK disabled
       configuration hash MD5:
       62 19 C7 07 E1 42 D1 B7 37 6C 3D D0 77 39 F9 E6
       data hash MD5: 64K
       A4 E6 39 C5 5D D0 2C 4A 8A 82 B0 F4 26 4F E8 3B>)
(   2,<2005-07-21 13:47:50.77 +100>,<MAYBRIDGE\NMR>,<NMR_250MHZ>,
      <Start of raw data processing
       ef LB = 0.3 FT_mod = 6 PKNL = 1 SI = 32K 
       data hash MD5: 32K
       A0 E2 2A F8 83 67 C4 4A 4E DC 34 DA A5 9C 67 95>)
(   3,<2005-07-21 13:47:55.29 +100>,<MAYBRIDGE\NMR>,<NMR_250MHZ>,
      <apk 
       data hash MD5: 32K
       11 56 A9 B5 C3 2C 5C 1D 3D 3B 19 DC F7 E6 F1 0D>)
(   4,<2005-07-21 13:47:56.36 +100>,<MAYBRIDGE\NMR>,<NMR_250MHZ>,
      <abs ABSG = 5 
       data hash MD5: 32K
       9A 80 85 AF 8F 1A A8 E3 58 82 71 3D F4 6A 48 36>)
$$ ##END=
$$ 
$$ hash MD5
$$ FE 3E 77 F5 70 8F 85 E1 57 39 3C D9 E2 33 DA 99
##$RELAX= 
##$RELAX= 
##$RELAX= 
##$RELAX= 
##$RELAX= 
##$RELAX= 
##$RELAX= 
$$ Bruker specific parameters
$$ --------------------------
##$DU= <C:\u>
##$EXPNO= 6280
##$NAME= <ADRS>
##$PROCNO= 1
##$TYPE= <nmr>
##$USER= <dgb>
##$AMP= (0..31)
100 100 100 100 100 100 100 100 100 100 100 100 100 100 100 100 100 100 
100 100 100 100 100 100 100 100 100 100 100 100 100 100 
##$AQSEQ= 0
##$AQ_mod= 3
##$AUNM= <au_zg>
##$AUTOPOS= <32 >
##$BF1= 250.13
##$BF2= 250.13
##$BF3= 250.13
##$BF4= 250.13
##$BF5= 500.13
##$BF6= 500.13
##$BF7= 500.13
##$BF8= 500.13
##$BYTORDA= 1
##$CFDGTYP= 0
##$CFRGTYP= 5
##$CHEMSTR= <none>
##$CNST= (0..31)
1 1 145 1 1 1 1 1 1 1 1 1 1 1 1 1 1 1 1 1 1 1 1 1 1 1 1 1 1 1 1 1 
##$CPDPRG= <>
##$CPDPRG1= <>
##$CPDPRG2= <>
##$CPDPRG3= <>
##$CPDPRG4= <mlev>
##$CPDPRG5= <mlev>
##$CPDPRG6= <mlev>
##$CPDPRG7= <mlev>
##$CPDPRG8= <mlev>
##$CPDPRGB= <>
##$CPDPRGT= <>
##$D= (0..31)
0 1 0 0 0 0 0 0 0 0.06 0 0 0 0 0 0 0.0002 0 0 0 0 0 0 0 0 0 0 0 0 0 0 
0 
##$DATE= 1121950051
##$DBL= (0..7)
120 120 120 120 120 120 120 120 
##$DBP= (0..7)
150 150 150 150 150 150 150 150 
##$DBP07= 0
##$DBPNAM0= <>
##$DBPNAM1= <>
$$ [...]
##$SUBNAM7= <"">
##$SUBNAM8= <"">
##$SUBNAM9= <"">
##$SW= 20.6930455092707
##$SWIBOX= (0..15)
0 0 3 0 0 0 0 0 0 0 0 0 0 0 0 0 
##$SW_h= 5175.983436853
##$TD= 65536
##$TD0= 1
##$TE= 295.16
##$TE2= 300
##$TE3= 300
##$TEG= 300
##$TL= (0..7)
0 120 120 120 120 120 120 120 
##$TP= (0..7)
150 150 150 150 150 150 150 150 
##$TP07= 0
##$TPNAME0= <>
##$TPNAME1= <>
##$TPNAME2= <>
##$TPNAME3= <>
##$TPNAME4= <>
##$TPNAME5= <>
##$TPNAME6= <>
##$TPNAME7= <>
##$TPOAL= (0..7)
0.5 0.5 0.5 0.5 0.5 0.5 0.5 0.5 
##$TPOFFS= (0..7)
0 0 0 0 0 0 0 0 
##$TUNHIN= 0
##$TUNHOUT= 0
##$TUNXOUT= 0
##$USERA1= <user>
##$USERA2= <user>
##$USERA3= <user>
##$USERA4= <user>
##$USERA5= <user>
##$V9= 5
##$VALIST= <valist>
##$VCLIST= <CCCCCCCCCCCCCCC>
##$VD= 0
##$VDLIST= <DDDDDDDDDDDDDDD>
##$VPLIST= <PPPPPPPPPPPPPPP>
##$VTLIST= <TTTTTTTTTTTTTTT>
##$WBST= 1024
##$WBSW= 4
##$XGAIN= (0..3)
0 0 0 0 
##$XL= 0
##$YL= 0
##$YMAX_a= 413010
##$YMIN_a= -343866
##$ZGOPTNS= <>
##$ZL1= 120
##$ZL2= 120
##$ZL3= 120
##$ZL4= 120
##$ABSF1= 16.522
##$ABSF2= -4.171173
##$ABSG= 5
##$ABSL= 3
##$ALPHA= 0
##$AQORDER= 0
##$ASSFAC= 0
##$ASSFACI= 0
##$ASSFACX= 0
##$ASSWID= 0
##$AUNMP= <proc_1d>
##$AZFE= 0.1
##$AZFW= 0.1
##$BCFW= 0
##$BC_mod= 0
##$BYTORDP= 0
##$COROFFS= 0
##$CY= 12.5
##$DATMOD= 1
##$DC= 0
##$DFILT= <>
##$DTYPP= 0
##$F1P= 14.0000005364418
##$F2P= -0.99999901652339
##$FCOR= 0.5
##$FTSIZE= 32768
##$FT_mod= 6
##$GAMMA= 0
##$GB= 0
##$INTBC= 1
##$INTSCL= 1
##$ISEN= 128
##$LB= 0.3
##$LEV0= 0
##$LPBIN= 0
##$MAXI= 10000
##$MC2= 0
##$MEAN= 0
##$ME_mod= 0
##$MI= 0
##$NCOEF= 0
##$NC_proc= -4
##$NLEV= 6
##$NOISF1= 0
##$NOISF2= 0
##$NSP= 0
##$NTH_PI= 0
##$NZP= 0
##$OFFSET= 16.522
##$PC= 1
##$PHC0= -80.35433
##$PHC1= 6.08653
##$PH_mod= 1
##$PKNL= yes
##$PPARMOD= 0
##$PSCAL= 4
##$PSIGN= 0
##$REVERSE= no
##$SF= 250.13
##$SI= 32768
##$SIGF1= 0
##$SIGF2= 0
##$SINO= 400
##$SIOLD= 32768
##$SREGLST= <1H.CDCl3>
##$SSB= 0
##$STSI= 32768
##$STSR= 0
##$SW_p= 5175.98343685301
##$SYMM= 0
##$S_DEV= 0
##$TDeff= 65536
##$TDoff= 0
##$TI= <Analysis number 999999
Compound Code 99
Book Reference 9
Project Code 9>
##$TILT= no
##$TM1= 0
##$TM2= 0
##$TOPLEV= 0
##$USERP1= <user>
##$USERP2= <user>
##$USERP3= <user>
##$USERP4= <user>
##$USERP5= <user>
##$WDW= 1
##$XDIM= 32768
##$YMAX_p= 428784212
##$YMIN_p= -238113
$$ End of Bruker specific parameters
$$ ---------------------------------
##NTUPLES= NMR SPECTRUM
##VAR_NAME=  FREQUENCY,     SPECTRUM/REAL,   SPECTRUM/IMAG
##SYMBOL=    X,             R,               I
##VAR_TYPE=  INDEPENDENT,   DEPENDENT,       DEPENDENT
##VAR_FORM=  AFFN,          ASDF,            ASDF
##VAR_DIM=   32768,         32768,           32768
##UNITS=     HZ,            ARBITRARY UNITS, ARBITRARY UNITS
##FACTOR=    0.157963299565203, 1,           1
##FIRST=     4132.6476996994, 0,             0
##LAST=      -1043.33573715361, 0,           0
##MIN=       -1043.33573715361, -238113,     0
##MAX=       4132.6476996994, 428784212,     0
$$ Real data points
##PAGE= N=1
##DATA TABLE= (X++(R..R)), XYDATA
$$ [...]
20719b6130L5232O190k0120K917J6957J7375n2642k6827J6602k8807k4959k3985
$$ -26130 9102 15292 -4828 -1911 15046 32421 -20221 -47048 -30446 -59253 -84212 -108197
20707a08197K67K2273M2626K4067p96q1819N2859N1075l0165K877L0136L7418
$$ -108197 -107930 -85657 -43031 -18964 -19760 -101579 -48720 2355 -27810 -24933 5203 42621
20695D2621l8011m6024j2238K1777o505P4340N1580J2887n7293k5447k6506M275
$$ 42621 4610 -41414 -53652 -31875 -38380 35960 87540 100427 43134 17687 -8819 -4544
20683d544N16L491J6301j4230J1797J1427k2335o3107k077K1654K1526k1900k6598
$$ -4544 -4028 -537 15764 1534 13331 24758 2423 -60684 -62761 -41107 -19581 -41481 -68079
20670f8079M3917r565j5383k7395J6703L2855j7393j9283L4405L0629M8848P919
$$ -68079 -24162 -33727 -49110 -76505 -59802 -26947 -44340 -63623 -29218 1411 50259 58178
20658E8178r955k6342j7805J6467K0332K3779K0842l7514r720l870l025K4783
$$ 58178 48223 21881 4076 20543 40875 64654 85496 47982 38262 34392 31367 56150
20646E6150R1329m7504n9860l7383L2913J3521m3260p5240q65k6906j4061K1755
$$ 56150 147479 99975 40115 2732 35645 49166 5906 -69334 -70199 -97105 -111166 -89411
20634h9411N4285P4139M7492K4625m4880j320j2632j5157n909l9192N3497R4884
$$ -89411 -35126 39013 86505 111130 66250 64930 52298 37141 31232 -7960 45537 140421
20622A40421m6245P652j3097k3422p676l9110k6846L992K2308J447j5800p599
$$ 140421 94176 101828 88731 65309 57633 18523 -8323 -4331 17977 19424 3624 -3975
20610c975O4697l059k0150m253k5416n4283R896L4326N0181N7769J4979m1474
$$ -3975 60722 57663 37513 33260 7844 -46439 -36543 -2217 47964 105733 120712 79238
20598G9238n2986k2694O9727j6045l1044J7692l3676r402K3500o302J4409k9392
$$ 79238 26252 3558 73285 57240 26196 43888 10212 810 24310 18008 32417 3025
20586C025j9143L9501J4842k8329j6914K9688K295l2108J1802J3660l376k8606
$$ 3025 -16118 23383 38225 9896 -7018 22670 24965 -7143 4659 18319 14943 -13663
20574a3663l6770Q995Q305M8294J3679l3604m9062n548N7852K8104m614l9738
$$ -13663 -50433 -41438 -33133 15161 28840 -4764 -53826 -59374 -1522 26582 21968 -17770
20562a7770p282O6404N5424J1607j7763k0189n1977r963J1668J596p084r149J0683
$$ -17770 -25052 41352 96776 108383 90620 70431 18454 8491 20159 21755 14671 5522 16205
20549A6205K7954o047M485k6164l7455K0684L2697j3816j3944j7406N1763K8672
$$ 16205 44159 38112 42597 16433 -21022 -338 32359 18543 4599 -12807 38956 67628
20537F7628k2284m2922j127j0908N2524M5133n0790j7187J5419K2450p2150j9430
$$ 67628 45344 2422 1295 -9613 42911 88044 37254 20067 35486 57936 -14214 -33644
20525c3644l4660n9072J8815P0538M194L4541K5629o2282n5446K1342M3126k842
$$ -33644 -68304 -127376 -108561 -38023 -33829 712 26341 -35941 -91387 -70045 -26919 -29761
20513b9761l0985j1184K2674K1863l3902k6807L7294L7968L6862j6047N3099O1880
$$ -29761 -60746 -71930 -49256 -27393 -61295 -88102 -50808 -12840 24022 7975 61074 122954
20501A22954n6117L306K1369l1308q3900k4240L0752R8617j1548p8090l7028k5592
$$ 122954 66837 70143 91512 60204 -23696 -47936 -17184 81433 69885 -8205 -45233 -70825
20489g0825o1877Q2l3015L3082M0845k0535o561M4945K5629N4177O8257j527k1579
$$ -70825 -132702 -132620 -165635 -132553 -91708 -112243 -118804 -73859 -48230 5947 74204 72677 51098
20476E1098k4916j4757j4711n852O401j0002l3561M1739K7061K699j1801m4799
$$ 51098 26182 11425 -3286 -9138 -2737 -12739 -46300 -4561 22500 25199 13398 -31401
20464c1401k989l6104J3879Q1204N2465j4889O403L5582j3157l1405P862O326
$$ -31401 -34390 -70494 -56615 24589 77054 62165 68568 104150 90993 59588 67450 73776
20452G3776j0660k7392k4664k4020J4025J3203o7049p866J5480K3306k8115K4369
$$ 73776 63116 35724 11060 -12960 1065 14268 -52781 -60647 -45167 -21861 -49976 -25607
20440b5607M3455M9815m7192l5014L6589J2584k0210q4688n8209M5517J8512m1694
$$ -25607 17848 67663 20471 -14543 22046 34630 14420 -70268 -128477 -82960 -64448 -106142
20428a06142L4678K6438R9297L7297o7997l8891Q018J8127L0642Q0428n558k7047
$$ -106142 -71464 -45026 54271 91568 23571 -15320 -7302 10825 41467 121895 116337 89290
20416H9290r032k5056j5473M6970P2462M8582K8730o9328r408l8162m3388K128
$$ 89290 80258 55202 39729 86699 159161 207743 236473 167145 157737 119575 76187 78315
20404G8315K6975j8783l7060p750L0875L5649p5909j9998L9464L7583K4692L1
$$ 78315 105290 86507 49447 41697 72572 108221 32312 12314 51778 89361 114053 114084
20392A14084m409L1986K8307p6530n3753l4315q439O0519J5326k1919k8479J215
$$ 114084 109675 141661 169968 93438 39685 5370 -3069 57450 72776 50857 22378 23593
20380B3593j2592n5904m413O4346L9903O7346k789m8916m5964k6431j8919k5400
$$ 23593 11001 -44903 -49316 15030 54933 122279 119490 70574 24610 -1821 -20740 -46140
20368d6140K3241O418J0470J565o268K6141K7077j1402p714M0481k9702k5442
$$ -46140 -22899 -16481 -6011 -4446 -10714 15427 42504 31102 23388 63869 34167 8725
20356H725l6737O525K3968L2232J1896l0776j7789k3485L682O9146m0022k3958
$$ 8725 -28012 -21487 2481 34713 46609 15833 -1956 -25441 -21759 47387 7365 -16593
20344a6593O599K2215P611K9785K7192l2080m1781K3660M8127K4156N791m1560
$$ -16593 -9994 12221 19832 49617 76809 44729 2948 26608 74735 98891 104682 63122
20332F3122p0028j2022o875J87L4171N0121K6956L7977j9496o0797k8389k6096
$$ 63122 -6906 -18928 -25803 -25616 8555 58676 85632 123609 104113 43316 14927 -11169
20320a1169P529O5540K411J6388J2297l3752j3740K4957l6584j1818M638L3083
$$ -11169 -3640 61900 64311 80699 92996 59244 45504 70461 33877 22059 26697 59780
20308E9780L081j8622p138P974n4911r466K1630L464Q3627O0659j6339m4894Q873
$$ 59780 62861 44239 37101 45075 -9836 -19302 2328 5792 89419 150078 133739 88845 97718
20295I7718K257k3005m9987p830k743K6097j1116M6199l640m3304m2731O360N0718
$$ 97718 99975 76970 26983 19153 16410 42507 31391 77590 73950 30646 -12085 -5725 44993
20282D4993P0871l9626j4485k0913J2266q77L0023m1414l3304o209q705J3921
$$ 44993 115864 76238 61753 40840 53106 52229 82252 40838 7534 1325 -7380 6541
20270F541l4036N686K5604k7088l9742p423J5527L1812J5578j3448n839L1172
$$ 6541 -27495 -21809 3795 -23293 -63035 -70458 -54931 -23119 -7541 -20989 -26828 4344
20258D344j836J2160L563M2917P9037M7584J6550j2176m8262o86m7105m0546Q153
$$ 4344 2508 14668 18231 61148 140185 187769 204319 192143 143881 143195 96090 55544 63697
20245F3697n3720n5277M1739M2072K0533J2388L5311k1000K428l1299o3999J3044
$$ 63697 9977 -45300 -3561 38511 59044 71432 106743 85743 88171 56872 -7127 5917
20233E917J8571k9404P0955R4607l422m2752J5605q9043n3442N3485P6220L9921
$$ 5917 24488 -4916 66039 160646 157224 114472 130077 41034 -12408 41077 117297 157218
20221A57218N804o4358r5721L6168R00j6115R5124N340q1020O402j2798L9368
$$ 157218 163022 98664 2943 39111 40011 23896 119020 124360 43340 49742 36944 76312
20209G6312Q6716N1274l4350m4718j9106J3163K301l566k2383n4078M6033N2954
$$ 76312 163028 214302 179952 135234 116128 129291 131592 128026 105643 51565 97598 150552
20197A50552k2508l1122j7120l6769n2228k4583N844N8270L2085J4572M37M5155
$$ 150552 128044 96922 79802 43033 -9195 -33778 -27934 30336 62421 76993 77430 122585
20185A22585J5591N4310R905k0451j2556J2829J3078M5720J0782l5891K0078O1905
$$ 122585 138176 192486 202391 181940 169384 182213 195291 241011 251793 215902 235980 297885
20173B97885J03316K06662K08587J42850J45791J14062o232j6009l9028j01329
$$ 297885 401201 607863 816450 959300 1105091 1219153 1212921 1196912 1157884 1056555
20163A056555j32095j11314j51700j13308j80058n8501M229q0026j8899n3511
$$ 1056555 924460 813146 661446 548138 368080 309579 313808 233782 214883 161372
20153A61372j1435M3769J2208l5457n3405o2874k822J036L324j5948j9931J2360
$$ 161372 149937 193706 205914 170457 117052 54178 51356 52392 55716 39768 19837 32197
20141C2197K9203K1218m5287J5848K8590N4742k7812J7142K6547j6970P296J2619
$$ 32197 61400 82618 37331 53179 81769 136511 108699 125841 152388 135418 142714 155333
20129A55333j0792q1306k9486j2234L7506k7987m7911K4478l291r759M6395O790
$$ 155333 144541 63235 33749 21515 59021 31034 -16877 7601 4310 -5449 40946 47736
20117D7736J0872N6067k016k8492J3651l2980m6334L3870P5419L200q2176l5851
$$ 47736 58608 114675 112659 84167 97818 64838 18504 52374 127793 130993 48817 12966
20105A2966o6323p3582K4646J1171L2471P2870l4009Q499R0088o2l9050j1667
$$ 12966 -53357 -126939 -102293 -91122 -58651 14219 -19790 -11291 78797 78735 39685 28018
20093B8018K6605K1966J6702k3785p0844P788n0390k3843R5339O9352K60r530
$$ 28018 54623 76589 93291 69506 -1338 6450 -43940 -67783 27556 96908 97168 87638
20081H7638K1014j7680q1984K6307J0345m0548m721J6876J5670L7521N0238L9450
$$ 87638 108652 90972 8988 35295 45640 5092 371 17247 32917 70438 120676 160126
20069A60126n1076n8350J33P5347J0551n0588m9985Q6714K9655k839j0957m4710
$$ 160126 109050 50700 50833 126180 136731 86143 36158 122872 152527 149688 138731 94021
20057I4021M399n862O494k5542J6072j8935o434q102n7800K8764J07767k3840
$$ 94021 98420 92558 99052 73510 89582 70647 64213 56111 -1689 27075 134842 111002
20045A11002l3051l6684n5158N1901L5977L7644M247J7201J778l2161m914o4678
$$ 111002 77951 41267 -13891 38010 73987 111631 115878 133079 134857 102696 97782 33104
20033C3104J7193k8339j2785K6613O9469P4510o3718o7060l5170l525O6815j7845
$$ 33104 50297 21958 9173 35786 105255 179765 116047 48987 13817 10292 77107 59262
20021E9262M2995k4471o2420J3937P727l2703l2859O4240O2334l12n0884k649
$$ 59262 102257 77786 15366 29303 37030 4327 -28532 35708 98042 97730 46846 44197
20009D4197J7702K2688K2563m452m7101k4331j5965k7815O981l2374j1969M8771
$$ 44197 61899 84587 107150 102698 55597 31266 15301 -12514 -5533 -37907 -49876 -1105
19997a105K9420N254K0062j9010n8504n6161M1700P8508n318R334J8608j8631
$$ -1105 28315 33569 53631 34621 -23883 -80044 -38344 40164 34846 44180 62788 44157
19985D4157j812j560j1702P749K869N1235Q8318l8156o9546m3381P352R765n254
$$ 44157 42345 40785 29083 36832 39701 90936 179254 141098 71552 28171 35523 45288 40034
19972D0034K1536R21j8007l61K0811n8786p342j3885N7017K5437L3284L3812j307
$$ 40034 61570 62491 44484 44123 64934 6148 -1194 -15079 41938 67375 100659 134471 133164
19959A33164n130K254p4368k9946L9001P3623L9415k0872K4685R791N5915L5223
$$ 133164 128034 130288 55920 25974 64975 138598 178013 157141 181826 191617 247532 282755
19947B82755J2553N546o105l2657j8299P1657O6625M7705J16653J04004J03471
$$ 282755 295308 300854 294749 262092 243793 315450 382075 429780 546433 650437 753908
19936G53908R5884J56832J22954J07958M8243l2220j54921j27294j13072j11915
$$ 753908 849792 1006624 1129578 1237536 1285779 1253559 1098638 971344 858272 746357
19926G46357q8228j43692q0994m273j7092n9272m5373l5029l5033J0285m1280
$$ 746357 658129 514437 433443 429170 412078 352806 307433 272404 237371 247656 206376
19915B06376o5138N0660J404l720k1616O021M7333J6810n3253J4495k693k7407
$$ 206376 141238 191898 193302 189582 167966 173987 221320 238130 184877 199372 196679 169272
19903A69272j0899k1746j6834l7783k8414K9008k961J4681N2898l1381j5538J4537
$$ 169272 158373 136627 119793 82010 53596 82604 79643 94324 147222 115841 100303 114840
19891A14840l627K6924K3430l6850l8397K0870K3650j9110j1993j7977L9101K9491
$$ 114840 111213 138137 161567 124717 86320 107190 130840 111730 99737 81760 120861 150352
19879A50352L2067p090k1182l0363o906p326J5453j4040l012l3869k0400r855
$$ 150352 182419 175329 154147 123784 116878 109552 125005 110965 107953 74084 53684 43829
19867D3829M4916N7550j8586o8625K849j2432L3789J3686j4241L7388N0762J2845
$$ 43829 88745 146295 127709 59084 61933 49501 83290 96976 82735 120123 170885 183730
19855A83730o6948q774J7284K6030k1188R994N0299J7708n9508j7645p961k259
$$ 183730 116782 108008 125292 151322 130134 140128 190427 208135 148627 130982 123021 120762
19843A20762k6385l1193L0187o962l8920n697L0650O7582J3573m0618J2566L491
$$ 120762 94377 63184 93371 86409 47489 41792 72442 140024 153597 112979 125545 129036
19831A29036Q473J9925K9395J3989o24K347K307j4691n1629n066K8344M6764n0955
$$ 129036 137509 157434 186829 200818 200194 202541 204848 190157 138528 133462 161806 208570 157615
19818A57615o7042K7707k3389p6932k1782l6732L3412K4215j3514P605K8488K0126
$$ 157615 90573 118280 94891 17959 -3823 -40555 -7143 17072 3558 11163 39651 59777
19806E9777n5000l5062O0486L832n2667k26M075J4667k4943L6764m663L0654L2611
$$ 59777 4777 -30285 30201 34033 -18634 -18860 -14785 -118 -25061 11703 7040 37694 70305
19793G0305L7708K3575k1262j61j1284n3392N1784M3548k7552j3211M6603L114
$$ 70305 108013 131588 110326 110165 98881 45489 97273 140821 113269 100058 146661 149775
19781A49775m3956j241K9663M4871L8021k8880n770N0251k8289n6330o859k0002
$$ 149775 105819 104578 134241 179112 217133 188253 182483 232734 204445 148115 141256 121254
19769A21254K2503N3816Q1408M2589J9042k6894K601k6146K1514m8300j151M3342
$$ 121254 143757 197573 278981 321570 340612 313718 316319 290173 311687 263387 262236 305578
19757C05578m4004J1809N4790l1141q0092o041j0985j5822K737j0819j359L2531
$$ 305578 261574 273383 328173 297032 216940 210899 199914 184092 186829 176010 174651 207182
19745B07182n1536j20666k9141J0723K9328O708L0567R4706M2119m1667k7539
$$ 207182 155646 34980 5839 16562 45890 52598 83165 177871 219990 178323 150784
19734A50784j7505o299K3164j6467K7785l290Q385N4717k253l1001K3766K4994
$$ 150784 133279 126980 150144 133677 161462 158172 166557 221274 219021 188020 211786 236780
19722B36780l4267j4939M4325j4893j1408o186m919l6488J0651J02604O419q7984
$$ 236780 202513 187574 231899 217006 205598 199412 194493 158005 168656 271260 277679 189695
19710A89695j1942N3254M477q564n1608o2416J2938M6278m106n6375q313K6018
$$ 189695 177753 231007 235484 226920 175312 112896 125834 172112 168006 111631 103318 129336
19698A29336R0218L6357J6790p8446l0853n833M0506q203k1179j3766r186n6328
$$ 129336 219554 255911 272701 194255 163402 157569 198075 189872 168693 154927 145741 89413
19686H9413m6033J8346O869Q6451j1376l0829p5436J1354M7546q756l9618o4328
$$ 89413 43380 61726 68595 155046 143670 112841 37405 48759 96305 87549 47931 -16397
19674a6397k0284L8086Q2357N6359m9801k927L1829p0945j7128M3316o283O1420
$$ -16397 -36681 1405 83762 140121 90320 87393 119222 48277 31149 74465 68182 129602
19662A29602K7191L8165K3122N23k3273j7949L7307P0048J1855K5226n2980o1717
$$ 129602 156793 194958 218080 218603 195330 177381 214688 284736 296591 321817 268837 207120
19650B07120j5047Q0243j6644J7162L9854r405L9056J07608J73979J42525J07739
$$ 207120 192073 272316 255672 272834 312688 303283 342339 449947 623926 766451 874190
19639H74190J74333K36629K42136J24376M0979o5859j60947j11431p7729q8794
$$ 874190 1048523 1285152 1527288 1651664 1692643 1626784 1465837 1354406 1276677 1187883
19629A187883q2017l0039L9023M6194P4241j5633l0048j7168o8758p1024J4803
$$ 1187883 1105866 1075827 1114850 1161044 1235285 1219652 1189604 1172436 1103678 1032654 1047457
19618A047457j9246n0363n6755l2868q8399p0872k2981m8916k7483K4963J7153
$$ 1047457 1028211 977848 921093 888225 799826 728954 705973 657057 629574 654537 671690
19607F71690l4261j4349M4437M44m3842J0964J8316M4423M5850K8974M6710K3330
$$ 671690 637429 623080 667517 667961 624119 635083 653399 697822 743672 772646 819356 842686
19595H42686K0631J5046L65K6316M5452L3806k2684j8838M4440O8079J25694Q4627
$$ 842686 863317 878363 878728 905044 950496 984302 961618 942780 987220 1055299 1180993 1265620
19583A265620R5188J67629J33804P0919l3934j4558J9277M385R786q3316m1634
$$ 1265620 1360808 1528437 1662241 1733160 1699226 1684668 1703945 1708330 1718116 1634800 1593166
19572A593166J9720N2697M364k0262l3246l5506k2102R242k830l7983L3450K1988
$$ 1593166 1612886 1665583 1669947 1649685 1616439 1580933 1558831 1568073 1565243 1527260 1560710 1582698
19560A582698M1042O7498O1105J00865O8626L8010J15927J61855J80516J98409
$$ 1582698 1623740 1691238 1752343 1853208 1921834 1959844 2075771 2237626 2418142 2616551
19550B616551K41717K58624K45960K29549K60680K46010J84662N8875M9303J9755
$$ 2616551 2858268 3116892 3362852 3592401 3853081 4099091 4283753 4342628 4391931 4411686
19540D411686J67629J03627J21284J68365J72558K74067L03946K67754K83907
$$ 4411686 4579315 4682942 4804226 4972591 5145149 5419216 5723162 5990916 6274823
19531F274823L59272M54384N37011O51670Q29542R50526J182413J461688J731475
$$ 6274823 6634095 7088479 7625490 8277160 9106702 10057228 11239641 12701329 14432804
19522A4432804K137558K665442L265257M147072N282005O829485R023364J1995295
$$ 14432804 16570362 19235804 22501061 26648133 31930138 38759623 47782987 59778282
19514E9778282J5873802K0370260K4556602K7174755K6853809K2566920J4340301
$$ 59778282 75652084 96022344 120578946 147753701 174607510 197174430 211514731
19507B11514731L471990q158753j7713034k4004628k6650102k5896667k2979549
$$ 211514731 214986721 206827968 189114934 165110306 138460204 112563537 89583988
19500H9583988j8927746j4896805j1416936q615049o561062n054856l862911l017492
$$ 89583988 70656242 55759437 44342501 35727452 29166390 24111534 20248623 17231131
19492A7231131k449267j963471j580583j260823j032508q57510p54399o97069
$$ 17231131 14781864 12818393 11237810 9976987 8944479 8086969 7332570 6635501
19484F635501n79344n32758m09447l31438j80405j26894j38073j76653j06194
$$ 6635501 6056157 5523399 5113952 4782514 4602109 4475215 4337142 4160489 4054295
19475D054295k6884o1026k3347L3907J3006j3180o6588k15781k69739l09359l15475
$$ 4054295 4027411 3966385 3943038 3976945 3989951 3976771 3910183 3694402 3424663 3115304 2799829
19464B799829k50638j95576j47384o3610j08814q3841q6007r2240j31573o0778
$$ 2799829 2549191 2353615 2206231 2142621 2033807 1949966 1863959 1771719 1640146 1579368
19454A579368q0926j28208o6112j13929j26418p4180n6980m9672L9517m5414k8878
$$ 1579368 1498442 1370234 1304122 1190193 1063775 989595 932615 882943 922460 877046 848168
19443H48168j156k4282k0454k4132L0182m2903l4098J2583j409q5110l5008K1710
$$ 848168 847012 822730 802276 778144 808326 765423 731325 743908 742499 657389 622381 644091
19431F44091O7587J7426L599O2178N0513J8640k7858q6100k7345K0350j6647Q1234
$$ 644091 711678 729104 732703 794881 845394 864034 836176 750076 722731 743081 726434 807668
19419H07668N6126M2786K5330n015p859J7385m265k3385J3568M0723P8921J08215
$$ 807668 863794 906580 931910 926895 919036 936421 932156 908771 922339 963062 1041983 1150198
19407A150198J32047R6770q886k9720m4209r7168r4653n5080m0638q9993p1195
$$ 1150198 1282245 1379015 1370129 1340409 1296200 1199032 1104379 1049299 1008661 918668 847473
19396H47473P79K1860j9210l2356Q170m2368k6112l8811M8471K9787k4783o2697
$$ 847473 848252 870112 850902 818546 826716 784348 758236 719425 767896 797683 772900 710203
19384G10203o2581o297o1154J5934R8995J07118m1787J9031M1108K6283K6470
$$ 710203 647622 641325 580171 596105 695100 802218 760431 779462 820570 846853 873323
19373H73323L2479k0111j2524J6353P25l3285k2509L3535N8375K1660M6159P649
$$ 873323 905802 885691 873167 889520 890245 856960 834451 867986 926361 948021 994180 1001829
19361A001829j6937L8571M1863l9323K240J16837P2027J06770J99689J05590L3492
$$ 1001829 984892 1023463 1065326 1026003 1028243 1145080 1217107 1323877 1523566 1629156 1662648
19350A662648J4711q1940q9683m6949m1695K5000k6102k1185k3755Q356O1958
$$ 1662648 1677359 1595419 1505736 1458787 1417092 1442092 1415990 1394805 1371050 1379406 1441364
19339A441364O8728L5280L836k4964O4629J30838L8133N0505N7692J01140J24450
$$ 1441364 1510092 1545372 1549208 1524244 1588873 1719711 1757844 1808349 1866041 1967181 2091631
19328B091631J56852K36402J84350J63509J11662Q6018P5307L9739K6473Q3602
$$ 2091631 2248483 2484885 2669235 2832744 2944406 3030424 3105731 3145470 3171943 3255545
19318C255545J16224J18248M8518J7422Q1846J08280J20879J59199K20250K68216
$$ 3255545 3371769 3490017 3538535 3555957 3637803 3746083 3866962 4026161 4246411 4514627
19308D514627L20602L94397M66540M94227M90376N91005O35229N40663N10753
$$ 4514627 4835229 5229626 5696166 6190393 6680769 7271774 7907003 8447666 8958419
19299H958419O38885P27517Q27597J044146J210110J403939J803999K293733K805994
$$ 8958419 9597304 10324821 11152418 12196564 13406674 14810613 16614612 18908345 21714339
19290B1714339L446459M288094N454716P076514R201297J2086831J5964786K0555121
$$ 21714339 25160798 29448892 34903608 41980122 51181419 63268250 79233036 99788157
19282I9788157K5103366K7904712K6931407K1129810J0777717j924955j3693070
$$ 99788157 124891523 152796235 179727642 200857452 211635169 209710214 196017144
19275A96017144k2154547k6270750k6321943k3609718j9715202j5677754j2136572
$$ 196017144 173862597 147591847 121269904 97660186 77944984 62267230 50130658
19268E0130658r237594p084528n506697m338927l378145k685310k098746j730302
$$ 50130658 40893064 33808536 28301839 23962912 20584767 17899457 15800711 14070409
19260A4070409j408999j121313q63533q26537p76189o56994o02454o10242n25343
$$ 14070409 12661410 11540097 10676564 9850027 9073838 8416844 7814390 7204148 6678805
19251F678805m06709l35819l51427l28410k43561k07719j74281k37810l31960
$$ 6678805 6272096 5936277 5584850 5256440 5012879 4805160 4630879 4393069 4061109
19242D061109k74964k24749j92178j54725j01501o8691r7362q1401j29094j40076
$$ 4061109 3786145 3561396 3369218 3214493 3112992 3044301 2946939 2865538 2736444 2596368
19232B596368p0961j8217q4410j59087j47767j43736j12329j28683p7828k817
$$ 2596368 2525407 2507190 2422780 2263693 2115926 1972190 1859861 1731178 1653350 1650533
19222A650533m518m1044o3254M698M3403m3361m2831J6547n2106m3462L6026j1501
$$ 1650533 1646015 1604971 1541717 1546415 1589818 1546457 1503626 1520173 1468067 1424605 1460631 1449130
19210A449130N4856J3876J2225j4893J8030N8064j6170l1573R679K205n5637M8613
$$ 1449130 1503986 1517862 1530087 1515194 1533224 1591288 1575118 1543545 1553224 1555429 1499792 1548405
19198A548405J38002J31994Q5444m040r469l3698q6985j33453j33497j44802m5594
$$ 1548405 1686407 1818401 1903845 1899805 1890336 1856638 1769653 1636200 1502703 1357901 1312307
19187A312307K1161N588m7774J9604k8089j7263k1135k5347N8914j9992l6718
$$ 1312307 1333468 1339056 1291282 1310886 1282797 1265534 1244399 1219052 1277966 1257974 1221256
19176A221256l3023J2874N4013M939k7363L7318P9284K7111N6355L5285L0921
$$ 1221256 1188233 1201107 1255120 1260059 1232696 1270014 1349298 1376409 1432764 1468049 1498970
19165A498970M2703K0339J672K0500L9323R3872Q3680O3476R8298J06630P1096
$$ 1498970 1541673 1562012 1563684 1584184 1623507 1717379 1801059 1864535 1962833 2069463 2140559
19154B140559O0445J05247J39978J63446K25668L47299M55548L83882M21939M43622
$$ 2140559 2201004 2306251 2446229 2609675 2835343 3182642 3638190 4022072 4444011 4887633
19144D887633L68529L44676K80816L64735M81043O89559R21133J264616J763843
$$ 4887633 5256162 5600838 5881654 6246389 6727432 7416991 8338124 9602740 11366583
19135A1366583K411910L282317M264785M803553M442322L197972J943107J272686
$$ 11366583 13778493 17060810 21325595 26129148 30571470 33769442 35712549 36985235
19127C6985235J713486L902257Q361443J5315585K3763234L0651337L3030759
$$ 36985235 38698721 42600978 50962421 66278006 90041240 120692577 153723336
19120A53723336K7215000J5222496K911420q447522j7393751k2775678k4217277
$$ 153723336 180938336 196160832 199072252 190624730 173230979 150455301 126238024
19113A26238024k2282581j7186011j0513404m178221O5276Q48746j755117n393264
$$ 126238024 103955443 86769432 76256028 72077807 72143083 72991829 71236712 65843448
19105F5843448q464793j0015379r610342q044442o157957m391313k955330j912208
$$ 65843448 57378655 47363276 37752934 29708492 23550535 19159222 16203892 14291684
19097A4291684j135412n72549j68330O7382J30868J48254O2956Q3328K67129N57020
$$ 14291684 13156272 12583723 12415393 12482775 12613643 12761897 12824853 12908181 13175310 13732330
19087A3732330R31944J587724K521847M054211O090724Q705680J0875764J1604952
$$ 13732330 14664274 16251998 18773845 22828056 28918780 37624460 48500224 60105176
19079F0105176R716776N367421R30875j842403j525498K316236Q979383J6818023
$$ 60105176 69821952 75189373 76120248 74277845 72752347 75068583 84047966 100865989
19071A00865989K4073050K8836755K9776759K6873201J8483138L006028j4397629
$$ 100865989 124939039 153775794 183552553 210425754 228908892 231914920 217517291
19064B17517291k7737841l5319543l4872819k9180525k1266898j3442351p265205
$$ 217517291 189779450 154459907 119587088 90406563 69139665 55697314 48432109
19057D8432109l362848k108018k860425m146382n139621n404223m977970m134046
$$ 48432109 45069261 42961243 40100818 35954436 30814815 25410592 20432622 16298576
19049A6298576l114905k363250j661602j173057q96023o27861m81607m35861l82848
$$ 16298576 13183671 10820421 9158819 7985762 7089739 6461878 5980271 5544410 5161562
19040E161562m47279m93416m62089l80449m06631k84049k18676j62904j67606
$$ 5161562 4714283 4220867 3758778 3378329 2971698 2687649 2468973 2306069 2138463
19031B138463j08940j63024j27704o1173p8964j72560j61062j27557j9220l2695
$$ 2138463 2029523 1866499 1738795 1677622 1598658 1426098 1265036 1137479 1118259 1085564
19021A085564J4686n03l9564k8113M8838M8833p0236m9186m6169q6137p6854n2208
$$ 1085564 1100250 1099747 1060183 1032070 1080908 1129741 1059505 1010319 964150 878013 801159 748951
19009G48951n5914L2359O551n1242q1751l2480n250n4761m3421r445k0048N9958
$$ 748951 693037 725396 731947 680705 598954 566474 561224 506463 463042 453597 433549 493507
18997D93507J2001n103l4010n1025j1567M4254m2059o2427l401L4339P071O1662
$$ 493507 505508 500405 466395 415370 403803 448057 405998 343571 340170 374509 381580 443242
18985D43242L4256q8734L4339j5785q6748n1557O48N5967O5833k979L2926j9345
$$ 443242 477498 388764 423103 407318 320570 269013 269661 325628 391461 388482 421408 402063
18973D02063l2981j4947j191j9197l45K7144k4521k1509n212K3910M242Q254J6810
$$ 402063 369082 354135 352944 333747 333402 360546 336025 314516 309304 333214 337456 345710 362520
18960C62520P667j972l5795M0499N06N875m2045p1740P417J9544M8305k5034l9986
$$ 362520 370187 368215 332420 372919 373425 379300 337255 265515 272932 292476 340781 315747 275761
18947B75761J6685N1237j745n234p8891q775K8690l4506k4034M0460k8951q249
$$ 275761 292446 343683 341938 336704 257813 249038 277728 243222 219188 259648 230697 222448
18935B22448L2529j6143J157k9721j02469J6678J8344l3166k7220M5867M8245
$$ 222448 254977 238834 239991 210270 107801 124479 142823 109657 82437 128304 176549
18924A76549Q718l2539M3011P677L0580O612p6818L583L9591n9810k7375P9280
$$ 176549 185267 152728 195739 203416 233996 240608 163790 167373 206964 147154 119779 199059
18912A99059R0711j4276n3183O8056M0732q06m5619r896m6862n1721Q974J8175
$$ 199059 289770 275494 222311 290367 331099 330293 284674 274778 227916 176195 185169 203344
18900B03344M2925L6873j4090j9627K6154k3222l5163L0159K8792o942l4654k9647
$$ 203344 246269 283142 269052 249425 275579 252357 217194 247353 276145 269203 234549 204902
18888B04902l8639r498q787n8560M9194K2673N0395J8842m4954m0587r7437m384
$$ 204902 166263 156765 147978 89418 138612 161285 211680 230522 185568 144981 47544 43160
18876D3160Q3680J9379L51K290m1239m8487n8225P626O2347Q0161J3117k9198
$$ 43160 126840 146219 146570 148860 107621 59134 909 8535 70882 151043 164160 134962
18864A34962j0298J1563L5137M850j5282l6299l0536P3094M4493P0247L8497O8412
$$ 134962 124664 136227 171364 176214 160932 124633 94097 167191 211684 281931 320428 388840
18852C88840M3556l9834N4116Q2432P1582R8285J61852K21821K54388K64711J81780
$$ 388840 432396 392562 446678 529110 600692 698977 860829 1082650 1337038 1601749 1783529
18841A783529J52408N6946k0704n8659j31212j89499j48058j16054j47322q2241
$$ 1783529 1935937 1992883 1972179 1913520 1782308 1592809 1444751 1328697 1181375 1099134
18831A099134j8856O054l4513m8589p8795l4126o9581n7990q6874m3582n7303
$$ 1099134 1080278 1086332 1051819 1003230 924435 890309 820728 762738 675864 632282 574979
18820E74979r7974m5783n9058k6655J8338J009k5516j9588j3604N070j9057l2448
$$ 574979 477005 431222 372164 345509 363847 364856 339340 319752 306148 311218 292161 259713
18808B59713m5179J3486J7021l5277j595O0301K4705m3844j4798K8308J0426m9775
$$ 259713 214534 228020 245041 209764 208169 268470 293175 249331 234533 262841 273267 223492
18796B23492K6686j2328N8986M5832N447N06N9043J04668P4610J5102M0623j759
$$ 223492 250178 237850 296836 342668 348115 348621 407664 512332 586942 602044 642667 640908
18784F40908R5852N7611n0225k321j9648l4791m6246N1376L1348m3180j9307k3750
$$ 640908 736760 794371 744146 741825 722177 687386 641140 692516 723864 680684 661377 637627
18772F37627L709j6315K9191L3456J35584J33962N9177j5181n5522j18987j61844
$$ 637627 641336 625021 654212 687668 823252 957214 1016391 1001210 945688 826701 664857
18761F64857r6361j25767q6949o0723n7162k357n3005m7704k0995l0452j6740
$$ 664857 568496 442729 355780 295057 237895 235538 182533 134829 113834 83382 66642
18750F6642r375K0487O779j6792k31l846J6906j9665j5696K2858O193J1658n2588
$$ 66642 57267 77754 84533 67741 67510 63664 80570 60905 45209 68067 74260 85918 33330
18737C3330l2683j6800K0162k5004Q474J7986K9370Q7247J2962m3330k7105M3338
$$ 33330 647 -16153 4009 -20995 -12521 5465 34835 122082 135044 91714 64609 107947
18725A07947Q4515N4564o7045m6961L4478M5375R1195M0122J4371K1330M8405
$$ 107947 192462 247026 179981 133020 167498 212873 304068 344190 358561 379891 428296
18714D28296P348J5054n3813q7322n3787l1469j02811j0127J5715m0370Q445M5358
$$ 428296 435644 450698 396885 309563 255776 224307 121496 111369 127084 86714 95159 140517
18702A40517J0946n5042j9973o09O6205K6309k8159q2884o04L3349N3500k3785
$$ 140517 151463 96421 76448 75839 142044 168353 140194 57310 56706 90055 143555 119770
18690A19770q974K777n5318m9381k9984M317k896j3115n859M0751K741Q642K5916
$$ 119770 110796 113573 58255 8874 -21110 -16793 -19689 -32804 -38663 2088 4829 13471 39387
18677C9387k860O58O3289L3414j5518K424l7773n9954M2884K6462O2088L4378
$$ 39387 36527 37185 100474 133888 118370 120794 83021 23067 65951 92413 154501 188879
18665A88879k7918N0044l0497q7155j2483j1452j5273k2112L8864M26m7295K4020
$$ 188879 160961 211005 180508 93353 80870 69418 54145 32033 70897 71323 24028 48048
18653D8048L8277K9143m900Q994L0261N1422K530l5441J2323L8663J7680l8945
$$ 48048 86325 115468 110568 119562 149823 201245 203775 168334 180657 219320 237000 198055
18641A98055K2634n3587R942M6043o9741n0413J2486n1970k093k0931k6918K6741
$$ 198055 220689 167102 177044 223087 153346 102933 115419 63449 61356 40425 13507 40248
18629D0248k9970N3614P6930L8486r391M7225J38607N5968P8301J40158J47161
$$ 40248 10278 63892 140822 179308 169917 217142 355749 411717 490018 630176 777337
18618G77337J23489J65192J68767J08236P3224N480o3356p7326j42918j23119
$$ 777337 900826 1066018 1234785 1343021 1416245 1421725 1358369 1281043 1138125 1015006
18608A015006o6535n8782j9207k5377K0528K0959L451J386K8297k7515l6871l3523
$$ 1015006 948471 889689 870482 845105 865633 886592 890043 891429 919726 892211 855340 821817
18596H21817j26680j42071n4656j9538n6588m5912n1449k256O46K1036m929J0805
$$ 821817 695137 553066 498410 478872 422284 376372 324923 322667 323313 344349 339420 350225
18584C50225l7041q055K5342j9511j02183j08319o757M8871J0345K0651j7077
$$ 350225 313184 305129 330471 310960 208777 100458 93701 142572 152917 173568 156491
18573A56491j4410l9233J1052Q0176j0983L3354P7405P6077O0410J16276J47610
$$ 156491 142081 102848 113900 194076 183093 216447 293852 369929 430339 546615 694225
18562F94225R6395P2066N5189N6270M6975M133m5922j17462p0635l6381r1576
$$ 694225 790620 862686 917875 974145 1021120 1025253 979331 861869 791234 754853 663277
18551F63277m2620m7295K7022P4807J82174J77212R4072K8308o1821j34075j96197
$$ 663277 620657 573362 600384 675191 857365 1034577 1128649 1156957 1095136 961061 764864
18540G64864k14727j12367q4469o2891J7168k8024L5695K2503n8491R456m7488
$$ 764864 550137 437770 353301 290410 307578 279554 315249 337752 279261 288717 241229
18529B41229k0734j8590n100J6655k4870m231n848n2233j00811M935L5232k3929
$$ 241229 220495 201905 196805 213460 188590 184359 178511 126278 25467 30402 65634 41705
18517D1705J4251N2341N7308l583r002k5287k077r040Q695N4392L4885K3028k5703
$$ 41705 55956 108297 165605 162022 153020 127733 125656 116616 125311 179703 214588 237616 211913
18504B11913o1255l3915L6198K8186k0484j1747k2366m3871m1764l5042k1255
$$ 211913 150658 116743 152941 181127 160643 148896 126530 82659 40895 5853 -15402
18493a5402k9335K8350r478J7904l3371M323N0670J2413M6525n825J9631J3868
$$ -15402 -44737 -16387 -25865 -7961 -41332 -37009 13661 26074 72599 66774 86405 100273
18481A00273J7663m4642j0291L7509j835J21650R291K914J5535K2421N3100N1110
$$ 100273 117936 73294 63003 100512 98677 220327 229618 232532 248067 270488 323588 374698
18469C74698J1477j8810K9949N6687m549n282K7560N3814J02808R6851M9079P0375
$$ 374698 386175 367365 397314 454001 449452 444170 471730 525544 628352 725203 774282 844657
18457H44657K7095q5835q4042j6739K3132n1247p8843j6054l6831k8821L2851
$$ 844657 871752 785917 701875 685136 708268 657021 578178 562124 525293 496472 529323
18446E29323p5527p3722j7616L1400l5517l3243L6494N560L2793M9005o6804o4693
$$ 529323 453796 380074 362458 393858 358341 325098 361592 367152 399945 448950 382146 317453
18434C17453j1521N8261J5480L6991M2263M411J2032J2964N327k1012j9947L6683
$$ 317453 305932 364193 379673 416664 458927 463338 475370 488334 493661 472649 452702 489385
18422D89385K4278L2318n344M7445J8786N955K7921j6250k1061N3864K9147L7616
$$ 489385 513663 545981 540637 588082 606868 612823 640744 624494 603433 657297 686444 724060
18410G24060P2806J7385O6846P9469O3277J8334M0434l3172k3801m4053k3031
$$ 724060 796866 814251 881097 960566 1023843 1042177 1082611 1049439 1025638 981585 958554
18399I58554J501j9634m7260p7267k9116M2165P0765K5605M2211k066K3425P0354
$$ 958554 960055 940421 893161 815894 786778 828943 899708 925313 967524 965458 988883 1059237
18387A059237o668j02104m6764L3367K7602J29051M8509Q5577K4563L4098N5519
$$ 1059237 1052569 950465 903701 937068 964670 1093721 1142230 1227807 1252370 1286468 1341987
18376A341987O5767j0926P9554L1651l874O4919O3199J05930J25758J05323J79276
$$ 1341987 1407754 1396828 1476382 1508033 1504159 1569078 1632277 1738207 1863965 1969288 2148564
18365B148564J14405J43785K05814J88866K97666L33288L80471L90931L08934
$$ 2148564 2262969 2406754 2612568 2801434 3099100 3432388 3812859 4203790 4512724
18356D512724L64600N14323N61342O87043P33306Q37004J090648J562828J981185
$$ 4512724 4877324 5391647 5952989 6640032 7373338 8210342 9300990 10863818 12845003
18347A2845003K356336K696792L238914L652896L764953L834082M194972M868486
$$ 12845003 15201339 17898131 21137045 24789941 28554894 32388976 36583948 41452434
18339D1452434O225553Q739913J1352237J3326862J6288017J9763118K0288702
$$ 41452434 47677987 56417900 67770137 81096999 97385016 117148134 137436836
18332A37436836J7403874J4998399J1831918L685881l831256p895457j1560294
$$ 137436836 154840710 169839109 181671027 185356908 181525652 173630195 162069901
18325A62069901j5308352j6334729j5276060j3233619j0780958q514845p010221
$$ 162069901 146761549 130426820 115150760 101917141 91136183 82621338 75611117
18318G5611117n860007n547794o135491o425626o396554o326711o034336n330588
$$ 75611117 69751110 64203316 58067825 51642199 45245645 38918934 32884598 27554010
18310B7554010m496797l583490k693405j828944j203874p93882m63903q9527P5593
$$ 27554010 23057213 19473723 16780318 14951374 13747500 12953618 12489715 12400188 12475781
18301A2475781K60617N48471R36908J603083K461452L364949M177831M895944
$$ 12475781 12736398 13284869 14221777 15824860 18286312 21651261 25829092 30725036
18293C0725036N694973O262178O098837N700591N756781N664646N459052N986306
$$ 30725036 36420009 42682187 48781024 54481615 60238396 65903042 71362094 77348400
18285G7348400P910990J0786693J2473324J2205457J2578642J3103003R801570
$$ 77348400 85259390 96046083 108519407 120724864 133303506 146406509 156208079
18278A56208079L973439j81947m366216j0959224j5086324j6370380j6571212
$$ 156208079 160181518 159999571 155633355 144674131 129587807 113217427 96646215
18271I6646215j6100465j4076595j1410621r082962o966485n064328m031628l650909
$$ 96646215 80545750 66469155 55058534 45975572 39009087 33944759 29913131 26262222
18263B6262222l368657l057879k783892k629174k311280k018702j600810j254654
$$ 26262222 22893565 19835686 17051794 14422620 12111340 10092638 8491828 7237174
18255G237174r22445p38747o39052n03216m47164m03642l56038l51350l23644
$$ 7237174 6314729 5575982 4936930 4433714 3986550 3582908 3226870 2875520 2551876
18246B551876k07082r9309j06923p9718j12094j48143j23294j13609l0904P3464
$$ 2551876 2344794 2245485 2138562 2058844 1946750 1798607 1675313 1561704 1530800 1604264
18236A604264J38266o988j24036j87764j46675j24901n3783j09601m3304k4900
$$ 1604264 1742530 1735542 1611506 1423742 1277067 1152166 1098383 988782 945478 920578
18226I20578l6528Q24l4715n0310m0789j4541R135p89M9525K1333q0399m4689
$$ 920578 884050 884874 850159 799849 759060 744519 753654 752865 802390 823723 743324 698635
18214F98635J3018k3223K0828P980m2620O360n5623k3582J5129j2432n3373j1320
$$ 698635 711653 688430 709258 717238 674618 680978 625355 601773 616902 604470 551097 539777
18202E39777q4896J0050N4624j4476K746m4304n413L1621J9773j5763O1727J4804
$$ 539777 454881 464931 519555 505079 507825 463521 458108 489729 509502 493739 555466 570270
18190E70270k483k4222L415N1522L3302J2135K8028R611j0214j9802l9803k4524
$$ 570270 567787 543565 546980 598502 631804 643939 671967 681578 671364 651562 611759 587235
18178E87235m2983K6102J3822l0717k3450R2523J7507K9155o259k1109L5663K190
$$ 587235 544252 570354 584176 553459 530009 622532 640039 669194 662935 641826 677489 679679
18166F79679N521k2805L0486K3217M665n1955k2546l5124J2200N94k6246k0098
$$ 679679 685200 662395 692881 716098 720763 668808 646262 611138 623338 623932 597686 577588
18154E77588K2299O8832J1587k3077p8180o9804J3006L2229P829n1793l9203M8186
$$ 577588 599887 668719 680306 657229 579049 509245 522251 554480 562309 510516 471313 519499
18142E19499M9257N7538M2623O3275L2254J6913N5955L3368M3186P2153P0010
$$ 519499 568756 626294 668917 732192 764446 781359 837314 870682 913868 986021 1056031
18131A056031O5249O8447P7127P2617J31718P9387R8521J90669L22720L00702
$$ 1056031 1121280 1189727 1266854 1339471 1471189 1550576 1649097 1839766 2162486 2463188
18121B463188M41096N26315O69609Q27816J072914J273139J518823K202599L390817
$$ 2463188 2904284 3430599 4100208 4928024 6000938 7274077 8792900 10995499 14386316
18112A4386316N528223R993623J8509758K9434851K8622055N598390j0366967
$$ 14386316 19914539 29908162 48417920 77852771 106474826 112073216 101706249
18105A01706249j8671968k2928904j9370986j3484058q712701n505713l428670
$$ 101706249 83034281 60105377 40734391 27250333 18537632 13031919 9603249
18098I603249k202888j567754j201877q27900o45113m93700m13919l55606l11956
$$ 9603249 7400361 5832607 4630730 3802830 3157717 2664017 2250098 1894492 1582536
18089A582536j58898j52659j48832j65236j40964p7096o8782n0015L9561j6331
$$ 1582536 1423638 1270979 1122147 956911 815947 738851 670069 620054 659615 643284
18079F43284l7312k4037j8941j06842p4333n7339K1036j0248l495L7061R15k4890
$$ 643284 605972 581935 562994 456152 381819 324480 345516 335268 331773 368834 369749 344859
18067C44859o2984k2180j8553o9354l0137P070L6903j1937K3556k2510N8912j0752
$$ 344859 281875 259695 241142 171788 141651 148721 185624 173687 197243 174733 233645 222893
18055B22893o248k1398j7071L2399Q241n8474m3241J9023M077J4788N34k074k3419
$$ 222893 216645 195247 178176 210575 218816 160342 117101 136124 140201 154989 155523 153449 130030
18042A30030m4710J1794q271O9964J9326k2220P803L7454p6674p238p598K0481
$$ 130030 85320 97114 88843 158807 178133 155913 163716 201170 124496 117258 109660 130141
18030A30141q763L958J02108J2822p3903J4703k0372l9785M0888K249l3285j6809
$$ 130141 121378 125336 227444 240266 166363 181066 160694 120909 161797 164046 130761 113952
18018A13952N8974L6375r0825j3793j30j7222O4165K0069j9404J8013n3732p9946
$$ 113952 172926 209301 118476 104683 104553 87331 151496 171565 152161 170174 116442 36496
18006C6496K7436N5771j5679o4354j4837L982M1959J387m4762k184K9340k8527
$$ 36496 63932 119703 104024 39670 24833 28815 70774 72161 27399 25215 54555 26028
17994B6028o7484L7811K7734M9554K5662k5316l8731m3534j8931l189N2085N2933
$$ 26028 -41456 -3645 24089 73643 99305 73989 35258 -8276 -27207 -30396 21689 74622
17982G4622L4662o7100r8937J1534O2349L0521N5768k5809o8007J5703N0130Q006
$$ 74622 109284 42184 -56753 -45219 17130 47651 103419 77610 9603 25306 75436 83442
17970H3442o899k3297K5273j1537J3040l144J7972L520M4381j8800k7284J6713
$$ 83442 76543 53246 78519 66982 80022 76878 94850 98370 142751 123951 96667 113380
17958A13380o783n1065j2061J8760r783m6332j1684M0877K0638J5955J2210L8267
$$ 113380 106597 55532 43471 62231 52448 6116 -5568 35309 55947 71902 84112 122379
17946A22379k0265q9504l8388j5970m3885K1037o586M8700M0855J6980N3712L9497
$$ 122379 102114 12610 -25778 -41748 -85633 -64596 -71182 -22482 18373 35353 89065 128562
17934A28562j2571m1218m0620M4525J2114l7423N0232q068n6925k7685N771l1978
$$ 128562 115991 74773 34153 78678 90792 53369 103601 95533 38608 10923 16694 -15284
17922a5284k5509m7769N4588K2962j742K8635r398n48l2356j5065Q7032K3844
$$ -15284 -40793 -88562 -33974 -11012 -12754 15881 6483 5935 -26421 -41486 45546 69390
17910F9390j6289Q818k2090K7342n7159o5511j5890j1736L1250J5682l0728K8379
$$ 69390 53101 61919 39829 67171 10012 -55499 -71389 -83125 -51875 -36193 -66921 -38542
17898c8542L9556j2635o4981J701N589O0713k5432p1444o5864J083P9448Q2751
$$ -38542 1014 -11621 -76602 -74901 -69312 -8599 -34031 -105475 -171339 -170256 -90808 -8057
17886h057l865n8522o2082r2039j3548Q3528K2286J4711J8622k1891K8336l1227
$$ -8057 -11922 -70444 -132526 -224565 -238113 -154585 -132299 -117588 -98966 -120857 -92521 -123748
17874a23748k3661J7106M4702j5957o546J5849J5907M0241p111L7813R852L7205
$$ -123748 -147409 -130303 -85601 -101558 -108104 -92255 -76348 -36107 -43218 -5405 4447 41652
17862D1652L133o9509l1527O8511L7077J4507j2700m5726j0125o214k4490l2140
$$ 41652 44785 -24724 -56251 12260 49337 63844 51144 5418 -4707 -10921 -35411 -67551
17850f7551k3302N6473k5923o2247K0221M1090L2917J07061P576J4798L1504m2785
$$ -67551 -90853 -34380 -60303 -122550 -102329 -61239 -28322 78739 86315 101113 132617 89832
17838H9832l8281k3953L4931J5024M596J3554Q2271L9021J6843K4416r131L1698
$$ 89832 51551 27598 62529 77553 82149 95703 177974 216995 233838 258254 249123 280821
17826B80821R5235J02135L5422P226o232J7880O3931M8876j8945k1717L7939M2466
$$ 280821 376056 478191 513613 520839 514607 532487 596418 645294 626349 604632 642571 685037
17814F85037k5094M2515l5583j57206p8977j9192o6760l4748K740k0785k0714
$$ 685037 659943 702458 666875 509669 430692 411500 344740 309992 312732 291947 271233
17803B71233m5553n4814k7987l8492p2217N065j3224l7351Q882o238K5859M4826
$$ 271233 225680 170866 142879 104387 32170 37235 24011 -13340 -4458 -10696 15163 59989
17791E9989k1766K5088j9185L582L3778l6833k5903M9940P5659O2273O0059l0953
$$ 59989 38223 63311 44126 47708 81486 44653 18750 68690 144349 206622 266681 235728
17779B35728N8832Q5390O3098N3673L2028J0872N534j1743L701m3625m8073l5266
$$ 235728 294560 379950 443048 496721 528749 539621 545155 533412 537113 493488 445415 410149
17767D10149J8488L094J822k814m4967K9441j64N8865R0005K6758n8514j22416
$$ 410149 428637 431731 433553 430739 385772 415213 415049 473914 563919 590677 532163 409747
17755D09747n2545q5014n3281k9303p4588k2114k6314o8621m4152J6147O0002
$$ 409747 357202 272188 218907 189604 115016 92902 66588 -2033 -46185 -30038 29964
17744B9964n2932k0115l030j5971r999l4622Q0283N0428P5533n7181k9532o1639
$$ 29964 -22968 -43083 -46113 -62084 -72083 -106705 -26422 24006 99539 42358 12826 -48813
17732d8813k3599J1793J8378Q0001k2094k0562r088L381m5080J9477J7732p292
$$ -48813 -72412 -60619 -42241 37760 15666 -4896 -13984 -10603 -55683 -36206 -18474 -25766
17720b5766p4482n7111J5503J3073j4451K3028j8811O3984J7703l2481o181l2849
$$ -25766 -100248 -157359 -141856 -128783 -143234 -120206 -139017 -75033 -57330 -89811 -95992 -128841
17708a28841P732J6941M3762Q532m477k8876L9393P4555K447k3683n7718L5430
$$ -128841 -121109 -104168 -60406 -51874 -56351 -85227 -45834 28721 31168 7485 -50233 -14803
17696a4803l487j9631j0079K1419K5874j3497j7708K2700q402j2852k5047l8360
$$ -14803 -18290 -37921 -48000 -26581 -707 -14204 -31912 -9212 -17614 -30466 -55513 -93873
17684i3873J0003K8945P153r406K4639k5790J5263N4277j1315j9415k9225k8096
$$ -93873 -83870 -54925 -47772 -57178 -32539 -58329 -43066 11211 -104 -19519 -48744 -76840
17672g6840o797K9404O4261j1989m7765n2872m6023p172M4643O1166j0705K1843
$$ -76840 -83637 -54233 10028 -1961 -49726 -102598 -148621 -155793 -111150 -49984 -60689 -38846
17660c8846J8005K1896k7390M1297K2552n879k1331m9474l0664r529K6392j2737
$$ -38846 -20841 1055 -26335 14962 37514 31635 10304 -39170 -69834 -79363 -52971 -65708
17648f5708n7197K2287N7051J5481l9299j4687O632L373J0239o804J0023k3854
$$ -65708 -122905 -100618 -43567 -28086 -67385 -82072 -75440 -72067 -61828 -68632 -58609 -82463
17636h2463P158L4446O5788l646K8543K7747p4874j7198M8817r224j4240r966
$$ -82463 -75305 -40859 24929 21283 49826 77573 2699 -14499 34318 25094 10854 888
17624H88J746O0493K1928m8062l9116L7853O095l8161K9798K6899j1383k5532
$$ 888 2634 63127 85055 36993 -2123 35730 41825 3664 33462 60361 48978 23446
17612B3446n5789K3764K9301j1892l7716m3228k5146Q114O879k1771m972L0270
$$ 23446 -32343 -8579 20722 8830 -28886 -72114 -97260 -89146 -82267 -104038 -109010 -78740
17600g8740J1494O5350J4401M243k2503L7088j8405l5806K8146k2445K7153N7664
$$ -78740 -67246 -1896 12505 16748 -5755 31333 12928 -22878 5268 -17177 9976 67640
17588F7640l022p4221J6217L829o8194n3326n3120j1708K1376L5750M3456j1851
$$ 67640 64618 -9603 6614 10443 -57751 -111077 -164197 -175905 -154529 -118779 -75323 -87174
17576h7174l842L5766K1957l9662l748L9614p2080k7932M7305N5505L2591J7228
$$ -87174 -91016 -55250 -33293 -72955 -76703 -37089 -109169 -137101 -89796 -34291 -1700 15528
17564A5528q351k2378j866P978k8810P556j1578l3531l5426j5560K8510P8788
$$ 15528 7177 -15201 -17067 -9089 -37899 -30343 -41921 -75452 -110878 -126438 -97928 -19140
17552a9140K4960m2510k1922l0710P608Q361M2248J9984L5040j5293l4773M0988
$$ -19140 5820 -36690 -58612 -89322 -81714 -73353 -31105 -11121 23919 8626 -26147 14841
17540A4841m4602q9659K5704K2329j9770p696J5670L8555j6479l9822O3763K9652
$$ 14841 -29761 -119420 -93716 -71387 -91157 -98853 -83183 -44628 -61107 -100929 -37166 -7514
17528g514r424j9550N6750n240k9116l0326j6084L4285k5810j0233j4434j1430
$$ -7514 -16938 -36488 20262 15022 -14094 -44420 -60504 -26219 -52029 -62262 -76696 -88126
17516h8126k5932M2278m866n7503J758K2760K613k0186q64K3414J32697M3037
$$ -88126 -114058 -71780 -76646 -134149 -132391 -109631 -107018 -127204 -128068 -104654 28043 71080
17504G1080o6156J1418L2574l1722K2230K3245K8897L999k9546l5160l81k4778
$$ 71080 4924 16342 48916 17194 39424 62669 91566 95565 66019 30859 30478 5700
17492E700J6449j013p716n343n3071J3535Q651O774m092L2056L1812r414J614
$$ 5700 22149 21136 13420 8077 -44994 -31459 -22808 -16034 -20126 11930 43742 34328 35942
17479C5942K4859k510q3132j7767O5230J04502K4894m2439m0363q8324k6135m8235
$$ 35942 60801 58291 -24841 -42608 22622 127124 152018 109579 69216 -19108 -45243 -93478
17467i3478O831N8431M7928k665l0864j0379P126O4083l2150o3828J9918K473
$$ -93478 -86647 -28216 19712 17047 -13817 -24196 -17070 47013 14863 -48965 -29047 -26574
17455b6574o750L0524r943K5664J1952p771j1733L7676K4233M7949j3977M4809
$$ -26574 -33324 -2800 -12743 12921 24873 17102 5369 43045 67278 115227 101250 146059
17443A46059J62104J51576P7971K8830j14436j59780j60183j15268l9019J953
$$ 146059 308163 459739 537710 566540 452104 292324 132141 16873 -22146 -20193
17433b0193J993l5834J9028L9849m5561m1727K3786L6095q076k5550J0072j1901
$$ -20193 -18200 -54034 -35006 4843 -40718 -82445 -58659 -22564 -30640 -56190 -46118 -58019
17421e8019K2827J3790k6629M153l3694L3953k6760k3532j2233M4309J0749J046
$$ -58019 -35192 -21402 -48031 -43878 -77572 -43619 -70379 -93911 -106144 -61835 -51086 -50040
17409e0040o834J1104j6731k9469l0317k015n330q631M5277O4452N6874l2339
$$ -50040 -56874 -45770 -62501 -91970 -122287 -124302 -129632 -138263 -92986 -28534 28340 -3999
17397c999j2718K6872k8684m2209k063j6616J9952L5667j2965J593J0986j2407
$$ -3999 -16717 10155 -18529 -60738 -62801 -79417 -59465 -23798 -36763 -35170 -24184 -36591
17385c6591Q797m1448r636j0155K5758M6303o485J3739j194R374k6989L7293M1308
$$ -36591 -27794 -69242 -78878 -89033 -63275 -16972 -23457 -9718 -10912 -1538 -28527 8766 50074
17372E0074n9707m5198m993k0923O984l200l318o926K805P7418o295l0878l237
$$ 50074 -9633 -54831 -59824 -80747 -73763 -76963 -80281 -87207 -84402 -6984 -13279 -44157 -47394
17359d7394K6364K9302Q912M8242K3870k4388n9368K0798J365k568l5042K8581
$$ -47394 -21030 8272 17184 65426 89296 64908 5540 26338 27703 25135 -9907 18674
17347A8674J1454n8934j1582k5207m0948O4608k058k3538J0653L1824p628L78
$$ 18674 30128 -28806 -40388 -65595 -106543 -41935 -43993 -67531 -56878 -25054 -32682 -32304
17335c2304k8624p9966M9450P1565L8280j394m0773l2125M1184K4304K5397j3317
$$ -32304 -60928 -140894 -91444 -19879 18401 17007 -23766 -55891 -14707 9597 34994 21677
17323B1677j3851n4325l1710j0911J0410N0726L6164L1206M92m7925m7198k4262
$$ 21677 7826 -46499 -78209 -89120 -78710 -27984 8180 39386 39878 -8047 -55245 -79507
17311g9507J1563M7927o189m4663J4555O0671j8072n378n795l0082J9733r562
$$ -79507 -67944 -20017 -26206 -70869 -56314 4357 -13715 -19093 -24888 -54970 -35237 -44799
17299d4799l646M3111N2953k4050n1089n8797k6281n318R607m2334M4382Q4219
$$ -44799 -48445 -5334 47619 23569 -27520 -86317 -112598 -117916 -108309 -150643 -106261 -22042
17287b2042j1284o5303J594o97k3571K0754p989L0995J3116k6193J6547M5442
$$ -22042 -33326 -98629 -97035 -97732 -121303 -100549 -108538 -77543 -64427 -90620 -74073 -28631
17275b8631J1196m2191J5094N0797J4148l7738m974L9654K6153K9228l423K7677
$$ -28631 -17435 -59626 -44532 6265 20413 -17325 -22299 17355 43508 72736 69313 96990
17263I6990k4129l4382k1771j6143J482l2211j6041K3266l634M317J4396j5583
$$ 96990 72861 38479 16708 565 2047 -30164 -46205 -22939 -26573 -22256 -7860 -23443
17251b3443J5367K6558q71l9038k3748K5923q77k6049j328j3475l6107o7897L3613
$$ -23443 -8076 18482 17611 -21427 -45175 -19252 -20129 -46178 -47506 -60981 -97088 -164985 -131372
17238a31372L9166M7282K7708k3095k8231J865K446L0023Q184q372n962q9605
$$ -131372 -92206 -44924 -17216 -40311 -68542 -66677 -64231 -34208 -26024 -34396 -40358 -129963
17226a29963L8664M0431O0604Q168m5566K2027q482k1716n4971K4960J06996K9473
$$ -129963 -91299 -50868 9736 17904 -27662 -5635 -14117 -35833 -90804 -65844 41152 70625
17214G0625k8948j4037m261o3543j628k6048M5467K0382m7533K9602K8685O4911
$$ 70625 41677 27640 23379 -40164 -41792 -67840 -22373 -1991 -49524 -19922 8763 73674
17202G3674l014L3943k5856p6348n5071N8771O9946m124k9602p4705l0576R023
$$ 73674 70660 104603 78747 2399 -52672 6099 76045 71921 42319 -32386 -62962 -53939
17190e3939j615M224K6093o1757j9876j3200l4221o863L9308N8419J7653n881
$$ -53939 -55554 -51330 -25237 -86994 -106870 -120070 -154291 -161154 -121846 -63427 -45774 -51655
17178e1655j8630j5374K2325j514K5445M7739q793j5339m2312L3922j536J6082
$$ -51655 -70285 -85659 -63334 -64848 -39403 8336 -457 -15796 -58108 -24186 -25722 -9640
17166i640L6486J549k3951J2902j9653m1000m2225K903M2765j2636J105j0705
$$ -9640 26846 28395 4444 17346 -2307 -43307 -85532 -82629 -39864 -52500 -51395 -62100
17154f2100K3363K5722M2424k5897m4963k1148k3806l3878N3641R6829M6273p7888
$$ -62100 -38737 -13015 29409 3512 -41451 -62599 -86405 -120283 -66642 30187 76460 -1428
17142a428r0770L156J5761j80l7731O183L8219N6025J7521j5260M5612o2193o115
$$ -1428 -92198 -89042 -73281 -73461 -111192 -105009 -66790 -10765 6756 -8504 37108 -25085 -31200
17129c1200n757L238l4698M9480O1732k0989r561n5545j8172M5620j7557J085
$$ -31200 -36957 -33719 -68417 -18937 42795 21806 12245 -43300 -61472 -15852 -33409 -32324
17117c2324L3819K659M540K8345n432K659J854p2992O092N4979j3690l8512k5122
$$ -32324 1495 4154 8694 37039 31607 34266 36120 -36872 -30780 24199 10509 -28003 -53125
17104e3125J2645O8673M5207L2188j3485j2877O125M586m7571k8839k0503k9902
$$ -53125 -40480 28193 73400 105588 92103 79226 85351 89937 42366 13527 -6976 -36878
17092c6878q252J5321J6336O256L4247J1512l3078j5614K0896O3435n8381r0202
$$ -36878 -45130 -29809 -13473 -7217 27030 38542 5464 -10150 10746 74181 15800 -74402
17080g4402n075N2425L4184n4277n4725l104k0711j156P6229J3422n0702N5837
$$ -74402 -79477 -27052 7132 -47145 -101870 -104974 -125685 -126841 -50612 -37190 -87892 -32055
17068c2055K3783R714J5016m3779l1077P8930r662M10R003J6603M4163l5440n8342
$$ -32055 -8272 1442 16458 -27321 -58398 20532 10870 11280 20283 36886 81049 45609 -12733
17055a2733p3915r730M4599N6033K1262l9432j5531Q951Q131M7125M698L3613
$$ -12733 -86648 -96378 -51779 4254 25516 -13916 -29447 -20496 -12365 34760 39458 73071
17043G3071K5153p4605r6138k6471J3102O2998N1004R339O7999M802j0624r111
$$ 73071 98224 23619 -72519 -98990 -85888 -22890 28114 37453 105452 110254 99630 90519
17031I0519m5157k7642l8954n8802m4003J8854N4289N6520k06K195K6240l0890
$$ 90519 45362 17720 -21234 -80036 -124039 -105185 -50896 5624 5418 7613 33853 2963
17019B963o3093j9890M2547L4987r030l9025J7623p867J7168N4030L3076j7714
$$ 2963 -60130 -80020 -37473 -2486 -11516 -50541 -32918 -40785 -23617 30413 63489 45775
17007D5775k9600o0916m0485P5427M2387l3565q248J555n8280k1629K5076K6479
$$ 45775 16175 -44741 -85226 -9799 32588 -977 -9225 -7670 -65950 -87579 -62503 -36024
16995c6024R596P5230n212k3122Q400j1309k3661q224P4430j0296n2237K2248
$$ -36024 -26428 48802 43590 20468 28868 17559 -6102 -14326 60104 49808 -2429 19819
16983A9819M4521l1441k7725K1865L637k9619k5121j00727l4086K1616K4196N239
$$ 19819 64340 32899 5174 27039 30676 1057 -24064 -124791 -158877 -137261 -113065 -107826
16971a07826J8766O119n682k5943K7291n751l8483J0981K405L6135M8022l9482
$$ -107826 -89060 -82941 -88623 -114566 -87275 -93026 -131509 -120528 -118123 -81988 -33966 -73448
16959g3448M3898m1586m5923k1201J2747L4228M4093K1227k3103L3692N1474K572
$$ -73448 -29550 -71136 -117059 -138260 -125513 -91285 -47192 -25965 -49068 -15376 36098 38670
16947C8670k6079m1582l0048m916K4795M4030j2801l626J5244j9987r980N6452
$$ 38670 12591 -28991 -59039 -63955 -39160 4870 -7931 -11557 3687 -16300 -26280 30172
16935C0172m902o172J9489m334n6224k9374K734L6652O6342J7312m5217n9126
$$ 30172 25270 19098 38587 34253 -21971 -51345 -48611 -11959 54383 71695 26478 -32648
16923c2648K48J2103j0676k6512M6554O8068L8298n317o0213n0389j2415l3028
$$ -32648 -32400 -20297 -30973 -57485 -10931 57137 95435 90118 29905 -20484 -32899 -65927
16911f5927n0449L6615J1381L0497j6959k5468p342K5770P7367k3056l2770O0330
$$ -65927 -116376 -79761 -68380 -37883 -54842 -80310 -87652 -61882 15485 -7571 -40341 19989
16899A9989P6940j5169q6734o1735l6582J3933O7498Q4544K2385o8852P782Q005
$$ 19989 96929 81760 -4974 -66709 -103291 -89358 -21860 62684 85069 16217 23999 32004
16887C2004J729N2177m8041o8344j9961j0842o842N66L440N6114M5274J1887j484
$$ 32004 33733 85910 37869 -30475 -50436 -61278 -68120 -67554 -64114 -8000 37274 49161 47677
16874D7677l3410m2959n9573r1540M50K7121K4546M2011J5568J6225M4422j9018
$$ 47677 14267 -28692 -88265 -179805 -179355 -152234 -127688 -85677 -70109 -53884 -9462 -28480
16862b8480p4717j2798K2083N0450K46l8641L6008L2489Q320o4505l4496J4450
$$ -28480 -103197 -115995 -93912 -43462 -43216 -81857 -45849 -13360 -5040 -69545 -104041 -89591
16850h9591K2598j5448R074l938M3935N2757j7019L0763m9232k1065J3269L869
$$ -89591 -66993 -82441 -73367 -77305 -33370 19387 2368 33131 -16101 -37166 -23897 -20028
16838b0028L5779K4804l8440o5874K9504J7635J5520k4782j4302K3633P820m2167
$$ -20028 15751 40555 2115 -63759 -34255 -16620 -1100 -25882 -40184 -16551 -8731 -50898
16826e0898J421N0807N7392k1628l9678j5939P1642L1950k1655m3883O5214k2340
$$ -50898 -49477 1330 58722 37094 -2584 -18523 53119 85069 63414 19531 84745 62405
16814F2405l2352n1172j4541K0250J7407J821k5604k3144k9349J1475q621K3564
$$ 62405 30053 -21119 -35660 -15410 1997 3818 -21786 -44930 -74279 -62804 -71425 -47861
16802d7861J7249l2842J7325p762l5192m6971o26P1264r445J0261J6591o4355
$$ -47861 -30612 -63454 -46129 -53891 -89083 -136054 -136680 -65416 -74861 -64600 -48009 -112364
16790a12364M1219P3295J0399P247k461J0834l0083k0006M2586j633o0605m5116
$$ -112364 -71145 2150 12549 19796 17335 28169 -1914 -21920 20666 19033 -41572 -86688
16778h6688m4404K2756Q7396R7806J5083o6429m5149k7475l6250Q116p263l3576
$$ -86688 -131092 -108336 -20940 76866 91949 25520 -19629 -47104 -83354 -75238 -82501 -116077
16766a16077l1915K4824P4106L3982K2145J0852k2697J0110j0518k0524J7839
$$ -116077 -147992 -123168 -49062 -15080 7065 17917 -4780 5330 -5188 -25712 -7873
16755g873n690L3193K6931j4589n0000L0605K8343J8829l8031j4895n2164o569
$$ -7873 -13563 19630 46561 31972 -18028 12577 40920 59749 21718 6823 -45341 -51910
16743e1910N9797k7899m7313n7448O261J0338q479M6093j9987J3860K2010j5476
$$ -51910 7887 -20012 -67325 -124773 -118512 -108174 -116653 -70560 -90547 -76687 -54677 -70153
16731g0153l7927M1696m0621K3152M2893K305J4631p348j3383k3005M659L0682
$$ -70153 -108080 -66384 -107005 -83853 -40960 -38655 -24024 -31372 -44755 -67760 -63101 -32419
16719c2419J722J8068J8093o8325j1420n773k0447J9506M3648k1477n9894o826
$$ -32419 -30697 -12629 5464 -62861 -74281 -80054 -100501 -80995 -37347 -58824 -118718 -125544
16707a25544K8353O6414L1991q2840o137O2035O9562J716l2306M547k8787o6755
$$ -125544 -97191 -30777 1214 -81626 -87763 -25728 43834 45550 13244 17791 -10996 -77751
16695g7751M310k6385m1563J6750N9497L7813k028j8151J0949o449j2713K1229
$$ -77751 -73441 -99826 -141389 -124639 -65142 -27329 -29357 -47508 -36559 -43008 -55721 -34492
16683c4492m844L7619J6908K6156O8287K8876k177r9114o7749k6898J0316J4987
$$ -34492 -39336 -1717 15191 41347 109634 138510 136333 37219 -30530 -57428 -47112 -32125
16671c2125L9274l855l7470J6691j7022k5335M3913L0734J8531j1674j928j6137
$$ -32125 7149 3294 -34176 -17485 -34507 -59842 -15929 14805 33336 21662 19734 3597
16659C597j8376k5297P664P631J1586J4676m1032l5195O3427M3033j8644O207
$$ 3597 -14779 -40076 -32412 -24781 -13195 1481 -39551 -74746 -11319 31714 13070 19277
16647A9277p441L4077k9241k5663R537k6372k0895J2451k2195R023M2223M4744
$$ 19277 11836 45913 16672 -8991 546 -25826 -46721 -34270 -56465 -47442 -5219 39525
16635C9525j6879o0278k5426R916M6570k0918k4865N4008J864r874k2738j6579
$$ 39525 22646 -37632 -63058 -53142 -6572 -27490 -52355 1653 3517 -6357 -29095 -45674
16623d5674L7906n0253m8771l8953P966O4586K8019o757J2012R151k2657P25K1455
$$ -45674 -7768 -58021 -106792 -145745 -137779 -73193 -45174 -51931 -39919 -30768 -53425 -52700 -31245
16610c1245n8796l4107M3460Q6918J0180l1382n9168J275K9878J3759P934j0485
$$ -31245 -90041 -124148 -80688 6230 16410 -14972 -74140 -72865 -42987 -29228 -21294 -31779
16598c1779K3005P746O476m8634j2717L2724P9126j8697n1971J1221K6110Q7139
$$ -31779 -8774 -1028 5448 -43186 -55903 -23179 55947 37250 -14721 -3500 22610 109749
16586A09749k8752q6022o6473L795j3786l0106M5163M6894K768M2028K5350M8336
$$ 109749 80997 -5025 -71498 -67703 -81489 -111595 -66432 -19538 -16770 25258 50608 98944
16574I8944K4025k2320l2045K6836L272l3825k6074j3481j5770j2254Q144L5941
$$ 98944 122969 100649 68604 95440 98712 64887 38813 25332 9562 -2692 5452 41393
16562D1393N2735r2285r4056R509J244M931j0143O4762R777J5987M3517j4807
$$ 41393 94128 1843 -92213 -82704 -81460 -76529 -86672 -21910 -12133 3854 47371 32564
16550C2564m203k7252L594k7658N45M621j1460L6426N0886o6699j8759K4662K000
$$ 32564 28361 1109 4703 -22955 -22410 -17789 -29249 7177 58063 -8636 -27395 -2733 -733
16537g33K8380n8087m1295M8227K3650o689K708l6271K0732J6086j5748M7455
$$ -733 27647 -30440 -71735 -23508 142 -6547 -3839 -40110 -19378 -3292 -19040 28415
16525B8415O7128m543K4357j1375m1844k8889O566M592n2822n930k8556j4436
$$ 28415 95543 91000 115357 103982 62138 33249 39815 44407 -8415 -14345 -42901 -57337
16513e7337L5129k6957P505K3008L88m1727K862J7212M3973r93k5608m0832j6674
$$ -57337 -22208 -49165 -41660 -18652 -18264 -59991 -57129 -39917 4056 3063 -22545 -63377 -80051
16500h0051L2652J9795M5384M279o488L3608p516m199l9695J2386J197J1958l2120
$$ -80051 -47399 -27604 17780 22059 15571 49179 41663 37464 -2231 10155 11352 23310 -8810
16487h810m5496j4150L841n7952k3719M7074O436k2379K8708L550J5049k3071
$$ -8810 -54306 -68456 -64615 -122567 -146286 -99212 -92776 -115155 -86447 -82897 -67848 -90919
16475i0919n529K5768R899k0043n3873M4020J05062n3950p9314L7651L0113N6219
$$ -90919 -96448 -70680 -60781 -80824 -134697 -90677 14385 -39565 -118879 -81228 -51115 5104
16463E104j3671L2709m6302Q515N576j9722k1264P610K604j7047k510J2843K1236
$$ 5104 -8567 24142 -22160 -13645 -8069 -27791 -49055 -41445 -38841 -55888 -58398 -45555 -24319
16450b4319N0723N1055k813l6582k4378m0007L539L5739N7270q495l3919n8359
$$ -24319 26404 77459 74646 38064 13686 -26321 -22782 12957 70227 61732 27813 -30546
16438c0546n9201L8359L5536L4405J5112k2724K529M6828J1373l519m0628Q640
$$ -30546 -89747 -51388 -15852 18553 33665 10941 13470 60298 71671 68152 27524 36164
16426C6164L5203P124m290L7570l1007m1180n3911n186j530J4904k7567l3983
$$ 36164 71367 78491 74201 111771 80764 39584 -14327 -19513 -21043 -6139 -33706 -67689
16414f7689J7390J3018M7292O0820Q481o0434p894p549q744O9795P4389J0320
$$ -67689 -50299 -37281 10011 70831 79312 18878 10984 3435 -5309 64486 138875 149195
16402A49195r7441l9567J7247L2778O59L2561L5890m4885l9411o6078o37l3249
$$ 149195 51754 12187 29434 62212 62871 95432 131322 86437 47026 -19052 -19689 -52938
16390e2938m4467P2387l726l0145L7246K0061l3355J3922O3665J3461k5574m4452
$$ -52938 -97405 -25018 -28744 -58889 -21643 -1582 -34937 -21015 42650 56111 30537 -13915
16378a3915n5235M4061O063K306K4459O308M4435N1769J6277J617k8391m5252
$$ -13915 -69150 -25089 -19026 -16720 7739 14047 58482 110251 126528 128145 99754 54502
16366E4502J6751J1161O990J2121J8075k5824m8590J7495p167j8228J1281M00
$$ 54502 71253 82414 89404 101525 119600 93776 45186 62681 55514 37286 48567 48967
16354D8967k6792r503N2902o3607q4475J0307N5816n9746r982M4408K7817j1194
$$ 48967 22175 12672 65574 1967 -82508 -72201 -16385 -76131 -86113 -41705 -13888 -25082
16342b5082o052Q8707M1619o8441r1760o7274M5673R4187l7160j4025k6020N295
$$ -25082 -31134 57573 99192 30751 -61009 -128283 -82610 11577 -25583 -39608 -65628 -60333
16330f0333L836k3947k9017K1281O8682N3408L5558k8458l7382p174O3574M6525
$$ -60333 -56497 -80444 -109461 -88180 -19498 33910 69468 41010 3628 -3546 60028 106553
16318A06553m0692m9306k7024K3727J8834L3390J9002k0112l1380K8377k9137
$$ 106553 65861 16555 -10469 13258 32092 65482 84484 64372 32992 61369 32232
16307C2232N7772j520l0096L5601k2607n1349k2466j0884Q839o956l568m9L0796
$$ 32232 90004 88484 58388 93989 71382 20033 -2433 -13317 -4478 -11434 -15002 -15051 15745
16294A5745J7915P600J467J9203J6326p1726K0799l707p3507J9506j3252O5913
$$ 15745 33660 41260 42727 61930 78256 6530 27329 23622 -49885 -30379 -43631 22282
16282B2282k0835k9801J2142L5214J3091J4724M83m8359K4720m1160j9467K765
$$ 22282 1447 -28354 -16212 19002 32093 46817 47300 -1059 23661 -17499 -36966 -34201
16270c4201L1037J861j3658m6246P1684P659l3505M9769M0929n1204r697k2083
$$ -34201 -3164 -1303 -14961 -61207 10477 18136 -15369 34400 75329 24125 14428 -7655
16258g655r953m2498J5390J0851m006M5780m369j2963j3478l1396J1871N3403
$$ -7655 -17608 -60106 -44716 -33865 -37871 7909 3540 -9423 -22901 -54297 -42426 10977
16246A0977L3579l0865j3450M9787k4440k4946k0409R573M9496k5433n1855J8392
$$ 10977 44556 13691 241 50028 25588 642 -19767 -10194 39302 13869 -37986 -19594
16234a9594n479m7710L4826P6359k7717l4073J8999R17J1436n1991k5835J1309
$$ -19594 -25073 -72783 -37957 38402 10685 -23388 -4389 -3472 7964 -44027 -69862 -58553
16222e8553O0895O8077l714j9995q707l607o6059j7943K5455M1935n696j3433
$$ -58553 2342 70419 66705 46710 38003 34396 -31663 -49606 -24151 17784 12088 -1345
16210a345K928L1355O0099n600n8737M6029P2566k9330j09680j7825k6904k9824
$$ -1345 1583 32938 93037 87437 28700 74729 147295 117965 8285 -9540 -36444 -66268
16198f6268L6583J7425l9352J6465L0784L8652N143M8806j5351P640k9734l5725
$$ -66268 -29685 -12260 -51612 -35147 -4363 34289 39432 88238 72887 80527 50793 15068
16186A5068j2571m514l5702J2196K3013k4445J3020K2601l5874n1428N362L6074
$$ 15068 2497 -2017 -37719 -25523 -2510 -26955 -13935 8666 -27208 -78636 -73274 -37200
16174c7200N4124L6689M8896J611l647j3664o7144o191k1599M2565K3932n6406
$$ -37200 16924 53613 102509 104120 100473 86809 19665 13474 -8125 34440 58372 1966
16162A966l0732m4000k4188N8968M945l8704M0750N4563M427J6176L4692O1870
$$ 1966 -28766 -72766 -96954 -37986 -33041 -71745 -30995 23568 27995 44171 78863 140733
16150A40733m9756p7770j3165R7979L5850k4200m6852k0192j8272J0705r174P792
$$ 140733 90977 13207 42 98021 133871 109671 62819 42627 24355 35060 25886 33678
16138C3678K5221M698k0887l4108q8P6106K3916q592L3956l4248K0437l2096j5869
$$ 33678 58899 63597 42710 8602 8514 84620 108536 99944 133900 99652 120089 87993 72124
16125G2124j9986l9068l3635O795k7430O005O7957k3541k2423n069n235O655J6103
$$ 72124 52138 13070 -20565 -13770 -41200 -35195 32762 9221 -13202 -18271 -23506 -16851 -748
16112g48o6846k2546N8336P6974n1873R240J821q006L2367L7156Q28k4949K9543
$$ -748 -67594 -90140 -31804 45170 -6703 2537 4358 -3648 28719 65875 66703 41754 71297
16099G1297m7013p6134l1026k3589O2977N4139p744J5087L221j271j2558l7834
$$ 71297 24284 -51850 -82876 -106465 -43488 10651 2907 17994 21215 19944 7386 -30448
16087c0448K2913L3840N063k7138N6346Q249l6528o6154j958p03j454L2451L6230
$$ -30448 -7535 26305 31368 4230 60576 68825 32297 -33857 -35815 -36518 -37972 -5521 30709
16074C0709q172K8592j3758o8920n293J4090p011K641P106K6390k8574L0371K7478
$$ 30709 22537 51129 37371 -31549 -36842 -22752 -29763 -27122 -20016 6374 -22200 8171 35649
16061C5649m7744m8740O2962Q7024k655l1045n0056k2318N677K6342q406k6106
$$ 35649 -12095 -60835 2127 89151 86496 55451 5395 -16923 -11246 15096 6690 -19416
16049a9416Q4843j5713R322m1028n7851J036R025M1387L5231m9093k4850j1621
$$ -19416 65427 49714 59036 18008 -39843 -38807 -29782 11605 46836 -2257 -27107 -38728
16037c8728L871R458M8051K1316j0960r737m107l3376r883M3136l680n7421m0010
$$ -38728 -34857 -25399 22652 43968 33008 23271 19164 -14212 -24095 19041 15361 -42060 -82070
16024h2070l807N1662J0304L4228O4811l2939j8091M3370l6655O3n874l938n071
$$ -82070 -85877 -34215 -23911 10317 75128 42189 24098 67468 30813 30876 25002 21064 15993
16011A5993j3598O2733J930j8023m3090M9860N3350j0569o9286q318Q391K742
$$ 15993 2395 65128 67058 49035 5945 55805 109155 98586 29300 20982 29373 32115
15999C2115m9288J1622M6757L0694n23k7395K3747l2479q17m0626l9134P987M6223
$$ 32115 -17173 -5551 41206 71900 71377 43982 67729 35250 34433 -6193 -45327 -37340 8883
15986H883n054j7924k1289J384N8495q623n7521K8718L8984J0102k2167m0106
$$ 8883 3829 -14095 -35384 -34000 24495 15872 -41649 -12931 26053 36155 13988 -26118
15974b6118Q785q0920j7946Q3908R2437K5188k4221j6148k7041o3759n4361k3759
$$ -26118 -17333 -98253 -116199 -32291 60146 85334 61113 44965 17924 -45835 -100196 -123955
15962a23955j6415R1514P8169q916l2017L3165k4515M094M0978j1700j3372k9080
$$ -123955 -140370 -48856 29313 20397 -11620 21545 -2970 1124 42102 30402 17030 -12050
15950a2050K7130N0710M814m0244m457n141J4361n5964j6808l907O0173L7241
$$ -12050 15080 65790 70604 30360 25903 20762 35123 -20841 -37649 -41556 18617 55858
15938E5858L9756j7309o9152o6150j4552K3389k4767M6431K1663m592K4257k0095
$$ 55858 95614 78305 9153 -56997 -71549 -48160 -72927 -26496 -4833 -9425 14832 -5263
15926e263K3414L1982K1292J7931j8760l1247p9852L8336L7039j8595p4649L9297
$$ -5263 18151 50133 71425 89356 70596 39349 -40503 -2167 34872 16277 -58372 -19075
15914a9075K1708N0665R705M0382Q40j5390n1752m2967n6401M6174L8366l8724
$$ -19075 2633 53298 63003 103385 104225 88835 37083 -5884 -62285 -16111 22255 -16469
15902a6469l1547K4882J3994L6493j882k1485m9214n2683M8312L4482O209J5363
$$ -16469 -48016 -23134 -9140 27353 25471 3986 -45228 -97911 -49599 -15117 -8908 6455
15890F455L8360n2284J946l247l535Q278q313m7166r143N3981P6507L8918m9096
$$ 6455 44815 -7469 -5523 -8770 -12305 -4027 -12340 -59506 -68649 -14668 61839 100757 51661
15877E1661q7790n883K9076Pl0926J3361K1088J3473J4302O947j1807l111J5344
$$ 51661 -36129 -42012 -12936 -12929 -43855 -30494 -9406 4067 18369 25316 13509 10398 25742
15864B5742K5059N2257k2932J2540O376j7688n0335K0435L3108k9805m4025j4995
$$ 25742 50801 103058 80126 92666 99042 81354 31019 51454 84562 54757 10732 -4263
15852d263J1604K1238N186j308j6110m1026l52j5887p243K0403j7745p3007K3294
$$ -4263 7341 28579 33765 32457 16347 -24679 -25031 -40918 -48161 -27758 -45503 -118510 -95216
15839i5216Q2175J8528p716Q415K8417p337n9858J3548K7115M5377m0416k4630
$$ -95216 -13041 5487 -2229 6186 34603 27266 -32592 -19044 8071 53448 13032 -11598
15827a1598K7233m2233M1004J9678K0087j8991N674p695j2196J9965P227j4739
$$ -11598 15635 -26598 14406 34084 54171 35180 40854 33159 20963 40928 48155 33416
15815C3416n8278j4408M450N2188J6333n0868j3764L3432K6305q500O072l4260
$$ 33416 -24862 -39270 -34820 17368 33701 -17167 -30931 2501 28806 20306 26378 -7882
15803g882P104l5743n0892k1067P0227Q6118j8331o6226J8965P4802O2810n1841
$$ -7882 -778 -36521 -87413 -108480 -38253 47865 29534 -36692 -17727 57075 119885 68044
15791F8044o688K928k8983l7874j6691J8422k0781j5051J2231J5475J4523P7738
$$ 68044 61356 64284 35301 -2573 -19264 -842 -21623 -36674 -24443 -8968 5555 83293
15779H3293m6081n5610Q5962J5679l0290j9042n1140j1542O8074K5607j0629o0756
$$ 83293 37212 -18398 67564 83243 52953 33911 -17229 -28771 39303 64910 54281 -6475
15767f475l8782j4345L8600M750L2230K2565m3151l5483r004J0942J2290K1734
$$ -6475 -45257 -59602 -21002 -16252 15978 38543 -4608 -40091 -49095 -38153 -25863 -4129
15755d129N974J3230L2831l6502L7839J3476L4445J6970k3437m4661K1221J1831
$$ -4129 1845 15075 47906 11404 49243 62719 97164 114134 90697 46036 67257 79088
15743G9088K3758M119k2044q564k3731o320K2998j2480o35k0148J9777J05729
$$ 79088 102846 106965 84921 76357 52626 46306 69304 56824 56189 36041 55818 161547
15731A61547k9694P704N123p0772L109j5256j5088j6399l517J3546K0280j7222
$$ 161547 131853 139557 144680 73908 77017 61761 46673 30274 26757 40303 60583 43361
15719D3361l364M7442j2312L5388K1993j5810o1681m484M1539M9342q360o9691
$$ 43361 39997 87439 75127 110515 132508 116698 55017 50533 92072 141414 133054 63363
15707F3363l1875L5197j02541M7430Q0806N6643o6577q6043M368Q0163l059o610
$$ 63363 31488 66685 -35856 11574 92380 149023 82446 -3597 771 80934 77875 71265
15695G1265K7479K3220j0758j6011m3816q540M2900k913K156L1193m9935M6543
$$ 71265 98744 121964 111206 95195 51379 42839 85739 82826 84982 116175 66240 112783
15683A12783N2288O8098M4345M4687N2649j079k1653J35357J53862J07276J41806
$$ 112783 165071 233169 277514 322201 374850 373771 352118 487475 641337 748613 890419
15672H90419K07494K97169K65740K26447K00156K03537R419l1009j10507j57771
$$ 890419 1097913 1395082 1660822 1887269 2087425 2290962 2300381 2269372 2158865 2001094
15662B001094k16662k39648k44772k59722k02709j65603j00568k4525p0937q6137
$$ 2001094 1784432 1544784 1300012 1040290 837581 671978 571410 546885 475948 389811
15652C89811j00313p2154n7947m5635l8803O3550J5390m457m3418n6273O748N2720
$$ 389811 289498 217344 159397 113762 74959 138509 153899 149442 106024 49751 56499 109219
15640A09219m6446K6709J3477N220L8551j037l4637j0392J5548m7352J0189k680
$$ 109219 62773 89482 102959 108179 146730 145693 111056 100664 116212 68860 79049 76369
15628G6369o7445J4648K5590j8189M2065M4198K4809q5226o6062p495O6124J00973
$$ 76369 8924 23572 49162 30973 73038 117236 142045 56819 -9243 -16738 49386 150359
15616A50359L5699j3693p236l3328K692m1492k6722R079l1626l1831P0222N1674
$$ 150359 186058 172365 165129 131801 134493 93001 66279 75358 43732 11901 82123 133797
15604A33797j0076m6735K5568j0753K449k4436J268M12j0008j441L968L9640L6267
$$ 133797 123721 76986 102554 91801 94250 69814 71082 71494 61486 60045 64013 103653 139920
15591A39920o9021q9687l0301N2488L5170o1084j1301l7070P427J09924n37k8504
$$ 139920 70899 -18788 -49089 3399 38569 -22515 -33816 -70886 -63459 46465 45928 17424
15579A7424O453m986n871K0572q50R920j1927L8240p491n5654n0116L1092O0565
$$ 17424 23877 18891 13020 33592 32742 42662 30735 68975 61484 5830 -44286 -13194 47371
15566D7371L4471j0211J6405j2537L5974j836j2038m8975L9449j4943m9140l8368
$$ 47371 81842 71631 88036 75499 111473 109637 97599 48624 88073 73130 23990 -14378
15554a4378R144j4628j5908K2231K52J662O2839L0154k3341J2317r059J02887
$$ -14378 -5234 -19862 -35770 -13539 -13287 -11625 51214 81368 58027 70344 61285 164172
15542A64172N8065l4950l3400n1474K3734P807n3357k9304L1853k8473q2824n3413
$$ 164172 222237 187287 153887 102413 126147 133954 80597 51293 83146 54673 -28151 -81564
15530h1564L0773k0465p2146k0916J8778J3380K8655Q551N4608K857l8952k81
$$ -81564 -50791 -71256 -143402 -164318 -145540 -132160 -103505 -94954 -40346 -37489 -76441 -76722
15518g6722k241P2066K9169o864j6500l592K0644L69J4738l4058K1610L0045l492
$$ -76722 -78963 -6897 22272 15408 -1092 -4684 15960 16329 31067 -2991 18619 48664 45172
15505D5172k829K788R644n9867P1168R0691M3416n047o1589o5482j1833K638L8797
$$ 45172 42343 45131 54775 -5092 66076 156767 200183 195136 133547 68065 56232 58870 97667
15492I7667P80j4624m680j9877J592L2567K3115R2073J8701O6319K046K6542N8987
$$ 97667 98447 83823 79143 59266 60858 93425 116540 208613 227314 293633 295679 322221 381208
15479C81208k8295m1916q344K9788K1807m7012j02133N070o6048m4811J5759n033
$$ 381208 352913 310997 302653 332441 354248 307236 205103 210173 144125 99314 115073 110040
15467A10040k8562J0227j8381M2050N6042J5971l4273j6738k3186J2376j0008
$$ 110040 81478 91705 73324 115374 171416 187387 153114 136376 113190 125566 115558
15456A15558J7346Q451J2002K4509j3760r709J9640K3131L9566n9418l3527l4453
$$ 115558 132904 141355 153357 177866 164106 154397 174037 197168 236734 177316 143789 109336
15444A09336J1591M0985J5325J8436l484N973O29p4097o0223k3640P7939Q1714
$$ 109336 120927 161912 177237 195673 192189 198162 198791 124694 64471 40831 118770 200484
15432B00484K6633l2004k8727k3568m0420K8940m1389o247K0684J4529l4966k2707
$$ 200484 227117 195113 166386 142818 102398 131338 89949 83702 104386 118915 83949 61242
15420F1242O187j3201n233J1883L7814K921K3365n7804j1865M0852J415l9092
$$ 61242 67429 54228 48995 60878 98692 101613 124978 67174 55309 96161 97576 58484
15408E8484j6378p111K240K2902k0591r403J6647k8014o2522k0369K9137M6326
$$ 58484 42106 34995 37235 60137 39546 30143 46790 18776 -43746 -64115 -34978 11348
15396A1348J1285j8568o5180l095n93o1088P252R203l7840K7602N912p5354n793
$$ 11348 22633 4065 -61115 -64210 -64803 -125891 -118639 -109436 -147276 -119674 -113762 -189116 -194909
15383a94909R695P1399J7451N342P6718N8329J3054M2204M2794k7005o832L5495
$$ -194909 -185214 -113815 -96364 -91022 -14304 44025 57079 99283 142077 115072 108240 143735
15371A43735K8402R1946L8467j8651j811M3229L483m6742j6603O7869J03617P2383
$$ 143735 172137 264083 302550 283899 282088 325317 328800 282058 265455 333324 436941 509324
15359E09324P4139R2897J33552J25299J69074R6056O7305J11486J33958Q3814
$$ 509324 583463 676360 809912 935211 1104285 1200341 1267646 1379132 1513090 1596904
15349A596904j8226K7924J6919j21931j65713j60035j06956m6375o9989j13776
$$ 1596904 1578678 1606602 1623521 1501590 1335877 1175842 1068886 1022511 952522 838746
15339H38746n6246j01170o4162m9212M8064J3792m3623n5832m7364J2288N3291
$$ 838746 782500 681330 617168 567956 616020 629812 586189 530357 482993 495281 548572
15328E48572N9573m5512k5876M1432J0899L9405p663k7266l7863l2024O4059p277
$$ 548572 608145 562633 536757 578189 589088 628493 620830 593564 555701 523677 587736 580459
15316E80459o3057M3388K1852J0009L3709J8177J1805K3495j7474M3193k2225
$$ 580459 517402 560790 582642 592651 626360 644537 656342 679837 662363 705556 683331
15305F83331J9833P2193P941N9794K0641J0558J4178k2366j6687O2911O4909j5212
$$ 683331 703164 775357 783298 843092 863733 874291 888469 866103 849416 912327 977236 962024
15293I62024k2671O8878J13381N7509j4055K76k5435L0971N4382M9452M8310K7460
$$ 962024 939353 1008231 1121612 1179121 1165066 1165342 1139907 1170878 1225260 1274712 1323022 1350482
15281A350482O5117P2249O5617N8436P2420P790P3107K6968R75O4312J42609J25240
$$ 1350482 1415599 1487848 1553465 1611901 1684321 1692111 1765218 1792186 1793161 1857473 2000082 2125322
15269B125322R3856R4216J35351J36974R7029Q0867R4450P1734J58476K28855
$$ 2125322 2219178 2313394 2448745 2585719 2682748 2763615 2858065 2929799 3088275 3317130
15259C317130K13178K03880J42415K93948K99364L27837L79734L93274M77352
$$ 3317130 3530308 3734188 3876603 4170551 4469915 4797752 5177486 5570760 6048112
15250F048112M46252N94419P75431Q21846R65837J278709J489687J796567K241026
$$ 6048112 6494364 7088783 7864214 8686060 9651897 10930606 12420293 14216860 16457886
15241A6457886K578450K960267L417094L975383M762374N850142P602731J0252952
$$ 16457886 19036336 21996603 25413697 29389080 34151454 40001596 47604327 57857279
15233E7857279J4264720J9835692K6468351L3682018M0285512M5557169M8003033
$$ 57857279 72121999 91957691 118426042 152108060 192393572 237950741 285953774
15226B85953774M6962093M1506332L1913339J8824033L624641j1734043k6080011
$$ 285953774 332915867 374422199 406335538 425159571 428784212 417050169 390970158
15219C90970158l6958413m4337769m7396086m6826590m2969109l7000151l0141173
$$ 390970158 354011745 309673976 262277890 215451300 172482191 135482040 105340867
15212A05340867k3222488j7329200j2580971r169896o923875n362611m358524
$$ 105340867 82118379 64789179 52208208 43038312 36114437 30751826 26393302
15205B6393302l668776l129137k719135k371450j993860j641205j376412j136669
$$ 26393302 22724526 19595389 16876254 14504804 12510944 10869739 9493327 8356658
15197H356658r43989p23492o07909n37292l73111l19466l20339k45687j86677
$$ 8356658 7412669 6689177 6081268 5543976 5170865 4851399 4531060 4285373 4098696
15188D098696j41602j39022q9742k26513k62602k63692j63632j13329j57445j53281
$$ 4098696 3957094 3818072 3728330 3501817 3239215 2975523 2811891 2698562 2541117 2387836
15178B387836j42297j46142j61128q4045n7105j05489j5120r3952o2638k0881
$$ 2387836 2245539 2099397 1938269 1854224 1797119 1691630 1676510 1582558 1519920 1499039
15168A499039n6252m9115k1608J6079l3187p1897q7820k6902n3519j57345j03329
$$ 1499039 1442787 1393672 1372064 1388143 1354956 1283059 1195239 1168337 1114818 957473 854144
15157H54144n8884J9814k5308j7789J7505l8239m1229q46Q041n3940l610M3739
$$ 854144 795260 815074 789766 771977 789482 751243 710014 709168 717209 663269 659659 703398
15145G03398J9699L5861K8160j6396L9105j6918K3224J7005k619m8504m4757j5881
$$ 703398 723097 758958 787118 770722 809827 792909 816133 833138 830519 782015 737258 721377
15133G21377j4673m5874l8811M7303k5643o8177p7470m1584n0106n7387n231j2643
$$ 721377 706704 660830 622019 669322 643679 575502 498032 456448 406342 348955 343724 331081
15121C31081k857K6038j922o8046p4758N1897L5743q764L6788N471o2076p1239
$$ 331081 328224 354262 352340 284294 209536 261433 297176 288412 325200 330671 268595 197356
15109A97356J9327J5281j5054k2761j915N3095l8361l1488m6847q4677m1194l354
$$ 197356 216683 231964 216910 194149 192234 245329 206968 175480 128633 43956 2762 -592
15097e92m026j1563M202j21L7004O6446P0712N5020j0139n0165l6109M1973N5516
$$ -592 -4618 -16181 -11979 -12100 24904 91350 162062 217082 206943 156778 120669 162642 218158
15084B18158L2433L1456K5592l3087j03288l0919L9818j3377j6671J3208M4669
$$ 218158 250591 282047 307639 274552 171264 140345 180163 166786 150115 163323 207992
15073B07992n0032J232J0711R1117L4705O1706J15422J27799O4924K7165n5898
$$ 207992 157960 159192 169903 261020 295725 357431 472853 600652 665576 692741 636843
15062F36843k2742N6651N6206L399n1600n577m4841k2138j7207k8803L2273k604
$$ 636843 614101 670752 726958 730357 678757 673180 628339 606201 588994 560191 592464 589860
15050E89860q3746l5238p9151n6542R154J1008k7372N8815J3390k6724J2283k2096
$$ 589860 506114 470876 391725 335183 344337 355345 327973 386788 400178 373454 385737 363641
15038C63641k1894j3373m5716o7407k6778j7517j1343k6207K8582K2929o867k0515
$$ 363641 341747 328374 282658 215251 188473 170956 159613 133406 161988 184917 178050 157535
15026A57535r523k8508J1998r175N314j3697k8056l426l9294k1085q378N6430
$$ 157535 148012 119504 131502 122327 127641 113944 85888 82462 43168 22083 13705 70135
15014G0135P0140L8545k5312o2655j9180N2988j0893j0229m8245l8988M808J6519
$$ 70135 140275 178820 153508 90853 71673 124661 113768 103539 55294 16306 21114 37633
15002C7633R318j4666M970l83L8437o598m735K0591p007K1549k133k269N697n0124
$$ 37633 46951 32285 37255 36872 75309 68711 63976 84567 77560 99109 96976 94707 100404 50280
14988E0280N696J6851L4252N835L1308m075m3028l7753J3436L1252R909j0318
$$ 50280 55976 72827 107079 112914 144222 140147 97119 59366 72802 104054 113963 103645
14976A03645J6539j9632J5574K6966M9J1964o8213m9427M0887J4947n7214m1158
$$ 103645 120184 100552 116126 143092 143141 155105 86892 37465 78352 93299 36085 -5073
14964e073l7363K0630j1494K0715o038L9137J0354N208j2435R716L1979P983l2739
$$ -5073 -42436 -21806 -33300 -12585 -18623 20514 30868 36076 23641 33357 65336 73319 40580
14951D0580j9310l1953M180N7824J7688j9518k6539M2964j9512k2765M864L3381
$$ 40580 21270 -10683 -6503 51321 69009 49491 22952 65916 46404 23639 28503 61884
14939F1884L0417L7156L1231K2051j9462J6110k9855Q609j4012L6001P7747K1659
$$ 61884 92301 129457 160688 182739 163277 179387 149532 158141 144129 180130 257877 279536
14927B79536o0043o4116n4418j7338p794R2683N5035L6849l9239q4413J7626L4090
$$ 279536 219493 155377 100959 83621 75827 168510 223545 260394 221155 136742 154368 188458
14915A88458P851n4380p0747J0718o74K1987q2030j19196R508Q0823K4240L5192
$$ 188458 196309 141929 71182 81900 81226 103213 21183 -98013 -88505 -7682 16558 51750
14903E1750k8136m9417m16p0213m2624l3321P550N2984Q4965K8892J2992q5093
$$ 51750 23614 -25803 -26219 -96432 -139056 -172377 -164827 -111843 -26878 2014 15006 -70087
14891g0087m2448N0160K8065L4881m4527j308J23554Q063r2217j7898J7552j9019
$$ -70087 -112535 -62375 -34310 571 -43956 -45264 78290 86353 -5864 -23762 -6210 -25229
14879b5229n2434K1401J30095r251j4939m2161J9207L9172L3499M6048n8237p6620
$$ -25229 -77663 -56262 73833 64582 49643 7482 26689 65861 99360 145408 87171 10551
14867A0551M829l4260r784O6978j3129l1404p3622n2803n993J5838J8099N2895
$$ 10551 15380 -18880 -28664 38314 25185 -6219 -79841 -132644 -138637 -122799 -104700 -51805
14855e1805L6638q967N2462l1910J0961l9169k7119K9851o7273j4608O6444L3474
$$ -51805 -15167 -24134 28328 -3582 7379 -31790 -58909 -29058 -96331 -110939 -44495 -11021
14843a1021L2226N18K8224J9158o38n5823p256M4939J3781k9689m8918L3075L5101
$$ -11021 21205 21723 49947 69105 68467 12644 5388 50327 64108 34419 -14499 18576 53677
14830E3677j0778m2420l1722j6973O716K4231K0516K6981k3791L298j298j9355
$$ 53677 42899 479 -31243 -48216 -41500 -17269 3247 30228 6437 9735 8437 -10918
14818a0918O6276O030O620M4607r473j4125k1117K8861R730q2617l7716J9602
$$ -10918 55358 61388 68008 112615 103142 89017 67900 96761 106491 23874 -13842 5760
14806E760J9381J2108N5601M6944l9499n3375j6228K408M0580j6117o9353m690
$$ 5760 25141 37249 92850 139794 100295 46920 30692 33100 73680 57563 -11790 -16480
14794a6480K8962J21450O1488k6165m7192M953J8278N0894O2668J17950P046L2605
$$ -16480 12482 133932 195420 169255 122063 127016 145294 196188 258856 376806 383852 416457
14782D16457Q5456J37293K42775J57519K25551K37542K44024K55087Q7532P2685
$$ 416457 501913 639206 881981 1039500 1265051 1502593 1746617 2001704 2089236 2161921
14772B161921K1870m9567q7277k02761k35539l12691k82608k96237k02662j14162
$$ 2161921 2183791 2134224 2046947 1844186 1608647 1295956 1013348 717111 514449 400287
14762D00287p0642j9143j0772k6097p3339o2789k9762k844l6713l7899L2482L3634
$$ 400287 329645 310502 299730 273633 200294 137505 107743 104899 68186 30287 62769 96403
14750I6403k7126M420m5917k5931k3932N767J5236m309m3754l6164J1823K2743
$$ 96403 69277 73697 27780 1849 -22083 -16316 -1080 -5389 -49143 -85307 -73484 -50741
14738e0741O328L3914J1588l0171m1324N2035K9635j0681J7217P215K3550O1181
$$ -50741 -44413 -10499 1089 -29082 -70406 -18371 11264 583 17800 25015 48565 109746
14726A09746q4111j25731K4643J4970J389O6670R5150l637o3470l1137P0118L2638
$$ 109746 25635 -100096 -75453 -60483 -59094 7576 102726 99089 35619 4482 74600 107238
14714A07238m5541p4180K080M4879K8630j1732R442n0938k7150J3870j4075m5634
$$ 107238 61697 -12483 -10403 34476 63106 51374 60816 9878 -17272 -3402 -17477 -63111
14702f3111K0757L1048k082m1738M130N184o482k6471K4644R7389L355n1084o1747
$$ -63111 -42354 -11306 -13388 -55126 -50996 -45812 -52294 -78765 -54121 43268 46623 -4461 -66208
14689f6208j0542J3789j3924J9619K5662Q8396K7846j6457J9074J7088L6976n6569
$$ -66208 -76750 -62961 -76885 -57266 -31604 56792 84638 68181 87255 104343 141319 84750
14677H4750m1941K3063J960l8536m9946m3852q329K6727J3086R964K8964k3219
$$ 84750 42809 65872 67832 29296 -20650 -64502 -72831 -46104 -33018 -23054 5910 -17309
14665a7309j0784L3456K2055k9178J7670j3310O297M1318l4896L4007N8200m5306
$$ -17309 -28093 5363 27418 -1760 15910 2600 8897 50215 15319 49326 107526 62220
14653F2220m2083J5752K8771j9123p929k3358j6857J7305K6207L7281j8286J5835
$$ 62220 20137 35889 64660 45537 37608 14250 -2607 14698 40905 78186 59900 75735
14641G5735J7165j4547m6752j5617l5093k2153J6272m0716J2641M9319L3824j462
$$ 75735 92900 78353 31601 15984 -19109 -41262 -24990 -65706 -53065 -3746 30078 28616
14629B8616n2693k6514Q0882R935m2493k9532l3297r874P006j1028j0952J4902
$$ 28616 -24077 -50591 30291 40226 -2267 -31799 -65096 -74970 -67964 -78992 -89944 -75042
14617g5042N564M4935L6838J6424k2570K8003J2192P262L3623j4034k1895J8476
$$ -75042 -69478 -24543 12295 28719 6149 34152 46344 53606 87229 73195 51300 69776
14605F9776O880O023l7041J235o6024o1087L7970L3565L5032m093l4708o1875
$$ 69776 76656 82679 45638 46873 -19151 -80238 -42268 -8703 26329 22236 -12472 -74347
14593g4347k4241R069L8029P5081k2877r97k5224K2088L8050j2860J6859k336
$$ -74347 -98588 -89519 -51490 23591 714 -283 -25507 -3419 34631 21771 38630 36294
14581C6294n9518L1020p024K1374n7043L4486j5153k4009J1018j8613j3936J3057
$$ 36294 -23224 7796 772 22146 -34897 -411 -15564 -39573 -28555 -47168 -61104 -48047
14569d8047L3549J0293J4777M323k4071n7580j2828l0464Q230L1160k06q104J4890
$$ -48047 -14498 -4205 10572 14895 -9176 -66756 -79584 -110048 -101818 -70658 -70864 -78968 -64078
14556f4078O86K2325K1057Q833J679R339L0888J8949m2909K574k5246J5985N1986
$$ -64078 -63392 -41067 -20010 -11177 -9498 -159 30729 49678 6769 9343 -15903 82 52068
14543E2068r459j0047m4521o0793o6058P4386K2071K4155m782m1704N3256o42
$$ 52068 42609 32562 -11959 -72752 -138810 -64424 -42353 -18198 -22980 -64684 -11428 -12070
14531a2070m0529M0285J4929k2269n4157K4029N0217J3011J387R426Q602m3987
$$ -12070 -52599 -12314 2615 -19654 -73811 -49782 435 13446 14833 24259 32861 -11126
14519a1126o9340j0042J0246k763n04K7859L9554M9562j6021N739O3941l6162
$$ -11126 -80466 -90508 -80262 -83025 -83529 -55670 -16116 33446 17425 23164 87105 50943
14507E0943p3232m5383K8304J7298L8489k5214n3030j1774K5294O2388n1387l2532
$$ 50943 -22289 -67672 -39368 -22070 16419 -8795 -61825 -73599 -48305 14083 -37304 -69836
14495f9836L2246O791N221j0997j5248n969L9738O7822j1279k7981m2087m3624
$$ -69836 -37590 -30799 -25578 -36575 -51823 -57792 -18054 49768 38489 10508 -31579 -75203
14483g5203N0228P530q021j2280n8689K7592K4830m2169k9398P5132K8488p807
$$ -75203 -24975 -17445 -25466 -37746 -96435 -68843 -44013 -86182 -115580 -40448 -11960 -19767
14471a9767r018r603P8Q8489L766m7276k5267j6579r471J433m503J0675L1184
$$ -19767 -28785 -38388 -38310 50179 53945 6669 -18598 -35177 -44648 -43215 -47718 -37043 -5859
14458e859k6841j8054O119P804M5153K0848q446k9814m0005M114L7480L3293l519
$$ -5859 -32700 -50754 -44635 -36831 8322 29170 20724 -9090 -49095 -44981 -7501 25792 22273
14445B2273l256o4523J6258J1445M6951L5377j0382l0594j6507l0070k1859k7124
$$ 22273 19017 -45506 -29248 -17803 29148 64525 54143 23549 7042 -23028 -44887 -72011
14433g2011L2785L3598p0290q118P0943K0611l362m8450Q474P1135j4601K9570
$$ -72011 -39226 -5628 -75918 -84036 -13093 7518 4156 -44294 -35820 35315 20714 50284
14421E0284K3094o7176K021k4326p533l276K9037J7950M672K8879j6539K4103
$$ 50284 73378 6202 8223 -16103 -23636 -26912 2125 20075 24747 53626 37087 61190
14409F1190M066K0077r08j466n4875j01074n768L4478L8210m758k293k7888M3384
$$ 61190 65256 85333 84425 82959 28084 -72990 -78758 -44280 -6070 -10828 -13121 -41009 2375
14396B375M7154j0665o0444o850N2964k7128m3016N3471j4827j2034n284J4186
$$ 2375 49529 38864 -21580 -28430 24534 -2594 -45610 7861 -6966 -19000 -24284 -10098
14384a0098J2151m3482m436Q1067l2994n8309m8162L1082O0357M2257j1679K1080
$$ -10098 2053 -41429 -45865 35202 2208 -56101 -104263 -73181 -12824 29433 17754 38834
14372C8834R781K0357j4005k066J2646m670p6479l0611M635L8248L974N3648M7218
$$ 38834 48615 68972 54967 52901 65547 60877 -15602 -46213 -41578 -3330 644 54292 101510
14359A01510l680m21J4968J9250L2512L6808J936m0421j6935j4515j5251J12736
$$ 101510 97830 97409 112377 131627 164139 200947 202883 162462 145527 131012 115761 228497
14347B28497K597n1001N94J5003N6798l4576m2458k3488J6089J4390J7569l0732
$$ 228497 231094 180093 180687 195690 252488 217912 175454 151966 168055 182445 200014 169282
14335A69282l2757O8670p458m3842m0771j6492k9536p1425K3058O997J9251m092
$$ 169282 136525 205195 197737 153895 113124 96632 67096 -4329 18729 25726 44977 40885
14323D0885Q314n177m2634n0487j664O7759j6620J4304M8222m1616l719q151r297
$$ 40885 49199 44022 1388 -49099 -50763 16996 376 14680 62902 21286 17567 9416 119
14310A19Q066j0431k5589j9647l3845m9461m373J1356K7517O4828J176o4912j0897
$$ 119 8185 -2246 -27835 -47482 -81327 -130788 -135161 -123805 -96288 -31460 -30284 -95196 -106093
14297a06093O9122M726l1402K0721O2497K5316l2355n2481N5129q508o5674N9017
$$ -106093 -36971 -32245 -63647 -42926 19571 44887 12532 -39949 15180 6672 -59002 15
14285A5J7328j6106l7809K821M0649N1516j7303j1342L2791m518k2482m8114l6287
$$ 15 17343 1237 -36572 -33751 6898 58414 41111 29769 62560 58042 35560 -12554 -48841
14272d8841M1502M4365Q58Q347q612j8771o9635k5366O4587j4370j2624K944l758
$$ -48841 -7339 37026 37884 46231 37619 18848 -50787 -76153 -11566 -25936 -38560 -35616 -39374
14259c9374K3078J1924l8739L714k0024K3392l4710j4339O0971K2080q012M2379
$$ -39374 -16296 -4372 -43111 -39397 -59421 -36029 -70739 -85078 -24107 -2027 -10039 32340
14247C2340P233n8410j5250n691l3804k9971j4965M6519O8524n380m1996K8401
$$ 32340 39573 -18837 -34087 -39778 -73582 -103553 -118518 -71999 -3475 -8855 -50851 -22450
14235b2450M838k4901l50q895P576M4719L477j7514K6886o840L6678J8192L0365
$$ -22450 -17612 -42513 -42863 -51758 -44182 537 4014 -13500 13386 6546 43224 61416 91781
14222I1781J7955n818q3691n1247K1494K356J1679M762M6621R420o7841n287k2403
$$ 91781 109736 103918 20227 -31020 -9526 -7170 4509 9271 55892 65312 -2529 -7816 -30219
14209c0219j7104K6201K3893L9140j3648P440L243J0965l4920p4204J1703R3370
$$ -30219 -47323 -21122 2771 41911 28263 35703 38946 49911 14991 -59213 -47510 45860
14197D5860M1086M1543q412l3136j6942k3797P103L847k4667m8353j6608J4976
$$ 45860 86946 128489 120077 86941 69999 46202 53305 57152 32485 -15868 -32476 -17500
14185a7500j9824J3243K2421L5517M3783k7117m0233j7175M154j4429k733K3048
$$ -17500 -37324 -24081 -1660 33857 77640 50523 10290 -6885 -2731 -17160 -19893 3155
14173C155K0392K1660k7048L232k0151k0868k243p0292l419K9017J1721K2928
$$ 3155 23547 45207 18159 21391 1240 -19628 -21871 -92163 -95582 -66565 -54844 -31916
14161c1916L260L2741M5274J7532m3441m4949l5130o2645O4570p987o265M2793
$$ -31916 -28656 4085 49359 66891 23450 -21499 -56629 -119274 -54704 -62691 -68956 -26163
14149b6163L221K0634J0658l3468l6941J6035L2759K5633O870j0343p6059L4466
$$ -26163 -22942 -2308 8350 -25118 -62059 -46024 -13265 12368 19238 8895 -67164 -32698
14137c2698K9992j1620k8100M406L594J4439L1581M5946M812o6176n6739j3593
$$ -32698 -2706 -14326 -42426 -38020 -34426 -19987 11594 57540 62352 -3824 -60563 -74156
14125g4156r451j991k666J1216K6046P4352L1680j3230j3640n8230j2846O3501
$$ -74156 -83607 -85598 -88264 -77048 -51002 23350 55030 41800 28160 -30070 -42916 20585
14113B0585J071k0059J7035p632J6073M0351l7428m7276L1905J7000k9755K2679
$$ 20585 21656 1597 18632 11000 27073 67424 29996 -17280 14625 31625 1870 24549
14101B4549J2585j35P478J1059m1834p4044J8732p788l2589O2958J9460l7281
$$ 24549 37134 36999 44477 55536 13702 -60342 -41610 -49398 -81987 -19029 431 -36850
14089c6850j4655l106K6013Q267L5035N9870L0620l9533l6310n4102q7522m554
$$ -36850 -51505 -54611 -28598 -20331 14704 74574 105194 65661 29351 -24751 -112273 -116827
14077a16827N6860N4340J819J9174N4490r591k5208l1908k0239L4406j6009m3495
$$ -116827 -59967 -5627 -3808 15366 69856 60265 35057 3149 -17090 17316 1307 -42188
14065d2188M0671j6162j7459L7481K6295K9005j590m3145l6521j5468j0781L5360
$$ -42188 -1517 -17679 -35138 2343 28638 57643 56053 12908 -23613 -39081 -49862 -14502
14053a4502R5288Q8101M0627p9573p3974n3605L739O6996O4194k4296k1421m4866
$$ -14502 80786 168887 209514 129941 55967 2362 6101 73097 137291 112995 91574 46708
14041D6708j3603j0118j2192k3180P448L4666r532L7833L7450J4901J0255K4854
$$ 46708 33105 22987 10795 -12385 -4937 29729 20197 58030 95480 110381 120636 145490
14029A45490J8182L8403n998k2232n6535p4365m8102n2653k6867O0167R4560K3288
$$ 145490 163672 202075 196077 173845 117310 42945 -5157 -57810 -84677 -24510 70050 93338
14017I3338o4036q19L0256M116o2804k4982r502m762J5246k207K554k714k2658
$$ 93338 29302 28483 58739 62855 51 -24931 -34433 -39195 -23949 -26156 -23602 -26316 -48974
14004d8974K2596J9065m941j2761M4487N505p2358k3503N8216N319J3992J01477
$$ -48974 -26378 -7313 -12254 -25015 19472 24977 -47381 -70884 -12668 -7349 6643 108120
13992A08120M5424r0413n163j0790p230R278n4212m2079j9124k5106l2057P4612
$$ 108120 153544 63131 57968 47178 39948 49226 -4986 -47065 -66189 -91295 -123352 -48740
13980d8740Q9886r291j0054m3653k1703n4699L2694N7631P1462l5635o6190l0872
$$ -48740 41146 31855 21801 -21852 -43555 -98254 -65560 -7929 63533 27898 -38292 -69164
13968f9164L6288L2440o4821k3158J7670j6213J3424J794L3361K6997m1739Q416
$$ -69164 -32876 -436 -65257 -88415 -70745 -86958 -73534 -71740 -38379 -11382 -53121 -44705
13956d4705K1111j0074N5326J8759j5378J1525j9918q4164J0504k035J2928m4071
$$ -44705 -23594 -33668 21658 40417 25039 36564 16646 -67518 -57014 -59049 -46121 -90192
13944i0192K396M6931L9169j3448L6753L9817o6926K7630L1157L7445l7751j0325
$$ -90192 -87796 -40865 -1696 -15144 21609 61426 -5500 22130 53287 90732 52981 42656
13932D2656K2994K0739l4702k3543p4820o499m1179n832J8317L9939J4806N913
$$ 42656 65650 86389 51687 28144 -46676 -53175 -94354 -100186 -81869 -41930 -27124 -21211
13920b1211p8334K1417O8568M350l2179l1565J9532O002j5775O125R752K3510
$$ -21211 -99545 -78128 -9560 -5210 -37389 -68954 -49422 -43420 -59195 -53070 -43318 -19808
13908a9808L5237j4504j1941J426N0556p40J4580O7846k1735o4291K8386m6999
$$ -19808 15429 925 -11016 -9590 40966 40226 54806 122652 100917 36626 65012 18013
13896A8013j8391J4077k154k0698p5780P52R3394K6563m1161n332M6083M2586
$$ 18013 -378 13699 11545 -9153 -84933 -84181 9213 35776 -5385 -10717 35366 77952
13884G7952l575j030L7241L0938m3533o423K2225K8337m7413q2610J1979R237
$$ 77952 74377 73347 110588 141526 97993 91570 113795 142132 94719 12109 24088 33325
13872C3325o573j2274k9008o718j0707J7794K6512j1099P176N0012m1110j9638
$$ 33325 26752 14478 -14530 -21248 -31955 -14161 12351 1252 8428 58440 17330 -2308
13860b308Q7173O0649J7395r457m4496n7453m3821m5519K7198O3592N2843K4569
$$ -2308 84865 145514 162909 153452 108956 51503 7682 -37837 -10639 52953 105796 130365
13848A30365k7893k5474k8756M4485n2834j8047l0036J6976k8803M4782L3287
$$ 130365 102472 76998 48242 92727 39893 21846 -8190 8786 -20017 24765 58052
13837E8052k0703l8101J3404J2984J500Q240M0435j7411k791n0343J2449p341
$$ 58052 37349 -752 12652 25636 27136 35376 75811 58400 55609 5266 17715 10374
13825A0374k6413k3542n000O0738K4369l5424p8339j3709O5071K2782l2830j0413
$$ 10374 -16039 -39581 -44581 16157 40526 5102 -73237 -86946 -21875 907 -31923 -42336
13813d2336o8572j4668R8506M9340q735M292k9304k7536l6774O5837O4975l5983
$$ -42336 -110908 -125576 -27070 22270 13535 17827 -11477 -39013 -75787 -9950 55025 19042
13801A9042M6820m1179o3688p408K526L5271k3245M4323M0351o0052l4019J0492
$$ 19042 65862 24683 -39005 -46413 -43887 -8616 -31861 12462 52813 -7239 -41258 -30766
13789c0766J9680J8876Q8776M1281l0847j6541j5949j0073j04771k1565O7986
$$ -30766 -11086 7790 96566 137847 107000 90459 74510 64437 -40334 -61899 6087
13778F087N3166m1558p3683K6368K9761J1960j7777Q095J8890J1905k5259m6499
$$ 6087 59253 17695 -55988 -29620 141 12101 -5676 2419 21309 33214 7955 -38544
13766c8544J6890j7933O845N5953O9999K6347m7609m8932J806l5616l2135R051
$$ -38544 -21654 -39587 -32742 23211 93210 119557 71948 23016 24822 -10794 -42929 -33878
13754c3878O6106l0226l3384m8571N867J3053L1896L3534K1063K0530m991l5429
$$ -33878 32228 2002 -31382 -79953 -74086 -61033 -29137 4397 25460 45990 40999 5570
13742E570m265j6541J5559K3136K0113J2719j8951k3647o0138l3511l7590L0200
$$ 5570 1305 -15236 323 23459 43572 56291 37340 13693 -46445 -79956 -117546 -87346
13730h7346J5167P3753K6528J1369m090k1341k0246l0718l1723L7223M2511J940
$$ -87346 -72179 1574 28102 39471 35381 14040 -6206 -36924 -68647 -31424 11087 13027
13718A3027l7225l1761n048R275k2083K6204O1837N6122Q433J006m8709l9178
$$ 13027 -24198 -55959 -61007 -51732 -73815 -47611 14226 70348 78781 79787 31078 -8100
13706h100k2375k5717M0965K0581N0677M5305P235N028m0756l1488o3692l8561
$$ -8100 -30475 -56192 -15227 5354 56031 101336 108571 113599 72843 41355 -22337 -60898
13694f0898j9874N8520J9434J8422n8870m5474n668L3123r508J626m2138L5904
$$ -60898 -80772 -22252 -2818 15604 -43266 -88740 -94408 -61285 -70793 -69167 -111305 -75401
13682g5401L4858j7630o262J2286k380J5927L710m505l3911M5P2078M3936O6281
$$ -75401 -40543 -58173 -64435 -52149 -54529 -38602 -34892 -39397 -73308 -73263 -1185 42751 109032
13669A09032K0616l0076q0739m1318J4064O8327K0238j23825k0328M242l1455
$$ 109032 129648 99572 18833 -22485 -8421 59906 80144 -43681 -64009 -59767 -91222
13658i1222M1774N9308m857J4020L1131J6455p387l3755j7315l146M8631J6275
$$ -91222 -49448 9860 5003 19023 50154 66609 59222 25467 8152 5006 53637 69912
13646F9912m8116l2193m445j5148N5114P5316l265n0018K8266l80L5403j8246
$$ 69912 21796 -10397 -14842 -29990 25124 100440 97175 47157 75423 75043 110446 92200
13634I2200m4900j1748k1080l9156p816L8161K5768K1920N114J8569L5411j6215
$$ 92200 47300 35552 14472 -24684 -32500 5661 31429 53349 58463 77032 112443 96228
13622I6228J3628l2482p2606k3971L1398N538m3533r190k8811j9111k305N0107
$$ 96228 109856 77374 4768 -19203 12195 17733 -25800 -34990 -63801 -82912 -85217 -35110
13610c5110O7167J9665k9191r2637j9953R3365N4024o215j5629p508K5920M2744
$$ -35110 32057 51722 22531 -70106 -90059 3306 57330 51115 35486 27978 53898 96642
13598I6642k2792k4993o5904j9406L0129K6753l1182K1849M4116J2874K8276J5534
$$ 96642 73850 48857 -17047 -36453 -6324 20429 -10753 11096 55212 68086 96362 111896
13586A11896m8828m5007J2467K595p0647n4990k8720J4286J9270P7807M017p104
$$ 111896 63068 18061 30528 33123 -37524 -92514 -121234 -106948 -87678 -9871 -5854 -12958
13574a2958Q046L4304k3141k8649K0661L0002n327N747q975l0756j6844j3546
$$ -12958 -4912 29392 6251 -22398 -1737 28265 22938 28685 19710 -11046 -27890 -41436
13562d1436n711J8703K1061L421j671M1435L8976N3358n0432j03313l707m4550
$$ -41436 -47147 -28444 -7383 -3962 -5633 35802 74778 128136 77704 -25609 -29316 -73866
13550g3866j8615P2371K3430k734L0358j091K844k8275l6245m0560L6334L7193
$$ -73866 -92481 -20110 3320 586 30944 29853 32697 4422 -31823 -72383 -36049 1144
13538A144o3120r724L995l0059j0446N5433Q1712N282l6999J2585k0783J2528
$$ 1144 -61976 -71700 -67705 -97764 -108210 -52777 28935 34217 -2782 9803 -10980 1548
13526A548l2934q551M566K2274l355J6642k9559o503J644L0904j7904l5978O3864
$$ 1548 -31386 -39937 -35371 -13097 -16452 190 -29369 -35872 -34228 -3324 -21228 -57206 6658
13513F658Q3246K3936l8315n5642j9562K1291J465k6089O429K3743N5155o2555
$$ 6658 89904 113840 75525 19883 321 21612 23077 -3012 3417 27160 82315 19760
13501A9760j9830j1265K9316M426K0179N7634j0943k5316r273j213J1568J9384
$$ 19760 -70 -11335 17981 22407 42586 100220 89277 63961 54688 53475 65043 84427
13489H4427j7155m3444n5124j2601K0624L1634L5241L7029j8619J7971Q35J537
$$ 84427 67272 23828 -31296 -43897 -23273 8361 43602 80631 62012 79983 80818 82355
13477H2355j7376k7328N4941K8683l6971n1644m6284q078N7544O2878l6269m6204
$$ 82355 64979 37651 92592 121275 84304 32660 -13624 -21702 35842 98720 62451 16247
13465A6247Q643j0037J605q5636K239O1747K0128J6663q507j6333m7465r346J8864
$$ 16247 24890 14853 16458 -69178 -66939 -5192 14936 31599 23092 6759 -40706 -50052 -31188
13452c1188N4944n9891m8866K0123L6353k0941Q304M9826K3905l1157r0444k7562
$$ -31188 23756 -36135 -85001 -64878 -28525 -49466 -41162 8664 32569 1412 -89032 -116594
13440a16594K488j9890N2998M6029j0559K6623K6187K4417O963k1931m5908k7247
$$ -116594 -114106 -133996 -80998 -34969 -45528 -18905 7282 31699 38662 16731 -29177 -56424
13428e6424n1770O500K9555P8152M8439R555m416l405k3455m7345r5369j691q212
$$ -56424 -108194 -101694 -72139 6013 54452 64007 59591 56186 32731 -14614 -109983 -111674 -119886
13415a19886K2007N9423J7525k1727K7926j4460M888j9422L0163Q8458J995n5904
$$ -119886 -97879 -38456 -20931 -42658 -14732 -29192 -24304 -43726 -13563 74895 76890 20986
13403B0986k5094l9265M460P281o3754k1719M9187k9482j5417M8680k4361K5997
$$ 20986 -4108 -43373 -38913 -31632 -95386 -117105 -67918 -97400 -112817 -64137 -88498 -62501
13391f2501N4423L7268O339j3405m2517n0233K3469K3152J4559N0269l1829m2838
$$ -62501 -8078 29190 35529 22124 -20393 -70626 -47157 -24005 -9446 40823 8994 -33844
13379c3844J05442K2511n2064n0425k0322m9387o5539J2063K5823M339K0415L0473
$$ -33844 71598 94109 42045 -8380 -28702 -78089 -143628 -131565 -105742 -101403 -80988 -50515
13367e0515L2425O3482k1428o072L5243P595n8467m2154L955l8846L473L3239
$$ -50515 -18090 45392 23964 17892 53135 60730 2263 -39891 -35936 -74782 -71309 -38070
13355c8070M6944o806q680J1830P684O880m1359K8935K1418j2585o9146L7098
$$ -38070 8874 2068 -6612 5218 12902 19782 -21577 7358 28776 16191 -52955 -15857
13343a5857p88o4120p685Q883L9283M0262j9253o0786O2306O1314p840m4623N703
$$ -15857 -16645 -80765 -88450 -79567 -40284 -22 -19275 -80061 -17755 43559 35719 -8904 -3201
13330c201O5038J0855J62o8075o4070J4669M6903J8702j528k0863k70Q145J3106
$$ -3201 61837 72692 72854 4779 -59291 -44622 2281 20983 19455 -1408 -1678 6467 19573
13317A9573q156L2418k4943K1638n4346k4157K3999L4523O344n20M062j6455J1344
$$ 19573 11417 43835 18892 40530 -13816 -37973 -13974 20549 26893 26373 30435 13980 25324
13304B5324N1059J1037j0771J84k5634l8984m124k7571J6166J5812K0174o846
$$ 25324 76383 87420 76649 76833 51199 12215 8091 -19480 -3314 12498 32672 25826
13292B5826l8889J2009o241J3602q122p3714k0603M3785J3718l5782J7333K858
$$ 25826 -13063 -1054 -7295 6307 -1815 -75529 -96132 -52347 -38629 -74411 -57078 -54220
13280e4220K4967N0580N1720J0588m2134j7224L1135K3928K4098j2341j06026
$$ -54220 -29253 21327 73047 83635 41501 24277 55412 79340 103438 91097 -14929
13269a4929j6862J6013M3861J1386l7294r4281k343Q8612L446q326o3474o2184
$$ -14929 -31791 -15778 28083 39469 2175 -92106 -94449 -5837 -2391 -10717 -74191 -136375
13257a36375L1543N4558M4014J7859p335m033j9797j1079l3540K7113M5689K5508
$$ -136375 -104832 -50274 -6260 11599 4264 231 -19566 -30645 -64185 -37072 8617 34125
13245C4125k4772n959j6732K7797k5411l5374n283L3578J7397j3757L5536L1767
$$ 34125 9353 3394 -13338 14459 -10952 -46326 -51609 -18031 -634 -14391 21145 52912
13233E2912L4046Q309k1651K8619R848j3375k1805K624q071l1683n493K1495p6828
$$ 52912 86958 95267 73616 102235 112083 98708 76903 79527 71456 39773 34280 55775 -21053
13220b1053Q122K7978J4643M562j3440L7922K8281k1486p254J3534j4502n3460
$$ -21053 -12931 15047 29690 34252 20812 58734 87015 65529 58275 71809 57307 3847
13208C847K5814j0501n8848K8220j436k1728Q480q410J7897P0656r380q7545L1288
$$ 3847 29661 19160 -39688 -11468 -12904 -34632 -26152 -34562 -16665 53991 44611 -42934 -11646
13195a1646J447L6941J0941K3905l1729l0664O0078k7798Q36L8235R881L3258
$$ -11646 -10199 26742 37683 61588 29859 -805 59273 31475 32311 70546 80427 113685
13183A13685J9578p238k5012o1906K0948j3497l1963R067J4619n9691j7467Q0303
$$ 113685 133263 126025 101013 39107 60055 46558 14595 23662 38281 -21410 -38877 41426
13171D1426P372m0770K5091M97j0692n573j7573N056L0927m2193J3354K1999l664
$$ 41426 48798 8028 33119 33616 22924 17351 -222 4834 35761 -6432 6922 28921 25257
13158B5257m5822M72j8655k0681K1014J9993L628k0218j3236N7884O7811K999
$$ 25257 -20565 -20093 -38748 -59429 -38415 -18422 -14794 -35012 -48248 9636 77447 80446
13146H0446n6226q8442p4828O711P0053L6684L3902P2691Q9870J09571L3240l9714
$$ 80446 24220 -64222 -139050 -132339 -62286 -25602 8300 80991 170861 280432 313672 273958
13134B73958l6149k9961k5057n0357l8644n3117l1141k7711l145k1792K5939L8386
$$ 273958 237809 207848 182791 132434 93790 40673 9532 -18179 -21324 -43116 -17177 21209
13122B1209j1939m2376J5029J9467L4106m933j1819J0717L9826O1249q4940j20398
$$ 21209 9270 -33106 -18077 1390 35496 30563 18744 29461 69287 130536 45596 -74802
13110g4802k178R173J1886J1713K1455n8920N5691M9921K1984R54J5195J3052
$$ -74802 -76980 -67807 -55921 -44208 -22753 -81673 -25982 23939 45923 46877 62072 75124
13098G5124p046L992J0002K1667K6429R4140J51133L7078P091j12236p8518m2511
$$ 75124 68078 72070 82072 103739 130168 224308 375441 412519 419610 307374 228856 186345
13086A86345j10400m9705o965K0688J3956Q10m8081j3230J8089p947o217J4527
$$ 186345 75945 26240 19275 39963 53919 54729 6648 -6582 11507 3560 -2657 11870
13074A1870O2372K5225k0598l7602k5017q584P057m7279n2689l7091L3368O3107
$$ 11870 74242 99467 78869 41267 16250 7666 14723 -32556 -85245 -122336 -88968 -25861
13062b5861K4884L6746K9556j9817k8219n5410q092L911j3996l2139M7812K0489
$$ -25861 -977 35769 65325 45508 17289 -38121 -46213 -42302 -56298 -88437 -40625 -20136
13050b0136P5526L4826L7070L2943j3310m9163o9216j2879K1980k3941o0388j5666
$$ -20136 55390 90216 127286 160229 146919 97756 28540 15661 37641 13700 -46688 -62354
13038f2354P5282L6923j1302j82J489k1473l7717l6165m2765K0615O3270J6385
$$ -62354 12928 49851 38549 38367 39856 18383 -19334 -55499 -98264 -77649 -14379 2006
13026B006l9280p919M2835o2193M4855K8321K2521K5167M2777k3751m9212K4177
$$ 2006 -37274 -45193 -2358 -64551 -19696 8625 31146 56313 99090 75339 26127 50304
13014E0304k0586j1400q705r37l1524j2629j0403k8381Q583K4972Q842N5930k4328
$$ 50304 29718 18318 9613 8676 -22848 -35477 -45880 -74261 -65678 -40706 -31864 24066 -262
13001b62j5282R001j9868l3813p50r109J4127J0519J8219n133O0875N6323n8107
$$ -262 -15544 -6543 -26411 -60224 -60974 -70083 -55956 -45437 -27218 -32351 28524 84847 26740
12988B6740n9639l3670j8028L2573K7492M9799J1800K9670n3066l9768K4501j2998
$$ 26740 -32899 -66569 -84597 -52024 -24532 25267 37067 66737 13671 -26097 -1596 -14594
12976a4594n1386M5642K5633l2209K0611J4568M1225N931K0659r41l0136j8865
$$ -14594 -65980 -20338 5295 -26914 -6303 8265 49490 55421 76080 75139 45003 26138
12964B6138j15030j4854J9104K0933L7903O69j0453l4415n989o250J05166J54584
$$ 26138 -88892 -103746 -84642 -63709 -25806 -25137 -35590 -70005 -75994 -82244 22922 177506
12952A77506n2516j03832n5109k2473j0006J1180j8449k6116K3269N684K9610
$$ 177506 124990 21158 -33951 -56424 -66430 -55250 -73699 -99815 -76546 -70862 -41252
12941d1252J4186l669J3006M9564m8320m0143O449l6193Q1453J4550j1515j9715
$$ -41252 -27066 -30735 -17729 31835 -16485 -56628 -50179 -86372 -4919 9631 -1884 -21599
12929b1599n478k543Q8100L0986l9145j4697J5174j1445L230Q132J5077l9569
$$ -21599 -27077 -29620 58480 89466 50321 35624 50798 39353 42583 50715 65792 26223
12917B6223m2202j4118K72J633l1214n021O9015J4427m544N0594l298R143k4834
$$ 26223 -15979 -30097 -29825 -28192 -59406 -64427 4588 19015 14471 65065 61767 70910 46076
12904D6076p2849k4279M8339l0074m1083J0335O8612J17939K3417k4446j4837
$$ 46076 -26773 -51052 -2713 -32787 -73870 -63535 5077 123016 146433 121987 107150
12893A07150j6392l4424j8773l1540K4348k3785m7829L7360m0438o470p391M21
$$ 107150 90758 56334 37561 6021 30369 6584 -41245 -3885 -44323 -50793 -58184 -57763
12881e7763q747q082L9902R199P3371J2460m5R941J998K000o6788m6896K0939
$$ -57763 -66510 -74592 -34690 -25491 47880 60340 60295 70236 72234 74234 7446 -39450 -18511
12868a8511Q0775L6738M8975m6871p0569K0976K2585n7181l9567j3710m3609l2119
$$ -18511 62264 99002 147977 101106 30537 51513 74098 16917 -22650 -36360 -79969 -112088
12856a12088R041N3669L344k054p322O983Q7961J2659k9668j5933l9324j1700
$$ -112088 -103047 -49378 -46034 -48088 -55410 -48427 39534 52193 22525 6592 -32732 -44432
12844d4432L1758R588K9237P773l9343m0584l905m4534l24K6000L1699k7311K8509
$$ -44432 -12674 -3086 26151 33924 -5419 -46003 -49908 -94442 -94766 -68766 -37067 -64378 -35869
12831c5869J7995K6460K6006j6536k9585J8115j7644K9773L233K9527K776o2755
$$ -35869 -17874 8586 34592 18056 -11529 6586 -11058 18715 21948 51475 54251 -8504
12819h504R226k2204L2447N2725k3097q124M2121M855j7416l1859o7571k7468
$$ -8504 722 -21482 10965 63690 40593 32469 74590 79445 62029 30170 -37401 -64869
12807f4869J7847Q7899L1184j5752p6799n009n239M9228m8189r71M1086r87n818
$$ -64869 -47022 40877 72061 56309 -20490 -25499 -30738 18490 -29699 -30670 10416 9429 3611
12794C611L9912l587R668J6953m9919n9205k4449J0323m275m021p239j4955M27
$$ 3611 43523 39936 49604 66557 16638 -42567 -67016 -56693 -60968 -64989 -72228 -87183 -86756
12781h6756J8894m271L1790L0989j9615j0569K9382N4248J9630J6098o2034m4422
$$ -86756 -67862 -72133 -40343 -9354 -28969 -39538 -10156 44092 63722 79820 17786 -26636
12769b6636M0718O8588j4309n8097M191O272k7793o5950M980R184K8128M2099
$$ -26636 14082 82670 68361 10264 14455 20727 -7066 -73016 -68036 -58852 -30724 11375
12757A1375N3047L6431L9605j6788p7117n2992L1936l1320Q970M7297k0637p8114
$$ 11375 64422 100853 140458 123670 46553 -6439 25497 -5823 3147 50444 29807 -48307
12745d8307K0899J5301l9524j2840J4196L173J7096Q003O286j8762M4554M2682
$$ -48307 -27408 -12107 -51631 -64471 -50275 -47102 -30006 -22003 -15717 -34479 10075 52757
12733E2757l347p0608n3456K7924P5901m6015m6750J7280J3928K5544J4396j4558
$$ 52757 49410 -21198 -74654 -46730 29171 -16844 -63594 -46314 -32386 -6842 7554 -7004
12721g004l9635K4987J0217L5633o5375n1654j0413J807K3190Q0112M9496j8959
$$ -7004 -46639 -21652 -11435 24198 -41177 -92831 -103244 -101437 -78247 1865 51361 32402
12709C2402k6914j165L3604J2988l2305J4969N5518R963r5624m1844L685L5990
$$ 32402 5488 4323 37927 50915 18610 33579 89097 99060 3436 -38408 -34723 1267
12697A267O9613j1746j2574j2662l785k9598k2825l5451J3556K517j4697k6683
$$ 1267 70880 59134 46560 33898 30113 515 -22310 -57761 -44205 -41688 -56385 -83068
12685h3068J6417K5440J067J00531J1450o0425o1112m1837q8005o601P5496P915
$$ -83068 -66651 -41211 -40144 60387 71837 11412 -49700 -91537 -179542 -186143 -110647 -102732
12673a02732Q766N4238N2174k7104m0601l7161n8873M9080J1183K7704M0580L876
$$ -102732 -93966 -39728 12446 -14658 -55259 -92420 -151293 -102213 -91030 -63326 -22746 -18870
12661a8870l2834K7633N8843n476m3972j9269K3874O485L2621N244R292j8722
$$ -18870 -51704 -24071 34772 29296 -14676 -33945 -10071 -3586 29035 34279 43571 24849
12649B4849J2147J360M357j2001j0853l976o668M062Q100j5406J6547J6494p7057
$$ 24849 36996 38356 42713 30712 19859 15883 9215 13277 21377 5971 22518 39012 -38045
12636c8045o4171J6724N9651Q3182P1300o2071r5728K7131K044k188P298L952
$$ -38045 -102216 -85492 -25841 57341 128641 66570 -29158 -2027 17 -2171 5127 9079
12624I079j2733j4092j3984M7211M3922j7363M4048K430m5292o3559j213k2157
$$ 9079 -3654 -17746 -31730 15481 59403 42040 86088 88518 43226 -20333 -21546 -43703
12612d3703j4453l2781K0134L1140M1849L5755n838n462N3499r02n9170N547n004
$$ -43703 -58156 -90937 -70803 -39663 2186 37941 32103 26641 80140 79238 20068 25615 20611
12599B0611n5600k9734P0009M4321J5730m1666J27K7294L4989K4769J0425m3033
$$ 20611 -34989 -64723 5286 49607 65337 23671 23798 51092 86081 110850 121275 78242
12587G8242J146k3129N195J0013J9496J416k1810o2493L0590K9601j0230l8614
$$ 78242 79388 56259 61454 71467 90963 92379 70569 8076 38666 68267 58037 19423
12575A9423m6330k1245k8709M7334j478K1002L1623o3381j1024M9907K3948o9153
$$ 19423 -26907 -48152 -76861 -29527 -31005 -10003 21620 -41761 -52785 -2878 21070 -48083
12563d8083k6158N118K0730J1383J9523k2624J3181k0569M1771O9512r036L450
$$ -48083 -74241 -69123 -48393 -37010 -17487 -40111 -26930 -47499 -5728 63784 54748 58198
12551E8198n9510k7086J5794R684l243l6546k6984L6525M0765l601m5452q943
$$ 58198 -1312 -28398 -12604 -2920 -6163 -42709 -69693 -33168 7597 3996 -41456 -50399
12539e0399J328o45M0299K6348L8474P330k4857o5081o9668o5087Q6270P4051
$$ -50399 -49071 -49716 -9417 16931 55405 62735 37878 -27203 -96871 -161958 -75688 -1637
12527a637j5017n591k940M3400L619j347J6782l4538n2514L9509k8550l0742M7361
$$ -1637 -16654 -22245 -25185 18215 21834 20487 37269 2731 -49783 -10274 -38824 -69566 -22205
12514b2205M3510O0035J0954j6401l8290l882n2020o4276l1933J9458J788Q338
$$ -22205 21305 81340 92294 75893 37603 33721 -18299 -82575 -114508 -95050 -93262 -84924
12502h4924L6712Q235M2372j2905j2142R739M773K6343l5515o2572n8724l0442
$$ -84924 -48212 -39977 2395 -10510 -22652 -12913 -8140 18203 -17312 -79884 -138608 -169050
12490a69050O6357K7121L8310n781O596J7543K5227m6975l1187k035J1893K1042
$$ -169050 -102693 -75572 -37262 -43043 -36447 -18904 6323 -40652 -71839 -73874 -61981 -40939
12478d0939j4217q534O51l9310L1333K4285Q167N8480N6551J3701k1595k9074
$$ -40939 -55156 -63690 -63039 -102349 -71016 -46731 -38564 19916 76467 90168 68573 39499
12466C9499K0329k0753l4689j8191m7449o016m3628M2021O8581j2495L4433o345
$$ 39499 59828 39075 4386 -13805 -61254 -67270 -110898 -68877 -296 -12791 21642 15297
12454A5297l4658J8703m8292j3956M0129L8494L7086m6864l394N4143j1510J6729
$$ 15297 -19361 -658 -48950 -62906 -22777 15717 52803 5939 2545 56688 45178 61907
12442F1907N2561L8092J6659l2001o6633m024j423n2656l2404J5401J6778P210
$$ 61907 114468 152560 169219 137218 70585 66561 65138 12482 -19922 -4521 12257 19467
12430A9467O761J3981k7969k0279P4696K2002k4105K528j8877o080j2180k6534
$$ 19467 26228 40209 12240 -8039 66657 88659 64554 67082 48205 42125 29945 3411
12418C411J917j1113J4646j1820p0026k1121J6374M9738o495Q938m8360m2994
$$ 3411 5328 -5785 8861 -2959 -72985 -94106 -77732 -27994 -34489 -25551 -73911 -116905
12406a16905j4732K8852N2097M012J3132J05578K7916j01204k6648N0289j952
$$ -116905 -131637 -102785 -50688 -46676 -33544 72034 99950 -1254 -27902 22387 20435
12395B0435n1121M315k0047j8451j4359K2331M5431L7852j2612J7377k9652n6947
$$ 20435 -30686 -26371 -46418 -64869 -79228 -56897 -11466 26386 13774 31151 1499 -55448
12383e5448K5843N4856J49k5269p1723j0205J590L113k5834M938O5099Q1437n050
$$ -55448 -29605 25251 25400 131 -71592 -81797 -80207 -77094 -102928 -97990 -32891 48546 43496
12370D3496P21k3097J4560l752k4080n4508l589r080L5346p826J1986M0190L2399
$$ 43496 44217 21120 35680 31928 7848 -46660 -50249 -59329 -23983 -31809 -19823 20367 52766
12357E2766n2474J5347L2270J9456J9758l3263J7961r814p9142R750m3992K8024
$$ 52766 292 15639 47909 67365 87123 53860 71821 62007 -17135 -7385 -51377 -23353
12345b3353M687M234O1680N421m4204n271L2716R068J4984l433n3474m0468k1365
$$ -23353 -18666 -14432 47248 52669 8465 3194 35910 44978 59962 56529 3055 -37413 -58778
12332e8778p929P029M1534p4256m5117K4084J2349N4391L3019l3009M3583L0729
$$ -58778 -66707 -59678 -18144 -92400 -137517 -113433 -101084 -46693 -13674 -46683 -3100 27629
12320B7629J7701J1119k4171j0094m1898k4874M699K0353L5659k2811l539j9049
$$ 27629 45330 56449 32278 22184 -19714 -44588 -39889 -19536 16123 -6688 -10227 -29276
12308b9276J0768J4571J9613K7844J0610J122q956r092r882L8155K6996q769k1849
$$ -29276 -18508 -3937 15676 43520 54130 55252 46296 37204 27322 65477 92473 83704 61855
12295F1855l1992K2424K8189L4163l067l4420m0489J1380j304l4375o1970j4615
$$ 61855 29863 52287 80476 114639 111572 77152 36663 48043 46739 12364 -49606 -64221
12283f4221M5337N0430O738J5979O3485O0910J9187n238o0200o3119j1519n222
$$ -64221 -18884 31546 38284 54263 117748 178658 197845 192607 132407 69288 57769 52547
12271E2547k3933p7955M989Q3436K6357l3223m5123k0405M60l6251N285N3716
$$ 52547 28614 -49341 -44352 39084 65441 32218 -12905 -33310 -32850 -69101 -63816 -10100
12259a0100j0715k4800J5369n254j6157J835j8999J9807L7229L6725j0366O542
$$ -10100 -20815 -45615 -30246 -35500 -51657 -49822 -68821 -49014 -11785 24940 14574 21116
12247B1116o119l8513L6711p2395n5736M3064R1503k3265j7020L5411j5620L7888
$$ 21116 14997 -23516 13195 -59200 -114936 -71872 19631 -3634 -20654 14757 -863 37025
12235C7025k8513k5036k782n022K8430j935q0130j8232j2048M6798J5348O9395
$$ 37025 8512 -16524 -19306 -24328 4102 2167 -77963 -96195 -108243 -61445 -46097 23298
12223B3298L3162k5526j4173l6555r573N3768j8045o1089Q573K2106N974r482
$$ 23298 56460 30934 16761 -19794 -29367 24401 6356 -54733 -46160 -24054 -18080 -27562
12211b7562J8387j226M0811J625K7709m9619o3275K9808N1065p4089l8073J9666
$$ -27562 -9175 -10401 30410 32035 59744 10125 -53150 -23342 27723 -46366 -84439 -64773
12199f4773P007K1370N8733m979m2413J5204J1132o7908O4429O1690J1382J0499
$$ -64773 -57766 -36396 22337 17358 -25055 -9851 1281 -66627 -2198 59492 70874 81373
12187H1373j052k7166j7942k7255n5639N1045J9880J4913n5919k8286K1483L2555
$$ 81373 80321 53155 35213 7958 -47681 3364 23244 38157 -17762 -46048 -24565 7990
12175G990J38l4505j5245K0537j2952K2780N4735J0524l9473k6648O967K6593
$$ 7990 8128 -26377 -41622 -21085 -34037 -11257 43478 54002 14529 -12119 -5152 21441
12163B1441O3951l0739J5583L969N5236l3661n8247K4189J7624l3969l5102j8665
$$ 21441 85392 54653 70236 74205 129441 95780 37533 61722 79346 45377 10275 -8390
12151h390m0749o968M1869K9681k3372m405k9611p481K740L2641j6798p741L9307
$$ -8390 -49139 -56107 -14238 15443 -7929 -12334 -41945 -49426 -46686 -14045 -30843 -38584 723
12138G23K9545q575k530K2925k5874R985L0181r766n7138K5760p0898M521N5026
$$ 723 30268 21693 19163 42088 16214 26199 56380 46614 -10524 15236 -55662 -51141 3885
12125C885K3638p5239r5725L2980O0617K4787K133k1605r567J5393Q4445n965
$$ 3885 27523 -47716 -143441 -110461 -49844 -25057 -22924 -44529 -54096 -38703 45742 39777
12113C9777n8075O835K4357L0588L3702o985q800L6581J0197m1853q944n6001
$$ 39777 -18298 -11463 12894 43482 77184 70199 61399 97980 108177 66324 57380 1379
12101A379k2072K740k0567L0028M7629J8862o618j0048l9663j221k957R57p039
$$ 1379 -20693 -17953 -38520 -8492 39137 57999 51381 41333 1670 449 -2508 -1551 -8590
12088h590K140L977l120l7866J6464M0711J5864l2102k0317L7495R0156R718o8754
$$ -8590 -6450 -2473 -5593 -43459 -26995 13716 29580 -2522 -22839 14656 104812 114530 45776
12075D5776k0267K1561k9252m3375J0742K8009j2250L641K2120n0493l4048L0167
$$ 45776 25509 47070 17818 -25557 -14815 13194 944 4585 26705 -23788 -57836 -27669
12063b7669M4602N7353m5820p6163K9101M8723o251n6040n5807m457M9077P9697
$$ -27669 16933 74286 28466 -47697 -18596 30127 23876 -32164 -87971 -92428 -43351 36346
12051C6346k5404j3121L8601j8295l2706k1261M5781Q3602K9317J9342k9212m2255
$$ 36346 10942 -2179 36422 18127 -14579 -35840 9941 93543 122860 142202 112990 70735
12039G0735j1987n0376L1387n3022m0655K2702P1162m7125j8224l5368q0987K6764
$$ 70735 58748 8372 39759 -13263 -53918 -31216 39946 -7179 -25403 -60771 -141758 -114994
12027a14994O6042K5598J5782m0837l7245o927m0172L8111N1988j0734m0496o798
$$ -114994 -48952 -23354 -7572 -48409 -85654 -92581 -132753 -94642 -42654 -53388 -93884 -100682
12015a00682L7124R9074j3301K1077O433M3109p3338n1763k5329J6653P3124M7737
$$ -100682 -63558 35516 22215 43292 49725 92834 19496 -32267 -57596 -40943 32181 79918
12003G9918q4949k7692p1828N894M6110j470Q939j7216l1653j2520L0457M6304
$$ 79918 -5031 -32723 -104551 -98657 -52547 -54017 -45078 -62294 -93947 -106467 -76010 -29706
11991b9706M0483o0128l7800J1088K6308k0219L7262J6645j62Q0682l779p1530
$$ -29706 10777 -49351 -87151 -76063 -49755 -69974 -32712 -16067 -16229 64453 60674 -10856
11979a0856m3136J9398N6927m1370l5381J4777j334K9687L8261l5790j1068k3411
$$ -10856 -53992 -34594 22333 -19037 -54418 -39641 -40975 -11288 26973 -8817 -19885 -43296
11967d3296q396L6717J2653J9743Q021M1575j4175l3028p008L4899k1820j6247
$$ -43296 -51692 -14975 -2322 17421 25442 67017 52842 19814 12806 47705 25885 9638
11955I638n6851o0320J2436l6958N4165M9124N074M3855K4915n1325J6053P0805
$$ 9638 -47213 -107533 -95097 -132055 -77890 -28766 -23692 20163 45078 -6247 9806 80611
11943H0611J8016J2866k553K5573m7752k0490q3130q203m2537r45K8386J0148
$$ 80611 98627 111493 108940 134513 86761 66271 -16859 -25062 -67599 -68544 -40158 -30010
11931c0010l591j4875q66N3538L2961j4126m4508J5470J3307M2293j8821Q039
$$ -30010 -33601 -48476 -49342 4196 37157 23031 -21477 -6007 7300 49593 30772 38811
11919C8811k5619l5968J5061k0393j5528k6199k5786O2000O6191j5276J7175j4074
$$ 38811 13192 -22776 -7715 -28108 -43636 -69835 -95621 -33621 32570 17294 34469 20395
11907B0395l2094R751J919M7757n2939j5424l524j5870l5917L7417N6539O9700
$$ 20395 -11699 -1948 -29 47728 -5211 -20635 -24159 -40029 -75946 -38529 18010 87710
11895H7710n9304p6855k0538L0050j9798j3423K1995r172j9394J332M9642N5152
$$ 87710 28406 -48449 -68987 -38937 -58735 -72158 -50163 -59335 -78729 -77397 -27755 27397
11883B7397O4954L3550l7319k6467o3573k3235J1094M0801o133p0115l1528K8445
$$ 27397 92351 125901 88582 62115 -1458 -24693 -13599 27202 21069 -49046 -80574 -52129
11871e2129J5452j8901M1220K0527O1983R26m4645m2228M455J2865k7009K1095
$$ -52129 -36677 -55578 -14358 6169 68152 69078 24433 -17795 -13340 -475 -27484 -6389
11859f389L955j5996K8106n32l0398Q893O2283N3991n237k5968n0763m2839K1527
$$ -6389 -2434 -18430 9676 9144 -21254 -12361 49922 103913 98676 72708 21945 -20894 633
11846F33j4935M1321R153K7487K0937L235l6356K2385n831J0909J6314r849m5900
$$ 633 -14302 27019 36172 63659 84596 87831 51475 73860 68029 78938 95252 85403 39503
11833C9503J3710L2735J9087l3985o4142L6551j6090p2392j407P759J6522M3326
$$ 39503 53213 85948 105035 71050 6908 43459 27369 -45023 -46430 -38671 -22149 21177
11821B1177L2620j0060l5075j9263J8675k6353J9510L5615k4498l9780k6693Q297
$$ 21177 53797 43737 8662 -10601 8074 -18279 1231 36846 12348 -27432 -54125 -45828
11809d5828K3617J9948m3128p2221K8104K0411J5546J5286M1515J2474l9457q0805
$$ -45828 -22211 -2263 -45391 -117612 -89508 -69097 -53551 -38265 3250 15724 -23733 -104538
11797a04538k544K0769K1499R171K3465P4605q123l7902l4321J3847M0268J8585
$$ -104538 -107082 -86313 -64814 -55643 -32178 42427 34304 -3598 -37919 -24072 16196 34781
11785C4781j3689k8167P399L2283j513j1194R511m5838m8972J507K6073J1975
$$ 34781 21092 -7075 324 32607 31094 19900 29411 -16427 -65399 -63892 -37819 -25844
11773b5844j4251M866M2706J6417p8010m718K0308K1105j621j6986j4657l1721
$$ -25844 -40095 -35229 7477 23894 -54116 -58834 -38526 -17421 -19042 -36028 -50685 -82406
11761h2406J1406K1500N8517J1309J0487l383k1791N891P763j9812k563k2933
$$ -82406 -71000 -49500 9017 20326 30813 27430 5639 11530 19293 -519 -3082 -26015
11749b6015l745N4649J9816k5753M8217n542J09P284k3840Q499m7734n5826j7800
$$ -26015 -29760 24889 44705 18952 67169 61627 61736 69020 45180 53679 5945 -49881 -67681
11736f7681j3049j8360K1880N0388K0796Q865k5337n6021J4127M933m7958k8197
$$ -67681 -80730 -99090 -77210 -26822 -6026 2839 -22498 -78519 -64392 -59459 -107417 -135614
11724a35614M3448M9297Q425j6331J0815m577L1680J9731l0659J3025P9161N3755
$$ -135614 -92166 -42869 -34444 -50775 -39960 -44537 -12857 6874 -23785 -10760 68401 122156
11712A22156n315m7517k2002m2251k7796l2487J4805K54M687M2741l5655j4171
$$ 122156 116841 69324 47322 5071 -22725 -55212 -40407 -40153 -35466 7275 -28380 -42551
11700d2551r252j493l513K313R2682M4079p4637n3519K2697N9221O7544J7521
$$ -42551 -51803 -53296 -56809 -54496 38186 82265 7628 -45891 -23194 36027 103571 121092
11688A21092k8521m6194Q68k1646p4816L5839O5526k2120k2991k1634k0993J8703
$$ 121092 92571 46377 47245 25599 -49217 -13378 52148 30028 7037 -14597 -35590 -16887
11676a6887l1461k2122l1288N1080K0870N7032o905l3190k8864m0593J7262L1994
$$ -16887 -48348 -70470 -101758 -50678 -29808 27224 20319 -12871 -41735 -82328 -65066 -33072
11664c3072M4933j797j630j8133j9479k8059k1995J9354J048j9968k8398N0617
$$ -33072 11861 10064 8434 -9699 -29178 -57237 -79232 -59878 -58830 -78798 -107196 -56579
11652e6579K4839O109P3261L407j9033k9333k7480M5876J4262K9402K1423k3103
$$ -56579 -31740 -25631 47630 51037 32004 2671 -24809 21067 35329 64731 86154 63051
11640F3051p030q833m0838q9062m2527L894j3887k0891K3407J11533O6181M206
$$ 63051 56021 47188 6350 -82712 -125239 -121345 -135232 -156123 -132716 -21183 44998 49204
11628D9204l0937p9203n544N4369m8716L535J6519q470P086r717p009k6106LK869
$$ 49204 18267 -60936 -66480 -12111 -60827 -57292 -40773 -49243 -42157 -51874 -58883 -84989 -84986 -82117
11614h2117L1791O455L1390j9829l2490k7831K3917N6529l3757J5677q365o451
$$ -82117 -50326 -43871 -12481 -32310 -64800 -92631 -68714 -12185 -45942 -30265 -38630 -45081
11602d5081K7736L4044N6648p510o988k229k6401K1015R170n531M5445q4034k4174
$$ -45081 -17345 16699 73347 65837 58849 56620 30219 51234 60404 54873 100318 16284 -7890
11589g890P2331J4813l9335l6663J0506k279m5620K6774K5686M7050l2570j605
$$ -7890 64441 79254 39919 3256 13762 11483 -34137 -7363 18323 65373 32803 31198
11577C1198l124k0516k47J1106l255M048P122j0261o7660J4489K7195j5715m1071
$$ 31198 28074 7558 7311 18417 15162 19210 26332 16071 -51589 -37100 -9905 -25620 -66691
11564f6691l0206N9008L1098L4787K7501m5284J2124K2353n8500J2032m6180P967
$$ -66691 -96897 -37889 -6791 27996 55497 10213 22337 44690 -13810 -1778 -47958 -39991
11552c9991N3070J1717K1466K9567M677m6431l2064n1657K8605L7276J2751J8168
$$ -39991 13079 24796 46262 75829 80506 34075 2011 -49646 -21041 16235 28986 47154
11540D7154n9776j6417P6232L5375j7862J6678o9119n9228m4852L6965P5330J6043
$$ 47154 -12622 -29039 47193 82568 64706 81384 12265 -46963 -91815 -54850 20480 36523
11528C6523J3595j4102l2836L9056L937l1057m6737o691J8407K8215l3563p443
$$ 36523 50118 36016 3180 42236 46173 15116 -31621 -38312 -19905 8310 -25253 -32696
11516c2696K1515k2142L705l0755n5385L9991L0733n2754K0748R641K8504K697
$$ -32696 -11181 -33323 -29618 -60373 -115758 -75767 -45034 -97788 -77040 -67399 -38895 -36198
11504c6198N5058j1578r555K5106n509m4241O9571l594j393J3035N485p78J7782
$$ -36198 18860 7282 -2273 22833 17324 -26917 42654 39060 37667 50702 56187 55409 73191
11491G3191m8983r4484K1678P573Q2865L1692j8343K1218L6171k4506K3964l5788
$$ 73191 24208 -70276 -48598 -41025 41840 73532 55189 76407 112578 88072 112036 76248
11479G6248n631l8563k4492k6493p984p2277q84P9270O569J139r799J0173N0835
$$ 76248 70617 32054 7562 -18931 -26915 -99192 -100076 -20806 -14237 -13098 -22897 -12724 38111
11466C8111k4123l9171K5611m0108n8996J8160L3575j7435M1781K3251M977m4925
$$ 38111 13988 -25183 428 -39680 -98676 -80516 -46941 -64376 -22595 656 5633 -39292
11454c9292l3230l1634K4322O5042M0422k0794j479j8793l3057L8187M749K548
$$ -39292 -72522 -104156 -79834 -14792 25630 4836 3357 -15436 -48493 -10306 -5557 -3009
11442c009K1986J994l0550K9298L1212N421j8823J6933k3568r814J2096K2542
$$ -3009 18977 20971 -9579 19719 50931 56352 37529 54462 30894 21080 33176 55718
11430E5718M2188n5722m3592j4910M316K7073m1230n8707K5244J1113L4939L2820
$$ 55718 97906 42184 -1408 -16318 -12002 15071 -26159 -84866 -59622 -48509 -13570 19250
11418A9250k2836j8578N0313J682k9934L049K0421M045j5015o291K9905j5597
$$ 19250 -3586 -22164 28149 29831 -103 2946 23367 27412 12397 6106 36011 20414
11406B0414K7724K0093l6743J254m03k9329K6351M5155j4178l4728r311O490o6877
$$ 20414 48138 68231 31488 32742 32339 3010 29361 74516 60338 25610 16299 22789 -44088
11393d4088k1597j2321j2499P392l02J5039L1281M5908q026l6534N9367L2210
$$ -44088 -65685 -78006 -90505 -83113 -83415 -68376 -37095 8813 787 -35747 23620 55830
11381E5830o220J8745R597K3752n3138n2043j4166q807K6591j8286k5929j8810
$$ 55830 49610 68355 77952 101704 48566 -3477 -17643 -26450 141 -18145 -44074 -62884
11369f2884N43o7162N6214J9684n70l780L18L7815L3353L5337m659k0984j5118
$$ -62884 -62341 -129503 -73289 -53605 -54175 -57955 -57637 -19822 13531 48868 44209 23225 8107
11356H107k3783K7611L0936J3161m0615k0927J8458M1470j5576K0473m1338l2954
$$ 8107 -15676 11935 42871 56032 15417 -5510 12948 54418 38842 59315 17977 -14977
11344a4977k9434k4993M9159L4133K4950K8221l2384o9191p8K2065M7754n39p6247
$$ -14977 -44411 -69404 -20245 13888 38838 67059 34675 -34516 -34594 -12529 35225 34686 -41561
11331d1561L1291j8180J1861N5302l176k7191l8944n2995J16j9568R145K5317
$$ -41561 -10270 -28450 -16589 38713 35537 8346 -30598 -83593 -83477 -103045 -93900 -68583
11319f8583M2694K01j3614j9021P282N6523K2129L6328M099j2355o098l4133n1124
$$ -68583 -25889 -25688 -39302 -58323 -51041 5482 27611 63939 68038 55683 49585 15452 -35672
11306c5672j7375j4397m5694k960J4918O4377L9903K5303M2157N696o0809k8685
$$ -35672 -53047 -67444 -113138 -116098 -101180 -36803 3100 28403 70560 76256 15447 -13238
11294a3238l1564l9304k8381L5356P7866n868o2361k7618K095K5734N1248K0928
$$ -13238 -44802 -84106 -112487 -77131 735 -5133 -67494 -95112 -93017 -67283 -16035 4893
11282D893K3403n760K1581K923n449M0103P02m1309l8548n6997m8988Q8945P5996
$$ 4893 28296 22536 44117 47040 41591 81694 82396 41087 2539 -54458 -103446 -14501 61495
11269F1495n714m9954p1764Q290L9992J6526p055n8498j8661k4503K3465J07370
$$ 61495 55781 5827 -65937 -57647 -17655 -1129 -8184 -66682 -85343 -109846 -86381 20989
11257B0989j4148j8393l8373J1994Q187k298n5665k0832K7597J1023n8681Q561
$$ 20989 6841 -11552 -49925 -37931 -29744 -32042 -87707 -108539 -80942 -69919 -128600 -120039
11245a20039J0886L0548L8227N0240K0114l0008m9894k6077K2363L3899J0837
$$ -120039 -109153 -78605 -40378 9862 29976 -32 -49926 -76003 -53640 -19741 -8904
11234h904J3182l7278n4931K3947M0014J7719K7937L4683M2224n3715n7781Q1720
$$ -8904 4278 -33000 -87931 -63984 -23970 -6251 21686 56369 98593 44878 -12903 68817
11222F8817Q8009k5334p999j8103k2167o633m5577o6887K668J3267j8047K1176
$$ 68817 156826 131492 123493 105390 83223 76590 31013 -35874 -33206 -19939 -37986 -16810
11210a6810M0551l5044m7223J7696Q9002J9170K2078p3572n3217K6137J2502o3444
$$ -16810 23741 -11303 -58526 -40830 48172 67342 89420 15848 -37369 -11232 1270 -62174
11198f2174l5318L9256J9525J445l93N6679N2025k261n4666m3410j9878K703M9680
$$ -62174 -97492 -58236 -38711 -37266 -37659 19020 71045 68784 14118 -29292 -49170 -46467 3213
11185C213J9269j0415Q312J7819j0229m864m9577Q8768Q5446l8671n2957p8790
$$ 3213 22482 12067 20379 38198 27969 23105 -26472 62296 147742 109071 56114 -22676
11173b2676q20L1026L3329l5368K0244Q7092k6662p1546m9501P9117j5925k7004
$$ -22676 -23496 7530 40859 5491 25735 112827 86165 14619 -34882 44235 28310 1306
11161A306J6622m2698K8630J9331k1212l3128k495o514J0197j6086k1540J324
$$ 1306 17928 -24770 3860 23191 1979 -31149 -33644 -40158 -29961 -46047 -67587 -66263
11149f6263m3277Q729P7983P7850M9247k9023M5557K3551k1708n3301l7251n9312
$$ -66263 -109540 -100811 -22828 55022 104269 75246 120803 144354 122646 69345 32094 -27218
11137b7218k8160o428p4086M2441L8097l4968n849M5475Q495j0548j1007M503
$$ -27218 -55378 -61806 -135892 -93451 -55354 -90322 -96171 -50696 -42201 -52749 -63756 -59253
11125e9253R250N5584Q413l1027n436l2755o465m250k9215N3834J1084l7262L1963
$$ -59253 -50003 5581 13994 -17033 -22469 -55224 -61689 -65939 -95154 -41320 -30236 -67498 -35535
11112c5535O4261j9768l1424J5312j819n3475r411K0081j6433j4545k1729L5934
$$ -35535 28726 8958 -22466 -7154 -8973 -62448 -71859 -51778 -68211 -82756 -104485 -68551
11100f8551K7157l5499Q668K5734P3293K6105K8907k227k3719n0114l4986o1351
$$ -68551 -41394 -76893 -68225 -42491 30802 56907 85814 83587 59868 9754 -25232 -86583
11088h6583k3319L8957R1217L2257k1394L0751M1268j9649o450j2774N6664j8786
$$ -86583 -109902 -70945 20272 52529 31135 61886 103154 83505 77055 64281 120945 102159
11076A02159n4548k6789p459L2396p7816n3711K5158N8765l8701O091N8595J3033
$$ 102159 47611 20822 13363 45759 -32057 -85768 -60610 -1845 -40546 -34455 24140 37173
11064C7173l8364k9952J0443Q328p1047k5779J2527N7823M0448J9803Q876J7569
$$ 37173 -1191 -31143 -20700 -12372 -83419 -109198 -96671 -38848 1600 21403 30279 47848
11052D7848q758m9320n9458K0204N9058M0708l1651L192K3020o268J7770k0550
$$ 47848 39090 -10230 -69688 -49484 9574 50282 18631 21823 44843 38575 56345 35795
11040C5795J2374K3981n3985j1208R128J5806p93j5385M726J2104j9872l2723
$$ 35795 48169 72150 18165 6957 16085 31891 31098 15713 20439 32543 12671 -20052
11028b0052J1460L229k9774k6014J7844J1791N5386l4705j6982K6149r281r483
$$ -20052 -8592 -5363 -35137 -61151 -43307 -31516 23870 -10835 -27817 -1668 -10949 -20432
11016b0432M3592K0576m9273k2701M3142L0449j2602l6214l4585o441j7236k9691
$$ -20432 23160 43736 -5537 -28238 14904 45353 32751 -3463 -38048 -44489 -61725 -91416
11004i1416j4953R434J6403O9799L144n209K1532K9044o2990n3479L2771Q262
$$ -91416 -106369 -96935 -80532 -10733 -7589 -12798 8734 37778 -25212 -78691 -45920 -37658
10992c7658L9935K8778j025r912j4943p1993l8993N7792O3104K5602L7513j6695
$$ -37658 2277 31055 30030 20118 5175 -66818 -105811 -48019 15085 40687 78200 61505
10980F1505k7249n1477k7529J0792N216L7601Q156o0650j9821K5059m6005l5973
$$ 61505 34256 -17221 -44750 -33958 -28742 8859 17015 -43635 -63456 -38397 -84402 -120375
10968a20375M6727K7032R508l2095k6041K4599j4767L8827K7278J726M8117J97
$$ -120375 -73648 -46616 -37108 -69203 -95244 -70645 -85412 -46585 -19307 -17581 30536 30733
10956C0733k1586r047k702k4507l3014n8366j292P1337K8108j6065K1935l0911
$$ 30733 9147 100 -2602 -27109 -60123 -118489 -119781 -48444 -20336 -36401 -14466 -45377
10944d5377J985K9873M9670M2677j6163k5210J7810j3277l3073O664p006k9730
$$ -45377 -43392 -13519 36151 78828 62665 37455 55265 41988 8915 15579 8573 -21157
10932b1157n0721M2K9837K5636j4365R46j4188J0442j0434j0757M5080K8707K5053
$$ -21157 -71878 -71836 -41999 -16363 -30728 -29782 -43970 -33528 -43962 -54719 -9639 19068 44121
10919D4121K0050m0264r842L9509j8531j6520j0121p0701n7099O67N2832L0725
$$ 44121 64171 23907 14065 53574 35043 18523 8402 -62299 -119398 -118731 -65899 -35174
10907c5174K0928o1347o5999L9641J9919K353J9661K3965N654K0188J2558K2532
$$ -35174 -14246 -75593 -141592 -101951 -82032 -79679 -60018 -36053 -30399 -10211 2347 24879
10895B4879J7447k168l9232j7398m1488k20K9090q788m4962L5734n012l9797j1467
$$ 24879 42326 40158 926 -16472 -57960 -58180 -29090 -37878 -82840 -47106 -52118 -91915 -103382
10882a03382L9371K5409K0592k8966j0248j2224J6218L9629m8895O8464P4712
$$ -103382 -64011 -38602 -18010 -46976 -57224 -69448 -53230 -13601 -62496 5968 80680
10871H0680p2755r0393j946L8752N1409m154n0490n9593L4356k0507K8602n409
$$ 80680 7925 -82468 -84414 -45662 5747 1593 -48897 -108490 -74134 -94641 -66039 -71448
10859g1448J5993N5068K2444J3402N5375k6768j6958j9025n6828k3765K2487K9939
$$ -71448 -55455 -387 22057 35459 90834 64066 47108 28083 -28745 -52510 -30023 -84
10847h4J4000p3915j6824J4916r370L5205R313K348k5577j2072N0611M0138m0100
$$ -84 13916 -59999 -76823 -61907 -71277 -36072 -26759 -24411 -49988 -62060 -11449 28689 -11411
10834a1411m8586P2812q223k002k1208J7166N8813j0068r3686j222L7793n3375
$$ -11411 -59997 12815 4592 2590 -18618 -1452 57361 47293 -46393 -47615 -9822 -63197
10822f3197L3030L0515N277K816m4001m4202M7420L5818J2739R59j7765J2277
$$ -63197 -30167 348 5625 8441 -35560 -79762 -32342 3476 16215 17174 -591 11686
10810A1686M4314K2989o264m6978j1312o2105k2323L1238L4048J4695k2343Q503
$$ 11686 56000 78989 72725 25747 14435 -47670 -69993 -38755 -4707 9988 -12355 -3852
10798c852J7550k037k7245m8612k7915L2964j9365j4202K9457p828q3020L7733
$$ -3852 13698 11661 -15584 -64196 -92111 -59147 -78512 -92714 -63257 -71085 -154105 -116372
10786a16372N5723Q411m129L8656O0941J5612j3601M3040m8834o9223j3471L9501
$$ -116372 -60649 -52238 -56367 -17711 43230 58842 45241 88281 39447 -29776 -43247 -3746
10774c746L3949Q666j6952l4858J5807J3927r294m4468l4767l241L3881k2566
$$ -3746 30203 38869 21917 -12941 2866 16793 7499 -36969 -71736 -74977 -41096 -63662
10762f3662n0559K8664N0826L7953p258o0046p3107O1741N2822j2337n9233J7237
$$ -63662 -114221 -85557 -34731 3222 -4036 -64082 -137189 -75448 -22626 -34963 -94196 -76959
10750g6959K9917M208J7887j6071k2506K4142P5399J6087N870k415m6519l8013
$$ -76959 -47042 -42834 -24947 -41018 -63524 -39382 36017 52104 57974 55559 9040 -28973
10738b8973l2822o103P586O2226j9614n8501j1137L6655k2933K5667L2369M537
$$ -28973 -61795 -67898 -60312 1914 -17700 -76201 -87338 -50683 -73616 -47949 -15580 -11043
10726a1043J5849k3525n8144P60N8355K3858P401j2777q246J9739K4462p946m6696
$$ -11043 4806 -18719 -76863 -76103 -17748 6110 13511 734 -7512 12227 36689 28743 -17953
10713a7953q905J9272p69K4935J7674j9198L188n9887j1004N3742L8043J7299
$$ -17953 -26858 -7586 -8355 16580 34254 15056 18244 -41643 -52647 1095 39138 56437
10701E6437J2257p16j1428L888L0312p9749l6858p821N5691Q10k5311n2286j2380
$$ 56437 68694 67978 56550 60438 90750 11001 -25857 -33678 22013 22823 -2488 -54774 -67154
10688f7154M1845K9369K3126j5664J5605O5034K9373p6517n1676m5256n054O0451
$$ -67154 -25309 4060 27186 11522 27127 92161 121534 45017 -6659 -51915 -56969 3482
10676C482N311j0490j8724k11J5483m9050K134L5026l3847J0310N6374N5730R61
$$ 3482 8793 -1697 -20421 -20632 -5149 -54199 -52065 -17039 -50886 -40576 15798 71528 72489
10663G2489n6057k1607m5931o5558M5543L4446N2042J4183K0876l5812q095m942
$$ 72489 16432 -5175 -51106 -116664 -71121 -36675 15367 29550 50426 14614 6519 1577
10651A577M0570J1851k9398J0103J0958l7442l9443J8034l4426J4068j3852J6921
$$ 1577 42147 53998 24600 34703 45661 8219 -31224 -13190 -47616 -33548 -47400 -30479
10639c0479L0190m5706r186r833j4801P220K6946L2145N3133L5402L2400j2159
$$ -30479 -289 -45995 -55181 -65014 -79815 -72595 -45649 -13504 39629 75031 107431 95272
10627I5272m5130k9302L38l937j5791l2899q9737q003N1682P7017N0298O5188
$$ 95272 50142 20840 21178 17241 1450 -31449 -121186 -129189 -77507 -490 49808 114996
10615A14996K7830q6322q404M691J352J7625j845l0486L28j3155j3969J1414n856
$$ 114996 142826 56504 48100 52791 54143 71768 69923 39437 39765 26610 12641 24055 18199
10602A8199l9106P266Q9230K5390k9513k4948n6889j3295j5837K4725L5337K4342
$$ 18199 -20907 -13641 75589 100979 71466 46518 -10371 -23666 -39503 -14778 20559 44901
10590D4901j1653l800m2316J873l927M1350o429l2322N3880k9253o2422j7820
$$ 44901 33248 29448 -12868 -10995 -14922 26428 19999 -12323 41557 12304 -50118 -67938
10578f7938n422m3202L557j401N3758N7210J0054k2605j3689k0567L5369K4772
$$ -67938 -73360 -116562 -113005 -114406 -60648 -3438 6616 -15989 -29678 -50245 -14876 9896
10566I896L3372p452n8009m7099o580m6029M3406O0255l877M1498L4350j0918
$$ 9896 43268 35816 -22193 -69292 -75872 -121901 -78495 -18240 -22117 19381 53731 42813
10554D2813p1652m6514k1178J0121k1507J4605L9884o292K7305P2010J2194j7253
$$ 42813 -28839 -75353 -96531 -86410 -107917 -93312 -53428 -59720 -32415 39595 51789 34536
10542C4536l2341k8982J3421J9763J190m2160j02M2395M5090P832m6351O4483
$$ 34536 2195 -26787 -13366 6397 7587 -34573 -34675 7720 52810 60642 14291 78774
10530G8774J053o1043N3341K7721k6046m9498l1781j8976L1687l0817l368L3155
$$ 78774 79827 18784 72125 99846 73800 24302 -7479 -26455 5232 -25585 -28953 4202
10518D202J3058j2215j3404j3770R061L4611m1169O539Q2580M8679k4351m7405
$$ 4202 17260 5045 -8359 -22129 -13068 21543 -19626 -13087 69493 118172 93821 46416
10506D6416l0471Q067J3968j9284l3921q314o03j548J3687o4029o3965M2067O9788
$$ 46416 15945 24012 37980 18696 -15225 -23539 -24142 -25690 -12003 -76032 -139997 -97930 -28142
10493b8142J2477J743L121Q513m608j2229M9639M8900m5894p3108k3199N2440
$$ -28142 -15665 -13922 -10801 -2288 -6896 -19125 30514 79414 33520 -39588 -62787 -10347
10481a0347P0813J3813j4944p647P260N1107j7201m3451O546k4885k7844k8213
$$ -10347 60466 74279 59335 51688 58948 110055 92854 49403 55949 31064 3220 -24993
10469b4993K3994M6270n2982o0534k8753O2623k1l8633J6136m5823l7642n1692
$$ -24993 -999 45271 -7711 -68245 -96998 -34375 -34396 -73029 -56893 -102716 -140358 -192050
10457a92050O9223J02242j9065j7425L2751l3154n073Q8920J6416j7834j8558
$$ -192050 -122827 -20585 -39650 -57075 -24324 -57478 -62551 26369 42785 24951 6393
10446F393O256M238m7072K0755o184M04K6077L7663L9615o2365j7508m0619k7614
$$ 6393 12649 16887 -30185 -9430 -15614 -15210 10867 48530 88145 25780 8272 -32347 -59961
10433e9961k396j8417k2406n75K9889L627O2073P1495L1379j0301L65q074K864
$$ -59961 -62357 -80774 -103180 -103755 -73866 -70239 -8166 63329 94708 84407 84772 76698 79562
10420G9562O857m0823o9994k8741J2120K4762j3660K6887K0180l7388j3999O8470
$$ 79562 86419 45596 -24398 -53139 -41019 -16257 -29917 -3030 17150 -20238 -34237 34233
10408C4233j5782j6047P284l0530j8228L6568P7439K0641m8272l3948l7620n9909
$$ 34233 18451 2404 9688 -20842 -39070 -2502 74937 95578 47306 13358 -24262 -84171
10396h4171k8114P9891R4685J3189m8672j8244j1391k9893m0882l4760M311P2993
$$ -84171 -112285 -32394 62291 75480 26808 8564 -2827 -32720 -73602 -108362 -104051 -31058
10384c1058K5673M5150k7965m7871k3903L5374l5825L2516J6278k6780l3200m7965
$$ -31058 -5385 39765 11800 -36071 -59974 -24600 -60425 -27909 -11631 -38411 -71611 -119576
10372a19576K4338Q8946K5985J0230n7079k0864J6937l306n0153j568K0200O3652
$$ -119576 -95238 -6292 19693 29923 -27156 -48020 -31083 -34389 -84542 -86110 -65910 -2258
10360b258N5067j384m0502n6385n4047L2009N5463J6409j2151l9155j2574M1391
$$ -2258 52809 51425 10923 -45462 -99509 -67500 -12037 4372 -7779 -46934 -59508 -18117
10348a8117K2759L6363l0225K7353p442n6513k5451K455r611J8828J058M5769
$$ -18117 4642 41005 10780 38133 30691 -25822 -51273 -48818 -58429 -39601 -38543 7226
10336G226o980l4041M1117P7078j3065n3813l5837k083l7990L8255n7053J0994
$$ 7226 246 -33795 7322 84400 71335 17522 -18315 -20398 -58388 -20133 -77186 -66192
10324f6192L3613Q985n6508l7012Q9920N6628M692O8648O2234J162l5904n7433
$$ -66192 -32579 -23594 -80102 -117114 -27194 29434 34126 102774 165008 166170 130266 72833
10312G2833J9313j78K6500k3704J1403P148l8473n0492n5075L4773K9656L1304
$$ 72833 92146 91968 118468 94764 106167 113315 74842 24350 -30725 4048 33704 65008
10300F5008j8934p5727m7013o94L8614J0992k0332K1866q085L1343O7696k0075
$$ 65008 46074 -29653 -76666 -77360 -38746 -27754 -48086 -26220 -34305 -2962 64734 44659
10288D4659k8840m2541J1059J9808L4726O3784j9696l3928J32M751k424M7073
$$ 44659 15819 -26722 -15663 4145 38871 102655 82959 49031 49163 53914 51490 98563
10276I8563q217m739q451K2151J1712K7827p7618o8497k0003K3702j5450J467
$$ 98563 90346 85607 77156 99307 111019 138846 61228 -7269 -27272 -3570 -19020 -17553
10264a7553L3950M4582J5309m1264R317j7087q3514j3195L1316K7719j6736k5887
$$ -17553 16397 60979 76288 35024 44341 27254 -56260 -69455 -38139 -10420 -27156 -53043
10252e3043L7344P4679k8544m8367j9497j6132k632K9528L6705M6687j2734n7713
$$ -53043 -15699 58980 30436 -17931 -37428 -53560 -56192 -26664 10041 56728 43994 -13719
10240a3719j3339J3159L876L3654k0132J9855K6240m0858o9594m2194k076J5324
$$ -13719 -27058 -13899 -10023 23631 3499 23354 49594 8736 -60858 -103052 -105128 -89804
10228h9804Q5117K7388R32k7744q897K8537P4123L678o785m1945o1043j861L0700
$$ -89804 -4687 22701 23633 -4111 -13008 15529 89652 93330 86545 44600 -16443 -18304 12396
10215A2396J7461l8731M0800J0628J0718O802k8200o2478l5173m5481n371O0586
$$ 12396 29857 -8874 31926 42554 53272 60074 31874 -30604 -65777 -111258 -116629 -56043
10203e6043J8815m3568M4392J07548P9846k9186n1189n2052k8368k1213K5588
$$ -56043 -37228 -80796 -36404 71144 150990 121804 70615 18563 -9805 -31018 -5430
10192e430q633J914L1996J6977m817j493n261J6714q264j5973q411k5301l4242
$$ -5430 -14063 -12149 19847 36824 32007 30514 25253 41967 33703 17730 9319 -15982 -50224
10179e0224K9958M8333j7432j4039o5802l9676P861M0046Q5590N3042l6900l3958
$$ -50224 -20266 28067 10635 -3404 -69206 -108882 -101021 -60975 24615 77657 40757 6799
10167F799N2701L0458n4633l2385k4426N6732L1579j4777n3733l5828K1078m9080
$$ 6799 59500 89958 35325 2940 -21486 35246 66825 52048 -1685 -37513 -16435 -65515
10155f5515M9715Q4652r788p5490k7972J3092L3221L4423l6969J7976k366j6580
$$ -65515 -15800 68852 59064 -16426 -44398 -31306 1915 36338 -631 17345 14979 -1601
10143a601l5648j7649M695m0407K3132N5268O9971P509J4395q153J2028J1214
$$ -1601 -37249 -54898 -50203 -90610 -67478 -12210 57761 65270 79665 71512 83540 94754
10131I4754j2397n2772o2923k4065N035j1981M5874N4633r204Q263O2452K863
$$ 94754 82357 29585 -33338 -57403 -52368 -64349 -18475 36158 26954 35217 97669 100532
10119A00532k9285p2099j4928l660O3329J1181q9846n028M9568k8254m3026m5947
$$ 100532 71247 -852 -15780 -19440 43889 55070 -34776 -39804 9764 -18490 -61516 -107463
10107a07463k2075l3585K0861M9470N1583L3764L7848j3164L4511o936k2681M1499
$$ -107463 -129538 -163123 -142262 -92792 -41209 -7445 30403 17239 51750 44814 22133 63632
10095F3632q859j6625k215L681k5566j1732j3602n1567l491K4147R655K891o2872
$$ 63632 54773 38148 35933 39614 14048 2316 -11286 -62853 -66344 -42197 -32542 -29651 -92523
10082i2523k9903J8717O1126L0552j6450M531M5057L477j8136K1640J8094J6897
$$ -92523 -122426 -103709 -42583 -12031 -28481 -23950 21107 24584 6448 28088 46182 63079
10070F3079k0775l2384l6026M0862M1096p183l5096M1560L5726l8362l1975J6678
$$ 63079 42304 9920 -26106 14756 55852 48669 13573 55133 90859 52497 20522 37200
10058C7200j4981L0872r346J7460O174L338q845l8002n1679K921N1241j6977J5109
$$ 37200 22219 53091 43745 61205 67379 70717 61872 23870 -27809 -24888 26353 9376 24485
10045B4485L836j8736l6177K4242Q4990M9072j1643j1181m2077j9096N252J4581
$$ 24485 28321 9585 -26592 -2350 82640 131712 120069 108888 66811 47715 52967 67548
10033F7548k2724q048M8823M0389l4627J1405m2220o2468N3188N833k0068j1809
$$ 67548 44824 36776 85599 125988 91361 102766 60546 -1922 51266 57099 37031 25222
10021B5222K0924j723n716r2763j6247K3647L5292L1390J2573m1970L9155m1618
$$ 25222 46146 44423 38707 -54056 -70303 -46656 -11364 20026 32599 -9371 29784 -11834
10009a1834N4644N0914q8073o3694L8276K9785N0923J0682l3j4552l2773k7557
$$ -11834 42810 93724 5651 -58043 -19767 10018 60941 71623 71590 57038 24265 -3292
9997c292l5030k955Q9530P388p0665o107N1979q418j0346m3521r659M4494K4722
$$ -3292 -38322 -41277 48253 55641 -15024 -21131 30848 22430 12084 -31437 -41096 3398 28120
9984B8120J6676K5153k8604n9940j8526j1244j3453k1303k3321J6459J31M9476
$$ 28120 44796 69949 41345 -18595 -37121 -48365 -61818 -83121 -106442 -89983 -89852 -40376
9972d0376P7992M979k4003M652J059k8707M4868k4249m0677k2633N6854O0037
$$ -40376 37616 42595 18592 23244 24303 -4404 40464 16215 -24462 -47095 9759 69796
9960F9796J8646l1514J6261l0547k1710K3726j6538j4006K4651j7410r537j0229
$$ 69796 88442 56928 73189 42642 20932 44658 28120 14114 38765 21355 11818 1589
9948A589K399k1913k4114J455r647j6504k6207Q633N3209J5916m5392l7381P4806
$$ 1589 3988 -17925 -42039 -40584 -50231 -66735 -92942 -84309 -31100 -15184 -60576 -97957 -23151
9935b3151O150k633j2896K1692m9688j6931J02475O3133N1310Q650q4438m8234
$$ -23151 -17001 -19634 -32530 -10838 -60526 -77457 25018 88151 139461 148111 63673 15439
9923A5439M2272L780K2633r325K0403P8625j7643n3644Q709J7753l8432l2965
$$ 15439 57711 61491 84124 74799 95202 173827 156184 102540 111249 129002 90570 57605
9911E7605n360M4727m2371J0578Q920n0127k4871O00P5280O972K5096J9962j5665
$$ 57605 52245 96972 54601 65179 74099 23972 -899 -299 74981 81953 107049 127011 111346
9898A11346n5940k7063N3015L8450p570n0907l6189n333K8068K7530m0568m2718
$$ 111346 55406 28343 81358 119808 112238 61331 25142 19809 47877 75407 34839 -7879
9886g879m3510K6067K4467Q242k3436L5137R7593M232L2001L8785m764M34K8807
$$ -7879 -51389 -25322 -855 7387 -16049 19088 116681 120913 152914 191699 186935 187369 216176
9873B16176m8097n9670l6491n4365p603j3144J9795k5578L9973n926p4722L8492
$$ 216176 168079 108409 71918 17553 9950 -3194 16601 -8977 30996 25070 -49652 -11160
9861a1160K4037l8771m256j5121j914L1707N471L5738J2179K417j2911l9159l9765
$$ -11160 12877 -25894 -30150 -45271 -47185 -15478 -10007 25731 37910 40327 27416 -11743 -51508
9848e1508N3396p826o749j0205K5149J7184Q136L2797J2542k4389O1896L5491
$$ -51508 1888 -5938 -12687 -22892 2257 19441 27577 60374 72916 48527 110423 145914
9836A45914L7792R4712N7697J11529J82585L47804L17734J22465m1954k30032
$$ 145914 183706 278418 336115 447644 630229 978033 1295767 1418232 1376278 1146246
9826A146246k71376k31673j81495r4547j16004n7374N104Q802o7999m7239o375
$$ 1146246 874870 643197 461702 367155 251151 193777 198881 207683 139684 92445 86070
9815H6070L616J7938j5847m9907j7055j7o415k1456J2239K4745K8774l6597q795
$$ 86070 89686 107624 91777 41870 24815 24798 18383 -3073 9166 33911 62685 26088 17293
9802A7293k674k6859j5151O6745J857K0491M2321k8592j5949L2902M0532m2618
$$ 17293 14619 -12240 -27391 39354 41211 61702 104023 75431 59482 92384 132916 90298
9790I0298k1703R408J4637m6538k9137o8571k3194P898k5522R6151Q9594l5011
$$ 90298 68595 78003 92640 46102 16965 -51606 -74800 -66902 -92424 3727 93321 58310
9778E8310m7148m3019l4881p2598N377k324Q0231J15453O044q370j6158o4122
$$ 58310 11162 -31857 -66738 -139336 -133959 -136283 -56052 59401 65445 57075 40917 -23205
9766b3205o0238j0770L3461K0976m1784l257M3156O524j7541L3416K0381K3001
$$ -23205 -83443 -94213 -60752 -39776 -81560 -84817 -41661 -35137 -52678 -19262 1119 24120
9754B4120j8321n5439M5010Q0947J9061q4441J0964M7725j2886J5723k4180m5403
$$ 24120 5799 -49640 -4630 76317 95378 10937 21901 69626 56740 72463 48283 2880
9742B880j3500J7227K3449K9838o1303o1645o764p092k4867p942J0884J1605P6521
$$ 2880 -10620 6607 30056 59894 -1409 -63054 -69818 -76910 -101777 -109719 -98835 -87230 -10709
9729a0709M3779N643K797n6047n971r955l8454l5993p242Q1422j6842m3578J8153
$$ -10709 33070 38713 41510 -14537 -20508 -30463 -68917 -104910 -112152 -30730 -47572 -91150 -72997
9716g2997N1205l2484k8589L2790m598m8330l2001k1416M3871P2823Q879k7466
$$ -72997 -21792 -54276 -82865 -50075 -54673 -103003 -135004 -156420 -112549 -39726 -30847 -58313
9704e8313L8139L6446l1249j9256o999k7713O8338M317r130k0595J3967m2901
$$ -58313 -20174 16272 -14977 -34233 -41232 -68945 -607 3710 -5420 -26015 -12048 -54949
9692e4949q882P0060K2464O266L7009j3918l9457N3622j321o0627o429j3910l3044
$$ -54949 -63831 6229 28693 34959 71968 58050 18593 72215 70894 10267 3838 -10072 -43116
9679d3116k3210m1065O7363K7243L2637P437n1857o215M0481L3244K6817J8547
$$ -43116 -66326 -107391 -40028 -12785 19852 27289 -24568 -30783 9698 42942 69759 88306
9667H8306J2723p9287q2661m307N8937K1990l3412K5912r756k4559j9286p919
$$ 88306 101029 21742 -60919 -65226 -6289 15701 -17711 8201 -1555 -26114 -45400 -53319
9655e3319L4953l6535K0211P3798k4378k7799R486N0646k0494k8847k5655O600
$$ -53319 -18366 -54901 -34690 39108 14730 -13069 -3583 47063 26569 -2278 -27933 -21333
9643b1333O0220m1749m2893P4527Q3524L536k9182K8357o5131J2440K2296O1600
$$ -21333 38887 -2862 -45755 28772 112296 115832 86650 115007 49876 62316 84612 146212
9631A46212p6785l1806M0434k937l3553k6752j1455n0854j3241Q395J1787N1369
$$ 146212 69427 37621 78055 75118 41565 14813 3358 -47496 -60737 -52342 -40555 10814
9619A0814k2069m1210m7423J4448O8615K2173k6888J8431O2667J9345p8011q0618
$$ 10814 -11255 -52465 -99888 -85440 -16825 5348 -21540 -3109 59558 78903 892 -79726
9607g9726j4434R631l528o095M1664K5740N0404N9796j13r808p149K8628k4320
$$ -79726 -94160 -84529 -88057 -94152 -52488 -26748 23656 83452 83339 73531 66382 95010 70690
9594G0690m5691k748J2399K5251J7200R727K0210q581k1707m9234R20K4518M859
$$ 70690 24999 22251 34650 59901 77101 86828 107038 98457 76750 27516 28436 52954 57813
9581E7813l382k0949k0832O0202l793l7426m769J4369M8832M402k4276k4378k3621
$$ 57813 54431 33482 12650 72852 69059 31633 26864 41233 90065 94467 70191 45813 22192
9568B2192k452l8657M7851M8362J5569L9788k4906o123j6165n8539m9714K1455
$$ 22192 19740 -18917 28934 77296 92865 132653 107747 101624 85459 26920 -22794 -1339
9556a339O5095k0357q1115k9765N2780K3187l1393j3944P0555k856J3118P8655
$$ -1339 63756 43399 -37716 -67481 -14701 8486 -22907 -36851 33704 30848 43966 122621
9544A22621K3286j4201j5497n3427l0203Q7693N5916J2220l15p293k6034L1181
$$ 122621 145907 131706 116209 62782 32579 120272 176188 188408 188093 180800 154766 185947
9532A85947L0300j2825p0996p2347R068l7087l5252k4512O3445L7068l838K4804
$$ 185947 216247 203422 132426 60079 69147 32060 -3192 -27704 35741 72809 68971 93775
9520I3775P795j4208J1959L226K4844Q657r1638m5830J0833n27m0668k6141P9666
$$ 93775 101570 87362 99321 102547 127391 136048 44410 -1420 9413 8886 -31782 -57923 21743
9507B1743P4439J9343J4254n1746k9511K8901k0810k1878M2963K9084M5964o736
$$ 21743 96182 115525 129779 78033 48522 77423 56613 34735 77698 106782 152746 146010
9495A46010r55R981m0054l5880L5394P3770Q8523j2512J2531J6935o1286m8131
$$ 146010 145055 155036 114982 79102 114496 188266 276789 264277 276808 293743 232457 184326
9483A84326O0633L0465K8426K702k7184K10N3501K1700L1038K0326J0996K1900
$$ 184326 244959 275424 303850 306552 279368 279578 333079 354779 385817 406143 417139 439039
9471D39039m452J0484J0628N669k4091O3311O2847K8261k7642m6362K6025L0239
$$ 439039 434587 445071 455699 461368 437277 500588 563435 591696 564054 517692 543717 573956
9459E73956M2407O4627l5171J4495J00393N5878J6346N4002M0329N2974L7088
$$ 573956 616363 680990 645819 660314 760707 816585 832931 886933 927262 980236 1017324
9448A017324L5861P5788J26825J60870J33046K8294N8673J94842J32468Q0374
$$ 1017324 1053185 1128973 1255798 1416668 1549714 1578008 1636681 1831523 1963991 2044365
9438B044365K21844K09686K43857K69279K98392L29821L47444M28238N77407N33837
$$ 2044365 2266209 2475895 2719752 2989031 3287423 3617244 3964688 4392926 4970333 5504170
9428E504170N93842O93357P27414Q18611Q97790Q85508Q10394P26710N94893M47785
$$ 5504170 6098012 6791369 7518783 8337394 9235184 10120692 10931086 11657796 12252689 12700474
9418A2700474J57702j09860l71034n66430p10356q63439r13529q93963q70041
$$ 12700474 12858176 12748316 12377282 11810852 11100496 10237057 9323528 8429565 7559524
$$ [...]
##END NTUPLES=NMR SPECTRUM
##END=
