##TITLE= c5867yag
##JCAMP-DX= 6.00 $$ JEOL NMR v1.10
##DATA TYPE= NMR SPECTRUM
##DATA CLASS= NTUPLES
##NUM DIM= 1
##ORIGIN= DELTA2_NMR
##OWNER= JEOL
##LONG DATE= 2010/02/ 5 03:50:42
##SPECTROMETER/DATA SYSTEM= DELTA2_NMR
##.OBSERVE FREQUENCY= 3.99782214397066E+02
##.OBSERVE NUCLEUS= ^1H
##.DELAY= (1.6668E+02,1.6668E+02)
##.ACQUISITION MODE= SIMULTANEOUS
##.ACQUISITION SCHEME= PHASE SENSITIVE
##.PULSE SEQUENCE= single_pulse.ex2
##.SOLVENT NAME= CHLOROFORM-D
##.FIELD= 9.389766
##.FILTER WIDTH= 1.3665350909952
##.ACQUISITION TIME= 2.73186816
##.SPINNING RATE= 10
##.OBSERVE 90= 11
$$ ------------------------
$$ JEOL SPECIFIC PARAMETERS
##$FILENAME= C:\DOCUME~1\YANANG~1\LOCALS~1\Temp/tmpconv_c5867yag_PROTON357299934
402c-1.jdf
##$TITLE= c5867yag
##$AUTHOR= JEOL
##$CREATION=  5-FEB-2010 03:50:42
##$REVISION= 17-FEB-2010 17:22:57
##$CONTENT= Y Gao-C12mimBF4-60-5.5h
##$INSTRUMENT= DELTA2_NMR
##$SITE= York Chemistry
##$NODENAME= itea
##$DIMENSIONS= 1
##$STORAGE= FLOAT
##$X_FORMAT= COMPLEX
##$X_CURR_POINTS= 16384
##$X_START= 12.46072 $$ppm
##$X_STOP= -2.53994 $$ppm
##$X_TITLE= 1H                              
##$X_ZERO_POINT= 0.3333
##$X_FREQ_FLIP= FALSE
##$X_POINTS= 16384
##$X_PRESCANS= 1
##$X_DOMAIN= 1H
##$X_OFFSET= 5 $$ppm
##$X_FREQ= 399.78221 $$MHz
##$X_SWEEP= 5.99736 $$kHz
##$X_RESOLUTION= 0.36605 $$Hz
##$SOLVENT= CHLOROFORM-D
##$TEMP_GET= 21.3 $$dC
##$ACQ_DELAY= 0.16668 $$ms
##$DIGITAL_FILTER= FALSE
##$FILTER_FACTOR= 1
##$FILTER_WIDTH= 3 $$kHz
##$TRANSITION_RATIO= 0.8
##$ORDERS= 2 15 74
##$FACTORS= 2  2
##$LOCK_STRENGTH= 1119
##$LOCK_LEVEL= 180
##$LOCK_GAIN= 23
##$LOCK_OSC_OFFSET= 7.26 $$ppm
##$LOCK_PHASE= 91.4 $$deg
##$LOCK_OSC_STATE= 2H OSC ON
##$X_ANGLE= 45 $$deg
##$X90= 11 $$us
##$X90_HI= 52 $$us
##$X90_LO= 52 $$us
##$X_90_WIDTH= 11 $$us
##$X_PULSE= 5.5 $$us
##$RELAXATION_DELAY= 4 $$s
##$SCANS= 16
##$PROBE_ID= 2756
##$ITERATIONS= 1
##$FIELD_STRENGTH= 9.38977 $$T
##$TEMP_SET= 25 $$dC
##$SPIN_SET= 10 $$Hz
##$SPIN_GET= 10 $$Hz
##$HE_LEVEL= 91 $$%
##$N2_LEVEL= 84 $$%
##$CHANGER_SAMPLE= 35
##$EXPERIMENT= single_pulse.ex2
##$OBS_PWIDTH= 1 $$us
##$IRR_PWIDTH= 52 $$us
##$TRI_PWIDTH= 1 $$us
##$QUA_PWIDTH= 1 $$us
##$IRR_DOMAIN= 1H
##$TRI_DOMAIN= 1H
##$IRR_FREQ= 399.7822 $$MHz
##$TRI_FREQ= 399.7822 $$MHz
##$RECVR_GAIN= 34
##$IRR90= 11 $$us
##$TRI90= 10 $$us
##$QUA90= 10 $$us
##$IRR90_HI= 52 $$us
##$QUA90_HI= 10 $$us
##$IRR90_LO= 52 $$us
##$TRI90_LO= 10 $$us
##$QUA90_LO= 10 $$us
##$IRR_OFFSET= 5 $$ppm
##$MOD_RETURN= 1
##$TOTAL_SCANS= 16
##$TRI_OFFSET= 5 $$ppm
##$X_ACQ_DURATION= 2.73187 $$s
##$AF_VERSION= 1
##$DELAY_OF_START= 2.0 $$s
##$ACTUAL_START_TIME= 634189727
##$CLIPPED= FALSE
##$DC_BALANCED= FALSE
##$QUI90= 10 $$us
##$SEX90= 10 $$us
##$SEP90= 10 $$us
##$OCT90= 10 $$us
##$NON90= 10 $$us
##$DEC90= 10 $$us
##$TRI90_HI= 10 $$us
##$QUI90_HI= 10 $$us
##$SEX90_HI= 10 $$us
##$SEP90_HI= 10 $$us
##$OCT90_HI= 10 $$us
##$NON90_HI= 10 $$us
##$DEC90_HI= 10 $$us
##$QUI90_LO= 10 $$us
##$SEX90_LO= 10 $$us
##$SEP90_LO= 10 $$us
##$OCT90_LO= 10 $$us
##$NON90_LO= 10 $$us
$$ [...]
##$VT_PID_LONG_40_H_CBH= 0
##$VT_PID_LONG_40_H_HC= 0
##$VT_PID_LONG_40_H_HL= 100
##$SAMPLE_ACTION= LOADED
##$SAMPLE_STATE= LOAD
##$SAMPLE_STATUS= LOADED
##$AUTOSHIM_MODE= Z1 Z2
##$AUTOSHIM_DELAY= 3600 $$s
##$AUTOSHIM_TRACK= AUTOSHIM OFF
##$SHIM_NAMES= SHIM_Z0
##$SHIM_Z0= -25605 $$Hz
##$SHIM_Z1= -69.81 $$Hz
##$SHIM_Z2= 9.62 $$Hz
##$SHIM_Z3= -9.61 $$Hz
##$SHIM_Z4= -34.48 $$Hz
##$SHIM_Z5= 11.03 $$Hz
##$SHIM_Z6= -0.59 $$Hz
##$SHIM_X= 9.3 $$Hz
##$SHIM_XZ= 41.5 $$Hz
##$SHIM_XZ2= -4.5 $$Hz
##$SHIM_XZ3= 0 $$Hz
##$SHIM_X2= -50 $$Hz
##$SHIM_X2Z= -14.5 $$Hz
##$SHIM_X3= 0 $$Hz
##$SHIM_Y= 114.4 $$Hz
##$SHIM_YZ= -42 $$Hz
##$SHIM_YZ2= -29.5 $$Hz
##$SHIM_YZ3= 0 $$Hz
##$SHIM_Y2= 7 $$Hz
##$SHIM_Y2Z= -19 $$Hz
##$SHIM_Y3= 0 $$Hz
##$NUM_SCANS= 1
##$END_TIME= 634189842
##$LOCAL_TIME= 634189842
##$LF_TUNE_DIAL= 2743
##$LF_MATCH_DIAL= 3563
##$HF_TUNE_DIAL= 2460
##$HF_MATCH_DIAL= 5778
##$HA_RF1= HF1
##$HA_RF2= LF1
##$HA_RF3= NONE
##$HA_RF4= NONE
##$SHAPE_NAMES= SQUARE
##$FG_SHAPE_NAMES= SQUARE
##$NOISE_NAMES= CW
##$NON_OBS_OFFSET= 1000000 $$Hz
##$NOMINAL_DDS_SPREAD= 100 $$Hz
##$OBS_AMP= NONE
##$IRR_AMP= NONE
##$TRI_AMP= NONE
##$QUA_AMP= NONE
##$QUI_AMP= NONE
##$SEX_AMP= NONE
##$SEP_AMP= NONE
##$OCT_AMP= NONE
##$NON_AMP= NONE
##$DEC_AMP= NONE
##$OBS_XMTR= 0
##$IRR_XMTR= 0
##$TRI_XMTR= 0
##$QUA_XMTR= 0
##$QUI_XMTR= 0
##$SEX_XMTR= 0
##$SEP_XMTR= 0
##$OCT_XMTR= 0
##$NON_XMTR= 0
##$DEC_XMTR= 0
##$PASS_RIPPLE= 0.01 $$dB
##$STOP_RIPPLE= 60 $$dB
##$PROBE_RECOVERY= 5 $$us
##$AF_DELAY_RATIO= 0
##$RECVR_PHASE= 0 $$deg
##$X_GRADIENT_MAX= 0.1 $$T/m
##$RECVR_GAIN_LIMIT= 80
##$RECVR_GAIN_POINT= 200000 $$Hz
##$VERSION= 4.3.6 [Linux]
##$Y_GRADIENT_MAX= 0.1 $$T/m
##$Z_GRADIENT_MAX= 0.3 $$T/m
##$INST_MODEL_NUMBER= JNM-ECS400
##$INST_SERIAL_NUMBER= NM14400056
##$FAST_AUTOSHIM_STEP_MULT= 50
##$FAST_AUTOSHIM_SETTLE_WAIT= 4 $$s
##$FAST_AUTOSHIM_ITERATIONS= 1
##$FAST_AUTOSHIM_MAX_STEPS= 30
##$SHIM_DELAY= 0 $$s
##$SHIM_DELAY_BEFORE_EXP= 0 $$s
##$SHIM_DELAY_STATE= OFF
##$SPIN_PID_P= 10
##$SPIN_PID_I= 5
##$SPIN_PID_D= 0
##$HF1_TUNE_ATN= 20.1 $$dB
##$LF1_TUNE_ATN= 25.7 $$dB
##$X_ACQ_TIME= 2.73187 $$s
##$X_ATN= 1.1 $$dB
##$INITIAL_WAIT= 1 $$s
##$REPETITION_TIME= 6.73187 $$s
##$DANTE_PRESAT= FALSE
##$IRR_MODE= Off
##$TRI_MODE= Off
##$DEAD_TIME= 0 $$us
##$DELAY= 0 $$us
##$X_PROBE_MAP= HF1
##$NORMALIZED= TRUE
$$ END OF JEOL SPECIFIC PARAMETERS
$$ -------------------------------
##NTUPLES= NMR SPECTRUM
##VAR NAME= FREQUENCY,    SPECTRUM/REAL, SPECTRUM/IMAG, PAGE NUMBER
##SYMBOL=   X,            R,             I,             N
##VAR TYPE= INDEPENDENT,  DEPENDENT,     DEPENDENT,     PAGE
##VAR FORM= AFFN,         ASDF,          ASDF,          AFFN
##VAR DIM=  16384, 16384, 16384, 2
##UNITS= PPM,     ARBITRARY UNITS, ARBITRARY UNITS, 
##FIRST=  1.246071630252E+01, -3.00475439021307E-12, -3.27589532873524E-11, 1
##LAST=  -2.53993879229948, -8.12136408630777E-12, -3.05936797816312E-11, 2
##FACTOR=  9.15623212770523E-04, 3.4082507322935E-09, 3.4082507322935E-09, 1
##PAGE= N=1
##DATA TABLE=(X++(R..R)), XYDATA
$$ [...]
9202i30037k621r6496J23103j6095p5152o680P5068m5499J2065j02034J07389o4140P6670
9189i44459o3053j9361P7355L7717o1509J02842n125j27621K9615j5848M3176j0262m1093
9176i97626j6460K5485k9376L4676n7894P0536J90880j58096l5212O338J10588o6540r5125
9163a017826Q0388m7726l4737L7955K6914K9043j6970j8841K5955L8289j2629j82066
9151a092251J02198J26380l8795l676j0690l8972k7424l0809K1577K679J6944P0215j984
9138i04608K4377j13448K9614N7941M2749m9997j4791m1709L7328l33J3949l3650m5905
9125i98483l7057N6632P2592j25450L9518R2430j0885j61556R4502k7855R5360j27848O512
9112a031588l465r1148J46993k41j3808J9614j1829K3732M0070j73876J84666K4095j74937
$$ plain form
9202 -930037 -932658 -1029154 -906051 -922146 -997298 -1003978 -928910 -974409 -962344 -1064378 -956989 -1021129 -944459
9189 -944459 -1007512 -1026873 -949518 -911801 -973310 -870468 -875593 -1003214 -973599 -989447 -946271 -956533 -997626
9176 -997626 -1014086 -988601 -1017977 -983301 -1041195 -970659 -779779 -937875 -973087 -966749 -856161 -922701 -1017826
9163 -1017826 -937438 -985164 -1019901 -981946 -955032 -925989 -942959 -961800 -935845 -897556 -910185 -1092251
9151 -1092251 -990053 -863673 -902468 -906144 -916834 -955806 -983230 -1014039 -992462 -989783 -972839 -902624 -904608
9138 -904608 -880231 -993679 -964065 -906124 -863375 -913372 -928163 -969872 -932544 -932877 -918928 -952578 -998483
9125 -998483 -1035540 -978908 -906316 -1031766 -992248 -899818 -910703 -1072259 -977757 -1005612 -910252 -1038100 -1031588
9112 -1031588 -1035053 -1126201 -979208 -979449 -993257 -973643 -985472 -961740 -921670 -1095546 -910880 -886785 -1061722
9099a061722L8116J1192P3874p4157J01366j01422l5400N8493J30525n9753m2879Q8994
9087h72773j14301N5260N9329n7162J9303q8858l0428J12813o7944K9769j20886J23902
9075i51976j31083J17783J0346j01529O4170J7127k5557L7512O4492m2855J9307j34403
9063a056666K9070J39852j12853o2333O4040J533K3846m5252K9311q17K4424l9651k3203
9050a028699J33979j72034r0988J80552K1684q8155j779o1059J39639q0127l7853k5422
9038a110262P2994P1228m2984j4780R6932o9776n558k6745k2207Q6404L1735p7285L8922
9025i71382M7995Q943m6243k8520M3430J5083j4245m2508P1317l206j0366j38580M9656
9012a018626n4359N9629n5500J00172p0079o4352O8324J261P1411l3904L2505j10567
$$ plain form
9099 -1061722 -1023606 -1012414 -938540 -1012697 -911331 -1012753 -1048153 -989660 -859135 -918888 -961767 -872773
9087 -872773 -987074 -931814 -872485 -929647 -910344 -999202 -1029630 -916817 -984761 -954992 -1075878 -951976
9075 -951976 -1083059 -965276 -954930 -1056459 -992289 -975162 -1000719 -963207 -898715 -941570 -922263 -1056666
9063 -1056666 -1027596 -887744 -1000597 -1062930 -998890 -997357 -973511 -1018763 -989452 -990269 -965845 -1005496 -1028699
9050 -1028699 -894720 -1066754 -1157742 -977190 -955506 -1043661 -1045440 -1106499 -966860 -1046987 -1084840 -1110262
9038 -1110262 -1037268 -966040 -1009024 -1023804 -926872 -996648 -1002206 -1028951 -1051158 -964754 -933019 -1010304 -971382
9025 -971382 -923387 -914444 -960687 -989207 -945777 -930694 -944939 -987447 -916130 -919336 -929702 -1068282 -1018626
9012 -1018626 -1072985 -1013356 -1068856 -968684 -1038763 -1103115 -1034791 -1033530 -962119 -996023 -963518 -1074085
9000a074085K04720j34252N6689M226o3622O2657n0765l1027K6208o066L5474j0097n6451
8987a036391o031j5248k1059M6357k6732j2719R5073J0021k11795P1673J16682n7581j9200
8974a066950J21773M7064o1910O222p9065L3423M1599j35932j9401m622M6767J53351
8962i17681j76040Q9461Q6622o3498n9178P5390q4194o0475K9033m9183M4740J19828o0289
8949a025464J0473J4996m6182Q7681o0438M1208k22j09980M0229q8549Q2443J5436j2937
8936a051306O7632k9109m0291j9304P0037O3916p4704o947j04152J71930j17744L5123
8924a034919J4695k1979N9028o6975J6697M2552l3648M8455r6103M5167M1590o6816L413
8911a048843N5643o8017O0668j8828Q878J0207p3514l357O8259j7322P597j00973P2110
$$ plain form
9000 -1074085 -869365 -1003617 -946928 -942702 -1006324 -943667 -994432 -1025459 -999251 -1005317 -969843 -979940 -1036391
8987 -1036391 -1042422 -1057670 -1078729 -1032372 -1059104 -1071823 -976750 -966729 -1178524 -1106851 -990169 -1047750 -1066950
8974 -1066950 -945177 -898113 -960023 -953801 -1032866 -999443 -957844 -1093776 -1113177 -1117799 -1071032 -917681
8962 -917681 -1093721 -1004260 -917638 -981136 -1040314 -964924 -1049118 -1109593 -1080560 -1129743 -1085003 -965175 -1025464
8949 -1025464 -1014991 -999995 -1046177 -958496 -1018934 -977726 -977948 -1087928 -1047699 -1136248 -1053805 -1038369 -1051306
8936 -1051306 -983674 -1012783 -1053074 -1072378 -1002341 -938425 -1013129 -1020076 -1124228 -952298 -1070042 -1034919
8924 -1034919 -1020224 -1042203 -983175 -1050150 -1033453 -990901 -1024549 -976094 -1072197 -1027030 -985440 -1052256 -1048843
8911 -1048843 -993200 -1061217 -1000549 -1019377 -1010499 -1000292 -1073806 -1077163 -1008904 -1026226 -1018629 -1119602 -1047492
8898a047492k3235L6290O3470p1869L7139j38426J41922j22777J41369q7548q2807J19652
8886a034312N3902L396K8327k09774J22602L7029j78591R1207J28322K0300m8032Q988j63
8873i76799n6913K2066Q645r4213P196J31824n5932J8548l6892j7202L7133m5456k4029
8860a082024M3579M1419K934M2345n6970j9187j5003O989L9921j9210K0887m2712p1259
8847a108291K1834Q8645j53196L2167J23720J02038j06422m8505n1888k3546K1545L3981
8835a067918M3981J3654j18849K3293J5386j3915j4496J57363j68955O5912j4397L5617
8823a043324R9386j05493N24N3272J1545r5862m4080K7052M1413J58500j04080K8803
8811i72344j68582N3414P7574O5280q7734j7498K6855r2015N5169p9065K7220R1940p9719
$$ plain form
8898 -1047492 -1070727 -1034437 -970967 -1042836 -1005697 -1144123 -1002201 -1124978 -983609 -1071157 -1153964 -1034312
8886 -1034312 -980410 -977014 -948687 -1158461 -1035859 -998830 -1177421 -1086214 -957892 -937592 -985624 -976636 -976799
8873 -976799 -1033712 -1011646 -1003001 -1097214 -1090018 -958194 -1014126 -995578 -1032470 -1049672 -1012539 -1057995 -1082024
8860 -1082024 -1038445 -997026 -994092 -951747 -1008717 -1027904 -1042907 -1035918 -995997 -1015207 -994320 -1037032 -1108291
8847 -1108291 -1086457 -997812 -1151008 -1118841 -995121 -893083 -999505 -1048010 -1099898 -1123444 -1101899 -1067918
8835 -1067918 -1023937 -1010283 -1129132 -1105839 -1090453 -1104368 -1118864 -961501 -1130456 -1064544 -1078941 -1043324
8823 -1043324 -943938 -1049431 -1048907 -995635 -984090 -1079952 -1124032 -1096980 -1055567 -897067 -1001147 -972344
8811 -972344 -1140926 -1087512 -1009938 -944658 -1032392 -1049890 -1023035 -1115050 -1059881 -1138946 -1111726 -1019786 -1099505
8798a099505J17541r0724j4357O4533L90j33321P2621L2937j09337N1698Q9691L4885
8786i82948j20197O192L7944J23427j45336K0766j368J195o5284O8232n4118O8361K54
8773a042880K6772j4590k3543l611k4825L3078Q0904o4187r2912Q0139j104o7733L4108
8760a080384N3194l5332K7408J32976k60659J09525m0100O069p0480J20365n9711q664
8748a105793m1884O2536p4687L3185n7707P9066k6182o848J32406Q4477j92876J4544
8736a099763J00140q4694N0071o0377j3243L1559J04512q2676o4573J19113m5120N7740
8724i87311j43322R1029n5412L0955m628k0808j8559R4631O3617o9908j13250l0622m2702
8711a206290K12371J6500j34105J3740P9040l2430K4367n4826N2534l9110Q8014p3921
$$ plain form
8798 -1099505 -981964 -1072688 -1087045 -1022512 -1022122 -1155443 -1082822 -1049885 -1159222 -1107524 -1017833 -982948
8786 -982948 -1103145 -1096953 -1059009 -935582 -1080918 -1060152 -1061520 -1060325 -1125609 -1057377 -1111495 -1043134 -1042880
8773 -1042880 -1016108 -1030698 -1054241 -1057852 -1082677 -1049599 -968695 -1032882 -1125794 -1045655 -1046759 -1114492 -1080384
8760 -1080384 -1027190 -1062522 -1035114 -902138 -1162797 -1053272 -1093372 -1087303 -1157783 -1037418 -1097129 -1105793
8748 -1105793 -1147677 -1085141 -1159828 -1126643 -1184350 -1105284 -1131466 -1138314 -1005908 -921431 -1114307 -1099763
8736 -1099763 -999623 -1084317 -1034246 -1094623 -1107866 -1076307 -971795 -1054471 -1119044 -999931 -1045051 -987311
8724 -987311 -1130633 -1039604 -1095016 -1064061 -1068689 -1089497 -1108056 -1013425 -949808 -1019716 -1132966 -1163588 -1206290
8711 -1206290 -993919 -977419 -1111524 -1097784 -1018744 -1051174 -1026807 -1081633 -1029099 -1068209 -980195 -1054116
8699a054116j02103M2712R8539J4509J9903n5625j19237J7891P2799l8507q001J7943n448
8686a098741k761Q4915M7087k7784o461Q204k5678j4320l927m2883n9935K5164l8478
8673a155598J02492p0493L8206L1074K7898p4009J25032n8545r9644K5681J06155o9389
8661a071140n8761O5459j099q6604Q1865k0783r427J1880k0428j4140K1724n9483O3571
8648a097366q966j18101j8487N8048N384o79L0801k7400J44055N9135j10454j07647O7506
8635a124171Q0272J26084k49291J27174l8210N2372j26625J18623j9314k3083p3990j8869
8623a169028j04509R5974P2043m3098m9385N2288L0477P4650r4039k7166O5147K3374l7670
8610a110942J0885O2037j19179k0162K615J04686Po9050M5485M0670j02780K1089l4248
$$ plain form
8699 -1054116 -1156219 -1113507 -1014968 -1000459 -980556 -1036181 -1155418 -1137527 -1064728 -1103235 -1111236 -1093293 -1098741
8686 -1098741 -1101502 -1016587 -969500 -997284 -1003745 -995541 -1021219 -1035539 -1039466 -1082349 -1142284 -1117120 -1155598
8673 -1155598 -1053106 -1123599 -1085393 -1054319 -1026421 -1100430 -975398 -1033943 -1133587 -1107906 -1001751 -1071140
8661 -1071140 -1129901 -1064442 -1065541 -1152145 -1070280 -1091063 -1100490 -1088610 -1109038 -1123178 -1101454 -1160937 -1097366
8648 -1097366 -1106332 -1224433 -1242920 -1184872 -1179488 -1180167 -1149366 -1176766 -1032711 -973576 -1084030 -1191677 -1124171
8635 -1124171 -1043899 -917815 -1167106 -1039932 -1078142 -1025770 -1152395 -1033772 -1053086 -1076169 -1150159 -1169028
8623 -1169028 -1273537 -1177563 -1105520 -1148618 -1198003 -1145715 -1115238 -1040588 -1134627 -1161793 -1096646 -1073272 -1110942
8610 -1110942 -1100057 -1038020 -1157199 -1177361 -1174746 -1070060 -1070053 -1139103 -1093618 -1052948 -1155728 -1134639 -1168887
8597a168887K8942k6985K1679m0161K7904R4251j36766R736N7502m9889J02381j4679r3727
8584a188699J43034p556J6262l7085L8914m5694o1606Q782j6419K5316k4256M9306j08901
8571a208602J41024j02472n8348J15866l4956M8797j12475M3465M6247k1728M3186k6969
8559a126965N3850j0477K7890o6083L3327L4612j2512j06110m5276L3371q2585K05485
8547a061473L5294j38588M1729O6400k00747R8530o960M133O1853n8888O5153m4969k8723
8534a167256j46716R9233Q3002J6849M3456Q9849k13649M9184N0206j06459k6439N5789
8522a172951K3353M5671n407l8944l5937J6214N7731m3707M9699N0638p7686k9889n4918
8509a216133K29600j91086N9645n1677J9795L2666j51948J38620J774o6106J08299r4194
$$ plain form
8597 -1168887 -1139945 -1166930 -1145251 -1185412 -1157508 -1063257 -1200023 -1190287 -1132785 -1182674 -1080293 -1094972 -1188699
8584 -1188699 -1045665 -1053221 -1036959 -1074044 -1035130 -1080824 -1142430 -1133648 -1150067 -1124751 -1149007 -1099701 -1208602
8571 -1208602 -1067578 -1170050 -1228398 -1112532 -1147488 -1098691 -1211166 -1167701 -1121454 -1143182 -1099996 -1126965
8559 -1126965 -1073115 -1083592 -1055702 -1121785 -1088458 -1053846 -1066358 -1172468 -1217744 -1184373 -1266958 -1061473
8547 -1061473 -1026179 -1164767 -1123038 -1056638 -1257385 -1158855 -1165815 -1161682 -1099829 -1158717 -1093564 -1138533 -1167256
8534 -1167256 -1313972 -1214739 -1131737 -1114888 -1071432 -981583 -1195232 -1146048 -1095842 -1202301 -1228740 -1172951
8522 -1172951 -1149598 -1103927 -1109334 -1148278 -1184215 -1168001 -1110270 -1153977 -1104278 -1053640 -1131326 -1161215 -1216133
8509 -1216133 -986533 -1177619 -1117974 -1169651 -1149856 -1117190 -1269138 -1130518 -1128744 -1194850 -1086551 -1180745
8497a180745M0642Q4579r3420K8825l9453P2245m5297M7188l5570P8271j59840N861J1174
8484a185540J06439n51O0617j85178R4154m2372N1226L8713j2966j04724l6076m4652P8138
8471a182772J14002k9352m9936K8927j1297k04977J31415R5954r0811M1337j53084J51898
8459a158696N4642k8023k5184M2350o5654P2152n7746M9370j20315J24802r0762J04365
8447a098699j29140m8018R2280J0521j12228K5537R0716L6954R391l7413L0557l4887L131
8434a161298K1068l94j01469N7045P3154L912r3880M9888m7483P2016o3155n2844R4717
8421a148723N757o5024O8433N9101j47563o226L4401J12325p0395M1806j66112j4274J5797
8408a280697P2805j5117O4010r2043J4648L1599K6739o972n5671J7166l0794l0605l253
$$ plain form
8497 -1180745 -1140103 -1055524 -1148944 -1120119 -1159572 -1087327 -1132624 -1085436 -1121006 -1042735 -1202575 -1196714 -1185540
8484 -1185540 -1079101 -1079652 -1019035 -1204213 -1110059 -1152431 -1101205 -1062492 -1075458 -1180182 -1216258 -1260910 -1182772
8471 -1182772 -1068770 -1098122 -1148058 -1119131 -1130428 -1335405 -1203990 -1108036 -1198847 -1157510 -1310594 -1158696
8459 -1158696 -1104054 -1132077 -1157261 -1114911 -1180565 -1108413 -1166159 -1116789 -1237104 -1112302 -1203064 -1098699
8447 -1098699 -1227839 -1275857 -1183577 -1173056 -1285284 -1259747 -1169031 -1132077 -1122686 -1160099 -1129542 -1164429 -1161298
8434 -1161298 -1140230 -1140624 -1242093 -1185048 -1111894 -1107982 -1201862 -1151974 -1199457 -1127441 -1190596 -1243440 -1148723
8421 -1148723 -1142966 -1207990 -1139557 -1080456 -1228019 -1234245 -1199844 -1087519 -1157914 -1116108 -1282220 -1296494 -1280697
8408 -1280697 -1207892 -1223009 -1158999 -1251042 -1236394 -1204795 -1178056 -1185028 -1240699 -1223533 -1254327 -1284932 -1288185
8395a288185L2852j5466p1840P0586J33440j9229m2504r2392j83R4192n8666m4996N5959
8382a246432O7300J8040j2594L0656m2018j17323Q3141N5203p1811J666l0940K0349m0234
8369a284997M4343L1600N7821j28112J0459J13771j61008Q2729l6748m46K1862M6392m7806
8356a250140P5077m4725N1425j38121m7654J33122K1949n0510M2855q2777P0595k4513
8344a243417m7332j74j9372Q0422N715M2517l6136M8180k0647p9157M5882l7286O3520
8331a197285P0115j09197j0308K4245k8415r8039L4344P6535j42496J80310O0997j24690
8319a263884m0942J53667q2261n8540j2398N2168P7477n3613n6802k624M0181m9426J5501
8306a281496N473M4697k953Q724O3134K5782K19887L06643J82136P630r5770J54918M02476
$$ plain form
8395 -1288185 -1255333 -1270799 -1342639 -1272053 -1138613 -1157842 -1200346 -1292738 -1292921 -1198729 -1257395 -1302391 -1246432
8382 -1246432 -1179132 -1161092 -1173686 -1143030 -1185048 -1302371 -1219230 -1164027 -1235838 -1234172 -1265112 -1244763 -1284997
8369 -1284997 -1240654 -1209054 -1151233 -1279345 -1268886 -1155115 -1316123 -1233394 -1270142 -1270588 -1248726 -1202334 -1250140
8356 -1250140 -1175063 -1219788 -1168363 -1306484 -1354138 -1221016 -1199067 -1249577 -1206722 -1289499 -1218904 -1243417
8344 -1243417 -1290749 -1290923 -1310295 -1229873 -1224158 -1181641 -1217777 -1169597 -1190244 -1269401 -1223519 -1260805 -1197285
8331 -1197285 -1127170 -1236367 -1246675 -1222430 -1250845 -1348884 -1314540 -1238005 -1380501 -1200191 -1139194 -1263884
8319 -1263884 -1304826 -1151159 -1233420 -1291960 -1304358 -1252190 -1174713 -1228326 -1285128 -1287752 -1247571 -1296997 -1281496
8306 -1281496 -1276023 -1231326 -1234279 -1225555 -1162421 -1136639 -916752 -610109 -427973 -420343 -516113 -361195 41281
8293D1281K81491k77676k93764k37137J93504m234l09405k44726l53697j0852j8614n317
8281a239146j18894J77482j14052P5957j45619R9330l0064o9917J61330k5934o5184n4806
8269a349517Q5308L181J17l4638N9293o4515k3712j713O850N3598l8645K6253L8300o8309
8255a308149p7255P0984N4579p2615N2008r3224n816j0681N0181P5545m9702j06042M5602
8242a374585M2138j2270L2210M8139q4020j02634k8116J03876J29197j56780q1035J21013
8230a362867n9112J47808q0292N1843j1615l6180k094M9617P880j3874k0472j37945M6135
8217a421168q5573J95283o4182K079J24869j02337j1949M7696p5889L9648Q4615m5555
8205a312463O7714J94164L71431K37949q4740n2805R9751M38261K12644l55544m24970
$$ plain form
8293 41281 322772 45096 -248668 -485805 -292301 -296535 -605940 -850666 -1204363 -1215215 -1233829 -1239146
8281 -1239146 -1358040 -1180558 -1294610 -1218653 -1364272 -1264942 -1295006 -1364923 -1203593 -1229527 -1294711 -1349517
8269 -1349517 -1264209 -1261028 -1260911 -1295549 -1236256 -1300771 -1324483 -1326196 -1319346 -1265748 -1304393 -1278140 -1239840 -1308149
8255 -1308149 -1385404 -1314420 -1259841 -1332456 -1280448 -1373672 -1379488 -1390169 -1339988 -1264443 -1314145 -1420187 -1374585
8242 -1374585 -1332447 -1344717 -1312507 -1264368 -1348388 -1451022 -1479138 -1375262 -1246065 -1402845 -1483880 -1362867
8230 -1362867 -1421979 -1274171 -1354463 -1302620 -1314235 -1350415 -1352509 -1302892 -1295012 -1308886 -1329358 -1467303 -1421168
8217 -1421168 -1506741 -1311458 -1375640 -1373561 -1248692 -1351029 -1362978 -1315282 -1391171 -1351523 -1266908 -1312463
8205 -1312463 -1244749 -1050585 -679154 -441205 -525945 -578750 -478999 -40738 171906 -183638 -608608
8194f08608k7487J29773O6867m08123k50223j26839K1356j56047r6243o7521K6462J6806
8182a479827Q3216M5574j01497m810n6657R2315k9794j11470J45950j05190J15141O0013
8170a347036j31187r594Q6037j24157k9971J67807K310j98887K71238j41924k3379m3391
8158a522134K09517N32986J79087o82112j31210r2582k7746k864N9606j19555j618J1664l7
8145a586998J05752M3488p8924j3548Q139k0550k3628k8038J02244o8838o5408K560Q7821
8132a535928j0185j37472P0959J49656o4067r6295P9859P378o7707j35269J13249l3866
8120a659688l6712M6685j09348J23780k6782Q9618j68953O6551l4511K8409j15764J43889
8108a652826j1759j09318N5069p818J11032Q83o084K5820j10861o5674k00841J13944Q2668
$$ plain form
8194 -608608 -636095 -506322 -439455 -847578 -1097801 -1224640 -1203284 -1359331 -1455574 -1523095 -1496633 -1479827
8182 -1479827 -1396611 -1351037 -1452534 -1457344 -1514001 -1421686 -1451480 -1562950 -1417000 -1522190 -1407049 -1347036
8170 -1347036 -1478223 -1487817 -1401780 -1525937 -1555908 -1388101 -1385791 -1584678 -1313440 -1455364 -1478743 -1522134
8158 -1522134 -1312617 -779631 -600544 -1282656 -1413866 -1506448 -1534194 -1537058 -1477452 -1597007 -1598625 -1586961 -1586998
8145 -1586998 -1481246 -1437758 -1516682 -1530230 -1522091 -1542641 -1566269 -1594307 -1492063 -1560901 -1626309 -1623749 -1535928
8132 -1535928 -1546113 -1683585 -1612626 -1462970 -1527037 -1623332 -1543473 -1536095 -1603802 -1739071 -1625822 -1659688
8120 -1659688 -1696400 -1649715 -1759063 -1635283 -1662065 -1572447 -1741400 -1674849 -1709360 -1680951 -1796715 -1652826
8108 -1652826 -1664585 -1773903 -1718834 -1726652 -1615620 -1614737 -1620821 -1595001 -1705862 -1771536 -1972377 -1858433 -1775765
8095a775765L6037j21925j27678j27191J69745l8543J16521p6593m5986K4720r8447J30825
8083a934280j1698j68733J17564K13571L8720J5876q4173J27794p8386L8935R5132j63045
8071a792723j61173N7394K9589Q6785j78369p8797k1204j20991R2294L4026m7943j11050
8059b212162j80326J51563k6287k7800M1507L53108J094524J157543L86302m28222j67519
8048A42231J311762J941240N15316j586811j597351j8770Q80632l4094j216517r18111
8038e80473m21277k36781j26695L24394N19766K41233J2905O01728Q32379J468615L302547
8027E938341J0262632L0612998O5060780O1396489j6796622m1104436L1825829J09129786
8019B56325797Q6631571n2306885j15059086m3100953L9448317L6687252n4455289
$$ plain form
8095 -1775765 -1739728 -1861653 -1989331 -2116522 -1946777 -1985320 -1868799 -1945392 -1991378 -1966658 -2065105 -1934280
8083 -1934280 -1945978 -2114711 -1997147 -1783576 -1744856 -1728980 -1813153 -1685359 -1763745 -1724810 -1629678 -1792723
8071 -1792723 -1953896 -1896502 -1866913 -1780128 -1958497 -2037294 -2058498 -2179489 -2087195 -2053169 -2101112 -2212162
8059 -2212162 -2392488 -2240925 -2267212 -2295012 -2253505 -1900397 -805873 351670 737972 309750 142231
8048 142231 1453993 3395233 3910549 2323738 726387 707617 1588249 1554155 337638 -580473
8038 -580473 -1001750 -1238531 -1365226 -1040832 -521066 -279833 -266928 334800 1167179 2635794 5938341
8027 5938341 16200973 46813971 111874751 173271240 156474618 115370182 147196011 256325797
8019 256325797 342957368 290650483 175591397 132490444 171938761 208626013 154170724
8012A54170724q0836676l9186910j4599419n854365k830057j594618j742722j506188
8004F019769r83035j74623k18109p40970n60783J1681Q16892Q06326k34822p77866M7603
7993D012063J213770J451737m27835j612355j133091K15946L68769m70034j390489r73055
7983A255426l87472m16095k77041l6453K15134k70120k97484j24002L0118R2532j41333
7972c56790j9569k19256j4145K0570m6451m3026K72641l1026j96636p9413K0309m373R1500
7959f05665M66430J149516J460147P4802r72311J33486J850237J999355n30039k508725
7949B517233j118657M63298P56511m22762j320924n43130m47132k38641j6985M82432
7939A11243O68463J52995K90067P91886J001637J745782N070643J5931696M6572293
$$ plain form
8012 154170724 73334048 34147138 19547719 13693354 10863297 9268679 7525957 6019769
8004 6019769 5036734 4862111 4644002 3903032 3342249 3353930 4170822 4977148 4742326 3964460 4012063
7993 4012063 5225833 6677570 6249735 4637380 3504289 3720235 4089004 3618970 2228481 1255426
7983 1255426 867954 451859 174818 138365 353499 83379 -214105 -338107 -307989 -215457 -356790
7972 -356790 -376359 -595615 -609760 -589190 -635641 -678667 -406026 -437052 -633688 -713101 -692792 -697165 -605665
7959 -605665 -139235 1010281 2470428 2545230 1572919 1706405 3556642 5555997 5025958 2517233
7949 2517233 1398576 1861874 2618385 2195623 874699 331569 -115563 -354204 -371189 111243
7939 111243 779706 932701 1222768 2014654 3016291 4762073 9832716 25764412 72336705
7930G2336705Q9154714N0723568o1386434l5331313O4022740J35298704M9522074
7923C64340758j18292539j12371144j3252718N4297739K1971039p9447054o6059354
7916E1186727k4961381r447221l827460k005278j630449j812253j254691k26167k19407
7907E802420p30159q71773j63067N68608J615828J583760O42427j525963j033211J523077
7897G411947Q76607j294006k129641o81078M92947K69118j158437j352970q17739l39942
7887A276806k21952k49242p9682M0711p3756j35175o326J18229j80945j2212O46132
7876A122588M175018K5622577Q7737836N4671868j33136130k8141504o306791j854846
7868C890616q52607p97162k06935k98746l43418j68624j34058M0132k11201q0536J7245
$$ plain form
7930 72336705 161491419 212214987 150828553 115497240 179519980 314818684 364340758
7923 364340758 246048219 133677075 120424357 174722096 196693135 117246081 51186727
7916 51186727 26225346 16778125 12950665 10945387 9314938 7502685 6247994 6021827 5802420
7907 5802420 5072261 4200488 4037421 4606029 6221857 7805617 8448044 6922081 5888870 7411947
7897 7411947 8288554 6994548 4864907 4183829 4676776 4945894 3787457 2434487 1616748 1276806
7887 1276806 1054854 805612 725930 766641 692885 557710 551384 669613 488668 476456 1122588
7876 1122588 5297606 30920183 118658019 173329887 40193757 12052253 5745462 3890616
7868 3890616 3038009 2240847 2033912 1735166 1391748 1223124 1089066 1129198 917997 837461 854706
7857H54706j70768j04798M2236j86797R5166m903j87779K1115J71792K61563J120369
7846A911902J223419j613470q85741l01631p3713O518q040j81369q0756J28783j04665
7835B1237J05312j00947J12461j11436k9085L655k6406L3644k0309j16101J899L1365K382
7822i2329k6088j4303K05285k29505J14461j24472q1123j2411J52686j09691p0324M6079
7810b41735m8397P1017l6480k7650R7798k1762l6088L8611M0572j26479P495m5042N8549
7797b69591J705o5156J06680k4568j00974o9414O2417K7290o8457K4839N9269J31190
7785a84770k12635J70351p3005q5129k1392J03595q4987O56m5687J3367Q186P4973q6050
7772d22527K6288j05119R3541n3221k617o4237R0450r1607J20359j73277J06809k7968
$$ plain form
7857 854706 683938 579140 621376 434579 529745 524842 337063 358178 529970 791533 1911902
7846 1911902 3135321 1521851 636110 334479 260766 267284 259244 77875 -2881 125902 21237
7835 21237 126549 25602 138063 26627 -2458 1197 -25209 8435 -11874 -127975 -126076 -94711 -92329
7822 -92329 -118417 -132720 72565 -156940 -42479 -166951 -248074 -260485 -107799 -217490 -287814 -241735
7810 -241735 -290132 -219115 -255595 -283245 -185447 -207209 -243297 -204686 -164114 -290593 -283098 -328140 -269591
7797 -269591 -267886 -333042 -226362 -250930 -351904 -421318 -358901 -331611 -400068 -375229 -315960 -184770
7785 -184770 -397405 -227054 -300059 -385188 -406580 -302985 -387972 -387316 -433003 -419636 -411450 -336477 -422527
7772 -422527 -396239 -501358 -407817 -461038 -463655 -527892 -437442 -529049 -408690 -581967 -475158 -503126
7760e03126P5612j31466R5698q865q1549J12431m5634j7904J92813k75217R9594P429
7748d80184J07527O7763L45899K40283Q5820k75762K24667K80211M31918k2470m02888
7737F02784l36896n0814J09539j6582l62838k62896q8985m2348m7424o9481M9905k6025
7725e42061K8541L2199o3031l8215M7136o0217L9147N4668k2882l3269k4409J7925l5994
7712f00462p861L1205N0320j00326k8889O8668O3329j38762L0171L3943M7630j49742O5768
7699f35008Q9837j887j14620j9453M7817m53r0252Q7612m7740m6837L0077K9886o6745
7686g37766N2630n6370k2961O1575M5595k009J31808j78211P6761J5515m2080l9224k958
7673f97695K4508R7381j14142J04595j45155R6297j29140K13583j02027L6686Q4181j39980
$$ plain form
7760 -503126 -427514 -558980 -463282 -472147 -553696 -441265 -486899 -504803 -311990 -587207 -487613 -480184
7748 -480184 -372657 -304894 41005 281288 367108 91346 316013 596224 1028142 1005672 602784
7737 602784 265888 215074 324613 308031 -54807 -317703 -406688 -449036 -496460 -565941 -516036 -542061
7725 -542061 -513520 -481321 -544352 -582567 -535431 -595648 -556501 -501833 -524715 -557984 -582393 -564468 -600462
7712 -600462 -608323 -577118 -526798 -627124 -656013 -587345 -524016 -662778 -632607 -598664 -551034 -700776 -635008
7699 -635008 -545171 -547058 -661678 -681131 -633314 -633767 -724019 -636407 -684147 -730984 -700907 -671021 -737766
7686 -737766 -685136 -741506 -764467 -702892 -657297 -659306 -527498 -705709 -628948 -613433 -655513 -694737 -697695
7673 -697695 -673187 -575806 -689948 -585353 -730508 -634211 -763351 -549768 -651795 -615109 -530928 -670908
7661f70908N3848j17045Q994K19905j26667j18273j9180L14245K11578N83135j58370m1791
7649A39471j47858M42466N03061j8126m34816l74309k2094J76520p140n01887j59750
7638d04462k14335l5455l4938m2718n1884R0660J03174p1186j18823L5801Q7173K5931
7626f31062j03379j39552K26647l5389l3685O138K9893r1744n3600J43991j7345j03857
7614h02944L5673n044M4465l1500K3247n6285p4880L2910J59234p8761o7675j1369J2028
7601h20901j3629l5355J1592P751P2449M703M0601j24204P7734O0227R680j43737k0168
7588h73257Q4745J36064m0541O91929J8617n84506j09603j92410Q2086J43496r6203J9663
7576g19920k4671j62536J81031j1080j79618J05455j58504N7730J97414j01729j23728
$$ plain form
7661 -670908 -617060 -734105 -725111 -505206 -631873 -750146 -769326 -455081 -243503 339632 181262 139471
7649 139471 -8387 434079 937140 919014 484198 109889 87795 264315 257175 -244712 -404462
7638 -404462 -618797 -654252 -689190 -731908 -783792 -693132 -589958 -661144 -779967 -744166 -656993 -631062
7626 -631062 -734441 -873993 -647346 -682735 -716420 -710282 -680389 -772133 -825733 -681742 -699087 -802944
7614 -802944 -767271 -772315 -727850 -759350 -736103 -792388 -867268 -834358 -675124 -753885 -821560 -832929 -820901
7601 -820901 -834530 -869885 -858293 -850542 -778093 -773390 -732789 -856993 -779259 -719032 -709352 -853089 -873257
7588 -873257 -788512 -652448 -692989 -1060 17557 -566949 -676552 -868962 -786876 -643380 -739583 -719920
7576 -719920 -744591 -907127 -726096 -737176 -916794 -811339 -969843 -912113 -714699 -816428 -940156
7565i40156L2613N9456k5623M481Q8037k4279p1833Q4216J6610q1998j3335J25085o1770
7552h08496L0969k589k1382N9754q6955J04779n2556p4695l4898P5602p4495J44052r3245
7539h34155L1326p5820R2815j21677M3414L8008p2544R6414j1890J17562j61297O5447
7527g92397q2450R1029m6417J4152j53054R5290K9974N6260p9807Q0049p1635P46j3554
7514h71814J37755j30497K4094M8368j06640j5045m1290J09713P0400o1162j02045Q5969
7502h52194k4555k9482k126M3228J0153j3209n4481J27151J28583j44767m651j0477Q5493
7489g41334j70956j0421Q8066m9595K9337l9884M4446n1379K4425M8232L7195m9758p0410
7476i12036N3879N1842k6199k0947K161q579K218j3878q0061P7840L4887j3222N9248k3777
$$ plain form
7565 -940156 -907543 -848087 -873710 -869229 -781192 -805471 -877304 -793088 -776478 -858476 -871811 -746726 -808496
7552 -808496 -777527 -780116 -801498 -741744 -828699 -723920 -776476 -851171 -886069 -810467 -884962 -740910 -834155
7539 -834155 -802829 -878649 -785834 -907511 -864097 -826089 -898633 -802219 -814109 -696547 -857844 -792397
7527 -792397 -874847 -783818 -830235 -816083 -969137 -873847 -843873 -787613 -867420 -787371 -859006 -858260 -871814
7514 -871814 -734059 -864556 -840462 -792094 -898734 -913779 -955069 -845356 -774956 -836118 -938163 -852194
7502 -852194 -876749 -906231 -908357 -865129 -854976 -868185 -922666 -795515 -666932 -811699 -816350 -826827 -741334
7489 -741334 -912290 -922711 -834645 -884240 -854903 -894787 -850341 -901720 -877295 -829063 -791868 -841626 -912036
7476 -912036 -858157 -806315 -832514 -853461 -851300 -859879 -857661 -871539 -951600 -873760 -838873 -852095 -792847 -816624
7462h16624r373r2549K3171O6560o6390m9127k3188J13602m1661n743k443L1523N6064
7449h16178p3102M9622m5112P9140j48295O7309N4834j00766J32140j09391QM6957q0084
7436i42918o859J43012r0639j7951K4268q0018L8062P7703q4118r0923J12756M5260n090
7423h77455j6905p047K9204j16197R9818J9155j2369J03545p3494m1187o1111R9167l6046
7410h90922N2586N277M8382k02300Q1893O4573j57417Q6552n6421L4457J3986L1156k7205
7397i15403L0600J18148r8357L5152o4421q5198J49282q5724j5465j0226P2011n1519m3602
7384i64722L7050K5153j03497N0543N4136j35611O0188L2421q2487L3173J59413j31551
7372i65791J21018l4987J3129O462k2508J19051k22735N609N8272J07375p5025j6196J0775
$$ plain form
7462 -816624 -825997 -918546 -895375 -828815 -895205 -944332 -967520 -853918 -895579 -901322 -903765 -872242 -816178
7449 -816178 -889280 -839658 -884770 -805630 -953925 -886616 -831782 -932548 -800408 -909799 -909791 -862834 -942918
7436 -942918 -949777 -806765 -897404 -915355 -891087 -971105 -933043 -855340 -939458 -1030381 -917625 -872365 -877455
7423 -877455 -894360 -901407 -872203 -988400 -888582 -869427 -881796 -778251 -851745 -892932 -954043 -854876 -890922
7410 -890922 -838336 -833059 -784677 -986977 -905084 -840511 -997928 -911376 -967797 -933340 -919354 -888198 -915403
7397 -915403 -884803 -766655 -865012 -829860 -894281 -979479 -830197 -915921 -931386 -941612 -869601 -921120 -964722
7384 -964722 -927672 -902519 -1006016 -955473 -901337 -1036948 -976760 -944339 -1026826 -993653 -834240 -965791
7372 -965791 -844773 -879760 -866631 -860169 -882677 -763626 -986361 -980752 -922480 -815105 -890130 -906326 -895551
7359h95551M983j4406J4539l5831o2742J32658q1291n8698l1826J0763o489m4999J93189
7346h75701j48544J14682l7110n6798Q8610N1199J28662j86175k0276o620Q803J18763
7334h20505K0419k36515p598J29008q3016J27497L2518j32495J9216o7383J19045o9925
7322i69734j9493J51833j59325R7370m1033O8667P120M4096j68392K3229Q225R96k7834
7309i84275J09337l4973l7694q4868P3421P5453j38600P829Q1991O1033j86119J25537
7297i31928o7687J56982m2393m3605J4893j9858J7969n1427r4597J94987n7921o1498
7285i86083j24093J63335K1541p2448P5702k3528N8252j369o2958n4577O0824M5319n9926
7272i60009J6735J6681J0978N791P7692j24947r0930R4020m3014l5002L1691M677r1927
$$ plain form
7359 -895551 -890568 -904974 -890435 -926266 -989008 -856350 -937641 -996339 -1028165 -1017402 -1023891 -1068890 -875701
7346 -875701 -1024245 -909563 -946673 -1003471 -914861 -863662 -735000 -921175 -941451 -948071 -939268 -820505
7334 -820505 -800086 -1036601 -1044199 -915191 -998207 -870710 -838192 -970687 -951471 -1018854 -899809 -969734
7322 -969734 -989227 -837394 -996719 -899349 -940382 -871715 -864595 -820499 -988891 -965662 -957437 -956441 -984275
7309 -984275 -874938 -909911 -947605 -1032473 -959052 -883599 -1022199 -1014370 -932379 -871346 -1057465 -931928
7297 -931928 -999615 -842633 -885026 -928631 -913738 -933596 -915627 -967054 -1061651 -866664 -924585 -986083
7285 -986083 -1110176 -946841 -925300 -997748 -922046 -945574 -887322 -888691 -951649 -1006226 -945402 -900083 -960009
7272 -960009 -943274 -926593 -915615 -909824 -832132 -957079 -1048009 -953989 -997003 -1032005 -1000314 -995637 -1087564
7259a087564P2797l6515P6595K807q74n103n3042O611O9325P4189k387J8125o0187m6860
7245i72083R9555j38037K8258j8632q409J10865L9132n8992O3510j03990r6464l935R4768
7232i64454P135K9238P1343n1681n5337J46631j13182j14054j1400J22330r4344k2096
7220a049871R2979j01833J42669j8360q1343k0886M6857O1266r0398J15468L0069n3979
7208i27362p6702N3052k7707k0244o7775J08799n9959L0354M9318m7694j02815o5180
7196a153915K01310L8733q3226J0157K162j41171J03934n821N1116L2963J54469k64507
7184a053796Q8764m7238L4097O649j5621L400n1543n1556J70359p2513o0872M8617O401
7171i94852K8559n639P7597n3667m4717J11533N2967j4165j45692o1977k2364n4306J77425
$$ plain form
7259 -1087564 -1014767 -1051282 -974687 -971880 -972754 -977857 -1030899 -1024288 -954963 -880774 -883161 -865036 -925223 -972083
7245 -972083 -872528 -1010565 -982307 -1000939 -1009348 -898483 -859351 -918343 -854833 -958823 -1055287 -1059222 -964454
7232 -964454 -957319 -928081 -856738 -908419 -963756 -817125 -930307 -1044361 -1055761 -933431 -1027775 -1049871
7220 -1049871 -956892 -1058725 -916056 -934416 -1015759 -1036645 -989788 -928522 -1018920 -903452 -873383 -927362
7208 -927362 -1004064 -951012 -978719 -998963 -1066738 -957939 -1017898 -987544 -938226 -985920 -1088735 -1153915
7196 -1153915 -952605 -913872 -997098 -986941 -984779 -1125950 -1022016 -1027837 -976721 -943758 -789289 -1053796
7184 -1053796 -965032 -1012270 -978173 -971524 -987145 -983745 -1035288 -1086844 -916485 -988998 -1049870 -1001253 -994852
7171 -994852 -966293 -971932 -894335 -948002 -992719 -881186 -828219 -842384 -988076 -1050053 -1072417 -1126723 -949298
7158i49298l1281l8672j8442p14O5013m9313M9568m7123j7023K6404n7411R8099j57569
7145a127762j8268Q7849J76987j37541N0267l3735R5197q3772l8138j7182Q0215m4868
7133a010751J3151j47656J30846q8443Q9598K1465n9107J36974j06422J27418J18451
7122g74476j05464j5j31905J81760J56982L50051L38502m63295j45413N46947J020470
7111I74144k26726q10331L40703M97886j63912j97000J91114o15961j56612L66003P83821
7100I83129n83601K7224O11713j36452n19310N35702R13578j238116o64711j10359P49392
7089E68189n56286p78963n5254K3822J2685j41114J1549N8658q2999J03388q2629q7951
7077a006905J05419j70649N9295j5276r361J31434p0112p0497L485N315P787K524k6560
$$ plain form
7158 -949298 -980579 -1019251 -1037693 -1038407 -973394 -1022707 -973139 -1020262 -1037285 -1010881 -1068292 -970193 -1127762
7145 -1127762 -1146030 -1058181 -881194 -1018735 -968468 -1002203 -907006 -990778 -1028916 -1046098 -965883 -1010751
7133 -1010751 -997600 -1145256 -1014410 -1102853 -1013255 -991790 -1050897 -913923 -1020345 -892927 -774476
7122 -774476 -879940 -879955 -1011860 -830100 -673118 -323067 15435 -447860 -593273 -46326 974144
7111 974144 747418 -62913 277790 775676 611764 414764 605878 -10083 -166695 199308 983129
7100 983129 399528 426752 1038465 902013 382703 918405 1831983 593867 -70844 -181203 568189
7089 568189 11903 -767060 -822314 -798492 -785807 -926921 -915372 -856714 -939713 -836325 -918954 -1006905
7077 -1006905 -901486 -1072135 -1012840 -1028116 -1037477 -906043 -976155 -1046652 -1043167 -1037852 -1030065 -1027541 -1054101
7064a054101r348M3715p6828O1875m8534Q7703p4419N2799M137j70347K00340m6748j07207
7051a136963O1343K5160j42992J50919n2738P4692J7209l8860j214J2457k9452L2990
7039a027449j45903R5819P894o596o1885J95034L1561p2977k9149j49497L5251J23579
7027a004318j52901P8767N8491o5140q280R098O8791m0668M8486j14624J34839r6814L8282
7014a045991m9124M5927N6841j11672L6377O5212l1130K9871p8949L8847N034P6020l7421
7001a000158m969M64187P19619j87823l71236J150347J179371j116279m91323J088690
6991A430426l45268j128008J39855O94903q13259m40718N21412N35199l81844J53523
6981C66221J142259n47782q39603R03126O46803j475378p02657M69695j13711o45393
$$ plain form
7064 -1054101 -1063449 -1019734 -1096562 -1034687 -1083221 -995518 -1069937 -1017138 -1013001 -1183348 -983008 -1029756 -1136963
7051 -1136963 -1075620 -1050460 -1193452 -1042533 -1095271 -1020579 -1003370 -1042230 -1043444 -1030987 -1060439 -1027449
7039 -1027449 -1173352 -1077533 -1069639 -1076235 -1138120 -943086 -911525 -984502 -1013651 -1163148 -1127897 -1004318
7027 -1004318 -1157219 -1078452 -1019961 -1085101 -1093381 -1084283 -1015492 -1056160 -1007674 -1122298 -987459 -1084273 -1045991
7014 -1045991 -1095115 -1049188 -992347 -1104019 -1067642 -1002430 -1033560 -1003689 -1082638 -1043791 -1038757 -962737 -1000158
7001 -1000158 -1005127 -540940 178679 -9144 -380380 769967 1949338 833059 341736 1430426
6991 1430426 1085158 -42850 97005 791908 -21351 -462069 59343 594542 212698 366221
6981 366221 1508480 960698 121095 1024221 1671024 195646 -507011 -37316 -151027 -796420
6971g96420k40510o500J08666r9854j29583N8327R2978Q6510K5073j26867J02275M6781
6959h79124Q8997j10964K78042N26793M019381J3725034J0906759j9919249k008163
6950F627506J2318776J0458869k1505978o379096j325074m86098j86948M9112j59818
6941e88749j63377l9570M2393j61793N6096M9866J06473K40276K41184m18184j11918
6930g47303K83280K23666l02546R4031K30018j80148j66584J18905R0272k39756k32175
6919h28340L6367R1039O3334K53090l36462j35441P2748L17921m7918J77761L79563
6908D3662L236519J2618468K3673574j7549137j3779587R551442K2479257j7853538
6900B2420660j7915971k843328r86988n77870j88463k80269j80672r627j2652K1639j49662
$$ plain form
6971 -796420 -1036930 -1043430 -934764 -1034618 -1164201 -1105874 -1012896 -926386 -901313 -1028180 -925905 -879124
6959 -879124 -790127 -901091 -623049 -96256 3923125 17648159 28554918 8635669 6627506
6950 6627506 18946282 29405151 7899173 1520077 195003 -291095 -478043 -428931 -588749
6941 -588749 -752126 -791696 -749303 -911096 -855000 -805134 -698661 -458385 -217201 -635385 -747303
6930 -747303 -464023 -240357 -542903 -448872 -218854 -399002 -565586 -446681 -356409 -596165 -828340
6919 -828340 -791973 -700934 -637600 -384510 -720972 -856413 -783665 -465744 -513662 -335901 43662
6908 43662 3280181 15898649 39572223 22023086 8243499 17794941 40274198 22420660
6900 22420660 4504689 1661361 674373 96503 -91960 -372229 -552901 -562528 -575180 -553541 -703203
6889g03203o3551L5811k09287J33830k4333m2831l2920J1100M7565K55228K50167o152
6877c48576k99050L54931K22048k99659m50876j4023K3657l8830q90j36369M6345q9244
6865a030536J0873k7152R6896j3695m7612N3481L558J8628Q9613o8600O5290j44236J43435
6852h50057j58789J42473P5070l7191P512j5881r1627J1667j06159L396j14588J9741N4683
6839a059750M4725j5879J5326j14205N0140J61457j41574J2340j4092k4142O9007p7118
6827a093765j5277J83157j31993j3089j7833R4908n6353o9045M0486P0222j95304O3869
6815a140017l2339l3190N0990Q4888q6497R4254Q628o7287m3466M3800O4873j02812l8598
6802a196773J00865Q7410j18494j75909o1105R5385R9167j6755j00021m0904K63087j92936
$$ plain form
6889 -703203 -766754 -730943 -940230 -806400 -830733 -873564 -906484 -895384 -847819 -592591 -342424 -348576
6877 -348576 -647626 -292695 -70647 -370306 -821182 -835205 -811548 -850378 -851268 -987637 -941292 -1030536
6865 -1030536 -1019663 -1046815 -949919 -963614 -1011226 -957745 -954187 -935559 -845946 -914546 -849256 -993492 -850057
6852 -850057 -1008846 -866373 -791303 -828494 -820982 -836863 -928490 -916823 -1022982 -1019586 -1134174 -1114433 -1059750
6839 -1059750 -1015025 -1030904 -1015578 -1129783 -1079643 -918186 -1059760 -1047420 -1061512 -1085654 -1016647 -1093765
6827 -1093765 -1109042 -925885 -1057878 -1070967 -1088800 -993892 -1050245 -1119290 -1078804 -1008582 -1203886 -1140017
6815 -1140017 -1172356 -1205546 -1154556 -1069668 -1156165 -1061911 -1053283 -1120570 -1164036 -1120236 -1055363 -1158175 -1196773
6802 -1196773 -1095908 -1008498 -1126992 -1302901 -1364006 -1268621 -1169454 -1186209 -1286230 -1327134 -1064047 -1256983
6790a256983n3549J08213m2402Q654p1557R8163k7608J0860q5608Q5767n2605N7640p6458
6777a297473M8540o1693l0658J26146j07516N3495k03029J57546L3456j23265J0028k504
6765a396927Q5201O7283r4920Q5674j76603L5546J43118o6929J9936m6162O8634l6649
6753a312798j8814L5172j61888M6183n0956j306R199J62659p8254k817J8509j7572O8360
6740a304323j72674K5105J10126M7815J5n6718j64578j6152J49787r1042M872J17008
6728a350759K57999M45701L02942O5309j52590l28487k85546j99687J97337K44204K57864
6717e45713L26256j24188l04189k83952k10772L81534N28631M24361J04938j22251m05655
6706b31000l72714r2012O30098J381332L935556J0691893J9004361K0101400J3551760
$$ plain form
6790 -1256983 -1310532 -1202319 -1244721 -1236067 -1307624 -1209461 -1237069 -1226209 -1311817 -1226050 -1278655 -1221015 -1297473
6777 -1297473 -1248933 -1310626 -1341284 -1215138 -1322654 -1269159 -1472188 -1314642 -1281186 -1404451 -1394423 -1396927
6765 -1396927 -1311726 -1244443 -1339363 -1253689 -1430292 -1394746 -1251628 -1318557 -1298621 -1344783 -1276149 -1312798
6753 -1312798 -1331612 -1296440 -1458328 -1412145 -1463101 -1464407 -1455208 -1292549 -1370803 -1373620 -1355111 -1372683 -1304323
6740 -1304323 -1476997 -1451892 -1341766 -1293951 -1293936 -1350654 -1515232 -1531384 -1381597 -1472639 -1467767 -1350759
6728 -1350759 -1092760 -647059 -344117 -278808 -431398 -759885 -1045431 -1245118 -1047781 -803577 -545713
6717 -545713 -219457 -343645 -647834 -931786 -1142558 -761024 -232393 191968 296906 174655 -231000
6706 -231000 -603714 -695726 -65628 1315704 5251260 15943153 34947514 55048914 68600674
6697F8600674j996897j6236750j8842083j4264204m14281J4069679J9938010J6490731
6689F7344879M630830j2248556j7250467j1693667N046501J9420360J8410565P209802
6681H0870247j1809477k0995284k0052886r806437P818941J9939100K1067435J3091293
6673H0122932m578831j9542321k1910790j8288058q226484k884598j512155o61794j23735
6664B394166K97372K15223R7446K588107J0828138J9937011j4750964j5322080k686546
6655C597873p07906l09380n49638q62769m62960K11493M38459R66325K229888M224831
6645H776216L885453L066692o37131l797622m078393l198371R80480L455601L217669
6636A1670594K776456l59860k784474j657618O143541K6897071J9108122k1186605m407119
$$ plain form
6697 68600674 66603777 50367027 31524944 17260740 16846459 30916138 50854148 67344879
6689 67344879 71975709 59727153 42476686 30783019 35829520 55249880 73660445 80870247
6681 80870247 69060770 48065486 28012600 18206163 26025104 45964204 67031639 80122932
6673 80122932 75544101 56001780 34090990 15802932 7576448 4691850 3179695 2517901 2394166
6664 2394166 2691538 2906761 3004207 5592314 16420452 36357463 21606499 6284419 3597873
6655 3597873 2889967 2580587 2030949 1168180 705220 916713 1355172 2321497 4551385 8776216
6645 8776216 12661669 15728361 15091230 11293608 7215215 4016844 4997324 8452925 11670594
6636 11670594 14447050 14087190 11302716 9645098 15788639 42685710 61793832 40607227 36200108
6627C6200108p705922q515637q401320k635806O324172R536876O908828K505365o780040
6618B7436624q357176r440445n200164j503820M55111M251397J3773457J680797j6592727
6609F503054l591974k98228K200083O206083Q426920Q697518L795838j996304p641926
6600B2301064q574261m968918J903374O847721Q606901M587267p17015o526730q596939
6591A4862464n091618m56580K622311J976176k22959j800422m96240Q601041J5979765
6582C5973938j3884970p990787J259351o8617j864543m292637m227726k427765j230134
6573A246110m63203k21571k06267q656N8622J75051j36967k00142j39843k48333O5258
6562g9941L5664r4329r8876J84663j68109Q0750J09604L9178r7229j37979j25950J63753
$$ plain form
6627 36200108 28494186 19978549 11577229 8941423 15265595 24802471 31711299 34216664 27436624
6618 27436624 19079448 9639003 4438839 2935019 3390130 7641527 21414984 23095781 6503054
6609 6503054 2911080 2612852 4812935 11019018 19445938 28143456 31939294 29942990 22301064
6600 22301064 13726803 8757885 10661259 17508980 26115881 30703148 29986133 23459403 14862464
6591 14862464 9770846 9314266 11936577 13912753 13689794 11889372 11393132 19994173 35973938
6582 35973938 22088968 14098181 15357532 15288915 13424372 9131735 4904009 2476244 1246110
6573 1246110 782907 561336 355069 346413 405035 580086 443119 242977 103134 -145199 -79941
6562 -79941 -44277 -138606 -237482 -52819 -220928 -140178 -30574 8604 -88625 -226604 -352554 -188801
6550a88801j28549j19420K5846r8692p5931N4157k1556j18371Q6465j28900l1778j5195
6538g60725J94612n2958j43653K7308n8965N2355L51445j19876j56101k8417M9927P8369
6526e66679j39181K6692P5908j72781M0862m6o706q4623p415P9150K2496j88584J53361
6513g67546j05564j5815J01588o6087r7108L2299J22142K794k8923L1748R3006o1158
6501g58624j24268M2394R7241O1611j7268j67596K958n9055j905m2813j5622l4896L9763
6488i78080L3644O1956j3468M7801n3509M312J03081p0267j4473r2622R1635l7694J84740
6475g32944J63851L87643J056819J169793R98863L32954k31089r45606q81511m68950
6465H49823N60964Q91859Q48205K30887l45852n85471r14531K80619J566101J849959
$$ plain form
6550 -188801 -317350 -436770 -410924 -509616 -585547 -531390 -552946 -671317 -584852 -713752 -745530 -760725
6538 -760725 -566113 -619071 -762724 -735416 -794381 -742026 -390581 -510457 -666558 -694975 -645048 -566679
6526 -566679 -705860 -679168 -603260 -776041 -735179 -735225 -741931 -826554 -833969 -754819 -732323 -920907 -767546
6513 -767546 -873110 -888925 -787337 -853424 -950532 -918233 -796091 -793297 -822220 -790472 -697466 -758624
6501 -758624 -882892 -840498 -743257 -681646 -698914 -866510 -863552 -922607 -924512 -967325 -982947 -1017843 -978080
6488 -978080 -944436 -882480 -895948 -848147 -901656 -897344 -794263 -864530 -879003 -971625 -879990 -917684 -732944
6475 -732944 -569093 -181450 875369 2045162 3044025 3376979 3145890 2200284 1318773 849823
6465 849823 1410787 2302646 3150851 3381738 3035886 2450415 1535884 1816503 3382604 5232563
6455E232563J388969J35765q79120j762935j395748l36556J385052J745563J475725J22056
6445G111334r78296j849743j778970j371432m17757K3364M2002L7116k00476k90673m45887
6434a19418n6312M8505L45470K14383P1470j28272m58897l14378j01458L00773M73533
6423B75399L99700M22421j730P4405Q33389K197378K653985K882475L560486Q178731
6413B1476639J8426421K1710817J7139550L191214j4349983k0545351j5172925M37171
6405C2313553J7203569K0501724J3448223k393944j8256337k1990635j3461258M005272
6397C1370167J7831346J7261985R928029o928640j7960784j7618310q109010Q680051
6389C4454834J8578853J6365630N242159j0855757k1133444j9452145j2413385m446787
$$ plain form
6455 5232563 6621532 6757297 5878177 4115242 2719494 2382938 3767990 5513553 6989278 7111334
6445 7111334 6133038 4283295 2504325 1132893 715136 738500 780502 817618 617142 326469 -119418
6434 -119418 -175730 -127225 218245 432628 504098 375826 -83071 -397449 -498907 -198134 275399
6423 275399 675099 1097520 1095790 1170195 2003584 4200962 6854947 9737422 13297908 21476639
6413 21476639 39903060 61613877 78753427 81944641 67594658 47049307 31876382 32313553
6405 32313553 49517122 70018846 83467069 81073125 62816788 40826153 27364895 31370167
6397 31370167 49201513 66463498 76391527 69462887 51502103 33883793 25774783 34454834
6389 34454834 53033687 69399317 74641476 63785719 42652275 23200130 10786745 6339958
6381F339958j950266j108077l75711k16957R1415K31112m50533l57198o09031m08735q1107
6370A104870J26930L66450J476j18056l13943m00706o9655l4613L09924L47400k6579
6359A293498j79767K402n08683l55862j89358J056k11035l3600o9829n0760k749n5146
6347c59833Q1509L0976P1076R8937L10143L4056m17161K17273R1053P845l70889k4770
6335b29785J7112p828q9802j73533K54746j59351j22134m4750Q0998j39619k7171P1779
6323e69338j4634J29298j32606J04072J56853R69371N357298J7983349J5474073k5984131
6313A3473605l602467J5120393J4702936k6987157r402062j657648p29248m40976l89663
6304H7713k33718k5787J06128k18784j06721K699j21719J99440J4475j40695J28045Q3084
$$ plain form
6381 6339958 4389692 3281615 2905904 2688947 2780362 3011474 2560941 2203743 1594712 1185977 1104870
6370 1104870 1231800 1598250 1599726 1481670 1167727 767021 697366 662753 972677 1320077 1293498
6359 1293498 1113731 1116133 607450 251588 62230 63286 -147749 -181349 -251178 -301938 -304687 -359833
6347 -359833 -278324 -247348 -176272 -77335 232808 266864 -150297 66976 158029 165874 -205015 -229785
6335 -229785 -212673 -220501 -310303 -483836 -229090 -388441 -510575 -555325 -474327 -613946 -641117 -569338
6323 -569338 -583972 -454674 -587280 -483208 -326355 643016 6000314 23983663 39457736 13473605
6313 13473605 9871138 24991531 39694467 12707310 3305248 1647600 918352 477376 87713
6304 87713 -146005 -171792 -65664 -284448 -391169 -388470 -510189 -310749 -296274 -436969 -308924 -225840
6292b25840K7664O8137K42700K281927Q869380J9037888p061332j5780374N411614
6283A2871764J7792429p572787j8572907l077528p00008n69270j73097j19150j21573
6274b42127j41006J06262m691J4835j72297O0120o7358J57733q6236j92158J97205J43631
6262b26087j17140p4870K88414J89094k98578m3694K00597J00589l50741j62418k6107
6251e20941M7268j66118N4873j94824J79397n5212j6830m560j2539O6850L6687o0141q3522
6238g29612P3539P2090M860j62991L2551P9360m656m5849R6182n2376K7839o9219J24243
6225e54039j02546Q4788j7004m1354j70039J57551k5963o917l3542M8243J14708j54864
6213g00978N3206j20920n771K5639J8141M3791l2129q3508P6695n1454R4308r2541J20394
$$ plain form
6292 -225840 -198176 -130039 112661 2394588 11263968 30301856 23240524 7460150 12871764
6283 12871764 30664193 23091406 4518499 1440971 740963 171693 -1404 -120554 -242127
6274 -242127 -383133 -276871 -281562 -266727 -439024 -378904 -446262 -288529 -374765 -566923 -369718 -226087
6262 -226087 -343227 -418097 -129683 59411 -239167 -282861 -82264 18325 -332416 -494834 -520941
6251 -520941 -473673 -639791 -584918 -779742 -600345 -655557 -672387 -676947 -689486 -622636 -585949 -646090 -729612
6238 -729612 -656073 -583983 -579123 -742114 -709563 -630203 -634859 -680708 -584526 -636902 -609063 -678282 -554039
6225 -554039 -656585 -571797 -588801 -630155 -800194 -642643 -668606 -675523 -709065 -660822 -546114 -700978
6213 -700978 -647772 -768692 -774463 -748824 -730683 -686892 -719021 -802529 -725834 -777288 -682980 -775521 -655127
6200f55127p9968J7613n3041Q4242j00416R5971k3142r9276J05083M8743j14202N8402
6188g15118p9624M8897J55481q7393j63532R4844O5109j13468J28966Q1315J24149J47768
6176c12606l398r047j14953j37395J3119m8177J91084M2529J13686K8811k20360j39590
6164e96297p3806J39627J94680J19500L3104j18243k22721j88107J0048K11808O7178L4091
6152c89138k236m2172j02601j16581M6123o6151m1139K9581m2253J6508l6935n7742J88990
6139f15746k38690J24182R138j32329J0482O3298k2759p1846L9695m4655J69278M4342
6127f65610r4770N667L4884P4585o2047n7911j08091R2326q0629J33165n401j13073K854
6114h44051M4790K9135J7273j2079j15980J09998N0503l6624o3064j1195Q9579k0376k263
$$ plain form
6200 -655127 -735095 -717482 -770523 -686281 -786697 -690726 -713868 -813144 -708061 -659318 -773520 -715118
6188 -715118 -794742 -745845 -590364 -677757 -841289 -746445 -681336 -794804 -665838 -584523 -460374 -312606
6176 -312606 -316004 -325051 -440004 -577399 -564280 -612457 -421373 -378844 -265158 -236347 -456707 -596297
6164 -596297 -670103 -530476 -335796 -216296 -183192 -301435 -524156 -712263 -702215 -490407 -423229 -389138
6152 -389138 -391374 -433546 -536147 -652728 -606605 -672756 -713895 -684314 -726567 -710059 -746994 -804736 -615746
6139 -615746 -854436 -730254 -721116 -853445 -842963 -779665 -802424 -874270 -834575 -879230 -709952 -665610
6127 -665610 -760380 -754713 -719829 -645244 -707291 -765202 -873293 -780967 -861596 -728431 -733832 -846905 -844051
6114 -844051 -799261 -770126 -752853 -764932 -880912 -770914 -720411 -757035 -820099 -831294 -741715 -762091 -764354
6101g64354p495O5981p0050k5686J6072p0693J31928K2358O0303j78461m5902m5723M4418
6088h67304J85667J6107k00266j08266J01601L4004j12632J45532j54876J06996k4017
6077h77454Q3676j27044O9197J19093j50130J88824k00113Q8193Q6100r1227J48745J38639
6065e23501k14672q8546J3166J2996J86271p3991j21730J3918k5991j66904J26895k5654
6053h87743K5108l5092J05600M6341j8477j64236J48623l8837M7996j26709j0971K09686
6041f98711j49283Q388Q4090q5610l1158j20521P5960J35089j26561M5463l276K7117n4715
6028h93728Q1898m1805J09289n4759p7050L7659n3815N6403m4690M1417p93p2372M6454
6015h65892J42508j52128P6689j36699J40774j11415J3555l7343l7787N7906J5977o4428
$$ plain form
6101 -764354 -771849 -705868 -775918 -801604 -785532 -856225 -724297 -701939 -641636 -820097 -865999 -911722 -867304
6088 -867304 -681637 -665530 -865796 -974062 -872461 -838457 -951089 -805557 -960433 -853437 -877454
6077 -877454 -793778 -920822 -851625 -732532 -882662 -693838 -893951 -805758 -719658 -810885 -662140 -523501
6065 -523501 -738173 -826719 -813553 -800557 -614286 -688277 -810007 -796089 -822080 -988984 -862089 -887743
6053 -887743 -862635 -897727 -792127 -745786 -764263 -928499 -779876 -818713 -770717 -897426 -908397 -698711
6041 -698711 -847994 -839606 -755516 -841126 -872284 -992805 -916845 -781756 -908317 -862854 -866130 -839013 -893728
6028 -893728 -811830 -853635 -744346 -799105 -876155 -838496 -892311 -835908 -880598 -839181 -839974 -912346 -865892
6015 -865892 -723384 -875512 -798823 -935522 -794748 -906163 -892608 -929951 -967738 -909832 -893855 -958283
6003i58283M8395r080l1868J01360k3539l13j2750J2826Q5026J27691l56849P0629J05787
5990h40968n9560j1488J24835j03560j27443Q4284J347J02193Q729p9830O0372k298q8126
5977i31513M5493p7599N9191N8945k5295k4318J47138j87392Q8081m2023N4490o5601P7292
5964h23111l414J20291r8429L6782Q6564J0711l0556j1017K19223O43973N21206m4646
5952F27577j42356m14483Q5463J358820J143040r0611n79325j275364n0031J131120M18638
5941B212488p3796m86702K63348N52465j8225n58148r92928J267697L247905J966100
5931G380204j77305j622796k780978J428983L778582P75625q07573l655735j460642
5922B858365J085324J8151o43981q26652J270997M74372K2448Q30319K845535J092700
$$ plain form
6003 -958283 -909888 -918968 -950836 -849476 -873015 -873328 -886078 -873252 -788226 -660535 -1017384 -946755 -840968
5990 -840968 -900528 -912016 -787181 -890741 -1018184 -933900 -932553 -830360 -821631 -901461 -841089 -843387 -931513
5977 -931513 -886020 -963619 -904428 -845483 -870778 -895096 -747958 -935350 -847269 -889292 -834802 -900403 -823111
5964 -823111 -826525 -706234 -804663 -767881 -681317 -670606 -701162 -712179 -492956 151017 672223 627577
5952 627577 485221 70738 156201 1515021 2658061 2567450 1988125 712761 662730 1793850 2212488
5941 2212488 2138692 1651990 1915338 2467803 2449578 1891430 898502 2166199 5414104 7380204
5931 7380204 7202899 5580103 2799125 4228108 8006690 8782315 7974742 4319007 2858365
5922 2858365 3943689 3961840 3317859 2491207 3762204 4236576 4259024 5089343 7934878 9027578
5912I027578j518422k215011k90779K110942N70167j162503k769785j702614K74302L94667
5902B718542j72481o37243q65758L32692Q48730N4462m06037n80667O08658Q79377K47677
5891C027952o89033j260503o04213L62243M5168j8112p13869m96027j24730M9007j74102
5880e96219n5461L9967r3504k9978m93J13597m2898p74r6688J0619R0635o8127J63171
5867e66153j56932J14057j27897o2288R0097l139p149p5972J22612j87502j2569Q5759
5855g87076n1633n2650M2661L5778J10057j57525L6126l6663j6975L1796r4242O3791O7205
5842h09350k1146K8775j0602l1253J02146m6710K3540k9144n7992Q2086j42066N3622M5641
5829h12453q866J6351j41796j26472K75607p1319O7996k5780l129J13871j32298o8843
$$ plain form
5912 9027578 7509156 5294145 5003366 7114308 7684475 6521972 3752187 2049573 2323875 2718542
5902 2718542 2546061 1908818 1043060 1375752 2224482 2278944 1872907 1292240 1900898 2780275 3027952
5891 3027952 2338919 1078416 474203 836446 881614 863502 149633 -346394 -471124 -422117 -596219
5880 -596219 -651680 -611713 -705217 -735195 -735688 -622091 -664989 -665763 -762451 -751832 -661197 -729324 -566153
5867 -566153 -723085 -609028 -736925 -799213 -709116 -712255 -719404 -795376 -672764 -860266 -872835 -787076
5855 -787076 -838709 -891359 -848698 -812920 -702863 -860388 -824262 -860925 -877900 -846104 -940346 -876555 -809350
5842 -809350 -830496 -801721 -812323 -843576 -741430 -788140 -764600 -793744 -851736 -769650 -911716 -858094 -812453
5829 -812453 -821319 -804968 -946764 -1073236 -797629 -868948 -800952 -826732 -829861 -715990 -848288 -917131
5817i17131n4604N2023J55242r6723j5862J8003q9596N4327M4620K077o7929k2746j28018
5804a066317J62752J3193j15389J46665l3884N4793q959K38l2886j9927n4556J87812
5792g66465j04360l6362P1860j6370p564j4498r7411N2050N3024j8564R307J0623O5973
5779g98757k6981k2373n4465n6742J74221j17193J17061j17947J2928P888K8753r2299
5767i45906N8074l2291K6985k6158n4915l0157K11353n2940p5756M4481N9360P591j35362
5754i45641O1783J14228j03114m9654q8421J17932O0374j17681Q6416m8015P4249N422
5742h32122J7255k7665l251j38880P9558L0126q5160O8859j36069P8747K9200j1445l1502
5729i62349P6967m7830J4409J03291j1882R111j15025j20002K06152m2437J29709j70063
$$ plain form
5817 -917131 -971735 -919712 -764470 -861193 -877055 -859052 -948648 -894321 -849701 -847624 -915553 -938299 -1066317
5804 -1066317 -903565 -890372 -1005761 -859096 -892980 -838187 -847146 -846908 -879794 -899721 -954277 -766465
5792 -766465 -870825 -907187 -835327 -851697 -859261 -873759 -971170 -919120 -866096 -884660 -875353 -864730 -798757
5779 -798757 -825738 -848111 -902576 -959318 -785097 -902290 -785229 -903176 -890248 -882360 -853607 -945906
5767 -945906 -887832 -920123 -893138 -919296 -974211 -1004368 -793015 -845955 -921711 -877230 -817870 -810279 -945641
5754 -945641 -883858 -769630 -872744 -922398 -1010819 -892887 -832513 -950194 -863778 -911793 -837544 -832122
5742 -832122 -814867 -842532 -845783 -984663 -905105 -874979 -960139 -891280 -1027349 -948602 -919402 -930847 -962349
5729 -962349 -885382 -933212 -918803 -815512 -827394 -818283 -933308 -1053310 -847158 -889595 -759886 -929949
5717i29949J8303O4680q7135M3469m7407P701J11676M5569j24833R864K4186J35847j31896
5704h59925O3493r4403q2215J68967j13612n4o7708J40258M8602n4516j5454j15217l8869
5691a020653Q3482J62392o1577k08913K27516m2579j5971j00273L5898N1170r3233R0662
5679h92079J09360j40823J1500l0611J14729p1139M9198j56419K5565J5897J2071r333
5667i62084Q9950o6394Q50N1643J9617K4168o90n4427J3333N8499j2553m0818R7803j32075
5653i13178O0221m5207j6388j3340m1323q692R0189k9434m5892J3570q506L7990n1230
5640i71220P5686r2516K3472q8854R9313K438J03460m6249M1619j5882j11435P2610P2922
5627h34636j21262P6807J4564J7765p2260q688N0785j53684K8206J977O871R4172k7319
$$ plain form
5717 -929949 -911646 -846966 -934101 -890632 -938039 -930338 -818662 -773093 -897926 -888062 -863876 -728029 -859925
5704 -859925 -796432 -890835 -973050 -804083 -917695 -917749 -985457 -845199 -796597 -851113 -866567 -981784 -1020653
5691 -1020653 -937171 -774779 -836356 -1045269 -817753 -860332 -876303 -976576 -940678 -889508 -982741 -892079
5679 -892079 -782719 -923542 -912042 -942653 -827924 -899063 -849865 -1006284 -980719 -964822 -952751 -962084
5667 -962084 -872134 -938528 -937678 -886035 -866418 -842250 -842940 -897367 -884034 -825535 -838088 -878906 -781103 -913178
5653 -913178 -852957 -898164 -914552 -927892 -969215 -977907 -887718 -917152 -963044 -949474 -957980 -919990 -971220
5640 -971220 -895534 -988050 -964578 -1053432 -954119 -951681 -848221 -894470 -852851 -868733 -980168 -907558 -834636
5627 -834636 -955898 -879091 -864527 -846762 -919022 -927710 -876925 -1030609 -1002403 -1000426 -993555 -899383 -926702
5614i26702J37625k3670m4769m3388O6793j60178N840J46780r0558m5178K2728R4149m3947
5601i04475J04677r5975q740k3685j1038P7216k25225J30821L170K8136p076q1495N5262
5588i58427m1218L8509k8892L2773M5499l5566m9195J49106o6722Q3630j60231P3628P8372
5575h38734j01717k1202J04566m4996p9044m987J10620J1034k5202J03566n4854j03155
5563i44105o502J28905j73476J00402p1068l4902N7203n195q1963O0526K6937j15523K1064
5550a037697L4301O551q275J6588Q8932R197n7697m130l1311n9941J83491L9756q4071
5537i04306j22177J07279J8281p7361P3366N8202n807j17277R2822O0438j14334r1143
5525a022017N5287J86437j96768O0996R8226j51021M8550j35719J34019p9740n9310L0665
$$ plain form
5614 -926702 -789077 -812747 -857516 -900904 -834111 -994289 -988449 -841669 -932227 -977405 -954677 -860528 -904475
5601 -904475 -799798 -895773 -904513 -928198 -939236 -862020 -1087245 -956424 -953254 -925118 -932194 -1013689 -958427
5588 -958427 -999645 -961136 -990028 -957255 -911756 -947322 -996517 -847411 -914133 -830503 -990734 -917106 -838734
5575 -838734 -940451 -961653 -857087 -902083 -981127 -986114 -875494 -864460 -889662 -786096 -840950 -944105
5563 -944105 -950607 -821702 -995178 -894776 -965844 -1000746 -943543 -948738 -1030701 -970175 -943238 -1058761 -1037697
5550 -1037697 -1003396 -996845 -1005120 -988532 -899600 -890403 -948100 -952230 -983541 -1043482 -859991 -820235 -904306
5537 -904306 -1026483 -919204 -900923 -978284 -904918 -846716 -852523 -969800 -876978 -816540 -930874 -1022017
5525 -1022017 -966730 -780293 -977061 -916065 -817839 -968860 -920310 -1056029 -922010 -1001750 -1061060 -1030395
5513a030395j2544J48060p7145N1826J2701p7574P0859o2157J11022j65430Q8095P5876
5501h66806M4750q5119j008j5455j2733M8468j35453M8542J03799j48361J0917J06085j517
5488i03891L6669j07281K5260j3973p7548J37216j3091O405R1657J5452J0789k8563k50542
5475a071441J01279R6323j15045Q4919k361N0086j96690P5320J4739j03019L4843J12873
5463i18174k7391m3878J08689r5818K12920j43709o7816j3828J41425j1286k5311k3863
5451i08040j5636O5593j27543k9505o94j3914p7817K42721j897j9240j32547O480r2916
5438a104955J60319p3151k18730K18768J57431j93942n6600L13126p1818l76961K27708
5427a018805k1793r8092K60300R3789j97838j04213M25040m51207M69496l73242k40498
$$ plain form
5513 -1030395 -1042939 -894879 -972024 -920198 -907497 -985071 -914212 -976369 -865347 -1030777 -942682 -866806
5501 -866806 -822056 -907175 -908183 -923638 -936371 -887903 -1023356 -974814 -871015 -1019376 -1008459 -902374 -903891
5488 -903891 -867222 -974503 -949243 -963216 -1040764 -903548 -916639 -910234 -818577 -803125 -792336 -820899 -1071441
5475 -1071441 -970162 -873839 -988884 -903965 -906326 -856240 -1052930 -977610 -962871 -1065890 -1031047 -918174
5463 -918174 -945565 -989443 -880754 -976572 -763652 -907361 -975177 -989005 -847580 -858866 -884177 -908040
5451 -908040 -923676 -858083 -985626 -1015131 -1015825 -1029739 -1107556 -864835 -866732 -885972 -1018519 -1012039 -1104955
5438 -1104955 -944636 -1017787 -1236517 -1017749 -860318 -1054260 -1110860 -797734 -869552 -1246513 -1018805
5427 -1018805 -1040598 -1138690 -878390 -784601 -982439 -1086652 -661612 -1112819 -643323 -1016565 -1257063
5416a257063M38038q4348P5276n510K3299k10579O2380q7165J83409j1711j80129J30731
5404i23372K3901j09412J9425R5424r5018j46299J56713K937L0309K05446k23430L4108
5392i29268p5348Q2859R985j24976O0819J53954k56725J33409K7706l694q3629J7128K97
5379i87483n3023l2979J72638m6800L9906P8824j02342K5590r0898M351P1328M5674n9123
5366i34337j6521J3170O2439j6958k64419M2135J16804m5921N2899O5820j14518l6083
5354a075490J17817k8943n3555O3859k967K9970k5925R7621j47650J34079k51345J09939
5342a032590J135K6586k0186j1309K711L5402o865N3647L0988p9353O4426r3201k2335
5329a050944J38281j0326l3833L6470n4505K3243j27526N3545J11256O530q0920p924k5179
$$ plain form
5416 -1257063 -819025 -903373 -828097 -833607 -810308 -1020887 -958507 -1045672 -862263 -873974 -1054103 -923372
5404 -923372 -899471 -1008883 -989458 -894034 -989052 -1135351 -978638 -975701 -945392 -739946 -963376 -929268
5392 -929268 -1004616 -921757 -911772 -1036748 -975929 -821975 -1078700 -945291 -917585 -921279 -1004908 -987780 -987483
5379 -987483 -1040506 -1073485 -900847 -947647 -907741 -828917 -931259 -905669 -996567 -992216 -920888 -875214 -934337
5366 -934337 -950858 -937688 -875249 -892207 -1156626 -1114491 -997687 -1043608 -990709 -924889 -1039407 -1075490
5354 -1075490 -957673 -986616 -1040171 -976312 -979279 -949309 -975234 -877613 -1025263 -891184 -1142529 -1032590
5342 -1032590 -1031455 -1004869 -1025055 -1036364 -1033653 -998251 -1005116 -951469 -920481 -999834 -935408 -1028609 -1050944
5329 -1050944 -912663 -922989 -956822 -920352 -974857 -951614 -1079140 -1025595 -914339 -907809 -988729 -996653 -1021832
5316a021832J06016n7381j23502J27921j63382J55545m9668l7515N8590J9525J5133j9521
5304i90071N5878l6013R8842J4358j68185j1392N9463j37656M5621J41908n7145J0963
5292i73429M3380l831K2123k07830J55034n2210j8489M1689j3996q232k3097L234o0039
5279a095693K32098j76623l6739P9403J00791j33598N7488J7121k0349R737j1617j29985
5267a107966J13471o2209k9956Q7464L2854o5847L9145p5254P4336o4541O1290k9763L4426
5254i92550J57932j01067j3812n6282M3422j0860m4234P9239n6884k2480L7754n2693L8244
5241i94271L0020j0335p8538N389p5254J31633J1164j4974l4713o311M8755M5754O809
5228i34872l0831l4134k5873N7569L8186o4798n2652J02005j8291l5912J3836n1356P0021
$$ plain form
5316 -1021832 -915816 -973197 -1096699 -968778 -1132160 -976615 -1026283 -1063798 -1005208 -985683 -970550 -990071
5304 -990071 -934193 -970206 -871364 -857006 -1025191 -1036583 -977120 -1114776 -1069155 -927247 -984392 -973429
5292 -973429 -930049 -933880 -911757 -1119587 -964553 -1016763 -1035252 -993563 -1007559 -1015791 -1038888 -1035654 -1095693
5279 -1095693 -863595 -1040218 -1076957 -997554 -896763 -1030361 -972873 -955752 -976101 -966364 -977981 -1107966
5267 -1107966 -994495 -1056704 -1086660 -999196 -966342 -1032189 -993044 -1068298 -993962 -1058503 -997213 -1026976 -992550
5254 -992550 -834618 -935685 -949497 -1005779 -962357 -973217 -1017451 -938212 -995096 -1017576 -979822 -1032515 -994271
5241 -994271 -964251 -974586 -1053124 -1047735 -1122989 -991356 -980192 -995166 -1029879 -1036190 -987435 -941681 -934872
5228 -934872 -965703 -999837 -1025710 -968141 -929955 -994753 -1047405 -945400 -963691 -999603 -985767 -1037123 -967102
5215i67102n9516j4857J017j5589J9229J2277L8464j1451j81078J68583O3265l262o279
5202i56299j54212J7323M8538p5252Q1259L391J01076q6004j35823J32698p0399L7648
5190a056056J84567j35516N7926m1595p0747M579p7691K7727P2834p3793L0421l1497M6661
5177a062180k1035J08069n5468K7601l5642k0696K45543k03775j9036j365q0771R0863
5165a027892l4823j7514Q524M6908n1629R5946N2084j76734N5946J4908N0566j18662O4751
5152a037621p083O8485J28364k16219J1897M0157N6675o6484p8m3875P9349K0614n4953
5139a020772j5232O4085N7573j85386N4053J5340J1110j15512J29181P0867r9506J2248
5127a021951j25885J14754J25769j14956o89m8939J79405J952o3250K9517L7541j34012
$$ plain form
5215 -967102 -1026618 -1041475 -1040458 -1056047 -1036818 -1024541 -986077 -997528 -1178606 -1010023 -946758 -950020 -956299
5202 -956299 -1110511 -1093188 -1044650 -1119902 -1038643 -1035252 -934176 -1020180 -1156003 -1023305 -1093704 -1056056
5190 -1056056 -871489 -1007005 -949079 -990674 -1061421 -1056842 -1134533 -1106806 -1033972 -1107765 -1077344 -1108841 -1062180
5177 -1062180 -1083215 -975146 -1030614 -1003013 -1038655 -1059351 -813808 -1017583 -1036619 -1037984 -1118755 -1027892
5165 -1027892 -1062715 -1080229 -1071705 -1024797 -1076426 -980480 -928396 -1105130 -1049184 -1034276 -983710 -1102372 -1037621
5152 -1037621 -1044704 -976219 -847855 -1064074 -1052177 -1012020 -955345 -1021829 -1021907 -1065782 -986433 -965819 -1020772
5139 -1020772 -1036004 -971919 -914346 -1099732 -1045679 -1030339 -1019229 -1134741 -1005560 -934693 -1034199 -1021951
5127 -1021951 -1147836 -1033082 -907313 -1022269 -1022958 -1071897 -892492 -890540 -953790 -924273 -886732 -1020744
5115a020744m9523J06949k3757k3275O9271j25575r967L0203k4857N0425K60J0578k9916
5102a039928K2596L3416j28520R3936j9258R7534n6756j5283J6657p2751N3138o3614j205
5089a080038r4348R5296Q6289r0444J9931L42O8752n8409J1453O2126O568j42063K0875
5076a093670J35619n4765j78473J48266k5239L9004k8798K899P013m3253O2083r500M1212
5063i97602l5021o7122l5532P1845M3565J0042n2759J57548j89276j07280J61668J813
5051a038111k0168Q871l4583Q0450j19139L8227K4937j6236J68235j56739N9414J6166
5039i88676M7533j55958Q3861K3572r0087L6018j2315O5009o1802l3935o62J1208j63425
5026a239659K46119K4591j32618K7122O6408j13057L9945O2617n406m4067K5936m9290N577
$$ plain form
5115 -1020744 -1070267 -963318 -987075 -1010350 -941079 -1066654 -1076621 -1046418 -1071275 -1020850 -1020590 -1010012 -1039928
5102 -1039928 -1017332 -983916 -1112436 -1018500 -1037758 -940224 -996980 -1012263 -995606 -1068357 -1015219 -1078833 -1080038
5089 -1080038 -1174386 -1079090 -992801 -1083245 -1063314 -1062972 -994220 -1052629 -1041176 -979050 -972482 -1114545 -1093670
5076 -1093670 -958051 -1012816 -1191289 -1043023 -1068262 -1029258 -1058056 -1055157 -1048144 -1091397 -1029314 -1038814 -997602
5063 -997602 -1032623 -1099745 -1135277 -1063432 -1019867 -1009825 -1062584 -905036 -1094312 -1201592 -1039924 -1038111
5051 -1038111 -1058279 -1049408 -1083991 -1003541 -1122680 -1084453 -1059516 -1075752 -907517 -1064256 -1004842 -988676
5039 -988676 -941143 -1097101 -1013240 -989668 -1079755 -1043737 -1056052 -991043 -1052845 -1086780 -1087442 -1076234 -1239659
5026 -1239659 -993540 -968949 -1101567 -1074445 -1008037 -1121094 -1081149 -1018532 -1023938 -1068005 -1042069 -1091359 -1085782
5013a085782l8660P3518j02003M5005l8498R5762L4202m9213p6456L0141J0257k6989N1634
5000a077082N1632j14173Q5052L9361j27957J18264o2800Q7304j02227M8528n4288J80916
4988i27470k813o7256l7212J5269K3004p2019N5465j08673K8063m6206R5347j54729J41949
4975a057281l2447j4698o1767Q1821J2648l7231l107j5490P1499J01058j70518N5598J2229
4962a057686j19521k1950R1399j2441J3754n3353j6700J58019j08146N6986m5760J12400
4950a002999q7896R9666r4398k2421r7970J98683n5773k2220q1595J89854o6445j76552
4938a220066J60180J3152l9619j5200Q2907o127p6204n6786J43409q3443k9354J7254L3552
4925a076345m0436R5733j08620J18417J894p2583j24023P4211J29337j47473J27779l2687
$$ plain form
5013 -1085782 -1124442 -1050924 -1152927 -1107922 -1146420 -1050658 -1016456 -1065669 -1142125 -1111984 -1101727 -1128716 -1077082
5000 -1077082 -1025450 -1139623 -1054571 -1015210 -1143167 -1024903 -1087703 -1000399 -1102626 -1054098 -1108386 -927470
4988 -927470 -930283 -997539 -1034751 -1019482 -996478 -1068497 -1013032 -1121705 -1093642 -1139848 -1044501 -1199230 -1057281
4975 -1057281 -1089728 -1104426 -1166193 -1084372 -1071724 -1108955 -1112062 -1127552 -1056053 -954995 -1125513 -1069915 -1057686
4962 -1057686 -1177207 -1199157 -1107758 -1120199 -1106445 -1159798 -1176498 -1018479 -1126625 -1069639 -1115399 -1002999
4950 -1002999 -1090895 -991229 -1085627 -1108048 -1206018 -1007335 -1063108 -1085328 -1166923 -977069 -1043514 -1220066
4938 -1220066 -1059886 -1046734 -1086353 -1101553 -1018646 -1024773 -1100977 -1157763 -1014354 -1097797 -1127151 -1109897 -1076345
4925 -1076345 -1116781 -1021048 -1129668 -1011251 -1009357 -1081940 -1205963 -1131752 -1002415 -1149888 -1022109 -1054796
4913a054796p0585L438q0794J7332P1437l4310R5985q4643l970Q1497N2467j47446q468
4900a162856O5170P2113j97358k7810l61Q2745N6787N7427j05466K6381o232J29491l5525
4887a045494l1155q3401P0591J27553k08502j8395J57377O8137j37135J1978k093m5872
4875a136411Q1166k9326m0941P9061M012q3691O3965j3841R297p8154Q6365q5647L732
4862a140413k4339N3266O7635j00259j4620K06390j78753N7565m4798r52L3150j20016
4850a206144J2621L5737J3820J2101K1534P4694j27920P3768l4957n8423l9387J78845
4838a043711p4673m2092O8728k9093m8738J13585j01856l371N6726n2071p6207R3814K0714
4825a118245m6034m6847Q4375j54296J22848n0872J51269l4289n3577k1276k7187J9593
$$ plain form
4913 -1054796 -1125381 -1121943 -1202737 -1185405 -1113968 -1148278 -1052293 -1136936 -1140906 -1059409 -1006942 -1154388 -1162856
4900 -1162856 -1097686 -1025573 -1222931 -1250741 -1251102 -1168357 -1111570 -1054143 -1159609 -1133228 -1139460 -1009969 -1045494
4887 -1045494 -1076649 -1160050 -1089459 -961906 -1170408 -1188803 -1031426 -963289 -1100424 -1088446 -1090539 -1136411
4875 -1136411 -1055245 -1084571 -1125512 -1046451 -1042439 -1126130 -1062165 -1076006 -1066709 -1144863 -1058498 -1144145 -1140413
4862 -1140413 -1164752 -1111486 -1043851 -1144110 -1158730 -952340 -1131093 -1073528 -1118326 -1119278 -1086128 -1206144
4850 -1206144 -1193523 -1157786 -1143966 -1131865 -1110331 -1035637 -1163557 -1089789 -1124746 -1183169 -1222556 -1043711
4838 -1043711 -1118384 -1160476 -1091748 -1120841 -1169579 -1055994 -1157850 -1161221 -1104495 -1156566 -1232773 -1138959 -1118245
4825 -1118245 -1164279 -1211126 -1126751 -1281047 -1158199 -1209071 -1057802 -1092091 -1145668 -1166944 -1194131 -1174538
4813a174538Q5432K9297M1860j65164O8903k0297q5898K9909Q9854m2948o4018Q7905
4801a119703j13068n729J63883m3685n8884N4285n7115q6509J45694j624k6167l4614M221
4788a179015P866n062L7701k8671Q2832r509m9665j01528n380r6457K87897o3339j76602
4775a298932J05363N2040j2383j91020J62901R197R9643o7680j1612J20901j74877K0315
4763a186144J46254j54237R1902o6569Q5643j55362J37461l4839O2640j16990J02406
4752a087835j18928q8664J18401k3000r9531J57477j16676P05L8594R8710o4487o8736
4740a253970J69856l9825j58965J10461K4257M1436l2259m6329L979N2752k8985l3319
4728a190911J46761q2495K0819J956n4002J24415J3080J02542M21817J82001J80031r327
$$ plain form
4813 -1174538 -1089106 -1059809 -1017949 -1183113 -1114210 -1134507 -1220405 -1190496 -1100642 -1143590 -1207608 -1119703
4801 -1119703 -1232771 -1238500 -1074617 -1118302 -1177186 -1122901 -1180016 -1266525 -1120831 -1122455 -1148622 -1183236 -1179015
4788 -1179015 -1171149 -1176211 -1138510 -1167181 -1084349 -1093858 -1143523 -1245051 -1250431 -1346888 -1058991 -1122330 -1298932
4775 -1298932 -1193569 -1141529 -1153912 -1344932 -1182031 -1172834 -1073191 -1140871 -1152483 -1031582 -1206459 -1186144
4763 -1186144 -1039890 -1194127 -1102225 -1168794 -1083151 -1238513 -1101052 -1135891 -1073251 -1190241 -1087835
4752 -1087835 -1206763 -1295427 -1177026 -1200026 -1299557 -1142080 -1258756 -1258051 -1219457 -1120747 -1185234 -1253970
4740 -1253970 -1084114 -1123939 -1282904 -1172443 -1148186 -1106750 -1139009 -1185338 -1181359 -1128607 -1157592 -1190911
4728 -1190911 -1044150 -1126645 -1105826 -1103870 -1157872 -1033457 -1020377 -917835 -496018 -314017 -133986 -143313
4716a43313l02999j37873j23675k23250l666j19763K7392M5491p720l3697M1765Q1695
4704h99613O0574J14049K13398K03342L39105J34012K36283R529k3340k32727j94789
4693d0177m42912j93366j87680n3057k5747k6431j6767o5298K4008o0750J56984q2420
4681a013613k2005K21412L16703K46379J73560k2687l28337k41640k39451j17489l3310
4670a060478M071q4991J295o901j67404J16298q4255P7883M029n0379J32730j82313N7911
4657a242504l5941r5559J88071J5085r1222p8659J15598L1039k2333j72686R4609p3590
4645a368092K12891j53436r475J36609o3453j00743P3662l7616N843O9585j7269j41317
4633a392811J37588R1299j97602M9548O2072k85612O5120J87173q4224N883j13792K3153
$$ plain form
4716 -143313 -446312 -584185 -707860 -931110 -934776 -1054539 -1027147 -981656 -989376 -1023073 -981308 -899613
4704 -899613 -839039 -724990 -511592 -308250 30855 164867 401150 410679 387339 154612 -40177
4693 -40177 -483089 -676455 -864135 -917192 -942939 -969370 -986137 -1051435 -1027427 -1088177 -931193 -1013613
4681 -1013613 -1035618 -814206 -497503 -251124 -77564 -100251 -428588 -670228 -909679 -1027168 -1060478
4670 -1060478 -1056407 -1141398 -1140103 -1147004 -1314408 -1198110 -1282365 -1204482 -1200453 -1250832 -1118102 -1300415 -1242504
4657 -1242504 -1278445 -1374004 -1185933 -1170848 -1262070 -1340729 -1225131 -1194092 -1216425 -1389111 -1294502 -1368092
4645 -1368092 -1155201 -1308637 -1318112 -1181503 -1244956 -1345699 -1272037 -1309653 -1303810 -1234225 -1251494 -1392811
4633 -1392811 -1255223 -1163924 -1361526 -1311978 -1249906 -1535518 -1470398 -1283225 -1367449 -1361566 -1475358 -1452205
4621a452205R4364N7023m2374o0307m6902O2069J33368j02060j5337J04494q8622J5638
4609a340851K8157L9558J4915j08929J75594k23296J92767q751r4812n9644L6061l2471
4597a381702k2293j8738J7129Q6860k5315P3325o2666M3421l9560L1907O4832P8214j31258
4584a285844L5646J06378r152N2484Q9751J94562k37145j24105j20976P0130o1361r713
4572a299345k8484q1551O1874m2883J6738J65671J73070P015K9375P0218J3040J07959
4560h07303L4102L11934p949J57692J94531N61704J120342J269962P94287m91303j124314
4549B013685q75027n87383l30513j74205M9719K7973J61505J75928K55148K61357N40687
4538A518874P37261R37586J687042K157821K427509K936337L577553M459740O415755
$$ plain form
4621 -1452205 -1357841 -1300818 -1343192 -1403499 -1450401 -1388332 -1254964 -1357024 -1372361 -1267867 -1356489 -1340851
4609 -1340851 -1312694 -1273136 -1258221 -1367150 -1191556 -1414852 -1222085 -1230836 -1325648 -1385292 -1349231 -1381702
4597 -1381702 -1403995 -1422733 -1405604 -1318744 -1344059 -1270734 -1333400 -1289979 -1329539 -1297632 -1232800 -1154586 -1285844
4584 -1285844 -1250198 -1143820 -1152972 -1100488 -1010737 -816175 -1053320 -1177425 -1298401 -1228271 -1289632 -1299345
4572 -1299345 -1327829 -1409380 -1347506 -1390389 -1373651 -1207980 -1034910 -1027895 -998520 -928302 -915262 -807303
4560 -807303 -773201 -461267 -469216 -311524 -116993 444711 1565053 2835015 3629302 3137999 2013685
4549 2013685 1138658 551275 220762 46557 96276 124249 285754 461682 716830 978187 1518874
4538 1518874 2256135 3193721 4880763 7038584 9466093 12402430 15979983 20439723 26855478
4529B6855478J0586425K1561071M3859321O8842408O1633154L114522n7995920o8909004
4521A09547455m3740039k1534062j0843764o520359m115103j986976j16396K248906
4513B2939662M602596P778323J1911098K0509564L6719340N5410741O3383040N7526985
4505B80781349M1309882J1798738k2448587m2282917m9704025n5847412n2699104l7192587
4497G3715337k1378252j2501198q106242n178864k821558n62839J214664L499964O370771
4488C4251783J1537967K3504801M7545580P2719030N9224775o002695o5963949p0736045
4480A06081247m2453834k0076833j0317918o744797n221072m201848l325902k296911
4472A1442132j319114K07698K397483J794545j112511m013378l656136j898108o02704
$$ plain form
4529 26855478 37441903 59002974 102862295 171704703 233337857 236452379 178456459 109547455
4521 109547455 65807416 44273354 33429590 26909231 22794128 20807152 20690756 22939662
4513 22939662 27542258 35320581 47231679 67741243 104460583 159871324 223254364 280781349
4505 280781349 322091231 333889969 311441382 269158465 219454440 163607028 110907924 73715337
4497 73715337 52337085 39835887 31729645 26550781 23729223 23166384 24381048 27881012 34251783
4488 34251783 45789750 69294551 116840131 189559161 248783936 242781241 176817292 106081247
4480 106081247 63627413 43550580 33232662 26487865 21266793 17064945 13739043 11442132
4472 11442132 10123018 10330716 12728199 14522744 13410233 9396855 5740719 3842611 3239907
4463C239907l39002k70844n7720L26121O12762J086974J055692J53614r57003j321460
4453C529041r95154n30157l70792l09874j91776j26827k02818r6195k81545k25168K6113
4442B24848J55292q0596p3065J3493p393K6829p1788n6645m3116l9571J65588j32009P8929
4429A60796q798r5990r1893m4264j14438j16049L4416j22747M8468p8810r0729J5059M654
4416e00325j5235j4279K0022J03775j27597l6991l5292j53079J20200N2544o3544J8971
4404f30830j60416M2835Q867j46851Q8785n2906n3523L6249K6415J39948P157j69986M9628
4391h14628j8084j01297K41771l4642P6277L6735n7154L5806J0592o0376j99897O3327
4379h21570j20336j0229k3766K750L9178J0411J05822j47718k7750j22281k2639Q351L9416
$$ plain form
4463 3239907 2900905 2630061 2572341 2898462 3511224 4598198 5653890 5807504 4850501 3529041
4453 3529041 2533887 2003730 1632938 1323064 1131288 1004461 801643 705448 423903 198735 224848
4442 224848 380140 299544 226479 239972 232579 259408 187620 130975 87859 48288 213876 81867 160796
4429 160796 151998 56008 -35885 -80149 -194587 -310636 -276220 -398967 -350499 -429309 -520038 -504979 -500325
4416 -500325 -515560 -529839 -509817 -406042 -533639 -570630 -605922 -759001 -638801 -586257 -649801 -630830
4404 -630830 -791246 -748411 -739544 -886395 -797610 -850516 -904039 -867790 -841375 -701427 -694270 -864256 -814628
4391 -814628 -832712 -934009 -692238 -726880 -650603 -613868 -671022 -635216 -624624 -685000 -884897 -821570
4379 -821570 -941906 -952135 -975901 -973151 -933973 -923562 -817740 -965458 -993208 -1115489 -1138128 -1129777 -1090361
4366a090361K9556n2270n0040j5438J14826J29088Q9551q1787K54631J92765J47211j54287
4354d86555l65332k53907J4529n940K114j39875R9575j23498k26812j09674j06008K04729
4342a496654R1052j6224l4608O5615P9507N2763K72645K6052l6390Q0042L15629R80030
4330C79459J038323O24523m27431p96914o16724r4302k59751l05924k50828k77547p3360
4319a060476J08557K60784J77663R2439J1030J87212p2993J1857J28133L11238N49990
4308G05434P12167K85887R80805L653236Q837724J4413564R134081m144926j3335892
4299B1242080j1338621m286274j628586q47292o12795o5653O4203K6226J20338K73511
4289B947137Q11529J359722K088897K560138K861280L092864M630603Q437286J4414868
$$ plain form
4366 -1090361 -1060805 -1113075 -1163115 -1178553 -1063727 -934639 -845088 -926875 -672244 -479479 -332268 -486555
4354 -486555 -851887 -1105794 -1091265 -1097205 -1095091 -1234966 -1135391 -1258889 -1485701 -1595375 -1701383 -1496654
4342 -1496654 -1405602 -1421826 -1456434 -1390819 -1311312 -1258549 -985904 -959852 -996242 -916200 -600571 379459
4330 379459 1417782 2042305 1614874 817960 201236 106934 -152817 -458741 -709569 -987116 -1060476
4319 -1060476 -951919 -691135 -513472 -421033 -410003 -222791 -295784 -283927 -155794 155444 705434
4308 705434 1417601 1703488 2684293 6337529 15175253 29588817 38722898 34577972 21242080
4299 21242080 9903459 5617185 3988599 3141307 2528512 2462859 2527062 2553288 2673626 2947137
4289 2947137 3758666 5118388 7207285 9767423 12628703 15721567 20352170 28789456 43204324
4280D3204324K1089154L3980360Q9519546K79801939O65598076P39860085Q5781703
4273A958835187n73863285p83688384l51776503j07982348m4214868k7176699k0707365
4266D9425735j3689432q406854n650536l706131k509881j776363j392421j465862j196619
4257I631636j168869j011133o86486k57152q1662R3902J360041M990506J0075788J2368710
4247C5315281M214287o742960j2437742q409481l475853k045426j490646r13157o76285
4238C338018m08536m88266m01218M06568J290555j98547j510759l20426K8153L0495j39678
4227A626359j78580r4452q2913k984J29268M86889L01707P276m03318l60805o9511j31976
4215A226960j79148j73837j24521Q9653Q2602L81O9797n1579O274O6104r3851r6679k24279
$$ plain form
4280 43204324 64293478 98273838 187793384 467595323 1133193399 1873053484 1958835187
4273 1958835187 1384971902 601283518 249507015 141524667 97309799 70133100 49425735
4266 49425735 35736303 27329449 21678913 17972782 15462901 13686538 12294117 10828255 9631636
4257 9631636 8462767 7451634 6765148 6507996 6426334 6520236 7880277 12870783 22946571 35315281
4247 35315281 39529568 32786608 20348866 11939385 8463532 6418106 4927460 4014303 3338018
4238 3338018 2929482 2441216 2039998 2446566 3737121 3538574 2027815 1707389 1735542 1766037 1626359
4227 1626359 1447779 1353327 1270414 1267430 1396698 1883587 2185294 2192570 1789252 1428447 1358936 1226960
4215 1226960 1047812 873975 749454 839107 921709 922090 991887 940308 946582 1012686 918835 822156 597877
4202E97877j8633r2599j5527j26597J11642n5127j12162j11790m74659q4766k0988J85713
4190b17616J36682o4722J58945M064K41693M9535m0730j5022j27410l4521j12020J10656
4178H9534j19805m983j97874N0204M0772R118R4130j22696O7560p2977j26685K9562k0721
4165b84861j7700j0258q6963M7295N7787j1861K5196J59796L3551M06525J286783J351601
4153B956891k033660q78778r8305r2750k1621q1642o4383K2231j1885n3986O1256Q185
4141b88447K0185j4445J6828p3541j01086l9860J70293j38073J18154J9076j36952K6018
4129d21850K1885J8310j43780L2090r4262M2976k4545j81J21959P391M2837M0899r7729
4116d54000n5612j11823q4296K8787O6471Q8331P3652J70936k15448J1953j82193K8781
$$ plain form
4202 597877 579244 486645 471118 344521 456163 401036 288874 177084 -297575 -382341 -403329 -217616
4190 -217616 -80934 -145656 13289 17353 259046 308581 267851 252829 125419 90898 -21122 89534
4178 89534 -30271 -35254 -233128 -182924 -142152 -133034 -38904 -161600 -94040 -167017 -293702 -264140 -284861
4165 -284861 -302561 -312819 -399782 -352487 -294700 -306561 -281365 -121569 -88018 318507 1605290 2956891
4153 2956891 923231 44453 -53852 -146602 -168223 -249865 -314248 -292017 -303902 -357888 -296632 -288447
4141 -288447 -268262 -282707 -265879 -339420 -440506 -480366 -310073 -448146 -329992 -310916 -447868 -421850
4129 -421850 -399965 -381655 -525435 -493345 -587607 -544631 -569176 -569357 -447398 -440007 -397170 -356271 -454000
4116 -454000 -509612 -621435 -705731 -676944 -610473 -522142 -448490 -277554 -493002 -481049 -663242 -634461
4104f34461K02898j9297K8029k01413l2723r0281P4635J39033j03045K1078k3302m8501
4092f87350K19159L57562q274k45468k02511O7342J09605J73317Q63379L517474N291657
4081I455892k905574n049491q74139P61286K321793L836766J803801j633493l663790
4072D053051k779895j039004k52051j84914k52700j26526J90824J316371L068822L132195
4062G126173l904089k877494o66768J972k2047l08425J47909J07168j01541l29712M4967
4051g81887j11760J49299K05677N8665J50693K09156k7158R2252M72021Q81443J482472
4040B780873N57009J575080K2568524J00907399K61146693n7272346k74217797m0439664
4032A7605771r345568j844251o00021k989353j053802o39684o50095j23644j87594j907
$$ plain form
4104 -634461 -431563 -450860 -422831 -624244 -656967 -747248 -672613 -533580 -636625 -615547 -638849 -687350
4092 -687350 -468191 -110629 -118903 -364371 -566882 -499540 -389935 -216618 646761 4164235 9455892
4081 9455892 6550318 1500827 626688 1387974 3709767 7546533 9350334 7716841 4053051
4072 4053051 1273156 234152 -17899 -202813 -455513 -582039 -391215 925156 3993978 7126173
4062 7126173 3222084 344590 -322178 -320206 -342253 -650678 -502769 -395601 -497142 -826854 -781887
4051 -781887 -893647 -744348 -538671 -480006 -329313 -120157 -147315 -55063 416958 1298401 2780873
4040 2780873 3337882 4912962 27481486 128388885 389535578 332263232 58045435 17605771
4032 17605771 8260203 6415952 5815931 2826578 1772776 1133092 482997 359353 171759 169852
4022A69852J9363j58526l41816R7245L9716j14373q4243P7843J18370o8274N72096J011108
4010A338361Q30936K567977J613754m469330j428979l10352j60262m31725j92303J0705
4000f31218J41979n4613P2734k12384K30460P8102r8639j65146j1611J73614j027k36342
3988g14091j53975K71998K247192M383357M375685m798885m334550j172053k17582n5911
3978a68815m43773P0824J78253l17082k08575J73381K80785p0133J04882J68005K58459
3967B6211O51670N38207j87889J46856J438849K203920K213005L899243L5400336
3958D6330408J50302333L59068687n8577557l91799689p4681430j6441465l586274j213818
3950I401195m541469j857468j005180n68990l12585r4979k92796j47179R2463K73302
$$ plain form
4022 169852 189215 30689 -311127 -213882 -174166 -288539 -372782 -294939 -176569 -244843 327253 1338361
4010 1338361 2169297 4737274 6351028 1881698 452719 142367 -17895 -449620 -641923 -631218
4000 -631218 -489239 -543852 -471118 -683502 -453042 -374940 -473579 -638725 -650336 -476722 -477749 -714091
3988 -714091 -868066 -596068 1651124 6034481 10410166 5611281 1276731 104678 -112904 -168815
3978 -168815 -612588 -541764 -363511 -680593 -889168 -715787 -435002 -505135 -400253 -232248 26211
3967 26211 677881 1216088 1028199 1175055 2613904 4817824 7030829 10930072 46330408
3958 46330408 196632741 555701428 497123871 105324182 30642752 14201287 10615013 9401195
3950 9401195 4859726 3002258 1997078 1428088 1115503 1020524 727728 580549 673012 946314
3940I46314J026963J425731j634811j948908J09902K35130l11391J44674Q63287K194678
3930C051569M144787K070572n601205k264893p24829l79041j07460j12877l43835j30589
3920c97801J30072K3032j78858o5457j84314N34657M853819J2273608J5369907o372346
3910B5986319j8017290n491738j007558K5112j017179l66397O93119k31281n97693k0714
3900d5300k2375q4827N34874L90710P49332J282264N10172N42619J496129M299200O371635
3889A6024433P544348Q728973P7245783L63791489R87086876L73745721j191929924
3882F42237699m96510176q6990979j9768448m613903j1452351r321286k905784l140043
3874G534729j734920q37100K1362o02027l62719m61481m93766k69807l55262p73382L29193
$$ plain form
3940 946314 1973277 3399008 1764197 -184711 -74809 160321 -151070 -6396 856891 3051569
3930 3051569 7196356 9266928 3665723 1400830 676001 296960 189500 76623 -267212 -397801
3920 -397801 -267729 -244697 -423555 -489012 -673326 -138669 4715150 16988758 32358665 25986319
3910 25986319 7969029 2477291 1469733 1494845 477666 111269 804388 573107 -24586 -45300
3900 -45300 -67675 -152502 382372 773082 1522414 2804678 3314850 3857469 5353598 9652798 16024433
3889 16024433 23568781 32297754 109543537 473335026 1460421902 1834167623 642237699
3882 642237699 145727523 58736544 38968096 34354193 22901842 13580556 10674772 7534729
3874 7534729 5799809 4962709 4984071 4382044 4019325 3557844 3064078 2794271 2439009 1665627 1994820
3863A994820J49376n71101R9595K329282O444819J1945615J0458266j2794160j2635708
3854G420804k934901j115996r50665p18042l90315k18281j66685j64688l58912k75427
3844A26892L77613J00021l36146m1685M51453J16932k44250j20822j6763j4957L4841
3833D33129J329580J350284j152999o11731n74065j75083j58489j17588R9523j55025
3823B67536j17916J55773K47288k55972m0459P9466j2513J30893r6724o8000j17736K0687
3811A92323j39951j49867J16834P24L0658J26764k33517k30713m63859L29276L66353
3800e4975j31342j37588P1534P1430J01895N0135j03465K3322r0718O7664K41989j11566
3788a685j41029l1762k39170O8743J26112R1297N8658N212j33761q634q9224m1436O9217
$$ plain form
3863 1994820 2144196 1573095 1672690 4001972 10446791 22392406 32850672 20056512 7420804
3854 7420804 4485903 3369907 2419242 1701200 1310885 1092604 925919 761231 402319 126892
3844 126892 504505 604526 268380 226695 678148 795080 550830 430008 413245 398288 433129
3833 433129 1762709 3112993 1959994 1348263 774198 599115 440626 323038 422561 267536
3823 267536 149620 305393 552681 296709 256250 335716 323203 454096 357372 289372 171636 192323
3811 192323 52372 -97495 19339 20063 50721 177485 -56032 -286745 -750604 -421328 -54975
3800 -54975 -186317 -323905 -252371 -180941 -79046 -28911 -132376 -109054 -199772 -132108 109881 -1685
3788 -1685 -142714 -174476 -413646 -344903 -218791 -127494 -68836 -63624 -197385 -206019 -295243 -336679 -267462
3775b67462o5005K9579O5328j07439J65419p7352Q5977j4838k2490P2195j17856k1328
3763b75272N6897Q4649o6232K1789R258k4180M8221J96620Q67887J703643n76650j926516
3751A20114j23354k00935Q8265j90098j46361N3799M1086R5378k4410l9614N549M6149
3739b74432n6287n2082R1470j51304K3113P333l3844O7955P1287j03835J12606p4954q21
3726c73795P1206r458j89091K0438R0398n7195J52064j24454p4678P9825J39648l8130
3714c13222j66123q9320K03879r3204P7201J58861q5737j37213J6183L218K8892L7346
3702c59239p9915m4106K0340M0282m8535J8290l2878k8641K2095L3370J5759j03954J07191
3689d39941Q026P1168q7643M2861J80957O23900K273533N230177M33390o121634j949913
$$ plain form
3775 -267462 -332467 -302888 -237560 -344999 -179580 -256932 -170955 -185793 -208283 -136088 -253944 -275272
3763 -275272 -218375 -133726 -199958 -178169 -168911 -193091 -144870 51750 919637 2623280 2046630 120114
3751 120114 -3240 -204175 -115910 -306008 -452369 -398570 -357484 -262106 -286516 -326130 -320581 -274432
3739 -274432 -330719 -382801 -291331 -442635 -419522 -412189 -446033 -378078 -306791 -410626 -298020 -372974 -373795
3726 -373795 -302589 -312047 -501138 -480700 -390302 -447497 -295433 -419887 -494565 -414740 -275092 -313222
3714 -313222 -479345 -568665 -364786 -457990 -380789 -221928 -307665 -444878 -428695 -425477 -396585 -359239
3702 -359239 -439154 -483260 -462920 -422638 -471173 -452883 -485761 -514402 -492307 -458937 -443178 -547132 -439941
3689 -439941 -431915 -360747 -448390 -405529 -224572 399328 2672861 7903038 8336428 2214794 264881
3678B64881k95103k74113K3223j23387N2130j59477K5676j7822J25024j23325j8173J5373
3666e05093m996l9570M6161Q2466q9985r9834R0722J05923p7139O8526L0726o3372N8816
3653c96649j5383j74134J22976k2455j16315R611k3318J49469q3168j7151L8468M2019
3641d86030p2332J18555o0100k3527J46855L192M5305j5661N9277k4517Q3163l1269J8931
3628b38158J8025O9962o6558J34811L0113j79990J54265o3470P1405j39807k4922L2542
3616b01782j27455O7921m6515P24j10187q0559R0345j23629p597O0130m5775J00841j31664
3603e55202j16614Q7510l3765L9640n9479k0332L9435N6434p3156l6298O9836m9403K8494
3590f22900q2784L0322K4222k0470J01666r4975k4528J00092j28091J15088j09182J3634
$$ plain form
3678 264881 -30222 -304335 -281112 -404499 -352369 -511846 -486170 -503992 -378968 -502293 -520466 -505093
3666 -505093 -510089 -549659 -503498 -421032 -511017 -610851 -520129 -414206 -491345 -422819 -392093 -455465 -396649
3653 -396649 -412032 -586166 -463190 -485645 -601960 -592349 -615667 -466198 -549366 -566517 -528049 -486030
3641 -486030 -558362 -439807 -499907 -523434 -376579 -373387 -328082 -343743 -284466 -308983 -225820 -257089 -238158
3628 -238158 -220133 -150171 -216729 -81918 -51805 -231795 -77530 -141000 -69595 -209402 -234324 -201782
3616 -201782 -329237 -261316 -307831 -307107 -417294 -497853 -407508 -531137 -538734 -478604 -524379 -423538 -555202
3603 -555202 -671816 -584306 -618071 -578431 -637910 -658242 -618807 -562373 -635529 -671827 -601991 -651394 -622900
3590 -622900 -705684 -675362 -651140 -671610 -569944 -664919 -689447 -589355 -717446 -602358 -711540 -697906
3578f97906N3891M7221p1053l1038l9982O9355R0820P501j70488L8250L1409K1755m1397
3565f91662Q9577L1812N5517j36598J3901n1239n2909P5509j4816p9167P3205j092j3037
3552g00999J46544l20040Q9719J4839J82180j7316m1528p0534Q7031k11865K20672O823
3540f14474n7598k1830r608K3172k910l0022J00571m1952k7733K1391l8430j06269J61203
3527f44489L2102m5479j54500N0965j06174K23754o2235l3551M6259p207j37441J84529
3515f53467k8354J1010k25270J65511l275m7274P3004J8002L7694N0442P4065n0400j72303
3502g50615m5732Q3153O7954k6823q3021M7134j04546R6558j9352M3010r2716J10035o5895
3489g40856j05811J9822Q6221O4368m5863J75688p8330n7273K2824J36474q8851K6523
$$ plain form
3578 -697906 -644015 -596794 -667847 -698885 -738867 -669512 -578692 -571191 -741679 -703429 -672020 -650265 -691662
3565 -691662 -602085 -570273 -514756 -651354 -637453 -688692 -741601 -666092 -680908 -760075 -686870 -687962 -700999
3552 -700999 -554455 -874495 -784776 -769937 -587757 -605073 -646601 -717135 -630104 -841969 -621297 -614474
3540 -614474 -672072 -693902 -703510 -680338 -683248 -713270 -612699 -654651 -682384 -660993 -699423 -805692 -644489
3527 -644489 -612387 -657866 -812366 -761401 -867575 -643821 -706056 -739607 -693348 -700555 -837996 -653467
3515 -653467 -681821 -670811 -896081 -730570 -733845 -781119 -708115 -690113 -652419 -601977 -527912 -578312 -750615
3502 -750615 -796347 -713194 -645240 -672063 -755084 -707950 -812496 -715938 -735290 -692280 -784996 -674961 -740856
3489 -740856 -846667 -826845 -740624 -676256 -722119 -546431 -624761 -682034 -659210 -522736 -611587 -585064
3477e85064j21555P1860O4504K8661K7078q6049j04785J10282P2044j8139R2251L67014
3465h1898J81984k1583K11037R32283N01361n62681l03540O88025P30332L06350l29912
3454B251758m9597J94174R94944J358933q2683j225411n08456R00940J327262n07089
3444D654775j104818n05026N11975J198812Q70371P43386L479818M427239O5998N036304
3434A9378834N513871R118747J814023L532621L171892O726270M057937R746845J554516
3425F4615556J478460M607801J0579991l098523J227304l655533L943625n124447m164724
3416G0409510j380957l327039q402615m987792m249172m740289l717986m563245p604183
3407B7436232p488208l517018k614984l045894n836167k001348o88192r8803j99848k51667
$$ plain form
3477 -585064 -706619 -634759 -570255 -541594 -514516 -600565 -705350 -595068 -523024 -541163 -448912 -81898
3465 -81898 100086 78503 289540 1221823 1723184 1160503 856963 1544988 2275320 2581670 2251758
3454 2251758 2202161 2396335 3391279 4750212 4667529 3442118 2933662 3834602 5161864 4654775
3444 4654775 3549957 3044931 3556906 4755718 5626089 6369475 9849293 14276532 14342530 19378834
3434 19378834 24892705 34011452 35825475 39358096 42529988 49256258 53314195 63061040 64615556
3425 64615556 66094016 70701817 81281808 78183285 79410589 75755056 79698681 74574234 70409510
3416 70409510 69028553 65701514 57298899 52311107 48061935 43321646 39603660 35040415 27436232
3407 27436232 19948024 16431006 13816022 10770128 4933961 2932613 2244421 2145618 1945770 1694103
3397A694103J3486O4815j40902j66478J2693l1494j01526j26242r2764n8030k39177q4293
3385G44191q1927j96818P0079j37607j19944j01072j00490j68232p7540j51244r0476R7471
3373c13609r1141K4747j18448l4361J00376j8377J73415j61268J2535l7414j5247R6128
3361c82664J8280j13142k2089n9792J21410n9729O8246r8066P693J46866J02933J76847
3349i3207j57138k86189N8616j30516J4651M7752N4444M275K37425Q3474m883j96584
3337c67880j23252j04799Q1783j29574J09470M2481O5337K6766O577J5304K3032K7620
3325c27135J5335k4463N2828j93808j3335r9045L456J37498K0034K93062j2991J27654
3313b0910r5472l2051j85814J01306j29496n6261J00585O4596j4564o498K40569m0185
$$ plain form
3397 1694103 1707589 1772404 1631502 1465024 1477717 1446223 1344697 1218455 1125691 1067661 828484 744191
3385 744191 662264 465446 535525 397918 277974 176902 76412 -91820 -169360 -320604 -411080 -313609
3373 -313609 -404750 -380003 -498451 -532812 -432436 -450813 -277398 -438666 -426131 -463545 -478792 -382664
3361 -382664 -364384 -477526 -499615 -559407 -437997 -497726 -429480 -527546 -519853 -372987 -270054 -93207
3349 -93207 -250345 -536534 -477918 -608434 -593783 -546031 -491587 -487312 -249887 -166413 -171296 -367880
3337 -367880 -491132 -595931 -514148 -643722 -534252 -491771 -426434 -399668 -393091 -377787 -354755 -327135
3325 -327135 -311800 -336263 -283435 -477243 -490578 -589623 -586167 -448669 -428635 -135573 -148564 -20910
3313 -20910 -116382 -148433 -334247 -232941 -362437 -418698 -318113 -253517 -268081 -274579 -34010 -74195
3301g4195j14510p6222J5844o206m9266O760N1576P6420j94830j7302r683r1152m1628o603
3287e30997k1602J27827L8470j58418q3520K53092m1937K8450Q8346O802l1090K40630
3275h3947j13356j8214J9971m2823J07471L6743j16433M7341j13393J44213l3184N6975
3263a08636K5087n5892P3235Q8741K13305R13357J906930J969002K312277K239957M468545
3252A4045908K120442L791462J088166L041029R99358J984854O3869J389468o16487q90693
3242B7017376l08118j565731k009259k186798j705501l386562k952844m305160j652996
3233F944407k260932j985552j769210n56034k29711n4844Q4911L6563j15643P1995j7368
3222A48582l9583P3177R7996j50079L96026j73j31063R2723j15209p8643j08039k3506
$$ plain form
3301 -74195 -188705 -264927 -249083 -255289 -304555 -297795 -246219 -169799 -364629 -381931 -391614 -482766 -524394 -530997
3287 -530997 -552599 -424772 -386302 -544720 -628240 -375148 -417085 -388635 -300289 -293487 -324577 -83947
3275 -83947 -197303 -215517 -195546 -238369 -130898 -94155 -210588 -163247 -276640 -132427 -165611 -108636
3263 -108636 -83549 -139441 -66206 22535 235840 1149197 3056127 5025129 7337406 9577363 14045908
3252 14045908 16166350 19957812 21045978 24087007 25086365 27071219 27135088 28524556 27908069 27017376
3242 27017376 26709258 25143527 23134268 20947470 19241969 15855407 12902563 8597403 6944407
3233 6944407 4683475 2697923 928713 372679 142968 88124 173035 209598 93955 165950 148582
3222 148582 108999 182176 280172 130093 526119 525946 394883 487606 372397 293754 185715 162209
3210A62209p2773N4715j06467j23440k2123j72279M374j03750K16104K66796L17281l2915
3198C87732l24227l21573j90230N4600M31988P94615m16954M36349K044756K517352
3188E414408j595809j798134J308290K623685k174726k351864Q23940K292083r12328
3179C629545j634332J05842O24972P30892L418979J1634619K0260901J2773908j0723915
3170D0821411k0504180j1926965l764270p62477P88616L959742J2322512K6605508
3162D7539897L2485937J1316818k2902192l4145187k0256862o733705j475962L87330
3154F216074K567213P966490J6522916J6747559j066871j4299939l035839J1479363
3146D3096966O218020r476087j4605260j0106526n481788j876217J103090P420100
$$ plain form
3210 162209 89436 144151 37684 -85756 -107879 -280158 -275784 -379534 -163430 103366 420647 387732
3198 387732 63505 -258068 -448298 -393698 38290 832905 415951 852300 2897056 5414408
3188 5414408 3818599 2020465 3328755 5952440 3777714 1425850 2249790 4541873 3629545
3179 3629545 1995213 2101055 2726027 3456919 6875898 18510517 38771418 51545326 40821411
3170 40821411 20317231 8390266 4625996 3863519 4652135 8611877 20934389 47539897
3162 47539897 80025834 91342652 68440460 34295273 14038411 7304706 5828744 6216074
3154 6216074 8783287 16749777 33272693 50020252 48953381 34653442 31617603 43096966
3146 43096966 49314986 39838899 25233639 15127113 9645325 7769108 8872198 16292298
3138A6292298J9448999L0150289K2418863l757583k6587912k6817102j2318836k589655
3130A6239361J303289M189357P255310J3305408J5202457M708314j0492167j4960755
3122C6750574p616490j121346J61811J238883K170439K448826K045894K555267J493969
3113D0127827M333971L967640L296048J608097L140379L350801M383793j30721K923830
3104F7001665K745448M872715L133907O51083k435141K89600p25203l094329j888363
3095G0551382n943431k442814m455615o024588o680866l178760m386094j981879m683207
3086C0774128n134297o352071l011219m352435j809909k618653j564003j36277q1856o3038
3076E650370L73211K49435J52231K92041O4170J94335K28980O6940N1115l2540k00906
$$ plain form
3138 16292298 35741297 65891586 88310449 84552866 57964954 31147852 18829016 16239361
3130 16239361 17542650 21732007 28987317 42292725 57495182 62203496 51711329 36750574
3122 36750574 29134084 28012738 28174549 29413432 31583871 34032697 36078591 38633858 40127827
3113 40127827 44461798 48429438 51725486 53333583 56473962 59824763 64208556 64077835 67001665
3104 67001665 69747113 74619828 77753735 78404818 75969677 76259277 75534074 72439745 70551382
3095 70551382 64607951 62165137 57709522 51684934 45004068 41825308 37439214 35457335 30774128
3086 30774128 25639831 19287760 16276541 11924106 10114197 7495544 5931541 5795264 5713408 5650370
3076 5650370 6023581 6273016 6425247 6717288 6781458 6975793 7204773 7271713 7322828 7290288 7089382
3065G089382l30290m73470j32140m60157l53841m00582m88495l82334l98853n59066n76890
3054B533264l88107m95854m57016l30476l96168k18859n7052j00460R120j36968O8845
3043C0269q5437K9228j35738J06392j3728M8736o7568j8504K5035L1439j21031P4604
3031i6303j58337m560r70K4342j10962n531j2180j32517K3432P4136q9816l342l5313N5815
3017d72106k8538L6336j4399J42848q8888k7827l7332J6490j7099J2795n3661N2139L6919
3004d42323L6376o3837Q0996l2985n6792J1383J2580L3602p0636J904K9901J24623J4819
2991c20389j10856J54745O8082J4883r0581j0631J53323J22049M19309R3733L76858P88197
2979A658722N42687K35341K96534L96383M57882j9548O1905P96952O84928n74802M70533
$$ plain form
3065 7089382 6759092 6285622 6153482 5693325 5339484 4938902 4450407 4068073 3669220 3110154 2533264
3054 2533264 2145157 1649303 1192287 861811 465643 246784 189732 89272 98392 -38576 30269
3043 30269 -55168 -25940 -161678 -55286 -69014 -20278 -87846 -106350 -81315 -49876 -170907 -96303
3031 -96303 -254640 -259200 -260170 -235828 -346790 -352321 -364501 -497018 -473586 -399450 -489266 -492608 -527921 -472106
3017 -472106 -500644 -464308 -478707 -335859 -424747 -452574 -489906 -473416 -490515 -477720 -531381 -479242 -442323
3004 -442323 -405947 -469784 -388788 -421773 -478565 -467182 -454602 -421000 -491636 -489732 -459831 -335208 -320389
2991 -320389 -431245 -276500 -208418 -193535 -284116 -294747 -141424 -19375 399934 493667 870525 1658722
2979 1658722 2201409 2436750 2733284 3129667 3587549 3568001 3629906 4426858 5111786 4536984 5007517
2968E007517R45726P7428l92350k7757J33197N5623r06106n50773L77762l05867q86920
2957C527480o3234P7536o31036l24615j68152k91882n32362p91073l45178l6270l77836
2946D3378k24536R610K11747L61782R35215Q59469l97406r17013q06215k59397o4204J3756
2934b33814L5530K18372O14207J503566J652381p0866j538633j602477o26991j95486N099
2923b39112J7347L9147L26979O05778J398967J327810r3641j277360p71390O01286M32744
2912B368555k41359j231833q27561L71663N55890J762711J126901k65300o77890O07206
2902C548983J234773m44202j894734j555002k91042o5331N74492Q56804m3956m93564
2892A427221L00480J361132R31097m91792j599519j275387n08047j59462m6332j52002
$$ plain form
2968 5007517 5953243 6030671 5638321 5610564 5743761 5799384 4893278 4342505 4720267 4414400 3527480
2957 3527480 3464246 3541782 2910746 2586131 2417979 2126097 1593735 802662 457484 421214 43378
2946 43378 -181158 -171548 40199 401981 1337196 2196665 1799259 882246 76031 -183366 -247570 -233814
2934 -233814 -198284 20088 634295 2137861 3790242 3719376 2180743 578266 -48725 -244211 -239112
2923 -239112 -221765 -182618 144361 750139 2149106 3476916 3383275 2105915 1334525 1935811 2368555
2912 2368555 2127196 895363 67802 439465 995355 2758066 3884967 3619667 2941777 3548983
2902 3548983 4783756 4339554 2444820 889818 598776 533445 1107937 1964741 1920785 1427221
2892 1427221 1727701 3088833 4019930 3528138 1928619 653232 145185 -14277 -60609 -212611
2882b12611k3296K20776J074779J791158J018997o88970j934989j000833l30954j96152
2872b82095j07374j2430O2798K26693J058797O95916k70076j041271n59265j28685j20777
2861d77769P0465r1417O7526j13030k02768K9711J20485J8507J0833J0981n660K3666n9969
2848e98439J7785m7462j34559M5365N7680M3245k3777l8642J8901O1502j00802J6875K092
2835f80236n989J23003l3577m4911J0775J7062m4660k2008L9370j4336o7448j8453J40424
2822f00984n3712O3737o2648J01146q3237j07336K03535k9418R582j1473j03420M6949
2810f27279R5615j5293p6756k8148L7753j43182J38529L6889L1835o9716q0521L1176J2609
2797f56489k7706o7627J2820J17312j3837O2062j61356L1498J12460n794j0905o8913l3420
$$ plain form
2882 -212611 -235907 -15131 1059648 2850806 3869803 3180833 1245844 245011 -85943 -282095
2872 -282095 -389469 -401899 -339101 -112408 946389 1642305 1372229 330958 -228307 -356992 -477769
2861 -477769 -407304 -498721 -431195 -544225 -746993 -717282 -596797 -578290 -567457 -556476 -562136 -538470 -598439
2848 -598439 -580654 -628116 -762675 -717310 -659630 -616385 -640162 -678804 -659903 -598401 -699203 -682328 -680236
2835 -680236 -686225 -563222 -596799 -641710 -630935 -613873 -658533 -680541 -641171 -655507 -722955 -741408 -600984
2822 -600984 -654696 -590959 -653607 -552461 -635698 -743034 -539499 -568917 -559335 -570808 -674228 -627279
2810 -627279 -531664 -546957 -623713 -651861 -614108 -757290 -618761 -581872 -550037 -619753 -700274 -669098 -656489
2797 -656489 -684195 -751822 -739002 -621690 -635527 -573465 -734821 -703323 -590863 -596657 -607562 -676475 -709895
2784g09895m1104K23576j52537j03874K9056J36019q5662R6606l3521O4798p1156k1295
2772f68989n1303N8551M5948M4507j3949n0990J8413j29982J38337n1145r70L1270m0632
2759f70934K4552m3770J15884o1904j7632P8466n9167j6150j0887o4728L7071J04682
2747e84517j51791J19645p5071P8156j8413N8076m7201M6326m8544q4629j6309p332K4937
2734g06667J28402j58669Q6103j5970m5074O595O806l8796L4561M4711m8154K7130J5563
2721f63459p569O8498j15246O39J01556j2291j49253L0063P2734M7742j4699l023L842
2708f40466J8321l3907K4890m498n0745j4078O9067p0551J9663J02423j27374J29293p9117
2695f57079k134O5291j70847P5117J3055J12141m987p9770q0496K7271k4443L1034n1400
$$ plain form
2784 -709895 -750999 -527423 -679960 -783834 -754778 -618759 -704421 -607815 -641336 -576538 -647694 -668989
2772 -668989 -720292 -661741 -615793 -571286 -585235 -636225 -617812 -747794 -609457 -660602 -661572 -630302 -670934
2759 -670934 -646382 -690152 -574268 -636172 -653804 -575338 -634505 -650655 -661542 -726270 -689199 -584517
2747 -584517 -736308 -616663 -691734 -613578 -631991 -573915 -621116 -574790 -623334 -707963 -724272 -731604 -706667
2734 -706667 -578265 -736934 -650831 -666801 -711875 -705280 -698474 -737270 -702709 -657998 -706152 -679022 -663459
2721 -663459 -671028 -602530 -717776 -717137 -615581 -627872 -777125 -747062 -674328 -626586 -641285 -644308 -640466
2708 -640466 -622145 -656052 -631162 -635660 -686405 -700483 -631416 -701967 -682304 -579881 -707255 -577962 -657079
2695 -657079 -659213 -593922 -764769 -689652 -676597 -564456 -569443 -649213 -729709 -702438 -726881 -695847 -747247
2682g47247P492J14268j31208Q9550j059p1477M2560k8697j0238J66867o2074j64514
2670g95777J60921k7926n2274j6518m9571J86683r4401j158m3691P6955n8943k385N1336
2657f66749Q8567j50520l284Q8809l1095o8408m3744M7855J16565k2499m2087k9348J42836
2644e73102j27612O0628M868j1990k8771Q0658r0904j08078J22442m5164Q0377j17829l577
2631g58054O0985q6261k2627J34149p4503Q0209o6377P0326q7249K14510j05729n885R7382
2618e49124j61213J06274j67666M4047p3610N3581J33404j6417n7772j8089p2156Q3650
2606f95091m5705M4670q1686J10990l5680J33434r9922L0512j0042p5629J36808j05011
2594f92352L6978m9948J6089M027l0385K0361L8943K061j30248J23446j13907J09706r2012
$$ plain form
2682 -747247 -739755 -625487 -756695 -667145 -668204 -739681 -697121 -725818 -736056 -569189 -631263 -795777
2670 -795777 -634856 -662782 -715056 -731574 -781145 -594462 -688863 -690021 -733712 -656757 -715700 -718085 -666749
2657 -666749 -578182 -728702 -731986 -643177 -674272 -742680 -786424 -738569 -622004 -644503 -686590 -715938 -573102
2644 -573102 -700714 -640086 -635218 -647208 -675979 -595321 -686225 -794303 -671861 -717025 -636648 -754477 -758054
2631 -758054 -697069 -783330 -805957 -671808 -746311 -666102 -732479 -662153 -749402 -534892 -640621 -646506 -549124
2618 -549124 -710337 -604063 -771729 -727682 -801292 -747711 -614307 -630724 -688496 -706585 -778741 -695091
2606 -695091 -740796 -696126 -777812 -666822 -702502 -569068 -668990 -638478 -648520 -724149 -587341 -692352
2594 -692352 -655374 -705322 -689233 -685206 -715591 -695230 -656287 -654226 -784474 -661028 -774935 -665229 -757241
2581g57241o496K15759p0989j24328K0271J5469N555j3522L0613K6574o0269R811Q4300
2568f24493p2480J02877j3657o6566J11135o6880q790J03617j05000q3767Q8720k8051
2556f63335J51963j10679o08R462r1082M9180Q3170O718j33862o3976R0025m7034n804
2543g25862N4382R8136L6053M1797j77582J76357n8889j08320K3173M7963m7759k6330
2531f66881J6088P4065r9228k3388R4800j1893p9145N6469l7325L4287N534m3716K8691
2518f51642o1893P5120k6620r3051L5925j951P6046j38122K01989p484m0918l1540J7382
2505f46759r9133K4273P2691n4927J47378j37318l8309j0626J25097O6874j01853o9190
2493g21802k5118o6596J45603j9279J60136m8796o7340K3637p6537J9336j64369J85224
$$ plain form
2581 -757241 -763737 -547978 -618967 -743295 -723024 -707555 -702000 -715522 -684909 -658335 -718604 -708793 -624493
2568 -624493 -696973 -594096 -607753 -674319 -563184 -630064 -638854 -535237 -640237 -724004 -635284 -663335
2556 -663335 -511372 -622051 -622659 -613197 -704279 -655099 -571929 -565211 -699073 -763049 -673024 -720058 -725862
2543 -725862 -671480 -573344 -537291 -495494 -673076 -496719 -555608 -663928 -640755 -592792 -640551 -666881
2531 -666881 -650793 -576728 -675956 -699344 -604544 -616437 -695582 -639113 -676438 -642151 -636617 -680333 -651642
2518 -651642 -713535 -638415 -665035 -758086 -722161 -724112 -648066 -786188 -584199 -591683 -632601 -664141 -646759
2505 -646759 -745892 -721619 -648928 -703855 -556477 -693795 -732104 -742730 -617633 -550759 -652612 -721802
2493 -721802 -746920 -813516 -667913 -687192 -527056 -575852 -643192 -619555 -696092 -676756 -841125 -655901
2481f55901m0589N7927o6620k805J08474j46357K7465K9816k4438Q1273j00625J67393
2469e64987n5646k5417J6548j7269k9764J4207n9840J3687N6882K1289J1771J5046O9159
2456e34334j14971J12052k41391L3163J28053N254p4918M9644K9187p1571Q9346n8864m398
2443f53748q0384Q0725j55263l9963O1656O0388K1500l5241N7548n6049J15938K7700j8610
2430f13803l1241q0103j5657P7755N7891q186q1408J19060j8127q0412K6131O019J6708
2417f25373j4908k5759n6118j3360J34168N2654j06897J89994P3383N0930j2373m1007Q876
2404c85790M1722j19262j17669Q0350l0720j4961P3388M8839R5637J17582j03233R3773
2392b20344k53968R3950J73514o9510K318J76333M9612M28964P68926K280338N147010
$$ plain form
2481 -655901 -696490 -638563 -705183 -707988 -599514 -745871 -718406 -688590 -713028 -631755 -732380 -564987
2469 -564987 -620633 -646050 -629502 -646771 -676535 -662328 -722168 -708481 -651599 -630310 -618539 -603493 -534334
2456 -534334 -649305 -537253 -778644 -745481 -617428 -612174 -687092 -637448 -608261 -679832 -590486 -649350 -653748
2443 -653748 -734132 -653407 -808670 -848633 -786977 -726589 -705089 -740330 -682782 -738831 -622893 -595193 -613803
2430 -613803 -645044 -725147 -740804 -663049 -605158 -613344 -694752 -575692 -593819 -674231 -648100 -642081 -625373
2417 -625373 -640281 -666040 -722158 -735518 -601350 -548696 -655593 -465599 -392216 -341286 -353659 -394666 -385790
2404 -385790 -344068 -463330 -580999 -500649 -531369 -546330 -472942 -424103 -328466 -210884 -314117 -220344
2392 -220344 -474312 -380362 -206848 -276358 -274040 -97707 -48095 380869 1149795 3430133 8577143
2381H577143N004342J051412k843557k771015p80350q18049j146586j732350j164504
2372C376486J80083J262572M316767N422113L111830j365776m148591j944170m04305
2363I807009j251685k787514j771430j55771M49700K272133K509457J027739J179445
2354A1279083L247100L760777p02516l907745m764338j759077M72899r91257M189J691483
2344H330598K421995K374908J149594K151912J651770k938261n579467n070994k694706
2335A797349j015481k05900l65287l10496o7930J06513J97877L4524M55176N85997k84783
2324I27559n84413n7282O04573J423893Q98283j387883j167504J234J066266J200225
2314B924951l50305j417610p75284l3044M45245O3512m28876K28331O09628n67792p19371
$$ plain form
2381 8577143 13581485 14632897 11789340 9018325 8237975 7419926 6273340 4540990 3376486
2372 3376486 3556569 4819141 9135908 14558021 17669851 16304075 12155484 10211314 9807009
2363 9807009 8555324 5767810 3996380 3840609 4290309 6562442 9071899 10099638 11279083
2354 11279083 14526183 18286960 17584444 13676699 8912361 7153284 7626183 6634926 6639115 8330598
2344 8330598 10752593 13127501 14277095 16429007 18080777 15142516 9563049 4492055 1797349
2335 1797349 781868 575968 210681 -99815 -167745 -61232 136645 171169 626345 1212342 927559
2324 927559 343146 285864 890437 2314330 3212613 1824730 657226 658460 1724726 2924951
2314 2924951 2574646 1157036 381752 348708 793953 857465 428589 656920 1266548 698756 -20615
2303b0615K83035R81741K108877J051628k090827j422642N82111J781478O77877k054359
2293A878304j252668Q9754M26748l03759q49844k71984j1187n0872j63145J27823n7488
2282d38318m4306K6039L19438O69807N41763q21425l60305K24417J182150K020782R6651
2271C416693k037089p46473Q13652J709432N0077j757379r74019N4361K87990m35509
2261C81736o12733k33129p5150M1264J982j48470P5534J0572j49596J28160P1549p4377
2249e82658k2867K2071J906p0549N9458k2174N5178J39668n7023j23100K2616p7737l6801
2236f92012J10115L3552j21059O4553m7793N7735P1853j00385N075J40457K6115J15748
2224c36046O7554q3022j66492P382J9078j04468L4755J50342N2371J4925Q3212n4226p1513
$$ plain form
2303 -20615 262420 1244161 3353038 4404666 2313839 891197 1473308 3254786 3932663 1878304
2293 1878304 625636 715390 1142138 838379 -11465 -283449 -294636 -345508 -508653 -380830 -438318
2282 -438318 -482624 -456585 -137147 532660 1074423 252998 -107307 117110 1299260 3320042 3416693
2271 3416693 1379604 633131 1446783 3156215 3206292 1448913 474894 529255 817245 381736
2261 381736 -230997 -464126 -539276 -498012 -496030 -644500 -568966 -558394 -707990 -579830 -508281 -582658
2249 -582658 -605525 -583454 -581548 -652097 -592639 -614813 -559635 -419967 -476990 -600090 -577474 -655211 -692012
2236 -692012 -581897 -548345 -669404 -604851 -652644 -594909 -523056 -623441 -618366 -477909 -451794 -336046
2224 -336046 -268492 -351514 -518006 -510624 -491546 -596014 -561259 -410917 -358546 -343621 -260409 -314635 -386148
2211c86148j486k79041J25019k1319M0168m5695O306n3798J16828J7813j4561q6869L14483
2198b68300K0392j50471n8124K3830J03631J97064L51L8374j51295Q9217K2180o712j40879
2185b80742N7638P1472P0813J98303k20926j57847q5721m0273o559j3282J12446j30533
2173d25211K41045l3809M5160o1037R6382P5766J12164J24119K6420k48109O6437J4205
2161C3532M8028N5994j69616o0294R8431Q4303j63816p2163J73336n7471J222M8796K2862
2148D3144J63373j46651J3077j34913K3385N7228j84L68j47374L3692O6293j8048j09755
2135a56365J06002j11990J4805P120q6042P534M3515P1983j1917q8938P5305L8171J2678
2122g8139r3626n080P1602j25712j57336J31904k23449R4597L5548o45p2629K5771k3533
$$ plain form
2211 -386148 -387634 -666675 -541656 -562975 -522807 -568502 -562196 -615994 -499166 -481353 -495914 -582783 -268300
2198 -268300 -247908 -398379 -456503 -432673 -329042 -131978 -131627 -93253 -244548 -155331 -133151 -139863 -280742
2185 -280742 -223104 -151632 -80819 117484 -103442 -261289 -347010 -387283 -393842 -407124 -294678 -425211
2173 -425211 -184166 -217975 -172815 -233852 -137470 -61704 50460 174579 200999 -47110 19327 33532
2161 33532 81560 137554 -32062 -92356 6075 90378 -73438 -145601 27735 -29736 -28514 20282 43144
2148 43144 206517 59866 72943 -61970 -38585 18643 18459 18827 -128547 -94855 -28562 -46610 -156365
2135 -156365 -50363 -162353 -147548 -140428 -226470 -218936 -175421 -103438 -115355 -204293 -128988 -90817 -78139
2122 -78139 -171765 -176845 -105243 -230955 -388291 -256387 -479836 -385239 -349691 -350336 -422965 -397194 -420727
2109d20727M8554J08548j16417n2038O859r5784j2843J91358k909r6023m7940J12689k9311
2096d05984r2522K07118j28117k7860j147N8521J351m9699L423L3332k4197j2366K5586
2083d12561P9799j08061N7561J10997o0139O7319L5012J97376J67912L94401m356M8646
2071E73906k77124r5308j06429K1168K8853K65549K08322K03322J36464o6572j24031o9956
2059F98164M2587J56451J88433K85873K71982O10640M09058N44442J276530L833312
2049H317472O772833R143272J1076614J0419286J432954j2706501j4885235p505326n78099
2040A1487270L598450O625724Q780098J1544308J1157393K48348j3178550j4679507
2032B5583534q373647m260188j938984j11523K430800M750135L128630p97796j008870
$$ plain form
2109 -420727 -372173 -263625 -380042 -432080 -425221 -521005 -533848 -342490 -345399 -441422 -489362 -376673 -405984
2096 -405984 -498506 -291388 -419505 -447365 -448512 -389991 -388640 -438339 -434916 -401584 -425781 -438147 -412561
2083 -412561 -332762 -440823 -383262 -272265 -332404 -265085 -230073 -32697 135215 529616 525260 573906
2071 573906 296782 201474 95045 116213 145066 410615 618937 822259 958723 892151 768120 698164
2059 698164 740751 897202 1085635 1371508 1643490 2254130 2663188 3207630 4484160 8317472
2049 8317472 15090305 24233577 35310191 45729477 47162431 34455930 19570695 12065369 11487270
2040 11487270 15085720 21711444 30491542 42035850 53193243 53441591 40263041 25583534
2032 25583534 17209887 12949699 11010715 10899192 13329992 18080127 21208757 20410961 19402091
2023A9402091J784616M462678J1347625J6757590J996192j3145455m973397Q315336
2015D5947276J3411567J7001913J1933638l111251p954222k65858m090999j3341316
2007E9530748n990649O932608J1281555J3311934R309657o234372j6487099j1724131
1999E9930251m047488K314690N539632Q949782J1227037J0496631O135937q25570m422913
1990I5297989j952379Q893045J5868037o81520j7075065j1571582k600932j109233n75513
1981H4492847K410587P138438J5855489K3411166J1177886p028496p453876l36581J185999
1972A30853459j341569o407741r388760r115958p521996o332044m929643k967808j953657
1963H0894283j547975j225831m72933J39276L52566L22976J155317K113953K752586
$$ plain form
2023 19402091 21186707 25649385 36997010 53754600 55750792 42605337 37631940 45947276
2015 45947276 59358843 76360756 88294394 85183143 77228921 76963063 72872064 59530748
2007 59530748 53540099 60472707 71754262 85066196 94375853 88141481 71654382 59930251
1999 59930251 55882763 58197453 63737085 72686867 83913904 94410535 100546472 99720902 95297989
1990 95297989 93345610 102238655 118106692 117425172 100350107 88778525 86177593 85068360 84492847
1981 84492847 86903434 94041872 109897361 133308527 144486413 137457917 130004041 129667460 130853459
1972 130853459 129511890 123104149 113715389 104599431 97077435 90745391 85815748 82847940 80894283
1963 80894283 79346308 78120477 77647544 77786820 78139386 78462362 79617679 81731632 84484218
1954H4484218K626550K680946J048969l623408p545675q846844q765569p891251o229561
1945D7938375m013627k999978k470428k330476k218833j724384j487701q58920o94798
1936B9139230j99111m6477L78832Q43363L27860j504999l865876l547141k026178o42624
1926A8856879P62065K633506N740789J2895749K4725494K8543523j229431l1968575
1918F0959999k5381926j3202673p142010l760776k636450j574447j207417q63490o18787
1909D572023o12790l56757l87258k39338l01810l05345j22357k31810j44652j42520k53651
1898A473735j9572J00477J06299L47449K56244J74365m44723o57377k45088j79061j85776
1887G26972k26192j21936L5709l243m4985r8259j59640J4473O2775j56905J2230o9647
$$ plain form
1954 84484218 87110768 89791714 90840683 87217275 79671600 70824756 62059187 54167936 47938375
1945 47938375 43924748 40924770 38454342 36123866 33905033 32180649 30692948 29834028 29139230
1936 29139230 28940119 28893642 29272474 30115837 30443697 28938698 25072822 21525681 19499503 18856879
1926 18856879 19618944 22252450 27993239 40888988 65614482 94158005 92928574 60959999
1918 60959999 35578073 22375400 15233390 11472614 8836164 7261717 6054300 5190810 4572023
1909 4572023 3959233 3602476 3215218 2975880 2674070 2368725 2246368 2014558 1869906 1727386 1473735
1898 1473735 1454163 1554640 1660939 2008388 2264632 2438997 1994274 1336897 1091809 912748 726972
1887 726972 500780 378844 414553 411310 366325 268066 108426 122899 185674 28769 40999 -28648
1875b8648j48016K20526j11381m0392j3404m2927Q8404L3972M548n4436l0399k2034M6604
1862i7583J15621R0221j68989J6102j09452o4015K2423J6141R3117J68272l8619J14694
1850A57933j83873k22276p7723L1717o3609J40633K6334o4938J32328j75862j9889R9016
1838b20209M7112J35040J45219J7372j48645j93391Q5646N4612R4563N7915j14754L0906
1826h614J32104r7988L0390p9823l8015N3889K16279J56062k22117q6623j17316J44854
1814H3082j00078j01015R4389N0861j1772n4870r4111J21859M7855Q2247Q8863J15423
1802C22733j82167j32966R4230o6410K0708J08824M0628O6656K42436j09468j27436j63505
1790A14263j7283j11195J3537K382r5833J62858r3512O0783K4529Q0779J8189q6313l398
$$ plain form
1875 -28648 -176664 43862 -67519 -107911 -121315 -164242 -75838 -41866 -37318 -91754 -122153 -144187 -97583
1862 -97583 18038 108259 -60730 -44628 -154080 -218095 -195672 -179531 -86414 81858 43239 157933
1850 157933 -25940 -248216 -325939 -294222 -357831 -217198 -190864 -255802 -123474 -299336 -319225 -220209
1838 -220209 -173097 -38057 107162 124534 -24111 -217502 -131856 -77244 17319 75234 -39520 -8614
1826 -8614 123490 25502 55892 -23931 -61946 -8057 208222 364284 142167 55544 -61772 83082
1814 83082 -16996 -118011 -23622 27239 15467 -39403 -133514 -11655 36200 118447 207310 322733
1802 322733 140566 7600 101830 35420 56128 164952 205580 272236 514672 405204 277768 114263
1790 114263 96980 -14215 -678 1704 -94129 68729 -24783 36000 60529 141308 159497 73184 69786
1777F9786M8554J0570o4167p1197m4774K4558m6063j68774J17458k4588r2015O4696m2216
1764b18172J22385j83305J13640P1L367Q5936j07030J42847r3694J7654K0732J6838r5784
1751a74515j7881j40062l6384M7201l0563L1073Q7731j11708J23766p7323j5642n777N1723
1738b68361K61236L63238N00678K3895n37166k42137J36873O58468J289406K26134j245300
1727A166964m46399P16863J659696K14339j311586r91066L34590J873244K017785j191097
1717D043333k403770o93566Q26095J421680J64291j292856j131192J40465J105929L80720
1707B561129j027081j033550j79490L46399M39933p9573o23297l06238k29824J03804q5162
1696a12950j3718N5788k4371L2983m6283J48051K01968M45803N63298m1600l88116j76442
$$ plain form
1777 69786 118340 128910 64743 -6454 -51228 -26670 -72733 -241507 -124049 -148637 -240652 -175956 -218172
1764 -218172 -95787 -279092 -165452 -165381 -162014 -76078 -183108 -40261 -133955 -116301 -95569 -78731 -174515
1751 -174515 -192396 -332458 -368842 -321641 -352204 -321131 -233400 -345108 -221342 -298665 -314307 -320084 -268361
1738 -268361 -7125 356113 856791 880686 343520 101383 238256 896724 2186130 2412264 1166964
1727 1166964 720565 1437428 3097124 3311463 1999877 1008811 1343401 3216645 5234430 4043333
1717 4043333 1639563 945997 1772092 3193772 3358063 2065207 934015 1074480 2180409 2561129
1707 2561129 1534048 500498 321008 667407 1107340 1027767 404470 98232 -131592 -27788 -112950
1696 -112950 -126668 -70880 -95251 -62268 -108551 39500 241468 687271 1250569 1208969 820853 644411
1684F44411L79149R45017N54380q82734p78445J30024R67631J615344m01621j562678
1674A610478m03510J185269K071752p378k351527j003435N27188J041232O78381p42363
1664B606087j316187l25744O86243Q58936n65030r72658l29635K39070L32619l12957
1654I00744l80650l30304m9512j87941n658N5001L8474J06190J21603j37831n4110l7742
1642C8264Q5492n7480p8919P368J27719r8956J63995J61770J7008J19074r5189j72053
1630B18093J13956R659n5702R003o6796m7261l6285j6326J1703K2382j3189J10929L2588
1617B92754J21407k2351Q6546J20304J54547J98249O34896P24290J265795K522956L227883
1606I327276L234252J573506J596429K920231J430969Q23790m900631k090229k497363
$$ plain form
1684 644411 1023560 1968577 2522957 1640223 861778 991802 1959433 3574777 3173156 1610478
1674 1610478 1206968 2392237 4463989 4456611 2105084 1101649 1628837 2670069 3348450 2606087
1664 2606087 1289900 964156 1650399 2509335 1944305 971647 642012 881082 1213701 900744
1654 900744 520094 189790 140278 -47663 -53321 1680 40154 146344 267947 130116 76006 38264
1642 38264 123756 66276 -12643 -5275 122444 23488 187483 349253 366261 485335 390146 218093
1630 218093 332049 341708 286006 295009 228213 180952 144667 128341 140044 162426 149237 260166 292754
1617 292754 414161 391810 478356 598660 753207 951456 1586352 2310642 3576437 6099393 9327276
1606 9327276 12561528 14135034 15731463 18651694 20082663 20906453 16005822 13915593 11418230
1597A1418230L49527k234936k142585k651074j328582r14430n78604n5100J58058P42348
1587B762852J092943K115343L246160L360073K634930l4397L137657M124511M108496
1578B6548568N85420l599705k670990k702887j498697n077913l525159l160885j506435
1569C391317j169273p41716l32800l9759M9695j42719n3471J22079j03387K8354j6624
1558I91696K6522J29438Q5589K05966O57123J262068J338213L74580m12844l76184J221627
1547E503794K217412L38479j266266k026499p05945O46145J01621n48378j136635o96227
1537B427501k55460j27578L6870K37314M76162Q90161J701417J394822J91113j61677
1527F810645K63776K505126K149428k95331j762926k404219k94728O85617k84804j132357
$$ plain form
1597 11418230 11767757 9532821 7390236 4739162 3410580 2496150 1917546 1862446 2020504 2762852
1587 2762852 3855795 5971138 9217298 12577371 15212301 15177904 18315561 22440072 26548568
1578 26548568 27133988 23534283 20863293 18160406 16661709 11583796 8058637 4897752 3391317
1569 3391317 2222044 1480328 1147528 1107769 1157464 1014745 961274 1083353 979966 1008320 991696
1558 991696 1018218 1147656 1233245 1439211 2096334 3358402 4696615 5071195 4658351 4282167 5503794
1547 5503794 7721206 8059685 6793419 4766920 4060975 4707120 4808741 4260363 3123728 2427501
1537 2427501 2172041 2044463 2081333 2318647 2794809 3684970 5386387 6781209 6972322 6810645
1527 6810645 7074421 9579547 11728975 11433644 9670718 7266499 6971771 7657388 7372584 6240227
1517F240227j599350n45696M08160J026987K501061N680280O683356J98033m565827P26188
1507A6753419Q427729J2656316P607757J641367j150331j903211J0994142J9789366
1499G4816554K1240943M233870k2484616q830000j155261J925202p70224j1428359
1491E7548109j6801457q735869N915655J6680026J2633531P52845J0259379R311816
1483H7564035P853244J2349581P414443k1530502k6060475n735944O339730P399034
1475G5593146j0946640k2292198j2084199R97025N611116q40559l016984J0544824
1467D3565531K0386019o89223q125006k9760343j1066716p45455N626564J3575156O943686
1458C9710213R95512K342142J4522652R824068l416765k4533240j5418992o370211L016823
$$ plain form
1517 6240227 4640877 4095181 4503341 5530328 8031389 13711669 20395025 20593058 16027231 16753419
1507 16753419 25181148 37837464 45445221 47086588 45936257 44033046 55027188 74816554
1499 74816554 96057497 100291367 77806751 68976751 67821490 69746692 68976468 57548109
1491 57548109 40746652 32010783 37926438 54606464 67239995 67992840 78252219 87564035
1483 87564035 95417279 107766860 115181303 93650801 67590326 61854382 68194112 75593146
1475 75593146 64646506 42354308 30270109 31267134 36878250 36037691 33020707 43565531
1467 43565531 63951550 63262327 55137321 25376978 14310262 13564807 19191371 32766527 39710213
1458 39710213 40705725 43047867 57570519 67394587 63977822 39444582 24025590 17655379 20672202
1449B0672202J4455278J7931936M035281j1815178j5744706j1489899l427879j10684
1441A4506351n02065J403706K627091J858730m46813j306099O99065K670910L249595
1432B4760471J179016r31121J404299M398244N408699j941640n572630J042840j869417
1423B7878761j264226Q8504K518831j748128r16515K259858J385901l92157L251634
1414C3062463K629744m334972l239065Q80422J462527K53538j867288j155487j7563
1405B7674319J372631N49221r29248q95114Q85819K676385K995514N123473R776177
1396D9229177P233043M424646J214161j532543M299650P959965J0785139R307402O490051
1387I9410691M682511J589665L538939L776427M323567N815111P970944R500057J0304966
$$ plain form
1449 20672202 35127480 53059416 57094697 45279519 29534813 18044914 14617035 14506351
1441 14506351 14004286 15407992 18035083 19893813 19447000 18140901 18839966 21510876 24760471
1432 24760471 25939487 25008366 26412665 30810909 36219608 34277968 28705338 29748178 27878761
1423 27878761 26614535 26703039 29221870 27473742 26557227 28817085 30202986 29810829 33062463
1414 33062463 35692207 31357235 28118170 28998592 30461119 30714657 28847369 27691882 27674319
1405 27674319 29046950 29596171 28666923 27771809 28657628 31334013 34329527 39453000 49229177
1396 49229177 56462220 60886866 62101027 60568484 64868134 72828099 83613238 92920640 99410691
1387 99410691 104093202 105682867 109221806 112998233 117321800 123136911 131107855 140607912 150912878
1378A50912878R990006Q515278P572777P528651P827161P943699R396526J2145480
1370B21832456J6013997K0172795K3937955K5445805K3482782J7510841P042854n180839
1362C50258646j3711371j6184892j3295566j0500892q566673p546279n537272k760122
1354B72155579j098210j886875m585793n248923m885746m584269n874223p906111r612402
1345B26473027r583214q015913n201352r81602K806128L189144K95272J743435L624322
1336B14349247N039318L383957J350294P494904K022144K127334j7651393o817687q710595
1327B02587523M992961m907345k702036p473259J223694O426678J0025682Q096644N983926
1318B24254468M166082M321615P511720J1177495R918176R513957N703879J6238780
$$ plain form
1378 150912878 160902884 169418162 176990939 184519590 192346751 200290450 209686976 221832456
1370 221832456 237846453 258019248 281957203 307403008 330885790 348396631 355439485 350258646
1362 350258646 336547275 320362383 307066817 296565925 287999252 280452973 274915701 272155579
1354 272155579 271057369 269170494 264584701 259335778 254450032 249865763 243991540 236085429 226473027
1345 226473027 216889813 208873900 203672548 202690946 205497074 208686218 208981490 210724925 214349247
1336 214349247 219388565 222772522 224122816 231617720 233639864 235767198 218115805 211298118 202587523
1327 202587523 207580484 202673139 199971103 192497844 193721538 200148216 210173898 218270542 224254468
1318 224254468 228420550 232742165 240253885 251431380 261349556 270863513 276567392 292806172
1310B92806172J2273260J6816446l415304j038522q643321l46064m686799J357416O230037
1301C11353321J8726682L0109985M2531005N7019151P2687558Q6628566R8721183
1294G17777451J12643320J25566389J38693694J56468539J78202857J98754219K09156490
1287A837262959J93824633J16396055l4997447j86120851k60412418k80926516k76315792
1280A108710623k42991347j93765336j46228949j07282948p8794998n8419428m4319383
1273B36908234l4123558k6265580k0628922j7055098j4289693j1864016r264426o666224
1265I6750717m564902k667419j668308j115007p39615p44772j623018l567113n757484
1256G4303079p540838q020042p830480o978209o072878m936030m222270l306540l051312
$$ plain form
1310 292806172 305079432 321895878 318480574 317442052 308798731 308452667 303765868 305123284 311353321
1301 311353321 330080003 360189988 402720993 459740144 532427702 619056268 717777451
1294 717777451 830420771 955987160 1094680854 1251149393 1429352250 1628106469 1837262959
1287 1837262959 2031087592 2147483647 2112486200 1926365349 1665952931 1385026415 1108710623
1280 1108710623 865719276 671953940 525724991 418442043 339647045 281227617 236908234
1273 236908234 202784676 176519096 155890174 138835076 124545383 112681367 103416941 96750717
1265 96750717 92185815 89518396 87850088 86735081 85995466 85250694 83627676 80060563 74303079
1256 74303079 66762241 58742199 50911719 43933510 37860632 32924602 28702332 25395792 22344480
1247B2344480k673281k085155j894231j356826j203962o67908o45350p80028p24713o16203
1237I696823q87116m49035l97568k50957m53782l08912k91806m06535n18834m63851k70038
1226D998389l93230l73355j88738j81580K7585k86549j70240j48231j81094j88456k56366
1215B658135m5101k57398l15429k86270j23007k21037k07821n0849k01719j50549j13443
1204F85512n4791l2423r7223j77357J84367Q0048Q1260L33235O7241L6057j9599P5710
1192A162037q2178l1040j579j70881j13620M4652p8285o288o7265k8422p7098J5634j05454
1179D60213J2637p8988J2767Q0237K21877j81567K2777N9590r3876J9737J52904K966K4475
1166G15749Q4519M0163q7769K0057j22669m8993p522j1326j13378K11746J20532K58919
$$ plain form
1247 22344480 19671199 17586044 15691813 14334987 13131025 12463117 11817767 11037739 10313026 9696823
1237 9696823 8809707 8360672 7963104 7712147 7258365 6949453 6657647 6251112 5732278 5268427 4998389
1226 4998389 4605159 4231804 4043066 3861486 3889071 3602522 3432282 3284051 3102957 2914501 2658135
1215 2658135 2613034 2355636 2040207 1753937 1630930 1409893 1202072 1151223 949504 798955 685512
1204 685512 630721 598298 501075 323718 508085 588133 669393 1002628 1069869 1105926 1086327 1162037
1192 1162037 1079859 1048819 1047240 876359 762739 807391 729106 722818 655553 627131 550033 565667 460213
1179 460213 472850 393862 406629 486866 708743 527176 549953 609543 515667 535404 688308 691274 715749
1166 715749 800268 840431 752662 772719 650050 601057 593535 582209 468831 680577 801109 1060028
1154A060028J37101M0702J57447J32068M5958J05839o6692J4740m63j8443n9733m3010
1142A505542o4865k727j39001R7788N396L4608P5202O2189K56355N1842J36697K81703
1130B300729K5784K35272K07178Q1460j19828j91660o0677m9864r6285j62427P5388m6862
1118B198208j13191o9822j9599N2280M4081k3808j20820J21186n5129R2876N262r2678
1106B018846o6492j30279p7923k94015p5793j22587q5208k27383l1606n3935j7857k0636
1094H15132j31229l8576K8154q9912l6276N451m4146j10227m3740j31153p1224j89539
1082c7285N6275j28842j40214O6438l1605O8515m0700q7044L5894o8974J81003O9770
1070e6769K23489Q6506L27677j505j33594k74147k5558j61342N6047j18338o2918o9013
$$ plain form
1154 1060028 1197129 1237831 1395278 1527346 1573304 1679143 1612451 1627191 1626728 1608285 1548552 1505542
1142 1505542 1440677 1437950 1298949 1396737 1402133 1436741 1511943 1574132 1830487 1882329 2019026 2300729
1130 2300729 2326513 2561785 2768963 2850423 2730595 2538935 2478258 2428394 2332109 2169682 2245070 2198208
1118 2198208 2085017 2015195 1995596 2047876 2091957 2068149 1947329 2068515 2013386 2106262 2111524 2018846
1106 2018846 1952354 1822075 1744152 1450137 1374344 1251757 1166549 939166 907560 853625 835768 815132
1094 815132 683903 645327 673481 583569 547293 552744 508598 398371 354631 223478 152254 -37285
1082 -37285 18990 -109852 -250066 -183628 -215233 -146718 -187418 -274462 -238568 -307542 -126539 -56769
1070 -56769 166720 253226 580903 579398 445804 171657 146099 -15243 40804 -77534 -140452 -209465
1058b09465M4325n0779j18633R0813O4175J85798M21057J228749J338211q18350j474366
1047G01535o75462l68620o5248n2864j8202q7074K3379p0239N6893q4086J25291j67718
1035f82415L58622j18268K67341L46449K27090j44700k79902m22220n2617j33407j49537
1024g83564K1418l9174M5407p5856R2076m1175r6819o3930q4383J64116K8889K174P5334
1011g55487l1235q220L2230j23528J08458j24089n4924P4909L557N1151J8753l269p1489
998h83183L289n6569P1093o725L4740Q9786M3942j08118P3480J3423k1704l9075l0689
985h16310N2418L7790p4496J32926J34648j22196k052o9022J01612q5792J0401J06892
973e93181J7526r5803M5970j645J10803J12378j26086J70960j24569J53578J7145m0761
$$ plain form
1058 -209465 -165140 -215919 -334552 -243739 -179564 6234 427291 1656040 2994251 2175901 701535
1047 701535 26073 -342547 -407795 -460659 -478861 -565935 -542556 -612795 -555902 -639988 -514697 -682415
1035 -682415 -323793 -442061 -174720 171729 398819 254119 -25783 -448003 -500620 -634027 -783564
1024 -783564 -762146 -801320 -755913 -831769 -739693 -780868 -877687 -941617 -1026000 -861884 -832995 -830821 -755487
1011 -755487 -786722 -794942 -762712 -886240 -777782 -901871 -956795 -881886 -878329 -827178 -808425 -811694 -883183
998 -883183 -879894 -936463 -865370 -872095 -837355 -747569 -703627 -811745 -738265 -724842 -746546 -785621 -816310
985 -816310 -763892 -726102 -800598 -667672 -533024 -655220 -657272 -726294 -624682 -710474 -700073 -593181
973 -593181 -575655 -671458 -625488 -627133 -516330 -403952 -530038 -359078 -483647 -330069 -312924 -353685
961c53685m932n3834Q1422j2284K13828J36577j4290M3880j11371l4373J11693J04925
949A07556J4662M8478O1208M8724J14039J46378J56192o1599Q0615K14356K73863L60221
937A564693N88275k0956l79087l5086K81444K45448N02040J106664J529656J452810J33348
926F969249m26272o00838j16395p7790q1543R4734J26891K84439L29159N26630N23441
915G551705L87476Q88707J279804K455528N385191Q040661O320907j563167j138700
906B9608112L048846O967507J4388554L0664153O1536149Q4649144L6468015m2898297
898B24432183m8891275l1145500j8459141j1251539j0052183r105763o675128l269643
890H5582011j64531K330013L622630O308224J4593377L3865242R7370482K46574259
$$ plain form
961 -353685 -358617 -412451 -331029 -343313 -129485 7092 -7198 36682 -74689 -109062 2631 107556
949 107556 122218 170696 231904 280628 394667 541045 697237 635638 716253 930609 1204472 1564693
937 1564693 2152968 2132012 1752925 1717839 1999283 2244731 2746771 3853435 5383091 6835901 6969249
926 6969249 6542977 5942139 5825744 5747954 5666411 5761145 5888036 6172475 6501634 7028264 7551705
915 7551705 7939181 8827888 10107692 12563220 17948411 25989072 32309979 30746812 29608112
906 29608112 32656958 39624465 54013019 84677172 146213321 230862465 267330480 224432183
898 224432183 175540908 144395408 125936267 114684728 104632545 95526782 88851654 85582011
890 85582011 85417480 87747493 91370123 97678347 112271724 146136966 243507448 490081707
882D90081707L30648388j73824291l53659741j33820854n5454154k6135557j2015083
875F5820415m417401n270509p386126m680187r25272K452193N061075O767526J0661417
866F8083131J9845843M1700880Q0058430R6214466m374829j14756196r1365222m3159453
858E2247050j8248889p032533m45992L184728k654101r558035n934647k986731j838145
849F732705j211308r18830o92198o65172o32137m52993l68003n1542l2298J45470N0073
838A903767P41407J324435J473156L72682j578576j654030j175007m90970j31539j03030
828F82295j63176k11935l05031j89185p8445j37132k15449J8237L0544k6298M7662n6506
816f04419n9261p7168J75779j24090l5029Q4343k0717O4826j08178j13567Q895n4303j6692
$$ plain form
882 490081707 820730095 646905804 293246063 159425209 103971055 77835498 65820415
875 65820415 61403014 56132505 48746379 44066192 43140920 45593113 50654188 57421714 68083131
866 68083131 87928974 129629854 209688284 305902750 301527921 186771725 95406503 52247050
858 52247050 33998161 26965628 26519636 29704364 27050263 17492228 11557581 8570850 6732705
849 6732705 5521397 4602567 3910369 3245197 2613060 2160067 1792064 1740522 1708224 1853694 1903767
838 1903767 2645174 3969609 5442765 5815447 4236871 2582841 1407834 916864 785325 682295
828 682295 519119 307184 2153 -187032 -265477 -402609 -618058 -599821 -569277 -595575 -547913 -604419
816 -604419 -663680 -740848 -565069 -689159 -724188 -639845 -660562 -595736 -703914 -817481 -808586 -862889 -879581
803h79581l120p1010j67460j09409K10159L5656R665n5205J2788N7925j2487O7318k4881
790i29642n1246N5740j13863K5311J8519j13490k4820l191M4505L2057N7732Q305j35637O2
776a129658R3814m9600M0462J30338j83576m7533Q689m1105K22850j21098L237K6951n7439
763a103668m4780J63774j6366l5270O7965l4048K0128j01687k6154J8900Q5933j36701
751a141974q6140J01675R2547m5031Q7575j3662l6695p6852Q6478r3009M5401Q0799m2014
738a040902N7740Q1902l1767m144j00710R2442J20037L41439M54476N08808o113m10399
726F2809k81710j53356o5077k01103r3845m5094P0364J1738o7217Q9976J06015j89294
714g55794O4433L64142N94009J446104J768263j044151j921106p68156l16558j16683m9604
$$ plain form
803 -879581 -882701 -953711 -1121171 -1230580 -1020421 -984765 -975100 -1030305 -1017517 -959592 -972079 -904761 -929642
790 -929642 -980888 -925148 -1039011 -1013700 -995181 -1108671 -1133491 -1136682 -1092177 -1060120 -1002388 -994083 -1129720 -1129658
776 -1129658 -1035844 -1085444 -1044982 -914644 -1098220 -1145753 -1137064 -1178169 -955319 -1076417 -1073180 -1046229 -1103668
763 -1103668 -1148448 -984674 -1001040 -1036310 -968345 -1002393 -982265 -1083952 -1110106 -1091206 -1005273 -1141974
751 -1141974 -1228114 -1126439 -1033892 -1078923 -991348 -1005010 -1041705 -1118557 -1032079 -1125088 -1079687 -998888 -1040902
738 -1040902 -983162 -901260 -933027 -937171 -1037881 -945439 -825402 -483963 -29487 479321 473208 62809
726 62809 -218901 -372257 -437334 -638437 -732282 -777376 -707012 -695274 -762491 -672515 -566500 -755794
714 -755794 -691361 -327219 266790 1712894 3481157 2437006 515900 -252256 -568814 -685497 -735101
703g35101j06771m4526R099o7225o189J07221j0877M9658k3325K56119J87899L82090
691a928P78946J21373r84769m26435l53680P725q2886p1397J09970r5180n1983M4624l6866
678a042486l5814k6599J11333m7024L6841O4085j42962Q9848j8841p5364N4208N4927
666i77848j78357J30349R5787q6743o8582R2230j00137k6613P5358j87635Q1962K9228
654a121001Q1393L4945q3724k3310L1803m6776P5713m0743m9088Q5936J9226Q979M5032
641i81615k4644j61666J14390m1413M3349J237L2939j06229Q8521K6695Q573j85917J54516
628a031264m18M252o3745J5124M7640O5475p7088O1626j06077O3162L438r7445O9812K2652
614a022856l4729j51380K77119p4083P998j16261J31264m4307O451L8027K8607j26016
$$ plain form
703 -735101 -841872 -886398 -877299 -944524 -950713 -843492 -854369 -804711 -828036 -571917 -384018 -1928
691 -1928 777018 898391 -86378 -512813 -866493 -858768 -941654 -1013051 -903081 -998261 -1050244 -1005620 -1042486
678 -1042486 -1078300 -1104899 -993566 -1040590 -1003749 -939664 -1082626 -992778 -1011619 -1086983 -1032775 -977848
666 -977848 -1156205 -1025856 -930069 -1016812 -1085394 -993164 -1093301 -1119914 -1044556 -1232191 -1150229 -1121001
654 -1121001 -1039608 -1004663 -1088387 -1111697 -1079894 -1126670 -1050957 -1091700 -1140788 -1054852 -1035626 -1026647 -981615
641 -981615 -1006259 -1167925 -1053535 -1094948 -1051599 -1050362 -1017423 -1123652 -1035131 -1008436 -999863 -1185780 -1031264
628 -1031264 -1031682 -1027430 -1091175 -1076051 -1028411 -962936 -1040024 -978398 -1084475 -1021313 -1017875 -1115320 -1045508 -1022856
614 -1022856 -1057585 -1208965 -931846 -1005929 -997931 -1114192 -982928 -1027235 -1020784 -982757 -954150 -1080166
602a080166R9623R962R846p447k4144j19021N1833l4229J13944m119j9910m1703L8495k951
588a009987M0420n0179p7476J24130o9824M016K4848j7979n892m7935J13278k4566o0321
575a057467J3017R2089k6915M4301r7638q3395J75843n6908N1218m9365P4694o5537Q351
562i77712J5002j8750p6673R2760o6148k5211J34366K0357j950r0287l8436J3298J173O469
548a011742p6183Q9905K8956k9863J8815n1966r5610K0614J56875j43097J25421o0016O117
535a021774K6700N5190Q377k8767K5089M0809l3788J889j1537l2964J33681n8957j15979
522a012031O5753M7942r7673N8607q3896J06253q4497N1064M0068o5670m016J8835n0591
509a009852Q1817j343O3771p6790O4764j27215O7688j33617Q8266m7356Q5692o5483J02030
$$ plain form
602 -1080166 -980543 -970581 -960735 -968182 -992326 -1111347 -1059514 -1093743 -979799 -983918 -1003828 -1045531 -1007036 -1009987
588 -1009987 -969567 -1019746 -1097222 -973092 -1042916 -1038900 -1014052 -1032031 -1037923 -1085858 -972580 -997146 -1057467
575 -1057467 -1044450 -952361 -979276 -934975 -1032613 -1116008 -940165 -997073 -945855 -995220 -920526 -986063 -977712
562 -977712 -962710 -981460 -1058133 -965373 -1031521 -1056732 -922366 -902009 -903959 -994246 -1032682 -1019384 -1018211 -1011742
548 -1011742 -1087925 -998020 -969064 -998927 -980112 -1032078 -1127688 -1107074 -950199 -1093296 -967875 -1027891 -1021774
535 -1021774 -995074 -939884 -931507 -960274 -935185 -894376 -928164 -926275 -937812 -970776 -837095 -896052 -1012031
522 -1012031 -946278 -898336 -996009 -937402 -1021298 -915045 -999542 -948478 -908410 -974080 -978096 -959261 -1009852
509 -1009852 -928035 -929378 -865607 -942397 -877633 -1004848 -937160 -1070777 -982511 -1029867 -944175 -1009658 -907628
496i07628l4663K6349j2242m7797p958J04844n6156j34086M8211K32057j04519k1663q9784
483a005035O3869o0964J6826N5023j03583k8585N7722J3412l0557P5614N9936o2034L8225
470i10131M7302j22532M2677K654N1981j23003O1753q2140M3728Q8913k6437J4339j09185
457a020081m7698J49285p9003J2403J49793q8149K173k2897K2445m1558K7580N8686j25456
444a002477J32598p9382P6429j25178p080Q7286k7906J8456P789L1160j6296K775n6759
431i58585q2503J25840K1899K4065N148N0867o8328r9794R6147L7854j52358K8786Q9146
418h81816k8696l2355J0230J00528q9631Q2146j74534J21195j88210K10391j45200N8138
406i57814k1261N7188o5065P8761O117P7401n9887k6569J08923o1115r1322J68152j17101
$$ plain form
496 -907628 -942291 -915942 -928184 -975981 -983939 -879095 -935251 -1069337 -1021126 -789069 -893588 -915251 -1005035
483 -1005035 -941166 -1002130 -985304 -930281 -1033864 -1062449 -1004727 -991315 -1021872 -946258 -886322 -948356 -910131
470 -910131 -862829 -985361 -942684 -940030 -888049 -1011052 -949299 -1031439 -987711 -898798 -925235 -910896 -1020081
457 -1020081 -1067779 -918494 -997497 -985094 -835301 -923450 -921277 -944174 -921729 -963287 -935707 -877021 -1002477
444 -1002477 -869879 -949261 -872832 -998010 -1005090 -917804 -945710 -927254 -919465 -888305 -904601 -901826 -958585
431 -958585 -1041088 -915248 -893349 -869284 -864136 -813269 -881597 -981391 -885244 -847390 -999748 -970962 -881816
418 -881816 -910512 -942867 -932637 -832109 -921740 -839594 -1014128 -892933 -1081143 -870752 -1015952 -957814
406 -957814 -979075 -921887 -986952 -908191 -902074 -824673 -884560 -911129 -802206 -863321 -954643 -786491 -903592
393i03592k6909K9783r4252n5080J08653O6943O2040R124j07351n074m0237J28689j47544
380i74807J40100l932n3425r15k8694N4614N6771n2946n7879M5074N377l6270j18493
367a025425J59813K6542j7696l9941N3422j10316L051M4263l0595N1313n7716k5079J60861
354h07503r0836k7494j0530K5329n4927N5874q8501O7927k4650J57883j53746o31L6825
341i14980N6162n5552J3089L9968j04521P6211j4332O5090r3792N8951m1760n573q683
328i29722O5351j15785N0351k5441J06834j53421Q1982m2696l9064N8386J9774M6955k7560
315i04056n2923O9234P6158k19827L0620k639O0126K8200K481J3927L0795j62321J29824
302i00401J4819o7263n7368R079K6953M923r556m529P8897r7521J21446j37116J93350
$$ plain form
393 -903592 -930501 -900718 -994970 -1050050 -941397 -874454 -812414 -803290 -910641 -915715 -955952 -827263 -974807
380 -974807 -834707 -838639 -892064 -892979 -921673 -867059 -810288 -863234 -921113 -876039 -870662 -906932 -1025425
367 -1025425 -865612 -839070 -856766 -896707 -843285 -953601 -950550 -906287 -936882 -885569 -943285 -968364 -807503
354 -807503 -898339 -925833 -936363 -911034 -965961 -910087 -998588 -930661 -955311 -797428 -951174 -951805 -914980
341 -914980 -858818 -914370 -901281 -861313 -965834 -889623 -903955 -838865 -932657 -873706 -915466 -921039 -929722
328 -929722 -864371 -980156 -929805 -955246 -848412 -1001833 -919851 -962547 -1001611 -943225 -923451 -876496 -904056
315 -904056 -956979 -887745 -811587 -1031414 -1000794 -1003433 -943307 -915107 -912626 -898699 -867904 -1030225 -900401
302 -900401 -885582 -952845 -1010213 -1001134 -974181 -969258 -978814 -983343 -904446 -1001967 -880521 -1017637 -824287
289h24287l4333j68950Q1365N1681m3787j7791j8286J13367m9198m9964k497P7683j02167
276i87164M7222L743n0223J05675j19423J9182L0341N059q6700k5539N1710K0534O6932
263i18651m5145r6390O3305J02007p7472j3178J9576L0247j1107n5549O2548J0054q3783
250a013538P8201j02459J694K4075J16401k8712n4229J34011q4234L4783q6497j2318K2349
237i70473M6772j99r3336J12996m4040j5248N4629M931j26886l9615J96105l8332o3456
224i76152M8021N2193l9279J2554K2399j12370O3942k9m3720k566M8718K9177j06303P1479
210i31936k4887j0691K4192j0680p9553K9978N4745K0196M7945n4042j30487R1259L6158
197i37803L8547j65607O6875J37494p4034M2559p6066O6546q1727J4364q4239J10761n2627
$$ plain form
289 -824287 -858620 -1027570 -946205 -894524 -938311 -956102 -974388 -861021 -910219 -960183 -962680 -884997 -987164
276 -987164 -939942 -936199 -986422 -880747 -1000170 -980988 -950647 -945588 -1032288 -1057827 -1006117 -985583 -918651
263 -918651 -963796 -1060186 -996881 -894874 -972346 -985524 -965948 -935701 -946808 -1002357 -939809 -929755 -1013538
250 -1013538 -935337 -1037796 -1036102 -1012027 -895626 -924338 -978567 -844556 -928790 -894007 -980504 -992822 -970473
237 -970473 -923701 -923900 -1017236 -904240 -948280 -963528 -908899 -903968 -1030854 -1070469 -874364 -912696 -976152
224 -976152 -928131 -875938 -915217 -902663 -880264 -992634 -928692 -928721 -972441 -975007 -926289 -897112 -1003415 -931936
210 -931936 -956823 -967514 -943322 -954002 -1033555 -1003577 -948832 -928636 -880691 -934733 -1065220 -973961 -937803
197 -937803 -899256 -1064863 -997988 -860494 -934528 -891969 -968035 -901489 -983216 -968852 -1053091 -942330 -994957
184i94957J5053n8136M6383K8072J2105l8898N8199l3318n5312n127L7208r1386J50406
171i29708J19695j86820R5519j14908J63284o0497o2006L6119Q9147r295r7898n5154
159a012522J04355J11085k47016L5413Q8487L4427j16371R9144k5385o3338L4819M4047
147i12855j26807M5705M6769J4697j79715J27831J904N6263q4554Q7840P285n6782M3868
134i28551q2468j0022l2182N7491L1108k2242K419k218n0971R2859o2424K936m0478Q1772
120i62971l9370L0697J08686j9839J8907j19876j038K7441R8060j07141m0082k9400J16445
107i19481m684n6099J0393j26633Q1597L7717O6300p74n289R3389j22420p767R4771j51865
93a010845L7882j16548J12509O9466q7192J26375p0805m0865p2193J63995k4270P2692
$$ plain form
184 -994957 -979904 -1038040 -991657 -963585 -951480 -990378 -932179 -965497 -1020809 -1025936 -988728 -1080114 -929708
171 -929708 -810013 -996833 -901314 -1016222 -852938 -913435 -975441 -939322 -850175 -859470 -957368 -1012522
159 -1012522 -908167 -797082 -1044098 -1008685 -920198 -885771 -1002142 -902998 -928383 -991721 -956902 -912855
147 -912855 -1039662 -993957 -947188 -932491 -1112206 -984375 -982471 -926208 -1010762 -922922 -915637 -972419 -928551
134 -928551 -1011019 -1021041 -1053223 -995732 -964624 -986866 -984447 -986665 -1037636 -944777 -1007201 -1004265 -1044743 -962971
120 -962971 -1002341 -971644 -862958 -882797 -863890 -983766 -984804 -957363 -859303 -966444 -1006526 -1035926 -919481
107 -919481 -924165 -980264 -969871 -1096504 -1014907 -977190 -910890 -911664 -916953 -823564 -945984 -953751 -858980 -1010845
93 -1010845 -972963 -1089511 -977002 -907536 -994728 -868353 -939158 -980023 -1052216 -888221 -912491 -839799
81h39799j43436m8144N0367N2434l8657Q8050j2885M5333l4479j23962n7192N7122P7031
68i28217k4418R292K2902r923J09490j47572l5951p9027K27331j26977k4916J00137p8605
55i86454M0250K4398m3361m075K0191j04553P7388Q1994J47186j01707n5462K7015j17701
42i94891l8478N6381o9260P9691o5649J13912O3921j50124k1219R3399O7409K0615O1371
29g82922j3831J80630k22642K1236n5789j02890O0817J42345j2516L3780j57574R2581
17h16775m4288l0363J11202p4522L1825R1331J46452L7711r5849l5861k2721O0206K62264
4c79388Q18153J888581M718814N472478o691134n169614r89927l24398j43657l5689L4592
-7h01189L4322R8326O9921j35979j50572O4797j23864N8016j07432N8362o7227p7556
$$ plain form
81 -839799 -983235 -1031379 -981012 -928578 -967235 -879185 -892070 -846737 -881216 -1005178 -1062370 -1005248 -928217
68 -928217 -952635 -943343 -920441 -930364 -820874 -968446 -1004397 -1083424 -856093 -983070 -1007986 -907849 -986454
55 -986454 -946204 -921806 -965167 -969242 -949051 -1053604 -976216 -894222 -747036 -848743 -904205 -877190 -994891
42 -994891 -1033369 -976988 -1046248 -966557 -1032206 -918294 -854373 -1004497 -1025716 -932317 -864908 -844293 -782922
29 -782922 -796753 -616123 -838765 -817529 -873318 -976208 -915391 -773046 -785562 -751782 -909356 -816775
17 -816775 -861063 -891426 -780224 -854746 -822921 -731590 -585138 -547427 -643276 -679137 -701858 -641652 -379388
4 -379388 438765 2327346 7046160 12518638 5827504 657890 -332037 -656435 -800092 -835781 -801189
-7 -801189 -766867 -668541 -598620 -734599 -885171 -820374 -944238 -886222 -993654 -935292 -1002519 -1080075
-19a080075J83491q3994L6490J2934j16001J50901J17872L8748n0349r3497L3824j23469
-31i73125J79602j77407J6296L6954j32002J63962k1843m682N3894k0227p4457J3306n0885
-44i90614j25535J28219p0539M9196L3796l0363O5634j010M9563j71840R8170R8405o1152
-57i28070o8490l2731J19464p2204L2683P7937j61868N1233l0013Q9187n6490k2221j28384
-70a129967J82626q9165k0997R5790o0874j6075L6831q9119J28378r5197J04452j2535
-82i65852r0433O0074r6170r791P0126Q2797M9706m761n9447r2778n7162J28437L7806
-95i47448M7424l9000l4928R7159j21504p3639R3979M334L9148N1898j39267j1058j1791
-108a044693Q1153k7612K8576k8943L5824M371N0389n9433o8926N8567j23372J29493L6702
$$ plain form
-19 -1080075 -896584 -980578 -944088 -931154 -1047155 -896254 -778382 -739634 -789983 -883480 -849656 -973125
-31 -973125 -793523 -970930 -954634 -917680 -1049682 -885720 -907563 -912245 -858351 -878578 -953035 -939729 -990614
-44 -990614 -1116149 -987930 -1058469 -1009273 -975477 -1005840 -940206 -941216 -891653 -1063493 -965323 -866918 -928070
-57 -928070 -996560 -1029291 -909827 -982031 -949348 -871411 -1033279 -982046 -1012059 -922872 -979362 -1001583 -1129967
-70 -1129967 -947341 -1036506 -1057503 -961713 -1022587 -1038662 -1001831 -1090950 -962572 -1057769 -953317 -965852
-82 -965852 -1056285 -996211 -1092381 -1102172 -1032046 -949249 -899543 -904304 -963751 -1056529 -1113691 -985254 -947448
-95 -947448 -900024 -939024 -973952 -876793 -998297 -1071936 -977957 -973623 -934475 -882577 -1021844 -1032902 -1044693
-108 -1044693 -963540 -991152 -962576 -991519 -955695 -951324 -900935 -960368 -1029294 -970727 -1094099 -964606 -927904
-121i27904m2172L0169K8628J6862j35414J60826r9937k3632n206K2793M4255n9283J9311
-134i70704Q2755k09846J59437N2920o1698M6366o2061l6799L0352L2313J0315K1882
-146i04768j72885J06772m2280m3604R48J60178p3970p1127Q0018J9247m5005M3133N494
-159i37849l7139J10779r8412J5298Q4682j38332J27046K508j07105L0049l8264n0371
-171a037110M6904K4592p7321M6621L3769k2909j21148J14983L6080M1820j28070J09070
-183i32719o8843J07491l5928n6650m9243K9859P3129o1842k1671q640P8135O1042L426
-196h82454j48838J05951p6602K4416J2341m6007N0183l6735o8586M2992J36583r7304
-208i84060j4759O8732l6019r5401K3428O1023O1192j06183m9773J76635o8097j7701p4798
$$ plain form
-121 -927904 -970076 -939907 -911279 -894417 -1029831 -869005 -968942 -992574 -997780 -974987 -930732 -990015 -970704
-134 -970704 -887949 -1097795 -938358 -885438 -947136 -900770 -962831 -999630 -969278 -936965 -926650 -904768
-146 -904768 -1077653 -970881 -1013161 -1056765 -1055817 -895639 -969609 -1040736 -960718 -941471 -986476 -943343 -937849
-159 -937849 -974988 -864209 -962621 -947323 -862641 -1000973 -873927 -871419 -978524 -948475 -986739 -1037110
-171 -1037110 -990206 -965614 -1042935 -996314 -962545 -985454 -1106602 -991619 -955539 -913719 -1041789 -932719
-183 -932719 -1001562 -894071 -929999 -986649 -1035892 -1006033 -932904 -994746 -1016417 -1025057 -946922 -885880 -882454
-196 -882454 -1031292 -925341 -1001943 -977527 -965186 -1011193 -961010 -997745 -1066331 -1023339 -886756 -984060
-208 -984060 -998819 -930087 -966106 -1061507 -1038079 -977056 -915864 -1022047 -1071820 -895185 -963282 -980983 -1055781
-221a055781J04590M6302o7266L9493j40208J15078N8388j27310J5781j6197k1174K16468
-233h31836q9545o2742q331j6104q8153J9945J61880n1277j795K400n2279J05802J2220
-246h99815o2173J6868n9073j7198L3899k5073Q8433L6546j47092M4604N3273m5833N3400
-259i29234L7584n2810j7918M4427l9518q0875J39494Q910N986j63537O6438P152j9245
-272i93146N7675n4897j6501J28506l7839m6717M4543r2742J897O3192n4689R5260J1628
-285h93830J4375q7447J4181J740n9316Q3429L4186j00917p1937j8411O9713L7630p3071
-298a049675J06362p5219M0862R0003n1177R2925l3613q6147Q9115j00346M7070o9252
-310i99092O9526j17906J03209q6550N7664J8196P0079j68206O9656j0326J36140p793P748
$$ plain form
-221 -1055781 -951191 -904889 -972155 -932662 -1072870 -957792 -899404 -1026714 -1010933 -1027130 -1048304 -831836
-233 -831836 -921381 -984123 -992454 -1008558 -1096711 -1076766 -914886 -966163 -967958 -965558 -1017837 -912035 -899815
-246 -899815 -961988 -945120 -1004193 -1021391 -987492 -1012565 -924132 -887586 -1034678 -990074 -936801 -982634 -929234
-259 -929234 -891650 -944460 -962378 -917951 -957469 -1038344 -898850 -889940 -883954 -1047491 -981053 -973901 -993146
-272 -993146 -935471 -990368 -1006869 -878363 -916202 -962919 -918376 -1011118 -1009221 -946029 -1000718 -905458 -893830
-285 -893830 -879455 -966902 -952721 -950981 -1010297 -926868 -892682 -993599 -1065536 -1083947 -1014234 -976604 -1049675
-298 -1049675 -943313 -1018532 -977670 -887667 -938844 -845919 -879532 -965679 -876564 -976910 -929840 -999092
-310 -999092 -929566 -1047472 -944263 -1030813 -973149 -954953 -884874 -1053080 -983424 -993750 -857610 -865403 -857655
-323h57655j68986M3172J00989n8853o9791N3061K7479o1314p8953L4466O3647m6701R9730
-336i19709n6137K4332l1239j0268L3079r5713J17292k3282L4269j06776Q8977M4041
-348i01134j08056j0359n0039m129J56947n1236n4842R8810n5934L5698R4883r5845m7264
-361i92500J23105j18835r074l802L8499N2968l8320l3899q5172J34858l5053q7359J41065
-374i13519j08905J0456k4085N8920p7109o5141J53377n1654M532K8851J9999L1207L4249
-387h98822R19n8811P6576l546k0951K8931l1478m3092j07182O9177J9920j1304J12653
-400h67010n6853k7981P0825m2444q3699J2115M553K5674k1509P7895n6215n4225R6050
-413i22824p3566O1039J03834j12500k4780N8340k7846n7377J5485J7306M4570j58117
$$ plain form
-323 -857655 -1026641 -983469 -882480 -941333 -1011124 -958063 -930584 -991898 -1070851 -1036385 -972738 -1019439 -919709
-336 -919709 -975846 -951514 -982753 -993021 -959942 -1055655 -938363 -961645 -927376 -1034152 -945175 -901134
-348 -901134 -1009190 -1019549 -1069588 -1073717 -916770 -968006 -1022848 -924038 -979972 -944274 -849391 -945236 -992500
-361 -992500 -869395 -988230 -997304 -1001106 -962607 -909639 -947959 -981858 -1067030 -932172 -967225 -1054584 -913519
-374 -913519 -1022424 -1011968 -1036053 -977133 -1054242 -1119383 -966006 -1017660 -1013128 -984277 -964278 -933071 -898822
-387 -898822 -897903 -956714 -880138 -883684 -904635 -875704 -907182 -950274 -1057456 -988279 -968359 -979663 -867010
-400 -867010 -923863 -951844 -881019 -923463 -1007162 -995047 -990494 -964820 -986329 -908434 -964649 -1018874 -922824
-413 -922824 -996390 -935351 -831517 -944017 -968797 -910457 -938303 -995680 -980195 -962889 -918319 -1076436
-425a076436J20296R740l2304l0234Q420Q9878j04000Q2819m7921K8678l8682J8496J19893
-438h51357N1486j07036j52097R8669P1448j28389K9034Q6127R8747j35261n1418N67M1953
-451i47527K0659p5940K6705O5275k6008Q222P028o5662j6545Q9572j8426l429n0544k5869
-465a012489N5594L258J1338J01670k28254K6419O4157k2657k9J3229N7401k9613o2102
$$ plain form
-425 -1076436 -956140 -946400 -978704 -1008938 -1000518 -910640 -1014640 -931821 -979742 -951064 -989746 -971250 -851357
-438 -851357 -799871 -906907 -1059004 -960335 -888887 -1017276 -988242 -902115 -803368 -938629 -990047 -989480 -947527
-451 -947527 -926868 -1002808 -976103 -910828 -936836 -928614 -921586 -987248 -1003793 -914221 -932647 -936076 -986620 -1012489
-465 -1012489 -956895 -953637 -942299 -840629 -1068883 -1042464 -978307 -1000964 -1000993 -987764 -930363 -959976 -1022078
$$ [...]
-2774b633714  $$ checkpoint
##END NTUPLES=
##END=
