##TITLE=Analysis number 311860
Compound Code cc 46006
Book Reference 415/188
Project Code adrs
Chemist Name bos
##JCAMPDX= 6.0         $$ Bruker NMR JCAMP-DX V2.0
##DATA TYPE= NMR SPECTRUM
##DATA CLASS= NTUPLES
##ORIGIN= Bruker BioSpin GmbH
##OWNER= NMR
$$ XWIN-NMR		Version 3.5
$$ Mon Jul 18 15:23:48 2005 GMT Daylight Time (UT+1h)  MAYBRIDGE\NMR@NMR_250MHZ
##.OBSERVE FREQUENCY= 250.131544655141
##.OBSERVE NUCLEUS= ^1H
##.ACQUISITION MODE= SIMULTANEOUS (DQD)
##.ACQUISITION SCHEME= undefined
##.AVERAGES= 16
##.DIGITISER RES= 18
##SPECTROMETER/DATA SYSTEM= dpx250
##.PULSE SEQUENCE= zg30
##.SOLVENT NAME= CDCl3
##.SHIFT REFERENCE= (INTERNAL, CDCl3, 0, 16.522)
##AUDIT TRAIL= $$ (NUMBER, WHEN, WHO, WHERE, WHAT)
$$ ##TITLE= Audit trail, XWIN-NMR		Version 3.5
$$ ##JCAMPDX= 5.01
$$ ##ORIGIN= Bruker BioSpin GmbH
$$ ##OWNER= NMR
$$ C:\u/data/dgb/nmr/ADRS/5960/pdata/1/auditp.txt
$$ ##AUDIT TRAIL=  $$ (NUMBER, WHEN, WHO, WHERE, WHAT)
(   1,<2005-07-18 15:23:29.27 +100>,<MAYBRIDGE\NMR>,<NMR_250MHZ>,
      <created by zg, POWCHK disabled, PULCHK disabled
       configuration hash MD5:
       62 19 C7 07 E1 42 D1 B7 37 6C 3D D0 77 39 F9 E6
       data hash MD5: 64K
       68 A7 91 BB D9 21 A9 44 3D 48 D2 F2 7E 5C 21 51>)
(   2,<2005-07-18 15:23:40.38 +100>,<MAYBRIDGE\NMR>,<NMR_250MHZ>,
      <Start of raw data processing
       ef LB = 0.3 FT_mod = 6 PKNL = 1 SI = 32K 
       data hash MD5: 32K
       6B F0 BC 3B 55 08 73 0C AD 58 36 34 52 E7 53 9B>)
(   3,<2005-07-18 15:23:42.35 +100>,<MAYBRIDGE\NMR>,<NMR_250MHZ>,
      <apk 
       data hash MD5: 32K
       0B 53 AE 12 3D 93 5B D6 E6 78 2E 7D 1C F1 3E 6B>)
(   4,<2005-07-18 15:23:43.08 +100>,<MAYBRIDGE\NMR>,<NMR_250MHZ>,
      <abs ABSG = 5 
       data hash MD5: 32K
       65 11 EC 48 3A 49 6F 50 E7 7F 2F 4B 93 02 96 6E>)
$$ ##END=
$$ 
$$ hash MD5
$$ 89 0D AC 64 BA DD D0 78 CF 08 76 E0 C7 EC EB 79
##$RELAX= 
##$RELAX= 
##$RELAX= 
##$RELAX= 
##$RELAX= 
##$RELAX= 
##$RELAX= 
$$ Bruker specific parameters
$$ --------------------------
##$DU= <C:\u>
##$EXPNO= 5960
##$NAME= <ADRS>
##$PROCNO= 1
##$TYPE= <nmr>
##$USER= <dgb>
##$AMP= (0..31)
100 100 100 100 100 100 100 100 100 100 100 100 100 100 100 100 100 100 
100 100 100 100 100 100 100 100 100 100 100 100 100 100 
##$AQSEQ= 0
##$AQ_mod= 3
##$AUNM= <au_zg>
##$AUTOPOS= <38 >
##$BF1= 250.13
##$BF2= 250.13
##$BF3= 250.13
##$BF4= 250.13
##$BF5= 500.13
##$BF6= 500.13
##$BF7= 500.13
##$BF8= 500.13
##$BYTORDA= 1
##$CFDGTYP= 0
##$CFRGTYP= 5
##$CHEMSTR= <none>
##$CNST= (0..31)
1 1 145 1 1 1 1 1 1 1 1 1 1 1 1 1 1 1 1 1 1 1 1 1 1 1 1 1 1 1 1 1 
##$CPDPRG= <>
##$CPDPRG1= <>
##$CPDPRG2= <>
##$CPDPRG3= <>
##$CPDPRG4= <mlev>
##$CPDPRG5= <mlev>
##$CPDPRG6= <mlev>
##$CPDPRG7= <mlev>
##$CPDPRG8= <mlev>
##$CPDPRGB= <>
##$CPDPRGT= <>
##$D= (0..31)
0 1 0 0 0 0 0 0 0 0.06 0 0 0 0 0 0 0.0002 0 0 0 0 0 0 0 0 0 0 0 0 0 0 
0 
##$DATE= 1121696608
##$DBL= (0..7)
120 120 120 120 120 120 120 120 
##$DBP= (0..7)
150 150 150 150 150 150 150 150 
##$DBP07= 0
##$DBPNAM0= <>
##$DBPNAM1= <>
$$ [...]
##$SUBNAM7= <"">
##$SUBNAM8= <"">
##$SUBNAM9= <"">
##$SW= 20.6930455092707
##$SWIBOX= (0..15)
0 0 3 0 0 0 0 0 0 0 0 0 0 0 0 0 
##$SW_h= 5175.983436853
##$TD= 65536
##$TD0= 1
##$TE= 295.16
##$TE2= 300
##$TE3= 300
##$TEG= 300
##$TL= (0..7)
0 120 120 120 120 120 120 120 
##$TP= (0..7)
150 150 150 150 150 150 150 150 
##$TP07= 0
##$TPNAME0= <>
##$TPNAME1= <>
##$TPNAME2= <>
##$TPNAME3= <>
##$TPNAME4= <>
##$TPNAME5= <>
##$TPNAME6= <>
##$TPNAME7= <>
##$TPOAL= (0..7)
0.5 0.5 0.5 0.5 0.5 0.5 0.5 0.5 
##$TPOFFS= (0..7)
0 0 0 0 0 0 0 0 
##$TUNHIN= 0
##$TUNHOUT= 0
##$TUNXOUT= 0
##$USERA1= <user>
##$USERA2= <user>
##$USERA3= <user>
##$USERA4= <user>
##$USERA5= <user>
##$V9= 5
##$VALIST= <valist>
##$VCLIST= <CCCCCCCCCCCCCCC>
##$VD= 0
##$VDLIST= <DDDDDDDDDDDDDDD>
##$VPLIST= <PPPPPPPPPPPPPPP>
##$VTLIST= <TTTTTTTTTTTTTTT>
##$WBST= 1024
##$WBSW= 4
##$XGAIN= (0..3)
0 0 0 0 
##$XL= 0
##$YL= 0
##$YMAX_a= 466877
##$YMIN_a= -325623
##$ZGOPTNS= <>
##$ZL1= 120
##$ZL2= 120
##$ZL3= 120
##$ZL4= 120
##$ABSF1= 16.522
##$ABSF2= -4.171173
##$ABSG= 5
##$ABSL= 3
##$ALPHA= 0
##$AQORDER= 0
##$ASSFAC= 0
##$ASSFACI= 0
##$ASSFACX= 0
##$ASSWID= 0
##$AUNMP= <proc_1d>
##$AZFE= 0.1
##$AZFW= 0.1
##$BCFW= 0
##$BC_mod= 0
##$BYTORDP= 0
##$COROFFS= 0
##$CY= 12.5
##$DATMOD= 1
##$DC= 0
##$DFILT= <>
##$DTYPP= 0
##$F1P= 14.0000005364418
##$F2P= -0.99999901652339
##$FCOR= 0.5
##$FTSIZE= 32768
##$FT_mod= 6
##$GAMMA= 0
##$GB= 0
##$INTBC= 1
##$INTSCL= 1
##$ISEN= 128
##$LB= 0.3
##$LEV0= 0
##$LPBIN= 0
##$MAXI= 10000
##$MC2= 0
##$MEAN= 0
##$ME_mod= 0
##$MI= 0
##$NCOEF= 0
##$NC_proc= -4
##$NLEV= 6
##$NOISF1= 0
##$NOISF2= 0
##$NSP= 0
##$NTH_PI= 0
##$NZP= 0
##$OFFSET= 16.522
##$PC= 1
##$PHC0= -61.13896
##$PHC1= -20.61384
##$PH_mod= 1
##$PKNL= yes
##$PPARMOD= 0
##$PSCAL= 4
##$PSIGN= 0
##$REVERSE= no
##$SF= 250.13
##$SI= 32768
##$SIGF1= 0
##$SIGF2= 0
##$SINO= 400
##$SIOLD= 32768
##$SREGLST= <1H.CDCl3>
##$SSB= 0
##$STSI= 32768
##$STSR= 0
##$SW_p= 5175.98343685301
##$SYMM= 0
##$S_DEV= 0
##$TDeff= 65536
##$TDoff= 0
##$TI= <Analysis number 999999
Compound Code 99
Book Reference 9
Project Code 9>
##$TILT= no
##$TM1= 0
##$TM2= 0
##$TOPLEV= 0
##$USERP1= <user>
##$USERP2= <user>
##$USERP3= <user>
##$USERP4= <user>
##$USERP5= <user>
##$WDW= 1
##$XDIM= 32768
##$YMAX_p= 363842656
##$YMIN_p= -289108
$$ End of Bruker specific parameters
$$ ---------------------------------
##NTUPLES= NMR SPECTRUM
##VAR_NAME=  FREQUENCY,     SPECTRUM/REAL,   SPECTRUM/IMAG
##SYMBOL=    X,             R,               I
##VAR_TYPE=  INDEPENDENT,   DEPENDENT,       DEPENDENT
##VAR_FORM=  AFFN,          ASDF,            ASDF
##VAR_DIM=   32768,         32768,           32768
##UNITS=     HZ,            ARBITRARY UNITS, ARBITRARY UNITS
##FACTOR=    0.157963299565203, 1,           1
##FIRST=     4132.6476996994, 0,             0
##LAST=      -1043.33573715361, 0,           0
##MIN=       -1043.33573715361, -289108,     0
##MAX=       4132.6476996994, 363842656,     0
$$ Real data points
##PAGE= N=1
##DATA TABLE= (X++(R..R)), XYDATA
$$ [...]
22723a10573O7436M2567P9950m4254J4399M5474j5287m1517k669p6709k3178J09173
$$ -110573 -43137 -570 79380 35126 49525 94999 79712 38195 35526 -41183 -64361 44812
22711D4812O7036R3169r242o4178q9082r4639N8026J9593l1859k400K2250l4586
$$ 44812 111848 205017 195775 131597 42515 -52124 5902 25495 -6364 -8764 13486 -21100
22699b1100j9850P5762K5913o2238j8401o0137o5619p189O8216N6273l1791M0690
$$ -21100 -40950 34812 60725 -1513 -19914 -80051 -145670 -152859 -84643 -28370 -60161 -19471
22687a9471J8198j6461n4820J04326N9793K1302k7460J1480J8866j5565p7794
$$ -19471 -1273 -17734 -72554 31772 91565 112867 85407 96887 115753 100188 22394
22676B2394j9119R09j0754j3379k9135k6884m3347J6403Q7172K8532q342L0837
$$ 22394 3275 4184 -6570 -19949 -49084 -75968 -119315 -102912 -15740 12792 4450 35287
22664C5287K4920m9045m0799p7503L7201Q2888J1207n0302q1310m1770L8370j5672
$$ 35287 60207 11162 -29637 -107140 -69939 12949 24156 -26146 -107456 -149226 -110856 -126528
22652a26528m1237k834M4104K2866K7311j4926L1036R8298O3452J216K1100P4365
$$ -126528 -167765 -170599 -126495 -103629 -76318 -91244 -60208 38090 101542 102758 123858 198223
22640A98223l8186q1986r0604r1381L5714j1027R651J1525P3329j1253m3059N7968
$$ 198223 160037 78051 -12553 -103934 -68220 -79247 -69596 -58071 15258 4005 -39054 18914
22628A8914L5948j5252J8263R039q264J8727O3597J5200o1411n0705p4665j4613
$$ 18914 54862 39610 57873 66912 58648 77375 140972 156172 94761 44056 -30609 -45222
22616d5222o2796k6123J5820J10460Q2338N4954L3300p2269o5095N7412L2532
$$ -45222 -108018 -134141 -118321 -7861 74477 129431 162731 90462 25367 82779 115311
22605A15311R359k3510m3089J6985M4651r8033k5991j5222N4325L9l8999K5768
$$ 115311 124670 101160 58071 75056 119707 21674 -4317 -19539 34786 34825 -4174 21594
22593B1594K7789P9646R3300K541n3430o2644J9347m666k9928p8856l7515P5577
$$ 21594 49383 129029 222329 224870 171440 108796 128143 123477 93549 14693 -22822 52755
22581E2755L5214r2661J6856O3194q4077m7530Q347N2805k5197M738j2817N2403
$$ 52755 87969 -4692 12164 75358 -8719 -56249 -47902 4903 -20294 -15556 -28373 24030
22569B4030O0189l1837l5127O3394l0193k3874J7502N7308k3444o6129l5110m4537
$$ 24030 84219 52382 17255 80649 50456 26582 44084 101392 77948 11819 -23291 -67828
22557f7828k0952L2739N8314O2687N9184N053J0302O1016J04661N7120P1727K2440
$$ -67828 -88780 -56041 2273 64960 124144 129197 139499 200515 305176 362296 434023 456463
22545D56463L8191Q0153k672k8925j50491o9411K8140Q5316L1895M8384J11343
$$ 456463 494654 574807 572135 543210 392719 323308 351448 436764 468659 517043 628386
22534F28386N319M3745R5531M4615J029n2313P881J2589j69053j59857k9737N3341
$$ 628386 633705 677450 772981 817596 818625 766312 774193 786782 617729 457872 428135 481476
22522D81476P9231M272l4755k4827k6138n9062j01521K6874K3943J2119N45P3387
$$ 481476 560707 564979 530224 505397 479259 420197 318676 345550 369493 381612 382157 455544
22510D55544k004l1016k7206r5612n6404n0574J7425J1854L9431j3110k7690j05732
$$ 455544 453540 422524 395318 299706 243302 192728 210153 222007 261438 248328 220638 114906
22498A14906K434K3306L8099m1333l3043p5107l3542j50K4712N8443K9139L787
$$ 114906 117340 140646 178745 137412 104369 29262 -4280 -4430 20282 78725 107864 111651
22486A11651k8689M0505j3632J6747j0064L8353n7321n7256q549K7601J9512L5997
$$ 111651 82962 123467 109835 126582 116518 154871 97550 40294 31745 59346 78858 114855
22474A14855j1080n0301o7621K9837J9233o0220L4416k4129o3486R5943M7824
$$ 114855 103775 53474 -14147 15690 34923 -25297 9119 -15010 -78496 17447 65271
22463F5271p7176j4609J1106o6790M9904Q3801Q3825K7384j9039n6851r3500o1255
$$ 65271 -11905 -26514 -15408 -82198 -32294 51507 135332 162716 143677 86826 -6674 -67929
22451f7929K0253L5278n8690K6344p1612K4765M1395q0782M6650K2871M0561K0445
$$ -67929 -47676 -12398 -71088 -44744 -116356 -91591 -50196 -130978 -84328 -61457 -20896 -451
22439d51J8462R547K3344l2160r4186L0763J1285K6386P4235M5734p3752n4946
$$ -451 18011 27558 50902 18742 -75444 -44681 -33396 -7010 67225 112959 39207 -15739
22427a5739p5158P545R4557O5174L319j20119P958N4176n0709p4683n7779J12719
$$ -15739 -90897 -83352 11205 76379 79698 -40421 -32463 21713 -28996 -103679 -161458 -48739
22415d8739J966m9661L5530L6826o6864k2836J29474N2509j1109o7987k1657r717
$$ -48739 -46773 -96434 -60904 -24078 -90942 -113778 15696 68205 57096 -10891 -32548 -42265
22403d2265J90P500O3579m4881m7899J7188N421L7972j9328J4225k4188j0498
$$ -42265 -42075 -34575 29004 -15877 -63776 -46588 -41167 -3195 -22523 -8298 -32486 -42984
22391d2984K3200k289m6235m0430O0625N343J3117l0878l3863K9636L9160M2651
$$ -42984 -19784 -22073 -68308 -108738 -48113 -42770 -29653 -60531 -94394 -64758 -25598 17053
22379A7053N004P346Q8787P9546n4629m2823P2532n4653m8514r3516o6870M0111
$$ 17053 22057 29403 118190 197736 143107 100284 172816 118163 69649 -23867 -90737 -50626
22367e0626L1482M7468N4861j7112k8460n0981L4484k2673K3367J17318l5152
$$ -50626 -19144 28324 83185 66073 37613 -13368 21116 -1557 21810 139128 103976
22356A03976n0018k4428L7573J04098j4669p7218O825Q717M6740r0129l5909j4883
$$ 103976 53958 29530 67103 171201 156532 79314 86139 94856 141596 51467 15558 675
22344F75m4512n072J8629K9673M1281j7380p2099K6337k5078m9973P8712N5893
$$ 675 -43837 -48909 -30280 -607 40674 23294 -48805 -22468 -47546 -97519 -18807 37086
22332C7086M4381P371m7931k4587N3731J0773l4656j9247M6805k4835m0679K4965
$$ 37086 81467 88838 40907 16320 70051 80824 46168 26921 73726 48891 8212 33177
22320C3177J02838N7635q0118p5477K6535K5467j6627J00463l514k9284r1456
$$ 33177 136015 193650 113532 38055 64590 90057 73430 173893 170379 141095 49639
22309D9639n1130m2872j24056k6729m9155R6089J55771l992n9826q936P6925K3763
$$ 49639 -1491 -44363 -168419 -195148 -244303 -148214 7557 3565 -56261 -65197 11728 35491
22297C5491l5310k0095J8855k3868M0458n1653J0366J9867M0771J6076K9018J1507
$$ 35491 181 -19914 -1059 -24927 15531 -36122 -25756 -5889 34882 50958 79976 91483
22285I1483r0401m7742P0531R7014j3724l9042l7730j6135J2291o654R6938l0345
$$ 91483 1082 -46660 23871 120885 107161 68119 30389 14254 26545 19891 116829 86484
22273H6484l8638j07754j22663P3767M5984P7710k0235K5839N2845n3684O381
$$ 86484 47846 -59908 -182571 -108804 -62820 14890 -5345 20494 73339 19655 26036
22262B6036j3990J3170j5020J0993K1381m1091K1933Q1775j7447k6124k9762P336
$$ 26036 12046 25216 10196 21189 42570 1479 23412 105187 87740 61616 31854 39190
22250C9190k6488J6839J395k4613K0478K0693p7208L6484N9209q9439k3067M7276
$$ 39190 12702 29541 30936 6323 26801 47494 -29714 6770 65979 -23460 -46527 749
22238G49L875n2818J304O2331j1442k7174p1430M1205M3744l7350J6639N8715
$$ 749 4624 -48194 -46890 15441 3999 -23175 -94605 -53400 -9656 -47006 -30367 28348
22226B8348O3953n1107J6353K5583p2691q410J3404n4364l3268M8498P2869j2970
$$ 28348 92301 41194 57547 83130 10439 2029 15433 -38931 -72199 -23701 49168 36198
22214C6198o5053J3783L2217m5768p0626J37307k274J327O9573j15466k2891J8207
$$ 36198 -28855 -15072 17145 -28623 -99249 38058 35784 37111 106684 -8782 -31673 -13466
22202a3466k4999P007l5859k8207P3946L0735J734M2741l6462N16q197N933K69
$$ -13466 -38465 -31458 -67317 -95524 -21578 9157 10891 53632 17170 17686 9489 15422 15691
22189A5691n7592l5081Q5870K4578k2789P6844O3885m9054M954o5862k347n014
$$ 15691 -41901 -76982 8888 33466 10677 87521 151406 102352 107306 41444 39097 34083
22177C4083q7511k2043P9454N2860k1496o302J4668K125N665m7330m1457K1922
$$ 34083 -53428 -75471 3983 56843 35347 29045 43713 45838 51503 4173 -37284 -15362
22165a5362O12M3363m5859k9296Q963M6261J2188k9123m8966N9436N4842Q752
$$ -15362 -14750 28613 -17246 -46542 -37579 8682 20870 -8253 -57219 2217 57059 65811
22153F5811j10173l9960L4766j7054n1369J6948Q160M4762L2477o10L5053L4126
$$ 65811 -44362 -84322 -49556 -66610 -117979 -101031 -92871 -48109 -15632 -16242 18811 52937
22141E2937m9495r967k9265m9921N277J01191N3321l9181L9189N0047K646j1232
$$ 52937 3442 -6525 -35790 -85711 -80434 20757 74078 34897 74086 124133 126779 115547
22129A15547m0930k3418K8098K9595M086O6647o182R152o7941p8393O9519M2311
$$ 115547 74617 51199 79297 108892 112978 179625 173443 182595 114654 36261 105780 148091
22117A48091N612M958R177k9375n5512p0658q277N62O2360m3246K3524O809k1014
$$ 148091 153703 158661 167838 138463 82951 12293 4016 4578 66938 23692 47216 54025 33011
22104C3011J2326j0475j5102o9087m457P078P5570L5436J18001k5930K1963o418
$$ 33011 45337 34862 19760 -49327 -53784 -46706 28864 64300 182301 156371 178334 171916
22092A71916n0564j09814m4354M5078O1294k2985j27664n771O2839m4770n4968
$$ 171916 121352 11538 -32816 12262 73556 50571 -77093 -82864 -20025 -64795 -119763
22081a19763Q7776j8794l8984L9999q6064J1857L1078J10149l044j17028M20p36
$$ -119763 -31987 -50781 -89765 -49766 -135830 -123973 -92895 17254 14210 -102818 -102398 -103134
22069a03134L8643K0818M946J4353J9433q2766k3768M8681R8316Q7971Q41r1248
$$ -103134 -64491 -43673 -38727 -24374 -4941 -87707 -111475 -62794 35522 123493 124334 33086
22057C3086M762K9197n0856Q51L9321m9919n7286q6893Q732L7705j864N5032N0013
$$ 33086 37848 67045 16189 17040 56361 6442 -50844 -137737 -129005 -91300 -93164 -38132 11881
22044A1881K2276M6213l3316k8607r055k5355l4034R0658L9877o0148m07K7260
$$ 11881 34157 80370 47054 18447 9392 -15963 -49997 40661 80538 20390 19983 47243
22032D7243l7839o240o778k8125k0582J8107l0276M0565K5675j0188m186j9642
$$ 47243 9404 3164 -3614 -31739 -52321 -34214 -64490 -23925 1750 -8438 -12624 -32266
22020c2266K2118K6470m259N5564Q2575j5877r7147r520o036k1145j1959N9673
$$ -32266 -10148 16322 12063 67627 150202 134325 37178 27658 21622 477 -11482 48191
22008D8191k7300q7534K3429k4145n4532n5891M2388j4378J01580J58179j2623
$$ 48191 20891 -66643 -43214 -67359 -121891 -177782 -135394 -149772 -48192 109987 97364
21997I7364r5135k4066J10661k1263m3215l035l5014l3795J9758J17961m4658
$$ 97364 2229 -21837 88824 67561 24346 21311 -13703 -47498 -27740 90221 45563
21986D5563p6687Q4419j1813j9382K3595o605k7179J7150j5195L4211J7149j2541
$$ 45563 -31124 53295 41482 22100 45695 39090 11911 29061 13866 48077 65226 52685
21974E2685k3632n3159m3256r658L9314J1063m7333N6761K3717k6556m5034Q870
$$ 52685 29053 -24106 -67362 -77020 -37706 -26643 -73976 -17215 6502 -20054 -65088 -56218
21962e6218m6070m9044J1913Q1310J3811j8925l8817k9946M0794N5957K1511j6077
$$ -56218 -102288 -151332 -139419 -58109 -44298 -63223 -102040 -131986 -91192 -35235 -13724 -29801
21950b9801r692j9416J7258q533p8778K744L6986J03156Q1436O3407q8716o6061
$$ -29801 -39493 -58909 -41651 -50184 -128962 -126218 -89232 13924 95360 158767 70051 3990
21938C990J0986L5457M2133Q683K4217q897J6358M860j889O1290L3652j10219
$$ 3990 14976 50433 92566 101249 125466 116569 132927 137787 135898 197188 230840 120621
21926A20621N876J6328L365p847r7235j1116J26028M7346p6652J6692n9354M9860
$$ 120621 126497 142825 146190 138343 41108 29992 156020 203366 126714 143406 84052 133912
21914A33912M6116p2200L3433j8869n4515O7153p38k1911M526j782j12414p1100
$$ 133912 180028 107828 141261 122392 67877 135030 134292 112381 116907 115125 2711 -68389
21902f8389J461k0274l4328o7674k6853M5619M7301K2676p029K6336N7389R028
$$ -68389 -66928 -87202 -121530 -189204 -216057 -170438 -123137 -100461 -107490 -81154 -23765 -14737
21890a4737L721K8680M9186J4699k2020o7264n77P0341Q0617K031J9534O0765
$$ -14737 -11016 17664 66850 81549 59529 -7735 -8312 62029 142646 144677 164211 224976
21878B24976k3972l1373o1793j6443m1170M2377o93m6179n8612J9088N5946J0845
$$ 224976 201004 169631 107838 91395 50225 92602 91909 45730 -12882 6206 62152 72997
21866G2997p5675k5927K6994L2690k1304O602M8957N845q364L280p3393N157l3701
$$ 72997 -2678 -28605 -1611 31079 9775 16377 65334 71179 62815 66095 -7298 -2141 -35842
21853c5842J4172Q5785K2651l9216M2435Q293o2758k0122J01604J04078k7517
$$ -35842 -21670 64115 86766 47550 89985 98278 35520 15398 117002 221080 193563
21842A93563q6949n9890n0001j5900j0457O8637R7312l1517J1751J247K0962k8081
$$ 193563 106614 46724 -3277 -19177 -29634 39003 136315 104798 116549 117796 138758 110677
21830A10677n0276k8199l1417l2059K2755o764L5068J1674J0577O0519J1534k4403
$$ 110677 60401 32202 785 -31274 -8519 -15283 19785 31459 42036 102555 114089 89686
21818H9686p2103j6089k9022P2545J35707L3934l1532k7164J8275q9774k5801
$$ 89686 17583 1494 -27528 45017 180724 214658 183126 155962 174237 84463 58662
21807E8662J1416j0377L0668P3588J0794o507r7210j10206m0204J3704R9313J02383
$$ 58662 70078 59701 90369 163957 174751 168244 71034 -39172 -79376 -65672 33641 136024
21795A36024n175n9749M5607j2970j08810j15069O5430Q371K4722l7226p43P2496
$$ 136024 130849 71100 116707 103737 -5073 -120142 -54712 -46341 -21619 -58845 -59588 12908
21783A2908M2802L8391m35k6875p8316P4660O2674n8664l0661j251l3319l2306
$$ 12908 55710 94101 93666 66791 -11525 63135 125809 67145 36484 35233 1914 -30392
21771c0392m5074K4794M8315k9540J4268J3548M6228p1096n8216L4062N1644O4622
$$ -30392 -75466 -50672 -2357 -31897 -17629 -4081 42147 -28949 -87165 -53103 -1459 63163
21759F3163n6034k2666N2436N1522n0469o1027O901J13335J4613o7571p160P110
$$ 63163 7129 -15537 36899 88421 37952 -23075 -16174 97161 111774 44203 37043 44153
21747D4153P6590m398L1479j6138k0168n7646k2752j8101O4870M278n6071J722
$$ 44153 120743 116345 147824 131686 111518 53872 31120 13019 77889 82167 26096 27818
21735B7818J00258M5577N5626N1668j0978r0686r7379l1304J3975K1053J0860
$$ 27818 128076 173653 229279 280947 269969 179283 81904 50600 64575 85628 96488
21724I6488k5691m4099j1207K8956l0299k7869j359N4244q269J0376M4412Q2080
$$ 96488 70797 26698 15491 44447 14148 -13721 -15080 39164 30895 41271 85683 167763
21712A67763P4565j9020j23912q8850R7844o9877J1751L2676O5297M8666J0552
$$ 167763 242328 223308 99396 10546 108390 38513 50264 82940 148237 196903 207455
21701B07455m9128j1806N1946p4795j19076L4182m698J7167r6063o6809N0529
$$ 207455 158327 146521 198467 123672 4596 38778 34080 51247 -44816 -111625 -61096
21690f1096n5747N257L9069M3063R659k354M2884k7389k8182O1738J02788L9324
$$ -61096 -116843 -111586 -72517 -29454 -19795 -22149 20735 -6654 -34836 26902 129690 169014
21678A69014j5506m5708N3313j2487P491N7799J0798l7791j252n9955L7101j0336
$$ 169014 153508 107800 161113 148626 156117 213916 224714 186923 185671 125716 162817 152481
21666A52481j7771m3457J3335R2131K678o8791n7662K2263l1639Q990m390n093
$$ 152481 134710 91253 104588 196719 199397 130606 72944 95207 63568 72558 68168 63075
21654F3075q0957n8436L1794j234j0468M250O819k0452o8523N3616J18777J0073
$$ 63075 -17882 -76318 -44524 -45758 -56226 -51976 -45157 -65609 -134132 -80516 38261 48334
21642D8334q9227o5975J0808M3391l7014n9696J04706P4648M4060J5831L814k410
$$ 48334 -40893 -106868 -96060 -52669 -89683 -149379 -44673 29975 74035 89866 93680 91270
21630I1270j2951K4510p551l4739N1404M3027L9575j2714p4873k4376j7775R083
$$ 91270 78319 102829 95278 60539 111943 154970 194545 181831 106958 82582 64807 73890
21618G3890J4952K9256j20429n7313R535L3762N0487k2603J0561L9948M6454m9189
$$ 73890 88842 118098 -2331 -59644 -50109 -16347 34140 11537 22098 62046 108500 59311
21606E9311o7929j6374K5193Q5158k3848p9521R686J52307Q886j03263j554O5121
$$ 59311 -8618 -24992 201 85359 61511 -18010 -8324 143983 152869 49606 48052 113173
21594A13173J4654j3790r5393k524J24374M6425M4134m2434o1304J3712R634o382
$$ 113173 127827 114037 18644 16120 140494 186919 231053 188619 127315 141027 150661 144279
21582A44279j10590k5440R0909M5871q503j7128P415k3689j11828l2920P998R3975
$$ 144279 33689 8249 99158 145029 136526 119398 126813 103124 -8704 -41624 -33626 60349
21570F0349K1761m2027K1552R1859L6498J657n8521o9769J6582j6690p996O7557
$$ 60349 82110 40083 61635 153494 189992 191649 133128 63359 79941 63251 55255 122812
21558A22812l7263j0689L7705J1454J8874p1628j462J8399l1986m1688M2431M0633
$$ 122812 85549 74860 112565 124019 142893 71265 69803 88202 56216 14528 56959 97592
21546I7592M5703J4048l7280l1739l553N744j3469p6762K3302N6026M889q1257
$$ 97592 143295 157343 120063 88324 84771 90515 77046 284 23586 79612 84501 3244
21534C244o8912M7088J4535R968M5104j2868k0526P2327m1040Q441J0456n2316
$$ 3244 -65668 -18580 -4045 5923 51027 38159 17633 89960 48920 57361 67817 15501
21522A5501O8885r247l2709M5528k3723k3000j8892K9672L4834m7626J18916J55514
$$ 15501 84386 75139 42430 87958 64235 41235 22343 52015 86849 39223 158139 313653
21510C13653m2878j55264j05718Q0402N1882O4741r8134o6618m7579p006Q0095
$$ 313653 270775 115511 9793 90195 142077 206818 108684 42066 -5513 -12519 67576
21499F7576l768L0914L7081r6681M0811O898j01856j073O5011J03421M2458J8246
$$ 67576 63808 94722 131803 35122 75933 82831 -19025 -20098 44913 148334 190792 209038
21487B09038m8743m9421k2765M7085j1256o2600l7059R0618P1351L511M3702m6536
$$ 209038 160295 110874 88109 135194 123938 61338 24279 114897 186248 189759 233461 186925
21475A86925j04965O810k7849l954M2205P7894j17634q9618O1958P9627M3389
$$ 186925 81960 88770 60921 56967 99172 177066 59432 -30186 31772 111399 154788
21464A54788k0724n2164j8793k3515k5822j9890m7888m4784l6013L4209M1573
$$ 154788 134064 81900 63107 39592 13770 -6120 -54008 -98792 -134805 -100596 -59023
21453e9023p41M174j5360R2189j8005P3203L9624M0479P1345n1016l7632J6957
$$ -59023 -59764 -55590 -70950 21239 3234 76437 116061 156540 227885 176869 139237 156194
21441A56194n4048L970n2419P5114Q8404l2978q1854K6074K8403N4275P1985l6399
$$ 156194 102146 106116 53697 128811 217215 184237 102383 128457 156860 211135 283120 246721
21429B46721r0352j69607r3401J0551Q0125O9265n0618m1427q9585O7176N2424
$$ 246721 156369 -13238 -106639 -96088 -15963 53302 2684 -38743 -128328 -61152 -8728
21418h728m5022l8317O1899M0270J55925l4527n5442k6467j16803M5106O9240
$$ -8728 -53750 -92067 -30168 10102 166027 131500 76058 49591 -67212 -22106 47134
21407D7134M8315J7471J8976L7809R054o6117j08107L5308N3580m278n6420K6442
$$ 47134 95449 112920 131896 169705 178759 112642 4535 39843 93423 89145 32725 59167
21395E9167L7327J7129K7460J4709K605l1576m4400L4057K8149n1428j04583L8774
$$ 59167 96494 113623 141083 155792 158397 126821 82421 116478 144627 93199 -11384 27390
21383B7390J14903k0813m8549N000K7880J6530k0737p9k3983N938r6853L1559
$$ 27390 142293 121480 72931 77931 105811 122341 101604 101525 77542 83480 -13373 18186
21371A8186M5958O3716k538M5711N0142K0784p2258n3366P4505k53n8340m5120
$$ 18186 64144 127860 125322 171033 221175 241959 169701 116335 190840 190587 132247 87127
21359H7127J4512o7094n7251K9237O0934l9226l0524L2255M1238j3420j8736n5535
$$ 87127 101639 34545 -22706 6531 67465 28239 -2285 29970 71208 57788 39052 -16483
21347a6483l7364R1180O7096K4503M8182p3422K5000j3423K207r1802J6426m1473
$$ -16483 -53847 37333 104429 128932 177114 103692 128692 115269 117476 25674 42100 627
21335F27m1387K8294P6982k5457o7433M553L5290R6388n3559J2603P4121N0842
$$ 627 -40760 -12466 64516 39059 -28374 -23821 11469 107857 54298 66901 141022 191864
21323A91864n0435l8854P3517J379j26747m2657p5117J3685M4163m9406n5714
$$ 191864 141429 102575 176092 177471 50724 8067 -67050 -53365 -9202 -58608 -114322
21312a14322J48951J29037l2104k0491l0558J6509p5762j2085k2280K2358K8537
$$ -114322 34629 163666 131562 111071 80513 97022 21260 9175 -13105 9253 37790
21301C7790j7914M0427j8092K5906m006J9908N4711k5827L3255M1620j5224m1717
$$ 37790 19876 60303 42211 68117 64111 84019 138730 112903 146158 187778 172554 130837
21289A30837m6995L4066L5783j1725l0510p2025j5340M1627O2776n5862N029j4636
$$ 130837 83842 117908 153691 141966 111456 39431 24091 65718 128494 72632 77661 63025
21277F3025L6628P074J7550p0967r8873m7414n1680K329N1303M2767O062o6596
$$ 63025 99653 106727 124277 53310 -45563 -92977 -144657 -142328 -91025 -48258 -42196 -108792
21265a08792j3849O3697O9716K8692P2321r218o2261K0015L232Q179l3010l1039
$$ -108792 -122641 -58944 10772 39464 111785 102567 40306 60321 63553 71732 38722 7683
21253G683K6662L4346Q3327J2346k8647k6732o7497p619p071q1083n8511K2226
$$ 7683 34345 68691 152018 164364 135717 108985 41488 33869 26798 -54285 -112796 -90570
21241i0570J32782J2521K1788m5040M2173M9344O455M8233L7286o3436J6255l408
$$ -90570 42212 54733 76521 31481 73654 122998 129453 177686 214972 151536 167791 164383
21229A64383o7326p3910o0521o1280q666P7286R1797M8842j9404m7525q4339k178
$$ 164383 97057 23147 -37374 -98654 -107320 -30034 61763 110605 91201 43676 -40663 -42841
21217d2841n5162N9177P1349K7657p8272l6223k6932L2660K1450n2238k8303J56448
$$ -42841 -98003 -38826 32523 60180 -18092 -54315 -81247 -48587 -27137 -79375 -107678 48770
21205D8770L7007r777q9981N501M6046k9583j7522m495N030M6975l4397j7899
$$ 48770 85777 76000 -13981 -8480 37566 7983 -9539 -14034 -9004 37971 3574 -14325
21193a4325K245M305j1198J5090J05415M2975m0067k0089J2516K7828j0574q8299
$$ -14325 -12080 -7775 -18973 -3883 101532 144507 104440 84351 96867 124695 114121 25822
21181B5822r696K8708j4163m0418P9429Q850J1233M7622M7782L6697L0657j2903
$$ 25822 16126 44834 30671 -9747 69682 78532 89765 137387 185169 221866 252523 239620
21169B39620l8716j08523r390L6013p2865o8473r9120j2384R3267J30512L9307
$$ 239620 200904 92381 82991 119004 46139 -22334 -121454 -133838 -40571 89941 129248
21158A29248l0821o835k2145m2210p3627j0701O8416L782m8615K4762K1256j8623
$$ 129248 98427 91592 69447 27237 -46390 -57091 11325 15107 -33508 -8746 12510 -6113
21146f113j1894m6780K2771Q4647o9009p3173L5321N4925p9236n0193O3363R0151
$$ -6113 -18007 -64787 -42016 42631 -26378 -99551 -64230 -9305 -88541 -138734 -75371 14780
21134A4780K2996p9756J4852O5062n36j7132R302m1942o3916n2067p900O7333
$$ 14780 37776 -41980 -27128 37934 37398 20266 29568 -12374 -76290 -128357 -136257 -68924
21122f8924J18658m8089n2885l8381j0855k4996R8892J58943L1033n6084l3860
$$ -68924 49734 1645 -51240 -89621 -100476 -125472 -26580 132363 163396 107312 73452
21111G3452m5116j0895L2974j9625K2532m9923o002J0676P8482J5889q4594m4555
$$ 73452 28336 17441 50415 30790 53322 3399 -2603 8073 86555 102444 17850 -26705
21099b6705K7583P9877N9777l1599m6709q9747J0662N7385N3427J6772l6938k8642
$$ -26705 878 80755 140532 108933 62224 -27523 -16861 40524 93951 110723 73785 45143
21087D5143J1136p1l2014j5624M4958k2281k1139L6786O4468L1494j8310n5209
$$ 45143 56279 56208 24194 8570 53528 31247 10108 46894 111362 142856 124546 69337
21075F9337o5480k5875k0213n8928M9560l265k65K5535m611Q9401N9901p0021
$$ 69337 3857 -22018 -42231 -101159 -51599 -54864 -55129 -29594 -34205 55196 115097 45076
21063D5076K8193Q2627L8082n3123j60720K9174l473l6063J3624k7903p2039P6818
$$ 45076 73269 155896 193978 140855 -19865 9309 5836 -30227 -16603 -44506 -116545 -39727
21051c9727k2083r8454m1156L9637k1140J6616R3895M4526j867J25924M2870q5288
$$ -39727 -61810 -160264 -201420 -161783 -182923 -166307 -72412 -27886 -29753 96171 139041 53753
21039E3753j7186L9897o6961O8798K9580n6704m2589N5143K2206J4017o507j25330
$$ 53753 36567 76464 9503 78301 107881 51177 8588 63731 85937 99954 93447 -31883
21027c1883j8814J0395P9279P490n668j614J00052R752n7258l8295K5084l5793
$$ -31883 -50697 -40302 38977 46467 40799 39185 139237 148989 91731 53436 78520 42727
21015D2727J60o7720j6081J4484q145j5644M8450O8148O1193P3344o2485l5159
$$ 42727 42887 -24833 -40914 -26430 -34575 -50219 -1769 66379 127572 200916 138431 103272
21003A03272q4144o4826k2890K5655l7829n1113M7459J09397R6744j5618j48699
$$ 103272 19128 -45698 -68588 -42933 -80762 -131875 -84416 24981 121725 106107 -42592
20992d2592k6692P7799j6009L6955J3582l3305n2702J4410J08512M7662n0258
$$ -42592 -69284 8515 -7494 29461 43043 9738 -42964 -28554 79958 127620 77362
20981G7362r9100p7171k1129Q229M9377N7743Q6468k0570r5419o5426N0875J3567
$$ 77362 -21738 -98909 -120038 -111809 -62432 -4689 81779 61209 -34210 -99636 -48761 -35194
20969c5194Q1972k0207n8688j4261J3242j8729N4616j9725N2501K4175J1107q3078
$$ -35194 46778 26571 -32117 -46378 -33136 -51865 2751 -16974 35527 59702 70809 -12269
20957a2269L1124M1112n223l7453j967O1381R8832l3796r0330o4537o415L8744
$$ -12269 18855 59967 54744 17291 15324 76705 175537 141741 51411 -13126 -19541 19203
20945A9203N5327N153N2063k473p4557j20915P970j4752M4970P7799P0498n0707
$$ 19203 74530 79683 131746 129273 54716 -66199 -58229 -72981 -28011 49788 120286 69579
20933F9579k4518q6706r4850m2807K2367j4549M4574N2949M6979L3393O0683L3914
$$ 69579 45061 -41645 -136495 -179302 -156935 -171484 -126910 -73961 -26982 6411 67094 101008
20921A01008M7854o886n6110j2109L265k7050k2862j08961p6130J9064J06076
$$ 101008 148862 141976 85866 73757 77022 49972 27110 -81851 -157981 -138917 -32841
20910c2841O2008j9167j3515o8836k9009J978N5427L1968q870k8733k6925o0116
$$ -32841 29167 10000 -3515 -72351 -101360 -99382 -43955 -11987 -20857 -49590 -76515 -136631
20898a36631J13700K6574n4261l0235k67J0292K9867j2704L6727K9349L1874R724
$$ -136631 -22931 3643 -50618 -80853 -81120 -70828 -40961 -53665 -16938 12411 44285 54009
20886E4009J055N9864j00074r413J11722Q0797n6839o9471K16R8162Q470l5378
$$ 54009 55064 114928 14854 5441 117163 197960 141121 71650 71866 170028 178498 143120
20874A43120q0646l7089J1908m5664p5153l6403R4315n592k2392M5572N2672q9
$$ 143120 62474 25385 37293 -8371 -83524 -119927 -25612 -31204 -53596 -8024 44648 44559
20862D4559j9446j6023K5258k1949o543J2761J02335O742n7584j2361J6596N3060
$$ 44559 25113 9090 34348 12399 5856 18617 120952 127694 70110 57749 74345 127405
20850A27405l3673j09165K947m7968p2056k3078K5970O2152k0349P404J00931
$$ 127405 93732 -15433 -12486 -60454 -132510 -155588 -129618 -67466 -87815 -80411 20520
20839B0520Q2691n2763j08417R475k640L4647N8147L4767k6041p5356r8902p4497
$$ 20520 103211 50448 -57969 -48494 -51134 -16487 41660 76427 50386 -24970 -123872 -198369
20827a98369K2328L5286K9194O792N5804N932j428N5111L6147n7895m3992j7152
$$ -198369 -176041 -140755 -111561 -104769 -48965 -43033 -44461 10650 46797 -11098 -55090 -72242
20815g2242k8542P4824M1388k3716l8745k8710l5767J9201Q8406R0646n9876r8497
$$ -72242 -100784 -25960 15428 -8288 -47033 -75743 -111510 -92309 -3903 86743 26867 -71630
20803g1630o0234L2520J31644J9762o6016r9131K6793R5153K5390K3091o9183
$$ -71630 -131864 -99344 32300 52062 -13954 -113085 -86292 8861 34251 57342 -11841
20792a1841r9313m907L7429L5414l2064l0300L2083n220j9271O5274Q8743J1105
$$ -11841 -111154 -116061 -78632 -43218 -75282 -105582 -73499 -78719 -97990 -32716 56027 67132
20780F7132r8705l6539M2938J3272K3865J12328m427j07945l5493M4643J242L8752
$$ 67132 -31573 -68112 -25174 -11902 11963 124291 119864 11919 -23574 21069 22311 61063
20768F1063P393n4329M6363j2855P3L6103q3452p5249K7052L1669M1997q118j6658
$$ 61063 68456 14127 60490 47635 47708 83811 359 -74890 -47838 -16169 25828 17710 1052
20755A052J8179j04839m0463O1501p683o700P5249P9725m6662m4795l2801j3932
$$ 1052 19231 -85608 -126071 -64570 -72253 -78953 -3704 76021 29359 -15436 -48237 -62169
20743f2169m8688R9523Q1797J10520k6478k7843J452M3482R5478M0749k0536k9145
$$ -62169 -110857 -11334 70463 180983 154505 126662 128114 171596 267074 307823 287287 258142
20731B58142O0753J05951o5508m5670j4624N0282N2633L2786J0277P6515L0308
$$ 258142 318895 424846 359338 313668 299044 349326 401959 434745 445022 521537 551845
20720E51845k9735j3264J3794N0597m2748m5004m2379k5014J08928N9016l6825
$$ 551845 522110 508846 522640 573237 530489 485485 443106 418092 527020 586036 549211
20709E49211q0435o7916k4333P0187L7782K206p5939j25405o5641K7005L6818
$$ 549211 468776 400860 376527 446714 484496 486702 410763 285358 219717 246722 283540
20698B83540j0059R4716L3541o5188q4090j9751l5072N722N3154j2928l3036m0733
$$ 283540 273481 368197 401738 336550 252460 232709 197637 203359 256513 243585 210549 169816
20686A69816j4195J543j4524J5970J0072m3889N8570P6291L3434n217j00954j11183
$$ 169816 155621 157164 142640 158610 168682 124793 183363 259654 293088 287871 186917 75734
20674G5734N7631J7653L0711K8926k5632l6816n4727j6263j3737n3443l1420O313
$$ 75734 133365 151018 181729 210655 185023 148207 93480 77217 63480 10037 -21383 -15070
20662a5070N6538M7767P228l4613J4059k9492M7245m1243N069L7679L845Q950
$$ -15070 41468 89235 96463 61850 75909 46417 93662 52419 57488 95167 99012 107962
20650A07962K9193m921n0474J9789m0029o6522K6771j5908M9860j7920o042N0811
$$ 107962 137155 132234 81760 101549 61520 -5002 21769 5861 55721 37801 31759 82570
20638H2570K4891q477m5579R07l421p181J1439r0060p9088K2702k1469K4706P4436
$$ 82570 107461 98984 53405 54312 50891 43710 55149 -34911 -113999 -91297 -112766 -88060 -13624
20625a3624j23201m1746J9427L4578l474R1456Q8833Q9380R800r6416n1330k671
$$ -13624 -136825 -178571 -159144 -124566 -128040 -36584 52249 141629 151429 55013 3683 1012
20613A012J3922r616K5245o3519j05095o7052M1096J28959M0001M996J7554J3335
$$ 1012 14934 5318 30563 -32956 -138051 -205103 -164007 -35048 4953 9949 27503 40838
20601D0838l2959J6039l0062j51422q788P3748J08098L4299K2527r7184l8930
$$ 40838 7879 23918 -6144 -157566 -166354 -92606 15492 49791 72318 -24866 -63796
20590f3796M7698Q5492J1958k3595L7284R4869m6908o920o5236k9886m0425P2563
$$ -63796 -16098 69394 81352 57757 95041 189910 143002 136082 70846 40960 535 73098
20578G3098J1114o0856r7013j5855Q5955N3498J1090n8801p0635k8854p7754N8725
$$ 73098 84212 23356 -73657 -89512 -3557 49941 61031 2230 -68405 -97259 -175013 -116288
20566a16288J1001L1748L8851J4082K0225j7705K3842K6625n8001j02006J5515
$$ -116288 -105287 -73539 -34688 -20606 -381 -18086 5756 32381 -25620 -127626 -112111
20555a12111O6138k409N1461l6089j8659M5341J5798k4347L9989K6701k9538K7876
$$ -112111 -45973 -48382 3079 -33010 -51669 -6328 9470 -14877 25112 51813 22275 50151
20543E0151q3830j24013j5093M1165Q790L0073O5744M635N666j2900l3571j16167
$$ 50151 -33679 -157692 -172785 -131620 -122830 -92757 -27013 -22378 -16712 -29612 -63183 -179350
20531a79350m8752J35370K3944K0483k2687L531K1274k1510k6296j6102j0490
$$ -179350 -228102 -92732 -68788 -48305 -70992 -67461 -46187 -67697 -93993 -110095 -120585
20520a20585L0243M8727j6789K7922N4165j5653o4935n6348O5369k1979n8783
$$ -120585 -90342 -41615 -58404 -30482 23683 8030 -56905 -113253 -47884 -69863 -128646
20509a28646L2910o696m6837m1515k882M580Q2939R1119N5495N910L652n5609
$$ -128646 -95736 -102432 -149269 -190784 -193666 -189086 -106147 -15028 40467 46377 50029 -5580
20497e580k9737L9603L3529j27867j9451L7380K3047l8239p5152j5115R5469M8365
$$ -5580 -35317 4286 37815 -90052 -109503 -72123 -49076 -87315 -162467 -177582 -82113 -33748
20485c3748j2286n2733j1182L3532M2743P5143p204k7722k6528M6535R1949n3146
$$ -33748 -46034 -98767 -109949 -76417 -33674 41469 34265 6543 -19985 26550 118499 65353
20473F5353j35513J7258P4797P907r065k9995K3051p0801N4506N1862q1157R578
$$ 65353 -70160 -52902 21895 29802 20737 -9258 13793 -57008 -2502 49360 -31797 -22219
20461b2219N5740k101J1042J03004j5604p2122r4394J8358J6074L6599o6661m8553
$$ -22219 33521 31420 42462 145466 129862 57740 -36654 -18296 -2222 34377 -32284 -80837
20449h0837l107J6181R771J2669p7500n5162K7187P354J8699l9002P9612L6854
$$ -80837 -83944 -67763 -57992 -45323 -122823 -177985 -150798 -143444 -124745 -163747 -84135 -47281
20437d7281L4818l4015j2169Q4962O9008o0618j4539n9778j7694K5332J5480P473
$$ -47281 -12463 -46478 -58647 26315 95323 34705 20166 -39612 -57306 -31974 -16494 -9021
20425i021K6894j0548q8542j0075l121l3759K9665N0315j8249O6140K2014j1929
$$ -9021 17873 7325 -81217 -91292 -94413 -128172 -98507 -48192 -66441 -301 21713 9784
20413I784l7368J0284M2800l197O56m618k5324J7905j6769j8605M0156N2068l7614
$$ 9784 -27584 -17300 25500 22303 22959 18341 -6983 10922 -5847 -24452 15704 67772 30158
20400C0158l2254l6587L2494q7595n5116K3948K572l8945k0507K9496J28488O0750
$$ 30158 -2096 -38683 -6189 -93784 -148900 -124952 -122380 -161325 -181832 -152336 -23848 36902
20388C6902j0418n5230k6551l0025j06456l039P0569J18032M7332j01210k9569
$$ 36902 26484 -28746 -55297 -85322 -191778 -194817 -124248 -6216 41116 -60094 -89663
20377h9663P568J4999N1284K3537r9477q9614o7119K1989J03082J2432R134N4920
$$ -89663 -82095 -67096 -15812 7725 -91752 -181366 -248485 -226496 -123414 -110982 -101848 -46928
20365d6928m9175M133J8970M5138j9339l8029N3844J8960j3215l8412L1011k2291
$$ -46928 -96103 -91970 -73000 -27862 -47201 -85230 -31386 -12426 -25641 -64053 -33042 -55333
20353e5333l7843l3419k4706L9145O9165j3412j5785n1768j6612P8497N7112O552
$$ -55333 -93176 -126595 -151301 -112156 -42991 -56403 -72188 -123956 -140568 -62071 -4959 1593
20341A593k3280R653m0461k814J4478N2904O5258M4273j11014j37559n3454L9251
$$ 1593 -21687 -12034 -52495 -55309 -40831 12073 77331 121604 10590 -126969 -180423 -141172
20329a41172Q404j1006l6578J9759L1177R103K967K9657J8918m3457j5914J9890
$$ -141172 -132768 -143774 -180352 -160593 -129416 -120313 -117346 -87689 -68771 -112228 -128142 -108252
20317a08252L660J7248R0869O6986L3080k9121p7131m5297N7699m2999m5544J46019
$$ -108252 -104592 -87344 3525 70511 103591 74470 -2661 -47958 9741 -33258 -78802 67217
20305F7217O7528k0838j13070L752j6374P7320O1594p8540m6033M205m7146m4889
$$ 67217 134745 113907 837 4589 -11785 65535 127129 48589 2556 6761 -40385 -85274
20293h5274J00545J8640J4761l4247J2543m2314o6539k8514K9958K7465P1035
$$ -85274 15271 33911 48672 14425 26968 -15346 -81885 -110399 -80441 -52976 18059
20282A8059R325l1746o7556o1926o8202N183N7584k2205p204R0764p1372j2688
$$ 18059 27384 -4362 -71918 -133844 -202046 -196863 -139279 -161484 -168688 -77924 -149296 -161984
20270a61984m509J132k2998L194M2302K3901J9468J9774K1019l4285M3685R6288
$$ -161984 -166493 -165361 -188359 -185165 -142863 -118962 -99494 -79720 -58701 -92986 -49301 46987
20258D6987N2457j12533o3007M6078m3258J6538j5037L9841r9272N856J082K139
$$ 46987 99444 -13089 -76096 -30018 -73276 -56738 -71775 -31934 -131206 -125350 -124268 -122129
20246a22129R8653O4055k9430n1228m3325M454j2486n0340k4624m7612J3236J3698
$$ -122129 -23476 40579 11149 -40079 -83404 -78950 -91436 -141776 -166400 -214012 -200776 -187078
20234a87078O6329J4632R0375K0603L693J1562L5209R6011r4725l0422Q0300o7546
$$ -187078 -120749 -106117 -15742 4861 8554 20116 55325 151336 56611 26189 106489 38943
20222C8943q8823j34638k7916Q0251L1444L0688N9210O6556O8603J7762j167o5000
$$ 38943 -49880 -184518 -212434 -132183 -100739 -70051 -10841 55715 124318 142080 140913 75913
20210G5913j06076n8542l9382Q5702O2679J2015o500r3768o2320n2782J1374N5355
$$ 75913 -30163 -88705 -128087 -42385 20294 32309 25809 -67959 -130279 -183061 -171687 -116332
20198a16332R2599q5982j21305N0255O0965L7208N6718J04305K8381j33521r6449
$$ -116332 -23733 -109715 -231020 -180765 -119800 -82592 -25874 78431 106812 -26709 -123158
20187a23158K3250L351M8542K2911n7586L0297L2468o008o1255k1034l676l1486
$$ -123158 -99908 -96557 -48015 -25104 -82690 -52393 -19925 -25933 -87188 -108222 -111898 -143384
20175a43384O172L4722L8657N335M360n5069J4487o3626k7604M6240J0868N3612
$$ -143384 -137212 -102490 -63833 -58498 -54138 -109207 -94720 -158346 -185950 -139710 -128842 -75230
20163g5230N0039m7729K9879M5041K3255r925K9402j3609o3403K5681N075n9725
$$ -75230 -25191 -72920 -43041 2000 25255 15330 44732 31123 -32280 -6599 -1524 -61249
20151f1249n319M0023N1425p2020p6950L8182K274L8820J9736m4700K321J14724
$$ -61249 -66568 -26545 24880 -47140 -124090 -85908 -83634 -44814 -25078 -69778 -67457 47267
20139D7267K8277j27779j18852K7820J46664P1153n4841n2074K3240J0498L4514
$$ 47267 75544 -52235 -171087 -143267 3397 74550 19709 -32365 -9125 1373 35887
20128C5887r5580n4087N9114R1805N6335M7177K5201n0665j79309o8889K1205
$$ 35887 -59693 -113780 -54666 37139 93474 140651 165852 115187 -64122 -133011 -111806
20117a11806K3470m5192J3765P0493j08157k9049O5228O8245j6552k7777Q757
$$ -111806 -88336 -133528 -119763 -49270 -157427 -186476 -121248 -53003 -69555 -97332 -88575
20106h8575J07788J724L5275L1958r908O15K3861L4972o4093j6722q5398J9979
$$ -88575 19213 20937 56212 88170 78262 78877 102738 137710 73617 56895 -28503 -8524
20094h524M4799O013N3778m0280k479P9343J36530j8841o7276r87Q9657L5462
$$ -8524 36275 42288 96066 55786 53307 132650 269180 250339 183063 182076 271733 307195
20082C07195J5506R9409O3401O9353M4960J66167J45745J86692J56548K27382
$$ 307195 322701 422110 485511 554864 599824 765991 911736 1098428 1254976 1482358
20072A482358L53380N74958Q94626R65474O88753k10722j254834j214638p00150
$$ 1482358 1835738 2410696 3305322 4270796 4959549 4748827 3493993 2279355 1579205
20063A579205l60890k81456k86996j26792J2998p3563n4798j8102r5274k8885
$$ 1579205 1218315 936859 649863 523071 536069 462506 407708 389606 294332 265447
20053B65447l5490O0734j3659r1839K3232M0536l17M6180j4979l5670K8460K0215
$$ 265447 229957 290691 277032 185193 208425 248961 248644 294824 279845 244175 272635 292850
20041B92850n0166l9620j04945N3818J8832p2713j4976P8636N4862m9038k2757
$$ 292850 242684 203064 98119 151937 170769 98056 83080 161716 216578 167540 144783
20030A44783R277J2311r3578J9631Q729K964J5597m4945P172J1454j8857l3232
$$ 144783 154060 166371 72793 92424 101153 104117 119714 74769 81941 93395 74538 41306
20018D1306l099n986n0723p2281L6254m3691l0169Q1949M2797j0568J0045O937
$$ 41306 38207 32221 -18502 -90783 -54529 -98220 -128389 -46440 -3643 -14211 -4166 2771
20006B771m1283k3547k8932l057J0117J00680M9955l0170p6295n1402J5693N8504
$$ 2771 -38512 -62059 -90991 -94048 -83931 16749 66704 36534 -39761 -91163 -75470 -16966
19994a6966r035J9575L3487j750J8394K2674k0575P796k760j3170j7624m0395
$$ -16966 -26001 -6426 27061 25311 43705 66379 45804 53600 50840 37670 20046 -20349
19982b0349K1909k1389J18588K7052J9833l3844j3399J9285R422k3500l0930L295
$$ -20349 1560 -19829 98759 125811 145644 111800 98401 117686 127108 103608 72678 75973
19970G5973j7574j1831P71L8726K344j9450k5258K0324l9711j14646j5478K8973
$$ 75973 58399 46568 47339 86065 88409 68959 43701 64025 24314 -90332 -105810 -76837
19958g6837O434k9111P668k0249l5887k9284L1663J5680J00513N9279J9211j5485
$$ -76837 -70403 -99514 -91846 -112095 -147982 -177266 -145603 -129923 -29410 29869 49080 33595
19946C3595J184l9103n5216K1620J47736O3872n8237j678l3863o5885n0951J6114
$$ 33595 34779 -4324 -59540 -37920 109816 173688 115451 113773 79910 14025 -36926 -20812
19934b0812K1744j6929q0199k0741N2732K6631O1855L9512J6663K1549J020M3235
$$ -20812 932 -15997 -96196 -116937 -64205 -37574 24281 63793 80456 102005 103025 146260
19922A46260K4581j3644M6149m2893p9940k2800L2877Q5598N3068o1848k0596
$$ 146260 170841 157197 203346 160453 80513 57713 90590 176188 229256 167408 146812
19911A46812n9122l0742j7896J26714J82191j8016j8672o1793r6893j1420L1031
$$ 146812 87690 56948 39052 165766 347957 329941 311269 249476 152583 141163 172194
19900A72194M1499j333m3007K0508n4276m4481J57773j0496P4126Q6982J840n5764
$$ 172194 213693 212360 169353 189861 135585 91104 248877 238381 312507 399489 401329 345565
19888C45565p7428L3088J05927Q085o3710K1492k6113K8685J05609Q4328k2016
$$ 345565 268137 301225 407152 415237 351527 373019 346906 375591 481200 565528 543512
19877E43512l2783n2910O334J44843L0131Q8046J79978J3207l1254N0122N3551
$$ 543512 510729 457819 464153 608996 639127 727173 907151 920358 889104 939226 992777
19866I92777L00K652J6948l4556o1362o0951P3105K8942M4330k4911J3197K0854
$$ 992777 993077 995729 1012677 978121 916759 855808 928913 957855 1002185 977274 990471 1011325
19854A011325r489m2208p1944q0750j16168p950k8658k2000l7858m3007K1880
$$ 1011325 1001836 959628 887684 806934 690766 682816 654158 632158 594300 551293 573173
19843E73173L2806l044q3178q4044L2402J26264O7466n9115j00815j1485m5301
$$ 573173 605979 602935 519757 435713 468115 594379 661845 602730 501915 490430 445129
19832D45129m9607p4743r313M2319J18219L7687p0459K675M0917M7794M152O435
$$ 445129 395522 320779 311466 353785 472004 509691 439232 441907 482824 530618 534770 541205
19820E41205M9263L0885N6354J27602J15209L8717k7784O1076J01514K9568R576
$$ 541205 590468 621353 677707 805309 920518 959235 931451 992527 1094041 1123609 1133185
19809A133185M3955M7659P3803J78406K40243K16974K93858L58026K53655l5249
$$ 1133185 1177140 1224799 1298602 1477008 1717251 1934225 2228083 2586109 2839764 2804515
19799B804515k56131m13780m05616l54934k92504k00416j57823o0091r4785j928
$$ 2804515 2548384 2134604 1728988 1374054 1081550 881134 723311 663220 568435 566507
19789E66507j6227n2459k1673m1244p9685Q3520L6930l2532m0284k4091l0693
$$ 566507 550280 497821 476148 434904 355219 438739 475669 443137 402853 378762 348069
19778C48069l9199m0318n2634J2689J721K3265O0376k8907j30459K8527o6041
$$ 348069 308870 268552 215918 228607 230328 253593 313969 285062 154603 183130 117089
19767A17089n0302m3624l8256M9760o814P6440l3331J398K8527m5052o6061N2286
$$ 117089 66787 23163 -15093 34667 27853 104293 70962 72360 100887 55835 -10226 42060
19755D2060j169j2836M2043O703l4942l8087k4148J9502K600p8989J7032M7342
$$ 42060 40891 28055 70098 76801 41859 3772 -20376 -874 1726 -77263 -60231 -12889
19743a2889O623n3494l5457P653O7455J731q1905k7404l4529j1979O6849M3161
$$ -12889 -6266 -59760 -95217 -87564 -20109 -18378 -100283 -127687 -162216 -174195 -107346 -64185
19731f4185R197M9480m4085p4328N4919j8786J6980j8807Q2110Q0320k4624k0096
$$ -64185 -54988 -5508 -49593 -123921 -69002 -87788 -70808 -89615 -7505 72815 48191 28095
19719B8095m0725L378L7165N2871Q005J8201p2958m0670O1917N5089l0492m3079
$$ 28095 -12630 -9252 27913 80784 88789 106990 34032 -6638 55279 110368 79876 36797
19707C6797j2357k2287L3312j713J9268o2875O3737M2449O1147P439k0528m2267
$$ 36797 24440 2153 35465 33752 53020 -9855 53882 96331 157478 164917 144389 102122
19695A02122M663k1306n9326j9363M8299J6500M7264J3552J04828J7678k591j0263
$$ 102122 106785 85479 26153 6790 55089 71589 118853 132405 237233 254911 252320 242057
19683B42057J01220J91584J65086P6958k09092k54767j32476m1555L5281o2714
$$ 242057 343277 534861 699947 776905 567813 313046 180570 139015 174296 111582
19673A11582O170k6252j18545K0560R669J07103Q1338n3602l4763r2188q0515
$$ 111582 117752 91500 -27045 -6485 3184 110287 191625 138023 103260 11072 -69443
19662f9443o9204N1912J23629J5486M525L499j0229o1437o714O5357o606N6295
$$ -69443 -138647 -86735 36894 52380 56905 60404 50175 -11262 -17976 47381 40775 97070
19650I7070p4253p1546j2397M3558m0189K2287o864o7471J4969l9256J07295J00122
$$ 97070 22817 -48729 -61126 -17568 -57757 -35470 -42334 -109805 -94836 -134092 -26797 73325
19638G3325n8602j03339Q5391K6500J2786j457N120m5846K865q2479p1936P8553
$$ 73325 14723 -88616 -3225 23275 36061 34604 39724 -6122 -3257 -85736 -157672 -79119
19626g9119M5157M9081m2967p595L4427j7032K4769j1583o8782m4268L3321N1033
$$ -79119 -33962 15119 -27848 -35443 -1016 -18048 6721 -4862 -73644 -117912 -84591 -33558
19614c3558j0865l9345m6457p4018K86N7699J39894M1234l9240M281M5953K5857
$$ -33558 -44423 -83768 -130225 -204243 -203957 -146258 -6364 34870 -4370 -89 45864 71721
19602G1721q783J3183L1945k1331J00778k4789m6311O1373k0861K4129R157l4410
$$ 71721 62938 76121 108066 86735 187513 162724 116413 177786 156925 181054 190211 155801
19590A55801k6254l3589K0456J4188K9631J4115L831J1167k7040L1156K8686J1809
$$ 155801 129547 95958 116414 130602 160233 174348 178179 189346 162306 193462 222148 233957
19578B33957O861P7623L7343j9029M2126O2230J7356O5546R4388O5529J8516O7517
$$ 233957 240818 318441 355784 336755 378881 441111 458467 524013 618401 683930 702446 769963
19566G69963m9999J14201O1332L614L1560N7646o0746j12752Q406n2397n4939
$$ 769963 719964 834165 895497 899111 930671 988317 927571 814819 823225 770828 715889
19555G15889K047q3236k8741K981K32q6525N6988Q0317J8322o8770o4523K1386
$$ 715889 717936 634700 605959 608940 609172 522647 579635 659952 678274 609504 544981 566367
19543E66367n4795J9976L4932J28K605J00191k2143l5637q2333L4713O4591M089
$$ 566367 511572 531548 566480 566608 569213 669404 647261 611624 529291 564004 628595 632684
19531F32684N2102m7749m7656K7643R6789J21467l383Q1551J43327N8041j0556
$$ 632684 684786 637037 589381 617024 713813 835280 831897 913448 1056775 1114816 1104260
19520A104260O1912J12679K48046K15132J22067M7362J36871K17707J82679Q6877
$$ 1104260 1166172 1278851 1526897 1742029 1864096 1911458 2048329 2266036 2448715 2535592
19510B535592L1808J67666J66032N2083M6631p0811j01409j25662j07804q4471
$$ 2535592 2567400 2735066 2901098 2953181 2999812 2929001 2827592 2701930 2594126 2509655
19500B509655m3038j12949m5512q9298j47854m9635j71291j51445j03369r5100
$$ 2509655 2466617 2353668 2308156 2218858 2071004 2021369 1850078 1698633 1595264 1500164
19490A500164n6948l9151J3223p1836p5109m1426q479L7632l7685P8943J07150
$$ 1500164 1443216 1404065 1417288 1345452 1270343 1228917 1220438 1258070 1220385 1299328 1406478
19479A406478M7761J4849l3528j7770O093O7030l8419o1085m2836M5205J63721
$$ 1406478 1454239 1469088 1435560 1417790 1423883 1490913 1452494 1391409 1348573 1393778 1557499
19468A557499J81170n1685j2538J21662J30702P6674J3620K16270K60352J68298
$$ 1557499 1738669 1686984 1674446 1796108 1926810 2003484 2017104 2233374 2493726 2662024
19458B662024J32197J18292J43095J95068J02688J96642J57792N7921M3738K2437
$$ 2662024 2794221 2912513 3055608 3250676 3353364 3550006 3707798 3765719 3809457 3831894
19448C831894N8876R7161R9048j4967l9862P7418Q7066m1903q2815k6795n7827
$$ 3831894 3890770 3987931 4086979 4072012 4032150 4109568 4196634 4154731 4071916 4045121 3987294
19437C987294O0589Q1806R2507O7708J18211J18772J36239O307P6872K31386K08657
$$ 3987294 4047883 4129689 4222196 4289904 4408115 4526887 4663126 4669433 4746305 4977691 5186348
19426E186348K38691K13160J87360L45723M36168L50408L05377L57241L35859
$$ 5186348 5425039 5638199 5825559 6171282 6607450 6957858 7263235 7620476 7956335
19417G956335N38689M97604L93696L98717K65602J98390K55998K15481J25683
$$ 7956335 8495024 8992628 9386324 9785041 10050643 10249033 10505031 10720512 10846195
19408A0846195J179j3157m330M7633l796M0830n2853j6496J57123K67727L13474
$$ 10846195 10847374 10834217 10829887 10877520 10873724 10914554 10861701 10845205 11002328 11270055 11583529
19397A1583529M25230M22373N80211P13925Q09525Q14396O49453P68056P96993
$$ 11583529 12008759 12431132 13011343 13725268 14534793 15349189 15998642 16766698 17563691
19388A7563691Q08295P35262M84281L96016L50033K64097K25822J23998N6461
$$ 17563691 18371986 19107248 19591529 19987545 20337578 20601675 20827497 20951495 21007956
19379B1007956J65116L07305L74020M38986M57427O03816Q18921J122580J270696
$$ 21007956 21173072 21480377 21854397 22293383 22750810 23354626 24173547 25296127 26566823
19370B6566823J466681J714218K108212K377268K530531K776504L304535L992772
$$ 26566823 28033504 29747722 31855934 34233202 36763733 39540237 42844772 46837544
19362D6837544M310748M385198M819353N826933O901678P256819P074740O588538
$$ 46837544 51148292 55533490 60352843 66179776 73081454 80338273 87413013 94001551
19354I4001551P198516R327475J1436850J1079005O901401J821667J653948M820739
$$ 94001551 101200067 110527542 121964392 133043397 139944798 141766465 143420413 148241152
19346A48241152M977619N08588n625140p978751n658644l749892m823829o463007
$$ 148241152 153218771 153727359 148102219 140123468 134464824 130714932 125891103 119428096
19338A19428096o676634o333992n912421n172443m004765k904917k877895m075107
$$ 119428096 112751462 106417470 100505049 95332606 91327841 88422924 85545029 81469922
19330H1469922m785345m344918l419259k660317k346477k490237k296539j917256
$$ 81469922 76684577 72339659 68920400 66260083 63913606 61423369 59126830 57209574
19322E7209574j531731r73596n81689q9078M21478R79805J531629J777912K033608
$$ 57209574 55677843 54704247 54122558 54033480 54454958 55434763 56966392 58744304 60777912
19313F0777912K436405K731717L356317M524338N409742N516779M672568M334982
$$ 60777912 63214317 65946034 69302351 73826689 79236431 84753210 89425778 93760760
19305I3760760N777773P898506Q957451Q493865Q039274Q532491R009306Q282285
$$ 93760760 99538533 107437039 116394490 124888355 132927629 141460120 150469426 158751711
19297A58751711O642510O338240O045587J708145m458061o969069n821065m150487
$$ 158751711 165394221 171732461 177778048 179486193 175028132 168059063 162237998 158087511
19289A58087511o476657j2708125j5370874j2460302q640750o914523p743959
$$ 158087511 151610854 138902729 123531855 111071553 102430803 95516280 87772321
19282H7772321q922104p749227n353113l542562k918976l265515l390251k927104
$$ 87772321 78850217 71100990 65747877 62205315 59286339 56020824 52630573 49703469
19274D9703469k222312k059817k215852k297196k137679k070960j934698j951697
$$ 49703469 47481157 45421340 43205488 40908292 38770613 36699653 34764955 32813258
19266C2813258j796851j647696j522201j566348j563006j582190j403297j224337
$$ 32813258 31016407 29368711 27846510 26280162 24717156 23134966 21731669 20507332
19258B0507332j265815j138536j045191j002701r90705q70864p54330o59202o39193
$$ 20507332 19241517 18102981 17057790 16055089 15064384 14193520 13439190 12779988 12140795
19249A2140795n98225n92173n78924m95556n00165m43755l20208k65174k97353
$$ 12140795 11542570 10950397 10371473 9875917 9375752 8931997 8611789 8346615 8049262
19240H049262l67690k78746k59860k68800k57241j84065j20432j18491j04335
$$ 8049262 7681572 7402826 7142966 6874166 6616925 6432860 6312428 6193937 6089602
19231F089602L6993n8732j79222j69581j37682j22459j84476j79325k12297j46944
$$ 6089602 6126595 6067863 5888641 5719060 5581378 5458919 5274443 5095118 4882821 4735877
19221D735877j51871j71298k46407k72964k49873j30406j45590j90465j2306k3638
$$ 4735877 4584006 4412708 4166301 3893337 3643464 3513058 3367468 3177003 3164697 3141059
19211C141059j73127j65687j17380r6894o592m7196j73304j22411n3335l4161
$$ 3141059 2967932 2802245 2684865 2587971 2581379 2534183 2360879 2238468 2185133 2150972
19201B150972m7663r601K2717p9098j08260l4246m3624L4936M9683j6508k2348
$$ 2150972 2103309 2093708 2116425 2037327 1929067 1894821 1851197 1886133 1935816 1919308 1896960
19190A896960l7138K42o369n7171Q806Q176p81J0273j6104j18573j08004n1566
$$ 1896960 1859822 1860064 1853695 1796524 1805330 1813506 1812725 1822998 1806894 1688321 1580317 1528751
19178A528751q0151P784J3482R9743r571J9782j9791M3384L3234m9860q4893P1189
$$ 1528751 1448600 1456384 1469866 1569609 1560038 1579820 1560029 1603413 1636647 1586787 1501894 1573083
19166A573083n982k6100o00k8829J5166J17523P4253N0823M8158N389R4778K19587
$$ 1573083 1567101 1541001 1540401 1511572 1526738 1644261 1718514 1769337 1817495 1822884 1917662 2137249
19154B137249L38894K80356K17962J78347m8528l11471l47443l70334l11405j36129
$$ 2137249 2476143 2756499 2974461 3152808 3104280 2792809 2445366 2075032 1763627 1627498
19144A627498r2343k03633j02247L4714l8500L3983O994l0925n4510l0557K7342
$$ 1627498 1535155 1331522 1229275 1263989 1225489 1259472 1266466 1235541 1181031 1150474 1177816
19133A177816o1387j53854N5847M3067J3868K3886j1124j7070m6549L1551j2100
$$ 1177816 1116429 962575 1018422 1061489 1075357 1099243 1088119 1071049 1024500 1056051 1043951
19122A043951m959l3765j8427m4490k8044q8133j8543L4512P2294O3879J8172
$$ 1043951 1038992 1005227 986800 942310 914266 826133 807590 842102 914396 978275 996447
19111I96447m4973L0596J3361n0604l4988k4276l6721o7414k5623K2533j1508
$$ 996447 951474 982070 995431 944827 909839 885563 848842 781428 755805 778338 766830
19100G66830L405K0630M3689k3485m818k1883J5396k1111N8752K6811l8294J5936
$$ 766830 770235 790865 834554 811069 806251 784368 799764 778653 837405 864216 825922 841858
19088H41858k5423j4324j7998M3171l8689J4604M2339m4316R061L2900j02935
$$ 841858 816435 802111 784113 827284 788595 803199 845538 801222 810283 843183 740248
19077G40248k9916N0221K524o6574p9791j12868R195M7679m2239J2316R2402L5287
$$ 740248 710332 760553 763077 696503 616712 503844 513039 560718 518479 530795 623197 658484
19065F58484N0302r243m1462q320O8646l701k1617k4545j2325N2150m8970j338
$$ 658484 708786 699543 658081 649761 718407 714706 693089 668544 656219 708369 659399 658061
19053F58061Q4200M4514L0983n7276n3431M7655P3367N2440R0036j8447n7882
$$ 658061 742261 786775 817758 760482 707051 754706 828073 880513 970549 952102 894220
19042H94220M2614j5904J5086M8739o599m8807p9609L1169Q1960p9947K0207K3424
$$ 894220 936834 920930 936016 984755 978156 929349 849740 880909 962869 882922 903129 926553
19030I26553p1745o1957n5312j3750k9335j6431O046j3751N511P3481M5588J4244
$$ 926553 854808 792851 737539 723789 694454 678023 684069 670318 675829 749310 794898 809142
19018H09142L8350k6819o3153l9129M0433J08743K7762l786Q0431k7867o8923
$$ 809142 847492 820673 757520 718391 758824 867567 895329 891543 971974 944107 875184
19007H75184n7736M4195J4858P595P8449Q4714Q3063M6740J4395J0950q8709Q5507
$$ 875184 817448 861643 876501 884096 962545 1047259 1130322 1177062 1191457 1202407 1113698 1199205
18995A199205K1767m9934k8574O9646L5829l7909K5885K3460J0185j2019k7501
$$ 1199205 1220972 1171038 1142464 1212110 1247939 1210030 1235915 1259375 1269560 1257541 1230040
18984A230040p929J7107L6240P733j13714m0490K5397M500L3096Q1020N2235L7681
$$ 1230040 1222111 1239218 1275458 1283191 1169477 1128987 1154384 1158884 1191980 1273000 1325235 1362916
18972A362916J11623M6836O8994O8756l8696R3949P1550J73684O7931M0360M2686
$$ 1362916 1474539 1521375 1590369 1659125 1620429 1714378 1785928 1959612 2027543 2067903 2110589
18961B110589J08618J42422J08873J13102Q6440O2817n6455O454Q8788p8323j43390
$$ 2110589 2219207 2361629 2470502 2583604 2670044 2732861 2676406 2682860 2771648 2693325 2549935
18950B549935j5160k1321l4947J2370n2122k6245l1192J7053J7139O9120j6832
$$ 2549935 2534775 2513454 2478507 2490877 2438755 2412510 2381318 2398371 2415510 2484630 2467798
18939B467798n5309j01718k790K6321J7996L8993l3730P9424J71924R8081J29345
$$ 2467798 2412489 2310771 2307981 2334302 2352298 2391291 2357561 2436985 2608909 2706990 2836335
18928B836335R6076R6102J02902J14142K07390K23677K29898K31265J87906J49135
$$ 2836335 2932411 3028513 3131415 3245557 3452947 3676624 3906522 4137787 4325693 4474828
18918D474828K58357K98686L15503K82042L24983L33580L51957K71620K03933
$$ 4474828 4733185 5031871 5347374 5629416 5954399 6287979 6639936 6911556 7115489
18909G115489J31917J28036J51004Q7001l7883o7214j199M6389m0842m1634N1086
$$ 7115489 7247406 7375442 7526446 7613447 7575564 7508350 7507151 7553540 7512698 7471064 7522150
18898G522150Q2067J25961O0R2882L16046K23578K49089M81053M44412N87078
$$ 7522150 7604217 7730178 7730238 7823120 8139166 8362744 8611833 9092886 9537298 10124376
18888A0124376O40010P25847Q70955J003569J045986J051678J108449Q88618Q29341
$$ 10124376 10764386 11490233 12361188 13364757 14410743 15462421 16570870 17459488 18288829
18879A8288829R00383P86820O14515M96174M97019O22678N41750L38421L21842
$$ 18288829 19189212 19976032 20590547 21086721 21583740 22206418 22748168 23086589 23408431
18870B3408431M33778M19307K52201J23310K51999M62282M18620M76463N74049
$$ 23408431 23842209 24261516 24513717 24637027 24889026 25351308 25769928 26246391 26820440
18861B6820440Q98778J362052J474620J642335J893423K472872K969374L016328
$$ 26820440 27719218 29081270 30555890 32198225 34091648 36564520 39533894 42550222
18853D2550222L071984L553950M338216N026286N053117M960005N986092P975215
$$ 42550222 45622206 49176156 53514372 58540658 63593775 68553780 74539872 82515087
18845H2515087J0071594J1212798J1576885J1669645J2758477J5288293J6532990
$$ 82515087 92586681 103799479 115376364 127046009 139804486 155092779 171625769
18838A71625769J2879319N374451K592127M780465L136257m408447j1285489j0909951
$$ 171625769 184505088 189879539 192471666 197252131 200388388 195979941 184694452 173784501
18830A73784501q352872r945325j2192995j0757817p776821o535265p349246p481969
$$ 173784501 165431629 155486304 143293309 132535492 124758671 118223406 110874160 103392191
18822A03392191n546005l969757m429493n761729n890897m797369l885341l553777
$$ 103392191 97846186 93876429 89446936 83685207 77794310 72996941 69111600 65557823
18814F5557823l272741k671984j965232j418801j123146p66573o04954m79884
$$ 65557823 62285082 59613098 57647866 56229065 55105919 54339346 53734392 53254508
18806E3254508o8241O23532J281238J912428K398732K748743L005266L360644
$$ 53254508 53186267 53809799 55091037 57003465 59402197 62150940 65156206 68516850
18798F8516850L956005N044073N860096N385742M150265M147542N671004O844231
$$ 68516850 72472855 77516928 83377024 88762766 92913031 97060573 102731577 109575808
18790A09575808O640660O383579P759484Q949519P363614M474155M562353O292978
$$ 109575808 116216468 122600047 130359531 139309050 146672664 151146819 155709172 162002150
18782A62002150L310860m906466r357324o940326n163183r180125j4602307j4077245
$$ 162002150 165313010 160406544 151049220 144108894 138945711 129765586 115163279 101086034
18774A01086034j0377591q170693p655524p185607o048941m708574l367008k301851
$$ 101086034 90708443 82537750 74882226 67696619 61647678 56939104 53572096 51270245
18766E1270245j925175k169839k292395j977822j364911j061279r30595q27666
$$ 51270245 49345070 47175231 44882836 42905014 41540103 40478824 39548229 38720563
18758C8720563o05248k38867L05434P46631J000587Q10983o81031l442660m878864
$$ 38720563 38115315 37876448 38181882 38928513 39929100 40740083 40059052 36616392 31737528
18749C1737528m191821l018220k272166j767032j458759j217637j027725j012152
$$ 31737528 27545707 24527487 22255321 20488289 19029530 17811893 16784168 15772016
18741A5772016q97980q42979q28941p23820o44868p00536m85653m08930m50864
$$ 15772016 14874036 14031057 13202116 12478296 11833428 11132892 10647239 10238309 9787445
18732I787445m38338l24249k70489k20836j68865j90495k79679j95052k14464
$$ 9787445 9349107 9024858 8754369 8533533 8364668 8174173 7894494 7699442 7484978
18723G484978j75472j07498q6361n0931q1533r3057j631Q4396J00697K1093J09989
$$ 7484978 7309506 7202008 7115647 7064716 6983183 6890126 6888495 6972891 7073588 7094681 7204670
18712G204670K24276J94870K34980K17061J78968J91944J59309K02432L08342
$$ 7204670 7428946 7623816 7858796 8075857 8254825 8446769 8606078 8808510 9116852
18703I116852M2650k29027l17218m38057n48898o72307o50616n51906n33189m09927
$$ 9116852 9159502 8930475 8613257 8175200 7626302 6953995 6303379 5751473 5218284 4808357
18693D808357l14744j41373o5319j16322j05007k30657k10662j88421j36307j24940
$$ 4808357 4493613 4352240 4286921 4170599 4065592 3834935 3624273 3435852 3299545 3174605
18683C174605j32083j12923r3217k6820K4703j04750j98150J12514J22982r4380
$$ 3174605 3042522 2929599 2836382 2809562 2834265 2729515 2531365 2643879 2766861 2672481
18673B672481l5800j2488j9341M9079L9179n3531j3732P3366J16523O0373P5794
$$ 2672481 2636681 2624193 2604852 2653931 2693110 2639579 2625847 2699213 2815736 2876109 2951903
18662B951903J00414J85812J78974J06133j9483K2647J79227K19249K51357L84022
$$ 2951903 3052317 3238129 3417103 3523236 3503753 3526400 3705627 3924876 4176233 4560255
18652D560255M26465N84135P29817J161116J846666K492520K740781J812504r44000
$$ 4560255 4986720 5570855 6300672 7461788 9308454 11800974 14541755 16354259 15410259
18643A5410259l517565l441974k152250j226558p84686m48139l45613k88996j51113
$$ 15410259 11892694 8450720 6298470 5071912 4287226 3839087 3493474 3204478 3053365
18634C053365j58067r8033j9749L807o2998r2815p0165k2260q347k571j3193l0662
$$ 3053365 2895298 2797265 2777516 2781323 2718325 2625510 2555345 2533085 2524738 2522167 2508974 2478312
18622B478312O0824O7682J2390k2641q6310L3611j2713j42033j02209q1903o1460
$$ 2478312 2539136 2606818 2619208 2596567 2510257 2543868 2531155 2389122 2286913 2205010 2143550
18611B143550n7088j07170q0843r8926k1415j08670r1781K3014N892l5372n0664
$$ 2143550 2086462 1979292 1898449 1799523 1778108 1669438 1577657 1600671 1606563 1571191 1520527
18600A520527j2225M4174k0882q0869n2313r0191m2525Q1289L7300o2091j09217
$$ 1520527 1508302 1552476 1531594 1450725 1398412 1308221 1265696 1346985 1384285 1322194 1212977
18589A212977j7348j1909m6846l4147K1810M6300M3707Q9544n7808j76155p7894
$$ 1212977 1195629 1183720 1136874 1102727 1124537 1170837 1214544 1304088 1246280 1070125 992231
18578I92231M8553J05029m685j81225j23332K8881R7961O303L2870R8580N6709
$$ 992231 1040784 1145813 1141128 959903 836571 865452 963413 969716 1002586 1101166 1157875
18567A157875P7091j0363r5839Q082M8039n8737o821M4529j1432M0604M7050P6992
$$ 1157875 1234966 1224603 1128764 1136846 1184885 1126148 1119327 1163856 1152424 1193028 1240078 1317070
18555A317070K7295l5686Q9464J24462J1667P0600l6657n6328o7218p6630q2068
$$ 1317070 1344365 1308679 1398143 1522605 1534272 1604872 1568215 1511887 1444669 1368039 1285971
18544A285971m5537j0772P8068J67144J09083J15216J91695J77467M2094L428
$$ 1285971 1240434 1229662 1307730 1474874 1583957 1699173 1890868 2068335 2110429 2113857
18534B113857q2092j57813k95010k16743q7830J6463l4163j25759j0318O6423
$$ 2113857 2031765 1873952 1578942 1362199 1274369 1290832 1256669 1130910 1120592 1187015
18524A187015R214J07378O0665j24830j06724p3472j44444r6062K4654q512q5683
$$ 1187015 1196229 1303607 1364272 1239442 1132718 1059246 914802 818740 843394 834882 749199
18513G49199q6137n8643K490J17832O9314k4907j513j17031m1956J05444m2702
$$ 749199 663062 604419 606909 724741 794055 769148 767635 650604 608648 714092 671390
18502F71390K6817K7988n7114l3651q5893j2381L9964j0847q0558j9887K6537
$$ 671390 698207 726195 669081 635430 549537 537156 577120 566273 485715 465828 492365
18491D92365k5434J50541J04855J48238P2384o639M1088O0856P4907m9150j72329
$$ 492365 466931 617472 722327 870565 942949 936310 977398 1038254 1113161 1064011 891682
18480H91682p5677j09828q9949l2595O1115M5143p6166k0346J3444k9310j1603
$$ 891682 816005 706177 616228 583633 644748 689891 613725 593379 606823 577513 565910
18469E65910m936P1650l1302M3604k5757j27829l1726M7120J3194m40O477p8385
$$ 565910 560974 632624 601322 644926 619169 491340 459614 506734 519928 519488 525965 447580
18457D47580p9217m4162N6739K1980R093K0788K659j8882l6070K6259J7410j8419
$$ 447580 368363 324201 380940 402920 412013 432801 435460 416578 380508 406767 424177 405758
18445D05758n6551M2282k5935J2218q8334K4636J18996O6562k2565K2912k4728
$$ 405758 349207 391489 365554 377772 289438 314074 433070 499632 477067 499979 475251
18434D75251N4386M672L1672p6616o8348N5964L9893K5359K6724J5738J03820
$$ 475251 529637 534309 565981 489365 421017 476981 516874 542233 568957 584695 688515
18423F88515K8948m6603J3695M8599J36234J05828Q2041K22473K83524L85512
$$ 688515 717463 670860 684555 733154 869388 975216 1057257 1279730 1563254 1948766
18413A948766N54091K11777j43970l90418m32292l66977k49317j13788r1330j22459
$$ 1948766 2502857 2714634 2570664 2180246 1747954 1380977 1131660 1017872 926542 804083
18403H04083n7649n3368j10736J0080N7628N3027o4207M4127N7406J15504Q8350
$$ 804083 746434 693066 582330 592410 650038 703065 638858 682985 740391 855895 944245
18392I44245o8903o9930Q8646N5102R3736j8828N356J9099k828R7887J22421m8826
$$ 944245 875342 805412 894058 949160 1042896 1024068 1029424 1048523 1045695 1143582 1266003 1217177
18380A217177q5114j02023J1024O0188K7550M1853L0908P9689J08701L3434j9922
$$ 1217177 1132063 1030040 1041064 1101252 1128802 1170655 1201563 1281252 1389953 1423387 1403465
18369A403465j55258o3723q2517o2857m5248n3958k2820l9065J57460J93237J02446
$$ 1403465 1248207 1184484 1101967 1039110 993862 939904 917084 878019 1035479 1228716 1331162
18358A331162N6268j0464j59463j74759j46219q3112m6653M0631L3193j5801k47
$$ 1331162 1387430 1376966 1217503 1042744 896525 813413 766760 807391 840584 824783 824536
18347H24536K276p3384l8316J1987L7826N9323K6364k0677k5421m7584J02816
$$ 824536 826812 753428 715112 727099 764925 824248 850612 829935 804514 756930 859746
18336H59746R5387M7948n243J3760L2579N4479J7213O5537O2941K8940J6228P1016
$$ 859746 955133 1003081 997838 1011598 1044177 1098656 1115869 1181406 1244347 1273287 1289515 1360531
18324A360531K8988m1635M7972R2660L7807p349p3684o9035J7171L0729j9451
$$ 1360531 1389519 1347884 1395856 1488516 1526323 1518974 1445290 1376255 1393426 1424155 1404704
18313A404704m1959p608J09743j5505j21248j01163j0706J7253l1977k8778p5532
$$ 1404704 1362745 1355137 1464880 1449375 1328127 1226964 1216258 1233511 1201534 1172756 1097224
18302A097224j13410j53505r9741k6960m99r5613n3416M2356P543Q1607K9963
$$ 1097224 983814 830309 730568 703608 703109 607496 554080 596436 603979 685586 715549
18291G15549q4061l3521k0607M734J9268L2952M3775m039o6706N3969k4302K644
$$ 715549 631488 597967 577360 582094 601362 634314 678089 674050 607344 661313 637011 639655
18279F39655k8958Q2621N0594L8888M2130J3046n8003K9073R3679p942M6375J9278
$$ 639655 610697 693318 743912 782800 824930 837976 779973 809046 902725 894783 941158 960436
18267I60436l0167Q5497Q8835Q0253K0743m0204J3990J03294J0962l7828j21118
$$ 960436 930269 1015766 1104601 1184854 1205597 1165393 1179383 1282677 1293639 1255811 1134693
18256A134693o0227L5295J8940l4382j6311j16535r9380m7816r9709q784O4307
$$ 1134693 1074466 1109761 1128701 1094319 1078008 961473 862093 814277 714568 705784 770091
18245G70091J8723O167o1773q0697l3998o2015j4632J20713L1669n8340l924q198
$$ 770091 788814 794981 733208 652511 618513 556498 541866 662579 694248 635908 631984 623786
18233F23786L2218O5104r7103j00392j01187M1906O5074K5358p3281j5184l166
$$ 623786 656004 721108 624005 523613 422426 464332 529406 554764 481483 466299 463133
18222D63133J4856R453l3397q1974P2045j6039R562M9465L5445L0035J4581J08219
$$ 463133 477989 487442 454045 372071 444116 428077 437639 487104 522549 552584 567165 675384
18210F75384J01783J21716J5998M2514l9675k5883n3510n7136j6472M2012m2201
$$ 675384 777167 898883 914881 957395 917720 891837 838327 781191 764719 806731 764530
18199G64530m0384k318N9334K6071L1200n7802j19649p9084K6535m1114m0295
$$ 764530 724146 721828 781162 807233 838433 780631 660982 581898 608433 567319 527024
18188E27024j0890N7671P573K2243j4872p4242L5499P7046L0552l872n5530N7823
$$ 527024 516134 573805 581378 603621 588749 514507 550006 627052 657604 653732 598202 656025
18176F56025L84k7011l5128M7131P7753P6248J1873q836m8231J6843l3793n9700
$$ 656025 656409 629398 594270 641401 719154 795402 807275 798439 750208 767051 733258 673558
18164F73558K0464j0152j4327M4413L0759m6692P5360M4362M0046L8895j3868
$$ 673558 694022 683870 669543 713956 744715 698023 773383 817745 857791 896686 882818
18153H82818j18P3088Q6329R7566K3031M7249Q0574L0167J7213J31606R7153M0143
$$ 882818 882700 955788 1042117 1139683 1162714 1209963 1290537 1320704 1337917 1469523 1566676 1606819
18141A606819J30023J38105J63106J20197J80117J98602P1942J24782J32963K49052
$$ 1606819 1736842 1874947 2038053 2158250 2338367 2536969 2608911 2733693 2866656 3115708
18131C115708K68755K55546L03978L37676M52756M60017M71382N52342O36124
$$ 3115708 3384463 3640009 3943987 4281663 4734419 5194436 5665818 6218160 6854284
18122F854284P28874P46465Q08048J026372J334100J793514K130957K415282L042335
$$ 6854284 7583158 8329623 9137671 10164043 11498143 13291657 15422614 17837896 20880231
18113B0880231L834522N127211P790638J2155526J7502351K1261107J9443270
$$ 20880231 24714753 29841964 37632602 49788128 67290479 88551586 107994856
18106A07994856J321124k7057958k9732593j7638509r389362n354666l385097
$$ 107994856 109315980 82258022 52525429 34886920 25497558 20142892 16757795
18099A6757795k191811j556960j333309j054238p63361o86477o04585m73828m52076
$$ 16757795 14565984 13009024 11675715 10621477 9858116 9171639 8567054 8093226 7641150
18090G641150k69008k54973j35458j77300j64882q9463n837J12047O7962j77682
$$ 7641150 7372142 7117169 6981711 6804411 6639529 6550066 6544229 6656276 6724238 6546556
18080F546556l31492m23578l78938l99978l88862m28158l39410j77998j74383
$$ 6546556 6215064 5791486 5412548 5012570 4623708 4195550 3856140 3678142 3503759
18071C503759j04495j56808k33493k09270j78142j62004j22288p0091j06949p9425
$$ 3503759 3399264 3242456 3008963 2799693 2621551 2459547 2337259 2267168 2160219 2080794
18061B080794j93489r0492p627r161r5498p4795o1097q7879j33448n4233P226
$$ 2080794 1887305 1796813 1789186 1780025 1684527 1609732 1548635 1460756 1327308 1273075 1280301
18050A280301m746n2375n7610m3123J6093j24472k3563P7881K1033K1550m560
$$ 1280301 1275555 1223180 1165570 1122447 1138540 1014068 990505 1068386 1089419 1110969 1106409
18039A106409p1765l5827M3951k5165p300j3825k0649L3396M9163O0562O7504
$$ 1106409 1034644 998817 1042768 1017603 1010303 996478 975829 1009225 1058388 1118950 1186454
18028A186454m4471m4839Q0092R5074R7774R8348K17066K38605K09446K79290
$$ 1186454 1141983 1097144 1177236 1272310 1370084 1468432 1685498 1924103 2133549 2412839
18018B412839L37056K56338j507k65079m16663k78334j03597k9134L7656J23718
$$ 2412839 2749895 3006233 3004726 2739647 2322984 2044650 1941053 1911919 1949575 2073293
18008B073293J33806J05396J02712J69405L34261M02340N05050P15989Q84063
$$ 2073293 2207099 2312495 2415207 2584612 2918873 3321213 3826263 4542252 5426315
17999E426315J151269J389734J596135J497445Q38739k34630j090019j602109
$$ 5426315 6577584 7967318 9563453 11060898 11899637 11665007 10574988 8972879
17991H972879j680350j419771r92707p18907n56823k90428k31522l11275j69596
$$ 8972879 7292529 5872758 4880051 4161144 3604321 3313893 3082371 2771096 2601500
17982B601500r7012j03046j69766j75204l0587K2595l4758K8575p601k1613K5462
$$ 2601500 2504488 2401442 2231676 2056472 2025885 2048480 2013722 2042297 2034696 2013083 2038545
17971B038545M2589r4377q7301j21193j3862p2665k7950j6682l053N5448j5634
$$ 2038545 2081134 1986757 1899456 1778263 1764401 1691736 1663786 1647104 1644051 1699499 1683865
17960A683865l5858j12857M2117Q9981M8095J02109Q77m4830n5874L170M2738
$$ 1683865 1648007 1535150 1577267 1667248 1715343 1817452 1818329 1773499 1717625 1720795 1763533
17949A763533P1346L0612k0419o023Q8367M2624l3236j0055p4213n5316J5496
$$ 1763533 1834879 1865491 1845072 1839049 1927416 1970040 1936804 1926749 1852536 1797220 1812716
17938A812716Q8838o776J3876l648P4245N721l2113l1258M5834J7576N3554k50
$$ 1812716 1901554 1894778 1908654 1905006 1979251 1984972 1952859 1921601 1967435 1985011 2038565 2038315
17926B038315R822p083j015O0047L6402j9408L7566J4998Q5090p089K8875m6834
$$ 2038315 2048137 2041054 2040039 2100086 2136488 2117080 2154646 2169644 2254734 2247645 2276520 2229686
17914B229686k19573j40556n9115j04048o1099J3852k5395j12894p9568P3221
$$ 2229686 2010113 1869557 1810442 1706394 1645295 1659147 1633752 1520858 1441290 1514511
17904A514511K4304j3118j4244l2855r2440q1361o1242R2289L0107n6628n01j0277
$$ 1514511 1538815 1525697 1511453 1478598 1386158 1304797 1243555 1335844 1365951 1309323 1308822 1298545
17892A298545k2609p581o2965j17479l2922K0255J1291j0036P746q560J5155O904
$$ 1298545 1275936 1268355 1205390 1087911 1054989 1075244 1086535 1076499 1084245 1075685 1090840 1097744
17880A097744n0515J6611j05701j9571Q2469m1625n4680k4843r6487k8858N6086
$$ 1097744 1047229 1063840 958139 938568 1021037 979412 924732 899889 803402 774544 830630
17869H30630Q9727q141j06738k9908j08716N8768J04943n4637o1405p5485o3207
$$ 830630 920357 912216 805478 775570 666854 725622 830565 775928 714523 639038 575831
17858E75831j4105J17070J0627j03025m9807m5533l6562M2169P2392J1490J0722
$$ 575831 561726 678796 689423 586398 536591 491058 454496 496665 569057 580547 591269
17847E91269k1640l8423N023O632j08040k7656N5825q07m9647k0359L4143p574
$$ 591269 569629 531206 536229 542861 434821 407165 462990 462183 412536 392177 426320 418746
17835D18746J1348J05255J145m7405p3757k8517J7554l632j2630k9754R8976j6390
$$ 418746 430094 535349 536494 489089 415332 386815 404369 400737 388107 358353 457329 440939
17823D40939K231m5701l5126L1795J4195j9951k9690K2436n9447N2814L1604m319
$$ 440939 443170 397469 362343 394138 408333 388382 358692 381128 321681 374495 406099 401780
17811D01780l6683K6521L8962K1127O794J3536m8094k773j01605n3239N5199N982
$$ 401780 365097 391618 430580 451707 458501 472037 423943 421170 319565 266326 321525 327507
17799C27507K4668K9024J9816j8094L9770L2529p7678l4353j42169K9810M2958
$$ 327507 352175 381199 401015 382921 422691 455220 377542 343189 201020 230830 273788
17788B73788n9909l474Q7425n235m2400L098N0695j0607q050K1897o4137l1414
$$ 273788 213879 210405 297830 292595 250195 253293 303988 293381 285331 307228 243091 211677
17776B11677j1908L4233j5610l0267Q9668O7784j6511n0444M676J186j4100J40171
$$ 211677 199769 234002 218392 188125 277793 345577 329066 278622 283298 284484 270384 410555
17764D10555N2094j55520r4028N4968L524j14050j9137L0375J8022K7343N5881
$$ 410555 462649 307129 213101 268069 271593 157543 138406 168781 186803 214146 270027
17753B70027m0422K9200n158j6622O9541K3574n030p3017n5852j4127q0016K6187
$$ 270027 229605 258805 253647 237025 306566 330140 325110 252093 196241 182114 102098 128285
17741A28285J521J03276K0966m6798o4634j1702N3200k8386L2469O4679J9588
$$ 128285 129806 233082 254048 207250 142616 130914 184114 155728 188197 252876 272464
17730B72464M3369j1874r0404o4265k8051l1873M8755P542K6349R9966L5138j6882
$$ 272464 315833 303959 213555 149290 121239 89366 138121 145663 172012 271978 307116 290234
17718B90234n8421l9072K2366N0019M588L3016L5915J4470q434J6622l3578r889
$$ 290234 231813 192741 215107 265126 269714 302730 338645 353115 344681 361303 327725 317836
17706C17836o7878q4665O972J7254o4275l8637J09060Q9441p0575p1999k7865
$$ 317836 249958 165293 172265 189519 125244 86607 195667 285108 214533 142534 114669
17695A14669M5410P7646L2712n0020P554j321K7755R024K027J8568l712o323L5192
$$ 114669 160079 237725 270437 220417 227971 226650 254405 263429 265456 284024 280312 273989 309181
17682C09181k9235j6241r6096q7110N4028O7029l6351n1607O0951P9440J1388
$$ 309181 279946 263705 167609 80499 134527 201556 165205 113598 174549 253989 265377
17671B65377j0391L3949J02349j0006l4156j3844P4814K0949j02411q9928m782
$$ 265377 254986 288935 391284 381278 347122 333278 408092 429041 326630 236702 231920
17660B31920k3788p551K8175M2732J5593K5553p379r2988l4693r83L5421O1822
$$ 231920 208132 200581 228756 271488 287081 312634 305255 212267 177574 176591 212012 273834
17648B73834L6084K5965j0280j26474k855R3301M149m0753o186J9587K5533Q03
$$ 273834 309918 335883 325603 199129 196274 289575 293724 252971 246785 266372 291905 292708
17636B92708Q309K3711Q0873K7363j23877k1285o4978j39937k7650p585M6680
$$ 292708 301017 324728 405601 432964 309087 287802 222824 82887 55237 47652 94332
17625I4332J32160J03976l7085q9964o9527K6565L3454k1076O8104M5164n3533
$$ 94332 226492 330468 293383 203419 133892 160457 193911 172835 240939 286103 232570
17614B32570k7879M8681n1098l1761J057k0758J901J09550O3427n6552m5227J6709
$$ 232570 204691 253372 202274 170513 171570 150812 152713 262263 325690 269138 223911 240620
17602B40620N2103N1226K973K3867J4982k8132j5706q1113n9793L1847K053K6618
$$ 240620 292723 343949 346922 370789 385771 357639 341933 260820 201027 232874 234927 261545
17590B61545Q7086J1430J1591l2730j4505o9101o7348J14M6746N4940M8922p6532
$$ 261545 348631 360061 371652 338922 324417 255316 187968 188082 234828 289768 338690 262158
17578B62158k0611K86j6076Q6138O4019k2653n2736J7204P1547N6233O1613j63783
$$ 262158 241547 241833 225757 311895 375914 353261 300525 317729 389276 445509 507122 343339
17566C43339l9906l3093M9108L2246o5648L2714j3160L9100O1240j7855k7266
$$ 343339 303433 270340 319448 351694 286046 318760 305600 344700 405940 388085 360819
17555C60819J01786K6149k3566J9600q8197n9529N9962M3455j2253K1626K5513
$$ 360819 462605 488754 465188 484788 396591 337062 397024 440479 428226 449852 475365
17544D75365R2155J27853K25563J17627n174l0120l8931o0106p4418q7671n3630
$$ 475365 567520 695373 920936 1038563 1033389 1003269 964338 904232 829814 742143 688513
17533F88513k6711o0187l4116K693Q5076P9332r9284k1532l047j4680n3822p3303
$$ 688513 661802 601615 567499 570192 655268 734600 635316 613784 610737 596057 542235 468932
17521D68932l3962p055N3758J16851J1525m3551k3632N9909Q1188J43746J09825
$$ 468932 434970 427915 481673 598524 610049 566498 542866 602775 683963 827709 937534
17510I37534k2976k3323l5085J02669L6995Q430k9532O208K3093K4424j8760K320
$$ 937534 914558 891235 856150 958819 995814 1004244 974712 980920 1004013 1028437 1009677 1011997
17498A011997L8228k0639k6092K3761K3114P2298N4401M2712J0131j5343n047
$$ 1011997 1050225 1029586 1003494 1027255 1050369 1122667 1177068 1219780 1229911 1214568 1209521
17487A209521M7080J18466N9088K1415r069N2635l3746m951J35175N9278O5244
$$ 1209521 1256601 1375067 1434155 1455570 1446501 1499136 1465390 1460439 1595614 1654892 1720136
17476A720136J9389P0179R3555k3373m6307P6070J35942O3520K7611Q7114J09416
$$ 1720136 1739525 1809704 1903259 1879886 1833579 1909649 2045591 2109111 2136722 2223836 2333252
17465B333252L6911q766J16097O7319J10485P6654l012J07512J72200J54566J73894
$$ 2333252 2370163 2361397 2477494 2544813 2655298 2731952 2728940 2836452 3008652 3163218 3337112
17454C337112K05742K37245K41333K49633K96268L20240K73558L29629L92030
$$ 3337112 3542854 3780099 4021432 4271065 4567333 4887573 5161131 5490760 5882790
17445E882790N54840N31037N25599O15987P11053Q51776Q82915R27571J055950
$$ 5882790 6437630 6968667 7494266 8110253 8821306 9673082 10555997 11483568 12539518
17436A2539518J084219J031660Q64736Q44085J090831J354961J582690J900696
$$ 12539518 13623737 14655397 15520133 16364218 17455049 18810010 20392700 22293396
17428B2293396K168845K452530K795538L316065M038500N247694O557211P911320
$$ 22293396 24462241 26914771 29710309 33026374 37064874 42312568 48869779 56781099
17420E6781099R510698J1828280J5013155K0366568K9801417M4190814N9857217
$$ 56781099 66291797 78120077 93133232 113499800 143301217 187492031 247349248
17413B47349248O7413726M9079682r772882p5014726q8725843o1874176l5470541
$$ 247349248 314762974 363842656 354069774 279055048 190329205 128455029 92984488
17406I2984488k0487673j2617167q171981n627115m342680l759780l297239k861016
$$ 92984488 72496815 59879648 51707667 46080552 41737872 37978092 34680853 31819837
17398C1819837k448773j871413j386454j061596q43990o35215m13309j84922J78846
$$ 31819837 29371064 27499651 26113197 25051601 24207611 23572396 23159087 22974165 23153011
17389B3153011N55502O70802J70587p83238j603948j873359j653491j528680j457946
$$ 23153011 23708513 24379315 24549902 23766664 22162716 20289357 18635866 17107186 15649240
17380A5649240j340878j129576r53708q23896q31079q30880p38379n33734m26134
$$ 15649240 14308362 13178786 12225078 11401182 10570103 9739223 9000844 8467110 8040976
17371H040976n76007n62079m63680m93632l96649k72008l48828l71328l41160
$$ 8040976 7464969 6902890 6439210 5945578 5548929 5276921 4928093 4556765 4215605
17362D215605k71002j73300k00965j95956j62332k02128k54112j98517j87805
$$ 4215605 3944603 3771303 3570338 3374382 3212050 3009922 2755810 2557293 2369488
17353B369488j25102j44343j07323p9624j10408j38816j17201j08322j81595r7965
$$ 2369488 2244386 2100043 1992720 1913096 1802688 1663872 1546671 1438349 1256754 1158789
17343A158789j9762J8660K9491k8301n6208J1457o6851p0718M3713k952O245n0010
$$ 1158789 1139027 1157687 1187178 1158877 1102669 1114126 1047275 976557 1020270 1017318 1023563 973553
17331I73553j09085r7374p6021n3958k1910k5881r8788n3675K1387l5581j2346
$$ 973553 864468 767094 691073 637115 615205 589324 490536 436861 458248 422667 410321
17320D10321j13213l2636K8918o0310k3934M4718l8420n3587M8470P5352Q62r32
$$ 410321 297108 264472 293390 233080 209146 253864 215444 161857 210327 285679 286541 285609
17308B85609L733k966p9520K949j5377N1237M0079K6349l3701l8602r9907r281
$$ 285609 289342 286376 206856 209805 194428 245665 285744 312093 278392 239790 139883 130602
17296A30602L4098P0608Q7563j2962k7495L2204N9051J23708N6163l0612r8319
$$ 130602 164700 235308 322871 309909 282414 314618 373669 497377 553540 522928 424609
17285D24609j19614r3305j9547L8534M4610K3903J6819k8653j07378l3556j6997
$$ 424609 304995 211690 192143 230677 275287 299190 316009 287356 179978 146422 129425
17274A29425l6731m028j2431J11649K086J988L0064p0315r5658L6736K1221J5908
$$ 129425 92694 88666 76235 187884 189970 191958 222022 151707 56049 92785 114006 129914
17262A29914j0868M8374J0209m443K3895j0187m1117K1067K9166L4131L1524o955
$$ 129914 119046 167420 177629 173186 197081 186894 145777 166844 196010 230141 261665 254710
17250B54710j09679J6746J1273R2178k1871o1247l1364J06338k9272k9427j0001
$$ 254710 145031 161777 173050 265228 243357 182110 150746 257084 227812 198385 188384
17239A88384K1613P2189M6513M0317p8321q3935l3352L3351n9994q9801p834l589
$$ 188384 209997 282186 328699 369016 290695 206760 173408 206759 146765 56964 49130 45541
17227D5541l4009N6060q980j2023j28m6166M0058L9410M6019N153J2171l5316
$$ 45541 11532 67592 58612 46589 46461 295 40353 79763 125782 130935 143106 107790
17215A07790k9063L4819L11n7446l6316L8656K9072L866O1987m3308m7442O926
$$ 107790 78727 113546 113857 56411 20095 58751 87823 91689 153676 110368 62926 69852
17203F9852O575J01900K4953q9261L6739L4884m282L341r499j00285p0665m2930
$$ 69852 76427 178327 203280 114019 150758 185642 181360 184701 175202 74917 4252 -38678
17191c8678J3982O7264j579J3893n1316Q5148o5291K6490R8672J7925n0577l9622
$$ -38678 -24696 42568 40989 54882 3566 88714 23423 49913 148585 166510 115933 76311
17179G6311K0238m9084m309O4091k6234j13341l7327P6764Q9329M0364n2248m628
$$ 76311 96549 47465 43156 107247 81013 -32328 -69655 7109 96438 136802 84554 79926
17167G9926P501Q394j05912k7328O9684K9937q4381p7641L7761L6448R924J6463
$$ 79926 87427 95821 -10091 -37419 32265 62202 -22179 -99820 -62059 -25611 -15687 776
17155G76K6348l5943k9834m022k1674L5307j341j9761J9915O9302Q4184P8131
$$ 776 27124 -8819 -38653 -42675 -64349 -29042 -30383 -50144 -30229 39073 123257 201388
17143B01388L3330n9979j9500p3473p117J01361n929q8022n3932j2638j5304m3611
$$ 201388 234718 174739 155239 81766 74649 176010 170081 82059 28127 15489 185 -43426
17131d3426k5556J1853n8971j084Q7631M8637L8209N6345l9671j03604k3927P7519
$$ -43426 -68982 -57129 -116100 -117184 -29553 19084 57293 113638 73967 -29637 -53564 23955
17119B3955N633k8756o8191O3414P8503k5406J6015P7678J36122p8547j38997
$$ 23955 29588 832 -67359 -3945 74558 49152 65167 142845 278967 200420 61423
17108F1423p6306L3147M3085J12980r859r8522M9122P3368M3422l8902P3676j05366
$$ 61423 -14883 18264 61349 174329 164470 65948 115070 188438 231860 192958 266634 161268
17096A61268l8598P318k8755r6185l4948j5897m7045K0801N6379p057n3729j3986
$$ 161268 122670 129988 101233 5048 -29900 -45797 -92842 -72041 -15662 -22719 -76448 -90434
17084i0434j2819M3303m9972l2818L9513P122K6996N044k1353O8548K6604r173
$$ -90434 -103253 -59950 -109922 -142740 -103227 -96105 -69109 -64065 -85418 -16870 9734 561
17072E61o587L9341n6585L3569K1574L0869L6790m1268j2982k4215M3396k4385
$$ 561 -6026 33315 -23270 10299 31873 62742 99532 58264 45282 21067 64463 40078
17060D0078O6709M2771r3618j90696j8694N0687O873n3458n182L0694L0024O716
$$ 40078 106787 149558 55940 -134756 -153450 -102763 -95890 -149348 -154530 -123836 -93812 -87096
17048h7096j2999n546p4478l0984Q1377L6318j541N8434L7060o5973q6046j2935
$$ -87096 -100095 -105641 -180119 -211103 -129726 -93408 -94949 -36515 545 -65428 -151474 -164409
17036a64409M0468N6136J4434o114l3138M5592k701k0793l2968r5847K7573P0982
$$ -164409 -123941 -67805 -53371 -59485 -92623 -47031 -49732 -70525 -103493 -199340 -171767 -100785
17024a00785M4111L202n0923j25500k9087R2122R6271N2221j8092N547J8042l4485
$$ -100785 -56674 -53472 -104395 -229895 -258982 -166860 -70589 -18368 -36460 -30913 -12871 -47356
17012d7356o5421M1249J38494N6856o6938l8403L0705M2466j283j9996m930n0576
$$ -47356 -112777 -71528 66966 123822 56884 18481 49186 91652 90369 70373 65443 14867
17000A4867M3895L4835J0857k8568k4550j20666o2504m8627j8937R2714J09021
$$ 14867 58762 93597 104454 75886 51336 -69330 -131834 -180461 -199398 -106684 2337
16989B337L4835M7322M991j41700Q860j4665o9957j16578O9806O7592P6597k0912
$$ 2337 37172 84494 89485 -52215 -43355 -58020 -127977 -244555 -174749 -107157 -30560 -51472
16977e1472p9567n7222P4674Q9997n2829k7762P7849K7062K6729J1879J5316l6838
$$ -51472 -131039 -188261 -113587 -23590 -76419 -104181 -26332 730 27459 39338 54654 17816
16965A7816m88j2624L7046k444m3770J7375L7617j7902l3569p6661k1101J9390
$$ 17816 17328 4704 41750 39306 -4464 12911 50528 32626 -943 -77604 -98705 -79315
16953g9315J1937M0462M3122o1470m8421M2881L5024l3949k4391j4360K992L2143
$$ -79315 -67378 -26916 16206 -45264 -93685 -50804 -15780 -49729 -74120 -88480 -85488 -53345
16941e3345M949J4286R5993l4694P286O8973j8026k3536j2534o0958o9372K5682
$$ -53345 -48396 -34110 61883 27189 34475 103448 85422 61886 49352 -11606 -80978 -55296
16929e5296k8453L5673J8915k2710O4072j28N9423m7787k3036n2111p3042k7012
$$ -55296 -83749 -48076 -29161 -51871 12201 12073 71496 23709 673 -51438 -124480 -151492
16917a51492N1717N1769j9219L4431k766l3334L7057k8504m5330K588L8567M0903
$$ -151492 -99775 -48006 -67225 -32794 -35560 -68894 -31837 -60341 -105671 -103083 -64516 -23613
16905b3613K1632N1467M9842l8105L1763j3201o3857J9289L5769Q7576r979j07450
$$ -23613 -1981 49486 99328 61223 92986 79785 15928 35217 70986 158562 148583 41133
16893D1133l2426N1983k79q7476j956o0436q2981N7528Q5297m502l7761o0383
$$ 41133 8707 60690 60411 -27065 -29021 -89457 -172438 -114910 -29613 -34115 -71876 -132259
16881a32259J2718R6075N5223J7618j0496n3576m6473K421l7761k6456n998O686
$$ -132259 -119541 -23466 31757 49375 38879 -14697 -61170 -58749 -96510 -122966 -128964 -122278
16869a22278J1692l8018j760L9440j8802N5231O4789K2487M9238N6617j02218
$$ -122278 -110586 -148604 -150364 -110924 -129726 -74495 -9706 12781 62019 118636 16418
16858A6418o1647O2350M4654j6129J9304L6045o584k5392r6867m9678n9872P554
$$ 16418 -45229 17121 61775 45646 64950 100995 94411 69019 -27848 -77526 -137398 -129844
16846a29844K8265R2672q7088q5266N4068M5924R796l312j5199M7751N4330K3454
$$ -129844 -101579 -8907 -95995 -181261 -127193 -81269 -71473 -74785 -89984 -42233 12097 35551
16834C5551Q335p841n6476j6608Q597m2P3336L651p5456j2675m2086J31658N2672
$$ 35551 43886 36045 -20431 -37039 -28442 -28484 44852 48503 -26953 -39628 -81714 49944 102616
16821A02616L4430M6224r1803l3479m0177n0989L1322O4614Q5788J2578P1913
$$ 102616 137046 183270 91467 57988 17811 -33178 -1856 62758 148546 161124 233037
16810B33037J21403O1163l2104J7726R3019J11357J29227J31953K50361L46673
$$ 233037 354440 415603 383499 401225 494244 605601 734828 866781 1117142 1463815
16800A463815K59480J24038p4627l79419m63791l30309j64935j28705n5802k7156
$$ 1463815 1723295 1847333 1772706 1393287 929496 599187 434252 305547 249745 222589
16790B22589j31509l6340M3025R8642N3246n2232m6071q4173j1960Q219k1635
$$ 222589 91080 54740 97765 196407 249653 197421 151350 67177 55217 63436 41801
16779D1801M5563k5727l8745k6019k7305j6836R3479J7205K2787j6364k3275N193
$$ 41801 87364 61637 22892 -3127 -30432 -47268 46211 63416 86203 69839 46564 51757
16767E1757n335l5130k4743J8480L82l7739M8544Q6658P5241m7998q8217q3002
$$ 51757 46422 11292 -13451 5029 5411 -32328 16216 102874 178115 130117 41900 -41102
16755d1102J8839O6396l6730O4192K566n5788m7911n0458O5494J37263j7767j16841
$$ -41102 -22263 44133 7403 71595 74161 18373 -29538 -79996 -14502 122761 104994 -11847
16743a1847l574l5244L003k317J3752l5643n926L5437k935K7079L4708N7637l7092
$$ -11847 -15421 -50665 -47662 -49979 -36227 -71870 -77796 -42359 -45294 -18215 16493 74130 37038
16730C7038l2968k72K5800o820o8255k7461m1687M7189M2181J4108J5070L3207
$$ 37038 4070 3798 29598 22778 -45477 -72938 -114625 -67436 -25255 -11147 3923 37130
16718C7130M6022p479K1647P551j16305q6384o4347P3783Q1208Q2049L1045K8903
$$ 37130 83152 75673 97320 104871 -11434 -97818 -162165 -88382 -7174 74875 105920 134823
16706A34823J787l5910m1074m2781r5984l6207M6539L2567m346J7802k5601J6649
$$ 134823 136610 100700 59626 16845 -79139 -115346 -68807 -36240 -40586 -22784 -48385 -31736
16694c1736O1501r788q6889J1375J51473J2957q1106q9086O6856Q9727l792m2855
$$ -31736 29765 19977 -66912 -55537 95936 108893 27787 -61299 5557 95284 91492 48637
16682D8637O8456K9713L941m3820n1850p659m7538p3495J8006R827l9849k3501
$$ 48637 117093 146806 150747 106927 55077 47418 -120 -73615 -55609 -45782 -85631 -109132
16670a09132N224P966P473M2321N56m5141N4341J5660n751L4743P545k2102K442
$$ -109132 -103908 -95942 -88469 -46148 -45592 -90733 -36392 -20732 -26483 8260 15805 -6297 -3855
16657c855r5056O019L9952L2603L8624o0466O322J9728l2354o4445J5853o123
$$ -3855 -98911 -92892 -52940 -20337 18287 -42179 -35857 -16129 -48483 -112928 -97075 -103198
16645a03198J4783N6480m489j818L7814J3422q0878n210N3844L2452j363k3430
$$ -103198 -88415 -31935 -36424 -38242 -428 12994 -67884 -73094 -19250 13202 11839 -11591
16633a1591j15J06035Q143j29138j15903j695O920l7895N8022M7779l7321l7971
$$ -11591 -11706 94329 102472 -26666 -142569 -144264 -137344 -175239 -117217 -69438 -106759 -144730
16621a44730J2563O2597l658l1937j2854Q270K1351Q4921j969J2064K0820P2098
$$ -144730 -132167 -69570 -73228 -105165 -118019 -109749 -88398 -3477 -5446 6618 27438 99536
16609I9536o7152k7172O995L9767N4523p3397n9239J2227J1878m8869L3928m3802
$$ 99536 32384 5212 12207 51974 106497 33100 -26139 -13912 -2034 -50903 -16975 -60777
16597f0777l0397l3023O164O1383L4845J2969K9020o450M3997L5757l7472o8750
$$ -60777 -91174 -124197 -118033 -56650 -21805 -8836 20184 13734 57731 93488 56016 -12734
16585a2734J4765j98P494J8049m1099L8009K4388k8406k8354j336M4662Q984o5756
$$ -12734 2031 1833 9327 27376 -13723 24286 48674 20268 -8086 -9422 35240 44224 -21532
16572b1532k2298N761j5438N8001Q2607k0318n0359O3751N635j5776m0722p4206
$$ -21532 -43830 -38069 -53507 4494 87101 66783 16424 80175 85810 70034 29312 -44894
16560d4894j05132l6330Q9911J13159j9001m9030L0674l1571N9145P9474M3865
$$ -44894 -150026 -186356 -96445 16714 -2287 -51317 -20643 -52214 6931 86405 130270
16549A30270n9282l6726n7261m3363K2368K2183M011q1780l7352J48274o136q4160
$$ 130270 70988 34262 -22999 -66362 -43994 -21811 -17800 -99580 -136932 11342 5206 -78954
16537g8954N8079M0776K2319N5842K497l4238q4687j4410k9L0938K8829j992L2364
$$ -78954 -20875 19901 42220 98062 100559 66321 -18366 -32776 -32805 -1867 26962 24970 57334
16524E7334L2748l4969N1444Q161q7092j172K9614q983k1474M7372K5464n8133
$$ 57334 90082 55113 106557 114718 27626 26454 56068 47085 25611 72983 98447 40314
16512D0314j3616l9422p4545M5815M2400k8363k0612P9860l3953O933L6729J0298
$$ 40314 26698 -12724 -87269 -41454 946 -27417 -48029 31831 -2122 4811 41540 51838
16500E1838n8735p7556N5263Q7511N720o1364K7925J16063Q1548o1599r9208j28322
$$ 51838 -6897 -84453 -29190 58321 64041 2677 30602 146665 228213 166614 67406 -60916
16488f0916l2549O5764l6788k110l3685L0365Q5796K9148J6716o2092m6337J3703
$$ -60916 -93465 -27701 -64489 -66599 -100284 -69919 15877 45025 61741 -351 -46688 -32985
16476c2985P5217M3582j02559q092J2373q334p0255N6310K3671J2411j2201n9654
$$ -32985 42232 85814 -16745 -24837 -12464 -20798 -91053 -34743 -11072 1339 -10862 -70516
16464g0516J8551j6062L4372K8158L9038R983l1354j2729L1863m3155q0724N5260
$$ -70516 -51965 -68027 -33655 -5497 33541 43524 12170 -559 31304 -11851 -92575 -37315
16452c7315n234J8251m9751j1295N8386K9267n3908n412O440m3082Q4776P1545
$$ -37315 -42549 -24298 -74049 -85344 -26958 2309 -51599 -57011 -50571 -93653 -8877 62668
16440F2668Q031o4508l8976j5096N0577J8506n7394m0744n3204N7103R5831j286
$$ 62668 70699 6191 -32785 -47881 2696 21202 -36192 -76936 -130140 -73037 22794 21508
16428B1508P1956K4901O109o1156K090l626m259J6821m4833j2082J8738L3573
$$ 21508 93464 118365 124474 63318 65408 61782 57523 74344 29511 17429 36167 69740
16416F9740o9604r6925l5000O443P9412K5901j1954k6355L6374N0384o9882j07312
$$ 69740 136 -96789 -131789 -125346 -45934 -20033 -31987 -58342 -21968 28416 -41466 -148778
16404a48778L7334j0876R824K3566O221N0586k2493p6922Q0316M1217m3369l6519
$$ -148778 -111444 -122320 -112496 -88930 -82709 -32123 -54616 -131538 -51222 -10005 -53374 -89893
16392h9893L0068K7595L8777O6187O4682k8605n9563P629O6510l37j14852r2487
$$ -89893 -59825 -32230 6547 72734 137416 108811 49248 56877 123387 123050 8198 -84289
16380h4289m1980l8103j362L9029M2658L403K8508N5260j76K1866j577k8471j6583
$$ -84289 -126269 -164372 -165734 -126705 -84047 -80644 -52136 3124 2948 24814 23237 -5234 -21817
16367b1817q2436k2392L0143N234O8154K102l8112J7767j442r2132K007J9105
$$ -21817 -104253 -126645 -96502 -91268 -23114 -21012 -59124 -41357 -42799 -134931 -132924 -113819
16355a13819J6325J0311J05081L0492j00971n6229k9536N0504K8358K3350J1446
$$ -113819 -97494 -87183 17898 48390 -52581 -108810 -138346 -87842 -59484 -36134 -24688
16344b4688r937r0682J4220P4728J11134J10670j8256r5220q9679n6229k9846
$$ -24688 -34625 -125307 -111087 -36359 74775 185445 167189 71969 -17710 -73939 -103785
16333a03785k8366O5457l71L2237M388q0526n2162K528K025O7489Q7811o2423
$$ -103785 -132151 -66694 -67065 -34828 -30440 -110966 -163128 -160600 -158575 -91086 -3275 -65698
16321f5698j8013J06041K1038N9828J9372o0120r6322J6020n6981L7256L8943
$$ -65698 -83711 22330 43368 103196 122568 62448 -33874 -17854 -74835 -37579 1364
16310A364N7861k961k0445q191R2367K7066p9718k4450l4608j01408o0707K2617
$$ 1364 59225 56264 35819 27628 119995 147061 67343 42893 8285 -93123 -153830 -131213
16298a31213M0426J6865M3314l0119l9578m730P4204M1034M6653L3544l3744p6442
$$ -131213 -90787 -73922 -30608 -60727 -100305 -105035 -30831 10203 56856 90400 56656 -19786
16286a9786n5864j6447M4583K1541k2282n7219k0820L9626j282k3381L3054M0616
$$ -19786 -75650 -92097 -47514 -25973 -48255 -105474 -126294 -86668 -87950 -111331 -78277 -37661
16274c7661l0332J5682R435j2089J6607J4324p9486P9486J35321j06265j9513
$$ -37661 -67993 -52311 -42876 -54965 -38358 -24034 -103520 -24034 111287 5022 -14491
16263a4491L9515J042p5560j9154L7170q396k9804Q472N0087K0853J0128J3577
$$ -14491 25024 26066 -49494 -68648 -31478 -39874 -69678 -61206 -11119 9734 19862 33439
16251C3439M0593o5543j3386Q6548J2361P9375P8368j2657n9807r2155r078O5404
$$ 33439 74032 8489 -4897 81651 94012 173387 251755 239098 179291 87136 78058 143462
16239A43462j159m2438l1315k0877j02021k0472M859K0324L2588L9830K2175K4893
$$ 143462 142303 99865 68550 47673 -54348 -74820 -69961 -49637 -17049 22781 44956 69849
16227F9849j3905j165m7470k9572J209q420J4089q4134q2217J8245j2110N8208
$$ 69849 55944 54779 7309 -22263 -21054 -29474 -15385 -99519 -181736 -163491 -175601 -117393
16215a17393M9855n1136L8031k0496j2514K798L9417M8057l9909J7834R9674j1819
$$ -117393 -67538 -118674 -80643 -101139 -113653 -110855 -71438 -23381 -63290 -45456 54218 42399
16203D2399N667Q878L0598m5659j681L343O6232l5125n8145M802L8905L5588j569
$$ 42399 48066 56944 87542 41883 40202 43545 109777 74652 16507 21309 60214 95802 94233
16190I4233K2097l0382q3433L3749K2336P3028J2373p5287p8042p4214L7598J4637
$$ 94233 116330 85948 2515 36264 58600 131628 144001 68714 -9328 -83542 -45944 -31307
16178c1307R89k096J9830R972P5291L19m9134Q1343j1921j1507q0944n8771n0630
$$ -31307 -30318 -32414 -12584 -2612 72679 72998 23864 105207 93286 81779 835 -57936 -108566
16165a08566j25847M7231J19320M9769o39J0562J8929n986n1486r7572R9135R3613
$$ -108566 -234413 -187182 -67862 -18093 -18732 -8170 10759 4773 -46713 -144285 -45150 48463
16153D8463n4280J5691P5715L9322m8469m4919j9313k8946K7548j7679m9639K9807
$$ 48463 -5817 9874 85589 124911 76442 31523 12210 -16736 10812 -6867 -56506 -26699
16141b6699K4797o4348j168N3708R5279J7574l1284n1422l0705m1403L743Q113
$$ -26699 -1902 -66250 -67418 -13710 81569 99143 67859 16437 -14268 -55671 -51928 -43815
16129d3815p1515n844J29274J2126p1533m1237O6987L5537n7985r187M0890n974
$$ -43815 -115330 -121174 8100 20226 -51307 -92544 -25557 9980 -48005 -57192 -16302 -22276
16117b2276m8086J1134k9988o0299L2406p861n709Q3256j1925K4599J0952l6512
$$ -22276 -70362 -59228 -89216 -149515 -117109 -124970 -130679 -47423 -59348 -34749 -23797 -60309
16105f0309j7713J071Q375J8561K5710j0430k0570K0269o960K3084k7111K5221
$$ -60309 -78022 -76951 -68576 -50015 -24305 -34735 -55305 -35036 -41996 -18912 -46023 -20802
16093b0802P4589o9196k528J2820o24K7670j0340L1999J27009K9438j00271j26873
$$ -20802 53787 -15409 -17937 -5117 -5741 21929 11589 43588 170597 200035 99764 -27109
16081b7109J4421J21988o67l5089M4043R333p4516l159K4894l8853p4121m5126
$$ -27109 -12688 109300 108633 73544 117587 126920 52404 49245 74139 35286 -38835 -83961
16069h3961l6869K8101L3318J08751J9949K2241p2121n1569J9092N5771J6034
$$ -83961 -120830 -92729 -59411 49340 69289 91530 19409 -32160 -13068 42703 58737
16058E8737o629o5012j8658K1592j8308n935J4344n6048l427l1144K9262L2135
$$ 58737 52108 -12904 -31562 -9970 -28278 -34213 -19869 -75917 -79344 -110488 -81226 -49091
16046d9091K7313k4901m1614L332K9821J3521Q9027o174l0586Q36j839j31013
$$ -49091 -21778 -46679 -88293 -84961 -55140 -41619 47408 41234 10648 11484 9645 -121368
16034a21368N5499M9336p7082M3374P3586O8753K1749K0513q8787n0676m7101
$$ -121368 -65869 -16533 -93615 -50241 23345 92098 113847 134360 45573 -5103 -52204
16023e2204j8522O301j4278K6884N7459k5164j2452q6958n1590P1956N6307n426
$$ -52204 -70726 -64425 -78703 -51819 5640 -19524 -31976 -118934 -170524 -98568 -42261 -47687
16011d7687M6106k0057L823K013j0754j0379O5522m147q6054j7390m0921R4K5253
$$ -47687 -1581 -21638 -17815 -15802 -26556 -36935 28587 24440 -61614 -79004 -119925 -119831 -94578
15998i4578M3149n9646n5687L0078k682j5653Q2724j0126n1660M4692l0311J09541
$$ -94578 -51429 -111075 -166762 -136684 -139366 -155019 -72295 -82421 -134081 -89389 -119700 -10159
15986a0159L3033K5020j8339j1528J1587l7793k4189O242K3654k4104l7929L440
$$ -10159 22874 47894 29555 18027 29614 -8179 -32368 -26126 -2472 -26576 -64505 -61065
15974f1065m7466K152Q6778L2614r50l461j5753n1232N1980M1351j5259m7449
$$ -61065 -108531 -106379 -19601 13013 12063 8602 -7151 -58383 -6403 34948 19689 -27760
15962b7760K4374N2867o2554m0431K8489M9881j26032q943N0497L3993p4214n5669
$$ -27760 -3386 49481 -13073 -53504 -25015 24866 -101166 -110109 -59612 -25619 -99833 -155502
15950a55502L1435L4733K7692N8503M767l1773M8740M0584L34N6645l7295q3672
$$ -155502 -124067 -89334 -61642 -3139 1628 -30145 18595 59179 59513 116158 78863 -4809
15938d809K3690M1294O2214n2287l1395n2617p3215p837k3087J9527k0907R8281
$$ -4809 18881 60175 122389 70102 38707 -13910 -87125 -94962 -118049 -98522 -119429 -21148
15926b1148M6563l2684L162m050k2336Q647j8921k7988R8007J26434M2420j03186
$$ -21148 25415 -7269 -4107 -8157 -30493 -21846 -40767 -68755 29252 155686 198106 94920
15914I4920m1744k4951M5366J3543L1444j25374j19940L7788R9287K9160r8129
$$ 94920 53176 28225 73591 87134 118578 -6796 -126736 -88948 10339 39499 -58630
15903e8630o5876l9788R9843M1081k8495j9012M666J7565K417j1288K495O1023
$$ -58630 -124506 -164294 -64451 -23370 -51865 -70877 -66211 -48646 -46229 -57517 -55022 6001
15891F001J9393J2908J1055q228P065l0451O0537k5701J761J0967J015p261p4026
$$ 6001 25394 38302 49357 41129 48194 17743 78280 52579 54340 65307 66322 59061 -14965
15878a4965P3701k3010n038J124o2262o2900k2810J4995P7944l1062k544k4374
$$ -14965 58736 35726 30688 31812 -30450 -93350 -116160 -101165 -23221 -54283 -56827 -81201
15866h1201K7422j3578l232K1454j3277O699J08521R1363q4248l3880l2963m2582
$$ -81201 -53779 -67357 -70589 -49135 -62412 -55713 52808 144171 59923 26043 -6920 -49502
15854d9502O2887M7830J7088m670R1633M154j26262J0833O2996Q352j24826m7316
$$ -49502 13385 61215 78303 73633 165266 169420 43158 53991 116987 125339 513 -46803
15842d6803L2443k6449J0585m643M6388O8667l8535o2098K6063k834m7385m295
$$ -46803 -14360 -40809 -30224 -34867 11521 80188 41653 -20445 5618 2784 -44601 -48896
15830d8896k792L5887j9831o210m198K1703L817L8743P7239q8734J4329Q6372
$$ -48896 -51688 -15801 -35632 -41842 -46040 -24337 -20520 18223 95462 6728 21057 107429
15818A07429n7212L795K38M8179P849o9319o2355K6792P6217J2890K2913l9092
$$ 107429 50217 54012 54250 102429 110278 40959 -21396 5396 81613 94503 117416 78324
15806G8324k2406O149M6795o0017q4685q235k6619M83O9074o437k1095O9018O9365
$$ 78324 55918 62067 108862 48845 -35840 -44075 -70694 -70211 -1137 -7574 -28669 40349 109714
15793A09714j2342p1860M2237L8213J1226k7708q1541K5193P359m9829k5115L763
$$ 109714 97372 25512 67749 105962 117188 89480 7939 33132 40491 -9338 -34453 -30690
15781c0690n9973l2272l4722m4053L2029J48802J49867O671n4852j5771l2394
$$ -30690 -90663 -122935 -157657 -201710 -169681 -20879 128988 135659 80807 65036 32642
15770C2642k6063K1460j4138k9888M082M1750j3709j09373l1351N4064O6051J669
$$ 32642 6579 28039 13901 -15987 -11905 29845 16136 -93237 -124588 -70524 -4473 -2804
15758b804k92N6061P7282J01955n2467o1537l1703M7136j5182J3318q922m9723
$$ -2804 -3096 52965 130247 232202 179735 118198 86495 133631 118449 131767 122845 73122
15746G3122m3671K3229L5366P9835K0103o1831r047k9233m9316o9368M6123N2517
$$ 73122 29451 52680 88046 167881 187984 126153 117106 87873 38557 -30811 15312 67829
15734F7829j4894l3176R291L2747M2639j9369o0174O359K9992m757m4409p2844
$$ 67829 52935 19759 29050 61797 104436 85067 24893 31252 61244 56487 12078 -60766
15722f0766o1697M2864m0443k9338P6353J03013P8115n2276j11881l6374O9877
$$ -60766 -122463 -79599 -120042 -149380 -73027 29986 108101 55825 -56056 -92430 -22553
15711b2553L0007L572J4495L154m097j0408m0864j7699l5581p269P8311K5384
$$ -22553 7454 11026 25521 28675 24578 14170 -26694 -44393 -79974 -87243 -8932 16452
15699A6452p219P9683l8708n7999m2637q1263l0308Q9208l5304O8352J3513L2478
$$ 16452 9233 88916 50208 -7791 -50428 -131691 -161999 -72791 -108095 -39743 -26230 6248
15687F248q8177j4097K2328P0853M254K0677k2848n1339K2472O3100m8316k5006
$$ 6248 -81929 -96026 -73698 -2845 1409 22086 -762 -52101 -29629 33471 -14845 -39851
15675c9851m2387m8307L6200j7567j5435L0671o8813N9387P2304J01190r151j5974
$$ -39851 -82238 -130545 -94345 -111912 -127347 -96676 -165489 -106102 -33798 67392 58241 42267
15663D2267K5335n2522j1239o2887l1041k5999L453j6868O3708N4639L6382k3549
$$ 42267 67602 15080 3841 -59046 -90087 -116086 -112633 -129501 -65793 -11154 25228 1679
15651A679p4256Q9968j0181q8159R057J15855n0629M0414N4410l9848p7151m3545
$$ 1679 -72577 17391 7210 -80949 -71892 43963 -6666 33748 88158 48310 -28841 -72386
15639g2386P8035l6975p777n6050R095N1189K0843j7340q438O7270n910n2762
$$ -72386 5649 -31326 -39103 -95153 -86058 -34869 -14026 -31366 -39804 27466 21556 -31206
15627c1206O6031J11802k0275o2684m2672K4409k354m3628p2378P906P0510K6705
$$ -31206 34825 146627 126352 63668 20996 45405 43051 -577 -72955 -65049 5461 32166
15615C2166j3065j31690l9935R8774L1461j8005m4131M1290N3085L7053p8905
$$ 32166 19101 -112589 -152524 -53750 -22289 -40294 -84425 -43135 9950 47003 -31902
15604c1902j7813l6530n455R338j983j2801l2860J29139Q0202O4122n590q735
$$ -31902 -49715 -86245 -91700 -82362 -84345 -97146 -130006 -867 79335 143457 137867 129132
15592A29132o1697M0687N4794n8921j29926J2609M3773O8615O8757j9971o0393
$$ 129132 67435 108122 162916 103995 -25931 -13322 30451 99066 167823 147852 87459
15581H7459o865k5787l7112l4093r896j3993l0821p7943k3296K0781l433N812
$$ 87459 80594 54807 17695 -16398 -26294 -40287 -71108 -149051 -172347 -151566 -154999 -149187
15569a49187n0826l6664o7K6594J07732J30663L4598n1964l5706K772m0341k1568
$$ -149187 -200013 -236677 -236744 -210150 -102418 28245 62843 10879 -24827 -22055 -62396 -83964
15557h3964j6616j0790J25296L874o1605j3155J1746Q8524k6467j10179j8347
$$ -83964 -100580 -111370 13926 17800 -43805 -56960 -45214 43310 16843 -93336 -111683
15546a11683O9687J38410M5874n4818m6482J2527J8687R5224K5666j15017m5318
$$ -111683 -41996 96414 142288 87470 40988 53515 72202 167426 193092 78075 32757
15535C2757l792m4042q593J4550j1168N4540j1210o4888m2578p900l6474k6690
$$ 32757 28965 -15077 -23670 -9120 -20288 34252 23042 -41846 -84424 -92324 -128798 -155488
15523a55488M381J0225Q1002J14102R6980p3512o3927O9537Q192o5314p75m1131
$$ -155488 -151107 -140882 -59880 54222 151202 77690 13763 83300 91492 26178 25403 -15728
15511a5728M4039k347n1393j3351P794K0934m7152j4267J620L9100L9408Q9073
$$ -15728 28311 25964 -25429 -38780 -30986 -10052 -57204 -71471 -69851 -30751 8657 97730
15499I7730J5539j09592k3785N065M0711R151N4672j4782k4689p092o4208o1866
$$ 97730 113269 3677 -20108 -15043 25668 34819 89491 74709 50020 42928 -21280 -83146
15487h3146R1474L1217o541m2791o4243M3892J9528l7510m3871J4444o8535O2852
$$ -83146 8328 39545 33004 -9787 -74030 -30138 -10610 -48120 -91991 -77547 -146082 -83230
15475h3230M5783n386J1095j6424L3695J3730L3007m7259N8944l4986M398k4755
$$ -83230 -37447 -42833 -31738 -48162 -14467 -737 32270 -14989 43955 8969 13367 -11388
15463a1388M3548m4537q0987l7735J28142m8052m1637k1775O796O6245M1040p0503
$$ -11388 32160 -12377 -93364 -131099 -2957 -51009 -92646 -114421 -107625 -41380 -340 -70843
15451g0843o841J7399L9637l7725n6192Q4319K6285j9236l7937J4035P712K0318
$$ -70843 -77684 -60285 -20648 -58373 -114565 -30246 -3961 -23197 -61134 -47099 -39387 -19069
15439a9069O8064L9345K1775q2996N50J20479n724r0193j02706q0700M0424k1064
$$ -19069 48995 88340 110115 27119 27669 148148 142424 52231 -50475 -131175 -90751 -111815
15427a11815o9638L393L4633m1390q77L9481j1026M3444l1293l3388n648M4358
$$ -111815 -181453 -178060 -143427 -184817 -185694 -146213 -157239 -113795 -145088 -178476 -184124 -139766
15415a39766R3800J7523P1366M4261p2997j35213j23384N8383J66155Q0920L9915
$$ -139766 -45966 -28443 42923 87184 14187 -121026 -244410 -186027 -19872 61048 100963
15404A00963N3694j5253q2562K5656p119l0050L25O5735j7166p5458j0216M4548
$$ 100963 154657 139404 56842 82498 75379 45329 45654 111389 94223 18765 8549 53097
15392E3097K7675k3437O510j4816j9692n470M7713o5682J6531o515q6223K6832
$$ 53097 80772 57335 63845 49029 29337 23867 71580 5898 22429 15914 -70309 -43477
15380d3477J7062l0128j8272L112Q1973J3683j4421k2790j3133Q691K0589n6828
$$ -43477 -26415 -56543 -74815 -71703 10270 23953 9532 -13258 -26391 -17700 2889 -53939
15368e3939k2956j3455j1587J1727R0142M1562o5532J130L4704J1707R5353K3660
$$ -53939 -76895 -90350 -101937 -90210 -68 41494 -24038 -22908 11796 23503 118856 142516
15356A42516p1263p8571j3223o1455n6263N5524L9139L1612M2757M208K2389j9389
$$ 142516 71253 -7318 -20541 -81996 -138259 -82735 -43596 -11984 30773 34981 57370 37981
15344C7981j19102J1802K610O320l8708N883K9580J682J0048N0026O8544m628
$$ 37981 -81121 -69319 -66709 -60389 -99097 -93214 -63634 -61952 -51904 -1878 66666 62038
15332F2038K3106p6171r9899j7170O1181N6730o1271M6744Q2006N2693o1032k2497
$$ 62038 85144 8973 -90926 -108096 -46915 9815 -51456 -4712 77294 129987 68955 46458
15320D6458J02643l6755l095L0241J2225p2230o3834q7607N3498N4952k5631k0446
$$ 46458 149101 112346 109251 139492 151717 79487 15653 -71954 -18456 36496 10865 -9581
15308i581P2304r1040q6491J05444K362Q2005J0915j2220M5136p908o4972r5870
$$ -9581 62723 -28317 -114808 -9364 -7002 75003 85918 73698 118834 110926 45954 -49916
15296d9916R892P4084N2522o8856M443K3103m7112r3276M086Q181l348J6378m8824
$$ -49916 -40024 34060 86582 17726 22169 45272 -1840 -95116 -91030 -82849 -86197 -69819 -118643
15283a18643K8039J4409l6110k3083K553J8813O3104J9306P7505L6463J6994q3222
$$ -118643 -90604 -76195 -112305 -135388 -132835 -114022 -50918 -31612 45893 82356 99350 16128
15271A6128q6186M417L2794K3737K3942M7628J2860j4606r5355o2886N1063k7468
$$ 16128 -70058 -65641 -32847 -9110 14832 62460 75320 60714 -34641 -97527 -46464 -73932
15259g3932K7279O3507M1090O385M6940j15718K184K6637k4439n5264P9561Q3960
$$ -73932 -46653 16854 57944 64329 111269 -4449 -2265 24372 -67 -55331 24230 108190
15247A08190p1633o121j3300j2709M8141r0961L1831K2997k5929J4120J3932o121
$$ 108190 36557 30436 17136 4427 52568 -38393 -6562 16435 -9494 4626 18558 12437
15235A2437P220K2184j4315l4920l2406p3678L9639M5508m3055o389J13631M7941
$$ 12437 19657 41841 27526 -7394 -39800 -113478 -73839 -28331 -71386 -77775 35856 83797
15223H3797K7215j8820k7725J1483j05600n8540L9073L4973j242M4163N0902L7889
$$ 83797 111012 92192 64467 75950 -29650 -88190 -49117 -14144 -15386 28777 79679 117568
15211A17568k930m5585j8023o4684K0254n3116l4726J6835J35721N2564q2813
$$ 117568 114638 69053 51030 -13654 6600 -46516 -81242 -64407 71314 123878 41065
15200D1065q1239n619k541k9535m401Q7119J19652O8852p2664n7000m9603j19208
$$ 41065 -40174 -45793 -48334 -77869 -82270 4849 124501 193353 120689 63689 14086 -105122
15188a05122Q788L1273j8740M7627J24445L086k7128n3573m6275k1810J04641
$$ -105122 -96334 -65061 -83801 -36174 88271 91357 64229 10656 -35619 -57429 47212
15177D7212N3325k2660k1467n5172m3366K6069n981K3248O7203M6908M6145K9819
$$ 47212 100537 77877 56410 1238 -42128 -16059 -22040 1208 68411 115319 161464 191283
15165A91283r0327P49l6291l8016k9192j0586m7044M7092P8369k6171p3335n7742
$$ 191283 100956 101705 65414 27398 -1794 -12380 -59424 -12332 66037 39866 -33469 -91211
15153i1211l6101M5815N3775N2891r7480q8777P9901L5933O1694N4554o1876j6329
$$ -91211 -127312 -81497 -27722 25169 -72311 -161088 -81187 -45254 16440 70994 9118 -7211
15141g211O794K0971l4846m2035N1872M7530p1086m4205N6433l101J372N7208
$$ -7211 -417 20554 -14292 -56327 -4455 43075 -28011 -72216 -15783 -18884 -17512 39696
15129C9696R2985p0248m8766k5943K3046L7163j8126L9480j12055p7636K513J14060
$$ 39696 132681 62433 13667 -12276 10770 47933 29807 69287 -42768 -120404 -117891 -3831
15117c831L0480k9501M2912O1340m3613p5403p6593j7810N0468N8034N0895o7166
$$ -3831 26649 -2852 40060 101400 57787 -17616 -94209 -112019 -61551 -3517 47378 -19788
15105a9788r151m2424J5940J3288l7137J01394k9854n8051P368k03j1715k2649
$$ -19788 -28939 -71363 -55423 -42135 -79272 22122 -7732 -65783 -58415 -58618 -70333 -92982
15093i2982P002l6673N6077j7660J805N5513M6457l9292P201P596N4288R894J6
$$ -92982 -85980 -122653 -66576 -84236 -82431 -26918 19539 -19753 -12552 -4956 49332 59226 59242
15080E9242n001j861N7328k7330K2548j3150O8641m1417p2356K0810M0551N0115
$$ 59242 54241 52380 109708 82378 104926 91776 160417 119000 46644 67454 108005 158120
15068A58120o5665j21647m7405O6112j1040P2458L9580M462j1845J6974k5669
$$ 158120 92455 -29192 -76597 -10485 -21525 50933 90513 94975 83130 100104 74435
15057G4435r6118n6607m0216O7387P2207k5648m7358L3239Q1424N5592M111p7436
$$ 74435 -21683 -78290 -118506 -51119 21088 -4560 -51918 -18679 62745 118337 122448 45012
15045D5012n6402J8232N3392q817o3217O1671j099M9734O5698k0155P4931q73
$$ 45012 -11390 6842 60234 51417 -11800 49871 48772 98506 164204 144049 218980 218107
15033B18107q5872R795o0029m5891q5721K2864l6910r775M5873k3655n3993Q5965
$$ 218107 132235 142030 82001 36110 -49611 -26747 -63657 -73432 -27559 -51214 -105207 -19242
15021a9242J2320l0455L0602J03452j821n8170j08433O3809J26423N2356l7078
$$ -19242 -6922 -37377 -6775 96677 94856 36686 -71747 -7938 118485 170841 133763
15010A33763n9389p6203l886L2867n842R293k1935J8655P1749O7532o9488o6106
$$ 133763 74374 -1829 -5715 27152 21310 30603 8668 27323 99072 166604 97116 31010
14998C1010q3257m0911Q943M3387q8582j200J00234L6216J3789n6518o0748n852
$$ 31010 -52247 -93158 -84215 -40828 -129410 -130610 -30376 5840 19629 -36889 -97637 -103489
14986a03489J1653K5861Q7891o6602o5224k5000l5160O4721J5052K9535N9073
$$ -103489 -91836 -65975 21916 -44686 -109910 -134910 -170070 -105349 -90297 -60762 -1689
14975a689p648k9265J7494O7166p972o9218k3622J13396L5684pm2430L3136O1913
$$ -1689 -9337 -38602 -21108 46058 38086 -31132 -54754 58642 94326 94319 51889 85025 146938
14962A46938L7367n8300r6133j2107n7201M8950O7534n8580O912J1547j6671J2452
$$ 146938 184305 126005 29872 17765 -39436 9514 77048 18468 25380 36927 20256 32708
14950C2708o4631l1726n8555O5148M7114q97N8909O2026n5047j00064m8429J8809
$$ 32708 -31923 -63649 -122204 -57056 -9942 -10839 48070 110096 55049 -45015 -93444 -74635
14938g4635J7606m4557k784m7224O438Q93J04551N7335m1888k3253m0628o7602
$$ -74635 -57029 -101586 -104370 -151594 -145156 -144263 -39712 17623 -24265 -47518 -88146 -155748
14926a55748L5396L1318M9740N3651j8158o8932M5848N9249n5211N767k8752P9507
$$ -155748 -120352 -89034 -39294 14357 -3801 -72733 -26885 32364 -22847 -17080 -45832 33675
14914C3675K5643M3637K6622K5511n1283m0668M9995M2653n0146J68n2389l4488
$$ 33675 59318 102955 129577 155088 103805 63137 113132 155785 105639 105807 53418 18930
14902A8930p4108r2242P467j0043K9721M9957O611Q8194N2397j2252q6592k8581
$$ 18930 -55178 -147420 -139953 -149996 -120275 -70318 -63707 24487 76884 64632 -21960 -50541
14890e0541J3965J14341P2188k8150l1838l1759j30709q986P6874J27605N8177
$$ -50541 -36576 77765 149953 121803 89965 58206 -72503 -81489 -4615 122990 181167
14879A81167k8924j35964j25062m2623M8726M5607o4344j0454M3638Q8860m1798
$$ 181167 152243 16279 -108783 -151406 -102680 -57073 -121417 -131871 -88233 627 -41171
14868d1171k4266o112K2877n5998L0827O997j2480J7903o1878k6823K1470Q520
$$ -41171 -65437 -71549 -48672 -104670 -73843 -66846 -79326 -61423 -123301 -150124 -128654 -120134
14856a20134K4238N4603l4210j8250O5568N9384L1108L3470j7379j0595l338K0581
$$ -120134 -95896 -41293 -75503 -93753 -28185 31199 62307 95777 78398 67803 64465 85046
14844H5046k9657L7619n3762l4212k0035O3387J2950m5279p8253l5272P4951M4767
$$ 85046 55389 93008 39246 5034 -15001 48386 61336 16057 -62196 -97468 -22517 22250
14832B2250r3271R2204N8735q243Q9140l9468o5461K8313q0966M3536N4189j0676
$$ 22250 -71021 21183 79918 71675 160815 121347 55886 84199 3233 46769 100958 90282
14820I0282n7108R037m0294j243P9866m9934j25736j0521J12009M1783j6266q236
$$ 90282 33174 42211 1917 674 80540 30606 -95130 -105651 6358 48141 31875 23639
14808B3639N0923l5947m6107k1175p3248n2143O99N2679J1839p0554n2292J96612
$$ 23639 74562 38615 -7492 -28667 -101915 -154058 -153359 -100680 -88841 -159395 -211687 -15075
14796a5075J29818n542m8065k9164l0735L4866M9863n1228q2833q7254m50J8424
$$ -15075 114743 109201 61136 31972 1237 36103 85966 34738 -48095 -135349 -135799 -117375
14784a17375L0424o5980j5862n6869j0879O6331R3543P7882K0432L2166J529j05194
$$ -117375 -86951 -152931 -168793 -225662 -236541 -170210 -76667 1215 21647 53813 55342 -49852
14772d9852k9029K5453K5089l6544j22539m4718N6521O5523L4003P4004M9209
$$ -49852 -78881 -53428 -28339 -64883 -187422 -232140 -175619 -110096 -76093 -2089 47120
14761D7120m6180m9211M2204P3431j4234j926M76l284o0047K1897j9687K82M9188
$$ 47120 940 -48271 -6067 67364 53130 51204 51680 48396 -11651 10246 -9441 -9159 40029
14748D0029p6631l0657k5970o0553J52168J2997m9093m3120O5379N0410n1563
$$ 40029 -36602 -67259 -93229 -153782 -1614 11383 -37710 -80830 -15451 34959 -16604
14737a6604k5363Q3531k213m0182P8951l0644p9302q461R494Q5499J2061j5564
$$ -16604 -41967 41564 39351 -831 78120 47476 -31826 -40287 -30793 54706 66767 51203
14725E1203m8173J1622N761m5901p300Q715k5727k6862K0011L8184P8453o3983
$$ 51203 3030 14652 20413 -25488 -32788 -24073 -49800 -76662 -56651 -18467 59986 -3997
14713c997n0577L2802Q0829N9444o0610j09034J8077m9534n1512N8165R0551n876
$$ -3997 -54574 -21772 59057 118501 57891 -51143 -33066 -82600 -134112 -75947 14604 8728
14701H728r348k2824N618j5011j9728O9109N6935r2891q5641K0295O7438N7426
$$ 8728 -620 -23444 -17826 -32837 -52565 16544 73479 -19412 -105053 -84758 -17320 40106
14689D0106k5181M6599J0731L6034k9497j30711n7708L4690M3466L2962L075o1821
$$ 40106 14925 61524 72255 108289 78792 -51919 -109627 -74937 -31471 1491 4566 -57255
14677e7255K5094N6546K5026K0691l4853m7898K5940o20k0963J9356N2417O5326
$$ -57255 -32161 24385 49411 70102 35249 -12649 13291 12671 -8292 11064 63481 128807
14665A28807k412j03021j01913L4698O2326K1582L9431j05673p5914P2538P1606
$$ 128807 126395 23374 -78539 -43841 18485 40067 79498 -26175 -102089 -29551 42055
14654D2055M940p0871K3052Q3138q164j32060p5618J4412M1449L7661k3425j4650
$$ 42055 46995 -23876 -824 82314 74150 -57910 -133528 -119116 -77667 -40006 -63431 -78081
14642g8081Q2934M2766q155O119l8668L7028J8033o0115m2274j8743M2026L8980
$$ -78081 4853 47619 39464 45583 6915 43943 61976 1861 -40413 -59156 -17130 21850
14630B1850m3826K7480M1395n68m0204o1294L6478l8897j09213k5342J07712J12516
$$ 21850 -21976 5504 46899 46331 6127 -55167 -18689 -57586 -166799 -192141 -84429 28087
14618B8087M8004J5341M9662l2684l1065r248l2644o4884J957r133J7916N2722
$$ 28087 76091 91432 141094 108410 77345 68097 35453 -29431 -27474 -36607 -18691 34031
14606C4031Q0760k2624m7460l4850M9204K3881m1766r8546m3081Q5389K2389N2439
$$ 34031 114791 92167 44707 9857 59061 82942 41176 -57370 -100451 -15062 7327 59766
14594E9766N3006N3647q0740j6291L8836J2368m4822Q105k0106m3448j0740n3416
$$ 59766 112772 166419 85679 69388 108224 120592 75770 83875 63769 20321 9581 -43835
14582d3835p381K2400m2890M8409O2519n9995l7580N7951J4252m6801N9292J3745
$$ -43835 -51216 -28816 -71706 -23297 39222 -20773 -58353 -402 13850 -32951 26341 40086
14570D0086m7928L6368r43L2462Q0590p964j10282r080J4001r9470p0473J7296
$$ 40086 -7842 28526 27583 60045 140635 132671 22389 13309 27310 -72160 -142633 -125337
14558a25337N2319J10884J0756O481M0390k6701m1899k6874P3952M7528j1276
$$ -125337 -73018 37866 48622 55103 95493 68792 26893 19 73971 121499 110223
14547A10223j8267k8919p0687k001O518k3817m190K2712P3434M4117L4441o7850
$$ 110223 91956 63037 -7650 -9651 -3133 -26950 -31140 -8428 65006 109123 143564 75714
14535G5714p9215l166J3674M5384R919k8610o1593M3624k0591r646Q228K6525
$$ 75714 -3501 -6667 7007 52391 62310 33700 -27893 15731 -4860 -14506 -6278 20247
14523B0247K3497N999l6157J8978J3634k7382n26L872o1389k1203M0213m1928
$$ 20247 43744 49743 13586 32564 46198 18816 18290 22162 -39227 -60430 -20217 -62145
14511f2145n9205l5564K4235j1935k9607R9513J34044M780n6984p8159K2885L485
$$ -62145 -121350 -156914 -132679 -144614 -174221 -74708 59336 64116 7132 -71027 -48142 -44657
14499d4657l5786O0521N7221K9762k8388q0353j5853N493N2322P490L167l3725
$$ -44657 -80443 -19922 37299 67061 38673 -41680 -57533 -52040 282 7772 10939 -22786
14487b2786m227m111M0078J41626L8175n6596p3870K1586l8597l4514l576l1509
$$ -22786 -27013 -31124 8954 150580 188755 132159 58289 79875 41278 6764 3188 -28321
14475b8321n9152k139J4439j6384l8570L7529O8822j2274o2225L059K161J5379
$$ -28321 -87473 -89612 -75173 -91557 -130127 -92598 -23776 -36050 -98275 -95216 -93055 -77676
14463g7676R7126R8549j5645j57266k0163J66694K2683L2865p917K7760o9516
$$ -77676 19450 117999 102354 -54912 -75075 91619 114302 147167 139250 167010 97494
14452I7494m5920q4178O1877n84n9930M6728M1331M2669J2076n7988n0302n5088
$$ 97494 51574 -32604 29273 28689 -31241 15487 56818 99487 111563 53575 3273 -51815
14440e1815j27076l6819O3445N9884l405J0153o6935l0348P4789J131J6089K6242
$$ -51815 -178891 -215710 -152265 -92381 -95786 -85633 -152568 -182916 -108127 -106996 -90907 -64665
14428f4665J9924M0481P6599Q298K3334j189J3999r837p3357o2432k8911k3973
$$ -64665 -44741 -4260 72339 80637 103971 102782 116781 106944 33587 -28845 -57756 -81729
14416h1729O650n4503m9188P5339K7135J8194k246L0272L8018o2566n2020J8900
$$ -81729 -75079 -129582 -178770 -103431 -76296 -58102 -60348 -30076 7942 -54624 -106644 -87744
14404h7744M083K6410M0354J2262k4804k0297L5351M3204R024l3695o428m040
$$ -87744 -83661 -57251 -16897 -4635 -29439 -49736 -14385 28819 37843 4148 -2280 -6320
14392f320M446O518R2414J26787j2662p6321j78408k8205P5169Q6199l5656r7379
$$ -6320 -1874 4644 97058 223845 211183 134862 -43546 -71751 3418 89617 53961 -43418
14380d3418O720L9941O2614k3132p6351K7395N1673n344p7827M9235K7584o3941
$$ -43418 -36698 3243 65857 42725 -33626 -6231 45442 40098 -37729 11506 39090 -24851
14368b4851l1399l3354k7636M1657L9574j2254n7829J0704J28777k1120j0544
$$ -24851 -56250 -89604 -117240 -75583 -36009 -48263 -106092 -95388 33389 12269 1725
14357A725p946O2150j6128l3260J3902m607j5835m0323p648n864k096k765N1254
$$ 1725 -6221 55929 39801 6541 20443 15836 1 -40322 -47970 -53834 -55930 -58695 -7441
14344g441j3709L0812J16181l9279p2396R64R752K582J06587P3695q5616j7657
$$ -7441 -21150 9662 125843 86564 14168 15132 24884 27466 134053 207748 122132 104475
14332A04475m2075p474K9110L3795l4043o3238k8463m2948M7480m0596m4574k4577
$$ 104475 62400 54926 84036 117831 83788 20550 -7913 -50861 -3381 -43977 -88551 -113128
14320a13128l5477J09707O6147K1655k6362j5595M8700j9325j51872l0330l1299
$$ -113128 -148605 -38898 27249 48904 22542 6947 55647 36322 -115550 -145880 -177179
14309a77179M7553J8359n682k2858k1422J01207K5796k3682l3682m3674M1351
$$ -177179 -129626 -111267 -116949 -139807 -161229 -60022 -34226 -57908 -91590 -135264 -93913
14298i3913L9945M2427m1349p0709P7994O5978K3521o1055n1281M1669P966M8407
$$ -93913 -53968 -11541 -52890 -123599 -45605 20373 43894 -17161 -68442 -26773 -18807 29600
14286B9600q865l4941J7885P4931N5275r6498l5657J6972M7986q5547n0843N5498
$$ 29600 20735 -14206 3679 78610 133885 37387 1730 18702 66688 -18859 -69702 -14204
14274a4204l8774l9354l6798m693O7089O1435o811l2353k86j1460j7822Q2769
$$ -14204 -52978 -92332 -129130 -133823 -66734 -5299 -12110 -44463 -44749 -56209 -74031 8738
14262H738m959m7267O864P0403O816j13485l2027j1844N8677R898q341m5388L9303
$$ 8738 3779 -43488 -36624 33779 40595 -72890 -104917 -116761 -58084 -48186 -56527 -101915 -62612
14249f2612J5986p5837p8607J32072N1022N2874p3901j30737l6385l946J10656
$$ -62612 -46626 -122463 -201070 -68998 -17976 34898 -39003 -169740 -206125 -210071 -99415
14238i9415J5963m885q039l3077O3223j8915K0008P6385J0095j1273n140P764
$$ -99415 -83452 -88337 -96376 -129453 -66230 -85145 -65137 11248 21343 10070 4930 12694
14226A2694k0199L3976N7226J1673n3011K2837l0619N6783L8123o8265J2432k664
$$ 12694 -7505 26471 83697 95370 42359 65196 34577 91360 129483 61218 73650 70986
14214G0986j15274q9658l2048P2474P0382K3378n334o515K4410l9543K5903N4963
$$ 70986 -44288 -133946 -165994 -93520 -23138 240 -5094 -11609 12801 -26742 -839 54124
14202E4124J0863q856k3128j31407j25457P9049J98433N3633j5076O7365o80m8648
$$ 54124 64987 56131 33003 -98404 -223861 -144812 53621 107254 92178 159543 158863 110215
14190A10215N190p7993o1888j21287m7500K2466N3706L836J03409R9993q0440
$$ 110215 115405 37412 -24476 -145763 -193263 -170797 -117091 -113255 -9846 90147 9707
14179I707p849m1240q6479J9910L7073O694O2442L9713n9317k6775J10973L4370
$$ 9707 1858 -39382 -125861 -105951 -68878 -62184 258 39971 -19346 -46121 64852 99222
14167I9222j05806r7369P0607J25065K2994q6594m0329m7195Q9088n5161q1813
$$ 99222 -6584 -103953 -33346 91719 114713 28119 -12210 -59405 29683 -25478 -107291
14156a07291N5894N844j02226L8086O5011l3440j42431l0835J8627L9815L3932
$$ -107291 -51397 -45553 -147779 -109693 -44682 -78122 -220553 -251388 -232761 -192946 -159014
14145a59014N9813K9504L0433j3938l8756Q217K3273J6706R919k6706m0292J742
$$ -159014 -99201 -69697 -39264 -53202 -91958 -83741 -60468 -43762 -33843 -60549 -100841 -99099
14133i9099O0464K2755m6819k194Q6920O01l2647m2369K0838J0508N6047j9012
$$ -99099 -38635 -15880 -62699 -64893 22027 22628 -10019 -52388 -31550 -21042 35005 15993
14121A5993p2352n5100M8999l5152R940O5736j0204o62Q3854q1861p0205J9919
$$ 15993 -56359 -111459 -62460 -97612 -87672 -21936 -32140 -32802 51052 -30809 -101014 -81095
14109h1095n62l522l3221l8375j0658Q9534Q7042l344J0018P9537q950K8483m1556
$$ -81095 -81657 -85179 -118400 -156775 -167433 -77899 9143 5799 15817 95354 86404 114887 73331
14096G3331j10236n0247J6467L4393M2399k3162K2461k9587k0571l1022j8304
$$ 73331 -36905 -87152 -70685 -36292 6107 -17055 5406 -24181 -44752 -75774 -94078
14085i4078P5278J49590k042j18662o6299N64p4548M1605J51171o663n1785l3506
$$ -94078 -18800 130790 128748 10086 -56213 -55649 -130197 -88592 62579 55916 4131 -29375
14073b9375r907M5251l812J5989O9428k0038l9383O2316J1162l4151o0829l990
$$ -29375 -39282 5969 2157 18146 87574 67536 28153 90469 101631 67480 6651 2661
14061B661J00419o498m685l0892r8263j30671J5524N1737J9787l8511l3915p118
$$ 2661 103080 96582 91897 61005 -37258 -167929 -152405 -100668 -80881 -119392 -153307 -160425
14049a60425R4489l910K2742J8622j6780j1997k7655L1733J6575L9769j1529n66
$$ -160425 -65936 -69846 -47104 -28482 -45262 -57259 -84914 -53181 -36606 3163 -8366 -8932
14037h932l6688j6986N173k3018M804q1016N2884O7815J3674L4469J8431l2440
$$ -8932 -45620 -62606 -57433 -80451 -75647 -156663 -103779 -35964 -22290 12179 30610 -1830
14025a830L7822m5201J4526j6909M3n8708N1142p877M9888J8410N9740m6900q5325
$$ -1830 35992 -9209 5317 -11592 -11549 -70257 -19115 -26992 22896 41306 101046 54146 -31179
14012c1179m2210P2340o946L4913n495m6064J8230l8692J2780N4776l3495l1523
$$ -31179 -73389 -1049 -7995 26918 21423 -24641 -6411 -45103 -32323 22453 -11042 -42565
14000d2565M1228j0874Q5779k8659l3503l5166m9573l29n2677O772J04847N2992
$$ -42565 -1337 -12211 73568 44909 11406 -23760 -73333 -73662 -126339 -119567 -14720 38272
13988C8272M9044q2870j13699k1078p461k7550N8836N8148M500k769m1820L2478
$$ 38272 87316 4446 -109253 -130331 -137792 -165342 -106506 -48358 -43858 -46627 -88447 -55969
13976e5969M7693J5827L517k1411r992J3432K0343n8355p7014N9607K0004k9772
$$ -55969 -8276 7551 11068 -10343 -20335 -6903 13440 -44915 -121929 -62322 -42318 -72090
13964g2090N4427P8782l1546p031L8470J5621J5289j4693K2672m0681m5892L4628
$$ -72090 -17663 61119 29573 22542 61012 76633 91922 77229 99901 59220 13328 47956
13952D7956N3273Q4237k0884q8778k1974K6422k5217P786M5190O9119Q627K677
$$ 47956 101229 185466 164582 75804 53830 80252 55035 62821 108011 177130 185757 188434
13940A88434j9470n0438r8683k4127m8185k9301R195K9201O3935p188n4895L6049
$$ 188434 168964 118526 19843 -4284 -52469 -81770 -72575 -43374 20561 13373 -41522 -5473
13928e473J07916K2704J3869j7460q1706q5379L9207l4168M0446p241l2214p0454
$$ -5473 102443 125147 139016 121556 39850 -45529 -6322 -40490 -44 -7285 -39499 -109953
13916a09953k0794J1151M5807R1400J7772L4815j1542j9751m3999K4851M0087
$$ -109953 -130747 -119596 -73789 17611 35383 70198 58656 38905 -5094 19757 59844
13905E9844Q816j9981l1158O1210P3266l7071j4699K1897Q423n6695l5062p6101
$$ 59844 68660 48679 17521 78731 151997 114926 100227 122124 130547 73852 38790 -37311
13893c7311O745P5742J00274p5898j06419N383k0208k2798L0146J5070p693j0121
$$ -37311 -30566 45176 145450 69552 -36867 -31484 -51692 -74490 -44344 -29274 -36967 -47088
13881d7088Q3110L8475k0621l1794O0091P6182J1594p936m9701q4673l6098m0996
$$ -47088 36022 74497 53876 22082 82173 158355 169949 162013 112312 27639 -8459 -49455
13869d9455o7661J7716j5965R076K9500Q8925N5119L0084o290m7885r738j02349
$$ -49455 -117116 -99400 -115365 -106289 -76789 12136 67255 97339 91049 43164 33426 -68923
13857f8923m9641P7332J1633m2329l64K0485K9861M0183l0022r005o9066K4889
$$ -68923 -118564 -41232 -29599 -71928 -72292 -51807 -21946 18237 -11785 -20790 -89856 -64967
13845f4967M406K3176j3350k4050N2908K719r3555J1384P9600K0246o2931l1993
$$ -64967 -60561 -37385 -50735 -74785 -21877 -19158 -112713 -101329 -21729 -1483 -64414 -96407
13833i6407N0037Q3476L9211k7076L5090l7380l8764N2991J6770J8158J055P070
$$ -96407 -46370 37106 76317 49241 84331 46951 8187 61178 77948 96106 97161 104231
13821A04231r8152r847J4864j9435M2143L8231J1140m3900q1200m7013O4137k6950
$$ 104231 6079 -3768 11096 -8339 33804 72035 83175 39275 -41925 -88938 -24801 -51751
13809e1751L0196O854K8438P1965M7305k1115m3826l4405K3021k1273m6839q2610
$$ -51751 -21555 -14701 13737 85702 133007 111892 68066 33661 56682 35409 -11430 -94040
13797i4040N0646N8218M3404m8002n6778L7373O8776l6596J8532J2584l2616j3667
$$ -94040 -43394 14824 58228 10226 -46552 -9179 59597 23001 41533 54117 21501 7834
13785G834N5578J30879l7024l4544l0398R727p090K2532j6625M4523L0692k0275
$$ 7834 63412 194291 157267 122723 92325 102052 94962 117494 100869 145392 176084 155809
13773A55809r535j0599n6086m5140n2552p903L197p641O0288K1005L638J2604
$$ 155809 146274 135675 79589 34449 -18103 -26006 -22809 -30450 29838 50843 54481 67085
13761F7085N8286j00777j2460O7512N1599l2756L0638K0649J875m8663r6217n2825
$$ 67085 125371 24594 12134 79646 131245 98489 129127 149776 151651 102988 6771 -46054
13749d6054L6810k0289J209M6400O4209n3799k0638p647j10037L0231K3143o367
$$ -46054 -9244 -29533 -28324 18076 82285 28486 7848 201 -109836 -79605 -56462 -62829
13737f2829P0598N6575Q4368k5591o3410K8271P4901o3889m1152j8759J199l02
$$ -62829 7769 64344 148712 123121 59711 87982 162883 98994 57842 39083 40282 39980
13725C9980N3939o6118L6300N1612m2819r3172o272l3360o5061O5363N9992k3402
$$ 39980 93919 27801 64101 115713 72894 -20278 -26550 -59910 -124971 -59608 384 -23018
13713b3018m149l3396n7809j5426J0281q329k8208k8496J00888J05320r163j2911
$$ -23018 -27167 -60563 -118372 -133798 -123517 -131846 -160054 -188550 -87662 17658 8495 -4416
13701d416N36R423j1556J3202L075k3094q5810M8938P1930l4578n4753Q2665L6436
$$ -4416 -3880 5543 -6013 7189 10264 -12830 -98640 -49702 22228 -12350 -67103 15562 51998
13688E1998k4234n5478N00K757n7827j7335N087Q952k2900j3892J6691J0490K3464
$$ 51998 27764 -27714 -27214 -24457 -82284 -99619 -94532 -85580 -108480 -122372 -105681 -95191 -71727
13675g1727n126k1776Q7916R763k4398M1899L5926L3348n6500n6156k3090Q6209
$$ -71727 -76853 -98629 -10713 -950 -25348 16551 52477 85825 29325 -26831 -49921 36288
13663C6288M1724q8317j9577N874k3399k2640J4551o5318K3965J09726R9930K4823
$$ 36288 78012 -10305 -29882 -24008 -47407 -70047 -55496 -120814 -96849 12877 112807 137630
13651A37630r269q1643k5102O049m8079J8538L8338n9246k7842P6229l3667j9002
$$ 137630 128361 46718 21616 27665 -20414 -1876 36462 -22784 -50626 25603 -8064 -27066
13639b7066Q6447Q2433p612r0756q0050K010M4843j8588j2591L751M3661l6624
$$ -27066 59381 141814 134202 43446 -36604 -34594 10249 -8339 -20930 -17179 26482 -10142
13627a0142n6798K3232L3940Q657J1L0263j3884J7488j6691M149J0705j9432K4972
$$ -10142 -66940 -43708 -9768 -1111 -1100 29163 15279 32767 16076 20225 30930 11498 36470
13614C6470m6450j656n1429l9595q771Q2959P2914K8050J9585J6209K2402q8739
$$ 36470 -9980 -11636 -63065 -102660 -111431 -28472 44442 72492 92077 108286 130688 41949
13602D1949o8342J1745N3259j2726Q6280M621r6439p9948J4303O4939N4581o8665
$$ 41949 -26393 -14648 38611 25885 112165 116786 20347 -59601 -45298 19641 74222 5557
13590E557p5031o268j7660R173N2770M2225j8246l8530N1910K5182L0805J3914
$$ 5557 -69474 -75742 -93402 -84229 -31459 10766 -7480 -46010 5900 31082 61887 75801
13578G5801M2762R9277j6157o6770q0637m5798J3632M8785m5269l8264M09J8314
$$ 75801 118563 217840 201683 134913 54276 8478 22110 70895 25626 -12638 -12229 6085
13566F085q8668j7528J46422K2555m9346K6639l6349p8491o4724j3809K4697O961
$$ 6085 -82583 -100111 46311 68866 19520 46159 9810 -68681 -133405 -147214 -122517 -115556
13554a15556L3059R8687L1047L0083k8260m6449k1129m8055P823P1496J5371k7040
$$ -115556 -82497 16190 47237 77320 49060 2611 -18518 -66573 -58750 12746 28117 1077
13542A077m0427N9736j3551q8022Q168l4192L0013N195L4343M2002L7335O6480
$$ 1077 -39350 20386 6835 -81187 -73019 -107211 -77198 -72003 -37660 4342 41677 108157
13530A08157L1513M2519J7353n9370o994p1458r752q550l0587n383l585M9985
$$ 108157 139670 182189 199542 140172 133178 61720 51968 43418 12831 7448 3863 53848
13518E3848l4029N1257L212j05344n5865K4212k2465P8813N4176p3766j9636J6344
$$ 53848 19819 71076 74288 -31056 -86921 -62709 -85174 -6361 47815 -25951 -45587 -29243
13506b9243N402m3085K7700k1341M9780q2415L3694L2283J5492K2857k6595j4262
$$ -29243 -23841 -66926 -39226 -60567 -10787 -93202 -59508 -27225 -11733 11124 -15471 -29733
13494b9733O1921N1312O8027j692o1811J4863j3700o8814j16972j5519O1261j4247
$$ -29733 32188 83500 151527 149835 88024 102887 89187 20373 -96599 -112118 -50857 -65104
13482f5104k1271n059M8186J1616K382R0347O472p1292n0500L5789O2487J3394
$$ -65104 -86375 -91434 -43248 -31632 -29250 61097 67569 -3723 -54223 -18434 44053 57447
13470E7447r2658K4140P5939p5026q2311m7883j420O0493M2064k7369p643Q2274
$$ 57447 -35211 -11071 64868 -10158 -92469 -140352 -141772 -81279 -39215 -66584 -74227 8047
13458H047K5832L8055k3632m0260m34k3443q4532L602J3905O6050L8630q4340
$$ 8047 33879 71934 48302 8042 7608 -15835 -100367 -96765 -82860 -16810 21820 -62520
13446f2520N515P8106n977R673K9690l622O3179K4700J1532j41569j36237N2812
$$ -62520 -57005 21101 15124 24797 54487 50865 114044 138744 150276 8707 -127530 -74718
13434g4718J8294n7127J05262m3341L066M4751O7073P420o8004K1361m6879M0788
$$ -74718 -56424 -113551 -8289 -51630 -48564 -3813 63260 70680 2676 24037 -22842 17946
13422A7946O0664Q705l2724k3345k3455N569N1734L1710N9051j4146j04023k7692
$$ 17946 78610 87315 54591 31246 7791 13360 65094 96804 155855 141709 37686 9994
13410I994J0296K3740O9812M0795l1011L3634O9945N2510M9816K2368J3078l5726
$$ 9994 20290 44030 113842 154637 123626 157260 227205 279715 329531 351899 364977 329251
13398C29251j7837N8910M6614K3735j4463j1664M3198J14398L7722j5039j46558
$$ 329251 311414 370324 416938 440673 426210 414546 457744 572142 609864 594825 448267
13387D48267j21115k2997k0054j6063m0392m4702J01890l2359k9591p548K0187
$$ 448267 327152 304155 284101 268038 227646 182944 284834 252475 222884 215336 235523
13376B35523M2914n6428l8703m7642J7896l4078l9802M2935O1305R645J2082n4265
$$ 235523 278437 222009 183306 135664 153560 119482 79680 122615 183920 193565 205647 151382
13364A51382q983N8329R824j02730m1437N7726O0252K549j00206o9925l7567J3986
$$ 151382 142399 200728 210552 107822 66385 124111 184363 186912 86706 16781 -20786 -6800
13352f800j924Q0510K7883j9317l8792L4072p6474l4614J0533M302O790n7211
$$ -6800 -8724 71786 99669 80352 41560 75632 -842 -35456 -24923 -20621 -13831 -71042
13340g1042K2153J7431l390j7731K1048N5709k768o3739P8136J1780n9995l136
$$ -71042 -48889 -31458 -34848 -52579 -31531 24178 21410 -42329 35807 47587 -12408 -15544
13328a5544L4763l378l3391K0056J4355j04280K4224P6161j1816p1290l2087O333
$$ -15544 19219 15841 -17550 2506 16861 -87419 -63195 12966 1150 -70140 -102227 -95894
13316i5894P1795j5395j2404J6583L2352j7284o7896L1663Q0529l4055l634M5970
$$ -95894 -24099 -39494 -51898 -35315 -2963 -20247 -88143 -56480 24049 -10006 -13640 32330
13304C2330k6956n4552L4201K7372o4723k6527q807j2867K0949N1862K7347O9133
$$ 32330 5374 -49178 -14977 12395 -52328 -78855 -87662 -100529 -79580 -27718 -371 68762
13292F8762M7251M3979L1363k6863m2100J0030p0592o1318p375J9608K7806Q105
$$ 68762 116013 159992 191355 164492 122392 132422 61830 512 -6863 12745 40551 48656
13280D8656j1671p2921J8530k9972o3538k1934J4612J14782N3777o837p2864m4425
$$ 48656 36985 -35936 -17406 -47378 -110916 -132850 -118238 -3456 50321 43484 -29380 -73805
13268g3805n4801j2321M069L4488N4784N2043N9646J1844l8387q2968K2260l7570
$$ -73805 -128606 -140927 -136858 -102370 -47586 4457 64103 75947 37560 -45408 -23148 -60718
13256f0718j8338K9294K8570k2384k1894k2975K3550k8610p049P879Q9369L0892
$$ -60718 -79056 -49762 -21192 -43576 -65470 -88445 -64895 -93505 -100554 -92675 -3306 27586
13244B7586N859M7066l5239o4572m5988M426J5796M5943l7661o8338L4473J2519
$$ 27586 33445 80511 45272 -19300 -65288 -60862 -45066 877 -36784 -105122 -70649 -58130
13232e8130k1734L8759J6068N5695n7722m6979J5798P5105m3160l1687o3343p1209
$$ -58130 -79864 -41105 -25037 30658 -27064 -74043 -58245 16860 -26300 -57987 -121330 -192539
13220a92539L6484P1537N4102l1144j0858L5510r694J21632O2481m8042o8487
$$ -192539 -156055 -84518 -30416 -61560 -72418 -36908 -46602 75030 137511 89469 20982
13209B0982o9022J728P6336N1600k3056j5273N2827L8844j6936q7623k4762J0643
$$ 20982 -48040 -46312 30024 81624 58568 43295 96122 134966 118030 30407 5645 16288
13197A6288l0665o1834M0113O5815K3334O946J6999r7402l5085N7256m0165J5213
$$ 16288 -14377 -76211 -36098 29717 53051 59997 76996 -20406 -55491 1765 -38400 -23187
13185b3187K6667J0130k9547J6867K3229K982k1823K9125n0484j05095O6147Q0557
$$ -23187 3480 13610 -15937 930 24159 27141 5318 34443 -16041 -121136 -54989 25568
13173B5568L0398o0445o2671j8942P1643k2617q756P3957L4565J1529K8245q7543
$$ 25568 55966 -4479 -67150 -86092 -14449 -37066 -45822 28135 62700 74229 102474 14931
13161A4931M3720j5196J0852J0206k6863n0027Q0021L1640j03759m9320l4472
$$ 14931 58651 43455 54307 64513 37650 -12377 67644 99284 -4475 -53795 -88267
13150h8267n2215J9830P796L7732k6095m4678m4539o495M8585J12103Q3424k7142
$$ -88267 -140482 -120652 -112856 -75124 -101219 -145897 -190436 -196931 -148346 -36243 47181 20039
13138B0039q0239L215L4840N0369k8327J0706M2637L9815L449j781k0209n9665
$$ 20039 -60200 -56985 -22145 28224 -103 10603 53240 93055 96504 94723 74514 14849
13126A4849n8347N3306q143J9421K5146j23195n3515M6041J00223R386m4761l1908
$$ 14849 -43498 9808 1665 21086 46232 -76963 -130478 -84437 15786 25172 -19589 -51497
13114e1497J192L555m5718J7456P1972P5312O7946j3775k1292P017o007j05967
$$ -51497 -50305 -46750 -92468 -75012 -3040 72272 140218 126443 105151 112168 106161 194
13102A94J3416K4953J3504q2951l8804L2692M0554k6670n5074p5686K5422M9995
$$ 194 13610 38563 52067 -30884 -69688 -36996 3558 -23112 -78186 -153872 -128450 -78455
13090g8455k757P1674M4486k8033k1035p793m7213o6306j823J8669K8965L7855
$$ -78455 -81212 -9538 34948 6915 -14120 -21913 -69126 -135432 -137255 -118586 -89621 -51766
13078e1766J1660M9757M05l3301l427N0082n329k3983l3800k1249J21155M7603
$$ -51766 -40106 9651 10056 -23245 -26672 23410 18081 -5902 -39702 -60951 60204 107807
13066A07807L6031k6753j04869n8990l71k1730M0028M5598m480l9266k316k8633
$$ 107807 143838 117085 12216 -46774 -47145 -68875 -28847 16751 12271 -26995 -29311 -57944
13054e7944o1445k7297K3136J36077n74n3802K6534P7313L1344M2447K5778l3356
$$ -57944 -119389 -146686 -123550 12527 11953 -41849 -15315 61998 93342 135789 161567 128211
13042A28211o9689J9040R363n849r293m4002j613p9314k5456P0337P4058j0360
$$ 128211 58522 77562 86925 81076 71783 27781 26168 -53146 -78602 -8265 65793 55433
13030E5433O4775q5357l0375l375L9751r12Q341j3929K1028K8841P552p9636l5791
$$ 55433 120208 34851 4476 1101 40852 39940 48281 34352 55380 84221 91773 12137 -23654
13017b3654l388L4659K2945l1280L7951p3916R622N2628j2601m708N1044M2360
$$ -23654 -27042 7617 30562 -718 37233 -36683 -27061 25567 12966 8258 59302 101662
13005A01662k6650k819o0000p0799K178O8612J2152L588p1456q2111K6050J6366
$$ 101662 75012 72193 12193 -58606 -56428 12184 24336 27924 -43532 -125643 -99593 -83227
12993h3227L4056R3253K9422q8476l0952k0981p600k1709n4892N8541M0639k1105
$$ -83227 -49171 44082 73504 -14972 -45924 -66905 -74505 -96214 -151106 -92565 -51926 -73031
12981g3031k3734o148j2845J29136J9102k7725l9335j4899L4439Q0797l989k3482
$$ -73031 -96765 -102913 -115758 13378 32480 4755 -34580 -49479 -15040 65757 61768 38286
12969C8286m920O7440l1018Q970N5355j1234l6155o7100N8651N0494M123o0457
$$ 38286 33366 100806 69788 78758 134113 122879 86724 19624 78275 128769 132892 72435
12957G2435n2977k2219N1189J6307l7445o7804j4455R2660P3457j5569l8590O9059
$$ 72435 19458 -2761 48428 64735 27290 -40514 -54969 37691 111148 95579 56989 126048
12945A26048M3754m5145o4625q6829j3005O5699k9802r375k045J7095j662n753
$$ 126048 169802 124657 60032 -26797 -39802 25897 -3905 -13280 -15325 1770 108 -5645
12933e645n3389j6175j4022J1818k7332l823O0353O6005k0505j47531j4697J34209
$$ -5645 -59034 -75209 -89231 -77413 -104745 -108568 -48215 17790 -2715 -150246 -164943 -30734
12921c0734J38753o1390r1621R2248L0839q705k6077r1778j04066r264R1701Q5344
$$ -30734 108019 46629 -44992 47256 78095 69390 43313 -48465 -152531 -161795 -70094 15250
12909A5250l4258o8569n6288k6987j3329k0310J22626L4120R254j03039k7088
$$ 15250 -19008 -87577 -143865 -170852 -184181 -204491 -81865 -47745 -38491 -141530 -168618
12898a68618M0877j8561N047N4330K3071Q0717L5904n1782j44045p8628J14523
$$ -168618 -127741 -146302 -141255 -86925 -63854 16863 52767 985 -143060 -221688 -107165
12887a07165J32197L1669j2079m7859q2266J08387K6771l3793j12611J05480O7592
$$ -107165 25032 56701 44622 -3237 -85503 22884 49655 15862 -96749 8731 76323
12876G6323k1129l5449m1016k5241j680N6244J00135n3190j1042j4979p1695o1389
$$ 76323 55194 19745 -21271 -46512 -48192 8052 108187 54997 43955 28976 -42719 -104108
12864a04108m444J4913k1118O283J9934O2231L1215l0540m677j2026k4248J3305
$$ -104108 -108552 -93639 -114757 -108474 -88540 -26309 4906 -25634 -30311 -42337 -66585 -53280
12852e3280r752o7904L7300l0692K4112M632j02865k2530J74077P3649j4884J2126
$$ -53280 -63032 -130936 -93636 -124328 -100216 -95584 -198449 -220979 -46902 26747 11863 23989
12840B3989O5943O210p6842p4658p638L4855r440j4814j8263j5918l76L6377o1463
$$ 23989 89932 96142 19300 -55358 -62996 -28141 -37581 -52395 -70658 -86576 -86952 -50575 -112038
12827a12038q0358k7320J01199K5236m0774P764P4910M8802m2014N295m0614L1523
$$ -112038 -192396 -219716 -118517 -93281 -134055 -126291 -51381 -2579 -44593 -39298 -79912 -48389
12815d8389M834N6783j1295j5318J5588j9437j1737l6901p849J3429j5710k5341
$$ -48389 -43555 13228 1933 -13385 2203 -17234 -28971 -65872 -73721 -60292 -76002 -101343
12803a01343K3069J8185M9083L6327J4108J6865r007l5149o5184K3641J8076n286
$$ -101343 -78274 -60089 -11006 25321 39429 56294 47287 12138 -53046 -29405 -11329 -16615
12791a6615n1265l5639N304N5791n1200l4139M3910k1845k3138M6329P0040Q0625
$$ -16615 -67880 -103519 -98215 -42424 -93624 -127763 -83853 -105698 -128836 -82507 -12467 68158
12779F8158N929j1231m4693l7258O687r0683j7076O4984o6414o1194O8480R3207
$$ 68158 74087 62856 18163 -19095 -12408 -103091 -120167 -55183 -121597 -182791 -114311 -21104
12767b1104o1563J6241M9592j41619m747J6453m090J3868M9677P6571K3541k8196
$$ -21104 -82667 -66426 -16834 -158453 -163200 -146747 -150837 -136969 -87292 -10721 12820 -15376
12755a5376J4656m1233J3274K3770m4094r5876j4912Q9928k745R9362K3025K2976
$$ -15376 -720 -41953 -28679 -4909 -49003 -144879 -159791 -69863 -72608 26754 49779 72755
12743G2755L6068q8167p3015n6005R893n6055J6668Q4270P9828N5717k7565l6878
$$ 72755 108823 20656 -52359 -108364 -98471 -154526 -137858 -53588 26240 81957 54392 17514
12731A7514o0504O413N9105P541n2742l2756m3470r8232l4122L0601N7456P0687
$$ 17514 -42990 -36577 22528 30069 -22673 -55429 -98899 -197131 -231253 -200652 -143196 -72509
12719g2509L2419o7523O585l5641K4273N4567M3646n8230p6381Q4137M3332l1917
$$ -72509 -40090 -107613 -101028 -136669 -112396 -57829 -14183 -72413 -148794 -64657 -21325 -53242
12707e3242r7785n3346M8401L1270J1649j7642p4327J1447K8527L6426j3114J5718
$$ -53242 -151027 -204373 -155972 -124702 -113053 -130695 -205022 -193575 -165048 -128622 -141736 -126018
12695a26018L710q802K7492J8052L8931J465m5528K3693k9002k5525J37490J01017
$$ -126018 -122308 -131110 -103618 -85566 -46635 -45170 -90698 -67005 -96007 -121532 15958 116975
12683A16975j9303j01997n0251J4754o9208Q2443P6390q518k1535n5369l0188
$$ 116975 97672 -4325 -54576 -39822 -109030 -26587 49803 41285 19750 -35619 -65807
12672f5807R5971K8107j07241k5205O244M8344J6320J8124p2231j30797q030J39038
$$ -65807 30164 58271 -48970 -74175 -67931 -19587 -3267 14857 -57374 -188171 -196201 -57163
12660e7163K2075n3188o0889j9431M9203M9104O9643R087K142j4270N1673N1436
$$ -57163 -35088 -88276 -149165 -168596 -119393 -70289 -646 8441 10583 -3687 47986 99422
12648I9422J1900m9174j43609J4763J37105m8539l3808L3614k9649k981J1174
$$ 99422 111322 62148 -81461 -66698 70407 21868 -11940 21674 -7975 -10956 218
12637B18n8993o813l9200r0595n6589P6498R5857J05726J4559K1009j03310j7871
$$ 218 -58775 -65588 -104788 -195383 -251972 -175474 -79617 26109 40668 61677 -41633 -59504
12625e9504N757L3185L1350K165O2806K4718n8858j1819k8522k9470m6221N297
$$ -59504 -53747 -20562 10788 12953 75759 100477 41619 29800 1278 -28192 -74413 -69116
12613f9116R3493p4290q3553J3451K7822p3291K1401L3216M6268M2264m305n8971
$$ -69116 24377 -49913 -133466 -120015 -92193 -165484 -144083 -110867 -64599 -22335 -26640 -85611
12601h5611J22616J17562n9871m4205j06972L0710L1919q0799l0565M4895R9156
$$ -85611 37005 154567 94696 50491 -56481 -25771 6148 -74651 -105216 -60321 38835
12590C8835J3864J0147N6741j2898L046k9565M2928q788n7022o2819j297J3316
$$ 38835 52699 62846 119587 106689 109735 80170 123098 114310 57288 -5531 -6828 6488
12578F488j6848J1735n5295J3439k0733N0340k536O557J3985j3571m6272m6735
$$ 6488 -10360 1375 -53920 -40481 -61214 -10874 -13410 -6853 7132 -6439 -52711 -99446
12566i9446M0878K6936j4515K9635J02047n331m4414m9653j7798J1761Q1077J6673
$$ -99446 -58568 -31632 -46147 -16512 85535 80204 35790 -13863 -31661 -19900 61177 77850
12554G7850p5418p2946l5436q2703O5546K6461L5715O6546R452n4795k8639K6061
$$ 77850 2432 -70514 -105950 -188653 -123107 -96646 -60931 5615 15067 -39728 -68367 -42306
12542d2306J8627M9367L4276k0562r018M5433O9667J0598m2898m2335j7520m7855
$$ -42306 -23679 25688 59964 39402 30384 75817 145484 156082 113184 70849 53329 5474
12530E474j6507J05716M1792l9676l389k5880j3793n6409l3741L1200l0352o0773
$$ 5474 -11033 94683 136475 96799 93410 67530 53737 -2672 -36413 -5213 -35565 -96338
12518i6338l9563J5912R9901N9732p215m9891Q329M7586l7510P477m548l0605
$$ -96338 -135901 -119989 -20088 39644 32429 -17462 -9133 38453 943 8420 3872 -26733
12506b6733J0830j0115o6385o575L8962P6756j3683l7280k0182k1326r1751K0818
$$ -26733 -15903 -26018 -92403 -98978 -60016 16740 3057 -34223 -54405 -75731 -167482 -146664
12494a46664O1215p685K5185p30k598Q555J6878n8972J7831K116J938j0249R61
$$ -146664 -85449 -93134 -67949 -68679 -71277 -62722 -45844 -104816 -86985 -84869 -82931 -93180 -92219
12481i2219N7834J7210M0639P8152j00575k780o2026K5725N2366m5092m2570q989
$$ -92219 -34385 -17175 23464 101616 1041 -1739 -63765 -38040 14326 -30766 -73336 -82325
12469h2325o376O3201N4795k8296N0767O9763m7086p1640k3693M6366R9003n2204
$$ -82325 -88701 -25500 29295 999 51766 121529 74443 2803 -20890 25476 124479 72275
12457G2275o1959N6325M5400j5238N0718O381j11798P8448R4690k2874j29400
$$ 72275 10316 66641 112041 96803 147521 153902 42104 120552 215242 192368 62968
12446F2968o9519J1054m350r553n37R044n3683k2415J2414j046M5256L0693k0348
$$ 62968 -6551 4503 153 -9400 -9937 -893 -54576 -76991 -64577 -65623 -20367 10326 -10022
12433a0022M1867N6726k1465k0606p1367k1623o6840L917L1923j1844k8629O3599
$$ -10022 31845 88571 67106 46500 -24867 -46490 -113330 -109413 -77490 -89334 -117963 -54364
12421e4364Q0071k0822l3367K5413k2216K6966M30p4109K7842J48927m7382L0835
$$ -54364 25707 4885 -28482 -3069 -25285 1681 2111 -71998 -44156 104771 57389 88224
12409H8224l5825J318M8630P8228j8288k1611l5669n1647n0020l7211k0699P6941
$$ 88224 52399 53717 102347 180575 162287 140676 105007 53360 3340 -33871 -54570 22371
12397B2371J0964l5041R443q6303l3514L1o3754J5574Q8614N7074K6066K6309
$$ 22371 33335 -1706 7737 -78566 -112080 -112049 -175803 -160229 -71615 -14541 11525 37834
12385C7834P3908P582p4710o4783l24l3875P842K7804K5270K6716l8339L1085
$$ 37834 111742 119324 44614 -20169 -20493 -54368 -46526 -18722 6548 33264 -5075 26010
12373B6010n4703j17350R3935L6091n9841r6872j9503n902O5675P2276k4424O7981
$$ 26010 -28693 -146043 -52108 -16017 -75858 -172730 -192233 -198135 -132460 -60184 -84608 -16627
12361a6627j014k4644k0340L2280K6894J3751M9084m9151o6996K0228J13639o266
$$ -16627 -17641 -42285 -62625 -30345 -3451 10300 59384 10233 -56763 -36535 77104 70838
12349G0838p7039l175Q8265o833n4365l4133R6893l4443j10789j6814P540K4065
$$ 70838 -6201 -9376 78889 72056 17691 -16442 80451 46008 -64781 -81595 -74055 -49990
12337d9990L3540l4025L7062l3431n216M8420L8609K0231L7266O4569r2693n4865
$$ -49990 -16450 -50475 -13413 -46844 -52060 -3640 34969 55200 92466 157035 64342 9477
12325I477K1453j6838K3504J19215K2506r3633p9463m0805j3192N0359K6071K1969
$$ 9477 30930 14092 37596 156811 179317 85684 6221 -34584 -47776 2583 28654 50623
12313E0623N1891J0799J0818o1033o5952M6519L3666L1585L357m3206j02381l6824
$$ 50623 102514 113313 124131 63098 -2854 43665 77331 108916 112273 69067 -33314 -70138
12301g0138R132N107r2860j6271J1966Q3064J56951q54q1284j7599l955L5002
$$ -70138 -61006 -55899 -148759 -165030 -153064 -70000 86951 86097 4813 -12786 -16741 18261
12289A8261O9117p3100l9963M2677Q1350M9439l7633P137p344j6332K0771K6940
$$ 18261 87378 14278 -25685 16992 98342 147781 110148 117285 109941 93609 114380 141320
12277A41320p1748o6319O4715K2581j29834l6779R3514N9580k3673m218j6188
$$ 141320 69572 3253 67968 90549 -39285 -76064 17450 77030 53357 49139 32951
12266C2951J3700J0437l3492L4099J0013m5445m7656K5823J6180N9537K2896j4675
$$ 32951 46651 57088 23596 57695 67708 22263 -25393 430 16610 76147 99043 84368
12254H4368k0651l0315o6035p2541j7533J47173k1309q5142j2021J6339q7312
$$ 84368 63717 33402 -32633 -105174 -122707 24466 3157 -81985 -94006 -77667 -164979
12243a64979P1887P1703M9349P7874k723m7249J2787M2961k5131l0088k0428m7493
$$ -164979 -93092 -21389 27960 105834 103111 55862 68649 111610 86479 56391 35963 -11530
12231a1530k0188O7468j2846l6162O7554l9337j13721p9544M3186R5816K8185
$$ -11530 -31718 35750 22904 -13258 54296 14959 -98762 -178306 -135120 -39304 -11119
12220a1119l5611j6020N3647M393o9122n4139n7303J10826R6057J3353Q603k6651
$$ -11119 -46730 -62750 -9103 -4710 -73832 -127971 -185274 -74448 21609 34962 43565 16914
12208A6914j52n7656L9943O9392q4703j8831Q015l1954O981O9381M7884o8872
$$ 16914 16762 -40894 -951 68441 -16262 -35093 -27078 -59032 -52051 17330 65214 -3658
12196c658p7162K5844l2901l192O1046R7195J5242J5812j0443m7000o6852M8383
$$ -3658 -80820 -54976 -87877 -91069 -30023 67172 82414 98226 87783 40783 -26069 22314
12184B2314O778r826o2246j0793l3458n9281P4002J16505N0903m9197p5457R333
$$ 22314 29092 19266 -42980 -53773 -87231 -146512 -72510 43995 94898 45701 -29756 -20423
12172b0423J2427r8260M8740m3277K808J23075n599M4899L5176n7414k3651n7170
$$ -20423 -7996 -106256 -57516 -100793 -97985 25090 19491 64390 99566 42152 18501 -38669
12160c8669l0790j070k8467j6600O0204J4222L0004n10o7771q4431j4515J5146
$$ -38669 -69459 -70529 -98996 -115596 -55392 -41170 -11166 -11676 -79447 -163878 -178393 -163247
12148a63247j6104J0460M3863J7076M5429N1160P2727o373q2065O188J5600j04243
$$ -163247 -179351 -168891 -125028 -107952 -62523 -11363 61364 54991 -27074 -20886 -5286 -109529
12136a09529P4470j7662J896J8379j360r8897j6194k5822K6692O0250n815N7520
$$ -109529 -35059 -52721 -50825 -32446 -33806 -132703 -148897 -174719 -148027 -87777 -93592 -36072
12124c6072N5849k3798K2116l5478L0859L0685J7100j5787K5678J5405K489N1148
$$ -36072 19777 -4021 18095 -17383 13476 44161 61261 45474 71152 86557 89046 140194
12112A40194m4571o0664m85l2748R503p3883M965p103j3549n0120O176l6456M4622
$$ 140194 95623 34959 34474 1726 11229 -62654 -57689 -64792 -78341 -128461 -122285 -158741 -114119
12099a14119j0480K2959M9681k2266k9170M6096j6048L1355K3252K7277K5373
$$ -114119 -124599 -101640 -51959 -74225 -103395 -57299 -73347 -41992 -18740 8537 33910
12088C3910o8414m9168j8585K2775M7566Q639J254K5950j1631j8237J022L3154
$$ 33910 -34504 -83672 -102257 -79482 -31916 -23277 -22023 3927 -7704 -25941 -24919 8235
12076H235K543l2216m1608J2570m1415k1968P8510J13553j7991p28L2453j17399
$$ 8235 10778 -21438 -63046 -50476 -91891 -113859 -35349 78204 60213 59485 91938 -25461
12064b5461N5572J32746J897p7569j8014l9749K9726Q996j7434k7205P0803k657
$$ -25461 30111 162857 164754 87185 69171 29422 59148 68144 50710 23505 94308 91651
12052I1651J7155n8948M9267l5990J0698k0427J0481M5267L2382o395l9006K0198
$$ 91651 108806 49858 99125 63135 73833 53406 63887 109154 141536 135141 96135 116333
12040A16333j3457K1148j7798k7010l2149l4940l5525l1267K0223R0176m1639
$$ 116333 102876 124024 106226 79216 47067 12127 -23398 -54665 -34442 55734 14095
12029A4095q6819m0326m650J4512j7866M3858N8317J7435m7384K1588L4969N5401
$$ 14095 -72724 -113050 -117700 -103188 -121054 -77196 -18879 -1444 -48828 -27240 7729 63130
12017F3130m242q9740P979l074M7967r500P639N821k4563m1265P06r451N7978
$$ 63130 58888 -30852 -22873 -25947 22020 12520 20159 25980 1417 -39848 -39142 -48593 9385
12004I385L7526j00557o9754K4425P4973L6757r9552r6323J06423L2722m4627
$$ 9385 46911 -53646 -123400 -98975 -24002 12755 -86797 -183120 -76697 -43975 -88602
11993h8602J7145M9811J5686O0600l240m0218Q036l1184J5926K9316N2080L8903
$$ -88602 -71457 -21646 -5960 54640 51400 11182 19218 -11966 3960 33276 85356 124259
11981A24259Q143m2029j22061L9157P6277K3262l8954l6850m2284K6111J5623
$$ 124259 132402 90373 -31688 7469 83746 107008 68054 31204 -11080 15031 30654
11970C0654R667m3374Q488m5686Q074Q6570K7853j06800j7441M3006J7469R082
$$ 30654 40321 -3053 5435 -40251 -32177 54393 82246 -24554 -41995 1011 18480 27562
11958B7562k7843p5398n5692m0102K4363J14870Q2099r3353l7472M9781N6258
$$ 27562 -281 -75679 -131371 -171473 -147110 -32240 49859 -43494 -80966 -31185 25073
11947B5073j1893r4689k6622O7240J06699m3062o8496j7930J1217M531J2796K1663
$$ 25073 13180 -81509 -108131 -40891 65808 22746 -45750 -63680 -52463 -47932 -35136 -13473
11935a3473l4914j7395N3052K5340m2953k8724L8178N0734J9967J6197o7608k5453
$$ -13473 -48387 -65782 -12730 12610 -30343 -59067 -20889 29845 49812 66009 -1599 -27052
11923b7052M0766j9107q896M2127N5426p0589p4844m5309P8508N9841j7159j25321
$$ -27052 13714 -5393 -14289 27838 83264 12675 -62169 -107478 -28970 30871 13712 -111609
11911a11609j08679J17526J11315o6079l9713L7410M7920j9415j2439Q0774j289
$$ -111609 -220288 -102762 8553 -57526 -97239 -59829 -11909 -31324 -43763 37011 35722
11900C5722p694l1377o1303M8074L6023o8303q588R7748J0236O907m320N5835
$$ 35722 28028 -3349 -64652 -16578 19445 -48858 -57446 40302 50538 57445 53125 108960
11888A08960L5897m5524K0431m615q908o8225q6957l6506K2335K0576K9449K8303
$$ 108960 144857 99333 119764 115149 106241 38016 -48941 -85447 -63112 -42536 -13087 15216
11876A5216l2231M4845K5348j0800K7034r7247r7843l9610Q4231P932j09129m0265
$$ 15216 -17015 27830 53178 42378 69412 -27835 -125678 -165288 -81057 -73125 -182254 -222519
11864b22519O1893j6105J7955J20092l06j5423L8590l0432K4668k0524j3882k9386
$$ -222519 -160626 -176731 -158776 -38684 -38990 -54413 -15823 -46255 -21587 -42111 -55993 -85379
11852h5379L039r121l1063J3363J2651J0264N2376N7082j04379k4128K4248P2217
$$ -85379 -82340 -91461 -122524 -109161 -96510 -86246 -33870 23212 -81167 -105295 -81047 -8830
11840h830M8200q1809p0162N3009N7598R3128k5374m8561Q7303K2234k6409M480
$$ -8830 39370 -42439 -112601 -59592 -1994 91134 65760 17199 104502 126736 100327 104807
11828A04807p1628J4852q449n3590Q672k9595L3090l5727r353Q1374m541r1565
$$ 104807 33179 48031 39582 -14008 -5336 -34931 -1841 -37568 -46921 34453 29912 -61653
11816f1653p16l2941o112r888l6483K8802k228j07610j0994J07655P7029P4877
$$ -61653 -62369 -95310 -101422 -111310 -147793 -118991 -121219 -228829 -239823 -132168 -55139 19738
11804A9738o159j1329o4972m4178R523J2262K8032N8069k7036p7165p4393Q6017
$$ 19738 13579 2250 -62722 -106900 -97377 -85115 -57083 986 -26050 -103215 -177608 -91591
11792i1591k388l7012j0687K5343N4897J8150K1096j00027j1113J693r4283p976
$$ -91591 -93979 -130991 -141678 -116335 -61438 -43288 -22192 -122219 -133332 -131639 -225922 -233898
11780b33898P7895N3565p7091n0454J4270J31723K4605M5810J10217k3877m5142
$$ -233898 -156003 -102438 -179529 -229983 -215713 -83990 -59385 -13575 96642 72765 27623
11769B7623m8873l1992R3873K4098q2082m553N9832k3543l7543p929j4653r824
$$ 27623 -21250 -53242 40631 64729 -17353 -21906 37926 14383 -23160 -31089 -45742 -55566
$$ [...]
##END NTUPLES=NMR SPECTRUM
##END=
