##TITLE=Analysis number 310068
Compound Code cc 46009
Book Reference 415/174
Project Code adrs
Chemist Name bos
##JCAMPDX= 6.0         $$ Bruker NMR JCAMP-DX V2.0
##DATA TYPE= NMR SPECTRUM
##DATA CLASS= NTUPLES
##ORIGIN= Bruker BioSpin GmbH
##OWNER= NMR
$$ XWIN-NMR		Version 3.5
$$ Fri Jun 10 10:39:44 2005 GMT Daylight Time (UT+1h)  MAYBRIDGE\NMR@NMR_250MHZ
##.OBSERVE FREQUENCY= 250.131544655141
##.OBSERVE NUCLEUS= ^1H
##.ACQUISITION MODE= SIMULTANEOUS (DQD)
##.ACQUISITION SCHEME= undefined
##.AVERAGES= 16
##.DIGITISER RES= 18
##SPECTROMETER/DATA SYSTEM= dpx250
##.PULSE SEQUENCE= zg30
##.SOLVENT NAME= CDCl3
##.SHIFT REFERENCE= (INTERNAL, CDCl3, 0, 16.449)
##AUDIT TRAIL= $$ (NUMBER, WHEN, WHO, WHERE, WHAT)
$$ ##TITLE= Audit trail, XWIN-NMR		Version 3.5
$$ ##JCAMPDX= 5.01
$$ ##ORIGIN= Bruker BioSpin GmbH
$$ ##OWNER= NMR
$$ C:\u/data/dgb/nmr/ADRS/4000/pdata/1/auditp.txt
$$ ##AUDIT TRAIL=  $$ (NUMBER, WHEN, WHO, WHERE, WHAT)
(   1,<2005-06-10 10:39:25.71 +100>,<MAYBRIDGE\NMR>,<NMR_250MHZ>,
      <created by zg, POWCHK disabled, PULCHK disabled
       configuration hash MD5:
       62 19 C7 07 E1 42 D1 B7 37 6C 3D D0 77 39 F9 E6
       data hash MD5: 64K
       BF F2 12 BB FE 9A B5 CE 9B 8B 6F 53 68 81 23 8F>)
(   2,<2005-06-10 10:39:36.77 +100>,<MAYBRIDGE\NMR>,<NMR_250MHZ>,
      <Start of raw data processing
       ef LB = 0.3 FT_mod = 6 PKNL = 1 SI = 32K 
       data hash MD5: 32K
       73 D2 AA 55 51 55 22 C0 0E 75 D4 D3 DA C9 48 51>)
(   3,<2005-06-10 10:39:38.38 +100>,<MAYBRIDGE\NMR>,<NMR_250MHZ>,
      <apk 
       data hash MD5: 32K
       01 83 9C C0 F3 49 FB B2 88 09 E6 8C 41 90 17 2A>)
(   4,<2005-06-10 10:39:39.04 +100>,<MAYBRIDGE\NMR>,<NMR_250MHZ>,
      <abs ABSG = 5 
       data hash MD5: 32K
       86 2B FF 94 EE 33 6A AE 73 CB DE DD D9 7E CF FC>)
$$ ##END=
$$ 
$$ hash MD5
$$ 0D C5 3C 4B F1 8F 26 1B 2C 92 16 61 2E 04 32 71
##$RELAX= 
##$RELAX= 
##$RELAX= 
##$RELAX= 
##$RELAX= 
##$RELAX= 
##$RELAX= 
$$ Bruker specific parameters
$$ --------------------------
##$DU= <C:\u>
##$EXPNO= 4000
##$NAME= <ADRS>
##$PROCNO= 1
##$TYPE= <nmr>
##$USER= <dgb>
##$AMP= (0..31)
100 100 100 100 100 100 100 100 100 100 100 100 100 100 100 100 100 100 
100 100 100 100 100 100 100 100 100 100 100 100 100 100 
##$AQSEQ= 0
##$AQ_mod= 3
##$AUNM= <au_zg>
##$AUTOPOS= <9 >
##$BF1= 250.13
##$BF2= 250.13
##$BF3= 250.13
##$BF4= 250.13
##$BF5= 500.13
##$BF6= 500.13
##$BF7= 500.13
##$BF8= 500.13
##$BYTORDA= 1
##$CFDGTYP= 0
##$CFRGTYP= 5
##$CHEMSTR= <none>
##$CNST= (0..31)
1 1 145 1 1 1 1 1 1 1 1 1 1 1 1 1 1 1 1 1 1 1 1 1 1 1 1 1 1 1 1 1 
##$CPDPRG= <>
##$CPDPRG1= <>
##$CPDPRG2= <>
##$CPDPRG3= <>
##$CPDPRG4= <mlev>
##$CPDPRG5= <mlev>
##$CPDPRG6= <mlev>
##$CPDPRG7= <mlev>
##$CPDPRG8= <mlev>
##$CPDPRGB= <>
##$CPDPRGT= <>
##$D= (0..31)
0 1 0 0 0 0 0 0 0 0.06 0 0 0 0 0 0 0.0002 0 0 0 0 0 0 0 0 0 0 0 0 0 0 
0 
##$DATE= 1118396364
##$DBL= (0..7)
120 120 120 120 120 120 120 120 
##$DBP= (0..7)
150 150 150 150 150 150 150 150 
##$DBP07= 0
##$DBPNAM0= <>
##$DBPNAM1= <>
$$ [...]
##$SUBNAM7= <"">
##$SUBNAM8= <"">
##$SUBNAM9= <"">
##$SW= 20.6930455092707
##$SWIBOX= (0..15)
0 0 3 0 0 0 0 0 0 0 0 0 0 0 0 0 
##$SW_h= 5175.983436853
##$TD= 65536
##$TD0= 1
##$TE= 295.16
##$TE2= 300
##$TE3= 300
##$TEG= 300
##$TL= (0..7)
0 120 120 120 120 120 120 120 
##$TP= (0..7)
150 150 150 150 150 150 150 150 
##$TP07= 0
##$TPNAME0= <>
##$TPNAME1= <>
##$TPNAME2= <>
##$TPNAME3= <>
##$TPNAME4= <>
##$TPNAME5= <>
##$TPNAME6= <>
##$TPNAME7= <>
##$TPOAL= (0..7)
0.5 0.5 0.5 0.5 0.5 0.5 0.5 0.5 
##$TPOFFS= (0..7)
0 0 0 0 0 0 0 0 
##$TUNHIN= 0
##$TUNHOUT= 0
##$TUNXOUT= 0
##$USERA1= <user>
##$USERA2= <user>
##$USERA3= <user>
##$USERA4= <user>
##$USERA5= <user>
##$V9= 5
##$VALIST= <valist>
##$VCLIST= <CCCCCCCCCCCCCCC>
##$VD= 0
##$VDLIST= <DDDDDDDDDDDDDDD>
##$VPLIST= <PPPPPPPPPPPPPPP>
##$VTLIST= <TTTTTTTTTTTTTTT>
##$WBST= 1024
##$WBSW= 4
##$XGAIN= (0..3)
0 0 0 0 
##$XL= 0
##$YL= 0
##$YMAX_a= 344004
##$YMIN_a= -326390
##$ZGOPTNS= <>
##$ZL1= 120
##$ZL2= 120
##$ZL3= 120
##$ZL4= 120
##$ABSF1= 16.44898
##$ABSF2= -4.244192
##$ABSG= 5
##$ABSL= 3
##$ALPHA= 0
##$AQORDER= 0
##$ASSFAC= 0
##$ASSFACI= 0
##$ASSFACX= 0
##$ASSWID= 0
##$AUNMP= <proc_1d>
##$AZFE= 0.1
##$AZFW= 0.1
##$BCFW= 0
##$BC_mod= 0
##$BYTORDP= 0
##$COROFFS= 0
##$CY= 12.5
##$DATMOD= 1
##$DC= 0
##$DFILT= <>
##$DTYPP= 0
##$F1P= 14.0000005364418
##$F2P= -0.99999901652339
##$FCOR= 0.5
##$FTSIZE= 32768
##$FT_mod= 6
##$GAMMA= 0
##$GB= 0
##$INTBC= 1
##$INTSCL= 1
##$ISEN= 128
##$LB= 0.3
##$LEV0= 0
##$LPBIN= 0
##$MAXI= 10000
##$MC2= 0
##$MEAN= 0
##$ME_mod= 0
##$MI= 0
##$NCOEF= 0
##$NC_proc= -5
##$NLEV= 6
##$NOISF1= 0
##$NOISF2= 0
##$NSP= 0
##$NTH_PI= 0
##$NZP= 0
##$OFFSET= 16.44898
##$PC= 1
##$PHC0= -71.2348
##$PHC1= 8.16134
##$PH_mod= 1
##$PKNL= yes
##$PPARMOD= 0
##$PSCAL= 4
##$PSIGN= 0
##$REVERSE= no
##$SF= 250.130018263064
##$SI= 32768
##$SIGF1= 0
##$SIGF2= 0
##$SINO= 400
##$SIOLD= 32768
##$SREGLST= <1H.CDCl3>
##$SSB= 0
##$STSI= 32768
##$STSR= 0
##$SW_p= 5175.98343685301
##$SYMM= 0
##$S_DEV= 0
##$TDeff= 65536
##$TDoff= 0
##$TI= <Analysis number 999999
Compound Code 99
Book Reference 9
Project Code 9>
##$TILT= no
##$TM1= 0
##$TM2= 0
##$TOPLEV= 0
##$USERP1= <user>
##$USERP2= <user>
##$USERP3= <user>
##$USERP4= <user>
##$USERP5= <user>
##$WDW= 1
##$XDIM= 32768
##$YMAX_p= 338988874
##$YMIN_p= -698685
$$ End of Bruker specific parameters
$$ ---------------------------------
##NTUPLES= NMR SPECTRUM
##VAR_NAME=  FREQUENCY,     SPECTRUM/REAL,   SPECTRUM/IMAG
##SYMBOL=    X,             R,               I
##VAR_TYPE=  INDEPENDENT,   DEPENDENT,       DEPENDENT
##VAR_FORM=  AFFN,          ASDF,            ASDF
##VAR_DIM=   32768,         32768,           32768
##UNITS=     HZ,            ARBITRARY UNITS, ARBITRARY UNITS
##FACTOR=    0.157963299565203, 1,           1
##FIRST=     4114.38375070709, 0,            0
##LAST=      -1061.59968614592, 0,           0
##MIN=       -1061.59968614592, -698685,     0
##MAX=       4114.38375070709, 338988874,    0
$$ Real data points
##PAGE= N=1
##DATA TABLE= (X++(R..R)), XYDATA
$$ [...]
19376A87360438q682061j0236892j0434284j0293952j0950334j1249203j0455396
19369A15058316q970596p928004p667067p480089o859134o035644n385458m791150
19361E9941174m007471l096399k474490j798702j105639l66843K20349Q20806
19353D8132785J693033K705321L400015M133256M555661N045237N650956O451895
19345H1768159P658248Q217483Q001771P502710Q011351R441751J0414577J0828244
19337A51844294J0948165J1972686J2996417J2382207J1199364J1297220J1759703
19330B34400056R100672L712610o43526k907272l901190o767927j2197779j5749248
19322B05046396j6399597j6463786j5946346j5986556j5567307j3787311j1968829
$$ plain form
19376 187360438 178678377 168441485 158007201 147713249 136762915 125513712 115058316
19369 115058316 106087720 98159716 90492649 83012560 76153426 70117782 64732324 59941174
19361 59941174 55933703 52837304 50362814 48564112 47458473 47091630 47311979 48132785
19353 48132785 49825818 52531139 55931154 60064410 64620071 69665308 75316264 81768159
19345 81768159 89426407 97643890 105645661 113148371 121159722 130601473 141016050 151844294
19337 151844294 162792459 174765145 187761562 200143769 211343133 222640353 234400056
19330 234400056 243500728 247213338 246569812 243662540 239761350 232993423 220795644 205046396
19322 205046396 188646799 172183013 156236667 140250111 124682804 110895493 98926664
19315I8926664j0398294r036589p988466o662970n658554m886502m237660l887893
19307D6169736l441481k908038k359842k063972j870211j824163j664208j291566
19299B8746255j129001r88972p85415r08220q76225q25657r15619p33018o47957
19290B0936171o49262r51303q87830q16942p36838p25576o07698p01095o35620
19281A4224007p24788n34823n59562o96165n00869m64700m71252o30420l79215
19272I262213l08121k73938l42004l73475k92992m62846m12739k75839j53733
19263F366526l8303m54130m20591j93758j08991k74862j55554k16043k34038j50319
19253D119937l39127k38520j02868N0394j81563k24388K5481J55609Q1242n0852
$$ plain form
19315 98926664 88528370 79491781 71503315 64840345 59181791 54295289 50057629 46169736
19307 46169736 42728255 39820217 37460375 35396403 33526192 31702029 30037821 28746255
19299 28746255 27617254 26628282 25842867 24934647 24058422 23232765 22317146 21584128 20936171
19290 20936171 20286909 19335606 18447776 17630834 16893996 16168420 15560722 14859627 14224007
19281 14224007 13499219 12964396 12404834 11708669 11207800 10743100 10271848 9641428 9262213
19272 9262213 8954092 8680154 8338150 7964675 7671683 7208837 6796098 6520259 6366526
19263 6366526 6328223 5874093 5453502 5259744 5150753 4875891 4720337 4504294 4270256 4119937
19253 4119937 3780810 3542290 3439422 3489816 3308253 3083865 3109346 3264955 3346197 3295345
19243C295345j05669m09668k86259l3911K9344k53415p9985n3233j26082K2588
19233A999055m0426k24169j9511J65416p7785j43317j30031j733M9563m9267m0925
19222A486870k4022M1513l0082l8698K5098l2565j64187L2776K5686n4306K0428
19211A288511j11223M5522P8662O9911j39288j38945m3158k7571J18652K2430
19201A163503o4839O4185J28481o5377o2629j29359j24547P430K5092m7285o8634
19190H26021q3314P566J62389K21444j18018k65384k05328k4993L8248R8023J9192
19179F75846Q7215o3360l4251J2037p3423P9315P8363J66872n2263o3441J01541
19168I14451j6673k41937k7118J44980j25877n5533R5257M9613R6918k0139k17374
$$ plain form
19243 3295345 3189676 2780008 2493749 2459838 2489182 2235767 2155782 2102549 1976467 1999055
19233 1999055 1958629 1734460 1714949 1880365 1802580 1659263 1529232 1527499 1577062 1527795 1486870
19222 1486870 1462848 1504361 1474279 1435581 1460679 1428114 1263927 1296703 1322389 1268083 1288511
19211 1288511 1177288 1222810 1301472 1371383 1232095 1093150 1049992 1022421 1141073 1163503
19201 1163503 1098664 1162849 1291330 1225953 1163324 1033965 909418 916848 941940 894655 826021
19190 826021 742707 750273 912662 1134106 1016088 750704 545376 520383 558631 656654 675846
19179 675846 763061 699701 665450 677487 604064 683379 761742 928614 876351 812910 914451
19168 914451 897778 655841 628723 773703 647826 592293 687550 737163 834081 813942 596568
19157E96568J3657J92301J70488j37060j13959o649j9576Q1190j01600j54595
19147E20765R0343R4281r7356O4607O8333P7269m1191m8097j99530n6380J25608
19136E98652J31038j53619k3808j04234M6617L9307N0348J40609m996j07536q5724
19125E26654j07877o413N7851M7944q7396J6328j15293P9324N8661m0037J36141
19114E65887J45442Q2449k0258o6813p4704j08882j39888r7901J79973J46875
19104F12180j0957o6816R6347N6790j33613j86598J17365J26705o5324o971j2013
19093E27095P4926J63787R1549j55106j58696K4355n6063j14536R2983Q3557o1600
19082E12251L681j21091l9014P6027K5942J53577M5570k26193j10035j674O5186
$$ plain form
19157 596568 610225 802526 973014 835954 721995 715346 695770 776960 675360 520765
19147 520765 611108 705389 608033 672640 740973 818242 777051 728954 529424 473044 598652
19136 598652 729690 576071 552263 448029 494646 533953 584301 724910 719914 612378 526654
19125 526654 418777 412364 470215 518159 430763 447091 331798 411122 469783 429746 565887
19114 565887 711329 793778 773520 706707 632003 523121 383233 285332 465305 612180
19104 612180 601223 534407 630754 687544 553931 367333 484698 611403 546079 539108 527095
19093 527095 602021 765808 857357 702251 543555 567910 511847 397311 490294 573851 512251
19082 512251 515932 394841 355827 431854 457796 611373 656943 430750 320715 319041 384227
19071C84227J14591J02532o1166k40512l1511J96353Q7480m4039j56214M7857
19061C99598J226o2214J7347n095J58834L3556q9094K3090N5034K304j39084n1796
19049C43706L5078L4223m9860J13081P4326q3688O2265n835q4415n3405l0863
19038C54613M1230j01365K4167J14339Q515j07237N115J54336j38640N3755Q0920
19027D89748k2144j05247N6214m5432n3429K30262n2160k4160j58201M9496J60075
19016E25022N8397N4064q4993J0564n0800P0102Q8481m8678M3919j9973Q9376
19005G35481J9448k40738O9439J54765R735J9218j72838l4086K04412m7254j94685
18994E22897k01587J10127O8123J70387K5323j87898L5113o1536j60532K23734
$$ plain form
19071 384227 498818 601350 540184 299672 268161 464514 551994 507955 351741 399598
19061 399598 400824 338610 355957 350862 509696 543252 454158 477248 532282 534586 395502 343706
19049 343706 378784 413007 363147 476228 550554 466866 529131 523296 438881 385476 354613
19038 354613 395843 294478 318645 432984 441499 334262 339377 493713 355073 408828 489748
19027 489748 467604 362357 418571 373139 319710 549972 497812 473652 315451 364947 525022
19016 525022 583419 637483 552490 563054 512254 582356 670837 622159 666078 646105 735481
19005 735481 754929 514191 583630 738395 748130 767348 594510 560424 764836 717582 522897
18994 522897 321310 431437 499560 669947 695270 507372 542485 480949 320417 544151
18984E44151J25780N7421M383J25369k573k86580k15415r6962P2015K08091j27681
18973D07999m5862O5187J30411j91399k18663j46641N903J38200J96990P76J46911
18962D89812L0719j25258M7445J29666M2350K8002L6486J02982p7539k25585j46655
18951C32425J07439R1175M6718j02393Q3121L9708j20723j6486J71195K22582
18941H54761L9868j38628j64656j17193Q4430q8863n9371k4752p4355J78257o821
18930D82677o1895K305o1654J15401J69936q4794j417J70946J10705K6866K9380
18919H98456j73649j52162J17754J22102P0688q300k1441p4049P4581K6743n2091
18908H28632j694J00466L8831j48384J21405L7052o8701J8717Q6513J11057M9837
$$ plain form
18984 544151 669931 727352 731735 857104 854531 567951 352536 255574 327589 535680 407999
18973 407999 362137 427324 557735 366336 147673 1032 6935 145135 342125 342901 489812
18962 489812 520531 395273 442718 572384 614734 642736 679222 782204 704665 479080 332425
18951 332425 439864 531039 577757 475364 558485 598193 477470 460984 632179 854761
18941 854761 894629 756001 591345 474152 558582 469719 410348 385596 311241 489498 482677
18930 482677 420782 423087 361433 476834 646770 561976 560559 731505 842210 869076 898456
18919 898456 724807 572645 690399 812501 883189 874889 853448 779399 853980 880723 828632
18908 828632 826938 927404 966235 817851 939256 976308 907607 926324 1012837 1123894 1173731
18897A173731L2794K9015Q0134l260J84916J60368L6762J6728j141k1104M971
18886A693914J44273J90370P3192J59824O6803j2031M5812J39726J2537Q878j00491
18875B422807j31820l7954J44356K84892K45673K05447P9941J8236n2718L4220
18865C213080J47250p3224J19029O3471P9739Q4345Q0506K37881K72551R8363
18855D322991J10150L10859M83513L52578L75867M12565M95690N10279O76928
18846H051420O68880O73018Q65625J077371J145391J345962J463339J726242K156575
18837A9173823K314286K610547L227315L784671M012150M352725N139641N860811
18829E0475969O507377O626184O616331P149320Q348538J0017512J1557954J2830993
$$ plain form
18897 1173731 1206525 1235540 1315674 1312414 1497330 1657698 1694460 1711188 1710047 1688943 1693914
18886 1693914 1838187 2028557 2101749 2261573 2328376 2316345 2362157 2501883 2514420 2523298 2422807
18875 2422807 2290987 2253033 2397389 2682281 2927954 3133401 3213342 3231578 3178860 3213080
18865 3213080 3360330 3287106 3406135 3469606 3549345 3633690 3714196 3952077 4224628 4322991
18855 4322991 4433141 4744000 5227513 5580091 5955958 6368523 6864213 7374492 8051420
18846 8051420 8720300 9393318 10258943 11336314 12481705 13827667 15291006 17017248 19173823
18837 19173823 21488109 24098656 27325971 31110642 35122792 39475517 44615158 50475969
18829 50475969 56983346 63609530 70225861 77375181 85723719 95741231 107299185 120130178
18821A20130178J3517098J5295086J8604275K1011788J9010391J4358233J3229296
18814B35156345J3064174Q990118J101494m831115o647836r345616j4266282j6813427
18806B06407855j6073693j4593344j4034398j4092660j2755252j0497146q945640
18799A15415722q362769q567455q064149p211649o929994o542996n585779m623499
18791E9527432l817411l144825k071424j186379o45162j18306N63518J250074
18783E0357517J738455K306921L134609M080856M730619N128281N847536O860302
18775H4185096P530618P560102O956144P376877Q360769Q773530Q223932Q921113
18767A47888181J0735279J1732694J0201510Q690643R946986J1335115P419737
$$ plain form
18821 120130178 133647276 148942362 167546637 188558425 207568816 221927049 235156345
18814 235156345 248220519 257210637 258312131 253481016 246833180 237487564 223221282 206407855
18806 206407855 190334162 175740818 161706420 147613760 134858508 124361362 115415722
18799 115415722 107052953 98485498 90421349 83209700 76279706 69736710 64150931 59527432
18791 59527432 55710021 52565196 50493772 49307393 48662231 48543925 49107443 50357517
18783 50357517 52095972 54402893 57537502 61618358 66348977 71477258 77324794 84185096
18775 84185096 91715714 99275816 106231960 113608837 121969606 130743136 138967068 147888181
18767 147888181 158623460 170356154 180557664 189248307 199195293 210530408 217950145
18760B17950145P99281k068211k739334n239622j1319426j5485616j5812152j6072571
18752A50012494j6283087j5692587j3872280j2250189j0533272q770068o886027
18745F5724984n841364n303965m429084l863686l375982l210112l109092k560067
18737C4031632k193345j900851j619776j328396j042988r75846q04655o54472
18729B3511303p39307p04981o31097n78107n17005m31580n29962o33383o68292
18720A8077589p34487n83429n45608p34663p69844n85197q54296q52255p53851
18711A1663959o70026n84285m35182n31680n78475m33620k92886k60250l38445
18702G539110n62585l67060l20377k78075j68844j64974l9992q3000j69084l23978
$$ plain form
18760 217950145 218749426 216681215 213941881 208702259 197382833 181897217 166085065 150012494
18752 150012494 133729407 118036820 104164540 91914351 81381079 72611011 65724984
18745 65724984 59883620 54579655 50150571 46286885 42910903 39700791 36591699 34031632
18737 34031632 31838287 29937436 28317660 26989264 25946276 24970430 24165775 23511303
18729 23511303 22771996 22067015 21435918 20857811 20340806 19909226 19379264 18745881 18077589
18720 18077589 17343102 16759673 16214065 15479402 14709558 14124361 13270065 12417810 11663959
18711 11663959 10993933 10409648 9974466 9442786 8864311 8430691 8137805 7877555 7539110
18702 7539110 6976525 6609465 6289088 6011013 5842169 5677195 5637203 5554203 5385119 5061141
18692E061141k42317j14835j35521k10519k06389k69010k56628k02396J8120j8805
18682C422841k73769j62359j77691j02956m0498l8673q1961m6583j26991m7848
18672B323512k8341p1841j74548j02330q9452n74p3730j14401O4804n1128j04859
18661A577112o1607r9856p863j443M2028j05056o2998N6212L0433q1645n5777
18650A229540p5602j44771J61553L10839m8958j21828k09741r2047J40308J61792
18640A311085q4449R448k6971k3468j2646K0791q8994J324n7483L0202J5381j27948
18628I66272j36180J35458K78466j724J02917j49353l04684k50416R9042J15484
18618H55282j139P6314j1083j26637r5518N4184P4951O2600O4700J4704j36282
$$ plain form
18692 5061141 4818824 4703989 4568468 4357949 4151560 3882550 3625922 3423526 3441646 3422841
18682 3422841 3149072 2986713 2809022 2706066 2665568 2626895 2544934 2498351 2371360 2323512
18672 2323512 2295171 2223330 2048782 1946452 1857000 1856426 1782696 1668295 1733099 1681971 1577112
18661 1577112 1515505 1415649 1407786 1406343 1448371 1343315 1280317 1336529 1366962 1285317 1229540
18650 1229540 1153938 1009167 1170720 1481559 1432601 1310773 1101032 1008985 1149293 1311085
18640 1311085 1226636 1236084 1209113 1185645 1172999 1193790 1104796 1106120 1048637 1078839 1094220 966272
18628 966272 830092 965550 1244016 1242292 1345209 1195856 891172 640756 739798 855282
18618 855282 854143 930457 919374 792737 697219 751403 826354 888954 953654 968358 832076
18607H32076K3256j16875L8964k155m3319R9387N5721L968j1987J70715o2498
18596I87253K931J17258K2520P6546k12382m5751j0042j6003J25763J21325J04718
18585A274136j52804n9877j13886j55478j01474j76397j88239R7831J53845r6882
18575D80775k5756k866K0801m2276R7982O8836j07607j44642L0441N3212o4601
18564C64299K2949P292n7439P1199P7149R3399j95791j27805J47244L32531J78413
18553I13440j78261j23300o8258N964O6774l7993k31993q836Q7386R0090M1924
18542E56937r3719j00143j39992J0006j13904M6023K64003K8771k58688q0326
18532A18968Q2127Q4181O5348j63289o8608j17324J19464K05589o0399j01129
$$ plain form
18607 832076 855332 738457 777421 775266 731947 831334 887055 891023 879036 1049751 987253
18596 987253 990184 1107442 1129962 1206508 994126 948375 938333 922330 1048093 1169418 1274136
18585 1274136 1121332 1061455 947569 792091 690617 514220 325981 423812 577657 480775
18575 480775 455019 452153 472954 430678 528660 597496 489889 345247 375688 428900 364299
18564 364299 387248 394540 337101 408300 485449 578848 383057 255252 402496 735027 913440
18553 913440 735179 611879 543621 549585 616359 578366 346373 337537 424923 515013 556937
18542 556937 463218 363075 223083 233089 119185 165208 429211 457982 199294 118968
18532 118968 201095 285276 350624 187335 118727 1403 120867 326456 266057 164928
18522A64928J8004o2652k861J52182J16884k34970r5288J33982q1043O2596P4064
18511B45826N0630J25049J10926o9525k14905j38246m8167R9415L3578L2089O3749
18500B90419m4681k36005r6832K53661L570j30306k5766J15563J63866Q040n643
18489B95886J367J10187K9552j65100q2229L2814j3312q7361J30039J91045j51396
18478B91492j20072L8672J18502L7264K6364j56991N9369k0209j25820j76601
18468b8030p2589J96004Q8278N1874M6619q487K8918m2072O6294K2791O6274R5838
18456E11712M8023J36061O7318j18342N791p0017j30180o2191p5775M2738J08790
18445D63928J39051k98N4806k10408j95874r3398K726M9384N327M2694O67o3504
$$ plain form
18522 164928 182932 120280 117419 269601 386485 151515 56227 190209 109166 171762 245826
18511 245826 296456 421505 532431 462906 248001 109755 61588 161003 194581 226670 290419
18500 290419 245738 9733 -87099 166562 170132 39826 14060 129623 293489 301529 295886
18489 295886 297253 407440 436992 271892 189663 222477 209165 121804 251843 442888 291492
18478 291492 171420 210092 328594 365858 392222 235231 294600 274391 148571 -28030
18468 -28030 -100619 95385 183663 235537 282156 273669 302587 260515 326809 349600 415874 511712
18456 511712 559735 695796 763114 644772 650563 580546 450366 388175 312400 355138 463928
18445 463928 602979 602681 657487 447079 251205 157807 160533 209917 215244 257938 258605 195101
18433A95101R4771J72441n1805l19942L5227m5191j20394Q4401J59228k0636O9811
18422B53012L0206Q3778K20696O2539j32693j12515N4089k00411k8114j7182p6551
18411A36854R2250Q1005K5556q6475n0280J6673J45437K1338j7780m5861J9630
18400C38347M474r9275K2359O0231L52m8163O537r0016J09164M5824M5383N569
18388D00786j464n3899k91470l1063K57668l7127J75843Q998M6165j13130l31817
18377B9490p6979O3927m0800Q5164J05564R9851J1863P7702L0197j9257k6782
18366C39940j44606K9185Q6527j64727Q2576N9396N9811r7257Q0324J20004j04351
18355C46822j7403L2497j00707r8186q5024R0794r2907J08208J13668n954Q6622
$$ plain form
18433 195101 289872 462313 410508 90566 125793 80602 -39792 44609 203837 183201 253012
18422 253012 283218 366996 587692 650231 517538 405023 459112 258701 230587 213405 136854
18411 136854 229104 310109 335665 249190 198910 215583 361020 382358 364578 318717 338347
18400 338347 342821 243546 265905 326136 326488 278325 284862 194846 304010 349834 395217 400786
18388 400786 399322 345423 53953 22890 280558 243431 419274 428272 474437 361307 29490
18377 29490 -47489 16438 -24362 60802 166366 266217 278080 355782 385979 366722 339940
18366 339940 195334 224519 311046 146319 228895 288291 348102 250845 331169 451173 346822
18355 346822 329419 361916 261209 163023 77999 168793 75886 184094 297762 291808 378430
18344C78430K8962M5227j37613j2328N6043q4559j14146k4277r0497O6180K10923
18333C22345O7981j42218n7638k4135J97136N9290j1447M0936j03508r2112n4067
18322B02563O0888J89885M6891j18352L7056L565q6806p9287j0175J8572j1215
18311B53585R4526K89493J71634j08145k8310o6863j1711K7523M5804L79970j301
18300A046205q1833P1112J16982l5437j00564m441k887M3679K1156K7541j67548
18289I33965j94655J13348J05698j79296o297R3732j93003j16678K7961J02925
18279F87700P3923p2872o4432N1770k15776R2352L2974j271j66206L0214R0876
18268E39252M4883j00554m6886N8858m1489j01081J18371J15501O478Q2986n081
$$ plain form
18344 378430 407392 452619 315006 302678 358721 274162 160016 135739 45242 111422 322345
18333 322345 390326 248108 190470 166335 363471 422761 411314 452250 348742 256630 202563
18322 202563 263451 453336 500227 381875 418931 422496 335690 256403 246228 264800 253585
18311 253585 348111 637604 809238 701093 672783 605920 594209 621732 667536 1047506 1046205
18300 1046205 964372 1035484 1152466 1117029 1016465 1012024 1009137 1052816 1073972 1101513 933965
18289 933965 739310 852658 958356 779060 772763 866495 673492 556814 584775 687700
18279 687700 761623 688751 624319 676089 460313 552665 585639 584368 418162 448376 539252
18268 539252 584135 483581 436695 495553 454064 352983 471354 586855 593333 676319 671238
18257F71238K8053J61415J85705O6858r3071L1565K60828N1787Q004J52002J24234
18246A648618K5951j50885r5706K4586K0962K821l84301k28442O0439K53522J95482
18235A373047N1219n288n0391o2526m1372l8055j62160Q1005j0096L5653J54122
18224A325158k7810o3482j39106o5844L5287O3067j03013k271O2607j26563j75667
18213G82363j5723O7056K4124J36458M3686j8105O1524J59546Q8151R3061o3186
18202A358955j27005L9259J64700J74885J6077m4780P2589L894L9754N1731J920
18191A751979J43746K70498J73328J2883k2387k14272J67449O9975j50492j00000
18181B102707J54119J11425m720K16925K09256J15578O6361K0415J0686m5012
$$ plain form
18257 671238 699291 860706 1046411 1113269 1020198 1051763 1312591 1364378 1372382 1524384 1648618
18246 1648618 1674569 1523684 1427978 1452564 1473526 1476347 1092046 863604 924043 1177565 1373047
18235 1373047 1424266 1418978 1368587 1306061 1264689 1226634 1064474 1145479 1135383 1171036 1325158
18224 1325158 1297348 1233866 1094760 1028916 1064203 1127270 1024257 1021986 1084593 958030 782363
18213 782363 766640 833696 857820 994278 1037964 1019859 1081383 1240929 1329080 1422141 1358955
18202 1358955 1231950 1271209 1435909 1610794 1626871 1582091 1654680 1658574 1698328 1750059 1751979
18191 1751979 1895725 2166223 2339551 2352434 2330047 2115775 2283224 2353199 2202707 2102707
18181 2102707 2256826 2368251 2363531 2580456 2789712 2905290 2971651 2992066 3002752 2957740
18171B957740J05962J81423J81699Q1799p928K32097L64954J39922K2476L26494
18161D586638M47705M12147M97827O80050O40175O48967P59572Q21070R97768
18152A0491919J027999J246451J891217K144307K578001K582719K818245L307988
18144B8088846L544742M078902M484102N003965N451363O183318P367266R369104
18136G3571608J2530191J6983578K3355645K8198556K5998749J9096474J6746869
18129B16481670K0918226K8130653K9575926J5527138k524123j1009976j4172394
18122B82927120j6078546j8100278k1643791k3479235k2647910k2020805k1330506
18115A37626049j8267388j1848772m447484K889599J1707025K5319270M0578493
$$ plain form
18171 2957740 3063702 3245125 3426824 3508623 3500695 3732792 4097746 4237668 4260144 4586638
18161 4586638 5034343 5446490 5944317 6624367 7264542 7913509 8673081 9494151 10491919
18152 10491919 11519918 12766369 14657586 16801893 19379894 21962613 24780858 28088846
18144 28088846 31633588 35712490 40196592 45200557 50651920 56835238 64202504 73571608
18136 73571608 86101799 103085377 126441022 154639578 180638327 199734801 216481670
18129 216481670 237399896 265530549 295106475 310633613 308109490 297099514 282927120
18122 282927120 266848574 248748296 227104505 203625270 180977360 158956555 137626049
18115 137626049 119358661 107509889 103062405 105952004 117659029 142978299 183556792
18108A83556792L6664600M546692j2868061j9339829k9073955l4317857l0517316
18101I8651066k1245454j3535717q925538o294659m548279l606608k795662k199151
18093C5499998j860733j546047j351481j374806j182481j047608j216813j062670
18085B4857359r23607q53959q08651q19933r10194n41793n83507p24686p57383
18076A7933646m13342k62175l99799n32324o97895p53126n33745p82113p60936
18067A2798191m59532p25683o22505l71927n68231o78854l91696l92721l46190
18058H240852l53370k66568n09151l50520k91118k90364k15721m80750l42381
18049E140909k09189j14876k23599k16334j66539l38055k05226j79298j58130
$$ plain form
18108 183556792 220221392 224768084 211900023 192560194 163486239 129168382 98651066
18101 98651066 77405612 63869895 54944357 48649698 44101419 40494811 37699149 35499998
18093 35499998 33639265 32093218 30741737 29366931 28184450 27136842 25920029 24857359
18085 24857359 23933752 23079793 22271142 21451209 20541015 19999222 19415715 18691029 17933646
18076 17933646 17520304 17258129 16858330 16326006 15628111 14874985 14341240 13559127 12798191
18067 12798191 12338659 11612976 10990471 10618544 10050313 9371459 8979763 8587042 8240852
18058 8240852 7887482 7620914 7111763 6761243 6470125 6179761 5964040 5483290 5140909
18049 5140909 4931720 4816844 4593245 4376911 4210372 3872317 3667091 3487793 3329663
18040C329663j86880k47629j82764J23275M6962k02794j07145j49487k36820k0013
18030B166368q016j84952l0564p9224O846r7393m9326L7694j25946j25838M6279
18019A555928j28565r1060r5442Q8717J96914k9091K8727r3576l17202q1136R4695
18008A128909J38193l2949J05279j74397j47285M9809l3101n9002m132l7895P8498
17997A011927l2790j09113L5212l1370r6747Q4549j50534R7654J36989j65871
17987G79906j18191j14419j37314j29802M9357K01067N1998q7928O9504J01915
17977F66093J32463K8974K1652R5851r5154n1878M8646J00216m2065j78030P6776
17966H03544Q7998j07998o3295O6101l8337j48289p6230J16103J45849l7500p2992
$$ plain form
18040 3329663 3142783 2895154 2712390 2835665 2882627 2679833 2572688 2423201 2186381 2166368
18030 2166368 2158352 1973400 1942836 1863612 1870458 1773065 1723739 1761433 1635487 1509649 1555928
18019 1555928 1427363 1336303 1240861 1329578 1526492 1497401 1526128 1432552 1115350 1034214 1128909
18008 1128909 1267102 1234153 1339432 1165035 1017750 1067559 1034458 975456 971324 933429 1011927
17997 1011927 979137 870024 905236 873866 777119 861668 711134 808788 945777 779906
17987 779906 661715 547296 409982 280180 329537 530604 582602 494674 564178 666093
17977 666093 798556 827530 849182 945033 849879 798001 846647 946863 904798 726768 803544
17966 803544 891542 783544 720249 786350 748013 599724 523494 639597 785446 747946 674954
17955F74954M3860M9293j29232p8318R1441q206R8919L5630J46089q5444m0567
17944G98419j84103r030Q8860j5255K4794l0123N1268L1750Q3645n0040k84048
17933E06137j8776J53631J12184j79583p6099M0672K7709q1842P6124j452k7393
17922E31312J8901o7861M54k6150l8354M70j47309n2763O9784j8675L9796m7090
17910B62515Q0396J08009K46281j66355o8362M5373m4699m2923J92826K7441q6980
17899E53522m4714J7279l7462r3915l0619J3409j0019J63380r5622j02563j42398
17888A90278p3178K703Q0822M2385r132Q5865k7727J3208K7648J59318K3604p8417
17876D37377q6612R1174l2817k03532k1813J1379q1335p0286j3477q212L0154
$$ plain form
17955 674954 718814 768107 638875 560557 651998 643792 742711 778341 924430 838986 798419
17944 798419 614316 605286 694146 678891 703685 673562 724830 756580 840225 790185 506137
17933 506137 487361 640992 753176 573593 497494 538166 565875 484033 560157 558705 531312
17922 531312 550213 482352 482806 456656 418302 418772 271463 218700 288484 269809 309605 262515
17910 262515 342911 450920 697201 530846 462484 507857 463158 420235 613061 640502 553522
17899 553522 508808 526087 488625 394710 364091 377500 367481 530861 435239 332676 190278
17888 190278 117100 119803 200625 243010 233878 319743 292016 305224 332872 492190 515794 437377
17876 437377 350765 441939 409122 205590 183777 195156 113821 43535 30058 21846 52000
17865E2000l0950o989R6099Q9396N9395N0244r1461R3391k3458n5316o4085o88
17853A67578M7659j24329k2583J9515j42871K4452p7631Q1598R4207P6285l7803
17842A06077J115P3985J42073o6352P551j70104j51064J4635Q6771j47968K5985
17831g7296J45983n4951k34160N2012J35979P2215M935p8574k110J12871m4781
17820C2123j48494Q2686J21663J48294q1988j33873R2962j00395Q1917M9689o5740
17809G8844j88807J7025K9415J29144l9269k0030J85786J13377q3160J47326m1715
17798C27936j51063n6784N5060K945r8300l2568j1398J0856p0727o4567l2058
17787a20668k9877J24514K71672J24362n9182n0653j1892m2115j14464k5908K2542
$$ plain form
17865 52000 21050 14061 110160 199556 258951 309195 217734 311125 287667 232351 168266 167578
17853 167578 215237 90908 68325 87840 -55031 -30579 -108210 -26612 67595 143880 106077
17842 106077 107192 181177 323250 256898 264449 94345 -56719 -42084 44687 -103281 -77296
17831 -77296 68687 13736 -220424 -168412 -32433 39782 44717 -33857 -35967 76904 32123
17820 32123 -116371 -33685 87978 236272 154284 20411 113373 12978 94895 144584 78844
17809 78844 -109963 -92938 -63523 65621 26352 6322 192108 305485 222325 369651 327936
17798 327936 176873 120089 175149 178094 79794 47226 35828 46684 -24043 -88610 -120668
17787 -120668 -150545 -26031 245641 370003 310821 260168 248276 206161 91697 65789 88331
17776H8331p2930R2275j10575J4323j2544P3544L1866O0269M0039n6529K6177
17765A74246p1907J78214R6403J707m0098r2199K5071Q4659o9470l24833p6071
17754a14278n9407J03941N1587N0935o0623j27605R3811N7203J1409J6757j38884
17743a15154q8548l8310P8418Q0858J84233K55507P619j0825j6674P6557l9931
17732C73750j42218l3273k51791r6814J00072P5086n0073K485J84063P2555m2171
17721A91671J66514R603j39312l5215K7726q8931k8281Q8713j87l2262r4852j94117
17709a28930K0778K19407r5480j3782m7676N3402J8881K3866J11882M7248k8853
17698A80743p278j32840P6846M3961k5734M2087l9819L9753l5424k9057r5343
$$ plain form
17776 88331 15401 107676 -2899 11424 -1120 72424 104290 164559 204598 148069 174246
17765 174246 102339 280553 376956 378663 338565 246366 271437 356096 286626 -38207 -114278
17754 -114278 -173685 -69744 -18157 32778 -27845 -155450 -61639 -4436 6973 23730 -115154
17743 -115154 -203702 -242012 -163594 -82736 101497 357004 364623 353798 337124 413681 373750
17732 373750 231532 198259 -53532 -150346 -50274 24812 -25261 -22776 161287 233842 191671
17721 191671 358185 367788 228476 193261 220987 132056 103775 192488 192301 160039 65187 -128930
17709 -128930 -108152 111255 15775 1993 -45683 7719 26600 50466 162348 209596 180743
17698 180743 173465 40625 117471 161432 135698 177785 137966 177719 142295 113238 17895
17687A7895l2765L1097O0273k6178j09682j0525J67511R9128k4029m9048q5583
17676C8094L8087J06604o7531k45732l8131o1529P2533M131j39313J3451K00638
17665g8698n987J38499J31970j05675O956Q7419r4632j79888l6047R610Q2859
17654d3614K9708J53349J8128N4187j99669p5843J5610j19561k8699R1880J21895
17643A7371J08281k1898q7380Q8977K005r0735o1924j30022j04666l5830l102
17632c18923J44149N2142p8692L6366K25344P7350J693J4993J55205n0981q2178
17621A76468L4423r4566j35999K516R2060M5674j23727j7628K45497r9319l1294
17610I4105O0935L209K5355r2057j9700j23803l4011p458J16670P4100n9735r08
$$ plain form
17687 17895 -14870 16227 76500 50322 -59360 -69885 97626 196754 172725 123677 38094
17676 38094 76181 182785 115254 -130478 -168609 -230138 -157605 -153474 -292787 -279336 -78698
17665 -78698 -84685 53814 185784 80109 87065 174484 79852 -100036 -136083 -126473 -43614
17654 -43614 -13906 139443 157571 211758 12089 -63754 -48144 -167705 -196404 -104524 17371
17643 17371 125652 103754 16374 105351 107356 16621 -45303 -175325 -279991 -315821 -318923
17632 -318923 -174774 -122632 -201324 -164958 60386 137736 139429 154422 309627 258646 176468
17621 176468 210891 116325 -19674 -17158 74902 120576 -3151 -20779 224718 125399 94105
17610 94105 155040 158249 183604 91547 71847 -51956 -85967 -93425 23245 97345 37610 36702
17598C6702N125N4199J4679j52625r1561R5253k4724j54957j37665R4216K50761
17587a0597K58325L778q7533j52367j31030r3971Q8418K6531K518l2592P5412
17576e3108K5356p5632O8798j02794M4885K7182N3618N5476p1385q5542J38255
17565B5109J47406l4613m2596m722J8243m8208Q4122p2551j512R6566k752L9120
17553B03612J6088j27240k6984k20834j07608J46444J15122K40668J35754k8580
17543C46442j41824j9086O2818N4099o3318o6492N9497n3181j24454R191O6355
17532A30047K52901J78889Q7636J76112K65038J84406J11872J46969J00444k4472
17522A609842r7195l591j16269j71845k63156k58071j36772j22122k38142L6733
$$ plain form
17598 36702 41827 96026 110705 -41920 -133481 -38228 -62952 -217909 -355574 -261358 -10597
17587 -10597 247728 251506 163973 11606 -119424 -213395 -124977 -98446 -95928 -128520 -53108
17576 -53108 -27752 -103384 -34586 -137380 -92495 -65313 -11695 43781 -27604 -113146 25109
17565 25109 172515 137902 95306 90584 108827 60619 144741 72190 70678 167244 164492 203612
17553 203612 219700 92460 65476 -155358 -262966 -116522 -1400 239268 375022 346442
17543 346442 204618 185532 248350 302449 239131 172639 232136 178955 54501 63692 130047
17532 130047 382948 561837 649473 825585 1090623 1275029 1386901 1533870 1634314 1609842
17522 1609842 1512647 1509056 1392787 1220942 957786 699715 562943 440821 202679 239412
17512B39412j31197j72511Q2216K49725J09212p5343o8169J0750J4555k07626
17502E1024j02016L4775L4759k8698R1305J46732l5266n2573n1361Q3864J15503
17491B88048K4403O3879J5000r9864k47913m5689J27245J39962O9471O4626j18308
17480B80860k65480l0193J64355J01454o4693j01563n5144M2401l4463m9717l3113
17469d5296k7172j89068k46J48310O7148r8947k3487P9691O9798N9830J16347
17458A56908r270j54962L2887J65760j54391P280K0090q4964L9145O8448J65491
17447B52422j1324m0036R062m8479M44626L57273O5994J0934r9996j35992j91394
17436F13090j11011o9211j68370O66R7834j98087j09819r9488o3230j02086P631
$$ plain form
17512 239412 108215 -64296 17920 267645 376857 301514 233345 244095 258650 51024
17502 51024 -50992 -16217 18542 -10156 81149 227881 192615 140042 88681 172545 288048
17491 288048 312451 376330 391330 291466 43553 -2136 125109 265071 334542 399168 280860
17480 280860 15380 -14813 149542 250996 186303 84740 29596 71997 37534 -12183 -45296
17469 -45296 -72468 -261536 -261782 -113472 -46324 -145271 -168758 -89067 -19269 40561 156908
17458 156908 147638 -7324 25563 191323 36932 44212 64302 -20662 18483 86931 252422
17447 252422 241098 201062 210124 161645 606271 963544 1029538 1040472 940476 804484 613090
17436 613090 502079 432868 264498 265164 362998 164911 55092 -44396 -107626 -209712 -202081
17425b02081Q4241J6422J11871O7388J07029J17444m4924O8019n7197j15388j74300
17414b1476m962J6999q2381r4312J24937m0562O0087N4116K15593n0787j90054
17403a2802o0207l0987m3207j12624R4264O8837r6659N5881j6773N4565l7406
17392a37118K7155o3282j26879r5460J91520K25203O8281J48595m2520m3926k1078
17381A30491j41063k13790J1535K8583J9910r742q6825Q0860J57819L91J6853
17370d978j92395n8306K26032J70045N1223j37162j59987K056M3386m7542K0574
17359h7054J41043o3596k27401n1627J30721l9261j09857o3690Q8536J66139K68813
17348A52766L8950k61804r5883l4917k3982K05909q0336R207Q9195j95490q5057
$$ plain form
17425 -202081 -117840 -101418 10453 77841 184870 302314 257390 325409 268212 152824 -21476
17414 -21476 -26438 -9439 -91820 -186132 -61195 -101757 -41670 12446 228039 177252 -12802
17403 -12802 -73009 -103996 -147203 -259827 -165563 -96726 -193385 -137504 -154277 -99712 -137118
17392 -137118 -109963 -173245 -300124 -395584 -204064 21139 89420 238015 195495 151569 130491
17381 130491 -10572 -224362 -212827 -184244 -164334 -174076 -260901 -180041 -22222 -21831 -4978
17370 -4978 -197373 -255679 -29647 140398 191621 54459 -105528 -103472 -60086 -107628 -87054
17359 -87054 53989 -9607 -237008 -288635 -157914 -197175 -307032 -370722 -282186 -116047 152766
17348 152766 191716 -70088 -165971 -200888 -224870 -18961 -99297 -90090 -895 -196385 -281442
17337b81442N5639J75774J41097Q0379P6543j68472j03549j05679n5516k0514
17327b05740N8539n3111r018J52702k7679P4172n7772r5348j24771k5092J17477
17316a95641p3282M925L3133j9599r65j21471Q7296J29442J32068J94944M8961
17305B19811j87467j26376K9309k00274j2670O6180J39659J13521L118p735k40978
17294b03902r8614M4100J00462r992P0988J52999j14026Q9871O4299o8042j50130
17283a21987j94998K0912k9544K8606P1224J76305J97541p8943L3875j82953m1553
17272a21515j1326M1778Q5666l5902q0945R3321n149J34125r765k09790N276J39289
17260B5063J03264J0417Q4508J17773k8683o6469r2179n2980p3420J81717M5533
$$ plain form
17337 -281442 -225803 -50029 91068 171447 247990 79518 -24031 -129710 -185226 -205740
17327 -205740 -147201 -200312 -209330 -56628 -84307 -10135 -67907 -163255 -288026 -313118 -195641
17316 -195641 -268923 -263998 -230865 -250464 -251429 -372900 -285604 -156162 -24094 170850 219811
17305 219811 32344 -94032 -64723 -264997 -277667 -211487 -71828 41693 44811 37076 -203902
17294 -203902 -302516 -258416 -157954 -167946 -96958 56041 -57985 31886 96185 28143 -121987
17283 -121987 -316985 -296073 -325617 -297011 -225787 -49482 148059 69116 102991 -79962 -121515
17272 -121515 -132841 -91063 -5397 -41299 -122244 -28923 -34072 100053 90288 -119502 -114226 25063
17260 25063 128327 138744 223252 341025 312342 245873 153694 100714 27294 209011 254544
17249B54544j09767n1109q9620j0611n7982j24263M3359J01862J97180n9216k25129
17238a30752p0666j11236L6618J42595Q9829K9754j43934j30123K06656R5226
17228A3967J1051J84514J0644p8610j0592O4738j10327J9223q7413Q2252Q7670
17217A87117j64975j82834Q2230P2257N9472l03963j19518O1123k8708P4852J86889
17206g6058J3577j14028m52J77645k6921l00870j26385J13054j189L0427J27572
17195a83628Q3534k0132j06738r619L6981J2591j39003n5974J63074P3031m2K34031
17183H8106J61443j06769j46774p9851J0682j32217j03138J01788J02901k2022
17173a25851Q5918j37784j41417L3302j84810J06562R1805J08146L7170r9248
$$ plain form
17249 254544 144777 93668 4048 -6563 -64545 -188808 -145449 -43587 153593 94377 -130752
17238 -130752 -201418 -312654 -276036 -133441 -43612 -13858 -157792 -287915 -81259 13967
17228 13967 25018 209532 220176 141566 130974 195712 85385 104608 17195 99447 187117
17217 187117 22142 -160692 -78462 -6205 53267 -250696 -370214 -309091 -337799 -262947 -76058
17206 -76058 -62481 -176509 -176961 684 -26237 -327107 -453492 -340438 -341627 -311200 -183628
17195 -183628 -100094 -120226 -226964 -236583 -199602 -187011 -326014 -381988 -218914 -145883 -145925 88106
17183 88106 249549 142780 -3994 -83845 -73163 -205380 -308518 -206730 -103829 -125851
17173 -125851 -39933 -177717 -319134 -285832 -470642 -364080 -272275 -164129 -126959 -226207
17163b26207J2371j9746K8616r6409n0630K3437j5251l5724M8195J64814P7778
17152h8756J0371p9592R1890K07911l5357q3415l6000n3490P0465j09772n6517
17141a62262J0688j7167P6861J33923o5757m2689J89954M7663p5976j91458k50802
17130c47022N7925J14707J30572J49556O723q3132l7222L4315j33870p6039J62282
17119b1205M375K8194J04474j236o9437j50743m3606L897M5755p585J31867J66384
17107A91134r2883j34819m7054K6125N3982J03175l2096p2200o6916j592L0825
17096d2319O7660j5476q5306P7467q8522j45805P7143J95767J0299K5638K6164
17085A02710N6715J29800j8587p4557j17754J5144L7989l8710k3711J09350l2546
$$ plain form
17163 -226207 -213836 -233582 -204966 -301375 -352005 -328568 -343819 -379543 -331348 -166534 -88756
17152 -88756 -78385 -157977 -66087 141824 106467 23052 -12948 -66438 4027 -105745 -162262
17141 -162262 -151574 -168741 -91880 42043 -23714 -66403 123551 171214 95238 -96220 -347022
17130 -347022 -289097 -174390 -43818 105738 112461 29329 -7893 26422 -107448 -183487 -21205
17119 -21205 -16830 11364 115838 114602 45165 -105578 -149184 -145287 -99532 -107117 24750 191134
17107 191134 98251 -36568 -83622 -57497 -3515 99660 67564 -4636 -71552 -73144 -42319
17096 -42319 25341 9865 -75441 2026 -86496 -232301 -155158 40609 50908 76546 102710
17085 102710 159425 289225 270638 196081 78327 93471 131460 92750 69039 178389 145843
17074A45843j19463r9252k15550n5712R4528R2880J97980J00432J33323q4163
17064A90846r1593j08632p7974j4826P374N1409Q1554l8267j28308Q4036J18147
17053G3766J4030J0064j64347j9201k08663j15316o1444J72525K95047j7504o6625
17042h7668P1522p4501q2190J03022M0491o5985J11670k9051k8247J12536q765
17031F2834p1057R6515M0775O8730k1266n0654r8610q9434L5166J09437J16228
17020A98664j65825J27253J51867j75572n0057R1461r6022R9483l6536n8869k2642
17009F3205q4445j1671L6384j940k56328J22718J08722k6411m4573o0952R9074
16998e6217J37085k848j03239n2365l2230O653R9703J7403o3615l631O8470N5642
$$ plain form
17074 145843 26380 -72872 -288422 -344134 -249606 -156726 41254 141686 275009 190846
17064 190846 99253 -9379 -87353 -102179 -94805 -43396 38158 -109 -128417 -44381 73766
17053 73766 87796 97860 -66487 -85688 -294351 -409667 -471111 -298586 -3539 -21043 -87668
17042 -87668 -16146 -90647 -172837 -69815 -29324 -95309 16361 -12690 -40937 71599 62834
17031 62834 -8223 88292 129067 197797 176531 125877 27267 -62167 -27001 82436 198664
17020 198664 32839 160092 311959 136387 86330 177791 81769 181252 144716 85847 63205
17009 63205 -21240 -32911 3473 1533 -254795 -132077 -23355 -49766 -94339 -155291 -56217
16998 -56217 80868 78020 -25219 -77584 -109814 -103161 -3458 13945 -49670 -53301 15169 70811
16986G0811L2092j05643r4181Q968K17208J08583k32040J20339K16034p502r8578
16975B36091n0700Q4730J16217o4972p7229k43757j37346k247K4322R0533K95164
16964B70806O3448j44015M4304m2857r5353O9013L4187n6535o4567j61132J09320
16953B6619j06651m2412J28822R8389r2098j46593k3535J97049N5198j23738n6931
16942h5881P5423J72128m2180r9003O3263r2111n9827n4070J03136K2103r1261
16931h8280j37649J16712R4632J9991k31111k4741J19824j53503M911K5738R8321
16920a55155Q963J5719J48508K7425o2653j19138L6722l527q6989m1479R1902
16909a39702r3318k977L4478q2006m0198Q5513J31289J97238P2462L441j43552
$$ plain form
16986 70811 102903 -2740 -96921 -87953 129255 237838 5798 126137 342171 334669 236091
16975 236091 185391 270121 386338 321366 244137 380 -136966 -139213 -114891 -24358 270806
16964 270806 334254 190239 234543 191686 96333 165346 199533 142998 78431 -82701 26619
16953 26619 -80032 -122444 6378 104767 12669 -133924 -157459 39590 94788 -28950 -85881
16942 -85881 -10458 161670 119490 20487 83750 -8361 -68188 -122258 -19122 2981 -88280
16931 -88280 -225929 -109217 -14585 5406 -225705 -250446 -130622 -284125 -279214 -253476 -155155
16920 -155155 -146192 -130473 18035 45460 -17193 -136331 -99609 -103136 -190125 -231604 -139702
16909 -139702 -233020 -235997 -201519 -283525 -323723 -238210 -106921 90317 162779 166220 22668
16898B2668K35893P1353n4335j88174k9529P4156j34974j93583p8527j7343L7950
16887b54445r3721M4599J38017n36j020l9048N369Q4991P980Q7463J69093n036
16875A43706J96002p1248j96856o7510P6100J06103j61249k36418K5907j5640
16865b01103L2059N0924n8676q8496J03496K10543R9685r6489K6405r6390n315
16854b3357N0268k7634M5992R476j03974J2908L4847k5872j5246Q8631N5516J4055
16842A15610N7353o7357j42745k3563J15593m2317j32920Q4451R4165J28914j27502
16831E9682p3166J43305J36240m1560m417j25539Q2902L8690Q5162n7371j55174
16820H8754k1124Q9570P6160l2649k15048l884K3030o8451j76284l6702J00535
$$ plain form
16898 22668 258561 329914 275579 87405 57876 132032 -2942 -196525 -275052 -292395 -254445
16887 -254445 -348166 -303567 -165550 -166086 -167106 -206154 -200785 -115794 -107814 -20351 148742 143706
16875 143706 339708 268460 71604 4094 80194 186297 25048 -211370 -185463 -201103
16865 -201103 -169044 -118120 -176796 -265292 -161796 48747 148432 51943 78348 -18042 -23357
16854 -23357 26911 -723 45269 54745 -49229 -36321 -1474 -27346 -42592 46039 101555 115610
16842 115610 172963 105606 -37139 -60702 54891 12574 -120346 -35895 58270 187184 59682
16831 59682 -13484 129821 266061 224501 220084 94545 177447 216137 301299 243928 88754
16820 88754 67630 157200 233360 200711 -14337 -18221 4809 -63642 -239926 -276628 -176093
16809a76093l516k9368M0768J49643J17671O3899j7154j48409M4257J71214N323
16798B18235R831p4477l9890K09012J1275p0425j26558O851J65893R0808k5709
16787C74846j93819q0091j4064l4731j18739N135Q0675Q2924K223n8152M749o0028
16775i072J51268K25707p3622j9575j23154j34961l7077o6442n5600P3000k2045
16764i1573M9655P5473p9085J97294O2453Q3023p9861n8438J1897j17075j44325
16753i0562j0873M929j64505j59704J10144K78676r0031m5515m2576m2126K8807
16742b23336j62902J39074J28302O5372q3811j74985Q1638K10035J13181r077
16732H3491o4797j831r7659M84m6675J76578J26044p0064p7269j5483J7653o481
$$ plain form
16809 -176093 -179609 -208977 -168209 -18566 99105 163004 145850 -2559 41698 212912 218235
16798 218235 228066 153589 113699 322711 333986 263561 137003 143854 309747 400555 374846
16787 374846 181027 100936 86872 52141 -66598 -61463 19212 102136 104359 46207 50956 -9072
16775 -9072 142196 367903 294281 274706 151552 16591 -20486 -86928 -142528 -69528 -91573
16764 -91573 -41918 33555 -45530 151764 214217 297240 217379 158941 170838 53763 -90562
16753 -90562 -101435 -96506 -261011 -420715 -310571 -31895 -121926 -167441 -210017 -252143 -223336
16742 -223336 -386238 -247164 -118862 -53490 -137301 -312286 -230648 -20613 92568 83491
16732 83491 18694 16863 -80796 -80312 -126987 49591 175635 105571 28302 12819 30472 23991
16720B3991R1160K4728j49590Q8022R9590j37909q2540J02882j3043j61305Q1460
16709c2554Q1188j0624m6779n0866n7007J45602j142J38944P851j86812r9301
16698a11500J23169J37908r8318j70318R845M1637o4774j14372J85348O8769R1493
16687I8887K249k62330j21862R9370N3028j0522r3654O0595J96787j33687L9220
16676g1919M0693L3797M6142O477j59823r7418j9541J37307o3536l9649l4496
16665b21966M1103J50071L8269j39708R872l4301L2154N197J95122M0544J20056
16654B36413l7480o9843j71685j16655J30820k4833j28064o1720j1947K02824
16644e2170J09569j25628j68916M5348J05332J17587L4646j150M5545N2042M834
$$ plain form
16720 23991 115151 139879 -9711 78311 177901 39992 -42548 60334 47291 -114014 -32554
16709 -32554 48634 38010 -8769 -59635 -116642 28960 27818 166762 174613 -12199 -111500
16698 -111500 11669 149577 51259 -119059 -109214 -67577 -132351 -246723 -61375 7394 98887
16687 98887 101136 -161194 -283056 -183686 -130658 -141180 -234834 -174239 22548 -111139 -71919
16676 -71919 -31226 2571 48713 55190 -104633 -202051 -221592 -84285 -147821 -187470 -221966
16665 -221966 -180863 -30792 7477 -132231 -122359 -156660 -124506 -119309 75813 116357 236413
16654 236413 198933 129090 -42595 -159250 -28430 -53263 -181327 -243047 -254994 -52170
16644 -52170 57399 -68229 -237145 -191797 -86465 31122 65768 64618 110163 162205 167039
16633A67039j53105j03143q1359M8777j02514J6977J13405K0682j30986L2174
16623a72053J12132j39630J35251J25690J51727j04342K8729m6471k8184j15096
16613e2247q558O3292M8599j14331n6543J43223L5602n6709L5438o8449k3427
16602e4110K09478J09976j81064j43830k8977k1294q7794L6812K51265P6092q8447
16591G8107o3476P2322r8541k22683p292j83490N7199J44450r6695n8081J63343
16580b14837K00219o8364j5091J12760n140j47479n6644m292O9084K07178j3469
16569F3925Q9902k1493j93087p4179j4680j02117M4505J60358k0226K7151P0076
16558C0135Q5044j0977j15651n4781J24351K1696l8410j19950k60244k4596J97951
$$ plain form
16633 167039 13934 -89209 -170568 -121791 -224305 -207328 -93923 -73241 -204227 -172053
16623 -172053 -59921 -199551 -64300 61390 213117 108775 137504 91033 62849 -52247
16613 -52247 -60805 2487 51086 -63245 -119788 23435 59037 2328 37766 -30683 -54110
16602 -54110 155368 265344 84280 -59550 -88527 -109821 -197615 -160803 90462 166554 78107
16591 78107 14631 86953 -11588 -234271 -241563 -425053 -367854 -223404 -320099 -378180 -214837
16580 -214837 -14618 -82982 -98073 14687 9547 -137932 -194576 -198868 -129784 77394 63925
16569 63925 153827 132334 -60753 -134932 -149612 -251729 -207224 -46866 -67092 -39941 30135
16558 30135 115179 104202 -11449 -66230 58121 79817 41407 -78543 -338787 -363383 -165432
16547a65432O6984j06118q8992K16371K23979q9496j43636m4574J7201m4372k3
16536a58108J72177K7740r9863k79100k52761P3191J43737N7310J06672J76133
16526c2872L5300j36425m9978J7955J07222J08192o9386O738j5756j40765m5090
16515b14865O7753K6927Q4379P7568M4803J93917j20206j28714L1064j0416r44
16504E1266l8496o1513P2324Q931J51803r1690j99050L2220J06300L7691j45479
16493g5693p0622R1361K1693l8901r1763m8394k9076L3171M1837L1703O2030j0168
16481h2822m8040K3644N9372J29256R3242k1028p8039Q1091Q043m0104q8094N5023
16469I1544j00191j20182L5064J89585q1224l7159k7160Q6219J66969p1823k7005
$$ plain form
16547 -165432 -98448 -204566 -293558 -77187 146792 57296 -86340 -130914 -113713 -158085 -158108
16536 -158108 14069 41809 -58054 -337154 -589915 -516724 -372987 -315677 -209005 -32872
16526 -32872 2428 -133997 -183975 -166020 -58798 49394 -19992 -13254 -29010 -169775 -214865
16515 -214865 -147112 -120185 -35806 41762 86565 280482 160276 31562 62626 52210 51266
16504 51266 12770 -48743 23581 32512 184315 92625 -106425 -74205 32095 69786 -75693
16493 -75693 -146315 -54954 -33261 -72162 -163925 -212319 -241395 -208224 -166387 -134684 -72654 -82822
16481 -82822 -130862 -107218 -47846 81410 174652 153624 75585 156676 164719 124615 36521 91544
16469 91544 -8647 -128829 -93765 95820 14596 -22563 -49723 36496 203465 131642 104637
16458A04637j3850q1114j26241J1837p9006L1469K917l3662J6385J31628k3344
16447e8344J8887K4433R1663N5290J13852J0221j30249j35103J72101J02233j70694
16436I4290q897N6862r4053n0946n2667L9974j2694J29964j87006q664J91289
16425I7452N1923p0532o8230N6000p5571O2666p6678q2242o3361P4288k3498j47338
16413b65121q0250K06772L7686m2826j71538O5294p107J27087J92387j50088J16908
16402B9204K527J00997m7955j01386P4946r9305J31227J34062j03054m0585N0039
16391A30717j1077j26126R5763K1834R7119m5218k92129j8925J20878M9282M1348
16380F3466q06r694n2387j13844L8834J52617K4127n452n8775n9530R2566o2689
$$ plain form
16458 104637 90787 9673 -116568 -104731 -183737 -152268 -149351 -183013 -166628 -35000 -58344
16447 -58344 -39457 -15024 76639 131929 245781 256002 125753 -9350 162751 264984 94290
16436 94290 85393 142255 48202 -2744 -55411 -15437 -28131 101833 -85173 -93837 97452
16425 97452 149375 78843 10613 66613 -8958 53708 -22970 -105212 -168573 -94285 -117783 -265121
16413 -265121 -345371 -138599 -100913 -143739 -315277 -249983 -257090 -130003 62384 -87704 29204
16402 29204 31731 132728 84773 -16613 58333 -40972 90255 224317 121263 80678 130717
16391 130717 119640 -6486 89277 111111 208230 163012 -129117 -148042 -27164 22118 63466
16380 63466 62660 52966 579 -113265 -74431 78186 102313 96861 38086 -21444 71122 8433
16368H433p023k7050j04881n8931o748J26051n8771j3564L6547O9365o4817O1651
16356c9738n2105O3544O0845r4563o704K5934j75986N1086M5400r5365J20655
16345i6997l8799L4268p1610j06498o7669J67760J59630q6497O3121R4469k513
16334D8665j01429P982p5384N2132j36734n9045J29186K04654O026K7864k2609
16323H1308j4413L5369n4026n2775k511p7062P5399r7608p5650J45856J28044
16312I1931J812P3549J15854Q076q3172q5969P6456P594j51175j94790j2019J55047
16300C194j20458J4755J5746j12389j20803j73744P0956J45343J76805J72084
16290G1489R7086p5099k23208k26147J49321J65239M2181Q7200O3701K06304N6134
$$ plain form
16368 8433 1410 -25640 -130521 -189452 -196200 -70149 -128920 -142484 -105937 -36572 -101389 -39738
16356 -39738 -91843 -28299 32546 -62017 -68721 -42787 -218773 -167687 -122287 -217652 -96997
16345 -96997 -135796 -101528 -173138 -279636 -347305 -179545 -19915 -106412 -43291 51178 48665
16334 48665 -52764 -44782 -120166 -68034 -204768 -263813 -134627 70027 76053 103917 81308
16323 81308 66895 102264 48238 -4537 -7048 -84110 -8711 -106319 -181969 -36113 91931
16312 91931 93743 167292 283146 291222 208050 122081 198537 206131 54956 -139834 -151853 3194
16300 3194 -117264 -102509 -86763 -199152 -319955 -493699 -422743 -277400 -100595 71489
16290 71489 168575 93476 -129732 -355879 -206558 -41319 862 88062 151763 358067 414201
16279D14201n5998p2899n7901O853R522j18037j691j8897n0178k1014L4804J12278
16267A81043m009r1412k2116M7434p6303r6198o6306k779Q3783J16612O2820q107
16255A24462j68175o9538l4669J08359J45399J87308j44674j34944j36552j7422
16245a40446K20092J27059m0700L8831j09248o9219N8750l3268Q038R0378K45283
16234C95550K3845l9657j84848n1926R3546n1768N1783k6183j46043k62383l3798
16223b31882K35360M290o4425O1009M4595M1696l9265P0731k9834O6669k9173
16212A29771k13381j79098l29911j00262J69276J91084J20349P0824N3747M1908
16202d5693j45053r6220K6830m6722l6261P7426J64684N4922k3135k69827k4113
$$ plain form
16279 414201 358203 285304 227403 234256 243778 125741 124050 105153 54975 33961 68765 181043
16267 181043 177034 85622 63506 110940 34637 -61561 -127867 -130646 -46863 69749 132569 124462
16255 124462 -43713 -113251 -147920 -39561 105838 293146 148472 13528 -123024 -140446
16245 -140446 79646 206705 166005 204836 95588 26369 85119 51851 59889 150267 395550
16234 395550 419395 379738 194890 142964 236510 184742 236525 210342 64299 -198084 -231882
16223 -231882 3478 7768 -56657 4352 48947 90643 51378 122109 92275 158944 129771
16212 129771 -83610 -262708 -592619 -692881 -523605 -332521 -212172 -141348 -87601 -45693
16202 -45693 -190746 -286966 -260136 -306858 -343119 -265693 -101009 -46087 -69222 -339049 -363162
16191c63162K02025J85973J40785j66754K2808k8433l7772K5923q9579R5387R4505
16180H1706n625P5411R5296j2888Q6011n9390r7041k9509O7250r3872O7727N4668
16168B29744j68436o721n7253n1999l0928m8863k0163J6569j08065L9877J26630
16157g9608j79890L8539J86884P7967k1147O897M8266n4297o3472J5841M6135
16146B2115j24626J70165J82255k02889j13227n5552J1438J06449p393L6837n7177
16135c1605o3947Q6034J3996l6023J21628m8918j22180n8318n2548O0181P0984
16124f0716J6929J02602Q9606J250l2872j19396l3942K79168j9003j33428J9895
16113A10093J02499j9649j29311p7802J02228o1794j41512M169J26137N141M2779
$$ plain form
16191 -363162 -161137 24836 165621 -1133 21675 -6758 -44530 -18607 -108186 -12799 81706
16180 81706 76081 151492 246788 233900 319911 260521 163480 133971 201221 107349 175076 229744
16168 229744 61308 54587 -2666 -54665 -85593 -134456 -154619 -138050 -246115 -206238 -79608
16157 -79608 -259498 -220959 -34075 43892 22745 29642 77908 23611 -39861 -24020 22115
16146 22115 -102511 67654 249909 47020 -66207 -121759 -110321 -3872 -11265 25572 -31605
16135 -31605 -95552 -9518 4478 -31545 90083 41165 -81015 -139333 -191881 -131700 -60716
16124 -60716 -43787 58815 148421 149671 116799 -2597 -36539 242629 223626 90198 110093
16113 110093 212592 192943 63632 -14170 88058 26264 -115248 -111079 15058 20199 62978
16102F2978p3268p4185k5619J30947K6541k1636j45977k77647k9775J79010J49126
16091i9505O7979j6601O3999r9783q3964j06324l1774R2509K65359O4731J29807
16080B46433j54142m0236n2805r7873P2876M6365J0522L8197k6122q3724k2057
16069f2566J9897M822m1830o5562j13482L4932J6926J50751o411K6149p9377o3372
16057a79123J01571O8219n2575R3120J82472n1022K2301j20347j64282l9266J09300
16046b9632J57540k6455n6198P3486N7583k118P7148j07492j30900m8631O723
16035b8946P0116o2633K5271J06122K5809j30639N5314P5642j88652r6021J9103
16024a29514j24364P4526J60493O8137P3401N2500Q7614q0078L846j50027j00558
$$ plain form
16102 62978 -10290 -84475 -110094 20853 47394 25758 -120219 -397866 -427641 -248631 -99505
16091 -99505 -31526 -48127 15872 -83911 -167875 -274199 -305973 -213464 51895 116626 246433
16080 246433 92291 52055 -750 -98623 -25747 20618 31140 69337 43215 -40509 -62566
16069 -62566 -42669 -37847 -79677 -145239 -258721 -223789 -206863 -56112 -62523 -36374 -115751 -179123
16057 -179123 -77552 -9333 -61908 31212 213684 162662 184963 64616 -99666 -138932 -29632
16046 -29632 127908 101453 45255 118741 176324 174206 251354 143862 12962 -35669 -28946
16035 -28946 41170 -21463 3808 109930 135739 5100 60414 136056 -52596 -148617 -129514
16024 -129514 -253878 -179352 -18859 49278 122679 175179 262793 182715 186561 36534 -64024
16013f4024p4478J29329J42982k7028j81260j5070k2484L7671r1992j22338R3811
16002a94881J05771o3471L4244P3384j80050J0499j28464q0839J27774J9742o141
15991b82432K3805K93008L6300j53683K4411r351j05414K9209m3488Q5133M0055
15980f2447J39217L9335j03840j68606R1677N4261O2709j1419j5451P2270O9702
15969A67408j27668j16552M202r0018K7739J93445m908p168p0660L494N0527n6457
15957b6616m0567N2479j11881p8769L8176p5953j69769r3675m5966Q1728J29174
15946c41639K88836K6796l7638N7345R2877l9826j84979j86410N8572Q8267J51241
15935b6558L9032l3633k6918M4631J81145l0584j36028m7765L1522k5291r532
$$ plain form
16013 -64024 -138502 -9173 133809 106781 -74479 -89549 -112033 -74362 -166354 -288692 -194881
16002 -194881 -89110 -152581 -118337 -44953 -225003 -214504 -342968 -423807 -296033 -276291 -282432
15991 -282432 -258627 34381 70681 -83002 -58591 -67942 -173356 -144147 -187635 -102502 -62447
15980 -62447 76770 116105 12265 -156341 -64664 -10403 52306 40887 25436 97706 167408
15969 167408 39740 -76812 -72610 -162628 -134889 58556 53648 46480 -24180 -20686 29841 -26616
15957 -26616 -67183 -14704 -126585 -205354 -167178 -243131 -412900 -506575 -552541 -470813 -341639
15946 -341639 -52803 -26007 -63645 -6300 86577 46751 -138228 -324638 -266066 -177799 -26558
15935 -26558 12474 -21159 -48077 -3446 177699 147115 11087 -36678 -5156 -30447 -39979
15924c9979r603J0666J51377k4386j39551N8790N5937K60076J43443n7825P3848
15913D82793j68609j43853q6901n3566J11380p1066p6871N0894k6004p8162Q4390
15902B4425R7554J6899j52451J87446L4614j62822M8236J15105j08317j23483
15892b2794N6533q9701p7920N7922M2877K32077m1508j11784N9408l8795j52704
15881h6389q1541p9090Q8044R7610q7344m6122P3577N4122J77214j2316m1674
15870E6091N5591N2678M7679J4700M0431J03188j74243j28649q1215P7633L6719
15859A00603L3408J9983r7651j4584J0738j5704J2403j5176J09102l1006j06894
15848E222l9707J08243L638m5737l124R5558k5425n5857K7376j60351l2295J30818
$$ plain form
15924 -39979 -49582 -38916 112461 88075 -51476 7314 63251 323327 466770 408945 482793
15913 482793 314184 170331 83430 29864 141244 70178 -6693 44201 18197 -59965 24425
15902 24425 121979 138878 -13573 173873 208487 45665 93901 209006 100689 -22794
15892 -22794 33739 -55962 -133882 -75960 -33083 198994 157486 45702 105110 66315 -86389
15881 -86389 -167930 -247020 -158976 -61366 -148710 -194832 -121255 -67133 110081 97765 56091
15870 56091 111682 164360 212039 226739 267170 370358 196115 67466 -13749 63884 100603
15859 100603 134011 153994 56343 41759 52497 36793 49196 34020 143122 112116 5222
15848 5222 -34485 73758 77396 31659 28535 124093 98668 42811 70187 -90164 -122459 8359
15836H359O0957P0836N2336n0467j80967o8981o6821p0670J73379J44286O098
15825G8345o4041j4621l9967j05846o2362J17200J3998J7319O5135m0695r2844
15814a28379J9019J42817l4063j30110q716J11702L836j3308R6177R4283j18846
15803C4412j14590q3999j7321j06046J4997J03977J43206j0955r8592o05l7978
15792a73494K02581J13087J7931l5744o9370r1780J37659O2953l04503p3447O8993
15781a45134K2752N6703m7693j90753R7765Q0276Q0554J52596j30646j21413K5034
15770a19959n5854j25599O4965l4714j8073K00981J8892r5757K35442J88003r8749
15759A59578P9070p4781j23456q7773j13671k28691L4014J15915m5860l7656k9481
$$ plain form
15836 8359 69316 140152 192488 142021 -38946 -107927 -174748 -245418 -72039 72247 78345
15825 78345 14304 -317 -40284 -146130 -208492 -91292 -77294 -59975 5160 -35535 -128379
15814 -128379 -109360 33457 -606 -130716 -139432 -27730 -23894 -37202 58975 153258 34412
15803 34412 -80178 -164177 -181498 -287544 -272547 -168570 -25364 -36319 -134911 -135516 -173494
15792 -173494 29087 142174 160105 124361 54991 -36789 100870 163823 -140680 -214127 -145134
15781 -145134 -122382 -65679 -113372 -304125 -206360 -126084 -45530 107066 -23580 -144993 -119959
15770 -119959 -175813 -301412 -236447 -271161 -289234 -88253 -69361 -165118 70324 258327 159578
15759 159578 238648 163867 40411 -47362 -161033 -389724 -355710 -239795 -285655 -323311 -352792
15748c52792L6578Q7505R7635J23371O6599J15938k20631j6386R205r4426q1167
15737b28571j5877J26596j59554j3941K26053O4699r2390J55768l239n443o5315
15726a1214l9583j90981L5185J79652J3866j38190P0049k4509q669O85N3230Q845
15714e1634j38328j53500J51808J21247J12994q424J8289r711j12027j68709M0474
15703a97521J02367K2413O0674k2503K3375r2703l8673J21201K9029r3859j51457
15692b37657K07477J09981p0857l0315J21965J32683j04676p4907J75533j40318
15682H8909k07R4000J6574j53014p8103P5722j6315k3730Q9957q1853k9615J39633
15670A21958N1300K5354k6424J07486N0815j28452k15703n8111O1206P351l5856
$$ plain form
15748 -352792 -316214 -228709 -131074 -7703 58896 174834 -45797 -62183 -52978 -147404 -228571
15737 -228571 -244448 -117852 -277406 -291347 -65294 -595 -92985 62783 59544 54101 -11214
15726 -11214 -50797 -241778 -206593 -26941 -13075 -151265 -81216 -105725 -114394 -113709 -60479 -51634
15714 -51634 -189962 -343462 -191654 -70407 42587 34163 52452 42741 -69286 -237995 -197521
15703 -197521 -95154 -72741 -12067 -34570 -11195 -103898 -142571 -21370 7659 -86200 -237657
15692 -237657 -30180 79801 8944 -21371 100594 233277 128601 53694 229227 88909
15682 88909 88702 182702 199276 46262 -31841 43881 27566 3836 93793 11940 -17675 121958
15670 121958 173258 198612 172188 279674 330489 202037 -13666 -71777 -10571 -3220 -39076
15659c9076j77180R507p7350L054J28952Q7369O6561J43898q8369p5765n1445
15648f9844p9079J56028J43754j64614R635R0390K52247N8874j49398l1301j33660
15637H3032j21578l1904o2377Q2150K11927j47300k19328m34K0121M3873M3839
15626i7979j58890p1380n9980M4140J35159J03600j38690l7157J07228K8864J04212
15615d0873K32775j9837j08890q78J3580J5856j0039j34896K9781J26997n4659
15604D8917L3252j58241k31210P7404K16750J01553n4641r9326P8744j22693k1377
15593a30868K18293n0362m4619O4611J3788p8423k9429j9530j33989K3688J93475
15582B6635n6723j17111J46796J07055j40639p0102P3254R6524o4223j88096N2306
$$ plain form
15659 -39076 -216256 -206749 -284099 -281045 -152093 -64724 1837 145735 57366 -18399 -69844
15648 -69844 -148923 7105 150859 -13755 -4120 86270 338517 397391 247993 216692 83032
15637 83032 -38546 -70450 -132827 -50677 161250 13950 -205378 -205812 -185691 -141818 -97979
15626 -97979 -256869 -328249 -388229 -344089 -208930 -105330 -244020 -281177 -173949 -145085 -40873
15615 -40873 191902 172065 63175 62297 75877 91733 81694 -53202 -23421 103576 48917
15604 48917 82169 -76072 -307282 -229878 -13128 88425 33784 -65542 13202 -109491 -130868
15593 -130868 87425 37063 -7556 57055 70843 -7580 -37009 -56539 -190528 -166840 26635
15582 26635 -30088 -147199 -403 106652 -33987 -104089 -30835 65689 1466 -186630 -134324
15571a34324J64578o2406j58536K9069K6799k5363L3173J17883J4975m9128r5754
15560a39034P5724J01999L6585j85606O6077N3543J9197j15869N0385J57653J4422
15549A35076q4246o8221m4976J8806K6469L5758r2068Q6824l3655j31669o1798
15538b13700J0761o2871q3792K00972K29299K428j63310n9014N7558K2627o7766
15527a26808P9111q2841r8962J08027N509J17632L9421j0013j02265j53217J88756
15516c5650N6686J53971L3373k44399p8807K16034j9305j8966q9909k8127N8045
15505B946J1827j2728O7880n2068j1440K0527j431j0256k3689k0189J34079M5635
15493A51093l12975j21199J83941K61705R485j59144o1132k4522R5032M5906j5288
$$ plain form
15571 -134324 30254 -32152 -190688 -161619 -134820 -160183 -127010 -9127 5848 -43280 -139034
15560 -139034 -63310 38689 75274 -110332 -44255 9288 28485 -87384 -36999 120654 135076
15549 135076 50830 -17391 -62367 -43561 -17092 18666 -73402 13422 -20233 -151902 -213700
15538 -213700 -202939 -265810 -349602 -148630 80669 83097 -80213 -139227 -81669 -59042 -126808
15527 -126808 -47697 -130538 -229500 -121473 -115964 1668 41089 31076 -71189 -224406 -35650
15516 -35650 21036 175007 208380 -36019 -114826 101208 81903 62937 -26972 -55099 2946
15505 2946 14773 2045 69925 17857 6417 26944 25513 15257 -8432 -28621 105458 151093
15493 151093 -161882 -283081 -99140 162565 172050 12906 -48226 -72748 22284 68190 52902
15482E2902K41898l8088j81961K8035J23815j3145q5333q5522N4634N1456p0360
15471G8331K8881j98681q4534K6878J6896p061P02j3917j6487j5064j21519P1623
15459b33952j3236j3788J99284J33784j25706k78983K7337J92401O9428j5496
15449e8927M8164J1738P314J32j03646k709R7003P1546p6685M2726o8583j16728
15437a48655J12549K3405p1491N2732O1231q4165q9691L4231j29085P9178J36766
15426b2995q5907L7860J05787p8906j04991o6710P25M0013L6665r1197J8182j3395
15414b24869p4849J49982Q1799r380n1328O1133J07561R3598r5129n4513J6918
15403I23R4911k07084r0193K02188J37070O3301l9259j45749p6727m0080j07338
$$ plain form
15482 52902 294800 256712 74751 102786 226601 213456 128123 42601 97235 148691 78331
15471 78331 107212 -91469 -176003 -149125 -132229 -139290 -138588 -152505 -168992 -184056 -305575 -233952
15459 -233952 -247188 -260976 -61692 72092 -53614 -332597 -305260 -112859 -43431 -58927
15449 -58927 -10763 975 8289 8421 -95225 -97934 -931 70615 -6070 36656 -31927 -148655
15437 -148655 -36106 -12701 -84192 -31460 29771 -54394 -144085 -109854 -238939 -159761 -22995
15426 -22995 -108902 -71042 34745 -44161 -149152 -215862 -215137 -175124 -138459 -229656 -211474 -224869
15414 -224869 -299718 -149736 -67937 -77317 -128645 -67512 40049 133647 38518 -15995 923
15403 923 95834 -111250 -201443 745 137815 201116 161857 16108 -60619 -100699 -208037
15392b08037L8482K5214N2190n9452o2448q5298q35n231q535n4403J1521O9824
15380b87008J23663O3246K9462p1519K5676k7001r224r9474L4324L8413o3599
15369b43041j77408K1907K23234Q9783o9674M3632J48539J29509m5343p6234K11626
15358B56530j62812q0172J24650j34047M5480j9343N316J49386L0941M983n8643
15347A62269p6884o4450M3451L0278m4858j82394q1632k2230j68482L04803J93026
15336I2897j49870Q60L8646j3226p9322P8790N2462L1076k198P7970M0942m1006
15324A28021k8547J2040o0547J8410N20k2153p0575J04992j9691M8922M4535j70255
15312a4328j7133J47104o398O950m6466n359J49011k31942j57422J75085J84144
$$ plain form
15392 -208037 -169555 -144341 -92151 -151603 -214051 -299349 -300184 -305415 -313950 -368353 -356832 -287008
15380 -287008 -163345 -100099 -70637 -142156 -116480 -143481 -152705 -252179 -217855 -179442 -243041
15369 -243041 -420449 -398542 -175308 -85525 -155199 -111567 36972 166481 121138 44904 256530
15358 256530 93718 13546 138196 4149 49629 30286 35602 184988 215929 220912 162269
15347 162269 85385 20935 64386 94664 49806 -132588 -214220 -236450 -404932 -100129 92897
15336 92897 -56973 -56113 -17467 -30693 -110015 -31225 21237 52313 50115 128085 169027 128021
15324 128021 99474 111514 50967 69377 69897 47744 -22831 82161 62470 111392 155927 -14328
15312 -14328 -31461 115643 109245 116195 69729 64370 213381 -18561 -175983 -898 183246
15301A83246r4993p1894n7096J3648j11854m8712n0341N4635J0948R9354L3978
15290c9081q2336K3530Q4544K7879N8635q3939j44124j1027j03062j1166J7275
15279b62872J9072N435k3535M10j7357K40599K45063m2397n5302J16438L3864
15268B59418k08584j9739J4312j37553J801K9674m2992q8214m5272n5677j2761
15257c05587J8925Q7335Q8487J28498j97910N4234Q3041q6166k2052J01978J18251
15246F9034J02291r1620n9723N3107J141j99599l9620R3854O1758p9275q4180
15235a72832Q5617J60702m5481j36435l1507J48784J6302j71420n3853j0493l4459
15224b45075m008O9057J52526m3487q1097J3578M2824m897j29746N8683J382m0934
$$ plain form
15301 183246 88253 16359 -40737 -27089 -138943 -187655 -237996 -183361 -172413 -73059 -39081
15290 -39081 -121417 -97887 -13343 14536 73171 -10768 -154892 -165919 -268981 -280147 -262872
15279 -262872 -243800 -238365 -261900 -261490 -278847 -38248 206815 164418 109116 225554 259418
15268 259418 50834 31095 45407 -92146 -90345 -60671 -103663 -191877 -237149 -292826 -305587
15257 -305587 -286662 -199327 -110840 17658 -180252 -126018 -42977 -129143 -151195 -49217 69034
15246 69034 171325 79705 19982 73089 74230 -125369 -164989 -71135 -9377 -88652 -172832
15235 -172832 -87215 73487 28006 -108429 -139936 8848 25150 -146270 -200123 -210616 -245075
15224 -245075 -249083 -180026 -27500 -70987 -152084 -138506 -95682 -100579 -230325 -171642 -170260 -211194
15212b11194M9560J15556k5235o7419L2085Q2866K22080j08517j64224k3091j37178
15201b34711J2414K8460J4871p799M4658K59M6701L678J33866J67559k3349K3134
15189B09741j29659p5490J6975K9400o9723K1353j5921j20155j5979K6987N6172
15178f6299n5881q1520j25660p6786K87165J67232j03313M6951M5112j06144j83232
15167b52375p6716O8253J10410k49364N4407K40493k9193j53956j461Q7870O3728
15156a37904k9420l4103m5083o4089J10042N8394J56658J82143m7750J3774q3515
15145G9147j81221r2166P8209J14444q3432q948J22466j32j99798o711l5094Q7072
15133a26164J2695l0286N642l044j2250J05611R958n0357O953k9415j31842N1043
$$ plain form
15212 -211194 -161634 -46078 -71313 -138732 -106647 -23781 198299 89782 -74442 -97533 -234711
15201 -234711 -222297 -193837 -178966 -186765 -142107 -141848 -95147 -91469 42397 209956 186607 209741
15189 209741 80082 4592 21567 50967 -18756 2597 -13324 -133479 -149458 -122471 -66299
15178 -66299 -122180 -203700 -329360 -406146 -118981 48251 -55062 -8111 37001 -69143 -252375
15167 -252375 -329091 -260838 -150428 -399792 -345385 -104892 -134085 -288041 -289502 -201632 -137904
15156 -137904 -167324 -201427 -246510 -310599 -200557 -142163 14495 196638 148888 162662 79147
15145 79147 -102074 -194240 -116031 -1587 -85019 -93967 28499 28367 -171431 -178142 -213236 -126164
15133 -126164 -113469 -143755 -138113 -141157 -153407 -47796 -37838 -88195 -81242 -110657 -242499 -191456
15121a91456J95649M126J68705J0957j63798j54728J40718O8710N3313j2387p3225
15110D6584n4128k9069n108K62892q712j42421j3896j57070M0422m3691p8860
15099a83057q8088k1203j89189m7858K4893K23890K74227l1522j50063P7800q3834
15088a94004j71837J4386M5755O9028k2087J66656K6274K6717n8079r7830P7666
15077a17355J90693R4029j15799n8952p7016q3897R3443q4384O214L5141J33294
15066A5411j39193J99670m2257q8237j09388o0206M5646k630k3525J83524O2576
15055D1391J0124O0906p6493Q22j989K73334l4665l13166j33057r9702p8273m3416
15043c94184J09020R6895J10373L6622m9059j43360n4981m4655Q9718J66644J61101
$$ plain form
15121 -191456 4193 8319 177024 187981 24183 -130545 10173 78883 132196 119809 46584
15110 46584 -7544 -36613 -41721 221171 212459 70038 56142 -100928 -60506 -104197 -183057
15099 -183057 -271145 -292348 -481537 -529395 -504502 -280612 -6385 -37907 -187970 -110170 -194004
15088 -194004 -365841 -351455 -305700 -236672 -258759 -92103 -65829 -39112 -97191 -195021 -117355
15077 -117355 73338 167367 51568 -7384 -84400 -168297 -74854 -159238 -153024 -117883 15411
15066 15411 -123782 75888 33631 -54606 -163994 -224200 -178554 -181184 -204709 -21185 41391
15055 41391 51515 112421 35928 36750 34761 308095 273430 -39736 -172793 -272495 -350768 -394184
15043 -394184 -285164 -188269 -77896 -41274 -90333 -233693 -288674 -333329 -243611 -76967 84134
15032H4134k9911J493j3965l07248o8781K69450M8223j01214R267j47913p520
15021b63985Q2864O5998j04193k1278J25775J84861J20236n427p6167j41954J66033
15010A32763J19931j82686j48076n1816K1810K6702L2354J37740k6188j10537
15000d8003P1175j8510m4735l7588o613J16831n723O4598N2904j01863q4102O2755
14988B1126p6621o5145j3348J8557L1741k1654r7341k4289j17628L6603K82885
14977b5114J26389j46726m71O5649q5417O2361n6891O1558J65244M2282j8919
14966A89945j5567l1684N0190J24002q9657j46751J21003M7048N5774l655j39898
14955A60750j68567m5222k6393j6405Q1073P5004J5789M6843p4672j79809m6741
$$ plain form
15032 84134 54223 55716 41751 -265497 -334278 -64828 -16605 -117819 -108552 -256465 -263985
15021 -263985 -181121 -115123 -219316 -240594 -114819 70042 190278 184851 108684 -33270 132763
15010 132763 252694 70008 -78068 -129884 -108074 -81372 -49018 88722 62534 -48003
15000 -48003 23172 4662 -40073 -77661 -84274 32557 26834 91432 144336 42473 -41629 21126
14988 21126 -55495 -120640 -133988 -115431 -83690 -105344 -202685 -226974 -344602 -307999 -25114
14977 -25114 101275 -45451 -45922 19727 -65690 -3329 -60220 1338 166582 208864 189945
14966 189945 174378 142694 192884 316886 227229 80478 201481 248529 304303 300648 160750
14955 160750 -7817 -53039 -79432 -95837 -14764 60240 76029 122872 48200 -131609 -178350
14944a78350M0461l8841p1875J0344K60660p896j26455L4407L8211J42384N1240
14933A54290k09707R4890k9609k03258m9216O0579J14031J44651P1133R2701J27381
14922C67866k1906j62926m1911j5159j3545n6502q3298n3820k01665n8592M4541
14911b96917Q5234N3498J99455J05506m4992l543K7334M5523k06995l2087j2971
14900h0955j67977K08230R0146R7139j02808m0234o6399K6957J17812R4341k3857
14889A52395J47441r5569j59187O7212P7351Q0591p819J9377j07534j71712o7974
14878f5428J58258J35104q3407o2628R0421N5238p7630j09005j71159n1423J0021
14867a71638J14613J13146l6143P6316P2431M8622p5371j31755j31569l8252n3936
$$ plain form
14944 -178350 -137889 -176730 -248605 -238261 22399 14503 -111952 -77545 -39334 103050 154290
14933 154290 -55417 39473 9864 -193394 -242610 -182031 -68000 76651 147784 240485 367866
14922 367866 345960 183034 141123 125964 112419 55917 -27381 -81201 -282866 -341458 -296917
14911 -296917 -211683 -158185 41270 146776 101784 98241 125575 171098 -35897 -67984 -80955
14900 -80955 -248932 -40702 49444 146583 43775 3541 -62858 -35901 81911 176252 152395
14889 152395 299836 204267 45080 112292 189643 270234 262415 281792 174258 2546 -65428
14878 -65428 92830 227934 144527 81899 172320 227558 149928 40923 -130236 -181659 -171638
14867 -171638 -57025 56121 19978 96294 168725 217347 141976 10221 -121348 -159600 -213536
14856b13536J8542J33639p9845o2607J33234R279j09745L2049J36081J55392K0705
14845A73188r3426m9294j01109O3430N350j1811l3559R3898R3774r2451k2116
14834B5874j7931m0523L5616o3879K4241L9278p3127q8752M5544N3332R8988J43389
14822A82050O610p2610M3858j35995q6945J10676p6251j37438Q0609L6308n3226
14811a02354j9521m3005j1772J9696K24081n3807q0677J79189q0947k26072r5385
14800b90574j21036j06794Q9563J28796J65777K45095J47663j51542j0614Q4088
14790A80422k7663J2019O0419L0963L8677L3518j6194p602J7273R5947K2149j20471
14778C19457l7122R2922K17364J91937K31718J66976L2762k3582J26522K20339
$$ plain form
14856 -213536 -194994 -61355 -141200 -203807 -70573 -61294 -171039 -138990 -2909 152483 173188
14845 173188 79762 30468 -70641 -7211 -1861 -13672 -47231 46667 140441 47990 25874
14834 25874 7943 -32580 3036 -60843 -36602 2676 -70451 -159203 -113659 -60327 38661 182050
14822 182050 188660 116050 159908 23913 -63032 47644 -28607 -166045 -85436 -49128 -102354
14811 -102354 -121875 -164880 -176652 -156956 67125 13318 -67359 111830 30883 -195189 -290574
14800 -290574 -411610 -518404 -428841 -300045 -134268 110827 258490 106948 96334 180422
14790 180422 152759 164778 225197 256160 294837 328355 312161 304559 321832 417779 439928 319457
14778 319457 282335 375257 592621 784558 1016276 1183252 1216014 1192432 1318954 1539293
14768A539293J21010l2238J50573K33711j38312l02522k15614j19541k29900l25864
14758F80596k50830k34061l5397K11899P5254k00559j36638m7640n7823J20449
14748A25250N6823j8124N5947O62J50186K89047j3892p7917k4574J6138K4156
14737E83702J15732J15374J99623J81923K56135Q5309m1670j37531J4506K06470
14727A579573J15182l4216k36631j38093k86198j25025j67104j47710l8620j89532
14717C31626K8402M6421j06673o2145Q0057q5958q660P6211Q7295o6659j61783
14706A58134j33147N6038P5383p678k4397J08207j3788j39358j81138R4061K26425
14695B18742q0785l2187p85P8154Q6578k3672q5835j03286l8171j74550K5216
$$ plain form
14768 1539293 1660303 1628065 1778638 2012349 1874037 1571515 1355901 1236360 1006460 680596
14758 680596 429766 195705 160308 372207 447461 246902 110264 62624 4801 125250
14748 125250 182073 163949 219896 220558 370744 659791 645899 567982 543408 559546 583702
14737 583702 699434 814808 1014431 1196354 1452489 1537798 1496128 1358597 1373103 1579573
14727 1579573 1694755 1660539 1423908 1285815 999617 874592 707488 559778 521158 331626
14717 331626 360028 406449 299776 237631 317688 231730 223070 299281 386576 319917 158134
14706 158134 24987 81025 156408 148730 124333 232540 218752 79394 -101744 -7683 218742
14695 218742 137957 105770 104985 183139 269717 246045 160210 56924 18753 -155797 -130581
14684a30581Q2861l2025K2297R5370J42399P5846j23164k9387k8885j68113j63374
14673b56756L1181K07420K28365m4924Q1308o3093j19497j8022q3907j4707j0575
14662f3207p1164j54773Q4181K50123J56248o9652l7818l9263n2101J12418J14913
14651B29905o842k62407o7861o7250K9493Q9537l3414j97096J58221L10826R256
14640A92368O9285j39316P6490N5624j06614m3481j90308j70755R1776R4420J05227
14629C4716j94205j53182Q9755J71508k3488n4551k682J94185N6678j42794j11749
14618a35809K08242J24591P5323n5979o5063J6740J16272q5114p7903o730R0626
14607B05196j72929m4699K8114n2477M6338P3573J9868n6703l4269J74260J37050
$$ plain form
14684 -130581 -47720 -79745 -57448 37922 180321 256167 133003 103616 74731 -93382 -256756
14673 -256756 -225575 -18155 210210 165286 246594 183501 64004 45982 -37925 -52632 -63207
14662 -63207 -134371 -289144 -204963 45160 201408 131756 93938 54675 2574 114992 229905
14651 229905 223063 -39344 -107205 -174455 -144962 -55425 -88839 -285935 -127714 183112 192368
14640 192368 261653 122337 198827 254451 147837 104356 -85952 -256707 -164931 -70511 34716
14629 34716 -159489 -312671 -222916 -51408 -74896 -129447 -132129 62056 118734 -24060 -135809
14618 -135809 72433 197024 272347 216368 151305 168045 284317 199203 121300 114570 205196
14607 205196 32267 -12432 15682 -36795 9543 83116 102984 46281 12012 186272 323322
14596C23322o6673j75844j29949m7141K21628J30852m3718m198n0860R2298J04912
14585C54629Q800p8532k8239l0554n4858k4663m3106J46163N548J64817J69921
14574E89926j34980j89603q9198m4384R8133j5269j7258P1281K6741o2306j40564
14563I2519J6599P5206J38664N3942o7393P9839n9107j9058j25641j03805Q9704
14552A71469L4024R5236O4890n9201p4381o2288N0849j4840Q3514J18792o107
14541D01957j51483q4123j8616r2131m5159l2823J44061J61036r3307K1156Q4618
14530B95186j03476j5035m5068L3929j00327k7373J74450J89015j0469n9280K9095
14519C60647q1102p7176J09325k6996m5099l1685K7436j1020p4224R4470L03530
$$ plain form
14596 323322 256649 80805 -49144 -96285 125343 256195 212477 208279 157419 249717 354629
14585 354629 363429 284897 256658 226104 171246 146583 103477 249640 255188 420005 589926
14574 589926 454946 265343 176145 131761 229894 214625 197367 268648 295389 233083 92519
14563 92519 109118 184324 322988 376930 309537 389376 330269 311211 185570 81765 171469
14552 171469 205493 300729 365619 306418 232037 169749 220598 205758 289272 408064 401957
14541 401957 250474 166351 147735 55604 10445 -22378 121683 282719 189412 210568 295186
14530 295186 191710 176675 131607 165536 65209 37836 212286 401301 390832 331552 360647
14519 360647 279545 202369 311694 284698 239599 207914 235350 224330 150106 244576 548106
14508E48106J41851j61790j78818J0055J5986n0774o0893j28176l4268J65824
14498B67103J11120j14624k41372j10003J31157P1792m6378j7486N5747M9328
14488A56384j31284N0935J76894J23300n2177L6939M4009l2075j661k11526j62573
14477b835K62589L0813o0231P5181J96039R8693n9137k24803o0320j2067Q139
14466B52061J07505k0707r1650K3474p4733J4313J84240J21676j06984j37337
14456B71858K01843L7078k4848j8125p7482j03348j78976p1543R2700K10370O8671
14445D08198r4823R458l6997M7927m5932r5146O7162O1462N2348n8769N120O8035
14433C88043r4676j57113J9785L4577J11841J53842j06310j92744j60464J04803
$$ plain form
14508 548106 689957 528167 349349 359404 375390 324616 263723 135547 101279 267103
14498 267103 378223 263599 22227 -87776 43381 115173 68795 51309 107056 156384
14488 156384 25100 76035 252929 376229 324052 360991 405000 372925 371264 159738 -2835
14477 -2835 259754 290567 230336 305517 501556 600249 541112 316309 255989 243922 252061
14466 252061 359566 338859 247209 270683 195950 210263 394503 516179 409195 271858
14456 271858 473701 510779 485931 467806 390324 286976 108000 36457 129157 339527 408198
14445 408198 313375 322833 285836 333763 287831 192685 259847 321309 373657 314888 320008 388043
14433 388043 293367 136254 156039 190616 302457 456299 349989 157245 -3219 101584
14423A01584R8668K74904Q3224J03041n9202j7695J01836K18057J27072j55867
14413H75622k38588r8870m295K2617P2115J71234J27849K50679J08469J6949k26293
14402A077488m7741J17740K23820l5431n2774Q7564R3925l4342k7142K2213m4524
14391A380796j37112J09423j13866m8645O7749L2389o4662n4416K0109M8582J69568
14380A409915L0352l0516L8063K9501K21444O7268J08218l2497P264J51025K37545
14369B237582P2078l2205J59777J00761J63755J06561J77209J22447J70447K56664
14359C535076k5311j757J70621J43113L07283J48728o7230O9355J85258K59012
14349D724148N10935L56060M29576N24869M61336N85137Q41636O79620P79493
$$ plain form
14423 101584 200252 475156 558380 661421 602219 584524 686360 904417 1031489 875622
14413 875622 637034 538164 533869 556486 628601 799835 927684 1178363 1286832 1303781 1077488
14402 1077488 1029747 1147487 1371307 1335876 1283102 1370666 1464591 1430249 1403107 1425320 1380796
14391 1380796 1243684 1353107 1239241 1190596 1258345 1290734 1226072 1171656 1191765 1240347 1409915
14380 1409915 1440267 1409751 1447814 1477315 1698759 1766027 1874245 1841748 1849012 2000037 2237582
14369 2237582 2309660 2277455 2437232 2537993 2701748 2808309 2985518 3107965 3278412 3535076
14359 3535076 3509765 3508008 3678629 3821742 4129025 4277753 4210523 4279878 4465136 4724148
14349 4724148 5235083 5591143 6020719 6545588 7006924 7592061 8433697 9113317 9892810
14340I892810Q78529J180667J438622J926570K455950K720408K920385L310601
14332B6724542M088886M639301N035336N238064N359793N829037O681143P538965
14324G1135067Q532460J0729842J4429925K0318029K9432284M0730886M6727453
14317B42035946L5127471J6185689P867321O386724Q018528N492811r239228k3634816
14309B88240446k9789533l5186444l9008274l6757313k9030210k0469919j3996840
14302H4001913r615924o730158m692393k694531j356878m18987L72944J277459
14294F0143445K161154K840063L346185L915873M702275N476924O158325O985403
14286I5729647Q255278J0495371J4104190J9504932K8036438L9588768M6932327
$$ plain form
14340 9892810 10771339 11952006 13390628 15317198 17773148 20493556 23413941 26724542
14332 26724542 30813428 35452729 40488065 45726129 51085922 56914959 63596102 71135067
14324 71135067 79667527 90397369 104827294 125145323 154577607 195308493 242035946
14317 242035946 277163417 293349106 301216427 307603151 315621679 321114490 311875262 288240446
14309 288240446 258450913 223264469 184256195 147498882 118468672 97998753 84001913
14302 84001913 74385989 67655831 62963438 60268907 58912029 58493042 58865986 60143445
14294 60143445 62304599 65144662 68490847 72406720 77108995 82585919 88744244 95729647
14286 95729647 103984925 114480296 128584486 148089418 176125856 215714624 262646951
14279B62646951L7329136J7131398O826000M761019N906493M387877r286267k4849637
14271C04852970l1530013l6862924m0947227l9619299l1892415k3095231j6260342
14264H4645519j1825665q711977o565490n142837m396316l426143k968421k582417
14256C9026253k082887k036120j744528j377924j215384j096102r38818o57112
14248B7877378o04759m08917l15985l88664m10787n32553o46564o84676n56009
14239B3328464o87835q80366r05807q92246q90076r66430q58562p99258p97566
14230A5650318r26003p61200n90963o81822p00194n59558m45597o39858m78625
14221I866498l01970m12192m39960m13516m28652k98561k61064l32076j09051
$$ plain form
14279 262646951 299976087 317107485 323933485 328694504 334600997 338988874 329702607 304852970
14271 304852970 273322957 236460033 195512806 155893507 124001092 100905861 84645519
14264 84645519 72819854 64107877 57542387 52399550 48003234 44577091 41608670 39026253
14256 39026253 36943366 34907246 33162718 31784794 30569410 29473308 28534490 27877378
14248 27877378 27272619 26863702 26547717 26159053 25748266 25215713 24569149 23884473 23328464
14239 23328464 22640629 21760263 20854456 19962210 19072134 18105704 17247142 16447884 15650318
14230 15650318 14724315 13963115 13372152 12690330 11990136 11430578 10984981 10345123 9866498
14221 9866498 9564528 9152336 8712376 8298860 7870208 7571647 7310583 6978507 6869456
14212F869456k37990m14012j76342j70364l51902l52170j98330p2829j0842j67444
14202D717231k82096j44776j08401j20183n4392j71455j84564k64314j35560L1038
14192C282528j18757l85364k08524j1046q2017l27533j28462j8696j00488M482
14182A906123L9763L0856j17407p2236O4674J15322j22814K4780R1181k8718k76924
14171A654600o7989M8087p5305j44345n2906J73656J31294j51362j81757K9841
14161A363814J30584J4510k02400j5257P1330l569K5626M5791L681L0336L5121
14150A499567r9437j25347L3840k731p5252J02090J08968o9404k54995j71199
14140I46100k8035M1731o481j41117n3628O8187N7050M0638K7945j1998K8061
$$ plain form
14212 6869456 6631466 6217454 6041112 5870748 5518846 5166676 4968346 4895517 4884675 4717231
14202 4717231 4435135 4290359 4181958 4061775 4007383 3835928 3651364 3387050 3251490 3282528
14192 3282528 3163771 2778407 2569883 2558837 2476820 2149287 2020825 2002129 1901641 1906123
14182 1906123 1945886 1976742 1859335 1787099 1851773 1967095 1844281 1869061 1960242 1931524 1654600
14171 1654600 1586611 1634698 1559393 1415048 1362142 1535798 1667092 1515730 1333973 1363814
14161 1363814 1494398 1508908 1306508 1291251 1362581 1359012 1384638 1430429 1434110 1464446 1499567
14150 1499567 1400130 1274783 1308623 1305892 1230640 1332730 1441698 1372294 1117299 946100
14140 946100 918065 959796 953315 812198 758570 826757 883807 924445 952390 940392 968453
14129I68453j44535q4044R3088J99543J47567l7552j13579j39457P0389q20P3976
14118A033029J44119R65j07333J8629k9244L5894j31927q6461N6394R8239N6711
14107A089015p601O5667j14616r6538j45154p3959J34652M5079m3640j89940j8669
14096F44296K7589J00426o5395P6073J88121j19259r9807M9546M9641K6962J70996
14085A049189m1139m0765q072O4068k8311m909l9121K678N8854j80751j98483
14074F33238Q187J70342K9452L7152j06350k48521q0732r4947J63857o9703j09700
14063C32275M2101J03844P3071R6553J11879J4683P1686j19662j22209p7503J10781
14052F37499L8539k0588q4108M1827L9190K4765j39875j62356M2010O5257p0639
$$ plain form
14129 968453 823918 739874 832962 1032505 1180072 1142520 1028941 889484 959873 959053 1033029
14118 1033029 1177148 1178113 1070780 1089409 1060165 1096059 964132 877671 934065 1032304 1089015
14107 1089015 1081414 1147081 1032465 935927 790773 716814 851466 896545 852905 662965 644296
14096 644296 671885 772311 706916 782989 971110 851851 752044 801590 851231 878193 1049189
14085 1049189 1008050 967285 959213 1023281 994970 990061 950940 953618 1012472 831721 633238
14074 633238 641425 811767 841219 878371 772021 523500 442768 347821 511678 441975 332275
14063 332275 374376 478220 551291 647844 759723 774406 846092 726430 604221 526718 637499
14052 637499 676038 655450 571342 613169 652359 677124 537249 374893 416903 482160 411521
14041D11521l2080N2269N5745k3497m9354M33K0400q468Q0572j6954k50882J5399
14029B55104P6407k4909p3944j01190o2476k1344O5582l6100M1282O530P4080
14018A99022M1137N9095o8074j25145m6453J39473J39868O3773q152l8897P2761
14007D28408j05175p7783J32367n6585k9826j00302m7314n1744P9729r952K1900
13996A83723l3495Q040J04515p2928j48319j54958J77365K44172j01240k16829
13986i954j4334J89659j13173j39061J08457K56742j2481m055p8714q788P1389
13975B45687l4121k45624j0112N8667J62267r4886m4305M9881j13907j14583J13528
13964b7508P4312m2735J11876J69889j09883J0107N154K17180L4376k64254j9926
$$ plain form
14041 411521 379441 431710 487455 463958 414604 415037 435437 426969 507541 490587 239705 255104
14029 255104 331511 306602 232658 131468 68992 47648 113230 77130 118412 124942 199022
14018 199022 240159 299254 231180 106035 59582 199055 338923 402696 394544 355647 428408
14007 428408 323233 245450 377817 321232 291406 191104 143790 92046 171775 161823 183723
13996 183723 150228 158268 262783 189855 41536 -113422 63943 308115 206875 -9954
13986 -9954 -24288 165371 52198 -86863 21594 278336 265855 261800 183086 174298 245687
13975 245687 211566 -34058 -44170 14497 176764 81878 37573 87454 -26453 -141036 -27508
13964 -27508 46804 4069 115945 285834 175951 186058 191212 408392 442768 178514 158588
13953A58588M4003P2507J1643r1247q8907K6028Q8139l0944J03961o1756k3396
13942B08619q005j49053J41695K02756j117j83662j77727Q4439K22693k1989O5379
13931C84028R4171k23253n0879r6687L0207K23429P9822m9761n0660p6483J1356
13920B75290J7504j40785L0427N9553L793O9989n2893L7604M2054M3871k0950
13909C65457L9208N5048j42131J31380n6287P388p8736j23179L6538J1152r7589
13898A48249L9688J56769j00831J5069l494j02487j17390n6144m3287m3900j5898
13887a23656n993N8731N0564l5973j5073k4467K2072J10082J6250Q5349N2281
13876A90167L8529R761j48203P2722k3117K438m082k5316P4213Q6849K2943P1075
$$ plain form
13953 158588 202591 275098 286741 195494 106587 132615 220754 189810 293771 232015 208619
13942 208619 200614 51561 193256 396012 394895 211233 33506 117945 340638 318649 384028
13931 384028 478199 254946 204067 107380 137587 361016 440838 391077 340417 263934 275290
13920 275290 292794 152009 182436 241989 245782 315771 262878 300482 342536 386407 365457
13909 365457 404665 459713 317582 448962 392675 400063 321327 198148 234686 245838 148249
13898 148249 187937 344706 243875 258944 255450 152963 35573 -20571 -63858 -107758 -123656
13887 -123656 -129649 -70918 -20354 -56327 -71400 -95867 -73795 36287 52537 137886 190167
13876 190167 228696 238457 90254 162976 139859 142297 138215 112899 187112 273961 296904 367979
13864C67979R0603K5409L0985K09624J66251J82516K03015L69524K14138O0809
13854A920853k3186j8315j53430j56511P8000q398l18866k85773l2243o3180j21849
13843H17102j1574j88868p7836J26024q9620j98202j66523J13075L2361m2948
13833C12991j21997o6965N6046J79811J15211o6521q1187L4927J32778L41014
13823H36108J04790J71221L02381J66805Q2186J64792n9656O867K4523J00951
13813A900968O123l4390k22931k90726k28429k05627j51094j37953p1720M4391
13803F08612j73324p4298P0276O1325j79062j08310l1154N0543K7246l8692j44659
13792F8503J52613J029j44975j29984O2594O2845J5567Q4689j25683m4144R5583
$$ plain form
13864 367979 458582 483991 514976 724600 890851 1073367 1276382 1645906 1860044 1920853
13854 1920853 1897667 1879352 1725922 1569411 1647411 1639013 1320147 1034374 1002131 938951 817102
13843 817102 805528 616660 538824 664848 575228 377026 210503 323578 355939 312991
13833 312991 190994 124029 180075 359886 475097 408576 327389 362316 495094 836108
13823 836108 940898 1112119 1414500 1581305 1663491 1828283 1768627 1775494 1800017 1900968
13813 1900968 1907091 1872701 1649770 1359044 1130615 924988 773894 635941 564221 608612
13803 608612 435288 360990 431266 492591 313529 205219 174065 224608 251854 213162 68503
13792 68503 221116 222145 77170 -52814 9780 72625 88192 172881 47198 3054 98637
13781I8637J8628k83731P7644K21900J17975l664j8248L7538L575p4266j94515
13770A473j20863J66214N8500K1999J5804K09060Q2114j28421r5388K7892n3197
13759A85187J352p9544n1269L7621K23760m0232j68184j03983o6461R1661R3743
13748A23651n5509n2468Q1076M7477l8411J71586L5670j14567j09743P0464q828
13737A50398j27834k0537q7878P3421J84987J73944j4164j59248j79058r3069
13727i9038n2259r3425J9060J92089J99728p3578j93381k7478r2229J41777J98384
13716A19650K0053r2668L0404Q2033j44795j27335J25976M2160J22495o6481k6575
13705H4917P2236j16811k11614K57564M3356p7058l0439L3240M6772k7659j55
$$ plain form
13781 98637 117265 -166466 -88822 133078 251053 247389 229141 266679 270254 195988 1473
13770 1473 -119390 46824 105324 127323 143127 352187 434301 305880 210492 238384 185187
13759 185187 186539 106995 55726 93347 317107 276875 108691 4708 -61753 29908 123651
13748 123651 68142 15674 96750 144227 105816 277402 313072 198505 88762 159226 150398
13737 150398 22564 2027 -85851 -12430 172557 346501 332337 173089 -5969 -99038
13727 -99038 -151297 -244722 -225662 -33573 166155 92577 -100804 -128282 -220511 -78734 119650
13716 119650 139703 47035 77439 159472 14677 -112658 13318 55478 177973 111492 84917
13705 84917 157153 40342 -171272 86292 129648 52590 22151 55391 102163 74504 74349
13694G4349K2363R482k9596P7018O8787j39984l3688L2441k16622J66591J86679
13683B17820j68193r8086p303O471K21328J86369o0741k07800k19469j42046R4541
13672a77109K08729J48725K4527j2795o3363j46562r3892N0418J13300K066k4691
13661B9353j17358N5677Q8053k3883J47212j21481k5771J01463p114n2263L2445
13650A06333j3093q4591r1729P7169O7533J21918j3947J27386p0710q6273R3667
13639B33663R6963j37731j45149j6452J7698m7193P2050J592r7799j3298K6697
13628h959q6679J92226J98993p152n3966N9093q0944j61401J0221q840l8695O915
13616B0812K41812J59350q3435j47067j98755j2457J83787M7341J2141k87k80255
$$ plain form
13694 74349 96712 106194 76598 153616 222403 82419 48731 81172 -135450 31141 217820
13683 217820 49627 -48459 -55762 -49291 172037 358406 297665 89865 -129604 -271650 -177109
13672 -177109 31620 180345 204872 192077 128714 -17848 -111740 -61322 51978 54044 29353
13661 29353 -88005 -32328 55725 31842 179054 57573 31802 133265 126151 73888 106333
13650 106333 93240 8649 -83080 -5911 61622 183540 169593 296979 226269 139996 233663
13639 233663 330626 192895 47746 31294 48992 1799 73849 75441 -22358 -35656 -8959
13628 -8959 -95638 96588 295581 288429 234463 293556 212612 51211 61432 52592 13897 20812
13616 20812 262624 421974 338539 191472 -7283 -19740 164047 211388 223529 223242 -57013
13605e7013j58530M4223J54812m227l864K304N0466m4582j17744j06966j44369
13594c85490J88195N7575n4233o4046K33119J78190p1861K6484R0195o147j09560
13583H2421l4803j09344P6584R8779j54702J1592q994j63711l1138j6778J69214
13572h0880L21899K6188k15783j18869k678L9657r3254j05414r4291J00245K49205
13561B6025n6227j56749J07006R176J17815J21796j00798n2211L8830J73329j62543
13550F5449K5981J03410oP0161j49609r4212j24216j15428l744M6190J38557J90168
13538A52701n6885L4118r8093q6684n3767O3640J48641J13765K81q0618M8756
13527A85855j8654n6446j22572P5569J59533N9762j05129l03797j89274R9727
$$ plain form
13605 -57013 -215543 -171320 -16508 -20735 -24599 -22295 28171 -16411 -134155 -241121 -385490
13594 -385490 -197295 -139720 -193953 -257999 -24880 153310 81449 107933 198128 191981 82421
13583 82421 47618 -61726 14858 113637 -41065 -29473 -38467 -202178 -233316 -250094 -80880
13572 -80880 241019 267207 51424 -67445 -70123 -30466 -123720 -229134 -323425 -223180 26025
13561 26025 -30202 -186951 -79945 -70769 47046 168842 68044 15833 54663 227992 65449
13550 65449 91430 194840 194834 264995 115386 21174 -103042 -218470 -222214 -176024 -37467 152701
13538 152701 95816 129934 31841 -54843 -108610 -44970 103671 217436 217717 137099 185855
13527 185855 167201 110755 -11817 63752 223285 283047 177918 -125879 -315153 -215426
13517b15426J44161Q6094J91939Q5166P3579L4315j84988l9081L6573q2833J27165
13506B56664P3935k25415j98104j2955J08075l9203n8402M0J13502R4340j40434
13495b7957j18416J7181J34625N0209o338o1580M239k8195R5802k9504k05784
13484a75718J03097j60255m0234J87425M5808j54772L810Q9315P5077Q4483Q2233
13473A40269P460k64526j00253L2241j77191P9097K12979K04122R7200J13979
13463C45377q8831j01889r4726K6269R1183j67627M8968J1500n320M2411N2129
13452A59444K0284j19826Q479N9706J4534J30042r5199n5247J00993l4099n9726
13441A29385N134l518r9634j27242L9389k5454l6957K82915P6301j48525k0180
$$ plain form
13517 -215426 -71265 14829 206768 291934 365513 399828 214840 175759 212332 129499 256664
13506 256664 330599 105184 -92920 -105875 2200 -37003 -95405 -95365 18137 112477 -27957
13495 -27957 -146373 -129192 5433 55642 49304 -12276 -8037 -36232 59570 30066 -175718
13484 -175718 -72621 -232876 -273110 -85685 -39877 -194649 -190839 -101524 -26447 58036 140269
13473 140269 147729 -116797 -217050 -184809 -362000 -282903 -69924 134198 231398 345377
13463 345377 256546 154657 59931 86200 177383 9756 58724 70224 64904 107315 159444
13452 159444 179728 59902 68381 128087 142621 272663 177464 122217 223210 189111 129385
13441 129385 134519 131001 31367 -95875 -56486 -81940 -118897 164018 240319 91794 71614
13430G1614o2722j9071l5436N5302Q745L5306q684m8471o0415R1788J18969p9174
13418F7751M8615j05836k81038M8032J48065K2771j05646j15684J37873Q0785
13408e4312o117P4553k14925m9541P7803J43815q1840n570N6071P958m2815m0947
13396a35867N1488p9120L2040N6384K3941o3834n9988O9374J34944J11303Q0782
13385B21447R2087K6177r3509m4089p4984M7278J36575r0462j35211o3589O56
13374B2376M8041J68566K6116j44452j82762l116j41907K4157N3914K1966j19294
13363b26395L6386J35934N0297j57648p4748R0856J82599R3182L0532j5603n5521
13352H9871J3939m2446r9670r7874q8514J00224j3802O5819J6591p0816p2733
$$ plain form
13430 71614 8892 -10179 -45615 9687 18432 53738 45054 -3417 -63832 27956 146925 67751
13418 67751 116366 10530 -270508 -222476 -74411 -51640 -157286 -272970 -135097 -54312
13408 -54312 -60429 14124 -200801 -250342 -172539 -28724 -110564 -116134 -60063 -52105 -94920 -135867
13396 -135867 -84379 -163499 -131459 -75075 -51134 -114968 -174956 -105582 29362 140665 221447
13385 221447 313534 339711 246202 202113 127129 174407 310982 220520 85309 21720 22376
13374 22376 70417 238983 265099 120647 -62115 -65231 -207138 -182981 -129067 -107101 -226395
13363 -226395 -190009 -54075 -3778 -161426 -236174 -145318 37281 130463 160995 145392 89871
13352 89871 103810 61364 -38306 -136180 -224694 -124470 -138272 -72453 -55862 -126678 -199411
13341a99411o3828l0893J19418P3940j7065K7240M7914J58776R319q4770m9338
13330h698j3599J34380K6601j7690o3664l9554j35164j08984J75972r087J3800
13319d5687M8834M8087P4476l6907j42578R9813O5954j9990J0269k23622K6227
13308i5124N8770J5798L8997O908r0249j78047J70785J16814n8620J13038l7786
13297F1284k30584j88873L5093L06833p0042O611M8303J19296J7954j32787q4348
13286a11260j38065J9361J79404O7931K9144j3044j67899p9392O9529J07767J36885
13275A00361p4031k03745m6276R0218K26687J13715o4351j42369j17140l4219
13265a51150j499J02894K92676K0703j61278J49J89882n2845k00339k02265L3232
$$ plain form
13341 -199411 -263239 -294132 -174714 -100774 -117839 -90599 -42685 116091 125410 40640 -8698
13330 -8698 -22297 112083 138684 120994 57330 17776 -117388 -226372 -50400 -59487 -45687
13319 -45687 3147 51234 125710 88803 -53775 46038 111992 92002 102271 -121351 -95124
13308 -95124 -36354 -20556 18441 25349 -64900 -242947 -72162 44652 -13968 99070 61284
13297 61284 -169300 -358173 -323080 -16247 -86289 -79678 -31375 87921 105875 -26912 -111260
13286 -111260 -249325 -229964 -50560 17371 46515 33471 -134428 -213820 -144291 -36524 100361
13275 100361 26330 -177415 -223691 -133473 93214 206929 142578 209 -116931 -151150
13265 -151150 -152649 -49755 242921 263624 102346 102495 292377 239532 39193 -163072 -129840
13254a29840r33j01428k94839Q5961M33269J70203j28295p3288k82366p8156Q919
13243c90793J34645J22067N6517J21971k5517p7580j01420M0093l0152M3313m9762
13232a56618R2664o7346M7112N1980J63132R731k00418L1963J8852J7551N595
13221A4198p4143n7312M4024O3159P8166m5714j66523p9853J1002K11528J55501
13210A54033K21472J00386j46920j52007K9229R8077M7967K21153J13438L3478
13200G20306q7648J942j14916j8830r0855j17437j01210p7389q7758j12741R5319
13189H783N9255J7777j23913n4167M3747O1910P0577m1957J31540J25409o1994
13178B36967k40068M9685J34251j26127L9100m3963j67834K5350J08851O2547
$$ plain form
13254 -129840 -130773 -232201 -527040 -441079 -7810 162393 34098 -39190 -321556 -399712 -390793
13243 -390793 -256148 -134081 -77564 44407 18890 -58690 -160110 -120017 -150169 -106856 -156618
13232 -156618 -63954 -131300 -84188 -32208 130924 140655 -59763 -27800 -8948 8603 14198
13221 14198 -59945 -117257 -73233 -10074 68092 22378 -144145 -223998 -212996 -1468 154033
13210 154033 375505 475891 328971 176964 206193 304270 352237 573390 686828 720306
13200 720306 632658 634600 519684 500854 409999 292562 191352 113963 26205 -86536 8783
13189 8783 68038 85815 -38098 -92265 -48518 13392 83969 42012 173552 298961 236967
13178 236967 -3101 46584 180835 54708 93808 49845 -117989 -92639 16212 78759
13168G8759K64186K56905J54241O3955o6016j13493J10641L8609J08261L30016
13158A226064K78091J98221J83993O2507k68430m06286j85908r7630q7499j41600
13148G61523O8072O5570k54373k39357j93204k68884M7425J9705j39716J59439
13138B6200O8976J7812L4304N3713N7501J41365j93625L3091N4722O2639O0947
13127D17645J18562l4257r6121R5330M7980m4229P1337m870j11417O7774l9210
13116D88524J40734L03930K33390M53211R9819Q5322j4918K3691j89831k74560
13106A349312l18253k91305j18955l1929k2250J1954j90072j07641Q0157m7731
13096C13287j38029R3285j31229k21888q1219J38234J84094j18755m9787k1308
$$ plain form
13168 78759 342945 599850 754091 818046 752030 638537 749178 787787 896048 1226064
13158 1226064 1504155 1702376 1886369 1948876 1680446 1274160 1088252 990622 903123 761523
13148 761523 829595 895165 640792 401435 208231 -60653 -13228 6477 -133239 26200
13138 26200 95176 112988 147292 201005 258506 399871 206246 239337 294059 356698 417645
13127 417645 536207 501950 405829 501159 549139 504910 576247 571377 459960 527734 488524
13116 488524 629258 933188 1166578 1619789 1719608 1804930 1790012 1813703 1623872 1349312
13106 1349312 1031059 739754 620799 588870 566620 578574 388502 280861 361018 313287
13096 313287 175258 268543 137314 -84574 -165793 -27559 156535 37780 -12007 -33315
13086c3315J84346j7685R8749R8254M6250j25598m9027N3521J5987R0940j7364
13075C45058j77055n9270J03147k1684J77153k64p1415K21486J70717L8816r7608
13064F29081o177n9749m436Q2617j46135j35722n6973j56350J39676M1294j83933
13053A43193n9326k08091Q8560J66810q394K9453r4660j51608j52634q8145J40814
13042a94028K38989J4261J18615P2754n3206m8505p8803Q6006j4315l17241j03025
13031b78498o8367R4942J38239M9458k7649K4060k2619J15621m7736K0033R6662
13020I4146J16569m4332j5458j1895K0161m1157j67889j1174Q7809J2485q039
13009C1226J19k02616o22K6241P9967N4953M6366O8609J70752r5903o6427J14294
$$ plain form
13086 -33315 151031 133346 232095 330349 376599 251001 201974 255495 271482 362422 345058
13075 345058 168003 108733 211880 190196 367349 367085 295670 517156 687873 726689 629081
13064 629081 622904 563155 558719 641336 495201 359479 302506 146156 285832 327126 143193
13053 143193 83867 -124224 -35664 131146 122752 152205 57545 -94063 -246697 -334842 -194028
13042 -194028 44961 59222 177837 250591 197385 148880 70077 156083 141768 -175473 -278498
13031 -278498 -346865 -251923 -113684 -64226 -91875 -67815 -90434 25187 -22549 -2516 94146
13020 94146 210715 166383 150925 139030 159191 118034 -49855 -61029 26780 39265 31226
13009 31226 31345 -171271 -171893 -145652 -65685 -10732 35634 104243 274995 179092 112665 226959
12997B26959p1446l8033m2229J5719J29414Q116r0018j3740J4718R4997M2629
12986B77086p3400L9356j89693j06069N365N4355j52810J6613P2635l3453o697
12975i6712J66719J00814j17996o5084l3665J0393O4599j48322M5633L1201O4738
12964B2318N3766o853n4971O7605j42048j82288r5662j6119q409K8262N4060l9302
12952c19641Q3626L9137o3547q1973j1581O6152R6504J83728J16100L6851j05956
12941C9400l4715j0492O7673Q3061o2133j92569p2707P9908J22879O1190j32545
12930e1050r0107Q7148J0066r4626J18544j27053p0226J98644o8429p4448J29931
12919c1606k503M029l997O6744J2037m2194K3169L1469L2457m3535j30403m9067
$$ plain form
12997 226959 155513 117480 75251 90970 220384 228500 138482 124742 139460 234457 277086
12986 277086 203686 243042 53349 -52720 -47355 7000 -145810 -129197 -56562 -90015 -96712
12975 -96712 70007 170821 52825 -12259 -45924 -35531 29068 -119254 -73621 -42420 22318
12964 22318 76084 69231 14260 81865 -60183 -242471 -338133 -354252 -362661 -334399 -280339 -319641
12952 -319641 -236015 -196878 -260425 -342398 -353979 -287827 -191323 -7595 108505 145356 39400
12941 39400 4685 -5807 61866 144927 82794 -109775 -182482 -102574 20305 81495 -51050
12930 -51050 -141157 -54009 -43943 -138569 -20025 -147078 -217304 -18660 -87089 -161537 -31606
12919 -31606 -34109 -30080 -34077 32667 44704 2510 25679 57148 89605 46070 -84333 -133400
12907a33400l5369M2472J94366R9511N9875q9881j12722K3991J65614j46587R220
12896G7090r5259M005r2482K7576l8764p1107Q972P5210R6745K46214j5035j96737
12884B6428j38878J0481j07559N7077R0500o9743P3320J18829j53628M361J00326
12873A1514k09673m7423J03263j9704R9428J16556K5358N490l2012N923k4596
12862C4124n4623J38347L8501k06268j56456J39882p1745j389N3301J7535K5373
12851d3418l989O0040R4399R369k16576j02516P4132J40398O3917P5486J13163
12840B64405l8006j41996K14280J8313j00596j04839j51744j14771O4008O6844
12830b4102Q8934O2139j496p1095R878P1308m5345j21256L160N5417M1414O7474
$$ plain form
12907 -133400 -168769 -126297 68069 167580 227455 137574 24852 48843 214457 67870 77090
12896 77090 -18169 -14164 -106646 -79070 -117834 -188941 -179969 -104759 -8014 238200 223165 26428
12884 26428 -112450 -101969 -209528 -152451 -61951 -131694 -58374 60455 -93173 -88812 11514
12873 11514 -198159 -245582 -142319 -162023 -62595 53961 79319 84809 52797 58720 34124
12862 34124 -20499 117848 156349 -49919 -206375 -66493 -138238 -139627 -86326 -68791 -43418
12851 -43418 -47407 12633 107032 116401 -100175 -202691 -128559 11839 75756 151242 264405
12840 264405 226399 84403 298683 316996 216400 111561 -40183 -154954 -90946 -24102
12830 -24102 64832 126971 125475 54380 64258 135566 90221 -31035 -27875 27542 68956 136430
12818A36430j08074r5815R348N5768J07940n4906j58381j50970n1602J11624R9519
12807i9119R9455m2138p2271J1067J82467q031j24412j41545k0237N6458r5264
12796b53570j15483J54913N0410J25378Q136j12496k20220O1730J02926k481K56759
12785E6002l0738j46645J38487J29211r1980j97232k63456K9658Q0252J90523
12775a05918J38348o9717j29810k2652R6680K4113j45638L5878K26867M5803O4304
12764A58258N9857n8352p3190l5991j10171j76479Q5078o329p2224j40169J57131
12753b12581K94433L762q4657o5614o6131P2674M2464j12034R7918K05038Q5557
12742B60829k24692o5310n6141m8650N8619K69820J0264k8704n8015O0624J9419
$$ plain form
12818 136430 28356 -67459 -58111 -2343 105597 50691 -107690 -258660 -310262 -198638 -99119
12807 -99119 336 -41802 -114073 -103006 79461 71430 -52982 -194527 -214764 -158306 -253570
12796 -253570 -369053 -214140 -163730 -38352 -30216 -142712 -362932 -301202 -198276 -200757 56002
12785 56002 25264 -121381 17106 146317 54337 -142895 -406351 -376693 -296441 -105918
12775 -105918 32430 -37287 -167097 -189749 -93069 -68956 -214594 -178716 48151 93954 158258
12764 158258 218115 159763 86573 50582 -59589 -236068 -150990 -157319 -229543 -369712 -212581
12753 -212581 81852 85614 957 -64657 -130788 -58114 -15650 -127684 -29766 175272 260829
12742 260829 36137 -29173 -85314 -133964 -75345 194475 204739 176035 118020 178644 198063
12731A98063j70733p8198N6474N0231J27378r6841j48625r298M7262O9602j46584
12720a01269j11319N6629J56219p399L5422k8875j51947r6563R1803J24520n217
12709c7996m8541m1444k2535m5386L3171N8863J60771j5560j32980K2803J531
12698f7303M3022Q5581n8477N1842J11363J10057j07786L4199j85132q0458r6731
12687a59823M6940j1582j08818J31989P6037J35293N3052j74422k16086r7736
12677c25156q5308N4479J86374Q2850K6189O1828l128J16964n546m0776P8004
12666A46774j70354k00794o3267J28876r259L1236J03324o4281q5801M1937J03989
12655c7620J04738R2484J0277j35507m1628n2137J26789q9705n0379J85380j17608
$$ plain form
12731 198063 27330 -50868 5606 55837 183215 86374 -62251 -71549 -24287 45315 -101269
12720 -101269 -212588 -155959 260 -7139 28283 -592 -152539 -249102 -157299 -32779 -37996
12709 -37996 -86537 -127981 -150516 -195902 -162731 -103868 56903 41343 -91637 -68834 -67303
12698 -67303 -24281 61300 2823 54665 166028 276085 168299 202498 17366 -63092 -159823
12687 -159823 -112883 -124465 -233283 -101294 -25257 110036 163088 -11334 -227420 -325156
12677 -325156 -410464 -355985 -169611 -86761 -60572 1256 -1872 115092 109546 68770 146774
12666 146774 -23580 -224374 -287641 -158765 -168024 -136788 -33464 -97745 -183546 -141609 -37620
12655 -37620 67118 159602 169879 34372 -7256 -59393 67396 -22309 -72688 112692 -4916
12644d916o9534J54200n3800j53339k2760P3159J3998M2072J08581R2201j41971
12633C7891j18564q1885O5283J34941k0052j57826j05462k3313j2029J37748O9436
12622g3832p7657l900P3891m8762r2377J16809J56213p8249o7480J66117l3840
12611C6933j69123J47196o289j55886j18340J9750R4552J38835K16111J30252
12601C33991r9864k8703P1512m5029j59659j20336j49268j1066n0977j12706o8749
12590d40854O7857K71253J43316N6970L1232O207j5724r3088j69071n3860J4972
12579a80790j5654K33577Q8820j03566M5862n0806j69540K0653Q2327J42112k6543
12568F6452J1690O4259J52801j13125j33656j2564L2596O2988j59492k11981N9964
$$ plain form
12644 -4916 -74450 79750 25950 -127389 -150149 -76990 -62992 -20920 87661 179862 37891
12633 37891 -80673 -162558 -97275 37666 17614 -140212 -245674 -268987 -281016 -143268 -73832
12622 -73832 -151489 -155389 -81498 -130260 -222637 -105828 50385 -27864 -95344 70773 36933
12611 36933 -132190 15006 8717 -147169 -265509 -245759 -151207 -12372 203739 333991
12601 333991 234127 205424 276936 231907 72248 -48088 -197356 -208422 -259399 -372105 -440854
12590 -440854 -372997 -101744 41572 98542 129774 135981 120257 27169 -141902 -195762 -180790
12579 -180790 -196444 37133 125953 22387 68249 17443 -152097 -131444 -49117 92995 66452
12568 66452 78142 142401 295202 182077 48421 35857 68453 131441 -28051 -240032 -180068
12557a80068K36682O2369J9059n1905Q6434J3904k65093j70792J05146K28516
12547H4252O44m8832P7283m134j98046L0416J42036P4338k9002o9921j06381p0989
12535a18336n7073J08612M9154j5829J36463m4109q0454l718r0935K4041J43078
12524E0894m037j36577Q4466j9962k02040q1558j3726M8569J08081L10418J31558
12513B76086j26935l3064m891K2782l4375r8154o2454q9198O2476l8023k1157
12502a46907n5295o0731j1786J10094q5650r3442j971J08193K56833J80024J02815
12491C02177j69430k08951l4967Q3669J46929J816j76832l4016N0822N2672j4104
12480b15J8183L9890j19116q5362Q8525P0331L4873N7459m7367J11700o9302k16859
$$ plain form
12557 -180068 56614 118983 138042 86137 172571 186475 -78618 -249410 -144264 84252
12547 84252 84896 36064 113347 109213 -88833 -58417 83619 157957 128955 59034 -47347 -118336
12535 -118336 -175409 -66797 -17643 -33472 102991 58882 -21572 -25290 -116225 -92184 50894
12524 50894 46857 -89720 -5254 -25216 -227256 -308814 -322540 -273971 -165890 144528 276086
12513 276086 149151 116087 111196 133978 99603 1449 -61005 -150203 -87727 -125750 -146907
12502 -146907 -202202 -262933 -274719 -164625 -250275 -343717 -345688 -237495 19338 199362 302177
12491 302177 132747 -76204 -111171 -27502 119427 121243 -55589 -89605 -38783 13889 -215
12480 -215 17968 57858 -61258 -146620 -58095 12236 47109 104568 57201 168901 99599 -117260
12468a17260k2751q5383r7280K4303J10109P6005Q4985k19113k51361J16591L26888
12457e4267q8728k4524J82349p6765p1156L993N8105L7386P1109j78451k1818
12446a62767j08816p8196Q4118m8042J8705K1802L5552J63548J29080R4291M1063
12435A90338r1898N5027M9867O3069j03864n8271o0759L6938r8417m8455n5736
12424a22161j11216R4640J28791O1000r4082q6858j31882o8345J85626K62826
12414A18339L0675k02284m1243L4066k1708K2148P5521N7896j02794n4463o9692
12403a53539P0727J11289k0831l0078K388K7661N3311q4158L4837l5173M3886
12392B0320k8196k4846J01401Q1770j09022m0300n3998L2431K2413k6787m5762
$$ plain form
12468 -117260 -140011 -225394 -322674 -298371 -188262 -112257 -27272 -246385 -497746 -381155 -54267
12457 -54267 -142995 -167519 14830 -61935 -133091 -129098 -70993 -33607 37502 -140949 -162767
12446 -162767 -271583 -349779 -265661 -313703 -294998 -273196 -237644 -74096 54984 149275 190338
12435 190338 98440 153467 203334 266403 162539 104268 43509 80447 -17970 -66425 -122161
12424 -122161 -233377 -138737 -9946 51054 -43028 -129886 -261768 -330113 -144487 118339
12414 118339 149014 -53270 -94513 -60447 -82155 -60007 15514 73410 -29384 -83847 -153539
12403 -153539 -82812 28477 7646 -22432 -20044 7617 60928 -23230 11607 -23566 20320
12392 20320 -7876 -32722 68679 150449 41427 1127 -52871 -20440 1973 -24814 -70576
12381g0576k1768p034p0597K0047K665k6542J87283J60146L9819l5689k42543
12370f4789m7392M0434l18607j61984R7192K49519L33005J46196l3402m7304m3392
12359A49476n9840r952M654k2322j08798J12534J45031j01392r4301l4473J90008
12348A70625j56374M6232Q8521k437j19193m4643P1338J2277j36526j45024j00261
12337c15465o6253M7536J75063J03205j03374o5366M1846o8023K0062P6121O4115
12326i0533N0864J4363q8001k7145O1500N0762r2985J10085K8613l0199O0443
12315D7767M2969o6743p7399N1640j7746o6488l2057j37658j03399Q5949j213
12304b74378J47773Q4630k3862q2553l1205P8347Q2165L6165M4627j57981k5405
$$ plain form
12381 -70576 -92344 -99378 -169975 -149928 -147263 -173805 13478 173624 213443 177754 -64789
12370 -64789 -112181 -71747 -390354 -552338 -455146 -205627 127378 273574 240172 192868 149476
12359 149476 89636 79684 84338 62016 -46782 65752 210783 109391 15090 -19383 170625
12348 170625 14251 60483 149004 146567 27374 -17269 54069 66346 -70180 -215204 -315465
12337 -315465 -381718 -334182 -159119 -55914 -159288 -224654 -182808 -250831 -230769 -154648 -90533
12326 -90533 -39669 -25306 -113307 -140452 -78952 -28190 -121175 -11090 17523 -12676 47767
12315 47767 90736 23993 -53406 -1766 -19512 -86000 -118057 -255715 -359114 -273165 -274378
12304 -274378 -126605 -41975 -65837 -148390 -179595 -101248 -19083 17082 61709 -96272 -121677
12293a21677M497J28886j2515n5129L2263J48768j10152j37234j27451j32135
12283c81879J30336K98303J45924J16042j12259k7430o9165j21524r3268J21813
12273F893M0910p519o1430N0220q1446K3052m205N4106j18182M2033M5737J00840
12261I1009j74992k35092o1513K38945K87785J04013p2620j27998j31706Q109
12251g4060J71248J95363o1688O649Q980P0296q6355J59242J73682j60890j28476
12240B73991j8653k62954j15015p7996J76761J74015K3784j37530q6777K8774
12230b1600M8302j03271p1855j71069l2786R1048K04045J13421J07914J30034
12220B94183r1229j48827J81596K9484j24255l3524m9627n0858n8287J06199p4569
$$ plain form
12293 -121677 -117180 11706 -809 -55938 -23675 125093 14941 -122293 -249744 -381879
12283 -381879 -251543 46760 192684 308726 196467 169037 99872 -21652 -114920 6893
12273 6893 47803 40284 -21146 29074 -52372 -29320 -33525 20581 -97601 -55568 -9831 91009
12261 91009 -83983 -319075 -380588 -141643 146142 250155 177535 49537 -82169 -74060
12251 -74060 97188 292551 230863 237512 246492 316788 230433 389675 563357 402467 273991
12240 273991 255338 -7616 -122631 -200627 -23866 150149 173933 36403 -50374 -21600
12230 -21600 26702 -76569 -148424 -319493 -352279 -261231 -57186 56235 164149 294183
12220 294183 202954 54127 235723 265207 140952 107428 57801 6943 -51344 54855 -19714
12209a9714n8391m3777p3359O3771l7217q075P2034j995j35549J54452P2815J13896
12197I8891q6126l6208J71486R3498n3593k26337n6628K01537J72209j3067J20788
12186C86450k12179L8732k7329o5900J7119P3063j67640j00192J1550J15990k3731
12175D5933j65502l9923J09607q0857j82382L8046N1471M824K3727j46743J26732
12164b15067P6295J38614M5099k09807j62232K01385J44765j76824K2362k1026
12154a56436r5522q1871J38048j3563l1524J69811J99299L4731p2370q6288r7126
12143i2811n6859K5249k2011p888L01073k7583p5240l5870j55088p7598L9309
12132a85317L219o0674j8964O3341J75541J9497l4477k0217j28392j9106k427
$$ plain form
12209 -19714 -78105 -121882 -195241 -131470 -168687 -176762 -104728 -106723 -242272 -87820 -15005 98891
12197 98891 12765 -23443 148043 241541 187948 -38389 -95017 106520 278729 265662 386450
12186 386450 174271 213003 185674 119774 136893 209956 42316 -57876 -46326 69664 45933
12175 45933 -119569 -159492 -49885 -130742 -313124 -275078 -223607 -218783 -195056 -341799 -215067
12164 -215067 -138772 -158 44941 -164866 -327098 -125713 19052 -157772 -135410 -156436
12154 -156436 -251958 -333829 -195781 -209344 -240868 -71057 128242 162973 90603 4315 -92811
12143 -92811 -149670 -124421 -146432 -154320 146753 119170 43930 8060 -147028 -224626 -185317
12132 -185317 -182098 -242772 -261736 -198395 -22854 -3357 -37834 -58051 -186443 -205549 -207976
12121b07976J71596R2962j4192n8438k38933J4567Q6034m9199R1464J91236Q6953
12110A66074j91417N6235m761j29212J64717p4316o2387Q9146O1044m5832n7923
12099b8632j25862k03680p5343J23691K43001J03620K1958N8219j91605j05623
12089a80256L7477j03072l9510J20999L74653Q8213j9778o9790j26937L8834M2245
12078A63078o1517j60103l3750m1289j59612K15836J31992J36985j93485J1650
12068I785l9164k91520j15149R4798k3143J4366K50061o8049o7504J10435J10771
12057a4313p2236r7494P899o0445n2272J04830L9193N0464L43053J21193k56839
12046A13033k72011J51542q042m4574J1850N5326N553P6447q1907j21137J68442
$$ plain form
12121 -207976 -36380 56582 42390 -16048 -254981 -240414 -154380 -203579 -112115 79121 166074
12110 166074 -25343 30892 26131 -103081 61636 -12680 -75067 14079 75123 29291 -28632
12099 -28632 -154494 -358174 -433517 -309826 -66825 36795 58753 116972 -74633 -180256
12089 -180256 -142779 -245851 -285361 -164362 210291 298504 278726 208936 81999 120833 163078
12078 163078 101561 -58542 -92292 -133581 -293193 -77357 54635 191620 -1865 9785
12068 9785 -29379 -320899 -436048 -341250 -364393 -350027 -99966 -168015 -235519 -125084 -14313
12057 -14313 -86549 -184043 -176144 -236589 -288861 -184031 -144838 -94374 248679 369872 113033
12046 113033 -158978 -7436 -15478 -60052 -48202 7124 12677 89124 7217 -113920 54522
12035E4522K13246o3992j5347j19268j04881Q3848J34881J9290k83427k0043J49948
12024D8777Q0302M6392n7478j06673J36381K1175j8454j35663j3247j06453M2282
12013f2659K01761K47428j07015l41211k7879L5986J84776K0889j15387o3906
12003b7217n2724J29917J29672R3108n7657j13266n897j81916j34450j48733M8463
11992c20700L4736l3229R0919J66985J49694L0467k02734k5506N9117n7097j18067
11981b25415l1595k4954p5037O9658R5698J1860j3302L7268p7683J85239O8271
11970B0008P9336j19916j03957n2113o2621J348J59286J52370j05574N6871k8320
11959c282o2435L2955K1528j10917p09q4012o0086Q8465R6958K3990J31668k2165
$$ plain form
12035 54522 267768 203776 188429 69161 -35720 48128 183009 202299 -81128 -101171 48777
12024 48777 129079 175471 117993 11320 147701 168876 150422 14759 1512 -104941 -62659
12013 -62659 139102 386530 279515 -61696 -89575 -53589 131187 152076 36689 -27217
12003 -27217 -79941 49976 179648 272756 215099 101833 95936 -85980 -220430 -369163 -320700
11992 -320700 -285964 -319193 -228274 -61289 88405 118872 -83862 -109368 -50251 -107348 -225415
11981 -225415 -257010 -281964 -357001 -287343 -191645 -179785 -193087 -155819 -233502 -48263 20008
11970 20008 99344 -20572 -124529 -176642 -239263 -237915 -78629 73741 -31833 25038 -3282
11959 -3282 -65717 -32762 -11234 -122151 -122860 -206872 -266958 -178493 -81535 -57545 74123 51958
11947E1958J9356m8488O5473r982p98Q1657q0394o172J13138k743j2232j98610
11935b7837L2320J43519N8927J4700j37196j46205k3347p946P4054M5760j32123
11924a05374j67614m1872L6711j35512k7730K21133k9514J2098J19995K1982l715
11913i9412o7460P2944o6051o8831O0343P4827J11209j55893L5074q8441j86612
11902c78303r4025R5681K07528K17995p9003R2078O545J2204l1217j4273J32805
11891A68015J9030j52511j60715Q645P2366p6208r1552M3139K36790j2452Q1145
11880A35692J8155k0053q7396j76934J20009N1340r7826q467N4817J3252j23797
11869a21208o702M3232L3765J13225r7751r1015o9130J60342J91121p3578r4147
$$ plain form
11947 51958 71314 22826 88299 78317 77519 159176 78782 72610 185748 183005 170773 -27837
11935 -27837 4483 148002 206929 221629 84433 -61772 -85119 -93065 -19011 26749 -105374
11924 -105374 -272988 -314860 -278149 -413661 -441391 -220258 -249772 -237674 -117679 -95697 -99412
11913 -99412 -166872 -93928 -159979 -228810 -168467 -93640 17569 -138324 -103250 -191691 -378303
11902 -378303 -472328 -376647 -169119 48876 -30127 61951 68496 80700 49483 35210 168015
11891 168015 187045 34534 -126181 -117536 -45170 -121378 -212930 -169791 66999 54547 135692
11880 135692 153847 133794 46398 -130536 -10527 40813 -57013 -65480 -10663 2589 -121208
11869 -121208 -127910 -84678 -50913 62312 -35439 -126454 -195584 -35242 155879 82301 -11846
11858a1846N2050J32444J80725J5221k15962r0459M5095J66167o4083k40604r1319
11847a22571k303M8997J48171J34411j50042P67o3885j10513q4597J80316J11457
11836I0208j55107J7783K5729r365q4232l3793j0702L272R2255J90793O1087j59478
11824B8450l3452O8383J41177L1305q2883n6075R9175o9823j89337J896J37946
11813G6762K9222k34418j17181K66558o922q3025K0965p4383J83288Q9293j18037
11802C2122j72485m8086l7867Q350k9595m4346J67845O6178j9770K16388J17618
11791B56352N2917j52791m9216j89733j51155q1833Q2409m6803L4681J03096K454
11780a39622p0880R88N8575J47492m4273r3665L1856L4815p214L2772p2750j9870
$$ plain form
11858 -11846 40204 172648 353373 368594 152632 62173 107268 273435 209352 -31252 -122571
11847 -122571 -124874 -75877 72294 206705 56663 57430 -6455 -116968 -201565 -21249 90208
11836 90208 -64899 -47116 -21387 -30752 -114984 -148777 -159479 -156207 -63952 126841 187928 28450
11824 28450 -5002 63381 204558 235863 152980 96905 196080 126257 -63080 -61184 76762
11813 76762 105984 -128434 -245615 20943 14021 -69004 -48039 -122422 60866 150159 32122
11802 32122 -140363 -188449 -226316 -217966 -247561 -291907 -124062 -57884 -77654 138734 256352
11791 256352 309269 156478 107262 -82471 -233626 -315459 -233050 -279853 -245172 -142076 -139622
11780 -139622 -210502 -209514 -150939 -3447 -47720 -141385 -109529 -74714 -81928 -49156 -121906 -141776
11768a41776O2103o8693j44969p466n0109J00513M8623L986N1518O0909j29242
11757b14603O1548o3010J9534J5849P0305Q4905k4663j34773M6357j07011N6256
11746a89306o936L2045K600O3992m6558l8371L7660N2855J17265M2061J11151
11735A78458J23194k29441k32438N1652l4222r0911P2937K9222k2189j08048J15887
11724a45899M3614j881r0663m4143J32458N9325N6888M6291j2869j37934J6733
11713g8080j04858j10009O902J63811J71779J53785J4287k1868m7712r1339L0241
11702H6939n8212K3881N8680p7395m5730j18163l5312j69084n8977K28178O4941
11691a00254j30589m4200R8842J54781Q0986m8216m3026j16604j28262m1559Q9166
$$ plain form
11768 -141776 -79673 -148366 -293335 -300801 -350910 -250397 -201774 -197788 -146270 -85361 -214603
11757 -214603 -153055 -216065 -196531 -180682 -110377 -25472 -50135 -184908 -138551 -245562 -189306
11746 -189306 -196242 -164197 -161597 -97605 -144163 -182534 -144874 -92019 25246 67307 178458
11735 178458 301652 72211 -160227 -108575 -142797 -233708 -160771 -131549 -153738 -261786 -145899
11724 -145899 -102285 -104166 -194829 -238972 -106514 -47189 9699 55990 43121 -94813 -78080
11713 -78080 -182938 -292947 -286045 -122234 49545 203330 217617 195749 148037 56698 86939
11702 86939 28727 52608 111288 33893 -11837 -130000 -165312 -334396 -393373 -165195 -100254
11691 -100254 -230843 -275043 -176201 -21420 59566 11350 -31676 -148280 -276542 -318101 -228935
11680b28935J23538K9203N2640j25352N2603J96853K9040m6390L8858j42444j03981
11669a24367o5511L5113j4355J35658L1527l0805J08605l060j72974o7640j3728
11658a81537k7935J27272R782p2533m5890J69065J00817J13301R6753k79910j55452
11647a46267N9693J24837r2692j19212P3535K0905j09265j85604j22331J86861
11637c09540R0230l024R2212J26451M2705j21288l33k8622q3965N6982J76546
11626C8354O8118m2086M2378q528j18928k00448l06285R1100K33424J17404j4209
11615i9706p3156m8453J2909m026M4321K61342M4044j92608M3054Q2616P20K8445
11603I9502j8325j00458k09209j05525P5433R3301O2639m4757j10905J26677q3037
$$ plain form
11680 -228935 -105397 -76194 -23554 -148906 -96303 100550 129590 83200 122058 -20386 -124367
11669 -124367 -189878 -154765 -169120 -33462 -1935 -32740 75865 72805 -100169 -167809 -181537
11658 -181537 -209472 -82200 -72418 -144951 -190841 -21776 79041 192342 289095 9185 -146267
11647 -146267 -86574 38263 -54429 -173641 -100106 -79201 -188466 -374070 -496401 -309540
11637 -309540 -219310 -222334 -130122 -3671 39034 -82254 -82587 -111209 -195174 -138192 38354
11626 38354 106472 64386 106764 98236 -20692 -221140 -527425 -436325 -202901 -85497 -99706
11615 -99706 -172862 -221315 -208406 -212432 -168111 93231 137275 -55333 -12279 70337 71057 99502
11603 99502 81177 -19281 -228490 -334015 -258582 -165281 -102642 -147399 -258304 -131627 -214664
11592b14664L0640P6763J11179N5334J8059j8136r5607K1912L1519m4210n0470
11581g7681J5518k10266O3874J37320P1340Q6617N4156k00373m1080k8091j351
11570a30017M843O4644P354p9900j2412m3323k7922J92836J8131j03702m7242
11559a56710j6359J83342k5362q0838n5817J49349J20626l1217j00151q0113J35810
11548D2560L1939j82554O8851k1594j31993o3767Q3798L3607k3586J54659Q433
11537C53m1108j42515J8959J81720n9582r8109m1921k5618J93361J3586q4305
11526h5179J40639K08593l5650l4395j67685r0416K523m9311o3198J54924K8882
11515I727j04590j27373Q9554J05941O7525j61143o9861n3868J95630k9686o2830
$$ plain form
11592 -214664 -184024 -107261 3918 59252 77311 59175 -36432 -14520 16999 -27211 -77681
11581 -77681 -62163 -272429 -208555 -71235 105 86722 140878 -59495 -100575 -128666 -130017
11570 -130017 -125174 -60530 -53176 -133076 -145488 -188811 -216733 -23897 -5766 -109468 -156710
11559 -156710 -173069 10273 -15089 -95927 -151744 -2395 118231 87014 -13137 -93250 42560
11548 42560 74499 -108055 -39204 -60798 -192791 -256558 -172760 -139153 -162739 -8080 353
11537 353 -40755 -183270 -164311 17409 -42173 -140282 -182203 -207821 -14460 -874 -85179
11526 -85179 55460 264053 228403 194008 26323 -64093 -61570 -110881 -174079 -19155 9727
11515 9727 -94863 -222236 -132682 -26741 40784 -120359 -190220 -244088 -48458 -78144 -140974
11504a40974l1755O5924M3543l9423n0657P3056J06956J91415j32713q8028M1253
11493C8597K00815K3786q5985M694k4138j63227m5353J1650K944q3835J01717
11482a8335N5095k76619n4224J66557J57040P2404Q7289j53797j2012M2345q6097
11471b0354l1178M9801L4293j12788R316R847m1243K3840l594J04247J12669n09
11459A34347J2195j85840j31338Q3894J53586o8106j43010l1801M0293k4863L297
11448a57346J649P5599O7052J12188j2238r9184J15072k7o8125R953l1875m00458
11436c87740j62104K27813J65093P7062N450m0801K0325k2185r3497J01093K03562
11425I4071j0027N0758r730J1055J2007j4352o1691q8855M3985k759j31636L5996
$$ plain form
11504 -140974 -172729 -106805 -63262 -102685 -153342 -80286 26670 218085 85372 -2656 38597
11493 38597 239412 263198 177213 181907 157769 -5458 -50811 -39161 -36217 -120052 -18335
11482 -18335 36760 -239859 -294083 -127526 29514 101918 189207 35410 23398 65743 -20354
11471 -20354 -51532 -1731 32562 -80226 -70910 -61063 -102306 -78466 -82060 22187 134856 134347
11459 134347 146542 -39298 -170636 -86742 66844 -1262 -144272 -176073 -135780 -160643 -157346
11448 -157346 -155697 -80098 -13046 99142 86904 -12280 102792 102765 34640 44593 12718 -387740
11436 -387740 -549844 -322031 -156938 -79876 -74426 -115227 -94902 -117087 -210584 -109491 94071
11425 94071 84044 134802 125072 136127 148134 133782 72091 -16764 27221 24462 -107174 -71178
11413g1178Q2950l1225P9831J46643J53174o2047j19848M839O4196k16257n2937
11402b1859j610L7789n7819j80452q0517K22394P4743q9992J35939m7468j25152
11391a34004r3947l1671O1701N9273L491o056O4738M7163M9129j04648q6704o2339
11379b33874j19289p6244K39212J88613J59644m3058j19825r3046j00590r107
11369b07564k5515J02616n9041n8252l7099Q0116k6131R6098K12229j14420N920
11358c1043J25547J22153j3086q7490j09425j6287R5862J56953r9999j64454k1867
11347d3136R4674j17437Q0787M2583j3208j00905j66144R7237J88206l2697N738
11336C5698K0732r022o6709j8153O078J62267J59285k25411j14759j7745R2181
$$ plain form
11413 -71178 11772 -19453 60378 207021 360195 298148 178300 183139 247335 31078 -21859
11402 -21859 -23469 14320 -43499 -223951 -304468 -82074 -7331 -97323 38616 -8852 -134004
11391 -134004 -227951 -259622 -197921 -138648 -135157 -141213 -76475 -29312 19817 -84831 -171535 -233874
11379 -233874 -353163 -429407 -190195 -1582 158062 115004 -4821 -97867 -198457 -207564
11369 -207564 -233079 -130463 -189504 -247756 -284855 -204739 -230870 -134772 77457 -36963 -31043
11358 -31043 94504 216657 203571 116081 6656 -9631 86231 243184 143185 -21269 -43136
11347 -43136 51538 -65899 14888 57471 44263 -56642 -222786 -125549 62657 29960 35698
11336 35698 56430 47408 -19301 -37454 -31376 130891 290176 64765 -49994 -67739 24442
11325B4442L78r2685M7444Q9322j38197j4627k951k5275L9947k7086r6894n8631
11313b54813J63192J63236N226j00655p4820q1356l3369N1663P3484q629j210
11302i8051J78984L8096j36000k1957m1247n0849n6282j66889p8984K6980l7446
11291d43645P1612J44157O4557L0186n2545P1966p5596m7245J58139J25350K4910
11280G1846j47390k0236J72797j11936l13833K7077J49663O3671K2591N0287j25510
11269a60973j83837O2379P9702J57995J13705l7694k26129p8743Q8909O0615m6877
11258a70948J4646m1244j10667P6928J06902j04651j3884M9439K56023O1286j58865
11247c5035k5835n1292o7140P2944J6754n6733Q1790j36945P9206J24858M047
$$ plain form
11325 24442 24820 -67865 -20421 68901 -69296 -83923 -86874 -112149 -72202 -99288 -196182 -254813
11313 -254813 -91621 71615 76841 -23814 -98634 -179990 -213359 -161696 -88212 -96841 -98051
11302 -98051 80933 119029 -16971 -38928 -80175 -131024 -187306 -354195 -433179 -406199 -443645
11291 -443645 -372033 -227876 -163319 -133133 -185678 -113712 -189308 -236553 -78414 46936 71846
11280 71846 -75544 -95780 77017 -34919 -348752 -321675 -172012 -108341 -85750 -35463 -160973
11269 -160973 -344810 -282431 -202729 -44734 68971 31277 -194852 -273595 -184686 -124071 -170948
11258 -170948 -156302 -197546 -308213 -231285 -124383 -229034 -242918 -193479 62544 123830 -35035
11247 -35035 -60870 -112162 -179302 -106358 -89604 -146337 -64547 -201492 -122286 2572 6619
11236F619l7606p6389k396q2397Q5143R9330j01599o3335P0827m757l8319M403
11224a40476O8954N3899J33079q471M0066m9862r1892M3377r2670j11074K38235
11213H3165j9125k54667j41874K1792J39539O5641j2535P3729j0989k77916p4956
11202d08196O8563P5679N6480l2439O1997J71785k9622p5880k4182k6112q5312
11191b47239J02976o154R7141j9339r3869P3210m5239M3896j0514o5084N1007
11180a19208m4416m7071r905J73588J98010L254O7053Q2128j63639n6309j05452
11169b1967M0839L9030n0940k11464M7475J01677j43262j38920R6530J58467m8374
11158a30909j0646M2065Q1519Q7593J8155J0716j30113l8139M516J42565J67957
$$ plain form
11236 6619 -30987 -107376 -109772 -192169 -107026 -7696 -109295 -172630 -101803 -106560 -144879 -140476
11224 -140476 -71522 -17623 115456 106985 147051 97189 5297 48674 -43996 -155070 83165
11213 83165 64040 -190627 -332501 -310709 -171170 -105529 -118064 -44335 -55324 -333240 -408196
11202 -408196 -339633 -263954 -207474 -239913 -177916 -6131 -35753 -111633 -135815 -161927 -247239
11191 -247239 -144263 -150417 -53276 -72615 -166484 -93274 -138513 -94617 -105131 -170215 -119208
11180 -119208 -163624 -210695 -220600 -47012 150998 154252 221305 303433 139794 83485 -21967
11169 -21967 18872 57902 6962 -204502 -157027 -55350 -198612 -337532 -241002 -82535 -130909
11158 -130909 -141555 -99490 -17971 69622 87777 98493 -31620 -69759 -65243 77322 245279
11147B45279j56301R544P8024m2322p9349j64292p06j38781P9161l8681j2128
11136b20552L9805n069q0824M5064l1381P0705j74180r5686K11618N2032q0842
11125b69310M4039J02802K0702M9260j73747j4424J63556J39985N2460j9360j44157
11114d8194k7025l9390l194r3062k7294l2001j42360L0948J86366m543O5686J00637
11102c3426j09739j23910k9033P7797j09835L0319J47980L3292j05139J8432k6817
11091b30079p3773K98239Q5997K769M0547p2627k0769P9311j59089r9420j40834
11080b89728k18815j51535l8607K69753J05394J99529n2648Q2813J47808n3936
11070B8o8198j35943R0519j04551j30666N7478M6541R3093J09692j08462N7938
$$ plain form
11147 245279 88978 98522 176546 134224 54875 -109417 -110123 -248904 -169743 -208424 -220552
11136 -220552 -180747 -185816 -266640 -221576 -252957 -182252 -356432 -452118 -240500 -188468 -269310
11125 -269310 -225271 -122469 -101767 -52507 -226254 -240678 -77122 62863 115323 95963 -48194
11114 -48194 -75219 -114609 -117803 -210865 -238159 -270160 -412520 -381572 -195206 -199749 -134063 -33426
11102 -33426 -143165 -267075 -296108 -218311 -328146 -297827 -149847 -116555 -221694 -203262 -230079
11091 -230079 -303852 -5613 80384 83153 123700 51073 30304 109615 -49474 -148894 -289728
11080 -289728 -508543 -660078 -698685 -428932 -323538 -124009 -176657 -93844 53964 28
11070 28 -68170 -204113 -113594 -218145 -348811 -291333 -244792 -151699 -42007 -150469 -92531
11059i2531J7203j2784P770j34126l2757l0813L47o8421K13901p0117l1763K54044
11047A9953K17241k7848j8100j58058l1339Q8681J62794Q142k24954O9358M6406
11036A52276j41980O5259n5191k947m2396l9741q5289L8124p4136R1322n754m3704
11024a44157j35187l0477O1886j92655m5609K21950K69543j25790n7163L221p2127
11013b46565r6302n9533J87727J50608L121j62018L0859J51956R9812k8690o7556
11002c6581j27322O7430J43384J57290L2567j05841N0502L332j12797L5174Q3292
10991A90430M2223K2610R9804r225j55954j4341p9665j37870m5447N5685M9819
10980A8069j03425r3510o8394J06863Q5250m9828N4287J36423L1485J07551J46822
$$ plain form
11059 -92531 -75328 -88112 -80342 -214468 -247225 -278038 -277691 -346112 -132211 -202328 -234091 19953
11047 19953 237194 209346 191246 33188 1849 90530 253324 261466 36512 105870 152276
11036 152276 10296 75555 20364 17417 -24979 -64720 -150009 -111885 -186021 -94699 -100453 -144157
11024 -144157 -279344 -309821 -247935 -440590 -486199 -264249 5294 -120496 -177659 -174438 -246565
11013 -246565 -342867 -402400 -214673 -64065 -60944 -222962 -192103 -40147 59665 30975 -36581
11002 -36581 -163903 -96473 46911 204201 236768 130927 181429 184761 71964 107138 190430
10991 190430 232653 255263 355067 345842 189888 175547 95882 -41988 -87435 -31750 18069
10980 18069 -85356 -178866 -247260 -140397 -55147 -104975 -50688 85735 117220 224771 371593
10969C71593n2954n9454j10567k0148l2752J00498L0699j19960j95670K7792N6396
10958d527j86Q8419J38975p854j29553k1191K9348j3874p8909L6598J22741j303
10946A58684n0131m4299J26007J13624k4583J16118n3091o2838L4398r6343p4761
10935A42785j61629n8453O2687j08105l2103Q9875P9640J43763q126J4860r670
10924A55524M2378j26012P5256J12110M6412L1984k0564n0299q6795r8586M9425
10913A30833P2665K6246K3075L0828j55289j07937j89091P4559N9327O3795J75332
10902B04343J45232p678k4207J20934j23396j03570j26548L1434O6994j17626
10892F5912k64005n843j26758O2917J71948J86628J72964l784L8767p6791M4500
$$ plain form
10969 371593 318639 259185 148618 128470 95718 196216 226915 106955 -88715 -60923 -4527
10958 -4527 -4713 83706 222681 214827 85274 64083 93431 79557 648 37246 159987 158684
10946 158684 108553 64254 190261 303885 279302 395420 342329 279491 313889 217546 142785
10935 142785 -18844 -77297 -14610 -122715 -154818 -64943 14697 158460 150334 165194 155524
10924 155524 197902 71890 147146 259256 305668 337652 317088 266789 179994 81408 130833
10913 130833 203498 229744 252819 283647 128358 20421 -168670 -94111 -34784 29011 204343
10902 204343 349575 341897 317690 438624 315228 211658 85110 116544 183538 65912
10892 65912 -198093 -203936 -330694 -267777 -95829 90799 263763 259979 298746 221955 266455
10881B66455N0768r6234l6264J4831m6477K0883k4073J28422J76814J4859q3044
10870C86940j27911k37249j43121Q3144K86058J19628j12640j90982j0481j25124
10860g1738k49533L8L4774L63998R7754m9907j2614k0588l9108j57903K2366P2799
10848i662P7205L5629j36580p4493M0001N8855O7211j2684m8813P251Q8822M1151
10836A33893M566J06486j53716j41375P2448j17000l3652J33717p7p7455J26528
10825E4363K06424k52032k17007q2226m8926K39324L13572O1923p6527k17278
10815a8390j77458l1021P2758J56119J07042k44963O9223K66379o3347R254Q1232
10804B26828p9420L820J4348L0824j28701j88687N1923K02177n9889o1213K29766
$$ plain form
10881 266455 317223 220989 184725 199556 153079 173962 149889 278311 455125 469984 386940
10870 386940 259029 21780 -121341 -38197 247861 367489 254849 63867 53386 -71738
10860 -71738 -321271 -321233 -286459 77539 175293 125386 112772 92184 53076 -104827 -82461 -9662
10848 -9662 67543 103172 -33408 -107901 -67900 -9045 58166 45482 -3331 3920 92742 133893
10836 133893 138459 244945 91229 -50146 22302 -94698 -128350 5367 5290 -72165 54363
10825 54363 260787 8755 -208252 -290478 -339404 -100080 213492 275415 198888 -18390
10815 -18390 -195848 -226869 -154111 2008 109050 -135913 -66690 199689 136342 145596 226828
10804 226828 147408 151228 165576 196400 67699 -120988 -69065 133112 73223 12010 241776
10793B41776p3488J5346k095l8117Q3945j57829J3466J47840K26619M7846l2691
10782D72618r5895n4613M0328K7235J9527j50252p5437N3034p5069j63033J35028
10771A33471O7110m209j01614O730m4847O8459P81M8196L3201o087k246P7782
10759B76727q9610J8390J20259J7130n7852j08465J34645J35683J01907J06517
10749F55331k7167J07620J35343P3901j4308j53201K9706K07539J40217L1740
10739A186721p7922j57430m2218P5820Q5470J07037P1254p7077q363J93900L92381
10728A749573K71270l5632R8410K11184J61393J74415O4219J46602K13026M27662
10718C482122N33502M73798P38702Q99673R48989J040019J304480J400028J371777
$$ plain form
10793 241776 168288 183634 181539 143422 227367 69538 83004 230844 457463 505309 472618
10782 472618 376723 322110 362438 389673 409200 258948 183511 236545 161476 -1557 133471
10771 133471 200581 196372 94758 101488 56641 125100 125881 174077 207278 201191 198945 276727
10759 276727 187117 205507 325766 342896 285044 176579 311224 446907 548814 655331
10749 655331 628164 735784 871127 945028 930720 777519 807225 1014764 1154981 1186721
10739 1186721 1108799 951369 909151 984971 1070441 1177478 1248732 1171655 1163292 1357192 1749573
10728 1749573 2020843 1985211 2083621 2294805 2456198 2630613 2694832 2841434 3054460 3482122
10718 3482122 4015624 4489422 5228124 6127797 7076786 8116805 9421285 10821313 12193090
10709A2193090J405075J553557J656795J955100K200553K325437K768051L297168
10701B9354826M692558P148285J0178044J5592943K0784510J8132588O055661
10694A11939415l750617r234347j3893860j6331240j5186000j1676050q141652
10687C3725649n416806l610858k616277j957560j330192p27435l91476k13482
10679A7461563J37998O71166R68120J343468J618664J629254K115953K593284
10671B8539470K890107K995295L175772L549488L920339M238880M845250O191869
10663F0346470R009948J2940085J9555314L0060853M2260450M0036430J4055043
10656B28264593p677773j9099448k8563909l4187614l2168422k4675197j7225727
$$ plain form
10709 12193090 13598165 15151722 16808517 18763617 20964170 23289607 26057658 29354826
10701 29354826 34047384 41195669 51373713 66966656 87751166 105883754 111939415
10694 111939415 108188798 98954451 85060591 68729351 53543351 41867301 33725649
10687 33725649 28308843 24697985 22081708 20124148 18793956 18066521 17675045 17461563
10679 17461563 17599561 18270727 19238847 20582315 22200979 23830233 25946186 28539470
10671 28539470 31429577 34424872 37600644 41150132 45070471 49309351 54154601 60346470
10663 60346470 69356418 82296503 101851817 131912670 174173120 214209550 228264593
10656 228264593 220586820 201487372 172923463 138735849 106567427 81892230 64666503
10649F4666503j1641779q098161n848555m275911l258404k797012k148834j457887
10641B5139960j087538q17415m32072N3542K61672K98382N73564P80554R55940
10632B5726589J259227J501419J686629J717613J827814K340373K917747M091165
10624D3068576O077232Q706692J2922753J8019742J8452493Q294431k744500q712262
10616A04085157j3267072j6091256j5846146j2879405r213328o190512m354131
10609B6243307l311666k433346k065994j870899j479104j213135r24341o76019
10601A2268803p19952o43551n55527n04630n78934l52386j69750k79398k84818
10592H179857j98162k68510j37395p2140J04339j35365j32476k28826j39987j14222
$$ plain form
10649 64666503 53024724 44926563 39078008 34802097 31543693 28746681 26597847 25139960
10641 25139960 24052422 23235007 22802935 22856477 23118149 23416531 23990095 24770649 25726589
10632 25726589 26985816 28487235 30173864 31891477 33719291 36059664 38977411 43068576
10624 43068576 49145808 57852500 70775253 88794995 107247488 115541919 112797419 104085157
10616 104085157 90818085 74726829 58880683 46001278 36787950 30597438 26243307
10609 26243307 22931641 20498295 18432301 16561402 15082298 13869163 12944822 12268803
10601 12268803 11548851 10905300 10349773 9845143 9266209 8913823 8744073 8464675 8179857
10592 8179857 7981695 7713185 7575790 7503650 7607989 7472624 7340148 7111322 6971335 6857113
10582F857113k34354j95443j51341m00988l80607k81225k29994k73576k53351
10573D456234k63687k75346k35775k27208j52131n8881k00336j85211m8925l9578
10563B769156N4440j31645r2716n8944j65700k61762k27614J48859l8509l8967
10553A956598J20601k62357k15558n1646j60036J10612l6065N3446j5374j62946
10543A337275j18957K2396P8477m8087Q7982m3737j22750N028J04572j01829o0436
10532A139934N3733j05203k18280j00127p0958N0864N1848P9372P3208p1199l6684
10521H46508r8454p2889l5340k3922K4387j3679K1321m7375J06722j4598q6713
10510F05968j53953J49677J42701O0307p5156j04703j6092J6825k6836o001M6069
$$ plain form
10582 6857113 6622759 6427316 6275975 5874987 5494380 5213155 4983161 4709585 4456234
10573 4456234 4192547 3917201 3681426 3454218 3302087 3243206 3042870 2857659 2808734 2769156
10563 2769156 2823596 2691951 2599235 2540291 2374591 2112829 1885215 2034074 1995565 1956598
10553 1956598 2077199 1814842 1599284 1547638 1387602 1498214 1462149 1515595 1500221 1337275
10543 1337275 1218318 1240714 1319191 1271104 1359086 1315349 1192599 1197627 1302199 1200370 1139934
10532 1139934 1193667 1088464 870184 770057 699099 749963 801811 881183 954391 883192 846508
10521 846508 748054 675165 639825 615903 640290 626611 647932 600557 707279 692681 605968
10510 605968 452015 601692 744393 804700 729544 624841 608749 625574 598738 592737 638806
10499F38806J7838m1182k55111q3136J62364K9609R4058J1665n3417J25970J29134
10488G76598j76956q5804k7564J85553J35220j4425o9345j73014j75663m023R6779
10477D67356n0263Q6164L4147r4838l6344J01931k5528j75536r7666M3318P0845
10466C23586J45757J39628K091Q8403j57215m2453k7812R4573l1575o8726o4220
10455D02037k6485M8732q8886M6992J59707m4801l1353n3409j08910P5551q2080
10444B97095m1023j98348N1151K4539J14456J6180P4967Q8393J6273l3386M7292
10433D57589o1680p8468M9142P7406M0405M0766j41849k51186P5059J35369o6545
10422B76008L5519j7003j5882j93623q2083L4405J96485m022n7226P3450M8977
$$ plain form
10499 638806 656644 615462 360351 277215 439579 469188 563246 574911 521494 647464 776598
10488 776598 599642 513838 486274 671827 807047 792622 723277 550263 374600 370577 467356
10477 467356 417093 503257 537404 442566 406222 508153 482625 307089 209423 252741 323586
10466 323586 469343 608971 611062 699465 542250 499797 471985 566558 534983 466257 402037
10455 402037 375552 424284 335398 382390 542097 497296 465943 412534 303624 379175 297095
10444 297095 256072 57724 108875 133414 247870 264050 339017 427410 443683 410297 457589
10433 457589 395909 317441 366583 443989 484394 525160 383311 132125 207184 342553 276008
10422 276008 311527 294524 278642 85019 2936 37341 233826 229804 172578 246028 295005
10411B95005R3257o1256r4840m2917l815o705j9790j08560K8777J30525J68142
10400C77823L6077q8637k1675N8346J2369m5639j01469j50186l4948r1103O9699
10389B0657J02881R691J37639R7881j04988Q1693q834j55328k54985n951O2002
10378a7642j1100p0512J33153N578N4672O1118O8851J7503q7575n1300j94124
10367i1378m153J25344N8645N1854q1928N4676J32080N3763j27620j41735J8116
10356D7664J02233j00428q0800L6194P9770L588k3232M8272k0047j30823N3456
10345A5847K31904J20970j89785l7436j38257J50916n0621o8994P6639j30757
10335a9574q1925J06017O5201J7314R833p7820m7144n6749O6966j2411Q3342o633
$$ plain form
10411 295005 388262 327006 232166 189249 185434 178729 158939 50379 79156 209681 377823
10400 377823 413900 325263 303588 361934 374303 328664 227195 77009 42061 -49042 20657
10389 20657 123538 133229 270868 368749 263761 345454 336620 181292 -73693 -79644 -17642
10378 -17642 -28742 -99254 33899 39477 94149 155267 224118 241621 154046 102746 -91378
10367 -91378 -95531 29813 88458 140312 58384 113060 245140 298903 171283 29548 47664
10356 47664 149897 49469 -31331 4863 84633 88221 64989 113261 93214 -37609 15847
10345 15847 247751 368721 178936 141500 3243 154159 103538 34544 111183 -19574
10335 -19574 -101499 4518 69719 87033 96866 19046 -28098 -84847 -17881 -30292 53050 46417
10323D6417l2572j07105j5396Q3221K91647J42995j22981j02935O290K47137J82478
10312F19196j70670k80408k39792l1433m7391J05938m8256L5501J69788J52700
10302B65173K345j25896j07513J63455P8015M874P3556Q6840o6891k2860n1662
10291B99436Q977j1552m3451j21432j0092j31478J95687J79471j06659j08874
10281A50033j32065N5497l7835m7786J13568J38074J37637K7124j28843R048n391
10270B79061k7767k4958r3641N4538O8134p7344j81554l3307P0438p501R7724
10259A23823J37178J4609r9050L0111j14606J00324R4096P1686j25184q0733M6013
10248A98267q8738K3487j06780q9180n2413P6251J20221P7787l5130L9443K1475
$$ plain form
10323 46417 13845 -93260 -108656 -25435 266212 409207 286226 183291 189581 436718 619196
10312 619196 448526 168118 -71674 -103107 -150498 -44560 -92816 -57315 112473 265173
10302 265173 267518 141622 34109 197564 275579 280453 354009 440849 373958 351098 299436
10291 299436 308413 296861 253410 131978 121886 -9592 186095 365566 258907 150033
10281 150033 17968 73465 35630 -12156 101412 239486 377123 404247 275404 284452 279061
10270 279061 251294 226336 132695 187233 255367 178023 -3531 -36838 33600 26099 123823
10259 123823 261001 275610 176560 206671 92065 192389 286485 358171 232987 152254 198267
10248 198267 109529 133016 26236 -62944 -115357 -39106 81115 158902 123772 163215 184690
10237A84690q1696j22576j60736q0422K12899l8705P7294J5757Q8609J85426J39436
10226D19976j9418j09738o4241m0774O2660j6072j07945r974O6620j63616l8401
10215b0923l7522R3802J45397M8689m9190j24126k3696m1432P572r2419p5715
10204a69563j88214L7099J96064O6689p8933L5126J78885O5079j98204j82665
10194b38637K17382J40386O21k9061p6092j31205P6194p4882N1615J46149J83747
10183B66217n400j27230k0973o1037Q538J27098J22095j6349L3289J69036j22683
10172C72601l22781l7622j11636R0467n2421m5432q8654o519J36711J22374r4091
10161c7003J28637Q4093l3543q9873m6184Q8734O1544J30775N7235p7946n6044
$$ plain form
10237 184690 102994 -19582 -180318 -260740 -47841 -86546 -9252 6505 95114 280540 419976
10226 419976 400558 290820 226579 185805 248465 232393 124448 114474 181094 17478 -20923
10215 -20923 -58445 35357 180754 229443 180253 56127 32431 -9001 -1429 -93848 -169563
10204 -169563 -357777 -320678 -124614 -57925 -136858 -101732 77153 142232 -55972 -238637
10194 -238637 -21255 119131 119752 90691 14599 -116606 -40412 -115294 -63679 82470 266217
10183 266217 260817 133587 112614 51577 60115 187213 309308 292959 326248 495284 372601
10172 372601 49820 12198 -99438 -8971 -61392 -106824 -195478 -201997 -65286 57088 -37003
10161 -37003 91634 175727 142184 52311 6127 94861 156405 287180 344415 266469 210425
10150B10425j05324j32180p6847L7719P3400L2285n033L325n6770J145J29582
10139A11727M7815j5803o2188M6004k389L5142r66M491q268Q5523J64811n6523
10127C49376o2469j59779o1183J5315p1032P9690k9421k13030J9615R6765j9516
10116e5669J99049J65515N4503j05313L766N8496J14965j43599k99415p3858k8393
10105a09953j5348o8919k9951M1795N6114n522k22843J1896J68552J04984n5256
10094a24451J5594q453p870K5766j64693j09098P1672J25189q683K7783q8091
10083b45335q0535j0498J46687J81755M4769k9000P8830J30098P2690Q6078p1876
10072C03663j23509L0631J67221q5322j57772j47233j68731P1035k0166j902R2682
$$ plain form
10150 210425 105101 -27079 -103926 -66207 7193 39478 34445 37770 -19000 -17855 111727
10139 111727 159542 143739 81551 127555 125166 160308 159342 163833 155565 241088 405899 349376
10127 349376 286907 127128 65945 81260 10228 89918 60497 -152533 -132918 -36153 -55669
10116 -55669 143380 308895 363398 258085 261851 320347 435312 291713 -7702 -81560 -109953
10105 -109953 -125301 -194220 -224171 -182376 -126262 -131784 -354627 -342731 -174179 -69195 -124451
10094 -124451 -108857 -117310 -125180 -99414 -264107 -373205 -301533 -176344 -185027 -157244 -245335
10083 -245335 -325870 -336368 -189681 -7926 36843 7843 86673 216771 289461 375539 303663
10072 303663 180154 210785 378006 292684 134912 -12321 -181052 -110017 -130183 -132085 -39403
10061c9403J05421R930k7847J83492J7994j55932k83583m4207Q6788K7688J81181
10050F1522o0410o5762J33370N4467N9319n4698q5007J4155l4623n2218J36289
10039A06404L0369J41753j77441n772N6039j21614j40444J8626J81620J7697O2131
10028A69368j26995j04309O710k1651j12789J1758N6887J34044J10728j628l0541
10017I1582L0992r0737J64496J7728j25830j33405J5004Q5725J93736J11306j17044
10006B43553k73603O3373q2687Q437J20033j07767o1231m1767j44166P2736Q3204
9995a19885k8966M0772p0018J25584J61823M3879O4214Q7420J0089j7340k29592
9984F7980j47472Q9317M2244j44881j34678J3306J15516J30023Q1401j9543n1493
$$ plain form
10061 -39403 66018 75948 48101 231593 249587 93655 -189928 -234135 -147347 -119659 61522
10050 61522 1112 -64650 68720 123187 182506 127808 42801 56956 22333 -29885 106404
10039 106404 136773 278526 101085 95313 151352 29738 -110706 -92080 89540 107237 169368
10028 169368 42373 -61936 -55226 -76877 -189666 -177908 -121021 13023 123751 122123 91582
10017 91582 122574 31837 196333 214061 88231 -45174 -30170 55555 249291 360597 243553
10006 243553 -30050 33323 -49364 -40927 79106 -28661 -89892 -131659 -275825 -203089 -119885
9995 -119885 -148851 -108079 -178097 -52513 109310 153189 217403 304823 314912 297572 67980
9984 67980 -79492 9825 52069 -92812 -227490 -214184 -98668 31355 112756 93213 41720
9973D1720m012r6388l4480p6275J09759K15689J08358r0195n8379K7846o7712
9962G5931j75285j94306l6929J60802N7167P270l3291k126l8957n2286K2098J17760
9950i2152J17868j15931j62841J30206K12877J14559q4261l3105j12943j10041
9940a35764k7171N1131j9270l7118P6929J84032J3046J53136p6782j27550p7336
9929b2717n3470k2515P732J2380J51027N1899J28295M8912j2191l0874j6640k99528
9917e7690m9891J83873L7415k4014M0418O9969M7646j23434j21197j2311J09472
9906A00256J09052P0039l3224m7249l4011R4766r1855M2134L3037l1651M8042
9895B59336l4609p439M3874o6275k998m7830j44304j9068N6258j0116m4628P3279
$$ plain form
9973 41720 37708 -58680 -93160 -169435 -59676 156013 264371 174176 115797 143643 75931
9962 75931 -99354 -293660 -330589 -169787 -112620 -105350 -138641 -140767 -179724 -232010 -209912 -92152
9950 -92152 25716 -90215 -253056 -122850 90027 204586 120325 87220 -25723 -135764
9940 -135764 -162935 -111804 -131074 -168192 -91263 92769 105815 258951 182169 54619 -22717
9929 -22717 -76187 -98702 -90970 -78590 72437 124336 252631 301543 289352 258478 241838 -57690
9917 -57690 -107581 76292 113707 89693 130111 200080 247726 124292 3095 -9216 100256
9906 100256 209308 279347 246123 198874 164863 259629 167774 209908 242945 211294 259336
9895 259336 224727 217288 261162 194887 191889 144059 -245 -19313 36945 26829 -17799 55480
9883E5480p2961p3232J09599P5664k5570J02600K8077m4850j79919j2140J08889
9872G1637P5538J47545P856n94R9443R4183J8949j27114j03905R768J42635K58090
9860F94031M16046K74007n0655R2887K69241J30152M06884O04039O81335J041634
9850D559601J362487J451845P61298j03301o79668q64202j257044j213546q16930
9841C200540p53031n87004l42587l47828j04517n7494j52957p2892j69825J18881
9831G31286L2807n3370n8119J01861k8040k57835j05878q0589N7142K8309o6106
9820C01468O8464m6665j93230M936Q3942K6144L5961N1668J66708j43583O2836
9809D18649p2707J5068L2031r0556p2597M1874q1006M9197n6253n0449m6329o8975
$$ plain form
9883 55480 -17481 -90713 18886 94550 68980 171580 199657 154807 -25112 -37252 71637
9872 71637 147175 294720 302576 301982 401425 495608 514557 387443 283538 293306 435941 694031
9860 694031 1110077 1384084 1333429 1426316 1695557 1825709 2232593 2836632 3517967 4559601
9850 4559601 5922088 7373933 8135231 8031930 7352262 6488060 5231016 4017470 3200540
9841 3200540 2447509 1860505 1517918 1170090 1065573 1008079 855122 782230 612405 731286
9831 731286 764093 710723 652604 754465 726425 468590 362712 282123 339265 367574 301468
9820 301468 369932 323267 130037 134973 218915 245059 281020 332688 499396 355813 418649
9809 418649 345942 361010 393041 302485 229888 271762 190756 239953 183700 133251 86922 17947
9797A7947n8344P8800l0747j15189J17507L9474K43678M9708j27606j69716N530
9786E1042Q3883P8650j06878k2101k6000O6834J17203l6111j12556j60778J51892
9775H5080J35985R6355j5748l8643l9248N8364o7263r0003N4145q4547m1182L9425
9763I2720J03794J5059J63310k07614j78084k0097N0327L0784k6049l5803K9486
9752A7833P6925j34588p5452P4705l7723l6706J43956M4326l2704l0062j28493
9741a17983Q5646R1281J08879j73831q5707j245q6652k19713M648K32141J27409
9730c5127m4898Q9024Q9568M9384l4619j24153j06422r7640j77146J30375M6620
9719b15034J7788J49553J53703n4584N5646K9227j57610j21748P1737j1883J2829
$$ plain form
9797 17947 -40397 38403 7656 -107533 9974 49448 293126 342834 215228 45512 51042
9786 51042 134925 213575 106697 84596 58596 125430 242633 206522 93966 -66812 85080
9775 85080 221065 317420 301672 263029 223781 282145 214882 124879 179024 94477 53295 92720
9763 92720 196514 211573 374883 167269 -10815 -30912 19415 50199 24150 -11653 17833
9752 17833 94758 -39830 -115282 -40577 -78300 -115006 28950 73276 40572 10510 -117983
9741 -117983 -32337 58944 167823 -6008 -91715 -92960 -179612 -399325 -394677 -162536 -35127
9730 -35127 -80025 8999 98567 147951 113332 -10821 -117243 -214883 -392029 -261654 -215034
9719 -215034 -197246 -47693 106010 51426 107072 136299 -21311 -143059 -71322 -83205 -70376
9708g0376Q2825j0992j45689n4508o0551O5916Q3064J10667j38285j497q8758
9697b28184Q0897J81563o0508j7259P9071M6637n5398j66274j8581K4289m9689
9686a83436K13620N1442o8893j58417N667K0082j37832J0266P5041Q5035o7970
9675a55395j72178N129L0765Q6228L0771L0814K6144Q5714R462k6523J3775m7431
9663h2725j01401l0223N8138L02919J27268j58911j76704m6779P6239l3114p1433
9652a36726k0754K9552j05567M0672J11942J81445K083k73003M886J40119l4686
9641f0037p6946r4118j587J35574p550j35016O4559J92266J78417j08309j34370
9630d7117J44610P9980n9614p6307j87687L4827L8729j5736N973j1449J58954
$$ plain form
9708 -70376 12449 1457 -144232 -198740 -259291 -193375 -110311 356 -137929 -139426 -228184
9697 -228184 -147287 34276 -26232 -43491 35580 82217 26819 -139455 -158036 -133747 -183436
9686 -183436 30184 81626 12733 -145684 -140017 -119935 -257767 -247501 -172460 -87425 -155395
9675 -155395 -327573 -322444 -291679 -205451 -174680 -143866 -117722 -32008 -22546 -49069 -35294 -82725
9663 -82725 -184126 -214349 -156211 146708 273976 115065 -61639 -108418 -32179 -65293 -136726
9652 -136726 -157480 -127928 -233495 -192823 -80881 100564 102647 -170356 -165470 -25351 -60037
9641 -60037 -136983 -231101 -232688 -97114 -104664 -239680 -175121 17145 195562 87253 -47117
9630 -47117 97493 177473 117859 41552 -146135 -111308 -72579 -88315 -82342 -93791 65163
9619F5163l5216K5205J7227O757j32805j30009q5929J74273P8098j05293j35157
9608b57686P0921j49978m2074J66844J74011J03472p3900j73420l2328K1536O9345
9597a23257n8824P075J1872J26466J6440j38096p7671L6006J5553J7001N5598
9586a11837L726L1825p0669J1320K6871o3759p7622J27674J30090j30269l4381
9575a57031J06450n045j27367j346M8385R9219j4790j80934L2457K38407o4649
9564b6244o7395m7117J44846J06137K3738L0621k3273o7715L6060J6734J8l191
9552A23219K208p282N5175j8338p000r496N46p1497k9539Q2199m9442L347O758
9539H0858N1946J40078q2284q4495o6747m3l6868K6757n2510o6549K5109J17887
$$ plain form
9619 65163 29947 55152 72379 79136 -53669 -183678 -269607 -95334 -17236 -122529 -257686
9608 -257686 -186765 -336743 -378817 -211973 -37962 65510 -8390 -181810 -214138 -192602 -123257
9597 -123257 -182081 -175006 -163134 -36668 -20228 -158324 -235995 -199989 -184436 -167435 -111837
9586 -111837 -108111 -76286 -146955 -135635 -108764 -172523 -250145 -122471 7619 -122650 -157031
9575 -157031 -50581 -55626 -182993 -184339 -135954 -36735 -51525 -232459 -200002 38405 -26244
9564 -26244 -93639 -140756 4090 110227 133965 164586 141313 73598 109658 126392 126410 123219
9552 123219 125427 118145 173320 154982 147982 138486 139032 67535 37996 120195 70753 74100 80858
9539 80858 132804 272882 190598 106103 39356 39313 2445 29202 -23308 -89857 -64748 53139
9527E3139J9476r3382m9978P1832R5129r317j57499Q4813n5192k9811J48388o7697
9515I901j72102K2634r9944K7206L13754J31807n1608l1494K0753K4494Q534m2591
9503A61344J03537Q5113j54882j00534m4113j73910m1803M4398Q6044l3243Q5824
9492A7775P3884Q0706j05347n8865J12393O2700r7719k12615M9768R1098l1709
9481a7931L468j3634n6692N048j21015M206K4130O6756M6651l1791K1484N7254
9469a2066p855N4224j61900K26542J67667r142l023m0728J1677r7063j10808o0712
9457d3187j23059r4252J80848J6016j36169O5841J7983L9097r7040p519M5207
9446a36234K2964J33423J25228q5846J5615Q3309O1660L1375J35539l3254o4136
$$ plain form
9527 53139 72615 -20767 -70745 1087 96216 86899 -70600 14213 -40979 -70790 77598 9901
9515 9901 -162201 -139567 -239511 -212305 101449 233256 181648 150154 170907 195401 203935 161344
9503 161344 264881 349994 195112 94578 50465 -123445 -165248 -120850 -34806 -68049 17775
9492 17775 91659 172365 67018 8153 120546 183246 85527 -127088 -77320 13778 -17931
9481 -17931 -14463 -28097 -84789 -79741 -200756 -196550 -172420 -105664 -59013 -90804 -69320 -12066
9469 -12066 -19921 34303 -127597 98945 266612 257470 254447 213719 225396 128333 17525 -43187
9457 -43187 -166246 -260498 -79650 -63634 -199803 -133962 -115979 -76882 -173922 -181441 -136234
9446 -136234 -113270 20153 145381 59535 75150 158459 220119 251494 387033 353779 289643
9435B89643P9974r8028j88296K3453L4108P569o4633p5401j34509j15056N3144
9424a88032Q6972R4256R0835j49925r0062j91853o9946L8966p3634K4185J77236
9413b51002j4025J04128J66036J51130N356j23932k2204r3376J7890m6285o7384
9402a73668R2623K12208k8892r4577K9484j01040O2815O3992l8584J2595J83822
9391B20778N5388j47850j37730m7118J0494m4396j12306M9075M9373J43149J824
9380D0681K1124J49354J9749j18615l1014Q5878j97865n1724o9378k0877Q1275
9369i1412O0332k1746O3841j2478m8185j07457J23615l7926k8147N1853R8992
9358E1282q898K4245J13613L1367j25092O2660J61900N1771q928M0883M3716j56145
$$ plain form
9435 289643 369617 271589 83293 106746 140854 148423 83790 8389 -126120 -241176 -188032
9424 -188032 -101060 -6804 84031 -65894 -155956 -347809 -417755 -378789 -452423 -428238 -251002
9413 -251002 -265027 -160899 5137 156267 161623 37691 15487 -77889 -59999 -106284 -173668
9402 -173668 -81045 131163 102271 7694 37178 -63862 -1047 62945 24361 36956 220778
9391 220778 276166 128316 -9414 -56532 -46038 -90434 -202740 -153665 -104292 38857 40681
9380 40681 61805 211159 230908 112293 81279 167157 -30708 -82432 -151810 -172687 -91412
9369 -91412 -31080 -52826 11015 -1463 -49648 -157105 -33490 -71416 -99563 -47710 51282
9358 51282 42384 66629 180242 211609 86517 149177 311077 362848 353920 394803 438519 282374
9346B82374k38015Q9891n2772J23785J42391P8476j06832o852M0774j16837r045
9335B27338p8527l6176J2569J2445n9275r4911J51243J18486Q2703j5477p8674
9324B41744M670R5036P0021L7019J4704R5928O1829N6474n4457j8099m2700P9911
9312F42080j12061R7036N1522m2691o6377M9517q9242K55352J73635K9100k8759
9301I59112m3776o8002J02053K99622K05980J65325L06293K32080L39089L25057
9291B822833L73943M83005O80266Q82199J013520Q50981R34613J024828J098033
9282A0164221J072019J204444J300702J393429J853591K730285M006401O032229
9274B9757321R230530J4393784J8474224J3021254Q95964n004208r253305j2749573
$$ plain form
9346 282374 44359 134250 81478 205263 347654 426130 319298 312446 353220 236383 227338
9335 227338 148811 112635 125204 137649 78374 -16537 134706 253192 335895 320418 241744
9324 241744 246414 341450 411471 448490 463194 559122 620951 677425 622968 604869 562169 642080
9312 642080 530019 627055 678577 635886 569509 619026 529784 785136 958771 987871 959112
9301 959112 915336 847334 949387 1249009 1454989 1620314 1926607 2158687 2497776 2822833
9291 2822833 3196776 3679781 4360047 5242246 6255766 7106747 8041360 9066188 10164221
9282 10164221 11236240 12440684 13741386 15134815 16988406 19718691 23725092 29757321
9274 29757321 38987851 53381635 71855859 84877113 85773077 80768869 71515564 58765991
9266E8765991j3748549j1697723q282344n587501l888112k716269j941685j429310
9258I474498j122786q43379o04701n05992l35073j70951k70563n29009l92890
9249D699154l61950j86107O8744L4531r5554j12Q2133m3898K2688J52898l1773
9238D340754o4280r5793q2203k31194j60902j21940j15329k24204j54899j82212
9228B907798n9925j30288l10422l4463n2721k15230j23040p301j73552k5605p0687
9217A704564j99231l9942j40720j3716r3406m8431j52713q8448l4289k8629j70010
9206F95029k486K85195J34203R48o3435p962L2658l8286K3010j58253j36108M9460
9194H13973p2514j17267k39099M726O1718O298M3424P8040J72096r7890q2847
$$ plain form
9266 58765991 45017442 33319719 25037375 19449874 15561762 12845493 10903808 9474498
9258 9474498 8351712 7508333 6903632 6397640 6062567 5891616 5621053 5092044 4699154
9249 4699154 4337204 4151097 4219841 4254372 4158818 4158706 4240839 4196941 4219629 4372527 4340754
9238 4340754 4276474 4180681 4098478 3867284 3706382 3584442 3469113 3244909 3090010 2907798
9228 2907798 2847873 2717585 2407163 2372700 2319979 2104749 1981709 1974408 1800856 1775251 1704564
9217 1704564 1505333 1465391 1324671 1310955 1217549 1169118 1016405 927957 893668 865039 695029
9206 695029 692543 977738 1111941 1112889 1049454 1041492 1074150 1035864 1058874 900621 764513 813973
9194 813973 741459 624192 385093 389819 451537 457835 501259 579299 751395 653505 570658
9183E70658J6254q9200p5806n9440j24825p2616J14676J23941j29244j34105J4754
9172A55047J50293J38999N5458j16588q7973p5267p9728k8812j6964r6648m2522
9161d4705J72372N0154j50496q8849j2606J66722K8762r2468l5793j05907P6318
9150c6496L19640L6279p0366p3057O0171Q505m7955p5814K6272k03111J09752
9139E3820R4049M241J1965R5289K6059l2155j7757k55928j49705J05098N5454
9128i570l2566N7157L9334L0029P5017O9563K1655n7672k5855k20841p1836J7861
9116a07724Q9781J8731q933K4703l0105J79600M6942L909p1295p8065k3637L4846
9104G8753P840n9381K51604r8417j49770r3463K0019k1055j12150Q3583J5136
$$ plain form
9183 570658 586912 497712 421906 362466 237641 165025 279701 403642 274398 140293 155047
9172 155047 305340 444339 499797 383209 295236 219969 140241 111429 94465 -2183 -44705
9161 -44705 127667 177821 27325 -61524 -74130 92592 121354 28886 -6907 -112814 -36496
9150 -36496 283144 319423 249057 176000 236171 244676 196721 120907 147179 -55932 53820
9139 53820 147869 152110 164075 259364 285423 253268 235511 -20417 -170122 -65024 -9570
9128 -9570 -42136 15021 54355 84384 159401 228964 250619 192947 167092 -53749 -125585 -107724
9116 -107724 -17943 788 -8145 16558 -13547 166053 212995 216904 145609 67544 43907 78753
9104 78753 86593 27212 278816 180399 30629 -62834 -42815 -63870 -176020 -92437 -77301
9093g7301P4480N4094R9064J28577j20786r1011K693m0611j6799O1314N9685p7335
9081E6064o8526P2825k1292P685K21906k4908m8581j48353K1387J07038J07518
9070B82763j28988j09639k3274M3609Q5638j22850J6033O3645K9713M7226N3148
9059B37024p425j95639k26408l7009J47420J04411j1283m0607m5678l0873J85999
$$ plain form
9093 -77301 -2821 51273 150337 278914 158128 67117 69810 29199 12400 73714 133399 56064
9081 56064 -12462 60363 39071 46756 268662 243754 195173 46820 68207 175245 282763
9070 282763 153775 44136 20862 64471 150109 27259 43292 106937 136650 183876 237024
9059 237024 229599 33960 -192448 -229457 -82037 22374 11091 -29516 -75194 -106067 79932
$$ [...]
##END NTUPLES=NMR SPECTRUM
##END=
