##TITLE=Analysis number 310657
Compound Code cc 46046
Book Reference 415/180
Project Code adrs
Chemist Name bos
##JCAMPDX= 6.0         $$ Bruker NMR JCAMP-DX V2.0
##DATA TYPE= NMR SPECTRUM
##DATA CLASS= NTUPLES
##ORIGIN= Bruker BioSpin GmbH
##OWNER= NMR
$$ XWIN-NMR		Version 3.5
$$ Tue Jun 21 15:16:53 2005 GMT Daylight Time (UT+1h)  MAYBRIDGE\NMR@NMR_250MHZ
##.OBSERVE FREQUENCY= 250.131544655141
##.OBSERVE NUCLEUS= ^1H
##.ACQUISITION MODE= SIMULTANEOUS (DQD)
##.ACQUISITION SCHEME= undefined
##.AVERAGES= 16
##.DIGITISER RES= 18
##SPECTROMETER/DATA SYSTEM= dpx250
##.PULSE SEQUENCE= zg30
##.SOLVENT NAME= CDCl3
##.SHIFT REFERENCE= (INTERNAL, CDCl3, 0, 16.4516)
##AUDIT TRAIL= $$ (NUMBER, WHEN, WHO, WHERE, WHAT)
$$ ##TITLE= Audit trail, XWIN-NMR		Version 3.5
$$ ##JCAMPDX= 5.01
$$ ##ORIGIN= Bruker BioSpin GmbH
$$ ##OWNER= NMR
$$ C:\u/data/dgb/nmr/ADRS/4490/pdata/1/auditp.txt
$$ ##AUDIT TRAIL=  $$ (NUMBER, WHEN, WHO, WHERE, WHAT)
(   1,<2005-06-21 15:16:34.74 +100>,<MAYBRIDGE\NMR>,<NMR_250MHZ>,
      <created by zg, POWCHK disabled, PULCHK disabled
       configuration hash MD5:
       62 19 C7 07 E1 42 D1 B7 37 6C 3D D0 77 39 F9 E6
       data hash MD5: 64K
       4D 3F 96 7A 38 C7 70 2A A3 5A 52 AE 92 70 FD 18>)
(   2,<2005-06-21 15:16:46.25 +100>,<MAYBRIDGE\NMR>,<NMR_250MHZ>,
      <Start of raw data processing
       ef LB = 0.3 FT_mod = 6 PKNL = 1 SI = 32K 
       data hash MD5: 32K
       C3 83 F9 BA 49 31 05 FB B4 65 AC A5 24 C8 E7 28>)
(   3,<2005-06-21 15:16:48.08 +100>,<MAYBRIDGE\NMR>,<NMR_250MHZ>,
      <apk 
       data hash MD5: 32K
       B1 07 D4 C9 F1 8D C9 09 E2 A8 43 00 27 83 57 52>)
(   4,<2005-06-21 15:16:48.75 +100>,<MAYBRIDGE\NMR>,<NMR_250MHZ>,
      <abs ABSG = 5 
       data hash MD5: 32K
       5B 36 A9 44 C9 54 E1 C0 0F 0B 74 A3 3F 25 77 9C>)
$$ ##END=
$$ 
$$ hash MD5
$$ 09 A0 52 50 AA 31 42 CF 9B 34 72 E1 DC 6B 2F 00
##$RELAX= 
##$RELAX= 
##$RELAX= 
##$RELAX= 
##$RELAX= 
##$RELAX= 
##$RELAX= 
$$ Bruker specific parameters
$$ --------------------------
##$DU= <C:\u>
##$EXPNO= 4490
##$NAME= <ADRS>
##$PROCNO= 1
##$TYPE= <nmr>
##$USER= <dgb>
##$AMP= (0..31)
100 100 100 100 100 100 100 100 100 100 100 100 100 100 100 100 100 100 
100 100 100 100 100 100 100 100 100 100 100 100 100 100 
##$AQSEQ= 0
##$AQ_mod= 3
##$AUNM= <au_zg>
##$AUTOPOS= <41 >
##$BF1= 250.13
##$BF2= 250.13
##$BF3= 250.13
##$BF4= 250.13
##$BF5= 500.13
##$BF6= 500.13
##$BF7= 500.13
##$BF8= 500.13
##$BYTORDA= 1
##$CFDGTYP= 0
##$CFRGTYP= 5
##$CHEMSTR= <none>
##$CNST= (0..31)
1 1 145 1 1 1 1 1 1 1 1 1 1 1 1 1 1 1 1 1 1 1 1 1 1 1 1 1 1 1 1 1 
##$CPDPRG= <>
##$CPDPRG1= <>
##$CPDPRG2= <>
##$CPDPRG3= <>
##$CPDPRG4= <mlev>
##$CPDPRG5= <mlev>
##$CPDPRG6= <mlev>
##$CPDPRG7= <mlev>
##$CPDPRG8= <mlev>
##$CPDPRGB= <>
##$CPDPRGT= <>
##$D= (0..31)
0 1 0 0 0 0 0 0 0 0.06 0 0 0 0 0 0 0.0002 0 0 0 0 0 0 0 0 0 0 0 0 0 0 
0 
##$DATE= 1119363394
##$DBL= (0..7)
120 120 120 120 120 120 120 120 
##$DBP= (0..7)
150 150 150 150 150 150 150 150 
##$DBP07= 0
##$DBPNAM0= <>
##$DBPNAM1= <>
$$ [...]
##$SUBNAM7= <"">
##$SUBNAM8= <"">
##$SUBNAM9= <"">
##$SW= 20.6930455092707
##$SWIBOX= (0..15)
0 0 3 0 0 0 0 0 0 0 0 0 0 0 0 0 
##$SW_h= 5175.983436853
##$TD= 65536
##$TD0= 1
##$TE= 295.16
##$TE2= 300
##$TE3= 300
##$TEG= 300
##$TL= (0..7)
0 120 120 120 120 120 120 120 
##$TP= (0..7)
150 150 150 150 150 150 150 150 
##$TP07= 0
##$TPNAME0= <>
##$TPNAME1= <>
##$TPNAME2= <>
##$TPNAME3= <>
##$TPNAME4= <>
##$TPNAME5= <>
##$TPNAME6= <>
##$TPNAME7= <>
##$TPOAL= (0..7)
0.5 0.5 0.5 0.5 0.5 0.5 0.5 0.5 
##$TPOFFS= (0..7)
0 0 0 0 0 0 0 0 
##$TUNHIN= 0
##$TUNHOUT= 0
##$TUNXOUT= 0
##$USERA1= <user>
##$USERA2= <user>
##$USERA3= <user>
##$USERA4= <user>
##$USERA5= <user>
##$V9= 5
##$VALIST= <valist>
##$VCLIST= <CCCCCCCCCCCCCCC>
##$VD= 0
##$VDLIST= <DDDDDDDDDDDDDDD>
##$VPLIST= <PPPPPPPPPPPPPPP>
##$VTLIST= <TTTTTTTTTTTTTTT>
##$WBST= 1024
##$WBSW= 4
##$XGAIN= (0..3)
0 0 0 0 
##$XL= 0
##$YL= 0
##$YMAX_a= 411916
##$YMIN_a= -429259
##$ZGOPTNS= <>
##$ZL1= 120
##$ZL2= 120
##$ZL3= 120
##$ZL4= 120
##$ABSF1= 16.4516
##$ABSF2= -4.241573
##$ABSG= 5
##$ABSL= 3
##$ALPHA= 0
##$AQORDER= 0
##$ASSFAC= 0
##$ASSFACI= 0
##$ASSFACX= 0
##$ASSWID= 0
##$AUNMP= <proc_1d>
##$AZFE= 0.1
##$AZFW= 0.1
##$BCFW= 0
##$BC_mod= 0
##$BYTORDP= 0
##$COROFFS= 0
##$CY= 12.5
##$DATMOD= 1
##$DC= 0
##$DFILT= <>
##$DTYPP= 0
##$F1P= 14.0000005364418
##$F2P= -0.99999901652339
##$FCOR= 0.5
##$FTSIZE= 32768
##$FT_mod= 6
##$GAMMA= 0
##$GB= 0
##$INTBC= 1
##$INTSCL= 1
##$ISEN= 128
##$LB= 0.3
##$LEV0= 0
##$LPBIN= 0
##$MAXI= 10000
##$MC2= 0
##$MEAN= 0
##$ME_mod= 0
##$MI= 0
##$NCOEF= 0
##$NC_proc= -3
##$NLEV= 6
##$NOISF1= 0
##$NOISF2= 0
##$NSP= 0
##$NTH_PI= 0
##$NZP= 0
##$OFFSET= 16.4516
##$PC= 1
##$PHC0= -78.20296
##$PHC1= 4.830423
##$PH_mod= 1
##$PKNL= yes
##$PPARMOD= 0
##$PSCAL= 4
##$PSIGN= 0
##$REVERSE= no
##$SF= 250.130017607783
##$SI= 32768
##$SIGF1= 0
##$SIGF2= 0
##$SINO= 400
##$SIOLD= 32768
##$SREGLST= <1H.CDCl3>
##$SSB= 0
##$STSI= 32768
##$STSR= 0
##$SW_p= 5175.98343685301
##$SYMM= 0
##$S_DEV= 0
##$TDeff= 65536
##$TDoff= 0
##$TI= <Analysis number 999999
Compound Code 99
Book Reference 9
Project Code 9>
##$TILT= no
##$TM1= 0
##$TM2= 0
##$TOPLEV= 0
##$USERP1= <user>
##$USERP2= <user>
##$USERP3= <user>
##$USERP4= <user>
##$USERP5= <user>
##$WDW= 1
##$XDIM= 32768
##$YMAX_p= 382705716
##$YMIN_p= -74071
$$ End of Bruker specific parameters
$$ ---------------------------------
##NTUPLES= NMR SPECTRUM
##VAR_NAME=  FREQUENCY,     SPECTRUM/REAL,   SPECTRUM/IMAG
##SYMBOL=    X,             R,               I
##VAR_TYPE=  INDEPENDENT,   DEPENDENT,       DEPENDENT
##VAR_FORM=  AFFN,          ASDF,            ASDF
##VAR_DIM=   32768,         32768,           32768
##UNITS=     HZ,            ARBITRARY UNITS, ARBITRARY UNITS
##FACTOR=    0.157963299565203, 1,           1
##FIRST=     4115.03877783537, 0,            0
##LAST=      -1060.94465901764, 0,           0
##MIN=       -1060.94465901764, -74071,      0
##MAX=       4115.03877783537, 382705716,    0
$$ Real data points
##PAGE= N=1
##DATA TABLE= (X++(R..R)), XYDATA
$$ [...]
16785c339p791M057O547J826N077j0161j6564m68l057R87N385j835q419M592J1882
16770a1281R026n95m04l612Q649L9M16k031N318m267O071M757o119j457K1619
16755B6129j403l574j505j148j0338p147Q248Q031n93k1398N786J5646K273K183
16741B1190j6014p577R271q060k26L005r507r430J0416K2142N731Q202j2973k8980
16727a2810J834j08M295k5319J067K2972P577J3497k369k080R224q347n71j7613
16713h751o256o99J0762J7836o0j1254o157L521J5389m402j6105R182K253J5250
16699B0509M682j2302N655K0275o560l367j5088k0272Q885J148j2613p552j11
16686a6711N620J0759N371j2890J3246J5699j2469k772j5782o27J8214j0969k2433
$$ plain form
16785 -3339 -11130 -7073 -526 1300 6377 -3784 -20348 -20816 -23873 -22886 -17501 -19336 -27755 -23163 -11281
16770 -11281 -2255 -2850 -3254 -6866 1783 1822 2238 207 5525 1258 7329 12086 5967 4510 26129
16755 26129 24726 21152 19647 18499 8161 1014 9262 17293 16700 -4698 1088 16734 19007 21190
16741 21190 5176 -2401 6870 -1190 -1416 1589 -7918 -17348 -6932 15210 20941 29143 16170 -12810
16727 -12810 -10976 -11084 -6789 -32108 -31041 -8069 -492 13005 10636 8556 17780 9433 8862 -8751
16713 -8751 -15007 -15706 -4944 12892 12832 1578 -4579 -1058 14331 9929 -6176 3006 5259 20509
16699 20509 25191 12889 18544 38819 32259 28892 13804 -6468 2417 3565 -9048 -16600 -16711
16686 -16711 -11091 -332 5039 -7851 5395 21094 8625 5853 -9929 -10556 7658 -3311 -25744
16673b5744J9541p149j4983m916N544K4344K1604L874m960R80n254j4158k527
16660c804J1988J0453R915l485r065k1721k6477q786O4K7479K2107j925j0156
16647c413j0490o725M411L625n887O437K9246K2201J8310o090l1003j4094J0397
16634A6925R538r222j452L94K092m140j7247q171j0295K1669K2398k663j4987
16621D839N287m138k233Q150M124r728P241J640j734l385l468k361j1956J4132
16607F410N202j8514r293j2993l838Q874J2648P300m175N438p939R062J9665j2883
16593D964p112J1381M164o81k0339Q489j1938K388P479K5K924q21k737j6556j8525
16578c6895J4897R221K4754K2892K352P32k4195o771M491J6380Q05q496K474j2971
$$ plain form
16673 -25744 -6203 -13352 -28335 -33251 -27707 -3363 18241 22115 17155 18135 12881 -1277 -3804
16660 -3804 8184 18637 28552 25067 16002 -5719 -32196 -40982 -40918 -13439 8668 6743 -3413
16647 -3413 -13903 -20628 -16217 -12592 -18479 -12042 17204 39405 57715 51625 20622 6528 16925
16634 16925 26463 17241 15789 16183 18275 14135 -3112 -11283 -21578 91 22489 19826 4839
16621 4839 10126 5988 3755 11905 16029 6301 13542 15182 13448 10063 6595 4234 -7722 6410
16607 6410 11612 -6902 -16195 -29188 -33026 -24152 -11504 -4204 -8379 -2941 -10880 -1818 17847 4964
16593 4964 -2148 9233 13397 12716 -7623 866 -11072 -8684 -1205 -1180 1744 923 -1814 -18370 -36895
16578 -36895 -21998 -12777 11977 34869 37221 37953 13758 6987 11478 27858 28663 20167 22641 9670
16564I670r148J8401Q854q875L1679j3632k6465j2037l833J6591R716L965j0384
16551A4502j5853q931m031J6875J1771r98q383N847J6205j756m337p954m821k311
16537E825N489K1327N039j4360k262m65j6007k2073p990j078Q249Q260k404J8091
16523E641J1645p535j3126l355Q067J304j428p118j0140j059k658j1501R08J4809
16509a5546K697l60O745m294j3822J3757K327Q64m50J5913m66j1283M370J0455
16495A0907k096R075m044r439k770L827L762j2403M181n846k735m517J8790k317
16481D375K2075o84j1648j3951j2332r489N331K101J8324N289M673K8262N124
16468D7450j2775k2462j2028J344Q84M499q403j6964m981J5143P677j5772O151
$$ plain form
16564 9670 522 18923 27777 18902 50581 36949 10484 -1553 -5386 11205 20921 24886 14502
16551 14502 -1351 -10282 -14313 2562 14333 13335 4952 10799 27004 25248 20911 12957 8136 5825
16537 5825 11314 32641 37680 23320 21058 20593 4586 -17487 -25477 -26555 -18306 -10046 -12450 5641
16523 5641 17286 9751 -3375 -6730 1337 2641 1213 -5905 -16045 -17104 -19762 -31263 -30355 -15546
16509 -15546 -12849 -13209 -6464 -10758 -24580 -10823 -8496 -7632 -8082 7831 7365 -3918 452 10907
16495 10907 8811 17886 13842 4403 1633 5460 9222 -3181 1000 -4846 -7581 -12098 6692 4375
16481 4375 26450 25766 14118 167 -12165 -21654 -16323 -14222 4102 9391 14064 42326 47450
16468 47450 34675 12213 185 1529 2413 6912 -1491 -18455 -23436 -8293 -616 -16388 -10237
16455a0237J4484Q371j7727j1251M419M962j587j2337j2199Q257K6199N796k7205
16442b0055n322J3840m807R548J0579k7239J093K6361Q912j6676M780L430k103
16429B341k122j3643o952L112R372J0524o976o658p054j6119O771K6254J5843
16416A4693n126Q62J3396L693r98l211k3512r924N439J712K0341N107N501j7436
16402A0537j8140J1971J2406p148n652j46l525J971Q293K2728j5680j9483q56
16389b724L911L650j6804k5645M64L2040J4730j5713O674j2756j1448j0053o906
16376d0580N103J571J6337O647N144m462J0267J3941J3169j0253q713k5206N625
16363a1410J8121M592o78o778j934j21r800M169J8489j2473m589P823J3888P596
$$ plain form
16455 -10237 4247 12618 -5109 -16360 -11941 -6979 -8566 -20903 -33102 -24845 1354 7150 -20055
16442 -20055 -25377 -11537 -16344 -6796 3783 -23456 -22363 3998 12910 -3766 1014 4444 2341
16429 2341 219 -13424 -20376 -17264 -7892 2632 -4344 -11002 -18056 -34175 -27404 -1150 14693
16416 14693 9567 10429 23825 27518 26520 23309 -203 -10127 -4688 -2976 17365 22472 27973 10537
16402 10537 -7603 4368 16774 9626 3974 3828 303 2274 10567 33295 17615 -1868 -2724
16389 -2724 1187 4837 -11967 -37612 -37148 -5108 9622 -6091 583 -12173 -23621 -33674 -40580
16376 -40580 -35477 -33906 -17569 -10922 -5778 -10240 27 13968 27137 16884 8171 -17035 -11410
16363 -11410 6711 11303 10625 3847 1913 1792 -8008 -3839 14650 2177 -2412 5411 19299 26895
16349B6895l877j0444L388M626m091j1134n488M314R697o561k0252m357L975J3440
16335A31R186M051q821q825q319l687O922L048K281K6873J0721j4107k3548n195
16321i289J4245K5905j0346j882J0190q179j1674J782M630j6412j3552j1153J07
16308b5628k868K0930J8382l047n170K9824Q303l8722k2044Q791L260J5373q877
16295a493k0049q734R35K5960J3452m563r372J6478o369k0118r519K1679K783
16282A070r768M024M623R383K821O129m041j5347K866j0698q156l472J2910L491
16268d165p005j3329J325L457J1635J895j8386J2814J5682j2797k5810o824J3980
16255b7528J322k003m739N747K7504j792k1633Q93N138L850M449P166O8k575j0996
$$ plain form
16349 26895 23018 12574 15962 20588 16497 5363 -125 4189 13886 7325 -12927 -17284 -13309 131
16335 131 9317 13368 4547 -4278 -12597 -16284 -9362 -6314 -4033 22840 33561 19454 -4094 -9289
16321 -9289 4956 30861 20515 18633 28823 20644 8970 10752 15382 -1030 -14582 -25735 -25628
16308 -25628 -28496 -7566 10816 7769 2599 32423 40726 2004 -20040 -11249 -7989 7384 -1493
16295 -1493 -21542 -30276 -29341 -3381 10071 5508 -3864 12614 6245 -13873 -23392 -1713 1070
16282 1070 -8698 -4674 -51 9332 12153 18282 14241 -1106 1760 -8938 -17094 -20566 -7656 -4165
16268 -4165 -11170 -24499 -23174 -19717 -8082 -6187 -24573 -11759 3923 -8874 -34684 -41508 -27528
16255 -27528 -26206 -28209 -32948 -27201 303 -1489 -23122 -22229 -17091 -13241 -8792 -1626 -1558 -4133 -15129
16240a5129M416j756j1161M763j478J2968J1212j4145p7J1622N244m898j2577
16227a0996N210n39N458K6136J2514l645J994j9484k504J1289K456k0347k1520
16214a3978k0503J7514J8615j0663K238J0647n217j1046r078o324J9844J9351
16202A1400k933P32n60J0622P375k175k2092R566J1661j8636K927J9770k968j5460
16188I229Q666J0194j0824J627p664j6210O18J4429K63l402m49j3790r627L8n008
16173b1910K895o259R984L890o223J9192j1730j5980O72K393M127J5121Q525J2831
16159A7528n627j1335p840M592m413p254n176j2762N938L3860k353p344j1950
16146a4136J6359J447j1147q313j704l393L188J6813J1457k97K557j1727N148
$$ plain form
16240 -15129 -10713 -12469 -23630 -18867 -20345 -7377 3835 -10310 -10387 1235 6479 1581 -10996
16227 -10996 -5786 -6325 -867 25269 37783 34138 36132 16648 14144 25433 27889 7542 -13978
16214 -13978 -34481 -16967 1648 -9015 -6777 3870 -1347 -12393 -21471 -27795 -7951 11400
16202 11400 8467 9199 8639 19261 26636 24461 2369 11935 23596 4960 7887 27657 24689 9229
16188 9229 17895 28089 17265 18892 11228 -4982 -4364 10065 10328 6926 6477 -7313 -16940 -16902 -21910
16173 -21910 -19015 -25274 -15290 -11400 -17623 1569 -10161 -26141 -25469 -23076 -18949 -3828 4697 17528
16159 17528 11901 566 -7274 -2682 -7095 -14349 -19525 -32287 -26349 7511 5158 -2186 -14136
16146 -14136 2223 3670 -7477 -15790 -17494 -20887 -17699 -886 10571 10274 12831 1104 6252
16133F252n190j4566L410m495n434J3652M894j4812K200O038M772M47j5509n507
16119b3848O423N185J1052N288K538J4159j2917J1688P610l6370j8829O637P467
16106a3917J2561k218j663N43k0394O567L132q027J2539J0540K4447M037j4884
16093A3263j0419m555Q439K870j1215m015K426l029K84o24k760j913m652P213
16079h687M202n752J1821M281r25J018p307o85J9548o579j6869o471j276M105
16065i576K542K581k863l06J9965K3930j9128j6125L929k3859L690J8015N769
16052H564j1143k371j30Q140j5018j8426K193J7545Q85O765j542J237j7132K135
16038a8298Q56J8395J1984j2303k5222K607L351p265J725P403J1489n755J1761
$$ plain form
16133 6252 1062 -13504 -10094 -14589 -20023 -6371 -1477 -16289 -14089 -8051 -3279 -2832 -18341 -23848
16119 -23848 -17425 -12240 -1188 4100 6638 20797 7880 19568 27178 -9192 -28021 -21384 -13917
16106 -13917 -1356 -3574 -5237 -4694 -25088 -18521 -15389 -23416 -10877 -337 24110 28147 13263
16093 13263 2844 -1711 6728 9598 -1617 -5632 -3206 -6235 -5951 -6575 -9335 -11248 -15900 -8687
16079 -8687 -4485 -10237 1584 5865 4940 5958 -1349 -2034 17514 10935 -5934 -12405 -13681 -9576
16065 -9576 -7034 -4453 -7316 -7622 12343 36273 17145 1020 4949 -18910 -15220 2795 8564
16052 8564 -2579 -4950 -5080 3060 -11958 -30384 -28191 -10646 -9761 -2996 -4538 -3301 -20433 -18298
16038 -18298 -17442 953 12937 634 -24588 -21981 -18630 -25895 -24170 -16767 -5278 -11033 728
16025G28r68j4716n425J0850J3521J6435K1198J3004k143l5835j1827O505J2022
16012B3349o125j0339P831j0543O18P725n871p975M341r405q281K292K784J0597
15998I98J880J7003j3541k3397p459K1537O676M76K338j90M926R452J788p354
15984A5133k2178j7297n71k854m884M962J8145m058J0873Q045N195J1320j4780
15971G051j5046l545R357m181q359N045K940K488J605K234l710k487K341Q65P108
15956C706k737j0870R406j0706q841j010l26L255O747m450M44R220J6502J9430
15942B9770k5918j4460P285J566r6K277o518R777j1018P084P03j828O609k089
15928C144M647M09l911P45p60j3566j5346J80J8352J0660J7938J4717j658j0483
$$ plain form
16025 728 -240 -14956 -20381 -9531 3990 20425 41623 54627 52484 16649 4822 11327 23349
16012 23349 17224 6885 14716 4173 4791 12516 6645 -1330 3011 -6394 -14675 -12383 -9599 998
15998 998 2878 19881 6340 -17057 -24516 -2979 3697 4173 6511 6321 11247 20699 22487 15133
15984 15133 -7045 -24342 -24913 -27767 -32651 -27689 -9544 -13602 -2729 5316 10511 21831 7051
15971 7051 -7995 -11540 -2183 -6364 -14723 -9678 -6738 -4250 -2645 -411 -4121 -6608 -4267 -3402 3706
15956 3706 969 -9901 -495 -11201 -20042 -21052 -21378 -18123 -11376 -15826 -15382 -6162 10340 29770
15942 29770 3852 -10608 -3323 -1757 -1853 424 -6094 3683 -7335 -251 452 -1376 5233 3144
15928 3144 7791 8200 4289 5034 4274 -9292 -24638 -24458 -6106 4554 22492 37209 35551 25068
15914B5068J405l22k6468o530R237O836k2433j632K0204p025j429l896J6007Q100
15900A7122j1931j8039J472J0553n933j1834R172K21K110r74k157Q355n96M681
15886B222l146J0042N474j4142j3520N931J279m356J4909R822M121J5807k437
15873C2006j7981k4280J2397J689j7110J2689M569j820J327k512O074R305m267
15860A2086p697p462j1582j4166j207K229M633p661J0545J5029J5843M762J6103
15847C1455p045l0088p745K934k833L12j9104j2380J4325K2678K823k4600j5313
15834d4581J0932K1224J322j0900j2924J0280o20J1103J3025r298k0633l317q625
15821d3012J8673J6848N22l328j0163M315n298q752q818J3942K2363M836k279
$$ plain form
15914 25068 26473 26151 -317 -6847 2390 9226 -13207 -14839 5365 -1660 -3089 -6985 9022 17122
15900 17122 5191 -12848 -11376 -823 -6756 -18590 -9418 -9197 -7087 -8061 -10218 -1863 -2459 2222
15886 2222 -924 9118 14592 450 -13070 -7139 -5860 -10216 4693 14515 18636 34443 32006
15873 32006 14025 -10255 2142 3831 -13279 -590 3979 2159 3486 974 7048 16353 12086
15860 12086 4389 -3073 -14655 -28821 -30028 -27799 -23166 -30827 -20282 -5253 10590 15352 31455
15847 31455 24410 -5678 -13423 -10489 -13322 -13010 -32114 -44494 -30169 -7491 -4668 -29268 -44581
15834 -44581 -33649 -12425 -11103 -22003 -34927 -24647 -25267 -14164 -1139 -10437 -31070 -34387 -43012
15821 -43012 -24339 -7491 -6969 -10297 -20460 -16145 -21443 -30195 -39013 -25071 -2708 2128 -151
15808a51K974M420q283K971J131J209J285K107n903O924J1910L37k4533J860l061
15793d803n950L20l541J1351k655J183q818N666O34j2271R634o729j4671o582
15779c7232P294r001j1388N835J0784Q314J6973P2l646j7458j882j50p130M951
15765c3664J225n355p663J370K7742P551n013q334K0292R061K009J708n442k8302
15751b2815p143J56J9443J0550j0489m135J6969J706j2468j6931l2858K141R411
15738d6463j793K7909J1171P182l628M067j3737l489O897m856J2677J7856K2108
15725C5901r257j0470Rr300k216P607r331l169k1209j1490J0582K2478K1090n195
15711A6030j2328j945L115J2303j9200j141L281n463q103J0620Q670J653J1745
$$ plain form
15808 -151 2823 7243 -1040 1931 3062 4271 5556 7663 1760 8684 20594 20931 -3602 -1742 -4803
15793 -4803 -10753 -10433 -13974 -2623 -5278 -4095 -12913 -7247 -6613 -18884 -9250 -15979 -30650 -37232
15779 -37232 -29938 -38939 -50327 -44492 -33708 -25394 -8421 -8349 -11995 -29453 -31335 -31485 -38615 -33664
15765 -33664 -32439 -37794 -45457 -44087 -16345 -8794 -13807 -22141 -1849 7212 9221 10929 5487 -22815
15751 -22815 -29958 -29802 -10359 191 -10298 -14433 2536 4242 -8226 -25157 -58015 -55874 -46463
15738 -46463 -48256 -20347 -9176 -1994 -5622 -1555 -15292 -18781 -11884 -16740 -4063 13793 35901
15725 35901 26644 16174 16183 6883 4667 12274 2943 -226 -21435 -32925 -22343 135 21225 16030
15711 16030 3702 1757 4872 17175 -2025 -3166 115 -5348 -13451 -2831 5839 7492 19237
15698A9237J6645j5165k9831j8397N273M390J647J4993K0037q308j0201k3314
15686b2994J3984L501q384N573P81J2076J5370k063j438k192j4683o523N874N120
15672D002m926L027K612J8241J792j0670m711r234l057k345n13j2842R504j8648
15658b7768o687J9432J3358j0175R16O382k498j302k4696j1448K6042K4923J1747
15645A8226j282k2127o505j6415l198K0674J2250J3793j7035m718j4926j188J9541
15632b910j5250r049j1658n013l083J5924K5843O194r373p71j3042j1247Q82j8741
15618e1294J3145J5873n98L382M108L590K836j507L10k009q046k0378J456J9780
15604a9352l189k13m186J3184J0454R412k699n127K223j4005j540J151L609O526
$$ plain form
15698 19237 35882 20717 -9114 -27511 -22238 -17848 -16201 -1208 18829 10521 320 -22994
15686 -22994 -9010 -5509 -13893 -8320 -7539 4537 19907 17844 16406 14214 -469 -6992 -1118 4002
15672 4002 -924 2103 4715 22956 24748 14078 9367 133 -2924 -5269 -5782 -18624 -9120 -27768
15658 -27768 -34455 -15023 -1665 -11840 -10924 -4542 -7040 -8342 -33038 -44486 -18444 6479 18226
15645 18226 16944 -5183 -11688 -28103 -31301 -10627 1623 15416 -1619 -6337 -21263 -22451 -2910
15632 -2910 -18160 -27209 -38867 -43880 -46963 -31039 -5196 998 -8375 -9146 -22188 -33435 -32553 -51294
15618 -51294 -38149 -22276 -22874 -19492 -15384 -11794 -8958 -10465 -10155 -12164 -20210 -40588 -39132 -19352
15604 -19352 -22541 -22754 -26940 -13756 -3302 6110 3411 -1716 507 -13498 -15038 -13887 -10278 -3752
15590c752J2545L450L924r125l032Q649K84l327n908m596k094j527j70J5014N002
15575A5337j7823J485K3265K752j2569j3369j7386k2086k20J5808N928M722J5113
15562I57O801q087j633j0221Q718O341j0121K324J7957N287L982m853j1948o695
15548a191o767J2532J4819m05j0561j2367j907K0052J6386j726j4125l497o147
15535E096m713r083P688K7666o15j8262n369L182J0803k482M301mJ0551l136j5414
15520A0209q296k1039J4665K4214n251j1894m823l971J174N536j820J3332R11
15507A2947k2861j5675p677J5288N737m971L772K908M344J2159J1199k0327j4473
15494a7630N90K0712M789l785N516L5217N762j3071k8643l2111r284j877O192
$$ plain form
15590 -3752 8793 12243 16167 7042 4010 12659 12943 9616 3708 -888 -2982 -4509 -4679 10335 15337
15575 15337 -2486 -1001 22264 25016 12447 -922 -18308 -40394 -40614 -24806 -18878 -14156 957
15562 957 7758 -329 -1962 -12183 -3465 2876 -7245 -4921 13036 18323 22305 17452 5504 -1191
15548 -1191 -7958 4574 19393 18988 8427 -3940 -5847 14205 30591 28865 14740 11243 5096
15535 5096 383 -8700 -1012 26654 26039 7777 2408 5590 16393 13911 18212 18208 28759 25623 10209
15520 10209 1913 -19126 -4461 19753 14502 2608 -2215 -6186 -5012 524 -1296 12036 12947
15507 12947 -9914 -25589 -33266 -17978 -12241 -17212 -13440 -10532 -6188 5971 17170 -3157 -17630
15494 -17630 -17040 3672 8461 4676 10192 45409 51171 38100 9457 -22654 -31938 -33815 -27623
15481b7623J521Q423L673J6900K3363k2166j7867N588o831Q639Q143q474P423
15468G12j2119j2875k70J1853K833m653j2160l3L250N675J7640J7403j7105J4958
15454A5109n457k7045j5102P54J9560O677k953m063Q683O987r319J667j6163o574
15440b7239O752m453K0892Q745l391j217Q376o393r670J301P096J47m924n308
15426i286k15j5390R336J2259K186j0789J0299O948j3700o698j0107p868R103
15413b3922o348o434j057K407K0838J2607Q058J516j6728j4590R49K0620L577
15400A493m366R801j1539j7085L1594K16l1636j6576J9905J2657L314k476J907
15387b791l872j940j2126j080j1159R216q518j1193J5599M921q086k63N386R597
$$ plain form
15481 -27623 -26102 -17679 -14006 2894 26257 4091 -13776 -8188 -15019 -6380 1763 -6711 712
15468 712 -11407 -24282 -24552 -12699 -9866 -14519 -26679 -26712 -23462 -17787 -147 17256 151 15109
15454 15109 9652 -17393 -32495 -31741 -12181 -5504 -8457 -12520 -3837 3150 -6169 -4502 -20665 -27239
15440 -27239 -20487 -24940 -4048 4697 1306 89 8465 2072 -7598 -6297 799 946 -3978 -9286
15426 -9286 -9501 -24891 -15555 -3296 -1110 -11899 -1600 5348 -8352 -15050 -25157 -33025 -23922
15413 -23922 -30270 -36704 -37761 -35354 -14516 -1909 6149 7665 -9063 -23653 -22704 -2084 1493
15400 1493 -2873 6928 -4611 -21696 9898 10114 -21522 -38098 -18193 -5536 -2222 -4698 -2791
15387 -2791 -6663 -8603 -20729 -21809 -32968 -23752 -32270 -43463 -27864 -22943 -31029 -31292 -25906 -16309
15373a6309K893L599L004L444j1618j0687p428p676K6883r788j2329l676J8962
15360b0726J5886m777j6740Q909K7723P884n142p95P187R81M197j361j6620o211
15346C95j3396o306o048m0R920n824n183J3555K528k0102L284J7117p347M109
15332a3338J226N905K150j1168j905J9181p337o016N625K716Q398Q736L692L112
15318B0977M47r370P118j4784q799n794L501J0341K987J083K451o904m833L10
15304a269P081j6722j2197K4896N650j0122n637J230k090j0772o10k8949j778
15291e1289J6372L6515K1970O861j0189k5052q591P613J4952j1042n367J5587
15279H340M714j2334l687J4218O973j5514q872o216P060L886L304J4014m784K573
$$ plain form
15373 -16309 -13416 -9817 -6813 -3369 -14987 -25674 -33102 -40778 -13895 -23683 -36012 -39688 -20726
15360 -20726 -4840 -9617 -26357 -17448 10275 18159 13017 12222 19409 20390 24587 23226 6606 395
15346 395 -13001 -19307 -25355 -25395 -15475 -21299 -26482 -12927 -10399 -30501 -27217 -10100 -17447 -13338
15332 -13338 -12112 -6207 -4057 -15225 -17130 2051 -5286 -11302 -5677 -2961 5437 14173 17865 20977
15318 20977 21424 12054 19172 4388 -4411 -10205 -6704 3637 6624 7707 10158 3254 -1579 -1269
15304 -1269 5812 -10910 -23107 1789 7439 -2683 -8320 -7090 -9180 -19952 -20562 -49511 -51289
15291 -51289 -34917 1598 23568 30429 20240 -4812 -13403 -5790 9162 -1880 -7247 8340
15279 8340 13054 720 -2967 11251 18224 2710 -6162 -12378 -5318 -1432 1872 15886 11102 13675
15265A3675j5723j7499K2117K3820j2957O642j6208n302k996J6282N115j5075
15253A891j2563k083K080o190K0992P680j0317j1393k3491o638J8749R168k4965
15240c7080p587J7723J0771J0839o465k300j8990k398J1661L466R754N383l139
15227h362j8711K228J1884J3671R704j1808m657r038k6914j5855K0176J5797O588
15214a5297Q118J7413q255J572j2272j0937j303k781M776N360m913j930m017j228
15200b5694J1110J675J8117O915J1420j4403k54j3840p210M965N328O14J248O92
15186F83J956j7601k617O222J0685k827j2297P609L522l580q257j0804J900N955
15172a9451J4358o171J4313P029j3981M045J1668j114q57P109l790l826j6823
$$ plain form
15265 13675 -2048 -19547 2570 26390 13433 20075 3867 -1435 -4431 11851 16966 1891
15253 1891 -10672 -12755 -10675 -16865 4127 11807 1490 -9903 -33394 -40032 -21283 -12115 -37080
15240 -37080 -44667 -26944 -16173 -5334 -11799 -14099 -33089 -35487 -23826 -20360 -10606 -5223 -8362
15227 -8362 -27073 -24845 -12961 710 10414 -1394 -6051 -15089 -42003 -57858 -37682 -21885 -15297
15214 -15297 -7179 10234 1979 3551 -8721 -19658 -20961 -23742 -18966 -13606 -18519 -20449 -24466 -25694
15200 -25694 -14584 -12909 5208 12123 23543 9140 8886 -4954 -12164 -7199 -1871 -1257 -9 683
15186 683 2639 -14962 -17579 -11357 -672 -3499 -15796 -8187 -4665 -8245 -16502 -27306 -25406 -19451
15172 -19451 -5093 -11264 3049 10078 -3903 142 11810 10696 9839 16948 13158 9332 -7491
15159g491N613J6972m203k30J5504J0541p410k2306k273P206k908j1513r374r622
15145b1494n521J5389j0792J4644P904K101J4400L451j9246j7701J694N365Q5
15132i721p774O513J5722j3171r81J397J2965P269j2240r660P673k76j0690j107
15118a4081P055K804J7783M235j3766K37J5595J3531r215j8099k0774P498J5111
15105G914q322J655k448J490L351j390J971K88M056r49O892L710j0463P63N721
15090A4239M3r881J0733l559n910j6730M071J1052J939J5992j851r872j721O959
15076A5504J1060j5421M793P578j531j4710j3909K2485O370j553n397N955j6198
15063E026q30L290R696Q364l182l662r763J281k635J4834Q248o401J4500q064
$$ plain form
15159 -7491 -1878 15094 10891 10661 26165 36706 29296 6990 4717 11923 9015 -2498 -11872 -21494
15145 -21494 -27015 -11626 -22418 -7774 130 2231 16631 20082 836 -16865 -15171 -9806 -9721
15132 -9721 -17495 -10982 4740 -8431 -9412 -8015 4950 12219 -21 -9681 -2008 -2284 -12974 -14081
15118 -14081 -7026 -4222 13561 17796 4030 4267 19862 33393 24178 6079 -14695 -7197 7914
15105 7914 -408 1247 -1201 289 3640 2250 4221 4509 8565 7616 14508 18218 7755 8518 14239
15090 14239 14282 4401 15134 11575 5665 -11065 -6994 4058 5997 21989 20138 10266 8545 15504
15076 15504 26564 11143 15936 23514 21983 7273 -6636 15849 22219 20666 15269 21224 5026
15063 5026 4196 7486 17182 25546 22364 18702 8939 10220 7585 22419 30667 24266 38766 30702
15049C0702j8916K1376j556k6670j2585N504K6170J0469j644j478q086k936q363
15036A1987j5467j7046o963J674J0952j66M212R726J7679k645P038n742p412J9106
15022B6933K415k1935l758J2642o736m410r071L917m185P689L045J1798K839p618
15008A3565R064k26j3900k552k453q866J837k005o325j1405r294J4514J0360m952
14994a2638J6383L108j4956j5722r617q160p880J6111J8767K079k5554j1831K4561
14981b5349L542J0940J0627P82l434o531j479J4136P835O49j3833k2780j3670
14968c8565q829K0354K7663j454l24K790O555L051k110P227p825k1464J290J7538
14954E897R283n657n106N602Q182l0699k5858P310J9335j1022j1192R721p79N590
$$ plain form
15049 30702 11786 33162 31606 4936 -7649 -2145 24025 34494 32850 31372 23286 20350 11987
15036 11987 -3480 -20526 -27489 -25815 -14863 -15029 -10817 -1091 16588 13943 20981 15239 7827 26933
15022 26933 29348 7413 3655 16297 9561 5151 -3920 -3 -4188 3501 6546 18344 21183 13565
15008 13565 22629 22403 8503 5951 3498 -5368 -3531 -5536 -11861 -23266 -32560 -18046 -7686 -12638
14994 -12638 3745 6853 -8103 -23825 -33442 -41602 -49482 -33371 -14604 -12525 -38079 -49910 -25349
14981 -25349 -21807 -10867 -240 542 -2892 -9423 -10902 3234 11069 11718 -2115 -24895 -38565
14968 -38565 -47394 -27040 623 -831 -1155 1635 8190 11241 9131 16358 8533 -12931 -11641 5897
14954 5897 15180 9523 4417 10019 18201 -12498 -38356 -31046 -11711 -22733 -33925 -24204 -24983 -19393
14940a9393p143Q267r785j9171K095K2052J2531r554L481J886L007J0123q080
14927i684j2601o016L759m658R556r33N016J1736J5529k025j7873j9792N624R730
14913a2632K704M639q481R094J4551m926O981m168k0193K251Q474r571l885K041
14899a3121J328n633Q770N790j2285M965P944o900O091P446K925J838j3393k2641
14885b6876O157K4052J2978l385J1131O353j8906r900M671j2684j1719n714j743
14872b5585l720J4124P550p231j5657P351J4073P832J1489J936j0423J1380J3316
14859B6435k0067J745J6860j1957k3070j3923K1722J5490Q11k1168j0300J6036
14847a386L409j4646j6017k5149J8840J7094K0137o628j2760M289J8829P058o228
$$ plain form
14940 -19393 -26536 -18269 -28054 -47225 -45130 -23078 -10547 -20101 -16620 -14734 -11727 -1604 -9684
14927 -9684 -22285 -28301 -24542 -29200 -19644 -20577 -15561 -3825 11704 9679 -8194 -27986 -22362 -12632
14913 -12632 -9928 -5289 -13770 -4676 9875 4949 11930 7762 -12431 -10180 -1706 -11277 -15162 -13121
14899 -13121 -11793 -17426 -8656 -2866 -15151 -10186 -2242 -9142 -3051 4395 7320 9158 -4235 -26876
14885 -26876 -20719 3333 16311 12926 24057 30410 11504 1604 6275 -6409 -18128 -23842 -25585
14872 -25585 -29305 -15181 -7631 -14862 -30519 -23168 -9095 -1263 10226 12162 1739 13119 26435
14859 26435 6368 8113 24973 13016 -10054 -23977 -2255 13235 14046 -7122 -17422 -1386
14847 -1386 2023 -12623 -28640 -53789 -34949 -17855 2282 -4346 -17106 -12817 6012 13070 6842
14834F842J57l866l649o344j0762k824J5245n340o867l812k629J0383j4633P312
14820b0787M84J5362M945Q470j3923j0414J398Q379K952m430j698J5403J940o256
14806A825L486j942o308J4307J2847J4429j0654l6613j4493N745J6837J3307L53
14793A3126l368Q81j988M422n939L472J085k555n793j9809k907J2521p363q981
14779b3196j4915j5900Q541L7320J7203p393j1267k0453L038J0247J4662j2608
14767a4721j1511J4418J9329J715k1829R321m668K374R411K1423j2153k2936J005
14754h822k374Q914O180o289q960q393n600J0317k106J0894m080p748j6074j5928
14740e0069j9989K2307J3469J0806j431k013P167j690m26R072j194n55p855J5211
$$ plain form
14834 6842 6999 3133 -516 -6860 -17622 -20446 -5201 -10541 -17408 -21220 -23849 -13466 -28099 -20787
14820 -20787 -20303 -4941 4 8474 -5449 -15863 -14465 -6086 -3134 -7564 -9262 6141 8081 1825
14806 1825 5311 3369 -2939 11368 24215 38644 27990 -8623 -23116 -17371 -534 12773 13126
14793 13126 9758 10639 8651 13073 7134 10606 11691 9136 3343 -16466 -19373 -6852 -14215 -23196
14779 -23196 -38111 -54011 -45470 -8150 9053 1660 -9607 -30060 -27022 -16775 -2113 -14721
14767 -14721 -26232 -11814 7515 9230 -12599 -3278 -7946 -5572 3839 25262 13109 -9827 -8822
14754 -8822 -11196 -2282 3898 -2391 -11351 -19744 -25344 -15027 -17133 -6239 -10319 -18067 -34141 -50069
14740 -50069 -70058 -47751 -34282 -23476 -24907 -26920 -19753 -21443 -21869 -12797 -13991 -14546 -22401 -7190
14726g190J2274L685q954p268J1755j782o580o608j5832J66R412J5976J1857M5
14712A0956j460j0006j2932L467l604p47P389j902N488m747J34Q457K066J1525
14698A4084O361k0071M5k8595j4833j0489N039J6329o742J4616K3739J2105o34
14685A0954q061P39m371J549L315J1222j0915j0745J0718K223K488m409o973k281
14671d547J911k7029l289L511L079P851P532n31r000n00Q86k251J7986j612k0254
14656b6257n21K0885J0480n148N140M385J6096r334j3628J3173J50r135k0833
14643a4547M537K0638J840j5730j3122Q122P689P7r024J593M220K100j2781o975
14629b1363J1485J1148K1907O510M094K787j5234j2979j5703K264J779J1417o351
$$ plain form
14726 -7190 5084 8769 -185 -7453 4302 2520 -4060 -10668 -26500 -26334 -16922 -946 10911 10956
14712 10956 9496 -510 -13442 -9975 -13579 -14326 -6937 -8839 -3351 -8098 -7964 493 2559 14084
14698 14084 20445 374 419 -28176 -43009 -53498 -48459 -32130 -38872 -24256 -517 11588 10954
14685 10954 2893 3632 -739 810 4125 15347 4432 -6313 4405 6628 9116 4707 -2266 -4547
14671 -4547 -2636 -29665 -32954 -29443 -26364 -18513 -10981 -11512 -20512 -21012 -20126 -22377 -4391 -6003 -26257
14656 -26257 -26778 -5893 4587 -561 4579 8964 25060 15726 2098 15271 15421 6286 -14547
14643 -14547 -10010 10628 12468 -3262 -16384 -8262 -573 -496 -9520 -7927 -3707 -1607 -14388 -21363
14629 -21363 -9878 1270 23177 29687 33781 36568 21334 8355 -7348 -5084 -3305 8112 1761
14616A761l265n006j9528K363K2606J3299m310m322k694j5854r799q8j8595P358
14602c6074P227p997m062O906R636J5520J4664O990p201m551m756J7573J2432
14589B6307j1281p205n765p779J1239R453J7693k2k1776q140j801J538j0793p377
14575a5709Q369J5185J7260J266j2304j5495K340J6984O035k759j3862j6034k2536
14562c1260K264L203J1867J0668j9054N022n661P616L806J1216N327j3125K882
14549e229L722n213q090o508j0841j562J6046O417M421P362k1305o901J3592L494
14535a0595o009M097m397Q508j0802k0542n134J5728K4934O772J7451l563k889
14522A3559j1892k397q787J4680O351j9636k1115l116J0083N66l118l963k338
$$ plain form
14616 1761 -1504 -6510 -26038 -23675 -1069 12230 7920 3598 904 -14950 -24749 -24837 -43432 -36074
14602 -36074 -28847 -36844 -40906 -34000 -24364 -8844 5820 12810 5609 1058 -3698 13875 26307
14589 26307 15026 7821 2056 -5723 5516 14969 32662 32640 10864 2724 923 2461 -8332 -15709
14575 -15709 -7340 7845 25105 26371 14067 -1428 912 17896 23931 21172 7310 -8724 -31260
14562 -31260 -28996 -25793 -13926 -3258 -22312 -17290 -22951 -15335 -11529 -313 5014 -8111 -5229
14549 -5229 -1507 -6720 -14810 -21318 -32159 -33721 -17675 -11258 -6837 525 -20780 -27681 -14089 -10595
14535 -10595 -16604 -12507 -16904 -8396 -19198 -39740 -44874 -29146 -4212 2560 20011 16448 13559
14522 13559 1667 -730 -9517 5163 11514 -8122 -29237 -32353 -22270 -21704 -24822 -28785 -31123
14509c1123L567l526K138J9201J364m74O076J9193j384k0635j0412P418L97R941
14495A741J5641l054k807j562j4307p532j5668L009N270N783N740j94K1055N191
14481A8306k4800j2737J3878J1235j3245k5656l35R526J4703l252k969J2047J0804
14468G505K4o691o484r16m467J7023J1072j2732k629j160j5177l227K379P606
14454g874J280J937J2016j548j5742o785J2243k916J1613k247r401j267j3732
14441b2423J0471J968L955K0516J0882P74m040n18L286j2194k3699J2359J4188
14428A5525j1183Q086k996j0088L81K1324p987j6361j6738J7642K851n77J3740
14415A3619J1539p965k2745l2538M391M709J6850J3001m417j3884j0325J9445
$$ plain form
14509 -31123 -27556 -31082 -28944 -9743 -8379 -8853 -2777 16416 15032 -5603 -16015 -8597 -8200 1741
14495 1741 17382 14328 11521 9959 -4348 -11880 -27548 -24539 -19269 -13486 -7746 -7940 13115 18306
14481 18306 -6494 -19231 -5353 5882 -7363 -33019 -33354 -23828 -9125 -12377 -15346 -3299 7505
14468 7505 7529 838 -5646 -6562 -11029 5994 17066 4334 1705 545 -14632 -17859 -15480 -7874
14454 -7874 -6594 -4657 7359 5811 -9931 -16716 -4473 -7389 4224 1977 -7424 -8691 -22423
14441 -22423 -11952 -9984 -6029 14487 25369 26143 22103 21585 24871 12677 -11022 1337 15525
14428 15525 4342 12428 9432 -656 -275 21049 13062 -3299 -20037 -2395 456 -121 13619
14415 13619 25158 17193 -5552 -38090 -33699 -28990 -12140 861 -3556 -17440 -27765 -8320
14403h320P637j8616r07K570M028j6359j2017J2106K187L001k989p95j267j054
14389c0795J0502O544p066l204P714O618P792n46j0304j5595O16R055Q792J3927
14375D050N393j3939m274L219M152l007R895M836K847q16l610n842j1397j0452
14361a8945L702J6633l405N540k396n300Q513P916J5028j2559r292J660M367O540
14347A8002l112r994O57o296q908r854Q703j312J498r53k336R749r58K529k91
14332b876J1099Q773Q66k2523o156J2763J991K668o756K2587K888j4677j1900
14319a253J4249J5820L615j2383q741m682j4310j5181J1569J1979N381Q502j7294
14306b729j5825r567p270p756J112R266P147J2954j726q25J557K942l946J3406
$$ plain form
14403 -8320 -683 -19299 -20206 -17636 -13608 -29967 -41984 -29878 -27691 -24690 -27679 -28474 -29741 -30795
14389 -30795 -20293 -13749 -20815 -24019 -16305 -9687 -1895 -2441 -12745 -28340 -27724 -18669 -9877 4050
14375 4050 9443 -4496 -8770 -5551 -1399 -4406 5489 10325 13172 12356 8746 2904 -8493 -18945
14361 -18945 -15243 1390 -2015 3525 1129 -4171 4342 12258 27286 14727 5435 7095 11462 18002
14347 18002 14890 4896 5553 -743 -9651 -19505 -10802 -12114 -10616 -11569 -13905 -4156 -5114 -2585 -2876
14332 -2876 8223 16996 17862 -4661 -10817 1946 3937 6605 -151 22436 25324 10647 -1253
14319 -1253 12996 28816 32431 20048 11307 6625 -7685 -22866 -11297 682 6063 14565 -2729
14306 -2729 -18554 -28121 -35391 -43147 -42035 -32769 -25622 -12668 -14394 -15219 -13662 -10720 -14666 -1260
14292a260J5439j0801n20Q124K0297J5969j5939j0429R293o507k0045j888Q927
14279A0660J9287l567J1120m861o542k3059P12k2756j170O744J4882q581J798
14266e333L399K0328P901r548j5826r233k950J90o656N37J2689K8729k508j1983
14252I736j784n707R173J3088K2356L0050K8316M0541L1611O1538R9619J24489
14240D63026M8945m7179k9815J6451N4685L9898N492q2566j12473o9677o1056
14229B25731n4333l6893k6454k0099l812j4881j555J3451N838q795q888o770j2724
14216D9816N579j5963p068j881o88j7697j3297k115J1200K8025J1110J0184J0495
14203F7700l1301j8084O820J0730J4092r03k4994J20j9314p531K3411O288r212
$$ plain form
14292 -1260 14179 3378 2858 10982 31279 47248 31309 20880 30173 23666 3621 1733 10660
14279 10660 29947 26380 37500 32639 26097 3038 3750 -19006 -20176 -13432 1450 -7131 -5333
14266 -5333 -1934 18394 26295 16747 921 -8312 -11262 -11072 -17728 -17191 -4502 24227 21719 9736
14252 9736 7952 2245 11418 24506 46862 76912 105228 145769 177380 238918 338537 463026
14240 463026 511971 464792 434977 451428 506113 546011 551503 468937 356464 286787 225731
14229 225731 171398 134505 108051 87952 84140 69259 67704 81155 86993 78198 69310 62540 49816
14216 49816 55395 39432 32364 30483 29795 12098 -1199 -3314 7886 35911 47021 57205 67700
14203 67700 36399 18315 25135 35865 49957 49054 24060 24180 4866 -2665 20746 27034 17822
14190A7822K256j628n170k927k849k2293k1039j1404J3939K1032R607M440N534
14177G320l988N814j486j4922O651J1972j849j7320o957m659l588r75R761L910
14163a0316j4713j0939K573n561J942O513J265J2883J986p622L0808M471m904
14150H386q998m581R65Qq836k3348K392J8735J8118j675K441k2676l175J3606
14136h638K1071k162N189J1454N466j1562k1101K3qR921r792j0923j494K3210
14122A0654J8638K249j0654J6807m470k5060r547m301O13r053O600L443K2841
14109A8760J0671k61j2431j0764j2231K3131K5738M79J424M559o136j5684j6268
14096A0987R367P436j2899j0240j833J5907q245K700L552Q946j9423j74J6209
$$ plain form
14190 17822 20078 18450 13280 10353 7504 -14789 -35828 -47232 -33293 -12261 -2654 1786 7320
14177 7320 3332 9146 7660 -7262 -611 11361 9512 -7808 -14765 -19424 -23012 -23987 -14226 -10316
14163 -10316 -25029 -35968 -33395 -38956 -37014 -30501 -29236 -16353 -14367 -21989 8819 13290 8386
14150 8386 -612 -5193 -4228 -4220 -13056 -36404 -34012 -15277 2841 1166 3607 -19069 -22244 -8638
14136 -8638 12433 10271 15460 26914 32380 20818 -283 -260 -268 9653 -139 -11062 -12556 10654
14122 10654 29292 31541 20887 37694 33224 8164 -1383 -5684 -5071 -14124 -7524 -4081 18760
14109 18760 29431 29170 16739 5975 -6256 16875 42613 43092 44516 49075 42939 27255 10987
14096 10987 20354 27790 14891 4651 2818 18725 10480 13180 16732 25678 6255 6081 22290
14083B2290j3235q738Q69O21j7181Q45J5170J6273k9q308L154r482j6352k1160
14069c5263p005N866J3337K415k2945J002K9115M615j2708j229K5595J0326j353
14056A1768J2396r448n883j0086R03K6171m810j7168K378M855r864p227j122j1007
14042a8144M1P757J0779J2414L038M189L995M248J7851J5751j8014j6004l8315
14029a0414k2617J8517K2900O407k5611n889L919J7132P272k920K4859p925j4077
14016A1553j2072j1899J5517J1907J2016n861l0563j6701J3926P125Q852L86L094
14003G280l623k0533J6048m456k1361J511K1232P933M314j6687q397p522P162
13990a7099K6089R242J3346P489j023O168R374K1805J8940j6033j1667q26N316
$$ plain form
14083 22290 9055 317 1186 1807 -15374 -14529 641 16914 16885 8577 11731 2249 -14103 -35263
14069 -35263 -42268 -36402 -23065 -20650 -43595 -42593 -13478 -8863 -21571 -22800 2795 13121 11768
14056 11768 24164 14716 8833 -1253 -350 25821 21011 3843 6221 11076 1212 -6015 -7137 -18144
14042 -18144 -18103 -10346 433 12847 15885 20074 24069 28317 46168 61919 43905 27901 -10414
14029 -10414 -33031 -14514 8386 14793 -10818 -16707 -12788 4344 11616 8696 33555 25630 11553
14016 11553 -519 -12418 3099 15006 27022 21161 -9402 -26103 -12177 -5052 3800 4186 7280
14003 7280 3657 -16876 -828 -5284 -26645 -25134 -3902 4031 8345 -8342 -16739 -24261 -17099
13990 -17099 8990 18232 31578 39067 38044 44212 53586 75391 94331 78298 66631 65805 71121
13977G1121r362j4149l015J3853J0644J6173q164j4436j8118k3675n308R152q675
13964A6041J041k396k869j1679O77q887J5965Q313J260r739L175L556o416n569
13950B473j8307n125j608K5369J9781J3111K5714L596R57J1822J9376k407j6235
13937G8517o845m452Q236q346k1492j5545j4399O679J4794j4270k36j3763J602
13924A0480n388O015k319j8072K955J5228M757N525r113q876L400j227n207j4373
13910a6215J0250P020O419Q651j524o189j3158j0781J9745J2119m319m170m352
13897C496q13m845j5770L852M413q949J6067K0132j0763O384J2654j4266n534
13884F058J1297j973j7981o794J6479P132k3418j8697J8463J9580J6278J1265
$$ plain form
13977 71121 61759 47610 44595 58448 69092 85265 77101 62665 44547 20872 15564 24716 16041
13964 16041 17082 14686 11817 138 815 -8072 7893 16206 17466 7727 10902 14458 8042 2473
13950 2473 -15834 -20959 -22567 2802 22583 35694 61408 65004 65961 77783 97159 94752 78517
13937 78517 71672 67220 75456 67110 45618 30073 15674 22353 37147 22877 22641 8878 10480
13924 10480 5092 11107 8788 -9284 -6329 8899 13656 19181 10068 1192 4592 3365 -1842 -16215
13910 -16215 -5965 1055 7474 16125 14601 8412 -4746 -15527 4218 16337 12018 7848 3496
13897 3496 2683 -2162 -17932 -14080 -9667 -18616 -2549 17583 6820 13204 25858 11592 6058
13884 6058 17355 15382 -2599 -9393 7086 14218 -9200 -27897 -9434 10146 26424 37689
13872C7689O05m453q335o272k650J1724m140p109M154R330j5215l974r659J475
13858C170j3221j409J2076P596q068N188p948k3251M84K6524R209p542j9686J6608
13844b70R19r178m228J5103K1802K685j6130l1744R747L0633J8044q146o285r708
13830A3244J3309j0281l787N292j1105q604K716M265J0208L675N670j8091r217
13817b706N500J6095l668l998n03j0463P458P816M890k2308l2371j0091J2173
13804c2176J0959k569K0115J6236r886O807j5964r250J162k125J1492J0372J0858
13791A6031R483P645L126Q582k0621j2723m555K449j1750j9971j4190K0718J9388
13778C612n506n798L705q348Q042m314m019K9146Q760P569K225k1234l2060M699
$$ plain form
13872 37689 38294 33841 25506 19234 16584 28308 24168 17059 21213 30543 15328 11354 1695 3170
13858 3170 -10051 -11460 616 8212 144 5332 -2616 -25867 -25383 1141 10350 2808 -16878 -270
13844 -270 649 -8529 -12757 2346 24148 26833 10703 -21041 -11294 19339 37383 29237 22952 13244
13830 13244 26553 16272 12485 17777 6672 -1932 784 5049 15257 18932 24602 6511 -2706
13817 -2706 2794 18889 15221 11223 10720 257 7715 15531 20421 -1887 -34258 -44349 -32176
13804 -32176 -21217 -23786 -3671 12565 2679 9486 -6478 -15728 -14566 -16691 -5199 5173 16031
13791 16031 25514 33159 36285 44867 24246 11523 6968 9417 -2333 -22304 -36494 -15776 3612
13778 3612 -1894 -7692 -3987 -12335 -4293 -8607 -12626 16520 25280 32849 35074 13840 -18220 -13521
13764a3521j94L95r378m482n800P505K8634L443Q523q109k375j5480j0004P953
13750a2890R261n505J5531q352j1399Q481M533k178j0543N717n777M845L495m185
13736h966O447m710r353N446J8077n819j881J6285q206j3574M790J0815m808k1581
13722a7038j1619J1092r30k1288J8477p741j4465R937M5286K490k696J54j0441
13709A218J0985R499j0369K516p831q878j9437k0913o819J4032K3318P260J2494
13696G075N387p497j337j7081L286R193l006N996j6564j9468J4036r263J729J5813
13682a1701J4150L267m310J1576J2884k334M309o955j6707Q294K853p457p739
13669A30j906r305j3531j3910K0491K833l561K4612o500j9175m53J5944K697J769
$$ plain form
13764 -13521 -13715 -13320 -22698 -27180 -32980 -25475 3159 6602 15125 7016 4641 -10839 -20843 -12890
13750 -12890 -3629 -9134 6397 -1955 -13354 -4873 -340 -2518 -13061 -7344 -13121 -8276 -4781 -8966
13736 -8966 -2519 -7229 -16582 -11136 6941 1122 -759 15526 7320 -6254 -1464 9351 4543 -17038
13722 -17038 -28657 -17565 -18495 -39783 -21306 -29047 -43512 -33575 11711 14201 11505 11659 1218
13709 1218 12203 21702 11333 13849 6018 -2860 -22297 -43210 -50029 -35997 -12679 -5419 7075
13696 7075 12462 4965 3628 -13453 -10167 -974 -3980 2016 -14548 -34016 -19980 -29243 -27514 -11701
13682 -11701 2449 5716 1406 12982 25866 23532 27841 20886 4179 12473 15326 7869 130
13669 130 -1776 -11081 -24612 -38522 -18031 -15198 -18759 5853 -647 -19822 -20275 -4331 -1634 135
13655A35n969o506j2910K58M982J6226m27K545l907o187j1139K4610J8152n114
13641A4749k341J1472N519k392j0722m661P93j0615j7805R929J0131l250j0026
13628i219L652j963J2466P16j0898j9089j0160J9132J343oJ567j1165L549q12
13614b0887j894J227K675J9680J3711M42P06m264p908q305j3146K583j90l84J2111
13599c843J5183k898K352k0115j2472P207L1022k661k189j5102m348J8087k882
13586G341q210q256J5691m669K974J884K508M964m339r64j5215j1442O408R963
13572a362k185k076K4387j0265j0718j7596r978j1081N963J5630O188O658q386
13559a4821j5162J0580J2236M28j2633k6278n729L7585J4007j1904k395L316M377
$$ plain form
13655 135 -5834 -12340 -25250 -24992 -20010 -3784 -4211 -1666 -5573 -11760 -22899 1711 19863 14749
13641 14749 12408 23880 29399 27007 16285 11624 12417 1802 -16003 -6074 4057 807 -9219
13628 -9219 -5567 -7530 4936 5652 -5246 -24335 -34495 -15363 -14020 -14026 -12459 -23624 -20075 -20887
13614 -20887 -22781 -21554 -18879 801 14512 14954 15660 11396 3488 -4817 -17963 -15380 -15570 -15954 -3843
13599 -3843 11340 8442 10794 -9321 -21793 -14586 16436 13775 11586 -3516 -7864 10223 7341
13586 7341 -869 -9125 6566 1897 4871 6755 9263 14227 9888 8924 -6291 -17733 -11325 -1362
13572 -1362 -3547 -5623 18764 8499 -2219 -19815 -29793 -40874 -34911 -19281 -13093 -6435 -14821
13559 -14821 -29983 -19403 -7167 -6739 -19372 -45650 -51379 -13794 213 -11691 -14086 -10770 -6393
13546f393j691j351l785J986N114M750m756Q041Q043k464k973o968k534J8788
13532A3807J2594j1615j4618L55M637k1125N720J9536R796l169P631q704j0779
13519D066P814O932L033o731r400o045J7221J0014J896p058j3218J2375j1593
13506I306k5755r011Q852R47n973l220R502N066j9779O794K3173P593j9688j2189
13492b4382R137M928j1444j3633J1309L382J9527j286j6447p005N31r71n714j0742
13478d2810K1344J9426J2960J0085l406j0452L764p053p357l287j4586o906L803
13465b4475N989J7062j3786M212M096J039J8275j3865l839J5034K980O841J348
13452B0911r780m663R735j8114n580l15l423P289R378J3356J7806J069j0779m935
$$ plain form
13546 -6393 -8084 -9435 -13220 -11234 -6120 -1370 -6126 1915 9958 7494 4521 -2447 -4981 13807
13532 13807 26401 14786 168 523 5160 -15965 -10245 9291 19087 15918 23549 14845 4066
13519 4066 11880 18812 21845 15114 5714 -331 16890 26904 28800 21742 8524 20899 9306
13506 9306 -16449 -25460 -16608 -15661 -21634 -24854 -15352 -10286 -30065 -23271 -98 7495 -12193 -24382
13492 -24382 -15245 -10317 -21761 -35394 -24085 -20703 -1176 -2462 -18909 -25914 -25383 -26354 -32068 -42810
13478 -42810 -21466 -2040 10920 21005 17599 7147 10911 3858 -3499 -6786 -21372 -28278 -24475
13465 -24475 -18486 -1424 -15210 -10998 -6902 -5863 12412 -1453 -5292 9742 12722 19563 20911
13452 20911 11131 6468 16203 -1911 -7491 -7806 -11229 -3940 5438 18794 36600 37669 26890 21955
13438B1955o662j842J6106j4334j4383p287j4757L654L1524J4550j859J2654R383
13425D8702j4289j2031o420p11j1360N034J39j4143J64r87O378J399j0954K433
13411f646J634J2921P117o073j4918Q438J5512j2488j0444J253K278k240J0546
13398F890N986j5899l836Q633o20n296k206p687l426p288J0213L78N907Q213o599
13383f637p398j7847m987k68L8172J6378j4501m803K342J1285R443j1533l567
13370F079k0386r772N382J7192K0052J0703k0625k2343J291j9222j1608J5760
13358b7497K3004j6348p079K609K115kJ8418P195n817J3954J5162p260l2688j508
13344a5742J5222J6752J2523J538L46j609m453P734o696p273j4263p538r97M047
$$ plain form
13438 21955 15293 13451 29557 15223 840 -6447 -21204 -17550 13974 28524 26665 39319 48702
13425 48702 34413 22382 15962 15251 3891 8925 9064 -5079 -4915 -5902 476 1875 -9079 -6646
13411 -6646 -5012 7909 15026 8953 -5965 2473 17985 5497 -4947 -3694 -1416 -3656 6890
13398 6890 12876 -3023 -6859 1774 1154 -4142 -6348 -14035 -17461 -24749 -14536 -14158 -8251 -38 -6637
13383 -6637 -14035 -31882 -36869 -37137 1035 17413 2912 -1891 451 11736 21179 9646 6079
13370 6079 -14307 -24079 -18697 -1505 18547 29250 8625 -13718 -12427 -31649 -43257 -27497
13358 -27497 -4493 -20841 -27920 -25311 -23196 -23198 -4780 2415 -3402 10552 25714 18454 -14234 -15742
13344 -15742 -520 16232 28755 30293 30639 29030 24577 32311 25615 18342 4079 -3459 -4456 -409
13330d09J8380Q033r757j8436N926J1469q12N635j922p033R151m906j9320r50
13316d951J9934J0318K18M587l501q901J8816P016o947j1769J671J5958k722j5722
13302B4005J1647K059J0493j44n595j3368R014K362J031O505J4706j0228l05n22
13288E1660l0879r565M236N011r074j1636J6057K135j599J0018L379J1027J1551
13275E2321Q174O772J4915K1952L2052P784O55p023j896L7643L7506L7849M1634
13262B90338O2049Q3250J11398J33056J16288L5615j282J2636K6765J5210m5215
13251H40108r1277j04120j05049q8994p6408o1354l4032m5203l2734j9725k0173
13240A61039l0700k5330m877J6107j8235p456J881K0238K202k4184j3239m608
$$ plain form
13330 -409 17971 26004 16247 -2189 3737 15206 14394 20029 18107 11074 20225 15319 -4001 -4951
13316 -4951 14983 25301 25519 30106 26605 17704 36520 43536 36589 24820 26491 42449 39727 24005
13302 24005 35652 37711 48204 48060 42465 29097 38111 40473 41504 48009 62715 52487 52182 51660
13288 51660 20781 11216 15452 20463 11389 -247 15810 17945 16346 26364 29743 40770 52321
13275 52321 60495 67267 82182 104134 136186 143970 144625 137602 135706 173349 210855 248704 290338
13262 290338 352387 435637 547035 680091 796379 831994 830712 843348 870113 885323 840108
13251 840108 748831 644711 539662 450668 374260 312906 278874 233671 200937 181212 161039
13240 161039 130339 105009 100132 116239 98004 90548 92429 112667 114869 90685 77446 72838
13228G2838O220M010J634j5856o83O950J605K875p404q065k664J1187K2683J6231
13214A11561n877j2989p297q661M829N735r738k4P349j478j3927l688j3306q723
13200D3766K8714O276N903j2051j063r704O088k579n927l129K782l555j4957K272
13186D2836j4551R946l632L513l614N910l294l858k1387l6468p157Q555J7650
13173e551K9165n40Q408K43Q656p001k7729r255R440J1878O866p81j1920n462
13159F417j561k8453K675M0757o024j7596J4459O660L317Q050J7059n757k0093
13146A9910M109J5455L999l6410j4247j0035O87J4678Q167j3556J8382J8599J1723
13133D1461l91j3617M872j1784j7888k6729J2032L3017n628p903J6487J0040j4645
$$ plain form
13228 72838 79058 83068 84702 68846 68163 75113 76718 79593 72189 64124 61460 72647 95330 111561
13214 111561 105684 92695 85398 76737 81566 87301 77563 77539 84888 83410 69483 65795 52489 43766
13200 43766 72480 78756 84659 72608 71545 61841 67929 65350 59423 56294 59076 55521 40564 42836
13186 42836 28285 38231 34599 38112 34498 40408 37114 33256 11869 -24599 -31756 -23201 -5551
13173 -5551 23614 23074 31482 31725 40381 33380 5651 -3604 5836 17714 24580 23799 11879 6417
13159 6417 4856 -23597 -20922 19835 13811 -3785 10674 17334 20651 28701 45760 40003 19910
13146 19910 24019 39474 43473 7063 -7184 -17219 -16532 -1854 6313 -7243 11139 29738 41461
13133 41461 41070 27453 32325 20541 2653 -24076 -12044 20973 15345 7442 23929 33969 19324
13120A9324k3131o467Q566n383o455j2881Q261J1287l302j3789M43L3961K99j3476
13106b743J6395J6463m935O920J1169J5581J5774o199L546J5686O912R047K499
13093A06115Q465Q126K1561O088O186Q471J1334J4750n941n786J429o086j7532
13080A57180j6559m811j0879p800q391N608k3688j4212K654j2415Q418j9490k385
13067E3230p013J8599L788N743r375k84M011K179r856j0328J0168Q293J2697K890
13053H4742R623m588j4205m45j7586k223K7158p780j1882Oj1273k1357J3091R643
13039E2924j7081j4841m569j688K983R648J7980L1064J1280k7426K332O663P935
13026G7204j1930j9985j9075j3958J4486N818j9586o344J232j3375p846K0667
$$ plain form
13120 19324 -3807 -10274 -1708 -7091 -13546 -26427 -18166 -6879 -10181 -23970 -23527 10434 10733 -2743
13106 -2743 13652 30115 25180 32100 43269 58850 74624 68425 71971 87657 94569 103616 106115
13093 106115 114580 122706 144267 150355 156541 165012 176346 191096 185155 179369 180798 174712 157180
13080 157180 140621 135810 124931 117131 108740 114348 90660 76448 79102 66687 75105 55615 53230
13067 53230 46217 64816 68604 74347 64972 64688 68699 70878 61022 50694 60862 69155 81852 84742
13053 84742 94365 89777 75572 75127 57541 55318 82476 74696 62814 62820 51547 30190 43281 52924
13039 52924 35843 21002 16433 14745 17728 27376 45356 76420 87700 60274 62606 69269 77204
13026 77204 65274 45289 26214 12256 26742 32560 12974 6630 7862 -5513 -13359 7308
13014G308R012j6429L7704J4664N16J6448O054M701j404M245P338J1768L795p185
13000I8535o288q759k735j4793p678J728k619N580J5898l400j5605k642J2826
12987G0048J8924N446L727j6619P65O859N175J610j3458o503O260q443R119J2279
12973I5189J6071m585P206K2478R184r14K876J8028q688r381J811j8070K1301
12960A52506J8709K2188o31k611j0478m521j2769J0827r24q37l170j3938n621
12947A48730J6828L047k1372R872M673k676K1783J0083k3224R455J8963o896o730
12934A82536N530N962J0495m491j5051m704P435J3566O709L4353J1009K3117K1723
12921B98189l501R233J6407J0967K1384K6910K0295J5122J2233J0740Q337L683
$$ plain form
13014 7308 16320 -109 37595 52259 52775 69223 75277 79978 78574 82819 90157 101925 105720 98535
13000 98535 92247 83488 80753 65960 58282 60010 57391 62971 78869 75469 59864 57222 70048
12987 70048 88972 94418 98145 81526 82291 89150 94325 95935 82477 75974 82234 73791 82910 95189
12973 95189 111260 106675 113881 136359 145543 144629 147505 165533 156845 147464 149275 131205 152506
12960 152506 171215 193403 192772 190161 179683 175162 162393 173220 172296 171459 168289 154351 148730
12947 148730 165558 168605 147233 157105 161778 159102 180885 190968 167744 177199 196162 189266 182536
12934 182536 188066 194028 204523 200032 184981 180277 187712 201278 207987 242340 253349 276466 298189
12921 298189 294688 303921 320328 331295 352679 379589 399884 415006 427239 437979 446316 449999
12909D49999P080J2502K6290K0619J6778J5391J9617K3126L6853L2857L2755R600
12897G03467J6389J8801Q627J7085n981J4713L0588L2290J3430m032J9874L0353
12885H95604J9529K2396K2233M1612K4754J2020K9981K6631R066M4721M4003M2828
12873A235378M2151P3392Q4898Q2040Q1555P1041N4950N7865P2490Q2392R3533
12862B031685J29102J51265J61937J72917K00375K23939K57618K89496L43193
12853C961527M14436N06461O12494P50832Q64800R43113J030284J122152J294391
12844A1500490J596477K008403K565645L389206M618808O479890R363128J3624263
12836E5146310J9284369K5290839K7937780K1651130Q235879n43796L40215M865180
$$ plain form
12909 449999 457079 469581 495871 516490 533268 548659 568276 591402 628255 661112 693867 703467
12897 703467 719856 738657 747284 764369 758388 773101 803689 835979 849409 845377 865251 895604
12885 895604 915133 937529 959762 1001374 1026128 1038148 1068129 1094760 1103826 1148547 1192550 1235378
12873 1235378 1277529 1350921 1435819 1517859 1599414 1670455 1725405 1783270 1855760 1938152 2031685
12862 2031685 2160787 2312052 2473989 2646906 2847281 3071220 3328838 3618334 3961527
12853 3961527 4375963 4882424 5494918 6245750 7110550 8053663 9083947 10206099 11500490
12844 11500490 13096967 15105370 17671015 21060221 25679029 32158919 41522047 55146310
12836 55146310 74430679 99721518 127659298 149310428 157546307 157002511 157342726 162207906
12828A62207906M038893o745575j9564714k4735921k3189412j8913821j4258098
12821E8839258j0365164p516786n611927m325137l374891k661881k148138j810287
12813B1025047j597558j397174j191733j046561r78549q76763p62317o59995n58620
12804A1955777m25930l55108k95882k33144j86902j45625r6864p8048j07644j14403
12794I916227j41222j82595k11030k30564k80354l14342l48449l80033l63908
12785G463730l72079l47565l37744l29528l13378k85840k81882k78104k52902
12776D664708k41518k39431j98311j81112j95350j58730j49688j55262j62849
12767B982457j56770j33706j07903j12155r9762q5103j00963j04972j04257r8883
$$ plain form
12828 162207906 166246799 159501224 139936510 115200589 92011177 73097356 58839258
12821 58839258 48474094 40957308 35345381 31020244 27645353 24983472 22835334 21025047
12813 21025047 19427489 18030315 16838582 15792021 14813472 13936709 13174392 12514397 11955777
12804 11955777 11529847 11174739 10878857 10645713 10458811 10313186 10216322 10138274 10030630 9916227
12794 9916227 9775005 9592410 9381380 9150816 8870462 8556120 8207671 7827638 7463730
12785 7463730 7091651 6744086 6406342 6076814 5763436 5477596 5195714 4917610 4664708
12776 4664708 4423190 4183759 3985448 3804336 3608986 3450256 3300568 3145306 2982457
12767 2982457 2825687 2691981 2584078 2471923 2372161 2287058 2186095 2081123 1976866 1877983
12757A877983p0231q1417o1167o6494n3379l5555n8895p7535o8252n4242m7226
12746A203590o2802m4817m0905l6602m3369m0067m4108l2231j6796l4304k3430
12735G84159l7559l2219k8922j4173k2916k2886k4887j1525l9065l6230p497k5791
12723D80489j915J451k2420K503J1058k6671J666J9336Q384P863Q383J0917L3995
12710E35039J6777J0678J149Q313J7400M743j3377k1880k8678j9529k7880l3301
12698D49454m3829k8339k8622j6311m6302l1629k9832J1964J3293j7118k7264
12687B05465j1083J2150k4140k6262p774J041m602j1583r149K783K4187O340r840
12674A47533r127K2660P631J2101l211L857J4632K7160J4121M271p961L305L982
$$ plain form
12757 1877983 1807752 1726335 1665168 1598674 1545295 1509740 1450845 1373310 1305058 1250816 1203590
12746 1203590 1140788 1095971 1055066 1018464 975095 935028 890920 858689 841893 807589 784159
12735 784159 746600 714381 685459 671286 648370 625484 600597 589072 550007 513777 506280 480489
12723 480489 478574 480025 457605 460108 471166 444495 446161 465497 473881 481744 490127 501044 535039
12710 535039 551816 562494 563643 571956 589356 594099 580722 558842 530164 510635 482755 449454
12698 449454 405625 377286 348664 332353 286051 254422 224590 236554 249847 232729 205465
12687 205465 194382 206532 182392 156130 148356 149397 144795 133212 124063 126846 151033 157373 147533
12674 147533 138406 161066 168697 180798 177587 181444 196076 223236 237357 241628 233667 236972 240954
12661B40954k46n333R08J4362o584j5673k112n3K120m941k32J06N319K0857P056
12646B56508L3261J8489j694l470J675j2848j2440K0018j89k4801L681p200j1432
12633B59558L228J3139r832O068j5430j4061R101R570j5404j670j4304o085K6128
12620B50006q081j4162l819p303j4684q120r605J2449O039r186q256Q3q06j9986
12606A64569k2063N786J4080J7067j3817k4049m7J572j2769O437J214j0367J1136
12593A38749k594L546J4888r587j3134m902l460J3271Q713Q911K2477J2833j3832
12580A75879j3653J1591L087m248q213M573L887n029n380j6069j4936q951N92
12567A23130j9690k1186J3762P316L278j0345P173Q152o223j554k1313q154K676
$$ plain form
12661 240954 240708 235375 236283 250645 244061 228388 226276 226223 228343 223402 223170 223276 228595 249452 256508
12646 256508 289769 308258 306564 303094 304769 291921 279481 299499 299310 274509 278190 270990 259558
12633 259558 262786 275925 266093 272161 256731 242670 251771 261341 245937 244267 229963 223878 250006
12620 250006 241925 227763 223944 216641 201957 193837 184232 196681 202720 193534 185278 185361 184555 164569
12606 164569 142506 148292 162372 179439 165622 141573 141526 143098 130329 136766 137980 127613 138749
12593 138749 136155 139701 154589 145002 131868 126966 123506 136777 145490 154401 176878 189711 175879
12580 175879 162226 173817 176904 172656 164443 169016 172903 167874 162494 146425 131489 122538 123130
12567 123130 103440 82254 96016 103332 106610 96265 103438 111590 105367 103813 82500 74346 77022
12554G7022J5437r13m158K19R910K2N015m486l484j1510j3944j918J6661J9274
12540A03147J31j2044K688J2677J799j0355m40n360J3455J6887k5188k2373L839
12527G8863K896J9318l579r141J0902q652M032N728O549j4939j7416K3457P516
12514A05534p318k4831R764J1791k46k784q982M073J3114k319j1027k261R619
12501I4127m242j285L306q1j1699j7534M077l163O870J1939J4418J0753K033j0447
12487I9072o084p340J10j720p952K211R780p016m517J682K6545p714R910L482
12473A10449j206m79L014j804j3640k1135Q175J7676j0348M508N294J492j4508
12460H7488j5554l865j623N609k0744p767Q100P479j0695k824K6292J7365j4218
$$ plain form
12554 77022 92459 91546 87388 87607 97517 97539 102554 98068 94584 83074 69130 67212 83873 103147
12540 103147 103278 91234 93922 106599 108398 98043 97603 92243 105698 122585 97397 75024 78863
12527 78863 81759 101077 97498 88357 99259 90607 94639 100367 106916 91977 74561 98018 105534
12514 105534 98216 73385 83149 94940 94694 91910 82928 87001 100115 97796 86769 84508 94127
12501 94127 89885 88600 91906 91825 80126 62592 66669 63506 70376 82315 96733 107486 109519 99072
12487 99072 92988 85648 85758 84038 76086 78297 88077 81061 76544 78226 104771 97057 106967 110449
12473 110449 109243 108764 111778 109974 96334 75199 83374 101050 90702 95210 100504 101996 87488
12460 87488 71934 68069 66446 72055 51311 43544 51644 59123 48428 45604 71896 89261 75043
12447G5043j5065M440r896O617M136l723Q949o936l02O474k0228L445J3094N035
12433G1083j799K513J5354j1539k394J1442j6947j07N232l911Q788J5211K4495
12420A17421K3389J0986K0921L1470K4434J130N1566L5641J4630O5298N6007Q9037
12408E41930J32327J96580K62554L39788M21603M23841L52193K12045R2392M2147
12398C017400L0649l8732j90294l31284m05425l92952l36692k52123j87723j52740
12388G60084j17413o6482n0937l0609l7320k4879r780l6955l6183j0658j419j1223
12376C26226L861o276l7848j8805n898k556Q596q505O283K318j3765j4581k8204
12363B10846K536q592m762n597l738M616J2767L953j9953j1291K262j2230l976
$$ plain form
12447 75043 59978 64418 54522 61139 65275 61552 70501 63565 63263 69737 49509 52954 66048 71083
12433 71083 69284 71797 87151 75612 73218 84660 67713 67606 72838 68927 77715 92926 117421
12420 117421 140810 151796 172717 204187 228621 229751 281317 316958 331588 396886 452893 541930
12408 541930 674257 870837 1133391 1473179 1894782 2318623 2670816 2882861 2975253 3017400
12398 3017400 3048049 3009317 2819023 2487739 2082314 1689362 1352670 1100547 912824 760084
12388 760084 642671 576189 525252 494643 457323 432444 422664 385709 349526 338868 337449 326226
12376 326226 330087 323811 285963 267158 261260 258704 267300 258795 265078 267396 253631 239050 210846
12363 210846 213382 204790 200028 194431 190693 195309 208076 212029 192076 180785 183047 170817 166841
12350A66841j9307j5736l512j75K49o307k3671j2998J6685m91k094J929j0314
12337I1099n659j990J7847j6172j5308K163J6983p897l976J7463j0584k0462J1847
12324G5354L389j0538M656j0298K436j166J691J883K580J604p405K822j5756j3687
12310C7565j233R958O527J2485j0989j5790n261O000P670L054k707j4569o37K789
12296C4862o907M08j803o281n832j3540J379J4794l930P939P622J8194j145j5421
12282C0339N250J282K185l527j3502m390O03K964j7245j5338K184L0391L9894
12269F1090M276m758j3706j4393m074R94j3900J1105M441j0884q71O469k7205
12256a416n619R110R364j1631J2089J308M025k948k4156J3018K5095L1993l355
$$ plain form
12350 166841 147534 131798 128286 128111 128360 122053 98382 85384 102069 101578 99484 101413 91099
12337 91099 85440 83450 101297 85125 69817 71980 88963 81066 77090 94553 83969 63507 75354
12324 75354 78743 68205 72861 62563 64999 63833 65524 67407 69987 71591 64186 67008 51252 37565
12310 37565 36332 46290 52817 65302 54313 38523 33262 39262 46932 49986 47279 32710 32073 34862
12296 34862 27955 28363 26560 20279 14447 907 2286 17080 13150 21089 28711 46905 45760 30339
12282 30339 35589 36871 39056 35529 22027 17637 18240 21204 3959 -11379 -9195 21196 61090
12269 61090 65366 60608 46902 32509 28435 29429 15529 26634 31075 20191 19320 25789 -1416
12256 -1416 -7035 2075 11439 -192 11897 13205 17230 14282 -9874 3144 28239 60232 56877
12243E6877j4998k6756j3931L594N461J647J400K8379P400j7484j3415J398M574
12230B4146N111j5749j2240k771m913j3697N393J2478R231R211K340J837J9907
12217D0284r85p779P882j347n583K766N94p414j515M009j0024Q219k512l1363
12203d768J809o32J5056n70o641l330j3410J18Q607Q574J0388L30J952L327n026
12188A5784k74m797q9J1517M084O559K452j5324P94r108j3819L651K0k0084P540
12173a1094J9409O687j4615j7300J697J5878m689j5525l953M321r91J2861N141
12160b173n480o78j2644m159J5193m729k782J435K1893M146p56Q664M635N567
12146B8132k025J1j1171R727j5919k5881q411J3772J1557R736m141P049O993J4682
$$ plain form
12243 56877 41879 15123 1192 4786 10247 11894 13294 41673 49073 31589 18174 19572 24146
12230 24146 29257 13508 1268 -1503 -6416 -20113 -14720 -2242 6989 16200 18540 20377 40284
12217 40284 39299 31520 39402 38055 32472 35238 35832 28418 26903 30912 20888 29107 26595 -4768
12203 -4768 -2959 -3591 11465 10895 4254 924 -12486 -12368 -3761 4813 15201 15531 17483 20810 15784
12188 15784 15510 10713 10624 22141 26225 32784 35236 19912 20706 11598 -2221 1430 1450 -18634 -11094
12173 -11094 8315 15002 387 -16913 -15216 662 -4027 -19552 -23505 -19184 -20175 -7314 -2173
12160 -2173 -7653 -8331 -20975 -25134 -9941 -14670 -17452 -16017 5876 10022 9266 17930 22565 28132
12146 28132 26107 26118 14947 24674 8755 -17126 -25537 -11765 -208 9528 5387 12436 19429 34111
12132C4111Q319j5417k4171j1956J8179J9006j1808N900O179j1350J111J3391
12120C1494k908j7514j6598J38M306k764J7211o854L21j1082p97L997j0510o915
12106a8475M104J419J1860m056m759Q97L041r91p771j833R828j557r437K81J7637
12091A88J0186j2856M827J941J5750j2170j6968l82Q27l756k46J2765P316R695
12077A7117N228j0917J342o98j6585j8312O049J6778L891M375n24j1526k59Q122
12063D081L593J4757P65k1425q613o103p187Q247L034j2143j6078L338Q819K2015
12049b900R274O484K457J237J439j1229J1097j4028j7615P622Q113m001j6030
12036a8080k0270L026J5860L767r124l595K6257Q330n759K573O356j895k6692
$$ plain form
12132 34111 42430 27013 2842 -9114 9065 28071 16263 22163 28342 16992 18103 31494
12120 31494 28586 11072 -5526 -5388 -1082 -3846 13365 6511 6832 -4250 -5047 -1050 -11560 -18475
12106 -18475 -14371 -12952 -1092 -5148 -9907 -9010 -5969 -6960 -14731 -16564 -6736 -8293 -17730 -17449 188
12091 188 10374 -2482 2345 4286 20036 7866 -9102 -9484 -8657 -12413 -12659 106 7422 17117
12077 17117 22345 11428 12770 12072 -4513 -22825 -16776 2 3893 8268 7744 -3782 -4041 4081
12063 4081 7674 22431 23196 1771 -6842 -12945 -20132 -11885 -8851 -20994 -37072 -33734 -24915 -2900
12049 -2900 6374 12858 15315 16552 17991 6762 17859 3831 -13784 -6162 1951 -2050 -18080
12036 -18080 -38350 -35324 -19464 -15697 -24821 -28416 -2159 6171 412 2985 9341 7446 -19246
12023a9246K040J0682J4155J6244l671j4765R541m144j1307J3100J1980q6k52
12010B4271j6501j0399P72o466J1K4983P385k945j1326q505L406R519K359n754
11996A0810P155j7919l108J319J4510J0668j7304q076J0230M744J092K2265L624
11983D0010j7472j514j6448j7213P408N379o25j643k704j0261R792J4025l726
11970E008j087j0850j9169J199J6772J4589m649q985q666J7628j5721M011O462
11957c458j1983r825J6869K0622k717J8043J2146j0799j967j853M953Q627K3153
11944F1811J7806k5008r150L6805L3424o861l9973j3803j1280k1708M805K2422
11932D9290n905l1322n277j3352j0095J92J0331p479L23L10O260J618K2098J1122
$$ plain form
12023 -19246 -17206 -6524 7631 23875 20204 5439 14980 10836 -471 12629 24609 24523 24271
12010 24271 7770 -2629 -1857 -8323 -8312 16671 24056 21111 9785 1280 4686 14205 16564 10810
11996 10810 17965 46 -3062 -1743 12767 23435 6131 -1945 8285 13029 14121 36386 40010
11983 40010 22538 21024 4576 -12637 -5229 150 -475 -2118 -4822 -15083 -5291 8734 5008
11970 5008 3921 -6929 -26098 -24899 -8127 6462 1813 -7172 -15838 1790 -13931 -9920 -3458
11957 -3458 -15441 -25266 -8397 12225 9508 27551 39697 28898 26931 25078 30031 38658 61811
11944 61811 79617 54609 45459 82264 115688 108827 68854 55051 43771 22063 26868 49290
11932 49290 43385 12063 6786 -6566 -16661 -16469 -6138 -13617 -13294 -12984 -6724 -5106 16992 28114
11918B8114k0358q989p257j4595J0332R678Q660n522k4886j2592j745O562j7428
11905e0026R748R497J3694O609j68J0453J2730m554R20j0066j0820k0782M917
11892b7848J5650J9757P396Q801j021K540j2807k2933K0102K574j020K720j1385
11879B526k471M10o096j2412m127O01J4511J0186P018J0888o724k1785p408J9444
11865D561L393k9233j0483J1842J4296Q478J1855O720j5686k2005R119J633j0614
11852a6124J7211K0703J8413q75k231j6112m726R582O780m5094k289N370P066
11839b326n908j2678j764l055O217j59Q451R948J5911L505J200k0012j7351J1441
11825f580J9198L157J655j0976P181k0982o137J3210J1703q210p793J116n977
$$ plain form
11918 28114 7756 -1233 -8490 -23085 -12753 -3075 5585 63 -24823 -37415 -39160 -32598 -50026
11905 -50026 -40278 -30781 -17087 -10478 -10646 -193 12537 7983 8903 -1163 -11983 -32765 -27848
11892 -27848 -12198 7559 14955 23756 22735 25275 12468 -10465 9637 12211 11191 13911 2526
11879 2526 55 465 -5631 -18043 -22170 -21569 -7058 3128 10146 21034 14310 -7475 -14883 4561
11865 4561 7954 -21279 -31762 -19920 -5624 2854 14709 21429 5743 -16262 -7143 -5510 -16124
11852 -16124 1087 21790 40203 39328 37097 20985 16259 25841 32621 -12473 -14762 -9392 -2326
11839 -2326 -8234 -20912 -22676 -25731 -19514 -19673 -11222 -1274 14637 18142 19342 -670 -18021 -6580
11825 -6580 12618 15775 17430 6454 13635 -7347 -13484 -274 11429 3219 -4574 -3458 -9435
11812i435K229m344m661k885L279k867J5488O462j3558n100M500o9K72O142o02
11797e149K1238p049J6050N297J577j6111j0482j6402R59j6447j8494o507K0752
11784c0768J8198O634J477J2201O46r945L873N555kj88k172k4580l811k754p65
11769b6401J9257J7016J634j799K107j3697j6869m190O354J4394N297l792j6468
11756a7157k7968J9422K0095l895P148J704o427N121l606J9318J173j4112n943
11743e127J3262p523j6816n473K7197j1757j0282P839R0l60K7928J0420M496j4131
11729A9763q883J1917J1296J2320K861j8505j9008K4332L5056J927K6802L0618
11717A30496J9868k1442j3886r098j0710j7378l600j0657j0192O566o350k9636
$$ plain form
11812 -9435 -7206 -11550 -16211 -19096 -15817 -18684 -3196 3266 -10292 -15392 -10892 -10961 -10689 -4547 -5149
11797 -5149 16089 9040 25090 30387 31964 15853 5371 -11031 -10072 -26519 -45013 -51520 -30768
11784 -30768 -12570 -5936 -4459 7742 8388 -1557 2316 7871 7869 7681 5509 -19071 -22882 -25636 -26401
11769 -26401 -7144 9872 11506 9707 11814 -1883 -18752 -22942 -16588 -2194 3103 -689 -17157
11756 -17157 -45125 -25703 -5608 -9503 -2355 -651 -7078 -1957 -5563 13755 14928 816 -5127
11743 -5127 8135 612 -16204 -21677 5520 -6237 -16519 -8680 -8590 -8950 18978 29398 33894 19763
11729 19763 10880 22797 34093 46413 49274 30769 11761 36093 71149 73076 99878 130496
11717 130496 150364 128922 115036 105938 95228 77850 74250 63593 53401 59967 53617 23981
11705B3981q910j1708j953k41Q252L650l87L863O26Q351j0658L844j618k534J4521
11690B9079j676r664J315j1293l860r543L491j4249l308J4949m628r424J2919
11677e892J9548O28l172j8456j1136Q152P764P668J191J7877j6009K827K2102
11664C3092k424j4564J8901j3888k7695M352J4992p588j8924k117J8340K1867
11652B4344J145J6735j4614k6940J0882K160k72j0082N899r251P758R507Q982
11639B6253M009N751r164L283j7755j6345R09k702m318j0534q753J6595K5652
11626A2881Q336N360j1517k1585m320J447R570r730k5140p680J8220L794K275
11613a8089j311R998J6924j2941O649K925j3301o172L352m13J4474P771j8855
$$ plain form
11705 23981 15071 3363 1410 1169 9421 13071 12684 16547 17173 25524 14866 18710 17092 14558 29079
11690 29079 27403 17739 19054 7761 3901 -5642 -2151 -16400 -19708 -4759 -9387 -18811 -5892
11677 -5892 13656 14284 11112 -7344 -18480 -10328 -2564 5104 6295 24172 8163 10990 33092
11664 33092 30668 16104 35005 21117 -6578 -2226 12766 5178 -13746 -15863 2477 24344
11652 24344 25489 42224 27610 670 11552 13712 13440 3358 9257 6 7764 17271 26253
11639 26253 30262 36013 26849 30132 12377 -3968 -3059 -5761 -10079 -20613 -29366 -12771 12881
11626 12881 21217 26577 15060 -6525 -10845 -9398 172 -9558 -34698 -42378 -24158 -20364 -18089
11613 -18089 -19400 -9402 7522 -5419 1230 4155 -9146 -15318 -11966 -12379 2095 9866 -8989
11600h989J796K6610J2927j0911k3836l024L0948m903r202k1192q557k349n27
11587b1209J0305j2329J0553r80j7493n0M162L190J2514o816K506L367j0138j898
11573b4316P780J0257K07m006J2807M112k114Q535J898O41L658m059q108O187
11559A3479J5079j1994n45L76J8992O779m764j3243j117j1886n230j9317M333
11546i058l696J4207P61J72m632M081n715q284m627J4165l590p43q5p78J0136
11531B314J97j0106M974K401q675k281R107O331J2190M87m456j403O032o279q319
11516B514k007L396p128m963K329O749m178Q646O200j5017J158o80J4487l894
11502G612r571j0605M784J3297J5966n307L342K20O679k997N462N703J4322k92
$$ plain form
11600 -8989 -7193 19417 32344 21433 -2403 -5427 25521 20618 11416 -9776 -18333 -20682 -21209
11587 -21209 -10904 -23233 -12680 -13660 -31153 -31203 -27041 -23851 -11337 -18153 -15647 -12280 -22418 -24316
11573 -24316 -16536 -6279 -6072 -10078 2729 6841 4727 13262 15160 15801 19459 15400 7292 13479
11559 13479 28558 16564 16019 16395 35387 42166 37402 24159 23042 11156 5926 -13391 -9058
11546 -9058 -12754 1453 2214 2386 -2246 1835 -3880 -12164 -16791 -2626 -6216 -6959 -7044 -7822 2314
11531 2314 2511 -7595 -2621 -220 -8895 -11176 -2069 4262 16452 16939 12483 11080 17112 10833 2514
11516 2514 507 3903 -3225 -8188 -5859 890 -3288 5358 11558 -3459 -2301 -2981 11506 7612
11502 7612 -1959 -12564 -7780 5517 21483 16176 19518 19738 26417 23420 28882 34585 48907 48615
11488D8615j5361k694P025j9340n857J36n228j0994J1191N154k459r184R908J2866
11474B3778j9255j0015J3472K0211J0891L03k920K5108K3265l082j924j2809j6354
11461E0669j6037j0539K495l207q426j5279n674M438Q68Q621j013j481K1720O681
11447C3836O297M944j4215k1595M358j1213k2589j19P501j096J4927J8297J1697
11434C1030K4210J5386J0408J978k7402j9845m020r991N689P455P262j3637J160
11421B9683l947j1365o431P226M0q340N261o325R017L024j543q897P242r516R284
11406A4413J5722m544k70n746o728j9344O177q508j5970Q876R354J5484n797j5094
11392a1975r800J2697J359K498O456J032Q45K239J0989m688m853R606J2840j0725
$$ plain form
11488 48615 33254 30560 37585 18245 12388 12524 7296 -3698 7493 12647 10188 1004 10912 23778
11474 23778 4523 -5492 7980 28191 39082 39385 36465 61573 84838 81756 79832 67023 50669
11461 50669 34632 24093 26588 23381 14955 -324 -5998 -1560 -692 7929 6916 5435 27155 33836
11447 33836 40133 45077 30862 9267 13625 2412 -20177 -20296 -12795 -13891 1036 19333 31030
11434 31030 55240 70626 81034 83012 55610 35765 31745 21754 27443 34898 42160 28523 29683
11421 29683 25736 14371 7940 15166 15206 6866 12127 5802 14819 17843 16300 7403 14645 5129 14413
11406 14413 30135 25591 25321 19575 12847 -6497 -320 -8828 -24798 -15922 -6568 8916 3119 -11975
11392 -11975 -21775 -9078 -7719 -5221 1235 2267 3112 5351 16340 11652 6799 16405 29245 18520
11378A8520j4150j1082n736l583N320j333J1995q501n539J9075j3186o950N178
11365i972k194r019J2793J775K294K7022j2574j2772j4813J950q985K892l82J2405
11351i580j777j0994m53J1564K1886j541Q36o402j4045N65J8608J646R045j7468
11337A890q208K7442J1231j8642P96J4029O909m886k106l705k2344J514K1840
11324B5760L936r445j1714L885j388q205J599K655N494j0012P650J6975k0085
11311G105j6212K4034J9923o354k8529o061k454K907J2798L391j0667j1231R44
11298a0406M216k0303q517k411Q548J1571N939l007p123J1835R483R531K0445
11285B9801k57P15j8492M35m410j0522n60P498J4229P738N951j9189o946n817
$$ plain form
11378 18520 4370 -6712 -12448 -16031 -10711 -12044 -49 -8550 -14089 4986 -8200 -15150 -9972
11365 -9972 -12166 -21185 -8392 -6617 -4323 22699 10125 -2647 -17460 -15510 -24495 -21603 -21985 -9580
11351 -9580 -11357 -22351 -22804 -11240 10646 9105 9941 3539 -10506 -9941 8667 10313 19358 1890
11337 1890 -6318 21124 32355 13713 14509 28538 35447 30561 28455 24750 2406 3920 25760
11324 25760 29696 20251 8537 12422 11034 2829 4428 7083 12577 2565 10215 27190 7105
11311 7105 -9107 14927 34850 28496 -33 -6094 -8548 -5641 7157 10548 -119 -11350 -10406
11298 -10406 -6190 -26493 -35010 -37421 -28873 -17302 -11363 -14370 -21493 -9658 -175 9356 29801
11285 29801 29544 30259 11767 12202 7792 -2730 -3290 4208 18437 26175 32126 12937 5991 174
11271A74J7049J9356j4691n130J628j6203J620K314j3016k747J6633j1065J0080
11258F002L059j1370O4o691k736J9313K8904j5590j1385J262m815P302k584J5746
11244B6481J3201N914L675P006q772r64P671j451m352l5208j337J907o571r164
11230a964P096K2441K0905j1748j4142J0964L034k3534j7076k719O291J2536L398
11217A5482J1419R968J3225J0509j2272M972j6087k4857j055Q479J5838J0122
11205D5743m886q942K027J7036k0378j0898P055J329O156o487j0994n829N362
11192A6294L120p125j0241j7347p313Q391P224J6264m484r963l298K981J0818
11179E321r039p328K679M40J8007K2189j296l508r759p714j2195J5921j19L579
$$ plain form
11271 174 17223 36579 21888 16758 18386 2183 3803 6117 -6899 -9646 6987 -4078 6002
11258 6002 9061 -2309 -2245 -8936 -11672 7641 36545 20955 9570 10832 6017 13319 10735 26481
11244 26481 39682 45596 49271 56277 47505 46541 54212 52761 48409 13201 11864 13771 7200 -1964
11230 -1964 5132 27573 48478 36730 22588 33552 36586 13052 -4024 -6743 -452 12084 15482
11217 15482 26901 36869 50094 60603 48331 53303 37216 12359 11304 19783 35621 45743
11205 45743 40857 31915 33942 50978 30600 19702 26757 28086 34242 27755 16761 10932 16294
11192 16294 19414 12289 2048 -15299 -22612 -14221 -6997 9267 4783 -5180 -8478 -5497 5321
11179 5321 -3718 -11046 -8367 -7927 10080 32269 30973 27465 17706 9992 -2203 13718 13599 17178
11165A7178J0593r676j6369l936M725l953m463N509j5448j31K1953J1311O005
11152B3298k1159P340N609j6875o954J970o804N27j3407n943O707J997K45l328
11138b6777J7320o416j932J5004k144J3662P006l1612L29J7006L223N221K2422
11125C2312k364m332q687j814K840o472M82n149L440N375k0128N39O714l418o899
11110g561J0617j123Q934P751N976O962J2340p617J2277K6484R983J7354K487
11097A04864j5732l1439P214J4468O854n495k3459j0545n611j7351j3601O292
11085A6459k711J0454l212O309r275j4208J1745J0294j3311L139r175n302j1141
11072i935J0287j0727j2900m375j3514O772K3110K4638O189N64o225j410k0837
$$ plain form
11165 17178 27771 18095 1726 -2210 2515 -1438 -5901 -392 -15840 -15971 5982 17293 23298
11152 23298 2139 9479 15088 -1787 -8741 -6771 -13575 -13048 -26455 -32398 -25691 -23694 -23449 -26777
11138 -26777 -9457 -15873 -17805 -2801 -4945 8717 15723 -15889 -15560 1446 4669 9890 32312
11125 32312 29948 25616 16929 15115 17955 11483 11965 6816 10256 15631 -4497 -3958 2756 -662 -7561
11110 -7561 3056 1933 10867 18618 24594 31556 43896 36279 48556 75040 85023 102377 104864
11097 104864 89132 57693 64907 79375 86229 80734 57275 46730 41119 23768 10167 16459
11085 16459 13748 24202 20990 27299 18024 3816 15561 25855 12544 15683 6508 1206 -9935
11072 -9935 352 -10375 -23275 -27650 -41164 -34392 -11282 13356 19545 20109 13884 12474 -8363
11059h363r645P087n99o633J7053R537l1J0473L811J3175K2993j4504r045L707
11045C9016K693j2488q135j246K73L702j3151j1672J5150J6606J7814J912j0569
11032C9905n850l099O259M517K3392J7367O210M689r528Q728K2671Q55m8N766
11018A21834J3661J7183P223O226K5678L3383O2758Q0107J09095J79967K43798
11007I00913L14760L63102L14839P2369k22382l11165l04904k38008j73898j49486
10997E66140j08845m7743o9693o0668k8526j5961k8483k8148L755O938r712r637
10985A69417r928r985j1642K0426m850j6309j3460r680j96l450Q063K468P940
10972A28814R467m253n882J4305J6591Q290m866r062j7928l1492m375K663O346
$$ plain form
11059 -8363 -18008 -10921 -11520 -18153 -1100 8437 8406 18879 22690 35865 58858 44354 35309 39016
11045 39016 41709 29221 21086 19840 20113 23815 10664 -1008 14142 30748 48562 50474 39905
11032 39905 34055 30956 37215 41732 65124 82491 88701 93390 83862 92590 115261 116116 116068 121834
11018 121834 135495 152678 159901 166127 191805 225188 287946 368053 477148 657115 900913
11007 900913 1215673 1578775 1893614 1965983 1743601 1432436 1127532 889524 715626 566140
10997 566140 457295 409552 339859 279191 250665 234704 206221 178073 181828 188766 179054 169417
10985 169417 159489 149504 137862 158288 153438 137129 123669 113989 113793 110343 118406 120874 128814
10972 128814 138281 134028 128146 142451 159042 167332 162466 153404 135476 103984 99609 102272 108618
10959A08618k9640k6498j9163k930L103k0546L047K0296R328J5070J5654j3322
10947F3017j140j2957j1896j2682K417k6403L302K1244P455N405j902Q192K617
10934D6669N154q39R598N661J0698j5520o947j4609j392J1964J06M750j4725o367
10920C4201k907P449J2048l7192j1656K5555o703j6637J6975K1867k663k245m944
10907C3148M737m515j458o804n198J435L230J7838K0749J613k3317j9623P069
10894B8904j351R414j27j5123J9805J4008k493m480J4517K3523j6122k9288j3321
10881B7866k56J1530o612M579o031N053J1527k02J4584r512k28R73M50k1594L633
10866C5760k0P237J2608j0233j5597O822J5371J3065L673K7727J0301M589j619
$$ plain form
10959 108618 78978 52480 33317 30387 33490 12944 15991 36287 45615 60685 76339 63017
10947 63017 61877 48920 37024 24342 26759 356 3658 24902 32357 37762 35860 44052 46669
10934 46669 51823 50984 60582 66243 76941 61421 54474 39865 38473 50437 50543 55293 40568 34201
10920 34201 31294 38743 50791 13599 1943 27498 20795 4158 21133 43000 40337 38092 33148
10907 33148 37885 33370 31912 25108 19910 21345 24575 42413 63162 64775 41458 21835 28904
10894 28904 27553 36967 36840 21717 41522 55530 53037 48557 63074 86597 70475 41187 27866
10881 27866 27610 39140 32528 37107 31076 36129 47656 47454 62038 52526 52298 53271 53721 32127 35760
10866 35760 35740 42977 55585 45352 29755 36577 51948 65013 68686 96413 106714 111303 109684
10853A09684j3985j675J953J7495J9034L4722J5512P806K9001J8898J6353J6923
10841B71721Q082P79M087P193k7207j9728k1141m4859J565J9544m535k5379l1051
10828A39071k9632k7554q870N545j7737j4053L929Q050J7249J6471J2676R656
10816A14801J4852l597Q687j138n987j0576j2032J6556j9311k0616R047R332r872
10803I0146n033j9625N509r105R385j0172j2875r910J748r903m687o681k397J147
10789A7547L868L433J4652K8590J5962j2509k9181j0999J5182j558k1611j1332
10777A2044j469L911k8502p34J1179P27m746J5090K0115K0540L4483J1892l826
10764I0704N931L3176J6606k4213N488J3365j8648r012N114k837j2812n274j6437
$$ plain form
10853 109684 95699 94024 95977 113472 132506 167228 182740 190546 219547 238445 254798 271721
10841 271721 279803 280582 284669 291862 264655 244927 223786 178927 180492 200036 195501 170122 139071
10828 139071 109439 81885 73015 78560 60823 46770 50699 58749 75998 92469 105145 114801
10816 114801 129653 126056 134743 133605 127618 117042 105010 121566 102255 81639 90686 100018 90146
10803 90146 85113 65488 70997 61892 71277 61105 48230 38320 40068 30165 25478 18797 16400 17547
10789 17547 21415 24848 39500 68090 84052 71543 42362 31363 46545 44987 23376 12044
10777 12044 10575 14486 -14016 -14750 -3571 -2844 -7590 7500 27615 48155 82638 94530 90704
10764 90704 96635 129811 146417 122204 127692 141057 122409 113397 118511 115674 102862 97588 81151
10751H1151J721N86O379N356Q145J990j1749L738Q417O757J4526L5788P319m59
10737A69665L9570J9268m718J2614m68O409q947k0783k1980o1K9383K4442P084
10724B51478M151M597j286J5486K1423j3653l712L0410K5265K0011j8389k1161
10712C14620K351O900J1324j2755k8106k6191j0465j877n544p327m755k133O983
10699B43025q478p157J8914N672k756J7209J3084j4079j0001R370L0160K611p120
10686B90454k7665R102J9842J6330J9908K7772K3439K4219K2339L8162M4150J5802
10674E23854J3458J2733M6340L7662J9483Q818K9351K4614K8066K0189K0252K6479
10662H11299J3569J1194J2059K1512M1037L6016M6704L6380L4187K2140L2904
$$ plain form
10751 81151 82872 83458 89837 95193 103338 105328 93579 97317 105734 112491 127017 162805 170124 169665
10737 169665 209235 228503 223785 236399 235931 242340 233393 212610 190630 190569 219952 244394 251478
10724 251478 255629 260226 258940 274426 295849 282196 278484 308894 334159 354170 335781 314620
10712 314620 316971 323871 335195 322440 294334 268143 257678 255801 250257 242930 238175 236042 243025
10699 243025 234547 227390 246304 251976 249220 266429 279513 265434 255433 264803 294963 297574 290454
10686 290454 262789 271891 291733 308063 327971 355743 379182 403401 425740 463902 508052 523854
10674 523854 537312 550045 596385 634047 653530 662348 691699 716313 744379 764568 784820 811299
10662 811299 824868 836062 848121 869633 910670 946686 993390 1029770 1063957 1086097 1119001
10651A119001K4267L653Q176K3659P564K8202M3878L5162J5973L7877M8767L6984
10639A433163L3564K1895L9335K6239K3982L5614K5874M9788P3148R6676R4079
10628A953357Q7066R1568Q9241J14014J15883R2935J07413Q7804P4291R4228J34156
10617C041956J44894J85948K07108K36166K73616L18448L92142M54130M78994
10608E733402N53761O59678P91956R29908J042126R94543R01198R35965J138635
10599A3681172J532312K089793K862325L844946N169827O974629R634234J3603652
10591E9392890J9617677K8849246M2162451N9102397P4339660P0924512K8316883
10584C82705716l1112850o1317478o2574191n2646646l9869084k8679679k0502093
$$ plain form
10651 1119001 1143268 1146921 1155097 1178756 1186320 1214522 1258400 1293562 1309535 1347412 1396179 1433163
10639 1433163 1466727 1488622 1527957 1554196 1578178 1613792 1639666 1689454 1762602 1859278 1953357
10628 1953357 2040423 2131991 2221232 2335246 2451129 2544064 2651477 2739281 2813572 2907800 3041956
10617 3041956 3186850 3372798 3579906 3816072 4089688 4408136 4800278 5254408 5733402
10608 5733402 6287163 6946841 7738797 8668705 9710831 10705374 11606572 12542537 13681172
10599 13681172 15213484 17303277 20165602 24010548 29180375 36155004 45789238 59392890
10591 59392890 79010567 107859813 150022264 209124661 283464321 354388833 382705716
10584 382705716 351592866 290275388 227701197 175054551 135185467 106505788 86003695
10577H6003695j4946222j1234101q677371o787589n310112m115329l167742k428510
10569B9336719j837571j431581j284444j341826j385652j304909j125484r75749
10561A8649503p97098o51631n30202m42126l65310l09805k61437j95858j35360
10552A4960676p5581Q76J9780l8757j37155l24097m91152n84032o09959o21844
10542A2098755n98455n83264n50565n21875m83605m85501m59352m36194m22379
10533G557565l91368l65409l55248l24977k80774k66863k74963k53615k38751
10524D805597k07767k14894k22181k04469j84978j69376j53055j34925j19660
10515C194292j07784r5662p9270j04394j22850j20257j34818j23518j25850j11420
$$ plain form
10577 86003695 71057473 59823372 51146001 44358412 39048300 34932971 31765229 29336719
10569 29336719 27499148 26067567 24783123 23441297 22055645 20750736 19625252 18649503
10561 18649503 17852405 17200774 16670572 16228446 15863136 15553331 15291894 15096036 14960676
10552 14960676 14885095 14885971 14905751 14866994 14729839 14405742 13914590 13330558 12720599 12098755
10542 12098755 11500300 10917036 10366471 9844596 9360991 8875490 8416138 7979944 7557565
10533 7557565 7166197 6800788 6445540 6120563 5839789 5572926 5297963 5044348 4805597
10524 4805597 4597830 4382936 4160755 3956286 3771308 3601932 3448877 3313952 3194292
10515 3194292 3086508 2990846 2911576 2807182 2684332 2564075 2429257 2305739 2179889 2068469
10505B068469o7003q2788r2761o8655n9122o4042p5117o8913q2990o9372n3350
10494A284356k9288l1358k1948k8940k0565m4736l5410l6878l7900k4597m5870
10483I26866o1317j4678j7980k5382k7074m3487k2454k4387K972j8812J134O380
10471F81781o361L81K3534J3673J1735L3472M4844M6029L6178L3780K9100J008
10459I49154k7588k3004m1733o8046m4752o2105o7497o8634o7163k7699k089k6801
10447D22043k0749l0591j6839k0616N242N262J0670M744J088O341K0365O1370
10435D48330Q3236Q0459P4658M1995J3423k5920l9141p9120n0628l8372m0021
10424D68899l1966j8319r655K2561J8438J4732j642r150r089q874K3086J0255
$$ plain form
10505 2068469 2001466 1918678 1825917 1757262 1698140 1634098 1558981 1490068 1407078 1337706 1284356
10494 1284356 1255068 1223710 1201762 1172822 1152257 1107521 1072111 1035233 997333 972736 926866
10483 926866 865549 850871 832891 807509 780435 736948 714494 690107 693079 674267 675401 681781
10471 681781 675420 675801 699335 713008 724743 758215 803059 849088 885266 919046 948146 949154
10459 949154 921566 898562 856829 788783 744031 681926 614429 545795 478632 450933 448844 422043
10447 422043 401294 370703 353864 333248 338490 343752 354422 359166 360254 366595 386960 448330
10435 448330 531566 612025 686683 728678 742101 716181 677040 597920 547292 508920 468899
10424 468899 436933 418614 408959 431520 449958 464690 463048 453898 444809 435935 459021 469276
10412D69276j6466q394p51L564L123K052Q000K1963L158n286K0072J0479P540
10399E18330P738L2251j557j3783r995j3299r626n040j0653j4127j4766l5194
10387D30279j9874p931l363J5990P308N715J1441j336j5545j8604k2932P590J00
10374C88838l677p160k1211j4084j7295p833j2719j7301J712J6150L597j4300
10362B94717j7521k3373j284k295J3544l386K448m706q952R379K4307J189j7289
10349B66778k408O618J9130M110n514m105q437m448J8361R255K3026M4449J4134
10336C80949J7261L8754K7756J7609L1410N2983M5375L3177O1474R1049R7643
10325H95440P5427M3659O2352P8781O2853Q3212J47633K31098L48418N49756Q36297
$$ plain form
10412 469276 452810 444416 443665 447229 450352 452404 460404 482367 485525 480239 500311 510790 518330
10399 518330 526068 558319 556762 542979 532984 519685 510059 505019 494366 480239 465473 430279
10387 430279 410405 402474 399111 415101 422409 428124 439565 438229 422684 404080 381148 388738 388838
10374 388838 385161 378001 356790 342706 325411 317578 304859 287558 289270 305420 309017 294717
10362 294717 277196 253823 252539 250244 263788 260402 262850 258144 249192 258571 282878 284067 266778
10349 266778 264370 270988 290118 294228 288714 284609 276172 271724 290085 299340 322366 366815 380949
10336 380949 398210 436964 464720 482329 513739 566722 612097 645274 706748 797797 895440
10325 895440 970867 1014526 1076878 1155659 1218512 1301724 1449357 1680455 2028873 2578629 3414926
10314C414926J212841J629709J801812J363561K03812r86112j549401j547732
10306E543416j269641r42557o75242m98479l53505k85260j95962j40739j18967
10297A063064o7822n0178m3432l3164k7531l4570m0903k4617k3584k1722k938
10286F92603m711k3685n1409l6540j5055k1364j7913l931k1224m519O464j007
10274D97709k689K689J437j3096l5744j5975j3115o464j6658k2209l1462k2412
10262C22011K796J5770j9275j5528L977K0970k287O726p923k7684k5298k2064
10250B52191j2220K940j3052k3078M970o698M02l605k60P30j7739n125N305r819
10236A74942l956J4919J0266j6515j9299j4035q696j87J2942J1761l244j3499
$$ plain form
10314 3414926 4627767 6257476 8059288 9422849 9626661 8640549 7091148 5543416
10306 5543416 4273775 3331218 2655976 2157497 1803992 1518732 1322770 1182031 1063064
10297 1063064 995242 945064 901632 868468 840937 806367 765464 740847 717263 695541 692603
10286 692603 687892 664207 612798 576258 561203 539839 521926 517995 496771 492252 498716 497709
10274 497709 495020 497709 499146 486050 450306 434331 421216 414752 398094 375885 344423 322011
10262 322011 324807 340577 321302 305774 309751 330721 328434 335160 327237 299553 274255 252191
10250 252191 239971 242911 229859 206781 211751 205053 205455 201850 201590 202320 184581 179456 184761 174942
10236 174942 170986 185905 196171 179656 160357 146322 137626 137439 150381 162142 158898 145399
10224A45399M880J2526R013j8561j2512n934k2751L54j0189q845K3499J0653p562
10211A19970p395P385O5j4558Q615J7857k061N929j763q271M383J3109J2825n837
10197A50253M649m463o56l131O012j2497j6357j2350o653N850R706k880j0358
10184A07125j806j0080m915Q737Q491K1334J6583J4093Q45j4255j0577J4341J4082
10171A63998J5713K7728M0463M2668N2785R7710J43538J70789K26641L08970L90396
10160A681399K86496K3210k20001l26906l06125k51078j93154j21563r9841j04506
10150C67931p1725m0779j1103l978k3402l4826j6323M362k318L35p648m529j0015
10137A45982J7020J6212q514l374m771j7464k342K633K592l621j3201j6308j478
$$ plain form
10224 145399 150279 162805 171818 153257 140745 134811 112060 112414 102225 93380 116879 127532 119970
10211 119970 112575 119960 120025 105467 114082 131939 129878 135807 134044 125773 130156 143265 156090 150253
10197 150253 154902 150439 149783 146652 152664 140167 123810 111460 104807 110657 120363 117483 107125
10184 107125 105319 95239 90324 99061 107552 128886 145469 159562 160407 146152 135575 149916 163998
10171 163998 179711 207439 247902 290570 343355 441065 584603 755392 982033 1291003 1681399
10160 1681399 1967895 1991105 1771104 1444198 1138073 886995 693841 572278 472437 367931
10150 367931 296206 255427 244324 240346 216944 182118 165795 170157 167839 168174 160526 155997 145982
10137 145982 163002 179214 170700 167326 162555 145091 142749 145382 147974 144353 131152 114844 113366
10124A13366J5939J9161j0247j7456K223M644R296J4167n645j7j7157r820j9124
10111I9330l1805p048J6887P997J0249M148L641L649n685L888K061K179l855m598
10097A01038k386q733j58j4586q86l182n046J469p87k378j6442j662m918Q583
10083D9926J073l664l146o900j0817J5875J7919m184j2644L375m626L121O063
10070E1371l603q502R390j0177J784J0549J200P65j2399n692L978J0845J1888
10057F1397L2803j939k2549j9524J436m78j1577k985N749N403O991r818K488R647
10043E7044j3498n839Q495J534J5119J3874J63m021K227k829j6629n609k006j0065
10029C7960k0959J652R042J1850j440p439m387R948J1659j7557k0410q403J953
$$ plain form
10124 113366 129305 148466 138219 120763 122986 127630 136926 151093 145448 145431 128274 118454 99330
10111 99330 67525 60477 77364 85361 95610 99758 103399 107048 101363 105251 107312 109491 105636 101038
10097 101038 98652 89919 89761 75175 74289 71107 66061 67530 66743 64365 47923 46261 41343 49926
10083 49926 50999 47335 44189 37289 26472 42347 60266 56082 43438 46813 42187 45308 51371
10070 51371 47768 39266 48656 38479 40263 50812 52012 52777 40378 34686 38664 49509 61397
10057 61397 94200 92261 69712 50188 51624 51146 39569 36584 42333 47736 54727 44909 47397 57044
10043 57044 43546 37707 46202 47736 62855 76729 76892 72871 75098 72269 55640 50031 48025 37960
10029 37960 17001 18653 27695 39545 38105 30666 26279 36227 47886 30329 9919 1516 3469
10016C469o95R401P342M180P969j833J5160r62J855J1083o071R831k553j3227
10002D4949p17Q54j471R295k060k748q330j0327P723q242l117L009R463o607j1781
9987A9893j7839J063K4199M588l393j3565n781L780J35Q130j2233L637J0413q465
9973A4562k78J1672P410k996j5749j40n457k39J8094P239n344Q458k836j340Q65
9958C3921l714N569j848K4246m390j8249m985l625J2482J7447N211j0591N799
9945E7273m295n65j3034n096j7905O030J7620P314k4385r641J8481J8054O262
9932E6113j1059j6990j7015N890J0731o513n952J7164N496L463L143J6239P2j4686
9918D6096m457k0765n599l92m391J7463Q215r571J044n672o810j3852l686L258
$$ plain form
10016 3469 2774 12175 19517 23697 31666 29833 44993 44031 45886 56969 50898 60729 58176 44949
10002 44949 44232 45086 43615 52910 50850 48102 39772 29445 37168 28926 25809 28818 38281 31674 19893
9987 19893 2054 3117 27316 31904 28511 14946 9165 12945 13080 21210 8977 12614 23027 14562
9973 14562 14284 25956 33366 30370 14621 14481 9024 8785 26879 34118 28774 37232 34396 33056 33921
9958 33921 30207 35776 33928 58174 53784 35535 30550 26925 39407 56854 62065 51474 57273
9945 57273 52978 52413 39379 34283 16378 22408 40028 47342 22957 13316 31797 49851 56113
9932 56113 45054 28064 11049 16939 27670 21157 15205 32369 37865 41328 44471 60710 60782 46096
9918 46096 41639 20874 15275 14883 10492 27955 36170 26599 27643 21971 15161 1309 -2377 881
9904H81M533J2484R826K7723l439j4099M113j2635j2865L192R099J3702J3532
9891E6047l808L889Q386J5032J1636m233n312k0832M800l216p290J6390J9169
9878I0658M036j6515k7652l300J107p186k300n901L6175M2072j2938j1268j9960
9865F7028k4708m793m422Q237j1230j4962J466K1457J0252j2322j6243l022R514
9852B6252J1514J6596l794k9844j4313P079J5781J755m180K8933P869K188R284
9839G5120J0086k392k602O489M336K099n31k0393n510j1038p29Q105l723m130
9825E5187q214k3392n728K493Q466K1656n022q649j5276M188R309J9459j3416
9812D1061j1140O638J9436j4000j1343l808J4242J2317J2664N900J7928n168k2967
$$ plain form
9904 881 5414 17898 27724 55447 52008 37909 42022 29387 16522 19714 28813 42515 56047
9891 56047 52239 56128 64514 79546 91182 86949 81637 60805 65605 62389 55099 71489 90658
9878 90658 94694 78179 50527 47227 48334 41148 38848 32947 69122 111194 98256 86988 67028
9865 67028 42320 37527 33105 41342 30112 15150 16616 38073 48325 36003 19760 16738 26252
9852 26252 37766 54362 50568 20724 6411 13490 29271 31026 26846 55779 63648 65836 75120
9839 75120 85206 82814 80212 86701 91037 93136 92605 72212 66702 55664 54935 63040 59317 55187
9825 55187 46973 23581 17853 20346 28812 50468 45446 36797 21521 25709 35018 54477 41061
9812 41061 29921 36559 55995 41995 30652 26844 41086 53403 66067 71967 89895 84727 61760
9799F1760l287R143R711q562j1090j2686j6661n732J2062l942J3447K434q678
9786C7919j0839j932N415j0245J0225J7208Q645L0650L4199L9636M1972P0667
9774B73520P4674Q5510L2279j9728n6011p7530p0674l5711k7423k6114l2363k3718
9762I6711l2700j0985j8733O04P692R467N228R093Q907p751j4689r425J0583r71
9748E3031p912j5795l307l00N519j3070J2158K0628R986k162K467N170o003m573
9734E5837K401M500o370N007m164J4135J2637j551k0448j9195j315K0380J09r246
9720E2717o97j754R249k6042j4696J3286P802m024J946N045r051j0851r251J0099
9706B3778J5962M617P188M199m2k4010k5477R897K2367J1098L323N823j8347j4036
$$ plain form
9799 61760 58473 67616 77327 68765 57675 44989 28328 22596 34658 30716 44163 46597 37919
9786 37919 27080 25148 30563 20318 30543 47751 56396 87046 121245 160881 202853 273520
9774 273520 348194 433704 465983 446255 390244 312714 242040 206329 178906 152792 120429 96711
9762 96711 64011 53026 34293 34897 42589 52056 57284 66377 75284 67533 52844 43419 54002 53031
9748 53031 45119 29324 26017 25717 31236 18166 30324 50952 60938 58776 61243 66413 60410 55837
9734 55837 58238 62738 56368 61375 57211 71346 83983 82432 61984 42789 41474 61854 61963 52717
9720 52717 52020 50266 59515 33473 18777 32063 39865 35841 37787 42832 33781 22930 13679 23778
9706 23778 39740 44357 51545 55744 55702 31692 6215 16112 38479 49577 52900 58723 40376 26340
9692B6340j530J3220J3914J0831j2872j517n709j3272L055K574Q988P258r219
9679D2061o270J8247Q282k9131r946J2607L5556r143j2658K966Q403o52j5389
9666D4933j2931r695N576R16R126K3852j713r787J348p785o435J4941J150K211
9652E5707O932m059l423j1368J0499j5118L637L149L575J1114j5859j3538K0226
9639E1474M635j327L361M457p903J579L296p927k172j68K0656O889j4779q992
9625E3079P100n715L2k155o881q516J5205O715J2010k1248M496j5180j4384M179
9611B8737M47m49P651J3749l123k842p716L40N803j13N804J1182j3168l3090L041
9596A6253J8925J0123J3790k018J421n81J2330K0247K69o120l010J916O084n505
$$ plain form
9692 26340 24810 38030 51944 62775 49903 48386 42677 29405 32460 35034 44022 51280 42061
9679 42061 35791 54038 62320 33189 23243 35850 71406 62263 49605 52571 60974 60322 44933
9666 44933 32002 22307 27883 28799 37925 61777 60064 50277 51625 43840 37405 52346 53496 55707
9652 55707 62639 58580 55157 43789 54288 39170 42807 45956 49531 60645 44786 31248 51474
9639 51474 56109 54782 58143 62600 54697 56276 59572 51645 49473 49305 69961 76850 62071 53079
9625 53079 60179 54464 54496 52341 45460 36944 52149 58864 70874 49626 54122 38942 24558 28737
9611 28737 29184 28735 36386 50135 47012 44170 36454 36794 42597 42484 48288 59470 46302 13212 16253
9596 16253 35178 45301 59091 57073 58494 57913 70243 90490 90759 84639 81629 83545 89629 84124
9582H4124q057r724m903P51P018K0359N023M445j4645o037K3746J9975m648K46
9568A17673K650N894O59k0726k9990J946J7242J4818j0758j3946R69k053j5760
9555F8618O901K728k861P633R380q44r36j70k772l315j116j0936k055M252m180
9540G0327K090N966k87J4516p074l412O023k0860p045K0589K5989m390j0349p785
9526H4298m71J248Q155o291n859P056m789j5026J1317j473j4836l3426m429O045
9512C1519l363m972J8304L719N526J9358J6747O744j9340j7107J2536j3208j4774
9499D1689o981J1506Q200J6290J2277K2935J2115j1285j0979J0941J0345l491
9487A13562j2913j3250O487N427J2606k685l373K78k438r620O02P222J3514k208
$$ plain form
9582 84124 76067 66343 61440 62191 69209 89568 94591 99036 84391 78354 102100 122075 117427 117673
9568 117673 120323 126217 126876 106150 76160 78106 95348 110166 99408 85462 86431 84378 68618
9555 68618 75519 78247 75386 83019 92399 91555 90619 90449 87677 84362 83246 72310 70255 74507 70327
9540 70327 72417 78383 78096 92612 85538 82126 88149 67289 60244 80833 106822 102432 92083 84298
9526 84298 83827 85075 93230 86939 81080 88136 83347 68321 79638 78165 63329 29903 25474 31519
9512 31519 28156 23184 41488 45207 50733 70091 86838 93582 74242 57135 69671 56463 41689
9499 41689 34708 46214 54414 70704 82981 105916 118031 106746 95767 106708 117053 113562
9487 113562 100649 87399 93886 99313 111919 109234 105861 106139 103701 94081 94683 101905 115419 113211
9473A13211n681k675J8067J2654J8575K5521r979l1433k0311K353J5231P845J5213
9460A58591J0167j963P864O265P231Q353rm104m944J0380J9036R601k1650o451
9446A98367K0281J4060P294r648P706R597J4590n069j1995m339q113l2475M867
9433B05123Q785l477N830J8598J2803K2455Q303q740n147N795M305M280J1811
9420B90724J142j4740L567K2611K2411j7316j2684Q139P556J673J3222j55M5620
9407C71770L6710L585M93J6419K766o5R770K4922J0071J3568J2693K3558J5337
9394E41597K5919K4034J9654P206l555J4609K7042K0797J4810J7415P773J5444
9382G32745Q845J4491K4981M1276N7524J0470M384L2023J863K8500M2062J8885
$$ plain form
9473 113211 107530 104855 122922 135576 154151 179672 169693 138260 117949 120302 135533 143378 158591
9460 158591 168758 166795 174659 180924 188155 196508 196499 192395 187451 197831 216867 226468 204818 198367
9446 198367 218648 232708 240002 230354 238060 247657 262247 257178 245183 240844 232731 200256 205123
9433 205123 213908 210431 216261 234859 247662 270117 278420 269680 264533 270328 274633 278913 290724
9420 290724 291866 277126 280693 303304 325715 308399 295715 303854 311410 313083 326305 326150 371770
9407 371770 408480 412065 412558 428977 431743 431678 441448 466370 476441 490009 502702 526260 541597
9394 541597 567516 591550 611204 618410 614855 629464 656506 677303 692113 709528 717301 732745
9382 732745 741590 756081 781062 822338 879862 890332 894716 926739 928602 957102 999164 1018049
9370A018049K1766L2674K8695K0284L2597L7203M1436L4071L3223N2466P4243
9359A426707O2263L9781M8852Q9600Q3094O5323J02662R4390R9765R3444J09470
9348B315351J03764J13534J27521J64758J68328J83548K04048K31324K57866K77901
9338D147943L06412L56570L89962M22173M97042N79019O44169P52584Q96957J034390
9328A0027221J231476J465721J749534K131461K561490L137159L795426M579718
9320C0679206N495195O435117P292272P780218P534718O182121L700225M39656
9312G5538728k775729n191443o522152o892520o596181n952316n201791m451303
9304C1955293l765295l193608k676364k251026j884208j595725j383067j200825
$$ plain form
9370 1018049 1039815 1072489 1101184 1121468 1154065 1191268 1232704 1266775 1299998 1352464 1426707
9359 1426707 1488970 1528751 1577603 1667203 1750297 1815620 1918282 2012672 2112437 2205881 2315351
9348 2315351 2419115 2532649 2660170 2824928 2993256 3176804 3380852 3612176 3870042 4147943
9338 4147943 4454355 4810925 5200887 5623060 6120102 6699121 7343290 8095874 8992831 10027221
9328 10027221 11258697 12724418 14473952 16605413 19166903 22304062 26099488 30679206
9320 30679206 36174401 42609518 49901790 57682008 65216726 71398847 75099072 75538728
9312 75538728 72762999 67571556 61049404 54156884 47560703 41608387 36406596 31955293
9304 31955293 28189998 24996390 22320026 20069000 18184792 16589067 15206000 14005175
9296A4005175j032311q93371p66642o78686n76587n08435m41418l99077l59069
9287H349579l29952k43752k34786k34998j96617j76380j69902j62258j44439j56217
9277F300278j61805j48313j73973j94452j82045j95344j89614k02329j97582j97215
9267D457606j76564j76314j83404j73549j73008j52269j32951j35259j29143j35598
9257B889547j21022j13971j13623j01068j02191j08413r2440r5612p6889p1440
9247A892878p3362q2022p3366m2566m8799n5766m9962n3824m7447l2604m6832
9236A286328l9066k9678n2079m6425m8824m2389k8369m6603k1829j6868l5942
9225H78256l9559m0417k6141k3158l2648l280j2348k5821o341j5100j2828k8276
$$ plain form
9296 14005175 12972864 12079493 11312851 10634165 10057578 9549143 9107725 8708648 8349579
9287 8349579 8019627 7775875 7541089 7306091 7109474 6933094 6763192 6600934 6456495 6300278
9277 6300278 6138473 5990160 5816187 5621735 5439690 5244346 5054732 4852403 4654821 4457606
9267 4457606 4281042 4104728 3921324 3747775 3574767 3422498 3289547 3154288 3025145 2889547
9257 2889547 2768525 2654554 2540931 2439863 2337672 2229259 2136819 2041207 1964318 1892878
9247 1892878 1819516 1737494 1664128 1621562 1572763 1516997 1467035 1413211 1365764 1333160 1286328
9236 1286328 1247262 1217584 1165505 1119080 1070256 1027867 999498 952895 931066 914198 878256
9225 878256 838697 798280 772139 748981 716333 713053 700705 674884 668543 653443 640615 612339
9213F12339l0502k0899j4080k1730j4884l5635j1541K3642K3315n209m0985k0172
9201D43659R827J501r418j0419O64K0888J068k3398p448N594K0011P917j1050
9188D49396O312q948K137k2284k6422j4486q802J896j8106l1777l556k483j9555
9175C03322k1357q548n450J874Q88o692j5494j3404j8412j7866L202l874p209
9162A90980j5906O507J1219L110j0015K078J4648J8437j256j745O864l80j5655
9149B08886p554J333J6790o555o418m601J488R544j1271P56J0706r59j9382o276
9135A86487J4633P083q179o201P020K2464K3632L004j0797P429K462o166j2078
9122B30793M646o572j0112l861J8465O915k8880j8953N285L986j4427n316j1862
$$ plain form
9213 612339 581837 560938 546858 525128 510244 474609 463068 486710 510025 504816 463831 443659
9201 443659 453486 454987 445569 435150 435814 456702 457770 434372 426924 432518 452529 460446 449396
9188 449396 455708 446760 448897 426613 400191 385705 376903 378799 360693 328916 325360 322877 303322
9175 303322 281965 273417 267967 269841 270729 264037 248543 235139 216727 198861 202063 198189 190980
9162 190980 175074 181581 192800 195910 185895 187973 202621 221058 219802 218057 224921 224541 208886
9149 208886 201332 202665 219455 212900 206482 201881 203369 212913 201642 202398 213104 212145 192763 186487
9135 186487 201120 208203 200024 193823 200843 223307 246939 249943 239146 246575 249037 242871 230793
9122 230793 235439 228867 218755 214894 233359 240274 211394 192441 197726 201712 187285 181969 170107
9109A70107n23J2880J094k0085l828Q199n361j3245N724m299j3635j8097J0335
9096A29266n461J5355M541k433r460k9543j163K952J0592J1491Q979J7428J74
9083A52718m879j1226j342K7515j613j8311R295j1845o022J94l571k6725j941
9070A02247P668R370p269N605n50j234L056R164J4207Q892k5931j4064j631l713
9056A05817m632n797O660K0855M977o89k7974j5780J3405j4813j8884n464J0814
9043F8495P495M469q046k032j718j4028k410j0310J0145J8656O282K219O852m0612
9029D5457j4687j144J9149O159J3775k359j5708J290K6479K2373R035j3906k7367
9016F8546j5010j2227L66J0921K738J524m865O589J2766J593j2404q636J5372
$$ plain form
9109 170107 169584 182464 183558 163473 159645 167844 162483 149238 154962 150663 137028 118931 129266
9096 129266 123805 139160 143701 141268 131808 102265 101102 104054 114646 126137 135116 152544 152718
9083 152718 147839 136613 135271 162786 161173 142862 152157 140312 134290 134484 130913 104188 102247
9070 102247 109915 119285 112016 117621 117071 115837 118893 128057 142264 151156 125225 111161 109530 105817
9056 105817 101185 95388 102048 122903 127880 127191 99217 83437 96842 82029 63145 57681 68495
9043 68495 75990 80459 72413 70381 68663 54635 52225 41915 52060 70716 76998 79217 86069 45457
9029 45457 30770 29626 48775 54934 68709 66350 50642 51932 78411 100784 109819 95913 68546
9016 68546 53536 41309 41675 52596 55334 56858 51993 58582 71348 72941 60537 51901 67273
9003F7273J9128k929j3578j5574j8518o753K0276Q217q21K0163N848J272J113
8990H5117k9695r917j0557K241R852n656j0116J6325K1675J0298j575j3761K620
8977F6851P503q700j0462L124j0905j470P388n143l264J8420L004P097n13J1628
8963H4558n095j9588j0464q354k258N20n791R776K888j4132j8136Q463J5859J4299
8949E2545Q214N559n472j055J102L904J5647J0371m0548k5818L054N495j0958
8936B2040J3614K6862J1284m062k7j3979J979J3512j656j493r523L466n012l1745
8922B5260k1376L237M667J469K1288K3369K740j0471j8284j0372K864J6701J1402
8909E2494M118Q8k176r661k64J365j1234r765K305j700k632P624J1202l660N882
$$ plain form
9003 67273 86401 83472 69894 54320 35802 29049 49325 57542 56721 76884 82732 84004 85117
8990 85117 55422 45505 34948 37189 47041 41385 31269 47594 69269 79567 77992 64231 66851
8977 66851 74354 65654 55192 58316 47411 45941 53329 48186 44922 63342 66346 73443 72930 84558
8963 84558 79463 59875 49411 41057 38799 39319 33528 43304 46192 32060 13924 22387 38246 52545
8949 52545 60759 66318 60846 59791 60893 64797 80444 90815 50267 24449 27503 32998 22040
8936 22040 35654 62516 73800 69738 69711 55732 57711 71223 69567 68074 58551 62017 57005 25260
8922 25260 3884 7121 11788 13257 34545 57914 60654 50183 31899 21527 24391 41092 52494
8909 52494 56612 56700 54524 44863 44599 45964 34730 24965 27270 25570 22938 30562 41764 38104 43986
8894D3986J171J6337j938j1352j6940Q91L572N7k678k696l924J7080L234j7919
8880B8881j7224J4339L3919R651k4634L091J820j6450l671N878J4627L879p807
8867D6299j411J198O799N969P086O452j5958j8433J6320q291j3379R570O179L029
8853E1429n125J067n355J754L189K1905k911q928J42N761J2625R586m609r801
8839G0729J456o817j0107j1220m960R583J0572O915j0712j1424J0991R103K257
8826F6366k0659j6117n403m704Q11J1390p183O914K1218P475N070K1685q461j0403
8812F7999k328r586j7749j2011O32P603K588M674J3562J0801j7149j4556J179
8799C5659R985K4322l332Q252P740K313k7337j8652J852R952P850p797j681M76
$$ plain form
8894 43986 45157 61494 59556 48204 31264 32155 35727 35784 33106 30410 26486 43566 46800 28881
8880 28881 11657 25996 59915 69566 44932 48023 49843 33393 29722 35600 50227 54106 46299
8867 46299 44888 46086 52885 58854 65940 72392 56434 38001 54321 46030 32651 42221 48400 51429
8853 51429 46304 47371 42016 43770 46959 68864 65953 57025 57167 62928 75553 85139 80530 70729
8839 70729 72185 65368 55261 44041 39081 48664 59236 66151 55439 44015 55006 64109 66366
8826 66366 45707 29590 24187 19483 20294 31684 24501 31415 52633 60108 65178 86863 78402 67999
8812 67999 65671 56085 38336 26325 26957 34560 37148 41822 55384 66185 49036 34480 35659
8799 35659 45644 69966 66634 74886 82626 84939 57602 38950 40802 50754 58604 50807 49126 49602
8785D9602N212j319k0r853p73M412L145p867Q150j0229J0851K56k0570N142o401
8770B9738j0591J7375J4494L269j6218r093m370J4715O107J2776L488m198j2242
8757D5250o654j2393j956O902K5650K765K256o256J2498J55q241o600n781J1009
8743E8604Q648O273k778j1885j2017M203m573m052K3163O184q397k1031j724L171
8729D3789o645J2745J4192Q93J8627L751j2784j5318p962n134M789R939J6245
8716G7127M495j3442j6829m774r475R957J4482J7816q881j9672n486l652m445
8703C7221O012k760K7822J5865r14p12J7426M726M134J1455J2521j8524l0683
8690H3589n137K4020K2091J566n298j5526p928n407k425p926O583j536p743K665
$$ plain form
8785 49602 54814 53495 53475 43622 42849 47261 50406 42539 50689 40460 51311 51567 30997 36139 29738
8770 29738 19147 36522 51016 54285 38067 28974 24604 39319 45426 58202 61690 57492 45250
8757 45250 38596 26203 24247 31149 56799 59564 61820 55564 68062 68217 59976 53376 47595 58604
8743 58604 67252 73525 70747 58862 46845 51048 46475 42423 65586 71770 63373 42342 40618 43789
8729 43789 37144 49889 64081 64974 83601 87352 74568 59250 51288 46154 50943 60882 77127
8716 77127 81622 68180 51351 46577 37102 47059 61541 79357 70476 50804 45318 41666 37221
8703 37221 43233 40473 68295 84160 83246 82534 99960 104686 108820 120275 132796 114272 83589
8690 83589 78452 102472 124563 126129 120831 105305 97377 91970 89545 81619 88202 86666 78923 81588
8676H1588p765n479j0404M682J0202j863J388J5503J1139k000j3309J9146p332
8663I5496j6076l0765r811o330K6988J6243J408R733n038q755R649k490q421J0457
8649H2288p599m615J5007N570q943K182L185j0881l979p115j9745O771K3730p107
8635F8749J7496K2454K466j3164q698p958j2289J4437Q352K430O277r494l987
8622H7071r566j2149L123l462K938J3183K4254o843j858M760j0985j3839o256
8609G0371q174J3779J0833J3417J8763m329M50Q939K614n113l939N899J4688N09
8595A38707k825j406J1331L0712J337J7572K8304J3442j1512p707j0860J6668
8583B23763K6653J3386m000p054l4762j2446l1175j9863L253k970L579P144p048
$$ plain form
8676 81588 73823 68344 57940 62622 72824 70961 72349 87852 98991 96991 83682 102828 95496
8663 95496 79420 48655 38844 32514 59502 75745 77153 86886 81848 73093 82742 80252 71831 82288
8649 82288 74689 70074 85081 90651 81708 83890 87075 76194 72215 65100 45355 52126 75856 68749
8635 68749 86245 108699 111165 98001 89303 81345 69056 83493 91845 94275 100552 91058 87071
8622 87071 77505 65356 68479 65017 67955 81138 105392 98549 96691 101451 90466 76627 70371
8609 70371 62197 75976 86809 100226 118989 114660 115110 124049 126663 121550 117611 123510 138198 138707
8595 138707 135882 134476 145807 176519 177856 195428 223732 237174 225662 217955 207095 223763
8583 223763 250416 263802 259802 252748 217986 205540 174365 154502 157755 154785 158364 165508 158460
8570A58460k530j0025k4554p627J1066n735k0642j3332J018K615J4546L094j5914
8557I0440j8814p28M66j8427m337O795K0283K284J3753P950j4806L591J3316n137
8543I6629L977j3174j3019j8158j4395j551j503o558J7711J8645L255n251n722
8530F0886j2626j2862l095l410q580O815q06j573N222j508l564m037j89n926r784
8515D963J0566L392p066l199m03J2319o249m290N771r07j0110n540Q371J0996
8501A8614O325N65j4183j4168K77K7753J7095k125l127M144j636Q494R020k410
8487E4638L285m504j6439m074M342j5211j0382O30J114J8134o688R62j0965j974
8473A2868J279j7513N448J8858q240j6686n826K0373K1874j6685o977n15m686
$$ plain form
8570 158460 155930 145905 121351 113724 124790 119055 98413 85081 86099 88714 103260 106354 90440
8557 90440 71626 70898 71364 52937 48600 55395 75678 77962 91715 99665 84859 88450 101766 96629
8543 96629 100606 87432 74413 56255 41860 40309 38806 32248 49959 68604 71859 66608 60886
8530 60886 48260 35398 32303 28893 20313 27128 26322 24749 29971 28463 24899 20862 20673 14747 4963
8515 4963 15529 18921 11855 8656 8253 20572 14323 10033 15804 14897 4787 -753 7618 18614
8501 18614 24939 25504 11321 -2847 -2570 25183 42278 40153 37026 41170 39534 48028 57048 54638
8487 54638 57923 53419 36980 32906 37248 22037 11655 12285 13399 31533 24845 25807 14842 12868
8473 12868 14147 -3366 2082 20940 12700 -3986 -9812 10561 32435 15750 8773 8258 3572
8460C572r61j1816K666N737M425N327O930J0280q475L97L4761J1536j2861j6426
8446C5092k103o270l392K188J7496k0853k734K9300m639j3824K623Q110k1722
8433A9272k0534M773o126N595K149O718R575R42o431j443J8493K593k020j4818
8419A8738j847q614O575j429O46m796j6956m580J6347K4771J8983M371O40J9070
8405G1919o544k1209j5343j4752k183N786K1627q843r440l272j3718l062N075
8392F041O534J1416J1577k7083j2106j787j2865O720K8418K112J135K0727n19
8379D0320q872R59Q626j734l091L987q308L49K1997O279J4683R640M497k595k813
8364H3924r506j4574j1854N611j1779l966j1953m294J1941m907P301j1827l491
$$ plain form
8460 3572 2611 -9205 -6539 -802 3623 8950 15880 26160 17685 18082 52843 64379 51518 35092
8446 35092 32989 26719 23327 25515 43011 22158 19424 48724 44085 30261 32884 40994 19272
8433 19272 -1262 3511 -2615 2980 5129 11847 21422 22364 15933 14490 32983 35576 33556 18738
8419 18738 16891 8277 14852 13423 14069 9273 -7683 -12263 4084 28855 47838 52209 52849 71919
8405 71919 65375 44166 28823 14071 11888 17674 39301 30458 21018 17746 4028 966 6041
8392 6041 12575 23991 35568 8485 -3621 -5408 -18273 -11553 16865 18977 20112 40839 40320
8379 40320 31448 32407 41033 39299 36208 40195 31887 32236 54233 60512 75195 84835 89332 86737 83924
8364 83924 74418 59844 47990 53601 41822 37856 25903 21609 33550 28643 35944 24117 20626
8351B0626m817n785o712N306n687m905K9039J4925M908N992n330J5038q314j8588
8337C5696P850o213j9507k4000j2122O899J2248L1815K5298O887p57K0265q332
8324G6027j8419Q72J320Q02k2102j9358n883q553k479J774k22O051J6428J2478
8310C8736n022L880M63j4612j6348k0889J3217l976p578J2574J2616q014J403
8297F450J3518L873p854p872j7629J1294Q410J605j2664k808O450n809J1325J2391
8283B0680L317k569k6979p735J6056J4218j1558K567R437k974j5907M943J1079
8270A4575j6582o815J3135K461m650J896k738L450L207j54l881j642m935J2329
8256I656J7846j6336j7569J5932J4255P555R817j7463k0516m068P839N712R204
$$ plain form
8351 20626 15809 10024 3312 8618 2931 -1974 27065 41990 46898 52890 47560 62598 54284 35696
8337 35696 43546 37333 17826 -6174 -18296 -11397 851 32666 57964 64851 64094 84359 76027
8324 76027 57608 58480 59800 60602 38500 19142 13259 4706 2227 4001 3779 9830 26258 38736
8310 38736 33714 37594 38057 23445 7097 -13792 -575 -4551 -12129 445 13061 5047 6450
8297 6450 19968 23841 15987 8115 -9514 1780 10190 11795 -869 -3677 2773 -3036 8289 20680
8283 20680 23997 21428 -5551 -13286 2770 16988 5430 7997 17434 14460 -1447 3496 14575
8270 14575 -2007 -8822 4313 6774 2124 4020 1282 4732 7939 7785 3904 2262 -2673 9656
8256 9656 27502 11166 -6403 9529 23784 31339 41156 23693 3177 -891 6948 12660 21864
8243B1864Q928P706j5401k6062L451J1578Q32O438K595m594j6482R596Q102J0434
8229B8985N004j4146j3836O200J4750p657o12J4566J275n70j2338M330P805j2153
8215B1603n852j2863m607R126J3242j6839K531n448n211O074p369M892N042r556
8201e235q70P027K6346j1177M557p05j5270o821L080J4781N086j5128M010j4480
8187d799J8020J0448L22p213j6902M35P337l720n789P391Q344L138j2097O389
8173A1304J9972r915J494j783j2139j578m709K542j105j1288J8481J8466j1754
8160A7988j4293P254J5062M83j5222j512M841j7049m584L209r145J715R099N84
8146a570l232Q32j2632k5954L3409J7013k656m536J968q038R63Q162K30o466j3579
$$ plain form
8243 21864 30792 38498 23097 -2965 486 12064 12896 19334 21929 17335 853 10449 18551 28985
8229 28985 33989 19843 6007 12207 26957 19300 18688 33254 34529 33959 21621 25951 33756 21603
8215 21603 15751 2888 -1719 7407 20649 3810 6341 893 -4318 1756 -5613 -721 4321 -5235
8201 -5235 -6105 922 27268 16091 20648 19943 4673 -2148 932 15713 20799 5671 9681 -4799
8187 -4799 13221 23669 23991 16778 -124 311 7648 3928 -1861 5530 13874 17012 4915 11304
8173 11304 31276 21361 22855 21072 8933 7355 2646 5188 4083 -7205 11276 29742 17988
8160 17988 3695 10949 26011 26494 11272 9760 14601 -2448 -7032 -3823 -12968 -11253 -2154 -1570
8146 -1570 -4802 -3970 -16602 -42556 -9147 7866 5210 674 2642 -5396 -4433 3729 3959 -2507 -16086
8131a6086p505O747K1625J703P345N505M197O784K903k923j0742j7305q432K643
8117c541k959J3326K2599q870J1503O293m108J4202J6370l731n505J2139J5819
8104H3537n532p706j6040o130k567P742j3144l3401j7735J9363K907j031J8405
8091B8668j1360n149J364J407O529n003j887N373j557N25L601o862m877Q231J7698
8076C6701R934m173j1033l781k640O396K679P10k4740p517J0496R153J3982J3548
8062D9715K6498J3119J1213J3652o21J2048K0882O776l9m989j2673j3551j2553
8049A09477j9096j1332R811K104r902J0974j1415l439J7397j112j9706j4078r652
8036E0031k901j1227J4810J3221p088j872J94J152j1232J506J177J7115K129J3372
$$ plain form
8131 -16086 -23591 -16844 4781 6484 13829 19334 23531 30315 33218 30295 19553 2248 -6184 -3541
8117 -3541 -6500 6826 29425 20555 32058 38351 34243 48445 64815 61084 55579 67718 83537
8104 83537 78005 70299 54259 48129 45562 53304 40160 6759 -10976 8387 11294 10263 28668
8091 28668 17308 12159 13523 14930 21459 16456 14569 19942 18385 18910 22511 15649 10772 19003 36701
8076 36701 46635 42462 31429 27648 25008 31404 34083 34793 10053 2536 13032 22185 36167 49715
8062 49715 76213 89332 100545 114197 113576 125624 146506 153282 153243 148254 135581 122030 109477
8049 109477 90381 79049 88860 90964 81062 92036 80621 77182 94579 93467 73761 59683 50031
8036 50031 47130 35903 50713 63934 56846 54974 55168 56320 45088 46594 47771 64886 67015 80387
8022H0387j0361j6037j4226J3351J9536J7056K0611R812r979O52Q40Q67j1554
8009A00955j1153J0859m902p911R936l163k478Q739j5100K136J5264n980o613
7996I0589j596L513q808j3497j5429J360J8838j3936j1456J4266P464j52q820
7983F2336q517j8878o702M844J7305O770J674m568M659o670K844J3322J4333R96
7969H3748k5287k370m120N429R597O907M62n959r614j1912k730K631j2013L971
7955C8740m492j0405o759J2403p61J3750J5488R127j7376j1273j5991j306m958
7942A6187J3240M990k882M862M591J0089r685P795n899J0804J4779j1886m001
7929E2984j4470j6233N802J8461M922p332k44l820Q420j737k734k1896J1883R940
$$ plain form
8022 80387 70026 53989 39763 53114 72650 89706 110317 120129 110150 110802 111642 112509 100955
8009 100955 89802 100661 95759 87848 97784 94621 92143 100882 85782 87918 103182 97202 90589
7996 90589 88993 92506 83698 70201 54772 56132 74970 61034 49578 63844 71308 71156 62336
7983 62336 53819 34941 28239 33083 50388 57158 58832 54264 58923 52253 55097 68419 82752 83748
7969 83748 58461 56091 51971 57400 66997 73904 74366 68407 58793 46881 44151 46782 34769 38740
7955 38740 34248 23843 17084 29487 28726 42476 57964 67091 49715 38442 22451 21145 16187
7942 16187 29427 34417 31535 36397 40988 51077 41392 49187 43288 54092 68871 56985 52984
7929 52984 38514 22281 28083 46544 51466 44134 43890 40070 48490 46753 44019 22123 34006 43946
7915D3946L074j0117k634J0378Q419l105J0510P506p437P235j338M2j1944j7985
7901C6550j8947j3760n069N517J4083P152J0532K705j4379j0575j967K820n132
7888I530O349J3600j3526k1882o227N286m91N572L280m289K7206K847o833K1280
7874D1702N937j4631k1175o109o37L951M87j1630P231o859j8491J4839M427r715
7860a0673M107KJ5494J2238L954P831J6033j4364m60o026l788R31j7871n569O25
7845B464p326j1339R188Q357p802O609j1659o437K4118K515n485j0375k707J0598
7831G19J6574N277J0543j1944j4048o307M799O862J5802O807n002m437K064j904
7817B5805j2183M47Q746N325j3250j0880j990P637j690J347P197j4772O445j0112
$$ plain form
7915 43946 47020 36903 34269 44647 53066 49961 60471 67977 60540 67775 66437 66479 54535 36550
7901 36550 17603 3843 -1226 4291 18374 25526 36058 38763 24384 13809 11842 14662 9530
7888 9530 15879 29479 15953 -5929 -12156 -6870 -7361 -1789 1491 -2798 24408 27255 20422 41702
7874 41702 47639 33008 11833 5724 5087 9038 9525 -2105 5126 -1733 -20224 -5385 -958 -10673
7860 -10673 -6566 -6564 8930 21168 25122 32953 48986 34622 34162 28136 24348 25279 7408 1839 2464
7845 2464 -4862 -16201 -7013 1344 -6458 151 -11508 -17945 6173 8688 3203 -7172 -9879 719
7831 719 17293 22570 33113 21169 7121 814 5613 12475 28277 35084 30082 25645 27709 25805
7817 25805 13622 14069 22815 28140 14890 4010 2020 9657 7967 9314 16511 1739 8184 -1928
7803a928r356J409J0414J840q849j1100M013L568M217j1346o437J1243r785K294
7789a9803K722P591o276K2318O204j4722j9143J2831m026j4979N503J8667Q049
7776D936K0026l87k5743l034p37m83n549j303r103m30J0857O241K945P490N232
7761A0958o468j1736l717J9921J9293p783o862n504J4671J6753k3276j3535j7337
7748a4622j9679L100J4254J0812j6900l925n164J045L952P962r79J0397J0218
7735D71k245j704k845k062J2654J720n209p518l986J0619R553m01j901k694j8324
7720a3872k2961J385P973J9653j531L198M181J5431l309L335m783j1317r688o863
7706a9168L650l289O682J0566q185R123J9890L246j6814j3774J2883L420M467
$$ plain form
7803 -1928 -11284 -9875 539 2379 -6470 -17570 -13557 -9989 -5772 -17118 -23555 -12312 -22097 -19803
7789 -19803 -17081 -9490 -15766 6552 12756 -1966 -21109 -8278 -12304 -27283 -21780 -3113 4936
7776 4936 24962 24575 -1168 -4202 -4939 -5422 -10971 -12274 -21377 -21807 -10950 -4709 -1764 5726 10958
7761 10958 4490 -7246 -10963 8958 28251 20468 13606 8102 22773 39526 16250 2715 -14622
7748 -14622 -34301 -31201 -16947 -6135 -23035 -26960 -32124 -31079 -27127 -19165 -20144 -9747 471
7735 471 -1774 -3478 -6323 -8385 4269 5989 780 -6738 -10724 -105 9448 9047 7146 4452 -13872
7720 -13872 -36833 -35448 -27475 -7822 -9353 -6155 -1974 13457 10148 13483 8700 -2617 -12305 -19168
7706 -19168 -15518 -18807 -12125 -1559 -9744 -621 19269 22515 5701 -8073 4810 8230 12697
7693A2697l727j866o299l647L140M929j8292j1315M506N505L57j2331j9380M866
7679d0857J4513jJ1474L594O043J0557m608l818N250o797l891r091n273j307M787
7664a9425m447l507O585j851M950j1620J9342J5384q432p396r0R047J0024p942
7650F22j949N182j809j9318o608J4620N653j5884N255K1429J8124J1677m724J767
7636C4037m758j9367K748R376k0677o47J1541Q64j2648p106k948N651J1861K7642
7622C5569j1534j8543n271j356k279j2290N100K1279l41j917J3652Q821r434j1308
7608A0148Q602q615L01p952Q486J759o604n980K078p779j9499o149Q628J5429
7594g147J7593Q628o391j7565j1222r773P581j1159K894J3361k227m130M679J1798
$$ plain form
7693 12697 8970 7104 805 -2842 298 5227 -13065 -24380 -19874 -14369 -14012 -26343 -45723 -40857
7679 -40857 -26344 -26345 -14871 -11277 -5234 5323 715 -3103 2147 -4650 -8541 -17632 -22905 -24212 -19425
7664 -19425 -23872 -27379 -20794 -22645 -17695 -29315 -9973 5411 -3021 -10417 -10507 -1460 8564 622
7650 622 -1327 3855 2046 -17272 -23880 -9260 -3607 -19491 -14236 7193 25317 36994 32270 34037
7636 34037 29279 9912 12660 22036 1359 712 12253 13117 469 -6637 -9585 -3934 7927 35569
7622 35569 24035 5492 221 -1135 -3414 -15704 -10604 10675 10334 8417 22069 30890 21456 10148
7608 10148 18750 10135 10436 2484 10970 12729 6125 145 2223 -5556 -25055 -31204 -22576 -7147
7594 -7147 10446 19074 12683 -4882 -16104 -25877 -18296 -29455 -26561 -13200 -15427 -19557 -14878 -3080
7580c080l35j0374j0763j689J0944m350O067J9581l421j2650P248k505j4632m087
7566b4046M177K903k2897P152R937o341j1551J0517J7856P862k609k925n707m97
7552a6169Q816M934J3287O8j9084q769M347K1038Q962j0611l173K7303k567j0281
7538A8101J6087j797j6276n916J0674J024o563J2657K95M92j8242l2681J9177
7525b968L3320L208r295j036K520n235J523j3246j1925m35J071N769k552N160
7511E879J5469m750n045n723j2272J6263R652j3963p217o530M27M538n670n264
7497a4206o80J8570N841j2062j2912r040J0885o093o936L001L155j0023K8819
7484a681J3053O133j3707j5341M792J522l423k2345n016K532J9595J9197j0321
$$ plain form
7580 -3080 -3415 -13789 -24552 -26241 -15297 -19647 -13580 6001 2580 -10070 -2822 -5327 -19959 -24046
7566 -24046 -19869 -16966 -39863 -32711 -22774 -29115 -40666 -30149 -12293 -4431 -7040 -9965 -15672 -16169
7552 -16169 -7353 -2419 10868 10936 -8148 -16917 -12570 8468 17430 6819 3646 30949 28382 18101
7538 18101 34188 32391 16115 10199 20873 21897 15334 27991 28286 28778 10536 -22145 -2968
7525 -2968 30352 33560 24265 23229 25749 20514 22037 8791 -3134 -3569 -2498 3271 719 5879
7511 5879 21348 16598 11553 5830 -6442 9821 19473 5510 -1707 -8237 -7810 -3272 -8942 -14206
7497 -14206 -14886 3684 9525 -2537 -15449 -24489 -13604 -19697 -26633 -23632 -20477 -30500 -1681
7484 -1681 11372 17505 3798 -11543 -6751 -5229 -8652 -30997 -36013 -33481 -13886 5311 -5010
7471e010r125j5746J8044L18k939J2918o835r991j3754j8333l619K5100K0639
7458h333O562j3888n905j340K1066P038n442N016J256l343j0831K474p906R203
7444d373j0205j1629N798J3822J0095J5849Q857m119k1804k779n718j1585L118
7431a4673m382J0854R299M444j207m716j9416o680Q838K2963J2659j4148j1423
7418g588j5756j7205j3582N048M961J8386K5692L424o219n0J0845l546J18L555
7404H083n990k0046l124K9877R943j6467j5659k038n384l315O898M796R985k403
7390d844m057l849J2707L055j2601j465r503k00J1850j7623M75J6389P054K996
7376C84M416j031m348J7681J781j5296j8702P155M566o960k939m541r475L578
$$ plain form
7471 -5010 -14135 -29881 -11837 -11519 -14458 -1540 -8375 -18366 -32120 -50453 -54072 -28972 -8333
7458 -8333 -1771 -15659 -21564 -22904 -1838 5200 -242 4774 6030 2687 -8144 -5670 -13576 -4373
7444 -4373 -14578 -26207 -20409 -6587 3508 19357 28214 24095 2291 -488 -6206 -17791 -14673
7431 -14673 -19055 -8201 1098 5542 4335 -381 -19797 -26477 -17639 5324 17983 3835 -7588
7418 -7588 -23344 -40549 -54131 -49083 -44122 -25736 -44 3380 -2839 -2889 7956 4410 4528 8083
7404 8083 2093 -17953 -21077 8800 18743 2276 -13383 -15421 -20805 -24120 -17222 -12426 -2441 -4844
7390 -4844 -8901 -12750 -43 3012 -9589 -11054 -20557 -20757 -8907 -26530 -26055 -9666 -2612 384
7376 384 4800 3769 -579 17102 18883 3587 -15115 -7960 -3394 -10354 -13293 -17834 -27309 -23731
7362b3731P788O042p21m711j209K2633k1068j2765J4170L922J017p669n646m981
7348b6929p704K6905P342l779p677K2014J263J0788L326Q42j5204m0812j1541
7335d1166N678Q096K251k640J4776R888k4666N009J1485J7763L612M927k2818
7322g805k0543J549N414m52j5872n413J1136K069L52J9862J0612O039L736j4083
7308c399M326J0942P061l882L907j3937j5061j3763n572k236J3884J6554K086
7295I10j5137n457K242J0687K531m024j5838q254J233Q898J9255J1404j6626p865
7281a6041N406n960k0449J5069J6995P745j4688p732J6160n748p761m580J272
7268b0312K70J023j1615J3712N355O830m708K184J6822K0632j5481K11J031p762
$$ plain form
7362 -23731 -15943 -9901 -10622 -15333 -16542 6091 -14977 -27742 -13572 -9650 -8633 -16302 -21948 -26929
7348 -26929 -34633 -7728 -386 -4165 -11842 10172 11435 22223 25549 26391 11187 -29625 -41166
7335 -41166 -35488 -27392 -25141 -27781 -13005 -3117 -27783 -22774 -11289 6474 10086 15013 -7805
7322 -7805 -28348 -26799 -21385 -21837 -37709 -43122 -31986 -29917 -29565 -9703 909 6948 10684 -3399
7308 -3399 927 11869 18930 15048 18955 5018 -10043 -23806 -29378 -31614 -17730 -1176 910
7295 910 -14227 -19684 -17442 -6755 -4224 -8248 -24086 -32340 -31107 -22209 -2954 8450 -8176 -16041
7281 -16041 -10635 -16595 -37044 -21975 -4980 2765 -11923 -19655 -3495 -9243 -17004 -21584 -20312
7268 -20312 -20042 -19019 -30634 -16922 -11567 -4737 -9445 -7261 9561 30193 14712 14923 15954 8192
7254H192k1852n099O240O896N997K975M219L660m230O442j1200m348J26n424j5132
7239b2538M04J8476p238n760J5196K986J127m916j9930J1013J3171r004M930M328
7225B245K862k087k810Q756O654o590l2081k1097K3557K3776o420j2647j1938
7212b7820K581J5197P716O320j1409J0701Q561O793j8242j3156r996M353J4119
7199d282j1789o496K3422J4421k2962j5344K7121J2927r091k3246n813j2544j3118
7186d6794P911J4204L152J6675p251r059J8496P763j177K003n232o267j1447n99
7172a7622L465J4447r295m288K2102P16N731k742K718K438M609l687r887j131
7158G574j3743j4062R392J4849k4627J3898J6918n642j3206J0761j3297j9023
$$ plain form
7254 8192 -13660 -18759 -12519 -5623 374 3349 7568 11228 6998 13440 2240 -2108 -1982 -7406 -22538
7239 -22538 -22134 -3658 -10896 -16656 -1460 1526 2653 -2263 -22193 -11180 1991 -7013 -2083 2245
7225 2245 5107 3020 210 8966 15620 9030 -23051 -44148 -20591 3185 -3235 -15882 -27820
7212 -27820 -25239 -10042 -2326 3994 -7415 3286 11847 18640 398 -12758 -22754 -18401 -4282
7199 -4282 -16071 -22567 855 15276 -7686 -23030 4091 17018 7927 -15319 -21132 -33676 -46794
7186 -46794 -38883 -24679 -21527 -4852 -12103 -21162 -2666 5097 3920 5923 691 -5576 -17023 -17622
7172 -17622 -14157 290 -9005 -13293 8809 9525 15256 12514 15232 17670 22279 18592 8705 7574
7158 7574 -6169 -20231 -10839 4010 -20617 -6719 10199 4557 -8649 2112 -11185 -30208
7146c0208q400J2888P517J3683J0913l051o518J2066j7247k4159M113R443m023
7133b2983M409k579J5661K0008j4011r173M309Q402j3309r316m556J790m097j2900
7119c8345m067N217j140N789m864J5091J8071l108K608j0100J1748J7043R043
7106B2986j7344j3163Q653K4894l714j4459j8746p520J5958K6002j3600k3817
7094a3870J0075K7237r53J3347K2093n477j2973r736N608J012j4446j3425P027
7081A5519m981k2416L114M397J6563J2079j3037k3894L736Q099K1312L999k6364
7068a874j2488P643J7671J43o878m699j4698J415m299j409K858N186j2963j1196
7054c5588p575l673M289J4835J1444J3161J0641n354M250q829r958p13M238J2877
$$ plain form
7146 -30208 -38608 -25720 -18203 -4520 6393 3342 -3176 8890 -8357 -32516 -28403 -18960 -22983
7133 -22983 -18574 -21153 -5492 14516 505 -8668 -4359 4043 -9266 -18582 -23138 -21348 -25445 -38345
7119 -38345 -42412 -37195 -38335 -32546 -37410 -22319 -4248 -7356 -4748 -14848 -3100 13943 22986
7106 22986 5642 -7521 1132 26026 22312 7853 -10893 -18413 -2455 23547 9947 -13870
7094 -13870 -3795 23442 22489 35836 57929 52452 39479 29743 35351 36363 21917 8492 15519
7081 15519 10538 -11878 -8764 -4367 12196 24275 11238 -12656 -8920 -821 20491 24490 -1874
7068 -1874 -14362 -6719 10952 11095 4217 -482 -15180 -13765 -18064 -19473 -16615 -11429 -24392 -35588
7054 -35588 -43163 -46836 -42547 -27712 -16268 -3107 7534 2180 6430 -2399 -12357 -13070 -8832 4045
7040D045j8888R032K22j146J520p570N539R573N922n076j1559J2101P089j5063
7026d259j2691J0923j262m465O11J1208q304j8298r530K62R012J8417K4181j138
7012A4667m179j5843k087Q77p758M360j1648J0917P924J6127k2962k5614o651
6999d1870N178J3461M821Q77L773M377j0124N543k2718J5769P167p650M42j5241
6985c6195Q497J5823J5349K547k857J4932j8076n286J4621K1003k219k2418M483
6972A0204j575j6611J059m199P674j339k4955r636L1421L0776Q541L859l113k702
6958B9404j0915l168j3599l939j4727k0517k914K0373J3878N527q350J1K0181
6945A1245k834q90j5230R874P46j655j1777L468j24q413o796J4911Q971k0771
$$ plain form
7040 4045 -14843 -5811 -5589 -6735 -5215 -12785 -7246 2327 8249 3173 -8386 3715 10804 -4259
7026 -4259 -16950 -6027 -7289 -11754 -11143 65 -8239 -26537 -36067 -35805 -26793 -8376 15805 14667
7012 14667 10488 -5355 -7442 -6565 -14323 -9963 -21611 -10694 -2770 13357 -9605 -35219 -41870
6999 -41870 -36692 -23231 -18410 -17533 -13760 -9383 -19507 -13964 -36682 -20913 -13746 -21396 -20954 -36195
6985 -36195 -27698 -11875 3474 6021 3164 18096 20 -5266 9355 30358 28139 5721 10204
6972 10204 8629 -7982 -6923 -11122 -3448 -4787 -29742 -39378 -7957 22819 31360 35219 32106 29404
6958 29404 18489 15321 1722 -2217 -16944 -37461 -40375 -20002 -6124 -597 -8947 -8936 11245
6945 11245 8411 7521 -7709 2165 2911 1256 -10521 -7053 -7177 -15590 -22386 -7475 1496 -19275
6931a9275L539M691P728J1158J67j8604j9063O740J4245K0392q341r547j7282
6918b3452j2096J0102L697n310J9725M567J1608N595R52j1143L191O725j2049
6905B112j1206J3054R884n31k2433j7597K037R422J5501K3850l662l653j3802
6892B976j1295J0299M712j4791K18n529m882l751j605J288O790K409M427j8201
6878b6935L248J1501J6012J1230n03l650q870J2757R863p019k2574j4780n891
6865b5611L074O339J1490K916j5862Q375J7610J600n730N724j8503J127K7124
6852A9673k519k2689j2397K511n310m285N317J3191J9785J1840j3658R56J2320
6839B4735N55j0846m457P400N125j4729j4443R555K952J4395J2121o261k1794
$$ plain form
6931 -19275 -15736 -11045 -3317 7841 8008 -10596 -29659 -22919 -8674 11718 3377 -6170 -23452
6918 -23452 -35548 -25446 -21749 -27059 -7334 -2767 8841 14436 15388 4245 7436 14161 2112
6905 2112 -9094 3960 13844 13313 -9120 -26717 -24680 -15258 243 24093 20431 16778 2976
6892 2976 -8319 1980 6692 -8099 -7881 -13410 -18292 -22043 -23648 -22360 -15570 -13161 -8734 -26935
6878 -26935 -23687 -12186 3826 15056 14553 10903 2033 14790 24653 17634 -4940 -19720 -25611
6865 -25611 -22537 -16198 -4708 -1792 -17654 -9279 8331 9931 4201 9925 -8578 -7451 19673
6852 19673 17154 -5535 -17932 -15421 -20731 -25016 -19699 -6508 13277 25117 11459 12415 24735
6839 24735 25290 14444 9987 17387 22512 7783 -6660 2895 5847 20242 32363 26102 4308
6826D308j4661J3R904P666n2k3400r922j237P707O038O687O81n207J6697J5904
6811B1126J920J2281J1949n819j9650j21J1768M496l758j48q451j9445l0148K3840
6797a60J334j2939K4526K3665J1668j8919j283J5206O599m471R083K54k0051q076
6783B6436q102j3807J4030K7699J6325p378R289j2137q051l163k4153J380J860
6770B0228J3305J6076N53j5599o905m037J8237K8272P790l45k2762m466q326J3847
6756E5868L3661n013L86J535j218J9932J6237J3848M32K1737L1893K9867L0967
6743B50132N2522R5576J10260P1426k3600m7248o2229n1934k5922k0304O381K8048
6731C83108K7494K6263N2019Q0615J19632J41665K24256L19324M44843O64058
$$ plain form
6826 4308 -10353 -10340 -436 7230 7178 -16222 -26144 -27381 -19674 -13636 -6949 -6268 -11475 5222 21126
6811 21126 23046 35327 47276 41457 21807 21686 33454 37950 34192 34044 25593 6148 -24000 -160
6797 -160 1174 -11765 12761 36426 48094 29175 27892 43098 49697 45226 54309 54563 34512 26436
6783 26436 18334 4527 18557 46256 62581 55203 64492 52355 44304 41141 16988 18368 20228
6770 20228 33533 49609 50162 34563 27658 23621 41858 70130 77920 77575 54813 50347 42021 55868
6756 55868 89529 84516 84902 86437 85219 105151 121388 135236 135668 157405 189298 219165 250132
6743 250132 302654 398230 508490 579916 556316 509068 446839 394905 368983 348679 355060 383108
6731 383108 410602 436865 488884 569499 689131 830796 1055052 1374376 1819219 2483277
6721B483277R95548J480892K066474K581021K124874k45884k124531k206471j829467
6712E325733j345337r40880o37401m46144l21873k40452j77421j77088j32727
6703I06410q2093l9308l4337n4901j8975Q916j5100j052J8608L5245J2436m3305
6691F92544p0614o6095n4677m2368j0066N075j3410j4843j2720k244K407j2418
6679D00571k091J0938Q812R465L278l7643m8295j7303j3787l2199p995l271j2882
6666B57598j3209j4167k7373k2763j7301k4726q869j0272N863O093p784l303l818
6653A15969K988j3867n622j4924j3758k288j064J193q77n82K0487R574j699r700
6639H5830l6079j7213m76r73J501K985K277J1192O289L337k4005j9437n485n709
$$ plain form
6721 2483277 3478825 4959717 7026191 9607212 11732086 11486202 9361671 7155200 5325733
6712 5325733 3980396 3039516 2402115 1955971 1634098 1393646 1216225 1039137 906410
6703 906410 824317 785009 750672 695771 676796 685712 670612 669560 688168 723413 735849 692544
6691 692544 621930 555835 501158 458790 448724 453799 440389 425546 412826 410582 412989 400571
6679 400571 398480 409418 418230 427695 430973 393330 345035 327732 313945 281746 273751 270480 257598
6666 257598 244389 230222 202849 180086 162785 138059 129190 118918 124781 130874 123090 119787 115969
6653 115969 118957 105090 99468 84544 70786 68498 67434 68627 67750 67168 87655 97229 95530 85830
6639 85830 49751 32538 32062 31089 32590 35575 37852 49044 55333 58670 34665 15228 9743 4034
6625D034J2433Q886o428J2726j845J09j7877k831m342O051K2344J4089j0151j7988
6611A9210Q047M68J0524J8718k2643j0824j77p605M82P261Q172O579k1716j2812
6597C684J3417J0573J007J784L233j1349p124K2401O966q833k1600r392p636j0141
6583a3010P377J7K215J0016M992j0369M501J3607J5340K1881k485m031o549l2359
6569A1143j4961J0649L27m055J2841O44q100j4992J2766o126j7161N384P164k5424
6555b9901j1753J9003O828O153k791q734O338Q040l284N17l703P449k02o97J2821
6540F084J2982k6197k6024J6578N323o218P465Q87K9183K1823j2427j2588j0949
6527E922J9779L431n309j3670m963K217r450j379K0950O062M350r173m367j3336
$$ plain form
6625 4034 16467 25353 18925 31651 29806 29915 12038 9207 4865 10916 33260 47349 37198 19210
6611 19210 27257 27725 38249 56967 34324 23500 23323 15718 16200 23461 31633 38212 16496 3684
6597 3684 17101 27674 28681 30465 33698 22349 15225 37626 44592 35759 14159 4767 -2869 -13010
6583 -13010 -5633 -5616 -3401 6615 11607 1238 5739 19346 34686 56567 54082 50051 43502 11143
6569 11143 -3818 6831 7158 3103 15944 16588 8488 -6504 6262 136 -17025 -11641 -4477 -29901
6555 -29901 -41654 -22651 -15823 -9670 -12461 -21195 -14857 -6817 -10101 -9584 -13287 -5838 -6040 -6737 6084
6540 6084 19066 -7131 -33155 -16577 -11254 -17472 -10007 -9120 20063 41886 29459 16871 5922
6527 5922 25701 29132 23823 10153 5190 7407 -2043 -3422 17528 23590 27940 18767 14400 1064
6513A064L730l500J5311J6384k7332q813K99J2031j0976k560R893K656J4155l297
6499A9045j7533r681l028N338L699k2728j3085K0926K6729m642j5584j0370J2725
6486h189J0144L642J0221j8317j6038l049M97K1233L310n213J3106P926L459k5162
6472b430n396m176Q079J2879j0441j8320P228K357o279J3262J2902l218j3676
6459g229j1025Q419J4192j285j1500l547K924J2361J7201L833j3450r560P03j1854
6445i817J336P293q497r80J9975J6729k725l420j2492m583K277j7325j2461N00
6431b4190o133K0580r60Q9J1435J3586q621Q803J1846K50K569j0257j5961K208
6417E244m270q723P219Q530J4997N090r249j6923M373L928l292k206l000J3049
$$ plain form
6513 1064 4794 1294 16605 32989 5657 -3156 -2857 9174 -1802 -4362 5531 8187 22342 19045
6499 19045 1512 -8169 -11197 -5859 -2160 -24888 -37973 -17047 9682 5040 -10544 -20914 -8189
6486 -8189 1955 5597 15818 -2499 -18537 -21586 -21089 144 3454 -1759 11347 19273 22732 -2430
6472 -2430 -7826 -12002 -3923 8956 -1485 -19805 -12577 -10220 -16499 -3237 9665 6447 -7229
6459 -7229 -18254 -9835 4357 3072 -8428 -11975 -9051 3310 20511 24344 10894 1334 2037 -9817
6445 -9817 -8481 -1188 -9685 -10665 9310 26039 23314 19894 7402 2819 5096 -12229 -24690 -24190
6431 -24190 -30323 -9743 -10703 -10614 821 14407 5786 14589 26435 26685 29254 18997 3036 5244
6417 5244 974 -7749 -530 8000 22997 28087 18838 1915 6288 10216 6924 4718 1718 14767
6403A4767O404o654r471p053p593j0871N759J0172M320l92M285J5283q778k518
6389G660j2191R390N185R41k409p36r267r731J516J2079O616p321j0921O563L3254
6374C0628j257n070N699j3151k340J1362Q508n500k4137r84j805n575J1064L990
6360A1432j3222p006J2356J3657o828k124K346K16O842m886n84O721J366l920
6346A6366j07J174j4139N558J5427J417n038k679l228j0481p912J6794r537R039
6332A2654J5008j7352q66m643M209M201O583j8675m009j6910m177J0881J5365
6319B269m120j1159o356J4647m639j8113n731m367N09J3470J8111K980j6089m019
6305b2607L0578p615j7374K1382q23j7624R581J2817M505J8586j960l347r415
$$ plain form
6403 14767 21171 14517 5046 -2007 -9600 -20471 -14712 -4540 -220 -612 3673 18956 10178 7660
6389 7660 -4531 4859 10044 10985 8576 7840 -1427 -11158 -9642 2437 9053 1732 -9189 -2626 30628
6374 30628 29371 24301 30000 16849 14509 25871 34379 28879 4742 3758 1953 -3622 7442 11432
6360 11432 -1790 -8796 3560 17217 10389 8265 10611 10827 17669 12783 12199 18920 20286 16366
6346 16366 16259 17433 3294 8852 24279 25696 20658 17979 14751 4270 -3642 13152 3615 12654
6332 12654 27662 10310 9444 4801 9010 13211 19794 1119 -2890 -19800 -23977 -13096 2269
6319 2269 -1851 -13010 -19366 -4719 -9358 -27471 -33202 -37569 -37060 -23590 -5479 -2499 -18588 -22607
6305 -22607 7971 356 -17018 4364 3541 -14083 -4502 8315 12820 31406 29446 26099 16684
6292A6684k87m21M979n82k5585j8122j783J0572K4911R907J0677k2730k1073l044
6278a5897j6242m364J7336J1311j9698j4012o440O776J9448O458r181J6251k073
6265a0327q182q68N135J1533m095O650j2215p447q099J4126j0244j0302J4001
6252b0334J3524J0830J3232J4901O08j7750l009P120K099n131k2767k3387L304
6239b6760K422p141R421J0721R306J1417j030L335M120k527j0267R109j1669k120
6225a663J3150j0887j0005p468r8p880l539k904J0816J7701m335O154j73j181
6211b312O01k2853Q474K4230K0745J805j7132n660j3194j0144m822r301l079O289
6197b6353j834J5262j123K4958p032k1898J24J5747M81r844o924L44P869J1936
$$ plain form
6292 16684 16397 15976 20955 20373 -5212 -23334 -25117 -14545 10366 20273 30950 8220 -12853 -15897
6278 -15897 -32139 -36503 -19167 -7856 -27554 -41566 -48006 -41230 -21782 -15324 -24505 -8254 -10327
6265 -10327 -18509 -19377 -14242 -2709 -6804 -154 -12369 -19816 -27915 -13789 -24033 -34335 -20334
6252 -20334 -6810 4020 17252 32153 32761 15011 12002 19122 21221 16090 -6677 -30064 -26760
6239 -26760 -24338 -31479 -22058 -11337 -2031 9386 8356 11691 15811 13284 3017 12126 457 -1663
6225 -1663 11487 600 -9405 -16873 -16971 -24851 -28390 -31294 -20478 -2777 -7112 -958 -1131 -2312
6211 -2312 -1711 -24564 -16090 8140 28885 30690 13558 7898 -5296 -15440 -20262 -29563 -32642 -26353
6197 -26353 -28187 -12925 -14048 10910 3878 -18020 -17896 -2149 -1668 -11512 -18436 -18092 -10223 1713
6183A713j101k879K803l08m531k0099k034R320n596O700J6807k284j7909N026
6169a4372O555O428Q379Q473k6712n544L577j5610O361o028o12J6875J254m551
6155a5527q75J4307J1324j1535j642m996j424n777j42J7959J4223q056k773j0208
6141e142J0491K52J0516J9886P913k5937j4847j3570j1874P830j6101p163K9298
6128h448O149k1548j3179O520J2082J4622R554j855J0202k2763j5286o386k1344
6115e1680l840K0991l90J1236J7121r053q330J39Q675K8259K620p064j5092j2385
6101a8793Q593P271j8658j2727K977O898N773M179m227J842k970p498J897q565
6087c4008J576P664o125L037J0027j1173m478J5599J0110J3811n049q324J194
$$ plain form
6183 1713 612 -2267 536 228 -4303 -24402 -26436 -17116 -22712 -16012 795 -1489 -19398 -14372
6169 -14372 -7817 -1389 6990 15463 -11249 -16793 -13216 -28826 -22465 -28493 -29105 -12230 -10976 -15527
6155 -15527 -16402 -2095 9229 -2306 -3948 -8944 -10368 -16145 -16287 1672 15895 7839 5066 -5142
6141 -5142 5349 5601 16117 36003 43916 17979 3132 -10438 -22312 -14482 -30583 -37746 -8448
6128 -8448 -2299 -23847 -37026 -30506 -18424 -3802 5752 3897 14099 -8664 -23950 -30336 -51680
6115 -51680 -55520 -34529 -34919 -23683 -6562 -15615 -23945 -23806 -15131 13128 15748 8684 -6408 -18793
6101 -18793 -10200 -2929 -21587 -34314 -31337 -24439 -18666 -14487 -18714 -16872 -19842 -27340 -25443 -34008
6087 -34008 -32432 -24768 -30893 -27856 -17829 -29002 -33480 -17881 -7771 6040 991 -7333 -6139
6074f139P942J0338k564n161L942N98J1549j4119j5403n417J0611L869n473k776
6060h203M126L18j3811o612n895K840Q541j280N644K1124J7143r397m657j1210
6046a329j2656j2672K465M676j0267P6J0033K4146J2297m458n958j0497k789j6991
6032b3924K6R144m639K366P792J292L512j5244j7030J110j505O909K465J3663
6018a4063R557l692O614K639M598J1773L604j0637J0056k68j8167j2834K603j4187
6004b2404R785L761J323N877j3078j5012J9773J88Q845J5005J829J464j3837k0470
5990a6951n631j2726R581J5507q919M420O064M659Q26N487j2350j9188J856k406
5976b9771J2675R305J0940M24j4769j4981m324m396Q438K3866J7112q489o004
$$ plain form
6074 -6139 1803 12141 9577 4416 8358 8956 20505 6386 -9017 -14434 -3823 46 -5427 -8203
6060 -8203 -4077 -3759 -17570 -24182 -30077 -27237 -18696 -19976 -14332 6792 23935 14538 9881 -1329
6046 -1329 -13985 -26657 -24192 -19516 -29783 -29707 -19674 4472 16769 12311 6353 -4144 -6933 -23924
6032 -23924 -23898 -14754 -19393 -17027 -9235 -7943 -4431 -19675 -36705 -35595 -37100 -30191 -27726 -14063
6018 -14063 -4506 -8198 -1584 1055 5653 17426 21030 10393 20449 20181 2014 -10820 -8217 -22404
6004 -22404 -12619 -8858 -7535 -1658 -14736 -29748 -9975 -9787 -942 14063 15892 17356 3519 -16951
5990 -16951 -22582 -35308 -25727 -10220 -19139 -14719 -8655 -3996 -3170 2317 -10033 -29221 -27365 -29771
5976 -29771 -17096 -7791 3149 3573 -11196 -26177 -30501 -34897 -26459 -2593 14519 6030 26
5963B6P52J1177N205p194p389j0714L153J9471L222j5756j9554p863Q827O393
5949a0244K8755r18j2027j7535j6420j1493j0922N667K9508K0889n827J730M385
5936E548j2476r479M688k11o623J8104J7692j4980q206J8438o963j5987r015n357
5922b4827k0003R793K6978K7747M809k1513j542j7998j7632J0654Q081R96P159
5909g298Q740J1214l931n579k2078j067J5935q64r047j707J3135K035j6200j2711
5895b9423j0587J9246M526P94J5573L551O075p084m800q332n553O983R504L647
5881D120R556R936n596q710L563R836Q434l000o700j4978r419J8479j2257J0666
5867A3930J7712r36l0501j6886J0029n787r105r140R147Q405M180R955P191j916
$$ plain form
5963 26 778 11955 17160 9966 2577 -8137 -4984 14487 17709 1953 -17601 -25464 -16637 -10244
5949 -10244 18511 17593 5566 -11969 -28389 -39882 -50804 -45137 -15629 5260 -567 1163 5548
5936 5548 -6928 -16407 -11719 -11930 -18553 -449 17243 2263 -5943 12495 5532 -10455 -19470 -24827
5922 -24827 -44830 -35037 -8059 19688 24497 2984 1442 -16556 -34188 -23534 -15453 -14457 -7298
5909 -7298 1442 12656 8725 3146 -18932 -19999 -4064 -4928 -13975 -15682 -2547 -512 -16712 -29423
5895 -29423 -40010 -20764 -16238 -15444 129 3680 9755 2671 -2129 -10461 -16014 -9031 473 4120
5881 4120 13676 23612 18016 9306 12869 22705 31139 28139 21439 6461 -2958 15521 3264 13930
5867 13930 31642 30706 205 -16681 -6652 -12439 -21544 -30684 -21537 -13132 -8952 1003 8194 6278
5853F278Q212j8582O668P62p80j8542p413J720J4065m128k1617J4589J1169R516
5839A917P855r910k627M046q257j0407J4500O391J630K928O302o219J0379r773
5825H755k3695K2890J0261j2549r299q317n464j2209o643O805N482p563P111O229
5811a8206m850j050J4450Q269L406J279O955N239k592M1j5534r40R966J0831j4061
5796C203J499J2764Q827j3419l698N208k3889j3724k204r335j1704J0034K1790
5783a4648J2594J9895l635j7591k7235K4605J9627Q614m463k0456q889J6451Q425
5770A3294j9219j6862J4396K1355J422j6271J3768q499k9469m052m707J0799p89
5757b4834K1840Q925J699o382J78m597P160o328j3476O270N213N705k258j2533
$$ plain form
5853 6278 14490 -4092 2576 3338 2558 -15984 -23397 -21677 -7612 -11740 -33357 -18768 -7599 1917
5839 1917 9772 -138 -2765 1281 -6976 -17383 -2883 3508 5138 8066 14368 8149 18528 8755
5825 8755 -14940 7950 18211 5662 -3637 -11954 -17418 -29627 -36270 -29465 -23983 -31546 -24435 -18206
5811 -18206 -23056 -24106 -9656 -1387 2019 3298 10253 15492 12900 12941 -2593 -3533 6433 17264 3203
5796 3203 4702 17466 26293 12874 9176 14384 -9505 -23229 -25433 -34768 -46472 -36438 -14648
5783 -14648 -2054 17841 14206 -3385 -30620 -6015 13612 22226 17763 -2693 -11582 4869 13294
5770 13294 -5925 -22787 -8391 12964 14386 -1885 11883 3384 -26085 -30137 -34844 -24045 -24834
5757 -24834 -2994 5931 7630 1248 1426 -3171 3989 -2339 -15815 -9545 -4332 1373 -885 -13418
5743a3418j8464O333K2951K021k9204r008R082R534P624j2928j0949K6789O633
5730c004Q87J143o503k222j0909j0244K0761L76J7426O803p555j5846o614J4835
5716f66j7890M419K8156n434n098J9050l438J2440m612j8055j5221j663P457M319
5702C764L484J856j6846r501J2908k436k619P558P835k0140L089P958j6088j0336
5688b9514J7276l498Q778K0326j498K408Q037n488o435j2739m416m966j2536M159
5674b0106Q656j4653L048O359k4138L724N151J2451K5052j52j7878J4168M667
5661F349P48j2530J798k298J0620J503k2508k7670M468P904J572M306n114J9284
5647a1568J1300l578J252l319k734j1949n19J1186R578L057K756p479n989j1221
$$ plain form
5743 -13418 -31882 -25549 -2598 -577 -29781 -38789 -29707 -20173 -12549 -25477 -36426 -9637 -3004
5730 -3004 -2117 -974 -7477 -9699 -20608 -30852 -10091 -9715 7711 14514 6959 -8887 -15501 -666
5716 -666 -18556 -14137 14019 8585 3487 22537 19099 31539 26927 8872 -6349 -8012 -555 3764
5702 3764 7248 9104 -7742 -17243 -4335 -6771 -9390 -1832 6003 -14137 -11048 -3090 -19178 -29514
5688 -29514 -12238 -15736 -6958 13368 11870 14278 22315 16827 10392 -2347 -6763 -11729 -24265 -20106
5674 -20106 -11450 -26103 -23055 -16696 -40834 -37110 -31959 -19508 5544 5392 -12486 1682 6349
5661 6349 7097 -5433 -3635 -5933 4687 6190 -16318 -43988 -39520 -31616 -30044 -25738 -30852 -11568
5647 -11568 -268 -3846 -2594 -5913 -8647 -20596 -21115 -9929 -351 2706 5462 -2017 -8006 -19227
5633a9227P259q410p018L405K0746J55j4111m017p102o391J0657J6816K3836l535
5619A3063j1782q61r883j3751k601K4975J8187o280j4590k980L769R672J324l611
5605D651K403o576q082k5510q241n273l652K2841L300n200J9379j467j390R239
5591c578k698K548R803j4308k382N917N128N357J9088j0056r413L901j1868j671
5577d232k422P895J3954J801P677j3312o212l073q915M059K0216J5607l1398k9442
5563b7797K9126O486k9685J836J9709J1161k112R21N969L800J4836p689j1428
5550A5133J3420Q06j4001J479r898M03j4555q456J4451N903K377q234J156p350
5536g366j3187o910J0010k488J1130k6968j8759Q985J5968K8320K2685j5036k5000
$$ plain form
5633 -19227 -11968 -20378 -27396 -23991 -3245 -3090 -17201 -21218 -28320 -34711 -24054 -7238 16598 13063
5619 13063 1281 420 -9463 -23214 -25815 -840 17347 11067 -3523 -6503 -2734 6938 8262 4651
5605 4651 7054 478 -7604 -33114 -41355 -46628 -50280 -27439 -24139 -29339 -9960 -11427 -12817 -3578
5591 -3578 -6276 -3728 6075 -8233 -10615 -4698 430 5787 24875 14819 5406 9307 -2561 -4232
5577 -4232 -6654 1241 15195 16996 24673 11361 5149 2076 -6839 -2780 17436 33043 1645 -27797
5563 -27797 1329 7815 -21870 -20034 -325 10836 8724 9645 15614 19414 34250 26561 15133
5550 15133 28553 29359 15358 16837 6939 7342 -7213 -15669 -1218 4685 7062 -1172 -16 -7366
5536 -7366 -20553 -27463 -17453 -19941 -8811 -35779 -54538 -45553 -29585 -1265 21420 6384 -18616
5523a8616o375m77m638M849J9784K3753k45k4111j2005j491O766K2844k0897k4336
5509c5195P7J0314O701P894R964L895K507J1984R884j0987j1254n24L591p2j6861
5494h082p280J1058q789J0648R701j8544r807p293n463J0879Q243L729J99J735
5480i066J4517J6120l016j3539q699r017j525l92j6474j1979J1471J3033M287
5467a4279M676J756O340k828j161J2594l290j2922J1350m87j0959R61R365o87
5453D29l061p181k389J5495R356j2250l644j9015j3439J5238L0090M644l1974
5440a7701p261J13p272J4842K4473L012O16J1308N068j5967k682L707j1371j7027
5426a6142q937K1382K8506j3353k1604q479K1561j0260o737L751O070N688P623
$$ plain form
5523 -18616 -24991 -25468 -30106 -25257 -5473 18280 18035 -6076 -18081 -19572 -12806 10038 -10859 -35195
5509 -35195 -35118 -24804 -18103 -10209 -245 3650 6157 18141 28025 17038 5784 5260 8851 8779 -8082
5494 -8082 -15362 -4304 -13093 -2445 7256 -11288 -21095 -28388 -33851 -22972 -14729 -11000 -10801 -9066
5480 -9066 5451 21571 18555 5016 -3683 -12700 -14225 -14617 -31091 -43070 -31599 -18566 -14279
5467 -14279 -9603 -7847 -1507 -4335 -5496 7098 3808 -9114 2236 1749 -9210 -8249 1116 429
5453 429 -2632 -9813 -12202 3293 12649 399 -3245 -22260 -35699 -20461 9629 14273 -17701
5440 -17701 -24962 -24849 -32121 -17279 7194 10206 10822 22130 27198 11231 8549 12256 885 -16142
5426 -16142 -25079 -3697 24809 11456 -10148 -18627 2934 -7326 -14063 -10312 -4242 1446 9069
5413I069Q021O033j5562j2518J5734J6322K198j2094j2044r838M288J1260n872
5400D997p875J221J5556k639J0569j4016q931p235M505J6561J3953o048j7248
5387C370M578J4377j1277o751j935j7192j863l069M281j2584M428L1351p555l952
5373c793J9807k238q990J0302J1566O06J364j755L985l798L945j1179k5597L484
5359b291J7580M272l717Q801L655n049l256j1400j2172j1291l039Q41O84N095
5345a1287p319N209M117J0140o635j0949k707J7852J9487l861j0901q881J9976
5332A4241K2260J0031j947k5065j2165p212p708J2560j424N818j46j2550k6660
5319b9967M752J0334J140N879j1452j4063N926J2224p779J0810J0380Q434p141
$$ plain form
5413 9069 17090 23123 7561 -4957 10777 27099 29297 17203 5159 -4679 -391 10869 4997
5400 4997 -2878 -1657 13899 11260 21829 7813 -1118 -8353 -3848 12713 26666 20618 3370
5387 3370 7948 22325 11048 4297 2362 -14830 -16693 -19762 -15481 -28065 -23637 7714 159 -3793
5373 -3793 16014 13776 4786 15088 26654 27260 28624 26869 30854 27056 31001 19822 -5775 -2291
5359 -2291 15289 19561 15844 24645 28300 23251 19995 8595 -3577 -14868 -17907 -17066 -16382 -11287
5345 -11287 -18606 -13397 -9280 860 -5775 -16724 -19431 -1579 17908 14047 3146 -5735 14241
5332 14241 36501 46532 44585 19520 7355 143 -7565 4995 3571 9389 9243 -3307 -29967
5319 -29967 -25215 -14881 -13741 -7862 -19314 -33377 -27451 -15227 -23006 -12196 -1816 6618 -523
5306e23l798j1007J9681O048j8863J3465R905J2394j448o560o808p610p345j4881
5292a7350k394m86k2181r661j707M324Q657P732P937J5951M695j5457q512J1774
5278a6678m557k4384q09J5492J2026J3341l670j5644O082L4126J6336n530l059
5265B3072j2065m330m892m657J742o610K91j543j1050M658J8513r136J403j312
5251e916P601J0522k0914k3977M82J9966K1959P695L506m620j8567q375l522M687
5237i473q59k1554p694o482N75j0269J2331L1034l064J651q623M330J6844J4144
5223A2891L06k0995r986j1077N730K7309J162Q815J13k2614p541n688k2681j7091
5209f1347K8732K4514K0296l755K391O434j9968j1437Q696M319L032P400j5818
$$ plain form
5306 -523 -4321 -15328 4353 10401 -8462 5003 14908 27302 25854 19294 12486 4876 -2469 -17350
5292 -17350 -19744 -20230 -42411 -52072 -53779 -49455 -40798 -33066 -25129 -9178 -4483 -19940 -28452 -16678
5278 -16678 -21235 -45619 -46428 -30936 -18910 -5569 -9239 -24883 -18801 15325 31661 26131 23072
5265 23072 11007 6677 1785 -2872 -1130 -7740 -7449 -8992 -20042 -15384 3129 -6007 -4604 -5916
5251 -5916 1685 12207 -8707 -32684 -32202 -12236 9723 17418 20924 16304 -2263 -10638 -14160 -9473
5237 -9473 -10332 -31886 -39580 -46062 -45487 -55756 -43425 -12391 -15455 -13804 -22427 -18097 -1253 12891
5223 12891 13197 -7798 -17784 -28861 -23131 4178 5340 14155 14268 -8346 -15887 -21575 -44256 -61347
5209 -61347 -32615 -8101 12195 8440 10831 17265 -2703 -14140 -5444 -1125 1907 9307 -6511
5196f511q388J419O353L157Q270q202j0610N770J4591J0093j1605p719k325O086
5182C79K329j7202n2J640R061J4741L683J749M006L017k2647j1271l614l336n476
5167b2993J1914q834J027J0524J2294K0498R941o382l2723j2421J4739J3223K441
5154A3248O439j0330j0328j4539k4337n149J0134K7285J7146m54j3258o337M910
5141e570K742j3387R130R886Q341M920l257O308k9428p68K1050o54j290J8960
5127B6983K467K880M02j9638k7615r895J8445J736q717J6878J3705J6437o948
5114B7120k5128p043J9270N576o916r029j532J206r91Q981k8828r75k449j479
5100b2217J2031J6915n743J625N908K665J829q752m074J2498k592j2585J1956
$$ plain form
5196 -6511 -14899 -13480 -7127 -3970 4300 -3902 -14512 -8742 5849 15942 4337 -3382 -5707 379
5182 379 2708 -14494 -14546 -12906 -3845 10896 14579 16328 20334 23351 704 -10567 -14181 -17517 -22993
5167 -22993 -11079 -19913 -18886 -8362 3932 24430 34371 27989 -4734 -17155 -2416 10807 13248
5154 13248 19687 9357 -971 -15510 -39847 -44996 -34862 -7577 9569 9115 -4143 -10480 -5570
5141 -5570 -2828 -16215 -7085 2801 11142 16062 12805 19113 -10315 -11083 9967 9313 8023 26983
5127 26983 29450 32330 32732 13094 -14521 -24416 -5971 -4235 -12952 3926 17631 34068 27120
5114 27120 1992 -5051 14219 19795 12879 3850 2318 3524 2533 11514 -17314 -18289 -20738 -22217
5100 -22217 -10186 6729 986 2611 8519 11184 13013 4261 187 12685 10093 -2492 9464
5087I464l298J639M910J4656l321o623o977L319M864k656j012m82l159n122j0890
5072d688o784J4654O2j1421R265j026J727O712L367p587n810j0297j5425N558
5058b1693K3026p928P377P040m54n119M031k801j0860j2761J5075J389M025j0279
5044i932j4422j49N439p320J2465J9862Q606q810l368p877j705N929O263N276
5030A0257L039j7350m857p02n139n589j7428L877R921J3409r636k7K2513O797
5016I085P071R487J2569l145j6698j359j195P183j978k0708j9102l620K579J4425
5002e406o585j5162Q837N049Q925o608j1753p060J5962O954M963M780J311k09
4988C998K98P565j7281j7742L317k880M672R53p730p943J9089R542p334j1833
$$ plain form
5087 9464 6166 7805 12715 27371 24050 17427 10450 13769 18633 15977 14965 14483 11324 6202 -4688
5072 -4688 -11472 3182 3244 -8177 1088 62 1789 8501 11868 4281 -1529 -11826 -27251 -21693
5058 -21693 1333 -6595 782 7822 7368 2249 6280 3479 -7381 -20142 -5067 -3678 347 -9932
5044 -9932 -24354 -24503 -19064 -26384 -13919 5943 14549 5739 2371 -5506 -7211 -1282 4981 10257
5030 10257 13296 -4054 -8911 -9613 -14752 -20341 -37769 -33892 -23971 -10562 -20198 -20225 2288 9085
5016 9085 16156 25643 38212 35067 18369 17010 15815 22998 21020 312 -18790 -22410 -19831 -5406
5002 -5406 -11991 -27153 -18316 -13267 -4342 -10950 -22703 -29763 -13801 -6847 -1884 2896 4207 3998
4988 3998 4296 11861 -5420 -23162 -19845 -22725 -18053 -17100 -24830 -32773 -13684 -4142 -11476 -23309
4974b3309K348N080K966r847r61J3956K541J2753J0519l016j5139j1266m839P757
4960a0457j548l980Q995K877L035Q431k941k3018P811R694n538J891L632l429
4946d545O101o217k7745k198L0687J9113o900j5136k305J3259n091n523L157k186
4932e529J266P841N434j2242o84K1907L388m613q475L860J3666o624j8222j1821
4918a0848m81J6021k2579K284n777j7901J6749M921k715J3864J4256K653p181
4905C266o581j3835J1176J711R715m890j7564j714J0910K8495P471j4773j2123
4892A264p34K3p513m05O107J83n079m247r781q206j240M026O74K618J3352l897
4876a2855L680n903m147j6062J0596J7172Q025J572k3184j3424P006N322J6760
$$ plain form
4974 -23309 -20961 -15881 -12915 -22762 -23723 -9767 -7226 5527 16046 13030 -2109 -13375 -18214 -10457
4960 -10457 -12005 -15985 -6990 -4113 -1078 7353 4412 -18606 -10795 -1101 -6639 -4748 -1116 -4545
4946 -4545 1556 -4661 -32406 -34604 -3917 15196 8296 -6840 -9145 4114 -977 -6500 -3343 -5529
4932 -5529 -4263 3578 9012 -3230 -3914 17993 21381 16768 8293 12153 25819 19195 973 -10848
4918 -10848 -11329 4692 -17887 -15603 -21380 -39281 -22532 -17611 -20326 -6462 7794 10447 3266
4905 3266 -3315 -17150 -5974 -4263 5452 562 -17002 -18716 -7806 20689 28160 13387 1264
4892 1264 530 553 -6960 -7365 -1258 -1075 -6154 -10401 -20182 -28388 -29628 -25602 -24928 -22310 -8958 -12855
4876 -12855 -9175 -15078 -19225 -35287 -24691 -7519 506 2078 -21106 -34530 -27524 -22202 -5442
4863e442J7889K94r190r640o185o04L8P301j2348j8683Q50n003R183J4735K3247
4848F442j0417r361J808L570J095j3043J0243n510J683o458R823q151j0084J1917
4834a6443J6276m253n689R078L183n746j5768J2863k0709k1415J2353j361Q464
4821b9167M300K0262O076L12p76j4655m169P225j8497k999p22m949K1099m06j4264
4806c1330j6262N950J8878P182L08Q655M792L306j7241M731J5178j127j4079j0368
4792b1427l380L0820M269k3562k9823j1821j4249J6029J8333L0012O018O023q067
4779h25j7912m856O749q409j141R359P255l1052P694j535l908J1396m361l111
4765c4657P759J2344m002j0284j0590J5636J408J0967O835J380j7294p996N546
$$ plain form
4863 -5442 12447 12741 3551 -6089 -12274 -12878 -12840 -5539 -17887 -36570 -35720 -40723 -31540 -16805 6442
4848 6442 -3975 -13336 -11528 -7958 -6863 -19906 -9663 -15173 -13490 -19948 -10125 -18276 -28360 -16443
4834 -16443 -167 -4420 -10109 -1031 2152 -3594 -19362 -6499 -27208 -48623 -36270 -37631 -29167
4821 -29167 -24867 -4605 1471 1783 1007 -13648 -17817 -10592 -29089 -32088 -32810 -37759 -16660 -17066 -31330
4806 -31330 -47592 -41642 -22764 -15582 -15274 -6619 -1827 1479 -15762 -11031 4147 3020 -11059 -21427
4792 -21427 -24807 6013 10282 -13280 -43103 -54924 -69173 -53144 -34811 -4799 1219 7242 -825
4779 -825 -18737 -23593 -16844 -25253 -26394 -17035 -9780 -40832 -33138 -34673 -38581 -27185 -31546 -34657
4765 -34657 -26898 -14554 -18556 -28840 -39430 -23794 -22386 -11419 -4584 -3204 -20498 -28494 -22948
4752b2948J3619K601j2204j1371R63J112n811J5102L7595j1962j3452K282J0167
4739E693Q314j6599m0490N822M3691K2924p670k1995o521j42J3163M043j4715
4726d482k2660J004n9N249J5783P473k6j1307j1018O273j3Q594J2208q017m955
4711e953o957q549m200J0152M593j489j2578K2810J9146j1764p458k102J1311
4698F962K0251q324n500l294J33j9566J1276O757P308p73N445o627l911j2988
4684b851j2835P117R496J6526O818m981m106M217p778k3585j0796K2290J9844
4671A9376N918N778j1350j9927j6520j9766l702p313J5571J2010j505J978M721
4658a4731M715N359j8347J4732J0770p837k968L097O460K029p249k0990J320J1370
$$ plain form
4752 -22948 -9329 -6728 -18932 -30303 -29340 -28228 -34039 -18937 18658 6696 -6756 -4474 5693
4739 5693 14007 -2592 -43082 -37260 6431 29355 21685 -310 -6831 -6973 6190 10233 -4482
4726 -4482 -27142 -26138 -26197 -20948 -5165 2308 2282 -9025 -20043 -13770 -13783 -5189 7019 -998 -5953
4711 -5953 -12910 -21459 -25659 -15507 -10914 -12403 -24981 -2171 16975 5211 -2247 -4349 6962
4698 6962 27213 18889 13389 10095 10228 -9338 1938 8695 16003 15230 20675 14048 10137 -2851
4684 -2851 -15686 -8569 927 17453 24271 19290 15184 19401 11623 -11962 -22758 -468 19376
4671 19376 25294 31072 19722 -205 -16725 -36491 -40193 -47506 -31935 -19925 -21430 -19452 -14731
4658 -14731 -10016 -4657 -23004 -8272 2498 -5339 -8307 -5210 1250 3279 -3970 -24960 -23640 -12270
4644a2270J3033M903r221K838q865k038J2417m885j987J4734J3422j1277j6424
4631e620M68N318n021m922k890R769n021p252R825J4926J2283K433j7812j5893
4617i409n574J3739J755J4349J0840R228n760k1245o975R189n394j6196K2824
4604A1371J4685j6316j4474N210K632k705l385k088N06K2889L962j3695K35j7044
4590h217j9825J2714O270l838k2044k049P131O316O073O339l619K1128J0708j3194
4576C893j2432p671P859n725Kj855o450J603j97j972O883L570N401j2830J1241
4561h680P309Q419j5125j2098q296o673N917J1966J1002J158p634k5981J9353
4548a9363M616p849L066n295K464K1655Q171J4031j6671k9804J527o798K643K8905
$$ plain form
4644 -12270 763 5666 -3555 -717 -9582 -11620 797 -4088 -6075 8659 22081 10804 -5620
4631 -5620 -5152 166 -4855 -9777 -12667 -2898 -7919 -15171 -5346 9580 21863 24296 6484 -9409
4617 -9409 -14983 -1244 511 14860 25700 34928 29168 7923 948 10137 4743 -11453 11371
4604 11371 26056 9740 -4734 476 3108 403 -2982 -5070 -4564 18325 22287 8592 8827 -8217
4590 -8217 -28042 -15328 -9058 -12896 -34940 -36989 -29858 -23542 -17469 -11130 -14749 6379 17087 3893
4576 3893 -8539 -16210 -8351 -14076 -14074 -15929 -22379 -20776 -20973 -22945 -16062 -12492 -7091 -19921 -8680
4561 -8680 -1371 7048 -8077 -20175 -28471 -35144 -29227 -17261 -6259 -5101 -12735 -38716 -19363
4548 -19363 -14747 -22596 -19530 -24825 -22361 -706 7465 21496 4825 -24979 -23452 -30250 -27607 1298
4534A298J9712j7083o391o231l999J1186q977k2582p213Q393n096N553Q171j9803
4520d3062K84J4339Q438K3380O893j1491j3194P944J307j16r045n219r143o73
4506b9358N857n506K4986N541p968J1906R572k938j8285m799J0540k455J3893
4493A0986n418j0340Q981K723j74p824j8749p691J1919m824k808N610j275p855
4479b6739M039K0173p410K531N085q924M432j73q398M001J0601k332Q869m171
4465A584k5663R681J5738L974j2906r148J742O842j3449J3667J2404L845j9560
4452a1249o716O275j350R317P658k893J9182Q364r606K338j3139j0401j2875J308
4438a3787m071Q565J1786K74j5317j0939K3578J5269q568j321J1193p715r219
$$ plain form
4534 1298 21010 3927 -2464 -8695 -12694 -1508 -10485 -33067 -40280 -31887 -36983 -31430 -23259 -43062
4520 -43062 -42778 -28439 -20001 3379 10272 -1219 -14413 -6469 -5162 -5278 -14323 -19542 -28685 -29358
4506 -29358 -23501 -29007 -4021 1520 -6448 5458 15030 12092 -6193 -10992 -452 -2907 10986
4493 10986 5568 -4772 4209 6932 6758 -1066 -19815 -27506 -15587 -20411 -23219 -17609 -18884 -26739
4479 -26739 -22700 -2527 -9937 -7406 -2321 -11245 -6813 -6986 -15384 -11383 -782 -3114 5755 1584
4465 1584 -24079 -14398 1340 5314 -7592 -16740 -14998 -8156 -21605 -7938 4466 8311 -11249
4452 -11249 -17965 -11690 -13040 -3723 3935 1042 20224 28588 18982 21320 8181 -2220 -15095 -13787
4438 -13787 -17858 -9293 2493 2767 -12550 -23489 89 15358 6790 5469 16662 8947 -272
4425b72P56r8J381J0366l260j1052J172J3722j4517j0548J5928q83k1903k4323
4411d3531r383K1595K8502K2558j2315n223J5021R458j4400q367J2764j9607p286
4398a0214j3741M730P531L318K712O76l511Q957K1530l155j0662J6184M292l047
4384B5600k265l575m171j5687J5135l012n171o341j9549j6274k980K6146J2457
4371C13J0075J8354l772j1313j3583j933L329j7128p487J1989J73J501n883M67
4357a4898J7543J7763m695j4266K2295m305k3483p716k447M33J7009L3384N419
4344D2036j9528j4476k865j1401O333l401j4087J1416K1091n506p860j4153K504
4331i897J1599k546J0236j7114j1116K251O869r223N330J8580J696n684l553o652
$$ plain form
4425 -272 484 386 1767 12133 8873 -2179 -1007 12715 -1802 -12350 3578 2695 -19208 -43531
4411 -43531 -52914 -31319 -2817 19741 7426 2203 17224 26682 12282 3915 16679 -2928 -10214
4398 -10214 -23955 -19225 -11694 -8376 -5664 -4988 -8499 458 21988 18833 8171 24355 28647 25600
4384 25600 23335 19760 15589 -98 15037 12025 6854 513 -19036 -35310 -38290 -12144 313
4371 313 10388 28742 24970 13657 74 -1859 1470 -15658 -23145 -11156 -10983 -9482 -15365 -14898
4357 -14898 2645 20408 15713 1447 23742 19437 -4046 -11762 -14209 -13776 3233 36617 42036
4344 42036 22508 8032 5167 -6234 99 -3302 -17389 -5973 15118 9612 1752 -12401 -9897
4331 -9897 1702 -844 9392 -7722 -18838 -16587 -9718 -18941 -13611 4969 6665 981 -2572 -9224
$$ [...]
##END NTUPLES=NMR SPECTRUM
##END=
