##TITLE=Analysis number 313061
Compound Code cc 47910
Book Reference 452/24/3
Project Code adrs
Chemist Name peted
##JCAMPDX= 6.0         $$ Bruker NMR JCAMP-DX V2.0
##DATA TYPE= NMR SPECTRUM
##DATA CLASS= NTUPLES
##ORIGIN= Bruker BioSpin GmbH
##OWNER= NMR
$$ XWIN-NMR		Version 3.5
$$ Wed Aug 24 13:06:40 2005 GMT Daylight Time (UT+1h)  MAYBRIDGE\NMR@NMR_250MHZ
##.OBSERVE FREQUENCY= 250.131544655141
##.OBSERVE NUCLEUS= ^1H
##.ACQUISITION MODE= SIMULTANEOUS (DQD)
##.ACQUISITION SCHEME= undefined
##.AVERAGES= 16
##.DIGITISER RES= 18
##SPECTROMETER/DATA SYSTEM= dpx250
##.PULSE SEQUENCE= zg30
##.SOLVENT NAME= CDCl3
##.SHIFT REFERENCE= (INTERNAL, CDCl3, 0, 16.522)
##AUDIT TRAIL= $$ (NUMBER, WHEN, WHO, WHERE, WHAT)
$$ ##TITLE= Audit trail, XWIN-NMR		Version 3.5
$$ ##JCAMPDX= 5.01
$$ ##ORIGIN= Bruker BioSpin GmbH
$$ ##OWNER= NMR
$$ C:\u/data/dgb/nmr/ADRS/8500/pdata/1/auditp.txt
$$ ##AUDIT TRAIL=  $$ (NUMBER, WHEN, WHO, WHERE, WHAT)
(   1,<2005-08-24 13:06:18.31 +100>,<MAYBRIDGE\NMR>,<NMR_250MHZ>,
      <created by zg, POWCHK disabled, PULCHK disabled
       configuration hash MD5:
       62 19 C7 07 E1 42 D1 B7 37 6C 3D D0 77 39 F9 E6
       data hash MD5: 64K
       5F 2B 7F 59 4B 26 6C 7B 6C 39 D6 5E 7D 4E 9C D7>)
(   2,<2005-08-24 13:06:31.69 +100>,<MAYBRIDGE\NMR>,<NMR_250MHZ>,
      <Start of raw data processing
       ef LB = 0.3 FT_mod = 6 PKNL = 1 SI = 32K 
       data hash MD5: 32K
       5C 47 09 16 B8 1F 50 A1 DF EC 12 C4 28 97 A6 22>)
(   3,<2005-08-24 13:06:33.49 +100>,<MAYBRIDGE\NMR>,<NMR_250MHZ>,
      <apk 
       data hash MD5: 32K
       F5 59 24 78 E0 54 23 01 02 9F 79 01 21 7B B7 D3>)
(   4,<2005-08-24 13:06:34.33 +100>,<MAYBRIDGE\NMR>,<NMR_250MHZ>,
      <abs ABSG = 5 
       data hash MD5: 32K
       DC C1 88 92 B7 01 63 82 30 47 51 C5 6F 30 88 35>)
$$ ##END=
$$ 
$$ hash MD5
$$ 50 9E 5F 32 75 F5 DD EE FE 37 0B BD 95 7D 46 9A
##$RELAX= 
##$RELAX= 
##$RELAX= 
##$RELAX= 
##$RELAX= 
##$RELAX= 
##$RELAX= 
$$ Bruker specific parameters
$$ --------------------------
##$DU= <C:\u>
##$EXPNO= 8500
##$NAME= <ADRS>
##$PROCNO= 1
##$TYPE= <nmr>
##$USER= <dgb>
##$AMP= (0..31)
100 100 100 100 100 100 100 100 100 100 100 100 100 100 100 100 100 100 
100 100 100 100 100 100 100 100 100 100 100 100 100 100 
##$AQSEQ= 0
##$AQ_mod= 3
##$AUNM= <au_zg>
##$AUTOPOS= <31 >
##$BF1= 250.13
##$BF2= 250.13
##$BF3= 250.13
##$BF4= 250.13
##$BF5= 500.13
##$BF6= 500.13
##$BF7= 500.13
##$BF8= 500.13
##$BYTORDA= 1
##$CFDGTYP= 0
##$CFRGTYP= 5
##$CHEMSTR= <none>
##$CNST= (0..31)
1 1 145 1 1 1 1 1 1 1 1 1 1 1 1 1 1 1 1 1 1 1 1 1 1 1 1 1 1 1 1 1 
##$CPDPRG= <>
##$CPDPRG1= <>
##$CPDPRG2= <>
##$CPDPRG3= <>
##$CPDPRG4= <mlev>
##$CPDPRG5= <mlev>
##$CPDPRG6= <mlev>
##$CPDPRG7= <mlev>
##$CPDPRG8= <mlev>
##$CPDPRGB= <>
##$CPDPRGT= <>
##$D= (0..31)
0 1 0 0 0 0 0 0 0 0.06 0 0 0 0 0 0 0.0002 0 0 0 0 0 0 0 0 0 0 0 0 0 0 
0 
##$DATE= 1124885177
##$DBL= (0..7)
120 120 120 120 120 120 120 120 
##$DBP= (0..7)
150 150 150 150 150 150 150 150 
##$DBP07= 0
##$DBPNAM0= <>
##$DBPNAM1= <>
$$ [...]
##$SUBNAM7= <"">
##$SUBNAM8= <"">
##$SUBNAM9= <"">
##$SW= 20.6930455092707
##$SWIBOX= (0..15)
0 0 3 0 0 0 0 0 0 0 0 0 0 0 0 0 
##$SW_h= 5175.983436853
##$TD= 65536
##$TD0= 1
##$TE= 295.16
##$TE2= 300
##$TE3= 300
##$TEG= 300
##$TL= (0..7)
0 120 120 120 120 120 120 120 
##$TP= (0..7)
150 150 150 150 150 150 150 150 
##$TP07= 0
##$TPNAME0= <>
##$TPNAME1= <>
##$TPNAME2= <>
##$TPNAME3= <>
##$TPNAME4= <>
##$TPNAME5= <>
##$TPNAME6= <>
##$TPNAME7= <>
##$TPOAL= (0..7)
0.5 0.5 0.5 0.5 0.5 0.5 0.5 0.5 
##$TPOFFS= (0..7)
0 0 0 0 0 0 0 0 
##$TUNHIN= 0
##$TUNHOUT= 0
##$TUNXOUT= 0
##$USERA1= <user>
##$USERA2= <user>
##$USERA3= <user>
##$USERA4= <user>
##$USERA5= <user>
##$V9= 5
##$VALIST= <valist>
##$VCLIST= <CCCCCCCCCCCCCCC>
##$VD= 0
##$VDLIST= <DDDDDDDDDDDDDDD>
##$VPLIST= <PPPPPPPPPPPPPPP>
##$VTLIST= <TTTTTTTTTTTTTTT>
##$WBST= 1024
##$WBSW= 4
##$XGAIN= (0..3)
0 0 0 0 
##$XL= 0
##$YL= 0
##$YMAX_a= 423719
##$YMIN_a= -492002
##$ZGOPTNS= <>
##$ZL1= 120
##$ZL2= 120
##$ZL3= 120
##$ZL4= 120
##$ABSF1= 16.522
##$ABSF2= -4.171173
##$ABSG= 5
##$ABSL= 3
##$ALPHA= 0
##$AQORDER= 0
##$ASSFAC= 0
##$ASSFACI= 0
##$ASSFACX= 0
##$ASSWID= 0
##$AUNMP= <proc_1d>
##$AZFE= 0.1
##$AZFW= 0.1
##$BCFW= 0
##$BC_mod= 0
##$BYTORDP= 0
##$COROFFS= 0
##$CY= 12.5
##$DATMOD= 1
##$DC= 0
##$DFILT= <>
##$DTYPP= 0
##$F1P= 14.0000005364418
##$F2P= -0.99999901652339
##$FCOR= 0.5
##$FTSIZE= 32768
##$FT_mod= 6
##$GAMMA= 0
##$GB= 0
##$INTBC= 1
##$INTSCL= 1
##$ISEN= 128
##$LB= 0.3
##$LEV0= 0
##$LPBIN= 0
##$MAXI= 10000
##$MC2= 0
##$MEAN= 0
##$ME_mod= 0
##$MI= 0
##$NCOEF= 0
##$NC_proc= -3
##$NLEV= 6
##$NOISF1= 0
##$NOISF2= 0
##$NSP= 0
##$NTH_PI= 0
##$NZP= 0
##$OFFSET= 16.522
##$PC= 1
##$PHC0= 130.5152
##$PHC1= 4.344367
##$PH_mod= 1
##$PKNL= yes
##$PPARMOD= 0
##$PSCAL= 4
##$PSIGN= 0
##$REVERSE= no
##$SF= 250.13
##$SI= 32768
##$SIGF1= 0
##$SIGF2= 0
##$SINO= 400
##$SIOLD= 32768
##$SREGLST= <1H.CDCl3>
##$SSB= 0
##$STSI= 32768
##$STSR= 0
##$SW_p= 5175.98343685301
##$SYMM= 0
##$S_DEV= 0
##$TDeff= 65536
##$TDoff= 0
##$TI= <Analysis number 999999
Compound Code 99
Book Reference 9
Project Code 9>
##$TILT= no
##$TM1= 0
##$TM2= 0
##$TOPLEV= 0
##$USERP1= <user>
##$USERP2= <user>
##$USERP3= <user>
##$USERP4= <user>
##$USERP5= <user>
##$WDW= 1
##$XDIM= 32768
##$YMAX_p= 514599821
##$YMIN_p= -159104
$$ End of Bruker specific parameters
$$ ---------------------------------
##NTUPLES= NMR SPECTRUM
##VAR_NAME=  FREQUENCY,     SPECTRUM/REAL,   SPECTRUM/IMAG
##SYMBOL=    X,             R,               I
##VAR_TYPE=  INDEPENDENT,   DEPENDENT,       DEPENDENT
##VAR_FORM=  AFFN,          ASDF,            ASDF
##VAR_DIM=   32768,         32768,           32768
##UNITS=     HZ,            ARBITRARY UNITS, ARBITRARY UNITS
##FACTOR=    0.157963299565203, 1,           1
##FIRST=     4132.6476996994, 0,             0
##LAST=      -1043.33573715361, 0,           0
##MIN=       -1043.33573715361, -159104,     0
##MAX=       4132.6476996994, 514599821,     0
$$ Real data points
##PAGE= N=1
##DATA TABLE= (X++(R..R)), XYDATA
$$ [...]
17606A82726k2330r302m257L347J1208J0300k157k744j0563k3058k7136j4412
17594I1622m142p325j0878o145j788k415o137K878N84m416p607O03J330N733k727
17579D9170k727m046m660K03m014l768M30j830K10K267M295k243m737q037j563
17564A8950j164N694l421j526J999k443K819K015j278q593q32O582J2414O753
17550C7969m88m358l033j1004n335r04P116L702n207k326j206k353l029N297j217
17535A3624k961K772N17o242j619O293N476L240K375J61k847m049p06J221k652
17520A4603m792J775J031r76N12l35N655K022J518q82k889m837m565Q02N498O47
17504A4787R87k186J936J04J6p801j927Q020J342n195k439J426M10K455j491l7
$$ plain form
17606 182726 160396 151094 146837 150184 161392 171692 169535 166791 156228 133170 106034 91622
17594 91622 87480 80155 69277 63132 61344 58929 52792 55670 56254 51838 44231 44834 46164 51897 49170
17579 49170 46443 42397 37737 37940 33926 30158 30588 28758 28968 31235 35530 33287 28550 20513 18950
17564 18950 17786 23480 20059 18533 20532 18089 20908 22923 21645 13052 12220 18802 31216 37969
17550 37969 37481 33123 30090 19086 13751 12847 19963 23665 18458 16132 14926 12573 9544 14841 13624
17535 13624 10663 13435 13952 7710 6091 12384 17860 21100 23475 23636 20789 16740 16034 17255 14603
17520 14603 9811 11586 12617 11641 12153 11818 17473 19495 21013 20131 17242 12405 7840 8642 14140 14787
17504 14787 15774 13588 15524 15628 15644 7843 5916 13936 15278 10083 7644 9070 9480 11935 10444 10407
17488A0407M963K438l78j758R39m929o360J368O834m521O04K061J642k204r618
17473A488j324M142O469j560j831J795R08j86j781M806N825J53k822m881J071
17458A2272J477l936K819k90K48k903J91j662M585P11r32K222M618L253j491R408
17442C0590P041N196M997J302L152K820j148q222o948J777j077p049j0336o254
17428A5841k091O635J353K623o374n302n337l588j459K95M764K872M84K180k432
17413A0464L885P304N550n764N80O41j0020j081L906L710j0794m153%k246N451
17398G433Q088M27q390n13N038N699k77l964L231K59p178k335M364K966j014j496
17382A2338K081j299O942J905k716o840k988l594K931L529m60L097M299P231M015
$$ plain form
17488 10407 15370 17808 17430 15672 16611 11682 5322 6690 13524 9003 9607 11668 13310 11106 1488
17473 1488 164 4306 10775 9215 7384 9179 10087 9901 8120 12926 18751 18904 16082 11201 12272
17458 12272 13749 9813 12632 12342 12590 9687 9878 8216 12801 13512 12580 14802 19420 22673 21182 30590
17442 30590 37631 42827 47824 49126 52278 55098 53950 45728 38780 40557 39480 32431 22095 15841
17428 15841 13750 20385 21738 24361 17987 12685 7348 3760 2301 2596 7360 10232 10716 12896 10464
17413 10464 14349 21653 27203 21439 22019 22660 12640 11559 15465 19175 8381 4228 4228 1982 7433
17398 7433 15521 15948 7558 7045 12083 17782 17505 13541 16772 17031 9853 7518 11882 14848 13834 12338
17382 12338 14419 13120 20062 21967 19251 12411 9423 5829 8760 12289 11829 14926 19225 26456 30471
17367C0471L498o472J029l844o061j750l312L036K600k391m372Q226N554k836
17353B3376p020k156K089k545K869M317j22q282n851N987K023k875j364j90R119
17338A9375j617l465L634J075p99K078M76L078Q561m615p093r44R72J035M92J151
17322B3394J491o959o280l162j041m293k118k635K141J706l152L629M740j086
17308F375l189M010M866Q196O09l379q66j835j184m764n263L041L05J317j315
17293F924j643J178j33n67k931k619j676k142N65N605Q53N552k938K996R03o5
17277I862m190K189L053O045J724r181p497l466N097M027J528n84p662k778l242
17262e075M823N128P975p23q129j0341M369M497r85O668K316m387J009l42J608
$$ plain form
17367 30471 33969 27497 28526 24682 18621 16871 13559 16595 19195 16804 12432 20658 26212 23376
17353 23376 16356 14200 16289 13744 16613 20930 20808 12526 6675 12662 14685 11810 10446 10256 19375
17338 19375 17758 14293 17927 19002 18203 20281 20757 23835 32396 27781 20688 19744 20716 21751 22243 23394
17322 23394 24885 17926 11646 8484 7443 3150 1032 -1603 538 2244 -908 2721 7461 6375
17308 6375 3186 7196 12062 20258 20867 17488 16622 14787 13603 8839 3576 6617 6922 8239 6924
17293 6924 5281 6459 6326 5759 2828 209 -1467 -3609 -3044 2561 3414 8966 6028 9024 9927 9862
17277 9862 5672 7861 10914 16959 18683 9502 2005 -1461 3636 7663 9191 8607 945 -1833 -5075
17262 -5075 -252 4876 12851 12128 3999 -6342 -1973 2524 1539 8207 10523 6136 7145 6803 8411
17247H411l321k775n72j334J89k594P21R572L172j250R9N85l376k850j446j342
17231A889J505j030k813m127j318M071N103P212r61o192m334K18P085N846l653
17216H501o571O52o058L712N379NP817L58r186j917K270M919o403K598J488K066
17200I630j091j0212J766N924n58N166N193o499n125L152k476m295j341j76O341
17185E399O689N100j381L119L988m602p89l812l932q161m474J308L802k152l569
17170c467P06M660o39k351R238J610q959l664N541N180k486m069m283J747n41
17155a777N282O110p86n450M22K103n389n715O118J2955K184n650o755r12j64
17140B576N661j278m70O668P98m05L307K223k395o638l133J69n425J831r45k359
$$ plain form
17247 8411 5090 2315 1743 409 598 -1996 -1275 8297 11469 10219 10318 10903 7527 4677 3231 1889
17231 1889 3394 2364 -449 -4576 -5894 -1823 3280 10492 9531 3339 -995 -777 6308 12154 8501
17216 8501 1930 2582 -3476 236 5615 5620 13437 13795 4609 2692 4962 9881 3478 6076 7564 9630
17200 9630 8539 -1673 93 6017 5459 10625 15818 9319 4194 7346 4870 575 -766 -942 5399
17185 5399 12088 17188 15807 18926 22914 18312 17523 13711 9779 1618 -2856 -1548 2254 102 -3467
17170 -3467 -2761 1899 1260 -1091 8147 9757 798 -2866 2675 7855 5369 1300 -2983 -1236 -1777
17155 -1777 3505 9615 8829 3379 3801 5904 515 -5200 918 13873 16057 10407 3652 2740 2576
17140 2576 8237 6959 6489 13157 13955 13550 16857 19080 16685 10047 6914 7083 1658 3489 2544 185
17124A85M85L985L436l35j855O787M504m101L696P196n73J269p371k464J157k711
17108A3290l086o394n714M526J433p113m807Q219K121j026j413q98r70Q824J878
17093H870n005o07l067m420J222J219M14r82K384K33K097j628n015M677L541J077
17077E010K924J933n575l551M669M545p96j765L52M650J402m847k848R35J763
17062H801K474j213j07L093l622o975j666P063J0673n36n573j660q391l547O64
17047e22L14O439L014J421j983l988P3K019o298r442L961m61L319M832N49k627
17031F20J300j774K83J624j86l329m615M056L703L718j301l265k691n167L975
17016c049N024J61k907n742k555L743N265j482M57Q35l069k742m583r74L751O924
$$ plain form
17124 185 670 4655 8091 7756 5901 12688 17192 13091 16787 23983 23410 24679 17308 14844 16001 13290
17108 13290 10204 3810 -1904 2622 4055 -3058 -7865 354 2475 1449 36 -862 -1832 6992 8870
17093 8870 3865 3258 191 -4229 -3007 -1788 -1374 -2356 28 261 2358 730 -4285 392 3933 5010
17077 5010 7934 9867 4292 741 5410 9955 9159 7394 7746 12396 13798 8951 6103 7038 8801
17062 8801 11275 10062 9955 13048 9426 2451 785 7848 18521 17985 12412 10752 2361 -1186 -522
17047 -522 -208 6231 9245 10666 8683 4695 4768 6787 489 -8953 -4992 -5453 -2134 2698 3247 620
17031 620 1920 146 429 2053 1867 -1462 -6077 -2021 1682 5400 4099 834 -1857 -7024 -3049
17016 -3049 1975 2136 -771 -6513 -9068 -5325 -60 -1542 -1085 -250 -3319 -6061 -10644 -11618 -7867 -943
17000i43L247L339M61n912L259K390J802J0017L505n15m101k322L43o328n277
16985B965n743j32L04m22M501j748M97Q04M984P934l56o445O111N872j853R5k526
16968A4842p673r23j67M651L808O432M513p336J812Q51K103K165n56K085M896
16953C1503o101p675o529k745m871j339l544r28K714M905J297k062O37M99M767
16938A0528k840n586m620m523P206P805L253m259j569J323O762m962k393K686
16924H811m908J458N1L48m519j217M804k232k302O84M786j023p575j536N220J682
16908B532J269J675k418j923K134O214l814n027K069J938n926n383K565K343k444
16893d196l56Q421R476j376o113o394j437j618L911M190L388n636m174L741L813
$$ plain form
17000 -943 2304 5643 6104 192 3451 5841 7643 17660 21165 20650 16549 14227 14570 8242 2965
16985 2965 -2778 -2910 -2606 -3028 1473 -275 222 1026 6010 13944 13588 7143 13254 19126 17273 17368 14842
16968 14842 7169 6246 6079 10730 14538 20970 25483 18147 19959 20810 22913 25078 24522 26607 31503
16953 31503 25402 17727 11198 8453 3582 2243 -1301 -2229 485 5390 6687 4625 5262 5761 10528
16938 10528 7688 2102 -2518 -7041 165 7970 11223 6964 5395 6718 13480 8518 6125 8811
16924 8811 3903 5361 5412 5760 1241 24 4828 2596 294 978 5764 4741 -2834 -4370 850 2532
16908 2532 3801 5476 3058 1135 3269 9483 5669 642 2711 4649 -1277 -6660 -4095 -1752 -4196
16893 -4196 -4552 3869 13345 11969 5856 -538 -1975 -3593 318 4508 7896 2260 -1914 1827 5640
16878E640M95o252j669K388P508k14m854m577n87O225j41L728N852K621l952p744
16862D467K861Q723P9k525m119R3P903l617m427M468K858j511k233J822r440p654
16846b252K90Q079K089k810m50p1M2J946k970J73j569j289k340L477j239j609
16830e03p803j843m554m5M785j922J763J0022M908l164n030Q91n327P050N484
16815D712J858M637l368j008j56Q62o07k536J927K789L773k309q653n167j930
16800e176J665L931k210L886J099J000J685k43M35l134m882K078J2556q96n885
16785E909O551n177n223J748K520M6j60k088j944J810O14k606l243m147p16r33
16769g039n51P802L223j443l74l476J492o270m702L724Q212K824m613m014l32
$$ plain form
16878 5640 6135 -117 -1786 602 8110 7896 3042 -1535 -2122 4103 3962 7690 13542 16163 12211 4467
16862 4467 7328 16051 16130 13605 9486 9579 17482 13865 9438 13906 16764 15253 13020 14842 5402 -2252
16846 -2252 -1962 6117 8206 5396 4946 4875 4917 6863 3893 4066 2497 1208 -1132 2345 1106 -503
16830 -503 -8306 -10149 -14703 -14748 -9963 -11885 -10122 -100 4808 1644 -3386 -2495 -7822 -772 4712
16815 4712 6570 11207 7839 6831 6675 7537 6930 4394 6321 9110 12883 10574 1921 -3246 -5176
16800 -5176 -3511 420 -1790 2096 3195 4195 5880 5637 6072 2938 -1944 134 12690 11794 5909
16785 5909 12460 7283 2060 3808 6328 6374 6214 4126 2182 3992 4606 2000 -1243 -5390 -6106 -7039
16769 -7039 -7590 212 3435 1992 1618 -1858 -366 -6636 -11338 -7614 598 3422 -1191 -5205 -5537
16754e537O54L833k281L085R26Q51k433j911k82M661M696L124k908J860k050o875
16738e87k075K129J985J861K867L012J556K094K723k2o555m347K84K39n676L235
16722B723O968l407J99n53J243j335N10J685N26k222j659L739K407R55l289k73
16706H217N189l989J354m180k875N966L619l071o734r59K288L046n92n099j307
16691H73P097r696j0903L745Q75J86N922J509L005N580J30K41o441r320k71Q538
16675A070R61l056M360L50M065k257p848O582J1357j709n885k343k117J294M511
16660I335K92R27o87N970m289k554r56O15o363k335J193M224J866Q174K396j560
16644A6248n632k387q178j342p27L656p67j167J27N49l662L869p93J056J905m672
$$ plain form
16754 -5537 -4883 -1050 -3331 -246 680 1531 -902 -2813 -3095 1566 6262 9386 6478 8338 6288 -587
16738 -587 -2662 -533 1452 3313 6180 9192 10748 12842 15565 15543 8988 4641 4925 5164 -512 2723
16722 2723 9691 6284 6483 5930 7173 5838 6348 8033 8559 6337 4678 8417 10824 11779 8490 8217
16706 8217 13406 9417 10771 6591 3716 9682 13301 10230 3496 2537 4825 7871 7279 2180 873
16691 873 7970 -1726 -12629 -8884 -8009 -7823 -1901 -392 2613 8193 8323 8564 2123 -7197 -7468 1070
16675 1070 2031 -1025 3335 3685 7750 5493 -2355 4227 15584 13875 7990 5647 3530 4824 9335
16660 9335 9627 10554 9867 15837 11548 8994 8038 8653 2290 -45 1148 5372 7238 15412 17808 16248
16644 16248 10616 8229 51 -1291 -2018 1638 871 -296 -169 380 -3282 587 -206 850 2755 -1917
16628a917m656l245k819O874M021l748l77J139M161K598R50l895k641p3l32K007
16612a953K744l203R67N213J487m171l044l613l615l98J485M803K022k562k526
16597f364k78N945O131k143M78k251l562m043k860J940N635O644L740l662j180
16582D170J244j411O11j237k006K232L725o130J40j322p274j544K332J0107M401
16567H038j799j454K447K19J325l562P48n61L376K80o623M49M209n214j822J250
16551A306L315K156n213p439k23O849M269j4135q709P37O031O779K888k558k126
16536f073J0005M749J524k912m326J6J432k073N63P214m479p860l703L167J603
16521a153J039M404j290O73j071L041K569K371j047m898l216m75N453J0352m90
$$ plain form
16628 -1917 -6573 -9818 -12637 -5763 -1742 -5490 -5867 -4728 -567 2031 2981 -914 -3555 -3628 -3960 -1953
16612 -1953 791 -2412 -1445 3768 5255 1084 -1960 -5573 -9188 -9586 -8101 -3298 -1276 -3838 -6364
16597 -6364 -6642 -697 5434 3291 3769 1518 -2044 -6087 -8947 -7007 -1372 5272 9012 5350 4170
16582 4170 5414 4003 4614 3377 1371 3603 7328 1198 1338 16 -7258 -8802 -6470 3637 8038
16567 8038 6239 4785 7232 7451 8776 5214 5962 5401 8777 9057 2434 2883 7092 1878 56 1306
16551 1306 4621 6777 1564 -5875 -6098 751 5020 -9115 -17824 -17087 -11056 -4277 -1389 -3947 -6073
16536 -6073 3932 8681 10205 7293 2967 2983 4415 2342 2905 10119 5640 -2220 -5923 -2756 -1153
16521 -1153 -114 4290 3000 3673 2602 5643 8212 10583 9536 4638 1422 947 6400 16752 16262
16506A6262p582j915p50K55J430m530l133L033q68P844k134m510J80n207n29o9
16490b223M750l061l894l4K172P165M493O91L096r7p153j0457j98n21k248K566
16474d953R751o57n360k013J542P14L192J950O7M234l311K435p78N62L96K407
16458A0178L50k429j635n343k463j16M480r3k190p381J616L947K785J424J164
16443D294J040p364l589k099K68q023k074R428O119k914M776R77j359k76O571
16428E775M762r589q689l536M74j047J890P608n23M286m403m01m472M877K478
16413e10m351K958L427n887o691k077N951P406o67k622O73k97L61k176k117N174
16397a445O010O748K36l206r3m412j2470l161L955N769M990k17k862p83O09j325
$$ plain form
16506 16262 8680 6765 6015 6270 7700 3170 37 3070 2202 10046 7912 3402 3582 -1625 -2154 -2223
16490 -2223 2527 -534 -4428 -4462 -2290 4875 9368 10059 13155 13058 5905 -4552 -4750 -5271 -7519 -4953
16474 -4953 4798 4141 -1219 -3232 -1690 -976 2216 4166 4233 8467 5156 7591 6813 7375 7771 10178
16458 10178 10528 8099 6464 1121 -1342 -1458 3022 2929 739 -6642 -5026 -1079 1706 3130 4294
16443 4294 5334 -2030 -5619 -7718 -7450 -15473 -17547 -8119 -2000 -4914 -138 839 -520 -796 5775
16428 5775 10537 948 -7741 -11277 -10803 -11850 -9960 -2352 -2875 1411 -2992 -3393 -7865 -2988 -510
16413 -510 -4861 -1903 1524 -4363 -11054 -13131 -7180 226 -441 -3063 -2390 -2687 -2326 -4502 -6619 -1445
16397 -1445 4565 11313 11549 8343 8250 3838 -8632 -11793 -7838 -2069 2921 2704 -158 -941 -332 -1657
16381a657o264M69K454Q976P120n009j2226j0783K391q0N33O322R643J640l099
16366D30Q409O55o073k30l446J599M205R89p102q110J0657N476k045K596O52K254
16350A0916l165m173o328q307j188n41K472M921L764K155k301n072k312l467N029
16335g597N118M574n580j932P398R53J222L260j002M71l343K749n970m397j765
16320e841L015N211J519o052N80M775J434M338K740k875k081n250m27j237l879
16305d030M87K078J823n729P539l444J157L048o609q276q448j086J005j979O807
16290a5657O944P87N762K43m542m853L093Q21j227j557J957r27L913L289k067
16275d021n58Q41j458j348J893J204J243M504O406q545n295J71k281M088N766
$$ plain form
16381 -1657 -7921 -7452 -4998 3978 11098 6089 -6137 -16920 -14529 -14609 -14076 -7754 1889 3529 430
16366 430 8839 9494 3421 3191 -255 1344 5549 6538 -564 -8674 1983 7459 5414 8010 8662 10916
16350 10916 7751 3578 -2750 -11057 -12245 -12786 -10314 -5393 -1629 526 -1775 -6847 -9159 -12626 -7597
16335 -7597 -2479 2095 -3485 -5417 1981 2934 4156 7416 6414 6885 3542 6291 321 -4076 -5841
16320 -5841 -2826 2385 3904 -2148 -1568 3207 4641 8979 11719 8844 6763 1513 1086 -151 -4030
16305 -4030 -3543 -1465 358 -5371 2168 -1276 -119 2929 -3680 -11956 -20404 -21490 -20485 -22464 -15657
16290 -15657 -8713 -7926 -2164 -1921 -6463 -11316 -8223 -7402 -8629 -10186 -8229 -9156 -5243 -1954 -4021
16275 -4021 -4579 -3738 -5196 -6544 -4651 -3447 -2204 2300 8706 161 -5134 -4963 -7244 -3156 2610
16260B610k14K422n757p081m539J045O489N383J750R065q871r460l223L396R437
16245B452J353k074l965M36j518L577j606j077m256M608q45L845j051o212K592
16230c741P793r6J030l211o794K280M922L77l392k527l340o514K171L121Q93N591
16214a437Q26M032k647j516k56K099n510k019K401Q6r19N80M388L902K863L51
16198G224j151j994k943j105m066L161J370m537J48J216j223L197L44j897m605
16183f861N03j488l054j959L682N20J668K907K14N972L817J352J066J071l656
16168E754J60J330j822M761m223l328o29l25j662j207J512l062o941r71M111J567
16152d975M646%l231J908J301r53J093K175L070m371n901n697j170K319M090M741
$$ plain form
16260 2610 2396 4818 -939 -8020 -12559 -11514 -5025 358 2108 11173 2302 -7158 -10381 -6985 2452
16245 2452 3805 1731 -2234 -1798 -3316 261 -1345 -2422 -6678 -2070 -2915 930 -121 -6333 -3741
16230 -3741 4052 3956 4986 1775 -5019 -2739 2183 2560 -832 -3359 -6699 -13213 -11042 -7921 -7028 -1437
16214 -1437 -611 3421 774 -742 -998 1101 -4409 -6428 -4027 -3941 -4860 -4280 108 4010 6873 7224
16198 7224 6073 4079 1136 31 -4035 -874 496 -4041 -3893 -2677 -3900 -703 -359 -2256 -6861
16183 -6861 -6358 -7846 -10900 -12859 -9177 -8657 -6989 -4082 -3868 2104 5921 7273 8339 9410 5754
16168 5754 5914 7244 5422 10183 5960 2632 2003 1678 16 -1191 321 -2741 -9682 -10653 -6542 -4975
16152 -4975 -329 -329 -3560 -1652 -351 -1304 -211 1964 5034 663 -5238 -10935 -12105 -9786 -5696 -955
16136i55p72m670M174K432J26l366J515R078J397J495l886j061n27n635p211k220
16120a0086j373M901M166J274L420J578N292K093j129l754k473l483L104L187
16106F717j0136k621j527J428L210k37n095k809O31j226k833l264L076P023R44
16091f719J1778Q216M384o581q521k729l749j3717p75N300j864M843K908N774
16077a452J435p176J547P265P418j694o301k957n624j242M099J914L563l076q344
16062a0625m114J367L446J024o34J66O61K413R03k464l464J729J818k583N04K92
16046i561J437l619r09M805K734j377K551P558l619p636p927L572Q750L471K775
16031C005j341K324k270j0036k253L80L714K850j208m55L330M873N28n573M400
$$ plain form
16136 -955 -1727 -6397 -2223 209 335 -3031 -1516 7562 8959 10454 6568 5507 4980 -655 -7866 -10086
16120 -10086 -11459 -6558 -2392 -1118 2302 3880 9172 11265 10136 6382 3909 426 3530 6717
16106 6717 -3419 -6040 -7567 -6139 -2929 -3166 -8261 -11070 -10439 -11665 -14498 -17762 -14686 -7663 -6719
16091 -6719 5059 13275 17659 11078 2557 -172 -3921 -17638 -18413 -13113 -14977 -10134 -7226 -1452
16077 -1452 -17 -7193 -5646 1619 9037 7343 1042 -1915 -7539 -8781 -4682 -2768 795 -2281 -10625
16062 -10625 -14739 -13372 -9926 -8902 -9536 -9370 -8709 -6296 -5393 -7857 -11321 -9592 -7774 -10357 -9853 -9561
16046 -9561 -8124 -11743 -12652 -7847 -5113 -6490 -3939 3619 0 -7636 -15563 -11991 -3241 230 3005
16031 3005 1664 3988 1718 -8318 -10571 -10191 -6477 -3627 -4835 -5290 -1960 2913 3441 -2132 2268
16016B268R08l418k584n984m574J665O785Q173q50j971N02M638L784L562j330
16001A1574j855q218j638n192l693M681K026j913K49N086K661J312l024p106j314
15986f364N090K903J00K397L76o565o799M14j911N990M981O702L554n318N195
15971A0745R03K471j114q048p885Q94M405n454M39k582n016M027k466L789J0808
15956E916l477p262j295M133J884k235N93L636L750O733l407m598k666m241K55
15941b281n56J833J394k652p702l436O604M378R61Q02q18K095j887l02l351P87
15925d131Q630p63l036k436L978L169m741N2K082l735m225o517J124N126M434
15910i89M750N310J083q43l50p660p608j569L448K730L287O484M653j051m64k180
$$ plain form
16016 2268 3176 -242 -2826 -8810 -13384 -11719 -4934 3239 2389 418 920 5558 9342 12904 11574
16001 11574 9719 1501 -137 -5329 -9022 -4341 -2315 -4228 -3979 1107 3768 5080 2056 -5050 -6364
15986 -6364 -1274 1629 1729 4126 4502 -2063 -8862 -8448 -10359 -4369 612 7314 10868 5550 10745
15971 10745 11648 14119 13005 4957 -2928 -2034 2371 -3083 -2644 -5226 -10242 -6215 -8681 -4892 5916
15956 5916 2439 -4823 -6118 -1985 -101 -2336 -1743 1893 5643 12376 8969 4371 1705 -2536 -2281
15941 -2281 -2837 -1004 390 -2262 -9964 -13400 -6796 -2418 -1457 -655 -1473 622 -1265 -1567 -4918 -4131
15925 -4131 4499 3736 700 -1736 2242 5411 670 722 2804 -931 -5156 -11673 -10549 -5423 -989
15910 -989 3761 9071 10154 9311 8961 1301 -6307 -7876 -4428 -1698 1589 8073 12726 11675 11211 9031
15894I031j301P453J039r412o258O321N114l467p706p646J920O191j636J315K539
15879C497L991k779n287l492J149O219K702J942O138k633n717q641r159P761J0343
15864F034J097m423j743J529R73k11k67L537N9k389J342o364q74M604P572k585
15848G891n180L701o378n220Q22l23J384L570o168j583P322n701k353J331J93
15833f692J75O387O318J121k068m662K7mn194j105k46k245o60M064k92l412O630
15816a858L996o359n871L278J4193L562L713m322q341l563J798j461k075q423
15802a1733J998J334K843j329p66M976J371k223j621p63K135K32J121L336p55
15787A56k585L320L594j577K345j076j847n657L202O147m801p649j329K350L852
$$ plain form
15894 9031 7730 15183 16222 6810 552 6873 11987 8520 814 -6832 -4912 1279 -357 958 3497
15879 3497 7488 4709 -578 -4070 -2921 3298 6000 7942 14080 11447 5730 -2911 -12070 -4309 6034
15864 6034 7131 2708 965 2494 3467 3256 2989 6526 6585 4196 5538 -826 -1700 2904 10476 7891
15848 7891 2711 6412 34 -5186 -4364 -4687 -3303 267 -5901 -7484 -162 -5863 -8216 -6885 -6692
15833 -6692 -6517 -130 6188 7309 5241 579 606 602 -4592 -5697 -5943 -8188 -8848 -4784 -5076 -8488 -1858
15816 -1858 2138 -4221 -10092 -6814 7379 10941 14654 10332 1991 -1572 226 -1235 -3310 -11733
15802 -11733 -9735 -8401 -5558 -6887 -7653 -2677 -1306 -3529 -5150 -5913 -3778 -3546 -2425 911 156
15787 156 -2429 891 4485 2908 5253 4177 2330 -3327 -125 6022 1221 -6428 -7757 -5407 -1555
15772a555O853N515o20q104K395O178J667l312p172n058l655J367L534M91r8J479
15756i5K200M806K319l993n836j636L269N995K420n082j628k282p198k914J1243
15741A588O476k575j312M088K434l280p954N87K52l86J131K870L180k05n02K181
15725H573m50j173j65n437k426j393k604k309K411K765L040L593k720K729p258
15710b824n433o381k373M940R307M54j049j766k171L27o03K165J026k061k723
15695i165L499n347j302M587M078L126K299j87N817Q30o457k647o037l890q8j779
15679a2663K6n827J130O354J642m38Q697L1j908l053m179l83m719M443M702O462
15663C17p4r7k915m466N00m948k717J326m8k446m552k047J0366M043L01J687k106
$$ plain form
15772 -1555 5298 10813 10193 2089 4484 10662 12329 9017 1845 -3213 -6868 -5501 -1967 -1476 -1574 -95
15756 -95 2105 6911 9230 5237 -599 -2235 1034 7029 9449 4367 2739 457 -6741 -9655 1588
15741 1588 8064 5489 4177 8265 10699 7419 -535 52 304 -82 1049 3919 7099 6894 6392 8573
15725 8573 8123 6950 6785 1348 -1078 -2471 -5075 -7384 -4973 -2208 832 4425 1705 4434 -2824
15710 -2824 -8257 -14638 -17011 -12071 -2764 -2310 -3359 -5125 -7296 -6969 -7572 -5407 -4381 -6442 -9165
15695 -9165 -5666 -11013 -12315 -7728 -3650 -524 1775 1588 7405 8235 1778 -869 -6906 -10796 -10884 -12663
15679 -12663 -12637 -18464 -17334 -10980 -9338 -9776 -1079 -1048 -2956 -6009 -10188 -10571 -15290 -10847 -6145 317
15663 317 243 146 -2769 -7235 -6735 -11683 -14400 -13074 -13122 -15568 -20120 -22167 -11801 -7758 -7457 -5770 -7876
15646g876M995j75p635N71N645l054l766n29L616K647N243J317l069p488J039
15631h519L870J188j156n249n387M917N818M893P00j633k247o214K281Q757j732
15616B87m918l184Q93M231L11j333J16K777J206j362j812M606N772o441j966O89
15600a28l219L68j367p857P972q21J221j033j702m840M500O784N325O834o845
15585E192j833N065k865o885j738J504j232k396J60L99r67j0316m001R62L975
15570a4976M690Q163L677o794m990n554j853R472N432N371j14l294j0540k575
15556a3885K127o04j311L351M582l107k328K823J98m309M37N265o1K031K622j667
15540c836k620M684k143m813L877k011j671L15k140k50J127l770J942J0761N068
$$ plain form
15646 -7876 -2881 -3056 -10691 -10120 -4475 -7529 -11295 -11824 -8208 -5561 -318 999 -2070 -9558 -8519
15631 -8519 -4649 -3461 -4617 -9866 -15253 -10336 -4518 375 1075 -558 -2805 -9019 -6738 2019 287
15616 287 -4631 -7815 -6922 -2691 -2380 -3713 -3597 -820 386 -976 -2788 1818 7590 1149 -817 -128
15600 -128 -3347 -2979 -4346 -12203 -4231 -5052 -3831 -4864 -6566 -11406 -6906 -122 5203 12037 5192
15585 5192 3359 8424 5559 -1326 -3064 -1560 -2792 -5188 -5028 -4629 -5596 -15912 -19913 -18951 -14976
15570 -14976 -10286 -2123 1554 -5240 -10230 -15784 -17637 -8165 -2733 2638 2524 -770 -11310 -13885
15556 -13885 -11758 -12362 -13673 -10322 -5740 -8847 -11175 -8352 -8154 -12463 -12026 -6761 -6822 -4791 -2169 -3836
15540 -3836 -6456 -1772 -3915 -8728 -4851 -6862 -8533 -8218 -10358 -10608 -9481 -13251 -11309 -548 4520
15525D520p490l337p69J646O562J725M824k379j514k372l528q178j394l53k017
15510a4054M814N818j218k043m796N145P794K888j816n529J452m726o56K845k022
15495f104j695K576J367k781k954j430j029N05J415J859O970J799o272m024L049
15480f749N370k800n23k670j299j160K578N509p82l494L337k863q913j857L627
15465a2689J0486K503l787M332j570m09K704j169k492l839K2k32R89M036M046
15450B931n809p556R32K356J714Q410J503k863P09K313p340q870j546j173K654
15435a1635M26K244M349L434K741K384l676k686m823K827M670om970r43m1M410
15419a295O746j718m596l158k510O545L96l749n812m221k392p28N423m117j533
$$ plain form
15525 4520 -2970 -6307 -7076 -5430 1132 2857 7681 5302 3788 1416 -2112 -10290 -11684 -12037 -14054
15510 -14054 -9240 -3422 -4640 -6683 -11479 -6334 1460 4348 2532 -2997 -1545 -6271 -6927 -4082 -6104
15495 -6104 -7799 -5223 -3856 -6637 -9591 -11021 -12050 -11545 -10130 -8271 -1301 498 -5774 -9798 -6749
15480 -6749 -1379 -4179 -4702 -7372 -8671 -9831 -7253 -1744 -2526 -6020 -2683 -5546 -14459 -16316 -12689
15465 -12689 -2203 300 -3487 845 -725 -1134 1570 401 -2091 -5930 -5908 -6140 -5151 -1115 2931
15450 2931 -2878 -10434 -9502 -7146 -5432 2978 4481 1618 2327 4640 -2700 -11570 -13116 -14289 -11635
15435 -11635 -11209 -8965 -4616 -1182 1559 3943 267 -2419 -7242 -4415 255 249 -4721 -5664 -5705 -1295
15419 -1295 5451 3733 -863 -4021 -6531 14 410 -3339 -9151 -13372 -15764 -16492 -11069 -15186 -16719
15404a6719N290J486j386K008m01N74M87j980Q078L964K502m521p430o039J775
15389a2312L811L267j237M250k262q74j999L26N625M418M674M393p258m756l192
15374c126Q11J62R91L072K571l953m535K679j235m836K937r89o45M608K813L69
15358A694k262p589n290L021N461L502J467l701j515K451k04n6k598k037k253
15343i909o08K087N568N352L33l7M119o143q29L078R30m260j686M20j298K678
15327b05Q706K613l102j64p247l987p15n242L535L174k442n065k167N645L514
15312c149m658n708O45J347M723J873l153L578M053K409l848j0327p482P143R750
15297b804q91J824l368O00R609N751L1o373k611M357j027l987M192P4O24l924
$$ plain form
15404 -16719 -11429 -9943 -11329 -9321 -9722 -9148 -8661 -10641 -2563 1401 3903 -618 -8048 -14087 -12312
15389 -12312 -8501 -5234 -6471 -2221 -4483 -5357 -7356 -7030 -1405 3013 7687 12080 4822 66 -3126
15374 -3126 -2315 -2153 -1162 1910 4481 528 -4007 -1328 -2563 -7399 -4462 -5451 -6096 -1488 1325 1694
15358 1694 -568 -8157 -13447 -10426 -4965 -1463 4 -3697 -5212 -2761 -2965 -3021 -5619 -7656 -9909
15343 -9909 -10517 -8430 -2862 2490 2823 2786 6905 762 -67 3011 3941 -319 -2005 -1585 -2883 -205
15327 -205 8501 11114 8012 7848 601 -3386 -4101 -9343 -5808 -2634 -5076 -10141 -12308 -6663 -3149
15312 -3149 -7807 -13515 -12870 -11523 -6800 -4927 -8080 -4502 -449 1960 -1888 -12215 -19697 -12554 -2804
15297 -2804 -3695 -1871 -5239 -4639 4970 10721 10752 4379 1768 6125 5098 1111 5303 5377 6001 2077
15281B077k849L126J2429m26l425J83J922l330p338j909L558j57l025M749k450
15266C135l087r75K097l18R59J991l206l630J253K042L557r074n985O470M959
15251A88K198m255N2k46n012P23M162J124n583P154k99j0661J505N039k220K279
15235c852M521k805k031O62k633L639K515j526J0M146j8P6k011J796j156o065
15219d732k590N918m663o638L460j361mJ974k07m133J481N895M230K728M90j524
15203C24m285q087Q68J27J154L120M478O901j489k446J784K363J7L296P039j365
15187A3799j2058j2991l163M968O431m549j271L741Q386K543K99l132o208n738
15173h943P39j5P23J570J980j012j541n838k656m02M806J2849J388p56k395L071
$$ plain form
15281 2077 -772 2354 14783 14357 10932 11115 13037 9707 2369 460 4018 3861 836 5585 3135
15266 3135 48 -927 1170 852 1811 3802 596 -3034 -1781 261 3818 -5256 -11241 -4771 188
15251 188 2386 -1869 -1817 -2063 -7075 -6352 -2190 -1066 -6649 505 206 -10455 -8950 -3911 -6131 -3852
15235 -3852 669 -2136 -4167 -3505 -6138 -2499 16 -1510 -1500 2646 2628 2704 693 2489 1333 -4732
15219 -4732 -7322 -1404 -6067 -12705 -9245 -10606 -10610 -8636 -8843 -12976 -11495 -5600 -1370 1358 1848 324
15203 324 -3961 -12048 -11180 -11053 -9899 -6779 -2301 4600 3111 665 2449 4812 4829 8125 15164 13799
15187 13799 1741 -11250 -14413 -9445 -3014 -7563 -8834 -5093 3293 5836 6135 3003 -3205 -8943
15173 -8943 -8204 -8219 -7496 -5926 -3946 -4958 -6499 -12337 -14993 -15395 -10589 2260 3648 2892 497 3568
15157C568N215l452l636P13l08J349m64n995j550o324K139Q636k046o742l77O109
15141c165J1510M769j1110r930j390l310N153L410K518J924n94K695k98q933M821
15126a930M097J729L227n113k447k058J934n31L080j49k05j188M012k489r56l937
15110b924j593r01J990l566K49M904L322M285N942N62j860l997J0P80p394J09
15094h2k149l012J223J695K356l302k141k241M514M975n49P8M922J114o962L366
15078C805M869l562m135M79j195l282p051m528O872N342p701l650K95J0556N177
15063B291L599P001o838o044N817N204j244q464j860L461J847P55J481l655j407
15048A944n083r05l125M544L932M188K620o207p799J411j029m039k05J356R21
$$ plain form
15157 3568 8783 5331 1695 2408 2100 3449 2985 -3010 -4560 -10884 -8745 -109 -2155 -8897 -9274 -3165
15141 -3165 8345 13114 2004 -7926 -9316 -12626 -7473 -4063 -1545 379 -215 2480 2182 -6751 -1930
15126 -1930 2167 3896 7123 2010 -437 -2495 -561 -1092 1988 1839 1634 446 4458 1969 1013 -2924
15110 -2924 -4517 -5418 -3428 -6994 -6745 -1841 1481 5766 11708 12270 10410 6413 6423 7203 -191 -82
15094 -82 -2231 -5243 -4020 -2325 31 -3271 -5412 -7653 -3139 1836 1287 1365 6287 7401 439 3805
15078 3805 8674 5112 977 1456 261 -3021 -10072 -14600 -7728 -2386 -10087 -13737 -13442 -2886 2291
15063 2291 5890 12891 6053 9 5826 11030 9786 1322 -538 2923 4770 5525 7006 3351 1944
15048 1944 -3139 -4044 -7169 -2625 1307 5495 8115 1908 -5891 -4480 -5509 -9548 -9753 -8397 -7476
15033g476M352J273l805j789N135K331J532L462n10p915l40K023K812J500k886
15018c01l963o2O056J231m493j389O02L16o82k206m193l639j064L132L539M957
15002b159K788l993n560L400L779m795K825N950q89l198o342n522K520K946M092
14987d158O85l187M29k190n298j057L024Q821M573n68K185k201l744k97l789j323
14971h095j290L359j907L315l482O635O269k880o013j372j11l088K957M897k75
14956a081M613J878n059k330L41L80K459k593k523k703n479m607k909Q35J397
14941a7381L590L845q23P174J698l710mJ299m133l142k223O666J422j284m595
14926a1601O199m28l014l23J984J175J216j969k295N753L333K695M726n374L396
$$ plain form
15033 -7476 -3124 -1851 -5656 -7445 -2310 21 1553 5015 4505 -3410 -3750 -1727 1085 2585 -301
15018 -301 -4264 -4326 1730 2961 -1532 -2921 -2319 -2003 -2685 -4891 -9084 -12723 -13787 -10655 -7116 -2159
15002 -2159 629 -3364 -8924 -5524 -1745 -6540 -3715 2235 1346 -1852 -8194 -13716 -11196 -8250 -4158
14987 -4158 -3473 -6660 -6231 -8421 -13719 -14776 -11752 -2931 1642 1074 3259 1058 -2686 -2983 -6772 -8095
14971 -8095 -9385 -6026 -7933 -4618 -8100 -1465 4804 1924 -4089 -5461 -5572 -8660 -5703 -806 -1081
14956 -1081 3532 5410 351 -1979 -1638 -1258 1201 -1392 -3915 -6618 -12097 -16704 -19613 -18778 -17381
14941 -17381 -13791 -9946 -10769 -3595 -1897 -5607 -5611 -4312 -8445 -11587 -13810 -7144 -5722 -7006 -11601
14926 -11601 -5402 -5830 -8844 -9167 -7183 -6008 -4792 -6761 -9056 -3303 30 2725 7451 2077 5473
14911E473K46k442k62Q3n949p085p94j24P02j43N115l392O10J20L081l730L233
14894e258J399m798N334P616K053j050m476m874L836k85k505k035L084m631j564
14879h154l341L148l75L901k984K272M770K657n066m495L164q16N490J612j897
14864a14l055k589M49j790l296k37m0j713J783j191l879J501J372J478k221m11
14848a3953k135J272N981M875j090J340j125J302O554N42K366k177l67r869j724
14833h208N365N469m919m609J450K231o94k37M258k658r744J626P018L950N91
14818H89n81l548K387J675N97L41o748k469k919k946J867K790M232o239Q696j814
14802c790k228j727j591L907m04K834l94p05K34J209K054N787K737j465n526q115
$$ plain form
14911 5473 5719 3277 3015 3098 -2851 -9936 -10730 -10854 -10152 -10295 -5180 -8572 -7962 -7842 -4761 -8491 -5258
14894 -5258 -3859 -8657 -3323 4293 6346 5296 820 -4054 -218 -503 -3008 -5043 -1959 -6590 -8154
14879 -8154 -11495 -8347 -8722 -4821 -7805 -5533 -763 1894 -3172 -7667 -4503 -5319 171 1783 -114
14864 -114 -3169 -5758 -5309 -7099 -10395 -10632 -10672 -12385 -10602 -11793 -15672 -14171 -12799 -11321 -13542 -13953
14848 -13953 -16088 -14816 -8835 -3960 -5050 -3710 -4835 -3533 3021 3563 5929 3752 3385 -6484 -8208
14833 -8208 -2843 2626 -2293 -6902 -5452 -3221 -3915 -4152 106 -2552 -12296 -10670 -3652 298 889
14818 889 308 -3240 -853 822 1419 1760 -4988 -7457 -10376 -13322 -11455 -8665 -4433 -10672 -1976 -3790
14802 -3790 -6018 -7745 -9336 -5429 -5833 -2999 -3393 -4098 -3864 -2655 -601 5186 7923 6458 932 -7183
14786g183j981P780k941k936K778K474j275r233n530Q584O438J702L333j833q085
14771g908L772q91l201L529j126L176J617q25n635k488O112J304r35M907K994
14756D402n599m214L16N21p03l75l258J670L668O121n647l355N058K008J653O85
14740B951P35P88K276R17q222j026l345p254m228M564P238P978l420m439L264
14725a223M231J845J073o035o515o142K774L542M972N120r181L054J07n706o152
14710a4236J119O372M951J878J694n454j0910J65N944J73L516K780r83l75N083
14695A717j547L678m622j901L309p51m744m380K880L672l69q93L24p196l464Q058
14679f229J460m22L473r39j382O477n72l737j774J078l049m048O680O316J173
$$ plain form
14786 -7183 -9164 -1384 -4325 -7261 -4483 -2009 -3284 -12517 -18047 -9463 -3025 -1323 2010 177 -7908
14771 -7908 -4136 -5027 -8228 -4699 -5825 -2649 -1032 -1857 -7492 -9980 -3868 -2564 -3499 1408 4402
14756 4402 -1197 -5411 -5095 -4574 -5277 -5652 -8910 -7240 -3572 2549 -3098 -6453 -1395 613 2266 2951
14740 2951 3686 4474 6750 7667 -555 -1581 -4926 -12180 -16408 -11844 -4606 3372 -48 -4487 -1223
14725 -1223 3008 4853 5926 -109 -6624 -12766 -9992 -6450 -1478 3642 -5539 -2485 -2378 -8084 -14236
14710 -14236 -13117 -6745 -1794 84 1778 -3676 -14586 -14421 -8477 -8304 -4788 -2008 -2991 -3366 1717
14695 1717 170 3848 -774 -2675 634 -117 -4861 -9241 -6361 -2689 -3058 -3951 -3627 -10823 -14287 -6229
14679 -6229 -4769 -5191 -1718 -2657 -4039 2438 1866 -1871 -3645 -2567 -5616 -9664 -2984 3332 4505
14664D505L403O798k498m268l509M684L434J677L468M67l442m597q775o635K920
14649b368M05k275M412n296q308N450P582J342k402J600j43J360k494k797k759
14634f691k186l614J705P003J912J130J145j512l647o357L403K874O001N520J665
14619H351o389k815K284K454k425o85L527m950j934o51K806n480q569m66O3m158
14603a9037J578J3J0088R195j677p726l433N986O332k419q58M622o60J535m580
14588a041K161J065j280r132j569J740m62M49M814L662M069l474n167j491J361
14573d295K616N80l035J32k889R44L756k005p054L442O310l49l331J94k085M527
14557b542o11O27l013l044M542P339L61Q06M110M793k930n896O391L653n96O150
$$ plain form
14664 4505 7908 14706 12208 7940 4431 9115 12549 14226 17694 18161 14719 10122 1347 -5288 -2368
14649 -2368 -1963 -4238 174 -5122 -13430 -7980 -398 944 -1458 142 -1 1359 -1135 -3932 -6691
14634 -6691 -8877 -12491 -10786 -3783 -1871 -741 404 -1108 -4755 -11112 -7709 -4835 1166 6686 8351
14619 8351 1962 -853 1431 3885 1460 775 4302 -648 -2582 -3233 -427 -5907 -14476 -14942 -14879 -19037
14603 -19037 -17459 -17446 -7358 1837 160 -7566 -10999 -5013 1319 -1100 -1958 2664 2004 3539 -1041
14588 -1041 1120 2185 905 -8227 -9796 -8056 -8518 -8069 -3255 407 4476 1002 -4165 -5656 -4295
14573 -4295 -1679 -1099 -4134 -4002 -6891 -5947 -2191 -4196 -11250 -7808 -1498 -1847 -5178 -4984 -7069 -2542
14557 -2542 -3153 -2526 -5539 -8583 -4041 3298 3659 4465 8575 13368 10438 4542 10933 14586 13990 20140
14541B0140M720q44L975R085J0880J0831J2229J8668P777P955O839r33n198j1785
14527I4339j8388k0061j2816q151r105l389p030r664l506K096J1045J750q42r216
14513G062m386j059J087J036N70l019J191R025K856j3967j011K858n2K187m566
14498a88j422j214J962L887J439k152m85O042j659j580k339K070j600n309K616
14483F8j99l341J65j264J468j411p67k399j284K149K121J0461P31J175n36L525
14467A0662n404k257P867Q206q370o370L720k259J405L018q469P93q32r72K883
14452C621p336K16R080K585Q4l031P799L389o439n171K105J591k63n910p119j104
14436e903J565M281k223n9P89P93L652k412o389K071J1210P294n796n780m620
$$ plain form
14541 20140 24860 24016 27991 37076 47956 58787 71016 89684 97461 105416 112255 111322 106124 94339
14527 94339 75951 55890 43074 34923 25818 22429 15399 5735 2229 4325 15370 17120 16278 7062
14513 7062 2676 1617 2704 3740 4310 1291 2482 11507 14363 396 -615 2243 2191 4378 -188
14498 -188 -1610 -2824 -862 3025 4464 2312 1827 7869 6210 4630 2291 4361 2761 -2548 68
14483 68 -131 -3472 -3307 -4571 -3103 -4514 -5281 -7680 -8964 -6815 -4694 5767 6498 7673 7137 10662
14467 10662 5258 3001 10868 19074 10704 4334 8054 5795 7200 10218 1749 2542 1710 738 3621
14452 3621 -3715 -3499 5581 8166 8250 5219 13018 16407 9968 4797 6902 8493 8230 2320 -4799 -5903
14436 -5903 -4338 -57 -2280 -2339 -1550 -757 2895 483 -5906 -3835 7375 14669 8873 3093 -1527
14421a527L883K542K576L04M392J148k387m505j359K28J136l81J236l869P387
14406A0804M180q679j908O903O057K564l226l704k934J058M570N817n687l507
14392A2308M441M751N495l946j333j70n307k210M048N794O43l990O35N639J591
14377B8389j029j139m214N431l67J638J24l595K88L312J1519M827l929l493m499
14362C3263p608j527M167P664K161M61L321K31n272k281M287M021j758k222j906
14347C7002j354o57p20r945o251L825J899R126L188k247m033Q99M391M73k739
14332C2857N42j225K90j802k401P83r569o665L382L451K974q268J544M414l404
14317A6903J660N48N793k853p632j0714m129k18K615p75O9J1964L734p878m281
$$ plain form
14421 -1527 2356 4898 7474 7778 12170 13318 10931 6426 5067 5295 6431 6050 7286 3417 10804
14406 10804 14984 6305 4397 11300 17357 19921 16695 12991 10057 11115 15685 21502 15815 12308
14392 12308 16749 21500 26995 23049 21716 21546 16239 14029 18077 23871 24514 20524 21159 26798 28389
14377 28389 27360 26221 22007 27438 27071 28709 28833 25238 25526 28838 40357 45184 41255 37762 33263
14362 33263 25655 24128 28295 35959 38120 38581 41902 42133 36861 34580 38867 42888 41130 38908 37002
14347 37002 35648 34991 34271 24326 18075 21900 23799 32925 36113 33866 29833 30732 35123 35596 32857
14332 32857 33399 32174 32464 30662 28261 29044 19475 12810 16192 19643 22617 14349 15893 20307 16903
14317 16903 18563 19111 24904 22051 14419 3705 -424 -642 1973 1198 1267 13231 16965 9087 4806
14302D806J854P87n84l813k647K895J457O273L713M023k838m931l082m055p37
14287C121m558O923P291k942l913O662M913l154J099L403n159n374O41K396k585
14272H764p554l82o980m29m24q80m396O961O980o911j88K387k681L282O343j553
14256B339j347J154J51l636n553N425L231l591J591P976M711J993o834k69m34
14241F907j480J101K729n387m84p816l283L53k178J541K490J392K797J418p003
14226f903n227Q764K947K895K56K31P44n16J21j895n370Q49O248L853j387l772
14210A838q871J130L712l651j298M136m729k894K616M545N502k91n471j700j549
14195f975j33k595l728M527M172L0l99n08M369p043P63N879k633k93j474L594
$$ plain form
14302 4806 6660 7447 6863 3050 403 3298 4755 11028 14741 18764 15926 10995 7913 3858 3121
14287 3121 -1437 5486 12777 9835 5922 12584 17497 14343 15442 18845 13686 8312 8953 11349 8764
14272 8764 1210 828 -6152 -6581 -7005 -7885 -12281 -5320 1660 -5251 -5439 -3052 -5733 -2451 3892 2339
14256 2339 992 2146 2297 -1339 -6892 -1467 1764 -1827 -236 7740 12451 14444 7610 7341 6907
14241 6907 5427 6528 9257 3870 3386 -4430 -7713 -7360 -9538 -7997 -5507 -4115 -1318 100 -6903
14226 -6903 -12130 -3366 -419 2476 2732 2963 3707 3191 3312 1417 -3953 -3104 3144 6997 5610 1838
14210 1838 -7033 -5903 -2191 -5842 -7140 -3004 -7733 -10627 -8011 -3466 2036 1745 -3726 -5426 -6975
14195 -6975 -7108 -9703 -13431 -8904 -4732 -4702 -5101 -5609 -1240 -8283 -7520 -1641 -4274 -4567 -6041 -2447
14179b447j886j126j862j323L830L969O798k251o662l727N902k542p005o23J45
14164a0810J128K403J739R262O256m036l843o464L979J186L741j941o814K541
14150a673p91k455k1P85K8m12N634k441m004n393m230J1935O26n879k834K086
14134i039P207J748j824L356k620K194j729J391N090k580n705p419l606L985K346
14119g205J273N772J415J94j824K48M13n525j519L352N555M392j761o848l453
14104e521j084l253K728J0199L012m248l493K599r01k491P29J148j002K57m374
14089e695M391N89O77P03m418j736m5K958k588J322L046M924m349j372l639j860
14073g092L710l142q545M287M399j23j33k944l156J29J246O511N398l38p267J201
$$ plain form
14179 -2447 -4333 -5459 -7321 -8644 -4814 -845 5953 3702 -2960 -6687 -785 -3327 -10332 -10955 -10810
14164 -10810 -9682 -7279 -5540 3722 9978 5942 2099 -4365 -386 800 4541 2600 -4214 -1673
14150 -1673 -2464 -4919 -4940 -4155 -4127 -4539 1095 -1346 -5350 -10743 -14973 -3038 -2412 -8291 -11125 -9039
14134 -9039 -1832 -84 -1908 1448 -1172 1022 -707 684 5774 3194 -2511 -9930 -13536 -9551 -7205
14119 -7205 -5932 -160 1255 1449 -375 -127 286 -5239 -6758 -3406 2149 6541 4780 -2068 -5521
14104 -5521 -6605 -9858 -7130 3069 6081 1833 -1660 939 38 -2453 -1724 -576 -1578 -1321 -5695
14089 -5695 -1304 -715 -38 665 -3753 -5489 -5534 -2576 -5164 -3842 -796 4128 -221 -1593 -5232 -7092
14073 -7092 -3382 -6524 -15069 -10782 -6383 -6506 -6639 -9583 -12739 -12610 -11364 -4853 545 207 -7060 -5859
14057e859M178K770n836m250K366J590m873l004L59P25K359Q838L899M63l22r16
14041B487J64M148l20K770r30J292q55j0345m603m19j393K786M096r254r65L390
14025g951j823M436O586Q76n638k851m202j161J49j813J625Q310Q145r446r141
14010a3899m46K851M957O688N079k709p985n760o208L524O378k906N7L171J837
13995e371N906N72J566M867k274k623k601p505m469l095J0041P063J215K138l61
13980E069J229p606j558J3062M768m729p216p438n83N501K444k048k092k528m283
13965h008j285J496N735L060L01K347j966J081o099l59J531J123J080K214J744
13950C995k156l454j007N07L134N174K757p875q7K093o302p606o520Q249K424
$$ plain form
14057 -5859 -1681 1089 -4747 -8997 -6631 -5041 -9914 -12918 -12559 -11834 -9475 -637 3262 3725 3403 2487
14041 2487 2651 6799 6479 9249 8319 9611 8756 -1589 -6192 -6611 -8004 -5218 -1122 -10376 -11341 -7951
14025 -7951 -9774 -5338 1248 2124 -3514 -6365 -10567 -11728 -11579 -13392 -11767 -3457 4688 -4758 -13899
14010 -13899 -14345 -11494 -6537 151 5230 2521 -5464 -11224 -17432 -13908 -7530 -10436 -10379 -7208 -5371
13995 -5371 535 1107 2673 7540 5266 2643 42 -7463 -11932 -15027 -4986 2077 3292 5430 5069
13980 5069 6298 -1308 -2866 10196 14964 10235 3019 -4419 -5002 499 2943 895 -1197 -3725 -8008
13965 -8008 -9293 -7797 -2062 998 1299 3646 1680 2761 -3338 -3697 -2166 -1043 37 2251 3995
13950 3995 1839 -1615 -2622 -2115 1019 6193 8950 1075 988 3081 -3221 -10827 -17347 -9098 -6674
13935f674m170J948J594Q67K536j802q428K31J045N23K894M087M577J813J363
13920B404m436M145n144J037M010N13m828L2m53M674L473L130L316r124m073L879
13904B555p099r060n414O77J943M583R747M53J877J457o126n243j757L470l712
13889a1649k821N39l235L268k017o06O530J314L003j332K82n84J930K6n986J41
13873a1197k435O4L606j949p27L204J90p25O545K611m547o330L007N846L87l799
13857f249L638J867n015o553M249M649K221k425j93J172K416N282k890o735k560
13842g126m847K350m70l685M837n027k983l04Q213Q275P329n705J827J204J108
13827D996n8j660k174n149J46j136o304m924L462O148j600K963L594l017J396
$$ plain form
13935 -6674 -10844 -8896 -7302 -6435 -3899 -5701 -14129 -13898 -12853 -12330 -9436 -5349 -772 1041 2404
13920 2404 -2032 2113 -3031 -1994 2016 2529 -2299 -2267 -2720 1954 5427 8557 11873 2749 -1324 2555
13904 2555 -4544 -13604 -19018 -18341 -16398 -11815 -2068 -1615 262 1719 -4407 -9650 -11407 -7937 -11649
13889 -11649 -14470 -13931 -17166 -13898 -15915 -16521 -9991 -8677 -5674 -7006 -6724 -7308 -5378 -5352 -11338 -11197
13873 -11197 -13632 -13568 -9962 -11911 -12638 -9434 -9244 -9969 -3424 -813 -5360 -11690 -8683 -2837 -2450 -6249
13857 -6249 -2611 -744 -5759 -12312 -8063 -3414 -1193 -3618 -3811 -2639 -223 5059 2169 -4566 -7126
13842 -7126 -11973 -9623 -10093 -13778 -8941 -13968 -16951 -17255 -9042 -767 6562 857 2684 3888 4996
13827 4996 4938 3278 1104 -4045 -3899 -5035 -11339 -16263 -12801 -6653 -8253 -5290 -1696 -4713 -3317
13812c317N709L626J930o165m843J140K664L019J663n208r222j945J718j825J322
13797i734O92M866M121O645q17m765k277j482j756j982k564L086l668M794q73
13782e714j642R31k617M765K218o745j283M953P770K312m440j223J358m391r51
13767d699n274N01M864J557K048N797J31K057n809k254J657j624l894m88j665
13752g095L154N147N441o723j41j640p296P08R059l490l342j83K192O579j417
13737I53j997L269l236m115l55o359K103k472q54m165L368L858N484K022J601
13722h95N491J890M77m496j542J088j562o358m941P170P127m565J685m41k814
13707b686l587n734k379J73K641P10J461l113n288L544O197l490M025q66k483
$$ plain form
13812 -3317 2392 6018 7948 1783 -3060 -1920 744 3763 5426 218 -9004 -10949 -9231 -11056 -9734
13797 -9734 -9042 -4176 -55 6590 5773 1008 -1269 -2751 -4507 -6489 -9053 -5967 -9635 -4841 -5714
13782 -5714 -7356 -6425 -9042 -4277 -2059 -8804 -10087 -5134 2636 4948 508 -715 643 -3748 -4699
13767 -4699 -9973 -9472 -4608 -3051 -1003 4794 4925 6982 1173 -1081 576 -1048 -4942 -5430 -7095
13752 -7095 -3941 1206 6647 -76 -217 -1857 -9153 -8445 614 -2876 -6218 -6401 -4209 2370 953
13737 953 -1044 2225 -1011 -5126 -5481 -11840 -9737 -12209 -13063 -17228 -13860 -10002 -4518 -2496 -895
13722 -895 4596 6486 6963 2467 925 2013 451 -5907 -10848 -3678 3449 -1116 569 128 -2686
13707 -2686 -6273 -12007 -14386 -14213 -11572 -10862 -9401 -12514 -17802 -14258 -8061 -11551 -7526 -8392 -10875
13692a0875J853P149j090n535n480J060k641O24j291M233L811M408M251J056J256
13677B789m845l294j52n653M04J1181M048r717j879Q02k25o554J14l405j819O095
13661a2110k249L679J0527N761m246m000N346q81nm442m367j210J1823N14m314
13646a74K852k129l902n663R76K937l406k817K500N153K789L871l251o840j387
13631h491O01l570j494M151k606J134J0831N610P007l577r285p74J81p86o18k443
13615d129o16n865M924M249j765K807J155k23o348K93K366O752M630J997M471
13600A4698n835n62j25J267n566o457N33k768m09J601L604K71p719l431k64J403
13584i759K018P173k077l104K958Q27J967K636o34j083j19L369K657l215k701
$$ plain form
13692 -10875 -9022 -1873 -2963 -8498 -13978 -12918 -15559 -14935 -16226 -11993 -8182 -3774 477 1533 2789
13677 2789 -2056 -5350 -5502 -11155 -10751 430 4478 -5239 -7118 -6316 -6541 -13095 -12981 -16386 -18205 -12110
13661 -12110 -14359 -10680 -153 5608 1362 -2638 2708 1827 1822 -2620 -6987 -8197 3626 4140 -174
13646 -174 2678 549 -3353 -9016 -8040 -5103 -8509 -11326 -8826 -3673 -884 2987 -264 -7104 -8491
13631 -8491 -7890 -11460 -12954 -8803 -11409 -10275 556 6166 13173 9596 311 -463 -282 -1068 -1686 -4129
13615 -4129 -4745 -10610 -5686 -1437 -3202 -395 760 537 -5811 -5518 -3152 3600 8230 10227 14698
13600 14698 8863 8301 8176 9443 3877 -2580 -2047 -4815 -5224 -3623 -19 252 -7467 -10898 -11162 -9759
13584 -9759 -7741 -568 -2645 -5749 -2791 -1964 3 2639 2005 922 803 4172 6829 3614 913
13569I13n87M70L889j697Q266J408k512J68Q217J346m325K494M329J689k460l631
13553A7977K67k610p427j784o20P235o24m234j877q293j167R342M453k459R3k064
13537F208j480k524J449k18l655J24o285N301R72r329m222Q491M913L143P842
13522A0730j231l977j024O64P579N910k035M134R520R242k408n547m963j2234
13508A4360M57l89m356r249k361m162n204R6N841L501k097K5P88J108n10J160
13492i92p290M258L502N203J357K096Q03p549L18J0931M11l602M178l162r452
13477A010k081k724L362N727L319n055M381L209j805L431K111q544j0486J536
13463b609j931m618N092L223l492o11L015J635j30j270l7j526J0060n22j013k903
$$ plain form
13569 913 326 796 4685 2988 11254 12662 10150 10318 18535 19881 15556 18050 22379 24068 21608 17977
13553 17977 18244 15634 8207 6423 5803 13038 12414 8180 6303 -1990 -3157 6185 10638 8179 8272 6208
13537 6208 4728 2204 3653 3435 -220 -96 -6381 -1080 -108 -9437 -13659 -5168 -255 2888 10730
13522 10730 9499 5522 4498 5162 12741 18651 16616 20750 30270 39512 37104 31557 26594 14360
13508 14360 14817 14428 10072 823 -1538 -5700 -10904 -10808 -4967 -1466 -3563 -3538 -2750 -1642 -2152 -992
13492 -992 -8282 -4024 -522 4681 6038 8134 8937 1388 1706 12637 13048 9446 13624 10462 1010
13477 1010 -1071 -3795 -433 5294 8613 3558 7939 11148 9343 12774 14885 6341 -4145 -2609
13463 -2609 -4540 -9158 -4066 -843 -4335 -4946 -1931 -296 -426 -1696 -1733 -3259 6801 6279 5266 2363
13447B363m805J42l626L293p25L706L121q05Q65O263j599r403l488L571M43q98
13431a582M810j553k897q06j568m763N999N278j170L400J779m022m948R97J088
13416D2K833N090j341N243M020o92r24m359j091R71j357J976K873K364n450n549
13400D649m212j148N987J822r225l351J251k338N007o91J596m17M58M711O99o383
13384a585J070L601j977p366K91N458R17m964K532l764k875M634J712J898K505
13369B087K9M10K337K985P813Q94r14p635J948J719l768P41l242m230K049R05
13353D128L64k106M008j425j767j809K323O692l208m215j195N238j372l169k9
13338B458q179j542M335j168p090R115L430m351k580j175p70m043q86K988N177
$$ plain form
13447 2363 -2442 -2300 -5926 -2633 -3358 348 3469 2664 3529 9792 8193 -1210 -4698 -1127 -684 -1582
13431 -1582 3228 1675 -1222 -2028 -3596 -8359 -2360 2918 1748 5148 6927 2905 -2043 -1046 42
13416 42 2875 7965 6624 11867 15887 15195 14271 9912 8821 9792 8435 10411 13284 15648 10198 4649
13400 4649 437 -711 5276 7098 -2127 -5478 -4227 -6565 -1558 -2249 -653 -1070 -612 4099 4798 -1585
13384 -1585 -515 3086 1109 -6257 -5966 -508 409 -4555 -2023 -5787 -8662 -4028 -2316 -418 2087
13369 2087 2116 2526 4863 7848 15661 16555 15641 8006 9954 11673 7905 8646 5404 1174 3223 4128
13353 4128 4492 2386 6394 4969 3202 1393 3716 10408 7200 2985 1790 7028 5656 2487 2458
13338 2458 -5721 -7263 -2928 -4096 -11186 -2071 1359 -2992 -5572 -6747 -7517 -11560 -12446 -9458 -4281
13323d281Q925N684L503j686l117l092J853Q01n410p75l276o179J23j420n61J26
13307h782M595j902M757L331k911J227L241k297N410M267Q22p525N29J979m510
13292B231l547j79p57j110j241n6N417N263O148j772J429K757p266N37O497k240
13276A2111l234l668m006M185J937J243j73Q906N102l086k479j058P23M892P527
13261B8922N188L818M949O949J579O721O494q7r308j9163j0168Q92J690k923m427
13246B1126j447P70k040m382l28j493k109P882P87j1589k976J033M175m42L100
13231A2067O657k45q043j102M232j334J165M651j459l01l748j948L071q57k269
13216A0537j868o225j003L503L944k509j204j79J920l6K410j466m515k023O320
$$ plain form
13323 -4281 4644 10328 13831 12145 9028 5936 7789 8590 3180 2405 -871 -7050 -6927 -8347 -8908 -8782
13307 -8782 -4187 -6089 -1332 1999 -912 315 3556 1259 6669 10936 11758 4233 4762 6741 2231
13292 2231 -1316 -1495 -2252 -3362 -4603 -4659 758 6021 12169 10397 11826 14583 7317 7854 14351 12111
13276 12111 8877 5209 1203 5388 7325 8568 8395 17301 22403 19317 16838 15780 16503 21395 28922
13261 28922 34110 37928 42877 49826 51405 58126 64620 64533 55225 36062 25894 26786 28476 25553 21126
13246 21126 19679 20449 18409 14027 13699 12206 10097 17979 18766 7177 4201 5234 9409 8967 12067
13231 12067 18724 18479 10436 9334 13566 12232 13397 18048 16589 16288 12540 10592 13663 12806 10537
13216 10537 8669 2444 1441 4944 8888 6379 5175 4996 6916 6880 9290 7824 3309 1286 7606
13201G606O910l263l455K248q50P372M038l389l799O008N284k841k174k51N352
13186B4796J0136J11K353n09p494J316O336L192k580l03J257R326L46q790l612
13171C5881Q89j683O330j847p40L441L762P379J0169N227J5232J3091J5166J6697
13157A28994J2932J1935J3600K4292L4225M6659N6334O7506Q6772J06511J51051
13146G40811J97789K45530K79822K72717J95472P3652r2906k55964l53908l31228
13136I71787k47216j65237r5934o4675m8003k8078k4292j5799q844j0208j0735
13125B52766p105p525K217R850N903J0579J1904K6724K5484K0750K4594L3138
13113D09279L0106L8796N1374N3866O1771Q9156J07186J50060J89864K39500L13521
$$ plain form
13201 7606 14516 11253 7798 10046 9196 16568 20606 17217 13418 19426 24710 21869 19695 19444 24796
13186 24796 34932 35043 37396 36887 29393 30709 37045 40237 37657 37354 38611 47937 48283 39493 35881
13171 35881 36770 35087 41417 39570 38830 42271 46033 53412 63581 68808 84040 97131 112297 128994
13157 128994 141926 153861 167461 191753 225978 272637 328971 396477 483249 589760 740811
13146 740811 938600 1184130 1463952 1736669 1932141 2005793 1912887 1656923 1303015 971787
13136 971787 724571 559334 463400 398725 350722 322644 298352 282553 273709 263501 252766
13125 252766 245661 238136 240353 250203 256106 266685 278589 305313 330797 351547 376141 409279
13113 409279 439385 478181 529555 583421 645192 734348 841534 991594 1181458 1420958 1734479
13102A734479M18725N55212P02951Q27079Q37200O88463L61293j33971o92651
13093E298780j090542j120165q60000n53936l37781k16248j42552r8001q1626
13084G97929p4141n9446m0801l0870j9227j9749j0815k962J71Q024J2112J8385
13072E78610J9545K4150K1810K7257J9536J6643K7359L5854N9609O5926R2833
13061I89132J38946J75443K19843K88667L92884N22948O66586Q06463Q57427P48378
13051E806717M45231j9865n84605j042372j171775r65163o43699l96911k42027
13042A185531j64335j12449r2128p6191o2897n1629m0503l1091k2835p902j1522
13031E12049j2627o045l855J414R408J7516L706l583j732j0231j3578r157N03
$$ plain form
13102 1734479 2153204 2708416 3411367 4238446 5075646 5764109 6125402 5991431 5298780
13093 5298780 4208238 3088073 2228073 1674137 1336356 1120108 977556 879555 797929
13084 797929 723788 664342 623541 592671 573444 553695 542880 539918 540089 548113 560225 578610
13072 578610 598155 622305 644115 671372 690908 707551 734910 770764 830373 896299 989132
13061 989132 1128078 1303521 1523364 1812031 2204915 2727863 3394449 4200912 5058339 5806717
13051 5806717 6251948 6232083 5647478 4605106 3433331 2468168 1824469 1427558 1185531
13042 1185531 1021196 908747 816619 740428 677531 625902 585399 554308 531473 523571 512049
13031 512049 499422 493377 489522 490936 500344 517860 521566 517983 516251 506020 492442 483285 483788
13018D83788J3847J8941L4103M4118O4521P8998J18066J60999K02005K50895K79663
13007A749944K57052J66125K7157j65433l33902l93929l41294k44329j54389j02798
12997D64204o5404m8026k9900k4227k4292k0106j2904r320j3012r842m133m343
12985A98695p805o193m301j630K354q266j0506r305r508r639o539r315m858o796
12971A06388n996l969k996j966K344n13J96J059m234j1779j3241p623j1242r602
12957C6826M399O797m196j503j862n066n77K779J630j894n369n413O389l5k591
12942C0314o17l127m603K669j737l093M795M555l74l325Q081R202l796p590L184
12927C4538K428N51J913J1020Q80K92J89l959q252o040j2314p346N08K618k01
$$ plain form
13018 483788 497635 516576 550679 594797 659318 738316 856382 1017381 1219386 1470281 1749944
13007 1749944 2006996 2173121 2200278 2034845 1700943 1307014 965720 721391 567002 464204
12997 464204 398800 350774 320874 296647 272355 252249 239345 230025 217013 207171 203038 198695
12985 198695 190890 184697 180396 178766 181120 172854 162348 153043 143535 133896 127357 118042 113184 106388
12971 106388 100392 96423 93427 91461 93805 93292 93488 94547 90313 78534 65293 57670 46428 36826
12957 36826 41225 48022 43826 42323 40461 35395 34818 37597 39227 37333 31964 26551 32940 32905 30314
12942 30314 29697 26570 21967 24636 22899 19806 24601 29156 28782 25457 33538 42740 38944 31354 34538
12927 34538 36966 37517 39430 50450 51330 51622 51811 47852 39600 33560 21246 13900 14408 17026 16825
12912A6825o551N232K306j169J113K538j0444j0797O493J137L106K153N953n197
12898A2698p713n300M632P202M824q708p189M543N760L243M326j471j631J273
12884A6489K508P24M402N618P758N959n940p226o084m36p951j2673J884K138m580
12869B590k266L65J866N87k931k086K708Q440m395m875j594O222j578K66K233
12854E552Q5r76R648m42n959m049l675M223L641M906m678n021n070j843K554j554
12838b658L815N053J012l471P25K60j448L089o772p187O890M605K895p301p487
12823g980m083k821L354o135K303Q836k511L564Q918M331n940l170J431k44O209
12808F062j593p723J339L342n52k477l626l65L231L180M229m243q281J803R58
$$ plain form
12912 16825 10274 15506 17812 16643 17756 20294 9850 -947 5546 6683 9789 11942 17895 12698
12898 12698 4985 -315 4317 11519 16343 7635 446 4989 10749 13992 18318 16847 15216 16489
12884 16489 18997 19721 24123 29741 37499 43458 37518 30292 24208 23772 15821 3148 5032 7170 2590
12869 2590 324 689 2555 3142 211 -1875 833 9273 4878 3 -1591 4631 3053 3319 5552
12854 5552 5637 4661 14309 13867 7908 3859 184 4407 8048 12954 8276 3255 -1815 -3658 -1104 -2658
12838 -2658 1157 6210 7222 3751 4476 4736 3288 6377 -395 -7582 -692 3913 6808 -493 -7980
12823 -7980 -12063 -14884 -11530 -17665 -15362 -6526 -9037 -5473 3445 7776 1836 -1334 97 -147 6062
12808 6062 4469 -3254 -1915 1427 875 -1602 -5228 -5593 -2362 818 5047 804 -7477 -5674 -4716
12793d716J327P779J662L956R63n403m893j117M816q410l915K65N658K184p94
12778f38j50j411R7O578O200l440n023l661l288j0Q453m38j547m485L65M298J293
12761C193N073M23p247l20K596k135J461M414l039j227r44J950n31O1J297M382
12745I407k307o137N400L001q484j0553L715J807n134N7N96n843n23J868M215
12730h915R688K365r164j187L501K828k000m241K477N334p21K722o812n898l338
12715a3361M586M071P432K484o885Q01J961j199k803O243k092M94j416L136K355
12700E807o819o038J989M244m400K423k09m955R83j332N52K029P482K046j966
12685A836O4O83M654N286m65o116n303j565L389N260j394M202R602R87Q7j131
$$ plain form
12793 -4716 -3389 4390 6052 10008 10971 5568 675 -442 4374 -4036 -7951 -7686 -2028 156 -638
12778 -638 -788 -2199 -2102 4476 10676 7236 2213 -1448 -4736 -4746 3707 3269 1722 -2763 -2398 1900 3193
12761 3193 8266 8689 1442 1122 3718 1583 3044 7458 4419 3192 2248 4198 3667 3728 5025 9407
12745 9407 7100 963 6363 9364 880 -9673 -5958 -4151 -9285 -9228 -8632 -14475 -14998 -13130 -8915
12730 -8915 773 3138 -6026 -7213 -3712 -884 -2884 -7125 -4648 686 -35 2687 -4125 -10023 -13361
12715 -13361 -8775 -4704 2728 5212 -1673 -872 1089 -110 -2913 3330 1238 1732 316 3452 5807
12700 5807 -1012 -7050 -5061 -817 -5217 -2794 -3003 -7958 -6975 -8307 -7755 -5726 1756 3802 1836
12685 1836 1900 2583 7237 12523 12058 5942 639 -926 2463 7723 6329 10531 20133 21120 21207 20076
12669B0076l111o009J84j276p202Q86O438K137q39l109j691k313j309n321m47
12654b906J202J884M06O43M917k836L017k358j3152o1K687L856P8l566k749Q84
12638h054J873L66L783L155N529Q341M189N049P209N737J146l368K983K688j1300
12623B9326q825o010k012J90j497L851l491l380q747P83N782K461J647L258K593
12608A5929k220j651n193n60K334L506j431k176j486J0313k6j1515j512k047M060
12593F325K489K716l99J729N86K439P010L454L029M449N657J323K60l29n880q082
12577B6776l239j128l646n771p785J17O374J174p20n058p950m295L451J971K484
12562B755j395l200m464J867M413P402M618J804l000l806k130N527J2467K860
$$ plain form
12669 20076 16965 10956 11140 9864 2662 3548 9986 12123 11284 8175 6484 4171 2862 -2459 -2906
12654 -2906 -1704 180 586 1229 6146 3310 6327 3969 -9183 -9244 -6557 -2701 -2623 -6189 -8938 -8054
12638 -8054 -6181 -5815 -2032 1123 6652 14993 19182 24231 31440 37177 38323 34955 37938 40626 29326
12623 29326 20501 14491 12479 12669 11172 15023 11532 8152 -595 188 5970 8431 10078 13336 15929
12608 15929 13709 12058 6865 6305 8639 12145 10714 8538 7052 17365 17339 5824 4312 2265 6325
12593 6325 8814 11530 11131 12860 13446 15885 22895 26349 29378 33827 39484 40807 41067 40738 34858 26776
12577 26776 23537 22409 18763 12992 5207 5324 11698 12872 12152 7094 -856 -5151 -1700 271 2755
12562 2755 1360 -1840 -6304 -4437 -24 7378 11996 13800 10800 6994 4864 10391 22858 25718
12548B5718m202N555M477k14m578j200O259N031P272K902l728j206K711L842J264
12533D9903J524m427p518O393Q44K91J2536M52J920O205J606N043J212N899K3151
12518A05034K5723K2194K2602J5418M640m308j4828j1122o624j0543q247j775
12506A38164J117q868p822O11J08N00J1298J2856P800L97l164k397O916J4445
12492A71961J110R598J5812P520R079j091j0920p6J947J8610J5793J5962J1193
12479B66498J6459K5872L5106L0282L8719M4084J7474K114k4767n6698n5887l2410
12467C06846k4528j9325j0112j3045j2345o680k40N129K513j897p35j3871j0930
12454B00780j0466j3968j794l88n12m38M054l107n923o433j3469q244K183J704
$$ plain form
12548 25718 21516 27071 31548 31334 26756 25556 31815 36846 44118 47020 43292 42086 44797 48639 49903
12533 49903 51427 47000 39482 45875 46719 47010 59546 59998 61918 68123 69729 74772 75984 81883 105034
12518 105034 130757 152951 175553 190971 195611 191303 176475 165353 158729 148186 139939 138164
12506 138164 139281 130413 122591 123202 123310 123810 135108 147964 155764 156161 152997 150600 157516 171961
12492 171961 173071 182669 198481 206001 215080 213989 203069 202993 204940 223550 239343 255305 266498
12479 266498 282957 308829 343935 374217 412936 457020 474494 476608 451841 395143 339256 306846
12467 306846 282318 262993 252881 239836 227491 220811 220571 225700 228213 226316 225581 211710 200780
12454 200780 190314 176346 174552 174164 173652 173214 177268 174161 168238 161805 148336 140092 142275 143979
12440A43979Q077Q754O270J1296P413O775L456L962j167p41L976p447k8727k5564
12426A40312k2244j7269j2008K72K476r739n112q350n180n544R00K146%l900k096
12411E4664n332J070l591J757L51n578p602q187j872j079L536J805k983K464N166
12396C4589M577p364p645q900j038k35q05o248o533O083O734k55M856k340k385
12381A3091M488R75q203o393O64k596L091L969K18K972m334J131q38P72n19K6
12365H514l88J982L221m250k762L610L634l73q286j340N31M399N788M56n731l482
12349E523r28L477j605n168N07K872M302J540m776j406K84J541P73m979p40J723
12333B940L54N272J2700m117j1008o287l265R414L597p380n596j631K343J518
$$ plain form
12440 143979 152056 160810 167080 178376 185789 192564 196020 199982 198815 198074 202050 194603 165876 140312
12426 140312 118068 100799 88791 89063 91539 81800 76688 68338 63158 57614 58514 60660 60660 56760 54664
12411 54664 49332 50402 46811 48568 48919 43341 35739 27552 25680 24601 28137 29942 26959 29423 34589
12396 34589 39166 31802 24157 15257 14219 13984 13179 6931 398 6481 13215 12960 17816 15476 13091
12381 13091 17579 18554 10351 3958 4622 2026 5117 9086 9304 12276 7942 9073 8235 9007 8488 8514
12365 8514 8126 10108 13329 9079 6317 9927 13561 13188 4902 3562 4093 8492 14280 14736 9005 5523
12349 5523 4595 8072 6467 1299 1806 4678 8980 10520 5744 4338 4622 6163 6936 1957 1217 2940
12333 2940 3294 8566 21266 17149 6141 -146 -3411 6003 9600 2220 -3376 -5007 -2664 -1146
12319a146O319M745k703k323N479L879m321k223N503L998J134L24J791L235m54
12304B3237j016Q121n048q589n932N026m297m239l86N49N007O85l792K819l459
12289H686m921j601N545M204l89p348M429J1531J701k231J018k365j600q941J965
12274I683J029N97m016o933M555P923J426q44m722l519K318J980J625K74n652
12259E724n443r469j152M866P05L764M100P895n223p383n144Q340k876L569K897
12244E170J737j981j834J164l355n467M043O747K909k37K985M211o324m129j944
12229C695k132J976J2714K770n489O41j922l731L20L547n919L499K399L450m832
12214A0986n048L337L496M146m838l768q224J849L85l406m536m820N039R91M63
$$ plain form
12319 -1146 5173 9918 7215 4892 10371 14250 9929 7706 13209 17207 18341 18665 20456 23691 23237
12304 23237 22221 30342 25294 16705 10773 15799 11502 7263 6877 7426 12433 13118 9326 12145 8686
12289 8686 3765 2164 7709 11913 11524 4176 8605 20136 21837 19606 20624 18259 16659 7718 9683
12274 9683 10712 11309 7293 360 4915 12838 14264 13420 8698 5179 7497 9477 11102 11376 5724
12259 5724 281 -9188 -10340 -5474 -4769 -1005 3095 10990 5767 -1616 -6760 1580 -1296 2273 5170
12244 5170 6907 4926 3092 4256 901 -4566 -523 6224 9133 8896 11881 16092 9768 5639 3695
12229 3695 1563 3539 16253 19023 13534 14175 12253 8522 8842 12389 6470 9969 12368 15818 10986
12214 10986 5938 9275 12771 16917 12079 8311 87 1936 2321 -1085 -5621 -10441 -5402 -4411 -3948
12199c948r25J912P067P753P718L010k742j616J257o040o70o496n130n159O400
12184B391N773m105m038M430P80l695l673j330J230J414M906L77k809m469r70
12169c788L213L0J247Q353j858n722n271L35M532M001J305J004K206RJ92J07J546
12152A1441J995j250m892o26m275m006J079L490j22O06L90M128K351l258p986
12137i35J93K845k922o97J987N571O19m637k500M304k622l904J9l547m13Q018
12121A379L127k643J456J795o93o712m888N490O280m4N967J754k020j880M790
12106A3158K816m872m973N768p222n243O781o496r996k522K005J1409q62R60k64
12091D47L273M04K780m3p70P95L071J299m700K958j426n216k582q26J426K512
$$ plain form
12199 -3948 -4873 -2961 4106 11859 19577 22587 19845 18229 19486 13446 12776 6280 1150 -4009 2391
12184 2391 8164 4059 21 4451 5231 1536 -2137 -3467 -2237 -823 4083 4460 1651 -2818 -3788
12169 -3788 -575 -545 702 9055 7197 1475 -3796 -3461 1071 5072 6377 7381 9587 9596 9788 9895 11441
12152 11441 13436 12186 7294 6668 2393 -1613 -534 2956 2834 3440 3830 7958 10309 7051 -935
12137 -935 -742 2103 -819 -1516 471 6042 6661 2024 -476 3828 1206 -2698 -2679 -6226 -6639 1379
12121 1379 4506 1863 3319 5114 4421 -2291 -7179 -1689 4591 4547 10514 12268 10248 8368 13158
12106 13158 15974 11102 6129 11897 4675 -568 6213 -283 -10279 -12801 -10796 613 -249 711 447
12091 447 3720 4124 6904 6861 6091 6886 9957 11256 6556 9514 8088 2872 290 -536 890 3402
12075C402m634j47P364N443j062m856n732n397J110K022l34L373K852k736l762
12060c094j825N214l738J0426O132n09k308k290J945m286p506l507r12N36N615
12045a07L114K169n912k396k35L855o17l312M18m109L447J214K727M72l264O069
12029C533J2516K863m648m602J12J264K791p49n407n542J884R84L963m590l584
12014G88M571O663l594p815k515O964L189l160K504O756j017q449k735N577k110
11999E617q852J411L982M269N33k33K605k698n958O906J668n428q38J050K319
11984F353M278L397J19J554m365o086K205l090J164m021q50M310l532K350J710
11969E496L66M360q53k065l076N18J654m172k805o91J954O986K855k961K905l397
$$ plain form
12075 3402 -1232 -1379 5985 11428 10366 5510 -222 -5619 -4509 -2487 -2821 552 3404 668 -3094
12060 -3094 -4919 295 -3443 6983 13115 12606 10298 8008 9953 5667 -1839 -5346 -6258 -5722 -107
12045 -107 3007 5176 -736 -3132 -3367 488 -129 -3441 -3023 -7132 -3685 -2471 256 728 -2536 3533
12029 3533 16049 18912 14264 9662 9774 11038 13829 13080 7673 2131 4015 4999 8962 4372 788
12014 788 5359 12022 8428 613 -1902 5062 8251 5091 7595 14351 13334 4885 2150 7727 5617
11999 5617 -3235 -1824 2158 6427 6960 6727 9332 6634 676 7582 9250 3822 2984 4034 6353
11984 6353 10631 14028 14147 15701 11336 5250 7455 4365 5529 1508 658 4968 1436 3786 5496
11969 5496 5862 10222 9369 7304 4228 4746 6400 2228 -577 -1268 686 7672 10527 7566 10471 7074
11953G074J848J922l20o906j372J676k007k016k235K89J741O173J1920K359n412
11938A4734m39q92l753j1750n129K185Q615R049L380M559L179j805l062p363m074
11923G434k7l737K022M24r5L311M515L834k899j536K612m62j905q069n30O65J65
11906E722O085O406l407j801m810P08Q076L964k638j199k027K97N75m158p196
11891D597q032K730N738L702k984M629l870l570j382m49M17M228m332l550p69
11876b897L95l345k904J872N196O070j369k905K665N770m33n001j537N634p68
11861F443o433m410J0596K074k093k238m651m822l253M629J0246Q87L44k669j934
11846B716j228O675L098l57J1451j085j935m982J849l885n221L15M575J580O324
$$ plain form
11953 7074 8922 10844 10524 3618 2246 3922 1915 -101 -2336 -2047 -306 5867 17787 20146 14734
11938 14734 14295 13403 9650 -2100 -7229 -5044 3571 12620 16000 20559 23738 21933 18871 11508 7434
11923 7434 7407 3670 5692 6116 6021 9332 13847 17681 14782 13246 15858 15396 13491 5422 4892 5557 5722
11906 5722 11807 18213 14806 13005 8195 8903 16979 20943 18305 17106 15079 15376 15951 11793 4597
11891 4597 -3435 -705 5033 8735 5751 10380 6510 2940 1558 1109 1526 5754 1422 -2128 -2897
11876 -2897 -2502 -5847 -8751 -6879 -1683 4387 3018 113 2778 8548 8115 3114 1577 7211 6443
11861 6443 10 -4400 6196 8270 6177 3939 -712 -5534 -8787 -4158 6088 6975 7319 4650 2716
11846 2716 1488 8163 11261 10904 22355 21270 19335 14353 16202 12317 7096 7411 11986 13566 19890
11831A9890j276N262K077j2688r383O466N608m469O63K046q009J091M783l207
11817H854K852j292N344N213m738j893p93k352m28p515P44M071N87q77Q50N1j64
11800H514k343J21j512M332M690m91j484m233l89p40Q387J1677O109n45q162r777
11784A4154P2k061k25L37p12M452N70M438J97l837j647p591j5q43K494n73m212
11767D998j652L362J855K579k720j00M153l154m500k767M917J1477J237m253p353
11752H079J309R17j237m368j170j493j580k948J726Q931L730n568k641Q10O450
11737A0947R047r74n432k69n16o215k3P04K031L328J193j028J786m448r257m54
11721D20K485L701m06N883M47l848O99n766j216L258K732o071m306J853R668R851
$$ plain form
11831 19890 18614 23876 25953 13265 3882 10348 15956 11487 12150 14196 6187 7278 12061 8854
11817 8854 11706 10414 15758 20971 16233 14340 13547 11195 10767 3252 3996 8067 8654 7777 8627 8678 8514
11800 8514 6171 6292 4780 9112 13802 13311 11827 7594 7205 6465 14852 26529 32638 32093 23931 14154
11784 14154 14226 12165 11940 12277 11565 16017 16587 21025 21222 17385 15738 8147 8132 7289 9783 9210 4998
11767 4998 3346 6708 8563 11142 8422 8322 12475 9321 4821 2054 6971 18448 19685 15432 8079
11752 8079 9388 10305 9068 4700 3530 2037 457 -2491 -765 8166 11896 6328 3687 4497 10947
11737 10947 19994 19020 13588 13319 12803 6588 6565 7269 9300 12628 13821 12793 14579 10131 874 420
11721 420 2905 6606 6200 12083 12530 8682 9381 3615 2399 5657 8389 2318 -1988 -135 9533 19384
11705A9384q246m331J116K914J847k15l247j296J136j775q67L915o71m494R08
11690F078r94l062N839J900O393J437k545p69j801q82M094M968O98m202q24j300
11674A5028m193J591q63K271l147r64J457N782L929n52k224l855k589K077J968
11659A5716j643M477m166J732Q31M060L767o396j16r503m248K783K131j038K819
11644A1206l442j680R72k037q08l319J555N168j735L6K602k204P263J1262j796
11629B3043m718l794J774M570L843j789l844j612o458n903N242N454P84J305J893
11614A9790m56q589o387O836L844r11J139l295J612O48J416M015k482l263M95
11599A4412J887P665M017J680k080R09k172M083k754n05O77j288n209J514M691
$$ plain form
11705 19384 11138 6807 7923 10837 12684 12469 9222 7926 9062 7287 6420 10335 9664 5170 6078
11690 6078 5084 2022 7861 9761 16154 17591 15046 14277 12476 11594 15688 20656 21354 17152 16328 15028
11674 15028 10835 12426 11563 13834 10687 9723 11180 16962 20891 20339 18115 14260 11671 13748 15716
11659 15716 14073 18550 14384 16116 16947 21007 24774 18378 18262 8759 4511 7294 9425 8387 11206
11644 11206 7764 6084 7056 5019 4211 892 2447 7615 5880 5916 8518 6314 13577 24839 23043
11629 23043 18325 14531 16305 20875 24718 22929 19085 17473 11015 5112 10354 15808 16592 17897 19790
11614 19790 19334 10745 4358 11194 15038 14127 15266 11971 13583 14231 15647 19662 17180 13917 14412
11599 14412 16299 23964 27981 29661 27581 28490 26318 30401 27647 27142 27819 26531 21322 22836 27527
11584B7527L45Q16J245M96J368j941r514q135P117Q911J425k8m976o176L711N056
11568B7247l522j942K508l151m025J239l95L50N424O18n86n17N92l521m596j895
11552A3828M30K237m144K219m7j489O063O576j725O239R03j328J914p739k214
11537B1723N69k231r622n051j333N554M487J535K071K225K25J300K63K736K747
11522B7198m626j1465m688J0675Q098k481o186l93M948P327j79j030n403l048
11508A8747l949n116k121M841K050j001n172j748J605J522j849L161M351P014
11494B2335q91M77M027N963o128j037j904p412p46M819j094m189N140J634q960
11479A2034P151P707j529o476k751R371N180L835j533m228l393J773l178J654
$$ plain form
11584 27527 27872 28688 29933 30429 31797 29856 20342 12207 19324 28235 29660 29632 24656 18480 22191 27247
11568 27247 23725 21783 24291 21140 17115 18354 17959 18309 23733 24351 23765 23248 23840 20319 15723 13828
11552 13828 14258 16495 12351 14570 14523 13034 19097 25673 23948 30187 31090 29762 31676 23937 21723
11537 21723 22292 20061 10439 5388 4055 9609 14096 15631 17702 19927 20152 21452 21715 24451 27198
11522 27198 22572 11107 6419 17094 25192 22711 16525 16132 21080 28407 28228 27198 21795 18747
11508 18747 14798 9682 7561 12402 14452 13451 8279 6531 8136 9658 7809 10970 15321 22335
11494 22335 21444 21921 25948 31911 25783 24746 22842 15430 14684 19503 18409 14220 19360 20994 12034
11479 12034 19185 26892 25363 18887 16136 25507 30687 34522 32989 28761 25368 27141 23963 25617
11465B5617n09j526k647J591N484o48o782k114J427M489L418k854n577n157O223
11450B0435L845k75l539j062L665p397l627N66l371P600M014k17j352M981L033
11435B7299k184p790L826O501K524n333l097k394j245L475M463M172L674O90l677
11420C0904l252j586j732N626O991l407o342P47J475n269J36P682J446k891L535
11405C4063r58m111p495j637J114j493J947L647l46Q3J198K005l163m653n399
11390A4802O659M346J733J99J081m727j548j401P20J81N407L283J974k546p284
11375B2879k872N852L18p741j943K899M229K934J199m50l054j070j103N793R46
11360B8816l857l675K859L282L173k157N841J0053J596l984K184L079j435n209
$$ plain form
11465 25617 25108 23582 20935 22526 28010 27362 20580 18466 19893 24382 27800 24946 19369 14212 20435
11450 20435 24280 24005 20466 19404 23069 15672 12045 12611 9240 16840 20854 20637 19285 24266 27299
11435 27299 25115 17325 21151 27652 30176 24843 21746 19352 18107 21582 26045 30217 33891 34581 30904
11420 30904 27652 26066 24334 29960 36951 33544 27202 27949 29424 24155 24291 31973 33419 30528 34063
11405 34063 33105 28994 21499 19862 20976 19483 21430 25077 24731 24814 26012 28017 24854 20201 14802
11390 14802 21461 25807 27540 27739 28820 24093 22545 21144 21864 22045 27452 30735 32709 30163 22879
11375 22879 20007 25859 26177 18436 16493 19392 23621 26555 27754 27304 24250 23180 22077 27870 28816
11360 28816 24959 21284 24143 27425 30598 28441 34282 44335 45931 41947 44131 47210 45775 40566
11346D0566r159m254L493O099M922k622m538L318J495k86l889p340J53m581p68
11331B2609O298l191J208P36k19K867o51l15N111L624r302j537K850P222Q069
11316D5379j490R16O27m847j831k876O173R584n555k205N121K963Q30l763J562
11301E0588o234m227J218L885Q07O550m808O096L980m816o607n626m957P657Q517
11286E2023M532p03p41M238l97l932l376O15m570m174J1137N408n812o262j654
11271D6332k646o43Q355o366j0472q898j4734j2040J727R436J0376O977k18N923
11257C3109N428K64J629J898j728M12j245k834P342O202l867J894J4612J2961
11243G6077N503R093O190L459P117J4286J1197J7210J3614L945K055m88n922L742
$$ plain form
11346 40566 31407 27153 30646 36745 41667 39045 34507 37825 39320 39034 35145 27805 27958 23377 22609
11331 22609 28907 25716 26924 27660 27441 30308 29657 29342 34453 38077 28775 27238 30088 37310 45379
11316 45379 43889 44805 45432 40585 38754 35878 42051 51635 46080 43875 48996 51959 52789 49026 50588
11301 50588 44354 40127 41345 45230 46037 52587 47779 53875 57855 53039 46432 40806 35849 43506 52023
11286 52023 56555 55852 55111 59349 58952 55020 51644 52259 47689 43515 54652 60060 54248 47986 46332
11271 46332 43686 43043 51398 45032 34560 25662 10928 -1112 615 10051 20427 27404 27186 33109
11257 33109 38537 38801 40430 42328 40600 41012 39767 36933 44275 50477 46610 48504 63116 76077
11243 76077 81580 90673 96863 100322 107439 121725 132922 150132 163746 167691 169746 169258 163336 167078
11229A67078J0165K1612J6991J9488L3361L9168M5320M8583P0707R3628J26246
11218F92347J70196K15479K86999L75245M33289M30677K74064P6342j50153n64238
11208B240247o70926m62029k85839j86323j11302p2097m6884l9196l1055k1606
11198C12990j4646q935j4697k114q079p742p365j092J567L916N519j363q12p327
11184B49820j1058j2181n080j2048n330r809k666p659l629l635p610J131p62l602
11170A65882m062r661q009p242m988n960K024k845j775n732r509m683K69j999
11156A01710o767o55M51J055O497m310n932p39P119j79p310j340m089j5271j3236
11141E7004k576P210R315N516l046n472O355K866j517Q34M1L109o79j2230M629
$$ plain form
11229 167078 177243 198855 215846 235334 268695 307863 353183 401766 472473 566101 692347
11218 692347 862543 1078022 1365021 1740266 2173555 2604232 2878296 2954638 2804485 2240247
11208 2240247 1569321 1107292 821453 635130 523828 451731 404847 365651 334596 312990
11198 312990 298344 289409 274712 272598 264519 256777 249412 248320 249887 253803 259322 257959 257147 249820
11184 249820 238762 226581 221501 209453 204123 194314 191648 183989 180360 176725 169115 170246 169484 165882
11170 165882 161820 152159 144150 136908 131920 125960 127984 125139 123364 117632 108123 103440 103709 101710
11156 101710 94943 94288 94739 95794 102291 97981 92049 91310 98429 98250 90940 89600 85511 70240 57004
11141 57004 54428 61638 70953 76469 73423 67951 74306 77172 75655 76489 76530 79639 78960 66730 71359
11126G1359O399j233k951K028k245K723j400q730m241J912n821j0796J81L320
11112E0505M432k843n210l067p898k0391j0747J415L038L868N472L003j442o160
11098A3975j802K11J0359M866O770K1702K3976K5368K5855Q576P312K4703J3562
11085A85433r696q388j1646R10P044J837m617P63m552L84R655J6802J5516J5479
11071B14924Q319J5051K2465L0194L1846K5060J8180J5209R631J6734J1391M157
11059D23161J5081J2314L962P291J02l908k3124j1467j5658j3673j8850k5542
11047C49689k9626l9413m5144l5641k4478n549q098J9l172M439Q268k141n059
11034A64094J207K305N837O768l224j327p378j257Q00l251k759l137N760R417
$$ plain form
11126 71359 77758 76525 73574 75602 73357 76080 74680 65950 61709 63621 57800 47004 47185 50505
11112 50505 54937 52094 46884 43817 35919 15528 4781 6196 9234 13102 18574 21577 20135 13975
11098 13975 12173 12384 22743 27609 34379 56081 80057 105425 131280 139856 147168 171871 185433
11085 185433 175737 167349 155703 156613 163657 165494 160877 161640 157088 157472 167127 183929 199445 214924
11071 214924 223243 238294 260759 290953 322799 347859 366039 381248 390879 407613 419004 423161
11059 423161 438242 450556 454518 461809 461911 458003 434879 423412 407754 394081 375231 349689
11047 349689 320063 280650 235506 199865 175387 169838 161740 161759 158587 163026 171294 169153 164094
11034 164094 165301 167606 173443 180211 176987 175660 168282 167025 167825 164574 161815 158678 164438 173855
11020A73855P106P891P928M460Q177M708l930K641N248k187l119M564o863j4339
11006A96140N59N355k502l200K797L451j2901j6535j2192j5743k4357j9798k1282
10993G9792k3254k2919l0100o0033m2367o04J1943L7582N3429N5680M8710L6164
10981A44023K6937K1545J3395J1330o307j9538k0109p320O69l725Q060J7797J5945
10968B02702q160j2208o159r478j9378k4566k3932j9153j9850j6964j3106k39
10956B9509M825J1066K4916O5577Q0447K7756O110K5667L6219K2035Q643K4729
10944C67499L2051K4801K9830M1538L6180J0120l62o036q279J8774M3842N3401
10932F43359P3962Q7130Q0423N8611J0871k3289n423J1100k2035r1651r7770l9008
$$ plain form
11020 173855 180961 188852 196780 201240 209417 214125 210195 212836 218084 215897 212778 217342 210479 196140
11006 196140 196699 202054 199552 196352 199149 202600 189699 173164 160972 145229 120872 101074 79792
10993 79792 56538 33619 3519 -56514 -98881 -99485 -87542 -49960 3469 59149 107859 144023
10981 144023 170960 192505 205900 217230 210923 191385 171276 163956 164625 160900 168960 186757 202702
10968 202702 194542 182334 176175 166697 147319 122753 98821 79668 59818 42854 29748 29509
10956 29509 34334 45400 70316 135893 216340 244096 250206 275873 312092 334127 342770 367499
10944 367499 399550 424351 454181 495719 531899 542019 541657 535621 527342 546116 589958 643359
10932 643359 717321 804451 884874 943485 954356 931067 925644 936744 914709 823058 725288 686280
10920F86280n5193q0999n6026l0679m235l29N200R924K2049K0911J8451J7669
10908E53023J5306J5546K5719K4796L8733M5513N1403M4447K7757J6499K1712
10897H80454K0243J6012K9538L5654M1183L9561L6249N1280M9129M1283L8371
10886A278957K3716J6939J7577J3334J6840J8067R353J982q18J3027L0179K4472
10874A463625O901K56L377J2806K5345M0278M4003M6705M5984L3525K4956J9262
10862A767023K2633L0480J6957Q807K4988L4590L4535M9825P8070Q0135R5277
10851B243320R9782R4968Q3102N9949M2715O9648R7781J09957J21790J39948J42017
10840C304977J43767J68190K00612K26923K43880K46509K71850K90396K85866
$$ plain form
10920 686280 631087 550088 494062 463383 459148 458819 464019 473943 495992 516903 535354 553023
10908 553023 568329 583875 609594 634390 673123 718636 770039 814486 842243 858742 880454
10897 880454 900697 916709 946247 981901 1023084 1062645 1098894 1150174 1199303 1240586 1278957
10886 1278957 1302673 1319612 1337189 1350523 1367363 1385430 1394783 1396765 1395947 1408974 1439153 1463625
10874 1463625 1470526 1470782 1474159 1486965 1512310 1552588 1596591 1643296 1689280 1722805 1747761 1767023
10862 1767023 1789656 1820136 1837093 1845900 1870888 1905478 1940013 1989838 2067908 2148043 2243320
10851 2243320 2343102 2438070 2521172 2581121 2623836 2693484 2791265 2901222 3023012 3162960 3304977
10840 3304977 3448744 3616934 3817546 4044469 4288349 4534858 4806708 5097104 5382970
10831E382970L50731M19392M87516N55916O12452P56562R67608J171011J384264
10822A2088422J473598J381668J369697J282353J201396J691530K448378L081199
10814B6018241L635524M368487N241691O350397P918144J0039757J2790841J6314891
10806I2677973K1021022K7479561L6726059M8747630O1513823P1782405P5427526
10799D35375999N7721070K1502752k780972n8618736j18229340j01805483o5177934
10792A67987356m0951850k6178419j7099698j2127127q952342o746162n285128
10785E0646630m104031l038496k290902j751639j323911j025473q06384n90059
10777C5715735k55687J17101M76514P45678M15294n87614j811534k524218k496827
$$ plain form
10831 5382970 5733701 6153093 6640609 7196525 7808977 8565539 9533147 10704158 12088422
10822 12088422 13562020 14943688 16313385 17595738 18797134 20488664 22937042 26018241
10814 26018241 29653765 34022252 39263943 45614340 53532484 63572241 76363082 92677973
10806 92677973 113698995 141178556 177904615 226652245 288166068 359948473 435375999
10799 435375999 493097069 514599821 511818849 453200113 334970773 233165290 167987356
10792 167987356 127035506 100857087 83757389 71630262 62677920 55931758 50646630
10785 50646630 46542599 43504103 41213201 39461562 38137651 37112178 36305794 35715735
10777 35715735 35460048 35577149 36053663 36799341 37214635 36627021 34815487 32291269 29794442
10768B9794442k281708k036422j785230j588669j443510j343935j250305j131781
10760A6932882j047223r58325q46705p87952p36621p00463o60431o04882n57979
10751A0032301n06260m85769m73894m57957m42278m03599l49035l20620k97807
10742F295082k89734k85277k72607k71808k63618k52464k48323k37931k08916
10733C964404j89682j83262j71629j60178j42234j29608j29114j33426j37409
10724B587862j29846j27600j26969j27826j18396q7596q8829j03955r9882q7026
10714A489937r2490q1367o4669n5004n4886n4583m4316l5109l3002k9802j8919
10703I25790k6038k5784k9322l7223m1092n0793n2089m0368k8224j1220l794O535
$$ plain form
10768 29794442 27512734 25476312 23691082 22102413 20658903 19314968 18064663 16932882
10760 16932882 15885659 14927334 14080629 13292677 12556056 11855593 11195162 10590280 10032301
10751 10032301 9526041 9040272 8566378 8108421 7666143 7262544 6913509 6592889 6295082
10742 6295082 6005348 5720071 5447464 5175656 4912038 4659574 4411251 4173320 3964404
10733 3964404 3774722 3591460 3419831 3259653 3117419 2987811 2858697 2725271 2587862
10724 2587862 2458016 2330416 2203447 2075621 1957225 1869629 1780800 1676845 1576963 1489937
10714 1489937 1397447 1316080 1251411 1196407 1141521 1086938 1042622 1007513 974511 944709 925790
10703 925790 899752 873968 844646 807423 766331 715538 663449 623081 594857 583637 579843 586378
10691E86378J0205M340M626K127j5530j0817k135J420O4j110J467m126m160J3042
10677E85791K668j8150j0616P865K4039j709k8696k2816j2846j4797l3755j5743
10665D61235k5000l6132l7315m4271m9190m4878l3748k3770l875K101N598K4364
10653A95119K6656J5987J7953J9914R490J0110K3154K5222K6053L5719P4560Q3113
10641E63050L4378J557j0170q504j0273j0522j8964j5683j6052j2446j7207q903
10629D70261m797J756l365L926J2017R680m510j2253p047r790j9158n892M200
10616D35028J1522K7713M1525M3469M3544L9933K9967K3441N617M576k3500j04954
10604E77881r1613l5159k7810k5656k1042k6109k4876j5120j5734j2228o615j0883
$$ plain form
10691 586378 596583 600923 605549 607676 592146 581329 579194 580614 580678 579568 581035 576909 572749 585791
10677 585791 588459 570309 559693 567558 591597 589888 561192 538376 525530 510733 476978 461235
10665 461235 436235 400103 362788 318517 269327 224449 190701 166931 163056 165157 170755 195119
10653 195119 221775 237762 255715 275629 285119 295229 318383 343605 369658 405377 479937 563050
10641 563050 597428 598985 588815 580311 570038 559516 540552 524869 508817 496371 479164 470261
10629 470261 465464 467220 463855 467781 479798 489478 484968 472715 465668 455878 436720 430828 435028
10616 435028 446550 474263 515788 559257 602801 642734 672701 696142 701759 706335 682835 577881
10604 577881 486268 451109 423299 397643 376601 350492 325616 310496 294762 282534 275919 265036
10592B65036j1047k081R74J732j1305j3558j2080r517j0871q752o449o086n769
10579A70227L441J38M004J1197k412j569j4553p540q051m442j4212j2912m613
10566A18703m034Q0O357K309k377L900O290J091O287j611j260o574K853L893l260
10551A32647o941j1564j0701j1781r431m859n285P14m043j1520j2319k514l961
10538C8442k2n799j2405r115m315j3246j1691k02Q665Q477N757R922J1790P483
10524C3741Q83N584l837p937j0017j2075r551K207P343j501n44p734j4369p980
10510b5787m06R10J1064J6484J4445K6275N5526L1707P716K568K244N971M217
10497A52934Q62P087J603K845R07m35J114k494m004q122j2158l630j903M744J2964
$$ plain form
10592 265036 253989 251908 252882 254614 243309 229751 217671 208154 197283 188531 182082 175996 170227
10579 170227 173668 173806 177810 189007 186595 185026 170473 162933 154882 150440 136228 123316 118703
10566 118703 114669 114749 121106 123415 121038 124938 131228 132319 138606 136995 135735 129161 132014 135907 132647
10551 132647 125706 114142 103441 91660 82229 77370 72085 72799 68756 57236 44917 42403 38442
10538 38442 38420 32621 20216 11101 6786 -6460 -18151 -18353 -9688 -1211 4546 14468 26258 33741
10524 33741 34624 40208 36371 28434 18417 6342 -3209 -1002 6341 4840 4296 -3438 -17807 -25787
10510 -25787 -26193 -25283 -14219 2265 16710 42985 98511 130218 137934 140502 142746 148717 152934
10497 152934 153796 160883 162486 165331 166238 165803 166917 164423 160419 152297 140139 136509 134606 139350 152314
10482A52314J438J581J498j2242j1756j704P124j382l605l994j821p491L884R473
10468A33317J702j755o210m727K472m030O785M936Q45l276l372k287j543L71p500
10453A15728o557k004K798j321l400n845N73L853j56j809p81r48l459j501m928
10438I0243l294l827j440N054O539J758m884l094J651l817l598J995K43l454m79
10423G9596M991L174O341M848n91n761p708l882j579J1800J0334o65j572J463
10409A00789P947P740K308j970K604O196J3623l152J912M518J1845J3278K3971
10396A91609K7799J8817K2139K8582K8713L7656N2502N4821P4488R4583J26592
10385G58301J75647K35410L15027L93970M39027L88851J90857K2108k90701o67213
$$ plain form
10482 152314 153752 155333 156831 144589 132833 131129 138253 136871 133266 129272 127451 119960 123844 133317
10468 133317 135019 133264 127054 122327 124799 120769 127554 132490 133335 130059 126687 124400 122857 123228 115728
10453 115728 109171 107167 109965 108644 105244 99399 99972 103825 103669 101860 101079 100131 96672 95171 90243
10438 90243 86949 83122 81682 86736 93275 95033 90149 87055 88706 84889 81291 83286 83529 80075 79596
10423 79596 84587 87761 94102 98950 98359 92598 84890 81008 79429 91229 101563 100898 99326 100789
10409 100789 108736 116476 118784 116814 119418 125614 139237 136085 137997 142515 154360 167638 191609
10396 191609 219408 238225 260364 288946 317659 355315 407817 462638 537126 631709 758301
10385 758301 933948 1169358 1484385 1878355 2317382 2706233 2897090 2919198 2628497 1961284
10375A961284n99800l78864k34460j55350r2802o2972n2964l6194l6329k9132
10365B82417j5477j5039j5367r255k690j627J490K922K131Q352J0360M367L471
10352B56055q43n168n619j0469q004j0812j3597j0110j1577m246r32m637q690
10339A61351l810j551O945K694l558J522k971o985j2419j4108k0319j7367o922
10326H2502P35J313o412j180L051j760P99n003o648k380j2185l045Q703K373m192
10311E6671q726j178K245n189p688k547J647k337l49j465l486K092n167l137j352
10296B0034M533J94n591k216P19L199L437M813J519j711o395p190k201J870P186
10281B2200J349n237k323k583n916k560k317k36K043K042Q654j742O648k495O18
$$ plain form
10375 1961284 1361484 982620 748160 592810 500008 437036 384072 347878 311549 282417
10365 282417 266940 251901 236534 227279 224589 222962 224452 227374 229505 237857 248217 252584 256055
10352 256055 255212 250044 244425 233956 225952 215140 201543 191433 179856 175610 174678 170041 161351
10339 161351 157541 155990 162935 165629 162071 163593 160622 153637 141218 127110 106791 89424 82502
10326 82502 83237 84550 78138 76958 80009 78249 79048 74045 67397 65017 52832 49787 58490 60863 56671
10311 56671 47945 46767 49012 43823 36135 33588 35235 32898 32549 31084 27598 29690 24523 21386 20034
10296 20034 24567 24761 19170 16954 17673 20872 24309 29122 30641 28930 22535 15345 13144 15014 22200
10281 22200 23549 18312 15989 13406 7490 4930 2613 2377 4420 6462 15116 13374 20022 17527 18145
10266A8145N559P69k283m113n458o291j775l539j64L999R263K089O597Q04O93
10251B4295Q885L806L995Q28m061r969r488r111k135J413K140N276O339m00P0
10236B1883m778m383J098L880j972m10K848j005K639L108k561k506N11j429J035
10221A7958L450K746k547K00J70m605j107K074P119L619J771L889K533K72O887
10206D4429J0209L318Q267K494P367J2692N754N430J0156O890J2864K4602J6582
10193A71054L810j4917l4093l5186k9565j4422r798q44j002k171n790m441j116
10180B1519O154j328n423K573K041N527M797J545J756N425J52K274J0895O101
10166F4008R381N100R084K0578L1578L1239L3015K8604K9876L7335J8548J2127
$$ plain form
10266 18145 23704 24473 22190 18077 12619 6328 4553 1014 850 4849 14112 16201 22798 23602 24295
10251 24295 33180 36986 40981 41809 37748 27779 18291 9180 7045 8458 10598 15874 22213 21813 21883
10236 21883 17105 12722 13820 17700 15728 15318 18166 17161 19800 22908 20347 17841 18352 16923 17958
10221 17958 21408 24154 21607 21807 21977 17372 16265 18339 25458 29077 30848 34737 37270 37542 44429
10206 44429 54638 57956 66223 68717 76084 88776 94530 99960 110116 117006 129870 154472 171054
10193 171054 174864 159947 125854 90668 61103 46681 36883 36039 35037 32866 27076 22635 21519
10180 21519 27673 26345 20922 23495 25536 31063 35860 37405 39161 44586 44738 47012 57907 64008
10166 64008 73389 78489 87573 108151 139729 170968 203983 232587 262463 299798 318346 330473
10154C30473M21j2393k8887l8064k5008k4811l6461l8577k5684j4397j6558q430
10142F1624q817m361m986n258k51O135O87q78n710J3m73J402o802j0929o32j219
10126A9545r54j497j261K850l988n191L697M959K194M991k820m499M59p56m334
10111A3395n314j026J830r91L165M614j92m271m838L175J0978L250m994j924k667
10096A4190q7L397l424o535l622l562l080M072M213J337M646J255K604q60k331
10081A2213l318n838l554M56M452O193o25K377L255m65M372J287p7n609J609J449
10065A8177J1660L366K77j34k235l183l172m411O2k49P98L237K947j226J000L52
10049B7266m600K256N061K58P166J167m323q864o574o204L764N43m737m635j457
$$ plain form
10154 330473 330894 318501 289614 251550 226542 201731 165270 126693 101009 86612 70054 61624
10142 61624 52807 48446 43460 38202 37951 44086 44773 43895 38185 38198 37725 39127 32325 21396 20764 19545
10126 19545 18591 17094 15833 18683 14695 9504 13201 18160 20354 25345 22525 18026 18485 17729 13395
10111 13395 8081 7055 8885 7894 11059 15673 15481 11210 6372 9547 20525 23775 18781 16857 14190
10096 14190 14103 17500 14076 7541 3919 357 -2723 1349 5562 6899 11545 12800 15404 14544 12213
10081 12213 8895 3057 -497 -41 4411 10604 9979 12356 15611 15146 19518 20805 20728 15119 16728 18177
10065 18177 29837 33203 33480 33346 31111 27928 24756 20345 20407 20158 20956 24193 27140 25914 26914 27266
10049 27266 22666 24922 29983 30241 37407 38574 34251 25387 18813 12609 16373 16916 12179 7544 6087
10034F087J87k161p746M305k382K744R933J279J271l680N106J676k93O655l963
10019A9018j03K148J61r566m441m111o855l79K800n409N123L420j310o929M974
10004a459J599L746J563K733L406J963M491m074j127m700j915R307N360M218k72
9989B4839n730p030O650J0906J797j306o8O666J0285R185J5115K2559L3173M4101
9975A71142N9031N3515K6084O107l4142r2492o9927l8519k2143j2992m516n892
9963C5256m18k231O26p133n791K640J548j488o880L702Q147o581j142m454L875
9948A9676K192J207o84j284k815n616M47J0829k734n978K296K974L239L603j44
9933B7208l025m75L110L241N4K410j730n347L453N07K967q42M720j758J973P265
$$ plain form
10034 6087 6274 4113 -3633 672 -1710 1034 10967 12246 13517 9837 14943 16619 16326 22981 19018
10019 19018 18915 21063 21224 11658 7217 3106 -3749 -4128 -1328 -6737 -1614 1806 496 -6433 -1459
10004 -1459 140 3886 5449 8182 11588 13551 18042 13968 12841 8141 6226 15533 20893 25111 24839
9989 24839 19109 12079 18729 29635 31432 30126 30058 36724 47009 56194 71309 93868 127041 171142
9975 171142 230173 283688 309772 315879 281737 189245 119318 80799 58656 45664 41148 35256
9963 35256 34838 32607 33233 26100 20309 22949 24497 23009 16129 19831 27978 21397 20255 15801 19676
9948 19676 21868 23075 22391 21107 18292 12676 13123 23952 21218 15240 17536 20510 23749 27352 27208
9933 27208 24183 23708 26818 30059 30113 32523 30793 25446 28899 29406 32373 31531 36251 34493 36466 43731
9917D3731p2N335O91k992p063o873l503L394k477n893n259K393L700k029k763
9902B0320j094J440J478K148K588K947J705O91N70N409R05M260k048k024J0273
9887D9568M286J076j404m221j0819N842Q223J805o79L528K189p27o00K421m26
9872F0062L015K153n911k231k932J316m339l851L645l65K712N149J894M283N082
9857F9682M662K973M231K8L819m21N30K376j072j255n253k30O65Q852N361j04
9841I4844K591R727J2873p66k847m885J615M087K964N864R012M779O419J0322
9827A56599P819P015J2588J9297J5511N820Q479R506J6055K9188L6078K7273L0423
9814C81651L9464M8597N1023O1389P0434O9085P5121Q4592R2539J04302J27194
$$ plain form
9917 43731 43659 48994 49685 46693 39630 32757 29254 32648 30171 24278 19019 21412 25112 23083 20320
9902 20320 19226 20666 22144 24292 26880 29827 31532 32223 32793 38202 39107 43367 41319 39295 49568
9887 49568 53854 54930 53526 49305 38486 44328 52551 54356 53677 57205 59394 58667 58067 60488 60062
9872 60062 63077 65230 59319 57088 54156 55472 51133 47282 50927 50562 53274 58423 60317 64600 69682
9857 69682 74344 77317 81548 81576 85395 84974 85504 87880 86808 85553 80300 80070 80735 89587 94948 94844
9841 94844 97435 107162 120035 119269 116422 111537 113152 117239 120203 126067 135079 139858 146277 156599
9827 156599 164418 171433 184021 203318 218829 224649 233128 242634 258689 287877 323955 351228 381651
9814 381651 421115 469712 520735 582124 652558 721643 796764 881356 973895 1078197 1205391
9803A205391J62100K04991K46523K95631L49433M37664N58927P30945R91009J352638
9793F535252J870024K541921L304758L957004M037243L148664J468380r71263
9785B5891983l969842n812293n198410l392004j986893j186252p56914n06393
9777C082982l65860k82475k13207j62423j11731q9711o3045l9424k1144j9336
9767A714626j0330m921N007R316N985j2657n4642q9174j03222j04432r1173q6966
9755A177417q7546o8001o5330o1962n6565n3277m5509l6773l9139l7690l7778
9744E87847k7254k6767k8926k0890k2264j8953k5993k6185j7487j8305j6311j0385
9732C28127j1418j5104j3244n350j4664j1702j3566j6997l503M80o353o242q694
$$ plain form
9803 1205391 1367491 1572482 1819005 2114636 2464069 2901733 3460660 4191605 5182614 6535252
9793 6535252 8405276 10947197 14251955 18208959 22246202 25394866 26863246 25891983
9785 25891983 21922141 16109848 10911438 7519434 5532541 4346289 3589375 3082982
9777 3082982 2717122 2434647 2221440 2059017 1947286 1857575 1794530 1755106 1733962 1714626
9767 1714626 1704296 1699375 1704382 1713698 1719683 1707026 1652384 1563210 1459988 1355556 1264383 1177417
9755 1177417 1089871 1021870 956540 894578 838013 784736 739227 702454 663315 625625 587847
9744 587847 560593 533826 504900 484010 461746 442793 416800 390615 373128 354823 338512 328127
9732 328127 316709 301605 288361 283011 268347 256645 243079 226082 222579 223059 216706 210464 201770
9719B01770p719p115j907q453m462m039o394p155k31j720m317j0549p859N083
9705A34933j429J07M805L107K969o985m425J689r67j36k113m10J789M068J761
9690A38763J553O833O99Q15J878L782M164Q97P06Q894O392K709N002J418J2696
9675A97201J1612m808k55P239P277L011J0766P930J0484J2778J1616J2122J1560
9662B98533L809R012J0215J4518J0434J9481J7473K3835J8482J5585J9071K1557
9650D82005K5842K4504K7004K6638K9164L0925L1111L3086L9208M7991N7042N2104
9638I06624M6162N7318N4072M5997N2688O3465O5810O0869N4192N2988L8397L0823
9626A529405L3522L1900J9755J1452l189j4751j8486k0428l3832m1985m2053m4081
$$ plain form
9719 201770 194051 186936 185029 176576 172114 168075 161681 154526 154295 152575 148258 137709 129850 134933
9705 134933 133504 133611 138416 141523 144492 137507 133082 134771 133804 133668 131555 131145 132934 137002 138763
9690 138763 140316 147149 147848 148663 150541 154323 158487 159384 160090 168984 175376 178085 183087 184505 197201
9675 197201 208813 204005 203750 210989 218266 221277 232043 239973 250457 263235 274851 286973 298533
9662 298533 302342 311354 321569 336087 346521 366002 383475 407310 425792 441377 460448 482005
9650 482005 507847 532351 559355 585993 615157 646082 677193 710279 749487 797478 854520 906624
9638 906624 952786 1010104 1064176 1110173 1162861 1226326 1292136 1353005 1407197 1460185 1498582 1529405
9626 1529405 1562927 1594827 1614582 1626034 1622845 1608094 1589608 1569180 1535348 1493363 1451310 1407229
9614A407229l9134m5908n0666n1149m7868m5855m5371n0332m8897m1198m0006
9603I00845l5577l3934l0584k8130k7084k9402k7974k5698l0603k5918k5577k5812
9591E54552j8534j9062j6015j7663k3236j9097j1854j2549k6334k3618q002o751
9579C51837j2470p489j5542j3003r990m563j4654j5062l029p232l165p523o751
9566B31364j1864r399k464n885r625k974j968r235q277m769r95L052K548o920
9552A62589l202m343j2039l086l900k829o474m180J311l503q162j0341m565m867
9538I2409K104L090k746o540P18o525n609K180K533m317j006J057K297L460l44
9523H2761J790P888K820k785Q565L464J996P653O851J5400J5538J7468J9146K4572
$$ plain form
9614 1407229 1368095 1322187 1271521 1220372 1172504 1126649 1081278 1030946 982049 940851 900845
9603 900845 865268 831334 800750 772620 745536 716134 688160 662462 631859 605941 580364 554552
9591 554552 536018 516956 500941 483278 460042 440945 429091 416542 390208 366590 358588 351837
9579 351837 339367 331878 316336 303333 293343 288780 274126 259064 256035 248803 245638 238115 231364
9566 231364 219500 210101 207637 201752 192127 189153 187185 177950 169673 164904 163909 166961 169509 162589
9552 162589 159387 155044 143005 139919 136019 133190 126716 122536 123847 120344 112182 101841 97276 92409
9538 92409 94513 97603 94857 88317 89035 82510 76901 79081 81614 77297 76291 77348 79645 83105 82761
9523 82761 84551 92439 95259 92474 101039 104503 106499 114152 121003 136403 151941 169409 188555 213127
9509B13127O850O140L575j0878k4679j6020j0948j3221r165p589k342k996L263
9496A35117J0850K0706K2798K0247K0681J4670P951P298o176p992l619m683m211
9483B33637j356L286M610K6j1477k830O264q19L61J0505K5564L5045M7435N7071
9469D07322N9378N1148L2200J0720j9975o8351q6932o7434m3550l0625j6953j5722
9457B11226p286j292J1004Q164L089M950N677M671M171O804K033K126O29l102
9443B52864k896j0979j9311j9857j7281j2165j7989j2831n391n925P48O257J4274
9430A49518J2546J0567K2402J4477J1932m87j6592j0679j7773k7279k1370j7188
9418A10074j8248j2144n297l867L469L26o266m143o751m816N55l509n222n955
$$ plain form
9509 213127 219977 226117 229692 218814 194135 178115 167167 153946 144781 137192 134850 131854 135117
9496 135117 145967 166673 189471 209718 230399 245069 253020 260318 254142 246150 242531 237848 233637
9483 233637 232281 235567 240177 240203 228726 225896 232160 231341 231702 242207 267771 302816 350251 407322
9469 407322 466700 517848 550048 560768 540793 472442 385510 318076 274526 243901 226948 211226
9457 211226 203940 202648 213652 221816 224905 229855 235532 240203 244374 251178 253211 255337 255966 252864
9443 252864 249968 238989 219678 199821 182540 170375 152386 139555 134164 128239 128987 135244 149518
9430 149518 162064 172631 195033 209510 221442 220955 204363 193684 175911 148632 127262 110074
9418 110074 91826 79682 74385 70518 73987 74313 68047 63904 57153 52337 52892 49383 44161 38206
9404C8206K978m109m34q28m425k876J908p67K432K140m466m577j461J451O157
9389C1329J758J490N582L01M080J0407P484J3194L676R017J4215J9048J4668O300
9375A42549O557r800j9481k7783l1674j7460r210q085o989L244K450k788J156
9362B2686l003J329j939p067r76n62l623j043L295L264N074M273k629l615l579
9347A1885j011j799L576K553Q51M031K752k123o164m455J981j866m987N375k895
9332G704o045l808J571M977J769M60o896o552j331J0884O729q11q608o420N406
9317i71L696L285R79O73K830L471R85m563l792m801k572O32J335q00K103J105
9301C595q81J435J820L967m387n372n022L613M179k891N874P68m522K233k74l262
$$ plain form
9404 38206 41184 37075 36641 35813 31388 28512 30420 29653 32085 34225 29759 25182 23721 25172 31329
9389 31329 33087 34577 40159 40460 44540 54947 62431 75625 79301 88318 102533 121581 136249 142549
9375 142549 149106 139306 119825 92042 60368 42908 33698 25613 18624 21868 24318 21530 22686
9362 22686 19683 21012 19073 12006 11030 10468 6845 5802 9097 12361 17435 21708 19079 15464 11885
9347 11885 10874 9075 12651 15204 16055 20086 22838 20715 14551 10096 12077 10211 5224 10599 7704
9332 7704 1659 -2149 -578 4399 6168 6628 -268 -6820 -8151 2733 9462 8651 43 -6377 -971
9317 -971 2725 6010 6989 7662 10492 13963 14948 10385 6593 1792 -780 -148 1187 387 2490 3595
9301 3595 2714 4149 5969 9936 5549 177 -4845 -1232 2947 56 5930 6698 2176 4409 4135 873
9285H73o90K770j125P204n314j0768l994O076J5196j321o801M94p92O84l867m408
9269e783n92J861J280L054R01j944j193P75J087j741K544M672n52j143M847K067
9253A0140J419k042J601j978L272Jn174j471j22n267k840M613J243n617L149P887
9237H814L573L336o21k970K575k909k460j768j066J156m185R2P782K162J063n15
9221A4059L555m622J213N146K945j642l003o83q62m420J14o3L348m301K729J563
9205A5076l741j987l675k434l798O010N034O266P083o154p332K331q49l006N577
9190A4401K994j032M44K320L139J409m070J477L483M449Pn873K037j251K6k909
9174B1051j2737j4088o621Q57k0M199M640M39n313k705k32J398K246Q62P128Q398
$$ plain form
9285 873 183 2953 1828 9032 3718 -7050 -11044 -4968 10228 8907 2106 2600 1808 2492 -1375 -5783
9269 -5783 -6375 -4514 -3234 -180 721 -1223 -2416 -1641 -554 -2295 249 4921 4369 3226 8073 10140
9253 10140 11559 9517 11118 9140 12412 12413 7239 5768 5646 379 -2461 2152 3395 -2222 927 8814
9237 8814 12387 15723 15102 12132 14707 11798 9338 7570 6504 7660 3475 3567 11349 13511 14574 14059
9221 14059 17614 12992 14205 19351 22296 20654 17651 16968 16106 11686 11800 11737 15085 10784 13513 15076
9205 15076 11335 9348 5673 3239 -559 5451 10485 16751 23834 17680 10348 12679 11830 8824 14401
9190 14401 17395 16363 16807 19127 22266 23675 19605 21082 24565 29014 29021 23148 25185 23934 23960 21051
9174 21051 8314 -5774 -12395 -11538 -11558 -7359 -2719 -2280 -7593 -10298 -10530 -9132 -6886 -6024 1104 9502
9158I502q95j0703J146K822M787M72j582N914L947o963K64O895n97O8k723N846
9142A8200O734Q62N94L861p80q561m912l88m298l149O718K382o683n377l24K096
9126F975l316k450L845J489m118n542K001J503N923L163K006j1014n423N013O331
9111F386Q07j383K553k993k097O31n683m233O900J655m477L199K09L647q85J48
9095D384l929n251O921Q029k299K501M27k965J270K321K151k577N55n469j299
9080D770L392p88J646m314M06M797M302K15n052l454M43M188l776K440k598l137
9064C480l6N027r51k707N070O710l064j209J735n297j0276l756R17n31O612M889
9048F613K64K85L171k584n799l998M871N54n67K662M622k854j373J313N564l631
$$ plain form
9158 9502 8607 -2096 -950 1872 6659 7131 5549 11463 15410 8447 8711 15606 15009 15077 12354 18200
9142 18200 24934 25796 26390 30251 29471 20910 15998 15610 11312 8163 14881 17263 10580 5203 4879 6975
9126 6975 3659 1209 5054 6543 2425 -3117 -1116 387 6310 9473 11479 465 -4958 55 6386
9111 6386 7193 5810 8363 5370 3273 3904 -1779 -6012 888 2543 -1934 1265 1474 5121 4236 4384
9095 4384 455 -4796 2125 10154 7855 10356 10783 7818 9088 11409 13560 10983 11538 6069 4770
9080 4770 8162 7374 9020 4706 5112 9909 14211 14426 9374 5920 6363 10551 6775 9215 6617 3480
9064 3480 3444 8471 7520 4813 9883 16593 13529 12320 14055 8758 -1518 -5274 -4357 -4888 1724 6613
9048 6613 6877 7162 10333 7749 1950 -2048 2823 3377 2810 5472 10094 7240 5867 7180 12744 9113
9032I113o501l639j299M804Q262J074l468j546k533J090L057K184p090m354M429
9017C583j79n445n558l25l67O159K185k854j873K290K066L70K260J2771N118o170
9001A4031m871K127J292o937K552K583J748M20o817m795p182P357P346K395L883
8986A5132n02O496J1250N019l190L220K652k452o741m838l490j913j315L344o45
8971B2027j1327k779n747m559N377J276l900q594L423K756O899M438k396n232
8957A662J275N305L947L774K92K35j346J296Q919J449p56n4n328N685J961M403
8941C2719Q515R032P999J8229J3092N476m855p170j1850q945j6250o554k304J305
8927C8439j215n779j74L055o084j5062j442N004J0469P903p66j098P99L634M731
$$ plain form
9032 9113 2612 -1027 -2326 2478 10740 11814 8346 6800 4267 5357 8414 10598 3508 -846 3583
9017 3583 3404 -2041 -7599 -7924 -8291 -2132 53 -2801 -4674 -2384 -318 52 2312 15083 20201 14031
9001 14031 9160 11287 12579 5642 8194 10777 12525 12945 6128 1333 -5849 1508 8854 11249 15132
8986 15132 14630 21126 32376 37395 34205 37425 40077 37625 30884 26046 22556 20643 19328 22672 22027
8971 22027 10700 7921 2174 -2385 2992 4268 368 -8226 -4803 -2047 4852 9290 6894 1662
8957 1662 2937 8242 12189 15963 16255 16490 15144 16440 25359 26808 26052 25998 20670 26355 28316 32719
8941 32719 41234 50266 58265 76494 89586 95062 90207 83037 71187 62242 45992 39438 37134 38439
8927 38439 37224 31445 31271 34326 28242 13180 11738 16742 27211 35114 34348 33250 34049 37683 42414
8912D2414K115J225l130m297j841q65J276l573J259J390j794j014K462L02L414
8897C9343k35P14K450K105J3733J2411L511j839K581n998o109n382p128M527q13
8882E3871k174J885K65j682J358j132r98k468K169J235J273m455J951j111k075
8867D7912K508K407K883L38o356Q714O286J710l538j99O922L201L810K221o717
8852G2102L492R083J454j022M918M606J0657J2126R703J2623J3084J6032K0207
8839A89065J0950R229K1048J8919J9477J8494K3292L1595L8849M9294O4511Q0659
8827E75382J18917J46411J93727K55609K99335L21637K88874J53651j491k20838
8817B131214m49084m44715l19625k07562j28014q3719o4787m1265k6384k2115
$$ plain form
8912 42414 44529 45754 42624 38327 36486 35621 36897 33324 34583 35973 34179 33165 35627 35929 39343
8897 39343 39108 39822 42272 44377 58110 70521 74032 72193 74774 68776 62667 57285 50157 54684 53871
8882 53871 51697 53582 53847 52165 53523 52391 51393 48925 51094 52329 53602 49147 51098 49987 47912
8867 47912 50420 52827 55710 56048 49692 58406 64692 66402 62864 62665 69587 72788 76598 78819 72102
8852 72102 75594 84677 86131 85109 90027 94633 105290 117416 127119 139742 152826 168858 189065
8839 189065 200015 209244 230292 249211 268688 287182 310474 342069 380918 430212 494723 575382
8827 575382 694299 840710 1034437 1290046 1589381 1911018 2199892 2353543 2352052 2131214
8817 2131214 1682130 1237415 917790 710228 582214 498495 433708 392443 366059 343944
8807C43944k4968j7936r463j3028m667j2604j7446j6028l238m285j257N551j638
8794B22937q13k389o314q590j1223q912j0767q353n955j3190j3331j0446j152
8781A21502o620J372J026o585m410j916K351o169j0892l016l119n217K711J153
8767H2171q18r34J194j942n502K948J638n432o698K584l985j2627l837K124n827
8752D5057J666N558k824l16M295J370M44l633n758Q50n109o983m369m58O709M44
8736C6943J638P526l556j611M973L126J170j422r29K146l865j661p934k248K702
8721C6998O650J546J088J18L878m535l013N482j662p514K61J933k981M044Q11
8706D3104P120L898K98o9l908K695L613n113N99P632R500l761K496k485q94K994
$$ plain form
8807 343944 318976 301040 291577 278549 273882 261278 243832 227804 224566 220281 219024 224575 222937
8794 222937 222124 219735 213421 204831 193608 184696 173929 165576 159621 146431 133100 122654 121502
8781 121502 114882 116254 117280 110695 106285 104369 106720 100551 89659 86643 83524 78307 81018 82171
8767 82171 81353 80419 81613 79671 74169 77117 78755 73323 66625 69209 65224 52597 48760 50884 45057
8752 45057 46723 52281 49457 49141 53436 54806 55250 51617 45859 46709 41600 34617 30248 29790 36499 36943
8736 36943 38581 46107 42551 40940 45913 49039 50209 48787 47858 50004 46139 44478 36544 34296 36998
8721 36998 43648 45194 46282 46400 50278 45743 42730 48212 46550 39036 39297 41230 38249 42293 43104
8706 43104 50224 54122 54420 54351 50443 53138 56751 51638 52237 59869 69369 65608 68104 65619 64725 67719
8690F7719P075k977n892j125N66J159N718M257k150l069L537M412q3p917j268
8675F9962O069J266k730L016R121o52K819M945j281n974R69K277o712j715M14
8660H1794O51K37o56K062m299j179k509q16K797J947M399J170j311O874P283M818
8644A03262j175K780J2874J0100M110k767J111Q01O448N083O261L060m103k327
8630A45518j1095P022P304n978o894J9j792l135p806J209O770n49N21Q890O986
8615A46990P471J376P021O584m734N838J1268J3621J5137Q805J8291K3523K1776
8602B82967K3259L1883K9910M4065N6042O1374O7082Q0343R7087J15691J51784
8591A041487J92617K58882L45438M70326O34203Q23086R96140J065392P94589
$$ plain form
8690 67719 74794 71817 65925 64800 65366 66525 72243 76500 74350 71281 74818 79230 79147 71230 69962
8675 69962 76031 77297 74567 77583 86704 86052 88871 93816 92535 86561 87530 89807 83095 81380 81794
8660 81794 82445 82682 82026 84088 79789 78610 76101 75285 78082 80029 84428 85598 84287 91161 98444 103262
8644 103262 102087 104867 117741 127841 131951 129184 130295 131096 137544 142627 148888 151948 147845 145518
8630 145518 134423 141445 148749 142771 135877 135896 134104 130969 123163 124372 131142 130593 131114 140004 146990
8615 146990 154461 155837 162858 169442 164708 170546 181814 195435 210572 219377 237668 261191 282967
8602 282967 306226 338109 368019 412084 468126 529500 596582 676925 774012 889703 1041487
8591 1041487 1234104 1492986 1838424 2308750 2942953 3766039 4762179 5827571 6622160
8582F622160L22042j40449j092731j655449j242852p49281m57584k78606j74223
8573A153027j26221q6232o6985l9978k9285j6762p530q405j327l356K874J3132
8561G82952J4895K7639M0685N7727O5673N9127O1719O4040P7574J01380J25241
8550A478652J36331J57942J99240K38453L14667M37366N98484Q26716J145749
8541E533600J525295J880251K119359J750524P81702J7417j762231l343680k708568
8532E793669j659292r97046o11249l88145k73397j93425j47957j11036p8845m8287
8522A284990l8460l7245l8653m0251l5655k3598q917m652m60K4729K4776J3823
8510A120427j991l999m9J19O564K4178M9398P1478R4627J25096J83786K62833
$$ plain form
8582 6622160 6944202 6803753 5711022 4055573 2812721 2063440 1605856 1327250 1153027
8573 1153027 1026806 940574 873589 833611 804326 787564 780034 771629 770302 766946 769820 782952
8561 782952 797847 825486 866171 923898 989571 1048698 1110417 1174457 1252031 1353411 1478652
8550 1478652 1614983 1772925 1972165 2210618 2525285 2962651 3561135 4387851 5533600
8541 5533600 7058895 8939146 11058505 12809029 13590731 13608148 11845917 8502237 5793669
8532 5793669 4134377 3137331 2526082 2137937 1864540 1671115 1523158 1412122 1333277 1284990
8522 1284990 1246530 1209285 1170632 1130381 1094726 1071128 1062211 1057559 1057099 1081828 1106604 1120427
8510 1120427 1118436 1114437 1114388 1114507 1121071 1145249 1194647 1266125 1360752 1485848 1669634 1932467
8498A932467L69111N04508O79228Q54902R85273R17223M88648P1595n92015j500350
8488D710590j458936r44651n66742l49887k20183j44808j02519p2787o1944m1717
8478G46416k7583j7470j2701j3861j5150j7713k1367k3885j4257r748j8552k1864
8466E32265k1413k7559k9316k3510k3214l1188k7713k5192j8239j9165j8101j6063
8454B51592j5302o332j4928j3461n514j2859j7102j1091K338l46q293j1106m739
8441A32857o805l054l576p533q888j0757o894O09o51o835p388q023N149q99L407
8426G0719O97M15M266Q27m655Q61l387j272k150l30K645n862n808j155j28K418
8410E8101K031M995k77J418L177p2l059m82J272l041l756p813r624o336J647J615
$$ plain form
8498 1932467 2301578 2806086 3485314 4340216 5325489 6242712 6731360 6802955 6210940 4710590
8488 4710590 3251654 2307003 1740261 1390374 1170191 1025383 922864 850077 788133 746416
8478 746416 718833 701363 688662 674801 659651 641938 620571 596686 582429 572681 554129 532265
8466 532265 510852 483293 453977 430467 407253 376065 348352 323160 304921 285756 267655 251592
8454 251592 236290 229958 215030 201569 196055 183196 166094 155003 157341 156995 148702 137596 132857
8441 132857 126052 122998 119422 111889 103001 92244 85350 85959 85308 78473 71085 63062 68211 67312 70719
8426 70719 71416 71831 76097 76924 72269 73130 69743 68471 66321 65991 68636 62774 56966 55811 55683 58101
8410 58101 60132 65127 64850 66268 69445 69373 66314 65832 67104 64063 60307 52494 42870 36534 38181 39796
8394C9796q693q223j07P347N081k844j3408J511M842O900M505L035l709J030P11
8379C7774p266m225M09o49J1267l564n050L16k388N123O237l585M3J1687M405
8364E0534M693J249J0151J1276l118o468M000J465P366O169M222J78p39p299j3377
8349G0302j1454n491k4p512o988p29j137q667l462K331M831M181J075o103K406
8334C3559m942k382j282j64L548j901m504j832J894k423K696J955M594K399r971
8319B1244L231P044j456k794M750j792P836J3526O171K977p489p848j701L221
8305D6920j879q37k041o929o90n033j0385j0492j531k755J620Q78l465O0O583
8290A0024K687k772J17j774k14J647K169J626q38j032m085o069k97M420J558n015
$$ plain form
8394 39796 31103 22880 22773 30120 35201 32357 18949 20460 25302 32202 36707 39742 36033 37063 37774
8379 37774 30508 26283 26692 26043 37310 33746 28696 29012 26624 31747 37984 34399 34442 46129 50534
8364 50534 55227 56476 66627 77903 74785 68317 72317 73782 81148 87317 91539 91717 90978 83679 70302
8349 70302 58848 53357 53333 45821 38833 38104 36967 28300 24838 27169 32000 36181 37256 31153 33559
8334 33559 28617 26235 24953 24789 28337 26436 21932 20100 21994 19571 22267 24222 28816 31215 21244
8319 21244 24475 31519 30063 27269 32019 30227 38063 51589 57760 60737 53248 45400 43699 46920
8305 46920 45041 44204 42163 35234 34544 29511 19126 8634 7103 4348 5968 6846 3381 3441 10024
8290 10024 12711 9939 10056 8282 8068 9715 11884 13510 12672 11640 7555 1486 1189 5609 7167 2152
8274B152o342j411M014J131N332R198K244p275R60K302K757q88o443p92p74O22
8258F787J981L648K50r116o132L62N35M625O929L026j5144m79Q226J0935Q319
8243B4752N493R12j0099n928m266R12q94n775l360L645K080Qj501k122O660O807
8227A7324O459k035N79j982k065k534O713o60m092l944L447o24j776Q49J364j315
8211A5708k070j299o73Q91M537O50j94L834j754j1259L186N464l832K886J898
8196A7973k473N576J3099J1236n29M20O887P628J3565J6040J0245R578K181j3412
8182I8014j3480j1667n34j498k445o211j3328j4489r739q456j0095K182M901J882
8168A5037n710k086j802m357J625n902N894M530k403l88M310j05J54k305P657
$$ plain form
8274 2152 -4190 -5601 -1587 -456 4876 14074 16318 9043 10003 12305 15062 14174 7731 6939 6165 6787
8258 6787 8768 12416 12666 3550 -2582 -2220 -1685 2940 9869 12895 -2249 -2728 5498 16433 24752
8243 24752 30245 31157 21058 15130 10864 11776 10882 5107 1747 5392 7472 7480 5979 3857 10517 17324
8227 17324 23783 21748 22327 20345 18280 15746 22459 21799 17707 13763 17210 16586 14810 15659 17023 15708
8211 15708 13638 12339 11666 12557 17094 17744 17550 21384 19630 8371 11557 17021 13189 16075 17973
8196 17973 15500 21076 34175 45411 44882 45302 52189 59817 73382 89422 99667 109245 111426 98014
8182 98014 84534 72867 72333 70835 68390 62179 48851 34362 24623 16167 6072 8254 13155 15037
8168 15037 9327 7241 5439 1082 2707 -3195 2699 7229 4826 4438 8748 8643 8797 6492 14149
8153A4149L682q893l182N875L597o460j838n27m132L485O492Q793M258n889K402
8138B1812Q171J418P778J1154J2000P514O399Q6j4392j9891j2522j754J288q768
8124B0293r127L364R11L482j346K383M011n803j704J943j048j046J683k084K499
8109A8411L777m142l080L582n91R65J267m452m381P67J869R19N851M395K525J980
8093B9662N844L218K932P340M600K425J659J6360L977p462j2576j4498m427m117
8079C4937p907j633k849o446Q880K985P288l099K446O662L176N425N321m613L64
8064E0937K016r11K553j505N513J1175R226M593M462K0010K1125P530J4413K1128
8050A72265J5208Q566J0251N430l801j0542j3426j6480r900p946o52l593n253
$$ plain form
8153 14149 17831 8938 5756 11631 15228 8768 6930 6403 2271 5756 12248 21041 25299 19410 21812
8138 21812 29983 31401 39179 50333 62333 69847 76246 76332 61940 42049 29527 27773 29061 20293
8124 20293 11166 14530 15441 18923 17577 19960 23971 18168 16464 18407 17359 16313 17996 15912 18411
8109 18411 22188 18046 14966 18548 17957 18922 20189 15737 11356 12123 13992 14911 20762 25157 27682 29662
8093 29662 35506 38724 41656 48996 53596 56021 57680 74040 78017 70555 57979 43481 39054 34937
8079 34937 27030 25397 22548 16102 24982 27967 35255 32156 34602 41264 44440 49865 55186 50573 50937
8064 50937 52953 52042 54595 53090 58603 69778 79004 83597 88059 108069 129194 136724 151137 172265
8050 172265 187473 196039 206290 211720 207919 197377 183951 167471 157571 149625 148973 145380 140127
8037A40127n300j6731j6513j4833l522m737k037l090n803K968J609R76K832L90
8023G6336N032l144M124K928L835K508m918M086J2135O709J3259J1746O945J6408
8009A57989K2895K8016L7048L4639K5552J4019P112k414k2652l3533k6831k8660
7997B13180j6826j9580j3449j3438j0961j7019r218m355j39j915r503k979j0662
7984H3136o996n471p139J55M428j140O483k767l635N167L785k634K279n869n21
7969F9261P028O577M47j737N258L489J1036J2966J3607M060K805k328k901l463
7955A26105m589q735r412j3027j3684M42j401l259L2j2598j0247r094m223n60
7941C5750k297l164j922M659K726n780l240P17q119l937J382J823J422p094m007
$$ plain form
8037 140127 134827 118096 101583 86750 83228 78491 76454 73364 67561 70529 72138 73114 75946 76336
8023 76336 81368 78224 82348 85276 89111 91619 86701 90787 102922 109631 122890 134636 141581 157989
8009 157989 180884 208900 245948 280587 306139 320158 327270 324856 302204 268671 241840 213180
7997 213180 196354 176774 163325 149887 138926 121907 112689 108334 108195 106280 96777 93798 83136
7984 83136 76140 70669 63530 63685 68113 66973 73456 70689 67054 72221 76006 73372 75651 69782 69261
7969 69261 76289 82866 83313 81576 86834 90323 101359 114325 127932 131992 134797 132469 129568 126105
7955 126105 121516 112781 103369 90342 76658 77100 75699 72440 72472 59874 49627 40533 36310 35750
7941 35750 33453 30289 28367 33026 35752 29972 26732 27449 19330 15393 16775 18598 20020 12926 8919
7926H919K224M153N085o097j459P954l70L624l829K154J616L167l160l892J5j279
7910A8825l347k682J323L150m46j447k903K859N195N145l057q570K90J831m73
7895A5693K103k069l944l919M1K694L984j027R60j901o29l738N95L471p57n233
7879F324k021N806K050j213m047K310R22k768p91K754L957l605k163k616O79p57
7863D821N36N225k841m653R31K480k89j778J057j583j105L486M704m11j0261k268
7847a949Q49P6P762l736k511o130j0437J861R801M270k82J256K270j16j166n220
7831c402J087K178K812m738j225M259l071J424r12N325L29Q06J533k484k638q059
7815f776J63O488M501K587l998q698K164n9j653k082q423m19O327L659M378q18
$$ plain form
7926 8919 11143 15296 20381 14284 12825 20779 20409 24033 20204 22358 23974 27141 23981 20089 20104 18825
7910 18825 15478 12796 14119 17269 16823 15376 12473 15332 20527 25672 22615 14045 14335 16166 15693
7895 15693 17796 15727 11783 7864 7905 10599 14583 13556 14516 12615 11986 8248 8843 12314 11557 6324
7879 6324 4303 10109 12159 10946 6899 9209 10131 7363 6572 9326 13283 9678 7515 4899 5578 4821
7863 4821 5357 10582 7741 3088 4019 6499 6210 4432 5489 3906 2801 6287 10991 10580 319 -1949
7847 -1949 -1100 -1024 6738 3002 491 -5639 -16076 -14215 -4414 -144 -426 830 3100 2984 1818 -3402
7831 -3402 -2315 -137 2675 -2063 -3288 971 -2100 -676 -1588 3737 4066 4872 6405 3921 1283 -6776
7815 -6776 -6613 -125 4376 6963 2965 -5733 -3569 -3628 -5281 -7363 -15786 -16205 -9878 -6219 -1841 -2659
7799b659O5M392j865k601M778N577k242o009M680k376J339J168j323j747j0106
7784h929k756R354M765j387m055K116o095N39J763J406n704j913J094l229j169
7769a4200M91P945R330j744L123m275m643m479Q40K96J363k716m877l453o36J293
7753a6342L648L836N69m99Q460J93o474M12J904L914N394n593l926m632K49L38
7737h549m291k412K733N645N311n165k934K295q355r43M989Q566l570N825M082
7722C227J449o300n973J642N826m559M99J385l99m305n58j929J864j217q40j909
7706a2097j042q159K082P210M190m746j463K33N201j752m390k445k271m105k131
7691b5685m39K574p4P664j572m1l383J927J0186M497l409N019K229m020n816l289
$$ plain form
7799 -2659 -2594 1798 -67 -2668 2110 7687 5445 -564 4116 1740 3079 4247 2924 1177 -8929
7784 -8929 -11685 -2331 2434 1047 -3008 -892 -6987 -6448 -4685 -3279 -8983 -10896 -9802 -13031 -14200
7769 -14200 -13709 -5764 3566 1822 4945 670 -3973 -8452 -7612 -7316 -5953 -8669 -13546 -16999 -17635 -16342
7753 -16342 -12694 -8858 -8289 -8788 -328 -135 -6609 -6197 -4293 -379 5015 -578 -4504 -9136 -8887 -8549
7737 -8549 -12840 -15252 -12519 -6874 -1563 -6728 -9662 -7367 -15722 -16665 -11676 -3110 -6680 -855 3227
7722 3227 4676 -1624 -7597 -5955 -129 -4688 -4189 -2804 -3203 -7508 -8066 -9995 -8131 -9348 -10188 -12097
7706 -12097 -13139 -21298 -19216 -12006 -7816 -12562 -14025 -13792 -8591 -10343 -14733 -17178 -19449 -23554 -25685
7691 -25685 -26124 -23550 -23624 -15960 -17532 -17573 -20956 -19029 -8843 -4346 -7755 -2736 -507 -4527 -10343 -13632
7675a3632L974O09m243L205L764r61J40m789l558M743k603Q605K818j373m777
7660h078m622M90K063K943k661K94K591J679J340j328l27M682M92j1Or44j789
7643c180m683j515M676l93k343M608J504k717j849Q94o712o53k481l669N257K853
7627a0403J221k970k273K615K182k74J624J108K503L7l288k064l939m692K191
7612a6422Q229O976n223l547m063j108m17L092O728k188k030K994O243K033n636
7597d339j529J867k362l450n401N889L488l715M522O104m021l694L30M476J471
7582c64K692n246n597n762O554N049K748K108o313J657N635L371o583n808J258
7567d601j309j373n460P98L267o641J089M333K391N81l125Q29N890P341L748m749
$$ plain form
7675 -13632 -9658 -9049 -13292 -10087 -6323 -7284 -7144 -11933 -15491 -10748 -13351 -4746 -1928 -3301 -8078
7660 -8078 -12700 -12210 -10147 -7204 -9865 -9571 -6980 -5301 -3961 -5289 -5616 -934 -442 -453 -447 -1391 -3180
7643 -3180 -7863 -9378 -4702 -5095 -7438 -2830 -1326 -4043 -5892 -4998 -11710 -12363 -14844 -18513 -13256 -10403
7627 -10403 -9182 -12152 -14425 -11810 -9628 -9902 -8278 -7170 -4667 -4630 -7918 -9982 -13921 -18613 -16422
7612 -16422 -8193 -1217 -6440 -9987 -14050 -15158 -15575 -12483 -5755 -7943 -9973 -6979 -736 1297 -4339
7597 -4339 -5868 -4001 -6363 -9813 -15214 -9325 -5837 -9552 -5030 1074 -2947 -6641 -6311 -1835 -364
7582 -364 2328 -2918 -8515 -14277 -7723 -2674 74 2182 -4131 -2474 3161 6532 -51 -5859 -4601
7567 -4601 -5910 -7283 -12743 -11945 -8678 -15319 -14230 -9897 -7506 -6925 -10050 -9221 -3331 4010 7758 3009
7551C009J967j178o832r28N003K273J316j015K633K579l986j0239J399r492r48
7536a4439O39r04k714M870J011J937J795M1k053N725N24K506k436o95k256r17
7520g366N286P14l96K974n414M3J712m949j319K713J174k31q327l364L942O394
7504f414Q28l428J774j719N297M128q4m197k531j611M813k73p446k340q06M341
7488i668Q20K117J316J076P197M892j444o025l344J638q56N143P080l390o360
7473A92k727l078M186J107L78l007l552n274M577K464j697K670J102k840r592
7458a5091O781R309l575l604m528J163j931M993k01q616k674R23M567J037Q369
7443c078j253l551K949K100k987J910l43k397n111j681L548M414k21k161n285
$$ plain form
7551 3009 4976 3798 -3034 -3962 1041 3314 4630 3615 6248 8827 4841 -5398 -3999 -13491 -14439
7536 -14439 -13800 -14704 -17418 -12548 -11537 -9600 -7805 -7764 -9817 -4092 -3568 -1062 -3498 -4193 -6449 -7366
7520 -7366 -2080 -1366 -1762 1212 -4202 -4159 -2447 -7396 -8715 -6002 -4828 -5059 -13386 -16750 -12808 -6414
7504 -6414 -5586 -9014 -7240 -8959 -3662 466 382 -3815 -6346 -7957 -3144 -3417 -10863 -13203 -14009 -9668
7488 -9668 -8848 -6731 -5415 -4339 2858 7750 6306 281 -3063 -1425 -2281 2862 9942 6552 192
7473 192 -2535 -5613 -1427 -320 58 -2949 -6501 -11775 -7198 -4734 -6431 -3761 -2659 -5499 -15091
7458 -15091 -8310 999 -2576 -6180 -10708 -9545 -11476 -6483 -6684 -15300 -17974 -17051 -12484 -11447 -3078
7443 -3078 -4331 -7882 -4933 -2833 -5820 -3910 -4253 -6650 -11761 -13442 -9894 -5480 -5701 -7862 -13147
7428a3147K488Q897j716k28K464L419K841n662p262J896p01K957M840l460m192
7413f566J10j774j870L23M991k30M593L658m778n141k063l803j451P527j161l98
7397h033O81m923m619O136R837R895L793l906n058O76l486j062K05m885k722N972
7381a499k108n229j440l766p98J555N583J485l525M168L211J880p061k004N205
7366d343k074n634j210k596m748j5P601R09p95M046L763L962m758k035j14P69
7350g272K927P999k462J05p176m389K660p19n177N937J1554J554k163k164o936
7335e722K45l548k566J052L803J645J972m892n522J499J554M948o76o15O541K856
7319B574K941p23k907J244o201J28o660M137O75L885L347j641p056l917k96K013
$$ plain form
7428 -13147 -10659 -1762 -3478 -3706 -1242 2177 5018 -644 -7906 -6010 -6711 -3754 1086 -2374 -6566
7413 -6566 -6456 -8230 -10100 -9777 -4786 -5016 -423 3235 -1543 -6684 -8747 -12550 -14001 -6474 -7635 -8033
7397 -8033 -7352 -12275 -16894 -10758 -921 8974 12767 8861 3803 4479 993 -69 136 -4749 -7471 -1499
7381 -1499 -3607 -8836 -10276 -14042 -14840 -13285 -7702 -6217 -9742 -5574 -2363 -483 -7544 -9548 -4343
7366 -4343 -6417 -12051 -13261 -15857 -20605 -20620 -13019 -12110 -12905 -8859 -5096 -1134 -5892 -7927 -8041 -7272
7350 -7272 -4345 3654 1192 1297 -5879 -10268 -7608 -8327 -13504 -7567 3987 5541 3378 1214 -5722
7335 -5722 -5477 -9025 -11591 -10539 -6736 -5091 -3119 -8011 -13533 -12034 -10480 -5532 -6208 -6823 -282 2574
7319 2574 5515 4792 1885 3129 -3072 -2944 -9604 -5467 -4792 -907 2440 799 -6257 -10174 -10470 -8457
7303h457k110l633m161O002Q121Q26q51M386K72n744M530J634K825p023r197p576
7287b0156j82J597J2620J1317Q20j222j431p240n229j885N793q94Q187j927o492
7272f324m406j126J633j519K404j117j040J968M481o473j862l769N31P101J0093
7257E75r38p518L841q31o258m521j853m967K067R402J0385K114l917o240K613
7242f046K094n013r95R92r82k105Q229K255m426J765L382J501R66m763j0229M55
7226a2920N076L593J889L428M664p395m781J539N925K32l369o7l288o733Q21N21
7210a0865k032n30K672Q072O605j11O149k018o139r228j440L601L783Q86j843
7195b438K893m73R18k253j224K543J528K147o804k587j175o39K605L534j519k734
$$ plain form
7303 -8457 -10567 -14200 -18361 -12359 -4238 -3412 -4263 123 395 -5349 -819 815 3640 -3383 -12580 -20156
7287 -20156 -20338 -18741 -6121 5196 6016 4794 3363 -3877 -9106 -10991 -5198 -6092 2095 168 -6324
7272 -6324 -10730 -11856 -10223 -11742 -9338 -10455 -11495 -9527 -5046 -11519 -13381 -17150 -16619 -9518 575
7257 575 -363 -7881 -4040 -4871 -11129 -15650 -17503 -22470 -20403 -11001 -616 1498 -2419 -8659 -6046
7242 -6046 -3952 -8965 -9960 -8968 -9950 -12055 -3826 -1571 -5997 -4232 -850 651 1617 -3146 -13375 -12920
7226 -12920 -7844 -4251 -2362 1066 5730 -1665 -6446 -4907 1018 1250 -2119 -2186 -5474 -12207 -11386 -10865
7210 -10865 -12897 -13427 -10755 -2683 3922 3811 9960 7942 1803 -7425 -8865 -5264 -1481 -595 -2438
7195 -2438 455 -18 900 -1353 -2577 -34 1494 3641 -3163 -5750 -6925 -7564 -4959 -1425 -2944 -5678
7179e678N564k468P9j157k734n010l460J317K841K628K51K162K656J603m441P26
7163e121M674m326j503p02J499j459J987n747k010P410J670k186m243q021L427
7148a4651Q475M967J004L328n290j869m912o679J138j973J330k524K498Q538J799
7133d821M25n310j058N019J901l370K534K051K841k204k586J302K362j214J490
7118f38j721j766j585J491J469o569j657M005M850M526K674j521j464J321k233
7103A182m130j564o37r52O053K52J440K11m737l602j888j623j709l334k241P565
7087i714O119l773j505o191M52J832L032P221L76K820m53m296j895K99K707N466
7071B497J917j704K030Q67J23k344l741l729n388N14J862k418l02L89O256N795
$$ plain form
7179 -5678 -114 -2582 -2503 -3660 -6394 -11404 -14864 -13547 -10706 -8078 -7827 -5665 -3009 -1406 -5847 -5121
7163 -5121 -447 -4773 -6276 -6978 -5479 -6938 -4951 -10698 -12708 -5298 -3628 -5814 -10057 -18078 -14651
7148 -14651 -6176 -1209 -205 3123 -2167 -4036 -8948 -15627 -14489 -16462 -15132 -17656 -15158 -6620 -4821
7133 -4821 -4396 -9706 -10764 -5745 -3844 -7214 -4680 -2629 212 -1992 -4578 -3276 -914 -2128 -638
7118 -638 -2359 -4125 -5710 -4219 -2750 -9319 -10976 -6971 -2121 2405 5079 3558 2094 3415 1182
7103 1182 -2948 -4512 -5149 -6101 -48 204 1644 1855 -2882 -6484 -8372 -9995 -11704 -15038 -17279 -9714
7087 -9714 -3595 -7368 -8873 -15064 -14612 -12780 -9748 -2527 -2151 669 216 -4080 -5975 -5676 -2969 2497
7071 2497 4414 2710 4740 5607 5730 3386 -355 -4084 -9472 -8958 -7096 -9514 -9816 -9427 -3171 2624
7055B624O26q961L434P123k218p834n557o374J812J0958O348N28k110k950p055
7040i606K078k670L089L922N092M69l388l863R53K93J829n3n520L23j334j200
7024i586j417n930l863M869l019p86P0M033Q850J31o81l322k14j793l64J470L553
7007g999M613N464M58n933r735k127L393P736j762j646o948K429M805N502K3o95
6991b422j922J898Q007K320l935n507r480J00M855N04k058l746K311O411L004
6976C40L696j144n639p543k1N214K326j019O57L617m092j568N060k849o1J758
6960a268K627K996l65l8n756L12N218m244n362M15N698l874l374j695j711L891
6944f530N43K98P44j361J864j375K659J80j135j207n158O46K16N455M566n110
$$ plain form
7055 2624 3250 -5711 -2277 4846 2628 -5206 -10763 -17137 -15325 -4367 1981 2509 399 -2551 -9606
7040 -9606 -7528 -10198 -7109 -3187 1905 2374 -1014 -4877 -3924 -3631 -1802 -1855 -7375 -7052 -8386 -9586
7024 -9586 -11003 -16933 -20796 -15927 -18946 -19732 -19662 -15629 -6779 -6648 -7329 -10651 -10865 -12658 -13022 -11552 -7999
7007 -7999 -3386 2078 2536 -3397 -13132 -15259 -11866 -4130 -5892 -7538 -14486 -12057 -7252 -1750 -1727 -2422
6991 -2422 -4344 -2446 5561 7881 3946 -1561 -11041 -10941 -6086 -5582 -7640 -11386 -9075 -2664 340
6976 340 4036 2892 -2747 -10290 -10311 -5097 -2771 -3790 -3133 484 -3608 -5176 -116 -2965 -3026 -1268
6960 -1268 1359 4355 3990 3952 -1804 -1492 3726 -518 -5880 -5465 233 -3641 -7015 -8710 -10421 -6530
6944 -6530 -5987 -5689 -4945 -6306 -4442 -5817 -3158 -2978 -4113 -5320 -10478 -9832 -9616 -4161 405 -4705
6928d705n275j689P388J559m8n710K466m119M512M640k439o755p446j748N370
6913a3999L990l566k635k150k783L435O326K948N911J6o155m329M181M563J561
6898b686p177n203Q40J446J3048JkN745K618j227J534n274J37L560j1055p993
6882a1688L556K738l011o29P441K046j296M297n307p570K198K454N11n359p934
6867a7553J534j050P054Q325P203q581o360K815n82J675M400r12j095m159Q61
6852f425P01K248J300J653r409n655q356O206Q918k386M268K679k913j553O0J657
6836g007J3828l199k823n525o614J421j822J88k152J517k249n66K956q57K764
6821a0140O250M669J942l222o326p148l235l119N191O950j484J489p58j27N590
$$ plain form
6928 -4705 -9980 -11669 -4281 -2722 -2770 -8480 -6014 -10133 -5621 -981 -3420 -10175 -17621 -19369 -13999
6913 -13999 -10009 -13575 -16210 -18360 -21143 -17708 -11382 -8434 -2523 -2507 -8662 -12991 -8810 -4247 -2686
6898 -2686 -9863 -15066 -14226 -12780 268 269 267 6012 8630 7403 8937 3663 3800 7360 -3695 -11688
6882 -11688 -8132 -5394 -8405 -9034 -1593 453 -843 3454 -1853 -9423 -7225 -4771 -4260 -9619 -17553
6867 -17553 -16019 -17069 -10015 -1690 5513 -3068 -9428 -6613 -7195 -5520 -1120 -2032 -3127 -7286 -6425
6852 -6425 -5724 -3476 -2176 -523 -9932 -15587 -23943 -17737 -8819 -11205 -6937 -4258 -7171 -8724 -8664 -7007
6836 -7007 6821 3622 799 -4726 -11340 -9919 -11741 -11553 -13705 -12188 -14437 -15003 -12047 -12904 -10140
6821 -10140 -3890 779 2721 -501 -6827 -13975 -17210 -20329 -15138 -8188 -9672 -8183 -8941 -9068 -3478
6806c478Q490m216k403J347O67q18o594J397M63j574l146N088L791n35J852l322
6790b991L483R002rr917Q1P880J4143P112M895O065J312k054j2508j5777m347
6775F370L155m01j522m033p723R66M875O496j023o876p55K144k804l7M217P02
6759C751j304P288K834j750J0962P182J367L086j222j1426l476n463N649k07q216
6744I055l135k807Ln86l873Q158L261l669L580k375p100K586J773K743r13l786
6728B915K407N271p273m144r092k159L62N872K702L537R49k17L490N46O688K522
6712A4376J372o062o209N014k431K694k85M165M897m770k666k326K790K304L162
6697A6025o387j0109m41j743J646n64m0j779n214K270N363p201L113L289K571
$$ plain form
6806 -3478 5012 796 -1607 -260 407 -411 -7005 -5608 -5145 -6719 -9865 -4777 -986 -1521 331 -2991
6790 -2991 492 9494 9485 -432 -351 7529 21672 28784 33679 39744 41056 39002 26494 10717 6370
6775 6370 9525 9124 7602 3569 -4154 -3188 1687 8183 7160 284 -471 1673 -1131 -1168 3049 3751
6759 3751 2447 9735 12569 10819 21781 28963 30330 33416 32194 20768 17292 11829 17478 17271 9055
6744 9055 5920 3113 3116 2530 -1343 6815 10076 6407 9987 7612 512 3098 4871 7614 6701 2915
6728 2915 5322 10593 3320 -824 -9916 -12075 -11713 -5841 -3139 398 1347 1130 4620 5166 11854 14376
6712 14376 15748 9686 3477 8491 6060 8754 8469 12634 17531 12761 10095 7769 10559 12863 16025
6697 16025 9638 -471 -912 -2655 -1009 -1573 -1613 -3392 -8606 -6336 -973 -8174 -5061 -1772 799
6682G99k388l24l23M49m126l107P220N352J461K350Pk848p11k783n797r62j990
6665g721l768J785L806j639n685K873J463N359J280r16K539L291j946n44O008
6650F185l179r759N99P69l101p031L921N567j543l390K535L9N172l085j610Q08
6634g103o452k84L349k242j212K037O872r92l82k931q48N390k671j195m498K069
6618a1093l514K940M751l243K06N989K287p871k185K995L545O75j990n592k924
6603a5024l666P852N165j652J022j719J906j517n807O023n898k451j227M249P880
6588d864K158k189k680M22J512K114l754k908j32Q636m20k751J423K558J2J697
6572H34l613j217j216M734l259n951n499M427O726O278J873l826o079J780O406
$$ plain form
6682 799 -1589 -1913 -2236 -1787 -5913 -9020 -1800 3552 5013 7363 7370 4522 3811 1028 -4769 -5731 -7721
6665 -7721 -11489 -9704 -5898 -7537 -13222 -10349 -8886 -3527 -2247 -3163 -624 2667 721 177 6185
6650 6185 3006 -6753 -6154 -5385 -8486 -15517 -11596 -6029 -7572 -10962 -8427 -8388 -3216 -6301 -7911 -7103
6634 -7103 -13555 -13839 -10490 -12732 -13944 -11907 -5035 -6027 -6409 -9340 -10188 -4798 -7469 -8664 -13162 -11093
6618 -11093 -14607 -11667 -6916 -10159 -9953 -3964 -1677 -9548 -11733 -8738 -5193 -4518 -6508 -12100 -15024
6603 -15024 -18690 -10838 -5673 -7325 -6303 -8022 -6116 -7633 -13440 -7417 -13315 -15766 -16993 -12744 -4864
6588 -4864 -2706 -4895 -7575 -7153 -5641 -3527 -7281 -10189 -10321 -1685 -2105 -4856 -3433 -875 -863 834
6572 834 -2779 -3996 -5212 -478 -3737 -9688 -15187 -10760 -4034 2244 4117 291 -5788 -4008 2398
6557B398J211l597l140K969R82q252p254m123k579n54P953N367K881R27J452m035
6541g394n120m47q42o71n3o33O2M877L061k146J709p11j09M774k082j329L112
6524c942j097m501n864l46O2J747J983J205P60M837L639l439l337j0J765O109
6508d29j324L44M637P763k915k780m397J949o82j493K603k053k182o590l482j571
6492a2602P930J387k131K21l264n223j529k827l688P11l070J449N915J063P430
6477h228l446j530K010M340l084m628K590L478K22k232O611n326p177k302J2156
6462f546J0176m270o550p27k42l328m632J074N709k50L804q79k826l037K52K737
6446i535P112K619J39J722M162p094l045m224K034m698k808O728M355Q03K717
$$ plain form
6557 2398 3609 12 -3128 -159 823 -7429 -14683 -18806 -21385 -21939 -13986 -8619 -5738 -4811 -3359 -7394
6541 -7394 -12514 -12961 -13803 -14474 -14527 -15160 -15098 -10221 -7160 -9306 -7597 -8308 -8417 -3643 -5725 -7054 -3942
6524 -3942 -5039 -9540 -15404 -15750 -15688 -13941 -11958 -10753 -9993 -5156 -1517 -4956 -8293 -8303 -6538 -429
6508 -429 -1753 -1409 3228 10991 8076 5296 899 2848 2166 673 3276 1223 -959 -7549 -11031 -12602
6492 -12602 -4672 -3285 -5416 -5195 -8459 -13682 -15211 -18038 -21726 -21015 -24085 -22636 -16721 -15658 -8228
6477 -8228 -11674 -13204 -11194 -6854 -9938 -14566 -11976 -8498 -8276 -10508 -3897 -9223 -16400 -18702 -6546
6462 -6546 3630 -640 -7190 -7917 -8159 -11487 -16119 -15045 -9336 -9586 -5782 -6661 -9487 -12524 -12272 -9535
6446 -9535 -2423 196 335 2057 6219 -875 -3920 -8144 -6110 -10808 -13616 -6888 -2533 -1730 987
6431I87l865l598J747L566J972K80m150j195M144n066n118R44O852J179n579O25
6415f275M073j589n608m536j202M437O228P112N01m293j904M076M003l216j965
6400a58m50J291J688m8p046l379k61l372j775O173Q239j509m690O325J83o504
6384e293j649L26l096J020M317K454J808J217r30K159L950M289k674k092j389
6369D417M945p556p006k681m947J187j52j02M996O225l865M25J892O391J0n221
6353a042q979P779M226J651N536n493o169p456l01J168J042l7m328j940o11N234
6337i720j196j194m26N692L52m843K062N913M079o53L317J256J190l46m970j556
6321a043O586L619k70o244K562j771J705K905j0095m466l390O935J110n661J202
$$ plain form
6431 987 -2878 -6476 -4729 -1163 809 1089 -3061 -4256 -112 -5178 -10296 -9352 -2500 -1321 -6900 -6275
6415 -6275 -2202 -3791 -9399 -13935 -15137 -10700 -4472 2640 3141 -1152 -3056 1020 5023 1807 -158
6400 -158 -608 683 2371 2323 -4723 -8102 -8363 -11735 -13510 -7337 902 -607 -5297 1028 1211 -5293
6384 -5293 -6942 -6616 -9712 -8692 -4375 -1921 -113 1104 174 2333 6283 10572 7898 5806 4417
6369 4417 9362 1806 -5200 -7881 -12828 -11641 -11793 -11895 -6899 -674 -4539 -4114 -2222 4169 4179 -1042
6353 -1042 -10021 -2242 1984 3635 9171 3678 -2491 -9947 -10248 -9080 -8038 -8075 -12403 -14343 -14954 -9720
6337 -9720 -10916 -12110 -12536 -6844 -6492 -11335 -9273 -3360 719 66 3383 4639 5829 5483 513 -1043
6321 -1043 5543 9162 8892 2648 5210 3439 5144 8049 -2046 -6512 -9902 -2967 -1857 -7518 -6316
6306f316M926N957J9k809J722l334J919J423l027n227m365M414J727l791K085
6291d677Q90k784o114k385N081N782K024j124K121M16j868m417o304p60j137M109
6275a1147L431k042L246N93k670M442L474L62k508K090j050L101k944k754p204
6260a1580n693L132Q598J1408N793j002k696L486j063l72j86K197J734j0644m905
6245a793L585k568k091l931M466j740R32q83k331n28L16K074l496p069J235L660
6229a0162Q915k26m294l731o010k201P72O14L76K18N016L61l183j618L936N569
6213e648M48M69N671K159j376k433k090P11m968K731J884J819m88n895L559J65
6197c282K010p83o19k956L291M983M92j520o189M609M49j903L294j140l811l586
$$ plain form
6306 -6316 -1390 4567 4586 1777 3499 165 2084 3507 480 -4747 -9112 -4698 -2971 -6762 -4677
6291 -4677 -3787 -6571 -12685 -15070 -9989 -4207 -2183 -3307 -1186 -770 -2638 -7055 -13359 -14119 -15256 -11147
6275 -11147 -7716 -9758 -6512 -5919 -8589 -4147 -673 -311 -2819 -729 -1779 1322 -1622 -4376 -11580
6260 -11580 -17273 -14141 -5543 5865 11658 10656 7960 11446 10383 10011 9825 12022 13756 3112 -1793
6245 -1793 1792 -776 -2867 -6798 -2332 -4072 -3140 -4023 -6354 -6882 -6566 -4492 -7988 -15057 -13822 -10162
6229 -10162 -1247 -1473 -5767 -9498 -15508 -17709 -16937 -16323 -15947 -15729 -10713 -10352 -13535 -15153 -11217 -5648
6213 -5648 -5200 -4731 940 3099 1723 -710 -2800 -2089 -7057 -4326 -2442 -623 -1111 -7006 -3447 -3282
6197 -3282 -1272 -2055 -2674 -5630 -2339 2644 3136 1616 -4573 36 485 -1418 1876 736 -3075 -6661
6181f661L628Q72j081j289o412L62L392o878k529L225L65j475P38m887J24j39
6165a8645Q34k059k493M185k320n17L852J494m709J152P690L933O984K4o202l724
6149a0521j468l726j724N020J171Q01r86J674l446N928J0262L162L473k865O33
6134G388N53p980q537n94M836k293O878l63k981j084M637L658J846j652k986o420
6118e094p600K760J1487K670l96j382n237o967J977L540O587k260m837k352l598
6103a0702n155N138N858J993k781K830k346j608P00o2N770L851k272K917n103
6088i72l116o67l454M492O277J586p35m338J310J638Q07N267l704o79l737j04
6072a29M001J286m117O56l122J123L467L519o251q005k237l687K480P839R513
$$ plain form
6181 -6661 -3033 -2161 -3242 -4531 -10943 -10581 -7189 -14067 -16596 -13371 -13006 -14481 -13743 -18630 -18506 -18645
6165 -18645 -17811 -19870 -22363 -18178 -20498 -21015 -17163 -15669 -20378 -19226 -11536 -7603 -619 -595 -6797 -10521
6149 -10521 -11989 -15715 -17439 -12419 -11248 -10447 -11433 -9759 -13205 -7277 2985 6147 9620 6755 7388
6134 7388 7941 -39 -8576 -9170 -4334 -6627 251 -112 -3093 -4177 460 4118 5964 4312 1326 -5094
6118 -5094 -12694 -9934 1553 4223 3827 2445 -2792 -9759 -7782 -4242 2345 85 -4752 -7104 -10702
6103 -10702 -15857 -10719 -4861 -2868 -5649 -2819 -5165 -6773 -6073 -6135 -365 3486 1214 4131 -972
6088 -972 -4088 -4755 -8209 -3717 2560 4146 3411 -927 383 2021 2828 8095 4391 3712 -25 -129
6072 -129 3872 5158 1041 1697 -1425 -302 3165 6684 433 -7572 -9809 -13496 -11016 -3177 6336
6057F336n175n097L49K956J931K53J389m428m496J049J876J388k200M99K855j192
6041a707J547l55p535J119n97L808L373K70J029j220K875K596q792k495J488J128
6025c468n164J915k924m233k976M650L487j432n27P469N45r834k661K296J728
6010a1129J993J069K59K718k354l949P239M372r096j272j294J747P854j0545n596
5995a7984N919O498j460p104P435K869N258j095n711Q24k176L469K546o795l08
5980g815k018q040j599J825N308M624P376Q440o733m893j001K216K65r675n441
5965a7161k557N889J0789N033K003p47J817n004o501P67m3k811J437k14N529p55
5949b529N77K566M141n151p897M838l402j1303K764J2698N844m804j725J003J201
$$ plain form
6057 6336 1161 -3936 -3587 -631 1300 1553 2942 -1486 -5982 -4933 -3057 -1669 -3869 -3370 -515 -1707
6041 -1707 -160 -515 -8050 -6931 -7528 -3720 -347 -77 952 -268 2607 5203 -3589 -6084 -4596 -3468
6025 -3468 -8632 -6717 -9641 -13874 -16850 -12200 -8713 -10145 -10672 -3203 -2658 -12492 -15153 -12857 -11129
6010 -11129 -9136 -8067 -7808 -5090 -7444 -11393 -4154 218 -8878 -10150 -11444 -9697 -1843 -12388 -17984
5995 -17984 -12065 -5567 -7027 -14131 -6696 -3827 1431 336 -5375 -4551 -6727 -3258 -712 -7507 -7815
5980 -7815 -9833 -17873 -19472 -17647 -12339 -7715 -339 8101 1368 -3525 -4526 -2310 -2045 -11720 -17161
5965 -17161 -19718 -13829 -3040 1993 3996 3249 5066 62 -6439 -5672 -5715 -8526 -7089 -7303 -1774 -2529
5949 -2529 -1952 614 4755 -396 -8293 -3455 -6857 -18160 -15396 -2698 3146 -1658 -3383 -2380 -1179
5934a179J969o418o564J88J705k778o83L212M480O554L362o814o3l781q123K700
5918a2233M121O576J268m246l646K839K146o66P226O84j0442q88M221k97j941
5903e278l10K685j49K676J27q924l540k490L934M213L075r004R840K963K250K618
5887D686N63j138k452k843L207P077j90j784l066r031p12N45j503O948L838j0359
5871f214o188q0M607N156J588j049L099q50M053m749n033j854O16k810m078L453
5855a0333L840P556K376Q06m031n498m252J958O242k114q097L137O714k648p605
5840a1949M231P465J333N812l828m346J784l558j125J095J813L283j497l621J590
5825a518k797j595j203k103k340L288j99K098N447J041p279j424j154r096K139
$$ plain form
5934 -1179 790 -5628 -12192 -12004 -10299 -13077 -13760 -10548 -6068 486 3848 -2966 -3029 -6810 -14933 -12233
5918 -12233 -8112 -1536 -268 -4514 -8160 -5321 -3175 -3841 3385 4069 -6373 -7261 -3040 -3337 -5278
5903 -5278 -5588 -2903 -3052 -376 -249 -9173 -12713 -15203 -11269 -7056 -3981 -12985 -3145 -182 2068 4686
5887 4686 5249 4111 1659 -1184 2023 9100 8910 7126 4060 -4971 -5683 -5138 -6641 307 4145 -6214
5871 -6214 -12402 -12482 -7875 -2719 -1131 -2180 919 69 4122 -627 -5660 -7514 -6898 -9708 -13786 -10333
5855 -10333 -6493 1063 3439 4245 214 -5284 -9536 -7578 -1336 -3450 -11547 -8410 -1696 -4344 -11949
5840 -11949 -7718 -253 1080 6892 3064 -1282 502 -3056 -4181 -3086 -1273 2010 513 -3108 -1518
5825 -1518 -4315 -5910 -7113 -9216 -11556 -8268 -8467 -6369 -922 119 -7160 -8584 -9738 -18834 -16695
5810a6695L826N583L642L658k059R9J638k020J980q88q17L518P36J157K626p65
5794E219k967K830j767m853l616j008n550k75Q45L147N467j847m345r04K128J244
5778f252P95j793l544L265K902K57l370n023L383N483L507l120o25L230l724j550
5762f179M360j92l180Q65J752r43J503J355n662k499L496M177R63N155P99Q034
5746A3804M124j282m416r046j382P69j0602l312M074P250k396j171m50j978k076
5731h090L349K623r09j902l175N43k54J207q69j257j340j841j079P65M521j165
5715h873l440p22K273j258L276m0l848j606N29L560N702k390l766o100M258O08
5699a1837K389R93p55j944K951N118j720N950J690p485r94p89M064L419k198q30
$$ plain form
5810 -16695 -12869 -7286 -3644 14 -2045 -1946 -308 -2328 -348 -1236 -2053 1465 2201 3358 5984 5219
5794 5219 2252 5082 3315 -1538 -5154 -6162 -11712 -11987 -11142 -7995 -2528 -4375 -8720 -9624 -7496 -6252
5778 -6252 -5457 -7250 -10794 -7529 -4627 -4370 -7740 -12763 -9380 -3897 -390 -3510 -4135 -905 -4629 -6179
5762 -6179 -1819 -2011 -5191 -4326 -2574 -3517 -2014 -659 -6321 -8820 -5324 -1147 -184 4971 5770 13804
5746 13804 17928 16646 12230 3184 1802 2571 -8031 -11343 -7269 -19 -2415 -3586 -4036 -6014 -8090
5731 -8090 -4741 -2118 -3027 -4929 -8104 -7561 -7815 -6608 -7477 -8734 -10074 -11915 -12994 -12229 -7708 -8873
5715 -8873 -12313 -13035 -10762 -12020 -8744 -8784 -12632 -14238 -13709 -10149 -4447 -6837 -10603 -16703 -12445 -11837
5699 -11837 -9448 -8455 -9210 -11154 -8203 -3085 -4805 1145 2835 -4650 -5644 -6433 -2369 1050 -1148 -1978
5683a978N880J72l236k06k536r33j841j567J672J018M783o838l062L522J714J137
5667b299r51j125l376n508M666J3331Q176k332j779k975m302n190n182O812M117
5652B083QK003N557J58P32j548r038n940o228K419J0955J626K032L267L74n247
5636C213K127J138m853K08O53n052l726K677K603j1504m279J1549M418L448q480
5621e860o202J646L474k362j688N298M531m236M341M568K923N22m589l233l627
5606d494j713L820p27K356N886L450L21q283q719n63j577p073n15M275K147J0630
5590g79M202l054N203n30o934j240L172n573J538j947l672M34K873K979l415Q59
5574e884R4k006k550j50O011N239K572j539j46K809m449n25O79M19m337j205J703
$$ plain form
5683 -1978 3902 4074 838 632 -1904 -2837 -4678 -6245 -4573 -3555 1228 -5610 -8672 -5150 -3436 -2299
5667 -2299 -3250 -4375 -7751 -13259 -8593 4738 12914 10582 8803 5828 1526 -3664 -8846 -2034 2083
5652 2083 2091 4094 9651 9809 10541 8993 -45 -5985 -12213 -9794 1161 2787 4819 8086 8460 3213
5636 3213 5340 6478 1625 1833 2486 -2566 -6292 -3615 -1012 -12516 -16795 -5246 -828 2620 -5860
5621 -5860 -12062 -10416 -6942 -9304 -10992 -5694 -1163 -5399 -1058 3510 6433 6955 2366 -867 -4494
5606 -4494 -6207 -2387 -3114 -758 5128 8578 8899 616 -8103 -8666 -10243 -17316 -17831 -13556 -11409 -779
5590 -779 3423 369 5572 5042 -1892 -3132 40 -5533 -3995 -5942 -9614 -9180 -6307 -3328 -6743 -5884
5574 -5884 -5790 -7796 -10346 -10496 -4485 754 3326 1787 1641 4450 1 -524 155 574 -3763 -4968 -3265
5557c265N290l446l236k701j635N261M324j471L277p99K98j903j328L385l083
5542a032p234R86K580P539L193l802r262K60K341J595O276P61j624J039j417l016
5526h17k735R680M575q75n670j0990n91L154K401j309l763N520K932n872j392
5511e752j954m63L647K998o14J158L503L228m419n757N041J396m872o01j387K050
5495b798j953J06l066k093N795M290j900j022k602j83L308J400m935L234l23J925
5479h17q302j156N648p61N570M098K161j126m650J687r539r745p274L983M696
5464a5527L291K008N616Q543p80j10Q267M358k639o974r805J574N756j358j0646
5449h426j845N796J579K81j861J84P077N006m471n78M12j948k998j86J912k356
$$ plain form
5557 -3265 2025 -1421 -4657 -7358 -8993 -3732 592 -879 2398 1599 1897 -6 -1334 2051 -1032
5542 -1032 -8266 -7280 -4700 2839 6032 2230 -7032 -6772 -4431 -2836 3440 4201 2577 3616 2199 -817
5526 -817 -3552 6128 10703 9828 4158 -6832 -7423 -4269 -1868 -3177 -6940 -1420 1512 -4360 -5752
5511 -5752 -7706 -8169 -4522 -1524 -2138 -980 2523 5751 1332 -4425 616 2012 -2860 -3461 -4848 -2798
5495 -2798 -4751 -4645 -7711 -9804 -4009 281 -1619 -2641 -5243 -5426 -2118 -718 -5653 -2419 -2742 -817
5479 -817 -9119 -10275 -4627 -5388 182 4280 6441 5315 665 2352 -7187 -16932 -24206 -20223 -15527
5464 -15527 -12236 -10228 -4612 3931 3151 3041 11308 15666 13027 6053 -3752 -2178 3578 2220 -8426
5449 -8426 -10271 -4475 -2896 -2615 -4476 -4292 2785 7791 3320 2742 3154 1206 -1792 -1978 -66 -2422
5433b422j946K046R5J893K671J051k848L445M163j783p489J77Q449J146L154m583
5417G219j0403k780k161n57K201L150j315k256K295k671P63j938j944R20L636
5402e841l466K046O354L972K74r359l583J770K566L051n901k410J198L951L304
5387b074m68j366k61p227M185J0102M292p576q641M45N003O557M193K00m133l267
5371c6j980J972o05R76r9m095p39L815J029K771l509M913l531l490L910k276J58
5354h16k145K433l149J322M777j495j183K954l521q368l372J178K153P523K767
5339A058n321j045m129K676M189K424N983o1K321r032p128l438J147p28P213K977
5323h94n28n853N47O259Q5l382K146l703k389M0K016M732M80R80l352n966k027
$$ plain form
5433 -2422 -4368 -2322 -2227 -334 2337 3388 540 3985 8148 6365 -1124 -947 7502 8648 11802 7219
5417 7219 -3184 -5964 -8125 -8682 -6481 -3331 -4646 -6902 -4607 -7278 -6515 -8453 -10397 -9477 -5841
5402 -5841 -9307 -7261 -907 3065 3339 -6020 -9603 -7833 -5267 -2216 -8117 -10527 -9329 -5378 -2074
5387 -2074 -2542 -3908 -4169 -11396 -7211 2891 7183 -393 -9034 -8589 -3586 2971 7164 7364 3231 -36
5371 -36 -2016 -44 -649 327 228 -3867 -4606 -791 238 3009 -500 4413 882 -2608 1302 -974 -816
5354 -816 -2961 -528 -3677 -2355 2422 927 -256 2698 -823 -9191 -12563 -11385 -9232 -1709 1058
5339 1058 -4263 -5308 -9437 -6761 -2572 -148 5835 5774 8095 -937 -8065 -11503 -10356 -11084 -3871 -894
5323 -894 -1422 -7275 -6728 -469 -384 -3766 -1620 -5323 -7712 -7672 -5656 -924 -444 536 -2816 -8782 -10809
5306a0809M208P230j493k983N16j76N994L840N57l527R83p456m630j086m489M094
5290i227J1220J1210k359j899J262o043k639O24J919R86k307j816K639P83M618
5275H971R69k344N94k666J411N983m265q396k880l241j078o59j580n991m560r
5259a9741P942Q889M557P040J0930m618r067o362n08k954N365N234L815j322r321
5244a21k994Q20j132j368J208P085M230M27L390j127J510m432m567r232K508r48
5228d743J538Q19j207K157K775L159r79j665r37k183k034j82n2K97K910J016j264
5211e75K891L85l935l056k653M357j268o859K828N276J714K846J143M359J647
5196I100p895k806j1055k457Q522L840O70n28K60K595L332k96j514k056n103J911
$$ plain form
5306 -10809 -6601 629 -864 -3847 -3331 -3507 2487 6327 6884 3357 4340 -3116 -7746 -8832 -13321 -9227
5290 -9227 1993 13203 10844 8945 10207 4164 1525 2149 4068 5054 2747 931 3570 4353 8971
5275 8971 9940 7596 8190 5524 6935 12918 8653 257 -2623 -5864 -6942 -7601 -9181 -15172 -19732 -19741
5259 -19741 -11799 -2910 1647 8687 19617 14999 5932 -430 -938 -3892 1473 6707 10522 9200 -121
5244 -121 -3115 -2295 -3427 -4795 -3587 3498 7728 8155 11545 10418 11928 7496 2929 -6303 -3795 -4743
5228 -4743 -3205 -2386 -3593 -1436 1339 4498 3519 1854 917 -1266 -3300 -3482 -3534 -3237 -327 689 -575
5211 -575 2316 2701 -1234 -4290 -6943 -2586 -3854 -10713 -7885 -2609 -895 1951 3094 7453 9100
5196 9100 1205 -1601 -12656 -15113 -6591 -2751 -2081 -2609 -2349 246 3578 3282 1768 -288 -5391 -3480
5180c480Q12K714k703j716q24M20K187N161J777j740J796n75p774k494N44P028
5164A133M451l804m963K587J301J932m393o833r88M290m25K920J973o69J34K003
5148F49J501m46Q98k961k707J37N859J595j717o88n129n933J35N262k353j638
5132g536o30o96J508L035j017J495j824k33N245l876j022M759l716n798J223R179
5116I6N393k182l856R35K60R66l714M607N563J151j639m490p938j666m35N031
5100a918N70l618j160L205J687q010o454P738j042q308L638K799N571N378L246
5085C322m034J270k478J163N461J390n741r936j433P901O118Q89n865n820o921
5070a4714Q10jO568J333l341j435P539L922L550k951M12K963k357l518r333K645
$$ plain form
5180 -3480 -2668 46 -2657 -4373 -5197 -4777 -2590 2571 4348 2608 4404 3829 -3945 -6439 -5895 1133
5164 1133 5584 1780 -3183 -596 705 2637 -1756 -8589 -9577 -5287 -5712 -2792 -819 -1488 -1354 649
5148 649 2150 1704 2602 -359 -3066 -2929 2930 4525 2808 2120 -3009 -8942 -8807 -3545 -5898 -7536
5132 -7536 -8166 -8862 -7354 -4319 -5336 -3841 -5665 -5898 -653 -4529 -5551 -792 -4508 -10306 -9083 96
5116 96 5489 3307 -549 386 646 1612 -2102 2505 8068 9219 7580 3090 -4848 -6514 -6949 -1918
5100 -1918 -1348 -4966 -6126 -2921 -1234 -9244 -15698 -7960 -9002 -17310 -13672 -10873 -5302 76 3322
5085 3322 -712 558 -1920 -757 4704 6094 353 -9583 -11016 -3115 3003 3892 -1973 -7793 -14714
5070 -14714 -13904 -13905 -7337 -6004 -9345 -10780 -3241 681 4231 1280 1692 4655 2298 -1220 -10553 -7908
5054g908J70K690M610k703N876L783k953Q90m083l134j942k195N662L747k496
5039A4K477o898l471O551N957M698J106k541n513J761J055J293l36j732n707L8
5023a248L424J094l495j429K722n397r19j826l720N25M251N078L263m267K4j949
5007c869m9m64m808N07P402p144o821N067L554R06L414M899m360j073L560K268
4991B989r119m216K245N465J605L154R41J151r90k484l910j933j42l826m225j30
4975a3425K531M437K470M440L930K417p562o05l337j070N407L436j01J84j767
4960A385l582j290r7k856R44J690Q205n36k515M934J547m830m988K368K531M331
4944G241j48Q24l26o591k397M780L898L692K142p667J021N90k033J224R60l923
$$ plain form
5054 -7908 -7738 -5048 -438 -3141 2735 6518 3565 4455 372 -2762 -4704 -6899 -1237 2510 14
5039 14 2491 -4407 -7878 -1327 4630 9328 10434 7893 2380 4141 5196 6489 6153 4421 -1286 -1248
5023 -1248 2176 3270 -225 -1654 1068 -4329 -5248 -7074 -10794 -10269 -6018 -940 2323 -1944 -1920 -3869
5007 -3869 -3918 -4382 -9190 -8683 -1281 -8425 -15246 -10179 -6625 -5719 -2305 2594 -1766 -2839 721 2989
4991 2989 -6130 -10346 -8101 -2636 -1031 2123 3064 4215 3225 741 -3169 -5102 -5244 -9070 -13295 -13425
4975 -13425 -10894 -6457 -3987 453 4383 6800 -762 -1367 -4704 -5774 -367 3069 2968 3152 1385
4960 1385 -2197 -3487 -3584 -6440 -5496 -3806 4399 3863 1348 6282 7829 2999 -1989 379 2910 7241
4944 7241 7093 7917 7591 1000 -1397 3383 7281 10973 13115 5448 6469 7059 5026 6250 7210 3287
4928C287l97J2747k649j2248k397j541q848M867K113L898L431J239l17j224m9
4913A912o738j832K514J734J353l055j528K772J425n295n528l243M320Q492Q08
4898a889J810k619J098k231J148k595K678L54n708N179K399n111R1N670L70Q31
4882A475J790K139m55j675J572n522l480J108L985n214k897O035p37o421k667
4867a0964L506J691J678q92L713J502M682L438k081r949J622L461j418K361P14
4852C064m747k515k99M866j513l62N77l645j11m310O371L439M93j366p29o34J073
4835c48m857O86N710m614n899k223Q28P489O457p28k305l78k750j013N606Q319
4819I980l73j129J0471l514m475o403R07j021n464J60L911J502L042J038j730
$$ plain form
4928 3287 2890 15637 12988 740 -1657 -3198 -12046 -7179 -5066 -1168 2263 3502 3185 1961 1912
4913 1912 -4826 -6658 -4144 -2410 -1057 -4112 -5640 -2868 -1443 -6738 -12266 -15509 -11189 -2697 -1889
4898 -1889 -79 -2698 -1600 -3831 -2683 -5278 -2600 -2246 -7954 -2775 -376 -5487 -5396 274 644 1475
4882 1475 3265 5404 4949 3274 4846 -676 -4156 -3048 937 -4277 -7174 -1139 -1876 -8297 -10964
4867 -10964 -7458 -5767 -4089 -4981 -1268 234 4916 8354 6273 -3676 -2054 1407 -11 2350 3064
4852 3064 -1683 -4198 -4497 369 -1144 -1506 -929 -4574 -4685 -8995 -2624 815 1308 -58 -787 -1421 -348
4835 -348 -5205 -4519 1191 -3423 -9322 -11545 -10717 -3228 3229 2501 196 -182 -2932 -3945 1661 9980
4819 9980 9607 8478 18949 15435 10960 4557 5464 4443 -1021 -861 3050 4552 7594 8632 6902
4804F902p101k55J616l972k093n7k069m791K217J163N703J18K048J338k4K803
4788C546J728n746m563M213K967k639o240K450O047L227j84J367J388L653l484
4773G730q659J206K1n107p45M170m06o841j573Q16J862k061L983R747P9p72P51
4756D201n580n737k805Q024O761L87j640r169j69Q294k654n036j314K731K424
4741a282M40k541M337j486L487K624L149N76K602k132l985k095o091K838L357
4726C798l640l898J122M244J195k951k301O886M308J944K479n118j049k381o382
4711a744L852m821J75P738j219M635m842m739L4j246k907k761M043J2703M394
4696A3295n78j4k709k297m49L091l160o164k557J363j701K172L186n633j779r86
$$ plain form
4804 6902 -199 -454 1162 -2810 -4903 -4960 -7029 -11820 -9603 -8440 -2737 -2619 -571 767 743 3546
4788 3546 5274 -472 -5035 -822 2145 -494 -6734 -4284 1763 4990 4806 6173 7561 11214 7730
4773 7730 -929 277 298 -4809 -5554 -1384 -1790 -8631 -10204 -9388 -7526 -9587 -5604 4143 4222 3450 4201
4756 4201 -1379 -7116 -9921 -1897 4864 5251 3611 -5558 -5727 2567 -87 -5123 -6437 -3706 -1282
4741 -1282 -842 -3383 954 -532 2955 5579 8728 9304 11906 9774 5789 3694 -2397 441 3798
4726 3798 158 -3740 -2618 1626 2821 -130 -2431 4455 8763 10707 13186 8068 7019 4638 -1744
4711 -1744 2108 -2713 -2538 5200 3981 8616 3774 -965 -931 -2177 -5084 -7845 -3802 8901 13295
4696 13295 12717 12703 9994 7697 7248 10339 7179 1015 -1542 -179 -1880 292 3478 -2155 -3934 -4920
4680d920Q491J619R18l965n371K987K381M653n385n079K749O042o62l131m499
4665c172R70l396Q24P211K555k609N479k914n210K816l58N369R71j2873m224j521
4649a0082M349Q068J660j380M712N3n34j254R23k657K036n260o234m418j378K430
4633h966N271P310N754o357j830j310m549o83n54K596m188K195P883k31m312J863
4617a08M995J314o315p914N272O80J85j303j02L271N196k028p973j028J1458Q652
4601A4252J624q920n287j871L824P134p530o626P664J733q617q428m81o24K555
4586i598P364N053j045k563n97p451N3O983J076j30n648k420k602K973K221L149
4570c182j149L57M270M826m875q282M523J008k909J844L753M443L619p486R72
$$ plain form
4680 -4920 3571 5190 6108 2143 -3228 -241 2140 6793 1408 -3671 -922 5120 4458 1327 -3172
4665 -3172 -2202 -5598 -4774 2437 4992 2383 7862 4948 -262 2554 2196 7565 8536 -4337 -8561 -10082
4649 -10082 -5733 2335 3995 2615 7327 7380 6846 5592 6515 3858 5894 634 -5600 -10018 -11396 -8966
4633 -8966 -3695 3615 9369 3012 1182 -128 -4677 -5360 -5914 -3318 -7506 -5311 2572 2341 -1971 -108
4617 -108 4887 6201 -114 -8028 -2756 -2076 -1891 -3194 -3296 -25 5171 3143 -4830 -5858 5600 14252
4601 14252 15876 6956 1669 -202 3622 10756 3226 -3400 4264 5997 -2620 -11048 -11529 -12153 -9598
4586 -9598 -2234 2819 1774 -789 -1386 -8837 -8784 -1801 -725 -855 -6503 -8923 -11525 -8552 -6331 -3182
4570 -3182 -4331 -3974 296 5122 247 -8035 -3512 -2504 -5413 -3569 184 4627 8246 760 1732
4555A732J869l999m015K426M784P544p039j0728M95L079m81M973M540k152p649
4540d621j693m3L717M891j281L00J581M083m495o486k578L853O432Q262n833n967
4524A22K306J814r617q357N779O545O76n77l694j198L009N464M717l239q352r4
4508d696j36n272O90j744P154J899O438K57k982l916J255j1m535j50L622n52n11
4491c190O043N377K498j966l746J329p121r379j621L216m727L12R004R494K87
4476E810L092N79l546m797J532j379J373j412k556l33o628j315K905N050M289
4461B664N06K783m947j2740k063J2737O38j115k577K272K106k790j429l581L735
4446c801K313j399J470O510L362p378j696O01m202K97n961J794J454J0216O263
$$ plain form
4555 1732 3601 -398 -4413 -1987 2797 10341 3302 -7426 -6931 -3852 -4333 640 5180 3028 -4621
4540 -4621 -6314 -6357 -2640 2251 970 1270 2851 6934 2439 -4047 -6625 -2772 3660 11922 6089 122
4524 122 2428 4242 -5375 -13732 -7953 -1408 -732 -1309 -5003 -6201 -3192 2272 6989 3750 -4602 -4696
4508 -4696 -4832 -10104 -9414 -11158 -4004 -2105 4333 4590 1608 -2308 -1053 -1064 -5599 -5749 -2127 -2679 -3190
4491 -3190 2853 8230 10728 8762 5016 6345 -776 -10155 -11776 -8560 -13287 -12975 -3971 5523 5810
4476 5810 8902 9481 5935 1138 2670 1291 2664 1252 -1304 -1637 -8265 -9580 -6675 -1625 2664
4461 2664 3170 5953 1006 -11734 -13797 -1060 -422 -1537 -4114 -1842 264 -2526 -3955 -7536 -3801
4446 -3801 -1488 -2887 -1417 5093 8455 1077 -619 -18 -4220 -3923 -9884 -8090 -6636 3580 9843
4431I843K408r134q534o628k611Q551L708q705n762M151m90M109N289O435l555
4416i25m019M568M791l702k206l344j235J673M820K420l739q39J0986L899p640
4401E508m760O850j033p40J442l962n607J973J221l211k535K110m079n005Qk630
4385a4450N18L844L889j918o029N50L130K632K662j009P27j044l942N283N300
4370A43p288R97k195J910O072O150R08j958m340p56l382j697J087L176k321q544
4354a2038K959Q0k11L624K540M269j470n97n883K397L782R785r5r85J440n618
4338C979M90M492l877n959n92k171n481L178N185M791K115J71n136m48O156Q640
4322A5533l657n755N16r824o878j797M796O991K078Q152l32n462m463j288j056
$$ plain form
4431 9843 12251 3117 -5417 -12045 -14656 -6105 -2397 -11102 -16864 -12713 -13203 -9094 -3805 2630 -925
4416 -925 -4944 -376 4415 713 -1493 -4837 -6072 -4399 421 2841 -898 -1737 9249 13148 5508
4401 5508 748 7598 6565 5825 7267 3305 -2302 -329 892 -2319 -4854 -2744 -6823 -11828 -11820 -14450
4385 -14450 -13932 -10088 -6199 -8117 -14146 -13596 -10466 -7834 -5172 -6181 -5454 -6498 -10440 -5157 143
4370 143 -7145 -6148 -8343 -6433 -361 5789 6697 4739 399 -357 -3739 -5436 -4349 -1173 -3494 -12038
4354 -12038 -9079 -8999 -9210 -5586 -3046 1223 -247 -844 -6727 -4330 -548 9237 9142 8157 9597 3979
4338 3979 4469 8961 5084 -875 -1467 -3638 -9119 -5941 -756 4035 6150 6321 1185 737 6893 15533
4322 15533 11876 6121 6637 -3187 -10065 -11862 -7066 -75 2003 10155 9823 4361 -102 -1390 -2446
4307b446R4J880K111L813J088n175j040k524l687l53N436M259L378J213p86p32
4291F529L182l229m672j665M596j059o358J45Q643J622q096j260K570P2q41N82
4275G61l192m00m007J218m062J544R54P368K153J337O864o536K532O92j901k118
4259C207l704p954Q00L450k538j125P87N138k966p039M084O180L237K772k839
4244A490n555M964P489l762K758J929l203r07J901m473K72q505n281N451K447
4229b985l230k660P56L228k421J68Q143M966k463k33K878N091l839j737j865O91
4213D488l942k801l182m541L63M445O334J368m502m061k980m9N665J277l504n1
4197e673j062M242L398J524K981j275N46Q33m870m185K666l115k670K01k24k30
$$ plain form
4307 -2446 -2352 -472 1639 5452 6540 1365 325 -2199 -5886 -6239 -803 3456 6834 8047 7261 6529
4291 6529 9711 6482 1810 145 4741 3682 -2676 -2531 6112 7734 -362 -1622 948 1020 179 761
4275 761 -2431 -2831 -6838 -5620 -9682 -8138 -7184 184 2337 3674 10538 4002 6534 7226 5325 3207
4259 3207 -497 -8451 -7651 -4201 -6739 -7864 -7077 -1939 -4905 -11944 -7860 -1680 1557 4329 1490
4244 1490 -4065 899 8388 4626 7384 9313 6110 5203 7104 2631 2903 -5602 -10883 -5432 -2985
4229 -2985 -6215 -8875 -8119 -4891 -7312 -7144 999 5965 3502 3269 6147 11238 7399 5662 3797 4488
4213 4488 546 -2255 -5437 -9978 -9615 -5170 1164 2532 -1970 -6031 -9011 -9060 -3395 -2118 -5622 -5673
4197 -5673 -6735 -2493 905 2429 5410 4135 4681 5514 644 -3541 -875 -3990 -6660 -6459 -6683 -6913
4181f913O921J224O71K123q81p972P80k02m077J330J400k180L81L126J598N716
4165C045J475k997l051n804L975O219L683m323o090l287O012k747O577Q759L646
4150A5092L386q78p213m392m155K280M624j507L54P76J048k256r495J538L551
4135B753O742N11q880j1262j438j189j538K683O541l293J23P089K275K158K291
4120E566j936O338p228k399j227m923q655J217P351J2195O590j060r366q163n481
4105a1181k641O757R734j925J276J434K658L511m388M886K125K954l272n704l578
4090B646n137l254J618m70j65p54m463L730K95l01K780l587O23L443K496o34l5
4073a169K831N792k387k474j0245J135O955J952j983j352l6m599m190K377j267
$$ plain form
4181 -6913 8 1232 1903 4026 3145 -4827 -4047 -4249 -8326 -6996 -5596 -7776 -7395 -4269 -2671 3045
4165 3045 4520 1523 -1528 -7332 -3357 2862 6545 2222 -3868 -7155 -1143 -3890 2687 11446 15092
4150 15092 18478 17600 10387 5995 1840 4120 8744 7237 7591 8367 9415 7159 -2336 -798 2753
4135 2753 9495 10006 1126 -10136 -11574 -12763 -14301 -11618 -5077 -8370 -8247 -1158 1117 3275 5566
4120 5566 3630 9968 2740 341 -886 -5809 -14464 -13247 -5896 6299 12889 11829 2463 -5700 -11181
4105 -11181 -13822 -7065 2669 744 2020 3454 6112 9623 5235 10121 12246 15200 11928 6224 2646
4090 2646 -2491 -5745 -4127 -4597 -4762 -5516 -9979 -6249 -5954 -6255 -3475 -7062 -6439 -2996 -500 -1134 -1169
4073 -1169 1662 7454 5067 2593 -7652 -6517 438 2390 407 -945 -981 -5580 -9770 -7393 -8660
4058h660J772J298L291M033o574n142J932O630N492L792K198l776N79P70o14o779
4042B42j631J758N522Q133j006p143o716k103j484k717N135j862L56n482J674
$$ plain form
4058 -8660 -6888 -5590 -2299 1734 -4840 -9982 -8050 -1420 4072 7864 10062 6286 6865 7635 7021 242
4042 242 -1389 369 5891 14024 13018 5875 -841 -2944 -4428 -7145 -2010 -3872 -3516 -8998 -7324
$$ [...]
##END NTUPLES=NMR SPECTRUM
##END=
