##TITLE=Analysis number 313124
Compound Code cc 48409
Book Reference 436/88
Project Code adrs
Chemist Name williamk
##JCAMPDX= 6.0         $$ Bruker NMR JCAMP-DX V2.0
##DATA TYPE= NMR SPECTRUM
##DATA CLASS= NTUPLES
##ORIGIN= Bruker BioSpin GmbH
##OWNER= NMR
$$ XWIN-NMR		Version 3.5
$$ Thu Aug 25 09:07:51 2005 GMT Daylight Time (UT+1h)  MAYBRIDGE\NMR@NMR_250MHZ
##.OBSERVE FREQUENCY= 250.131544655141
##.OBSERVE NUCLEUS= ^1H
##.ACQUISITION MODE= SIMULTANEOUS (DQD)
##.ACQUISITION SCHEME= undefined
##.AVERAGES= 16
##.DIGITISER RES= 18
##SPECTROMETER/DATA SYSTEM= dpx250
##.PULSE SEQUENCE= zg30
##.SOLVENT NAME= CDCl3
##.SHIFT REFERENCE= (INTERNAL, CDCl3, 0, 16.4456)
##AUDIT TRAIL= $$ (NUMBER, WHEN, WHO, WHERE, WHAT)
$$ ##TITLE= Audit trail, XWIN-NMR		Version 3.5
$$ ##JCAMPDX= 5.01
$$ ##ORIGIN= Bruker BioSpin GmbH
$$ ##OWNER= NMR
$$ C:\u/data/dgb/nmr/ADRS/8570/pdata/1/auditp.txt
$$ ##AUDIT TRAIL=  $$ (NUMBER, WHEN, WHO, WHERE, WHAT)
(   1,<2005-08-25 09:07:32.81 +100>,<MAYBRIDGE\NMR>,<NMR_250MHZ>,
      <created by zg, POWCHK disabled, PULCHK disabled
       configuration hash MD5:
       62 19 C7 07 E1 42 D1 B7 37 6C 3D D0 77 39 F9 E6
       data hash MD5: 64K
       5D A2 5D 7A C7 75 C2 FE 12 3A 3B D0 00 C4 64 E5>)
(   2,<2005-08-25 09:07:44.36 +100>,<MAYBRIDGE\NMR>,<NMR_250MHZ>,
      <Start of raw data processing
       ef LB = 0.3 FT_mod = 6 PKNL = 1 SI = 32K 
       data hash MD5: 32K
       BC 6C 79 00 71 3D FF 1D 44 AB CC C5 62 2E 16 F2>)
(   3,<2005-08-25 09:07:45.96 +100>,<MAYBRIDGE\NMR>,<NMR_250MHZ>,
      <apk 
       data hash MD5: 32K
       D0 FA E4 B4 5A 81 F9 36 98 95 89 15 0D 38 25 54>)
(   4,<2005-08-25 09:07:46.63 +100>,<MAYBRIDGE\NMR>,<NMR_250MHZ>,
      <abs ABSG = 5 
       data hash MD5: 32K
       C1 BF 76 10 3B E0 C4 AA CA 92 BB 47 48 C7 2F C4>)
$$ ##END=
$$ 
$$ hash MD5
$$ 1A DA 29 CB 4B 2C 3A DE 45 57 DB D1 42 9C B1 F2
##$RELAX= 
##$RELAX= 
##$RELAX= 
##$RELAX= 
##$RELAX= 
##$RELAX= 
##$RELAX= 
$$ Bruker specific parameters
$$ --------------------------
##$DU= <C:\u>
##$EXPNO= 8570
##$NAME= <ADRS>
##$PROCNO= 1
##$TYPE= <nmr>
##$USER= <dgb>
##$AMP= (0..31)
100 100 100 100 100 100 100 100 100 100 100 100 100 100 100 100 100 100 
100 100 100 100 100 100 100 100 100 100 100 100 100 100 
##$AQSEQ= 0
##$AQ_mod= 3
##$AUNM= <au_zg>
##$AUTOPOS= <2 >
##$BF1= 250.13
##$BF2= 250.13
##$BF3= 250.13
##$BF4= 250.13
##$BF5= 500.13
##$BF6= 500.13
##$BF7= 500.13
##$BF8= 500.13
##$BYTORDA= 1
##$CFDGTYP= 0
##$CFRGTYP= 5
##$CHEMSTR= <none>
##$CNST= (0..31)
1 1 145 1 1 1 1 1 1 1 1 1 1 1 1 1 1 1 1 1 1 1 1 1 1 1 1 1 1 1 1 1 
##$CPDPRG= <>
##$CPDPRG1= <>
##$CPDPRG2= <>
##$CPDPRG3= <>
##$CPDPRG4= <mlev>
##$CPDPRG5= <mlev>
##$CPDPRG6= <mlev>
##$CPDPRG7= <mlev>
##$CPDPRG8= <mlev>
##$CPDPRGB= <>
##$CPDPRGT= <>
##$D= (0..31)
0 1 0 0 0 0 0 0 0 0.06 0 0 0 0 0 0 0.0002 0 0 0 0 0 0 0 0 0 0 0 0 0 0 
0 
##$DATE= 1124957252
##$DBL= (0..7)
120 120 120 120 120 120 120 120 
##$DBP= (0..7)
150 150 150 150 150 150 150 150 
##$DBP07= 0
##$DBPNAM0= <>
##$DBPNAM1= <>
$$ [...]
##$SUBNAM7= <"">
##$SUBNAM8= <"">
##$SUBNAM9= <"">
##$SW= 20.6930455092707
##$SWIBOX= (0..15)
0 0 3 0 0 0 0 0 0 0 0 0 0 0 0 0 
##$SW_h= 5175.983436853
##$TD= 65536
##$TD0= 1
##$TE= 295.16
##$TE2= 300
##$TE3= 300
##$TEG= 300
##$TL= (0..7)
0 120 120 120 120 120 120 120 
##$TP= (0..7)
150 150 150 150 150 150 150 150 
##$TP07= 0
##$TPNAME0= <>
##$TPNAME1= <>
##$TPNAME2= <>
##$TPNAME3= <>
##$TPNAME4= <>
##$TPNAME5= <>
##$TPNAME6= <>
##$TPNAME7= <>
##$TPOAL= (0..7)
0.5 0.5 0.5 0.5 0.5 0.5 0.5 0.5 
##$TPOFFS= (0..7)
0 0 0 0 0 0 0 0 
##$TUNHIN= 0
##$TUNHOUT= 0
##$TUNXOUT= 0
##$USERA1= <user>
##$USERA2= <user>
##$USERA3= <user>
##$USERA4= <user>
##$USERA5= <user>
##$V9= 5
##$VALIST= <valist>
##$VCLIST= <CCCCCCCCCCCCCCC>
##$VD= 0
##$VDLIST= <DDDDDDDDDDDDDDD>
##$VPLIST= <PPPPPPPPPPPPPPP>
##$VTLIST= <TTTTTTTTTTTTTTT>
##$WBST= 1024
##$WBSW= 4
##$XGAIN= (0..3)
0 0 0 0 
##$XL= 0
##$YL= 0
##$YMAX_a= 291320
##$YMIN_a= -291017
##$ZGOPTNS= <>
##$ZL1= 120
##$ZL2= 120
##$ZL3= 120
##$ZL4= 120
##$ABSF1= 16.44563
##$ABSF2= -4.247543
##$ABSG= 5
##$ABSL= 3
##$ALPHA= 0
##$AQORDER= 0
##$ASSFAC= 0
##$ASSFACI= 0
##$ASSFACX= 0
##$ASSWID= 0
##$AUNMP= <proc_1d>
##$AZFE= 0.1
##$AZFW= 0.1
##$BCFW= 0
##$BC_mod= 0
##$BYTORDP= 0
##$COROFFS= 0
##$CY= 12.5
##$DATMOD= 1
##$DC= 0
##$DFILT= <>
##$DTYPP= 0
##$F1P= 14.0000005364418
##$F2P= -0.99999901652339
##$FCOR= 0.5
##$FTSIZE= 32768
##$FT_mod= 6
##$GAMMA= 0
##$GB= 0
##$INTBC= 1
##$INTSCL= 1
##$ISEN= 128
##$LB= 0.3
##$LEV0= 0
##$LPBIN= 0
##$MAXI= 10000
##$MC2= 0
##$MEAN= 0
##$ME_mod= 0
##$MI= 0
##$NCOEF= 0
##$NC_proc= -5
##$NLEV= 6
##$NOISF1= 0
##$NOISF2= 0
##$NSP= 0
##$NTH_PI= 0
##$NZP= 0
##$OFFSET= 16.44563
##$PC= 1
##$PHC0= -71.7245
##$PHC1= 6.821157
##$PH_mod= 1
##$PKNL= yes
##$PPARMOD= 0
##$PSCAL= 4
##$PSIGN= 0
##$REVERSE= no
##$SF= 250.130019100368
##$SI= 32768
##$SIGF1= 0
##$SIGF2= 0
##$SINO= 400
##$SIOLD= 32768
##$SREGLST= <1H.CDCl3>
##$SSB= 0
##$STSI= 32768
##$STSR= 0
##$SW_p= 5175.98343685301
##$SYMM= 0
##$S_DEV= 0
##$TDeff= 65536
##$TDoff= 0
##$TI= <Analysis number 999999
Compound Code 99
Book Reference 9
Project Code 9>
##$TILT= no
##$TM1= 0
##$TM2= 0
##$TOPLEV= 0
##$USERP1= <user>
##$USERP2= <user>
##$USERP3= <user>
##$USERP4= <user>
##$USERP5= <user>
##$WDW= 1
##$XDIM= 32768
##$YMAX_p= 369600763
##$YMIN_p= -698073
$$ End of Bruker specific parameters
$$ ---------------------------------
##NTUPLES= NMR SPECTRUM
##VAR_NAME=  FREQUENCY,     SPECTRUM/REAL,   SPECTRUM/IMAG
##SYMBOL=    X,             R,               I
##VAR_TYPE=  INDEPENDENT,   DEPENDENT,       DEPENDENT
##VAR_FORM=  AFFN,          ASDF,            ASDF
##VAR_DIM=   32768,         32768,           32768
##UNITS=     HZ,            ARBITRARY UNITS, ARBITRARY UNITS
##FACTOR=    0.157963299565203, 1,           1
##FIRST=     4113.54552587141, 0,            0
##LAST=      -1062.4379109816, 0,            0
##MIN=       -1062.4379109816, -698073,      0
##MAX=       4113.54552587141, 369600763,    0
$$ Real data points
##PAGE= N=1
##DATA TABLE= (X++(R..R)), XYDATA
$$ [...]
27676 -62469 18543 62493 -30011 -15492 84230 124087 65137 22279 -23282 -82351 -100360 45905
27664 45905 145882 336548 310526 299032 215440 139429 136953 5351 -174526 -371043 -351142
27653 -351142 -125107 -59662 -153556 -196519 -202189 -227039 -253717 -204842 -159949 -100176 65178
27642 65178 104825 -31995 -145347 -126835 15320 53611 -72443 -28109 27527 73075 158685
27631 158685 158112 98536 58421 53008 342945 219725 191261 117978 31124 61351 123426 141866
27619 141866 263524 153767 8326 59944 71256 -38003 -160848 -180203 -121238 -60928
27609 -60928 -255391 -292357 -170425 -80027 -118306 -248830 -152519 -20685 18388 -21170 -93676
27598 -93676 -70558 -145189 47252 7043 -41407 -86395 -267436 -272853 -254576 -235515 -283569
27587 -283569 -179117 -104286 53567 169712 121628 60778 51941 74250 218314 200768 110605
27576 110605 231852 265497 184092 57631 -18687 85136 196831 31714 -89466 -183745
27566 -183745 -176764 -69587 78993 215376 336984 317522 159127 115592 97047 40269 -40604
27555 -40604 -22817 154247 148887 -24350 -162890 -194599 -68408 -11993 15134 56001 46347
27544 46347 156458 138321 56810 81692 17829 121098 153063 76911 264276 264212 167899 251075
27532 251075 288430 277895 68127 89368 179874 169023 128599 20058 74099 177482 54452
27521 54452 -153741 -139773 -151528 -20871 -232548 -263011 -98663 -78600 -54660 13156 95698
27510 95698 123639 288118 287590 496326 416074 294018 303497 252555 274690 161268 170896 151458
27498 151458 159974 304011 138529 120312 -74916 -172825 -57666 130262 161897 -44992
27488 -44992 -163684 -93052 -88093 -99951 -114250 -247830 -237083 -114021 -132282 -77829 -16328
27477 -16328 -38410 -2191 108125 14446 -67570 -101669 -152902 -141380 -75679 -178207 -17001
27466 -17001 136649 208001 227999 37616 -24250 65424 128931 18591 -22577 136054 25431
27455 25431 -125938 -142368 -138487 -36912 -37601 -25236 164040 217721 115103 83321 217910
27444 217910 144338 74821 86172 81383 134436 214714 93474 -18189 -58310 -1152 -17970
27433 -17970 -112993 -91752 -60463 42574 168135 214082 154356 225121 332848 477784 425657
27422 425657 287491 155376 323744 420486 260198 221194 250684 82964 -76254 -30933
27412 -30933 31410 43254 -69614 -140999 -107857 -81398 -188936 -62717 174957 223820 167782
27401 167782 151589 254406 126720 112937 222665 276589 132557 -5260 90161 92909 54100
27390 54100 65341 21904 -32303 23000 97349 51097 145671 130733 57615 25248 12820 -98479
27378 -98479 -172605 -133671 -14935 89052 116573 119953 -382 -33063 96379 87386 -55407
27367 -55407 -84870 -27744 38878 104767 230841 241791 133208 -89990 -77738 -132503 -306473
27356 -306473 -233304 -97296 -67134 -189448 -139814 -155313 -91755 -4663 -135543 26510 81856
27345 81856 191713 213987 248841 151125 171296 159988 88590 71116 122473 -14316 -94103
27334 -94103 -181459 -232558 -191055 -174123 -85792 8719 -86983 -111439 9728 186502 147998
27323 147998 47137 126651 92308 57707 22965 -3919 13833 -90110 -60555 40583 120633
27312 120633 114647 159228 140417 -46940 -48600 -133440 -28362 153755 -11920 -261531 -339038
27301 -339038 -283199 -144135 -125994 -71793 -150342 -144581 -194722 -248013 -61197 122103 -111632
27290 -111632 -237783 -69916 46372 -12647 -55768 -2204 -8169 57968 55784 -34643 -29939
27279 -29939 -55013 -7580 15060 9128 -4362 -41299 124510 75038 3123 -33644 -54126 -63828
27267 -63828 -114195 -141695 70250 79601 5435 -99199 -13438 81062 149071 174590 226709
27256 226709 301284 134704 20118 103872 84632 -40731 -157182 -99776 -111322 -77235 -79783
27245 -79783 24551 -65062 45161 208768 58980 -49011 -153789 -70470 30826 -75006
27235 -75006 -209060 -154676 33423 336537 343491 203339 194266 36359 -10371 109059 165472
27224 165472 59385 67888 80071 223154 273316 267152 206202 294860 309503 126816 67180
27213 67180 51087 88605 16343 55718 228878 71124 -66711 -117847 -24000 783 -52760
27202 -52760 33651 154560 167827 208114 264824 253072 -76464 -170409 -173065 85170 178410
27191 178410 126370 209045 197010 142026 115680 90097 112887 207464 215562 111385 194729
27180 194729 228942 72047 -160696 -329505 -259597 -233598 -124931 53916 -30189 -138953
27170 -138953 -118017 7814 -69372 -124170 -88639 -140623 -96967 -42385 120543 103791 -94779
27159 -94779 -291212 -263699 -153395 44183 -30740 -120897 -101726 7914 50303 -15142 -28780
27148 -28780 11660 18547 22143 -91372 -98526 -80382 -46311 4536 -70485 -6423 3683 47768
27136 47768 30026 9224 36711 -19833 327 16121 127283 187592 21497 -54706 -80546
27125 -80546 -84433 -69287 61650 85190 161442 77907 129046 129760 279014 120474 -61706
27114 -61706 -232284 -268445 -86764 -36492 -119135 -244087 -197598 -53897 -56917 -271751 -339970
27103 -339970 -327463 -257069 -140522 -63946 -103279 -110739 -83594 -88757 -18620 143009 40658
27092 40658 -84027 -109206 -72667 886 39822 46352 82075 226042 360092 480064 425434
27081 425434 258348 167124 144001 49769 27432 183920 26406 -7527 65712 -6559 -108981
27070 -108981 -193977 -167359 56930 188795 240403 262560 136499 189960 247885 152899 105481
27059 105481 147483 124684 -18649 25870 174616 379947 314040 132465 98918 13083 6061
27048 6061 -91235 -102274 2837 131772 200638 142933 119529 64137 74044 51855 150543 208940
27036 208940 97886 -7843 -19865 24298 100285 106972 137445 95185 54719 29874 -19804
27025 -19804 7001 -40946 -23083 124615 181723 135392 -129589 -235330 -41570 -97891 -166274
27014 -166274 -131310 -153094 -209880 -174608 -114474 -42543 -67494 87523 59000 -83184 3653
27003 3653 94195 119770 152008 156073 65587 24408 -1407 118413 62934 -79724 -144600 -39008
26991 -39008 -6058 74188 116172 126537 113724 -79048 -118899 -37979 138117 64599 -56401
26980 -56401 -175960 -13384 59210 71961 78552 145708 11940 -52665 5325 35157 -7118
26969 -7118 19358 168055 178758 13587 -25826 -115364 -39984 -12905 94465 292940 261465
26958 261465 272016 244670 285286 163032 94504 95125 2093 14297 -12614 8748 -35523 -175735
26946 -175735 -213161 -222067 -237570 -151893 -96234 -69695 50426 13974 -78783 -189258 -76061
26935 -76061 127160 119611 18186 4788 117221 60479 -26798 -82747 -7740 93313 335294
26924 335294 369589 197272 144997 3078 -9935 -56988 124617 175365 -33765 -261806
26914 -261806 -277267 -279305 -74325 40430 78785 -35356 -6842 -104819 37372 188472 43404
26903 43404 14034 59124 -56846 -145601 10201 48464 -143977 -286789 -141654 145263
26893 145263 205485 60973 -71844 62072 107308 -901 25637 -98996 -79524 -118338
26883 -118338 -170426 -142232 -79784 -15039 14631 -215162 -298652 -271960 -227265 -152708 -85377
26872 -85377 -41513 -57587 22986 50583 127529 161986 44110 128644 36300 8667 42490
26861 42490 8305 -126363 12728 110410 68175 102895 123472 121178 192520 83751 78861
26850 78861 80242 148862 196735 52583 77842 184408 177141 140367 95048 -43008 -76026
26839 -76026 39605 69740 53636 23046 -102149 -46319 151823 48054 -158667 -330497
26829 -330497 -205527 -88374 -196666 -204751 -130889 18433 -34686 -75102 32391 -28125 -20077
26818 -20077 -82142 -86386 6610 167521 39114 4366 140612 200356 196578 55478 87189
26807 87189 226143 164401 -57019 -32027 212361 251976 93130 -213321 -259404 -165075 -126619
26796 -126619 -163141 -151383 -18791 -42811 -66024 5842 75296 210177 213422 270813 239108
26785 239108 64319 -34365 -109444 43136 84914 -127493 -129556 -91105 38677 142626 100064
26774 100064 150681 115097 -62644 -223587 -221760 -23229 -28436 114939 206579 276351 323665
26763 323665 109847 -94799 -113137 -109920 -134755 -215842 -189219 -186647 -216726 -191245 -7779
26752 -7779 -1012 77669 83460 182680 87471 56925 -5604 48333 81160 118487 102130 -1272
26740 -1272 15140 113724 28734 104641 7408 107490 204802 203519 196801 -19385 -10967 94138
26728 94138 -69594 -151491 -293555 -186308 -100438 -72990 -53560 -96747 -44898 74922 197307
26717 197307 120915 184163 271269 236215 159146 -77215 -117277 -214737 -123303 -72127 -154478
26706 -154478 -147232 -121438 -167821 -189118 -211474 -94806 8549 -70258 -99934 -130080 -102947
26695 -102947 -97062 -55081 -91270 -29303 -63644 -39698 -64479 -14027 157430 82320 52939
26684 52939 136021 85689 40272 109578 46229 -83411 -135645 -110627 -214094 -236561 -131748
26673 -131748 30998 162050 -45036 -201909 -160745 -177223 -108527 30644 108467 309212
26663 309212 120373 59027 147216 156815 9176 -208609 -109500 28801 121623 -2788 -217335
26652 -217335 -213145 -122592 -19120 -32407 88069 139187 -4423 -110293 -22944 56543 67608
26641 67608 53489 -29785 -188459 -195183 -78432 26814 234576 377374 76207 -172711
26631 -172711 -223453 -140697 -4853 30315 56093 68338 133562 43479 39056 -75439 2287
26620 2287 179587 215194 278102 276436 267042 224049 109829 105871 255298 285910 219683 194903
26608 194903 5407 4534 121166 -76670 59661 69675 -4276 7674 127452 154459 110036
26597 110036 48037 -15842 97424 116769 103181 -43349 22207 88102 109230 155554 13059
26586 13059 -110008 -17155 39252 -33748 -111316 -112114 103825 249377 251043 276943 210214 145056
26574 145056 55525 -95895 -223380 -356174 -450535 -571287 -387634 -174904 -116623 41539
26564 41539 77921 39900 -91543 -109363 -78510 -117760 114529 307438 311224 149178 -145016
26553 -145016 -137818 14100 119450 13742 -62008 51073 70373 -36050 -10466 -39629 -24803
26542 -24803 81318 181237 280925 240058 76097 -89592 -131516 -142136 -275727 -434278 -492740
26531 -492740 -529859 -448127 -405540 -268775 -159796 -101776 -172311 -65611 -138846 33081 142354
26520 142354 195994 332061 261805 156017 -109862 -130899 161552 147029 80432 -91469
26510 -91469 -184077 -75694 -56502 -97284 -139039 -228468 -176280 -135704 -40051 49472 37006
26499 37006 -17752 25410 -62410 -68159 -48267 2096 109261 37340 45191 -45676 -36009 -87541
26487 -87541 42270 42580 -86719 -110715 -65445 26079 66326 93472 52014 41985 99508 -121463
26475 -121463 -92320 -161904 -125487 57724 7205 -89211 -174137 434 189518 214657 184606
26464 184606 138366 174247 90161 55671 -22119 145413 378944 223605 79537 48803 -36542
26453 -36542 51247 192379 106872 53797 106361 154167 144560 30695 31869 73892 108368 137227
26441 137227 88984 -21886 -151739 -80214 81538 100283 -55325 -151299 -277328 -269659 -156467
26430 -156467 -36557 -54172 -91239 -10966 81617 -58322 -127909 49348 107911 194084 92642
26419 92642 106259 181037 121229 65703 -74397 -167872 -83171 21810 -87058 -122867 -101106
26408 -101106 -24749 -90705 -125416 -163633 -196359 -194138 -108855 -13580 24969 148649 123040
26397 123040 163092 207864 111160 48934 -128888 -4778 111560 83640 79673 13914 82712
26386 82712 299957 219309 152530 100081 161808 140429 293787 360662 376996 313415 48807
26375 48807 -87613 -66298 -87099 14443 154320 86573 83579 168152 1923 -179762 -245557
26364 -245557 -332822 -281727 -324914 -310546 -71249 -11126 62664 59054 233450 207873 214010
26353 214010 202581 262579 206970 65611 -103346 -87507 8234 134623 91252 -51973 -95058
26342 -95058 56151 255944 279116 315869 250664 229450 245874 50965 -48638 -148691 -77558
26331 -77558 -11921 -70333 -25421 -73355 -48521 -33914 -57425 -80895 -3636 54279 101838 37889
26319 37889 -82681 114309 165375 93948 97905 -52360 -143838 -54808 169236 78544 -49052
26308 -49052 15221 23066 -70928 -134036 -192996 -150688 -241027 -419940 -334722 -53685 -78324
26297 -78324 -92702 -70742 -62788 -130779 -272011 -320362 -238040 -145773 -6886 93984 -111910
26286 -111910 -169466 -191628 -247760 -102741 38909 157587 123122 12507 85441 230800
26276 230800 319228 245100 35278 -78109 -81104 -131303 -178196 -198636 -77018 8796 91898
26265 91898 110466 96080 -607 16635 -49119 -80250 39685 21350 23167 177698 375280
26254 375280 401182 152215 141598 177537 129099 139559 319805 201723 -11375 -110385 -113314
26243 -113314 -64872 74650 89061 16948 5740 20656 8984 91087 21696 -36953 75477
26232 75477 121552 64533 48058 8352 -61915 -62871 714 -54503 -81170 -97026 24233 18877
26220 18877 -68655 23912 38917 122235 287297 313815 232461 278123 220490 142285 239941
26209 239941 210274 174602 197349 199724 197939 138957 205998 135598 133599 288115 142494 88983
26197 88983 123613 89652 31075 -4799 -96785 -176731 -199949 -69786 -30767 -42369 -14830
26186 -14830 39725 9253 11362 120224 240306 310864 212238 108765 51143 3467 -74247
26175 -74247 -50859 96125 176991 88691 12235 70681 123981 141103 165069 242327 212349
26164 212349 165455 181340 168256 143610 116004 128314 193450 86377 -163677 -147014 143282
26153 143282 258965 234135 110425 203473 247345 174364 143921 200382 259524 241554 180626
26142 180626 150797 28950 -3114 -133841 -296205 -259399 -103319 57928 175556 274199
26132 274199 117711 145970 209269 83545 -89062 -52568 84982 98954 38725 -1603 -11071
26121 -11071 217894 199984 234457 371318 354457 140073 -50958 -250233 -323264 -351517 -344231
26110 -344231 -276618 -217131 -199650 -131255 -21390 -96261 -119382 -8671 37445 -6888 141135
26099 141135 69849 -64208 -106481 -40487 14105 89350 165885 176200 191469 172218 67176
26088 67176 -31111 -81662 -1370 182007 99808 43789 -41145 31969 116478 293616 275186
26077 275186 282479 202291 26323 -195945 -185212 -102011 31061 -65264 -81275 -8007 6025
26066 6025 -34493 -137596 126156 153080 163099 225406 72674 -8980 -51764 -30345 84153
26055 84153 189667 98218 -31839 7812 73256 68477 178727 100487 -46040 -66668 -29246
26044 -29246 -91636 -24699 174354 248653 409525 342701 210881 41330 -73128 -41575 158377
26033 158377 161208 258056 465997 381184 197905 36976 -89396 -190214 -172684 10995
26023 10995 94883 -76316 -94277 -42571 53872 -45624 -50332 -47930 74529 183618 266761
26012 266761 77939 -22866 -64384 -109611 2852 103215 42384 93104 8834 -61986 -138959
26001 -138959 -122803 35147 -92851 -157823 -91255 -3401 47145 65842 45526 93229 19921
25990 19921 -52053 -12964 -11564 56463 40064 89223 132762 109642 133628 -29185 -71615 -161601
25978 -161601 -235127 -128072 -67682 -161887 -184553 -79945 -65229 99500 58687 -80350 -92634
25967 -92634 20845 149272 146484 65029 82369 60452 -37263 -16736 -13750 -227451 -341615
25956 -341615 -178853 25695 35105 -5337 83191 143962 237251 319018 109286 23696 287152
25945 287152 263162 169777 72533 -46132 103479 191388 207628 129518 97766 -7270 -41587
25934 -41587 121803 181591 102887 -34922 -22 -93846 -134912 1862 52481 -21518 141265
25923 141265 290004 102068 -50409 24052 47481 -27397 -184607 -217258 -199108 -58805
25913 -58805 54610 133832 142541 72491 9151 25570 -22299 -84384 62108 -41168 -45732
25902 -45732 -63108 -168003 -212990 -126725 -100029 -51694 -64167 49592 75455 75501 23020 25577
25890 25577 69770 59373 45706 125328 139634 5467 -98721 -229469 -262020 -283802 -155928
25879 -155928 -127929 -135235 15432 86166 113949 157274 185408 -2784 -3203 188927 199605
25868 199605 189642 138083 35062 99368 215019 78847 106455 83674 -42974 -138116 -152751
25857 -152751 -76670 56174 186498 219878 -47126 -123211 -96298 -67093 -133878 -192057 -283750
25846 -283750 -273484 -144923 -107200 -59649 -117660 -37367 -61629 -98448 -103061 -128226 -4068
25835 -4068 47489 -66411 -161080 -91457 -23746 -60728 -5394 76929 36608 -151796 -248779
25824 -248779 -296697 -226076 -46484 49702 29465 93343 141551 74700 56735 11868 -21379
25813 -21379 -26759 -117917 -113553 -141291 -264783 -274668 -219412 -73403 101948 71755 143870 309332
25801 309332 289099 137487 138625 -16148 -101973 3223 84446 164582 95995 -98582 -108802
25790 -108802 -4238 47142 56942 104696 213014 46203 -103510 -109769 -160520 -292199 -364606
25779 -364606 -239868 -125114 -153304 -84620 -96556 -208029 -184874 -169591 -114913 -146944 -164328
25768 -164328 -195102 -115028 -152453 -108835 138900 240127 155660 234225 336505 178455 53467
25757 53467 -56026 -140318 -43228 152310 220171 6908 -240809 -201964 -131658 126449 46755
25746 46755 -177711 -131796 139005 222221 80074 -58432 -123425 -4779 77188 22461 -92812
25735 -92812 -25678 8900 -42265 -35552 -36738 -630 -74216 -175983 -238686 -75562 125950
25724 125950 211696 174398 88497 -100371 -141136 -106209 -19129 -88648 -80058 52772 -104842
25713 -104842 -162005 -10857 138647 177646 242400 218375 2614 -213393 -238572 -389975
25703 -389975 -366851 -134489 11297 115364 102909 68863 23509 -36473 10582 158019 191156
25692 191156 131259 6351 19320 50312 -115299 -129719 -69029 -212130 -123832 -76325 -46122
25681 -46122 -125242 -79146 -2672 -42081 -82936 -34488 -62962 -137139 -97740 -197437 -78516
25670 -78516 180560 65682 40676 -31666 -88562 -84636 -119840 -60482 62908 73868 31716
25659 31716 235845 269818 266753 145096 -25039 89799 112305 153622 90484 -33138 -22123
25648 -22123 75324 102326 116741 285373 306527 250130 28911 -104203 -57909 -90089 -246992
25637 -246992 -155596 123451 162154 298440 280430 216933 223826 212700 233406 60582 80394
25626 80394 69792 4322 -514 -43630 1584 -80680 -82588 156620 128097 204192 284127 288967
25614 288967 188040 -2043 -177944 -100808 -7981 210473 267502 108337 31100 112554
25604 112554 46401 -38980 -114285 -9411 44533 100561 -49189 42884 156804 47431 -42558
25593 -42558 -90221 -24399 -99166 68187 228705 229159 126003 -51145 -143462 -234367 -177920
25582 -177920 -47048 47157 78999 185594 347057 419096 291037 193695 -66010 -259023
25572 -259023 -201826 -109001 -201501 -95532 -2000 62177 19315 23686 -184579 -99623 -13025
25561 -13025 -3872 3639 35239 -119051 -181724 -285756 -138532 -69407 -63615 -133838 -81895 -55644
25549 -55644 -100967 -96450 -38433 -236964 -221580 30668 31346 -112185 -121085 -67928 -76166 -226385
25537 -226385 -214199 -72775 -207842 -366967 -270872 -48573 -2007 -58006 434 79524 96397
25526 96397 132379 162391 179865 142449 -6871 75994 79626 151697 351663 321456 307095
25515 307095 199059 106152 69267 149759 290556 277037 149203 35291 23477 192696
25505 192696 211805 204896 37645 -58339 -43979 -51141 28774 -54087 -269200 -395200 -289192
25494 -289192 -112374 166839 331561 348368 235198 157792 -6382 21442 22702 -125467
25484 -125467 -278621 -245176 -137929 90299 162412 235761 91375 -141415 -58974 -181846
25474 -181846 -171955 -188031 -183790 -168950 -129614 -68296 -57905 7786 63313 62617 15300 32361
25462 32361 175319 270326 298652 163746 -51071 -20668 26290 65961 326540 237420 -55186
25451 -55186 -40188 100723 156731 105580 188411 255100 172139 -17468 -71069 -81640 8574
25440 8574 115080 62109 68339 51441 27235 49195 96559 74384 136400 143949 -98726 -174356
25428 -174356 -46221 52287 69731 10954 98187 110589 -59870 -150364 -203200 -225273 -191086
25417 -191086 -40835 -98415 -264713 -47083 19236 -76275 -71075 -302105 -222462 43502 72117
25406 72117 -129832 -55664 -18006 -76109 -175792 -69878 -19062 148086 248914 178198 169323
25395 169323 -13449 -50161 -32441 -88221 -166403 -226021 -121186 -150539 -156300 -9019 57065
25384 57065 1503 -24693 -1451 -17508 49393 -19024 -170286 -19743 -28090 -235687 -156190
25373 -156190 -88267 -256756 -178486 15208 133715 169657 160414 12372 -34470 140764 336713
25362 336713 268929 55656 -4621 12541 -85339 -114485 -136494 -27115 78907 35788 -46706
25351 -46706 -31361 -84935 -89173 -70611 2763 29060 89147 213454 238103 3255 -45624
25340 -45624 -129989 -24632 199001 143791 122870 56690 -118950 -131038 20953 -29642 -69059
25329 -69059 16928 80280 148299 16288 97477 81932 -71519 -22132 106995 68687 -68307
25318 -68307 -111752 -18126 19015 50087 2810 -201087 -199009 -167165 -191091 -161108 -44691
25307 -44691 188805 171131 68575 100314 4496 37909 75836 195518 216257 205132 287318
25296 287318 169812 -103943 -164561 -42344 -54849 -56727 164544 240812 237214 84308 15577
25285 15577 -38061 -82055 -108052 45550 153591 192669 40646 -56508 71814 117844 137957
25274 137957 31837 66908 127143 5737 -125667 106673 88639 -76477 -192598 -222285
25264 -222285 -69465 101645 149743 202668 318349 161228 19574 85100 138165 238655
25254 238655 147476 -8647 3574 188086 135601 55598 90383 56586 -68271 -37703 -17365
25243 -17365 48623 27513 -74341 -127193 -170183 -214297 -55298 63507 81705 -85076 -159053
25232 -159053 -76024 -165378 -274318 -192457 -167800 60383 -26040 -128613 -170299 -185519 -161546
25221 -161546 -118346 -126711 -132244 -17722 -4686 133156 118248 -3122 -16692 -30565 -134688
25210 -134688 -139950 -154154 -145504 -144981 -264610 -354251 -270698 -235078 -274714 -257990 -121135 -25648
25198 -25648 -56343 14126 10433 -49931 -73418 -159655 -216007 -213895 -217391 -235049 5127 10050
25186 10050 -7552 726 -83024 -121208 -145461 -151987 -120952 -21691 177662 77027 -156802
25175 -156802 -119246 -161278 -160080 -105038 3084 16784 8608 147951 315716 306173 247853
25164 247853 251471 116784 117021 222061 196974 168625 274802 322375 385395 281781 184492
25153 184492 178137 120097 -16461 -81256 -101555 -24835 -7812 -20534 126779 82400 -119149
25142 -119149 -18378 -37580 -68780 -21435 119381 169556 241966 137028 183299 161998 -1621
25131 -1621 -93520 -73430 -43630 -74279 -117890 -226176 -221969 -229458 -304811 -282331 -211501 -140616
25119 -140616 59577 212454 260240 318878 83027 -85047 -19203 108278 156674 244555
25109 244555 256986 10039 -41131 186184 186499 323718 197166 51735 -24465 -189775 -170607
25098 -170607 -242095 -289043 -294498 -365164 -203082 -26514 42735 5396 -85632 -24761 106666
25087 106666 162468 -126421 -204296 26105 55276 127811 236655 186555 168761 132672 43158
25076 43158 -20359 -174902 -290751 -410468 -275837 -56254 -130500 -75275 -32545 -107639 -100435
25065 -100435 -30389 -112320 -169524 -132696 8315 144892 167534 20348 -89099 -9762 -58532
25054 -58532 89480 172906 -30244 -67153 -75882 34439 33584 -129724 -144927 -23336 142787
25043 142787 165654 37597 -17453 -162628 -257863 -204402 -95495 6787 182971 131770
25033 131770 -31023 33302 -36657 -169216 -95269 -70647 23461 4151 13181 149219 65562
25022 65562 17794 124898 256642 272260 74104 -31766 -10501 13418 38626 -5297 9241
25011 9241 -58961 -179941 -93729 135065 207406 274368 333673 188594 179669 160181 -35270
25000 -35270 72561 -8668 -97064 -20937 113739 86747 -42242 -25546 192371 315876 184095
24989 184095 65163 -14425 23030 43529 14219 -168067 -199750 -32102 -18150 74476 82515
24978 82515 -71069 -141620 -170928 -237058 -125477 -28891 127447 229938 256062 191530 160872
24967 160872 246878 267883 269483 248880 341084 223862 203475 99719 176578 166016 184088
24956 184088 136925 -9738 20249 -136955 -161069 85279 63555 -77319 -59933 10244 164037
24945 164037 179705 18216 -123400 -174298 -146319 -192902 -140271 -95824 16561 78265 267803
24934 267803 213184 233365 100366 91320 -24474 128243 45801 9688 -61696 20278 108943
24923 108943 181437 256791 224074 233853 161910 -7240 -45063 20669 -8821 287 46834 109699
24911 109699 6057 -119026 -200759 -176910 17083 84735 -92341 -166953 -72532 -7710 56767
24900 56767 306702 210150 167420 87668 -111581 -36880 -30858 -20200 -43074 -118158 -83999
24889 -83999 -20023 263 -13340 124674 132542 73283 -1057 -19079 25918 57799 22071 18361
24877 18361 74689 69137 165232 228124 205442 214501 181807 272743 283612 80454 255029 339471
24865 339471 88146 67535 35193 32275 -12861 -75362 -118869 -122770 2357 30598 -9540
24854 -9540 -117663 -154874 -96533 -71685 -238761 -253738 -67834 6908 19557 -66409 -68665
24843 -68665 -257 75651 18017 7414 -74405 -61720 -82387 -45608 -30148 70862 79472 124294
24831 124294 162359 78617 -58108 -18777 -5065 90634 -65540 -78774 -98948 -67753 -25249
24820 -25249 122834 214396 166422 53637 150558 151793 40562 -85410 -110271 -96849 83904
24809 83904 -58331 -123786 -80738 20717 29833 41528 136105 73480 118282 177999 33079
24798 33079 -26990 4112 -67209 -205994 -133758 -180467 -191622 -272569 -127934 -71479 -53487
24787 -53487 -50452 -141655 -155612 -71303 74769 164385 98516 -33969 17377 192317 211177
24776 211177 103160 69401 1614 71224 160464 65236 -99869 -190397 -59647 125039 80670
24765 80670 -65355 -41028 -93817 -152612 -27144 -77974 -71685 96214 201746 169926 148771
24754 148771 -14083 12623 110556 185626 41862 60241 44818 -11250 -70024 -58082 -94897
24743 -94897 -206 74065 90973 112833 220889 240030 208078 197663 134888 69410 51749
24732 51749 19396 -179565 -186230 -114157 -169768 -205782 -222913 -82497 -26612 -100184 -237740
24721 -237740 -394064 -243069 -61570 -103140 -187510 -260074 -179007 -122303 -11772 -35780 -10283
24710 -10283 76381 679 -120286 -155028 -68601 -75231 36332 184 -121430 -114491 -23997
24699 -23997 -37128 36603 111442 -67229 -29389 -151167 -227781 -277069 -226770 -194648 -92198
24688 -92198 111752 79473 -1528 50805 11350 -82887 -174240 -148512 -152821 -205570 -54726
24677 -54726 -2095 -109383 -138366 -143977 -115040 -12322 86026 99454 102770 135187 66932 149589
24665 149589 144133 85068 52108 40444 124017 195559 31316 -30034 50985 58281 -73625
24654 -73625 -152670 15064 43689 -113455 -141076 23583 98689 77276 130356 154523 87671
24643 87671 49732 34730 120755 1051 102285 106848 96778 147264 210742 238651 173363
24632 173363 123030 -149534 -243223 -89405 -144243 -196053 -169555 -187450 -200546 -50034 238196
24621 238196 266812 154832 55932 34927 30462 78022 31064 53414 11668 -33951 -60173
24610 -60173 -22373 -17352 -6283 6943 -42863 -95699 -46488 -101588 -201966 -131118 -95537 72740
24598 72740 115861 166078 210321 198847 27981 -93498 -116297 42497 203344 193291 -6645
24587 -6645 -22564 28299 48363 189999 237829 157686 15170 156699 195803 211820 217388
24576 217388 -5048 -24411 -12950 72339 116276 35679 23344 45560 -72164 -181963 -246202
24565 -246202 -163936 -138538 -185930 -204231 -98471 -85024 -164734 -29405 -36953 -106019 -119546
24554 -119546 -31652 34565 109276 59704 4532 -10576 -164414 -228330 -91398 185627 294067
24543 294067 172020 2705 21217 10894 105202 82692 -66923 -32598 -168427 -277091
24533 -277091 -238251 -237475 -206634 -15104 6724 22422 -1219 -145219 -138865 46513 -60824
24522 -60824 -182674 -98097 -45456 -36409 12 -100604 -282720 -236278 79921 298028 301189
24511 301189 179871 26150 -64914 111847 33072 -23544 -77256 -93502 112855 34487 -52859
24500 -52859 -131437 -67277 -26346 79031 228124 75601 -6174 23480 86199 54372 8701
24489 8701 -69138 -90058 -135429 -219972 -101545 -74294 61720 37064 118743 227235 186536
24478 186536 -38019 -162837 -194922 -253923 -279042 -204196 -166826 -191542 -226990 -267954 -358854
24467 -358854 -236463 -163847 -82938 46361 152799 65343 46253 89348 68492 95088 133720
24456 133720 -75624 -63350 136792 113813 31198 -30384 -118077 17952 -15484 78095 97551
24445 97551 -58287 -110007 -39307 41768 24134 94744 143926 254751 140269 56873 31303
24434 31303 -70899 -119435 -58455 23286 14830 58196 -152017 -390713 -496528 -374867 -261366
24423 -261366 -169784 83166 214042 281652 248715 199066 64123 73081 -2030 -41674 -22766
24412 -22766 -141111 -158993 -134542 -73731 -73047 -112214 68137 205098 194632 225654 129295
24401 129295 -78262 -12214 145219 239271 312327 109070 -107157 -86486 -51765 -37588 42924
24390 42924 70013 91340 -17418 -150424 -141871 -234683 -141990 -94089 -41308 35000 -46359
24379 -46359 -80160 133456 138206 168365 132246 35517 -15276 -174546 -208199 33166 144951
24368 144951 83217 -25032 62380 187271 225829 245834 95484 -36411 -8358 -36072 -97186
24357 -97186 36821 -5756 -75213 -99851 -179341 -358961 -346613 -253374 -212123 -30395 -126760
24346 -126760 -188721 4510 17573 -22123 -51402 -120287 -130713 -290539 -231253 -123300 -114997
24335 -114997 2444 -73972 -65510 -113304 66879 51766 -49247 -5156 4507 69723 -16621
24324 -16621 -5146 26472 77692 120668 104378 -42973 79599 180780 156476 155036 227656
24313 227656 134385 -119274 -112899 -81317 -97048 -95821 60652 56502 168721 214449 245032
24302 245032 167107 341574 313236 210019 255605 143910 -9902 -26623 71302 111481 233354
24291 233354 180443 127008 27638 43170 45199 -121792 -130826 -909 59440 15901 103854
24280 103854 186725 64626 -22150 -72362 -40856 -61041 -48575 -121554 -55828 -155562 -179267
24269 -179267 41551 122844 236312 168749 191764 179955 166263 139399 55009 13810 -4297
24258 -4297 -43250 -192190 -243807 -40462 213581 96171 -103316 -167965 -211685 -208701 -101447
24247 -101447 -17058 -97549 -141452 -179664 -240194 -351099 -287734 -290138 -316650 -218327 -147208
24236 -147208 -178276 -92430 -62519 -245580 -220121 -41437 50879 11096 40322 93209 43403
24225 43403 20047 39351 82601 4239 73234 385840 352946 154361 91128 -425 -21647
24214 -21647 8282 38280 129150 -13519 -148218 -93680 -83120 -98910 -166646 -179422 -145495
24203 -145495 -152137 -191734 -220557 -141425 -134307 -62292 123071 214285 169648 100779 91455 51001
24191 51001 66519 89867 149308 187896 172711 183034 156158 133162 196117 98000 -27739
24180 -27739 -39930 -38701 -18218 -58978 11106 41176 -49173 -111703 -149806 -110404 -91953 -8986
24168 -8986 1451 39017 25229 -163453 -195991 -180786 -223842 -242929 -230288 -82440 -123074
24157 -123074 -123207 -96570 -120537 -272467 -154472 -41140 41079 33435 -28083 -165856 -172524
24146 -172524 -76951 14445 132213 91754 -21983 -30831 33856 -153443 -243359 -36957 28531
24135 28531 -63198 11577 -2001 -106470 -28253 29468 -26061 121500 73244 -55213 -103097
24124 -103097 -242261 -177941 18081 20313 -86901 -10128 21865 -180873 -378587 -415267 -324412
24113 -324412 -208162 -102144 -72067 -153456 18040 190516 186991 152252 128619 37883 96952
24102 96952 60366 87046 305132 251398 3663 -23283 30296 -24290 -189606 -225723 -296578
24091 -296578 -412375 -344068 -168835 74765 253912 168611 22417 24292 26925 22089 82271
24080 82271 50511 -105207 -54162 -60256 -98141 -92429 -158095 -261607 -291351 -121531 185520
24069 185520 250079 310459 265041 202902 44157 -6453 131702 11102 7677 -49164 -30578
24058 -30578 108925 37604 133307 209082 219836 89685 142231 15732 -109893 -37663 115158
24047 115158 172229 173159 241727 165787 193964 172150 -27209 -65819 16799 96445 52776 38787
24035 38787 85063 148720 289758 301299 171251 48431 66132 -10938 3359 41127 147190
24024 147190 236957 309430 280334 257268 225519 226540 116177 82177 165088 63183 87631
24013 87631 126458 -115258 -62454 -98876 -244027 -271215 -182833 -187729 -48307 45211 165089
24002 165089 212882 68961 28718 270288 402897 276339 -33925 -232883 -138720 -4783
23992 -4783 -87827 -85429 -75829 -67192 -7000 108341 155894 42920 51479 -43334 -114563 -116240
23980 -116240 -108586 -150265 -142703 -195528 -183864 -120648 -14043 37099 12759 -73659 -109906 -39720
23968 -39720 15600 106731 144462 175504 110506 1005 -309547 -248045 -200453 -117174 -115244
23957 -115244 -39973 93803 122506 261087 209638 141942 119637 202442 291377 219758 127345
23946 127345 174187 173733 54194 -110213 -67450 194445 222511 97853 -2099 137394 303986
23935 303986 339944 250455 6192 -27966 1567 -68230 -168243 -180513 -70554 -162642 -300849
23924 -300849 -245971 -5364 18463 80287 85298 74705 5499 55024 249371 381144 314626
23913 314626 304239 193321 212619 206071 150215 18835 34597 186534 223694 120310 144600
23902 144600 161950 212607 67494 2533 85411 199815 193756 179745 307320 416035 332570
23891 332570 227910 340884 295488 130925 25667 -105873 -166994 -137586 -251561 -180330
23881 -180330 -94873 -9068 31074 -72476 -137120 -80527 -153439 -386206 -327338 -401676 -526945
23870 -526945 -495992 -209392 -139685 -102261 -102146 -148799 -79445 -48764 -83942 -237910 -136795
23859 -136795 75314 111605 93178 167483 156829 161926 115419 62787 24272 96445 218960
23848 218960 333517 404514 134750 156855 58610 -7684 212720 210270 107332 247884 378399
23837 378399 358216 243741 111305 -7201 -134765 -171547 -168575 -75423 -99625 -142549 -23140
23826 -23140 -40690 34587 32814 -77947 -276311 -254228 -196031 -289550 -210333 -156216 -109290
23815 -109290 -208679 -286155 -163046 -58511 101956 65893 -17367 19187 164690 189984 201370
23804 201370 80308 16006 282 -13739 -613 30633 -84780 -243359 -187234 -64910 28630
23793 28630 -34235 -39715 -78045 -112087 -94050 -148220 -233180 -231499 -132432 -289110 -171778 -275429
23781 -275429 -229510 -69531 -88226 -231889 -129680 103308 81271 -11494 159164 180993
23771 180993 224356 196655 74437 92933 178294 110456 74430 20354 23834 410 -80137
23760 -80137 -181874 -141625 -79228 27878 194439 183092 141543 42298 -116960 -16436 -107783
23749 -107783 -239260 -97572 -113222 -269263 -284942 -130026 -22303 -11795 -52750 -33775
23739 -33775 -15171 138083 177541 68058 64098 15476 -129482 -94831 -69398 12765 -11959
23728 -11959 -13644 131496 187463 29080 16535 25605 50623 -49203 -183475 -308173 -253737
23717 -253737 -180759 -187084 -298179 -382432 -300319 -87691 -50780 -142047 -153159 -204819 -96131
23706 -96131 104647 22185 8391 146788 100858 11074 79552 -47858 -33647 23836 -71031
23695 -71031 -227158 -170778 -29538 42888 32735 -2793 -38383 -32517 -51175 -91958 16190
23684 16190 39176 -108399 -371072 -274991 -330388 -372181 -325748 -343398 -298183 -203542 -175226
23673 -175226 -203988 -175273 -165462 -6894 72898 78348 -17241 -78178 50685 147292 93769
23662 93769 110405 92596 -36270 53652 153528 67813 696 -43667 -190347 -215675 -151080
23651 -151080 -60686 -110197 -176653 -317965 -397649 -409546 -265682 -66081 4369 61889 16241
23640 16241 -210238 -330539 -294548 -30915 -19562 -96089 -117311 -116383 -81436 -84490 67644
23629 67644 116817 147655 228513 150526 110750 62565 3952 37654 -17097 10441 -35395 36784
23617 36784 -20010 22684 107760 -97004 -112436 -49306 -168700 -229206 -115593 -88012 21512
23606 21512 57595 -29459 -71872 -97660 -151007 -242841 -78922 68225 90076 137380 60886
23595 60886 -29641 -127964 -309598 -403607 -462708 -382975 -245461 -24919 -58364 -255026 -228237
23584 -228237 -106464 77974 -6998 -135666 -36521 -44501 -47208 49871 -78608 -298562 -337444
23573 -337444 -144020 26963 66388 35785 62825 82386 125837 237737 139287 -122593 -268489
23562 -268489 -125828 -145728 -261272 42466 53988 -17930 58838 41992 -56191 7510 25414
23551 25414 55154 88558 -98549 -98027 -85903 29960 59992 153036 287798 270592 49415
23540 49415 -7172 -4364 -50725 77871 140130 1349 3225 -35916 -91515 -39857 28099 -80618
23528 -80618 -144793 -134515 -224808 -293036 -230423 -225786 -306046 -330403 -296815 -266415 -187193 -149291
23516 -149291 -162875 -63099 -115761 -253331 -237620 -58397 -636 -32230 -139837 -239287 -153046
23505 -153046 -77904 22930 50023 142807 263340 344236 342306 218262 297125 228961 133537
23494 133537 168484 283379 197346 33358 -6812 -68391 -54942 -24077 34313 162991 182302
23483 182302 57971 -6437 -73909 31693 -25185 104467 6269 -71091 -56563 -33706 127420
23472 127420 231848 107581 95189 -48218 47738 64048 -171723 -256545 -215538 -267603 -265273
23461 -265273 -164181 -182010 -145680 54121 -592 -31752 78407 -100692 -125767 -33164 175136
23450 175136 264319 230303 162758 12137 -60442 -76287 -225538 -235868 -97919 -22572 2628
23439 2628 -30415 -103015 -150276 -108697 -96616 -185609 -241812 -296872 -254066 -160863 -28323 -92404
23427 -92404 -134747 -30404 45518 126285 143035 232090 481729 463922 303598 163034 167691
23416 167691 222973 45467 -89944 -23308 51297 101875 121947 -69725 -123481 -119401 -177384
23405 -177384 -178971 -93189 -81765 20881 42253 108716 50982 -49970 -19329 52177 1077
23394 1077 6470 107630 26283 59581 116491 -13616 -29993 -15786 -138018 -136677 -43326 108336
23382 108336 143545 69237 61845 -3123 112090 94253 -111160 -97899 -123856 -75801 -61704
23371 -61704 -16471 2936 -22592 -16812 -15801 33096 108173 165113 227911 153742 14394 88902
23359 88902 21350 -177715 -237127 -57507 -194409 -104262 -136467 -86311 -163749 -65877 39076
23348 39076 32751 67755 116942 92168 609 882 13095 -33695 56786 9179 -63681 -49402
23336 -49402 -82000 -139302 -137071 -52267 64633 146041 131289 -115718 -80254 63398 105481
23325 105481 43360 -11600 39038 128106 78661 -38994 -24566 -73069 -167063 -22707 143560
23314 143560 111369 -3427 -40514 -205235 -246812 -60088 3121 97268 56162 -112848 -95574
23303 -95574 -94000 4032 62835 -10407 11122 -22450 28959 215610 282403 44387 -31375
23292 -31375 15964 -57839 -128959 -203907 -7749 43935 131158 178159 156614 2857 -22077
23281 -22077 -17295 160928 194847 16437 -189497 -34781 18543 1597 88080 207919 125914
23270 125914 64411 68886 137613 103328 158204 129450 124101 84004 86653 141508 222589 227774
23258 227774 91910 131198 16002 -3928 89710 135760 115196 -26194 -144962 -212943 -301674
23247 -301674 -371065 -162936 -102760 -144054 -172669 -250769 -265794 -250965 -202509 -152210 -178062
23236 -178062 -37026 66553 82042 131245 150408 102268 153623 338384 229324 19416
23226 19416 45153 104879 -33261 -131253 -79379 -96737 -310340 -255039 -99194 -95368 -186918
23215 -186918 -157460 -97421 -156389 -94788 12655 34348 9872 42769 -102858 -92782 -37732
23204 -37732 8293 8675 -107311 -10353 -40794 -85363 43175 233083 354100 237766 172807
23193 172807 208206 202028 128580 61220 -2093 37897 55814 105581 81392 -122655 -180144
23182 -180144 -103499 -158201 -237246 -163670 -83230 -195354 -202054 -173986 -67291 -153658 -156766
23171 -156766 18590 -42479 -68825 89232 58788 -153604 -115851 22288 247991 389027
23161 389027 341847 173317 38716 -18507 -89182 48447 214591 177451 176707 181146 220988
23150 220988 202014 251733 163584 10561 -139140 -203872 -79857 100786 63017 135058 282057
23139 282057 308918 146608 249102 319840 190265 219224 146738 34682 51126 94961 113171
23128 113171 254545 139671 181604 242142 375336 411485 356513 266176 100847 12872 -40371
23117 -40371 -21085 2542 -52177 -22369 187231 77955 -162559 -211925 -276680 -163402 -254380
23106 -254380 -167507 -194541 -144809 -32587 -38499 -7282 -38288 -23167 -64350 -168164 -273374
23095 -273374 -150856 -82091 -76736 -128367 -81924 -80749 -33208 37818 69747 63338 -2140 -121615
23083 -121615 -81214 149789 61685 61981 113517 -2980 -61555 -55080 -58227 64009 192768
23072 192768 99664 75809 86600 62173 -54083 -95128 4728 840 -103792 5581 108300
23061 108300 196187 141556 19282 -81802 -103755 -207141 -179301 -240409 -171202 48753 84448
23050 84448 -37773 -208134 -298291 -34081 171892 87768 137928 95353 -164683 -233458 -298153
23039 -298153 -292174 -300362 -245441 -226668 -200060 -110793 144065 189730 262101 372377 270507
23028 270507 150570 55124 132622 84026 -48618 -46895 -73134 -155648 -371683 -489172 -360945
23017 -360945 -218286 -215492 -188194 -14805 49080 97127 176386 97192 20291 54965 -73564
23006 -73564 -2928 176985 141187 -135229 -109695 51702 100551 128108 -51081 -191462 -251477
22995 -251477 -258615 -132295 -128352 -298546 -123398 54388 44966 -41236 -83220 -34392 27560
22984 27560 51745 144086 -23853 86999 134717 86832 64507 39847 145663 314840 355471
22973 355471 176413 -4549 13668 154709 46545 -63720 -7348 -103726 -191589 -234361
22963 -234361 -167696 -110289 -106494 -217597 -210801 -21645 33403 196342 312162 182814 2233
22952 2233 13946 -35785 -22339 -107935 -223166 -181527 -134392 -215087 -183702 -136951 39536
22941 39536 218044 271711 159721 78140 93517 61020 -30018 -257078 -179585 -126469 -93919
22930 -93919 -66267 48573 145031 142957 58270 142076 124230 -25507 -7356 -65598 -41482
22919 -41482 -14042 96422 206879 364223 329830 270118 247913 58158 -208818 -361636
22909 -361636 -322205 -181093 -96502 35259 1422 -103474 -49742 110590 152995 25973
22899 25973 -27116 -190463 -57642 114340 125308 74177 46754 56768 37162 39262 -21269
22888 -21269 -244073 -240621 -206149 -99214 -81005 -143765 -304882 -373952 -177398 5293 -163646
22877 -163646 -161727 -1984 22292 -30973 -49807 -94132 -104824 -129090 -136782 -225623 -223480 -124368
22865 -124368 -36836 -11179 102797 114691 58083 74569 154669 169000 86387 89142 139418
22854 139418 -63700 -77051 -22281 81163 90521 215130 262057 202617 15660 -120138 -23622
22843 -23622 25308 -145411 -112336 56031 134814 292188 255711 126940 -2190 -12756 22208
22832 22208 59285 74922 6635 65166 148035 143682 128925 47844 -23343 -41133 25094 161386
22820 161386 208363 49595 -44944 69475 220233 253064 48412 -35583 79564 19452
22810 19452 37547 95042 90940 25520 47260 53811 193449 266707 242655 123803 2942
22799 2942 36803 39885 -46670 -34352 -219599 -313047 -188496 -89021 -117033 82796 120864
22788 120864 -54328 -124285 -249241 -436941 -331276 -226379 -71793 59054 47994 49389
22778 49389 -23653 -51851 -103333 12114 -45858 -102539 -140614 -151757 -273137 -278788 -266799
22767 -266799 -348824 -403342 -255154 -131939 -67945 -192101 -118513 125993 205547 71549
22757 71549 70840 115880 97128 -58787 -44346 30716 23312 -68188 -133894 -100250 90407 139748
22745 139748 73529 -59460 -65255 -52547 -13217 -18788 59133 116610 -62830 -21709 -126156
22734 -126156 -106606 -151028 -100947 -251357 -107122 -1227 59582 25385 -68402 7733 71134
22723 71134 -2280 -6964 -69115 -36417 -39504 92999 180270 164469 69124 42687 6930 -68881
22711 -68881 73664 109449 130214 182198 20493 -87656 -10760 36511 26069 -99039 -113071
22700 -113071 -116610 14182 -49673 19147 51762 134369 -110841 -97269 -12172 -45446 -136605
22689 -136605 -40356 -22031 -58429 105141 110163 -89386 -82874 39458 -31054 -103320 -32426
22678 -32426 -61957 -96514 -146882 -116845 126785 211001 117559 -71153 -294141 -240818 -168523
22667 -168523 -66187 -21610 -96477 -156444 -125290 -10151 169420 63434 60373 10069 -17164
22656 -17164 -121235 -57495 -33340 98299 89736 121104 69757 1824 116924 272090 258135
22645 258135 108869 57158 178858 278790 209650 148129 107619 47202 -28098 -207705 -71751
22634 -71751 21905 11871 -143684 -304908 -312857 -396277 -376143 -131787 -43807 -128755 -206681
22623 -206681 -212268 -277017 -461589 -292693 -129834 35516 2021 -185054 -51149 113796
22613 113796 149632 206206 201554 148901 -19453 -107547 -102482 98044 135653 199774 190925 274987
22601 274987 210297 7736 -91274 -252728 -252093 -251734 -141088 -58406 -134137 -106839 -16298 -32017
22589 -32017 -97495 -114452 -39518 -56606 -64400 -23392 32534 50399 -73527 -73639 -79829 -119625
22577 -119625 35982 96299 136425 186797 11554 12976 -54302 -368016 -314688 -224855 -100421
22566 -100421 -51475 3845 42644 -88332 -179183 -105047 -143513 -185703 -26907 76383 51521
22555 51521 71547 40450 8142 -19548 -106088 -10247 66709 76654 147071 22292 -11170 14468
22543 14468 -28885 -152292 -246295 -278335 -319371 -251796 -80277 190448 344219 216030 -35195
22532 -35195 -84873 -99163 -115239 -129667 -146071 47863 17622 71912 17542 46355 111324
22521 111324 197934 383669 345657 187960 91147 176706 183332 324658 218703 175659 10233
22510 10233 108764 86553 153320 91969 -5025 105641 313627 440018 285443 135476 54276
22499 54276 -82434 -269916 -280234 -154862 -148797 -28321 -17973 -22238 -62191 72801 115633
22488 115633 69132 -84580 -127896 -253646 -384459 -318998 -271818 -169622 -118002 -124564 -56542
22477 -56542 -46720 -12949 86345 79 134562 162900 8976 -32099 -9551 93091 79034
22466 79034 53721 40002 -38420 55921 104806 76747 -6397 65589 43824 61220 143515 176628
22454 176628 -26595 -54877 -130046 -160484 -29032 127080 195825 16040 -121374 -63888
22444 -63888 118129 154621 83477 -88378 -285630 -133920 47817 175767 156478 14940
22434 14940 -24590 -17028 8313 164400 284932 120605 62736 -58948 -70132 -9242 -114700
22423 -114700 -293705 -226867 -36665 44847 202731 279382 159174 124356 25447 -54273 -66856
22412 -66856 40777 -2336 -90559 -49253 199489 323940 347533 242318 -12622 -64524 6857
22401 6857 55911 83646 49655 -23292 -59231 34545 33536 -65057 21273 -73187 -82649 -187044
22389 -187044 -229447 -214170 -148313 -224064 -167391 -322894 -301347 -82229 -34199 -34795 -119193
22378 -119193 -121630 -82408 17847 -66148 -168595 -166582 -40884 217177 206502 95943 24988
22367 24988 -175844 -341165 -193078 28643 175407 378328 225728 128086 236660 98262
22357 98262 -16435 -58810 -19777 -56254 60184 154347 -18952 -109284 -6867 -45980 -111001
22346 -111001 -80503 -74497 -27181 -41614 -37758 -55919 -116363 -50415 -15688 -44627 -68627 -79027
22334 -79027 30834 -22906 -2703 56422 164295 149755 73329 125704 121789 84136 86986 14021
22322 14021 -51470 -95765 -229457 -288682 -119309 -17915 -16675 523 75906 149606 -15547
22311 -15547 -22828 146294 278262 242465 125943 181832 177056 53854 -17983 -199918 -129213
22300 -129213 -96076 -66411 98804 276171 153427 47871 -190433 -348768 -361191 -199631
22290 -199631 -79537 102949 50197 90742 152010 135681 66353 -73864 -139123 -215026 -157350
22279 -157350 -163584 -206093 -224445 -208591 -66338 82969 -63237 -247324 -44468 217608
22269 217608 291912 217276 204780 139524 123069 309984 229157 288563 269944 178715 150238
22258 150238 204659 181162 -28808 -14098 33141 32223 -63992 -19930 76537 53447 -16331 -68692
22246 -68692 15295 57063 95277 63473 -51815 -78172 102933 65795 -24947 -56380 -6738
22235 -6738 -28463 23081 -8421 -113844 -50030 116642 61255 -72974 -169117 -98283 -4605
22224 -4605 -99333 -144292 -46449 26504 103963 133823 14246 -50262 -77826 71230 49441
22213 49441 30704 15642 12774 171278 12423 -232003 -258570 -253708 -262163 -89501 -41545
22202 -41545 19041 26429 53849 108442 107887 50999 53024 -31317 -86052 -229301 -159026 -109546
22190 -109546 -124586 -42796 64718 6490 100089 34044 -59884 -8400 15242 9031 51225
22179 51225 -54199 -171385 -115720 -152540 -210624 -204105 -165727 -12206 2686 15362 74642
22168 74642 20422 84034 100421 -62254 -102833 -102988 -124171 -91300 59878 77833 138961 194204
22156 194204 160729 48322 -65656 50998 106944 179595 7145 -4113 31906 14619 77116
22145 77116 -4037 11202 27960 -49534 -81499 -40840 -157107 -26656 -29495 -195399 -215303
22134 -215303 -81216 77204 82602 55743 174320 150043 100587 88313 46638 -54035 -41597
22123 -41597 9729 -22871 76957 92292 -163 -112304 -13917 -78763 -239266 -247119 -293290
22112 -293290 -326372 -396241 -250560 -112054 -45731 47968 -26989 -60589 37584 19551 -89229
22101 -89229 -157620 -54265 93004 119948 106986 -30678 -92081 -103146 -14039 91784 43073
22090 43073 56251 -20039 -144630 -271371 -225099 -138927 -57777 31348 92169 48621 77651
22079 77651 -21779 -65578 13145 111466 37392 116592 315982 317896 179273 101901 119825
22068 119825 138438 120722 -83480 -120596 -80274 -88967 -88089 122207 60226 -39668 113970
22057 113970 170658 89490 93409 15640 -66110 -190689 -4745 70458 -29587 31859 53949
22046 53949 19922 -183521 -179719 -139809 -89878 -68999 147051 232104 119466 20609 -9708
22035 -9708 -72234 -127247 7694 5854 -56045 -139612 -55712 -55818 -28834 -82901 -37625 -34871
22023 -34871 -122864 -124269 -98410 -77029 -68884 -25288 68047 64506 18564 -24308 -53626 -66084
22011 -66084 21789 121683 90709 85981 149964 38834 -226569 -398793 -344088 -146469 -219141
22000 -219141 -364569 -217638 106553 105859 43923 -46677 -83551 19104 64281 31514 -103022
21989 -103022 -82143 -68460 -47550 -40014 -21607 26230 95216 118632 176766 227642 112257
21978 112257 -65499 24104 52148 -22421 -1842 155764 176513 32770 -136521 -103421 19970
21967 19970 124536 138115 124531 -11338 -128815 -91812 -142547 -116850 -129362 -76762 -54511
21956 -54511 -131358 -142777 -53301 -1497 -121114 -19626 51593 63746 144476 224765 102836
21945 102836 -21756 94820 -3568 24790 -51866 -59445 -54779 52492 192800 118165 -76060
21934 -76060 -89615 -165659 -320615 -383060 -171358 -62518 -34349 -13837 57608 -126283 -328002
21923 -328002 -376852 -113817 141309 274910 141274 116834 54285 -119287 -131808 -142130
21913 -142130 -81196 -170702 -188663 -175125 -128856 -98125 -72028 -76722 -198768 -201818 -10813
21902 -10813 95848 2481 13543 57324 21623 -171852 -284210 -277194 -122359 53899 -64077
21891 -64077 -189311 -245085 -230126 -138498 -15945 17280 101082 279197 208249 101739 4482
21880 4482 -113200 -217322 -266672 -274471 -226804 -64557 -35989 -84369 116826 218805 242876
21869 242876 150710 63130 39209 154039 254026 210709 126790 212604 140077 -34065 -54135
21858 -54135 113770 105581 34805 -115164 -257582 -174801 -103020 -200452 -111348 48492 88602
21847 88602 150119 -47451 2294 73773 111089 -36049 -84837 -96309 -76581 -140192 -145417
21836 -145417 -182237 -240794 -199557 -89807 -781 -31960 -6773 -45623 3314 -30562 -149024
21825 -149024 -109911 -7273 60714 159589 137778 108559 -11658 -109189 -139062 -144062 -152723
21814 -152723 -142785 -10516 -44327 -96425 -10938 -74618 -87716 -76839 -118239 7281 105011
21803 105011 9426 -111376 -246910 -81906 -15436 -154786 -254741 -230819 -231632 -285264 -129527
21792 -129527 15494 5045 -134385 -55887 115408 242249 93502 55305 61007 49536 39040
21781 39040 -138861 -176832 -202178 -160695 -61136 -140141 -272954 -187856 -269697 -387139 -475764
21770 -475764 -217984 -60046 -231328 -259790 -50304 25197 -26989 72859 82778 -133715 -57703
21759 -57703 -11393 -51086 -21662 -118801 -140038 -66008 -2235 86943 151165 10410 -16815
21748 -16815 119013 232177 -69456 -184202 -185839 -88475 -63357 -8250 97290 214643 101550
21737 101550 89826 123083 125842 156806 216585 203059 71749 38014 -65174 48156 73527
21726 73527 97901 178832 75969 27216 -147489 -210893 -31824 54980 47072 70690 -16575
21715 -16575 -28207 -167397 -150932 -148575 -189480 -234711 -172301 -87590 -115786 -378277 -389117
21704 -389117 -241386 -77913 35496 -45837 -120609 -112075 -29911 -43346 -149219 -266314 -223681
21693 -223681 -127115 -241769 -276322 -165969 -87656 -251855 -217252 -123943 -223624 -198383 -206112
21682 -206112 -121367 -253631 -209329 -196047 -87959 -42162 125363 81030 -22139 -55371 -123479
21671 -123479 -240883 -174501 -119276 17528 -113500 -92461 -115903 -130313 -112461 1730 72655
21660 72655 79820 4160 -158163 -175242 -24985 16206 -93976 -146775 62709 314100 233200
21649 233200 96987 48986 19776 -178489 -261784 -222016 -137343 26079 47679 -68889 -135431
21638 -135431 -146100 -87958 -208179 -211399 -80933 14213 21246 20513 53583 120283 101172 8395
21626 8395 57617 118193 18980 1892 -38489 69864 316593 344679 277214 110303 40858
21615 40858 -131449 -239661 1857 77381 -139466 -411261 -352128 -258792 -137539 13360
21605 13360 -66518 -3034 99824 188501 230129 262651 356538 159827 67876 10801 81560
21594 81560 225287 43305 -74193 -136913 -110464 -117336 -255748 -338692 -231635 -194174 -241857
21583 -241857 -232486 -231878 -275546 -240571 -136577 8498 21471 20650 53572 44708 10976 -135595
21571 -135595 -212259 -183161 -82965 -106432 -77074 53366 58242 79828 222282 252252 141073
21560 141073 158462 142118 117439 -32503 -13592 84183 148120 170061 183513 138263 114545
21549 114545 92036 80551 -151662 -98011 75703 182963 -41597 -154562 -40939 92024
21539 92024 57612 -145655 -81329 29617 151064 101224 90831 53844 84876 -145691 -263004
21528 -263004 -83134 -109845 -135404 -194522 -86349 85043 -14442 -53652 -44495 -58656 22975
21517 22975 125215 204681 176632 89351 218315 253588 188056 117228 73868 -60204 -9076
21506 -9076 93444 49665 -3120 -40367 -12993 33920 -23342 -36887 44018 149837 67896
21495 67896 58329 -13086 -58819 -174036 -128153 51159 171763 324234 123417 -34208 -29915
21484 -29915 21031 169169 294458 168983 90875 3305 -52613 -24181 48752 -90733 -159317
21473 -159317 -223683 -86585 75606 110361 321103 417569 301321 129699 94429 10287
21463 10287 74696 174180 322053 233779 -2581 -95693 17660 92856 239983 135803 -78212
21452 -78212 -37061 -34496 -130068 -220776 -141154 -5110 25506 -76837 -283671 -275241 -275332 -239729
21440 -239729 -182034 -155206 2126 53543 188380 174220 168841 182515 -4772 -147798 -11178
21429 -11178 14053 -103885 -13623 13714 -133234 -122107 -69112 -68445 -172979 -213437 -106440
21418 -106440 -109936 -156516 -251586 -131414 -211386 -93324 115075 -26019 -205103 -179799 -172874
21407 -172874 -60113 139352 92335 -21187 -118440 -135464 5244 -28165 -51247 137513
21397 137513 259344 83790 56384 97955 58097 201050 218330 97615 -175890 -274329
21387 -274329 -177359 -111847 -265940 -277534 -135341 -67766 7362 196529 193025 91251 44678
21376 44678 -43570 -124602 -145379 -293442 -334133 -266088 -249777 -183799 -132406 -121705 -184982
21365 -184982 -56870 47243 54262 -59838 138466 101196 -11566 -25699 103743 127827
21355 127827 172534 179944 161020 149563 118090 71561 32031 -1355 7359 67151 56721 -139956
21343 -139956 -314975 -283932 -230438 -35401 -13950 -256035 -239337 -157451 -194258 -288287 -325292
21332 -325292 -343317 -438686 -322491 -187423 -49440 170838 155802 136728 204247 432502
21322 432502 453448 348451 313893 314707 203961 151134 -27159 92825 24294 79458 77702
21311 77702 80903 112123 184635 252817 254611 210625 189249 189421 250977 317270 228834 114263
21299 114263 82348 144078 118434 81222 77203 -65418 -150552 -67535 136430 145892 -35247
21288 -35247 -201758 -283948 -282741 -126234 -15388 17836 -2690 -89198 5353 166443 254638
21277 254638 279520 80723 -87017 -17239 -81853 -29155 85229 255685 224532 329177
21267 329177 383984 334905 144894 118174 55349 67001 -23381 -213084 -313576 -304912 -133714
21256 -133714 -149587 -203359 -291169 -253483 -219387 -205634 -84600 -23279 -47094 -175917 -242131
21245 -242131 -330943 -265956 -17264 11637 -71714 -210015 -207206 -151537 -152802 -119849 -95059
21234 -95059 -36567 -56279 -509 -135605 -295613 -169004 -27714 -133269 -212152 -249185 -284433
21223 -284433 -270391 -194217 -135386 -125083 -90527 -53790 -60645 1342 -111259 -62757 52868
21212 52868 70208 126904 191854 110592 -14836 -55221 66788 117709 83240 101143 81055
21201 81055 173173 148297 136472 128110 23956 -51871 76946 142928 47439 -29477 -60112
21190 -60112 -102870 -54691 51748 -89250 -23768 108817 42109 96562 40785 -120754 -184544
21179 -184544 -74901 8482 -40710 -47249 -175301 -18136 -25985 14183 141429 191740 360112
21168 360112 209582 126977 -54508 -95777 -93143 -222071 -395636 -304957 -114369 -20396 -3346
21157 -3346 -37397 -38677 20654 -125353 -122726 -59235 -50489 60686 186907 53353 -95181
21146 -95181 -106796 19515 47386 15356 104672 200072 207940 51162 -126883 -153760 -136478
21135 -136478 -75344 -117599 -110240 -22396 64493 -36468 59617 80412 45975 19818 22053 31745
21123 31745 64363 50922 1564 -96836 -18700 175754 258444 218147 94989 48975 133227
21112 133227 145201 111279 63780 -25059 -196489 -111147 -154143 -146379 101688 151938 -5335
21101 -5335 33323 212137 160087 116387 50196 36908 -151858 -303956 -262188 -237528 -324333
21090 -324333 -414943 -149029 -137783 -77148 83676 210983 196510 52010 -45831 -37335 122866
21079 122866 251912 230134 117760 -17961 -10178 -39260 -62905 -34405 -72585 -147869 -229241
21068 -229241 -53361 99216 -122729 -60890 3770 -153168 -270844 -243948 -266758 -246918
21058 -246918 -67155 -148281 -201031 -366362 -374469 -214484 -146037 -276064 -316962 -143804 -65496
21047 -65496 -44315 -42357 -58679 -65012 -129970 -68690 -94027 -163480 -152822 -80746 -33085 33318
21035 33318 179725 117184 177836 32239 22776 67530 -46595 -31382 -126883 -11073 35213
21024 35213 -41184 -78159 -177605 -223880 -215811 -241808 -306987 -212663 -90831 -211503 -72766
21013 -72766 118632 4222 -76113 -101286 10456 155651 65370 21803 -38620 112716 255618
21002 255618 152259 22455 109344 132803 55876 161240 62504 171294 272278 303465
20992 303465 294089 288889 30629 12046 97378 101596 143147 20520 -51262 -21268 41107 40045
20980 40045 83816 75023 55413 5321 -193512 -162548 -109179 -81758 41132 -8911 -72336
20969 -72336 -2412 94174 169835 70268 -248 29913 114398 167806 107503 3304 -177581
20958 -177581 -331546 -246220 -133762 -160086 -164951 -209229 -85343 90387 87424 -17840 -204986
20947 -204986 -37333 16708 -53276 -6502 47485 -49565 -49863 -117372 -150050 -211623 -191631 -53323
20935 -53323 -130287 -110231 -121024 -83755 55847 -7803 -121708 -207596 -257015 -256495 -214231 25276
20923 25276 80602 204546 238896 173232 102243 93262 51634 -5216 87022 151687 147712 98356
20911 98356 -121514 2251 3244 163555 314232 225727 148342 51341 -95474 -103994 -132804
20900 -132804 -54698 -40348 -57309 -180030 -121093 76911 239339 202526 117404 -74456 -95976
20889 -95976 4504 -71804 -191835 -258009 -269399 -295954 -247113 -60916 -104362 -97775 44519
20878 44519 191521 200990 109684 22333 -122934 -307950 -170279 -166244 -85446 -13212 -66875
20867 -66875 -234357 -311534 -352737 -195076 -54057 -83238 -99320 -90654 -1574 -171219 -51518
20856 -51518 -10998 -61049 -193160 -66821 97229 14923 -12855 26288 15670 43890 87344
20845 87344 -39093 -123896 -143139 -175107 -170065 -243096 -152013 -34980 -161024 -250879 -71902
20834 -71902 -7669 -75110 -201581 -81567 30115 -628 -13197 -56084 -42665 -103548 11531
20823 11531 263100 232851 85310 26163 112444 159580 215922 58667 14325 -32006 134486
20812 134486 119803 1763 -51714 -112903 -254152 -28573 48650 37580 141929 207258 469463
20801 469463 392280 289207 264096 213635 168922 -25534 23589 168709 -8186 -73536 58028
20790 58028 174090 64308 -92303 -69372 -41926 -70409 -26497 -9793 -149388 -102392 3921
20779 3921 70492 13876 10803 112998 264606 267616 278658 348268 390073 187596 29675
20768 29675 58480 210705 295616 203386 154016 2113 -4050 20985 289254 412307 237387
20757 237387 63732 43079 63735 3278 6103 20310 -58073 -100575 -104695 -72612 -39159 56486
20745 56486 35640 8955 114848 30977 -36628 82106 -6329 67042 163620 90237 -4939
20734 -4939 -161566 -146594 22427 290738 351060 326034 205536 29189 28250 32780 13419
20723 13419 -29354 98924 33981 -44084 -95267 -159992 -59650 -52987 -106774 -102665 -128111 -128661
20711 -128661 -75834 -17369 -31645 -102177 -30093 -153831 -90753 -53597 -122396 -312751 -299322
20700 -299322 -247888 -80001 -6792 -70245 -48663 9179 96592 -208318 -422996 -348046 -119572
20689 -119572 -127501 -100896 53700 16725 -23439 121024 4834 -28856 -22284 -72756 -27829
20678 -27829 101836 161565 98029 -23178 -95299 43602 24361 -50696 -136280 -160372 -131837
20667 -131837 -79722 -61994 5340 -74908 -148133 -278594 -266026 -108673 -138161 -190741 -203908
20656 -203908 4920 -14056 -127659 -146613 -99395 -98059 -81888 -39709 -162624 -132861 -203761
20645 -203761 -297701 -232698 -83954 123312 46848 -77613 -105370 -18693 49407 77010 -84623
20634 -84623 -84314 10153 77799 -48573 -117955 -135268 -105193 84428 -78267 -181220 -268003
20623 -268003 -232024 -184514 59248 252631 337440 272938 270163 176559 210049 100019 78957
20612 78957 124973 195574 154481 54210 -54035 21074 145793 41796 51571 142945 46039
20601 46039 -128623 -183378 -85046 -145103 -269765 -288048 -237871 -45875 -118786 -183583 -149219
20590 -149219 -180426 -22717 22296 -16825 -83043 -255727 -242991 -209065 -107090 18445 32234
20579 32234 -240 -49450 -8405 -69917 106194 282522 251975 114067 196571 134420 84559
20568 84559 36621 -52835 -90551 48783 11092 49823 303189 216040 246234 188824 37946
20557 37946 70163 206293 114638 -134662 -128000 -27344 36489 -118119 -43718 60821 -27432
20546 -27432 -76147 -3623 105371 180982 203186 145928 47064 -49566 132739 162011 148268
20535 148268 97673 105982 128786 113894 208233 238405 77036 29905 50362 65803 156427
20524 156427 92482 -8593 30614 39774 11906 -7028 -101502 -189871 -139661 -35427 -83652
20513 -83652 -159225 -95623 -89813 21121 60118 6915 -116305 -36643 -52208 -67867 34781
20502 34781 30879 -44475 -165128 -233378 -199822 -143178 -180861 -106329 67188 128615 -49999
20491 -49999 -130757 -210264 -36689 96833 112825 182901 188183 -16092 55013 118250 80037
20480 80037 -10798 -70719 48807 20277 -49095 32136 164948 299299 156673 162302 138013
20469 138013 168943 116644 -112898 3088 29821 -149574 -188368 -180616 -187696 -75456 -18744
20458 -18744 -64819 -93171 -588 -23402 51178 1351 -13662 13572 5266 -12681 -30879 -2951
20446 -2951 100397 69171 26380 -38140 69541 250295 71265 -51227 -174051 -55224
20436 -55224 -37652 -72037 -35444 -148992 -2629 73514 228209 202891 155467 119328 27320
20425 27320 -16315 63127 36913 65055 180742 206125 186701 -15615 -84969 -190952 -211489
20414 -211489 37123 260318 256624 34042 12494 127080 80393 72122 79276 123065 221514
20403 221514 270341 149406 -5531 -127895 -124567 -248780 -270775 -237659 -155114 -237998 -155109
20392 -155109 -181831 -112150 3927 -46704 -15768 70101 136365 204908 257837 238192 41028
20381 41028 -25424 -75083 -98593 -48007 -193047 -84268 49163 33361 88120 138120 89429
20370 89429 173433 182234 168929 192756 49623 -28901 -7640 853 14722 52174 171553 225399
20358 225399 194557 109177 104289 53936 116667 196499 228003 213381 183270 120084 200010 134323
20346 134323 94677 58536 -141630 -168691 29220 47841 89612 111700 127464 -76883 -98838
20335 -98838 -45906 -129158 -84160 150154 341640 246494 110973 77741 -34332 -215676 -217933
20324 -217933 7864 -71139 -231999 -450023 -248908 4170 -114398 -364932 -417736 -202903
20314 -202903 -65507 -30216 41266 -22493 -71370 -265 -158628 -233515 -212917 24480 90583
20303 90583 -7012 -18241 -115286 -71554 -32562 -80773 -133981 -108911 -115063 4741 47033 -46739
20291 -46739 -25935 96431 183453 -27921 2246 166022 188322 88586 109122 118315 162058
20280 162058 76406 -25573 -37224 -14363 53208 34077 40401 101281 212952 41056 -41169
20269 -41169 3204 108020 87944 57148 159468 191001 113132 12804 -124715 -135898 -178730
20258 -178730 -225119 -275502 -287323 -293306 -166851 -162412 -19221 125232 -63203 -118143 216590
20247 216590 110234 -100021 -124064 -86983 -46313 -12355 16929 181128 124622 86270 -132302
20236 -132302 -209281 -196015 -196757 -218313 -37057 42115 26682 37223 70942 114952 219304
20225 219304 205261 125042 45794 -30776 -91401 -37542 78550 398271 563009 248589 18063
20214 18063 134159 167320 149142 101718 45112 24631 2997 7897 54865 -19985 67853 56902
20202 56902 50204 41192 -31587 -25593 24967 -81443 -177244 -290055 -151811 -109138 -190326 -187919
20190 -187919 -3104 -8634 -6409 -29870 2321 20271 -66220 -242015 -248278 -174579 -93525 -84182
20178 -84182 -33379 45958 -54166 -196302 -356056 -284785 -161613 -39837 -53365 -43256 160456
20167 160456 95478 98192 2681 33386 -44182 -135126 -234323 -306432 -326598 -205972 -153094
20156 -153094 -94102 -22777 15255 55529 107635 97114 187670 233581 194750 128743 150363
20145 150363 153124 235437 121909 -102708 -178784 -162792 -59010 90783 73731 125882 32799
20134 32799 -56879 32479 95951 89306 24693 -11326 -49523 -62416 -44191 -42742 -79458 -122212
20122 -122212 -69802 -35804 33769 -89765 -92976 -113442 -122021 -187547 -307876 -242014 -146841
20111 -146841 -67407 -125341 -87152 73380 -76331 -343876 -243898 -26002 126333 12389
20101 12389 79141 92192 67904 -1170 18985 29436 -108948 -133216 -211534 -60476 177117
20090 177117 265404 301480 375258 383662 300315 106781 77866 -26172 -85888 -134656 -314591
20079 -314591 -269502 -126550 -110661 -72435 -145406 -282847 -208975 -69055 -48743 -53883 -14074
20068 -14074 47085 90474 63094 117900 199151 253870 122549 12188 78220 84486 -23098
20057 -23098 -73598 73035 40383 -98729 -94923 -14633 -15709 157519 349300 95419 -44669
20046 -44669 -119564 -213996 -100348 60950 114573 -38623 -101277 -23515 129239 103914 11909
20035 11909 73876 -47573 -131986 76595 35996 -85475 10855 101280 170130 -18379 788
20024 788 -30996 -75613 -72439 -52664 -734 125850 200123 68787 1796 34639 54656 95759
20012 95759 51476 117681 108784 141939 220412 171718 68962 57890 201841 228621 105183
20001 105183 -14613 43344 -21326 -111110 -112035 -134093 -263470 -240092 -102928 -51022 -79685
19990 -79685 -52922 45232 62338 -149474 -272432 -133159 -110102 -126882 -86603 -119664 -45797
19979 -45797 3801 357 -15860 -23231 -70190 48712 149829 55703 -81470 -20577 -31270
19968 -31270 71815 207225 126355 48197 15044 -45950 -39410 -170414 -328073 -261027 -56981
19957 -56981 -39416 -28532 108942 233580 324173 153534 116735 94045 -4865 15920 124577
19946 124577 281826 255586 213777 283006 202984 184504 171015 75745 11057 -88970 -79808
19935 -79808 -55912 -77118 141397 304463 233119 277577 141569 49877 -48935 31424 102230
19924 102230 79780 72800 71550 59520 -1347 -222629 -182582 -146949 -226118 -9521 50305
19913 50305 92880 176662 111924 60106 47202 -42590 -13679 -115384 -123734 -209232 -105210
19902 -105210 -164085 -200710 -216739 -152638 -16739 102135 167671 140079 130033 292367 181419
19891 181419 217809 94509 105139 72613 41321 60396 16569 -17316 -159266 -191447 -206667
19880 -206667 -99462 -59672 -167672 -109516 -67054 -42444 5845 2224 3330 2735 -42368 -87921
19868 -87921 130857 151602 223763 258390 87020 -59184 28410 52300 220313 259405 335110
19857 335110 278063 239220 218945 69514 15383 42807 228446 164344 -52331 -165312 -100691
19846 -100691 -33494 196497 212264 86474 128795 141562 -31500 -193095 -185370 -51318 92517
19835 92517 127127 70541 -85458 -266432 -152157 -49976 36367 202548 309103 201785
19825 201785 182619 95416 18492 -7083 -36711 95715 47148 -19954 -58890 -45219 -92885
19814 -92885 -77731 27242 -955 1009 152064 99171 -45966 -195627 -335849 -365882 -354454
19803 -354454 -203067 -71001 532 -94753 -83929 -11522 -142037 -40140 264341 239094
19793 239094 50641 105778 167825 135345 185088 212123 255211 236195 138516 76707 104883
19782 104883 209694 175546 285246 338074 264355 224359 168835 139136 97142 190656 146560
19771 146560 -86765 -108050 -86812 -21528 22616 116049 217782 257133 154848 39628 -42131
19760 -42131 -17665 -8933 13232 86217 -54950 -110406 -182634 -112704 70546 199701 153229
19749 153229 46232 8748 7191 85904 147610 68166 25447 51643 26847 -38390 49874
19738 49874 138709 -42591 7437 -101913 -14124 -132915 -166579 11444 -73362 6094 32038
19727 32038 94991 -33893 -48789 -143301 -78280 -28300 -106859 -40020 -106914 -52698 -36341
19716 -36341 -17646 -68943 -161207 -93128 -52492 -68190 -111942 -16961 -68190 -170995 -206697
19705 -206697 -157152 -87896 -102529 -88234 -49746 -123153 -109183 -149815 -111015 -80366 62773
19694 62773 77410 141077 187171 22003 16851 36017 15958 -43769 -48937 43802 121288 35656
19682 35656 -126903 -47239 -67067 -63870 69452 11606 -166948 -131941 -90555 -53586 -190214
19671 -190214 -208319 -193219 -51110 65689 -34448 -142496 -163080 35156 -53433 -102092
19661 -102092 -144733 -165212 -172733 -108824 30244 229854 229148 127065 257735 344555 267827
19650 267827 131459 -20373 -95618 -152678 -65370 13559 38595 116982 -125212 -259075 -156376
19639 -156376 -305194 -439337 -337272 -142519 -90180 -85981 -173819 -167952 -33962 -42485 31810
19628 31810 10130 3009 177471 168354 115417 118975 172561 208645 160320 134026 90501 49412
19616 49412 29021 63669 167725 196382 251196 241119 138642 19004 -106099 -167843 -52859
19605 -52859 47243 54889 143156 88887 30808 9714 70546 96644 -78118 -85250 -113130 -116004
19593 -116004 -86529 -30046 43900 7914 8248 -12006 -22306 127268 115700 -52770 -153938
19582 -153938 -88270 -45739 89395 183159 106888 150027 67500 32210 10734 -12951 -18926
19571 -18926 132670 229884 304411 300195 286933 378153 311701 138221 209975 298574 207153
19560 207153 88172 -64805 -63722 -89063 95573 39738 -134117 -34707 60496 120024 172425
19549 172425 105932 -154542 -118596 -77007 -41665 225613 331644 162563 250619 219760 109484
19538 109484 71912 99195 92838 -15857 5768 39047 -24251 62505 -53911 -203508 -221313
19527 -221313 -48399 131873 268983 376071 306370 101834 -130688 -69560 -52258 -48304
19517 -48304 -119625 -172140 -153032 -59668 -70008 -106512 -42660 -167515 -157056 71427 76884
19506 76884 163436 257834 227823 105065 49251 -20259 -16347 37853 90829 29935 107397 153095
19494 153095 63926 -18901 -74874 145528 153325 37209 60275 187768 84339 21584 94268
19483 94268 -40029 -121934 -67404 38132 96648 272932 398001 222098 220568 152337 85876
19472 85876 90737 172621 252688 137064 -4864 111536 137515 4170 41562 155233 290254
19461 290254 220485 124792 59798 29073 -35439 -17025 74050 134418 170031 154770 -11967
19450 -11967 -53719 106092 48230 -53180 -8903 -24475 -155113 -160584 47169 157299 200035
19439 200035 216302 55148 47716 122070 159237 227841 235504 350541 242364 103018 78932
19428 78932 115288 12887 -64529 -37417 -59954 -122616 -124463 136967 267598 189077 173893
19417 173893 223574 200842 202760 218401 264146 160062 138792 -20306 -168070 -92537 -27621
19406 -27621 -17376 88779 38063 32511 -52105 -133959 -115843 160875 140584 168349 116986
19395 116986 95063 153962 187567 280725 202574 -8004 -69444 -37645 -25451 -39294 -19741
19384 -19741 30247 89928 60294 64323 -22673 -133208 -75275 -51218 -19469 159036 229541
19373 229541 216230 302234 218885 68712 1885 40438 102456 129386 50729 123710 128280
19362 128280 1541 59963 242643 307739 216554 186325 48427 -83763 -87557 96677 222131
19351 222131 82511 100616 210237 226259 249129 321014 263612 170940 130388 119679 78290
19340 78290 72609 -45162 -10634 189799 183857 -60500 -36962 103067 37970 136605 144202
19329 144202 69442 117332 103014 110869 101233 369113 380328 239548 125827 136721 242693
19318 242693 288762 203285 162597 135471 99785 36431 223828 219073 181332 177406 285110
19307 285110 307038 371077 389959 214333 24601 -1782 976 -51504 -129662 -207953 -58003
19296 -58003 120669 61777 88998 156998 369700 309219 100492 42377 -80323 -57801 29349
19285 29349 122493 -38666 -151507 -70525 -149046 86545 44430 -27099 -26909 -150265 -121692
19274 -121692 -25431 -14215 32937 94524 91656 136102 133880 63688 34384 109456 57261 207463
19262 207463 223486 363616 402931 354640 385462 432169 241648 163846 99442 -104335 -135716
19251 -135716 -262224 -252364 -54653 114691 62935 68268 105291 206129 198151 184062 167193
19240 167193 104812 89019 263673 261617 193052 422408 611197 565140 370076 357247 277647
19229 277647 138859 78055 35406 108577 254482 331170 369309 313948 267687 198901 52972
19218 52972 117508 137296 26368 50887 114712 38394 86101 -40698 -119547 -104190 -37737
19207 -37737 58445 23134 52428 86926 150708 66449 113459 136692 92251 41739 108120 26538
19195 26538 145288 152633 34543 -15073 46103 277424 348999 155036 213158 177362 30041
19184 30041 37482 232775 250919 275714 312136 332131 462723 449910 535132 710856 482750
19173 482750 261823 385678 499915 521147 488269 551542 648217 702443 718947 742900 651583
19162 651583 696568 741735 836377 771562 740165 584894 633848 628277 665933 756684 792657
19151 792657 811798 712503 521683 468490 548656 495919 473001 671818 565900 355273 369974
19140 369974 362893 213608 173797 89773 158329 111787 120951 45729 9754 161106 39051
19129 39051 52441 121598 41712 54005 128262 152711 240785 247165 118528 146127 138309 102123
19117 102123 96582 28983 -12996 17555 146533 270427 207572 12618 -43258 27034 109725
19106 109725 23984 30190 -11112 193747 260809 191067 187996 118485 106861 -127778 -180376
19095 -180376 -157355 -159745 -342 3820 71299 71771 123049 211569 251785 155188 22603 -19564
19083 -19564 149687 313276 482342 627044 520861 451946 490285 535686 388649 379581 394926
19072 394926 346217 471625 674569 759409 692260 660120 582057 319334 248661 378864 380696
19061 380696 419972 326990 281252 221021 172073 134266 165266 120593 127514 151233 190577 405017
19049 405017 489323 412854 479443 531714 457076 345698 501133 522322 432139 405298 416602
19038 416602 551532 617409 639214 734089 877571 855114 816123 831782 831736 855817 924918 1043733
19026 1043733 1000097 1146235 1171258 1098513 1093949 943238 989882 1238222 1370812 1446473 1281428
19015 1281428 948284 942963 887012 996643 946025 974720 1032320 1004085 890958 708707 412336
19004 412336 439408 525393 594191 442246 328565 275206 136780 149717 279511 355399 414476
18993 414476 581010 562406 409011 315192 290338 252425 214351 168598 138956 236810 247956
18982 247956 334598 465186 612804 509646 407529 297886 162320 151012 324234 437894
18972 437894 454815 412951 340054 381276 237863 157878 374004 516146 398598 217789
18962 217789 246942 327183 212798 248021 278605 295335 215732 177629 170609 267929 364034
18951 364034 135667 74568 171856 100103 26559 41512 268670 507102 310692 177823
18941 177823 293624 475043 461987 487183 385068 427947 467732 538642 633640 686139 675863
18930 675863 585872 492413 450371 383330 363827 492991 594458 593397 435113 433977 657090
18919 657090 733346 791369 776243 774493 774837 811887 930965 946776 959418 851434 725251
18908 725251 753858 808089 848918 1005096 935425 690596 613115 776536 812187 857665 678771
18897 678771 488687 495087 511439 616375 384973 358331 550210 644275 803796 877495 808483
18886 808483 761138 952286 1309171 1658330 1827869 1706389 1502126 1149619 1024010 1009203
18876 1009203 1115192 1085007 1015859 1013582 807133 702715 570433 526137 337085 295653
18866 295653 354949 365512 531370 794280 822137 762584 694231 643868 707777 726078 818184
18855 818184 877854 959956 1124685 1149832 1170544 1226789 1059192 1070506 1063831 1020281 948263
18844 948263 983130 892486 929604 998364 815580 937622 1030541 1054243 845846 913421 1081198
18833 1081198 1227545 1213544 1018552 1026400 1005218 1000318 945772 786821 601003 523960 471773
18822 471773 510955 658665 648618 639527 503707 427986 560164 601568 592144 482035 316755
18811 316755 334850 651874 735727 644603 702377 661557 626986 762786 735860 776253 752514
18800 752514 687412 761362 728040 655475 493363 244432 284050 313013 385073 398578 520726
18789 520726 534688 627203 725959 776337 955095 877752 796732 826726 837206 713628 803235
18778 803235 943658 1062940 939509 780771 848412 869878 836605 966911 1059128 1140279
18768 1140279 1400548 1680978 1772578 1790543 1966158 1974948 1718348 1470252 1310801 1204976
18758 1204976 1053423 983798 964208 976850 1098888 1103441 796655 782063 1004979 1227958
18748 1227958 1174229 1239526 1394736 1424904 1536391 1435194 1395099 1330239 1324224 1358574 1387579
18737 1387579 1449086 1486971 1572516 1515557 1687439 1902007 1793611 1578470 1672427 1618841
18727 1618841 1638707 1804866 1985334 2130057 2350984 2265741 2215514 2257345 2386977 2234506
18717 2234506 2483910 2669910 2733723 2841003 3137969 3449499 3713153 3727235 3825753 4185033
18707 4185033 4516684 4763383 5199648 5768651 6477108 7091467 7871161 8527517 9499108
18698 9499108 10445804 11415251 12848998 14496988 16394760 18802406 21815434 25320637
18690 25320637 29566703 34304542 39462491 45508230 51663489 57414535 62976422 68806765
18682 68806765 74266471 78327371 81938666 86606353 91993949 96883638 101945080 108603763
18674 108603763 115289227 120415560 124950926 128879623 129926749 127308078 123766397 120549303
18666 120549303 115926268 109717441 104455154 100957843 97631458 94389533 91695182 88433545
18658 88433545 82970969 77153930 71866674 65672707 58142856 50765816 44939602 40219321
18650 40219321 35808589 31991644 29498248 27964564 26540657 25515005 24597433 23644590
18642 23644590 22550744 21521945 20641144 19876425 19136673 18393266 18073517 17761988 17475782
18633 17475782 17012101 16531967 15908457 15045925 14323281 13718334 13293210 12832751 12261844
18624 12261844 11504104 10490718 9537818 8822547 8324406 7714477 7215801 6975467 6728617
18615 6728617 6532298 6525990 6438680 6172325 6129892 6241138 6114629 5853118 5735489 5724262
18605 5724262 5907334 5913620 5798043 5867326 6071963 6367424 6791155 7177092 7516912 7936831
18595 7936831 8381584 9079765 9852341 10811198 11875750 13370748 15159064 17592030 20702177
18586 20702177 24409697 28591719 32929254 36992104 40202021 42555957 44189298 45128889
18578 45128889 45739383 46877677 49040431 51818677 54641729 56932120 58284311 57946900
18570 57946900 55650957 52267338 48634488 45022814 42097028 40209319 39114741 38365681
18562 38365681 37543964 36379000 34613700 32047883 28516387 25214255 22285949 19968741
18554 19968741 18394312 17482941 16841713 16593365 16554255 16819218 17186078 17583781 18140520
18545 18140520 19215000 20330562 21643171 23377546 25849657 29282987 33708696 38958701
18537 38958701 44834484 51242637 57343328 62160777 65628139 67991263 69168846 69623609
18529 69623609 71062139 74378526 78652799 82887835 86784118 89657171 90234836 87600500
18521 87600500 83093235 78215463 72782633 67325834 63525429 61468887 60159856 58619704
18513 58619704 56443833 53618705 49285753 43681802 37870256 32629201 27925582 24189429
18505 24189429 21560552 19728865 18536256 17708390 16812876 16138328 15675516 15155484 14670529
18496 14670529 14111543 13481298 13143763 12751748 12568321 12352638 11943863 11617267 11533000
18487 11533000 11607217 11633615 11666593 11574514 11579887 11526239 11461476 11370652 11576861 11729184 12058270
18476 12058270 12611385 13116150 13940979 14866813 16030128 17718166 19750291 22310818 25299227
18467 25299227 29030771 34404792 42106403 51915910 62826543 71337753 76608612 78455154
18459 78455154 75281842 67140945 58585164 54955752 56408362 61948866 71869759 86009741
18451 86009741 102247099 117197150 130361696 140572889 142602055 134636515 122743796
18444 122743796 110856731 96771189 81477854 70433520 65793532 66352448 71698568
18437 71698568 81631793 94456844 105430221 111048345 111305935 104326292 88212105 67557970
18429 67557970 51020317 40928838 35017948 31527478 29216194 27774991 26572016 25325883
18421 25325883 24245960 23293085 22597720 21956899 21386784 21184347 21110708 21190964 21428278
18412 21428278 21704604 21675537 21536688 21425256 21321241 21020815 20727116 20122637 19458620
18403 19458620 18747702 18150090 17645546 17117314 16955031 16784263 16276683 15860378 15515998
18394 15515998 15224725 15191438 15063248 15178570 15825679 16479753 17576719 19248039 21218738
18385 21218738 23843480 27381607 32142564 38293615 45195552 52429086 59340379 65024787
18377 65024787 68322638 68762397 66339223 61817574 56192742 49774918 43346929 37899828
18369 37899828 33737174 30758258 28504837 27364551 27135665 27747282 29457810 32090544
18361 32090544 35692626 39452157 42172712 44383697 45643849 45340219 43917567 43057178
18353 43057178 43905592 45700206 48189072 51231912 55423483 60781289 67955910 77331663
18345 77331663 89948860 106618396 129081577 159563782 199677840 245757336 289696218
18338 289696218 331140925 362286031 369600763 355675662 334117393 311146086 286107151
18331 286107151 272869138 276442240 289266658 301019718 303319062 298579324 286122693
18324 286122693 264471269 237748865 219604134 209839990 201602852 192095875 175327001
18317 175327001 148223076 117273728 95424391 82320296 74150460 68984837 65373707
18310 65373707 62996101 61452037 60060678 58946321 58339499 57790190 57131571 56446062 55140055
18301 55140055 53177740 50313336 47432741 45257308 43783163 42921362 42655296 42967037
18293 42967037 43689959 44829366 46649872 49325673 52445637 55928363 60214458 64948993
18285 64948993 69575388 74152835 79023281 83107018 84808891 83333208 78802325 71971664
18277 71971664 63543688 54276267 45023003 37168894 30926168 26552916 23413400 21186785
18269 21186785 19538577 18227864 17195313 16412621 15628301 15040655 14662559 14435392 14332764
18260 14332764 14245241 14045778 13952688 13800823 13520982 13155959 12805430 12154640 11382407 10860368
18250 10860368 10368129 10036326 9714653 9344781 9006878 8727025 8477014 8321328 8189983
18241 8189983 7821813 7420287 7124313 7146518 7102919 6784789 6690040 6466502 6181816 5999027
18231 5999027 5841548 5668170 5758499 5793568 5869600 5874984 5773003 5873478 5994429 6089291
18221 6089291 6446576 6834281 7079119 7299996 7801933 8169880 8486423 9089404 9728311
18212 9728311 10448306 11366809 12160000 13036400 14160651 15479794 17029974 19105499 21814317
18203 21814317 25294103 29812778 34759232 39987429 45671446 51117763 55483835 59337898
18195 59337898 63396925 67323882 70590590 73279549 77081650 81355820 84755680 87289262
18187 87289262 89211671 89859636 88631342 86074701 82656989 78502776 74009367 70187335
18179 70187335 67177503 63865958 60120383 56988196 53848463 49237814 43877237 39108559
18171 39108559 35120166 31405061 27934141 25235773 23411432 22196194 21464461 20810114
18163 20810114 20402998 20205435 20289931 20380229 20611932 21142283 21873530 23065198 24786559
18154 24786559 26980782 29446918 32225014 35172185 37828534 39972507 41882190 43892963
18146 43892963 45615156 46702930 47900257 49795110 51833584 53565293 54765615 55694182
18138 55694182 55635843 54656753 53117879 51281654 48882824 46372492 44282715 42569564
18130 42569564 40860101 39169430 37808859 36683753 34728317 32536241 31030762 30119949
18122 30119949 29521564 29102784 29426642 30639983 32692679 35609109 39754752 45357126
18114 45357126 53118258 64107695 79800730 102055135 132833458 169769003 198065987
18107 198065987 212173069 215157027 198523407 157266805 105960826 72023290 53502072
18100 53502072 42645554 35445468 30518898 26990137 24333172 22295138 20539546 19209196
18092 19209196 18116182 17290816 16512874 15764964 15393204 15223091 14873416 14642970 14390402
18083 14390402 14323370 14383216 14573026 14346470 13539263 12784213 12010074 11245211 10627011 9993577
18073 9993577 9516000 8985398 8343957 7825049 7372489 7047398 6763920 6266660 5887629
18064 5887629 5707878 5603870 5325680 5183137 4931361 4620478 4437630 4167998 4046653
18055 4046653 3938748 3787437 3512317 3330963 3218619 3046662 2870113 2640336 2427316
18046 2427316 2097055 1797169 1962111 2131651 2171916 2101470 1882790 1650208 1535677 1529796
18036 1529796 1585720 1663936 1721748 1630829 1515319 1415785 1411388 1292003 1268437 1252817 1429810
18025 1429810 1591613 1572375 1550707 1479590 1662346 1652117 1497919 1419808 1202567 1216336
18015 1216336 1429997 1576478 1767529 1759720 1616258 1542506 1453443 1373864 1318973 1323328 1221288
18004 1221288 1087970 885363 797680 812460 943374 1205057 1139753 1081021 1024823 925237
17994 925237 937238 883397 874446 846435 791550 884544 905961 1026490 898420 560819 496811
17983 496811 645089 614075 722076 789321 958993 1044193 723246 608206 663237 671890 612442
17972 612442 426852 422264 328894 319475 358724 421550 442022 342939 354064 333593 395984 523534
17960 523534 653075 609118 477098 443177 422585 481033 565470 635825 661053 623232 650504
17949 650504 562683 736861 763213 664303 651197 700195 673262 657615 432419 458031 511979
17938 511979 292653 310993 514901 467926 351236 330479 433925 567241 553173 408675
17928 408675 312174 265616 113640 248184 327066 405185 397100 254287 232429 220487 181511
17917 181511 228199 178815 218732 347846 151797 87731 129835 172825 296143 246173 283697
17906 283697 349224 359972 347777 433679 487850 365284 275639 260922 310383 466191 358539
17895 358539 146976 101336 5184 82054 181423 71516 81945 134808 221323 257823 244398
17884 244398 272778 453105 537395 699191 737669 802955 782257 636453 647945 713230 770670
17873 770670 871369 859290 785656 810585 1061218 1242747 1062078 1140478 1440682 1663583
17863 1663583 1707350 1675379 1694526 1687100 1362295 921627 704888 594690 598210 799496 776689
17852 776689 638156 688053 819651 948168 1001404 816154 563461 382401 270934 401105
17842 401105 437051 458776 671033 740419 791389 720855 692919 677207 724373 785030 885055
17831 885055 925490 1032919 1312879 1377487 1302072 1203375 1069083 927311 909796 1079948
17821 1079948 1269372 1225094 1248952 1268013 1091261 963593 796364 728785 660959 463978
17811 463978 542505 402201 339769 405739 427138 444659 585129 565728 531961 612110 717264
17800 717264 712427 651908 563671 465980 426140 424662 373787 231919 273217 388565 543502
17789 543502 564506 526190 520807 585309 607513 586780 376695 454728 544783 477057 295714
17778 295714 274816 323621 316996 260063 275697 278398 348952 351734 224220 314643 392512 513911
17766 513911 617397 453777 330117 141660 89132 274469 494050 574465 526480 583529
17756 583529 518876 459542 438675 468259 476852 410071 331019 285239 283316 134611 3055
17745 3055 137901 349955 543760 631823 459915 406807 463927 458834 577303 732921 799871
17734 799871 711687 675557 558900 464956 479694 532226 632300 561094 378811 432511 559311
17723 559311 499788 518627 445102 480976 437137 315954 276714 269413 257630 194552 413579
17712 413579 544261 676709 558171 340023 190587 307719 415122 376687 257492 257364
17702 257364 312530 388160 515508 535814 467253 307952 169457 350302 408623 448632 545797
17691 545797 730296 709974 786183 609280 409709 326476 237246 227828 326698 308284 412722
17680 412722 311004 183143 137180 244253 272809 385165 428626 231327 133122 84900
17670 84900 145282 196045 226153 128702 79987 130046 61937 52448 82556 22749 12809 149343
17658 149343 242658 450417 446860 305201 290340 297557 417698 357861 93401 60991 166006
17647 166006 269388 182268 133860 403322 626744 568038 419833 439824 449877 442809 407573
17636 407573 421790 407450 353371 575859 688520 538201 431814 301362 129484 265260
17626 265260 401704 393783 288484 256467 151542 55379 51300 -95988 -38637 75910 68988
17615 68988 69642 191244 83563 -135089 -138151 84900 77910 28212 -184660 -271013 -136233
17604 -136233 -50323 3433 -5158 15819 77855 159233 1184 -56387 -168301 -277220 -68012
17593 -68012 -1557 2063 -124118 -289376 -334525 -328335 -391137 -381648 -290784 -118049 -19775 31914
17581 31914 -40858 -302976 -193067 9704 71438 58506 26953 -150147 -173072 -151946 -158090
17570 -158090 -120370 -89521 -67586 -101554 -180151 -149443 -67242 -55141 -188518 -192785 -82270
17559 -82270 -189733 -172864 -102478 -43831 74394 6593 -107994 -142434 -261005 -159177 44408
17548 44408 75257 -83518 -119156 -91926 -79006 -145403 -3146 76784 154046 109485 135771
17537 135771 169834 280624 287817 31549 -122837 -82416 -45632 -144440 -273242 -268959 -153175
17526 -153175 -172599 -9024 61964 7949 -49153 19772 139435 95766 120718 171471 22942
17515 22942 -202908 -237025 -39317 -52345 -56038 -110433 -176457 -148615 52040 147450 183480
17504 183480 207345 98344 178494 122590 -79848 -112704 141423 63483 9149 -42180 -47318
17493 -47318 -41326 -132799 -263618 -387276 -293631 -155918 47457 136486 138912 236354 291277
17482 291277 253965 68307 -115434 -230365 -207784 -95429 -108756 -75565 -163650 -172085 -98749
17471 -98749 -30476 90172 105985 -14371 -42881 56391 189484 295287 163626 134986 109512
17460 109512 32341 30004 -38975 -104639 5777 9768 -83521 -19872 -135490 -200121 -165536
17449 -165536 -193031 -135347 33250 111413 139222 322951 580797 905926 1084178 1127256
17439 1127256 1229845 998384 468364 167002 19545 82449 8335 -143050 -217125 -237739
17429 -237739 -342751 -278972 -112827 -13079 26595 -6272 -54015 -102471 -27353 48439 81606
17418 81606 118938 87545 159928 247921 369573 265935 188750 38523 -151360 -332173 -416710
17407 -416710 -198517 -96631 6647 42679 -12749 -4493 85888 -28371 -197310 -187405 -8239
17396 -8239 169128 129257 -22939 -14112 -25951 -44660 -151160 -90662 38897 -41435 -43644
17385 -43644 -23233 35080 -13602 3775 28070 66481 -1313 -76459 7024 156314 -24661
17374 -24661 -157149 -117227 97084 166382 227073 243892 120783 -6805 -88384 -221579 -275680
17363 -275680 -181354 -63468 -61908 -104252 -206428 -31399 -129954 -281652 -318528 -490858 -406802
17352 -406802 -298491 -239182 -194165 -256314 -312709 -391008 -388699 -223269 50038 -28712 -179879
17341 -179879 -166861 -124540 -149974 -91079 -36070 -95989 -112473 -17407 29986 -125902 -225988
17330 -225988 -117363 -9667 156741 246833 110545 -44497 -183562 -222059 -201968 -211251
17320 -211251 -79390 79368 78189 200502 206412 125898 150378 30820 -44368 29028 -7844
17309 -7844 -86308 -111846 -140893 -61768 -158513 -253751 -120662 -210972 -486465 -548260 -321149
17298 -321149 -225235 -262034 -129646 -158957 -66143 -264832 -342690 -193358 -188927 -94536 26799
17287 26799 144457 71135 96209 140196 56512 82367 246852 212822 24645 -59496 -6231
17276 -6231 -56025 -193771 -164823 -201204 -134280 -248018 -98467 -106962 -184391 -154135 -108472
17265 -108472 36367 119275 97620 5186 -57039 -5783 21420 84280 121691 43348 32689
17254 32689 90789 -28339 -1659 -83725 -275086 -338521 -317631 -296623 -267103 -280893 -223955
17243 -223955 -29414 -11120 -132336 -101600 -122097 -173732 -272673 -295860 -264208 -409596 -509787
17232 -509787 -276600 -68436 -74653 -105702 -107427 -160293 -187211 -187710 -209279 -277471 -328334 -222741
17220 -222741 -230363 -353783 -392981 -360166 -211168 -121309 -130551 -60898 73373 277198 399484
17209 399484 259843 80805 -152251 -236206 -69010 4912 -101095 -80830 52761 -91162
17199 -91162 -164517 -79080 -10978 86762 -17437 -109165 -129187 -118630 -69401 62077 269665
17188 269665 234121 230461 -19416 -217377 49620 174112 214023 43362 -34867 -37329 6503
17177 6503 -38553 2557 27193 83951 209599 200288 71530 -25933 -134634 -264057 -130127
17166 -130127 -60036 86783 -3468 -34012 -10385 -161144 -325217 -436303 -316816 -280102
17156 -280102 -181584 -8566 -57620 -147942 -281191 -210338 -81544 -71482 -82642 -89008 30662
17145 30662 122742 -19718 121 -62607 146523 237086 175198 171022 192262 23030 -24393
17134 -24393 -21883 -20021 -113554 -227498 -22277 10060 -16576 -15354 -171425 -202713 -191244 -161840
17122 -161840 -248777 -201823 -203008 -100578 -155514 -142658 -155967 -294694 -299158 -302343 -152348
17111 -152348 -83417 -80022 -188067 -289142 -432559 -335581 -96600 -48077 10582 65451 -55404
17100 -55404 -145878 33623 28940 -162061 -262099 -265535 -191294 -254087 -285121 -195589 401
17089 401 11006 -47196 -121222 -178004 -33716 -80199 -128952 -187896 -323411 -331476 -108389 21972
17077 21972 -59066 -212239 -228498 -152931 -130407 -158494 -215459 -134347 -80877 -114881 -79427
17066 -79427 -117343 -66341 217857 280760 172786 117209 45940 105997 -4902 -169589 -195895
17055 -195895 -109089 46870 -57209 -35935 126141 143841 -51350 -274368 -261565 -249916
17045 -249916 -174380 68998 144078 98515 105365 50824 141938 159639 121798 72068 -174435
17034 -174435 -322846 -297595 -212062 -87242 35712 -113759 -55156 17481 45334 76205 35455
17023 35455 88884 104117 -36439 -129090 -22385 -30760 -85560 -3071 -11527 -186225 -215746
17012 -215746 -288126 -306375 -59412 52082 -119106 -50877 86934 -19263 -141131 -21950
17002 -21950 -39799 -70259 -137997 -136861 -92885 -112581 -67925 -183398 -20973 34569 -87579
16991 -87579 9237 168049 88649 -72798 -238201 -240058 -78486 123272 49500 99652 244868
16980 244868 114899 24556 42535 71339 88205 12673 -109705 -21881 60343 49615 -103441
16969 -103441 -102517 -4936 36122 70825 45021 56907 64799 61275 73582 52940 12177 57508
16957 57508 88886 -73919 -188695 -129875 58894 -55481 -249115 -233190 -160402 -119095 -42001
16946 -42001 13128 -82868 -213858 -261926 -173450 -75964 -107591 -123485 -26600 35156 39918 84261
16934 84261 99708 -45516 -40604 86251 85081 -15129 -73703 117300 82226 -89810 -71484
16923 -71484 15876 -48534 -209001 -193296 -193211 -97019 84379 259690 263462 58507 -46518
16912 -46518 65448 116959 53607 -27100 -113912 -149442 -122766 -192827 -236484 -152862 -23649
16901 -23649 -176999 -281179 -175017 -89717 5160 13405 -27980 -177945 -299875 -251524 -230107
16890 -230107 -247402 -213720 -93100 -135591 -81804 32185 62980 -107044 -65366 -25656 76965
16879 76965 30674 16751 -39352 -216050 -303638 -339437 -313599 -249786 -156602 -22648 45765
16868 45765 62520 -5518 -72984 -119825 -266316 -282839 -157318 -176545 -167588 -101452 -98089 -45126
16856 -45126 18224 -48796 -167335 -140819 -120839 -32544 151538 335951 339001 291064 261098
16845 261098 258292 267426 137815 -29357 -31435 225662 217636 38224 157770 166323 -80241
16834 -80241 -174315 -186093 -145710 -203852 -76915 -86028 -78955 -98401 -151505 -213938 -94022 -47399
16822 -47399 -187096 -150158 -96204 -114436 -43595 103131 240621 205375 96379 109530 124119
16811 124119 48747 -86508 -200725 -371355 -352133 -198355 11393 27924 101677 109279 14079
16800 14079 -244134 -330305 -171686 -181170 -165857 -166721 -224632 -241046 -65136 -64715 5505 207809
16788 207809 292551 147168 -38752 -32474 -43003 18718 -36495 7366 -182944 -243548 -159512
16777 -159512 -134302 -176894 9027 129837 148353 125797 216670 321796 328723 248709 73644
16766 73644 -14447 45173 150667 7511 -76827 -153676 -217458 -84804 -61240 96768 218503
16755 218503 75743 18669 38165 38763 54877 -79253 -146249 -99565 -65868 5348 24202
16744 24202 -126068 -66834 17117 65620 -26905 -93381 -187695 -27801 -8512 72968 12536
16733 12536 -23276 -6510 -187879 -129621 -45242 -22731 -69687 -21844 -56466 -134619 -183430
16722 -183430 -106208 -242528 -289462 -124453 28080 32837 235623 213187 135725 211381 299956
16711 299956 217777 155667 121572 215333 221930 62814 -61886 -113729 -134281 -19515 75729
16700 75729 90 -189510 -209376 -187761 -190399 -15642 85164 1757 18163 -19519 -299704
16689 -299704 -251090 -111608 -85589 -32517 35032 41298 -73085 -16775 52962 102401 39712
16678 39712 -39199 -4571 -102580 -129102 -122546 -255630 -261873 -324364 -315790 -155116 -26884 60707
16666 60707 125093 143858 323305 464875 431188 229923 240154 109178 120372 219718 -49235
16655 -49235 -225543 -242297 -18652 67886 30946 22962 95183 165920 119978 157950 101103
16644 101103 203606 223967 25045 -58035 -51798 -150027 -225660 -155446 -108529 -26920 -39544
16633 -39544 -66529 104803 130309 60559 84531 71830 50644 213043 203472 116975 -69873
16622 -69873 -125116 -59573 -91810 -157890 -17538 63882 31373 -69829 -150378 -46112 -68158
16611 -68158 -36041 -6106 37039 152134 171557 116787 155073 237330 172575 237440 223570
16600 223570 81168 44515 16393 48138 51670 117598 242677 310893 169768 -5293 -42079
16589 -42079 89021 194872 183857 265460 155744 -30236 -72487 -121927 -41361 137846 92250
16578 92250 -75723 -110339 -179061 -275455 -422532 -448611 -365375 -209545 -190688 -211293 -218952
16567 -218952 -153982 -161818 -154091 -133206 -114333 -77086 -73120 -93132 -42846 90814 186617 112250
16555 112250 -15175 -30200 54534 75525 56396 186229 99252 63684 175271 309230 312465
16544 312465 316873 308799 195332 54755 -26363 -38248 -56208 62511 41119 60668 -8470
16533 -8470 -147417 -322271 -289364 -81674 24696 52984 46147 -67814 -276966 -314412 -88878
16522 -88878 -58552 -252385 -278413 -199084 -153713 -51469 -50383 12507 120339 159358 92450
16511 92450 77353 88820 47803 -158648 -144252 -279912 -292166 -97376 9244 -85440 -315132
16500 -315132 -93031 151265 137415 61831 -12667 -138490 -291252 -291416 -176269 18952 -75379
16489 -75379 -93279 -50253 20848 118984 153495 137440 13378 7780 -6043 -37475 -123297 -185266
16477 -185266 -107600 -62451 -87834 -126059 -2432 223247 264806 122323 1725 -55658 -17606
16466 -17606 87274 88156 -32318 -126195 -184963 11008 234838 42266 71900 115212 103614
16455 103614 202266 172141 43845 4680 69028 45078 -105238 -96696 46869 69791 20528
16444 20528 127065 154215 159210 62197 16286 -137822 -212516 -137280 -93785 -28870 -85735
16433 -85735 -111392 -145271 -86133 47142 50848 -50885 -216196 -230169 -230830 -181060 -177073 35968
16421 35968 99564 98478 61821 90305 137118 109885 106401 220970 202313 108575 71150 130073
16409 130073 34047 -136290 -253402 -58994 59802 184012 103888 -25557 -56380 -16371
16399 -16371 -26610 70763 54096 -54440 -181771 -175475 -189979 -135428 -69804 -90835 -4114
16388 -4114 -102419 -274346 -194403 -20172 153128 98141 140600 22932 -35216 -15983 39435
16377 39435 166390 62723 -75674 -173333 -168608 -64257 100865 120249 247625 311934 167448
16366 167448 129374 -16413 -27863 11082 16033 66249 -105513 -345080 -329686 -76640 -105718
16355 -105718 -139851 -12001 84731 159965 144170 68622 174336 247472 198898 71936 164755
16344 164755 48073 926 204943 137075 194269 265741 373593 123886 -142777 -144213 -184396
16333 -184396 -29527 -17639 -182509 -64496 21762 -120974 -187122 -36363 102863 58529
16323 58529 110135 28959 7034 28362 63479 104543 181238 268832 393223 295348 62521
16312 62521 109995 48212 71955 165437 123437 48277 99853 171325 104061 156866 -44022
16301 -44022 -169772 -101030 154386 47534 -88715 47121 -6414 -202751 -278938 -139600
16291 -139600 -83615 -66435 -75412 -186851 -170655 -136641 -106774 33407 80353 106032 288162
16280 288162 178709 -13329 -54141 -91809 -129374 -89455 -624 -46642 -295946 -138892 -42790
16269 -42790 -158661 -198250 -142852 -191673 -133879 38521 160221 188248 159807 212715 149649
16258 149649 7374 -149912 -99768 -79639 -140167 -113813 -150774 -194906 -194428 -142096 49461
16247 49461 155696 140288 61258 -29209 -53395 -148304 -136652 -15133 1342 73384 114961
16236 114961 181662 299789 328470 298693 171798 111014 30733 -144731 -281999 -205931 -202077
16225 -202077 -250044 -236833 -108260 -34831 -167991 -119066 -71761 66782 31572 -37623 -84798
16214 -84798 -133214 -158977 -44153 81521 -7478 -82094 8443 33306 -112156 -238868 -170896
16203 -170896 -127877 -17184 86559 83378 361417 542081 308736 115243 65587 -89124
16193 -89124 27938 72334 15435 -3033 -53327 -142031 -165477 -73338 -61154 -45193 20711
16182 20711 8032 -18092 -40293 -136010 -6787 14390 70281 -2085 -68558 -171221 -90031
16171 -90031 -239943 -467534 -311003 -80006 28946 -68553 -124223 -13635 -30347 -68367
16161 -68367 -22746 -27286 -110160 -270862 -196377 -201556 -316336 -341333 -215292 23490 79573
16150 79573 -157398 -164717 -39398 -52180 -37256 -68422 117781 331047 352704 295633 432132
16139 432132 280572 69911 113919 102953 -26790 -97978 -31984 -90062 -142801 -26577 118794
16128 118794 137299 164324 251401 211861 142805 88810 87387 -94643 -105455 156247 198359
16117 198359 -54377 -235709 -117388 -36620 -2550 -96536 -62608 23228 188944 41097
16107 41097 -20453 65515 6584 -39873 -153342 -192415 -2389 82143 173698 137558 145856
16096 145856 55680 -136637 -88982 -108794 -96085 52264 136274 77905 184027 180660 24682
16085 24682 58750 -57369 -292830 -324646 -376912 -260765 -181614 -59379 19224 -42752 -16915
16074 -16915 184551 184395 307054 426755 399608 253119 56460 -146425 -229138 -175199 -309538
16063 -309538 -474134 -314858 -151593 -69344 -49089 -32746 44070 183717 53669 68335
16053 68335 154229 131380 156008 32650 -22020 -146121 -129835 -7605 51541 7985 -80832
16042 -80832 -91978 -49305 87352 133045 140530 98280 192714 131278 46988 54120 44693 -14378
16030 -14378 -91246 -24330 -78136 -37453 -19265 -126748 2013 -32571 -9501 -31708 13309
16019 13309 163742 262658 141039 -102199 -92292 -21001 53798 201591 324183 225182 78319
16008 78319 55668 19602 -89975 -212344 -215282 -119020 -12576 203211 205163 207017 246826
15997 246826 165752 90584 180549 217845 179451 148201 46765 57690 83069 4073 -7586
15986 -7586 55401 -64876 -296344 -215638 -99800 83959 173610 214428 -73212 -208112 -85885
15975 -85885 -21443 -68644 -10566 -181801 -361070 -259351 -293161 -260582 -260436 -108373 -24705
15964 -24705 32135 305361 391258 296395 111573 71013 -23512 -82383 31878 -43516 -16526
15953 -16526 -58569 -125816 -168338 -37372 45649 -12281 55706 53475 54020 38931 5386 -127652
15941 -127652 -68799 -3936 -24750 -61407 -108468 -96463 -26944 -98942 -129214 -20660 38004
15930 38004 -7334 -15426 -235652 -277577 -351555 -443044 -415389 -171796 15820 -36216 -28939
15919 -28939 122548 162924 181511 102622 -7687 -4397 51408 16122 -181268 -187890 -12320
15908 -12320 158673 282154 179012 65664 -65791 -84626 -191510 -108874 -100543 -109621 -204692
15897 -204692 -164862 -69410 -3934 -119195 -102137 66447 52457 -124425 -244393 -125143
15887 -125143 -191148 -260035 -208247 -169438 -216986 -156643 -86237 4351 43193 -3133 83729
15876 83729 204826 325941 193056 105975 208666 59292 8306 94125 101531 -5237 61284
15865 61284 -60135 -197499 -176059 -41999 34657 61796 47532 77009 241419 270332 31083
15854 31083 -152787 -269144 -153509 -83531 -208266 -238058 -291993 -336165 -142517 -111476 -12132
15843 -12132 -100642 -164666 -27858 15615 -188112 -130870 -48197 -22578 -263631 -202701 -164690
15832 -164690 -90296 -40492 -42913 -56606 3852 24830 30363 66706 -130871 -145582 74489
15821 74489 211539 292476 251570 265487 366791 267917 109848 73987 129569 188323 83740
15810 83740 -210783 -210953 -128021 -299687 -279690 -92872 -93995 -70833 229 118990 119678 284348
15798 284348 225333 271365 242536 207408 133637 219649 293159 289797 239131 145292 106806 -15504
15786 -15504 -48913 -194176 -172196 -130186 -183605 -123516 -32035 70273 4947 -79675 -82494
15775 -82494 -126551 -34061 -66954 -89830 -49264 3650 55534 68377 -37762 -96515 -152160
15764 -152160 -44847 -70291 -163244 -245 184509 224842 112168 166521 200210 209593 121677
15753 121677 72413 -53457 -60252 -12972 70238 88727 163659 64443 52495 92666 274607
15742 274607 226986 -62150 19037 86157 6228 8578 133281 312469 431322 369134 239120
15731 239120 142229 19101 56380 -3217 -102426 -77606 129051 234403 119848 -131806
15721 -131806 -191610 76527 134226 65612 -16480 -8890 31945 34266 70917 163012 133691 5540
15709 5540 -72425 -118528 -64650 73336 62913 -111653 -158079 -69837 95662 325682 256916
15698 256916 144356 21280 -123587 -218195 -200488 -127230 47596 32489 -33676 -35814 135865
15687 135865 125389 15814 -121958 -105931 -117859 -102943 -128786 -251806 -227342 -103659 -182395
15676 -182395 -306108 -268776 -62926 -131591 -180347 11003 88082 53003 200168 170774 124473
15665 124473 187299 302904 268215 49424 99932 215523 249382 428387 285134 205168
15655 205168 233880 126763 47547 39769 -28072 -92933 -15922 -72428 -54795 -35368 -83261
15644 -83261 -163231 -45787 91485 101064 25913 -81342 -56485 -81978 76522 166092 83887
15633 83887 46939 554 -7470 -6721 10113 -192361 -205713 -160121 -157220 -261994 -179745 -61395
15621 -61395 -85996 -21801 13430 -80998 -179111 152234 225799 66123 43478 111265 180967
15610 180967 193205 87285 -13252 -45549 -81785 155889 368382 261504 142716 75845
15600 75845 129086 270891 259369 5171 43690 -56585 -21257 131482 147142 142586 133041
15589 133041 18653 -129725 -133227 7309 109764 86452 -45083 -77531 43816 -34633
15579 -34633 39353 89839 149806 179287 36388 -22215 19279 16138 -1898 -63327 -163780
15568 -163780 -127949 -134342 -104121 -71136 -80476 -145927 -41556 -13664 -43178 44138 114680 88543
15556 88543 119320 131028 290895 292619 177854 -12049 54314 207467 66574 -29673 -6670
15545 -6670 53395 -38139 -187787 -139852 -95233 27205 48070 74465 63251 -6085 -92816
15534 -92816 -58962 -9623 5657 5920 138753 53445 4016 130819 233809 237317 306774 186478
15522 186478 6324 -103062 -2268 -42641 15824 -596 -133576 -11500 63808 94790
15512 94790 66545 56786 -2849 -195026 -229563 -244490 -256460 -217020 -366373 -352195 -189741
15501 -189741 73432 54628 59157 124632 94894 26232 -29949 -27289 -109651 -220263 -173805
15490 -173805 -246394 -170523 -50075 -88629 -111331 -67156 -49249 -87156 139818 175729 171119
15479 171119 49512 -85697 -258122 -302995 -143703 -197388 -158877 -275015 -326198 -252483
15469 -252483 -313009 -245159 -42476 -63788 -257955 -96376 241346 331928 194439 60677
15459 60677 -25130 82664 51795 81352 76648 173265 45078 -33 40355 56085 31409
15448 31409 -56674 -63827 -49805 -215894 -150067 -186153 -200279 -118611 15087 6835 29115 99636
15436 99636 190624 249538 38185 -143376 -92777 -52122 -135984 -262724 -374745 -254115 106836
15425 106836 191194 116144 35320 -4399 65346 -58282 -78553 39140 38665 65415 128555
15414 128555 196933 -62614 -175042 61952 104315 -100777 -164132 -70237 113965 202208
15404 202208 184616 43848 -107987 -61769 28066 137673 149263 126787 152329 96343 81093
15393 81093 271341 454602 480145 391486 233827 215608 144956 139306 227053 237049 223777
15382 223777 192099 142525 -9751 -163751 -317311 -331209 -112808 -182996 -108636 81424
15372 81424 149626 300656 235060 296489 338778 330949 406988 218763 86600 98583 201918
15361 201918 227499 297113 319093 165520 74003 139739 268657 186898 5469 -171290 -148034
15350 -148034 -267077 -263593 -191816 -11444 -145246 -208956 -79552 -23830 -26045 36073 -84692
15339 -84692 -355431 -203467 -23361 94781 160632 202076 73109 -18596 42493 88255 145091
15328 145091 77043 86117 -22276 -98969 -158526 35428 47232 -192997 -234003 -73806 -71242
15317 -71242 -154768 -139213 -64561 -51958 -59403 -73543 -99012 -151708 -170484 -172942 -160190 -49173
15305 -49173 -30730 80082 245962 355490 253465 108472 67849 15063 -137940 -73470
15295 -73470 -30299 16327 -115407 -124338 -80275 -80076 2618 28927 97768 190107 81038 -128354
15283 -128354 -231683 -218155 -135838 -139402 -166475 -152621 -116033 -154871 -100726 2513 -17629
15272 -17629 -61692 -40383 -94028 -355079 -342608 -197200 -59112 70434 88847 34084 -55477
15261 -55477 112610 -17842 -79553 -171020 -320184 -355717 -254095 -177289 -105824 -62562 -89670
15250 -89670 53143 21672 -23556 -74122 -83416 -23981 29014 -4601 -53536 -48068 -124507 -121044
15238 -121044 -60031 -4864 82842 3617 -16299 -119626 -129909 49696 71180 -32450 -31551
15227 -31551 -69316 -187471 46032 266196 354535 387476 419786 257034 85287 -118866
15217 -118866 -186207 -28254 26866 -87765 -218915 -193137 -85580 12143 73791 -3648 -35650
15206 -35650 -56087 -47358 -133491 -183017 -166851 -22888 6294 105027 127421 22256 -179437
15195 -179437 -172847 -6566 102142 82583 114485 45848 125503 82309 129699 180780 191672
15184 191672 43586 -201558 -152828 91387 143765 -22625 -81159 -187070 -176228 -151701
15174 -151701 -24107 38345 82635 39538 -123026 -94583 -5499 148206 303958 324675 199207
15163 199207 117375 624 84913 190842 189472 164467 78600 -10370 81129 220946 342763
15152 342763 400576 325315 369087 348492 200061 218553 298461 360045 252665 186821 111572
15141 111572 -8140 -61001 42120 171594 88780 138921 167488 132318 265582 367612
15131 367612 260952 162485 -77145 -99755 157141 213884 107745 29090 -56736 -222018
15121 -222018 -354439 -342982 -301632 -177559 -161739 -242369 -318011 -259593 -277608 -241055 51401
15110 51401 97969 153827 123831 10021 -24034 -14018 -50917 -176953 -72568 -53772 1365
15099 1365 209344 201988 72527 68533 -20352 -240199 -272988 -277000 -174120 -23441 -71663
15088 -71663 -146697 -66313 43014 27654 58799 -124795 -175783 113144 191778 52236 -121927
15077 -121927 -163226 -90577 13228 -634 24239 111937 57860 75018 118926 -35876 -127519
15066 -127519 -4024 52661 2109 123472 248971 242784 214464 88588 28246 -100067 -8848
15055 -8848 34593 -61471 -16515 87778 131306 100933 21415 -97775 -13201 -8347 -11054 -135695
15043 -135695 -71013 58257 224864 227786 259183 118155 -2039 -158137 -185184 -111065 -88919
15032 -88919 -145994 -224967 -244589 -117113 -220888 -183307 -79810 14640 116559 312344 238097
15021 238097 78077 105653 108986 81222 -17565 58171 147545 82629 109515 178799 297254
15010 297254 227689 310879 506946 722937 991189 1284202 1337706 1333256 1404970 1199282 808248
14999 808248 527315 293443 192786 261490 358583 302734 329832 201050 124743 248819
14989 248819 298377 420219 381993 198087 69338 109961 147071 89687 25031 -138783 -51730
14978 -51730 127384 256595 339363 374496 326365 303241 303132 257290 358910 461722 560049
14967 560049 571198 503126 537371 461104 434797 352402 248052 75349 98954 42323 -72795
14956 -72795 95818 133312 85358 64770 110309 140203 210719 168954 100419 90471 61977 175288
14944 175288 288976 277268 180029 68599 90496 187562 188467 30437 75178 3578 58532
14933 58532 251173 357358 470109 368510 97802 -26517 56725 130260 178410 175539 130417
14922 130417 16547 -4926 156150 80864 171189 72400 -162523 -328122 -297722 -276732 -157035
14911 -157035 -89361 -83490 -186896 -296343 -137584 100366 258375 180876 174747 134157 167403
14900 167403 178507 158863 174149 46515 -105091 -144173 -216630 -266424 -74913 -35024 -29172
14889 -29172 -158584 -164229 -131379 -93327 139482 276700 234094 257791 263639 355009 409472
14878 409472 428977 319996 327533 454633 340349 266499 357396 336441 186702 31425 -21347
14867 -21347 133873 267282 254696 304019 229529 28055 -104747 -101102 45579 83541 48458
14856 48458 -936 -93488 -47828 221607 389435 158642 106480 310005 421734 308160
14846 308160 222990 348777 371477 224018 95381 7483 7968 -94776 -146809 -269461 -445054
14835 -445054 -481735 -309056 -120634 -119817 -138117 -3775 -98770 -159671 -46196 82949 -44747
14824 -44747 -119792 -154049 -117417 -216939 -285281 -287099 -88054 -102113 -72682 -25905 -23052 -59089
14812 -59089 -50151 -163264 -91703 -157325 -331556 -276513 -83929 -132971 -237007 -127073 -30732
14801 -30732 -14209 125742 139969 -124123 -80581 -187196 -73569 128718 209134 165447 138611
14790 138611 75609 -49961 -129443 -20346 175686 65274 147016 48294 -119165 -109462 -28781
14779 -28781 109480 131931 -46929 -82186 -57845 -43680 177832 237809 194483 62156 57966
14768 57966 153431 149102 161582 152499 135084 -36850 -27823 -105810 -125061 -205683 -135812 -248199
14756 -248199 -287706 -150746 -64111 90794 42924 226558 294612 193849 162743 147092 -2899
14745 -2899 18301 170306 207754 158413 53069 -39689 -39264 64616 194201 315484 96984
14734 96984 10164 18229 -178416 -489698 -407900 -266454 -192212 65398 38590 31881 114393
14723 114393 11839 -88060 94091 111334 -37007 -87887 -110398 -188883 -252048 -152146 -83483
14712 -83483 32881 5477 -9573 110456 206322 257139 117950 104786 161660 101262 81804
14701 81804 89255 201103 222788 156964 71464 113654 132627 166427 225052 327801 271633
14690 271633 134704 151605 242343 198379 273916 173993 158910 144430 101402 -61029 -88430
14679 -88430 -51011 87117 44599 139691 183341 187063 333180 371664 232412 150314 165718
14668 165718 119884 77491 57411 -106441 -99393 -28961 -5934 18333 104664 33739 -76335
14657 -76335 -50592 9270 128446 -58637 -164405 -166965 -67213 124557 248255 321047 478653
14646 478653 488676 336012 270827 82254 -40360 -18356 -47012 -190057 -272943 -253036 -197246
14635 -197246 -94157 -155928 -143326 -104620 -165643 -238048 -281784 -168182 -119381 36697 -1637
14624 -1637 -55292 63221 -3698 99211 248496 259712 298131 296147 241580 386496 415736
14613 415736 331040 453805 594779 548901 478533 512046 668542 718349 782767 978605 1065022
14602 1065022 1074497 1180091 1364205 1306206 1269412 930497 682650 779759 933116 888248
14592 888248 856672 820964 728503 462446 458830 558158 555892 538353 523851 299669 254602
14581 254602 121760 13937 272958 404346 324319 330198 417651 463637 411223 356024 354426
14570 354426 466667 570643 716985 872895 983023 1185580 1157412 994343 1060701 1069357
14560 1069357 964440 861924 923910 767571 513871 448104 606386 576767 502065 372982
14550 372982 363877 335243 191476 126714 204896 129586 270245 196117 97946 52288 74454
14539 74454 234060 395697 421524 330115 202776 225491 258095 143295 184318 101559 122055
14528 122055 201428 226176 200649 197426 133895 160913 256374 238539 340835 185246 11005
14517 11005 -40749 -26607 -44622 -98177 49558 289046 263595 -35005 -11730 20143 51620
14506 51620 271392 468404 376866 212956 177574 118322 8888 158866 283757 351708
14496 351708 457315 497063 446070 370643 351351 337612 232132 16132 -200715 -146862 -75140
14485 -75140 -23339 -16922 120332 254822 273940 273539 250340 214724 315802 479604 516678
14474 516678 412541 352350 240323 71877 49284 9487 -50879 -151146 -119503 -84893 -82665
14463 -82665 -47303 45625 217047 320108 299884 134036 90291 101752 243257 378980 427136
14452 427136 392872 182157 54822 110775 268367 322720 209971 189290 191069 96401 20549
14441 20549 123614 86199 -71898 -92824 -131417 -269738 -315216 -188656 10040 88784 58302
14430 58302 24733 12336 87644 36610 -19932 176600 353520 204248 -38042 43554 -32991
14419 -32991 -83803 74371 109253 172822 264998 259463 320097 430260 456040 466570 441908
14408 441908 294146 345178 480176 502612 401928 468529 423342 123960 154819 198870 239051
14397 239051 214969 57939 -44848 36037 170705 131935 121200 116927 65662 129951 295020
14386 295020 219479 155347 162589 21617 68404 112801 72125 35106 100795 104216 111381 240185
14374 240185 327546 394845 331622 360496 287671 415981 577794 571091 533258 601837 460113
14363 460113 215986 309415 333518 330136 274637 291331 250644 256170 193354 115812 130150 226780
14351 226780 249019 211273 236736 208581 205205 425654 425531 451766 494883 529213 489118 447037
14339 447037 433366 333770 433482 488416 335556 160381 117199 -1457 -44400 49230 80806
14328 80806 79200 99188 -65133 -110627 -51933 -50590 118153 196816 265588 301486 332485 528292
14316 528292 615878 454660 350014 156755 147885 294352 171364 134921 260566 215936
14306 215936 325698 386189 426903 487969 231171 156035 223686 268155 267617 318990 394910
14295 394910 446807 360545 387347 438317 346332 141651 -8399 109499 302109 316008 340872
14284 340872 292321 338188 502842 551366 470025 589010 608952 368810 224598 232861 262850
14273 262850 171377 -87654 -27202 16005 -122024 -76428 95402 59427 -8957 -26328 13740
14262 13740 103513 188463 221569 227802 356728 395401 447441 451717 356132 424098 543845 732197
14250 732197 837505 904670 978613 857047 866017 908327 984560 1043251 1081937 1025627 1023779
14239 1023779 1009693 1143887 1123627 1055654 1040419 1036520 952768 791194 717253 795697 965723
14228 965723 1140733 1112868 1037552 1099992 1245864 1240944 1307098 1338463 1351067 1348819 1186531
14217 1186531 1274258 1406908 1441228 1548578 1622633 1735953 1873973 1886093 1869628 1996100
14207 1996100 2089745 2071208 2189909 2326454 2452739 2731878 2890126 3249921 3595722 3989169
14197 3989169 4386700 4877306 5694294 6443602 6921302 7461389 7851685 8056313 8093684 7940108
14187 7940108 7834981 7814062 7614789 7358376 7429751 7620365 7694925 7868255 7961111 8218890
14177 8218890 8866510 9811446 10713402 11839345 13274267 14935694 16863494 18994842 21318471
14168 21318471 23775055 26956240 30610145 35127719 40693288 47369905 56023569 67262225
14160 67262225 81278194 98011143 117350172 138948400 160841881 180979649 198013526
14153 198013526 210511734 216763670 215470471 206944186 192730996 173964365 152444011
14146 152444011 130246883 109577119 91785349 77064434 65281817 56599774 50766713
14139 50766713 47153671 44760938 43208027 42177817 41641736 41692381 42223550 43161763 44579296
14130 44579296 46493539 48891507 51971248 55933299 60947414 67204679 75324491 85801783
14122 85801783 98938067 114597875 132797887 152891641 173667168 192584764 208007810
14115 208007810 218576666 223016177 220065801 210077879 194391644 174696316 152431282
14108 152431282 129347494 108211448 89749771 74317252 61973139 52883981 46353886
14101 46353886 41760631 38166191 35254270 32842503 30957832 29327158 27664820 26337336
14093 26337336 25339010 24364086 23449098 22899740 22434940 21816834 21060643 20322664 19435556
14084 19435556 18497680 17474847 16540914 15768880 14916911 14002864 13148005 12256680 11306413
14075 11306413 10603857 10097179 9609881 9109259 8404476 7953858 7532786 7313655 7022007
14066 7022007 6585660 6139298 5798400 5563132 5363743 5212505 4987955 4673672 4390581
14057 4390581 4129995 3900853 3610201 3486849 3276893 3100872 3147681 3062594 2895998 2848830
14047 2848830 2671384 2627811 2507688 2500034 2622602 2519459 2348518 2178339 2075297 2043298
14037 2043298 2073364 2097500 2032002 1982867 1836254 1826231 1791397 1871727 1809799 1714642 1519600
14026 1519600 1368295 1339131 1190500 1094441 1154156 1290940 1390985 1261273 1221774 1256260
14016 1256260 1105662 896333 865721 708357 663712 583994 662964 694548 702301 596664 701091
14005 701091 851970 1147635 1162042 1038407 1024117 1133730 1190275 1316074 1227323 1081073
13995 1081073 1168338 1204019 1226135 1181390 1140436 1120737 1135310 1113681 1119330 1025394 1080980
13984 1080980 1043423 1032483 823251 768233 778660 764571 739919 689457 622404 488770 447034
13973 447034 524657 608232 546758 511787 649388 660661 627190 680562 576771 655888 676582
13962 676582 643539 767703 901397 905307 833464 729523 678770 580160 606520 621469 549538
13951 549538 513821 630125 731188 793730 609989 442609 442088 362321 299250 354573 462677
13940 462677 546195 568502 503871 501017 581248 573663 493850 558310 529627 352073 268358 380280
13928 380280 521389 509350 590271 489755 374328 369262 302847 320531 272617 116163 115045
13917 115045 34481 108416 146551 164475 230578 195556 224202 136932 227466 279834 383379
13906 383379 346493 89309 -72981 -9892 234996 329151 420360 498571 317483 290528 287604
13895 287604 398184 317646 378364 417001 318120 330150 387750 414658 316004 261468 180837
13884 180837 132283 57972 -37345 -160293 -191837 -151259 -60571 -10232 76520 -13898 130481
13873 130481 -2242 -85019 6148 68325 -67763 -117955 -111079 -120364 -119982 -33774 46010 -100288
13861 -100288 -126030 21593 204940 2423 -103851 -194766 -289280 -349147 -305707 -250897 -76400
13850 -76400 -91273 -157615 -136653 -94231 -155978 -26408 75344 20738 -25734 -56950 59986
13839 59986 145996 102013 231959 152484 107098 211510 145732 82989 71200 105480 132043
13828 132043 185676 76095 66152 137553 202674 322184 331945 291481 176925 303682 457896
13817 457896 326436 263743 356240 318528 79027 -65759 42022 206766 267614 204920
13807 204920 -10788 52792 210850 84790 -4634 12623 -37857 -59462 -73963 117573 150960
13796 150960 160276 193177 147562 179020 260424 486808 496464 337136 289688 386213 247552
13785 247552 193254 190328 139118 101394 291088 398687 356037 202472 -710 -111117 -114351
13774 -114351 70315 313983 100788 -1166 103221 106905 98929 145727 124473 84699 161452
13763 161452 159862 232181 192280 242229 276158 315189 202975 217576 87980 25763 -19719
13752 -19719 81472 145437 52071 120210 84351 32062 -57692 81869 167063 362242 282859
13741 282859 172357 149491 192358 173731 247461 241365 119682 14819 -61604 -46614 64973
13730 64973 21922 15937 119742 182662 156333 139578 135624 174015 202298 196811 81462 181426
13718 181426 112143 77224 15265 113317 176262 193727 376667 442467 375517 296087 226477
13707 226477 136432 168889 478639 561161 721488 865174 826937 699098 895101 1023546
13697 1023546 1140163 1121400 1088304 1272695 1132818 805294 687783 622779 372641 251982
13687 251982 391818 509026 454384 367099 526136 521707 543653 463099 331230 399344 270818
13676 270818 127934 144200 255092 216219 286620 347090 522936 670770 720994 753901 954217
13665 954217 918928 754440 918027 1032941 1181779 1302993 1369441 1262051 1158552 1007782
13655 1007782 974826 943534 746438 601351 247628 99112 121928 95769 122408 155400
13645 155400 198632 165977 136922 135188 203869 192499 186892 373635 379650 333505 276439 258697
13633 258697 190661 312922 111095 21499 -188499 -183851 -228949 -61817 -4204 157053 108474
13622 108474 -58130 33488 102205 47144 104719 265792 98506 90674 288970 354542 327110
13611 327110 194318 205502 301231 218377 54638 154043 118668 41476 104891 -206 120113
13600 120113 221591 264970 137610 77823 215303 268483 233979 132915 28040 50663
13590 50663 65383 77704 84034 100602 169198 192234 142832 4306 -98168 -147999 79890
13579 79890 267879 395868 290298 43413 39010 42520 47836 81258 101282 57306 41939
13568 41939 -49479 -207143 -235010 -196826 -157340 -133229 -150436 -79775 -143578 -184454 -148321
13557 -148321 -77139 -12463 -172108 -18204 140626 32066 137448 313263 329976 227392
13547 227392 219569 257604 301531 251573 171172 12440 40371 182136 166225 -19496 -47305
13536 -47305 -86045 19874 138570 162283 134366 126299 132495 -75545 -208541 -215260 -127816
13525 -127816 28135 154668 52686 -30328 37312 6203 26849 -89072 -79897 -182438 -198089
13514 -198089 -63321 -100797 20815 135322 113084 231585 233980 56653 -161295 -116749
13504 -116749 -55217 -65388 22875 8734 -22366 20968 -100842 -113196 -46483 47997 82389
13493 82389 157021 88854 32554 38316 174782 167195 119033 131390 94327 60167 114677 156169
13481 156169 -14726 -261117 -182378 26937 56248 -113324 -165 56333 49488 129978 76253
13470 76253 64677 125243 94734 160651 98544 16696 146959 133121 110827 -32757 -231387
13459 -231387 -329104 -255058 -141731 106684 209952 213215 199455 208291 16001 -22511 68994
13448 68994 95190 -15127 -51254 -238183 -246265 -321093 -214183 4778 -44469 10299 -73454
13437 -73454 -3069 -10073 -33451 56748 147842 103663 17484 42592 126150 139849 36382 5288
13425 5288 -101624 -201086 -59484 -181355 -58386 99741 212581 138316 23133 -32863
13415 -32863 36893 104026 57814 166761 8729 4403 100176 119268 38242 -44185 -49868 62491
13403 62491 151811 137834 79668 30922 -62081 -139992 21433 145470 -17174 70041 95956
13392 95956 183743 241919 244066 233900 224587 326996 214788 148695 94712 154374 38061
13381 38061 103008 9754 -70121 -32854 95288 159592 228273 155215 79306 113951 -2796
13370 -2796 -130899 -82590 -95067 -70177 -4010 -47581 -30305 -95291 -87885 -70738 -160909 -166271
13358 -166271 -74809 -121560 -278272 -242105 -16858 72959 182226 144038 -58935 -198741
13348 -198741 -61574 92796 46670 -33715 -106492 -355998 -316031 -250092 -122666 -156213 -216037
13337 -216037 -230067 -227980 -25158 -50870 -76817 -8046 157004 215954 180349 15526 -86850
13326 -86850 -142085 -68786 20665 -121076 -122799 -168037 -190543 -84863 -19780 193793 231534
13315 231534 60091 -1101 34412 217182 259980 156753 105817 163604 148719 118731 98726
13304 98726 -27723 -86981 -14211 95061 130352 132079 173963 235830 149087 128663 159441
13293 159441 184565 129290 -12614 4460 -31500 -101964 -88203 -38952 -92424 9447 66703
13282 66703 208541 364496 438766 316941 322786 288298 128706 99688 44487 27864 -30112
13271 -30112 -80593 -178048 -112898 167645 195831 61892 -18776 -107197 -141741 -76879 145488
13260 145488 271545 248956 169524 190574 185435 111606 8519 -66323 -26668 -41925 -53115
13249 -53115 96465 -14938 -118601 -247575 -281778 -251561 -303505 -169998 -205140 -94075
13239 -94075 122431 119121 38558 79272 49425 2871 95427 80131 34320 -2157 -56196 80351
13227 80351 116453 59682 -1757 78682 110794 31527 -92975 -144660 -149431 -256496 -124303
13216 -124303 -29714 56992 174183 70250 73211 99179 24845 59803 30126 -122098 -139385
13205 -139385 -347828 -194063 4175 129860 172756 158151 -38004 -56082 6085 -47435
13195 -47435 49888 32563 135770 8093 40430 3952 -150317 -223209 -159211 -138334 -151772
13184 -151772 -297916 -266588 -293238 -301781 -230926 -110273 -90413 165628 253225 118585 67754
13173 67754 95815 73939 -34450 22389 102170 38589 36859 38790 -290275 -397905 -214126
13162 -214126 29207 115692 -61719 -90568 8537 -4436 -86506 80157 117515 -73084 -107267
13151 -107267 -168654 -298391 -209174 -174646 42250 -58595 -159034 -157940 -64621 -5630 33388
13140 33388 61935 28156 78329 185954 106052 32276 7846 -48354 -87667 -83838 -25808 -168949
13128 -168949 -298082 -248595 -214106 -69327 -55804 11105 242326 423613 374422 255323
13118 255323 92837 4537 34697 69413 -15703 9459 59723 -11594 58261 66834 -81421
13107 -81421 -59645 87036 229293 119743 106399 112318 34364 37117 79681 44886 92566
13096 92566 145794 -51834 -114714 -54879 151688 332377 345789 183771 142904 148142 231396
13085 231396 101659 84157 87129 111537 121593 163872 142170 193679 57134 37027 150566
13074 150566 80528 -31562 -98767 -164698 -78548 -81562 -128925 -164711 -224491 -175602 -304178
13063 -304178 -367457 -313691 -129041 -103481 23045 212685 179376 94608 54579 -34095 -71112
13052 -71112 89781 314403 559368 473970 258232 229499 3299 -87099 -54685 -18800 14381
13041 14381 145018 124524 231612 157654 128708 235917 212757 174734 81509 14948 52416
13030 52416 54083 -92070 -8602 185546 81931 -32361 -79877 -51562 105920 187577 -54842
13019 -54842 -119615 -99480 -177446 -186462 -217553 -116187 -70368 -168197 -81881 -292895 -500330
13008 -500330 -313855 -293497 -392383 -283645 -571 -7629 20946 -20362 8886 -29828 70280
12997 70280 96839 -5136 115982 237503 325680 322558 158068 1678 -14628 41683 44334
12986 44334 155821 315411 244898 -45248 -222672 -249319 -139164 -15951 -18906 97842
12976 97842 132426 106835 114619 350037 290330 54449 -180503 -117917 47449 38534 100510
12965 100510 66398 -15845 -107400 -29877 67198 -151 160053 258571 100391 307 4895
12954 4895 21478 -153030 -99423 17083 69331 -15258 -104435 -15533 55856 -18651 72519
12943 72519 54049 22125 25031 151719 115490 298899 202048 49152 61517 -8868 19952
12932 19952 108944 143865 61191 176785 176735 144507 174675 112422 127067 74516 41883 -167421
12920 -167421 -168139 -39527 -237 160624 128366 -23690 -74050 -126041 -76396 -4086 152357
12909 152357 164137 27271 -13678 39933 23167 123312 123691 134630 115786 168128 148673
12898 148673 191661 144130 69982 -17409 -34670 -26234 -160731 -127884 -126794 -143375 -177447 -145223
12886 -145223 -130712 -37888 -35621 -53434 47435 106730 66711 127969 159162 156980 367436
12875 367436 432506 324521 124352 19562 -56452 -29229 -104385 33039 82932 159569 123784
12864 123784 79175 128710 90501 161086 274378 316031 250062 280974 232380 129359 104314
12853 104314 139364 141112 66826 25579 104119 162392 49851 -72770 35590 29531 -57384
12842 -57384 10471 -37362 39262 -11928 56187 95385 190150 189303 141840 52985 -163745 -181767
12830 -181767 -72450 138393 181699 51638 -47001 2339 -28019 -78434 -99556 -172298 -36776
12819 -36776 56428 -39748 -198299 -130767 -186524 -195180 -43878 -18464 1068 28330 -81806
12808 -81806 -128230 101762 168673 53852 -66321 34809 -41618 -54230 47206 168639
12798 168639 69136 -33134 81581 37933 -34439 -47457 180558 121450 -129560 69100
12788 69100 103823 111376 100568 -37303 -276492 -211396 -132984 -27767 29551 -7722 72613
12777 72613 202211 146513 159827 128972 26937 199732 300232 276476 106853 71349 37098
12766 37098 34779 107349 79958 245295 207726 111254 -16633 -108740 -186691 -12520 141707
12755 141707 29834 -18638 30789 79452 65100 -77130 -28717 -4488 -47918 9505 157636
12744 157636 144946 71288 46367 78319 84046 13477 -20267 -14723 -82359 -176389 -216852 -185058
12732 -185058 -54812 -46358 49130 21954 62430 126901 121903 7001 -64655 177219 322752
12721 322752 412422 321175 189551 57249 -173506 -121477 -90023 -88555 -154633 -98461 -88486
12710 -88486 75993 195937 173534 34636 -84090 -13051 121118 -982 -161152 -189369
12700 -189369 3911 84859 219624 303426 265473 227219 170906 98280 173765 153452 50499
12689 50499 111023 39802 -30185 -84843 -52295 2332 11403 7747 -28974 -225220 -253113 -119513
12677 -119513 -123998 -92596 -78974 -18007 68804 148717 119326 179474 206934 179751 229539 181820
12665 181820 129824 133240 157823 117864 99815 52576 -115812 -294437 -110935 -14085 -125367
12654 -125367 -168042 -191504 -213533 -258079 -290508 -236149 -320312 -120721 27325 17069 88184
12643 88184 83215 -56052 101653 171227 146398 100603 145376 129536 59687 -49920 -198663
12632 -198663 12574 194728 357136 410388 317620 337876 267254 50568 -43563 -160738
12622 -160738 -82616 -52093 38991 59774 4501 -105023 -148942 -13915 201072 197635 112760
12611 112760 59297 58676 65580 -82699 -144363 -648 148418 224797 172634 69842 87804
12600 87804 166555 -27858 -199045 -61415 42264 61397 4511 -98844 -42429 114142
12590 114142 138745 139654 126953 -94356 -279706 -246134 -315170 -336911 -289694 -393050 -206004
12579 -206004 -32275 20463 -71846 -204516 -173779 -190723 -245850 -201732 -99198 -37813 -56538
12568 -56538 13117 32866 -32058 22307 14015 4180 -78880 -148538 -325767 -333056 -177712 -285246
12556 -285246 -340721 -131823 -69404 -139066 -19625 113863 166335 205301 205489 188761 112733
12545 112733 -81109 -111825 -233684 -78097 27180 -130704 -267404 -440495 -393795 -303433
12535 -303433 -201916 -9855 92462 135180 65503 13008 -25817 -101410 -197912 -214066 -283596
12524 -283596 -84619 -80133 -152251 -241273 -323880 -271322 -87156 -8161 49464 65001 -81502
12513 -81502 -3834 -10327 92589 135028 142037 118259 7898 100854 22304 57982 201140
12502 201140 52518 202151 179756 125713 106841 120975 3069 -82710 -47988 18851 155910
12491 155910 143785 -28927 23479 97893 43783 -19029 -213512 -178284 -114823 -69779 -114871
12480 -114871 -218401 -188844 -97238 -287517 -309785 -110936 28669 151058 116623 15088
12470 15088 -87024 -155964 -259046 -136309 -148165 -302527 -305788 -75292 -20119 32630 105684
12459 105684 78280 210075 170299 27285 -21781 -106871 -125416 2063 988 -110388 -114215
12448 -114215 -198393 -145042 -182024 -238540 -186663 -90765 -89296 -45191 -9522 -104882 -110418 -188246
12436 -188246 3830 99039 93356 305703 290007 171170 32232 -189548 -263844 -142304
12426 -142304 42969 113621 177373 -21190 -133810 -16906 189095 299247 231462 55655
12416 55655 27725 2125 48581 -7548 -18174 72229 24888 81510 17471 -48651 -8707 81213
12404 81213 63307 41858 18029 26797 117985 95677 76604 66388 -71042 -14599 -107374 -307769
12392 -307769 -344773 -216560 -177338 28379 158231 30086 -4365 -20060 34710 163860
12382 163860 120827 44548 -21604 -82233 90750 21024 -15492 69646 186262 121215 100685
12371 100685 230013 105461 -13636 -106103 -243121 -347311 -257077 -165045 88827 134922
12361 134922 18891 -8171 -59500 -66172 -283751 -236747 -89390 42458 66142 144953 69170
12350 69170 26450 100866 65389 -103004 -56496 -11102 21018 121391 18526 23973 -6511
12339 -6511 -17484 -2401 9765 22152 -95148 -164516 -306812 -114019 1072 -58401 -13689
12328 -13689 -86068 77605 229701 119888 106404 113057 139372 164681 230664 204385 66816
12317 66816 112156 168090 225155 303456 172408 137544 -15354 -245349 -88584 -2888 -75374
12306 -75374 -73290 -162453 -366838 -468605 -128178 13335 -15683 36244 7587 -113000 -343299
12295 -343299 -346667 -253089 7020 230339 348456 206268 10763 -37440 63279 159605
12285 159605 122820 -874 -135137 -122209 -41967 121459 38684 -107845 -199952 -109641 -66933
12274 -66933 -9704 34166 -22118 -209288 -270063 -133062 -27920 -5175 -22226 -208596 -236484
12263 -236484 -141354 -47154 -40821 -159660 -201804 -70482 78476 151091 138192 117262 160942
12252 160942 90697 126182 38684 -182814 -29955 20699 148 29114 -28212 -35536 47497
12241 47497 170934 118955 -155617 -173775 29823 -22458 -112600 -85879 -92512 -110928 29682
12230 29682 305045 318405 160144 11156 17714 283289 235524 1377 -60141 -31266 40387
12219 40387 -33288 -75737 -59481 -110158 24161 91377 62535 -35144 -107798 -116047 -155483 46594
12207 46594 59178 -246103 -240613 -25088 -97199 79419 269868 142507 -68032 -150114 -292788
12196 -292788 -137742 27155 166706 176008 187243 245360 72096 29576 31731 -45463 -31223
12185 -31223 187229 291024 152987 143087 91447 -76364 -170274 -58861 65349 69919 -13148
12174 -13148 -169649 -27243 18337 -191241 -228824 -308663 -111607 -79650 76576 314539
12164 314539 193187 -40635 -124349 -126322 -184445 -158837 -163752 -181401 -54480 -102355 -143627
12153 -143627 -152922 -186620 -149217 -48470 -78726 -165000 -64352 31216 -104261 -351860 -247660
12142 -247660 -135743 -122069 -116435 -136823 -151402 16130 126642 75805 187113 147121 68154
12131 68154 94653 67518 44643 108333 168043 195342 287241 239522 175355 -62522 -188557
12120 -188557 -64357 38500 145761 56334 -182221 -262100 -62029 60016 203837 87471
12110 87471 102724 156993 10229 -148908 -148740 -95243 -49416 124118 216468 48484 -158793
12099 -158793 -162741 37215 84961 -34012 -144900 -125821 -22782 -158653 -25302 138089
12089 138089 188160 163086 73040 176145 16274 -89880 -81951 43445 -64796 22863 194956
12078 194956 137945 75344 51080 99703 -61095 -170021 -116183 -199779 -223434 -145954 -52176
12067 -52176 48932 178458 98010 -104275 -144841 -104568 109895 246348 -32 -64053
12057 -64053 47442 -66832 -2471 14948 32016 163387 147067 231526 83665 25604 49702
12046 49702 72479 93675 207393 371880 440189 430701 160963 -80239 -70852 -53889 48835
12035 48835 118480 196218 349518 193115 18402 136017 292167 72702 -59883 -38752
12025 -38752 -84760 -174397 -118557 -37734 -5231 19120 65858 89447 155948 87519 -18108
12014 -18108 -82509 38377 47801 -165690 -251296 -70893 12074 8328 -66239 -246994 -342450
12003 -342450 -157294 -178019 -327716 -238993 -70796 -219644 -382057 -322774 -260851 -228757
11993 -228757 -218589 -245470 -30444 45969 60850 99623 78198 -74903 -67207 -80446 -149529
11982 -149529 -46591 29079 -5196 -85715 -37396 -117704 -50721 -9563 13793 16812 -62078
11971 -62078 -22727 -131869 -184881 -230502 -199873 -161445 -322171 -389831 -419658 -299036 -217507
11960 -217507 -75809 -93403 -251671 -69694 91149 87420 48055 -2417 -331 -106094 -65328
11949 -65328 -61858 -157928 -320810 -274390 -233273 -301640 -209877 -248707 -294435 -244270 -94022
11938 -94022 38562 66480 -67648 -254254 -314690 -128196 -98134 -84530 -162264 -49020 -13225
11927 -13225 46006 140115 -59530 -369692 -528013 -525052 -378105 -213172 -161758 -31483 -17206
11916 -17206 -40444 -238008 -301178 -236951 -149970 -245208 -153762 -89767 -25355 197338 179944
11905 179944 -52514 -68767 51410 140495 21600 -99236 -77246 -69291 -55198 -83684 2039
11894 2039 93535 42200 -4109 -182806 -271954 -181634 -4274 102678 86390 -14920 -82588
11883 -82588 -48842 -153919 -110531 -88878 -168712 -151929 -98802 -69366 -131766 -38020 49444
11872 49444 219570 272658 239288 109979 42005 81445 257413 240520 -37962 -166641 -87418
11861 -87418 6364 153465 116036 103144 184421 99896 -49522 203 48517 -108029 -68889
11850 -68889 -81007 -43059 -11242 83772 171411 157696 24905 -41433 28308 80730 105715
11839 105715 165617 207005 128808 155312 124267 83030 43136 -38627 -153763 -38705 35901
11828 35901 103340 71463 102848 217333 284593 337882 245193 204530 180318 -13437 18643
11817 18643 171616 179073 156712 43178 -181253 -178791 -85620 -43335 26738 237522 44243
11806 44243 6625 34182 44600 16807 -58550 -29927 44352 99448 -93682 -310689 -286531
11795 -286531 -262192 -351816 -362707 -318782 -163227 -55465 288 67114 111996 130925 123808
11784 123808 -43919 -47520 -22115 -65159 43052 121111 134272 84021 -24049 -276923 -420720
11773 -420720 -357924 -226534 -99861 -36558 -101553 -154364 -191671 -8651 72457 -15903 -60546
11762 -60546 -15797 -40287 -74756 -102821 -148385 -124041 51111 15836 -58671 -18175 56930
11751 56930 18224 -6266 62273 -32756 -215741 -289860 -235714 -229494 -217397 -402680 -362689
11740 -362689 -368806 -322363 -241403 -412137 -350676 -245814 -143474 -61436 -26134 -154407 -90724
11729 -90724 28855 -61095 -74491 -35414 22713 17848 -14837 -55977 -34067 120305 -36441
11718 -36441 -146999 -83524 97029 42718 -96155 -212084 -161457 -19768 15751 -132964
11708 -132964 -125770 45357 70519 56921 33 -98958 -152710 -232875 -248434 -251029 -212840 -180972
11696 -180972 -301077 -340922 -170676 -3840 65806 -37463 -54549 -31399 -32880 -261298 -441089
11685 -441089 -322552 -298161 -361268 -187537 -222244 -301904 -145924 -152534 -273993 -97125 -31403
11674 -31403 -71596 -52226 198908 263020 59160 -153023 -108148 99207 133558 42077 -62141
11663 -62141 -28281 -18447 -50547 39991 154861 25072 -75022 -12538 15569 106451 107192 30399
11651 30399 -104021 -179283 -116315 -119343 -125990 -136512 -41898 67585 47399 113717 172281 274343
11639 274343 359410 108565 -25708 -31813 142013 216597 218133 277297 318445 206520 -72866
11628 -72866 -52894 38578 -84679 -200423 -208698 -105867 -159410 -201455 -202225 -170948 -275616
11617 -275616 -277917 -177818 -103380 -32952 -59983 -14427 -52834 -61883 -32113 -40480 -101564 -79292
11605 -79292 -103880 -68433 39630 56902 -88172 -60304 -53862 -33488 -181346 -62091 65532
11594 65532 -81901 -133347 -58724 48660 103532 98317 108819 -94341 -218894 -193794 -193324
11583 -193324 -28969 195579 192451 50090 101235 -24767 -76946 53854 86215 84680 193965
11572 193965 195338 66648 -17634 -63261 -21761 -10155 -47434 -2431 -25184 -11993 43719
11561 43719 103801 37328 -134666 -67962 9096 -6041 41352 -103247 -151337 -38935 225107
11550 225107 270983 141679 237118 287942 199757 41010 22902 -68669 -226150 -293076 -154526
11539 -154526 -169484 -242100 -257307 -86529 -57742 -52590 -105235 -20244 12389 -60329 -181151
11528 -181151 -180555 -48507 101606 58375 31316 54326 85818 147372 71915 81560 104578 41261
11516 41261 133013 182058 88499 -12083 -89929 21692 -7372 -97877 -126488 -123019 -87466
11505 -87466 3751 163404 146696 206522 174017 111850 47699 148256 156210 175662 83177
11494 83177 51773 40470 -13596 -22611 -100834 -94686 -2352 -42731 -7899 89178 -102408 -130203
11482 -130203 -1658 -68636 -54546 103832 52410 62636 125065 28881 -164675 -134185 -110161
11471 -110161 -131139 -118386 -273798 -506391 -546310 -435368 -249407 -197870 -343265 -222106
11461 -222106 -29115 -69466 -182186 -101170 -226535 -482139 -372144 -265083 -196082 -145357
11451 -145357 -12346 51161 90178 93335 187459 223859 220140 46838 -114410 -133156 -532
11440 -532 172897 231032 229019 128266 84716 104568 204549 219083 -33938 -99888 44073
11429 44073 8390 84225 120885 188963 121248 -124562 -155653 -59793 -144850 -139334 -154760 -146415
11417 -146415 42951 188128 180635 42984 -65815 40985 146703 100646 -4450 48040
11407 48040 179467 222814 229388 176644 -32552 -89630 -198390 -116764 -155486 -59634 -51530
11396 -51530 -57997 -101862 -157190 -60 18367 88762 -22484 -234330 -326354 -432905 -277274
11385 -277274 -222175 -291688 -215518 -212400 -118441 69288 47199 -139015 -236416 -19986 154153
11374 154153 72303 -191157 -230319 -90690 -74982 -163698 -237298 -337714 -476877 -436777 -391548
11363 -391548 -428960 -274419 13747 99486 -63944 -3783 -53976 -256598 -323475 -335736 -197342
11352 -197342 -172375 -48534 20768 75577 -117145 -203512 -109249 -109917 -145984 -197220 -158301
11341 -158301 -68979 -2845 69525 149685 207728 10584 -149256 -284078 -276923 -174987 58870
11330 58870 127155 167473 137690 -55676 -139057 -1953 -70096 -194714 -297549 -265928 -246053
11319 -246053 -147286 -168393 -299663 -207226 -121947 -96895 -111973 -29883 -52631 55152 237607
11308 237607 91030 -48069 -19183 51224 -39581 -86181 -7756 172057 271021 130965 24006
11297 24006 -5698 81386 76744 130079 67943 -30472 27919 -30262 118307 209439 92385
11286 92385 -8839 49199 113053 112938 111261 180692 207721 163055 100531 214067 191121 95235
11274 95235 185329 209490 238723 111747 482 -122999 -44238 6755 2174 168984 288291
11263 288291 125228 11078 -38321 -143815 -265081 -425285 -385620 -262802 -31538 38004
11253 38004 65442 -104405 -138201 -42498 38962 8196 68231 111420 97681 21578 -104717
11242 -104717 -190907 -15843 173185 101217 -107799 -210825 -132332 42009 -7917 37365
11232 37365 90576 182241 195532 154871 136727 252060 381395 281212 146058 -33621 -133730
11221 -133730 -177691 -124410 -58720 -74950 -38871 -44615 -110631 -202638 -291229 -252801 -302454 -177611
11209 -177611 -67929 -51316 -266377 -187850 34775 131640 101992 166583 189219 122242 163231
11198 163231 148030 118613 96837 -27969 36063 66198 139421 190478 164400 135036 -29660
11187 -29660 -113545 -108610 -170133 -145634 -16489 99234 96165 -21323 -92748 -267485 -295866
11176 -295866 -246670 -322335 -158974 79977 157881 68105 197297 176484 94000 111094 77997
11165 77997 -46682 689 158658 345444 183356 93269 140691 53365 32605 53583 -137360
11154 -137360 -37823 87792 184121 94877 34004 -73239 -24604 98440 162959 79087 76622
11143 76622 86064 115821 150750 56813 79715 129790 7530 -162777 -377049 -382190 -282755
11132 -282755 -192573 -149777 -200963 -184613 -251108 -289133 -196269 -147248 -22922 -135575 -139145
11121 -139145 -173825 -276469 -198850 -75815 -95172 -158730 -164112 -77914 -47876 90787 142466
11110 142466 133110 203459 275227 79737 -6083 77638 203643 118252 28077 92797 149468
11099 149468 170640 -89751 13916 51042 30219 84300 211211 213358 160062 73728 -28940
11088 -28940 10614 115334 178058 165693 86835 -99351 -101512 -73270 -167295 -245795 -225238
11077 -225238 -117402 -197611 -346381 -270648 -75431 95142 86908 116590 73043 130643 80586
11066 80586 41306 71727 18088 -111617 -32582 -9249 -134553 -116459 -280507 -379055 -435127
11055 -435127 -307252 -168226 -146311 -72337 -113210 -248444 -213885 -20998 -64153 -193835
11045 -193835 -295805 -270262 -167751 -224796 -235712 -163422 -202043 -275484 -158601 -111738 -268447
11034 -268447 -263704 -84685 109290 170788 169445 37759 125223 92642 22928 -36364 -103800
11023 -103800 -121291 -91884 -301753 -424654 -422053 -416913 -314810 -326458 -231338 -222207 -265660
11012 -265660 -200152 -83614 -78153 47283 -88614 -157686 -258731 -239678 -193085 -128650 15623
11001 15623 18854 17199 60862 -91983 -297107 -376331 -246987 -267128 -190664 -352962 -486630
10990 -486630 -484774 -460874 -238063 -110686 -194597 -145051 -24860 -88745 -151254 -228654 -356781
10979 -356781 -144475 57381 92578 67748 -15474 -54751 -148044 -224292 -257451 -27352 33340
10968 33340 48582 -180175 -182897 -203539 -175665 -254055 -301418 -235185 -291506 -263843 -324192 -235578
10956 -235578 -163708 -87313 -26956 60461 61963 33297 171127 245927 195174 182298 299902
10945 299902 342760 319622 234513 254206 205448 176635 102733 151919 122832 53752 -86799
10934 -86799 -36635 19058 -37508 5672 -55134 -128139 -48835 132810 177045 47579 -54505
10923 -54505 -124459 -86849 -107526 33235 144744 188922 161286 231819 115745 134720 13556
10912 13556 -129292 -265278 -248895 -264845 -170838 -108560 -103774 -32917 45930 1763 1677 -35880
10900 -35880 -123301 -210378 7438 158183 10359 -161316 -264334 -241347 -28419 27607
10890 27607 51210 -28498 -5740 -18067 -124386 -199166 -144710 -26552 71657 130803 106918
10879 106918 24446 17103 70 -56806 34313 94366 73038 -86717 -41094 -20284 154757
10868 154757 171571 75425 44736 69268 129928 67902 -34851 -104539 -17111 -73961 -27074
10857 -27074 -18891 -78915 -91970 -107938 -116849 -121776 -23136 40666 -95982 -233078 -175613 -187860
10845 -187860 -342498 -342337 -248755 -150291 -79560 104334 200455 -13396 -61258 -89786 -145473
10834 -145473 -44702 38183 70702 51112 108 -9928 155952 142389 15089 -42687 36296
10823 36296 76149 -179960 -269982 -365414 -327222 -357534 -187575 -185119 -129065 -50891 50350
10812 50350 298978 250654 114518 7209 31375 110483 179549 115755 224129 252002 207685
10801 207685 54537 -34261 -96920 -61940 -39133 -35386 -26657 -91976 -70544 -73977 -23546 70259
10789 70259 -56663 -102732 -126998 -121421 -213362 -157893 -117791 27874 56359 174246 157387
10778 157387 145166 37658 39938 54792 114073 232746 148396 -81668 -218026 -207056 -16697
10767 -16697 -55857 -135801 -116399 -183841 -344560 -208917 15362 54047 141043 79954 -140082
10756 -140082 -242456 -263315 -239832 -251276 -240008 -272829 -117750 -152525 -113510 -168734 -118445
10745 -118445 8137 15570 -66890 -183438 -64900 -103879 -152810 -207695 -135467 -129616 -267861
10734 -267861 -330983 -267167 -61480 37424 125233 95478 -70599 -49100 93293 273249 299577
10723 299577 346047 313874 341913 245402 75887 -123870 -219108 -201888 -113252 -99787 -186592
10712 -186592 -161590 -172570 -77572 -85208 -72471 -130727 -247333 -256118 -181874 -94163 -147510 -299777
10700 -299777 -122464 102414 120719 140684 139954 31996 76520 182113 35281 23051 119888
10689 119888 101966 53541 72679 -8841 31007 54975 29910 3075 87437 -42197 -244053
10678 -244053 -157810 -66894 29575 16208 -20063 69378 49784 -99089 -219562 -50609 204190
10667 204190 234616 205458 250441 190360 44237 -161648 -302172 -329428 -278065 -197649 -73571
10656 -73571 66195 98134 55321 -73459 -48412 -158946 -260612 -201828 -90356 4257 -72665
10645 -72665 -142466 -75156 -72681 65909 202410 229103 228740 272134 275141 170191 -7884 -79159
10633 -79159 33773 -11101 -124199 -114337 -144301 -204302 -83887 -10273 77989 119351 205721
10622 205721 55045 -17903 8161 101195 203214 170149 174738 233985 125101 -6308 -103032
10611 -103032 -147270 -234930 -70049 156203 117928 182451 237632 10986 -195393 -55105
10601 -55105 31255 -144051 -181666 -249638 -264012 -66451 55286 24754 51928 -1707 28037
10590 28037 43957 7955 -31079 -106436 -167146 -131916 36961 154380 43928 -77457 -78459
10579 -78459 -118642 -57777 107034 320353 285795 153112 82965 31986 54250 28739 -76893
10568 -76893 99385 159826 26974 -14878 108756 -26662 -70541 -6747 -54514 -9068 87469
10557 87469 41848 -3231 -64159 -83355 -217314 -219704 -21107 67606 120572 122844 -35375
10546 -35375 -154725 81841 227640 307563 275243 142213 39501 -60144 -39399 41051 -128556
10535 -128556 -305331 -316416 -131958 -39653 -204336 -437719 -541120 -348130 -214707 -260239
10525 -260239 -287853 -207882 -115196 12576 -33757 25181 132753 132945 112151 54247 -100511
10514 -100511 -52865 -107030 -41611 8231 45669 40122 81327 210490 154849 -119953 -184187
10503 -184187 -96117 -39919 36041 -16047 -117433 -194853 -123971 -133030 -75597 -75199 -21186 -49029
10491 -49029 -1195 122893 244371 190109 -87178 -173439 -138907 -91413 -88377 -61692 -71965
10480 -71965 -62318 99521 136665 156427 103806 27569 -77155 -1501 18934 56278 151878
10469 151878 85624 92107 -49388 -86827 -111344 -143573 -284065 -348266 -187555 48976 215871
10458 215871 248484 215160 178357 144296 130980 64115 -96846 -51711 -29383 -64044 59807
10447 59807 153983 -32265 -236669 -340235 -390000 -241551 -132304 -33017 -92943 -81324 4904
10436 4904 -25686 -125823 -77042 -18631 86438 135369 69796 -143189 -71029 49558 -128826
10425 -128826 -192221 26230 111665 -58058 -131614 -157409 -304151 -335230 -452253 -543636 -394764
10414 -394764 -86197 -8914 -170174 -246190 -295987 -270458 -256579 -354349 -402850 -338716 -254891
10403 -254891 -223709 -257390 -282095 -203431 -63177 -148440 -294508 -128402 31094 100960 152297
10392 152297 219133 84692 105290 91758 47743 -12364 -19787 -56108 -26784 79377 227128
10381 227128 394554 340077 271229 25007 -172701 -107095 -37320 -94723 -101431 -38890 33759
10370 33759 95408 -177363 -104154 -16622 24888 34820 57031 127865 -1768 -68683 -108177
10359 -108177 -61203 -56715 140811 -48377 -189535 -147093 24724 175305 346376 300229
10349 300229 411743 366548 284831 252064 384357 284690 51550 -25566 8055 84568 67439
10338 67439 -94078 -27367 159571 88578 124678 79999 56965 156857 107499 -8393 -98113
10327 -98113 -74799 -113057 -158751 -171239 -56335 -46930 -44428 186747 376214 297711 142675
10316 142675 -37936 -246748 -386563 -340946 -282854 -261650 -122266 21247 80610 177401
10306 177401 204442 44842 141874 214519 172801 92396 39868 -52250 -128395 -28360 85087
10295 85087 104412 171395 120146 166219 217637 58871 -28716 -20595 27218 120203 254493
10284 254493 96624 66643 -9546 80868 137067 54462 -125897 -27880 159144 227425 65590
10273 65590 45028 -98389 -117318 18989 -189051 -280618 -211941 -318172 -279887 -94848 -10734
10262 -10734 -86411 -115177 -56905 -57051 4969 54328 -4230 -83252 28815 121758 -58370 -254756
10250 -254756 -252364 -125720 -257257 -383558 -318000 -248741 -182229 -175265 -126240 84226 161130
10239 161130 -49084 -23748 -89917 -306656 -307094 -262824 -346969 -418211 -284036 29228 74958
10228 74958 -35544 -219510 -187247 -157534 -113659 -78159 7814 45592 -71512 -74944 -113514
10217 -113514 -13532 74145 113938 20941 -24864 -13533 61717 31259 -31930 -45415 75002
10206 75002 28544 -85100 -124985 -243274 -61490 147757 102050 -66999 -113459 -90641 -25442
10195 -25442 138303 103272 128546 164529 195449 34866 -65419 -126244 -262230 -151140 -3579
10184 -3579 66366 83634 161645 184301 66109 24639 -88420 -111512 -54118 57696 157444
10173 157444 140773 114267 92283 38769 57213 -58003 -65468 -154071 -101633 -81168 -21966
10162 -21966 -55694 7811 60682 -158089 -139165 -46286 23220 134874 123995 -25158 -81971
10151 -81971 -51675 13021 108074 104155 79367 198366 292637 276778 167527 34353 -23220
10140 -23220 38995 156250 236462 243397 165705 -49613 -57272 -64598 -124051 7061 25540 36160
10128 36160 -77271 -98297 15720 -48977 -32164 -34420 18450 23828 58883 73500 130360 -3787
10116 -3787 -226268 -294878 -282525 -205538 -127484 -215357 -508694 -435962 -274780 -158691 -49074
10105 -49074 -35768 -60588 -35821 -156354 -116019 79828 120954 251659 219164 22678 -146757
10094 -146757 -112066 -11573 73406 80606 198568 335796 391703 287806 98879 -124507
10084 -124507 -95462 -186591 -328867 -139853 -112934 -194770 -37578 80571 127958 181357 24187
10073 24187 8739 -16739 88612 58872 -97971 -140378 -231904 -311728 -193567 -79076 8140
10062 8140 -61130 -187735 -211799 -109950 -175603 -242180 -132341 -130178 -94105 60127 192496
10051 192496 192203 174127 210095 171892 173629 355765 363958 277798 228254 -51620 -20041 48830
10039 48830 82454 22938 -62758 74582 202445 104838 -10736 34513 116944 124053 135320
10028 135320 98025 69536 103251 114711 50803 -98258 -257726 -297449 -100541 -8228 -61554
10017 -61554 42912 190072 224384 52659 70386 90563 29398 -38709 -40532 17358 87280
10006 87280 17539 -123405 -213414 -94349 -82447 -5155 129217 17078 -101058 -72784 50183
9995 50183 129334 174985 252521 73533 -55727 -35757 -153896 -243860 -281567 -230468 -303485
9984 -303485 -307410 -328223 -321200 -230395 -242132 -45719 20493 98201 -75023 -161600 56496
9973 56496 160584 166597 -6232 -56248 -72814 -5246 79389 43848 -52847 -69010 -13930 -41440
9961 -41440 -22373 -113782 -259207 -240503 -257269 -356963 -405561 -320070 -135470 -177379 -182975 -194944
9949 -194944 -61383 -58676 7815 12832 26909 -46130 -141688 -206279 -30218 209672 439742
9938 439742 380703 275721 186996 135758 52110 1298 -79584 -53612 -64171 74491 129937
9927 129937 177178 195619 95599 65388 15681 -114378 -207521 -154698 32216 123418 81110
9916 81110 60556 153674 -11765 -112003 -133284 -30550 167775 43284 -69104 -37999 103209
9905 103209 287066 268189 277874 302140 177809 203020 265342 342911 290514 129040 -39825
9894 -39825 -51325 17949 89585 181291 66212 34789 -79706 -128245 -100266 -114121 -106588 -79762
9882 -79762 50050 -37864 -11657 49429 61458 12368 27704 -23778 -157424 -291346 -338724
9871 -338724 -195314 -198452 -277558 -218103 -47850 18301 68877 125538 115428 21841 59687
9860 59687 81961 248398 324147 319127 84052 20252 22798 -113730 -71628 31436 58995
9849 58995 -11710 -22318 169260 108395 23275 153063 229473 49526 -27409 28945 -42120
9838 -42120 -62111 -162044 -196663 -81844 -18743 -55713 -113332 -130593 -117409 31293 17722
9827 17722 -275932 -265618 -3627 98412 30565 -110579 -190463 -154885 -126461 -290410 -276529
9816 -276529 -163763 -283868 -287154 -59697 101717 298562 344058 382873 393409 317828 342871
9805 342871 337282 219730 240563 28825 -74015 -129422 -108102 -187854 -207519 -241993 -225485
9794 -225485 78304 32480 46662 108229 13089 54570 -55929 -244676 -292085 -234805 -298471
9783 -298471 -271050 -60224 -82372 -102140 -5631 92349 98115 2554 -14582 -2794 53803 172334
9771 172334 98562 135351 152185 17366 -119842 -120955 48422 -3798 -24976 -25795 -21672 -509
9759 -509 -353317 -454889 -255898 -48426 202325 221543 85385 -116046 -275260 -283181 -381549
9748 -381549 -326163 -262411 -92008 -192494 -113349 -85354 92674 250419 284781 267379 251873
9737 251873 268584 188206 184317 168016 137356 168404 271368 242384 69759 130676 136658 69009
9725 69009 -48282 -2310 19606 -75926 -140048 -52569 -187 -52525 -32739 133110 116658
9714 116658 46106 61190 -67555 -196873 -106248 -56756 -72465 -2797 75223 155895 163505
9703 163505 241256 163584 -143850 -151064 -82084 -203049 -383487 -127049 15480 -36695 41587
9692 41587 99734 226939 276801 253419 316819 226227 188059 162590 287434 253732 232647
9681 232647 215221 52123 150221 123119 -15431 43361 10438 56902 220997 147827 50876
9670 50876 193322 108941 40802 26152 177058 369434 348383 259934 81117 37457 -220
9659 -220 -59112 -68798 -141270 -169495 -149951 -101435 -84857 -95901 -132277 118623 201488 39795
9647 39795 -18232 -75389 -161856 -186643 -102419 -136367 6684 -52377 -262056 -207944 89349
9636 89349 27265 82669 182588 53076 36347 -28172 -6992 16301 199630 159704 98830
9625 98830 48857 31976 268551 196579 92380 54640 177614 263709 269762 182580 105313
9614 105313 117887 237873 211319 64833 -27605 -35771 -34927 -96727 -166542 -227756 -257144 -147197
9602 -147197 465 -37058 -22813 27309 -115651 -51413 -28719 -106191 -155159 -77988 -179863
9591 -179863 -127385 -63607 53940 114091 27292 107848 18595 -144418 -184699 -54986 3752
9580 3752 -19571 -77045 25035 44844 173130 422934 397618 314393 289377 208146 106582
9569 106582 -18475 -27070 -103370 -78480 8781 335715 322929 194958 237814 227674 102840
9558 102840 217735 158844 163922 110111 73813 24063 -86791 -165580 -177373 -14397 244956
9547 244956 333355 374614 374536 374361 206125 71993 -74195 -5164 194359 156256 68814 -80058
9535 -80058 -88390 70065 107070 55064 130141 163379 46976 10036 44694 155413 227487
9524 227487 473146 484567 376875 157209 94919 74391 52884 151746 12290 -203998 -109093
9513 -109093 73054 136132 -5971 -57452 -32837 -94234 -136390 73168 119090 85144 23094
9502 23094 17959 183749 120134 36299 17522 177355 264217 235988 40270 77497 219312
9491 219312 237554 167285 229080 445334 310008 218881 77464 46792 -37830 -268345 -237031
9480 -237031 -58752 138559 -36677 -205292 -216727 -273403 -220482 -187352 -47518 161359
9470 161359 55477 96137 147687 24928 -3155 -68106 -104840 84758 125134 82119 121525
9459 121525 17328 47792 35251 135633 257639 397618 430880 424997 484586 486691 507916
9448 507916 498556 287302 108111 112199 149218 39406 -72094 -4629 188795 172350 182409
9437 182409 145163 147747 218285 424085 507932 420164 257949 362444 390464 297765 369437
9426 369437 521444 616685 566332 643106 619919 602796 597556 564111 436832 202241 84557
9415 84557 201597 354549 471518 721593 918977 845817 804708 834529 731560 862579
9405 862579 889166 840898 824442 763613 749771 843513 827244 953786 1024920 1107072 1116425 1252080
9393 1252080 1291719 1442666 1393442 1488021 1680906 1680025 1822878 1962605 2144238 2377360 2493826
9382 2493826 2737275 2961226 3298482 3679007 3983917 4376561 5008201 5923059 6621897 7387486
9372 7387486 8084115 8841515 9694352 10492562 11611664 13283777 15420846 18266218 22039261
9363 22039261 26965767 33635519 42486617 53217169 63821485 71063970 74018084 71444992
9355 71444992 62331041 48456549 35766562 27368173 22025475 18600478 16450304 15024881
9347 15024881 14027558 13373964 12971824 12725414 12690910 12922704 13094511 13665029 14405792 15430434
9337 15430434 16528777 17849778 19189428 20563652 22024091 23456736 24932129 26758676
9329 26758676 29658949 33812516 39294446 46472800 56255308 69413093 86972489 108725996
9321 108725996 129803601 143351420 148821676 142484812 121746358 91475446 65677868
9314 65677868 49159556 39109606 32776924 28477082 25375600 23043300 21179553 19722258
9306 19722258 18498165 17715957 17116043 16389996 16125219 16132752 16372410 16726320 17102364 17558737
9296 17558737 18195283 19121850 19768761 20427589 21263796 22311806 23878419 26113071 29213103
9287 29213103 33634252 39724524 47621399 57216610 66715829 72818494 74762579 71367429
9279 71367429 61624458 47470118 34874097 26481765 21169337 17769274 15415898 13695678
9271 13695678 12464249 11459436 10563221 9705726 8966998 8301691 7678364 7395207 7213850
9262 7213850 7035053 6871025 6690559 6655885 6433784 6207015 5973815 5821697 5759981 5516152
9252 5516152 5275954 5105028 4916617 4544216 4336086 4059084 3652410 3544078 3311570 3039427
9242 3039427 2869864 2717173 2657834 2515569 2332061 2174279 1988964 1919341 2035597 2095534
9232 2095534 1938677 1800642 1712784 1609986 1380688 1389621 1488066 1535816 1583149 1582400 1379899
9221 1379899 1157172 901714 790578 830053 867310 872846 785574 812101 728728 496655 454482
9210 454482 500124 613756 720910 609470 490834 544102 547701 507242 454996 543990 730912
9199 730912 769331 665601 708959 889101 901628 843199 962834 1066137 1092102 1003747 787269
9188 787269 715725 766742 799239 850866 880379 736524 633921 672066 679943 541174 546018
9177 546018 514635 452242 607781 554056 481359 573772 733355 683524 554537 636692 646340
9166 646340 634472 449003 528250 677903 714818 611418 458122 485206 509119 859316 1023383
9155 1023383 1093980 1009490 826725 784665 826050 723569 706631 629912 604424 500593 483335
9144 483335 637089 645676 579204 582677 753472 864845 731939 629114 603227 471140 467595
9133 467595 755992 893510 819613 882258 951787 1001614 928059 1039888 1147431 1298692 1422808
9122 1422808 1552113 1687443 1785095 1984550 2225949 2395012 2555718 2969395 3465249 3846970
9112 3846970 4448953 5028877 5577641 6300342 7022817 7834936 9057012 10419597 12142646
9103 12142646 14678722 17960561 22217445 27963704 35973909 47097471 60919524 73574987
9095 73574987 80963854 83686063 79076041 65262151 46021891 31477605 22936710 17767444
$$ [...]
##END NTUPLES=NMR SPECTRUM
##END=
