##TITLE=Analysis number 311962
Compound Code cd 00793
Project Code adrs
Chemist Name endeavour
##JCAMPDX= 6.0         $$ Bruker NMR JCAMP-DX V2.0
##DATA TYPE= NMR SPECTRUM
##DATA CLASS= NTUPLES
##ORIGIN= Bruker BioSpin GmbH
##OWNER= NMR
$$ XWIN-NMR		Version 3.5
$$ Wed Jul 20 15:23:06 2005 GMT Daylight Time (UT+1h)  MAYBRIDGE\NMR@NMR_250MHZ
##.OBSERVE FREQUENCY= 250.131544655141
##.OBSERVE NUCLEUS= ^1H
##.ACQUISITION MODE= SIMULTANEOUS (DQD)
##.ACQUISITION SCHEME= undefined
##.AVERAGES= 16
##.DIGITISER RES= 18
##SPECTROMETER/DATA SYSTEM= dpx250
##.PULSE SEQUENCE= zg30
##.SOLVENT NAME= CDCl3
##.SHIFT REFERENCE= (INTERNAL, CDCl3, 0, 16.522)
##AUDIT TRAIL= $$ (NUMBER, WHEN, WHO, WHERE, WHAT)
$$ ##TITLE= Audit trail, XWIN-NMR		Version 3.5
$$ ##JCAMPDX= 5.01
$$ ##ORIGIN= Bruker BioSpin GmbH
$$ ##OWNER= NMR
$$ C:\u/data/dgb/nmr/ADRS/6180/pdata/1/auditp.txt
$$ ##AUDIT TRAIL=  $$ (NUMBER, WHEN, WHO, WHERE, WHAT)
(   1,<2005-07-20 15:22:41.97 +100>,<MAYBRIDGE\NMR>,<NMR_250MHZ>,
      <created by zg, POWCHK disabled, PULCHK disabled
       configuration hash MD5:
       62 19 C7 07 E1 42 D1 B7 37 6C 3D D0 77 39 F9 E6
       data hash MD5: 64K
       9A 56 76 3A 8D 2F 50 E2 E4 EF 7B 54 38 5A 7E C5>)
(   2,<2005-07-20 15:22:55.30 +100>,<MAYBRIDGE\NMR>,<NMR_250MHZ>,
      <Start of raw data processing
       ef LB = 0.3 FT_mod = 6 PKNL = 1 SI = 32K 
       data hash MD5: 32K
       94 FC 22 ED 7F 42 C1 68 E8 1B 65 43 4C 33 BF E6>)
(   3,<2005-07-20 15:22:57.29 +100>,<MAYBRIDGE\NMR>,<NMR_250MHZ>,
      <apk 
       data hash MD5: 32K
       15 95 B5 04 A2 92 58 32 1F C7 CC 9B C3 A6 74 4D>)
(   4,<2005-07-20 15:22:58.05 +100>,<MAYBRIDGE\NMR>,<NMR_250MHZ>,
      <abs ABSG = 5 
       data hash MD5: 32K
       32 19 D8 C7 8E 40 81 AE 19 EC B8 47 74 56 F0 B7>)
$$ ##END=
$$ 
$$ hash MD5
$$ DC 09 28 FF CD 32 17 7F CF 90 E3 3F 4E 80 09 F2
##$RELAX= 
##$RELAX= 
##$RELAX= 
##$RELAX= 
##$RELAX= 
##$RELAX= 
##$RELAX= 
$$ Bruker specific parameters
$$ --------------------------
##$DU= <C:\u>
##$EXPNO= 6180
##$NAME= <ADRS>
##$PROCNO= 1
##$TYPE= <nmr>
##$USER= <dgb>
##$AMP= (0..31)
100 100 100 100 100 100 100 100 100 100 100 100 100 100 100 100 100 100 
100 100 100 100 100 100 100 100 100 100 100 100 100 100 
##$AQSEQ= 0
##$AQ_mod= 3
##$AUNM= <au_zg>
##$AUTOPOS= <46 >
##$BF1= 250.13
##$BF2= 250.13
##$BF3= 250.13
##$BF4= 250.13
##$BF5= 500.13
##$BF6= 500.13
##$BF7= 500.13
##$BF8= 500.13
##$BYTORDA= 1
##$CFDGTYP= 0
##$CFRGTYP= 5
##$CHEMSTR= <none>
##$CNST= (0..31)
1 1 145 1 1 1 1 1 1 1 1 1 1 1 1 1 1 1 1 1 1 1 1 1 1 1 1 1 1 1 1 1 
##$CPDPRG= <>
##$CPDPRG1= <>
##$CPDPRG2= <>
##$CPDPRG3= <>
##$CPDPRG4= <mlev>
##$CPDPRG5= <mlev>
##$CPDPRG6= <mlev>
##$CPDPRG7= <mlev>
##$CPDPRG8= <mlev>
##$CPDPRGB= <>
##$CPDPRGT= <>
##$D= (0..31)
0 1 0 0 0 0 0 0 0 0.06 0 0 0 0 0 0 0.0002 0 0 0 0 0 0 0 0 0 0 0 0 0 0 
0 
##$DATE= 1121869360
##$DBL= (0..7)
120 120 120 120 120 120 120 120 
##$DBP= (0..7)
150 150 150 150 150 150 150 150 
##$DBP07= 0
##$DBPNAM0= <>
##$DBPNAM1= <>
##$DBPNAM2= <>
$$ [...]
##$SUBNAM7= <"">
##$SUBNAM8= <"">
##$SUBNAM9= <"">
##$SW= 20.6930455092707
##$SWIBOX= (0..15)
0 0 3 0 0 0 0 0 0 0 0 0 0 0 0 0 
##$SW_h= 5175.983436853
##$TD= 65536
##$TD0= 1
##$TE= 295.16
##$TE2= 300
##$TE3= 300
##$TEG= 300
##$TL= (0..7)
0 120 120 120 120 120 120 120 
##$TP= (0..7)
150 150 150 150 150 150 150 150 
##$TP07= 0
##$TPNAME0= <>
##$TPNAME1= <>
##$TPNAME2= <>
##$TPNAME3= <>
##$TPNAME4= <>
##$TPNAME5= <>
##$TPNAME6= <>
##$TPNAME7= <>
##$TPOAL= (0..7)
0.5 0.5 0.5 0.5 0.5 0.5 0.5 0.5 
##$TPOFFS= (0..7)
0 0 0 0 0 0 0 0 
##$TUNHIN= 0
##$TUNHOUT= 0
##$TUNXOUT= 0
##$USERA1= <user>
##$USERA2= <user>
##$USERA3= <user>
##$USERA4= <user>
##$USERA5= <user>
##$V9= 5
##$VALIST= <valist>
##$VCLIST= <CCCCCCCCCCCCCCC>
##$VD= 0
##$VDLIST= <DDDDDDDDDDDDDDD>
##$VPLIST= <PPPPPPPPPPPPPPP>
##$VTLIST= <TTTTTTTTTTTTTTT>
##$WBST= 1024
##$WBSW= 4
##$XGAIN= (0..3)
0 0 0 0 
##$XL= 0
##$YL= 0
##$YMAX_a= 390547
##$YMIN_a= -429598
##$ZGOPTNS= <>
##$ZL1= 120
##$ZL2= 120
##$ZL3= 120
##$ZL4= 120
##$ABSF1= 16.522
##$ABSF2= -4.171173
##$ABSG= 5
##$ABSL= 3
##$ALPHA= 0
##$AQORDER= 0
##$ASSFAC= 0
##$ASSFACI= 0
##$ASSFACX= 0
##$ASSWID= 0
##$AUNMP= <proc_1d>
##$AZFE= 0.1
##$AZFW= 0.1
##$BCFW= 0
##$BC_mod= 0
##$BYTORDP= 0
##$COROFFS= 0
##$CY= 12.5
##$DATMOD= 1
##$DC= 0
##$DFILT= <>
##$DTYPP= 0
##$F1P= 14.0000005364418
##$F2P= -0.99999901652339
##$FCOR= 0.5
##$FTSIZE= 32768
##$FT_mod= 6
##$GAMMA= 0
##$GB= 0
##$INTBC= 1
##$INTSCL= 1
##$ISEN= 128
##$LB= 0.3
##$LEV0= 0
##$LPBIN= 0
##$MAXI= 10000
##$MC2= 0
##$MEAN= 0
##$ME_mod= 0
##$MI= 0
##$NCOEF= 0
##$NC_proc= -1
##$NLEV= 6
##$NOISF1= 0
##$NOISF2= 0
##$NSP= 0
##$NTH_PI= 0
##$NZP= 0
##$OFFSET= 16.522
##$PC= 1
##$PHC0= -76.05461
##$PHC1= 7.687169
##$PH_mod= 1
##$PKNL= yes
##$PPARMOD= 0
##$PSCAL= 4
##$PSIGN= 0
##$REVERSE= no
##$SF= 250.13
##$SI= 32768
##$SIGF1= 0
##$SIGF2= 0
##$SINO= 400
##$SIOLD= 32768
##$SREGLST= <1H.CDCl3>
##$SSB= 0
##$STSI= 32768
##$STSR= 0
##$SW_p= 5175.98343685301
##$SYMM= 0
##$S_DEV= 0
##$TDeff= 65536
##$TDoff= 0
##$TI= <Analysis number 999999
Compound Code 99
Book Reference 9
Project Code 9>
##$TILT= no
##$TM1= 0
##$TM2= 0
##$TOPLEV= 0
##$USERP1= <user>
##$USERP2= <user>
##$USERP3= <user>
##$USERP4= <user>
##$USERP5= <user>
##$WDW= 1
##$XDIM= 32768
##$YMAX_p= 375638724
##$YMIN_p= -176613
$$ End of Bruker specific parameters
$$ ---------------------------------
##NTUPLES= NMR SPECTRUM
##VAR_NAME=  FREQUENCY,     SPECTRUM/REAL,   SPECTRUM/IMAG
##SYMBOL=    X,             R,               I
##VAR_TYPE=  INDEPENDENT,   DEPENDENT,       DEPENDENT
##VAR_FORM=  AFFN,          ASDF,            ASDF
##VAR_DIM=   32768,         32768,           32768
##UNITS=     HZ,            ARBITRARY UNITS, ARBITRARY UNITS
##FACTOR=    0.157963299565203, 1,           1
##FIRST=     4132.6476996994, 0,             0
##LAST=      -1043.33573715361, 0,           0
##MIN=       -1043.33573715361, -176613,     0
##MAX=       4132.6476996994, 375638724,     0
$$ Real data points
##PAGE= N=1
##DATA TABLE= (X++(R..R)), XYDATA
$$ [...]
22438 -4744 5972 17439 15094 15610 30128 34039 24101 11206 5783 -675 -8729 -4466 -88 -266
22424 -266 -10097 -13273 -3465 -8851 -15131 -21039 -14539 -15170 -18960 -12847 -5217 -18230 -13676 -6483 -6637
22409 -6637 -22672 -32423 -43272 -29848 -27407 -23470 -11816 -4790 -5013 804 -721 546 749 754 2186
22394 2186 2703 4742 13769 16357 8740 9294 1449 -1785 8015 18397 5638 5657 18761 7129 -2078
22379 -2078 -3035 886 4055 -12846 -11417 5228 21747 12253 -3388 -11875 -19896 -20878 -17221 -19202
22365 -19202 -17744 -6621 4657 3704 -3475 -6242 -5725 934 -2486 -8671 1875 14313 22669 16872
22351 16872 8845 3701 4815 4017 -2611 -9081 -5852 -8884 -9758 -10784 -8155 -4008 -13441 -30891 -25892
22336 -25892 -23459 -12060 1882 10121 12169 19041 20048 10933 11134 9530 3745 -3398 -3592 4446
22322 4446 14215 26788 17363 15681 7152 9713 10699 7594 330 -1436 -8179 -3491 1497 7522 -890
22307 -890 502 -921 172 5076 10377 14067 11109 4089 13237 23302 20934 16522 12887 6216 -10744
22292 -10744 -20096 -24431 607 12957 4812 -2519 -366 4593 1553 3412 7326 665 -8662 -10517
22278 -10517 -1560 8924 12581 17148 14579 28116 22248 3155 -7842 -1442 12094 2046 -3169
22265 -3169 -8962 -337 4403 -121 3981 3489 15131 20899 11456 -5366 -3127 -2847 -792 934 -12348
22250 -12348 -10169 3236 5380 -1451 4323 9101 7092 14360 15336 10861 -3671 -11408 -9773 -6288
22236 -6288 -1233 474 2675 9196 8689 17581 13163 16129 9109 7234 1268 -8035 -12694 -7929 -7212
22221 -7212 -5213 -19846 -27249 -28740 -12923 -10203 -7405 3085 836 -3111 -4987 -8299 -12403 -1006
22207 -1006 17169 18555 5496 -3597 -11055 -15582 -9176 -11740 -23494 -13652 -5617 -8721 -17631 -23408
22193 -23408 -11360 -4747 -8895 -3246 -16595 -21367 -24740 -31632 -36278 -32257 -12653 -3230 2860 2134
22179 2134 -928 4944 6893 9740 7862 -6394 -9863 -2264 14961 12819 13615 12223 5964 4102
22165 4102 8642 16058 10605 11153 13 -15927 -14945 -3290 9525 11450 6291 10191 13762 5417
22151 5417 -22979 -24101 -20696 -8271 3155 -15260 -23665 -18409 -10656 -12441 -9929 1355 -9227
22138 -9227 -11058 -7987 1410 9507 12190 1340 1249 1757 -11514 -9590 -6031 -2046 -423 2579 -2243
22123 -2243 2079 -2621 -9391 -3188 12651 17503 14260 16859 32135 30237 15529 2567 -8241
22110 -8241 129 3245 -880 -5855 2377 -6494 -7222 -17176 -18134 -10884 -4470 -302 3241 2754 4013
22095 4013 -2267 -6944 -4152 -259 -2446 -3215 -2860 -5548 -18300 -25541 -21359 -4122 -2838 -5092 947
22080 947 9705 8286 8165 5620 10397 17851 17814 8253 16879 22576 16930 2695 -1990 737 -9623
22065 -9623 -18038 -24314 -20968 -11018 -14790 -8608 -3192 2088 -3952 -25807 -23050 -12633 -2513 -10453
22051 -10453 -8834 6106 7537 49 -12946 -13192 -7166 -7305 11847 24585 19540 9030 4928 1492
22037 1492 5293 10305 3359 2147 -994 455 7069 4175 -2098 -2518 -3474 2425 852 -2386 -4371
22022 -4371 -4985 -69 14539 12180 8643 4743 -7012 -21978 -16758 -9015 -862 3440 -159 11156
22008 11156 16911 12202 7645 6126 11876 17314 8161 1699 1460 200 -7343 -10091 2009 3205
21994 3205 -9170 -12814 -13765 -3502 -7050 -4557 15301 18207 11088 21488 23473 19132 6495 -9263
21980 -9263 -13425 -19739 -9367 -6109 -11264 -7833 -4246 1222 3330 7588 12407 9223 5529 8479
21966 8479 11659 15978 5829 3157 -3947 -14441 -20298 -23505 -16128 -19906 -15438 -3773 -3976 -6454
21952 -6454 -9959 -8873 -9336 -4410 -3355 7050 10906 17526 9478 -2732 -2957 -791 1616 11766
21938 11766 13827 5901 2588 -7001 3138 1152 -12823 -17481 -14286 -10771 -3752 1464 1311 -444
21924 -444 -5458 -2032 5888 -1812 -10425 -5454 10081 21252 15623 1897 7609 6790 -8972 -12880
21910 -12880 -2273 3429 7463 10674 10650 7123 6854 14804 11931 12917 8613 -693 -6976 -4337 -14739
21895 -14739 -26900 -24820 -12185 -3375 7038 12218 13510 8083 4935 4118 7839 7433 1701 1163
21881 1163 3798 -2913 -1281 4061 10197 6015 543 -2191 -9568 -17637 -20664 -10924 -6307 -6982 -9399
21866 -9399 -21250 -9657 14600 25090 19944 14717 5541 2990 -4383 -10859 -11561 -2478 -1631 -1844
21852 -1844 -6262 -5745 1836 10140 6142 -5468 -2808 -5654 -10827 -30150 -31575 -20301 -6715 -8893
21838 -8893 -11455 -13373 -3930 -6071 -2943 4828 12359 11719 6724 1933 7142 4812 5625 13405 20117
21823 20117 7003 -2033 10618 17160 19000 14099 10931 -1304 2388 14878 231 -8981 -15588
21810 -15588 -24331 -18899 -2973 3239 1534 -2514 2217 7015 8878 -3659 -7475 12822 16322 14289
21796 14289 13808 18514 8532 -1931 -5829 -3204 395 3825 1178 2018 -926 -4361 -408 6644 8356
21781 8356 -452 -1777 -2693 1453 -1495 -2867 -3243 -9092 -18472 -16106 -9565 -13464 -5534 6291 1435
21766 1435 -1627 -6586 -5566 4152 7116 -3723 -18174 -30480 -35311 -27363 819 6067 4854 5418
21752 5418 -2528 -3829 -10930 -17468 -20099 -23399 -21989 -13610 -9949 -10447 -13556 -19960 -19916 -22903 -17713
21737 -17713 -4678 -13305 -15701 -1276 1013 -6303 -11161 -13843 -6632 -4158 -812 -3405 -11195 -3807
21723 -3807 6490 21182 22590 12115 -4303 -11378 -17319 -14845 -12557 -20552 -14405 -16081 -8747 3590
21709 3590 -152 -15948 -21869 -16055 -19450 -23127 -23766 -14119 -4693 3007 -4333 5270 13766 9951 2674
21694 2674 -1909 -6488 -15200 -17529 -2893 5742 -1110 4351 7022 -1392 -2745 -6 -7118 -7433 38
21679 38 -4175 -2384 -7926 -10528 -12457 -13835 -20167 -16442 -3299 -1985 9970 1985 6443 425 -14564
21664 -14564 -13871 -4054 -7637 -12663 -3925 -7763 -20920 -15079 -7157 -9230 5718 17622 12915 7698
21650 7698 10895 16286 15021 6794 1988 -7899 -19543 -11130 2503 1422 -2987 -2896 5916 10874 5661
21635 5661 9446 8878 15759 13726 14822 8109 1919 3849 1888 1420 6963 17635 15887 10191 -4413
21620 -4413 -14425 -12282 -403 5016 3893 5651 10520 5194 4491 46 5476 4653 -7353 -5576
21606 -5576 -5056 -1887 -5761 -12480 -8593 -4899 -3565 -15186 -11562 1052 -503 -3882 11580 20241
21592 20241 26036 24234 29049 21101 7226 -4736 -14023 -4391 2036 3106 -3946 -742 1886 5767
21578 5767 -3505 -3626 3469 3546 -1527 -9384 -13784 -7164 -5848 -2231 -4451 -1980 3608 13338 6038
21563 6038 -1592 -8324 -14046 -8138 -1044 9900 10498 5620 7264 -988 -12400 -2412 3597 2247
21549 2247 2646 3723 2945 -7850 -12218 -5256 -6417 -11348 -14380 -13865 -10375 -13569 -20024 -11020 -10209
21534 -10209 -14379 -10495 -16545 -24244 -11138 -20885 -26513 -11621 -3271 3708 -265 -3630 -4213 -12228
21520 -12228 -15800 -6815 4390 1964 -11049 -26910 -15617 -9377 -10410 -13329 -22110 -10154 -9844
21507 -9844 -6892 797 1125 -4591 -17965 -19809 -12118 -21209 -28571 -12277 1300 -4161 -7308 -12113
21493 -12113 -1008 3536 -18295 -30514 -29806 -20155 -16575 -8665 -3158 -5326 -4073 -1563 -752 2065
21479 2065 3323 8340 7253 15932 22287 24029 18927 -5918 -10035 -15726 -14230 -2652 6331 15191
21465 15191 12817 -4359 2917 8056 -4099 -15558 -28224 -19985 -5770 -8433 -21807 -20915 -19270
21452 -19270 -4971 -6545 -2962 -1074 -2084 -284 -6112 -9083 -21791 -23911 -11468 -9332 -13616 -12391
21438 -12391 887 7973 -495 1657 6290 9931 8690 9292 -4201 -18219 -17436 -16442 -7353 2135
21424 2135 2736 253 3112 6741 -530 -9841 -2905 8003 9329 10849 27577 15812 -4375 -21276
21410 -21276 -20161 -17479 -12154 -10789 -8122 -7468 -12567 -18324 -18324 -5642 3439 -875 -1232 -5945 -2373
21395 -2373 4148 556 -23 -2570 2719 5406 7352 9042 -1734 2106 4014 1676 355 1756 5830
21380 5830 -5183 -17654 -19060 -20512 -14344 -12355 -17924 -4934 -6150 -15144 -6931 2076 -160 -2160
21366 -2160 -9031 -15785 -30213 -34174 -20245 -3439 809 112 973 8698 7670 5732 11562 13207
21352 13207 8051 3043 -1079 5074 5262 -7516 -9858 -5788 -3511 6304 5972 -2310 -11766 -8832 -7447
21337 -7447 -13238 -21338 -14823 -8542 -13243 -18443 -10302 3511 343 -7739 -10129 -10116 -7650 -7272 6302
21322 6302 9807 4281 -3156 -6998 -11271 -12061 -4150 -2558 -13582 -12749 -3674 12559 24783 25201 17002
21307 17002 9420 7633 14722 6518 9343 24484 25162 16961 6600 -3093 -4077 1034 2358 -2708
21293 -2708 1984 7980 6163 -4127 -2220 -3548 -4821 -3134 3450 342 -8919 -5403 -11789 -5043
21279 -5043 7955 474 -9846 -10064 -15742 -13446 -3817 -798 -5234 1698 7307 14885 12730 11688
21265 11688 6548 9381 18159 19172 17140 13391 9753 -64 -9060 -2036 -2451 -8752 -4681 -3036 -1425
21250 -1425 2988 -101 -11700 -8157 -6516 -11745 -8080 -3632 -6502 -4973 2755 12756 25233 28494
21236 28494 23625 22384 19924 19672 14560 9843 14029 18495 11968 13761 2521 -9175 -4827 12030
21222 12030 24952 25610 7813 -8976 -17033 -13349 -1563 12046 22058 18669 14747 18347 11064
21209 11064 23717 30227 12697 3190 13879 13992 -880 -11811 -5740 -5394 -12742 -15099 -3062
21196 -3062 3108 9302 -151 -4675 -10650 -6068 -16685 -24726 -10395 -11466 -8522 -17223 -24570 -16864
21182 -16864 -8591 -9439 -15456 -19178 -18525 -12452 -3147 3593 1325 -4263 -11727 -11870 -9041 4002 2302
21167 2302 -3827 -894 6762 8775 -5728 -7544 -5625 960 -1932 -9939 -1840 -2064 -6693 -1535 7620
21152 7620 4127 6760 13976 2196 3169 7163 -127 -863 -9175 -19792 -28328 -27122 -20481 -14293 -16462
21137 -16462 -21084 -13377 -6308 6889 -5700 -9829 2541 8844 2325 -4353 -10282 -10403 -9537 -12041
21123 -12041 -3902 13274 16317 -432 803 7982 2639 -2318 6969 8617 4085 8495 8215 16943
21109 16943 11009 -2937 -3019 -3484 1077 6123 -662 -15616 -10885 -3900 117 334 7716 11307 5884
21094 5884 4095 -94 -896 -739 -2930 -1775 -1540 14043 23002 20073 15640 1135 -11068 -13155 -10648
21079 -10648 -6256 -10507 -17842 -11873 5838 17291 7809 -75 2002 9485 -7631 -9847 3769
21066 3769 5015 10007 7913 -4403 -6390 -6741 -1476 1047 8428 5984 6690 -11725 -25699 -23933
21052 -23933 -18923 -18667 -4662 -2230 2092 10122 3402 6513 9483 13182 19640 14243 5738 714
21038 714 -2106 -4813 -8021 -13302 -21383 -22343 -17382 -6969 -9497 -28048 -24017 -4727 -2520 -4224
21024 -4224 -3058 -6540 -14530 -6129 -1975 -5582 -15612 -13711 -4743 696 2922 1302 2877 14705
21010 14705 1157 -12135 -9589 -9526 -6264 5624 6479 -5359 -1992 -1614 -10161 -6105 -11309 -14297
20996 -14297 -14383 -2162 281 8627 8276 313 -3460 1691 -1874 -13706 -16931 -4667 5767 3146
20982 3146 10419 14117 18090 19775 17792 17015 10807 -3155 -11378 -3821 5988 -148 10480 3022
20968 3022 -521 5230 8999 -1462 -5454 -10800 -12964 -9927 -4315 -17141 -20044 -23925 -13668 -9494
20954 -9494 -16481 -9363 5136 6880 11243 3882 3137 10207 2484 -3661 -9098 -4408 -10160 -12244 -16267
20939 -16267 -26784 -28638 -31484 -36553 -30232 -25367 -20458 -891 -4903 -18500 -21730 -31027 -36655 -28305
20925 -28305 -18493 -17066 -8457 -1602 -816 10690 14349 2201 -13162 -18453 -4487 4544 9160 9960
20911 9960 9007 13700 11685 6132 9972 21784 22166 7052 5551 1612 -7835 -11704 -6980 5336
20897 5336 197 -2029 -2659 5797 13564 8567 -2425 -4990 2142 8682 16130 17542 11004 17687 9257
20882 9257 8178 15332 20828 6898 -9920 -9485 -3539 2249 6609 8721 8783 17295 12028 13148 18676
20867 18676 12622 9539 -158 4433 -3674 -5799 -1826 5311 12713 7588 -9328 -12854 -13954 -10754
20853 -10754 607 7946 1692 3659 7024 3268 6722 2003 24 -2781 3681 1675 -8730 -12055
20839 -12055 -4900 -5150 -15076 -11572 -8018 3361 6978 -2525 177 9400 15895 26275 15953 20090
20825 20090 8612 9734 17568 15951 2798 -12664 -29225 -14967 4176 15428 19432 10435 3641
20812 3641 3701 7223 9988 -8383 -9368 246 14301 17358 16451 13979 5276 -1603 -15528 -11377 -1059
20797 -1059 -524 -2929 -6352 -815 1591 17366 30286 15519 2774 -5373 -14605 -6982 6689 17665
20783 17665 19143 14079 23310 26017 22619 15822 -183 -13848 -19634 -17860 -12261 2126 7376 6077
20769 6077 4338 133 536 8345 -1846 -10979 -19108 -15604 7159 16922 19962 8555 2723 -2164
20755 -2164 2216 2116 11653 13785 16069 15814 20223 19890 14436 12885 6153 6352 6970 -9524 -2421 374
20739 374 8728 4055 -10494 -12034 -10833 -7244 -10424 -2401 -15205 -16925 -14098 -15157 -2388 2148
20725 2148 4655 8909 11389 10281 8379 812 -3664 -11215 -14424 -6704 -3911 2211 3038 5133 8749
20710 8749 -2508 -18026 -12579 3643 8037 1185 -12132 -13441 -8845 -5934 -9199 3290 8302
20697 8302 5458 1871 -2440 7089 16383 9370 5316 5466 22923 16894 11080 11388 633 -7639 -4984
20682 -4984 8953 -2907 -5540 1038 10559 11996 8300 10445 12688 15665 14654 13002 7538 4227
20668 4227 7928 4142 -3935 -9128 -9289 -25 12385 19391 20095 11405 -2582 -5428 -3441 -12000 -10197
20653 -10197 -7855 -1385 -1826 -2963 -1375 -612 -8632 -10099 -14127 -14745 -5610 -214 244 -3111 -7732
20638 -7732 -4256 -6783 -2045 5400 8669 3970 -9289 -15261 -14225 -12787 -14352 -14171 -12298 -13213 -11329
20623 -11329 -2280 6478 20005 22756 20015 11715 3510 -105 1491 271 -2365 2691 6524 11622
20609 11622 7524 -2661 -15849 2815 4387 3616 -9060 -10675 8275 15937 9163 -3848 -19323
20596 -19323 -14367 -19649 -17011 -13542 -11239 -11200 -10426 -11746 -12293 -15988 -14364 -4095 -5734 1887 11841
20581 11841 8054 -10095 -20912 -17033 -9182 -10683 -7688 -8884 -5548 8689 17465 3577 -3136
20568 -3136 -7681 -5750 -6184 -6388 2369 7272 428 -2649 -12045 -15354 -17532 -16475 -8800 -7794 -10173
20553 -10173 -14456 -5426 -1817 584 14103 16268 5059 7830 8481 6811 -5249 1554 10944 13699
20539 13699 3648 3653 3060 -8146 -12685 -7843 -7575 -15531 -18393 -10023 -13950 -17692 -26658 -20137 -532
20524 -532 -8300 -11879 -8569 280 14043 7283 -4664 -523 5533 44 -1422 17026 16010 4223
20510 4223 -7595 -15782 -13618 -2630 -195 1203 -15152 -21583 -26270 -22362 -13187 -4265 -2627 -1292
20496 -1292 8153 782 -12702 -23276 -18139 -14807 -14519 -21578 -24357 -20668 -10847 -10719 -7326 -3000 -6483
20481 -6483 -17672 -16642 -11053 -1456 7283 6435 -4387 -9727 -8984 -4311 -617 -9699 -4168 1167 500
20466 500 -1152 -563 285 -7566 -13743 -14868 -3495 -2344 -2484 -3346 -6878 143 10719 4116 -20357
20451 -20357 -34647 -21523 -7985 -9208 -6262 5077 29 -13148 -20741 -28742 -27855 -18756 -15736
20438 -15736 -7130 10110 20986 24053 18542 -4858 -1312 24075 31782 15578 -83 951 4536
20425 4536 2386 -3159 -8086 -4258 -4914 -12237 -6615 5921 14300 9311 12412 13628 1815 2449 -3651
20410 -3651 -4716 -3010 -282 -1996 5531 12084 11989 8935 -1141 -11900 -14130 -7771 4443 10956
20396 10956 -3145 -12252 -3997 -5600 -11677 -15108 -2621 7341 12114 6010 6626 15083 2056 5274
20382 5274 6780 3799 3894 104 1519 4110 5701 8196 3500 568 -617 -955 2734 2050 4588 7883
20366 7883 9914 3710 -3097 -9800 -5267 -2671 5449 8706 12491 7117 -7780 -9200 -6854 -5358
20352 -5358 739 -2121 -2355 -11382 -14517 -9056 398 8422 661 -12852 -15847 -6126 2528 -1618 -5233
20337 -5233 -16831 -15341 -5769 12501 18631 5772 -7186 -11619 -10128 -9235 1484 6802 7930 4574
20323 4574 1630 7296 12545 10878 9193 1375 9488 4636 -19279 -16599 -1934 -1342 3858 12020
20309 12020 6901 -6796 -4686 4209 10735 12126 5289 5304 4108 -4775 -16506 -14047 -16382 -18763
20295 -18763 -22643 -24725 -20071 -16455 -2789 11872 1793 -1544 -4394 -8882 -9971 -6089 -3211 4289
20281 4289 -3785 -9223 -2788 4782 -685 -12301 -20904 -8012 968 -10778 -24701 -20233 -8601
20268 -8601 -2517 -6737 -7053 -9986 -2819 6458 9095 5833 -925 -7445 -5401 -1935 -304 -2959 3755
20253 3755 -6523 -14412 -14206 -5017 2262 4808 17417 18215 12367 5987 4099 -13269 -7778 -6849 -2034
20238 -2034 6452 9965 199 4296 204 -6278 -12437 -28949 -27181 -16030 -10835 -16694 -14789 -12615
20224 -12615 5757 6342 -3673 -16937 -17413 -16329 3550 5159 6168 647 -17533 -24431 -18873 -19356
20210 -19356 -6822 9963 14286 8740 8266 1154 -78 -1281 -9476 -8045 -5031 -11113 -1357 -5474
20196 -5474 -11821 -10228 -12553 -5016 18002 12708 -132 5936 7580 490 2290 17722 15478 9590
20182 9590 591 -11204 -8467 -14209 -23082 -13719 -8189 -7737 -6654 -10102 -25066 -32359 -9405 -9467 -9454
20167 -9454 1607 13580 9739 5262 -2634 1278 1949 -4523 -9656 -12829 -14648 -17406 -12460 -1435
20153 -1435 3139 4469 9763 -1581 -7153 -810 5020 6077 9743 13027 1689 -3954 -4909 2609
20139 2609 4541 3065 -6469 -3054 11816 3935 -12502 -7491 4570 6695 9076 8180 1859 7269
20125 7269 5884 10064 9240 -5177 -15007 -5195 -76 -3472 -3178 -4585 -2741 11497 14681 13792 9744
20110 9744 6021 8645 12269 3113 -5942 -6632 -5883 -7218 -6552 -7125 -7262 -13031 -24355 -20639 -11601 -9030
20094 -9030 -14076 -4811 -9074 -21222 -21853 -17046 -6810 808 7643 -9218 -24621 -17468 -4255 -8440
20080 -8440 -10527 -14862 -11340 -10849 -9131 -3094 -7330 -11568 -21713 -25902 -15737 -18986 -28015 -34009
20066 -34009 -27264 -18334 -11435 1028 2620 -200 -6390 2463 6075 2398 4026 2594 2013 -8692
20052 -8692 -5817 -876 -298 5841 5073 11276 12435 7693 2699 -1681 5798 16846 16023 14630 9668
20037 9668 1590 -7503 877 11034 13468 12997 10983 7834 4318 -17065 -30207 -20310 -928 17651
20023 17651 13616 11101 11287 10934 16713 28734 27417 11271 5291 878 -6851 -10177 -11894 -6231
20009 -6231 -5000 -6432 -10394 -17520 -15892 -10840 6646 4236 15873 21231 10474 -6550 -5890 3163
19995 3163 8277 6493 -5588 -17482 -14325 -7415 -486 -6949 -3592 8131 5223 -899 -4978 -2454
19981 -2454 -756 -7565 -9730 -7254 4647 10104 13323 11692 12020 11504 -1347 -1705 -7692 -6043 -6080
19966 -6080 -6503 -1022 1216 -12964 -21268 -20153 -13643 -21373 -9545 -3816 2628 2650 -9513 -18692 -18900
19951 -18900 -10507 3478 17275 9617 -752 -18533 -13333 -4955 3033 4660 1960 2140 1372 8215
19937 8215 2565 -8918 -9689 -2328 8358 929 -8710 -7947 -10549 -16798 -10385 -8788 -11106 -1179 -2313
19922 -2313 -6163 5964 8987 8106 11915 9593 6385 3214 -11687 -17623 -10004 -2903 -452 -5468
19908 -5468 -2028 3785 -2467 12074 9774 2661 3508 -5220 -10559 4071 6533 597 3687 2057
19894 2057 -5854 -16872 -13995 -20972 -13458 -8914 -3511 -7000 1212 1664 -7570 -18533 -10649 -2668
19880 -2668 -5838 9884 15811 13399 5280 -4078 -12859 -9455 -6173 -14875 -9086 -2525 -20058 -20232
19866 -20232 -8535 2138 5286 -566 -9326 -9331 -9448 -11306 -10342 -3909 -5049 -8018 -14359 -14926 -9653
19851 -9653 -4803 5000 12862 9132 -7491 -14892 6003 2537 -482 11156 11977 102 -3123 4011
19837 4011 1584 -10189 -9171 -13685 -10540 -1137 6080 271 2154 3422 1683 -470 15349 21415
19823 21415 10008 -14286 -22086 -20421 -19573 -5593 -3923 -13430 -4174 4434 -123 7098 13316 16604
19809 16604 13560 15698 9065 6247 -1146 2784 -1712 -7638 -2113 -3501 -7599 -15435 -25312 -31041
19795 -31041 -24945 -16589 -12126 -3248 5169 -7662 -23620 -19893 -10805 -5710 4419 10941 11598 6286
19781 6286 11071 13701 21317 20188 14983 19445 16521 13481 14654 3214 -4494 6136 16436 15771
19767 15771 6001 -6601 -15744 -25098 -18134 -1259 -4987 -2593 -4159 -7022 4862 25826 26590 17993
19753 17993 3632 -5452 -1096 3675 4814 14061 6852 -3965 -10286 -8946 -7622 -7523 -15702 -14032
19739 -14032 -6053 -3595 -11995 -13328 -10067 -11615 -2180 -9197 -8675 7638 12268 6398 3980 954
19725 954 4672 5624 7430 901 -9321 -13851 1041 10407 5532 -6678 -15652 -14017 -4070 -2756
19711 -2756 1869 3127 -4078 -2037 -3050 -1921 3749 11634 3947 -10571 -17526 -17548 -16534 -3488 10593
19696 10593 13289 -416 2158 15080 6449 -10188 -12458 -5843 -5545 4657 13880 22422 14967 -1000
19682 -1000 1986 7281 983 -7433 -13761 -15003 -6651 -17168 -23078 -18655 -8408 3740 7143 3946
19668 3946 15150 2735 -11245 -8996 -3110 7049 14836 9940 13489 11646 9033 -803 -632 -2780
19654 -2780 -14086 -7411 -9744 -19286 -11151 -5130 -12543 -10089 -6885 -6280 4703 13963 17804 15394
19640 15394 13040 9260 4794 180 4570 13483 8504 -6671 -11346 -20956 -36742 -33873 -20660 -3580
19626 -3580 -3906 -6402 2012 6049 258 7150 10915 9891 2177 -1995 1289 11546 18481 7112
19612 7112 5003 3671 -6323 -15553 -25302 -33931 -30073 -7419 7344 -2779 -6107 -14765 -20253 -15941
19598 -15941 -8282 -6693 -1752 12165 13091 20269 9400 -1749 -12364 -14497 -2495 -10755 -6496
19585 -6496 6706 7389 -6008 592 6855 10520 -2931 735 7169 6176 8320 3892 2999 7257 1333
19570 1333 -119 -6409 -1674 -3709 -1989 -8097 -10392 -8191 -3949 7273 -80 1413 6217 492
19556 492 6192 -1923 -6392 -12057 -5711 -90 -10311 -3412 3083 12441 15568 8121 -616 -4265 -19552
19541 -19552 -10947 -4270 -7863 2021 1686 -6378 3688 19351 18886 -28 1844 -3690 -10789 -10032
19527 -10032 -16003 -8571 -7090 -4526 14034 8578 -13680 -16134 -9487 -8629 171 5699 -2460 1720
19513 1720 6505 -1185 8103 20059 22353 15371 -1605 6069 7259 5807 10617 14832 16507 13700
19499 13700 -3626 -17577 -13781 -2628 9952 4891 -10680 -1547 13899 9579 17513 27739 22027
19486 22027 17490 17564 10697 8315 15003 3164 2716 13067 -2648 -16757 -12400 -9499 -14931 -16698
19472 -16698 -18009 -7678 -3739 -1647 -4904 -11199 -21895 -25962 -25019 -9972 -2747 7832 10080 -4890
19458 -4890 -17102 -20932 -11832 -13124 -5305 8829 11837 7099 5773 2875 8498 17123 20014 15611
19444 15611 12524 6640 11788 12120 10779 1851 -8482 -18662 -17974 -5938 -11713 -5451 -7595 -17677
19430 -17677 -13126 -7952 -635 494 1162 3037 -4741 -10556 -7782 -19885 -12966 -8213 -5663 -12881
19416 -12881 -19776 -17512 -15647 -12563 2066 11172 5443 -10213 -13747 -1757 3962 3661 2752 -6006
19402 -6006 -5333 -1779 1776 -10341 -11766 -12556 -12193 -6784 -7223 -4632 3041 -5351 -13136 -4268 -10698
19387 -10698 -23303 -19795 -11027 1459 13546 8955 -2789 -7522 8774 14236 68 -7793 -1938
19374 -1938 6614 15302 19637 9778 -2445 -14342 -12656 469 9987 9318 2280 -6916 6670 18763
19360 18763 15132 14305 15000 13324 5016 -7469 -9401 3440 8557 6137 1255 -34 -1820 -350
19346 -350 3338 7853 8000 8818 12175 12834 7482 2794 2620 -2201 1054 -6265 -7281 -3146 1479 4803
19330 4803 9034 4192 4122 7003 -2671 -16812 -10817 4066 -3651 2213 7349 -3135 -7091 -12947
19316 -12947 -4518 -2034 319 4868 567 -7319 -15616 -17627 -8982 -8142 8232 11254 9719 7785
19302 7785 8776 4144 -3010 557 -1035 -3876 -265 -260 6594 7742 14144 11038 2663 -2897 -966 10592
19286 10592 16665 9002 -624 7286 12177 16701 23543 22024 23028 19714 10484 14118 20964 16790
19272 16790 445 -9063 -1093 1328 -10386 -14562 -9446 -1744 13778 20534 10275 -1059 -7057
19259 -7057 -4249 7353 3003 -7934 -9470 -13509 -17387 -17137 -12722 -12588 -8230 -10610 -13936 -3116
19245 -3116 -743 2668 -3802 -9160 -14794 -19469 -9226 -6218 -16775 -14963 1910 7749 7560 2429
19231 2429 4167 6623 15278 22933 21389 14820 13886 8726 1390 -4833 -8520 -10980 -7147 -8423 -6856
19216 -6856 -7466 -13894 -21188 -12081 -5902 -5115 3390 3395 3739 3339 -2271 2527 -2777 -910 -2927 -2947 -9378
19199 -9378 -15777 -14452 -9479 -2661 2401 4109 4400 -8392 -21311 -29954 -18287 -745 5751 -3399
19185 -3399 -2865 -6580 -12364 -14590 -8753 2871 -362 -1585 2558 3166 9171 9081 4023 5330 -144
19170 -144 -8155 655 11273 252 -20090 -8503 13576 7515 -2020 12843 21543 23178 18966
19157 18966 14893 11882 7020 7537 10134 17800 25300 17353 9061 1061 -10955 -6628 3329 2124
19143 2124 13967 18244 9783 -3416 -22210 -28671 -15725 -16503 -10342 4711 12920 19882 17615 16478
19129 16478 3983 -5119 -10957 -8834 355 1355 -6627 -2855 -8389 -5427 995 5711 6622 -1007
19115 -1007 -907 -1245 -18197 -22474 -19037 -2613 -194 3169 11015 10503 11284 7715 14905 13894 4996
19100 4996 3557 10174 16939 24319 17730 3033 -15238 -17304 -18977 -14855 386 -10397 515
19087 515 11025 11151 9437 13440 -1139 -8598 1758 16657 18368 26994 41766 44275 24440 10025
19073 10025 2538 9722 1678 -2100 -8741 -20717 -20796 -16419 -19496 -29098 -29968 -23345 -19171 -5685 6669
19058 6669 3060 5065 423 -9287 -2477 16495 17332 6797 2535 -3139 -9583 -3206 16246 29385
19044 29385 19219 -114 -798 3597 11525 6553 16770 18335 590 -5452 4406 5437 -10345
19031 -10345 -23185 -27305 -18178 -11018 -7762 -5896 -6635 1464 -4439 -9821 -6111 8870 6711 -8123
19017 -8123 -2855 2404 8791 18733 21116 14600 17052 9666 4783 12892 20562 15765 11993 -6429
19003 -6429 -10348 -21996 -5593 -874 -6858 -7640 -8586 -6901 -14401 -9355 -3807 9150 14566 1010
18989 1010 279 11946 8308 -6366 -16937 -18859 -9379 -13748 -18174 -11659 -3196 -8311 304 5047
18975 5047 7414 20937 19284 20567 20790 8934 -493 -6001 -2356 -9437 -15457 -16217 -10670 -3358 3467
18960 3467 775 -5118 -13310 -14395 -13365 -7970 -2395 3640 -1451 -772 -450 6237 6541 -206 4199
18945 4199 9962 10880 9622 6637 1703 3583 -469 -3346 2909 15365 7190 -8725 -7587 -8311 -10113
18930 -10113 -13545 -13325 -12505 -9244 2145 3441 -1153 -10652 -17654 -20437 -17414 -8139 3102 -2233
18916 -2233 -5616 -7282 -8997 -4118 -10919 -15745 -12208 -19890 -24014 -5535 17795 20956 16203 15717
18902 15717 11204 16791 20040 1347 -11523 -9916 1080 1367 2482 1103 -9933 -8670 -4755 -1231
18888 -1231 -3908 -583 -997 2244 -1265 -1037 6344 20967 21962 7875 -4592 -13617 -9955 98
18874 98 1978 -6357 -14289 -6753 -452 -3691 -2117 6721 996 -997 -574 -4518 -4849 -11679 -7604 -446
18858 -446 4924 138 2206 61 -806 3850 -3980 -8198 -7778 -3812 3951 9965 8049 16478 14543
18843 14543 8090 14274 5994 -3607 3522 8065 5973 2671 459 -2208 -9589 -2443 5039 3704
18829 3704 5973 3140 4542 -4218 -16020 -5731 51 -1480 -10568 -9871 -8337 3479 9843 -548
18815 -548 -1081 -7193 -6974 5116 8380 1492 -291 9391 17302 24407 19940 10685 4419 9068 13073
18800 13073 8618 -4026 -11324 1531 3211 -2667 -13985 -7862 1837 -5220 -22 -297 3709 13438
18786 13438 2571 1085 10580 8260 20078 24228 5924 -3031 -7174 -5381 503 9656 11611 7148
18772 7148 1638 9544 16469 22411 54267 97482 137946 154155 128752 89654 55065 39121 25201
18759 25201 5072 -12351 -19199 -12943 -10539 -19304 -4434 8969 -328 2499 500 -14431 -2112
18746 -2112 4896 1103 -4819 -1836 6380 5785 -319 12537 7967 10802 20787 18867 10735 2062 362
18731 362 -3325 -12715 -13990 -4377 -5654 -16996 -24081 -19748 -15172 -17512 -12472 -3914 -1549 -10444 -8747
18716 -8747 186 -5110 -20140 -28022 -25446 -5151 12709 13320 -3813 -19045 -12743 2259 7637
18703 7637 4999 2553 5705 -3561 -12420 -15776 -13548 5453 22431 18228 7383 7893 8201 3415
18689 3415 -899 -943 -659 -2785 65 7969 -2289 7183 17163 6180 1945 19160 16161 1888
18675 1888 -3491 -11150 -17415 -9526 -8892 -18387 -5668 17177 21750 10533 3348 -1642 -8129 -4411
18661 -4411 -1296 -4855 -9952 -10566 -1971 -1173 -11106 -21474 -8274 -1437 -16343 -19023 -6675 -7307
18647 -7307 -25968 -15548 -14909 -12053 -16852 -11796 -19215 -25606 -6587 8545 8303 5231 10499 7929
18633 7929 5292 17154 23962 13008 4453 15482 24788 21806 17157 3330 4320 10672 -5461 -12903
18619 -12903 -23534 -17398 196 7974 11331 1823 3628 -14619 -26317 -19730 1949 4188 -477
18606 -477 11435 17742 8085 -8410 -4635 5253 10036 12027 6659 -3725 -9416 -8155 -13096 -13688
18592 -13688 -12287 1320 3364 -6716 -2659 -2268 -13016 -5416 7252 -86 -1080 586 6442 -321
18578 -321 850 3807 4771 7056 5832 492 -6725 8547 18008 2831 4422 650 6571 17841
18564 17841 9707 -1720 -5864 -5542 5444 2790 9371 4999 3441 8285 6164 2858 -14887 -14097
18550 -14097 -1618 253 -557 -6455 -5596 -3485 4699 17534 16449 4157 1696 11288 11212 17965 25644
18535 25644 25516 29120 19078 11777 680 -1553 -6235 -731 1592 -4283 -11433 -3646 -10273 -22011
18521 -22011 -21564 -21845 -9912 -7463 -9003 -4680 5746 5888 -750 -6631 -9423 -10906 -14412 -3001
18507 -3001 1072 2846 3167 7241 12431 4321 1394 2305 38 2728 -20178 -20347 -5335 4751 9551
18492 9551 22053 19328 10945 2452 -519 11184 15501 20994 22415 17387 20113 10399 1060 74
18478 74 1821 4949 7877 10948 3447 3476 5962 11436 -2753 -26704 -28632 -5549 7103 9021 11639
18463 11639 8934 12105 14499 18745 14194 -9256 -12177 -16360 -19815 -6734 1355 5246 6548 5220
18449 5220 748 19870 17973 5660 -2490 2288 3591 1948 548 660 -3210 -1823 -5960 -6049 -5989
18434 -5989 8264 9684 4947 13970 10169 6415 483 -741 -4482 -4741 -1051 -7312 -6993 -4059 -10820
18419 -10820 -1098 9076 21371 21433 10339 -4470 2529 1014 -8673 -114 3421 -2129 -12378 -8716
18405 -8716 -10945 -10128 -13539 -18386 -5417 10168 11267 -2194 -9779 -2787 -3207 -10272 -17624 -16648 -9179
18390 -9179 -5296 512 2774 2267 11808 7880 -6315 -12660 -7148 3158 16041 17009 16643 19238 2349
18375 2349 4810 13734 -7957 -21168 -25184 -14092 -2268 6973 12254 15381 10629 7956 10905 1595
18361 1595 -16253 -17856 -7606 -13880 -8772 -6107 3700 13344 12060 5491 10636 5979 3069 10817
18347 10817 5860 -5288 -13897 -5663 -962 -10843 -18755 -11985 -7089 -4847 -1341 5697 9158 11127
18333 11127 968 -9029 -18404 -20389 -23521 -20710 -6474 -434 -883 1216 -1727 -7782 -7007 6915
18319 6915 5913 5079 -5627 -7610 -3548 -541 -7643 3350 10495 7849 10061 16541 30794 25400
18305 25400 7471 1142 7466 3539 -1517 693 -335 3801 2207 8018 9059 10302 10213 -1698
18291 -1698 -1372 -9616 -13235 -18111 -3260 10537 6000 -5227 -2728 -9252 1973 27731 26012 11545
18277 11545 5877 17155 12485 13899 10332 3670 11970 8478 7594 5944 6032 1562 -3497 13184 36053
18262 36053 36825 34453 36770 34798 27526 21465 29496 40674 47507 38898 39188 28079 16339 1166
18248 1166 -6041 -8008 -9709 -5267 -639 2653 858 -970 6797 25376 35849 37336 32880 27190
18234 27190 18587 29322 22359 11804 -2928 -5739 -607 -2570 -5673 -3951 -7985 -1352 1841 17738
18220 17738 15660 1640 -683 13126 20175 23000 20800 26247 26371 21070 10111 1307 142 4290
18206 4290 -1578 -5599 -3093 9135 11116 14744 11737 1628 10353 17470 4044 1466 18620 17481
18192 17481 7790 13898 21313 12642 22741 29922 28526 9332 5220 1943 -8860 -6189 760 -968
18178 -968 12212 17714 21864 28603 31655 29622 20553 21772 32452 48433 41601 34954 38466 24510
18164 24510 21197 20239 17763 22685 41346 57194 57786 47732 55432 69789 80982 76465 75275 82375
18150 82375 80699 83838 84329 70636 67444 76106 89536 84173 84881 98370 109836 117663 123397 135938
18136 135938 148305 157608 171078 193901 192391 188951 206582 246164 296789 351217 392053 425302
18124 425302 468803 525206 590210 667969 794797 949345 1124905 1332855 1584577 1914183
18114 1914183 2384972 3146590 4464717 6884946 11455015 18773320 25085496 24957667 21106054
18105 21106054 16016167 11002488 7106349 4571557 3084747 2207273 1655628 1270190
18097 1270190 1003022 802041 637159 521321 438748 372839 311342 262949 219146 188007
18087 188007 167596 171204 162607 140994 116755 110890 101608 95866 79418 72613 69489 72030 64330
18074 64330 47426 43209 31596 32610 34286 21908 26532 33154 36460 38639 33073 40663 36932 24724
18060 24724 12341 4353 6493 11891 18955 15819 14179 5185 2113 14424 26725 23546 23699 14693
18046 14693 25398 31200 31054 37291 25165 16251 19806 13589 15013 27196 29878 19509 20799 25268
18032 25268 31023 33767 20749 18885 20700 9558 -2424 7508 10202 3758 1460 1635 3784 5899
18018 5899 10426 4252 -7994 -19987 -5988 4365 -1652 -15231 -19866 -23998 -12084 -2682 4919
18005 4919 12861 10031 2052 375 -4648 1131 1948 -2649 -5514 -17365 -18678 -8308 -5795 -4302
17991 -4302 -901 658 -8568 -22572 -25157 -17818 -5449 17775 13121 1286 10765 12809 13460 21032
17977 21032 8405 -3641 -1430 9354 17556 19148 7593 11338 13654 13020 -1455 -15340 -22793
17964 -22793 -24852 -23806 -22241 -21392 -12524 2547 -5295 -25225 -31370 -19234 -214 3752 -11797
17951 -11797 -18633 -16987 -10714 -11074 -4865 -4683 -10897 -5500 4825 4720 -5279 -3398 6683 -1584 -14155
17936 -14155 -14917 -9886 -11200 -10798 -3802 6342 3645 -4198 1654 8469 2507 -11768 -11195 -17234 -17182
17921 -17182 -9688 -6362 -8683 -2009 6206 7768 17144 15773 8041 4672 -4395 707 -3618 -17150
17907 -17150 -17818 -9118 -3543 -3561 4927 17285 18994 17011 17786 14014 9217 5589 9392 4873 -7654
17892 -7654 -12930 -4788 -2633 10587 1945 1718 10541 -7112 -21061 -25102 -24343 -16791 -10035 -7122
17878 -7122 -6856 -4769 -1897 -5607 2368 -4409 -8048 -8645 -18030 -8233 8372 1694 13457 18955 30467
17863 30467 15180 -5366 -13066 -3918 5809 -2796 -13092 -12153 -11307 -9033 -8863 -8723 -5615 -8923 -5783
17848 -5783 -14114 -6437 5576 13666 11745 14666 2029 -4293 -6826 -13749 -7294 -2823 -2234 -5983
17834 -5983 -6984 5820 17366 17772 7500 -3524 -17171 -8850 -1821 -11879 -12417 4583 10048
17821 10048 10651 9348 -860 -421 2296 6890 10289 4380 -3447 -6565 -6738 -17418 -26836 -16968 2620
17806 2620 13597 8660 -3960 -3777 -11196 -11373 -4236 -5693 -4215 -430 2358 -481 5914 2119 -5644
17791 -5644 -4850 -1839 -4704 3411 12381 15362 18970 11889 7679 4428 6864 12845 12038 4099 -3376
17776 -3376 -7191 -13276 -9954 6967 17071 17752 17980 6387 -1212 -3327 -5404 -2823 -10504 -25123
17762 -25123 -17602 -16046 -14734 -4178 2698 -5557 -11390 2530 12789 34 3892 2936 -36 8429
17748 8429 8799 5141 8313 5882 -849 2921 -2874 6484 15026 19023 18344 -4026 -20106 -6209
17734 -6209 2191 2689 -5265 -12365 -8784 -11132 -9654 221 1283 -8932 -13477 -12543 -8769 -16022 -8315
17719 -8315 -5756 -11993 -3315 12024 33040 27331 20505 17788 8198 1192 -2498 -11793 -22548 -21216
17705 -21216 -28760 -36988 -27709 -20638 -17966 -17097 -11742 -12148 -18524 -4402 3682 -2206 -4896 -476 4256
17690 4256 -746 -17097 -23411 -20834 -21137 -1490 -549 -139 -1081 -6512 -10398 -10165 -8392 -4542 -11255
17675 -11255 -9530 -16538 -6922 2052 -2996 -9647 -9301 -1052 5224 1315 -5465 -6131 -4197 -19884 -33473
17660 -33473 -37033 -13569 -13590 -17440 387 1745 -3699 743 -8723 -5113 -5311 7317 7308 -1280 6531
17645 6531 -5121 -5199 -4047 -17447 -27640 -22784 -27943 -33880 -34778 -20707 -7482 2240 -364 -6027
17631 -6027 -1005 29 2302 7790 7258 11518 13310 17503 6910 2725 -2340 16176 21555 19563
17617 19563 23547 27521 19098 14442 6155 -2638 354 -64 -11210 -7267 -7687 -4730 4257 8335 4610
17602 4610 5019 5982 -4295 -3606 -14332 -19427 -7443 -8098 -8546 -8132 -8064 -10009 -1191 4683 4382 -275
17586 -275 -1474 -3728 -1222 5192 7485 2822 -4054 -4215 5940 4162 10465 13634 13666 14462 3566
17571 3566 -8052 -15679 -9055 -5700 3208 8686 10014 2697 -1627 -3977 -8986 -11888 -191 7621
17557 7621 7583 -2162 -9475 -7571 -4467 -2554 20517 21598 10399 8996 9030 5772 2175 2635 -11869
17542 -11869 -20742 811 6894 7365 17767 27010 22508 9183 -802 -7838 -8721 990 -1057 -2401
17528 -2401 -11925 -16390 -16078 -12436 -12764 5330 9718 2062 -1160 2801 6131 3855 3808 4187 -13076
17513 -13076 -18395 -6916 -11738 -4017 3228 -10967 -19770 -21374 -15366 -8704 142 8630 3249 4824
17499 4824 -1790 3587 -3493 -14429 -12974 -3871 3076 -3452 -8424 -16571 -10979 -14552 -10267 -13040
17485 -13040 -8939 -7698 -12323 -22637 -14096 -6482 -2738 3539 2126 -6513 -12424 -6335 -16212 -8627
17471 -8627 -4562 -5835 954 4325 3932 -7775 -10923 -16821 -20270 -5214 3024 3938 6282 2529 3751
17456 3751 10816 4884 13612 11216 9088 18747 22223 14791 548 10725 24273 33371 42900 84041
17442 84041 127774 143492 127760 95443 76285 53169 41387 27342 18972 20852 24629 17497
17430 17497 -2639 -3108 -2594 -7426 -9740 -5444 -2803 1206 10475 22349 25904 25725 21902 12688 10586
17415 10586 13281 12064 9817 3371 -9461 -4842 -1629 8433 5268 -7956 -18486 -19891 -10098
17402 -10098 5634 17325 22648 13122 4198 1415 1596 4479 17806 15917 -1137 -2979 -1656 -6223
17388 -6223 -3013 -6340 -9437 -17896 -23667 -21348 -19669 -22427 -24865 -23580 -20737 -16873 -20537 -23480 -14705
17373 -14705 1517 12884 6411 10605 14171 4781 1319 -5938 -5370 -14855 -15401 -12862 -11547 -21619
17359 -21619 -16333 -13446 -9682 -3102 -6553 -9129 -10409 -14743 -22851 -22480 -14651 -5270 3756 615 -4353
17344 -4353 2034 -2216 -599 1891 -3041 -5080 -10363 -9577 -2772 5202 10132 10672 11462 5140 -13443
17329 -13443 -15291 -9445 -2096 -687 -10630 3594 12008 8552 449 -7109 -14942 -7420 -6274 -8340
17315 -8340 -7045 -4760 -6449 -2537 -4024 1915 -1601 -7101 -9739 -7305 -13999 -3183 -123 -2406
17301 -2406 -9692 -7599 -10313 -27975 -30062 -35141 -17811 -1043 7307 16917 13122 8900 2168 -1568
17287 -1568 -3177 -2128 2874 679 17379 25168 9049 -3337 -3954 -2104 -15336 -17981 -12957 -17651
17273 -17651 -17663 -8323 -2289 1552 6674 7444 -998 3595 16698 23244 26891 12132 10422 5694 4098
17258 4098 5908 5859 15207 16651 21102 38125 24567 4301 -3834 1774 -5559 -1456 7619 7549 8870
17243 8870 19906 9984 12238 3854 -8569 -7838 3327 -4000 -11123 -20061 -15336 -18246 -10407 -1307
17229 -1307 776 -6541 -1545 865 -5235 1835 2423 16098 27367 24997 21954 18701 17688 14457
17215 14457 3126 1790 6789 -439 -16112 -14095 -14610 -10288 -6065 -7325 -313 -2835 -7440 -2197
17201 -2197 -1352 -4912 -594 3267 -977 -20227 -24237 -4649 3391 6322 6119 853 -4266 -3074 -2039
17186 -2039 -11279 -5964 -4617 -11204 -13733 -10622 -6625 397 4234 -5033 -2460 -4108 -46 2483 -7436
17171 -7436 -12604 126 23837 15401 5574 -752 2516 9737 15520 10261 -2080 -7882 -5075 -2838
17157 -2838 12368 6391 11915 19541 24151 4856 2409 4897 3143 -374 2607 701 3982 14665
17143 14665 10987 10332 15350 -2691 -15266 -18946 -7303 3521 1875 7262 9893 3931 -1920 -10606
17129 -10606 -13140 -15562 -29771 -34325 -10132 11821 20796 10368 -11480 -15921 -10262 -11073 -13555
17116 -13555 -17156 -9770 -2451 -9585 -12399 -5335 -3696 1860 4581 6627 5834 -3939 -16423 -12142
17102 -12142 -5975 -8063 -15722 -8661 -1427 -4267 -8736 9651 7327 -9046 -15736 -10915 -1964 38
17088 38 -6958 -9594 3652 9190 3745 -6092 -9016 -2634 -5781 -24223 -26572 -16686 -17272 -18760 -17628
17073 -17628 -19758 -29449 -17631 -8170 -9065 -9125 2988 23861 24841 21496 6435 10646 11247 3919 -1927
17058 -1927 2647 6112 16706 16560 11459 10461 8092 4496 3957 14977 18458 11661 10703 14271 933
17043 933 -7573 -9810 -6251 1993 5700 -2612 -1719 -88 -1362 1557 6589 5363 7789 7472 13005
17028 13005 10932 2630 -6925 -10025 -2660 -3951 -6254 -8202 -12588 -19671 -25713 -21561 -10199 -13013
17014 -13013 -15796 -3430 3197 101 434 3830 2529 12016 4125 6496 17063 19071 15881 13574
17000 13574 -729 -3988 -10184 -14169 -4809 -3859 1853 13423 24073 19497 21315 2814 -19717
16987 -19717 -24173 -14680 -4845 1561 -1535 -4809 -11732 6710 12252 11325 7950 -5582 -11262 -2868
16973 -2868 10941 5018 11755 2628 -4100 1133 -2441 -2925 1992 -1163 -5989 -17375 -12868 -6996
16959 -6996 1658 19114 12870 10769 5565 557 -8127 -7971 -12345 -6481 621 -4780 -294 2842 3261
16944 3261 5465 13085 13085 3642 -593 5286 16334 8537 18605 22699 4346 9115 9963 9847 15635
16929 15635 10737 -5962 -13605 -17893 -16817 -19101 -23050 -19751 -11075 -7953 -15464 -11461 -1600 8816
16915 8816 15703 22419 12564 -12188 -19625 -8603 -12952 -30089 -30393 -20634 -10937 -4842 -16169 -20318
16901 -20318 -12730 -10276 -11742 -17458 -5370 -10803 -4949 -4871 -9764 -6898 3290 -3227 -7547 -232
16887 -232 6498 10855 10190 2017 1506 -4868 76 9165 204 -11539 -10360 -4937 -46 -15455 -25115
16872 -25115 -9586 -1577 -4850 2779 -378 5986 3021 -8946 -6042 -7642 -6210 -7666 -10729 -12671
16858 -12671 -6332 -19423 -11919 -7733 -10182 -9673 -9610 -4138 -2107 -12541 -15408 -12883 -18729 -22460 -31435
16843 -31435 -21493 -14317 -5822 -7531 -6498 -5469 3012 7201 6380 6074 -5960 -9404 1730 -90
16829 -90 10248 19559 10633 -5263 -13584 -21970 -32195 -28414 -25706 -23025 -17908 -10298 -16248 -4585
16815 -4585 1203 3976 1467 -863 -6795 -8215 -14169 2248 11002 2019 -6968 -15193 -24417 -34315
16801 -34315 -19929 -8776 7703 -982 -15625 -19210 -14170 -13883 -3462 -5911 -9766 -6326 -4124
16788 -4124 -3700 -6792 -8380 -12277 -18358 -27007 -15959 -7311 3611 8790 6976 3202 -811 -548 8141
16773 8141 11979 2869 2564 -2057 -8246 -14838 -20537 -12156 -5066 -10358 -5907 5420 11524 7201 4314
16758 4314 3526 -667 2729 -3768 1746 1022 -3213 4412 2841 -937 -1525 6295 4722 1634 -11687
16743 -11687 -14415 -4833 -11629 -8612 -634 -6962 -3500 -766 -16445 -24849 -15733 10275 7006 14103
16729 14103 3142 -12569 -17489 -7753 1807 6434 6925 -1754 -12097 -15515 -2296 9978 -3361
16716 -3361 3847 6979 -5240 -19083 -22173 -23536 -20721 -17868 -12375 -5469 -6640 -6834 -18128 -38462
16702 -38462 -34818 -21417 1961 14656 15794 15764 5604 1694 -10328 -21673 -11081 -5786 -14041
16689 -14041 -14471 -7080 5472 -2722 -1150 705 1026 -4650 -13405 -18408 -12082 -7208 -1731 -2948 5864
16674 5864 5337 6228 7998 4093 4707 -4156 -12197 -8745 -619 11570 8798 6432 1661 -3022 3152
16659 3152 -1075 -9709 -13920 -4455 -3390 542 12661 17778 10740 2011 -1270 -9045 -7921 -6296
16645 -6296 -18926 -15840 -5538 10455 6959 1698 -3329 -4263 -4406 7656 8916 5349 8754 1233
16631 1233 -8649 -16308 -19993 3147 14043 16037 14599 6999 49 -3746 6007 14054 28225 35026
16617 35026 22113 14735 19554 8523 4261 2913 11647 13759 6380 8422 5755 -1631 -896 9234
16603 9234 14012 8590 -3813 -1337 1096 -1560 1040 4612 1642 190 -4418 -8291 -16093 -8678
16589 -8678 -9459 -10959 -3319 562 -293 3219 3411 4721 10578 -586 3303 13246 12821 7031 12072
16574 12072 5584 3564 5749 6170 5033 8254 16452 1180 -13736 -11169 3616 9194 10385 -1161
16560 -1161 -10495 -4109 -4548 -208 3158 -7462 -18288 -21508 -17425 -18335 -10905 -7632 -14895 -13468 -13715
16545 -13715 -4129 -15033 -21805 -28464 -26099 -14670 -5850 -1690 -7889 -11229 -7811 -6118 -10267 -23743
16531 -23743 -28934 -14685 -5759 -6742 -13792 -8320 -2494 -3396 -1647 3531 1535 -9859 -3235 2026
16517 2026 5076 -2533 -13415 -13654 -11962 222 12023 2689 -5762 -625 1890 -2679 -5350 6999
16503 6999 21473 19065 20047 8729 -3223 -839 10456 19528 8359 -4863 -7188 -6869 -1842 -5521
16489 -5521 -10707 -8763 3520 3296 9876 12739 -5699 -7651 4990 5470 3754 776 -40 -7447 -12456
16474 -12456 -2851 4999 2600 -6775 1593 -3348 7519 17021 11222 9206 20134 16140 13426 13426 5835
16459 5835 -3738 -11045 -3401 2687 9076 17235 17283 7719 5356 4368 16 -8071 -11776 -13626 -7772
16444 -7772 4514 1713 -486 5516 -3224 -3261 -3000 -689 -3851 -19531 -23566 -21286 -27763 -23365 -13932
16429 -13932 956 -1100 -5937 -11247 -19478 -14440 -5899 10553 520 -7675 -12158 -14859 6454
16416 6454 11347 -3333 -5206 3058 7094 17623 19825 17960 3037 -6481 1751 14916 15540 7612
16402 7612 -5323 -675 5152 19534 31138 22322 11039 2394 -1416 -10545 -8617 -10002 -15613 -9484
16388 -9484 -5864 -5143 -1309 1684 -6094 -11294 -8793 -9345 -6013 3056 6236 8197 9674 6644 4522
16373 4522 -8012 -17791 -27652 -31934 -17115 -20018 -22074 -12447 -7506 -6559 -10110 -24124 -17923 -10386
16359 -10386 -8258 -6413 -15268 -28425 -34322 -40856 -31431 -1994 1921 -12843 -18653 -20555 -12045 -6538
16345 -6538 5598 5934 -3930 -12163 -11426 -2721 -6479 376 -1509 -3945 -13903 -22238 -25777 -20420 -12303
16330 -12303 5879 12151 19014 9413 4838 8932 4719 5637 11285 12685 11172 8466 2411 6244
16316 6244 13420 22930 19823 16371 12250 10982 7475 18963 17106 4956 7224 -376 -1320 -11985
16302 -11985 -11030 -2659 2996 6006 6813 9515 922 9059 25392 15887 10143 3011 -9761 -8130
16288 -8130 686 -1049 4290 4263 10193 8649 -1893 -5630 -6370 -6356 -7818 -11027 -8809 3973 6328
16273 6328 18710 4395 -8793 -6431 -126 -4486 5106 13794 13894 15481 8400 5253 -9907 -18787
16259 -18787 -14290 -8481 -11986 -14754 -6811 -7119 -1808 -1914 -707 -10409 -12220 -4015 -2528 -303 5053
16244 5053 14365 15744 10725 14780 14877 14691 13345 -3521 -7651 7621 5679 139 -339 6164 6839
16229 6839 -6537 186 2569 4915 -720 -1900 -10384 -12237 -4234 1507 -4585 -1671 3909 13801
16215 13801 19123 14619 6113 4134 5438 14550 25521 21379 12467 1156 6684 22722 15134 2212
16201 2212 3742 -3008 -8554 -7732 -8534 -14645 -7367 -8791 -6797 -1512 -15714 -6882 7113 18660
16187 18660 27626 23592 13821 14713 14390 3989 1843 7685 13152 13952 6626 -633 3570 14409 14071
16172 14071 619 -858 11300 12900 14364 9286 7425 12979 16249 13454 73 -281 -8229 -10583
16158 -10583 -12866 -15633 -18321 -21266 -17603 -8821 -8412 -5997 -11788 -16672 -7514 9556 9987 -4457
16144 -4457 -10966 -10239 -13776 -11762 -11858 -3946 3276 -4718 -3310 4111 -2035 -5212 -2449 -11321 -16875
16129 -16875 -14525 -6269 -8011 -5524 1832 1522 -9791 -20665 -19831 -18232 -5737 -2897 -7506 -11067
16115 -11067 -7223 -16621 -16625 -11883 -8759 -11317 -11994 -13458 -9702 -1075 2223 47 11 9942 20536 10775
16099 10775 3385 -4048 879 -467 -452 7782 1809 -2818 -8523 -10390 -6198 -15254 -9028 -2769 -1398
16084 -1398 -835 -7453 8807 19189 19755 3884 -704 9242 7161 8220 9662 11133 4802 -5330
16070 -5330 -13867 -17514 -18121 -13458 -8034 -15530 -23744 -11101 -16024 -19314 -17212 8944 15038 11742
16056 11742 6479 1188 7637 16343 12198 -1285 -4762 -3037 -9608 -9538 -7295 -4702 -3794 -7630 -10282
16041 -10282 -5644 -1349 8777 11230 14586 13561 10250 -2602 -12173 -16677 -14070 -12396 -11769 -11449
16027 -11449 -11295 -19590 -10273 -8121 -10696 -9172 -9613 -15529 -10358 -3714 6895 12971 11512 3146 -482
16012 -482 -9597 1864 5320 7466 5701 876 494 -8078 -7732 -9199 -24033 -23048 -17916 -19157 -12149
15997 -12149 -13589 -6150 104 -2863 15566 18196 4155 7267 9801 2100 -5355 -4834 7148 15023
15983 15023 5192 7550 -3874 -2420 -6792 -9309 -10386 -7439 -11721 -12127 -2449 -6959 -14517 -605
15969 -605 -1971 -7456 -7151 -11670 -7157 -3473 6622 -819 -7715 -4686 213 261 -7831 -7355 -7420 356
15953 356 12596 14188 7152 -4038 -6776 2990 5512 -5138 -19678 -10114 2511 -5376 -19465
15940 -19465 -28093 -17932 -1702 -3980 -4370 -4041 -13981 -22579 -23484 -22556 -6666 1458 -6390 -14950 -11534
15925 -11534 -6853 -1922 -15299 -31411 -34767 -23140 -10547 -2515 -8300 -9045 -3916 1904 11604 19127
15911 19127 8641 -6792 -7987 -205 7761 8673 -10337 -6370 -6775 -19793 -21646 -2914 8198
15898 8198 10146 3217 658 -2666 2100 23239 27227 14440 3283 -10182 -9686 -13049 -5575 -3861
15884 -3861 -3086 -5983 -3686 -417 -1947 -22374 -26365 -12007 5297 17676 1373 -19414 -28881
15871 -28881 -20877 -18656 -14064 -3555 -2268 -5891 4966 -2058 -1631 4837 3113 1274 5222 -5475
15857 -5475 -10478 -15554 -13375 -9854 -9242 -21325 -28748 -22078 -8237 8999 19089 18446 13991 10868
15843 10868 -1590 -10188 -979 11604 5773 14528 11729 -1929 -4836 -695 -2742 -7669 -12948 -11278
15829 -11278 -1790 -18557 -12686 -9592 -12846 -6639 -5896 -10241 3386 7043 6683 -9821 -18543 -5343
15815 -5343 -6851 -20056 -27799 -42063 -38627 -12449 -3535 4798 3142 -3895 -3101 -7863 -18865 -28262
15801 -28262 -22916 -22893 -11534 -7548 -7826 -12751 -12695 -8445 -3056 -2481 703 9032 751 -8590 -17093 -24981
15785 -24981 -19229 -7432 -14693 -13614 -6250 6256 5749 12460 7766 4255 -4774 -2076 9091 5963
15771 5963 -5522 -16311 -11361 -2203 -10648 -16249 -5340 5341 9299 14185 17192 6995 -592
15758 -592 834 13600 21013 17497 11054 -228 -8939 -4309 3464 1968 15999 12945 6446 23132
15744 23132 13658 10671 22845 23907 13419 14792 19681 8914 11764 20298 11558 2571 -7417 -9700
15730 -9700 -2816 -829 3874 8712 16829 9947 7818 -7082 -14523 -18398 -15197 -5994 -2435 -7853
15716 -7853 -10798 -67 7747 8637 5091 409 5667 -9952 -14002 -7839 531 -3891 -7707 -8177 6279
15701 6279 8640 16347 24112 15311 2233 13631 18733 -29 -797 1033 8255 7373 -5955 -11809
15687 -11809 -1186 3134 -803 3534 1038 -6865 -5198 -434 -7559 -18569 -16878 -8526 -3326 -8993
15673 -8993 -13147 -27881 -28761 -9304 3612 2033 -10289 -14846 -16977 -12093 -8371 -6772 -667 -163
15659 -163 17458 14147 8032 1782 3099 3759 3791 -977 -4398 5420 -6329 -9596 -2976 6873 -1625
15644 -1625 -2218 -1341 -9633 -17479 -10832 -8696 472 3356 6270 8635 7260 4004 -701 -7916 -5976
15629 -5976 -676 3541 -9101 -10095 -6051 5115 2411 -1771 893 7133 3213 11443 25469 25399 23954
15614 23954 14625 8163 6480 -2028 -8595 -14812 -13473 -3619 -1341 10888 1328 -5680 -1578 5502
15600 5502 15054 3367 -8319 -15992 -5282 -2769 -7822 -2568 5689 9559 5557 1680 -7452 -1678
15586 -1678 4343 -716 -5306 -5455 -8669 -16157 -21434 -12170 -5 1593 -4536 4165 11112 -7691
15572 -7691 -15545 -14258 -7570 -6521 1671 -782 -8813 -9951 825 6751 11288 4124 -14234 -16175
15558 -16175 -9792 -57 7477 13129 6767 2249 -6593 291 10625 17053 14089 27673 20811 4315
15544 4315 -11307 -2939 1727 -4911 3549 -444 -16950 -28376 -31259 -26761 -27747 -26380 -26808 -28212
15530 -28212 -22233 -25115 -30895 -15030 -2597 -341 8620 16162 12844 11339 6000 4650 260 -4989
15516 -4989 -3538 3730 12920 12039 16632 19406 14992 -3620 -13407 -6456 -1033 2099 -254 -3820 -4305
15501 -4305 -4329 9013 17675 12810 10998 13646 12559 3677 2884 -10395 -598 8617 12295 13548 16212
15486 16212 8124 -526 -10042 -16556 -12461 -237 10634 3671 -2935 -7959 4804 3391 3741 3069
15472 3069 -1263 3872 9696 16181 8727 -5057 -17952 -7391 1771 3576 11629 3706 -12735 -11612
15458 -11612 -1225 -175 -5923 -12954 -6430 -5029 1124 -223 3775 10460 15524 12978 18058 11709
15444 11709 19161 19299 3406 -10282 -14987 -9156 7237 24708 26726 27548 23944 17372 7370 8424
15430 8424 6409 -7240 -5617 7139 11101 10414 7603 12288 17166 15506 18377 1667 -7002 -10802
15416 -10802 -11345 -22601 -25193 -14820 -7842 -6789 3530 8746 6135 7384 9194 15104 3173 3154
15402 3154 -2550 6488 14505 13297 7606 2083 288 -4251 -4308 3391 3147 -782 -9746 -8322 -2813
15387 -2813 -3990 -3320 16 -5383 -12547 -13201 1388 -1104 -12014 -22022 -30353 -40201 -32132 -18866
15373 -18866 -4027 -238 4507 -9020 -13377 -10896 -19086 -19120 -5499 -3109 -18305 -25056 -22423 -19244
15359 -19244 -6248 -3722 -14546 -19291 -12383 -4780 -1130 -6565 -9383 -6070 -7174 -2665 4694 15404
15345 15404 5959 4918 17404 15695 -2500 -2995 11473 5296 -9506 -6693 10082 23292 26013
15332 26013 19546 15225 15148 22088 18846 21731 22456 13292 7345 7706 10399 11106 20846 9051 904
15317 904 -864 1617 2745 18311 17504 30 -1510 2778 12947 27673 24168 13477 6833 986
15303 986 -269 9739 1784 3173 10957 14967 4881 1703 3549 5148 3141 4248 14496 13401
15289 13401 9547 9175 12054 19882 25024 27163 20178 -272 -5504 -14021 -16565 -14506 -15945 -31456
15275 -31456 -26925 -11149 956 -9258 -9286 -14030 -11041 -15041 -15662 -1434 6801 4363 -6507 -8603
15261 -8603 -7610 -5541 1383 5617 9185 5844 1419 5303 5478 388 5070 15359 5113 3433 -2379
15246 -2379 -2015 7036 3396 888 5474 5995 -2863 -7886 -5653 6651 10136 6647 5333 -5584 -5654
15231 -5654 12739 403 -7467 1978 -1195 1333 14081 14850 14848 16111 21019 19824 20106 4867 7493
15216 7493 10471 3715 5375 14289 6279 -6961 -5794 -7388 -11592 3068 16467 26722 25559 14688
15202 14688 13422 17977 13623 112 -1579 -5981 -14895 -18358 -23066 -18084 -3708 -7364 -13859 -20782
15188 -20782 -15742 -13101 -17655 -24899 -32368 -22268 -14514 -16699 -20866 -10705 -9613 -12946 -16852 -19781
15174 -19781 -23280 -23341 -22725 -13144 -4233 -4039 -581 -984 168 -5816 -6866 -4251 -23 3197 -2248 -8769
15158 -8769 2758 9800 13471 7967 14035 12234 9481 11470 -1548 -17801 -6627 -345 -6546 -5169
15144 -5169 -9 -459 -4488 -5932 -5902 -13286 -15720 -14613 -12761 -9631 1496 -3826 -3939 -21354 -31192
15129 -31192 -20648 -13614 -7787 2179 1067 6753 3017 3983 644 -285 -10751 -15292 -2769 -647
15115 -647 12710 21859 11812 3294 4685 10270 8077 6583 3387 7818 15549 15759 11026 -2095
15101 -2095 -1674 -393 -3109 2487 -3029 -7068 4725 -3942 -12129 -8901 -4733 905 -11405 -16905
15087 -16905 -6828 5111 16546 17099 15439 14135 11128 7189 3590 -3298 -6365 -5021 -751 5561
15073 5561 -2480 -20496 -30787 -29788 -18978 -5366 11251 7452 5492 12202 20278 24582 22187 13930
15059 13930 -4744 -18521 -7848 -4586 -5460 7690 10031 5367 6528 8245 2851 4486 3642 -8017
15045 -8017 -22176 -21517 -19392 -16335 -5457 -6923 -2610 5997 5052 325 -8678 -2112 2307 6162 7474
15030 7474 11297 5710 8741 13358 3787 1918 162 11003 7889 3561 19682 20614 20453 22147 24362
15015 24362 25587 23963 25091 15402 -4391 -12001 -9558 3126 2785 2051 3736 8747 13217 10569
15001 10569 8867 3547 6149 17111 16419 9544 1177 4955 13881 9038 -3883 -20647 -30040 -9214
14987 -9214 3340 -6129 -6498 -1230 8907 7732 6058 1448 -16354 -25178 -9788 1062 -7950 -10028
14973 -10028 -13625 -23300 -17520 -20640 -26823 -23242 -18185 -25541 -20038 -15945 -8834 8315 6597 207
14959 207 -3503 15032 15122 2737 -3053 -2666 -142 4395 17616 17256 17138 17060 22611 23989 19626 6091
14943 6091 -538 -14769 -19926 -11045 -10043 -12003 -6554 3135 -2156 4780 6167 -3795 134 8285
14929 8285 18391 17642 5524 -6071 -8904 -1629 -371 -7226 2503 -1538 -4365 -6034 -3653 1367
14915 1367 -8615 -16568 -24134 -10245 5256 8054 5578 -8199 -20013 -12581 -5757 -9678 -20083
14902 -20083 -32094 -31462 -9818 -1633 2663 -4748 -15533 -17926 -23817 -23031 -10814 -7757 1669 -5102
14888 -5102 -6618 -1927 -8660 -13120 -8266 -4533 -2132 680 11179 15744 5425 4808 11340 9084
14874 9084 11592 12788 5721 3088 -1259 533 -7311 -17792 -14984 -12312 -9138 -13796 -7231 -2259
14860 -2259 11587 722 6540 18341 12102 9913 7889 -5810 7576 5546 -527 1114 5181
14847 5181 7477 -3083 -13666 -20133 -18437 -12036 -3538 533 548 -2610 -2361 7018 7766 5536 4087
14832 4087 3013 -2533 -10548 -14314 -11552 -16307 -3198 2450 4527 14757 16227 11456 15099 12996
14818 12996 5453 -1204 -575 2954 -6280 -9839 -5648 -1728 -6907 -12520 -3068 2580 3383 -4489 2875
14803 2875 9328 15128 11983 8987 5094 -1389 -10902 -16749 -9541 6402 5675 -5004 -7691 -5331
14789 -5331 -5732 -12655 -20473 -7086 -9395 -20346 -14851 -11225 -8431 963 -4074 -4324 3562 10279 9686
14774 9686 18010 19692 8445 -2998 -14269 -706 5839 -6910 -15408 -6877 -19997 -17365 -7321
14761 -7321 -14233 -14735 -67 -2746 -6030 -5113 -6454 -10628 -6086 -9222 1540 5014 -1424 196 5523
14746 5523 -4605 -9442 -1196 2804 3978 13511 7665 -7193 -14061 -16668 -13963 -4673 12541 1320
14732 1320 -12118 -8042 -12566 -10748 -10452 8 3045 -2097 -8450 -6882 2765 6779 -314 5856
14718 5856 3920 -1312 9838 13944 6641 -6158 -6125 -13433 -16719 -17671 -10872 -12776 1446 3291 7599
14703 7599 17737 9929 4644 669 -3023 955 2701 -6037 -11427 -8621 -5129 -4679 -296 -2267 4430
14688 4430 11391 15718 8401 -8920 -18404 -13154 -22506 -7598 1182 -2648 -14138 -22622 -20985 -9935
14674 -9935 2749 2202 3877 -1104 -5848 -9488 -14118 -19632 -15754 -5593 -823 -3639 -15756 -1849
14660 -1849 8489 -1422 -7130 -7490 -7414 -145 7935 -9670 -500 5759 11984 9543 5905 -2737 -16265
14645 -16265 -22594 -19985 -21853 -20740 -14021 -4860 -12168 -19056 -12074 -10729 -4827 6323 8526 -2988
14631 -2988 -11815 -15749 -12793 -6215 7843 16573 11829 5018 -7406 -16817 -21011 -5442 -6576 7216
14617 7216 19858 24753 20647 17093 11330 10933 3639 -18436 -22766 -17235 -12854 -18116 -11625 -4434
14603 -4434 -8981 -4384 -7693 -6584 -11838 -23606 -13913 -4290 -3096 -9572 -11421 6127 7908 5145
14589 5145 10660 5979 -932 -1136 5380 13991 12079 11507 22380 7123 -15640 -14473 -7778 -813
14575 -813 9698 3657 8748 -552 -7766 2768 19843 19883 -502 -4258 -14422 -5783 -2248 -2558
14561 -2558 -11329 -2605 9218 5788 5037 3376 -7189 -5503 -9225 -12313 -2276 1346 4949 -2788
14547 -2788 -14624 -12771 -7333 -18885 -24295 -18978 2271 6946 1803 8349 4765 6832 13711 -2057
14533 -2057 -18668 -19826 -22485 -16991 460 2057 1266 1743 -1901 3970 6140 -3283 -13192 1012
14519 1012 7678 7613 4409 2795 -2487 -6899 -15924 -20410 -14862 -13503 -13863 -12760 -7280 -1380 -1620 -9538
14503 -9538 -3605 4085 1369 -466 -5769 2635 11415 -2545 -15955 -18040 -5169 5098 17371
14490 17371 15652 17070 12284 5747 3385 9614 12341 -58 -7628 -7571 -2080 30 373 9940 2047
14475 2047 2189 5862 2370 859 16279 19796 15641 13008 8792 6871 8108 23575 21464 14876
14461 14876 14475 6826 3173 7021 11330 16888 16352 8008 -1453 -14211 -20297 -7801 2226 -6265
14447 -6265 -4128 -6718 -4769 9311 14331 9576 5968 4261 7349 -3140 1999 16999 17038 10647
14433 10647 16086 17651 19716 479 -5705 -6014 -5344 -8109 -12031 -3445 3106 5755 1085 -13119
14419 -13119 -16210 -6966 3872 12349 11493 8306 6504 -12993 -18480 -18817 -11993 1903 5275 390
14405 390 10586 20046 12183 794 6093 -2124 -9674 72 2170 -5030 -8240 -5560 2297 -1550
14391 -1550 -3443 -7475 -6021 -7578 -19530 -21758 -20466 -19907 -5389 -8525 -7427 -3874 -18328 -22500
14377 -22500 -22773 -29757 -29065 -15958 -5205 -8782 -13814 -25037 -24916 -7828 -6019 -2401 -548 16212
14363 16212 25411 12739 -3826 2439 11508 11102 12200 295 -3855 -4151 10820 13701 15116 7952
14349 7952 7489 20684 18403 9057 247 942 -3422 4808 6320 2063 -4435 466 -1466 -7798 -2226
14334 -2226 36 -6060 -10332 -14312 -8056 637 18165 12467 1123 -1762 -6387 -9784 -9068 3398
14320 3398 1662 -20704 -13246 -6038 542 -4484 -8899 -9311 983 11770 19290 18881 14366 2416
14306 2416 -4532 2465 7528 14116 5559 -13770 -18282 -10530 -1126 3695 2422 -5126 3373 -3482
14292 -3482 -10472 -9137 -19188 -7166 1639 1324 1282 10011 22734 22170 8566 -4389 -5914 -11466
14278 -11466 -7704 -687 6603 8012 15740 14059 10698 14525 1139 1133 -7376 -12742 -12227 -5279 1525
14263 1525 3840 21923 24478 26173 20057 19129 3584 -50 12415 10430 9339 6117 15846 16116
14249 16116 16549 13416 5673 -6964 -13264 -12027 -22724 -21756 -16599 -16606 -9875 -9011 -17640 -19879 -2407
14234 -2407 -1385 -5435 -9617 -8574 -51 8511 12539 10671 3628 -1723 -2718 3769 7673 13504 14136
14219 14136 16920 10048 2064 2585 2839 -94 -8738 -7405 1931 252 -8144 -6535 -9126 2887 5842
14204 5842 14931 10824 11616 -3095 -15 8333 8808 550 2384 12461 -401 -11661 378 2669
14190 2669 -12983 -8584 -9587 -13259 -8698 -5069 -2223 -16691 -14302 263 15705 16877 11743 7474
14176 7474 -4565 -11657 -5434 4756 9941 -5375 -13634 -13817 -11795 -19482 -11727 -11984 -12627 931
14162 931 11996 5430 9393 9474 4094 -2389 1127 -4702 -3175 3898 13393 17502 13563 6062 854
14147 854 -11886 -13488 -10325 3728 9328 -12843 -10542 -3515 363 -4586 -13745 -11288 8777 17529
14133 17529 4951 -6975 -1056 11437 3281 -971 6418 555 -1660 2362 8745 3716 -6470
14120 -6470 -10769 -654 7142 12389 16000 11686 1032 6688 14831 18696 25937 20751 16747 8439
14106 8439 9416 9181 15274 17386 19558 20037 11063 12305 10648 17252 24998 25911 24049 19009 8708
14091 8708 2157 -9332 -4012 -2786 597 9749 9708 1585 -9546 -17557 -21914 -4284 8068 17238
14077 17238 18554 15010 8555 11043 8172 974 -135 -4998 -11001 -14693 -17395 -13122 -8193 3998
14063 3998 10418 10065 20209 10721 -3888 -5378 -1223 3034 -3502 -18582 -17893 -16047 -6739 -1407
14049 -1407 -71 -7357 -3554 -1773 8656 8930 -6023 -9327 -312 2577 5015 3562 374 7469
14035 7469 23997 25329 20592 4388 -10605 -16032 -17298 -17226 -17562 -8946 -5386 -2103 3924 -3923 -7832
14020 -7832 -6430 3372 5210 12856 18465 14615 14118 14256 13830 6066 -7639 -9822 5314 22951 33001
14005 33001 32645 31036 27535 27230 20374 2904 259 11558 24931 12675 681 934 7090 4306
13991 4306 10239 13005 -71 8528 8619 7320 15443 10001 -11621 -12355 -25904 -26729 -10719 7847
13977 7847 21448 8670 -17330 -21862 -20575 -17250 -17270 -14455 5258 4270 -10661 -7050 -8547 -7928
13963 -7928 648 2943 -10423 -12698 -6958 -2579 -8950 1463 14380 740 -6941 -6463 924 -1131
13949 -1131 5736 9453 -3192 -8060 -11961 -22775 -31513 -28340 -22250 -7166 2530 10692 21879 20896
13935 20896 5943 -15077 -19670 -10598 -3654 7214 1842 -13469 -17318 -17931 -6123 -5988 -7596 -7187
13921 -7187 -7431 -15582 -13404 -6062 1236 6881 -6912 -13258 -9303 -5386 3511 -3186 -8023 -6500 -2049
13906 -2049 5575 8428 -10785 -14199 -25057 -25105 -18871 -17317 -11952 -8265 -8387 -8402 798 4224 5079 14955
13890 14955 11829 4855 -940 3463 3950 -2894 -10883 -6609 -20279 -12592 1592 3422 -7222 -6927
13876 -6927 8785 18673 27996 27642 16137 13401 15023 12350 6802 2040 3204 199 -6445 -13767
13862 -13767 -9901 1468 7389 7399 4053 5238 14726 6115 6043 -4117 -12639 -5769 -7775 -11245 -13248
13847 -13248 -3530 -888 2286 -5043 -14195 -17057 -13734 546 8182 5064 10786 3281 -6195 -1993
13833 -1993 176 -3667 -11435 -22626 -13408 1540 -6130 -1071 -478 3496 -688 -2934 -4357 -4321 -256
13818 -256 1817 -3286 5666 8602 -3291 -12118 -5438 294 1802 -3332 3067 -4395 -815 -2891 5363
13803 5363 6189 3076 12301 17795 10232 11800 9374 9288 5277 -5186 -4714 6465 19125 24752 17743
13788 17743 6354 2992 5365 -3224 -8418 -2819 -3541 -18741 -19132 24 6876 309 1593 9061
13774 9061 12222 11389 -4072 -4186 -529 2154 10820 19662 17574 19533 18828 7536 -7081 -13497 -12435
13759 -12435 -6646 -1009 -435 -1374 -3798 7376 14585 10532 4547 14155 20833 20586 15456 6090 10333
13744 10333 17013 21764 13100 6907 4259 17937 30660 23822 14408 14292 15142 20890 13742 -458
13730 -458 -5821 1771 8389 5704 5918 -4669 -9930 -9083 1558 2237 -8802 -9778 -11930 -4156 6300
13715 6300 7497 12416 4249 -4070 4577 15746 14265 14949 5533 10291 13669 10984 6470 7401 -199
13700 -199 -3216 -14738 -28582 -32445 -23289 -20680 -14736 -5793 -3310 -6085 -4261 -3199 -13930 -25902
13686 -25902 -16293 -9729 -13047 -19578 -21603 -29030 -21578 -5250 -13821 -22003 -14011 -10920 -12744 -2274
13672 -2274 1050 -4430 -13678 -19308 -17288 -9141 268 1235 -4991 -5413 6437 7049 127 1421 6587
13657 6587 8206 10213 5215 775 1835 11346 10675 9490 -2743 3099 -895 -8196 -4598 -9022 -15020
13642 -15020 -11898 -13657 2461 11113 11826 10141 -781 -4292 -7911 6291 22367 6867 1646
13629 1646 3723 302 -7934 -4902 11002 16986 11069 5345 13153 8611 1481 -869 3467 -6253
13615 -6253 -11067 -1385 -3111 -1938 979 -4134 -9127 -1603 6282 18563 8590 11956 11381 3895 -4973
13600 -4973 -5576 -2805 -9579 -24160 -30319 -13502 -2923 5025 16184 16078 7041 9902 9232 -433
13586 -433 -7668 1012 3388 269 -566 2035 19322 12398 2002 -6044 -4986 1901 -2516 -5411 740
13571 740 5588 2590 731 4642 -694 -10706 -14516 -30017 -19727 -5027 -8185 -9423 3486 15538
13557 15538 9693 12206 17769 9690 -5900 -16355 -24733 -18987 -13371 -15613 -23365 -15526 -4866 -895
13543 -895 -2489 -1670 11936 15365 13690 11802 4897 9114 10873 10962 -35 -182 9561 14008 12260
13528 12260 8872 -1817 -11430 -14769 -10093 -6992 -2104 11966 28579 32200 26368 22942 8813
13515 8813 3907 4497 2113 10859 21973 27408 19204 20182 17304 8496 9675 15346 7045 4220 1904
13500 1904 3316 2915 -2632 2 6158 14933 6080 -1785 -11168 -22930 -31069 -16522 -177 14369
13486 14369 13468 11660 13186 10996 20916 18450 18047 14768 3772 1414 3311 -2939 -4569 -5527 -8692
13471 -8692 -8579 -3526 -16151 -19126 -22415 -22334 -17590 -7649 -16157 -23476 -7003 6678 14046 4600 11310
13456 11310 21684 16025 5387 2960 2022 1874 3865 10683 -2580 -17890 -15865 -11504 -17761 -23307
13442 -23307 -20954 -19631 -15923 -9869 -6338 -5735 -2710 -6699 -8951 -13734 -27598 -29142 -8873 -857
13428 -857 -7383 -3834 -2178 -3512 -8428 -1157 690 3761 -652 2902 1322 -2137 -5817 -8559 -6605
13413 -6605 2731 5039 -6250 -4238 -7854 -8038 700 11577 26340 35429 24419 11116 7786 3883
13399 3883 -1779 -8305 -8945 2505 2081 -1510 6024 11318 15721 13389 3516 -7883 378 13282
13385 13282 10968 -2218 -10790 -2356 12007 13308 6482 10776 12837 8525 17641 10770 4063 -62
13371 -62 8553 10296 6953 7118 8173 -6402 -13317 -7237 -5901 205 -2693 2474 7547 997 217
13356 217 -3339 -509 -2234 4717 9268 4156 6202 -878 522 -3925 -12728 -6861 3218 2970 3654
13341 3654 5137 12246 3219 7076 4648 5022 7672 8865 -1547 -13403 -4940 3568 -4658 -8568
13327 -8568 -2915 -5423 -11144 -722 -2040 -2583 6142 4276 12328 8384 9235 12054 74 -12798
13313 -12798 6087 21540 24648 20647 11615 -6573 -300 3430 6549 2959 -4044 871 528 2342
13299 2342 -6358 5158 19456 28213 18702 11015 640 -2253 4268 13044 6782 -2464 -2676 6512
13285 6512 5806 13164 17933 14086 5294 1993 -5278 -7240 -13324 -5642 -11739 -10015 3301 5624 -517
13270 -517 5385 -446 -6969 -6379 549 16670 22555 17929 -2694 -10577 -12403 -9301 -7797 7280
13256 7280 9140 -4707 -19752 -21148 -9925 7686 15449 22577 22389 23061 24211 3395 -12353 -4611
13242 -4611 -333 1519 -327 7721 5930 10215 6200 1099 -11087 -10031 -3379 2998 9035 10707
13228 10707 4286 2305 5084 -5266 251 10958 6463 9343 9343 8418 6431 3180 -319 792 -9957
13213 -9957 -7824 -1196 9132 17063 4923 891 -12392 -25076 -13033 -4153 5473 6070 -7559
13200 -7559 454 15143 20988 31257 22956 9002 3429 -7898 4448 8295 -7700 -15535 -17112
13187 -17112 -20604 -20802 -14657 -6866 6468 20491 15497 6261 9708 1302 -3063 -6129 -12100 -18681
13173 -18681 -10374 -4114 -6739 -2365 3183 20760 19792 6722 11759 5374 -6919 -8475 3530 4826
13159 4826 8278 10057 13424 17069 23451 20753 27246 23889 8511 4289 -1592 3445 984 8542
13145 8542 11026 9917 2658 1972 -564 5144 9238 8361 5636 9956 10888 10300 6890 1542 132 16439
13129 16439 23367 15530 19559 20172 18142 11631 16329 18906 9944 7364 1707 6974 8676 -3716
13115 -3716 -3470 -791 -10136 -12473 -13414 -15319 -7550 -6465 5645 5190 7247 8600 8448 6955 -2582
13100 -2582 563 1321 12966 18735 11506 -13124 -19767 -12576 -1705 4463 22868 22806 6818 -4752
13086 -4752 -18697 -18496 -21511 -6162 8074 15856 -980 -11797 -18797 -8956 9672 14124 15584
13073 15584 13725 3935 -1245 -1147 -2501 3277 16558 16085 20383 14566 8631 -3757 -559 568 2942
13058 2942 1594 -3219 -19300 -22797 -18070 -1243 10496 6637 9832 2419 -10014 -7162 -8466 -1876
13044 -1876 -2440 -355 -4360 6620 16101 13534 -2529 1099 3904 -2549 -6797 -2539 5533 14361
13030 14361 15871 8286 3280 -1499 -8384 -11071 -7522 -3338 -11355 -19167 -9374 535 1680 2506 1213
13015 1213 -618 13176 20761 23991 5416 -1235 5552 10654 15185 10232 4326 3921 6960 3547
13001 3547 13204 12263 -1072 -3822 -2336 -2035 822 5144 2713 351 -9391 -12721 -2559 -8584 -8818
12986 -8818 2038 11419 12722 9458 5772 -2567 4066 5493 4515 1469 -5507 -12521 -12035 -8490 5385
12971 5385 12035 6895 6463 11560 7064 -7567 -6119 2755 16783 21157 9497 -3334 -10000 -2105
12957 -2105 4392 -5735 -21036 -26706 -21832 -12265 -9038 -13911 -5599 -3360 -7068 3193 19873 22269
12943 22269 12445 -3311 -4838 -1694 2795 7353 10654 14656 8802 3205 -8411 -5880 1473 7987
12929 7987 2834 -5911 6212 13671 5912 10663 10387 10416 17 4404 15257 13936 5563 -5919
12915 -5919 -779 -1050 5089 -233 -8599 -13706 -4414 -16039 -22328 -9826 10920 29349 28338 11485
12901 11485 -2263 1099 1541 -2930 -7480 -7248 -5271 801 12481 15086 -621 -6436 -1175 2126
12887 2126 5177 15071 6541 1405 4651 1252 -600 1127 -4402 -3377 2602 -5757 -12988 4839
12873 4839 6459 5982 21279 16758 2045 -4599 -361 3405 -2196 -5005 -3068 -2829 -8550 5334
12859 5334 13778 8605 -577 -685 -9636 512 20857 29655 22517 11450 -164 -2763 6079 2187
12845 2187 -377 1711 7481 4614 5843 2937 -4990 -18365 -15148 5132 4021 -2503 -623 5946
12831 5946 3548 11015 20026 14731 12952 -550 -4947 -4916 -3190 -2776 -4872 4678 14096 8481 4911
12816 4911 7929 669 4402 7084 8961 6717 6448 13985 -1278 -15318 -724 13050 17644 3778
12802 3778 1448 1657 5637 5936 5599 4991 4838 1015 -5860 -11961 -16060 -10058 207 1258 -1480 1270
12786 1270 7847 6929 -3724 -1616 -2504 -1138 660 -9766 -18257 -15618 -12005 1257 11196 22107
12772 22107 15062 18484 24226 32169 20060 -3612 -12631 -307 10328 -4409 -19871 -10393 1197
12759 1197 -3514 6396 13399 14983 4412 -2983 -1193 -2112 -1556 12292 19449 21351 5157 -4268
12745 -4268 -5849 -6493 -3889 -15707 -15859 -15676 -6032 -10373 -11355 8176 4680 2033 8662 17020 23822
12730 23822 17813 22167 32508 26837 7548 67 4003 17290 16069 11940 12226 12382 9317 7398
12716 7398 3336 2708 5537 5214 -7078 -11321 -7601 -9744 -17349 -13540 -6493 -8133 -13192 -22820 -19315
12701 -19315 -11412 -3456 -1443 2805 8706 11152 7609 -1048 4038 10840 4036 -45 -2038 6127
12687 6127 16300 48 -12842 -8620 -984 -1028 217 12863 17334 19583 26737 29338 37396 35047
12673 35047 28070 19648 2637 -4806 9838 22922 23925 6466 -2900 -934 122 -550 1190 2712
12659 2712 5661 1587 -4050 -10551 -3627 -4225 -4551 -7375 4081 8580 25692 19497 10850 10557 13272
12644 13272 7811 13787 9014 8206 11611 10596 12142 11039 4207 -5938 -12984 -17039 -12738 -4420
12630 -4420 5267 7608 6775 4295 -6128 -115 532 -805 -5597 -7384 594 -8960 -19222 -10893 1007
12615 1007 4581 2592 -9298 -18386 -14914 -8942 -8242 -14169 -7638 -2819 3735 6698 5133 -9232
12601 -9232 -14325 -10125 -8428 -10790 -6704 1559 1843 -8881 -13612 -11671 -8173 -6060 -5507 -3994 -1857
12586 -1857 -5551 -7646 -10330 -13794 -3108 8013 2622 2495 -10143 -8728 -1184 -4166 5466 -6459
12572 -6459 -12696 -12505 -18063 -16498 -13056 -14494 -6795 -877 -983 2323 2865 -12446 -9058 -13344 -7489
12557 -7489 5213 -1614 -37 1176 5610 6310 -6039 -26777 -19039 -480 1677 -850 49 -4992
12543 -4992 -11165 -11177 -13581 -17340 -19738 -14975 -9982 -1479 -2521 -1911 3857 -409 -2928 2230 313
12528 313 8397 14389 17265 11799 5574 -1290 6952 15271 20000 15400 4299 -2486 9136 18545
12514 18545 29014 22276 3823 -10022 -7988 -2412 5444 9659 3654 -5641 -9942 -12750 -5521 -8100
12500 -8100 -7653 -81 5709 -4776 -6313 -4632 -9150 -8209 1202 2640 -4293 -9490 -11872 -12791 -2457
12485 -2457 -1003 -2404 -2673 -417 -4948 -1939 6288 14119 15870 23004 26615 21359 25286 14398 10576
12470 10576 11562 -3854 -14055 -7352 -7390 4211 3299 2266 11017 16964 15420 7146 3906 13351 12140
12455 12140 -2527 402 10624 9492 -3160 -4207 -8965 -4310 -6325 9474 2776 -5623 -8720
12442 -8720 -1778 13276 10659 5439 2357 -5631 -8389 -14267 -7050 2866 6264 14065 14281 13183 9777
12427 9777 432 -7351 -8223 -5735 -6621 -2480 -603 -2794 2173 -3061 8261 18205 29111 21379 24129
12412 24129 20199 5910 7385 12009 5850 -9562 -9102 -9032 -16986 -4740 -3783 -9030 -16032 -24971 -19678
12397 -19678 -15574 -23198 -32525 -40300 -24569 -10283 -1000 -13449 -16881 6480 10507 1674 9055
12384 9055 10611 14331 -482 -11999 -21541 -10197 -5794 -8910 -8972 -2954 -1371 -1889 15025 6970
12370 6970 -1120 -2579 1924 10112 20161 20389 10405 -1238 -759 -4331 815 3141 7978 14011 -1007
12355 -1007 2671 8637 9424 2996 -896 15317 20146 9761 -312 -4431 1233 320 -1533 2538
12341 2538 1436 253 -6832 -5531 -7545 -7489 -9454 -5283 -3335 3814 12147 6867 15230 28495 27394
12326 27394 12551 5642 2913 11826 22240 18338 28493 19724 1796 -4636 -516 10381 16498
12313 16498 16574 11341 11383 -1307 -14865 -17711 -14253 -6265 -9928 -1476 1412 -3216 3899 10827 6822
12298 6822 -7128 -8128 8207 19174 15786 -9287 -18878 -7775 -8452 -10125 -18798 -28680 -21562 -11368
12284 -11368 -5330 16568 14547 9859 23249 25400 25179 28720 14999 180 -4954 6057 7487
12271 7487 2843 4305 -5467 -17685 -159 8001 -2206 -21417 -13243 1827 1946 4503 673 -8861
12257 -8861 -190 1804 4504 987 -4040 -14730 -10899 -17596 -11897 -1565 10932 15540 7773 10475
12243 10475 9230 18346 29325 20582 -753 -2960 -5372 -388 9574 4171 -5606 -996 -892 6446
12229 6446 -4708 -5799 2129 -11591 -9401 -15931 -16603 2729 5313 -10903 -9842 -159 1144 -874
12215 -874 8028 13611 18294 16096 13722 17429 7477 2734 -1809 -2850 7385 11079 14802 7352 4539
12200 4539 7286 11595 5617 -3176 1197 -9061 -15516 -5592 -232 -601 453 3887 4655 19154 24227
12185 24227 26825 31970 29153 12066 10077 2901 -1837 -3845 -5117 7246 8496 14987 31181 24044
12171 24044 13190 11708 2186 4771 10326 -150 2081 1585 -2016 -3534 3059 4494 -2052 2504
12157 2504 8529 18161 16255 11746 17119 10418 -421 7982 11435 7025 6900 -700 -6391 1974 9635
12142 9635 16443 8246 6660 -1992 -3092 -6907 -17530 -20639 -12382 -12631 -8822 2081 8213 6927
12128 6927 7688 22768 23262 10948 -1579 735 9945 9578 13585 8977 920 5258 7635 4062 3606
12113 3606 4904 7471 10586 6412 -112 4200 9245 10186 11649 9776 1086 -1928 -11184 -11754 -3170
12098 -3170 7806 14573 17554 12765 7459 13159 20254 18624 11066 11086 7956 5391 7868 5746 -1417
12083 -1417 7619 8021 12416 12608 11831 17871 13867 8567 -593 7900 1395 1284 -5278 -18693 -19978
12068 -19978 -12531 -5458 2602 -2348 -4074 11209 17690 5885 -270 2932 3259 3512 1162 12684
12054 12684 25719 26885 14347 3143 -6625 -12653 -4863 6714 5616 2137 -4141 -5148 -12116
12041 -12116 -17479 -14200 -15600 -1446 9118 18426 30486 25119 20569 17197 19678 16633 15070 16512
12027 16512 25855 32184 44983 31060 15112 12585 19835 29576 31122 32265 27816 24518 26823 23397
12013 23397 1952 -7344 4119 20613 15424 8126 4666 18345 28429 26759 11460 13931 20484
12000 20484 20993 18458 28657 22214 15631 6998 1528 -10297 -2781 14412 20897 19159 12655 3365
11986 3365 1453 2306 -994 -5121 -10858 -6410 -2456 -9686 -3647 10287 12621 6818 17421 11375
11972 11375 -885 2361 3876 -18625 -13472 10116 24871 20927 7697 2252 -4444 3262 10024
11959 10024 10079 10932 7563 10704 8998 -3898 -4795 8914 9584 12797 13795 15072 19179 21786 16422
11944 16422 7459 5536 9174 8289 5822 6897 11616 13380 5761 184 -17054 -15101 -21032 -10380
11930 -10380 7743 16248 21877 21642 15539 19254 31862 36247 26955 27326 15138 7265 10932 13408
11916 13408 2986 -3441 -7964 -3163 -1540 -3302 5195 438 2745 8361 -1203 5870 7335 9443
11902 9443 7469 7658 -8825 -18358 -20091 -11622 8964 5672 806 449 2483 3815 -6218 -2737
11888 -2737 3430 2577 1662 12264 12642 14816 24454 23018 14878 13687 8744 825 -1029 -2303 -696
11873 -696 2605 -4061 -2566 2538 11723 18521 20461 16943 4416 -3733 -9752 938 -1356 193
11859 193 13708 14383 18477 21327 14858 12340 15496 11523 5729 9008 7142 5389 6928 1577 -11712
11844 -11712 -17473 -7195 -5754 -14202 2294 10331 4059 -8808 2577 11345 10529 7022 -7053
11831 -7053 -11243 -13108 -865 4682 938 682 1847 3520 637 -4057 6167 14947 13241 12632 8479
11816 8479 11761 8399 9971 23248 20870 11948 10713 9094 6964 -2213 -1382 7137 11519 6070 2342
11801 2342 2867 9369 10211 5624 6625 2720 14220 19017 3260 -3482 14458 16783 11575 7326
11787 7326 6065 1988 -1263 -7733 -3819 5705 240 -2233 6919 8458 3928 -3512 -10277 -10241 -17479
11772 -17479 -9587 -10489 -5786 1772 17416 20462 12878 9111 10025 13095 8838 11114 9887 -8798
11758 -8798 -6628 -699 -6620 -7707 -14483 -11311 4129 11210 1144 11594 15293 16201 12942 9206
11744 9206 11989 10386 14901 17441 19195 10563 -836 12640 17837 12893 8662 18349 28439 32150
11730 32150 29201 30915 51758 56712 55008 42118 31854 17113 11504 21609 32338 31559 28783
11717 28783 27289 24738 16830 11358 1813 9573 24570 20011 3632 2677 14390 7317 7842 11906
11703 11906 12732 17606 18663 21774 28591 46778 57878 52604 43997 53349 54794 48926 59461 66192
11689 66192 56244 40159 43626 61634 68729 87019 111952 145469 155355 150301 140956 123443 98752
11676 98752 75381 66734 61688 49763 49072 47503 50586 48855 49091 42542 30668 25214 24935 28211
11662 28211 32615 35524 30945 18760 24961 35422 41143 42684 50097 53380 72995 93758 120219
11649 120219 142262 154429 153020 140599 123024 97845 82224 67064 56557 43971 53449 77136
11637 77136 107003 121779 142795 160022 148440 127733 100710 86186 68834 52730 50331 41718
11625 41718 35660 24290 22729 23249 29838 34715 38556 31409 23646 17072 20748 33098 41187 40435
11611 40435 39995 39620 33512 33587 46233 72410 107894 139208 161923 166899 139957 113232 94175
11598 94175 76066 54184 51559 49392 53524 50564 49667 51572 57150 54173 58705 62429 55570 43987
11584 43987 50019 54535 35407 16560 8137 23529 15226 10454 22097 33293 48460 45727 26862
11571 26862 10280 7504 4210 9057 16987 17001 13803 25495 37128 32055 26400 26669 21551 25592
11557 25592 47799 55023 55900 53127 39246 28458 26123 22895 14159 12534 13456 1424 5824 13046
11543 13046 6224 7928 15382 21653 26907 27165 23982 18262 17517 21266 10851 3106 10712 14807 15062
11528 15062 6126 3262 11058 20870 27304 16692 14971 11984 12695 8986 -604 679 8969 9704 9020
11513 9020 2001 -7586 -2712 3151 10087 -1710 -2085 -6436 -2324 1317 13962 20296 36797 31581
11499 31581 29863 29308 39077 45855 41802 21497 -4054 -2149 2016 10931 24151 29175 34279 40012
11485 40012 41673 28076 27798 38968 42770 36064 29962 25476 29375 24910 14261 29328 24795 18542
11471 18542 10685 11237 10437 10169 15438 16019 1341 2601 4632 5649 -5382 -4309 -2838 9925 17604
11456 17604 15141 15464 15703 24796 19446 21387 27004 32869 34106 40027 50537 56722 50376 49161 61691
11441 61691 73784 81559 89658 99907 112860 134025 182816 255156 354640 519431 823330 1309376
11429 1309376 1808959 1960021 1750438 1395505 1013106 682464 467243 326557 226403
11420 226403 166238 128596 99492 79620 60994 54819 50509 57059 63654 52354 35541 25456
11408 25456 21842 13703 20100 38706 47046 37718 32947 35441 30240 28991 23073 21888 24374 15662
11394 15662 19633 27515 18640 18070 15082 10474 20956 21148 8834 4350 1391 11200 27250 20378
11380 20378 7837 487 4838 12511 27054 28510 23873 31121 26166 24140 21007 24176 38879 31137
11366 31137 22429 28786 27817 25977 34466 52588 55028 38538 31818 30492 27648 23476 20893 35970
11352 35970 33853 17944 4410 11378 11295 7253 7520 6942 16395 25217 27699 16097 7954 7545 13376
11337 13376 2309 -4422 -939 2176 8118 14855 19713 14554 15362 22354 27117 24791 10784 2841
11323 2841 6307 17759 23823 22832 22918 29967 44433 33164 25722 20694 20837 19564 17598 17051 12690
11308 12690 6959 17681 26770 21080 9962 17538 30187 30185 15447 10759 10845 24289 31677 43684
11294 43684 46345 43706 32320 33390 31180 30558 29156 27649 28451 26458 28461 33743 36020 27283 40371
11279 40371 52372 50160 29902 27513 33416 32831 31260 21255 22485 27401 27792 20423 11910 17379
11265 17379 22218 23563 26103 11319 4791 7981 10723 18661 17060 11460 14260 28653 38226 38268
11251 38268 36423 29181 27978 29995 33435 37684 41954 49758 61220 71645 81956 81937 97494 130236
11237 130236 150196 162308 164569 171841 178202 179687 174269 172832 173453 157162 142557 119095 93074
11224 93074 67231 59867 61217 45942 33862 29119 33004 36797 35406 41950 48807 51997 56969 44466
11210 44466 49091 54304 60338 74090 78997 88031 91604 85053 71504 64060 47129 33850 31281
11197 31281 31944 29220 29813 25553 38760 48713 43654 18403 7882 5646 2359 -7579 -7669 843 1852
11182 1852 3218 -3573 -11689 -10660 12718 19983 30939 46725 52315 56767 61608 67200 62450 61759
11168 61759 71464 74219 69616 76737 80971 52012 11026 1898 12649 10644 7107 19816 35919
11155 35919 36514 43820 56443 62109 58662 47306 32349 38524 43938 47850 40846 34497 24699 7881
11141 7881 7143 -10 -2375 3340 -4963 -16674 1502 53625 124666 213247 270832 283956 274575
11128 274575 254854 230358 206904 175553 166909 161387 160997 160023 165355 162935 161852 152134 148715 153737
11114 153737 151179 149182 162015 186152 234000 309394 392476 453534 486410 519575 567492 557116
11102 557116 472809 379605 303974 237645 179249 150007 130154 124887 120000 126998 134423 128183
11090 128183 133008 134416 138232 137894 142694 161614 177034 183104 193602 193020 174809 144130 133119
11077 133119 135492 139534 138732 142353 153749 166026 183884 196349 203327 213230 228414 249758 275282
11064 275282 282670 288740 300276 305588 302189 295629 281472 265306 254793 256285 271179 275786 286990
11051 286990 297574 299174 299290 293246 294489 302236 307458 312470 317602 333879 356352 382638 403369
11038 403369 431638 448465 460603 455985 441787 466760 507505 558378 603100 656729 686228 708462
11026 708462 736323 767355 808597 841491 871708 913952 974558 1015261 1066647 1148700 1206190
11015 1206190 1260922 1315544 1391828 1456741 1517496 1598921 1706385 1836610 1999045 2188064
11005 2188064 2415560 2619641 2773984 2942352 3173992 3512652 4009202 4612619 5269416
10996 5269416 6039300 7014126 8285584 9746116 11039740 12204077 13493014 15161317
10988 15161317 17351214 20139861 23804368 28790912 35775744 46552942 64508343 96040940
10980 96040940 154076131 250644666 351988023 375638724 332238678 264442820 190732134
10973 190732134 128147488 84229896 57232270 40922932 30550924 23554213 18664392
10966 18664392 15136179 12499584 10652268 9571101 8937496 8149226 7122586 6035540
10958 6035540 5023767 4234597 3726647 3394101 3111407 2847496 2557452 2264852 2007888
10949 2007888 1842732 1740185 1654376 1572155 1477176 1375541 1284229 1183260 1082642 1030664
10939 1030664 981063 908555 849372 810333 782255 752061 737678 705088 660168 624037 605500
10928 605500 582019 565839 537721 524452 537800 551730 556330 555852 533486 507537 466015 423945
10916 423945 406421 408905 419977 420840 397067 373392 355458 347399 343136 322936 307527 313337 304833
10903 304833 278303 255106 258431 266498 252325 228277 221423 191593 162673 135301 138601 142406
10891 142406 145880 139742 136273 140676 160691 166905 157814 165461 176099 185111 184448 197612 202870 206599
10877 206599 205073 193852 180878 143171 102643 89830 101381 118003 145946 163449 172709 169413
10865 169413 157468 153935 151098 150094 159455 177975 192556 216829 229613 222014 207237 221552
10853 221552 246928 288294 334951 366528 379249 317583 240990 185251 174739 180213 188076 176421
10841 176421 156244 131093 106486 114373 114570 84854 53493 41948 43103 34539 14271 8257 -1445
10828 -1445 -27769 -72497 -113725 -136846 -163771 -176613 -123133 -23554 51350 97166 133488 154363
10816 154363 155062 142129 135229 117405 108452 96587 89031 91018 85131 87135 97843 109248 108808
10803 108808 73982 59428 72686 73761 70807 74086 81228 96370 105179 115409 110168 95297 73585
10790 73585 44143 32067 17095 10700 20496 32990 61187 74501 79546 70266 54071 39492
10778 39492 53882 66134 61521 73271 81654 92263 90202 85221 86123 96298 91802 82137 75663
10765 75663 65528 44444 30865 28004 34839 38402 50238 73348 73351 50994 41811 30127 8970
10752 8970 -10033 -11184 -10094 1723 9465 14686 -3304 -13529 -9994 -10695 1135 7653 9903 15587
10738 15587 18719 27814 22031 17433 30179 28983 17712 17218 8956 8424 10000 6264 4066 312
10724 312 6406 18109 24624 25132 25604 33561 23708 19326 15505 7747 -6309 -15745 1004 8934 8673
10709 8673 12627 25942 20864 19694 28884 41730 32186 26848 24347 16390 18035 17126 4101 3669
10695 3669 11860 2521 -2939 -2629 14729 21704 31682 33095 21524 20394 15393 13317 7217 2909
10681 2909 7090 16588 18840 15523 15538 19252 13889 10159 5581 2346 -56 -7544 -11909 -15314 508
10666 508 10643 12729 5578 -1911 -12041 -13948 127 17119 28788 37828 44217 37827 23858
10653 23858 28733 23004 29213 31696 32613 31194 13211 -169 13124 30055 25618 25407 30162 25963
10639 25963 25779 24987 20708 22911 12632 6300 6007 17144 21105 8851 7298 7438 4714 -4702 -3924
10624 -3924 -1481 1262 -9510 -12133 2357 21676 32918 24754 14209 1268 -4607 -3998 -13416
10611 -13416 -11533 2144 -4398 -12693 -10392 -15121 -13255 -2743 -2176 -12787 -13753 -6304 -1005 -2198
10597 -2198 -3483 -5104 -4433 -5439 -7421 -10362 -2538 101 4025 10528 17217 18358 4634 -558 2298
10582 2298 1603 -2540 -4878 6216 9629 23062 34097 16460 5614 6139 -2088 8811 18095 19229
10568 19229 22006 30200 23773 11103 10122 19108 34437 35505 28250 15233 10534 11216 12549 21403
10554 21403 24058 26963 35441 27377 6384 13581 19062 20135 22565 34579 40912 36235 29955 41058
10540 41058 51303 66859 72392 71244 75262 88412 83446 74559 89199 115037 105333 107798 128371
10527 128371 161048 207733 274602 384654 582838 937277 1461029 1882276 1885719 1624413
10517 1624413 1265736 907823 614514 417200 290807 215175 154448 108199 76074 53844
10507 53844 42620 42985 44159 41238 29719 14034 18229 19520 16461 -1023 -8177 7769 18699
10494 18699 17177 14609 10644 11551 20829 19660 13606 18351 13792 19836 24957 30044 26696 9099
10480 9099 3422 -2422 -12159 -3375 7910 7640 6923 4298 5353 -2023 -5299 -10659 -12868 -11169 -8785
10465 -8785 -12486 -13160 -5165 -2744 -129 1441 13612 12617 24073 18723 1237 -15479 -13276 -10670
10451 -10670 -9779 -16943 -12136 -5204 -9478 -7336 -3268 -22683 -32452 -31193 -19784 -14275 -11351 458
10437 458 4954 -3481 -9433 7497 9443 1405 3421 -246 7317 5952 4299 11244 10101 1033 6908
10422 6908 2198 -2329 7158 16887 20316 19460 2425 -599 -9138 -1015 2970 5978 -3001 -14436
10408 -14436 -7798 860 8465 12691 1624 -17700 -27745 -23542 -16280 -3182 8329 8415 277 -10687
10394 -10687 -8030 -624 7425 7390 375 -12041 -6211 -4908 -5223 1631 2272 -8968 -7888 -9565 -10254
10379 -10254 -1293 2542 4332 10007 13727 -3473 -21138 -9549 1233 7229 17288 15601 16736
10366 16736 9620 5679 -3001 379 17337 25254 23278 26150 22492 24252 32414 43308 41827 35680
10352 35680 23346 8113 12032 12832 -1318 533 10848 20669 21681 21890 28323 22586 9872 4465
10338 4465 9915 7974 846 1979 1885 -1528 6990 12504 -3217 1968 7342 10370 7690 4589 2921
10323 2921 5339 1346 -3564 5321 7799 3061 -7139 -12533 -8514 -20652 -24978 -27501 -15810 -4576
10309 -4576 -2436 -8200 -6778 -16751 -20876 -8457 -1885 3096 8103 2024 2230 -7289 -2334 6443 3318
10294 3318 -5599 -20542 -31298 -12278 -1213 -9738 -23250 -14339 -3304 7957 3006 1755 1838
10281 1838 4563 4676 2269 1454 4856 17334 20237 23337 9082 7036 15111 27100 24235 17658
10267 17658 24634 28503 12698 7639 13927 14306 13443 10456 -5571 497 19514 17985 4060 -3892
10253 -3892 15868 19112 12228 11424 9321 1841 7997 -606 -3645 3608 -636 -7724 -7677 -8801 1882
10238 1882 6691 5401 6673 4618 -1530 -5199 1623 4084 5836 2848 -473 -4141 5291 -2932 2371
10223 2371 14216 8275 -2457 10221 18786 18479 12399 6455 3869 6 -7904 819 4645 680
10209 680 3757 -5325 -16116 -18924 -12940 -6513 -5171 5196 3835 -1451 1244 2349 -8006 -5590
10195 -5590 3062 6894 4992 10300 942 -3972 -299 5494 3691 -2943 -8044 -7069 -9503 4780 17633
10180 17633 8944 -1048 -507 -553 4591 7311 16624 10631 1334 -15581 -5015 11190 8352 9370
10166 9370 -3736 -14751 -2405 10015 12566 13334 -425 -12049 -5863 8492 -1554 -20020 -32224
10153 -32224 -23967 -3039 -5014 -19453 -17738 -12793 -10043 -13656 -17698 -16801 -10480 -7556 -11116 -12407
10139 -12407 -12925 -10037 -10261 1662 16101 1947 104 9788 3960 11317 12670 11288 6970 4533
10125 4533 4910 4412 611 1384 -11138 -2973 8339 5142 2916 -2505 -1335 -244 8130 18614 14664
10110 14664 -185 -15712 -4118 -882 -10570 -8031 -16305 -12902 -14035 -20153 -9670 -13128 -26419
10097 -26419 -32653 -31168 -22061 -5089 -4698 -11369 -8967 -2307 8853 2100 -2644 -4704 -9184 294
10083 294 2527 6559 2187 7153 4354 -6709 -19609 -13943 -14796 -15812 -4948 2032 -4505 -10343
10069 -10343 -6698 -3505 -3893 -1038 -2852 -7537 -8986 -4017 9225 911 4076 2471 -3428 -5350
10055 -5350 1356 15612 19277 13368 15266 25857 45022 66064 69700 52573 33769 19989 5061
10042 5061 6350 10928 10296 5654 5154 2773 -11120 -23020 -24084 -5698 2792 2310 7226 8861 17018
10027 17018 13088 13153 6759 3452 -11956 -20470 -23841 -19433 -8476 -5057 1686 9057 14199 4325
10013 4325 -3082 2916 403 -7716 -13167 1221 10835 -6755 -16058 -11689 -3564 -2637 1318 2300 6330
9998 6330 10896 10467 5856 -874 10404 11779 3233 -4778 -6480 4575 23328 18637 7607 5268
9984 5268 -3545 -10292 -13262 -5316 -6659 -14999 -20388 -13989 4372 20612 16961 -982 -9883 -19573
9970 -19573 -17914 -1323 347 -8064 -1219 8338 5962 5317 -6897 -3770 2302 1270 10508 1452
9956 1452 -4216 4617 3863 17440 14887 24808 22714 13202 9609 20822 13872 9227 1257 642 2641
9941 2641 -2415 -9471 -8733 854 2768 -4670 -17417 -13555 -10560 -14180 -6718 -8595 -700 6717 -2195
9926 -2195 -3250 -2485 -2372 -8645 -9963 -10687 -13820 -5679 8558 13173 8842 1373 -15769 -13347 -2817
9911 -2817 3460 5110 17990 15773 13210 22212 24103 27440 3351 -2509 -8035 -8364 2112 -1782
9897 -1782 -3039 -3258 13750 13663 14249 21277 17633 9376 2623 1770 496 10337 19979 5971 9933 1218
9881 1218 3202 5511 3497 -5189 -11621 -4901 13002 20132 16237 -3840 -1070 3857 7831 10479
9867 10479 11369 11999 -544 -7811 -23328 -26537 -18273 6560 19063 17846 10515 12699 19764 13157
9853 13157 16378 4179 3206 -2063 -3942 -8383 -4128 -15670 -28607 -31204 -10364 8171 3021 -6622
9839 -6622 5307 9635 1727 -6533 -8658 -15830 -25239 -13936 -5867 -400 -3867 -3906 -3359 804 7802
9824 7802 -1506 2979 9062 6171 6458 13993 14027 9985 8384 2211 -2 5004 6733 13322 9306 17629
9808 17629 33101 47347 44071 38689 33122 22685 16838 27806 39752 73035 98394 130758 156404
9795 156404 200304 293143 471753 781861 1102518 1155505 1007287 798490 562377 374909
9785 374909 253362 185191 113338 78919 71006 67860 55842 43967 37178 45006 43633 31922
9773 31922 21275 20770 21769 13131 234 -4605 -12698 -13721 -5843 -2981 -4045 -4173 3687 16317 19878
9758 19878 11184 3466 11606 18225 12165 102 -4803 -12694 -27065 -24420 -6229 451 -6039 -13211
9744 -13211 -7044 -4229 -684 6812 14562 12702 -5841 -17807 -19779 -25174 -16772 -13055 -11018 -10351
9730 -10351 -3359 -5785 176 5344 2005 6507 7961 1127 2117 -3295 -11844 -2775 -2125 -14269 -12589
9715 -12589 -10575 -7368 -6659 1702 1140 1382 1012 3689 -3922 -4926 1538 -760 -9896 -7150 -1592 -11053
9699 -11053 -11215 -6092 -12318 -19741 -30240 -21375 -3370 15 -4985 -9933 -7705 -13509 -13355 -12602 -7558
9684 -7558 10255 17132 14624 9767 10290 3572 2713 6201 3604 -5342 -7990 -4001 111 -7814 -6634
9669 -6634 -1492 -2146 -1261 -7456 -13396 -13804 -6899 -229 -3464 -13335 -21314 -19019 -12092 -6548 -11427 -23153
9653 -23153 -26208 -28842 -26930 -17528 -7496 -10257 -18049 -24266 -12007 -11693 -15578 -16478 -21406 -15458 -2375
9638 -2375 -9610 -2293 -1094 900 -3126 -9938 -4628 -6807 -1753 6687 11949 9502 4795 5602 20919
9623 20919 18551 11071 -1857 -539 -4930 -3046 -1452 2868 11559 14463 6185 -3985 -9961 -16292
9609 -16292 -14932 -3017 -1373 -5692 -3780 -3009 -9928 -12968 -14982 -5504 -811 850 6339 5452 11187
9594 11187 6779 4926 2356 -2889 -10147 -7071 -7297 1632 52 -10729 -5582 -2883 2916 1548 165
9579 165 2809 17413 7749 -2374 5333 17213 20353 16279 4091 -14996 -13746 -881 582 -1819
9565 -1819 -2237 6731 12120 12735 2017 7682 23273 23626 20257 12743 5812 -2665 -3465 7615 8136
9550 8136 7408 19450 17152 861 -495 3895 1104 6719 12651 2191 -1430 -7847 -12015 -13576
9536 -13576 -7871 -5306 583 390 95 7774 -3705 2327 9285 13632 5364 -172 -1388 413 3156
9521 3156 9497 3231 -10646 -8993 5907 7247 -4235 3327 9586 9889 1170 5498 14529 11833
9507 11833 7655 6454 -1561 -8840 -4082 9034 11946 11064 8865 2077 -1576 571 1002 -293 -914
9492 -914 -3999 -11078 -9881 -11145 -23542 -19385 1495 1505 -6056 1628 14275 11342 4674 -3914 2615
9477 2615 9063 19323 2058 -1775 -4979 5248 2038 3534 -6798 -6070 -4190 -10169 -14472 -22310
9463 -22310 -22507 -20828 -13645 -3454 2241 10567 5741 1277 1826 -6742 -12511 -11227 -1216 13341
9449 13341 16624 8516 1656 -7953 -9390 -13415 -7669 -945 -16511 -20314 -11399 -8824 -20215 -23676
9435 -23676 -13693 -9053 -7802 -743 -976 -10866 -11091 -10861 -9601 -14928 -23391 -16248 -10255 -20695 -15420
9420 -15420 -11143 1004 -4145 -3160 8314 17750 13485 11558 11321 8674 17378 18795 13120 7441 15023
9405 15023 12668 12204 -1296 -15543 -21423 -21558 -11770 -3623 -5906 -3878 2503 3771 -5212 -5488 7284
9390 7284 7573 5802 4336 -2462 -5267 -2716 -4904 9446 12798 -2612 -5533 262 13087 21374
9376 21374 8724 -5289 -941 -96 -6933 -9913 -11696 -15166 -13048 -14043 -15092 -3026 10249 5604
9362 5604 -5644 11668 19070 12282 -818 -3482 -7154 -6538 -14944 -4540 -1583 -2869 3472 -2449
9348 -2449 -3677 -6033 -8468 8709 20211 24349 28077 25887 15406 12965 17401 19651 22879 35095
9334 35095 25570 10365 10601 5171 6737 2782 -7899 -5538 6692 12382 560 -1637 -8653 -8910
9320 -8910 -2793 881 -1731 5117 10645 1781 -757 -13859 -8465 -1568 -1475 -3677 -2799 -4712 160
9305 160 8185 2539 -224 17420 20937 23950 2698 -3949 8537 28879 18864 21413 22192 24126
9291 24126 19585 2698 -7568 -19521 -28253 -30801 -32459 -17887 2633 6146 2641 7312 17263
9278 17263 20846 16864 837 -347 3478 8123 3694 -8703 -3067 -3101 192 4168 5835 -1410 -4332
9263 -4332 4301 6395 2398 -703 740 10188 16585 13073 302 -3256 -10471 -17110 -7284 -1413 3798
9248 3798 -7109 -4864 -1664 -13008 -11738 -7989 -3470 4975 15767 17903 13465 24635 12823 9354
9234 9354 9292 -3176 2784 12790 12602 9135 10084 7680 1872 184 -8306 -7870 -2712 4426 10822 3340
9218 3340 -2748 7040 15132 8193 7772 8171 7797 2761 1069 13028 25681 29950 26288 20073 6810
9203 6810 3176 4062 14701 2050 459 3206 455 -3299 596 3107 550 2772 12075 9683 -13
9188 -13 -4853 3253 11683 10033 11956 12692 9763 1116 12160 34776 27842 23409 28896 37206 32080
9173 32080 28100 29503 39971 22175 -7180 -3538 -7352 -11596 -2264 -905 232 3107 10776 8939
9159 8939 17646 9827 -4918 -1235 16221 18383 22392 21384 19344 17216 10514 17626 31344 30767
9145 30767 27274 28296 28400 30648 36858 30002 24949 25432 19009 24619 26842 33336 37571 33084 29116
9130 29116 47053 55611 56838 60993 64715 67421 64178 83220 83896 89878 94602 88931 89171 95820 99605
9115 99605 109486 117541 123551 135286 151803 166522 181075 207919 238964 263780 271167 296201 344358
9102 344358 393210 452774 511099 576035 672938 795390 940221 1127418 1378376 1706651 2182999
9091 2182999 2950435 4253918 6526683 10130844 13970382 15260304 13877475 11298928
9083 11298928 8382676 5847536 4008520 2799878 2037426 1528501 1182424 937849 774957
9074 774957 642810 536676 452401 386455 328450 274746 230674 200073 186475 184178 172048
9063 172048 155760 138196 132774 142352 128027 107317 109592 110369 94653 83043 69495 55524 49195
9050 49195 55633 64457 59686 63122 63983 56801 49512 49400 44615 34669 34092 44446 46120 48873 52205
9035 52205 47144 43000 26278 24077 31567 34507 37254 54039 52984 50282 43670 22788 16990 22263
9021 22263 26556 34437 35182 34150 34469 32283 31160 26581 20308 25843 23117 14447 16398 12283 14625
9006 14625 9276 5473 8481 6642 -3458 -8367 -7072 3722 14291 13643 12469 11131 16996 21424
8992 21424 29500 22308 37393 41009 42342 53800 57743 60566 70748 67347 82222 120312 163765
8979 163765 204855 241437 278835 289483 272174 237368 197034 153832 110789 74918 71294 62433
8967 62433 59657 58612 44106 33441 26698 38050 47592 47657 44547 48961 49588 35858 13181 12691
8953 12691 16071 23956 27727 30411 38271 39365 33841 27993 36539 33657 37429 49648 49668 58020 76089
8938 76089 91376 116159 143530 173487 238583 338359 447097 538156 573976 551544 496100 406850
8926 406850 326133 259871 205577 163765 133146 100962 70999 56361 48805 42555 19691 10295
8914 10295 21621 15631 10605 15463 27769 38446 36289 31763 22294 26307 20175 13572 13868 10219
8900 10219 16336 30250 35324 23772 26189 29888 38918 36375 45572 53837 68324 77656 103951 152060
8886 152060 202300 238208 262216 262510 242545 203119 171908 145556 114916 88406 66923 52647
8874 52647 54683 56528 43315 46091 39120 22224 17755 2834 -10908 2087 5210 -563 8382
8861 8382 19030 7274 7111 10360 -6560 -194 4036 889 4766 2906 8494 10900 10606 -10984
8847 -10984 -17913 -7206 -7329 -14764 -12519 -5692 7168 11338 4085 -8106 -7688 3417 3490 -8298
8833 -8298 -12185 -17881 -13683 -2134 3176 9074 11422 7214 4461 -13520 -14280 7113 15346 2862
8819 2862 1118 -1669 -11290 -10032 -14283 -12154 -4745 -4217 -5510 -3434 6992 11917 16447 19990 7265
8804 7265 -2311 4135 -2591 -7707 2352 10694 10672 14992 15712 13859 6645 6296 251 -5044 -6717 -4188
8788 -4188 -3590 -2944 537 -7307 -11873 -21075 -9106 1351 894 -404 3475 -1244 241 -6939 -21730
8773 -21730 -18788 -1169 945 6122 3196 742 3644 9648 3779 8729 19794 14809 8294 3383
8759 3383 10798 8139 208 -9236 3310 19412 20730 16343 14876 4633 -237 6496 7654 1333
8745 1333 -2286 401 -2234 1528 2867 8796 912 -12961 -24442 -12658 2775 11680 7352 1902
8731 1902 -8491 -7580 -2642 -2833 12430 19913 18248 17205 14021 1808 -2649 -10215 -14492 -6098 -7262
8716 -7262 -16556 -19715 -4692 6102 11157 14957 4991 4306 -770 -1065 5680 15501 3752 -2944 4388
8701 4388 -2264 -9074 -13691 -9116 -12890 -9279 2018 5625 7887 3892 2089 -5889 2608 12938
8687 12938 6971 17233 31917 25049 7877 -2320 -9340 -22256 -16432 -16033 -14489 -161 -2698
8674 -2698 2930 15810 14730 5921 -8249 -847 4105 11521 16580 15802 23286 18171 14940 9516 3100
8659 3100 3533 11596 25579 21905 1229 -6983 -12515 -8154 -370 11766 13378 20858 14649 2519
8645 2519 -354 13474 6826 -4800 -3220 4932 4593 8639 13875 11992 -2754 -9076 -5853 -1269
8631 -1269 9871 10615 17649 13705 -3074 -11170 -8277 3410 2057 -6212 6966 -1116 3155 11745
8617 11745 10792 3171 5444 115 -3960 9099 18870 7119 3337 17366 18655 25130 28717 21541
8603 21541 30365 38182 27017 4166 5393 16683 15013 8376 6574 347 -299 -6562 -1198 -2773
8589 -2773 -16773 -29627 -22742 -2985 -2163 -2518 2462 -2399 -388 -1919 -5292 -7298 -1413 4612 -4966
8574 -4966 4863 9954 558 -3009 -1853 -3149 1508 3183 -2656 -8031 -14902 -16741 -12653 -17714 -24670
8559 -24670 -13524 4875 714 -5692 -9621 -10980 -7344 973 12570 16227 18779 5201 6689 12537
8545 12537 4421 2116 2325 6890 808 12735 17992 -1619 -12549 -2109 637 1928 2948 2585
8531 2585 3793 -7023 -15627 -20975 -10164 -4196 -10181 -11769 -12351 -13175 -3584 7584 -8103 -13278
8517 -13278 -8743 -1859 7831 8924 -3998 -4248 1069 3701 4803 -5904 -11412 -277 8600 6381
8503 6381 4034 10401 10258 1932 -3702 -2314 8111 20642 -3686 -9339 11928 14601 11487 13026
8489 13026 10822 -5367 -11961 -6489 -9044 -2902 1311 -8340 -5100 7631 10829 10979 7334 900
8475 900 -4036 227 11900 21617 15515 7734 3038 -4218 -7536 -11848 -3331 6459 382 2871 3129
8460 3129 14050 13114 4695 10799 8322 2644 4936 4459 2161 10203 21345 29224 24836 9416 -9953
8445 -9953 -27723 -24150 -11588 -10741 -4650 -7315 -5141 11958 20140 21026 10345 7839 8478 -10809
8431 -10809 -11450 4898 14195 6925 1293 -804 -14135 -5346 -2044 4995 7640 -5641 -5455 -10447
8417 -10447 -8131 -729 12369 18026 14767 8732 -7390 -2394 11716 3069 4881 7317 10997 3929
8403 3929 2101 8750 11687 12760 7373 -644 313 832 8158 6721 -7628 -10648 -9369 -7333 1734
8388 1734 798 -13604 -10801 -11352 -16905 -14585 -7948 407 1800 442 8602 11010 20142 35925 31704
8373 31704 8289 4952 2956 1694 4388 12561 15598 11730 9329 9375 1276 -10672 -4462 6216
8359 6216 -6999 -11499 4862 6559 -3565 -6749 -18724 -23389 -27024 -17930 -12478 -2878 7751 783
8345 783 -4624 -1251 -6159 -13432 1742 19666 29197 22713 13392 11795 9337 2644 5897 -3542 -10026
8330 -10026 -9438 -8079 -2894 -124 -1774 -8811 -8962 1023 -3666 -8497 -7541 -4677 -4436 9204 20623
8315 20623 10055 7462 1370 2871 11528 2684 6653 4337 4396 3918 1154 278 3745 7305 2139
8300 2139 420 -12394 -17732 -1048 3385 -702 -395 3801 6109 7157 -3133 2917 -2514 -7775
8286 -7775 6881 14863 8404 4382 5162 8096 17576 13411 3917 -5808 -6767 -12012 -19287 -20648 -9788
8271 -9788 3557 1881 5415 141 -10113 -6876 -6787 1506 12146 1468 6873 20725 16980 19719
8257 19719 24489 12793 16316 7840 9197 11459 5618 -11898 -655 14682 19628 23879 18338 3026
8243 3026 -527 -7714 -15289 -11358 -4965 1014 2793 -10010 -6689 1055 9869 9399 8772 950 3386
8228 3386 11751 9456 -3379 -14668 -21882 -20822 -18119 -21628 -14976 -11395 -15226 -16834 -14722 -19207
8214 -19207 -12333 -2599 -3640 11740 13509 13918 13502 4717 4365 8643 13875 20019 5121 -8213 2999
8199 2999 4232 3352 5217 4412 -244 -8229 -7128 -12751 -11992 1579 5177 2019 -1298 -323 2182 7594
8183 7594 10978 11831 5226 1341 6700 3435 2212 1308 9128 -69 1187 3741 3777 -3709 -2425 7092
8167 7092 -4659 -509 6808 8009 10788 3079 4336 3287 10086 8349 410 -3102 -7774 -8285 -5901
8152 -5901 1694 -7676 -10015 -12236 -6998 3113 14312 17545 12538 15174 11951 13419 7978 -49
8138 -49 -2676 -14793 -12513 -13357 -10374 -2986 -378 -5405 -7141 -238 4478 -14001 -23284 -19847 -15180
8123 -15180 -3641 -1640 -18797 -18340 -11498 2752 8991 12598 10846 -360 -15665 -22177 -14485 -558
8109 -558 5023 -4310 -10424 -14725 -10661 -2316 -4047 -2621 -8547 -10588 -4391 4162 7363 3803 2680
8094 2680 6754 3959 -1421 -9248 -3596 -13794 -16663 -3429 -3911 -3424 -313 -2131 -4976 -998 5218
8079 5218 4341 5019 -1027 -3481 -4535 1593 13477 10906 5680 4896 -1409 -6682 -15868 -22887 -8942
8064 -8942 -2805 423 -5702 -11527 -9258 -6050 -15818 -16788 -915 6196 167 -422 -9640 -13900 -10558
8049 -10558 -6264 -8910 -12472 -15533 -19381 -22804 -22975 -16921 -5592 -7592 -11447 -21038 -22114 -14525 -8523
8034 -8523 -4424 8666 15677 20609 16722 2762 -3356 -6988 -11143 -8500 -3020 4859 18292 7695
8020 7695 -14902 -23160 -11098 -6343 11253 7155 4346 11105 12325 8958 5763 9392 12902 7148
8006 7148 14150 6070 -8381 -12737 -6149 16210 34456 28154 22251 7544 8641 1101 3137 873
7992 873 -3935 10274 6758 943 2678 9476 11543 12791 21533 10061 7631 5708 16954 18040
7978 18040 8088 -4396 -5453 5986 16624 13561 8851 4018 -7037 -6969 1733 -120 -2123 -7333
7964 -7333 -4805 1739 6323 6085 8774 24015 19827 16015 12935 1412 1028 4510 5839 -232 -15738
7949 -15738 -15463 -13982 -8765 -12936 -6918 6060 -2644 -17719 -14974 -5575 8022 20658 20582 14428
7935 14428 6067 -1455 -3575 -2110 -307 -1271 -9999 -7718 -2250 -4326 -8350 -2130 14583 12503 13173
7920 13173 12043 8206 7060 1548 -3937 2573 10993 9876 7950 8225 705 4539 5591 7333 843
7905 843 -722 952 -4868 -2655 8133 6384 2372 5817 9106 1027 8304 12164 -4234 -11974 -10394
7890 -10394 -1188 -295 12340 9575 -10134 -6348 14374 7778 3117 1723 -8 3697 14350 8519
7876 8519 9802 -12406 -25846 -21286 -4631 -5659 -3267 2804 -10572 -17207 -24404 -25431 -19565 -14545
7862 -14545 -1011 8664 6023 4818 -2018 8354 20179 26502 19539 11509 16039 23564 21589 16970
7848 16970 12096 12166 8393 9975 9181 11280 9452 9275 720 -4932 -317 3775 3548 2577 7155 15356
7832 15356 3749 -5363 -7665 -5582 -15203 -28012 -30953 -13819 1901 1701 -1282 -3960 2218 15152
7818 15152 12579 -5115 -26631 -37903 -34500 -25222 -11368 -10052 -9419 -3264 2938 -4808 -3918 -626
7804 -626 -11944 -19676 -19850 -11953 -9699 -1838 8446 7678 9423 19031 6378 -859 -5944 -2276 3029
7789 3029 8227 4594 1335 -10627 -11792 -1225 1671 3646 -482 9708 15468 20171 6134 -3117
7775 -3117 -21008 -19962 -10570 -12908 -9911 -2614 -2314 4183 12495 17925 16930 16676 9045 -1363 -3959
7760 -3959 -2975 -3756 -12243 -14683 -8011 -3541 -9764 -7266 -7322 -3426 -2574 -9846 1141 8499 -779 -4915
7744 -4915 11427 12463 11511 -2664 -12115 -344 14089 10804 8235 5444 -2193 -3724 10964 15102
7730 15102 12814 2253 -7886 -7956 -74 8363 8452 -1151 -3301 3133 11062 3787 -17258 -26370 -15780
7715 -15780 -5045 -2601 145 490 -5436 -9542 -6755 -2440 -6206 -259 2368 -4078 -5521 -3324 502
7700 502 7093 10203 -5245 -10784 -12789 422 2185 310 -2816 -6147 -7558 -9464 662 8089
7686 8089 1571 -5046 -9906 -1244 -8357 -9750 -2914 3561 7678 2195 -174 -5483 -2449 -1606 -1741
7671 -1741 9460 8740 -577 -10096 -18932 -16163 -3945 1672 -6370 -12617 -7943 7295 3488 -2684
7657 -2684 -4353 2519 6514 4240 16481 17183 9176 9106 6024 12876 16731 15519 13512 8854 -5269
7642 -5269 -4744 -6714 4565 14852 14190 6002 8912 4325 -11182 -11798 -11936 -970 -1359 -10364 -7938
7627 -7938 -4202 -2007 5415 1796 -12992 -12614 -10033 -11282 -11926 -14449 -19921 -11152 -2474 -2324 -4857
7612 -4857 -7714 -12215 -18043 -11954 -8983 -2353 -1576 -2040 7616 18555 22129 30610 15211 7615 7607 441
7596 441 -3276 12697 25810 22352 9659 2780 3382 14514 14994 13150 9540 1036 5615 -6351
7582 -6351 -18519 -26785 -18147 -9204 -8267 -5194 7902 2462 -2532 -938 -14010 -15323 -11516 -4556
7568 -4556 -443 1270 163 1610 5546 10906 9119 10115 18552 14661 12872 8871 4450 1499 1995
7553 1995 1739 6750 -5105 6802 14128 4078 4889 4591 1933 -1817 422 10391 10293 8574 5996
7538 5996 5018 5790 3051 254 -11464 -3235 3394 3053 -5705 -10256 -16246 -22035 -21649 -9979 -4283
7523 -4283 1347 -1910 -18928 -10448 -6362 -4274 15525 22650 26089 21356 12760 -2433 -14258 -19527
7509 -19527 -13334 -7871 -7504 6886 7506 8550 5296 4485 2117 1518 -5526 -15433 -7894 -1888 4500
7494 4500 8152 -1424 -15378 -17854 -11310 -10198 -10253 -10544 -12209 -15795 -19648 -8227 -1770 72 -1970
7479 -1970 9824 7914 7239 2612 -3353 -3640 -410 143 591 -3309 -5817 -6078 2801 12247 19528 8807
7463 8807 148 7586 19611 18872 11335 6780 19292 12470 11527 12939 13722 23653 16415 5320 -6620
7448 -6620 -7843 -17909 -24039 -9898 70 -5638 -9600 -19453 -9055 -1270 7252 4276 8645 5230
7434 5230 6402 3854 3383 49 -688 5365 10628 12933 5156 7597 8326 11383 12399 10209 7573 4950
7418 4950 4963 1486 13897 22230 18596 6192 -6302 -6008 8779 15996 18691 29956 32917 15980
7404 15980 15 -4984 -64 -5921 -5166 6343 9630 11058 15798 7959 -3856 -1636 -4762 -9149
7390 -9149 -11738 -5610 5846 -8779 -14084 -12629 -8040 -8095 -17564 -29190 -34921 -23788 -10803 -7384
7376 -7384 -8856 -25445 -36401 -36590 -26012 -19893 -16322 -14697 -11615 -18221 -10634 2048 7964 -3561
7362 -3561 -18849 -13765 -5030 -3048 -5182 -16773 -17575 -18110 -13524 -14740 -13856 -16206 -19603 -19606 -21791 -23843
7346 -23843 -20718 -17428 -17120 -18216 -6865 -1003 -15228 -12323 -1208 8568 5813 -2765 3827 20321
7332 20321 15509 -3017 4174 -8899 -8834 -11852 190 3111 -1577 -10443 -18345 -23859 -22722 -13871
7318 -13871 4191 1870 8205 3958 1133 2017 6853 7115 11798 12693 8670 10596 216 773 -4752
7303 -4752 -7293 -1782 13879 12953 7435 2095 9015 12666 5551 12829 9354 -769 1348 -3234 -16164
7288 -16164 -12985 -2323 1198 -2069 -4847 -249 18397 20160 18771 12606 6559 16967 11588 -7710
7274 -7710 -11804 1872 7017 5042 -46 406 3244 7072 12931 20348 16521 19527 21089 8257 -968
7259 -968 -16657 -13529 -6625 -12729 4093 6025 2416 4495 -2438 -11033 -7564 5258 2651 5978
7245 5978 9012 -3043 -16931 -8366 -1804 4614 4740 1988 2151 7456 24024 14001 3964 7342
7231 7342 13219 19393 18272 18538 10548 -241 -4977 -9749 -4843 -1795 -7212 -3519 5641 -467 -4180
7216 -4180 -14659 -20921 -18825 -23237 -18357 -19123 -28111 -25255 -14196 -14137 -11226 -8040 -10394 -14681 -8359
7201 -8359 -2524 -935 -13104 -16360 -7083 -7819 -1839 -6398 -13542 -944 6013 -119 4177 14362
7187 14362 14990 15965 12664 9539 11683 13500 13989 -1838 -14362 -7835 -764 17375 28486 15924
7173 15924 8448 -2735 -2693 -2968 -14081 -18748 -16345 -8435 -16697 -13065 -3397 828 -4054 -1357 108
7158 108 8919 13026 6372 9280 5539 1483 -1116 -4079 3757 11381 1674 -10024 -13347 -21299 -17952
7143 -17952 -10058 -8974 -6259 418 -1072 -5205 -14951 -12329 -6230 -5083 -9897 -6288 -1744 -10466 -7620
7128 -7620 2831 13441 -3184 -15318 -19112 -19121 -1743 1475 -14209 -23452 -6424 12401 14500 6860
7114 6860 4266 5972 3764 12152 6324 12727 8963 -5393 -2534 3492 -8434 -14021 -11459 -12158 -10270
7099 -10270 -13896 -19946 -24013 -22098 -18921 -3261 -8344 -12952 -20241 -15616 -7335 -8060 -16237 -24196 -16777
7084 -16777 -9071 -12948 -16579 -12909 -17187 -14228 1388 10387 2051 -2906 -1591 -679 -5014 403 10819
7069 10819 17545 18121 22827 21737 10799 14848 10135 9743 1514 -2433 -6010 -5339 13718 18496 22187
7054 22187 31823 15796 7204 4612 -3361 4069 26253 13955 -3586 -12221 -15820 -10588 -11370 -5728
7040 -5728 -6530 -8932 -11916 -17785 -14281 -12039 -11837 -10607 -18611 -9403 -12147 -21559 -3369 1215 -7990
7025 -7990 -2631 6351 -11408 -20230 -15537 -19262 -17494 -11264 -2592 7892 -5769 -25240 -37682 -41229
7011 -41229 -30684 -9316 2047 8471 19508 22985 14531 16561 25611 24719 18300 21596 21540 17101
6997 17101 8872 -2468 -14956 -12619 -8745 -17985 -18209 -10212 -2652 7568 -4240 -7000 -6621 -1003
6983 -1003 1800 -684 -17020 -25007 -9087 -7346 -12999 -15965 -10306 -11093 -18113 -13269 -14018 -30602 -16993
6968 -16993 -7025 -3304 -2580 7574 4850 4156 10931 10364 8261 -4144 -6749 -5754 -17364 -12938 -13427
6953 -13427 -12806 -20324 -19914 -14609 -13117 3215 7517 2567 13946 15736 12864 16033 9930 7863 10527
6938 10527 19546 17123 19656 19164 12631 10769 -3268 -14881 -16186 -17220 -11212 -4767 -4555 -3115 -1759
6923 -1759 3941 6402 -6545 -17181 -20560 -13540 2838 5372 8250 10883 19058 8212 1539 -3544
6909 -3544 -12457 -8128 -7774 -4797 -11408 -5827 -8399 -14570 -11193 -7155 -13191 -12280 -1006 2586 -2874
6894 -2874 14539 16895 1546 -11128 -17651 -9486 -12691 3378 20832 5729 -6587 -4295 2695
6881 2695 11649 6255 49 -9110 -8230 -6637 1855 -2599 -8107 -2202 -5303 -16827 -23541 -18270 -10206
6866 -10206 -220 1975 78 -11055 -17100 -14883 7308 10234 -5996 -300 -1692 -1386 7351 10823
6852 10823 3032 -1166 8628 15755 5537 3587 3728 11084 5257 -4918 -8668 -1875 -1593 7146 22100
6837 22100 20321 14405 10099 7326 -8679 -21645 -29051 -23489 -25422 -25262 -20540 -14602 -13527 -11067
6823 -11067 -9619 -9379 -5438 -5878 1051 -8977 -22352 -17977 -20471 -22266 -18847 -3196 5756 2736
6809 2736 -4144 -163 2069 -1034 -1963 -300 -1285 -3175 2354 -1602 6132 3600 -3448 1338 -7986
6794 -7986 -4432 -5457 -12996 -19965 -30550 -25762 -10468 -12404 -10876 -6211 4512 10219 7841 5179
6780 5179 -631 -2300 -271 -817 -446 10629 320 -10867 -6647 3882 135 -164 285 -1433 8181
6765 8181 11664 11129 9522 18941 18710 7198 -303 -2381 -5271 -7402 3201 1264 -2501 2510 -4224
6750 -4224 3663 15672 15019 4487 4762 9582 2335 -3200 436 4003 3610 2248 -2743 -5655 -3139
6735 -3139 -3585 -11298 -20721 -13876 4809 1480 -4031 -8856 -3294 -5438 176 -7609 -18004 -20331 -29232
6720 -29232 -25801 -6709 -2480 4808 12502 20176 20499 13764 8952 9492 16293 12421 2727 1805 -10990
6705 -10990 -9471 -11247 -7112 -3359 -5334 -2077 -1088 -1183 602 5809 7737 -6223 -6038 8878 -1823
6690 -1823 -16060 -23665 -27732 -30698 -22002 -8822 -11825 -12401 -16521 -14340 -17719 -17488 -24589 -17728 2415
6675 2415 13680 12052 12469 8732 572 -15099 -19350 3459 20552 16906 15847 11515 -1850 -1499
6661 -1499 15859 9728 3791 -727 -6468 -9489 -15046 -656 4509 347 -7548 1824 8228 12459
6647 12459 9866 11654 19107 24750 26169 15103 990 2850 3662 -407 2026 1143 7251 14417 11384
6632 11384 978 4661 -357 -6948 -8299 5951 17572 22406 13880 8243 -2532 -18391 -20284
6619 -20284 -15758 -24405 -27295 -13173 -4294 -4619 -8271 -13597 84 1834 -2347 -2949 -10161 -17755 -17897
6604 -17897 -4627 10320 1402 3897 5470 -5111 -16209 -19393 -14691 -16750 4661 7086 4217
6591 4217 4931 5418 10527 11456 11878 10263 8007 -3804 -11576 -6785 -14861 -11633 -11195 -6893 -11893 -7975
6575 -7975 -5555 -8223 -18962 -34064 -33232 -25907 -18827 -5538 -5168 -16769 -21180 -21715 -17277 -23824 -18526
6560 -18526 -713 5124 1337 -2980 1925 3554 6284 6260 -3848 -9594 -13207 -8568 -18125 -19225 -5888
6545 -5888 2125 -8448 -4190 -8537 -6711 -2560 -5381 -2347 -11869 -13221 -2759 6184 -1263 -13703
6531 -13703 -26489 -15399 1811 633 6297 5688 8253 10844 4431 -6137 -12967 -7673 -6273 -15301
6517 -15301 -22414 -3476 -4029 673 -11330 -16069 -10783 -4138 1956 -6230 -10901 -16329 -13738 -10685
6503 -10685 -12823 -12281 -6620 -4194 -11247 -17306 -16759 -21372 -16030 -374 -11325 -17509 -21337 -20923 -18085
6488 -18085 -7424 -3297 -11660 -16982 -16660 -20619 -21177 -17736 -17589 -15574 -11402 -5870 4787 -8197 -17536
6473 -17536 -6658 -1191 825 2131 -1339 -8737 2081 11555 11331 8082 14955 6914 -3769 -1748
6459 -1748 7597 8052 9933 5249 6847 5472 -7370 -14753 -16021 -19336 -14404 -12673 -2698 -3172 -1259
6444 -1259 -11310 -11047 -8453 -13325 -6684 -854 -6997 -10273 -8748 844 6732 -1545 -15786 -27710
6430 -27710 -19303 -4347 3100 -13808 -16305 1121 20286 13501 -1278 2160 12386 14517 25437
6417 25437 18861 14622 26355 32225 18605 13722 7508 -3109 -9964 -1970 2980 6436 -7610 -20511
6403 -20511 -13720 1855 1361 -6649 -18772 -25704 -4042 2279 7911 4069 3713 20008 31979 21543
6389 21543 13814 11208 -868 -7159 -12767 -12326 -9906 -1940 4641 1438 7683 4852 7576 2044 -10487
6374 -10487 -935 6713 10230 12124 11876 187 -4938 -7100 -1064 10911 13213 9915 1979 4668
6360 4668 12881 17249 22057 18196 24877 30678 29603 17854 364 -10029 -10108 -1356 4998 1845 -6314
6345 -6314 259 10342 19877 20770 11438 -501 287 2500 6928 11762 9010 7927 -9645 -22230
6331 -22230 -25799 -14892 -3237 857 -4038 -15920 -30253 -33986 -28233 -21996 -20572 -22336 -15536 -2989
6317 -2989 -1256 2067 1496 2882 7156 3219 5705 1323 -2324 -12629 -18491 -17052 -16209 -19656 -23878
6302 -23878 -25908 -16634 1249 15460 17157 12081 -5146 -15590 -4621 3050 -2279 4578 -1103
6289 -1103 6209 9522 3389 9716 5327 226 -7396 -12681 -2213 -6119 -16937 -19109 -6169 -101
6275 -101 -9292 -5010 5728 12190 -1761 2414 864 4798 7731 5909 -6270 -23010 -18858 -10641
6261 -10641 -12855 -5982 4513 -5016 -12610 -14278 -6589 6959 5703 4334 4043 6765 18514 14196
6247 14196 11026 14869 13448 17838 16261 22422 15208 5369 4033 6738 9357 8152 1532 -978 -4612
6232 -4612 2012 9967 -5747 -17015 -7572 895 -4098 -1339 6408 15238 17412 15438 7017 -3061
6218 -3061 -4231 1917 13983 21577 15426 -3473 2940 5914 6448 -2221 -10872 -14667 -18883 -11098 -17188
6203 -17188 -18593 -11288 -186 3414 6432 -2240 -7702 -11194 -20069 -15655 -7934 -435 10593 23423
6189 23423 22718 19127 17282 8628 -8148 -11874 -10097 -16400 -21376 -4834 6249 -6404 -10772 -10555
6175 -10555 -7277 -10481 -8662 -6206 -7193 -9300 -12011 -11380 -11338 -10577 -5217 -4373 7603 14773 -4453 -9407
6159 -9407 -9318 -7547 -11004 -12284 -9832 -9379 -6317 -2719 -2295 6775 9846 9013 1116 -7689 -7020 -9457
6143 -9457 11048 17567 19902 4633 -7450 6279 14117 8550 7830 2841 1446 -543 -3559 1465
6129 1465 -2483 -3260 1265 -4470 -13803 -933 -3956 4879 19718 26874 23373 10350 -5517 -6851
6115 -6851 5455 869 999 -14336 -12212 -2024 9175 1028 -6431 -685 14164 13842 14457 16563
6101 16563 -359 -10322 -6666 -2697 8580 25750 21899 11517 1166 1116 7838 7914 -3429 4325
6087 4325 3075 -1423 -13788 -4917 2115 5574 5588 -274 3438 1350 -4929 -2265 -2935 -226 -7676
6072 -7676 -11546 -8673 -3117 -3992 -4618 13443 4203 -631 11114 8781 3523 -2000 -12721 -10856 -1423
6057 -1423 -3983 -10224 -8520 -2147 18069 12230 -3444 -5336 -4546 -11986 -4652 2712 14426 13525 11044
6042 11044 7914 9555 5539 6475 14048 12710 7567 11312 16645 18143 12149 5352 13082 10636 8053
6027 8053 4687 11425 13443 9509 -943 5380 7263 6570 15025 9895 13294 19142 22884 27704 26005
6012 26005 23439 24812 13200 2708 -5225 179 -8025 -20130 -17761 -13578 -8004 -11750 -12902 -11032
5998 -11032 -8784 -20247 -28177 -27081 -17818 -1897 2839 -7580 -8048 -11562 -17668 -9221 9436 14869
5984 14869 -3753 -28356 -23948 -6625 -1731 2456 -5794 -9570 -14413 -10846 -10717 -6079 6704 9443
5970 9443 -4888 -15824 -13716 -6266 5075 9952 6327 5915 1790 -2801 -20080 -31358 -18664 9008
5956 9008 8076 -2666 -12982 -6221 3470 7611 9377 -1288 -13752 -17839 -2085 -5979 14344 24578
5942 24578 6232 -3481 -10191 -1147 3954 2570 11264 5531 196 4314 -4351 -9112 -20310 -17018
5928 -17018 -7064 52 -1908 11788 17332 12149 3764 3356 8736 10877 8968 8469 3151 -298 2080
5913 2080 1186 -5095 -10319 -9041 -3354 -8287 -1617 12363 18818 11579 12444 4573 -12854 -14476 -2581
5898 -2581 7423 4836 -7171 -7911 -3892 10128 8192 1237 -5881 7321 3690 -1130 -13224 -8714
5884 -8714 -1701 7535 511 -14416 -6324 11305 11747 25164 19756 5402 2398 6001 -5812 -7467
5870 -7467 -7809 -3852 8494 12787 17204 1206 -14688 -10878 -628 246 -5663 272 2695 -3531
5856 -3531 -3007 964 3440 -6023 -26079 -18393 -657 9265 12641 7176 3528 3204 5916 3491 2888
5841 2888 7697 3735 1195 2989 -8307 -15665 -18256 -10594 -1015 -5895 -6002 17088 27256 21891
5827 21891 19390 8425 -1752 -10607 -20176 -31936 -33242 -24352 -9117 -9403 -8835 -10625 -4018 7002
5813 7002 15754 14577 8486 -3044 1518 6920 4529 -2822 -8331 -3844 2849 7547 -1841 -4597 -1125
5798 -1125 9695 12199 17076 22486 12333 4816 15272 12127 10414 12118 5617 8624 3808 1048
5784 1048 16814 29994 18117 5369 4817 7542 9860 209 -1285 5907 -4619 -6659 2882 1692
5770 1692 7672 9397 10682 4052 7160 10352 7473 -802 4109 -6657 -14201 -7494 4801 7849
5756 7849 4255 2413 -8022 -10024 -12434 3579 14389 -5230 -9825 -11925 1338 13991 5591
5743 5591 2711 -525 -6118 -6145 -17222 -5333 -5231 -14084 -9128 -17068 -11107 507 5273 4198 -3254
5728 -3254 -17365 -30011 -23378 -10347 -9315 -11247 -10928 -6638 -4653 -161 -1974 -1788 -6563 -3373 4482
5713 4482 2847 -3524 -8946 3700 12346 14125 9343 -6460 -13768 -5585 2396 -371 -17473 -24137
5699 -24137 -16878 -15764 -7306 14729 10756 2863 10371 5226 -7691 -10796 -14319 -16019 -15577 -24645
5685 -24645 -29504 -21675 -16259 -13019 -7803 -11214 -15206 -19614 -23223 -23749 -24764 -8878 2880 3269 -1312
5670 -1312 253 2774 2335 -1262 -2526 -2707 -4457 4753 3703 4816 2608 -14930 -17810 -13652 -10645
5655 -10645 -4506 -1781 10082 12543 6630 885 5286 -10576 -19421 -22000 -20559 -15032 -20591 -26823
5641 -26823 -19066 -16106 -22660 -27499 -18625 -19084 -15585 -16797 -11159 3745 -1880 -7878 -5322 -4958 2748
5626 2748 5352 -1213 -2978 1642 4005 6172 8702 3003 5756 1436 -5249 -11427 728 -6551 -15173
5611 -15173 -7165 -3834 -679 -9720 -16154 -1916 5878 11002 11764 756 3991 6843 12648 11643
5597 11643 313 2738 -1710 -1920 5731 7136 14274 12829 3108 505 3966 15821 18296 12921
5583 12921 6689 -9686 -9611 -6128 -4883 7409 8307 -4606 -18878 -16825 -26178 -19280 -7215 -8279
5569 -8279 -16857 -19814 -12382 -297 9536 767 -7998 -15035 -17647 -1344 6389 -9033 -16075 -3769
5555 -3769 6451 10483 9042 -4163 -14164 -2837 5663 -1113 -9545 -4054 -3677 -9576 -16751 -19165
5541 -19165 -13682 -9738 1474 543 -8119 -5053 -1095 -3503 2496 10085 11453 17868 23333 18687 -503
5526 -503 -10053 -2957 -2508 -13560 -3823 -6650 -5627 -1408 -6326 -8085 -1952 9970 12260 -179 -4760
5511 -4760 -4603 692 -7395 -5647 -727 2680 -4358 -3642 -2205 -9357 -20084 -10804 7244 10778 -2605
5496 -2605 -10832 -20756 -21654 -7002 -860 -1643 -4512 -4510 -4811 10355 24400 20405 13082 -5751 -17919
5481 -17919 -1758 12057 7961 8051 615 -13398 5186 -5999 -5520 5021 12319 4427 182 1201
5467 1201 -6989 -6160 517 1562 19754 9080 14258 15506 13856 15950 7179 2010 6856 7392 11701
5452 11701 5789 -945 -47 -422 -8117 -4919 -1642 -803 9008 16597 10077 10282 6681 3280 8677 16675
5436 16675 11165 -4586 2691 4429 9501 3617 1055 5542 5919 616 -4692 -3392 7335 12476
5422 12476 4330 -1509 -5031 -11098 -24582 -29324 -27494 -6532 -3065 11753 22250 19884 2737
5409 2737 809 -3713 -1216 -6575 3960 1161 2594 2201 -9794 -16509 -12264 -6337 -13436 -11622 -1293
5394 -1293 5971 4684 2354 5494 -4515 -14287 -18892 -14563 -17454 -11864 -4808 -19752 -29310 -20205
5380 -20205 -15322 -19584 -24253 -29047 -17511 -12784 -11373 -6516 -12491 -8847 -1148 -8947 -23139 -16881
5366 -16881 -5019 -773 5241 4224 -2249 2947 5425 8811 7262 9761 9295 4087 -943 -2663 7932
5351 7932 2866 -4545 -6197 -2342 -3667 -9567 -5560 -691 401 2499 2379 3710 9300 7234 -5221
5336 -5221 -11390 958 5295 2671 14034 22180 15215 12667 23876 14802 2179 3310 -1070 -3406
5322 -3406 -4178 -11046 -22489 -22203 -6290 1202 -4574 -16258 -15664 -12448 -17411 -9918 -6932 -17236 -14135
5307 -14135 -7973 -1160 15595 22496 20198 22179 14274 10448 3594 -4757 -1008 2073 -2879 -8181
5293 -8181 -9755 2400 4941 -7380 -9099 3788 16120 20443 4483 -13509 -6891 -5201 -14025
5280 -14025 -17533 -15028 -5922 3817 9788 1393 3946 2088 5411 3787 7003 9333 7619 6291 -4345
5265 -4345 -241 3770 2754 -262 -10433 -11419 -1944 -5186 -6520 -14879 -21001 -20539 -10507 -3508 2856
5250 2856 5133 4620 -7392 -22181 -16060 -2257 13177 17795 -783 -10413 -16223 -12864 -9310 -7078
5236 -7078 -6098 -813 243 -5862 -6430 -2374 -4882 -169 7241 1828 -5634 -19462 -15137 -26442 -16888
5221 -16888 -16046 -25088 -24910 -8278 1841 2158 7212 5559 3729 5769 8537 9524 5864 -5617 -7031
5206 -7031 -6660 -11393 -5995 1303 -9189 -8550 5692 -3348 2324 11747 5562 1696 -3636 25 1237
5191 1237 1370 6045 9912 11675 554 -5935 -2843 -4839 -4803 -2416 7166 10390 6268 4564 7964
5176 7964 -1687 -6392 3017 540 -11713 -6089 -10400 -8346 -1385 4903 309 10697 21832 24938
5162 24938 20824 14890 -1416 -6926 -8997 -19533 -18162 -12188 7138 11707 9856 -4337 -7168 -2760
5148 -2760 -9458 -14842 -16569 -15981 -23874 -25922 -8176 8963 23373 20251 19313 7032 -23332 -28698
5134 -28698 -17559 -2111 8830 3702 10204 501 -11283 -5393 -2624 -15628 -16040 -11183 -1629 -5561
5120 -5561 -6142 -14442 -3649 5147 3885 4650 -652 -4996 -8849 -10434 -4964 3945 14368 15954 14879
5105 14879 18782 23921 24067 16660 10900 -2448 -11531 -20333 -31940 -24251 -20677 -8930 -2571 20
5091 20 6467 2470 -9032 -15950 -6139 9836 16462 8190 -3153 -15488 -5940 5472 -1736 -6974
5077 -6974 -12351 -16864 -16094 -7779 5054 -3218 -7468 4935 3232 -7080 -16184 -20977 -11919 -15741
5063 -15741 -17552 -12121 -5493 -5549 2292 708 536 6042 4200 9082 18775 13159 2888 12244 9409
5048 9409 9395 11887 15265 5650 -4452 -10401 -13594 -17658 -10134 -2068 -6174 2336 3529 41 -3027
5033 -3027 -9360 -5957 1956 -8914 -4538 6560 6894 -4445 -10620 -11063 -5085 12471 12872 7555 -4028
5018 -4028 -12694 -8418 -3031 -4043 61 -1823 -4266 5528 11501 10919 10143 -84 -13922 -2628 7129
5003 7129 10935 9916 2573 -14919 -20447 -12389 -267 -13580 -18887 -5741 -576 -11706 -20144 -25196
4989 -25196 -11399 -6274 -19589 -13063 -10039 -13275 -13208 -5705 -5467 -9880 687 5959 7727 3804 -6830
4974 -6830 -7214 -1140 4223 2567 4110 -9745 -19904 -10135 4541 1692 1087 -3036 -11384 -4525 -3488
4959 -3488 -11607 -3005 -2761 -3391 -9779 -19566 -23174 -25792 -30846 -20370 -12461 -8039 -843 11208 3003
4944 3003 3858 10750 3573 -8485 -11173 -7868 -3424 -7844 -41 9014 -503 3362 18215 14351 -3907
4929 -3907 -11459 -11541 -4600 -5804 9640 20927 6382 -9278 -286 -1993 3517 6142 3175 -577
4915 -577 5600 19447 5320 1087 -1955 -817 829 2451 6482 -7272 -20302 -18223 -6338 2705
4901 2705 9879 2645 -2179 -1970 -2877 -1485 -4754 -13739 -1070 5539 4801 9049 9895 16263 25313 13217
4885 13217 757 5557 11726 10578 2770 -132 5774 -853 -7555 -25735 -41910 -23918 -10554
4872 -10554 -17147 -24449 -30893 -39729 -34871 -16258 -6272 -3801 6245 19957 13241 12774 24437 28375
4858 28375 20036 10781 8891 5646 -9689 -1718 518 -4347 -13190 -12918 -11433 -9216 -6202 8100
4844 8100 15685 8535 1890 10430 11361 8376 5328 7439 11102 22607 25807 15759 16960 24972 24178
4829 24178 20280 16687 12234 8928 10896 12592 15483 10157 -1830 -9834 -11845 2895 9426 1593
4815 1593 -2954 -2793 -5816 -12546 -6319 -2597 2017 6212 11937 2585 -10508 -310 7938 10512 2864
4800 2864 -14294 -4284 14334 1219 -7581 4520 11341 5843 11317 6316 -1661 4569 -944 -8887
4786 -8887 -9286 4436 19363 8748 1983 -4883 -7689 -9203 -14320 -21559 -21648 -15169 -10953 -6361 -6014
4771 -6014 -4759 4747 5720 15767 16221 12218 5510 78 -6995 -11292 -18391 -21980 -19940 -10950 -2638
4756 -2638 -5966 -4995 -14027 -20898 -11387 -8531 -6572 -8465 2533 12026 5471 7441 8055 1419 -7889
4741 -7889 -7196 4032 21447 16446 13595 7160 -9981 -9314 -1157 -10622 -11458 -10979 -19051 -35680 -31105
4726 -31105 -28020 -25101 -15237 -9636 -17469 -15220 -1768 2809 3609 -5182 -16699 -19162 -9596 8424
4712 8424 14250 6009 -5165 -8890 -14995 -22131 -20645 -15861 -13451 -10981 -12292 -1800 7959 6832
4698 6832 8436 8207 12815 8459 7487 3090 3137 -7335 -6332 -414 9120 9269 15909 11838 3389 11050
4682 11050 14849 9442 5311 4353 12795 11440 16944 20402 4786 -6852 2688 15699 11464 9346
4668 9346 8793 5164 1955 -3146 -421 -13641 -5562 -5032 -3844 -1723 4399 3852 -7156 -21301 -12006
4653 -12006 -2460 8163 8973 16745 10138 -5342 -6327 5092 15410 24536 29785 25768 29332 29050
4639 29050 10918 -4437 -1069 -2533 -7179 -14555 -11416 -5817 -896 -17798 -20042 -3384 -2609 1277
4625 1277 -2303 6304 14241 13100 94 -21611 -26638 -11742 -6819 -5746 -7795 -8744 -11846 -1643
4611 -1643 1142 -562 109 -9449 -11669 -18691 -29572 -27497 -22235 -19661 -19141 -10183 2924 17537 25174
4596 25174 22222 21660 11750 6102 1687 -4443 -3612 7040 21207 16428 5745 22263 22046 11383
4582 11383 5453 12062 12202 10386 638 2801 13827 8713 2561 3028 -10022 -15206 -3313 7721
4568 7721 -422 -5086 -130 -4084 -4396 -16521 -19376 -16508 -6199 -3287 -4867 -12645 -11947 -5283 -5085
4553 -5085 -10632 -15631 -14880 -10918 -3753 5568 12965 12575 6782 5925 6456 14034 5075 332 -3521 -1651
4537 -1651 1600 114 940 1974 -5179 10683 9365 2814 3656 7539 7119 3396 -439 -4866 -13
4522 -13 3127 7038 19292 17940 17699 10962 4252 5617 4551 -3526 -6892 -3322 5188 26644 31192
4507 31192 27699 20519 10522 1412 -3376 -2257 -1878 3208 1267 -660 -2719 -9569 -16161 -23086 -7144
4492 -7144 -4037 -17754 -17170 -2049 6623 225 858 10954 17242 10672 7743 12255 9401 3477 3936
4477 3936 5044 12866 -5888 -22843 -26611 -7002 -10932 -18903 -16026 -15797 -5597 -8352 -18673 -15815
4463 -15815 -14980 -2490 5682 5509 2630 14798 22356 14871 11383 6635 7209 -6150 2070 4547 -4916
4448 -4916 -7209 3676 19940 14501 -1210 1734 7420 5927 1498 -2504 -2089 9988 19102 20842
4434 20842 17209 14535 14571 4947 -2071 -1655 4506 13112 9604 -13992 -19772 -10994 -5331 -9258 -16929
4419 -16929 -16423 7764 17145 14748 10050 10782 -6295 -10477 3223 1909 -4911 -10219 -7153 -6650 -385
4404 -385 4767 -1754 -10702 -6627 -5204 -14299 -17231 -7351 2135 -3150 -14549 -17991 2682 9640 5662
4389 5662 2805 6440 10659 12636 -1681 -19460 -17307 -9798 12114 18966 6370 376 5905 7704
4375 7704 3845 5933 1305 2674 2500 -2777 394 -8055 -3915 -12046 -24285 -14602 -18041 -17685 -20006
4360 -20006 -9635 4346 3125 4596 14415 10401 -1579 2114 2885 3733 -1846 7578 13809 2493
4346 2493 -2916 1722 80 -3492 -135 496 -5640 -5313 -2030 6770 6292 434 1860 169 9014 10826
4330 10826 10066 6458 -4926 -13462 -9048 1520 10177 4054 4175 -877 -12665 -6136 -904 8921
4316 8921 16788 13482 9998 9403 9248 -4875 -10215 -8190 -10838 -7884 -6779 -2858 7193 -2479 -4208
4301 -4208 8996 5694 2984 2877 659 -10960 -6598 -238 1372 906 11265 5837 -8447 -25245
4287 -25245 -24605 -10703 -9877 -19849 -26472 -18964 -1670 2470 -11199 -12195 -6866 616 -110 -2601 69
4272 69 11197 2744 286 2646 1622 -9926 -16984 -757 10517 14732 1995 -4809 39 2348
4258 2348 -1731 3639 11969 18105 11770 -4441 -4414 3181 -7079 -13934 -14642 -10815 1848 -941 2297
4243 2297 1202 3791 12081 -553 -18557 -24994 -18790 1610 10026 4137 405 4402 3783 3374 -7020
4228 -7020 -17023 -19807 -16485 -13632 -12243 -13093 -1589 10534 5800 305 -153 1881 9198 14241 3499
4213 3499 11726 5128 8519 9519 1928 -4983 -9369 878 15922 8544 -3607 -14937 -27306 -28565
4199 -28565 -26515 -19017 -8856 -6929 -2447 3381 236 -8929 -9757 -6443 -5095 -5213 -1450 -1315 316
4184 316 11694 7250 -3168 461 -5273 -5986 -13332 -13061 -8177 6356 7552 -2590 -2581 -104 1242
4169 1242 9156 23091 10700 8426 4497 -3924 -10753 -16425 -16739 -22645 -20051 -4600 16606 24491
4155 24491 13160 -2515 3919 3614 14782 16822 14381 -462 -2968 -9147 -10423 -7769 -3543 404
4141 404 427 -6658 -5079 5505 8106 -5821 -8169 -7317 -11103 -15634 -16829 -12637 -973 9150 6014
4126 6014 -6122 -10586 -6667 -13579 -9509 -2314 -14732 -13490 -4945 -1542 698 2348 6439 7523
4112 7523 4636 5410 11873 16384 15864 6845 3101 9491 2169 1500 1103 -4305 -10128 -18077 -28277 -20720
4096 -20720 -4614 -11165 -11626 1020 7289 7460 7986 -656 -9063 -2017 8784 2150 -1798 -8285 -12022
4081 -12022 -9695 74 -1218 -10047 -7999 5830 20619 20600 9833 3682 -9047 -11488 -2342 6321
4067 6321 -5355 -8414 944 11382 30401 29541 21257 2534 -10077 2147 586 12432 14103
4054 14103 5555 -351 15859 23726 17840 8389 4258 -5852 -2892 -2321 -18699 -32280 -29036 -11915
4040 -11915 -10588 -18323 -8076 7103 14092 14402 7086 -9638 -11667 -7325 -4402 -12201 -12535 -7812
4026 -7812 914 1790 2730 53 -4587 -4673 -2053 2519 935 -7415 -13679 -19272 -14575 -3565 182 4058
4010 4058 11770 4883 11330 20062 15292 10238 -6118 -19212 -22468 -16984 -8100 -2698 -6583 -14324
3996 -14324 -13991 -16560 -19760 -6001 2433 6103 15928 2846 -16608 -6309 7000 6043 14363 13522
3982 13522 2337 3390 4556 858 9336 1309 -3433 -4877 -5813 -9276 -23203 -21336 -24723 -14969
3968 -14969 -636 -3639 -6122 -5657 -16430 -17793 -19126 -25882 -28720 -33761 -21947 -14185 -15629 -5620
3954 -5620 -6660 -9550 -1845 -3595 -19281 -22028 -8066 -5414 -9570 -18428 -11931 -7197 -1025 3011
3940 3011 -76 7861 7861 13104 2908 -7243 -2349 3531 -2682 -3445 729 3221 -2497 6638 5332
3925 5332 7753 12755 10740 -11288 -11236 3267 15767 22083 14057 9443 2928 7606 3933 -20 -959
3910 -959 3806 13302 19033 11346 5509 5643 9291 7991 -1604 1191 -4080 1762 2040 -4392 -3579 3515
3894 3515 13835 21782 23436 20130 7992 -4638 -5497 6342 -1094 -6952 -2489 -3245 -11439 -19185
3880 -19185 -9592 -6060 -6114 -7630 70 -3343 -2573 -2174 4075 13715 17348 15946 16008 243 1959 -3012
3864 -3012 -9491 5546 12204 10341 3845 7106 6443 8539 20347 14619 -5696 -8322 -5723 3350
3850 3350 6101 12650 9556 8287 4299 4532 -4075 -18639 -16627 -15280 -13753 -9317 -501 10820 11815
3835 11815 17304 8268 -9492 -9148 1946 736 -5516 -5359 567 -2571 -7038 -8733 -12005 -19635 -6803
3820 -6803 -4132 3008 -2379 -20231 -14287 -523 -6013 -7467 -8837 2385 12168 20130 8281 331
3806 331 -10133 -18409 -15742 -10032 2964 4453 1139 1712 1667 1131 4423 6889 2191 3593 -1286 -472
3790 -472 1934 -2773 -13610 -15949 -17486 -12917 -7078 -2033 -2881 -64 -1453 -13141 -17060 -19246 -21024
3775 -21024 -16581 -15986 -17831 -17672 -14481 -21440 -12925 -3914 3721 257 -2659 -5696 -9133 -15228 -9304
3760 -9304 -8176 -10581 -5126 6496 3492 -5617 -324 4071 346 -6527 -7797 -4631 -10306 -6479 -10161
3745 -10161 568 -4355 -2276 -2196 -5082 8759 11003 5792 9770 14221 12980 5951 -3079 -10155 -15382
3730 -15382 -9489 -9456 -14312 -8224 -1172 466 2897 -3245 1606 5551 14267 16050 10849 -3160 67
3715 67 -4915 -1759 -1152 -9659 -10071 -6672 -6771 3179 1645 -6567 -11282 -14152 -7964 -1659 -3514 -4356 -1745
3698 -1745 2671 -2012 -11484 -23458 -25840 -8097 -6652 -6546 3867 11992 7814 4791 2507 11350
3684 11350 18890 13181 7628 7491 639 -281 -10206 -6166 3854 9008 10995 13692 6497 19378 17923
3669 17923 7810 -4984 -7000 6795 18508 4151 4548 1457 -9286 -7354 9170 22621 16114
3656 16114 19288 14323 13910 -5244 -11796 -2860 2427 9713 15715 13334 3945 5200 11492 21658
3642 21658 26400 20742 8031 -1678 -5774 -1364 6093 4343 1773 -2871 -8644 2337 11976 15120
3628 15120 12032 8335 5831 2978 -12177 -13710 -17675 -9971 4043 5589 762 -1500 2852 3328
3614 3328 9545 29415 31364 20312 5260 7606 10350 11307 7012 -2135 2545 4296 3989 2566 8835
3599 8835 5067 -597 -3432 857 897 -3696 -3850 -1364 -6162 -14069 -7726 -4637 1130 6053 4477 -13341
3583 -13341 -15798 6219 10540 10335 3393 -2780 -5018 -3107 -7521 -6954 -4966 -2585 2780 1829 -224
3568 -224 -7541 -9364 -6752 -9617 -9900 -2480 6518 388 -11158 -10651 -16737 -19616 10169 17047 13832
3553 13832 14842 12727 9789 17483 10395 -1260 -1318 -1019 1832 5290 4943 -7286 671 -1738 346
3538 346 -1858 -15287 -24771 -13033 -7756 -14637 -12083 -1194 -4696 -17463 -17279 -16606 -24111 -24305 -14579
3523 -14579 -3367 8811 3476 -4060 -11481 -13797 1798 7659 8708 6344 8456 -274 -6054 -15881
3509 -15881 -9003 6530 7415 6488 17247 12877 10486 3196 -1800 -5312 -5415 2206 8899 11969 -108
3494 -108 5582 6106 10503 12404 8202 11632 11662 6499 11984 19146 24341 16558 10735 -7305 -27111
3479 -27111 -30771 -31039 -21146 -12409 1572 8535 11039 5165 4771 15644 21516 20267 22362 9461
3465 9461 135 -8272 -9985 10370 2322 -14451 -4151 16092 16687 10818 193 2702 440 -3008
3451 -3008 -7953 -12838 -21890 -23638 -15837 -11498 -7910 2800 2507 6654 2458 3891 7721 5419 9162
3436 9162 -4511 -4186 -687 -3614 -10544 -12883 -19160 -19848 -14083 -6967 5843 16955 10205 -8726
3422 -8726 -10963 -7238 -2839 2373 13571 18547 14303 10269 6729 -5214 -2995 -3357 -2885 -6132 -6804
3407 -6804 -3811 -3062 -529 6516 12731 9234 -4047 -14734 -15766 -13548 -11766 -4235 -5371 -12391 -14970
3392 -14970 -11280 -4833 -13308 -20631 -19385 -13299 -11107 -8062 -8809 -4890 5955 10747 14709 16924 19237
3377 19237 14853 9600 16297 7365 2750 -6797 -20805 -14245 -19049 -23514 -15303 -7460 -11877 -12216 -303
3362 -303 -3114 2235 4815 14093 19803 17607 1893 -12918 -13216 -7970 -3861 -4043 617 1305 2540
3347 2540 -1533 4405 10719 2058 3038 4196 -8417 -14054 -14964 -5571 -214 -7084 -12380 -583 12093
3332 12093 12134 6252 6355 9210 17070 17376 11762 12032 11549 8733 4132 329 8324 6394 871 -5482
3316 -5482 -16297 -10085 -7454 -3779 -3175 5472 16594 11671 -2397 -3989 5506 21230 19885 19743
3302 19743 3575 -6548 -11059 -9008 -8397 -1547 7332 -492 -2039 2916 12085 8528 -3056 -5922
3288 -5922 -13095 -6236 938 12299 19027 18876 6555 -6381 -13348 -13025 -20943 -21635 -19928 -8086 -4591
3273 -4591 1476 5646 1900 3940 -5548 -21626 -20281 -11277 -10686 -3982 -5859 -8494 -26303 -24674 -34202
3258 -34202 -32698 -14277 -3786 -13303 -1639 -258 1915 -435 6186 13921 19757 23023 21537 18344
3244 18344 20483 24540 25217 7712 5488 89 8733 11914 7361 8215 18229 27486 36764 33149 21219
3229 21219 10480 2107 -2024 1326 2222 5023 18031 27951 32360 23984 12725 -4152 -9280 -11705
3215 -11705 -12634 -14286 -10525 -7505 -7204 -12038 4638 7721 13229 6557 9904 19440 29255 35576 24224
3200 24224 -603 1279 -233 4301 9691 -2107 -7488 -12979 -10619 -9088 -1775 6428 3400 1942
3186 1942 -3125 -2659 12856 16192 11147 9159 5000 6431 12642 6999 14231 5974 -5299 850 -4657
3171 -4657 2822 1380 -2418 -3897 -5108 -2452 -1344 6441 21279 29797 26686 22622 11763 1260
3157 1260 -6529 -12493 -10325 1028 7411 358 9857 22186 18680 15142 1015 -8024 -17862 -16281
3143 -16281 -10143 -280 -7323 -21752 -16548 -3193 -2479 -4864 -8489 2846 3259 -1069 -6702 4159
3129 4159 13737 21180 18848 7700 306 -313 3056 8771 1876 -10147 -5772 1475 12174 13566
3115 13566 9277 7972 10138 4263 4114 -1188 -16305 -26578 -17145 -12090 -12495 -12303 -5036 -9830 -11897
3100 -11897 -6333 -4382 3417 11903 21183 5812 2819 6600 4260 8352 3189 5690 3149 -8067
3086 -8067 -12222 -8604 1554 6129 10253 -1147 -7189 592 -6393 -13525 -5253 3395 6856 10146
3072 10146 3203 5705 17143 11403 4977 -13012 -7180 -2157 4673 6563 6282 7910 3981 -1257
3058 -1257 -16598 -13515 -993 7904 5175 4035 8436 -2056 -4161 8120 7587 11405 15681 2247
3044 2247 2650 5974 3936 14842 8852 6300 4218 -9105 -4524 431 10277 19206 26456 31370 20544
3029 20544 18186 10358 2712 -1062 -5020 5732 7157 -15434 -13767 -1926 2861 6822 1912 6605
3015 6605 6165 -17183 -23418 -14061 467 -4534 -7999 -3024 -9621 -13206 -10534 -4536 6004 10817
3001 10817 18796 11387 8989 2702 -2089 -4712 -12642 -4126 -1148 -11278 -11243 -4043 -9289 -11228 -10850
2986 -10850 -11100 -1191 -10346 -8142 -13758 -18172 -4088 -7259 -17263 -12063 -10553 -14128 -12483 -13618
2972 -13618 -9486 -3170 -6637 -6864 -15419 -10876 -9895 -13336 6694 6208 -6095 -4795 -101 516 3418
2957 3418 9924 14536 13011 -8461 6411 29087 30393 12265 4801 13545 17150 5431 -5784
2944 -5784 -16807 -7262 -8053 -8627 -2080 1792 -638 4015 -845 -7210 -4898 2967 2464 -5387 -7404
2929 -7404 1333 8349 15468 12138 4514 355 3499 16082 16449 26344 31507 17402 8660 5142 -27
2914 -27 -1665 1148 1382 -3806 -10890 -27399 -20997 -2583 58 -4935 -6045 317 5416 3711 -791
2899 -791 -676 -4877 -16130 -25218 -20351 -1611 7306 4981 -7936 -9779 4934 10932 14986 6656
2885 6656 -14923 -4974 -1704 1356 2887 -1381 818 -469 7196 1428 -9145 -7818 -1750 -7675
2871 -7675 -5100 6457 13143 7952 1814 -1166 7850 3028 -5146 -16015 -3684 6202 10768 13216
2857 13216 8134 2530 -6122 -6193 -498 6437 5490 7728 9065 -1135 7595 5446 3448 12726 9375
2842 9375 -2319 -874 6109 10743 10158 -3311 -9119 -3413 470 -3188 -5593 -12533 -12346 -4368 -7249
2827 -7249 -7743 -17363 -19824 -16815 -6795 -1458 4133 2123 -20798 -16679 -18325 -18392 -7173 -2154 1354
2812 1354 501 472 -2074 -6423 1675 9991 24682 17743 3457 323 -8563 -1427 8578 1408 -20416
2797 -20416 -24796 -15357 -9769 -3819 2813 10353 7600 2622 2926 10485 7724 -2977 -8523 -19805
2783 -19805 -21036 -18225 -12229 -6497 15510 24032 26374 24961 24327 19469 13528 3738 6670 14582 15449
2768 15449 14926 13952 17538 13949 -1044 -17555 -20811 -18393 -15075 5316 11298 9629 12689 11481
2754 11481 -3155 710 7139 7281 20678 21587 8930 -3103 -5712 -1043 4560 -2333 -11719 -9328
2740 -9328 65 11644 18274 13156 16144 6070 -4200 1167 -5118 -14425 549 1046 -9254 -13325
2726 -13325 -18118 -1860 5921 157 11447 18955 15869 6912 675 209 2580 3396 6534 10899 7998
2711 7998 12579 11858 6870 -8069 2539 2816 1838 -1310 -5853 1114 -5197 -16970 -12733 -2234 -16425
2696 -16425 -23539 -10247 -12223 -9217 -6891 7734 8587 9218 -2962 -2011 -3238 -7736 2123 9271 11924
2681 11924 6218 -2060 2189 -634 -9414 -11848 -3938 -4127 -9422 -5194 -3277 10872 9368 -3289
2667 -3289 -5271 -13930 -10426 -1204 -12842 -8910 1520 -5595 1964 8139 6971 6013 2297 -1126 -6340
2652 -6340 -341 3331 -669 -6438 -2814 -5025 -451 -16473 -34232 -32907 -26885 -25066 -18032 -22016
2638 -22016 -18796 -7276 1835 7399 896 2823 1516 -2386 4753 6150 7216 -1253 4128 9352
2624 9352 9459 -1647 3803 6669 3010 -9954 -20437 -26549 -25648 -12706 2561 -9294 -17547 -32272
2610 -32272 -36347 -26521 -7581 6151 6702 16447 12907 2741 -6523 -13059 -12495 -9274 -2430 -8018
2596 -8018 -10263 -3141 915 5849 2234 4530 7691 18457 21164 15960 10549 741 335 8182 18659
2581 18659 8641 950 -5306 5712 12715 18164 18586 28173 30279 30181 20474 24159 28527 24139 24305
2566 24305 25547 23395 14280 16599 9141 -3691 -13848 -12835 -17936 -15222 -12225 -10034 -1230 7337
2552 7337 9420 4613 3509 1177 3546 6559 16747 6780 -3705 -8523 -9998 -8128 7607 16639
2538 16639 10805 9639 23156 16305 4187 1141 -3306 -3968 -10764 -6709 -2696 -10815 -14044 532
2524 532 207 -4202 -20722 -27158 -19237 -3314 -834 -4013 -3924 -10280 -12860 -5922 -8532 -8177 -7402 -10790
2508 -10790 -3891 -51 466 307 1177 -4445 -15805 -2005 5146 -4738 -8159 3871 -596 647 -4619
2493 -4619 -23870 -29806 -24485 -25125 -23394 -14404 -15386 -20952 -8642 -1424 -5723 -7462 -13533 -8649 690
2478 690 -4933 -14845 -17437 -21024 -8916 -9143 -14224 -6881 -831 -5284 -14720 -11757 -16229 -15527 -2796
2463 -2796 2419 9991 -47 2361 -2166 -9334 -8628 -9088 1947 9994 4435 -16969 -20276 -15023 -10711
2448 -10711 -3770 -6959 -4074 -7573 -16395 -8325 7326 4064 -12791 -13490 -3691 -236 -6970 -23821
2434 -23821 -29512 -18905 1915 3913 -2884 -12014 -18416 -17904 -24766 -12270 9317 3012 5299 -1537
2420 -1537 -21013 -10154 8884 18459 16276 12461 14689 17478 7341 -5331 -10333 -12383 -10061 -2468
2406 -2468 12648 24311 27875 10801 15287 31042 28804 24594 23930 25079 15088 543 -5068 -6150
2392 -6150 1871 1614 11880 13046 16933 10543 -1228 -3491 2960 20103 20002 5481 4998 16724
2378 16724 19470 14128 8358 7943 12368 2610 -4296 -4092 -962 946 6412 8600 7872 10302 8133
2363 8133 4513 5443 12820 14306 -6231 -15149 -11319 -7738 -11522 -10397 5415 9576 19374 10793 12400
2348 12400 15241 16058 2959 -3131 5075 3119 4740 5157 4556 7254 7364 5377 1396 9681 17725
2333 17725 12382 6959 955 -5982 -9499 1731 7738 6469 9345 776 -7820 -9924 -8486 -12787
2319 -12787 -9871 -863 2111 3248 8656 -1165 -5777 -7550 -2962 4508 6852 -6787 -18773 -21113
2305 -21113 -9583 6976 10109 10731 1471 -1545 2814 5308 -8554 -6327 -9282 -3118 -14288 -23049
2291 -23049 -17671 -9811 -14676 885 9565 9316 6848 -1629 -1053 12537 2538 -18198 -14986 -9566
2277 -9566 1819 -2452 -11745 -10328 -630 -3885 -5533 -4901 -7943 -6021 2453 4764 981 -10271 7628
2262 7628 20758 16819 5434 4179 -2656 -6704 7886 20315 18826 8210 -2757 -9234 -8138
2249 -8138 -7159 -1502 -5687 -11229 -15164 -11371 3710 1478 4844 -5951 -19192 -13997 -11027 -18567
2235 -18567 -22957 -16513 -10665 3365 -77 5295 6412 -224 -16682 -24554 -15573 -2510 3670 11005
2221 11005 20268 18083 15416 18602 14476 6971 6618 -8656 -17282 -17620 -14165 3544 -1147 -4547 -10554
2206 -10554 -6766 -11726 -7526 -6743 -17261 -18641 -14102 -9720 -3972 6991 7244 4295 -3203 -7239 -18490
2191 -18490 -14108 1774 13993 8115 -4091 -10313 -12817 -6941 -16359 -15176 -9943 -12275 -12707 -10384
2177 -10384 -3436 -5751 -7008 -6109 -2970 -15612 -14401 1436 -1061 -8902 -7197 -1216 4831 477
2163 477 -8659 -20227 -13393 -6622 3631 11780 454 -668 -6199 -4178 13530 25028 16770 4817
2149 4817 -1693 5655 14440 18425 13821 4995 5710 -5002 -14106 -13393 -3875 -6544 -7220 -2396 6480
2134 6480 4156 -5407 -3601 -7021 -8618 -865 9490 4665 -1386 -6226 -9190 -8589 -13272 -6799 -5414
2119 -5414 -6223 -4098 -3400 -4411 7257 26329 20463 16174 2713 -659 -224 10042 12738 7092 2734
2104 2734 18953 29506 22471 21937 8808 -4923 -8312 -7014 -4712 5866 8227 76 1754 2608
2090 2608 5948 12543 9355 4466 14285 16698 11051 7290 11429 15671 3698 -2017 14799 8075
2076 8075 -1903 -3057 1968 -6814 -6047 14207 16159 9937 1514 6611 12333 15416 17535 18672 13359
2061 13359 11532 17051 10217 4545 1885 -166 656 4096 5859 14117 18056 18138 19335 16947 17230 14590
2045 14590 18357 13598 13627 19157 16046 26756 30543 21168 11521 8388 2148 -2978 8757 22323
2031 22323 9606 -4864 -9764 -16006 -10776 1678 5477 4063 4556 -220 2840 13442 20709 22881
2017 22881 13218 7751 -4378 -7376 -6714 -7425 -2197 -6122 -11689 -14399 -15194 -11145 -4533 669 -6244
2002 -6244 -10760 -10612 -18513 -16869 -6130 -14629 -2547 9006 13046 11672 9276 7202 -2709 1786
1988 1786 13553 4387 8869 1456 -1761 3944 16644 21774 14921 2316 2056 2413 -4502 -14926
1974 -14926 -10252 652 -11844 -3664 -440 -13666 -16356 -19076 -3499 2322 1153 4584 17657
1961 17657 29620 27304 14698 11779 13943 12630 2065 -7355 -14595 -10730 -6057 100 -2227 -8993
1947 -8993 -1309 -6729 -4357 5929 1401 5275 19679 28909 18799 14948 9007 5369 18388 16158
1933 16158 6016 2882 -5465 -2138 -1529 1467 11120 20968 10399 12045 17120 14428 -3943 -8612
1919 -8612 -11332 -13408 -3833 -6018 -16530 -26471 -29609 -30458 -22283 -21125 -13257 -11806 -8239 -10515 -5987
1904 -5987 -10615 -1261 11054 23650 22037 22603 32833 27824 14646 5584 10645 2398 2309 11015 7699
1889 7699 11124 7803 1601 -1986 3470 8049 1839 4608 742 -8239 -11212 -1933 -5780 -16289 -14485
1874 -14485 -5584 -731 -9828 -19023 -30340 -29245 -20271 -3801 -2323 -3599 -5378 4658 2422 -5172
1860 -5172 -6553 -4524 -7658 1303 11347 3864 -12063 -22790 -21926 -6355 413 4725 3939 -12387
1846 -12387 -18057 -8421 -2460 -2803 9515 9945 4883 2397 7702 11858 6895 13409 10339 3629 -4329
1831 -4329 -11618 -14135 -10065 -14069 -10240 2636 5076 16323 15795 15618 12944 1532 -5988 -18553
1817 -18553 -17348 -4443 4312 4065 7822 20071 24444 19755 21956 24670 18191 13210 -9636 -9269
1803 -9269 10966 21318 26392 25669 27493 28116 21461 19362 17060 8420 9397 12917 9748 1466 -1377
1788 -1377 3150 -8795 -3988 4661 4530 -2755 372 -405 6511 3223 -3077 4910 4019 2430 -2138
1773 -2138 -8183 10821 18840 12532 6048 -1905 -11027 -15974 -16520 -12410 -2501 -2181 -3683 -3223 2189
1758 2189 3536 -3023 -21536 -26953 -14116 -12416 -11013 -5438 493 -3266 -5910 -13246 -7751 -12107
1744 -12107 -17717 -9337 -87 -6954 -17263 -18589 -14071 8736 8289 -5261 -6980 -4940 -14323 -15814
1730 -15814 -11284 1094 19676 25615 11894 5215 -754 -9268 -9674 -17260 -19786 -13243 -15171 -11363
1716 -11363 -17968 -18537 -6444 -4595 -14792 -14616 -2915 -3814 13169 13216 5017 4513 14869 21616 27410
1701 27410 27717 24049 17519 2144 2237 3221 12693 21703 24830 30619 14281 6735 11469 8985 -2504
1686 -2504 -329 8629 17550 8014 3280 -9232 -16123 -12062 -6585 -15424 -21290 -14717 -14671 -4154 -6655
1671 -6655 -239 7950 19875 12701 -6911 -6653 -9720 -13283 -16394 -17419 -8418 -5693 -1472 3371 7551
1656 7551 5180 -969 2130 12793 5901 4232 2844 1914 5154 5687 1098 1264 11921 11972 20471 33952
1640 33952 35006 21870 9437 -952 -5732 -462 -9242 -20175 -5451 -12296 -5937 -668 7109
1627 7109 864 -13486 -16755 -13438 -17442 -18687 -16794 -16080 -12091 -6132 -3641 -19156 -34165 -24995
1613 -24995 -13675 -10195 -7003 -4362 4820 -7003 -9085 -2174 -6863 2639 6617 13617 9344 -5814
1599 -5814 -7419 -10843 -15094 -22244 -21345 -4062 5531 9535 5050 7224 6997 20725 6016 -4374
1585 -4374 -8877 -6531 -180 9246 -1521 -6757 -9758 1948 13796 13592 -5186 -13567 -8427 -9729
1571 -9729 -9004 -3125 -6883 2053 8884 7975 3670 7709 9407 1204 2715 3584 9647 4408 3192 4585
1555 4585 8374 844 2505 4564 10283 9018 -602 -9170 -3244 -5457 -15046 246 -3345 -799 -2313
1540 -2313 -6399 -6446 -4762 -3230 1399 4486 201 -7921 -986 7160 11809 -5156 5670 16505 21515
1525 21515 21608 20790 28045 31048 25852 22177 28338 26504 20465 5349 7355 14957 13551 4914 20257
1510 20257 22538 19734 15866 11873 15916 7124 6686 -2777 12294 17906 18741 23147 24476 22906 11114
1495 11114 -348 -11559 -6329 -16008 -595 8673 -3677 -8227 -7560 -3958 6484 21216 33058
1482 33058 25040 10425 1518 -19663 -29144 -15700 -6385 -8107 -14772 -17007 -6042 2509 3948 7725
1468 7725 3000 6701 15776 10245 6848 4868 8075 6161 9375 9638 1424 -11605 -9421 -579 -8710
1453 -8710 -16815 -10646 -13490 -13039 -11273 -15102 -1096 5374 4219 7689 10371 12825 2517 -8627
1439 -8627 814 11870 6978 1909 8186 5332 -8587 -8624 100 9820 -292 -720 -15988 -11142 -7593
1424 -7593 -10020 -3774 5692 7946 3258 -2624 -7380 -11173 -11439 -14549 -10162 5433 10980 12089 10867
1409 10867 2060 3211 3360 7 -3816 -7212 -7188 -2460 18110 17239 9150 -1947 -14227 -3886 9084
1394 9084 16106 16446 3172 4408 -1989 -480 7509 1543 -8183 -15524 -13708 -13128 -24419 -17224 -15210
1379 -15210 -1 23685 21847 19041 14021 10190 14143 9501 2020 2961 7589 -4018 6926 11280
1365 11280 11653 12390 12473 11306 1208 -6072 6 185 -3002 -9694 -11654 -3907 -3439 -2066 6923 13299
1349 13299 3454 -1588 -864 -11001 -19729 -20312 -20341 -16512 -9016 -2329 5691 11029 17062 23725 14149
1334 14149 -4913 -2609 2171 -8675 -15303 -11156 -4257 -6861 1095 6077 6807 5952 11187 10992 941
1319 941 -22527 -30119 -16214 6019 18467 15688 11142 -7994 -9571 -9232 -9167 -7932 -9532 -665 -2554
1304 -2554 -6532 -10579 -6936 -9159 -29 6639 291 5850 10472 1914 1728 6084 -4391 -4198 -307
1289 -307 2849 6531 10745 12287 12996 11872 13540 11081 5839 9808 2418 10557 -2539 -14385 -11954
1274 -11954 -397 2957 -2744 8261 25855 26960 14711 16888 23451 22269 15390 11241 8749 8216
1260 8216 12718 3840 1289 2055 4846 1454 5005 3382 -7702 -7052 -4097 -562 4945 2122 -4998
1245 -4998 -406 1809 -555 -10111 -11709 -18346 -19807 -3230 -4787 1535 303 5431 6665 6145 -848
1230 -848 2834 8629 10955 10958 18504 11176 788 -2139 -641 -4086 -13647 -21374 -19077 -20764 -10382
1215 -10382 7402 9873 7881 12189 14074 6886 -83 -2239 -2835 -5722 4594 2655 -1190 658
1201 658 2910 13918 14114 9987 -9555 -16859 -8997 2268 9410 3013 4672 7480 9241 14690 3865
1186 3865 -593 6280 17642 15382 13854 1830 -15775 -2640 7033 -1666 -9425 -17011 -8353 2011
1172 2011 7747 11892 911 -9530 611 -8839 -22436 -13110 -8838 -2682 1101 -17392 -22960 -20225
1158 -20225 -22006 -19915 -16451 -10266 -8337 -8801 -5126 -22649 -21636 -11348 11799 16608 9887 -2380
1144 -2380 -1400 2124 3394 8737 -2869 -9720 -10312 -6030 10186 14717 -79 -91 10537 3362 1015
1129 1015 13654 20923 18963 15948 8010 9768 11366 9340 12690 12067 1144 11022 8738 9450 18528
1114 18528 23980 29744 32461 17303 -2889 -7181 4924 13211 11178 11884 3992 -5716 -5994 -67
1100 -67 -3821 -4270 2918 3864 156 958 5007 -3102 6767 -492 -17489 -24483 -16483 -18044 -12707 -14995
1084 -14995 -20037 -7406 8979 14000 18724 19367 11677 9682 7446 2480 361 390 -5812 -15956 -24142
1069 -24142 -13713 -25334 -16625 -298 1742 10434 8567 11882 21463 25176 24760 12973 12543 1016
1055 1016 -1536 -1408 810 9243 4252 6011 11405 18305 20937 17264 7840 16623 22352 17433 12818
1040 12818 18274 13993 -2690 -7022 -15082 -17089 -12052 -5176 7152 5277 -11036 -29029 -27493 -15309
1026 -15309 -13373 -14555 -10425 -6715 -12829 -16808 -22351 -22777 -15587 -11389 -2395 -5943 -10278 -15855 -6402
1011 -6402 -2149 -8278 -5883 6234 5244 2575 1061 2912 6194 -1593 -15793 -20876 -17103 -12028 -6206
996 -6206 2375 -9068 -16921 1168 4321 -873 1873 4488 2813 -4402 -1679 1939 -1149 2160 5993
981 5993 2526 -8192 -6524 13579 15753 17554 5938 3944 -8454 -13515 -12348 -4963 1278 -10951
967 -10951 -12514 -10076 -1845 535 -6014 -3960 -1237 1902 -3336 -4801 -1617 651 8436 18826 15880
952 15880 13009 9149 16423 9779 895 -874 -796 3351 3791 12397 30430 30756 21476 17987 25757 32496
936 32496 25233 23435 16166 -261 -8350 -5523 -12017 -17493 -14054 -5465 12018 17100 8996 12066
922 12066 14462 5699 -11955 -6579 7234 5789 5623 11368 5162 14042 2947 5687 10761 6787
908 6787 6079 9340 -4678 -803 1189 -5344 -2739 -6413 -10935 -13498 -9360 -1273 -15589 -29396 -34150
893 -34150 -27485 -10099 -1534 1045 5846 8407 4342 4237 -895 -16073 -21386 -8447 871 5933
879 5933 8816 5911 8881 18782 6987 10324 8186 12663 16403 23318 22842 13375 9512 12516 7922
864 7922 -8381 -12290 -6787 -621 7292 13356 7242 13536 19716 11701 20352 26588 10585 -4298
850 -4298 -614 9425 7856 9524 5425 7644 12513 -2971 -1155 16205 18273 13814 14759 18819 25019
835 25019 25709 30584 32072 19161 1527 -6785 5863 17272 22484 19657 14486 9494 4718 2947
821 2947 -7635 -16575 -16698 3642 16383 6822 -3442 -15753 -16807 -21259 -10093 -9029 -1229 -4464
807 -4464 -13248 -16198 -16372 -10532 -10573 -10736 -9351 9952 14061 11254 7521 -9426 -18852 -13817 -14278 -7711
791 -7711 6710 8392 3726 8287 13278 16852 9582 -319 -15749 -22926 -16050 -13653 -17382 -15552 -9061
776 -9061 -5427 -374 1059 4498 -3130 615 4356 -3385 -3485 -1376 8208 12764 15210 17590 9452
761 9452 -8920 -9114 -2840 -1082 13709 13298 5343 8433 21109 18332 12447 435 -11940 -19223
747 -19223 -10534 1726 8347 7760 -3199 -7157 445 656 -7129 -20240 -19245 -13940 -4140 -5344 -26946
732 -26946 -29130 -16103 -7393 -11003 -14357 -12097 -7364 -5511 -5650 -4985 -11038 -3694 7459 3203 2317
717 2317 6692 7134 -9151 -15944 -8220 8356 15546 15645 16118 19354 11540 -12158 -4393 8913 11270
702 11270 1052 -10180 -2861 -6562 -8307 -14131 -8768 -4962 -9125 -8993 -14535 -11474 -5803 -9023 -18373
687 -18373 -7212 7454 11843 4971 4582 330 -4531 -8049 -10387 -8992 -2567 -1255 5995 4893 -5208
672 -5208 -3246 279 5443 8827 8446 -5910 -7936 -8142 -9261 1818 7039 8900 19833 12277 5382
657 5382 14029 14861 13268 14161 1625 -1032 -6850 -2361 4639 4353 -1839 -15109 -11320 -3929 1406
642 1406 -603 -1519 2001 5997 -1849 689 -1233 -7661 -2575 -13533 -9227 -2966 -13362 -20202 -22970
627 -22970 -14068 -14712 -14097 -13310 -12571 -14948 -13748 -13708 -16037 -17733 -5652 -10716 1852 3826 -3199 -5900
611 -5900 2559 -14998 -19867 -15163 -9435 -1319 12786 30169 25475 13059 4080 3430 -5854 -9981
597 -9981 -16177 -16873 -5887 -6732 -14052 -21274 -21549 -10828 -2845 -6943 -12002 -18081 -21118 -14229 -17377
582 -17377 -17439 -4424 6231 8573 15226 10304 10147 7736 1435 270 7905 15037 4972 -7681 -9383
567 -9383 -16766 -16138 -4164 -3785 5590 2533 1925 1196 10762 7222 1997 1012 9337 -4819 -13218 -9315
551 -9315 -11006 9417 15374 916 8244 7440 8759 5805 11164 18310 13253 4796 7727 877 3612
536 3612 14772 8937 8580 7316 16825 15472 7919 -2419 -5031 908 9392 6203 5268 3358 838
521 838 2316 -1982 -144 9115 8714 8489 9401 -1678 -4115 -9137 -12637 -12481 -22835 -21880 -12519 -7117
505 -7117 -11633 -7214 -1362 -10953 -20559 -29299 -34718 -21666 -17906 -10346 -3470 -1864 -412 8593 10294
490 10294 12480 11009 5198 3781 -1911 -446 -2219 -432 1875 -577 -14867 -11790 -8556 -13658 -19403
475 -19403 -23770 -34543 -39284 -19039 -3841 -6400 -7477 -1755 -642 -6846 -317 6293 5357 -2536
461 -2536 -15325 -15618 -17949 -18328 -16776 -24166 -15995 -3460 -6557 -9081 -7672 -9493 -12115 -3831 -1988
446 -1988 -15835 -19444 -14003 -8275 -7295 -1875 -6559 -3192 9451 20204 13419 -357 -4716 -1066
432 -1066 -5023 906 10473 16767 7221 8915 4908 6428 -8371 -4991 6677 7505 5900 -3095 -6745
417 -6745 -7235 -1431 -2210 -2260 4396 -6860 -27034 -37093 -30452 -4595 5786 4866 13438 9877 296
402 296 7335 9704 6018 5011 304 10883 18692 7414 -1545 -10111 -3621 3764 -2528 20 -7060
387 -7060 -2678 2446 -1327 -3234 -10396 -8716 -3800 -3122 8115 16094 6063 -373 6111 -767 4845
372 4845 3636 2604 1314 8783 12197 22004 10640 661 1781 -1960 -2825 3600 7553 1671 8065
357 8065 16822 4460 -6268 6222 -8895 -18563 -13478 -9971 4115 6999 11184 22547 19905 13407
343 13407 13645 -735 -3778 -2413 -1765 -4431 -15905 -17319 -18068 -19564 -21141 -27863 -25575 -14785 -13873
328 -13873 -18915 -9098 -2486 1190 -10633 -4291 2714 -96 -7552 -9413 -8391 -11664 -13037 -10821 -2561
313 -2561 -4213 -4538 -11397 -6568 -7534 -9806 -12719 -12597 -14201 -15330 3894 14566 16029 3997 -8832
298 -8832 -4791 -45 -5453 -12390 -17648 -11823 -1438 6419 8610 9823 11449 21227 15629 20071 14561
283 14561 9248 10243 11145 4699 -2456 5478 7504 1654 2551 1643 983 -4058 7122 22169 7225
268 7225 -4009 -7209 -11708 -20168 -15051 -12140 3716 1045 -5189 160 4728 6898 14888 15326 11110
253 11110 9883 5746 2677 -419 -2495 -12512 -13418 3355 9560 962 -2404 1484 2501 6509 -2746
238 -2746 -9264 -11976 -12750 -5171 -5385 -4750 -963 7147 1646 -3124 -2995 -3763 -4725 -6599 -7305 -12656 -9315
221 -9315 -8776 -147 10917 13629 9505 -1678 -17574 -12874 913 8211 8631 6088 -3564 4581 4356
206 4356 -8786 -14971 -280 7743 8145 3706 -10747 -22414 -20261 -10496 -2287 -5010 -6570 -2905
192 -2905 7248 9791 9305 13902 13126 6627 2455 -2329 -8433 -13659 -10752 -4294 -1962 3416 6129
177 6129 -2471 1737 13252 8593 3333 3977 6314 2669 -3736 -6352 -1711 -1315 -6461 -10874 -2557
162 -2557 4923 3581 -5660 -8364 -7706 -3303 5562 168 -829 1400 -746 8171 12879 12070 8824 6029
146 6029 7858 12275 9622 -567 -13594 -1997 5258 -2250 -7949 -9289 -12117 -10932 -9421 -11217
132 -11217 -8005 -5193 -3965 -8067 2604 6642 1142 -1033 -4420 -2160 836 7767 15866 21020 17953
117 17953 11150 -131 -3699 -2128 7694 7375 -1198 -7455 -13032 64 4219 -4719 -14368 -13812 -12564
102 -12564 -18603 -11424 -661 1098 -9611 -13128 -4279 291 143 -3703 -7227 -10500 -10673 -12229 -14055
87 -14055 -5736 -3313 5572 3829 3779 2208 391 -11743 -11649 -10554 -12010 -10262 -9863 -9493 -13393 -6350
71 -6350 -3630 -1583 -9486 -6117 -4191 -7844 -10770 -10409 -8361 -6555 2058 2603 7336 8950 8899 5422
55 5422 14 5794 4936 -779 4669 15836 13774 3019 -1959 567 -1736 -10573 -5645 -3099 -1131
40 -1131 -1341 8280 5078 6061 9778 7218 1171 819 -2325 -4593 -13137 -12622 -6506 77 -3595 3343
24 3343 9430 11430 6325 -5889 -10055 -8212 -3570 -554 -5022 -7260 817 7738 -232 -7874 -449
9 -449 3658 8793 10796 16038 15868 4095 -1578 -3577 -2338
0 -2338
$$ Imaginary data points
##PAGE= N=2
##DATA TABLE= (X++(I..I)), XYDATA
32767 7048 -957 5188 9200 9588 4393 5873 11904 11584 11144 14053 16656 13510 10724 15335 14058
32752 14058 11063 16949 16966 11525 11622 13515 16777 15169 6298 1285 8632 5498 7753 8851 10753
32737 10753 4196 9024 11661 8438 6673 -3807 2208 1070 3661 15011 21993 23699 15132 15653
32723 15653 13869 6099 1005 6343 14600 15018 7641 4166 11180 16308 19261 15892 17689 10327 8270
32708 8270 14986 10831 12059 15829 12733 3321 -3006 671 6283 15776 16447 19956 23745 18897 13494
32693 13494 14644 20548 25900 21071 19461 22300 15622 8317 5761 12764 18960 18594 20214 20968 28195
32678 28195 31793 22267 14978 20412 19046 19559 18967 26000 27627 37361 34129 24878 25435 24511 22701
32663 22701 26800 25182 24809 26826 26094 34968 35235 36355 28488 20396 20332 33656 35561 28310 18724
32648 18724 19931 29146 28211 30094 31240 27436 24832 22284 22852 29610 35710 39781 28204 24031 22764
32633 22764 24384 24625 27322 28722 27349 29900 33486 28954 29198 20523 19864 36493 37553 29748 32749
32618 32749 42031 34975 20423 12544 10160 17773 32654 34767 28417 26908 26502 31181 41083 41258
32604 41258 29281 22983 22479 28929 38641 48659 50655 50275 51071 56377 55456 53969 46797 40167 31998
32589 31998 28830 36258 43724 45034 39059 42886 45754 47322 37321 36782 39460 39555 35156 35219 43519
32574 43519 35250 25138 25419 33563 39431 49242 44105 38324 43263 48913 44965 40027 42762 40650
32560 40650 28320 31279 40417 49217 46965 47227 45933 44895 39485 39202 46829 46681 42460 41741 41896
32545 41896 35474 32274 42544 45310 49526 58966 64223 55452 43135 45575 48821 59866 59954 52681
32531 52681 50577 55334 60101 65697 57611 47122 47046 57403 59440 49254 41662 41063 34604 33398
32517 33398 44681 49001 54216 54730 55292 57394 52022 52963 53624 55836 51598 62308 57611 47719 51604
32502 51604 55339 43410 47601 52126 52502 54570 58870 63248 62887 53536 43516 37806 37007 39792 46873
32487 46873 53291 65826 63788 55726 47472 41100 37538 41848 38545 31993 32020 32782 30298 34461 44148
32472 44148 43045 38904 38065 38166 40101 38327 33521 34141 38472 44022 49593 44029 49039 48200 33776
32457 33776 28519 30791 32148 37802 45195 53246 52993 56233 64792 77593 75697 71547 66259 61972
32443 61972 62607 60240 60211 66918 71752 51341 40840 48470 60548 53705 52946 52559 42415 40636 34551
32428 34551 28843 31388 26300 31161 33223 40826 42604 45340 40583 34537 39804 45279 56816 60307
32414 60307 54592 49595 43392 41353 35847 39066 49546 56599 47615 44636 45145 45948 45427 44348 36664
32399 36664 43611 56095 63412 72806 66503 66229 67700 70431 79860 71256 62301 65904 75614 75514 72980
32384 72980 69607 60105 63189 67782 63437 48081 53265 70689 72313 65824 60515 55813 43547 35559
32370 35559 38191 38667 34229 39041 46232 43670 35706 37692 47417 60277 60190 53580 56529 57316 54683
32355 54683 52156 54186 58671 55711 55749 68108 66541 61527 59758 63365 44353 47352 54722 55866
32341 55866 53703 55936 53967 64104 75935 73404 79323 78337 74361 60693 54888 54949 58292 62656
32327 62656 65581 80444 86283 81415 66515 56564 54671 61602 67938 63293 61911 67227 58654 55394
32313 55394 55084 49161 44165 47080 54205 56147 68880 70730 67718 67627 64281 66828 72525 64173 48540
32298 48540 44385 49716 55376 66222 71383 71293 72069 62170 57134 55796 57115 62862 74583 68586 52053
32283 52053 53220 67033 70193 68235 53154 51631 54545 64216 68262 64150 63329 63104 63369 62490 73306
32268 73306 80957 71527 58248 55525 50713 60430 63704 66730 61082 54496 50822 38729 48659 56643
32254 56643 51846 51195 57196 63375 74438 84724 78923 66859 63479 53419 59515 62432 68259 61825
32240 61825 58428 59167 53178 59648 62652 63383 60080 54429 49578 58689 60140 57061 58232 50403 46015
32225 46015 56639 63658 62827 60921 66109 73704 67842 59324 55925 78761 78556 74108 67974 65077
32211 65077 61773 48208 46605 56995 69208 73766 69209 63914 57018 43253 38500 43617 50823
32198 50823 60788 63728 66457 71755 74216 67153 57396 60360 60906 65111 76119 81949 69279 64779
32184 64779 60086 62926 57914 58658 50229 34336 33456 48496 53697 39534 35618 55496 61789 63841
32170 63841 78235 94192 83679 70274 76681 66916 49701 50198 45615 48726 62394 68266 69903
32157 69903 66493 60059 52819 40490 41479 57298 63789 68179 79104 79255 73262 65709 72880 66739
32143 66739 63255 55445 49335 64389 68277 66877 61028 66153 68246 72040 79846 79098 68211 57711
32129 57711 55952 61787 61219 53247 62124 61295 53785 47599 60370 64818 61883 64281 68482 61929 60702
32114 60702 65742 67289 64765 62636 54112 48713 48038 54198 51310 40611 45532 46515 55951 52878 59014
$$ [...]
##END NTUPLES=NMR SPECTRUM
##END=
