##TITLE=Analysis number 312890
Compound Code dfp 00030
Project Code adrs
Chemist Name ugmt
##JCAMPDX= 6.0         $$ Bruker NMR JCAMP-DX V2.0
##DATA TYPE= NMR SPECTRUM
##DATA CLASS= NTUPLES
##ORIGIN= Bruker BioSpin GmbH
##OWNER= NMR
$$ XWIN-NMR		Version 3.5
$$ Wed Aug 17 12:13:41 2005 GMT Daylight Time (UT+1h)  MAYBRIDGE\NMR@NMR_250MHZ
##.OBSERVE FREQUENCY= 250.131544655141
##.OBSERVE NUCLEUS= ^1H
##.ACQUISITION MODE= SIMULTANEOUS (DQD)
##.ACQUISITION SCHEME= undefined
##.AVERAGES= 16
##.DIGITISER RES= 18
##SPECTROMETER/DATA SYSTEM= dpx250
##.PULSE SEQUENCE= zg30
##.SOLVENT NAME= CDCl3
##.SHIFT REFERENCE= (INTERNAL, CDCl3, 0, 16.522)
##AUDIT TRAIL= $$ (NUMBER, WHEN, WHO, WHERE, WHAT)
$$ ##TITLE= Audit trail, XWIN-NMR		Version 3.5
$$ ##JCAMPDX= 5.01
$$ ##ORIGIN= Bruker BioSpin GmbH
$$ ##OWNER= NMR
$$ C:\u/data/dgb/nmr/ADRS/8070/pdata/1/auditp.txt
$$ ##AUDIT TRAIL=  $$ (NUMBER, WHEN, WHO, WHERE, WHAT)
(   1,<2005-08-17 12:13:22.17 +100>,<MAYBRIDGE\NMR>,<NMR_250MHZ>,
      <created by zg, POWCHK disabled, PULCHK disabled
       configuration hash MD5:
       62 19 C7 07 E1 42 D1 B7 37 6C 3D D0 77 39 F9 E6
       data hash MD5: 64K
       2A 53 1C CE 09 1A E2 E4 43 77 FB 1F 7A 3C ED 33>)
(   2,<2005-08-17 12:13:33.01 +100>,<MAYBRIDGE\NMR>,<NMR_250MHZ>,
      <Start of raw data processing
       ef LB = 0.3 FT_mod = 6 PKNL = 1 SI = 32K 
       data hash MD5: 32K
       F5 C2 EB A6 E8 4D 99 8B E8 B5 98 F5 D4 5D E9 DB>)
(   3,<2005-08-17 12:13:34.76 +100>,<MAYBRIDGE\NMR>,<NMR_250MHZ>,
      <apk 
       data hash MD5: 32K
       8F 56 F7 B0 9C 3B C0 7C 8A E8 16 D3 9E E9 4D 9D>)
(   4,<2005-08-17 12:13:35.62 +100>,<MAYBRIDGE\NMR>,<NMR_250MHZ>,
      <abs ABSG = 5 
       data hash MD5: 32K
       BF 24 1A 4B 44 E1 41 89 26 F5 23 E0 F4 0D 81 72>)
$$ ##END=
$$ 
$$ hash MD5
$$ F0 6F F9 31 41 AC C5 9B 7D F3 21 35 0A 0D 9D 93
##$RELAX= 
##$RELAX= 
##$RELAX= 
##$RELAX= 
##$RELAX= 
##$RELAX= 
##$RELAX= 
$$ Bruker specific parameters
$$ --------------------------
##$DU= <C:\u>
##$EXPNO= 8070
##$NAME= <ADRS>
##$PROCNO= 1
##$TYPE= <nmr>
##$USER= <dgb>
##$AMP= (0..31)
100 100 100 100 100 100 100 100 100 100 100 100 100 100 100 100 100 100 
100 100 100 100 100 100 100 100 100 100 100 100 100 100 
##$AQSEQ= 0
##$AQ_mod= 3
##$AUNM= <au_zg>
##$AUTOPOS= <20 >
##$BF1= 250.13
##$BF2= 250.13
##$BF3= 250.13
##$BF4= 250.13
##$BF5= 500.13
##$BF6= 500.13
##$BF7= 500.13
##$BF8= 500.13
##$BYTORDA= 1
##$CFDGTYP= 0
##$CFRGTYP= 5
##$CHEMSTR= <none>
##$CNST= (0..31)
1 1 145 1 1 1 1 1 1 1 1 1 1 1 1 1 1 1 1 1 1 1 1 1 1 1 1 1 1 1 1 1 
##$CPDPRG= <>
##$CPDPRG1= <>
##$CPDPRG2= <>
##$CPDPRG3= <>
##$CPDPRG4= <mlev>
##$CPDPRG5= <mlev>
##$CPDPRG6= <mlev>
##$CPDPRG7= <mlev>
##$CPDPRG8= <mlev>
##$CPDPRGB= <>
##$CPDPRGT= <>
##$D= (0..31)
0 1 0 0 0 0 0 0 0 0.06 0 0 0 0 0 0 0.0002 0 0 0 0 0 0 0 0 0 0 0 0 0 0 
0 
##$DATE= 1124277201
##$DBL= (0..7)
120 120 120 120 120 120 120 120 
##$DBP= (0..7)
150 150 150 150 150 150 150 150 
##$DBP07= 0
##$DBPNAM0= <>
##$DBPNAM1= <>
##$DBPNAM2= <>
$$ [...]
##$SUBNAM7= <"">
##$SUBNAM8= <"">
##$SUBNAM9= <"">
##$SW= 20.6930455092707
##$SWIBOX= (0..15)
0 0 3 0 0 0 0 0 0 0 0 0 0 0 0 0 
##$SW_h= 5175.983436853
##$TD= 65536
##$TD0= 1
##$TE= 295.16
##$TE2= 300
##$TE3= 300
##$TEG= 300
##$TL= (0..7)
0 120 120 120 120 120 120 120 
##$TP= (0..7)
150 150 150 150 150 150 150 150 
##$TP07= 0
##$TPNAME0= <>
##$TPNAME1= <>
##$TPNAME2= <>
##$TPNAME3= <>
##$TPNAME4= <>
##$TPNAME5= <>
##$TPNAME6= <>
##$TPNAME7= <>
##$TPOAL= (0..7)
0.5 0.5 0.5 0.5 0.5 0.5 0.5 0.5 
##$TPOFFS= (0..7)
0 0 0 0 0 0 0 0 
##$TUNHIN= 0
##$TUNHOUT= 0
##$TUNXOUT= 0
##$USERA1= <user>
##$USERA2= <user>
##$USERA3= <user>
##$USERA4= <user>
##$USERA5= <user>
##$V9= 5
##$VALIST= <valist>
##$VCLIST= <CCCCCCCCCCCCCCC>
##$VD= 0
##$VDLIST= <DDDDDDDDDDDDDDD>
##$VPLIST= <PPPPPPPPPPPPPPP>
##$VTLIST= <TTTTTTTTTTTTTTT>
##$WBST= 1024
##$WBSW= 4
##$XGAIN= (0..3)
0 0 0 0 
##$XL= 0
##$YL= 0
##$YMAX_a= 394723
##$YMIN_a= -432018
##$ZGOPTNS= <>
##$ZL1= 120
##$ZL2= 120
##$ZL3= 120
##$ZL4= 120
##$ABSF1= 16.522
##$ABSF2= -4.171173
##$ABSG= 5
##$ABSL= 3
##$ALPHA= 0
##$AQORDER= 0
##$ASSFAC= 0
##$ASSFACI= 0
##$ASSFACX= 0
##$ASSWID= 0
##$AUNMP= <proc_1d>
##$AZFE= 0.1
##$AZFW= 0.1
##$BCFW= 0
##$BC_mod= 0
##$BYTORDP= 0
##$COROFFS= 0
##$CY= 12.5
##$DATMOD= 1
##$DC= 0
##$DFILT= <>
##$DTYPP= 0
##$F1P= 14.0000005364418
##$F2P= -0.99999901652339
##$FCOR= 0.5
##$FTSIZE= 32768
##$FT_mod= 6
##$GAMMA= 0
##$GB= 0
##$INTBC= 1
##$INTSCL= 1
##$ISEN= 128
##$LB= 0.3
##$LEV0= 0
##$LPBIN= 0
##$MAXI= 10000
##$MC2= 0
##$MEAN= 0
##$ME_mod= 0
##$MI= 0
##$NCOEF= 0
##$NC_proc= -4
##$NLEV= 6
##$NOISF1= 0
##$NOISF2= 0
##$NSP= 0
##$NTH_PI= 0
##$NZP= 0
##$OFFSET= 16.522
##$PC= 1
##$PHC0= -78.50471
##$PHC1= 6.547601
##$PH_mod= 1
##$PKNL= yes
##$PPARMOD= 0
##$PSCAL= 4
##$PSIGN= 0
##$REVERSE= no
##$SF= 250.13
##$SI= 32768
##$SIGF1= 0
##$SIGF2= 0
##$SINO= 400
##$SIOLD= 32768
##$SREGLST= <1H.CDCl3>
##$SSB= 0
##$STSI= 32768
##$STSR= 0
##$SW_p= 5175.98343685301
##$SYMM= 0
##$S_DEV= 0
##$TDeff= 65536
##$TDoff= 0
##$TI= <Analysis number 999999
Compound Code 99
Book Reference 9
Project Code 9>
##$TILT= no
##$TM1= 0
##$TM2= 0
##$TOPLEV= 0
##$USERP1= <user>
##$USERP2= <user>
##$USERP3= <user>
##$USERP4= <user>
##$USERP5= <user>
##$WDW= 1
##$XDIM= 32768
##$YMAX_p= 298542906
##$YMIN_p= -269589
$$ End of Bruker specific parameters
$$ ---------------------------------
##NTUPLES= NMR SPECTRUM
##VAR_NAME=  FREQUENCY,     SPECTRUM/REAL,   SPECTRUM/IMAG
##SYMBOL=    X,             R,               I
##VAR_TYPE=  INDEPENDENT,   DEPENDENT,       DEPENDENT
##VAR_FORM=  AFFN,          ASDF,            ASDF
##VAR_DIM=   32768,         32768,           32768
##UNITS=     HZ,            ARBITRARY UNITS, ARBITRARY UNITS
##FACTOR=    0.157963299565203, 1,           1
##FIRST=     4132.6476996994, 0,             0
##LAST=      -1043.33573715361, 0,           0
##MIN=       -1043.33573715361, -269589,     0
##MAX=       4132.6476996994, 298542906,     0
$$ Real data points
##PAGE= N=1
##DATA TABLE= (X++(R..R)), XYDATA
$$ [...]
22457 47041 46093 74382 -22177 -86081 -50272 -20969 -11585 -11793 -19882 -58770 -132147 -121575 -85194
22444 -85194 -63045 -77255 -85928 -99706 -113297 -85774 -64412 -82169 -109713 -72515 4248 70887
22432 70887 38997 -12968 -718 1226 -8584 -7713 17774 -24450 -25474 -71937 -89737 -114797 -66344
22419 -66344 -55128 -58694 -61301 -52028 -101039 -101622 -36754 -21332 -19409 -13830 44338 59022 -5146
22406 -5146 -65694 -26973 19244 11631 2953 -20624 9140 46285 71816 98240 38279 -31897
22394 -31897 19771 21489 39448 40044 77792 6515 -21694 -51297 -46404 29997 52902 38794
22382 38794 48672 87740 85257 87362 85711 106040 76518 32282 60025 64788 21474 -24293 30266
22369 30266 4045 -40515 -47977 -7239 10407 17388 -5496 28452 6800 -26557 -597 -46049
22357 -46049 -43189 -32440 -40095 -28483 -9090 19261 21178 27178 3023 9553 22044 73087 81681
22344 81681 59463 3218 -1334 -95876 -139009 -107656 -59820 -70747 -64163 -73492 -74440 -25946 -628
22331 -628 5860 -2424 -26280 -73201 -52669 -56645 -2716 60732 45186 66057 -9274 -46285 -77975
22318 -77975 -48825 -37217 6432 72779 124642 121156 44778 12992 -13980 -35276 -15954 26913
22306 26913 -6682 -8679 1026 15130 8713 22070 -7119 -31073 -12165 -19247 -13282 -76862 -34738
22293 -34738 -40837 -55164 -66725 -83306 -107354 -39736 -61769 -24951 41105 81308 78096 38506
22281 38506 14372 1070 -1776 -37949 -69927 -90195 -79316 -36925 -60087 -47722 27007 111930
22269 111930 113158 -198 56505 81873 88380 80735 -2390 -51383 -65967 -117160 -133577 -108564
22257 -108564 -65389 -111440 -98382 -22585 -12983 -33302 -68225 -38242 -53438 -57141 -19778 2639
22245 2639 37280 -3554 -21474 -24469 -60534 -68896 -33488 -36373 -66088 -61881 -43644 -32017 -55127
22232 -55127 -56755 -59635 -100737 -73289 -10289 43918 44396 81617 77511 56297 43153 966 -69885
22219 -69885 -106107 -101253 -34819 -1224 7553 -23983 -70576 -8775 10088 -12874 4284 -10617
22207 -10617 -31668 -14234 -35328 -26284 -16069 -11271 -52807 -48043 -2606 -11636 15691 24190 51406
22194 51406 51283 60466 46310 29116 38050 7007 -24821 -51306 -36369 59729 63834 -7859 -44745
22181 -44745 -118527 -85092 -45328 21704 18713 6970 -63798 -47051 43866 46013 -66220 -39704
22169 -39704 49156 92379 98069 86719 -18929 -45742 -28497 37777 27643 9005 -23949 -54992
22157 -54992 -78455 -109250 -64447 -38564 -29924 -60093 -61455 -71794 2503 119024 50230 16039
22145 16039 -24452 -80509 -70189 -66019 -44858 -24993 -86091 -90606 -35867 -40935 -83475 -93421
22133 -93421 -58700 -18081 48685 33055 -12477 -545 16300 51236 116479 88516 42105 27535
22121 27535 27085 62875 49855 28294 -5690 -2185 46412 17268 -20909 -37999 6919 304
22109 304 8568 26563 36015 -6678 -45282 -110841 -100789 -35896 -52993 -79225 -109624 -68793
22097 -68793 -13615 60281 100828 78440 -18949 -23527 -9505 -43996 -71141 -63865 -2058 -164
22085 -164 -7399 -2593 -93387 -82598 -74084 -26453 37443 17642 -68275 -107375 -109473 -35918 -26256
22072 -26256 -14776 -13019 10840 -50672 -7997 22651 866 26919 84423 56818 -20247 -33395
22060 -33395 1306 -9035 -13219 31611 29414 -35919 -15039 6261 -46325 -58121 -64227 -76180
22048 -76180 -39660 33644 65055 47612 7807 -7369 -19913 -49439 -79292 -100338 -96178 -39024
22036 -39024 -23769 6578 -62150 -11656 13597 25067 -9927 -78443 -68866 -67424 -27660 -33259
22024 -33259 2067 26392 26707 21133 10578 57814 49981 15746 12957 83138 94881 37092 -52543
22011 -52543 -51642 -52181 -21885 7775 -36626 -94204 -83757 -19619 25011 26472 68477 44146 13077
21998 13077 84650 80431 47592 2187 -25311 -16566 17439 62736 27793 -45665 -59534 -52997
21986 -52997 -40041 -42834 -37694 -75067 -96638 -45907 13209 19964 17198 28900 -10837 -76723
21974 -76723 -82648 -31200 -1502 22680 21218 21250 -16222 -37101 -6484 -14373 -23596 -47539 9946
21961 9946 68033 113067 26279 3270 -27 17515 -39639 -33051 -61491 -4949 12972 -16565
21949 -16565 -137 32941 99164 58011 27611 63205 51420 39331 10621 4884 -23966 -44705
21937 -44705 -29651 -4916 12240 -14973 -28468 -545 46564 72459 116655 140509 147386 93302
21925 93302 66319 48108 37868 15401 -5766 22207 10573 45113 72087 90378 50765 18507
21913 18507 13419 16587 9413 18943 90236 90760 -39848 -13175 -35722 -45161 -73523 -75420 -60401
21900 -60401 -59719 -6573 -24557 -58109 3933 23221 -10843 -19621 -94788 -86405 -73741 -27811
21888 -27811 -15119 -21389 14621 57520 37071 33576 20437 -38322 -5017 16922 7769 13405
21876 13405 64559 71370 106976 84202 41604 -11816 -42867 -43545 -77105 -51868 -30735 -20481
21864 -20481 -73894 -76891 -72428 -15188 53113 24293 -16265 -23419 1735 -41906 -96005 -80812
21852 -80812 -28415 -18130 -79115 -169288 -167288 -88071 -10246 13733 15035 38070 29635 -3359
21840 -3359 -26352 -17592 -47309 -18054 -2682 -22486 -30592 14629 20929 6336 -13594 11153
21828 11153 -6087 -79773 -88047 -97695 -54101 49871 35753 9323 49847 14133 41543 91574
21816 91574 117116 79822 79423 75409 49700 -9523 21424 48155 44687 58790 41748 -7177
21804 -7177 -50744 -40244 18500 29323 37194 21161 -43032 -70268 -55760 -34089 22573 33746
21792 33746 37190 59175 63761 12606 -39561 699 36361 26790 21150 38616 25360 54177
21780 54177 88024 67823 -1640 11329 -8645 22773 40742 49351 49658 89598 88340 64833
21768 64833 7549 -15596 2185 54400 31215 -29790 -9925 -30746 -42444 -74194 -43841 -41132
21756 -41132 -56179 -10704 3295 4947 1215 -60482 -77445 -8639 53651 63608 62837 3374 -63441
21743 -63441 -68394 -28859 9928 -5882 -26025 -37816 -28102 -21614 -334 30514 21032 -12826
21731 -12826 2779 42741 63005 31957 34274 55094 15075 -27692 12833 67104 14524 -12034
21719 -12034 -1851 6991 -1755 12061 51399 71378 53435 5628 32817 1471 -53004 -52737
21707 -52737 -28035 -56674 -1848 30558 5053 -3235 34002 -9079 -64662 -79429 -55766 -38230
21695 -38230 -47278 -75522 -44995 -33887 -25573 -27019 -52312 -54211 -28549 18502 24407 -34936 -75172
21682 -75172 -17397 30598 23638 2248 68681 23327 -47278 -43061 -52797 -79618 -127678 -127790 -175199
21669 -175199 -134928 -99141 -92722 -84810 -59655 -55082 -58132 -1041 67417 53749 23869 -39789
21657 -39789 -52204 12981 34572 58017 26289 -19444 -52380 -36374 14395 57214 20661 -54977
21645 -54977 -56505 -56978 -81339 -91872 -6803 52394 48912 203 3335 -57504 -81598 -24361 -37572
21632 -37572 -63259 -43451 7584 -4487 -25138 22410 39416 51278 16995 9215 17817 33033
21620 33033 2699 -8137 -25146 57745 126115 113407 76221 67463 6727 -77280 -55429 -3980
21608 -3980 -7330 -3075 -116 26610 13096 -9161 11540 62124 19640 -41613 -13742 60625
21596 60625 53709 51409 80913 60046 8027 91004 106932 83914 -23835 -27963 27453 28892
21584 28892 -24757 52377 34982 6505 -8720 -23895 30378 50334 27777 53009 71495 44681
21572 44681 -11514 -22921 -63059 -75958 -26456 3350 -66967 -48612 -3515 -5087 -12344 4998
21560 4998 -14149 -73734 -74170 -66317 -19221 -29097 37789 31398 12277 -35680 -86804 -85918 -108465
21547 -108465 -83755 -79668 -30366 31925 71166 33878 -5089 2692 25630 64138 71428 30180
21535 30180 -11261 -23227 -6741 -24015 16897 58665 91234 80869 41700 52865 27999 -3892
21523 -3892 -18108 11433 22997 40913 8508 -911 271 -27024 41950 48004 46021 57053 47846
21510 47846 27659 -8466 13154 9674 -64424 -75207 -69997 -24505 6864 8151 -244 20014
21498 20014 24572 55014 22173 -21506 -66906 -68036 -82007 -29573 1969 -1861 -25775 -17255
21486 -17255 49580 28097 -1100 18161 44784 18326 15900 29846 12397 27298 47565 -19751
21474 -19751 -45836 -12072 38149 40115 25016 -26815 -1141 16651 -62709 -85411 -33209 4649
21462 4649 31846 23884 -1645 -11939 -59094 -68455 -43891 12001 35805 69270 38860 -8051
21450 -8051 5296 9352 20759 30010 -6894 -41637 2544 20267 47859 57998 83114 47635
21438 47635 47323 15238 25979 18030 -19488 3272 -23264 -21372 -33292 -1602 -15466 -32367
21426 -32367 9895 30769 -189 48907 107690 25318 -5330 -22954 -6179 14753 -34750 -69028
21414 -69028 -16966 14750 74842 70128 77700 34628 24015 12410 -46953 -66181 -24041 -41755
21402 -41755 -77486 -93593 -90048 -91877 -113157 -87665 -60575 -28988 12621 75002 40913 -39003
21390 -39003 -68362 -48856 -72801 -88312 -120710 -99020 -36614 -8829 30512 -41349 -63736 -52135
21378 -52135 -112626 -85095 -29033 -28172 -3549 45543 112149 148684 75033 47184 29240 -9411
21366 -9411 -34344 29405 76866 29757 8780 -54206 -49812 -62971 -55832 -23368 -1585 -5225
21354 -5225 7791 39837 -7313 -44721 7438 -31979 -62153 -87665 -58164 12146 28684 62106
21342 62106 47312 31719 64203 16422 -30670 -82522 -86402 -92534 -63916 -45765 -87305 -87022
21330 -87022 -36309 -29105 -6194 1608 -2403 17476 -958 659 22845 11756 -7004 -2551 -36233
21317 -36233 -19531 -37379 -51066 -96003 -149052 -126742 -110898 -115837 -110222 -82617 -46942 11745
21305 11745 40193 16898 -27515 -96860 -163041 -115679 -83080 4442 51752 10172 -75992 -72254
21293 -72254 9997 15147 -2785 -18955 -43084 20652 56250 34913 24219 39061 11301 -69662
21281 -69662 -69775 -46690 -38878 -18874 -6573 -28555 -19531 27760 80351 112028 124828 56109
21269 56109 7919 -36871 -34232 -55232 -43981 4837 14062 11394 -56736 -64541 -66078 -70645 -75547
21256 -75547 -62903 -49618 -52557 -60474 -70611 -84787 -83283 -55768 -31638 17655 35303 28842
21244 28842 -23484 -83178 -114015 -96216 -95500 -99705 12591 82234 109264 85379 31504 -21836
21232 -21836 -20156 -58980 -92292 -59065 -85852 -100041 -52345 27961 45972 39971 59326 93799
21220 93799 34693 68748 1682 -48210 -36686 -35419 -36896 3699 5040 -45763 -57631 -74102
21208 -74102 -21941 -3871 -14335 21959 -14507 -29802 -15890 21662 35016 5059 14223 47515
21196 47515 31889 1022 12591 -39932 -34052 23244 71322 56629 -37774 -26080 -12178 37
21184 37 25649 23227 -29263 -67856 -17779 -11335 -34633 22813 32712 31175 5702 2620 -15580
21171 -15580 -16749 37490 102971 104383 108078 107181 86088 59938 4298 -38738 -50410 -73779 -80786
21158 -80786 -24292 7564 -25067 -67230 -97073 -79208 -33030 -19605 -24309 -37962 -74011 -30110
21146 -30110 -24173 -47305 -72796 -59415 -35291 -8255 -3018 7026 35580 -3621 12593 58337
21134 58337 34770 48778 40357 8287 17529 7989 32872 27180 26653 99754 126591 105956 23600
21121 23600 -43759 -44475 -37994 -21211 -24452 -22207 11437 8906 -77480 -133188 -130978 -96185 -125522
21108 -125522 -111397 -71761 -26102 15077 37152 102724 115585 49560 9199 -6702 -20508
21097 -20508 -33786 -57671 -58012 -51816 -39681 -55233 -37375 -12531 -27198 1403 -908 11441
21085 11441 5791 26172 22997 21706 38919 95731 119375 90482 39309 -29280 -36105 -35361 -29247
21072 -29247 48677 91867 91080 69234 64271 52720 50131 48140 61564 95408 81221 112402 99617
21059 99617 82706 12632 -43492 436 15291 23707 53052 80796 62481 38753 27854 87431
21047 87431 50664 -15481 -35008 15096 42481 83398 33629 12036 73461 55056 -16209 -12599
21035 -12599 -760 -7802 -27145 -9972 -47603 -64903 -77572 -111534 -50064 -9194 -39624 -41634
21023 -41634 20999 -15248 -88580 -49430 -31495 -46970 -46161 -6929 7028 -2004 -47118 -39275
21011 -39275 -27378 -33061 -62605 -39461 -15237 -60743 -39045 15506 -31043 -57498 -15635 320
20999 320 -7592 -44470 -55941 -45320 -23425 36314 55930 70665 50403 19489 26706 -4577
20987 -4577 -25166 -13918 27274 38402 -22391 -24799 -58491 -29260 47560 -2605 14791 56753
20975 56753 30515 34262 42250 18572 -6405 243 -17848 -69275 -28982 14059 -5324 37080
20963 37080 63813 37318 -15663 -49454 -45870 33628 63086 71470 49242 60053 81473 68723
20951 68723 50627 17603 56384 42673 42314 -2185 -52742 -56525 -34021 3727 -26217 -70568
20939 -70568 -25654 19159 41275 734 -47379 -42170 -32787 -37955 -18682 45664 44023 60939
20927 60939 97795 62668 -27761 -63637 -85308 -52906 22301 23897 -26439 -58769 -61397 -76457
20915 -76457 -55220 26748 70360 12717 -44843 -62571 6881 51579 38557 39144 52482 67447
20903 67447 79044 28248 -9929 49200 113306 102817 61477 13441 12463 6788 64250 104396
20891 104396 65383 45931 64785 93728 58438 4933 -35697 -24245 -26365 -9423 748 -12364
20879 -12364 9585 64145 62020 60419 64151 92030 34163 8537 53928 12699 -37250 -61454
20867 -61454 -52961 -25435 -39599 -37906 -7821 37947 36064 -16702 -79761 -80601 -101196 -62520 -37529
20854 -37529 -102056 -118783 -83666 -69847 -25156 -36532 -30664 -108871 -115322 7177 88451 79807
20842 79807 130688 120247 40830 67303 57690 48969 61079 21040 35679 38514 35701 480
20830 480 12271 32191 23052 41494 -8833 -95791 -110133 -39475 23604 62703 47577 55754
20818 55754 29100 1900 1665 24949 32609 -13060 -1773 28973 13059 -31849 -106758 -148927
20806 -148927 -111209 -87760 -33331 7339 19662 -46540 -26509 -54804 -119441 -141606 -120310
20795 -120310 -89000 -75960 -14118 -29222 -32007 -2424 -9485 7723 16891 -11203 -48466 -117951
20783 -117951 -90393 -92235 -98230 -41903 -33024 4835 44482 62569 24138 3890 -53384 -11669
20771 -11669 38174 71425 28426 21761 -3262 912 -3843 -1851 -38465 -1083 35623 11756
20759 11756 27092 3389 -30221 -23734 -38156 -63977 -99916 -39284 -1862 -4605 -49143 -80426
20747 -80426 -83717 -55153 -35459 4345 -14318 -54967 -27566 4281 21873 36026 36018 27473 62600
20734 62600 57002 25830 49378 3889 -73554 -88864 -94450 -83985 290 -14677 -11590 6902
20722 6902 -6971 16428 22324 8416 -780 -15599 18975 -27403 -5926 91421 90053 29739
20710 29739 3264 45 -55357 -113102 -108940 -103098 -79467 -42449 -27110 11629 45310 19095
20698 19095 -18140 -23849 -71210 -79483 -21275 7846 -36744 -67010 -85709 -70355 -87803 -112493
20686 -112493 -79786 10442 35062 -1546 -5351 6590 -11198 -2703 -4923 239 -66120 -52410
20674 -52410 -2649 36753 83067 15947 -4619 17723 -8287 -71719 -121671 -89947 -72174 -70024
20662 -70024 -56903 11506 52716 35549 -8712 -60260 -3708 -3986 64034 82984 37495 32525
20650 32525 80780 93235 79793 90839 38811 -26297 -42425 7758 2123 -25172 -43770 -21026
20638 -21026 -54914 -81419 -53368 16134 23326 20249 -22700 -39147 -78665 -62976 -41219 -57757
20626 -57757 -48624 2197 -5803 -8822 -16813 -39956 -40128 -18908 -46494 -65508 -2836 57009 56044
20613 56044 7802 3430 -41075 -14164 16234 -12940 -16448 4887 11185 -56543 -85072 -103398
20601 -103398 -50152 -37708 -11006 26373 -7640 -99298 -88488 -61877 -77945 -116469 -102795
20590 -102795 -89401 -91584 -105438 -57636 -26899 -14396 9982 -30018 -39923 -23483 -3534 -36197
20578 -36197 -97739 -71585 -50748 -30281 -47436 -60267 -4390 39690 -11466 -18415 -2143 -3661
20566 -3661 -64684 -45902 -1909 -7251 -86586 -116221 -116703 -139629 -102976 -89316 -30704 15101
20554 15101 41698 -9807 -70015 -97464 -59606 -31021 -29066 32734 2289 -24481 -5477 -75539
20542 -75539 -102931 -45569 -8756 -6279 24250 49166 35878 19513 13290 4467 23114 10980
20530 10980 13332 -42524 -74179 -94816 -41039 24161 -43093 -55189 -4365 48949 78222 42724
20518 42724 63173 61311 12509 -36210 368 64819 50504 18219 -14251 -150 49914 70257
20506 70257 79978 72961 64211 6176 2169 -5501 -21923 30791 66821 62032 38301 27145 2323
20493 2323 10477 27587 -13154 -54035 -66408 -21184 -27956 -10348 13127 41854 60089 55994
20481 55994 9588 -14462 -17508 14591 332 -28424 -4441 40689 66052 20672 31846 26964
20469 26964 21582 6127 -1988 -4592 22890 -16601 -44376 -19613 621 -14066 -1117 -20531
20457 -20531 -50752 -76557 -108241 -67321 -9372 35784 73329 60642 67549 77817 48362 14279
20445 14279 1530 14770 78336 62771 36218 78208 44570 58512 48808 1888 26972 34468
20433 34468 23922 4549 41748 77808 39032 -10777 -44585 -36762 -5615 -963 -61830 -61644
20421 -61644 -47075 -54014 -16290 -47238 -40452 -15279 -25152 10170 -29843 -47943 26556 32365
20409 32365 37416 9868 48213 49418 15936 28349 -9618 -79229 -112717 -67388 18374 22386
20397 22386 -20255 5127 1441 -2763 6996 12491 4689 9524 -909 -25360 -7771 -20774 4207
20384 4207 -982 9636 16215 15154 -5486 -19217 2771 19703 -18456 -2633 10460 798 33467
20371 33467 45946 71926 80328 33997 -9117 24748 4594 -34586 -70020 -66664 -80831 -69470
20359 -69470 -10698 44164 75130 41613 -5609 3925 39758 34512 -17071 -17139 -29383 5868 71518
20346 71518 2021 -34039 -62345 -47199 -39432 43671 116013 107659 24545 -38319 -35582 3560
20334 3560 40298 19926 -40576 -42053 27903 33608 -1997 -67990 -22114 34651 -8914 -18698
20322 -18698 43680 63498 87567 105739 64798 52629 85138 102436 103886 65288 36153 52594
20310 52594 71152 51673 42715 40455 -24221 -78051 -56988 9723 29110 31071 35324 -34516
20298 -34516 -69135 -91589 -50635 -29841 -11037 60453 71547 41142 -4773 -1355 32644 -13560
20286 -13560 -116052 -114204 -26024 40836 4591 19099 30284 8927 -31263 -68640 -64015 -52005
20274 -52005 -65637 -52418 3949 41030 -15616 -50635 -71771 -68078 -11475 10169 5663 -948
20262 -948 -7464 46672 68827 85627 144427 188931 173013 134560 106885 93376 49709 -2028
20250 -2028 26194 -24490 -68024 -14669 -6200 1064 31121 91535 105650 108707 60575 100623
20238 100623 81989 29373 -8250 4632 79573 108773 67128 33303 -32954 -111423 -128237
20227 -128237 -53616 2363 19478 44584 19963 -195 -24264 13471 34491 29987 43556 18754
20215 18754 24400 10756 -10571 -6818 -20832 -29090 -50593 -45348 -24001 -43520 -50308 -5246 39379
20202 39379 13754 81983 135454 132029 31575 -30351 -12856 -12913 -14849 -53883 -26506 -6203
20190 -6203 25490 38688 63551 34317 -27090 -9918 -15592 25574 5643 -16330 22114 74256
20178 74256 93241 84495 11025 12421 57058 -4016 -32755 -15366 -6223 -10885 -33212 -23459 -40893
20165 -40893 30791 71909 34568 19764 31753 18279 53389 48272 19001 8665 21218 16196
20153 16196 2664 -22240 -45720 -23586 14652 -19146 -41189 -83072 -45146 4756 19427 59652
20141 59652 89388 68313 -18635 -31234 -20011 -25385 -31322 -4547 -11314 -2400 55983 117270
20129 117270 131368 115221 95590 46301 22477 89041 124469 100787 49175 -21908 -49821
20118 -49821 -31370 24671 75345 39798 33189 29702 -30472 -71133 -114434 -81772 -63893 -18876
20106 -18876 29448 57992 72634 69525 81081 80863 94542 153898 78846 -1955 -18134 47241
20094 47241 16027 25561 -15302 -26248 -25604 21821 41645 -16797 -26726 -20421 -20224 26836 11983
20081 11983 -9828 -25140 -36084 -66166 -53864 -32485 9742 33975 63110 54095 86533 112590
20069 112590 79494 19820 5632 16991 73076 56577 21411 34001 77142 33757 49856
20058 49856 35054 35750 23860 19061 29752 80199 56788 23424 -5757 12864 95446 137397
20046 137397 86022 76394 60234 56779 76338 48946 -40812 -111344 -94034 -32816 -20916 3161
20034 3161 29875 32851 58519 16108 -2716 10291 35342 60484 42593 10565 7854 26599
20022 26599 7499 -57236 -36583 -23650 -18212 -19190 12573 74683 97811 101296 34027 6501
20010 6501 5682 46841 -28395 -18516 26758 16865 58060 19117 35245 39606 67213 105850 100836
19997 100836 52880 -1000 20132 -13262 -23830 10237 29807 -27544 -28818 26509 28636 -5508
19985 -5508 -69 6462 -48810 -55792 -74823 -58957 -19395 -4343 -55126 -94203 -63653 -25391
19973 -25391 -55997 -29077 -52464 -29248 28005 51537 13650 -15112 -28928 -58110 -30220 34218
19961 34218 -26105 -58073 -44301 -12863 22046 59019 32095 -32528 -5555 22007 -4432 11733
19949 11733 17569 11231 -6049 -13232 -20449 -512 -21065 -37512 -9115 -5350 -13247 -2582 15419
19936 15419 26753 5135 -14478 -62018 -74208 8580 47810 31776 5079 -21371 -11799 -30252
19924 -30252 -50440 12698 8114 -7412 -17114 -64355 -98763 -50448 -104136 -85329 -19500 -58559
19912 -58559 -114058 -74382 -57463 -46082 11854 76926 102006 34088 -25282 -14822 26739 46424
19900 46424 10998 3239 30585 66336 56200 87142 31967 -47462 -49294 -4832 20320 21146
19888 21146 20468 -37883 -84006 -91712 -54616 -62477 -86122 -108954 -95632 -55267 -5234 -12991 31122
19875 31122 12240 22514 5364 -43873 -15062 -709 2701 -922 36591 3216 -68387 -69144
19863 -69144 7363 67887 107135 105121 15875 23517 81676 56033 62299 81651 59868 34452
19851 34452 13736 22055 29517 35792 61500 18990 -15326 -31254 -11041 43591 5889 -35458
19839 -35458 -77344 -106453 -107010 -91590 -93597 -70831 8922 11873 -4734 -25397 -13934 24610
19827 24610 21381 -69099 -119577 -102950 -42653 -28718 -14935 16108 55314 75242 43462 -9097
19815 -9097 -41542 -107873 -112567 -36546 23399 53421 33369 26422 18444 6106 -26976 9126
19803 9126 76156 53412 41443 75017 57641 64497 68351 21410 -6933 2736 44358 55560
19791 55560 60928 44179 31787 50664 39648 54205 24632 13262 14658 1982 8629 -40591
19779 -40591 -73716 -37090 11901 45144 35762 14597 2683 9430 13509 14691 3092 90057
19767 90057 92910 62275 75523 44987 56620 77499 10322 -15039 13139 639 -30624 -74380
19755 -74380 -106756 -96851 -64702 -86890 -92678 -63255 -85936 -16589 -16894 -42003 8244 47305
19743 47305 77696 91203 85880 44730 6258 -56611 -23131 42230 98345 123312 77675 23158
19731 23158 25988 52441 11677 -22754 -22879 23655 45674 47414 -7947 -9192 -8863 -51672 -105352
19718 -105352 -93082 -42318 -7813 40193 66150 74757 93160 79879 80197 100662 131539 137402
19706 137402 62493 33928 47058 39011 71654 82132 115062 98784 3786 3207 -484 -42708
19694 -42708 21152 92580 96164 45756 30895 37908 31390 14320 -20242 -41861 -19362 12049
19682 12049 16909 24986 38785 37898 40365 5634 34633 18713 12151 6782 24743 93573 88870
19669 88870 8391 -37530 -59886 -29039 -7844 22827 79403 79937 26319 4685 28186 45068
19657 45068 96998 58759 27611 50349 100636 103042 65188 70125 40024 47629 -22418 -18910
19645 -18910 29588 31058 22464 16512 59988 32771 -107596 -124668 -85760 -86832 -73736 -63126
19633 -63126 -46688 -21946 -24001 -26145 2778 61642 93911 86251 80746 72149 66478 24589 4170
19620 4170 18347 15516 30029 -8854 -5667 81635 114012 161971 118849 107878 106229 115884 90585
19607 90585 47277 90764 97771 11379 -16894 -24809 -31514 -2505 -6844 -21652 -12178 -26399 -24024
19594 -24024 2587 5371 16192 13160 23790 61795 64230 31488 80097 122284 94372 60880
19582 60880 94562 98140 93225 119380 81261 75377 76105 25827 -11464 3773 13049 -6499 -4712
19569 -4712 -4569 27475 -5712 -26571 -11973 6663 -3132 -45383 -63908 -28254 -44711 -63505
19557 -63505 -64291 -77010 -53206 -20137 19516 48334 74197 83590 55935 26747 29082 54631
19545 54631 45020 68560 69887 -28642 -42947 -46365 -38018 -3818 13767 -64804 -92213 -22003
19533 -22003 14303 71953 93471 53621 58290 58009 29257 44979 60741 67342 43448 -10274
19521 -10274 10879 34343 19810 28398 48322 4089 -21681 -11618 -19064 -40146 -82608 -134077
19509 -134077 -129664 -61946 -4227 30481 -3867 -28010 1807 22761 1613 -15398 -2965 -15923
19497 -15923 -6839 18980 33345 19383 24101 73455 33358 -16366 -2699 -7187 70407 44443
19485 44443 53288 648 7420 41337 49863 30402 43002 58350 95657 77527 57154 62586
19473 62586 59471 -6175 42462 61231 88359 115269 70542 -17522 -7583 78497 61390 22280
19461 22280 52838 62842 35123 16146 17225 9147 66851 55882 43288 60587 93234 99409
19449 99409 113867 76687 14715 52319 51450 43703 20335 -9395 -11846 38031 74183 29379
19437 29379 -27911 -42122 15594 54631 62842 34704 39958 4126 -5523 11712 32388 50563
19425 50563 73959 78697 52996 87011 80197 7310 8193 13894 5808 7947 15798 -5073 -38032
19412 -38032 -48376 -12762 43871 46399 113919 107739 21497 56802 58327 14947 16569 17215 -23952
19399 -23952 -40359 -29986 -31378 -9807 11823 37335 4504 -22293 -31128 -42234 -12267 42349
19387 42349 57727 7275 -55032 -67844 -51027 8071 64186 148535 208975 152255 67604 55977
19375 55977 47494 38813 -26477 -87212 -94731 -41904 -12675 -2148 29039 106159 108954 89075
19363 89075 79643 61416 50681 11926 38708 18266 26468 29614 58862 50777 16438 41437
19351 41437 104832 142203 120759 124776 115530 139661 119514 124824 60561 -44916 -11976 -3348
19339 -3348 23733 24218 44338 -8717 -17223 -9574 -1560 -651 9688 -2444 18587 18810 -18838 -52415
19325 -52415 -33750 31227 48895 12840 -22285 13930 2348 -3345 54722 79354 46788 50224
19313 50224 40832 57089 50847 30929 -24265 -65941 -27535 38337 5302 -30742 -39939 34159
19301 34159 83071 77500 68394 51655 -47386 -75972 -44236 -34555 -16251 -14139 -22918 4171 -9940
19288 -9940 -11540 -35120 2830 21779 33736 22411 -11851 236 -6413 -15308 -17846 -90962 -80939
19275 -80939 -48054 14701 27303 42367 21678 25458 82233 151944 143967 49212 33347 39015
19263 39015 7052 -76438 -51404 -28162 -2887 -7345 65771 132812 158731 113183 90036 86753
19251 86753 65570 84363 110488 47869 23865 69965 106872 65495 34143 59357 73049 131122
19239 131122 155021 134403 107828 99534 69384 44181 55510 35695 70780 177902 242676
19228 242676 233272 137546 111325 90257 5327 24979 68568 93439 56982 27838 21117 10657
19216 10657 20358 17711 12545 23833 54593 87179 50459 -2469 -89987 -96797 -112372 -78079
19204 -78079 -234 -55501 -63411 -53146 -41354 -30088 -64970 -69544 -40688 1155 -15511 -81339
19192 -81339 -43021 7081 33746 5304 -38563 -26186 36503 35293 29108 50536 69245 91354
19180 91354 158704 119528 52805 50126 47004 57010 78732 98263 103744 129696 81140 55494
19168 55494 64781 10399 35270 57398 14366 3140 30100 7368 17486 47772 87330 50470
19156 50470 23667 -7397 -26673 30559 20296 34674 -3906 -60773 -50392 -8271 15174 41652
19144 41652 63358 147261 107258 45792 20846 12774 28001 19476 2348 44729 95781 117871
19132 117871 109529 124573 141137 96240 23319 -1041 31584 14653 3004 -6024 -18177 37984
19120 37984 101919 103780 83444 43157 31798 35787 30108 -11136 -15731 -24130 -55283 -80989 -51103
19107 -51103 76796 74294 59345 83458 81955 68279 -13215 -64464 -58778 -20969 49277 42061
19095 42061 -30140 11198 10951 30413 61216 77669 108819 133649 157994 158657 154775 146759 116526
19082 116526 119097 128431 102376 66768 98289 115886 98554 84508 44711 -11111 -5138 -8789
19070 -8789 447 35731 16966 17873 16023 11380 3621 30199 -4340 -34047 15517 37854 20545
19057 20545 9547 -2446 9517 -14453 -43552 -35555 -965 15307 32482 43026 36676 12843
19045 12843 12739 59073 65152 50878 32449 -3163 852 -46935 -57347 5494 43143 -631
19033 -631 -7739 9315 -35386 -14152 9454 13212 29676 9986 -3303 -11861 -55509 -57357 10139
19020 10139 45941 45297 21492 -19016 -44036 -20128 64372 98063 112252 90509 90565 152219 195336
19007 195336 150212 125430 107702 83371 68635 114846 111045 99492 117537 65003 21012 31206
18995 31206 37430 42808 105760 153874 130606 118877 151058 134026 90122 80345 25892 -8727
18983 -8727 15785 81307 104992 89933 35803 33668 -23961 -17754 -27609 13834 103254 69812
18971 69812 39187 13189 -14429 -45825 10859 39276 -5576 -28034 12963 81802 49990 5803
18959 5803 64141 58975 59203 30768 13688 -7771 84340 134551 83178 109974 130041 118197
18947 118197 111999 129989 97353 69280 55658 95627 126538 130778 130054 124440 87237 50196
18935 50196 29015 42669 54164 106111 161202 117887 92682 71649 90035 125653 88380 85238
18923 85238 62175 88659 129403 74054 35452 5414 25478 32833 46162 87001 55501 50027
18911 50027 72547 64058 49408 75037 58301 71228 86146 70884 62155 38537 55890 60429
18899 60429 63568 45630 35362 46305 100578 103297 67018 46810 75913 96817 118637 120139
18887 120139 81649 105694 96540 30170 386 7228 37638 64098 53816 15518 19851 28363
18875 28363 52125 77447 100182 67602 42528 48349 105250 134623 48421 44217 67706 27745
18863 27745 26478 66603 131046 178346 160722 128089 110522 82908 89205 64478 38765 -12090
18851 -12090 -41840 -32432 -66548 -41410 16628 -15745 11886 28273 70385 135573 111899 116379
18839 116379 103474 101759 43790 25088 534 45114 57648 75185 46777 59175 57640 42695
18827 42695 110930 162475 121524 80716 97255 122960 97164 72229 31421 64674 98637 104214
18815 104214 116350 132708 151064 122939 36323 1485 36894 55746 72954 70658 24798 94695
18803 94695 124881 140084 133495 98346 119400 155099 183208 238575 338694 319841 284286 201664
18791 201664 98140 122045 178059 188364 151729 155404 245236 307937 329458 328916 321184 340060
18779 340060 326004 364397 385090 398140 368424 308545 305372 286983 218259 209111 259165 400648
18767 400648 660067 916221 882051 672363 513780 452944 406889 386049 394615 344381 281407
18756 281407 224475 179883 202128 190679 181510 188786 199078 229234 281568 337851 332093 327997
18744 327997 402255 468258 481570 447599 419168 438816 457417 483267 477234 446183 420718 483660
18732 483660 585111 636755 642609 559953 470357 440431 456232 410607 425825 406112 361602
18721 361602 334342 399607 434650 387794 376342 427295 418317 375507 346974 345033 315618 315062
18709 315062 347417 399913 455902 465062 465748 522775 535424 491273 581380 660345 636204 648567
18697 648567 673403 697034 643490 527873 511146 592846 592880 589026 664101 643113 556792 530278
18685 530278 542303 526229 461956 415512 416466 444889 404617 325111 315545 312674 274205 295534
18673 295534 349575 432741 512593 490615 502487 549014 551822 531407 585415 620410 646589 571753
18661 571753 550806 539954 500245 422689 373236 398749 411854 417302 464433 516836 657620
18650 657620 714190 686321 636658 587494 506807 467080 429706 406783 427074 381985 321818
18639 321818 323052 358439 347830 324211 342572 335273 282269 241877 216639 227511 291620 288142
18627 288142 268612 286105 338886 325317 298697 271526 235075 178853 199301 230927 261362
18616 261362 271222 301522 299044 278996 284469 302890 303510 289937 274836 322870 282721 303913
18604 303913 321717 277241 223625 239026 220003 179176 194984 182214 112155 84122 54264
18593 54264 68916 168736 215321 214458 214188 181149 190348 207424 189772 161718 179980 184066 150314
18580 150314 146060 145701 142354 143515 127154 154227 186053 179008 251702 300526 298413 276728 245403
18567 245403 284059 260195 232782 218587 178371 162973 153991 193554 220268 200845 177209 137651
18555 137651 171570 124163 125600 144937 162749 199726 190384 169109 139114 163183 116760 145001
18543 145001 163210 157168 183017 151213 158060 195333 182641 134407 131458 177608 239222 251197
18531 251197 262892 337505 336688 302765 328764 303355 257375 250880 195342 194961 230045 250347
18519 250347 223965 253275 237116 185944 185891 202098 183437 243329 277801 260386 216858 208903
18507 208903 197722 216934 214780 231863 214104 183189 146363 124128 178045 237693 281238 291439
18495 291439 302691 300244 302385 349036 353659 294985 278712 222807 220115 254639 262735 252179
18483 252179 199274 248428 299519 288133 279805 299544 292822 305154 374450 393335 298324 264061
18471 264061 294141 325311 382796 389753 360224 318562 288143 338574 382537 346890 350828 433610
18459 433610 439926 391500 388302 432966 417717 393312 428908 451368 480228 418746 408924 459286
18447 459286 459384 405740 385059 373289 455364 460920 396735 365608 390937 441051 451270 433706
18435 433706 431405 408340 372017 395052 439434 458264 431814 401951 380409 339485 350809 399097
18423 399097 413654 407892 436555 456808 442820 402021 430256 432926 423097 464170 480243 506022
18411 506022 493196 476725 427625 447644 444538 451070 425170 459658 452195 474379 510210 535201
18399 535201 565427 505106 493564 531442 484119 497928 544135 529046 541880 517879 533129
18388 533129 530913 530966 491181 498759 531129 539283 524007 546372 566771 597589 619914 587534 560606
18375 560606 559312 526336 542314 532325 508876 507479 539228 593409 672824 699256 680019 687287
18363 687287 632358 680064 704601 718317 693880 689712 727872 727440 714127 712725 744550 730821
18351 730821 713027 685153 653536 720810 792131 774982 716392 750866 762086 837936 846438 875068
18339 875068 903178 910120 954335 981219 967991 1033362 1041704 1105424 1141826 1086627 1061599 1109389
18327 1109389 1193410 1210329 1276063 1345877 1417134 1480490 1529176 1703463 1944171 2081012 2087434
18316 2087434 1992514 1871079 1803999 1819551 1889148 1959378 2114159 2500893 3109296 4079800
18306 4079800 5609740 7327415 8011312 7366050 6414493 5848120 5875613 6521353 7567753
18297 7567753 8064826 7746083 7475888 8003616 9379327 11163049 13133971 14910594 15436409
18288 15436409 14192954 12092028 10168818 9057601 8759294 9249401 10010464 10343086 10307123
18279 10307123 10313892 10027049 9054265 7754997 6632809 5858818 5315895 5043633 4931093
18270 4931093 4991486 5152913 5566194 5991694 6389052 6934997 7844626 9572767 12195320
18261 12195320 14207850 13997209 12701806 12025621 12420987 14293452 17850037 22470274
18253 22470274 26749090 29250002 29308163 28564546 27976755 27141509 26772700 27991933 30977382
18244 30977382 34821449 38312995 41212635 43148613 44352265 46387775 48748023 49927976
18236 49927976 49513828 48490737 46852117 44682120 43964979 45454901 46621359 44088899
18228 44088899 37966430 31165536 25717506 21975731 19706752 18655400 18466104 18788868
18220 18788868 19510414 20584184 22232640 24768543 28522939 33888891 41406075 52513550
18212 52513550 70297309 98012799 132994413 165412967 191108005 209994508 222914043
18205 222914043 225844123 208974179 180897135 158573685 146754593 143736753 147888318
18198 147888318 158927640 176765171 199875316 224483231 244933570 258651625 266861621
18191 266861621 268592534 262061721 250624515 234534057 209108758 177466424 146698478
18184 146698478 119183048 95268686 75806787 60791706 49580880 41560471 36061636
18177 36061636 32317065 29949462 28982456 29638545 31911349 35012033 38451816 43362176
18169 43362176 48962989 51954621 52696096 53916466 54219551 50890192 46015825 42655892
18161 42655892 40640014 37955533 34747326 32697825 31475743 30503763 30574817 32146940
18153 32146940 33476985 33655788 34225733 36084781 37771726 38114856 38852129 40946697 43221147
18144 43221147 44196701 43348696 40887652 37305765 33185138 28998200 25479445 22801882
18136 22801882 20243053 17520764 15179365 13045735 10925965 9193077 7993836 7140570
18128 7140570 6541556 6284489 6253816 6469071 6780496 7120844 7645427 8153034 8274949 8384979
18118 8384979 8723416 9291213 10165242 11608986 13975720 17738155 23386522 32144935 47594268
18109 47594268 79453495 131252720 152308741 118284358 80491438 56434486 40230780
18102 40230780 29399025 22177470 17094076 13502693 10941687 9152546 8008517 7467480
18094 7467480 7306394 7340888 7367999 7016868 6293138 5377562 4474064 3744591 3186888 2824901
18084 2824901 2615041 2427819 2218729 2040852 1955486 1873173 1723205 1594392 1506373 1472782
18074 1472782 1465190 1463176 1423684 1350324 1281086 1278243 1248087 1181370 1184620 1154113 1067066 984404
18062 984404 887201 808801 721147 660694 663927 670292 653556 625683 598837 518852 481450 420307
18050 420307 386135 326789 312181 322157 357872 377370 294856 285912 376934 383671 312639 284760
18038 284760 241987 234435 212307 143973 105832 153928 181733 169311 156610 193451 183765 170323
18026 170323 182990 161703 132287 185389 126817 19902 69541 91962 53375 17098 42835
18015 42835 9955 -26133 -7083 10175 36817 36862 5646 -41610 -91395 -69416 -104101 -62675
18003 -62675 -27257 -39224 -51638 -38713 -9174 -3368 2697 -18163 -50701 -130850 -139243 -105893
17991 -105893 -99395 -58513 -48550 -75268 -45411 41180 85902 103737 33222 -34278 -26436 -28763
17979 -28763 -22272 22251 50897 57481 26638 871 -39093 -87827 -106785 -95316 -122312 -96042
17967 -96042 -117635 -115898 -66886 -34474 -56786 -57553 -82012 -106484 -114340 -182913 -203023 -184570
17955 -184570 -112960 -86736 -149362 -222964 -153411 -95328 -59872 -74561 -63898 -75351 -100850
17944 -100850 -163090 -180875 -100926 -60323 -45913 -20881 -12795 -80947 -156872 -157115 -70946 -62670
17932 -62670 -106124 -93298 -59451 -47175 -87039 -148966 -177844 -174567 -145657 -183969 -220136 -165507
17920 -165507 -126927 -60024 -90017 -129886 -162985 -190800 -123147 -79208 -133932 -192814 -186029 -233891
17908 -233891 -269589 -215994 -165885 -166126 -149955 -107418 -107502 -185014 -227688 -209670 -115779 -88973
17896 -88973 -95786 -81714 -51111 -52445 -95126 -140124 -128002 -66900 -51906 -116885 -131530 -74177
17884 -74177 -64082 -66667 -18930 2270 348 26093 11703 -77125 -95780 -54409 1289 480
17872 480 38436 44223 32367 -8665 -16081 -33595 -28528 39550 11052 -1654 25698 2171 -35630
17859 -35630 -67418 -127994 -130109 -92073 -73151 -51791 -34149 -111773 -137363 -94346 -48512 -41402
17847 -41402 -10207 -13992 -31281 -13088 26377 -13451 -58986 -56422 -68074 -48307 -12367 -67726
17835 -67726 -91487 -78751 -129323 -151120 -182596 -173804 -146836 -119167 -116680 -103305 -48148 -3314
17823 -3314 -5583 -10339 -27916 -82343 -79898 -152434 -156037 -113886 -86551 -148705 -96038 -37036 -64141
17810 -64141 -80828 -70035 -60198 -50408 -88708 -70045 -99959 -106568 -135693 -92409 -27412 974
17798 974 -34667 -4842 48600 35820 -6010 -49966 -43548 -96308 -154042 -162109 -133025 -58434
17786 -58434 -46321 -30068 44646 87137 135711 125060 161289 129231 23979 4859 13080 68374
17774 68374 144719 176785 213884 267705 256996 221714 199130 126920 83847 57018 52701 14299
17762 14299 -820 -30589 -3420 12933 -5394 -56033 -106522 -160679 -139943 -116375 -76507 -12787
17750 -12787 -43817 -36864 -1906 23890 -6247 -2485 19997 26505 118491 222073 220379 174932
17738 174932 160348 174870 183593 216201 201136 217978 151710 108442 109685 129852 113188 139204
17726 139204 81853 86355 89897 100859 152297 202932 243375 223145 236131 257930 252586 308365
17714 308365 289314 242793 314730 338099 324409 377811 424258 442724 463697 423237 422950 431229
17702 431229 477283 515094 503881 467140 468132 544255 552078 477236 454780 419003 416094 426270
17690 426270 453256 465125 432169 376556 340823 308049 295351 315430 304965 206544 117095
17679 117095 80200 123939 94454 100579 92142 125402 212113 245748 272312 253905 287950 330321
17667 330321 278334 275389 337871 351020 418098 378222 370796 382167 409253 408968 438955 467636
17655 467636 479029 438092 441670 481041 489235 507425 493485 467822 420480 358577 342267 338850
17643 338850 283163 222611 189957 178419 154898 165895 195923 213409 173023 140817 81465
17632 81465 40352 83142 67526 51765 54022 -10127 -8061 18046 45442 2905 -60992 -43538
17620 -43538 -5659 14392 -22044 -37630 -56405 -58869 -76746 -75426 -63828 -79841 -53730 -11156
17608 -11156 9522 3459 10250 30143 4676 -36053 11542 40496 -25521 -70867 -57451 -45281
17596 -45281 -67994 -67159 -46296 6008 647 13923 -22570 -47293 -102577 -93564 -72478 -76323 -46427
17583 -46427 -82523 -96150 -76820 -72341 -95730 -142768 -157003 -117165 -90439 -62102 -60914 -57120
17571 -57120 -65924 -71249 -92852 -40809 -30620 -38371 -37846 -46070 -37720 -67708 -74940 -69386 -55837
17558 -55837 -12206 -6047 -42923 -102157 -97758 -44289 -19149 -36409 -18257 60350 73596 12107
17546 12107 -26168 -72280 -130282 -134096 -61640 -43926 -82363 -130046 -75736 -17059 21661 -6404
17534 -6404 26858 13028 -24563 -88960 -83096 -67121 -25443 -35706 -26306 -46183 -23806 34649
17522 34649 111939 147107 94999 44598 49025 23658 50758 75595 71201 -26362 -64475 -73357
17510 -73357 -103245 -136744 -157606 -86578 -46824 6998 28503 11410 -6159 -54954 -64205 -27961
17498 -27961 -70336 -114974 -75455 -117292 -118461 -67417 -81519 -71980 -40981 -47798 -46886 -38656 -1445
17485 -1445 -18733 -11217 -37605 -8565 11406 -17361 -28428 -56306 -74267 -52387 -35881 -42359
17473 -42359 -55851 -11839 -45845 -77796 -65511 -63338 -31530 -71823 -80983 -94296 -101610 -58043
17461 -58043 -22454 18703 33570 7226 15762 38925 57790 55052 43498 1658 -6233 -54739
17449 -54739 -93622 -35880 40490 100039 123391 187991 334252 576516 840453 770363 534602
17438 534602 388486 232054 146124 104206 -30255 -108342 -116496 -77280 -58031 -37038 -23739
17427 -23739 -72828 -134393 -80104 -14631 -26965 -47924 -43367 -12100 -6180 4321 1481 -8721
17415 -8721 -48577 -46354 -48064 -62928 -75573 -85135 -106194 -61245 -43718 -91689 -108189 -65543
17403 -65543 -24516 -24461 -779 -3219 -18165 -131 -14413 -21467 -42763 -110228 -80007 -62093 6443
17390 6443 7828 47105 34732 24764 -20099 -43750 10178 -7253 -41100 -15392 -41631 -85384
17378 -85384 -105924 -82971 -25947 -9353 -59742 -77733 -50698 22825 31388 -4236 -21308 -36376
17366 -36376 -63673 -23392 17379 31421 -42760 -66519 -86573 -101681 -124928 -88998 -5265 6887
17354 6887 -13271 18521 34638 16217 -3895 42308 10788 -63244 -71857 -100765 -128290 -156031
17342 -156031 -130636 -64367 -10717 -11323 7508 18299 23436 -12966 -55920 -136 17688 -11759
17330 -11759 -66373 -36281 -42323 -4788 16588 -12861 -9706 -7325 -40572 -29163 -30244 -18113
17318 -18113 -30115 -38261 -56488 -93133 -112920 -114412 -109034 -103367 -75291 -101055 -91142 -85773 -83835
17305 -83835 -106248 -54014 3294 -19580 -54762 -47141 -50025 -40731 -107192 -158939 -136144 -78776
17293 -78776 -59517 -54065 -68900 -60229 -85064 -44906 3298 -53935 -104931 -123542 -105095 -8385
17281 -8385 47528 48307 37120 -27690 -93276 -125246 -120411 -42733 11237 39586 37758 11998 -42595
17268 -42595 -72942 -69414 -67610 -49085 -62743 -43790 -60260 -73877 -84406 -47758 -56733 -66914
17256 -66914 -69735 -11891 -23115 -19293 35749 99516 114723 89201 38588 -6002 -28322 -37027
17244 -37027 22801 45404 35255 -3384 -33987 -25511 -29675 -70639 -45778 -14452 35035 60390
17232 60390 2926 -76289 -100265 -168996 -144408 -84828 -1620 40003 77964 18521 -3224 -71932
17220 -71932 -65317 -41229 -32637 16886 7750 -18098 4111 13883 -22845 -63042 -108515 -85106
17208 -85106 -67957 -111305 -128443 -91656 -86204 -86349 -43995 -78856 -118517 -96011 -36310 -71155
17196 -71155 -43409 -45956 -68582 -17698 9149 20359 83310 76988 45820 18732 11621 37197
17184 37197 42915 -13543 -44370 -7748 9943 -13914 23598 88557 92332 53228 -3251 -56272
17172 -56272 -69371 3841 22225 -10556 5092 -39357 -62392 -73277 -58889 1273 -19960 -6110
17160 -6110 34944 -35163 -44225 38046 26567 16470 -6757 -28724 -62496 -6709 36221 18799
17148 18799 -52713 -65411 -2006 49363 83525 57785 32518 -2854 -12603 41725 128866 133188
17136 133188 97865 90528 66680 41952 69299 96291 60117 33350 -17944 -41283 -50598 -25655
17124 -25655 19574 4270 -7314 14953 -45476 -112030 -104026 -67106 -69510 -17247 62260 17176
17112 17176 -43843 -60485 -22762 6485 40966 53087 -41820 -72460 -91495 -91101 -104377 -71383
17100 -71383 -68673 -28714 25891 48403 45128 80633 98301 123131 111854 112304 90923 106309
17088 106309 43014 -52887 -64771 -62746 -19078 3805 -4827 -2628 -69654 -86466 -85647 -112602
17076 -112602 -89482 -108033 -47729 -69697 -74335 -44339 -14619 -97396 -164438 -147283 -109850 -128971
17064 -128971 -130706 -51485 -26840 -34480 -54440 -60068 -83472 -87440 -72004 -84080 -58805 -33188
17052 -33188 38536 49750 56044 87760 90698 98514 93654 73958 28190 -8599 7720 9826 -15835
17039 -15835 -3168 -4654 -6268 17690 2297 -49620 -91472 -13474 -31754 14128 66389 22496
17027 22496 -16257 485 61656 52040 24482 15321 -10602 -39490 -119156 -112762 -56783 -60015
17015 -60015 -64468 -32596 3348 21648 16425 25605 -29843 -99732 -99748 -65618 -28624 -13370 -48564
17002 -48564 -66828 -97049 -136131 -167899 -182924 -146349 -40865 47262 95834 159282 183895
16991 183895 196886 121927 38623 -27617 -79380 -113625 -50027 -50486 -19473 51385 29560 30503
16979 30503 93554 144058 74258 -306 -34826 -35083 -56251 -66987 -120305 -93885 -89260 -61823
16967 -61823 -28245 -43925 -39440 -3327 -18482 19124 28192 29929 2606 -41278 -49830 10189
16955 10189 49199 -3666 -51097 -90470 -74453 -33777 17446 -2044 -3669 -21628 -18274 -12808
16943 -12808 -17985 -23856 -11508 56717 21225 1563 8303 -4386 -5114 -3755 -16322 10092 20232
16930 20232 -24948 -15886 -39818 -93196 -74655 -45399 -16466 661 15455 -3030 -12518 -27800
16918 -27800 -1552 -18020 -18895 -47013 -41219 -69462 -98888 -63020 -12582 -51110 -34835 -50219
16906 -50219 -62040 -50738 -46713 -42273 -78380 -18185 36166 -34561 -40584 -23305 -10600 -21134
16894 -21134 -65112 -61892 -46984 -19455 -11693 -54639 -4111 18031 33144 54838 153282 196213
16882 196213 275196 286047 130490 75674 65547 82698 86450 48388 53111 30102 4996 32281
16870 32281 12376 -48115 12571 -12343 -3340 24379 -9015 -75819 -108106 -99379 -119506 -151601
16858 -151601 -167969 -163366 -107205 -87865 -60137 -8146 -31138 -33110 -43122 -31148 -32790 -25088
16846 -25088 -37866 -67306 -100090 -71584 -53837 -53931 -9557 13576 -34188 -71177 -37572 -37274 -30269
16833 -30269 26968 -16433 -47 -28143 -11097 16833 20848 -17569 -48874 -59699 -59816 -67822
16821 -67822 -66605 -70565 -57178 -50799 -24978 -17251 26784 -4922 -89354 -84549 -16206 7413 15514
16808 15514 -20103 -57299 -64902 -92257 -30535 -22774 -1239 -7705 -5748 25058 -24788 -92605
16796 -92605 -112887 -53942 -34646 -1632 -8520 6549 -29054 -28738 -30274 9064 79791 59348
16784 59348 14203 4917 36073 62294 69440 56425 108644 143022 152668 112921 87714 51264
16772 51264 20233 -15353 -50603 -26523 -45316 -62112 -112776 -154418 -95168 -74341 -94171 -74203
16760 -74203 -1066 40773 106831 131120 180342 183830 133581 73501 51691 55520 61835 36731
16748 36731 -28471 -29516 24544 54571 -9185 18283 19423 -43111 -55581 -45108 -22684 -1335
16736 -1335 5951 -71738 -92682 -37573 -52264 -76503 -52333 -25332 -21242 3470 37631 -36810
16724 -36810 -92799 -39568 -7437 1286 -25291 -22550 39857 -6226 -98457 -74531 -46813 -49557
16712 -49557 -73321 -98833 -115428 -87500 -31022 -57970 -112288 -86414 -14499 53820 26983 14335
16700 14335 -17815 6481 -46783 -68970 -53425 -61909 -43495 -21688 -23583 31932 28963 15945
16688 15945 26660 27191 51827 18050 27607 -23116 -86723 -128675 -78620 -38646 -78509 -55623
16676 -55623 -45962 -45724 -38133 -63053 -69586 -88759 -38694 18309 44248 18207 52053 88517 64651
16663 64651 21084 13634 51059 20440 -20437 -4941 -25511 35209 40067 19251 -10553 -3364
16651 -3364 48002 47373 54330 110831 134668 101400 16236 -31404 -24361 -73410 -100561 -161051 -132422
16638 -132422 -104122 -89789 -72739 -93719 -76896 -83221 -70183 -37279 9928 75541 91884 48102
16626 48102 56957 28077 -14829 -34401 -7491 29987 39066 46468 29336 12905 27388 25434
16614 25434 -14996 -29081 -16893 -4187 34041 60602 117331 60822 12280 581 22666 -12027
16602 -12027 -36928 -18342 -17223 17070 58322 30257 23724 30246 52644 64949 69401 88734
16590 88734 109941 78190 89150 37961 34265 -35284 -56765 -41963 -69744 -114759 -151843 -167533
16578 -167533 -114113 -58971 -69730 -69936 -51471 -18291 -60207 -110832 -89419 -69779 -47559 -55360
16566 -55360 -88915 -114076 -91486 -97612 -112772 -93303 -94654 -90487 -55941 -41428 -128674 -75168
16554 -75168 3861 -41623 -120850 -145553 -99893 -91090 -95311 -73838 -131599 -129479 -102283 -56706
16542 -56706 -22806 8746 -9863 -21988 71234 54051 60767 63112 49168 36691 21281 10622
16530 10622 15605 47 -3913 812 -52410 -89094 -56892 -48891 -17046 10280 11116 -61861 -104262
16517 -104262 -109466 -18799 45633 15372 5836 -10104 8302 50370 87525 65778 56451 114124
16505 114124 85544 -16321 -120120 -138344 -102937 -39698 -18260 -35700 435 -35954 -17825
16494 -17825 -12200 22612 10154 -49561 -38503 -62240 -71692 -7723 33708 -12219 -56483 -96494
16482 -96494 -52456 -63729 -93622 -85383 -18620 11436 -11276 -47872 -15912 11244 -21337 21488
16470 21488 32266 51163 17742 14780 52588 -2340 -15729 75570 49467 51375 -5742 -55465
16458 -55465 -49953 -37274 9358 49589 66331 -23445 -17417 -83512 -89703 -95076 -23552 42623
16446 42623 -7002 -5701 31745 14074 28123 29079 1316 -195 20338 24621 19213 24218 21749
16433 21749 29885 66918 67940 28654 -19857 -12465 12528 21950 -17162 -36167 -3954 74992
16421 74992 95900 47285 -22746 -15733 10816 -19211 -67897 -24461 35313 84786 26931 -56705
16409 -56705 -27134 63349 93107 57705 86876 116853 101330 88341 100428 50606 43162 83390
16397 83390 56593 13717 63957 80231 24407 -56809 -68585 62114 99421 105260 78068 58359
16385 58359 37778 33109 68553 32962 2049 -37425 -72502 -57306 -67334 -53264 -43651 -67948
16373 -67948 -77305 -39126 -41771 -38926 -57545 -29898 -8368 -5448 48244 165396 247930 225701
16361 225701 159420 57400 35764 53778 58222 23258 -65812 -61831 -54588 -119888 -166173 -92415
16349 -92415 -35797 -40690 -67188 -65564 -18452 -51167 -94613 -94994 -81839 -66188 -32763 19489
16337 19489 -17904 -98891 -124541 -25243 54500 27553 46970 22693 22697 92258 90282 69036 76247
16324 76247 66125 3349 -10079 -76735 -128968 -72359 -18895 -30568 -8813 -3529 -16166 -11843
16312 -11843 -28210 -66481 -26287 -42010 -20558 23062 83915 200423 217510 166061 188819
16301 188819 172379 152629 169234 158494 181493 159520 91627 24710 -29091 -78872 -78667 -90192
16289 -90192 -67070 25307 16849 -22126 -33 -29092 -17744 -81737 -95033 -107437 -114314 -76580
16277 -76580 -109870 -101512 -46642 -40675 -11474 19334 9394 32104 17271 26547 94487 132386
16265 132386 69462 81819 110089 83332 26202 22554 22441 -11003 -19518 -47599 -40684 -116134
16253 -116134 -106901 -92329 -107512 -83240 -43966 30223 52989 46805 17440 8026 60969 67653
16241 67653 116483 117721 79855 19822 13503 2871 -44388 -9083 83 -32880 -68604 -43034
16229 -43034 -25892 -47429 1076 20057 46628 63505 49104 88784 51481 58672 32364 25386
16217 25386 30012 -10303 -57657 -24497 -3398 -5860 -29694 -25165 32774 36007 29130 69616 87797
16204 87797 55010 52398 -21059 -58920 -67097 -48080 29206 31013 -17621 19383 71640 77667
16192 77667 86617 74252 25463 39742 49066 7782 -43704 -70540 -43739 -88029 -50817 -6614
16180 -6614 31869 -514 -64887 -47922 6127 40603 26938 -16891 -35080 -22963 -22798 -44538
16168 -44538 -54393 -90694 -79729 -88072 -41118 -70080 -55034 -33098 765 42284 50642 -8267
16156 -8267 1491 37280 28338 1493 -44383 -2015 -8905 -13291 -28621 -76096 -72876 -66939 -52761
16143 -52761 -7299 8925 15902 37341 41168 31528 19136 -16497 8480 -15077 -81970 -107760
16131 -107760 -50700 -58329 -54784 -57408 -51851 -45805 -105639 -123247 -65125 -28726 -52581 6730
16119 6730 7636 -32816 6459 -37685 -81987 -10893 5130 27894 33950 -13185 -68026 -109718
16107 -109718 -88636 5673 48244 11300 -31177 -52864 -24614 89 13702 36114 55657
16096 55657 5202 -683 12185 -33221 -69430 -81556 -69132 -21303 22110 -4037 -20377 36150
16084 36150 40436 11084 4093 7890 -12526 -10056 -6611 11031 38722 68640 37227 16729 60492
16071 60492 8881 -12958 -7734 34582 553 -29635 -57968 -41684 -20887 -21830 -11227 -7661
16059 -7661 19068 -7428 12497 23874 -15042 16800 41125 32936 -12490 -56067 -88111 -179308
16047 -179308 -146845 -91249 -59232 -60787 -115588 -66870 -75027 -31625 18594 68536 105917 24576
16035 24576 4654 1902 58358 86181 2880 -27300 -35273 -57855 -41946 -46951 -52113 -7974
16023 -7974 7658 48668 68307 110748 61340 39729 59866 61018 58204 42217 50669 23995
16011 23995 -12214 30588 13493 -6723 -7138 10995 -33004 -32647 33301 53296 -8449 4222
15999 4222 85449 96429 20532 -9439 -39811 -65193 -108170 -136273 -113669 -36517 -42568 -36095
15987 -36095 -42416 -44601 48739 123440 92428 67483 47518 -5691 -8152 39067 86845 29094
15975 29094 11923 51364 83025 82527 98553 95995 62885 -2097 -30223 -7268 32656 21475
15963 21475 -6117 -12785 -78562 -113135 -140206 -150375 -142899 -70859 -26797 -35395 14295 84013
15951 84013 117277 147579 92950 86634 76432 62190 76668 70110 54867 26108 -6916 10035
15939 10035 -85654 -103470 -61408 -66704 -16166 24399 20302 -86196 -110647 -94798 -49327 76
15927 76 -47589 -141017 -141233 -121426 -107705 -65303 -46919 -23653 -58578 -26420 -25483 -52781 -68460
15914 -68460 -56809 -129540 -136329 -99121 -53986 -107938 -107065 -45721 -28666 4880 66986 -5655
15902 -5655 -15386 31205 45568 29572 15114 45398 63192 48898 42444 3749 38283 52142
15890 52142 -2801 -34791 -59182 -50421 -22343 30903 45425 72102 47124 -3467 5914 17153
15878 17153 41999 42287 69416 77174 -14065 -78295 -36963 -18258 -29145 -61836 -59142 -71545
15866 -71545 -51192 -48911 -61049 -23488 30440 23044 47738 92746 36979 -8194 -46087 4332
15854 4332 -1414 -75146 -65166 -6617 19487 -24346 -9058 -5346 -26072 10846 -16096 -47252
15842 -47252 -93415 -75180 5364 -38007 -65636 -57388 -14202 24852 171 -46869 -64861 -107696
15830 -107696 -62358 38797 54091 63930 126109 101311 23435 5871 -38198 -53769 -80439
15819 -80439 -53217 -8560 292 12403 3455 -7342 -26071 -22188 -44995 -56031 -52662 -70253
15807 -70253 -46305 -18498 -45898 -16236 35490 6020 -57745 -109934 -79817 -42193 -22129 -50733
15795 -50733 -65872 -39522 4692 18067 34261 1261 15816 -19330 2464 34764 -5767 -6075
15783 -6075 14152 47741 71742 54477 -4735 -16601 -18475 -8060 -18617 -20499 3196 2218 -28882
15770 -28882 57015 127569 119291 85398 60108 43838 -4052 -47456 -10289 -7753 31923 53963
15758 53963 11173 6290 7164 -714 -4445 45036 28652 59413 66442 56827 102812 121608 131407
15745 131407 125474 144607 95767 55414 9799 -7286 29443 22147 -48943 -77161 -38802 27172
15733 27172 40322 36018 42175 -10401 -51047 -46358 29797 80046 30242 29530 46383 66202 -13153
15720 -13153 -45893 -34236 -84148 -86523 -88713 -70088 -41024 -33886 -57084 -95842 -124867 -125122 -76241
15707 -76241 -17972 -20684 18866 -9856 -49090 -71753 -109641 -124004 -35809 8989 11670 -50182
15695 -50182 -20081 -13929 -104530 -62202 13968 954 18312 30281 -48507 -41518 -24908 -38307
15683 -38307 -40526 -66510 -48190 -24187 -2625 -36050 -42858 -59998 -107775 -119330 -87428 -34686
15671 -34686 6865 -38220 -45382 30091 81583 106256 95903 69949 840 -67590 -38708 25938
15659 25938 66182 18828 -8294 -12774 -2838 4470 -10521 -27915 -56997 -49068 -18669 32790
15647 32790 53216 65019 39106 5550 -18449 14526 49923 86836 81899 53956 53943 -11544
15635 -11544 -16755 -35448 -55715 -381 63646 62554 14707 -33217 -57856 -35796 -1582 -39031
15623 -39031 36781 58556 66491 43351 43119 29789 34322 37880 14882 -49435 -66940 -39141 -13702
15610 -13702 35958 27411 -18699 -6817 17656 26439 42490 4013 -87417 -121161 -98726 -99031
15598 -99031 -77202 -36179 -11015 -11987 -25561 -1265 -6788 -30514 -33458 -118702 -112247 -69865 -20502
15585 -20502 -57089 -22949 -3385 -4292 -10210 -61505 -78113 -45736 -27185 -23288 -48947 -131717
15573 -131717 -124681 -140156 -124564 -118625 -92972 -34737 -51254 -27714 -24822 -68615 -22769 -38250
15561 -38250 -63832 -101565 -100923 -33763 40602 82539 31885 41197 58402 27490 -10188 -62521
15549 -62521 -49084 -29229 -30318 -9988 8996 -12382 -28630 -28252 -27039 -41532 -83577 -56063
15537 -56063 -21011 28561 17998 25108 34286 11726 -47891 -122317 -90111 -48395 -39770 24460
15525 24460 51402 17300 -5197 -50946 -64617 7843 23724 -31677 -71053 -28417 -14247 -7604
15513 -7604 -7095 -36745 -9882 -45389 -21326 18937 27955 47891 44225 -5544 -32793 -85150 -82424
15500 -82424 -63388 -67263 -93232 -102672 -30394 45869 22533 -7375 15300 -11394 -33559 -70366
15488 -70366 -27080 13115 -32323 1971 -18532 -19719 -1429 38544 20506 43159 56871 3533
15476 3533 -25650 42970 76400 38788 12120 11158 3680 -7536 -11223 10248 49912 112717 107691
15463 107691 81492 7658 -1183 -52 -14944 21853 2798 -4739 -7590 -6934 -19132 -20165 -36903
15450 -36903 -4807 33211 66248 114384 22308 -53940 -20458 -29708 -52689 -54406 -47272 -25622
15438 -25622 5018 38388 32835 18541 3411 21308 11438 -8146 -11932 46915 64045 44463
15426 44463 35557 75970 106701 58304 35472 -29861 -33010 -56730 -64801 -53500 -6976 -15135
15414 -15135 3660 15760 -9150 -33939 -58900 -12544 1522 -13336 -6421 34821 -401 -14724
15402 -14724 2837 52161 53466 43574 43588 109837 115408 88694 20708 58283 75733 34704 33722
15389 33722 6944 -85414 -121865 -115145 -52191 16904 51905 17811 -35592 -98842 -133693 -110148
15377 -110148 -84672 -94267 -115799 -152454 -213418 -105952 -71100 -63575 -34481 -13839 608 -47772
15365 -47772 -997 44802 48614 58906 62225 84701 92254 100542 67930 70681 43409 1217 30831
15352 30831 35835 -21049 -84355 -110432 -65720 -41488 -95033 -160946 -167417 -141293 -68143 9751
15340 9751 -3677 -25956 7502 56368 109279 41141 4534 25419 46819 85033 148659 120421
15328 120421 70602 30140 -19214 -27057 24879 7038 -41671 -9765 6559 25399 -34288 -83790
15316 -83790 -178759 -185471 -106213 -43245 -89968 -53708 -31259 -47119 -28329 -23952 -2566 10434
15304 10434 43671 -18315 -63009 -9403 39928 35127 14770 -6167 -38469 -56826 -27453 5270
15292 5270 -9213 -41105 -46199 -29833 -62535 -87234 -76349 -14894 -37240 -81731 -123042 -88255
15280 -88255 -100152 -73863 -84599 -93012 -15885 33591 -25493 -42087 27945 102464 99243 95313
15268 95313 81660 4800 -42980 -57750 -14066 50914 20470 -7027 -30960 -26871 -28814 -23252
15256 -23252 -38307 -44335 -55285 -40758 -9408 29426 18002 -4291 -22295 -32863 -55524 -36055
15244 -36055 -24970 -31736 -54618 -44430 -57773 -37388 8634 37331 23922 53506 44746 51087
15232 51087 98443 69980 72468 54681 40492 70271 119177 89280 89129 47903 38896 31355 40646
15219 40646 52829 64703 34264 -2809 59042 93631 48568 12115 5448 -9260 -40353 -53959
15207 -53959 -71576 -38506 -57239 -34987 49859 110526 89808 72254 63942 44372 50415 -4773
15195 -4773 -37247 39344 52638 24840 24783 4847 20597 66300 72719 22817 15311 -12718 -30206
15182 -30206 -17904 -27804 1667 8261 13305 46612 -19449 23875 16052 29379 32498 1323 -33041
15169 -33041 -18519 -31597 -48086 -91844 -120680 -104256 -88275 -68576 -12295 -1425 -12134 -26207
15157 -26207 -28748 -28750 -18595 -2976 25569 54031 62888 10553 2501 -34991 -86983 -48523 -12
15144 -12 -44741 -29589 -1296 21341 47257 30677 10568 -12076 -13830 -13655 66450 58637 14150
15131 14150 28248 36673 47905 45502 1664 -49523 -67446 -70317 -59047 4148 11943 58877
15119 58877 132774 128466 27446 -257 53144 79447 46673 14690 40643 61526 66165 105159
15107 105159 84157 24422 2921 9466 -7824 -25193 -23700 16226 55788 75589 148631 149908
15095 149908 118376 129038 88488 82601 93170 109706 108651 107250 120913 80799 9296 711
15083 711 25287 604 38940 58100 9942 -29137 -32525 -66880 -121741 -127958 -139071 -122428
15071 -122428 -91041 -71702 -28057 -57573 -41456 -9854 -19843 -76418 -92140 -69423 -90685 -12714
15059 -12714 73372 53557 27752 -2993 -45742 -739 48070 22964 32405 32802 24160 26721 -1375
15046 -1375 -16509 -33961 -8121 37009 58294 125713 84495 33303 46601 65869 77968 103970
15034 103970 55875 1825 -19339 -49736 -68172 -73301 -90818 -85689 -33472 -8536 -24517 207
15022 207 13876 -13555 3201 22565 36168 29609 8249 13821 -17005 -62009 -126490 -86531
15010 -86531 -41757 -83883 -104307 -60127 -67394 -41745 -52875 -68122 -86194 -45588 -35374 -52520
14998 -52520 -7395 -52855 -80228 -67355 -46556 -49341 -30069 -3413 6639 -61603 -59341 -43307
14986 -43307 -7826 24919 -14057 -41050 -61691 -164 30804 18694 53513 46265 36146 38649
14974 38649 35443 6993 -41578 -70049 -15421 -45975 -100217 -105255 -99912 -75849 -42732 -74264
14962 -74264 -58474 -34165 -22032 4935 -12232 26968 30832 -34477 -28948 28390 54042 34530
14950 34530 -38437 -77263 -121731 -85628 -20701 35892 27093 45901 15554 -18343 6864 12834
14938 12834 12685 7025 10873 16063 -14338 -35372 -32236 -42097 -29959 4433 21543 1065 -41427
14925 -41427 -76504 -87117 -87675 -54268 -49810 -87744 -24656 41057 -21332 -48567 -69784 -90049
14913 -90049 -61298 -32009 46635 93330 83876 52989 7252 28341 -6646 -24999 -2839 3765
14901 3765 -12058 -53278 -29563 7357 -39314 -23066 -45930 -66185 -43846 -69575 -17317 36982
14889 36982 52323 18110 -35084 -64819 -113477 -97511 -96541 -113575 -78999 -41438 39142 52710
14877 52710 28589 12159 27998 44201 34476 -24982 -38650 -37350 -41749 32156 107068 71347
14865 71347 2078 1424 53315 11597 28101 82705 117576 139918 127279 92816 46336 4875
14853 4875 -46255 -8695 18726 40058 51327 54974 19428 38643 33972 23625 78262 40557
14841 40557 -7865 -40903 -89661 -85678 -58113 -46094 -92654 -97540 -99357 -72865 -3941 40612
14829 40612 85891 74456 24599 -9453 52202 62288 -16174 -74873 -48509 -23872 -29854 -7696
14817 -7696 -743 43667 70628 53780 110821 164064 155458 79652 -33933 -56444 -38804 -29635
14805 -29635 -21455 -21832 -20137 -35063 -38226 -66205 -102310 -116230 -107150 -80198 29883 60922 69679
14792 69679 48793 35763 97061 96259 70282 81502 31478 38628 77012 104791 56900 34478
14780 34478 47856 -16574 -5004 16928 7953 -6667 -28165 -14569 15155 87120 102753 49637
14768 49637 -35529 -64255 -72109 -48396 -11276 -4641 25080 42317 13379 -41051 -19426 25011
14756 25011 -6090 -53789 -116721 -166021 -118210 -87095 -41398 -14801 -35598 -39613 -98059 -155000
14744 -155000 -150256 -87490 -67186 -38998 -21409 28292 11273 12728 -34745 -50365 -68654 -17450
14732 -17450 -44185 -39952 21164 11649 -40150 -60787 -3963 61146 78186 116172 115528 76039
14720 76039 107397 115704 107106 114287 99334 94740 75631 102640 89374 42576 14402 -2030
14708 -2030 45468 95547 76172 23206 83 16704 47372 94137 123730 156476 137707 104813
14696 104813 34370 20216 43490 4418 -38379 -92882 -32644 53109 40775 35941 81092 87254
14684 87254 28925 13120 33832 62214 62654 52974 60769 92608 41482 -13309 -6317 -11843 -13059
14671 -13059 -24312 -18932 -40429 -74440 -46196 4870 -377 -32610 25480 46545 21283 8041
14659 8041 -16762 -102961 -120056 -107018 -79413 5802 49140 -18311 -38750 -39236 -10414 -53832
14647 -53832 -122017 -28865 59465 87762 29587 54821 96792 36332 21076 -35518 -78838 -55128
14635 -55128 -25485 -49916 -19629 10488 -19540 -62107 -74577 -51415 -408 7521 -57829 -85590
14623 -85590 -41608 13794 56789 48298 41677 57156 12561 -41452 -32370 -22022 58758 93248
14611 93248 43270 17599 41440 14983 -4860 -37374 -48843 25257 21854 -7607 6942 59633
14599 59633 50519 18842 -1698 9179 19698 16293 32497 59682 71637 -33967 -69402 -38070
14587 -38070 52064 76839 62455 41384 -9941 -610 32912 41208 14687 20878 -43187 -57745
14575 -57745 19839 28028 -43176 -76111 -44867 23099 2690 -12674 -40596 -25680 -23571 -58575
14563 -58575 -69246 -72521 -120155 -63309 -16366 45822 72552 69223 66153 43094 87894 93008
14551 93008 116897 105171 81950 32286 -46905 -8280 -10842 10840 33866 76316 34732 -6157
14539 -6157 -22262 -5958 -22177 10248 38847 86065 70795 61409 56380 -25752 -65074 3426
14527 3426 42921 11003 -69836 -13817 54124 112091 109902 101054 99818 17989 20525 63701 109507
14514 109507 126187 131021 88039 54636 25861 -12956 -33283 -28048 -46804 -86262 -13982 73837
14502 73837 74378 22154 13751 -14660 39401 24175 10642 -22320 -24440 -32585 -74454 -80856 -26657
14489 -26657 20835 2156 15924 34167 51618 51180 67852 81357 1797 19139 -1337 -52218
14477 -52218 -32758 -9656 13843 82072 117533 68747 28671 51163 68484 41367 13990 -1844
14465 -1844 45055 27246 34494 39058 24496 36684 -17864 -57515 -94499 -76057 45634 112531
14453 112531 72088 32586 35603 20451 -15378 -7644 -28434 -19014 44038 53333 2891 8433
14441 8433 7266 -6892 -28854 -26575 -55102 -85930 -86703 -156438 -72677 -4915 -30400 -89131 -78321
14428 -78321 15954 23015 -18808 -105107 -111349 -72169 -62811 -57312 -72710 -82499 -62745 -12310 24195
14415 24195 108621 38471 -23852 -42803 37849 58012 -1234 60057 131460 158825 101463 51249
14403 51249 -17549 -25213 2945 33619 7411 -66821 -96728 -57939 19952 40205 1789 -13858
14391 -13858 -18286 -14545 -2621 34642 42008 18334 -13211 -3988 22229 22812 47384 13996 -47034
14378 -47034 -70885 -9705 10347 45115 16101 32279 39912 80193 81050 56624 20668 7512
14366 7512 -423 -41627 -37874 -31474 -24202 -68347 -139996 -112371 -56086 -51414 -40923 -30469 -23328
14353 -23328 -20438 -35089 -43345 -30581 -5397 -62568 -33054 -43064 -21805 -26896 -34644 -15871
14341 -15871 3239 34875 47357 52140 81250 32634 30642 34043 21896 51224 42909 46394 38992
14328 38992 20246 34053 24998 -24296 -53028 -65342 -58657 -67696 -77587 -63671 -55966 -55096 -65891
14315 -65891 -60515 -83220 -78802 -10726 -51701 -86682 -78369 -28307 -53696 -3723 24313 31205
14303 31205 58812 61411 30769 14419 32657 15778 -8963 1872 4164 -3539 30039 27071
14291 27071 -5743 -45232 -65087 -49969 -32261 43332 82929 87797 121581 177244 176942 112912
14279 112912 65926 63503 50804 12919 17704 -7641 -14195 -41809 -12011 81159 77673 15424
14267 15424 -31511 -10541 -13194 -398 -29385 -37685 -32411 -55949 -83076 -86790 -61472 -28036
14255 -28036 -2344 -41581 -32571 -43379 -9951 25209 29884 41265 86083 77917 61514 35275
14243 35275 37693 41314 50162 15885 -40701 -33096 -36775 7639 65417 49497 52298 -12706 1694
14230 1694 33149 61601 109910 68521 13220 16222 19646 709 -59881 -43950 1819 -16634
14218 -16634 4101 6113 7651 67346 161050 200012 149428 96042 78410 89072 66960 80163
14206 80163 81068 64381 41691 39683 52513 30236 69429 71913 -22018 -52806 -55917 -59678 -55625
14193 -55625 -48797 -96592 -134229 -89770 -42518 -45738 -59883 -34145 -51069 -53911 -18794 -28687
14181 -28687 -73522 -102592 -112908 -139756 -94441 -98501 -78997 -54644 -70019 -11702 57794 47972
14169 47972 -11855 17005 19279 3657 -51983 -29529 17010 26586 -26860 -98308 -85289 -111086
14157 -111086 -129988 -69301 -49547 -91248 -61529 -39036 -14877 449 21258 12188 -44460 -40444
14145 -40444 6080 57950 28427 40073 27831 -1016 16054 34533 29160 -17073 -19726 -16239
14133 -16239 18484 36369 85600 52880 61359 91014 90264 94893 89984 90966 97112 117943 75043
14120 75043 68152 48630 56343 63600 62591 20172 -22666 9099 44170 15687 -13998 -9650 -21353
14107 -21353 -20176 8136 57152 36845 -1036 -58525 -4001 43972 38646 4413 -14875 8785
14095 8785 43373 22295 19293 47049 13623 -28421 -24308 -22724 -28892 -61032 -15868 -43388 -65460
14082 -65460 -43820 -17411 -46786 -34641 32669 32639 17902 65447 93229 80987 56679 62192
14070 62192 -12427 -79562 -51198 -25420 18198 38378 55722 63374 51923 7464 -18683 24653
14058 24653 50224 130755 86280 20950 -2111 -41112 -26013 -19282 -56287 -55593 -73038 -123667
14046 -123667 -113892 -91868 -16263 115569 136455 60012 -8096 -26067 7025 11961 25553 21025
14034 21025 37843 58215 75372 58087 53553 -45840 -98296 -88955 -81687 -62651 -79247 -41453
14022 -41453 32156 1363 -15615 -20089 -36355 -5501 51967 16972 -21356 19003 51724 62447
14010 62447 63673 44295 47563 40531 5532 -8538 -40950 -71854 -20420 28426 35585 76025
13998 76025 85513 23096 -22473 -68161 -53337 -21136 -52084 -77309 -59395 -51526 -22956 44629
13986 44629 40349 31446 6878 49171 51091 20268 19779 -924 -50886 -27943 -27069 37066 69543
13973 69543 84797 80202 87037 65973 33609 16938 -13709 8973 -30860 -61634 -3802 29880
13961 29880 40918 44319 37041 60729 58466 67229 47485 72920 72719 75624 76881 85406 44570
13948 44570 -83 -1512 -10451 -46604 -23123 25479 3499 44723 68077 24716 7371 81228
13936 81228 125600 90407 32708 8049 -11313 -38058 -42336 4557 18256 -22629 -61462 -64892
13924 -64892 -9162 -9781 -23620 -31178 -68277 -79260 -119669 -80981 -13409 24666 45503 39633
13912 39633 86310 92924 36658 8787 -29410 -46903 -12490 -37057 -4388 -16105 -63506 -18613
13900 -18613 39282 14716 -6981 35883 97054 67155 26877 215 -5997 38782 14968 -357
13888 -357 7888 -16463 12754 13977 31396 42204 94937 31208 3260 64352 79619 86863 133642
13875 133642 85869 17322 13768 49976 134468 147757 86282 79703 120284 69319 -7290 -15249
13863 -15249 9205 -16371 -48408 -33650 38528 56329 45548 51443 51335 21777 -21699 -41081
13851 -41081 -9532 -27212 22289 -27844 -31940 -43340 -62128 -36466 -40935 -6858 -22203 -81897
13839 -81897 -67414 -55191 -64940 -39023 -90285 -68731 18445 15832 41725 72983 97913 72127
13827 72127 32816 -25135 -85907 -38029 26665 736 14997 51964 63894 85662 90125 45458
13815 45458 -25563 -44432 -21573 -18616 -14684 -2063 14430 84670 26056 -1152 45050 34862
13803 34862 3663 -338 26506 46870 74847 69909 39421 -9996 -6079 -4645 64232 51089
13791 51089 31949 24078 -43664 -88208 -75850 -62430 -23730 11905 4097 22948 46526 24313
13779 24313 26743 1209 -19708 -9309 -34527 13763 60819 40341 -25294 4148 22097 -19883
13767 -19883 13886 46400 80644 26855 -21445 -34723 -8958 67190 72517 98246 124515 111913
13755 111913 83052 87226 66821 95446 112134 113393 98601 89575 109365 61326 42458 20757
13743 20757 -28735 -97241 -75709 -44941 -44734 16856 56079 106333 94062 11421 25961 -10692
13731 -10692 20175 8901 -2166 -21660 -28906 -54350 -32816 42395 47610 79583 92180 88355
13719 88355 107150 59629 -11942 12119 43418 48173 -1985 -9251 7068 25768 65186 87872
13707 87872 134936 150946 65404 10628 -100408 -63979 -36315 -70221 -49879 -8220 33658
13696 33658 63136 81369 -18522 -76849 -43769 -957 21251 -13822 -12204 26210 53317 21559
13684 21559 33170 4750 -8767 -2243 10119 58818 104075 72289 56978 63449 34636 6271
13672 6271 49267 77142 94824 71233 25190 -14341 911 38521 9677 -10294 -34957 -34050
13660 -34050 -32744 -8284 -2455 23491 17486 22300 81493 74829 48986 118086 97231 50145 38723
13647 38723 37294 67134 40726 44148 101890 91095 43836 28782 76907 87026 49522 800
13635 800 7336 14037 19229 19468 -22914 -45429 -68166 1942 23196 15218 7241 55073 61677 62408
13621 62408 74739 42325 -18602 -72439 -4101 25924 11632 -24236 -71296 -40076 -15248 51832
13609 51832 50882 39204 33996 50242 43173 32349 -23495 5279 47775 43410 37082 -4947 18820
13596 18820 16148 -15127 12724 7765 -5380 -2282 6299 -6866 -8972 1997 15417 60687 35238
13583 35238 -29268 -51089 24309 119393 95898 -37641 -62659 26346 38067 28560 71078 15037
13571 15037 -32548 -30676 14589 11454 -5086 22052 31133 10944 -8711 -17942 -4609 14839
13559 14839 7 8772 47121 27098 56461 60178 77199 62976 16927 22792 27925 66335
13547 66335 100217 42520 -4176 -28021 -33727 -14821 28145 23755 30369 33794 47681 128850
13535 128850 125690 67428 100886 98090 45238 27276 57682 37738 -27744 -79568 -121069 -60375
13523 -60375 -19350 -13155 -18263 50600 26558 15183 -31524 16398 29944 -36599 -56127 -15404
13511 -15404 50557 28376 -1523 -34255 27805 51571 69822 55946 38922 -17891 12869 24351
13499 24351 64170 105373 102796 61943 40912 31528 37495 92051 109688 133959 114340 93154
13487 93154 54432 23065 41077 8670 47866 117631 147592 154702 116929 67577 24897 36279
13475 36279 9618 50268 93526 74073 52927 36788 36 -9791 40742 9769 -54360 -33854
13463 -33854 158 4942 -10620 6428 64867 107304 68637 -5301 -75081 -66284 -20636 -38069
13451 -38069 -38151 -23360 44281 78432 91389 40212 -33669 -40016 -32035 -51765 -68125 -8983 32242
13438 32242 69733 135698 150500 98445 66863 30818 -49505 -33534 -20715 2581 59512 34472
13426 34472 -19862 39792 118142 134806 117893 119680 78729 44116 96909 101934 36418 -64878
13414 -64878 -51701 8846 54455 28662 26345 14354 -5361 -41621 -49701 -12461 29164 52253
13402 52253 90998 97297 97968 106544 93676 125554 92394 62972 67005 101861 108312 112887 106407
13389 106407 132203 99479 92420 145776 102349 45416 33037 7671 29205 -4572 8681 -17358
13377 -17358 -7799 -4846 -4175 15794 103250 156476 92682 36906 42561 79056 63656 -20370 -116608
13364 -116608 -106716 -15574 36713 36860 65685 99352 81415 109264 103847 87167 96929 81585
13352 81585 50683 55538 43311 68177 53386 31647 -9111 -12400 4813 -32270 -23855 8938
13340 8938 33252 38398 61424 29599 62330 83846 114408 128201 59362 30034 29698 57343
13328 57343 96373 69087 88951 82805 14829 14450 -60383 -60317 11613 42492 33943 87228 61688
13315 61688 -18250 -104815 -68924 334 21826 -9986 -3910 46195 35465 39126 39213 57959 61141
13302 61141 66233 79151 53856 45273 52759 18193 24983 46322 7751 20075 37055 92880
13290 92880 126929 77245 65153 93421 117569 81822 12019 -85212 -69685 -14878 -9305 21358
13278 21358 11898 52728 49292 62647 63537 85632 55308 72098 62318 15724 9616 54948 36925
13265 36925 31666 190 -100343 -81548 13593 16416 -10876 10098 62429 80260 51890 92770
13253 92770 120228 149947 137811 89967 -4841 -11185 28019 54533 116001 191096 183801 165465
13241 165465 156709 159457 143164 166269 138503 98387 134674 146980 145153 84700 39910 62537
13229 62537 97199 119479 106801 82929 60820 2822 5552 33341 19316 -8571 9480 30832
13217 30832 76319 116058 103382 164906 198424 151553 113412 63385 39747 44538 77534 100681
13205 100681 107323 123983 90798 104609 179072 186083 85789 16256 31413 114115 115851 68648
13193 68648 74709 102483 67552 146439 129675 49809 -854 2932 118006 173239 224338 218266
13181 218266 170982 108802 43644 71324 157249 172386 157314 154166 139584 60850 30441 54710
13169 54710 81868 126655 119072 96523 100059 98939 65061 -32192 -20426 7376 16849 8396 27437
13156 27437 111593 178742 142027 81705 68246 19561 -4373 9485 67932 94445 101401 87266
13144 87266 80844 121659 146717 147986 153486 107068 82630 120773 56749 -1565 -18633 -10654
13132 -10654 47496 128333 172033 164795 189865 194960 179212 120259 71782 51248 3320 18936
13120 18936 -37774 -11474 27510 -12600 46199 137645 107719 39706 57403 132891 115894 84861
13108 84861 58904 47948 29919 30398 30102 17413 59888 48074 -8740 47962 87860 46312
13096 46312 92949 81424 96728 111006 45802 -60606 -63750 -55627 -10051 45250 36129 3414
13084 3414 -10433 -27752 -85980 -54705 -5846 60926 85465 60831 35410 18629 18483 59924
13072 59924 60534 115817 132583 115322 114489 131370 138745 136029 142939 115688 87457 75457 91314
13059 91314 110196 90520 38443 34527 45054 75644 91875 79320 118872 140300 99996 81925
13047 81925 86956 61487 73879 62356 55318 72849 76786 56299 50622 98867 76052 28337
13035 28337 33092 60654 48733 43300 52241 69281 56340 3425 34013 104341 108375 30261
13023 30261 2570 42026 53583 77463 107215 118465 146398 117503 41165 49696 68037 50833
13011 50833 78674 100371 53892 87100 70008 29655 48106 16251 21072 52139 83572 108506
12999 108506 52747 -2762 -34762 -28226 17683 62367 80135 33321 27468 76685 153672 146891
12987 146891 114881 125082 141855 132150 166427 137611 64410 24821 27702 104346 115650 128179
12975 128179 125603 93334 94400 114369 150628 145455 165949 137440 54388 65876 71131 51854
12963 51854 -62 27237 103169 97562 83751 90494 62932 9208 49934 37163 -1379 -9379
12951 -9379 20587 1310 -45107 -35816 13800 60151 83991 67432 32812 21919 53960 54881
12939 54881 84727 85124 99867 38678 -22779 6944 31877 25511 94866 110716 111102 115026 129642
12926 129642 163332 171728 125293 66528 29727 7977 54524 68156 42579 18839 -11614 4907
12914 4907 9876 31367 45941 73829 45348 31519 33468 48498 123744 144886 124591 116681
12902 116681 83243 121903 106636 105885 69961 62330 84288 68819 108867 99666 119451 99983
12890 99983 119345 76989 69590 35618 51926 98120 97147 31594 74379 65911 54817 41362
12878 41362 72589 65649 78150 66350 75526 104489 48480 6463 -7363 64285 105280 112729
12866 112729 141598 132151 111890 84131 84854 128756 156257 177431 209530 230117 207813 221322
12854 221322 208772 147360 108507 112129 119996 106695 64259 63631 96377 109409 101146 156424
12842 156424 180897 206074 182451 158002 161481 152074 54168 54236 117924 125352 193137 197594 140690
12829 140690 108469 171392 163001 166255 222169 228394 208375 242263 251793 292528 368467 418181
12817 418181 517648 711514 932283 1196832 1397965 1516160 1639621 1652427 1603787 1442328
12807 1442328 1223570 1031581 818084 595665 488324 453501 416178 385551 306105 294013
12797 294013 275971 245471 163396 103433 127949 196218 189923 190101 203437 135045 130223 136995
12785 136995 179117 134861 141882 106250 93804 123567 140364 200544 184328 128354 107864 105336
12773 105336 112350 157372 218876 197779 164223 119494 65556 57673 75046 131987 205137 221405
12761 221405 185115 203127 207749 152747 139855 135733 110708 105712 71918 75322 91051 119091
12749 119091 105016 58115 27236 50817 88541 125774 124636 96901 126686 131109 152039 166144
12737 166144 113517 81039 59465 42848 73628 104859 128238 144273 92844 55686 37930
12726 37930 49908 63373 66818 111442 101521 68401 100150 91703 56076 52647 108858 139968
12714 139968 127296 124131 132913 134424 173420 222645 136532 70662 69282 76931 90239 127007
12702 127007 157049 159623 158177 148739 134026 89681 56598 32052 28116 104937 142524 111375
12690 111375 134964 185699 192188 170875 185169 175927 148566 189142 222976 242719 188390 161402
12678 161402 138688 102413 118480 158239 172607 208307 220060 205163 173701 167003 185219 170717
12666 170717 153604 160340 178002 202721 239326 268249 267821 328945 279114 219749 275404 335516
12654 335516 338783 263448 208848 193257 225364 297750 296682 284199 289562 282520 301949 308497
12642 308497 337833 322301 242615 178891 199358 188955 195291 244425 233368 206692 231514 223643
12630 223643 241294 187778 166093 180926 129878 141893 234440 300647 295672 275230 299831 302393
12618 302393 288486 307048 320186 291912 275593 214175 231823 237320 218258 265229 307239 299322
12606 299322 244326 222634 245783 221032 214328 243653 256476 300020 293539 256725 254974 273251
12594 273251 246069 228262 247304 273031 286902 324764 351355 350027 391321 468636 441188 379306
12582 379306 387471 441159 453790 440950 414862 464964 417525 327468 289751 335056 360491 411051
12570 411051 371255 346052 320919 353748 358628 365228 316024 256799 319483 290402 296476 326987
12558 326987 311619 387012 470914 440617 423867 454447 419541 414991 448113 502056 530046 529340
12546 529340 496556 549894 601441 630852 688277 726443 757459 807071 872507 845108 769753
12535 769753 728495 697868 655621 551457 555992 633337 628649 653901 712886 757328 740772 699526
12523 699526 655127 634153 659238 690802 736364 765204 783123 784555 814837 769061 702618 700592
12511 700592 705313 719545 769499 820798 802766 792232 754818 698646 709090 754057 738437 719637
12499 719637 722155 822720 894501 882535 819654 828515 840413 855616 874187 858839 800838 772426
12487 772426 706323 679722 675307 718405 707741 646126 607012 620157 682214 702534 699258 710588
12475 710588 732861 775977 746354 722399 750303 810329 889205 884625 974296 1112246 1173565
12464 1173565 1155039 1131761 1184280 1210791 1148355 1134248 1111373 1083470 1003157 973101 1036494
12453 1036494 1092444 1169732 1211861 1166586 1175453 1210003 1186929 1150386 1083951 1115601 1174373
12442 1174373 1221918 1285092 1363826 1441406 1456892 1475967 1544207 1621356 1673267 1770478 1857683
12431 1857683 1978727 2132449 2271152 2321254 2396574 2561679 2674995 2849150 3022552 3233195
12421 3233195 3498976 3801695 4146465 4487160 4842465 5213667 5656479 6276305 7106656
12412 7106656 8134527 9579248 11520070 13786085 16177828 18432751 20562644 22643479
12404 22643479 24954885 27712250 31481996 37139958 45927856 59683312 81315141 114143654
12396 114143654 157739170 204740820 247361251 280186235 298020245 298542906 282259999
12389 282259999 251524470 213388950 175736369 141331473 110591985 85045400 65736041
12382 65736041 52062446 42610399 36111018 31471334 27964384 25111257 22499771 20106788
12374 20106788 17870477 15736960 13804332 12030464 10466299 9133995 8052554 7151021
12366 7151021 6436106 5800301 5235513 4786426 4487270 4163613 3855267 3549463 3274323
12357 3274323 3042409 2846739 2698195 2514638 2321053 2181406 2074216 2013850 1980386 1925744
12347 1925744 1839404 1736916 1643076 1536986 1418483 1391183 1378970 1315608 1265504 1242989 1201343
12336 1201343 1181822 1166137 1132796 1076253 974666 898420 918142 895726 879471 832453 798950
12325 798950 765316 786533 804171 715045 625786 607937 555288 528359 528848 521089 503892 433831
12313 433831 456172 510641 499541 500688 496251 488466 477064 481326 484781 562852 617911 564877
12301 564877 492688 440158 439726 451651 419578 404965 393127 412265 428495 443379 395099 381760
12289 381760 328090 300338 262795 308060 305297 334267 395996 418566 469292 442162 402845 415229
12277 415229 423464 415010 416332 491475 489460 511755 561010 551098 590619 648668 726387 717645 673025
12264 673025 667117 636069 636122 650911 550198 450910 401061 379014 294188 209754 185898 177720
12252 177720 137635 127118 155343 198337 218382 171860 136917 127212 85860 50679 70802 75931
12240 75931 122710 179757 92653 107862 130854 118033 97471 66096 70781 64177 127791 175555
12228 175555 149289 96639 142989 110666 78946 183395 225773 213781 145842 121666 159963
12217 159963 195329 189344 183524 177232 172963 179513 124826 119151 131860 92269 57141 53476 131937
12204 131937 172093 160982 176600 143663 99716 129952 134954 168892 184680 207482 208539 243624
12192 243624 245783 276633 319680 377606 442683 518461 662417 759560 755438 589170 452053
12181 452053 335951 275567 257437 267632 222841 198210 156724 157484 160105 153878 141057 115335
12169 115335 54613 41708 78213 38902 37461 80452 70619 58102 25488 51278 85983 14439
12157 14439 29945 142698 224338 222763 250016 223988 175876 150954 251363 281823 273165 272053
12145 272053 317758 486163 718281 1080044 1524823 1704142 1418973 972028 670456 508025
12135 508025 424512 360314 309371 220650 171676 163401 134810 112611 85501 68498 61340 46793
12123 46793 31459 23151 63832 60023 72739 117095 140454 101567 93859 159014 184047 256801
12111 256801 306580 291817 219739 231148 223471 222154 211966 177644 205129 253166 331220 414045
12099 414045 615985 936779 1373775 1730207 1671584 1310828 928126 698353 522888 428660
12089 428660 359506 291515 285172 218226 121215 96942 110865 140314 176273 159688 133851 136807
12077 136807 160601 111438 68116 108235 106388 75929 98282 54595 95560 105862 48877 42452
12065 42452 78433 121500 146799 165886 190043 242406 318135 389977 386237 355263 364934 351763
12053 351763 467251 621684 683784 572292 438809 406604 357029 283445 241062 217417 208325
12042 208325 186156 132763 75963 90415 86723 128372 119250 99464 40790 51885 106538 169434
12030 169434 130856 74142 29066 75018 111601 98514 162000 182259 134437 128123 153010 149578
12018 149578 181874 124179 52720 44896 76642 74384 91364 115298 176591 196921 183494 164874
12006 164874 180126 129348 73095 71084 111174 144510 168180 187653 174987 172968 161608 161867
11994 161867 157762 166138 190421 203298 182725 166734 148241 167183 168797 200538 215264 252647
11982 252647 265372 318615 333737 322180 273867 297587 308523 317480 460351 590997 759991
11971 759991 939672 1118276 1329056 1508313 1592173 1606830 1572877 1458318 1318774 1138314
11961 1138314 992254 816470 672463 504013 455824 394251 325967 337097 333639 323351 309348
11950 309348 300625 261176 230385 182174 168782 210415 258622 316071 268671 240491 238504 341680
11938 341680 446652 472862 460466 372528 382170 413927 453405 466108 468960 464883 405346 381829
11926 381829 447398 448094 458891 469045 501308 514253 592382 590628 514048 484398 504115 482774
11914 482774 468716 482784 522549 516665 550741 539085 541818 541889 513850 481048 501343 492966 567686
11901 567686 631000 684252 681299 696473 682732 696559 740751 754053 765975 725687 707416 743520
11889 743520 760108 752239 734212 641407 568895 562860 527790 542653 525793 537802 516413 534926
11877 534926 540254 543192 553884 595361 571961 567277 552500 575002 559784 575787 684375 665091
11865 665091 660740 633992 627590 605588 632403 676322 706328 686990 652181 603658 608606 598652
11853 598652 591991 585839 588086 608575 525484 430722 425957 485615 487087 478432 487046 504295 483807
11840 483807 417152 378419 356260 345463 343234 395780 416613 402277 348773 327642 290784 295107
11828 295107 318159 325072 384234 381041 337406 345921 307720 289221 285637 338625 378060 432583
11816 432583 523898 532944 554809 573566 595352 688440 779474 763038 696619 635997 637943 747139
11804 747139 745459 731731 652713 560494 520357 518824 611198 638616 636931 613496 592407 564972
11792 564972 544606 620010 666836 696316 665576 699662 682431 726451 779882 845459 859539
11781 859539 820551 835235 787861 745529 784171 824081 866407 867547 827987 780408 776281 851821
11769 851821 928012 893893 869078 857667 820986 804024 766008 748296 790720 842679 791445
11758 791445 765130 794657 831175 857532 812227 754319 752032 796493 834377 848812 858275 868013
11746 868013 934048 962744 1044970 1148823 1119390 1124015 1121719 1039786 966766 919894 870495 831823
11734 831823 834180 847172 819272 805303 752713 758703 727566 669860 603779 579551 545095 524594
11722 524594 584796 569926 545818 558338 571154 557276 545343 535875 478047 471435 436145 426206
11710 426206 422065 411094 395229 390239 413025 459972 437745 426311 461424 482318 479837 542016
11698 542016 512042 472406 456127 465163 442805 453877 511259 573652 589443 571533 527120 530467
11686 530467 517268 489379 505274 485401 434569 416330 454315 481068 484880 494223 514583 555249
11674 555249 528831 583708 659278 658826 606476 503104 459121 506311 610178 631047 571816
11663 571816 559958 578768 582526 609909 628254 610010 600429 562311 569847 585916 588381 633246
11651 633246 684852 652672 652546 689241 677730 654497 664491 680767 712800 710074 705236 687840
11639 687840 637196 706601 739478 722052 736290 820465 873510 910181 901991 928828 899907 895639
11627 895639 919927 912866 920975 919614 940310 927362 948211 973626 976601 951186 1010516 999112
11615 999112 998568 980337 919681 950555 1002549 978420 925390 933677 981837 997465 998957 990884
11603 990884 976967 1027601 1046758 990809 1013566 1057120 1098323 1212297 1211811 1196641 1138531 1145894
11591 1145894 1126336 1129287 1169730 1188714 1113730 1105483 1145694 1192555 1209128 1268289 1336521 1331394
11579 1331394 1336158 1332061 1316745 1258940 1230605 1247963 1263413 1341805 1354631 1321005 1308599 1307950
11567 1307950 1344032 1409209 1449362 1469715 1443707 1392952 1402176 1412971 1506893 1575933 1568075 1535109
11555 1535109 1552489 1589772 1669436 1688810 1646609 1659952 1763428 1819891 1831425 1805924 1800472
11544 1800472 1817577 1837886 1894287 1882355 1836627 1870195 1910388 1954296 1990058 2038881 2095361
11533 2095361 2165975 2135803 2193940 2263389 2334025 2393972 2489287 2612527 2795657 2956212 3196092
11522 3196092 3470956 3722471 4045175 4360819 4700975 5005555 5299793 5696255 6117665
11513 6117665 6613380 7331329 8193946 9307151 10843417 12714144 15055425 17930254 21255540
11504 21255540 24710098 27931319 30816371 33240028 35076982 36666345 38330789 40215957
11496 40215957 42062242 43852923 45573911 47404929 49292536 50768816 51480611 51121566
11488 51121566 49822294 48232659 46954947 46475646 46747601 47482558 48455887 49646795 51163681
11479 51163681 53317249 56313306 60293330 65205006 70451955 75312414 79037070 81294429
11471 81294429 82314006 82791154 83167838 83598994 83947635 83860840 83050273 81460109 79523941
11462 79523941 77753174 76365813 75442947 74811785 74303335 73971919 73795909 73587107 73413593
11453 73413593 73245290 73089888 73057937 73338370 73916673 74810709 75955070 77305100 78897615
11444 78897615 80786120 83225585 86164672 89542788 93270660 97204738 101317560 105657863
11436 105657863 110163851 114612296 118718227 122752216 127694581 134181691 141784576 149010172
11428 149010172 154716086 158412890 159901581 158539841 153964879 146268690 136206621 124944886
11420 124944886 113719602 103141309 93214115 83749886 74611392 65730660 57569276 50242121
11412 50242121 43649617 37857850 32813505 28687058 25301166 22502102 20316798 18639178
11404 18639178 17263965 16179548 15285921 14513185 13847525 13296857 12910347 12678270 12512514
11395 12512514 12443227 12462603 12586251 12864297 13306581 13907448 14732808 15823843 17086312
11386 17086312 18535670 20361153 22533295 25121190 28154844 31756355 36047073 40904472
11378 40904472 46268404 52141985 58799302 66884086 76864467 88663732 101482163 113942836
11370 113942836 124191760 130688886 133566294 134454985 135162732 136675064 138921859 140606197
11362 140606197 140463046 138599284 136174966 133634810 130483976 126125318 120674768 114955879
11354 114955879 109857101 106028762 103534601 101832869 100165134 98186894 96058790 93898707
11346 93898707 91485570 88550737 84985902 80836365 76654144 72845562 69706312 67361059
11338 67361059 65694246 64821677 64932937 66135603 68241121 70694638 72961990 74647438
11330 74647438 75618169 76187281 76786004 77646579 78825651 80226111 81449686 82418512 83053903
11321 83053903 82936505 81782608 79348357 75789908 71680696 67659806 64133131 61404327
11313 61404327 59218996 57350945 55548503 53637717 51777693 50161413 48871493 47943071
11305 47943071 47388285 47233871 47388001 47909599 48660547 49433827 50343974 51091830 51240090
11296 51240090 50515502 48835855 46315151 43224750 40002762 36761530 33356632 29857373
11288 29857373 26529716 23390981 20462839 17878494 15616731 13662556 12038477 10762890
11280 10762890 9643728 8625042 7829083 7249037 6683220 6098546 5548761 5034754 4589410
11271 4589410 4233364 3915445 3537540 3221830 2984151 2774532 2642619 2496741 2391697
11262 2391697 2260513 2129066 1981146 1822573 1792492 1704547 1615771 1535707 1489232 1415173
11252 1415173 1394927 1411466 1379836 1313723 1239100 1225897 1230866 1276314 1213585 1165018 1158678 1162936
11240 1162936 1129019 1072882 1022391 983452 952407 973480 971839 969499 946700 933181 894951 876694
11228 876694 860265 826683 830453 862808 789197 693005 624506 582017 552931 500336 513423 546805
11216 546805 565864 530273 436455 486589 530861 510874 486479 488997 477342 441740 405716 470482
11204 470482 495734 459962 458367 398729 376773 381637 415216 452169 422097 424102 365522 358774
11192 358774 415043 456894 427022 413803 375533 367869 341086 337882 391843 333474 315605 326209
11180 326209 289553 224613 159386 175732 211120 211756 213974 235539 194198 213740 195453 199770
11168 199770 183130 140329 143655 168157 176825 156529 171552 111913 93874 67739 117611 198050
11156 198050 142735 152982 200271 211270 139934 115948 77563 76058 71397 66382 66717 88815
11144 88815 48465 27659 60940 127045 141444 133024 147753 117315 55866 7039 -17696 -23902
11132 -23902 51217 66954 49529 81475 47234 64224 72750 86331 69782 105081 119007 89094
11120 89094 33087 36237 31851 18208 39387 63945 64918 66340 26707 6811 7050 29031 7094
11107 7094 24771 27361 34927 29478 30770 37816 42031 41544 26031 -32393 -13342 50435 93291
11094 93291 71446 52673 52682 44953 -17129 -22213 -37931 -19432 -38225 -82102 -23659 53990 60357
11081 60357 52864 58925 56167 -14674 -69497 14455 55379 43245 2458 21826 3286 -37594
11069 -37594 -32766 -47714 5730 60551 111728 119664 84150 48763 82018 143628 172891 214102
11057 214102 250269 309709 329878 369822 400607 415436 410758 420556 441772 472904 438418 422694
11045 422694 443277 456598 455033 464015 429754 411135 391378 451282 496131 468009 441613 403332
11033 403332 399039 396112 379122 369996 369618 373503 378934 397314 380202 409436 401921 399831 392556
11020 392556 336477 299284 332812 370911 406559 437193 453798 452158 426412 388309 403344 471585
11008 471585 513812 523912 469513 419413 390697 392290 417038 429760 451308 452251 435310 424048
10996 424048 297872 247703 244271 187586 240344 272484 253881 273556 290119 283626 279070 280241
10984 280241 262283 264842 257674 195937 250770 277730 250296 301173 333159 275308 231998 175581
10972 175581 189721 190286 227358 206024 167277 163780 139402 94437 95014 6336 -38938 -32675 4122
10959 4122 3384 -16928 457 -15426 -12045 -4818 39432 50656 33930 18305 -785 31429 -20080
10946 -20080 5514 75228 103842 130227 140544 176816 252964 210324 181615 212307 189554 262669
10934 262669 340313 396087 476519 517408 561730 570119 632019 634040 625431 571443 561207 545265
10922 545265 458686 447596 429309 403597 365363 399737 379357 345669 321124 330963 355342 377889
10910 377889 386616 295576 284278 328707 356388 367747 354812 322407 304228 310469 340324 349140
10898 349140 396414 440374 402021 450921 488802 522242 582676 573145 507851 430843 453797 485923
10886 485923 491879 506979 485141 422408 421439 451048 378582 359894 366397 334486 365282 363847
10874 363847 378090 351140 334070 293777 223088 244930 275773 277340 321416 295668 349930 344077
10862 344077 303111 398657 458929 495383 457395 447711 438797 370138 292945 224834 214660 179783
10850 179783 173128 117882 111720 84811 40987 60120 44802 24448 -2388 -41478 -45472 -62710
10838 -62710 -27434 -27645 4706 7997 979 29294 -51908 -88704 -130304 -78487 9520 33232
10826 33232 -51850 -100133 -78464 -13880 -81215 -82877 -54901 -111648 -141957 -142218 -125988 -93652
10814 -93652 -112671 -78567 -36525 28905 16479 8995 -10449 18488 31491 79684 36012 -58994
10802 -58994 -54913 -96642 -37478 -32662 -98769 -76445 -27457 -22956 -61512 -54246 -14345 691
10790 691 19352 29201 20184 12686 6836 1051 32524 39932 14165 8436 9380 13502 -10842 -26619
10776 -26619 -23951 -42858 -4520 19614 74063 113688 83257 36683 9883 -5022 11736 39488
10764 39488 33831 -53 -45895 -48039 -21369 -3401 -31713 -9893 32893 68755 -19036 -54136
10752 -54136 -56535 -15717 -31247 -77265 -68051 -107670 -74414 -57454 -55537 -44841 -67332 -68320 -56839
10739 -56839 -12602 -5746 -13749 -5627 -11900 -21808 -28256 -23441 -6183 -1121 4442 -30498 -100842
10726 -100842 -155143 -68983 25640 43537 -437 -62274 -85348 -116985 -71446 -22860 2591
10715 2591 -10172 10102 11187 16241 30202 28470 37969 36716 2515 -94111 -79709 -20184 -33807
10702 -33807 -53662 -65965 -46096 -65988 -45586 -67309 -53743 15276 4045 -52544 -98061 -91559
10690 -91559 -71103 -212 8712 -16270 -14685 -48567 -8399 9029 3044 -39946 -18017 -50215
10678 -50215 -46068 -68518 -31269 10886 3026 -18178 -44053 -64884 -41533 -50447 -42174 12478
10666 12478 31749 4197 -66968 -52011 -50426 -63848 -10842 8808 5530 -29916 -75540 -151112
10654 -151112 -166639 -136706 -140394 -123498 -96295 -56909 -58146 -110701 -162672 -167085 -99035 -71318
10642 -71318 -41273 51227 86731 69924 33626 30990 57650 66922 22647 33178 44684 90217
10630 90217 119654 90577 82591 68183 71523 34657 27506 25958 -5281 -41279 -32801 -33046 -52960
10617 -52960 -45320 -37384 -38507 5154 80096 42471 16217 25537 55443 12530 -70291 -47198
10605 -47198 -94072 -131233 -134370 -47660 -9159 17338 -22875 -27445 19104 -48431 -134461 -190218
10593 -190218 -206602 -133828 -113769 -127577 -93746 -109822 -90289 -36200 -51731 -44173 -79848 -95546
10581 -95546 -127168 -139644 -60828 -48145 -36355 4600 -13677 -66195 -53558 -49687 -41869 38484
10569 38484 58139 27662 -10628 37223 43733 17553 -8513 17351 -26145 -35841 -16799 -4995
10557 -4995 -44141 -51780 -62175 -76306 -61653 -80119 -13556 6958 7352 -1604 -12333 15092 67421
10544 67421 32379 -45221 -72117 -72599 -8195 18627 -30625 -60544 7924 27242 -9746 2644
10532 2644 48032 -33156 -52149 -9035 -21796 -60834 -10600 16483 7303 -22448 -25080 -17431
10520 -17431 7546 22072 58082 6807 432 -24122 -22843 -1454 9234 14209 27492 -199
10508 -199 -91678 -165003 -161645 -107089 -81631 -69353 -63209 -3483 14799 5261 1867 -34253 -30696
10495 -30696 -2345 -2700 -6059 48145 49550 80024 86191 52401 -11100 2147 5315 -33847 -69572
10482 -69572 -92546 -81892 -70597 -41831 -15786 -38056 -34127 -75894 -71644 -57236 -52129 -50355
10470 -50355 -22466 28012 9031 7392 -1991 -34377 25504 22739 45554 53696 -10104 20723
10458 20723 63945 74625 81490 59746 67448 68096 34243 12973 10871 38865 28453 -528 17940
10445 17940 13688 -4056 9187 16894 7963 -28218 -4941 -19583 -13276 12189 -11988 -57741
10433 -57741 -92699 -92630 -96175 -74387 -32301 -60914 -127952 -112219 -28355 20744 52034 69056
10421 69056 43741 -39082 -100544 -41967 26825 50748 17778 31367 -1923 25803 48858 33161
10409 33161 65710 52243 1940 -6989 -5666 -6300 3015 -64642 -63649 18732 16482 16040 39174 24636
10395 24636 51313 96791 32853 -229 -3894 -47330 -139718 -119267 -98752 -70721 12307 42542
10383 42542 45879 36275 78736 117989 90031 14215 -30476 -22243 -7598 -13179 -7374 6327 -18551
10370 -18551 382 2811 29815 -19995 -24469 -46731 -57983 -16818 27784 13088 -87345 -83281
10358 -83281 6551 37542 72103 33335 -59638 -114198 -138204 -96174 -87821 -69302 -107774 -100284
10346 -100284 -118839 -78006 -79405 -55922 -46069 -26083 19285 11356 8965 27405 -8089 -34242
10334 -34242 -97329 -99870 -5994 24791 -29815 -36312 28227 31563 -68053 -73447 -8876 -8492 -15420
10321 -15420 53226 16568 4537 -2649 -43475 -32123 -24518 -74187 -110450 -87111 -73053 -3294
10309 -3294 -2102 -19532 -21215 -26869 -61863 -4945 61373 72453 56310 39535 28944 -3089
10297 -3089 -41040 -43347 -5266 31090 620 -28196 17730 -18563 -76668 -15468 -11716 -51681
10285 -51681 -17226 32255 51227 32462 -10970 -5366 -19842 -5937 4504 -41610 -30517 38030
10273 38030 85942 95496 19347 -54324 10736 23240 -16745 -16677 -13404 -38787 -38160 -10958 -26937
10260 -26937 -78553 -41279 -34959 -28932 11455 -37552 -34991 -10110 2015 34958 43261 33470 -2306
10247 -2306 -5549 9943 -44952 -101858 -56183 -47441 -16488 1301 -24919 -49702 -50320 -83562 -114971
10234 -114971 -108512 -102190 -70356 -36120 -40789 -98560 -105444 -81450 -36183 -20303 -61709 -79317
10222 -79317 -83501 -53157 16748 41024 -6027 -54594 -28248 1650 4049 -16681 8944 -4875
10210 -4875 -12104 -52739 -21921 6294 -31358 3870 15164 -54971 -61035 -39048 -17969 44100
10198 44100 103656 144315 133778 66157 74921 100522 31737 -18327 -69628 -112553 -86501 -14201
10186 -14201 57506 20268 -16539 -26707 -63487 -116828 -79912 -41731 -85547 -97933 -34488 -35156
10174 -35156 -38167 -2633 1308 -15342 -38874 -55843 -79972 3564 51658 36893 4742 -57599
10162 -57599 -25177 24537 10043 -12568 -55944 -66300 -42171 1671 -35858 -89525 -161609 -166203
10150 -166203 -127552 -15550 25187 29957 24405 -36801 -46707 -56076 -59416 -64451 10160 80233
10138 80233 24147 -12284 -10066 25363 -9021 -69108 -136943 -109037 -54975 -43612 -23077 -22819
10126 -22819 -45366 -54934 -62886 -48384 35330 77046 42379 -6013 -85745 -139106 -95682 -13480
10114 -13480 35246 19126 -9147 14384 40862 32643 46112 42015 10079 -11252 -46006 -43342
10102 -43342 -33906 -35978 -38894 -4984 16025 25482 32024 -38352 -4877 23422 19503 15183 19870
10089 19870 16906 -30806 -48229 -46365 -11546 35348 33304 45013 25816 33281 48151 48059 75533
10076 75533 85142 76140 68498 48654 66446 120231 139082 184974 284871 307427 310264 295823
10064 295823 338165 381023 402942 428136 558008 719270 876118 1096575 1472477 2020817
10054 2020817 2922021 4577349 7785120 14563413 23361349 23401261 16129046 10520282 7067795
10045 7067795 4807314 3394438 2529693 1946079 1511849 1152375 931730 857082 721433
10036 721433 585439 506051 388897 342716 367152 379253 376468 365470 319063 304214 206562
10025 206562 168741 179501 164616 142284 87125 132904 109644 84201 119187 72007 -552
10014 -552 33521 120056 159973 116638 67996 39597 37308 60134 63743 57510 58553 53621 44557
10001 44557 24673 -1007 71183 78096 31521 68070 64977 47852 43270 32651 24798 -6165
9989 -6165 11707 38098 105770 128022 30785 -6045 -32456 -24636 -85002 -133493 -104050 -109234
9977 -109234 -122410 -59324 12321 13002 8958 213 -52020 -59630 -64523 -48210 -19687 -34677 -11984
9964 -11984 -16887 21029 7683 45062 124819 102837 41644 7796 -34978 -58622 -38273 -90738
9952 -90738 -139399 -142461 -105095 -83289 -95152 -72716 -67294 -109186 -106844 -68990 -80547 -82450 -63179
9939 -63179 -47163 -6730 9934 55686 28325 25470 30803 30846 70646 68744 40648 30862 30845 42674
9925 42674 45790 47522 -40497 -19592 12545 49815 58629 -47862 -89996 -40630 -29576 -63828
9913 -63828 -68782 -36647 30657 13188 29799 61453 63753 26059 -50072 -80962 -70540 -66495
9901 -66495 -55700 -75863 -53832 -61547 -19203 64958 54903 25738 36551 16226 -16066 -41365
9889 -41365 -45041 -10179 1464 -1900 -28926 -21422 -19004 -34769 -11351 20877 -8875 12904 -15211
9876 -15211 -10737 -20516 -10782 -1226 36998 -21546 -40696 -70652 -112723 -70657 -77453 -75783 -22817
9863 -22817 -22676 43555 73766 50466 53048 64927 46461 45423 -5243 -31382 -32025 3046 30628
9850 30628 6524 6595 -14274 -89529 -89156 -125054 -123861 -83640 -30746 5390 8642 -45178 -55893
9837 -55893 -72641 -77670 -59776 -64053 -67989 -35082 -22667 -49988 -5088 18453 -1667 -25059
9825 -25059 -31910 -47475 -3493 18574 53511 85259 91362 105748 6408 -58160 -88763 -97018
9813 -97018 -133588 -166739 -105920 -71452 -20802 -46343 -53822 -20637 -51901 -64896 -95004 -72212
9801 -72212 -2532 1370 -51549 -56035 -79446 -50154 -30636 25138 24369 -27335 -9825 20304 63739
9788 63739 64900 43686 37559 2776 -50877 -48764 44719 156974 129959 124716 88459 21237
9776 21237 -8639 -27121 -50427 -127776 -121736 -55717 -41542 -42674 -36493 -61890 -16042 21962
9764 21962 -22860 -63129 -71945 -54378 -97044 -140777 -87372 -72592 -56316 -20655 -27681 -31062
9752 -31062 -1319 -5088 21718 73555 77299 65196 17197 35777 10805 -5501 -90 -44138
9740 -44138 -450 26842 48308 27504 -31674 -33971 -46199 -5569 67882 27528 -10682 -21696
9728 -21696 -3786 -3163 -36309 -67243 -64270 -94332 -87865 -32023 -15596 -16238 27315 24997 -39886
9715 -39886 -42029 -41552 -29549 -9842 72095 73779 31485 7773 -65096 -58775 -17170 -38521 -26267
9702 -26267 6272 -13566 -2573 16150 23678 46661 22799 16732 9190 49038 39917 -24308 -2285
9689 -2285 22383 9785 -4198 6181 33064 -14543 -9567 -39026 -50646 -28897 -38103 21549
9677 21549 99823 70166 52742 24675 25591 38879 16254 -20534 -36525 -8272 35237 -17432
9665 -17432 -22402 31753 77146 88350 100794 74769 70538 82296 45595 36200 31570 -15146 -38911
9652 -38911 -40004 22203 35432 5488 -30132 19022 48700 47517 42777 44462 36597 1474 63260
9639 63260 53251 13466 29702 38362 -796 -6297 -5213 -67191 -68600 -27398 -85370 -109655 -56010
9626 -56010 -45020 -56954 -100520 -129377 -123910 -84283 -37940 -42991 -11728 18210 9582 -10120
9614 -10120 -58661 -42181 4323 33256 40961 16422 45649 77620 35089 -39567 -111173 -150646
9602 -150646 -86711 -19614 -29314 -79682 -112988 -83024 -44135 -52821 -63104 -48848 -34682 -32085
9590 -32085 -45611 -72988 -78560 -73053 -78383 -44823 -1237 13357 16456 -24157 -47943 -37776 -53744
9577 -53744 -84918 -106257 -106522 -60425 -15319 -44763 -76869 2915 23814 -15212 10354 17167
9565 17167 -29706 -38867 -56750 -51842 -32442 -26356 -38163 -27867 -41575 -25803 -17896 -17184 -27964
9552 -27964 -55641 -72220 -12568 9104 30798 37778 44885 26699 7067 6167 4352 69121 91629
9539 91629 161543 173631 109936 17831 -12859 -69344 -73627 -7793 26674 -17356 -94605 -109175
9527 -109175 -24907 9428 32468 23774 30761 26274 7926 23509 56704 133059 199873 196157
9515 196157 180893 175943 75548 30916 -44149 -48340 5966 -12945 27440 24033 -1901 -33176
9503 -33176 -45864 -92884 -91057 -82455 -69892 -89715 -116641 -66632 6334 35355 44479 3353
9491 3353 -47632 -46264 -23239 -12117 51599 79461 80232 73016 95604 89218 75242 35357 8046
9478 8046 -25540 7983 56757 26030 53952 82320 45818 6856 -26764 -47652 -51000 -38274
9466 -38274 -62349 -20460 -78140 -85288 -20834 1156 -32548 1015 31789 -4953 13315 16283
9454 16283 1817 -649 -27448 49313 120211 82171 85712 35333 39836 57602 67414 8714 19703
9441 19703 30368 37348 35276 32414 -10417 -28576 6559 15884 57171 93370 87416 3210 21720
9428 21720 37932 -25917 -22863 -49099 -53449 -48963 51369 78802 7758 -446 2437 -13004 -50830
9415 -50830 -70538 -20146 -62279 -38639 -12255 -48839 -21210 2852 16804 23175 36880 55963
9403 55963 73934 91638 79245 76056 72723 62570 44165 25204 24098 10573 29283 90115
9391 90115 100320 105515 100459 81308 47999 21763 22082 52549 36751 31023 61135 88931 67394
9378 67394 -2500 4671 73946 110732 82622 14648 -3660 19108 32299 42417 15743 7202
9366 7202 50035 39453 40651 97517 152690 174023 114525 53193 52992 16869 10588 -1299 -15186
9353 -15186 35567 -15409 -43144 -1063 46001 55104 27106 -18841 -12993 30536 -40114 -70120
9341 -70120 -35035 23511 101574 120366 123450 55491 42858 49424 62762 47886 33341 53650
9329 53650 57828 -5999 -11168 1911 46057 39424 25413 20376 33509 52442 88667 158232 149742
9316 149742 124915 127530 114748 70511 13808 27700 33383 51859 70762 23110 8118 25660
9304 25660 40726 97212 119036 49118 19339 63533 103250 39473 53614 104767 127972 131727
9292 131727 62484 -5952 -24797 2175 1221 33523 45513 21206 69068 103677 90894 105487
9280 105487 112359 120511 87518 52542 96759 149359 120072 101796 122293 115561 110529 70683
9268 70683 79008 112939 144285 110089 154207 158584 106046 62629 51195 121306 106082 132150
9256 132150 163445 169352 115152 54159 58943 93263 94694 41384 33244 52520 67163 60127 110023
9243 110023 135229 153281 133090 86650 133355 139293 121211 86485 60357 55497 86634 152245
9231 152245 164199 116354 96364 87491 93301 121178 143336 116031 150108 122970 163271 184147
9219 184147 215230 233619 215672 248173 252139 234693 261732 262880 185242 153014 191695 211906
9207 211906 212368 232729 229043 301903 305360 292249 295371 277876 258454 276682 270386 225437 218403
9194 218403 285835 330298 347219 309187 317754 342122 389682 394447 412548 506356 553280 544845
9182 544845 503587 486497 544591 574570 589106 591868 585052 623298 656351 749390 816634 860202
9170 860202 843926 830819 825953 878797 945398 1043694 1091296 1131442 1262244 1355763 1325022 1380311
9158 1380311 1472812 1594292 1753024 1865077 1997662 2130625 2296360 2522828 2727720 3010606
9148 3010606 3314325 3585312 3888116 4337931 4730953 5124048 5674788 6326663 7090800 7902799
9138 7902799 8846734 9907110 10954641 12009447 13088086 14036258 14756471 15235147 15333880
9129 15333880 15002656 14451590 13711717 12770768 11832229 10865063 9848822 8855368 7965513
9120 7965513 7144275 6553438 5953084 5385084 4847925 4361894 3988952 3669969 3387566 3124272
9110 3124272 2888605 2608964 2370172 2201991 2025614 1913535 1822259 1740375 1684692 1571522
9100 1571522 1460252 1357401 1283672 1265004 1207390 1173211 1063833 982097 888141 789133 753320
9089 753320 760049 773047 770100 739070 683568 585190 548860 510775 464356 415653 430544 450601
9077 450601 436939 435255 413149 405559 376202 318745 296913 325713 437057 463148 400911 329712
9065 329712 376864 381156 335743 334131 275202 210621 238594 261367 279753 217516 109527 163906
9053 163906 226842 259677 274444 227632 203817 224880 210480 208781 195183 212556 194668 203728
9041 203728 240129 232720 203361 156601 138270 168587 150509 161691 185186 126659 73204 61093
9029 61093 78559 83147 87711 74005 77976 109157 105411 113437 177047 169095 127393 98298 41903
9016 41903 78270 140292 149712 154810 120252 99693 82140 17988 12700 47116 59532 20194
9004 20194 32807 99945 125798 78739 86871 72522 56321 103502 120092 108864 120261 112945
8992 112945 175589 116360 27705 -30571 4356 87083 106227 70554 78153 73053 27117 -8701
8980 -8701 -10268 49295 37736 -10548 -5336 17705 13769 24709 12724 66151 124935 78955 21470
8967 21470 53240 75465 28925 27257 9986 -6099 -32479 -52660 7761 22867 -75212 -112234
8955 -112234 -47592 -23367 -16635 -15105 25983 33301 24704 95772 76503 39353 -44337 -105714
8943 -105714 -94271 -51682 20488 -26463 -15584 -8546 -33737 -68440 -34711 -5104 -46284 -43486
8931 -43486 -13660 33515 38283 112290 171532 153883 46653 -9245 -1554 -19841 -2653 43970
8919 43970 58985 60123 47211 55716 69119 63518 44509 -11054 -14247 51210 93654 103251 69898
8906 69898 67488 61455 16331 -63831 -56777 21655 30798 -6735 -33034 -42225 -46245 -79436 -84786
8893 -84786 -66904 -75267 -16221 36991 39330 34721 -5062 -47410 -61681 -67020 -84259 -96615 -17902
8880 -17902 -23073 -63353 -48360 -35504 -74797 -43060 -2854 -65360 -11159 43477 -6600 -123604
8868 -123604 -77457 -27643 -35125 1255 59497 108309 97270 34504 2726 16493 19980 28296
8856 28296 10368 -29863 5683 75753 81902 74841 27285 -14246 21403 89212 113872 87965
8844 87965 103090 94496 84956 6952 -58857 -46783 -37751 -65874 -90179 -75945 -8862 10151
8832 10151 24705 33847 46942 45947 35547 8710 -21504 -32698 -2699 -4751 -22225 -35190 -94564
8819 -94564 -90927 -29627 18031 55844 72179 24284 16697 36455 79353 92844 64190 55174
8807 55174 59899 9769 31479 38558 19902 -1411 -37804 -55796 -63026 -17962 16423 -6547
8795 -6547 -17746 -14701 56389 79352 56745 52712 59500 54571 4038 10427 11899 -21640 -8605
8782 -8605 38205 71243 -10468 20295 57041 2732 -13941 -23884 -20829 45323 84538 42965
8770 42965 -34628 -82807 -64565 12025 42001 80591 46124 25173 -13685 -5230 32630 49658
8758 49658 59582 5204 40461 86480 125631 126380 82391 57407 -20903 -49862 -66758 -27175
8746 -27175 8837 5561 45368 73243 45832 37496 57106 98554 151655 118900 61872 12451
8734 12451 6699 -37007 -52347 -33518 9090 11128 -41039 -40668 -11850 27191 56100 39793 -11157
8721 -11157 -54519 -39497 11158 -77676 -169253 -107756 -87265 -61508 -40200 9928 59503 60212
8709 60212 49545 65366 41947 -1015 32986 52713 20100 45647 34919 13710 8378 -15071
8697 -15071 -38113 -19489 -9542 26899 35315 -63448 -74401 -38249 -35689 -37014 -76192 -47938 15470
8684 15470 -24674 -67209 -98560 -54155 30023 -7490 -3616 57915 7481 -52588 718 54160
8672 54160 61967 42620 1613 -64168 -64166 -33674 -28228 -63214 -34542 -7765 -36690 -23726 500
8659 500 85413 69199 5513 9384 -6886 1248 -32464 -63822 -65915 -9110 93535 112504 109238
8646 109238 79553 89381 137447 195383 173084 90865 64514 99408 127601 141327 152800 130583
8634 130583 148631 195419 223369 241502 237267 274261 322390 382292 500781 761112 1210866
8623 1210866 1871000 2391169 2267451 1764063 1311968 947487 673691 541222 530581 518600
8613 518600 498457 442951 366973 346215 275784 259391 254501 212963 209184 198508 218001 206125
8601 206125 191809 176322 247351 333249 272046 270749 271704 254825 278658 262223 242401 318294
8589 318294 339383 354324 418081 491837 565565 637059 790551 1067262 1446362 2006332 3165710
8578 3165710 4720380 5289939 4370216 3156818 2353796 1837004 1575749 1517376 1723873
8569 1723873 2078241 2333307 2127087 1624089 1220261 916681 708126 584852 475698 441590
8559 441590 412669 347397 340017 310051 323108 357035 356588 366576 366573 377464 335201 275295 224040
8546 224040 227787 263955 276021 301072 367535 399807 463661 505848 565859 710616 931862
8535 931862 1331826 1997459 2532009 2364183 1797613 1314890 1095662 1105377 1271877 1717262
8525 1717262 2601363 3638367 3756118 2919029 2076246 1446606 1006063 787550 665937
8516 665937 502350 379742 306457 245416 231474 199589 190991 212679 189922 177477 128386
8505 128386 45538 56102 132995 122407 65917 26818 72888 146141 122013 53905 48815 44934
8493 44934 88263 68662 115420 196949 190597 185952 201787 187903 229939 303674 394286 586347
8481 586347 998528 1525884 1825914 1627120 1183812 771212 518951 347289 206858 72249
8471 72249 59248 62261 90867 118668 90508 94479 93712 39416 51511 12452 9402 44702 19068
8458 19068 -22161 -83815 -88338 -96112 -86127 -20850 -18556 -44330 -55777 -49464 -61446 -78756 -22753
8445 -22753 13315 52465 88973 109419 72857 5608 -61086 -1915 1193 -68271 -89499 -58724
8433 -58724 -957 55030 37792 36378 -294 -51882 -8525 47419 43719 -19651 -15691 -2263
8421 -2263 -50171 -67059 -62262 -59516 -81827 -62742 -2164 -23476 24940 24050 37788 2163 -11915
8408 -11915 -74854 -100612 -82621 -91854 -64482 -14288 17215 71283 30835 30153 34939 -22711 -2595
8395 -2595 16071 -833 -32614 -71577 -111512 -143394 -97824 -96345 -106592 -44940 2726 -21584
8383 -21584 -104880 -127773 -156344 -166513 -86986 -57872 -49698 -31150 14509 -8029 -67098 -64059
8371 -64059 -52721 -72938 -94831 -78711 -43089 -59677 -85289 -63304 -76442 -63169 -89591 -106971
8359 -106971 -133164 -70167 -10519 15805 322 17572 5500 47540 38190 21142 16970 -2875
8347 -2875 -7023 -40783 -81123 -68282 -1066 765 18826 17577 -23627 -60052 -37490 -27342 -53754
8334 -53754 -88114 -74391 -43922 -61105 -73110 -52185 -12225 -76087 -116915 -107414 -83991 -28042
8322 -28042 -27467 -31183 -76309 -87214 -82905 -121166 -138350 -121366 -88799 -29992 57820 23843 -4237
8309 -4237 6258 -2925 -44819 -60215 -57138 -55520 -69129 -13881 -10224 -4200 8305 26727 -9864
8296 -9864 -19685 2526 -23174 -7838 3992 -26982 -23685 -27349 -15725 -9978 20068 -23471 -38927
8283 -38927 23896 42787 16240 5816 -30966 14281 29189 88891 70108 84334 20971 24267
8271 24267 -3341 -18120 -56401 -59852 39310 35261 85516 157890 125007 87091 63131 37660
8259 37660 87461 49975 66558 48719 36493 51008 -11556 -41120 -37272 -93009 -93246 -68901
8247 -68901 -10233 -74579 -145672 -106497 -102950 -66867 12628 58510 27883 3860 -11196 -35496
8235 -35496 -92530 -45240 -22407 -12792 -9208 -10302 36774 44218 9725 11963 19704 27659 69312
8222 69312 105407 36709 -41340 -17261 3886 -6644 -3659 -47305 -57957 -22499 -46785 -116591
8210 -116591 -143459 -133733 -100964 -89445 -44340 308 25958 71772 48225 9303 -21664 16397
8198 16397 71665 29583 -49496 -79959 -19739 22502 24472 2484 42283 84480 59155 31918
8186 31918 34304 79206 38763 -37054 -111495 -118272 -57833 -23989 32910 41314 21802 28313 22912
8173 22912 2686 25579 79758 119326 92841 79371 65405 50701 93431 13310 -4645 21659
8161 21659 32184 57900 86420 72671 31770 14757 34791 37293 -6774 -14320 -44692 -80447
8149 -80447 -54257 -51377 -62681 -95361 -87055 -44198 -26160 -32023 -19237 25021 -6672 -16762
8137 -16762 32247 82433 17658 34276 25195 43195 38406 -20803 -24973 48548 41811 40457 42388
8124 42388 29206 -10266 -36393 -45815 -28535 -6985 -74811 -89320 -61606 -89273 -35029 -12093
8112 -12093 -12219 -34461 -40526 4034 24026 -18112 -10356 -18049 -24547 29749 69718 46975 54926
8099 54926 79992 64090 31098 21325 13956 26472 73515 86230 22183 -4438 16992 54431
8087 54431 77679 38226 24912 -28778 -30061 -22129 -65903 -147562 -82849 7122 42541 54495
8075 54495 61862 7113 -62263 -71942 5465 79239 117211 144788 82975 90136 126783 123904 91435
8062 91435 82912 110694 98052 27346 -19761 -49344 -39372 16699 -10633 -17105 3984 -19485
8050 -19485 -53196 7115 4603 -36831 -10217 33594 48347 70061 31853 1294 11503 38144
8038 38144 16667 108684 134160 127540 135827 50043 28202 96880 105712 85291 62761 74840
8026 74840 74803 103554 125880 105613 24735 -7310 9748 10435 35903 47880 66994 63716 75668
8013 75668 91555 81254 48207 27962 14183 14536 22957 13417 14082 -12359 -56576 -88253 -79385
8000 -79385 -36711 58864 56102 4456 3073 -25117 -22611 -41854 -49990 -73724 -28043 39914 20101
7987 20101 -2910 -28519 -47998 -67148 -68675 -73227 6448 43947 20808 -35765 -12431 25620
7975 25620 63299 48236 16510 57759 85054 93933 85549 53356 -27533 -17448 17568 -18487
7963 -18487 -63866 -68807 -25078 13047 105510 112430 123229 106340 89375 62067 45935 72380
7951 72380 40166 54415 79187 52647 7111 15426 -1627 42969 102106 123374 108616 103358
7939 103358 119460 113625 59455 -18970 -74028 -78769 -13561 72053 99755 37653 -31946 -64046
7927 -64046 -92058 -105199 -39241 -66424 -114549 -74291 22414 84678 72935 -14063 -26624 149
7915 149 -14249 -15708 -2687 20821 49764 -12703 -35770 -32173 -23299 13315 33289 1488 -45498
7902 -45498 -30697 -14445 -66906 -73276 -43475 -65334 13252 75979 19508 -27656 -61939 6886
7890 6886 60225 68528 53999 19400 64816 110562 138366 89958 25080 -3233 -18768 -32546
7878 -32546 -7960 20181 73774 107666 64509 15042 13817 31567 44426 14165 43434 87472
7866 87472 31956 -69034 -78831 -82050 -99766 -44596 57562 84600 91222 53621 38586 50932
7854 50932 28739 -56088 -98173 -101777 -60344 -27277 18342 28530 56969 43200 14089 -2489
7842 -2489 -25552 -4197 1459 -30978 -27298 -74172 -99945 -63302 -9785 208 -67768 -98315 -84324
7829 -84324 -73688 -73871 -748 20776 -54407 -103751 -41561 -33139 -29366 -42590 -60030 -49746 12146
7816 12146 -20800 27874 507 -96395 -41062 16645 75278 80053 67541 39234 14207 -22345
7804 -22345 -34780 -66688 -59781 -12172 -8602 37790 56428 -25894 -13431 11301 9373 -5769
7792 -5769 -29612 239 5800 72867 154810 101967 72548 83069 41032 -16618 -12080 -12469 -7913
7779 -7913 15668 8077 -17280 -11135 -15051 -18961 -34686 -71193 -105995 -117774 -65632 -5029 29774
7766 29774 -11412 -45264 4475 40302 9747 -24271 -5934 -16713 -39352 -33956 -32083 2960
7754 2960 34063 26523 19436 24629 31430 17871 4070 23811 89040 87628 16318 -37812 -72134
7741 -72134 -60521 -32258 2451 44623 21763 17428 -40176 -105963 -89665 -16135 10561 57050
7729 57050 73074 61453 6617 -51581 -39449 -30794 -27357 564 -79863 -108934 -86957 -55401
7717 -55401 -50020 -27455 -69448 -104027 -46566 -15838 -31695 117 -15291 -84401 -171235 -215569
7705 -215569 -202588 -86164 -25626 -30656 -19816 -72395 -104200 -34504 21631 -7571 -48725 -79306
7693 -79306 -101955 -55972 -52645 -40629 -65588 -69710 -61209 -44239 -1097 18314 39864 43055 70796
7680 70796 48774 15859 37650 -32255 -99094 -100645 -26450 10399 -21160 -52712 -95901 -96441
7668 -96441 -31027 -7425 4772 -1489 39070 21648 8166 -55788 -62490 -56883 -85611 -60952
7656 -60952 -65516 -65852 -39580 -7835 -79061 -130437 -129230 -48755 32763 63745 82490 43075 -26924
7643 -26924 -28869 23606 51172 36181 35391 38353 47215 61718 57521 16253 -54175 -49178 -14579
7630 -14579 18974 -2315 -41339 -40492 -86589 -65707 -30030 -29772 1169 54041 56150 5884 -27480
7617 -27480 -56652 -36353 -28238 -30331 -16018 -46495 -94696 -104231 -44223 -33169 -62537 -4651
7605 -4651 10839 16409 3303 -50941 -51930 -4146 -11934 -70222 -135199 -91299 -51874 33453 90909
7592 90909 101376 118194 110348 68583 16187 -55840 -84523 -114030 -60576 -27569 -59554 -42722
7580 -42722 -10116 28858 66826 34617 -15248 -26712 -11121 -10547 -51566 -90932 -73586 -40997
7568 -40997 -32659 -38858 -46191 -96872 -69026 -87261 -84388 7608 37977 25708 42178 67648 -5282
7555 -5282 -26090 18286 52761 18420 -12446 11628 41341 84765 79675 42289 49769 33287
7543 33287 65041 82664 41106 96403 107961 70948 23799 -28495 -9963 16690 28244 -33255
7531 -33255 -11373 52418 55827 33273 41717 -5423 -16637 -53153 -81879 -93865 -20784 -31115
7519 -31115 -3304 57571 49902 56056 53503 25000 6015 43491 27556 -17935 -57906 -23855
7507 -23855 36033 22638 21294 -4730 10010 9608 -19406 2672 25051 -13157 -50144 -40383 -41146
7494 -41146 -105340 -89140 -41839 -14937 -10260 27777 29808 44138 55659 49377 171 -16859
7482 -16859 17114 -49806 -56033 -19613 62222 153238 163157 131135 68746 12067 -33156 -89099
7470 -89099 -83304 -87416 -50840 -33760 12834 -181 -60134 -35604 5074 26336 1948 -39181
7458 -39181 8740 3475 -9215 -36084 -41354 -18804 8326 -12263 -27045 -9572 -462 -10080 -2537
7445 -2537 -12161 -41366 -53559 -46982 8842 27442 18546 13494 45529 39383 47328 86311 101058
7432 101058 75964 9323 -21056 -27438 30227 28795 -18966 -46601 -71602 -36171 -32722 -54399
7420 -54399 -48840 -44354 -50999 -6810 31558 33019 17919 -8572 -17173 -8070 -9280 18095 49869
7407 49869 2141 -29418 -33358 -58646 -68686 -103594 -81413 54172 41392 -18709 -46325 14910
7395 14910 73415 5064 -16504 -13916 -2936 -13003 41141 32188 74274 88142 76058 132791
7383 132791 112119 87097 51883 55971 55186 49568 56806 60975 90104 24612 -17619 -5477 -35342
7370 -35342 -85678 -69655 -22729 -44266 -42854 -80636 -93386 -133884 -137463 -96039 -44798 -26151
7358 -26151 -42510 -75151 -86941 -82881 -40480 -21317 -28580 9185 -7162 8655 -11724 -12226 27
7345 27 26933 -16143 -76649 -72904 -34398 -24717 -24090 -10698 2403 24456 -60131 -145030 -124529
7332 -124529 -88967 -71230 -79131 -39437 -6811 11748 -16814 66259 125099 14409 -65672 -134584
7320 -134584 -174729 -174318 -136835 -119423 -76418 -40392 -17103 -22015 -83013 -116558 -132027 -128259
7308 -128259 -110861 -113846 -117783 -66440 -29810 -53583 -45938 -55158 -75068 -80976 -109632 -62369 -8611
7295 -8611 11834 -14559 -74578 -25660 38017 4461 -32501 -103623 -149531 -148275 -174875 -148412
7283 -148412 -147277 -161885 -120803 -60456 -67949 -90152 -131205 -100205 -25988 22751 35693 -61041
7271 -61041 -69820 -55124 -26153 8870 63248 34079 15015 3113 34110 8220 -22720 -20699
7259 -20699 -45559 -42602 -14504 28489 92921 88243 86746 80230 45465 14733 -12637 3385 58159
7246 58159 111661 82675 17790 9210 14969 20913 13016 30916 30347 11915 58450 24747 -5783
7233 -5783 -2932 -10791 -15558 -69085 -63489 -64503 -80568 -61088 8998 -4804 -9985 62633 61316
7220 61316 104725 77841 33882 22338 -31775 -1963 12054 -26211 -56164 -36708 -23163 -20731
7208 -20731 -83155 -75996 -67240 -26789 -59821 -106289 -23161 -43789 -34313 31441 79399 65987
7196 65987 29329 -7924 -31264 -48949 -21508 -67118 -32653 14099 40290 43277 5241 25780
7184 25780 -2452 -2354 27791 40768 39175 52897 40645 7193 25672 11645 -13071 -30736 -44660
7171 -44660 -14992 -1084 39155 69895 29456 26269 26862 36012 25037 22272 41899 -6295 4214
7158 4214 -1305 -17580 -3099 8347 -30316 14374 -4616 -69561 -80298 -76925 -60432 -4471
7146 -4471 -6215 -57010 -38498 26842 69273 38352 -50633 -92315 -36863 -26918 -57770 16942
7134 16942 52991 45549 12724 -13978 -3898 -43596 -72517 -11048 11817 36770 39514 26216
7122 26216 13682 -26497 -60843 -100366 -40048 49919 101787 58850 27680 51032 107780 114543
7110 114543 128735 132786 62475 -30074 -4029 7115 -8098 22573 48007 27526 10768 -62069
7098 -62069 -30301 27667 5592 -15799 -10045 13668 53766 -17663 -53652 -58501 -18542 -9617
7086 -9617 -9282 61108 82104 45826 -36153 -90809 -70218 2464 -25228 -62967 -60435 -19996 -19783
7073 -19783 -36295 -33977 -7202 38539 -21935 -64050 -38775 -12057 -11999 6319 28392 41707 78133
7060 78133 84935 58112 22293 1967 19822 -24152 -37163 -58437 -71767 391 14730 29276
7048 29276 58433 -13034 -19829 -31885 -10187 -1743 -37432 -14224 -35020 -60471 -108013 -60755
7036 -60755 -3372 34091 29430 69256 49910 38137 43105 27800 7164 -85808 -100176 -29628
7024 -29628 5903 -65716 -104263 -100675 -101412 -57036 -3423 6390 10405 -12893 35964 43146 -28266
7011 -28266 -42173 -8153 14674 4459 -39170 -39074 -13776 -7822 -1168 33742 11382 -34565 -73919
6998 -73919 -34569 -29468 10113 9102 -59333 -102886 -106350 -140010 -118497 -52066 -37523 -46639 -40460
6985 -40460 -57190 -52937 -90241 -57997 -14971 -6592 -15656 -10892 3601 -32183 -44554 10496 34142
6972 34142 74456 38512 39992 61707 40521 10015 11430 35753 60116 87744 128377 96030
6960 96030 16835 -30144 -33469 13186 11618 -14958 -44256 -34697 -20458 27950 70580 18089
6948 18089 -25073 -67447 -18418 12518 -29358 -7337 -635 36056 62168 62889 39567 60307
6936 60307 15974 -50172 -77710 -100652 -3725 12158 -99836 -115857 -100022 -64333 -33198 67008
6924 67008 102726 83939 37591 68605 136365 100646 69461 104020 98328 91530 72107 73592
6912 73592 71425 4491 -54699 -34699 667 -13768 -58707 -81411 -61415 -60891 -25231 -15920 -30403
6899 -30403 -13791 -15421 -55927 -95751 -127130 -153994 -140782 -97954 -21765 33801 67795 26888
6887 26888 41301 48487 92260 72446 -3637 -22499 1352 -6644 26721 34218 -3611 -687 -15213
6874 -15213 -37413 -25827 9300 -2578 -40723 -44212 -47683 -41372 -59219 -62683 -88498 -56549 -32881
6861 -32881 21548 58234 -11260 19382 -6932 -9933 21593 -45936 -61992 -67088 -19440 -36068
6849 -36068 -35430 -55935 -46747 5085 33840 51473 43107 34218 21050 43347 46610 21678 -31159
6836 -31159 -37229 -73793 -74988 -38654 -39225 4164 -2340 -25734 -22653 -32935 10896 17641 -46125
6823 -46125 -78114 -94354 -106079 -63182 -2255 -28766 -93571 -86916 0 25949 -27060 -99476
6811 -99476 -159169 -130960 -84407 -27421 33058 9028 2025 39998 20596 -37434 -57045 -27893
6799 -27893 -6982 30737 -74105 -73779 3930 2586 6711 -4762 -107935 -170065 -94375 -60869
6787 -60869 -40443 19705 27855 41031 33676 -16707 -8773 572 -28809 -39969 -31604 -16707 -42096
6774 -42096 1365 12722 -3728 -6117 -38471 -87366 -82962 -50119 -14074 1352 5881 -3832 10873
6761 10873 6086 10664 4961 5468 14428 -34993 -74107 -86224 14757 35874 47087 30450 -49727
6748 -49727 -76647 -54070 -13046 8811 54909 -12533 -77329 -45844 10799 12977 9848 -33410
6736 -33410 -54049 -18709 27706 2528 10000 -14609 3830 -33527 -45018 -28548 8672 42214
6724 42214 32021 49451 71894 39667 14188 -3353 -15836 -2983 -135 -28750 28751 -29997
6712 -29997 -109943 -127093 -97955 -23805 50804 102862 47119 6064 -24081 27118 56150 56641
6700 56641 71394 61452 49757 42347 -8438 -62097 -76742 -28651 22960 5997 -3075 -27256
6688 -27256 -42336 -22736 -15995 -69561 -55517 3804 13238 -2930 -8887 12296 39138 21319
6676 21319 11495 12183 30453 14739 -15432 -3034 5202 37001 53731 64869 20516 4720 -38523
6663 -38523 -69862 -94767 -84871 -73076 4456 68242 112903 28583 -85299 -75308 -3082 45333
6651 45333 52222 52979 33374 -51999 -86423 -33954 11640 34051 12632 -36480 -44322 -16574 19990
6638 19990 85299 62064 16391 3141 35939 29131 -13776 -37208 -41610 -61707 -41694 22249
6626 22249 -18129 -43846 -62713 -41767 54769 14091 -41683 -61747 -78368 -65127 -66207 -37982
6614 -37982 -55566 -85335 -84688 -35421 -14681 -50511 -71875 -39952 -63743 -78212 -52408 -8101
6602 -8101 -22551 -1383 -1200 -14865 46826 62713 74993 81146 44024 54379 107872 88274 65651
6589 65651 76272 107884 124742 117560 78933 -2338 -30481 22596 83203 68394 119480 158189
6577 158189 174162 105387 28653 61712 71788 57997 58347 13954 -19673 -24876 6795 35004
6565 35004 17292 42138 62566 23221 23644 9959 2291 4198 15317 18966 -14473 -15114 31685
6552 31685 24097 63327 95075 82013 67881 18358 -12444 8335 -16839 -47678 -3126 1780
6540 1780 -25751 -12712 3412 -1642 -22386 -10553 59835 32261 3774 35476 43054 34254 21624
6527 21624 43238 65594 66774 53730 -6905 -30176 2592 16781 -18639 -4098 -25376 1559
6515 1559 4628 -73201 -88779 -81339 -62183 -100144 -106408 -33028 -4682 -48261 -78854 -52569 -9293
6502 -9293 -30545 -51705 -2572 36628 9272 -33434 -49801 -65919 -135263 -149109 -80897 -53049
6490 -53049 -27716 -60331 -117983 -105233 -83613 -78787 -123367 -108360 -77180 -94297 -94619 -119328
6478 -119328 -105034 -38828 -34478 -29466 -7561 -27376 12060 31821 27739 2464 26497 69497
6466 69497 65760 58466 57037 63839 74242 61238 6025 -28395 -32557 -66311 -85319 -91583 -21717
6453 -21717 51149 70494 105822 64337 37627 -21568 -8958 8826 42355 94321 123274 144110
6441 144110 131314 112000 103530 93881 52491 11334 -2296 -29525 -54568 -66901 -93551 -101299
6429 -101299 -83747 -55035 -28845 -5528 9865 -2719 -53567 -58589 -39171 -42358 -68265 -95693
6417 -95693 -111728 -105547 -74381 -49235 -40012 -57483 -22384 -38064 -27240 29424 38342 -7535
6405 -7535 -52060 -56935 -36957 13706 7387 -10692 -15212 4577 -32794 -62008 -57979 -83011 -122898
6392 -122898 -70203 -31336 -15052 28411 40598 39084 33689 -18155 -66681 -87615 -68218 -5081
6380 -5081 -68228 -58151 -86794 -63968 -15393 512 20638 71617 76577 19773 -53355 -24079
6368 -24079 -19571 -24036 -6856 -22239 10957 3856 9167 -25291 -12299 -30363 -20174 -50829 -67441
6355 -67441 -30041 51396 32212 -33455 -110350 -118370 -19841 -8488 -16251 -13802 36057 53563
6343 53563 19463 -64649 -50006 -23737 18184 11742 36168 -4856 -46857 -20572 16964 -22363
6331 -22363 -35425 -13055 21794 11616 -1342 30146 -3105 -17641 -37445 27636 49415 15730
6319 15730 700 55261 106597 27831 -49157 -70358 -65684 -26586 -18967 -40110 -96140 -43504
6307 -43504 45710 91258 64249 41651 2344 33419 24399 18314 52130 54938 37033 68336
6295 68336 58337 50377 73527 44240 38138 25134 21202 28637 -44006 -22961 41084 31230 75388
6282 75388 27206 2963 69040 44716 -3084 -4150 13626 -17674 -57526 -51231 -40008 -13213
6270 -13213 3102 22875 18929 35994 -9643 -39189 9157 96261 133866 111633 50915 37311
6258 37311 29509 15216 19929 -14367 -21591 -5844 43324 98690 60744 57045 74692 72868 9490
6245 9490 -19213 -18285 53088 49928 16465 14213 9215 -19058 -62422 -19667 7117 15817 -46158
6232 -46158 -46538 -1631 -15212 2167 30696 27485 55933 76305 86015 47129 23397 -13306 -75728
6219 -75728 -912 57501 34594 18523 95297 163030 129703 44151 -4575 -21025 -11634 21024
6207 21024 72959 50714 30278 6869 55184 111101 143653 124702 104417 150448 147473 75260
6195 75260 21458 12545 29840 18324 -17176 40176 102297 107623 61225 5088 7867 -44404
6183 -44404 -19837 60071 94194 75097 29051 95103 138739 93231 41286 54641 23132 -43079
6171 -43079 -36832 -34334 5003 21544 -2635 -38448 -40283 -59699 -77165 -62155 9374 30086
6159 30086 -22901 -73176 -91643 -58164 -22906 -15650 -551 -3607 -2990 -11424 -34987 -65278 -5408
6146 -5408 40339 29233 -14397 -2122 -16604 2126 20072 -31564 -78644 14361 107829 172779
6134 172779 164011 149552 133705 39364 -7818 -26169 51056 53783 85059 74165 57631 42375
6122 42375 -8474 -24324 33133 85962 106581 106515 74392 33432 -11391 -12500 -16100 -45261 -40222
6109 -40222 -60810 -48904 -49250 -70336 -51352 15804 12909 -22564 -30055 -48334 14231 58872 86562
6096 86562 98807 119480 163170 68740 -15003 -16504 -64811 -55594 39921 93388 59316 46823
6084 46823 416 -20630 4722 -42121 -17720 46 1205 40488 11413 34520 19266 36457
6072 36457 40230 21038 56743 50054 52531 27387 4905 55976 38430 37311 16830 -32551 -7640
6059 -7640 -10137 -645 -6745 -55560 -44276 -31603 -92065 -102992 -64535 -72224 -43651 1704 17083
6046 17083 6941 18952 29497 -11463 -10400 -47337 -43937 -12254 9150 -33628 -71953 -124593
6034 -124593 -152892 -161210 -126059 -98234 -45039 -19261 6716 24497 61984 52325 11966 -20227
6022 -20227 28164 72149 70406 93730 41814 30685 46164 69009 92885 101819 58078 29277
6010 29277 69927 98243 113748 46549 -22019 -4322 -15419 -11196 10955 8918 22206 -12991
5998 -12991 -63940 -48746 -28509 -9414 21389 24468 80969 79153 -31135 -44893 -76416 -59509
5986 -59509 -9761 7151 34197 11240 -23992 -23263 -44443 8164 74193 117386 124306 89607
5974 89607 38636 10441 7870 23361 69041 71135 36774 -786 30900 47060 41034 26614
5962 26614 12790 3606 -17951 9040 50796 67702 11941 24446 51789 21963 -26242 -53682
5950 -53682 14103 90300 45099 16876 42637 66739 61127 81271 89112 35179 11261 -5674
5938 -5674 6321 6825 -21517 -30721 -39125 -48122 -21270 -44883 -59195 -42804 -26024 -161 9065
5925 9065 -25294 -16577 28774 -26619 -50472 -39281 5815 5111 -9461 -7329 34168 106304 51096
5912 51096 -28266 -56199 -67519 -98937 -114008 -100470 -65859 -42536 25774 61997 61485 35819
5900 35819 25904 28728 60679 -2101 -55519 -77442 -33426 -6329 -1872 12175 3675 -30792 -69690
5887 -69690 -38992 8350 6229 -16919 -16485 -17205 3038 -37526 -26313 -23277 51402 136478 155610
5874 155610 117738 143248 98644 91638 38206 -22315 -31139 -29747 -44837 -32207 -24700 -24168 -22598
5861 -22598 27361 -1107 -35341 -32991 -12846 -14585 -16151 -14374 -37278 -69699 -76156 -90455 -58656
5848 -58656 -30846 -48545 -87522 -31292 -36116 -82783 -94003 -95664 -57195 13839 -10486 46678
5836 46678 108395 52643 60547 37647 -10753 -38594 -72980 -121590 -79235 -81176 -67157 39287
5824 39287 63143 59512 -30802 -1035 -18041 10356 -11621 -3026 -43298 -61174 -56421 -7089
5812 -7089 -26551 -64696 -36436 14436 20540 -23378 -32534 -33762 -1538 3708 75308 79126 12102
5799 12102 35726 8398 -33762 -28506 -23328 -1225 -30403 -46241 -32730 -58941 30551 83541
5787 83541 105273 136295 130905 109825 67460 473 -15399 11040 -25441 -49 70939 92843
5775 92843 43807 12692 -19191 -39951 -86117 -106936 -61683 -34837 -24803 -57960 -63991 -111814
5763 -111814 -117988 -31299 8926 22379 40309 35311 16965 13897 43974 34387 -23967 -57527
5751 -57527 -64295 -52867 -37830 -31115 2563 -11875 -30032 -27458 33318 13724 -54474 -11030
5739 -11030 8812 -19352 -45498 15073 16426 22006 28750 35801 45422 -6852 -58816 -84021 -43865
5726 -43865 -42765 -59536 -73497 -60639 -87235 -111490 -97440 -61992 -17464 -18719 -68985 -3062
5714 -3062 33182 -35236 -41510 9722 -1280 27171 35937 -18625 -29194 4032 2324 36434 77714
5701 77714 45920 -7980 -43246 -63310 -23457 9072 19410 60036 -21218 -90799 -22304 -6729
5689 -6729 -17364 -52833 -28717 8846 40783 54829 11109 5743 39373 22227 33240 83431
5677 83431 72722 32957 35589 -15550 -6338 4519 -3653 28047 17402 -634 -36128 -67432
5665 -67432 -87855 -70019 -74556 -56003 4601 -6325 -65407 -39211 -33816 -16645 39696 34659
5653 34659 48108 99642 40428 40858 34841 25706 -30653 -94933 -88862 -73775 -125287 -99974 4710
5640 4710 48402 60994 -8044 -28347 -22758 -13937 -21117 -40060 -42171 -43020 -63093 -30441 -29573 -14114
5626 -14114 42606 59071 23240 43098 60900 27971 10377 80857 131129 55929 31705 78034
5614 78034 97016 28746 -19531 -3390 15317 24144 67710 58467 53562 4515 -19010 -35376
5602 -35376 -82638 -94615 -68123 -85504 -100528 -50607 -23572 -15575 11108 48179 46187 60204
5590 60204 62489 10819 -28205 -53715 -56869 -53224 -27254 27361 -17551 -25037 -24396 -39415 -20845
5577 -20845 -26576 -20006 -26499 -14828 -7933 -9532 -43373 -36310 -54733 -296 61243 66494 75658
5564 75658 79051 66515 63572 77695 53720 58681 79868 55556 41654 -47000 -125058 -116977 -66694
5551 -66694 -65035 -103256 -27534 -2408 230 -120620 -142713 -59224 -18495 -45041 -52806 -47168
5539 -47168 -95237 -64391 -3009 -11503 1115 4294 20056 22714 28749 13226 6160 48337 78663
5526 78663 74993 60351 41726 59876 77520 78504 -15941 -48606 -58029 -16643 -47204 39191 30317
5513 30317 -61364 -107398 -89774 -78072 -32685 24512 35576 30282 12279 -1214 -24132 37927
5501 37927 37002 43951 54860 -432 -45812 -12931 -32771 -39689 -21453 -12572 -17763 5294 -42434
5488 -42434 -93863 -96566 -75965 -52939 -41555 -52159 -85306 -103613 -63224 -44147 -20764 -14015
5476 -14015 -44408 -31338 -53156 -50441 -17130 -24417 150 -20082 -40946 -52129 -43927 -22606
5464 -22606 -5853 8651 35717 30901 -7560 -14873 -11808 -34643 -296 -57094 -101069 -35407
5452 -35407 6083 -15755 39710 63416 43579 8407 -3110 -22284 -13903 -4693 -41720 -40911 20325
5439 20325 3607 -44530 -90659 -87661 -36369 14084 26402 -3745 5531 -4795 25999 94362
5427 94362 68534 67042 73787 122605 128545 87397 10105 -87714 -49742 21460 -30387 -47127
5415 -47127 -6791 10340 5831 -1681 6224 27562 34820 41141 32195 58915 -17378 -55616 40333
5402 40333 55516 41215 -10728 -11595 -3368 -58220 -68571 -69214 -31068 41221 39988 11380 18764
5389 18764 55835 78801 77245 62991 83076 106613 95586 47374 49873 43769 57730 62033 72813
5376 72813 17912 -6187 -6119 7486 -14972 -54273 -69169 -60515 38268 44317 79721 42097 -17424
5363 -17424 -44415 -20221 -9057 -777 -10969 -63763 -27601 -3129 15041 10895 -53717 -41853
5351 -41853 -58944 -22349 2045 13106 62642 16639 -4581 55446 62151 35574 2213 -9914
5339 -9914 -24798 -25019 -24066 -48854 -87487 -68645 -97989 -82281 -39588 -32719 -36127 -18624 -24062
5326 -24062 -29448 7145 47674 17087 -17106 -43552 -30137 -21048 -8778 -24506 -17112 25474
5314 25474 11067 45151 94846 84649 58977 19088 41377 8077 -19765 -48996 -73806 -66180
5302 -66180 -46737 -42238 21015 113072 88029 28798 -16727 -52494 -64586 -14706 46716 114943
5290 114943 109569 676 -59160 3246 80318 37976 -20816 61623 117992 132693 147396 52906
5278 52906 -22819 -33088 -56758 -51935 -55272 -69447 -91267 -99543 -92837 -9959 58519 65714 41236
5265 41236 49917 63362 13057 -33122 -18719 -20971 -38908 -20973 17822 42309 18971 29645
5253 29645 43655 128821 117801 95195 96566 52543 15221 -54244 -42524 -4532 23832 31596
5241 31596 -6675 -12030 1813 19630 47424 94736 102257 89544 68904 50990 24191 -3777
5229 -3777 -2485 -16865 -24316 1518 -8621 -60443 -85457 -74775 -99318 -129876 -92803 -111655
5217 -111655 -80659 -131124 -151186 -122327 -36658 636 -65490 -96772 -45843 -27656 -49591 -69636
5205 -69636 -112304 -65047 -69356 -72924 -94203 -110034 -64588 -63076 -78663 -91755 -49738 3750
5193 3750 27316 26546 -28528 -18723 3779 -3275 -1606 29581 61360 36936 32606 38440 105909
5180 105909 91679 42141 10749 -38260 -43782 -28677 -19168 -36260 14101 37977 56738 30833
5168 30833 35267 31562 -14539 -22301 -937 10858 34433 22868 26131 38870 -25039 1122 -21584
5155 -21584 -19707 79570 77569 30051 6833 -5922 -40299 -72735 -116054 -105037 -31701 -47250
5143 -47250 -3708 40497 48221 -21353 -3953 -6398 12986 14352 4149 -20744 -43329 -16285
5131 -16285 -9402 -32923 -41133 -44589 -29207 -35691 -34195 -48368 -67975 -50685 -54656 -58103 -7996
5118 -7996 60410 135419 142937 75542 40474 63454 21371 -64799 -86797 -74654 -57784 -43971
5106 -43971 -82581 -94821 -74577 -81260 -84297 -53739 -56171 -85558 -54183 -23817 -36155 -7190
5094 -7190 32728 50889 3627 30304 -11781 -31199 19301 42842 61568 74088 53528 54775
5082 54775 11407 -36517 -56331 -4116 -20095 -30705 -645 46203 76829 63266 13646 -38459
5070 -38459 -31038 -36513 -54809 -9425 18903 17861 -75929 -96334 -59406 -12341 -17606 -29314 20083
5057 20083 11725 -46102 -11167 -36265 -41760 2077 67590 64838 33620 68851 80685 90398 114593
5044 114593 97760 79245 47648 -37118 -23382 -17803 -10156 28327 87 -31096 20295 36496
5032 36496 8403 14588 55335 59205 30692 -25775 -51388 10195 -43679 -72586 -56651 -36776
5020 -36776 38290 49193 -19052 -41220 -34195 -5938 57124 65863 25347 -19731 -26987 -31321 -14176
5007 -14176 39679 97564 46352 -19689 -14777 -22362 -35399 22100 46201 66709 36840 3839
4995 3839 -44425 -37756 -11605 -1289 -43013 -41918 -39126 -57165 -26690 31140 43861 -40514 -36619
4982 -36619 16291 -19388 -53824 -30914 -47402 -54049 -54148 -52089 -40399 -8922 34924 45032 63614
4969 63614 48331 8344 11656 33098 2661 -17034 -22226 44588 97918 18040 -40158 -23699
4957 -23699 19243 32136 43582 25686 -7382 -35213 -38520 -10356 -21845 -1737 -24210 -26959
4945 -26959 -4909 34379 -50501 -43742 -6291 9726 8454 40818 9206 -10021 -52930 -69216
4933 -69216 -60490 -14892 24860 60922 13786 -25448 -44108 -66628 -44065 -57783 -59490 -73815
4921 -73815 -41568 29382 64079 3186 10585 58676 43550 -4814 -17176 19256 -21052 -96870
4909 -96870 -90997 -91580 -53928 -27848 -28859 13594 17039 -45050 -103608 -132933 -94670 -40015 -25433
4896 -25433 25868 40893 8733 5489 26650 -47797 -116475 -59914 -14489 -21618 -34983 -19370
4884 -19370 -58026 -48341 -39421 -34288 -13024 13205 -26862 -13344 24405 16025 23393 42337 34897
4871 34897 3482 334 46277 79283 -26726 -36287 21680 -1262 -74250 -36083 8938 -21575
4859 -21575 -38172 34716 75359 54482 -29977 -85002 -125199 -135373 -126392 -58495 2950 85827
4847 85827 72301 48094 45489 73861 18189 4174 -4290 -62285 -40377 -13902 -16663 -95364
4835 -95364 -116273 -65559 -39658 -56298 -104458 -120706 -52713 -32111 -39199 -56729 -31045 37374
4823 37374 111627 49053 -43034 -85207 -110217 -140672 -145565 -75856 -5446 88261 107059 51937
4811 51937 23614 -13218 -6486 -3695 -39103 -22763 -7189 -37308 -22328 -110 6610 -53892
4799 -53892 -39867 10143 74000 54924 -30213 -49227 -29717 7657 47606 35658 14680 -2617
4787 -2617 -46137 -57172 -56595 -34926 -99340 -151401 -95869 -68305 -59910 -70937 -88936 -92925 -40414
4774 -40414 8025 21854 11567 34749 66710 55333 -9390 -64164 -44297 11631 4482 -6849
4762 -6849 9214 2999 23664 -26767 -66553 -84412 -81034 -44016 -7543 -9937 -32748 -49120 -14419
4749 -14419 43993 58043 81584 69440 35009 7366 22515 -35705 -10667 23202 -19230 -85413
4737 -85413 -41997 5994 6906 -24084 -56474 -44687 -50115 -40153 -50610 -17293 75740 84829 70899
4724 70899 36265 82751 81498 13808 -13199 22516 34406 40650 3456 -84350 -78307 -44798
4712 -44798 -18384 -16409 -42834 -19295 -12934 -6087 -17968 -49884 9930 70401 60148 28300
4700 28300 3440 -9169 -74073 -73162 -46279 -17136 -11551 -16267 -3787 -2942 23145 50460 58585
4687 58585 11057 -38818 -34953 -58336 -56021 1144 27829 -39138 -46307 -50789 -46541 -8444 -13167
4674 -13167 -53451 -49808 -14334 23573 115100 110873 87435 37882 -42314 -42443 -10839 -8299 15863
4661 15863 6331 23278 17569 42614 104412 96446 53525 92263 34234 -33712 76 46446
4649 46446 52446 26170 49554 52083 71640 117771 142915 161300 142984 158386 162134 115358
4637 115358 49423 24484 11729 73178 80797 60232 33266 25098 25006 33380 -14580 -17280 35070
4624 35070 32702 23562 -26311 21113 108992 77663 -12609 -22160 5550 -16441 45664 86219
4612 86219 51271 43212 114534 60160 67566 51840 17334 3144 -28563 -13086 -12938 9494 12446
4599 12446 -24188 -5901 -6326 83501 59874 32667 -22149 -18519 35300 32165 23693 35493 55382
4586 55382 58497 45963 -17963 -75051 -77999 -29715 -35735 -20732 -18442 -27527 -34105 -12043 -4655
4573 -4655 64212 16600 -42643 9956 7623 27630 22391 26241 107065 158149 112996 56718 40755
4560 40755 67689 53180 33528 58704 108058 37412 -32114 17668 20753 -27584 -51042 -47031
4548 -47031 -70388 -31337 24403 723 -12847 -49351 -37917 -69273 -23370 35821 24934 3451
4536 3451 -23126 -54494 -61872 -64208 -46494 -34730 -88628 -105171 -51142 1725 41546 42232 3118
4523 3118 -16965 -16439 39781 67345 71171 21757 25140 -1227 -59069 -20092 -1239 -21009 241
4510 241 -37158 -118639 -101646 -22327 45906 -8246 33754 79254 38415 -28149 -40184 -2821
4498 -2821 29204 2745 -47711 -46470 -30974 -65275 -48335 -50216 -58836 -73144 -86984 -39322 -16495
4485 -16495 -29743 -28699 -258 23615 -35308 -62294 33466 80661 7097 -69455 -86848 -15929
4473 -15929 -7748 -12454 -4422 -45846 -22735 852 -52481 -106733 -66482 -11673 43713 78237
4461 78237 -13251 -72068 4730 7824 2373 -21084 25864 36709 39423 73346 94124 48749
4449 48749 -2802 -23176 -4125 18237 15947 10000 -975 5971 5014 16930 13111 10359 -10779
4436 -10779 -38162 -74243 -43689 -29808 17113 9907 3638 42988 -42714 -67649 -49372 6253
4424 6253 94260 125635 109155 53356 25264 6857 24248 6025 -7646 -6852 7907 5743 4629
4411 4629 62292 35351 54487 50989 9395 27919 30887 24642 32515 64651 49121 61104 68279
4398 68279 85350 89992 83503 73337 16371 -33862 -21622 -38104 -38151 6285 47038 41772 -35870
4385 -35870 -42704 -13868 28024 35403 6162 -34075 6814 98821 106681 54414 -9229 -9644 -7269
4372 -7269 -33678 -14639 -29639 -40570 -37003 -12480 -15760 9517 31508 -7902 -20166 44280
4360 44280 99845 86674 33807 5581 -15011 21389 -8472 -17793 36104 50979 81161 130308
4348 130308 191096 168572 136288 43670 -4018 -15118 -23796 1366 18387 654 -30582 -43399
4336 -43399 -98136 -132554 -4461 34199 44195 13274 12374 31068 52781 57351 49569 39117 -8358
4323 -8358 -16143 1023 2712 -53355 -92786 -101374 -15531 26543 37549 67761 64635 42214 40326
4310 40326 -16081 -12066 -17582 -3462 -20719 -5614 12272 12319 71542 87039 -8557 -76233 -143728
4297 -143728 -110036 -72110 -18466 33992 119132 117085 13105 -73076 -72724 -63102 -37239 -26440
4285 -26440 34827 77922 33570 2257 -33644 -19430 -18752 -19311 -41901 -80122 -71482 -16217 6934
4272 6934 48324 61521 29431 -5268 481 24479 26399 55714 38519 28155 43476 63755
4260 63755 66400 89856 33044 -35487 -31397 30802 -13774 -21528 -60807 -75572 -58483 -20312
4248 -20312 8062 46850 21117 -46649 -73261 -18355 11293 899 -21180 10074 100067 47177
4236 47177 -54139 -35690 -1160 5318 -3838 -60652 -23647 -683 -10650 -10953 -1954 20328 20658
4223 20658 -1992 45602 42597 22387 35063 -19685 -97931 -73614 -78100 -79560 8783 80376
4211 80376 45560 19812 17112 20433 88748 102408 46512 -12300 12356 83065 135496 78501
4199 78501 5425 -8969 -17726 -12930 -65906 -101207 -59763 -33012 -12221 -5027 -71700 -73170 -51207
4186 -51207 -49498 -42789 -59485 -45517 -60 12700 -21912 -75308 -76908 -81018 -35069 -9540 -50471
4173 -50471 -32357 15761 71903 82315 53681 49421 83796 78759 40211 17849 17026 10798 -515
4160 -515 -9296 -4898 28798 48778 14628 -27706 -37133 -41088 -26345 -16560 1508 41133 11868
4147 11868 29040 3070 -39414 -12525 -31250 -75430 -45464 17587 34499 54193 33218 9628
4135 9628 -30434 -9667 30826 65583 71911 -17827 -44370 -85962 -76277 -31093 -27500 -82327 -80456
4122 -80456 -35218 12025 36318 64883 64886 25521 -32085 -33688 -45121 -53090 -94091 -63917 -34273
4109 -34273 3073 -23251 -39872 27351 11255 3104 -34646 -54566 -68465 -73462 -45954 29102
4097 29102 75187 90449 97878 30545 -34301 -68366 -17426 -19368 8599 29255 35711 21606
4085 21606 -32277 -50708 -76628 -83656 -66183 -34771 -70882 -127127 -118554 -41794 -15744 -6216
4073 -6216 -6869 3556 -21536 -14601 -26047 -65477 -68430 -27670 13126 57383 -5543 -70319 -38147
4060 -38147 -34840 -40903 30999 44110 91779 46611 5715 -403 -38480 1672 1711 9763 78721
4047 78721 71389 15487 29453 55358 45173 93873 63099 24638 19067 23466 10720 26829
4035 26829 48722 76735 95418 58926 7670 55215 38899 18474 48898 46493 28261 11979
4023 11979 18933 -2108 -18399 -30650 20935 11599 48026 82776 114116 128233 135321 58417
4011 58417 -14286 -95455 -77859 8763 15289 -13904 -35346 -48823 -56582 -74343 -89842 -99916
3999 -99916 -67266 30410 53401 8657 -33678 -28965 -695 334 31894 18262 20693 -1548
3987 -1548 4230 11868 -32340 -46731 -11633 -7291 43012 43973 41288 -6941 1742 -44616 -84149
3974 -84149 -74975 -92062 -70677 -12356 1219 34709 3963 -26326 -34213 -29064 -7708 10700
3962 10700 21566 43208 22367 -29228 -41503 -22262 -21572 23819 22801 -17595 6465 12267 14617
3949 14617 23754 -15086 -49794 -18755 13446 14804 -1357 27322 72520 117804 70653 68076
3937 68076 63260 57847 51498 -23943 -54943 -7479 38715 85855 87995 97473 46208 -16259 -27815
3924 -27815 -64936 -75576 -66745 -26830 -54592 -95067 -113569 -59748 3017 21714 68585 26816
3912 26816 1696 -57098 -94051 -52523 -33654 -2177 -34 2824 -23730 -24562 8028 3647 -15863
3899 -15863 13953 39163 27506 31291 29897 24923 -10086 -40719 -12682 -49863 -75266 -67316 797
3886 797 47721 78423 67937 34343 48359 60926 111071 112099 107543 86400 43499 10815 24633
3873 24633 44989 32118 20451 39727 -14978 -26274 -19401 -19490 37043 6902 -62171 -33123 -9239
3860 -9239 38958 4048 -47238 -115753 -106545 -69238 -81484 -27535 16311 65454 134868 145986
3848 145986 125416 141345 142372 118431 94945 97931 105117 47047 16136 11753 12647 28370 31060
3835 31060 42384 -7303 -83990 -104535 -53060 10884 -32904 -29513 -40878 -1870 12203 -30067
3823 -30067 -131314 -192521 -143680 -91797 -101210 -38095 -10774 -77143 -101653 -42095 9844 18096
3811 18096 41786 51442 46062 51233 116004 118845 67884 26087 -6859 -11173 -7626 -23134 -61083
3798 -61083 -39796 -405 86782 124969 50932 -27788 3577 1588 -57590 -2489 3884 -64040
3786 -64040 -136792 -142235 -91283 -68493 -56448 -35108 -6952 31753 -9794 -50255 -59129 -34831
3774 -34831 -9485 -2095 13859 13290 29390 18348 -41433 -32354 -73704 -54204 -25139 10362 -1257
3761 -1257 -3906 -17123 13875 12155 -8074 -18515 -43501 -62322 -96692 -46710 -21174 38258
3749 38258 45452 49204 -22138 -79828 -19534 29207 9718 14277 1023 12029 27869 26101 14931
3736 14931 26090 30348 16669 40685 -4129 -448 35151 59119 65009 23977 18062 -23925 -75953
3723 -75953 -41455 -40228 -93405 -36449 -12309 -39944 -36573 -4428 34803 69656 20543 39642
3711 39642 95053 86968 90929 25346 -53698 -69666 -96450 -135479 -121261 -45027 -45176 -60204 -79828
3698 -79828 -106137 -94460 -53544 -61611 -93006 -87445 -12288 -1994 -10104 3548 28785 31713 42880
3685 42880 2022 -2958 -32610 -16285 -9948 -34342 -2270 -57928 -89487 -70368 -5083 -10767
3673 -10767 -15605 -32464 -35000 -13450 17167 -11334 66519 61819 12081 4068 26042 31529 318
3660 318 29814 6537 -21714 -13724 -31035 -35115 -74986 -61901 -29566 -1033 -24003 -4849 57451
3647 57451 70116 44110 57816 81832 100691 26141 -19700 -11618 54722 85170 61271 -24111
3635 -24111 -63983 -38233 1585 33560 27233 39851 49494 -41102 -46772 -45179 -2907 11085 16072
3622 16072 45556 69418 56933 -3836 -32740 -26399 8961 61282 51334 12664 28405 65101
3610 65101 52095 51876 12061 -20256 -20668 18341 73049 21397 22748 38174 53190 40054 74930
3597 74930 67877 2253 -48920 -20822 -20592 -61536 -76259 -115974 -92622 -85238 -101097 -72671 -65718
3584 -65718 -40730 -2877 -5849 -51160 -73046 -44981 -18018 20190 49394 4087 -61 -21908
3572 -21908 -14153 9970 17075 46169 43876 939 -25754 -57313 -64454 -45923 -37994 -7880 34101
3559 34101 10937 -23607 -13265 27268 42366 -956 28846 83400 99743 68591 -426 11456
3547 11456 82372 93035 127709 95244 12788 -13414 -47647 -61002 -4499 21818 45198 19253
3535 19253 35468 54707 33277 17096 -14184 12838 -33030 -59969 -65004 -50336 27130 38049
3523 38049 -23703 -88898 -72727 -17243 -17569 -4087 -6170 -41981 -32483 -37273 -5532 6687 23773
3510 23773 472 32050 17902 52987 24715 -13341 -28193 17018 -17600 2679 54987 32087
3498 32087 -947 -69445 -107643 -70636 -105382 -102602 -62838 -5146 11657 -4432 -35211 -7894
3486 -7894 15763 -14086 -28239 333 15805 385 17318 43080 43593 40108 93809 107863 74225
3473 74225 15072 11590 -7054 4672 10227 -8481 -9313 19501 39917 88534 72989 35640 31203
3460 31203 21182 38650 14528 -11603 31366 -3722 329 25248 48512 30312 20267 -25871
3448 -25871 -17235 -61099 -92632 -11960 47285 40671 21124 19990 -627 5812 18565 37734 -14973
3435 -14973 -23366 17363 777 -12520 35479 28349 -7118 -52701 -28650 -105706 -86162 -17934
3423 -17934 -11132 -34623 -31710 -46195 -29054 -2095 2153 -2745 13142 -5384 -30177 23556 86684
3410 86684 80959 75326 64490 79314 87439 64669 90491 69519 28137 4006 -29316 -18769
3398 -18769 -19523 -29142 -9438 -222 47384 18909 23693 32156 -1685 11592 65301 63403 56199
3385 56199 58898 118537 150298 101846 38226 31394 51833 73710 81250 90193 87681 81129 43733
3372 43733 15645 -9029 -23516 -91482 -64910 -43 32181 29311 40366 8939 -13099 38303
3360 38303 53867 24773 53271 31665 -25639 -42393 24047 57632 37615 39559 21560 33827
3348 33827 34296 50192 48980 26131 204 -26168 -54014 -47276 -34493 -62354 -43680 -4673 2714
3335 2714 22672 -838 -8611 -21336 41141 65069 22560 8491 -21981 -59938 -88567 -95555
3323 -95555 -15984 6559 -23377 -31192 4563 -27734 -77402 -114259 -72301 -8284 -52602 -56843
3311 -56843 -18937 -2906 -32545 -21432 -18540 -58825 -51932 10530 -10962 -19629 -40598 -57099
3299 -57099 -76552 -62709 16063 40980 35657 19028 -11903 -56568 -98990 -28219 14518 40740
3287 40740 30412 60650 83531 65117 21228 -42049 -54019 -26610 -31973 -45441 -42043 -24048
3275 -24048 -11623 -58028 -51050 -68543 -34080 -44466 -78997 -64942 -67752 5711 56129 -4015
3263 -4015 -27755 2676 60673 72189 56426 31948 16444 1637 -18783 -2910 52717 85375
3251 85375 39756 22303 75877 49949 -48221 -138165 -133917 -88568 -78515 -14119 -18757 2904
3239 2904 42576 21933 -797 36539 89635 125992 91367 68732 77872 25233 -34845 -63124
3227 -63124 -27933 104552 157361 95183 34098 59859 20536 4796 -18756 -28951 14798 11920
3215 11920 16283 27524 60689 36636 16339 16197 10707 -42899 -104713 -54085 -1691 38127 53080
3202 53080 3467 -32362 11718 31339 33501 31064 55747 55294 13953 -47442 -58965 -57179 -67888
3189 -67888 -70971 -69883 -45521 -11143 -21541 -70173 -62830 -27757 34363 89356 76062 67670 54019
3176 54019 17210 33685 38914 -6461 -393 -7275 22527 1236 1576 6321 27048 -20749 -27674
3163 -27674 3226 38548 -22245 -72771 45511 73361 58992 56994 65043 38813 23711 -47117
3151 -47117 -68177 -7086 -10700 -59671 -73593 4243 13009 -5699 -28514 -14103 -29405 -17383
3139 -17383 -53490 -4607 44561 -27769 1625 49357 65558 29918 26185 12409 -24035 -78410
3127 -78410 -55663 -36820 -71039 -86187 -82250 -64679 4876 35880 26149 -25756 -62366 -65424
3115 -65424 -56150 -45229 -23445 -594 10392 7870 -1462 23066 43949 83841 86606 46335 -39675
3102 -39675 -50955 -30304 -3831 16547 35656 34953 -17004 -30600 -39467 -3335 34193 64403
3090 64403 58822 16253 37185 16890 -14225 -11681 -12414 -9615 -23986 -17166 -15369 -12348 -42116
3077 -42116 -45803 -7413 35809 54413 9675 -48138 -65035 -80428 -55262 -45694 -46841 -43780 -716
3064 -716 12995 88039 80678 48366 39175 39502 48324 20478 43678 36041 -36862 -65525 -80845
3051 -80845 -97351 -77783 -45492 -43471 -56131 -18862 12592 59785 55472 14009 1320 17885
3039 17885 14375 -8881 -3121 48307 116132 101333 67244 63169 23779 18301 55889 113886 122287
3026 122287 77728 33722 32031 2519 6981 -29012 1434 46002 11356 -7560 7375 25010
3014 25010 61067 32179 3339 22728 -12234 -1699 37446 -5684 -45850 -45844 -97844 -145733 -119206
3001 -119206 -121275 -75500 -26085 -29918 -21364 22039 50875 40282 38759 18817 16920 -32047 -102994
2988 -102994 -104766 -40606 238 8726 -2077 -34294 -36312 -33387 -22863 6389 -11416 -66883
2976 -66883 -55817 44034 80061 29239 -48749 -50321 -33282 -19166 9870 31936 74049 40339
2964 40339 25410 23424 22692 2938 -13451 -38124 -50039 -114960 -59888 -45283 -39814 -26627 32853
2951 32853 43166 6462 -15308 2827 -66489 -83502 -39786 -17069 51134 78244 48412 59823
2939 59823 46011 682 9484 63942 56061 8187 -37563 -44097 -33421 -51803 -76134 -65762
2927 -65762 1844 -10099 7120 -11041 -34197 -75241 -126953 -113476 -94146 -95955 -117614 -121272
2915 -121272 -64129 -24215 -27205 -16449 -1198 55575 56168 33227 60047 68585 7746 -22551
2903 -22551 620 26532 32265 43802 59042 39212 53774 45706 19970 77034 68152 28360
2891 28360 -11311 -28869 -64961 -56766 15883 28952 64470 48702 -20396 -31546 20743 49721
2879 49721 103387 56757 -12408 -30421 28606 40512 51555 38748 -31504 -36207 -22212 22438
2867 22438 51210 93627 50361 23641 11418 40142 12984 -29795 -17487 -31507 -14821 -29806
2855 -29806 7750 33258 -72754 -111085 -80518 -12106 49372 43890 -478 21730 6383 -9430
2843 -9430 -7172 16312 37052 64836 73138 64409 66764 35937 3025 12389 -13163 -6710 63813
2830 63813 72763 44647 31031 35787 -12007 47793 51916 -10501 47722 17647 -71359 -12561
2818 -12561 37506 103035 84069 46115 18183 -4837 -22507 -24146 -40492 26519 73742 69769
2806 69769 51218 57360 84315 95274 68624 26063 9935 7899 14253 60115 101011 53248
2794 53248 -8932 -28618 27721 22784 9956 2190 -86973 -116305 -80683 -23738 -18896 -12916 -25212
2781 -25212 -27333 865 -31565 -44776 -56224 -91059 -93776 -117635 -96912 -62972 -22586 -8835
2769 -8835 -51610 -68021 -85123 -122376 -91913 -52084 -65412 -21118 3688 29958 713 -30591
2757 -30591 -62213 -76141 -57322 -66827 -30099 47756 63465 60276 -9005 -88104 -95691 -34614
2745 -34614 8197 -7476 -54659 -39666 9661 -17800 -18852 -55358 -76890 -12934 6074 -9960
2733 -9960 -59226 -102778 -65151 -51764 -66749 -99367 -88076 -14244 -11929 -66517 -71132 -36222
2721 -36222 -27117 -14666 52038 63214 74403 60447 111145 113010 57406 31276 -28788 -11415
2709 -11415 -11883 -37547 -55254 -46973 -22653 -27803 -2498 36150 -17284 -6597 9112 -3413 -6565
2696 -6565 -99155 -102159 -13865 44459 83690 83545 71728 77650 235 -83671 -68270 17801 35786
2683 35786 38181 67007 73168 61322 39688 15406 6841 -698 24752 44589 29108 13844 -11803
2670 -11803 33457 42500 34407 27013 20392 -17241 -58624 -80665 -93601 -59860 -2933 26468 33154
2657 33154 59593 98731 147108 97872 46217 77354 98861 55618 26528 35301 32039 66505
2645 66505 87352 101244 121413 80612 44059 16442 11637 23867 41513 2716 -59613 -90786
2633 -90786 -98261 -80110 -74279 -66516 -77290 -70661 -19191 17614 -179 -8867 -5748 -74992 -108667
2620 -108667 -108260 -75496 -30498 -24849 -41855 -69642 -124160 -116086 -40550 -42089 -54068 -83281 -86031
2607 -86031 -56292 -16276 36180 112692 132610 90032 81593 82310 90411 116648 163644 104764 -4366
2594 -4366 -11108 24619 33091 63917 56801 -2098 -1563 46280 67838 27065 -56129 -117783 -81895
2581 -81895 -49325 5795 45252 33992 26164 40960 16963 -45087 -5359 42408 75133 98158
2569 98158 65518 72045 16120 -49855 -64438 -8043 -23341 -32400 -1026 10668 29760 39551
2557 39551 51699 42380 42471 4687 -5562 -17124 -14747 31355 26228 -44921 -90993 -20575 36881
2544 36881 57220 -499 -82310 -152558 -148483 -99425 -55412 -8443 -5333 -671 30968 39626 42361
2531 42361 32974 20879 4744 -14057 -29008 -18890 15363 11432 42246 103357 84807 36298
2519 36298 -22585 -19902 -10373 3033 31483 67188 73004 70420 58605 82546 81692 52287 3906
2506 3906 -14369 -36846 4207 6901 39290 -28844 -36258 -48079 -10865 -1558 -3397 37128 71407
2493 71407 60902 67916 67011 12727 -5972 38665 9418 -46996 -33377 -27714 -5966 34083 41351
2480 41351 57601 87673 53375 37431 32295 35402 10830 41399 81595 85803 60263 91629
2468 91629 49481 51407 10922 -13784 -37422 -39298 -24524 8845 27616 -32154 -25221 39948
2456 39948 100262 74095 27498 79777 59841 -39431 -93257 -44546 -7676 1474 7110 24685
2444 24685 24109 31456 89308 131415 117716 51334 275 70357 107766 51849 25536 9690
2432 9690 -31894 -20024 -12310 26882 18651 -50891 -52803 -68947 -66856 -60645 -28745 -35699 -1927
2419 -1927 15951 42256 7563 -17421 2339 -1970 -40307 -47116 -43199 -35847 -61981 -71067 -52430
2406 -52430 24280 46955 24275 11409 18912 75135 52804 -23062 -44729 -48815 -36706 -6238
2394 -6238 -34122 -30210 -4886 -34890 -57788 -31365 -4235 31009 19288 47864 57592 34983
2382 34983 -56958 -55245 -62182 -35859 -21373 67837 107176 50740 65803 55569 31092 37558
2370 37558 45984 47947 18774 -32702 -4475 40177 18076 43486 86145 130510 124335 70319
2358 70319 -2420 -4232 -10799 52354 96434 63517 57084 76128 57797 28090 -25941 -90658
2346 -90658 -36529 -7282 40688 50878 -33601 -14988 -901 26017 19790 24874 -20706 -5331
2334 -5331 6738 -2845 -32515 -17539 34897 -23594 -63266 -20830 -5415 -24188 -47568 -44862
2322 -44862 -17935 -33461 -22062 30672 36036 32751 15169 -51524 -44529 10516 34320 31746 -3741
2309 -3741 -37073 -70917 -15139 7205 -2599 -7723 2742 16843 -539 -25298 24738 43520
2297 43520 4333 36011 83723 35090 -83970 -66972 -42675 -63813 793 52026 117071 68436
2285 68436 -35971 -107874 -71046 -26259 -27270 -5216 -26342 -7436 59568 85622 92536 106663
2273 106663 106695 118157 141016 120762 44087 6535 62711 59558 48925 31325 18529 94981
2261 94981 78957 71545 60118 52159 64928 34717 16242 13818 37069 22804 -15433 -58436
2249 -58436 -34929 -42038 10354 -1270 11312 -1673 -68382 -48770 -17995 -13222 27810 35706
2237 35706 -45456 -15053 45667 95028 95263 38011 11393 49564 28371 8534 57128 116454
2225 116454 76772 14919 -3511 -24919 -14100 51531 23844 15564 20625 58926 35514 35547 61493
$$ [...]
##END NTUPLES=NMR SPECTRUM
##END=
