##TITLE=Analysis number 309854
Compound Code dfp 00046
Project Code adrs
Chemist Name stores
##JCAMPDX= 6.0         $$ Bruker NMR JCAMP-DX V2.0
##DATA TYPE= NMR SPECTRUM
##DATA CLASS= NTUPLES
##ORIGIN= Bruker BioSpin GmbH
##OWNER= NMR
$$ XWIN-NMR		Version 3.5
$$ Mon Jun  6 09:52:02 2005 GMT Daylight Time (UT+1h)  MAYBRIDGE\NMR@NMR_250MHZ
##.OBSERVE FREQUENCY= 250.131544655141
##.OBSERVE NUCLEUS= ^1H
##.ACQUISITION MODE= SIMULTANEOUS (DQD)
##.ACQUISITION SCHEME= undefined
##.AVERAGES= 16
##.DIGITISER RES= 18
##SPECTROMETER/DATA SYSTEM= dpx250
##.PULSE SEQUENCE= zg30
##.SOLVENT NAME= DMSO
##.SHIFT REFERENCE= (INTERNAL, DMSO, 0, 16.522)
##AUDIT TRAIL= $$ (NUMBER, WHEN, WHO, WHERE, WHAT)
$$ ##TITLE= Audit trail, XWIN-NMR		Version 3.5
$$ ##JCAMPDX= 5.01
$$ ##ORIGIN= Bruker BioSpin GmbH
$$ ##OWNER= NMR
$$ C:\u/data/dgb/nmr/ADRS/3820/pdata/1/auditp.txt
$$ ##AUDIT TRAIL=  $$ (NUMBER, WHEN, WHO, WHERE, WHAT)
(   1,<2005-06-06 09:51:43.15 +100>,<MAYBRIDGE\NMR>,<NMR_250MHZ>,
      <created by zg, POWCHK disabled, PULCHK disabled
       configuration hash MD5:
       62 19 C7 07 E1 42 D1 B7 37 6C 3D D0 77 39 F9 E6
       data hash MD5: 64K
       33 AC 32 8D 48 B7 D1 96 E2 B5 F2 71 BE B1 AA 92>)
(   2,<2005-06-06 09:51:54.07 +100>,<MAYBRIDGE\NMR>,<NMR_250MHZ>,
      <Start of raw data processing
       ef LB = 0.3 FT_mod = 6 PKNL = 1 SI = 32K 
       data hash MD5: 32K
       41 EF B5 11 23 D3 EB 88 C9 D3 43 B3 C8 62 4C 63>)
(   3,<2005-06-06 09:51:55.78 +100>,<MAYBRIDGE\NMR>,<NMR_250MHZ>,
      <apk 
       data hash MD5: 32K
       45 32 3A 40 FD 25 63 C5 5D B0 7E A0 13 41 E5 62>)
(   4,<2005-06-06 09:51:56.46 +100>,<MAYBRIDGE\NMR>,<NMR_250MHZ>,
      <abs ABSG = 5 
       data hash MD5: 32K
       59 48 6E 82 4B BE 55 EB FB D9 FE 9F B7 89 49 89>)
$$ ##END=
$$ 
$$ hash MD5
$$ CD 01 8C 6F EE 68 70 6E 35 57 50 B9 04 56 B9 22
##$RELAX= 
##$RELAX= 
##$RELAX= 
##$RELAX= 
##$RELAX= 
##$RELAX= 
##$RELAX= 
$$ Bruker specific parameters
$$ --------------------------
##$DU= <C:\u>
##$EXPNO= 3820
##$NAME= <ADRS>
##$PROCNO= 1
##$TYPE= <nmr>
##$USER= <dgb>
##$AMP= (0..31)
100 100 100 100 100 100 100 100 100 100 100 100 100 100 100 100 100 100 
100 100 100 100 100 100 100 100 100 100 100 100 100 100 
##$AQSEQ= 0
##$AQ_mod= 3
##$AUNM= <au_zg>
##$AUTOPOS= <10 >
##$BF1= 250.13
##$BF2= 250.13
##$BF3= 250.13
##$BF4= 250.13
##$BF5= 500.13
##$BF6= 500.13
##$BF7= 500.13
##$BF8= 500.13
##$BYTORDA= 1
##$CFDGTYP= 0
##$CFRGTYP= 5
##$CHEMSTR= <none>
##$CNST= (0..31)
1 1 145 1 1 1 1 1 1 1 1 1 1 1 1 1 1 1 1 1 1 1 1 1 1 1 1 1 1 1 1 1 
##$CPDPRG= <>
##$CPDPRG1= <>
##$CPDPRG2= <>
##$CPDPRG3= <>
##$CPDPRG4= <mlev>
##$CPDPRG5= <mlev>
##$CPDPRG6= <mlev>
##$CPDPRG7= <mlev>
##$CPDPRG8= <mlev>
##$CPDPRGB= <>
##$CPDPRGT= <>
##$D= (0..31)
0 1 0 0 0 0 0 0 0 0.06 0 0 0 0 0 0 0.0002 0 0 0 0 0 0 0 0 0 0 0 0 0 0 
0 
##$DATE= 1118047902
##$DBL= (0..7)
120 120 120 120 120 120 120 120 
##$DBP= (0..7)
150 150 150 150 150 150 150 150 
##$DBP07= 0
##$DBPNAM0= <>
##$DBPNAM1= <>
##$DBPNAM2= <>
$$ [...]
##$SUBNAM7= <"">
##$SUBNAM8= <"">
##$SUBNAM9= <"">
##$SW= 20.6930455092707
##$SWIBOX= (0..15)
0 0 3 0 0 0 0 0 0 0 0 0 0 0 0 0 
##$SW_h= 5175.983436853
##$TD= 65536
##$TD0= 1
##$TE= 294.16
##$TE2= 300
##$TE3= 300
##$TEG= 300
##$TL= (0..7)
0 120 120 120 120 120 120 120 
##$TP= (0..7)
150 150 150 150 150 150 150 150 
##$TP07= 0
##$TPNAME0= <>
##$TPNAME1= <>
##$TPNAME2= <>
##$TPNAME3= <>
##$TPNAME4= <>
##$TPNAME5= <>
##$TPNAME6= <>
##$TPNAME7= <>
##$TPOAL= (0..7)
0.5 0.5 0.5 0.5 0.5 0.5 0.5 0.5 
##$TPOFFS= (0..7)
0 0 0 0 0 0 0 0 
##$TUNHIN= 0
##$TUNHOUT= 0
##$TUNXOUT= 0
##$USERA1= <user>
##$USERA2= <user>
##$USERA3= <user>
##$USERA4= <user>
##$USERA5= <user>
##$V9= 5
##$VALIST= <valist>
##$VCLIST= <CCCCCCCCCCCCCCC>
##$VD= 0
##$VDLIST= <DDDDDDDDDDDDDDD>
##$VPLIST= <PPPPPPPPPPPPPPP>
##$VTLIST= <TTTTTTTTTTTTTTT>
##$WBST= 1024
##$WBSW= 4
##$XGAIN= (0..3)
0 0 0 0 
##$XL= 0
##$YL= 0
##$YMAX_a= 344109
##$YMIN_a= -204467
##$ZGOPTNS= <>
##$ZL1= 120
##$ZL2= 120
##$ZL3= 120
##$ZL4= 120
##$ABSF1= 16.522
##$ABSF2= -4.171173
##$ABSG= 5
##$ABSL= 3
##$ALPHA= 0
##$AQORDER= 0
##$ASSFAC= 0
##$ASSFACI= 0
##$ASSFACX= 0
##$ASSWID= 0
##$AUNMP= <proc_1d>
##$AZFE= 0.1
##$AZFW= 0.1
##$BCFW= 0
##$BC_mod= 0
##$BYTORDP= 0
##$COROFFS= 0
##$CY= 12.5
##$DATMOD= 1
##$DC= 0
##$DFILT= <>
##$DTYPP= 0
##$F1P= 14.0000005364418
##$F2P= -0.99999901652339
##$FCOR= 0.5
##$FTSIZE= 32768
##$FT_mod= 6
##$GAMMA= 0
##$GB= 0
##$INTBC= 1
##$INTSCL= 1
##$ISEN= 128
##$LB= 0.3
##$LEV0= 0
##$LPBIN= 0
##$MAXI= 10000
##$MC2= 0
##$MEAN= 0
##$ME_mod= 0
##$MI= 0
##$NCOEF= 0
##$NC_proc= -5
##$NLEV= 6
##$NOISF1= 0
##$NOISF2= 0
##$NSP= 0
##$NTH_PI= 0
##$NZP= 0
##$OFFSET= 16.522
##$PC= 1
##$PHC0= -86.29201
##$PHC1= 18.15211
##$PH_mod= 1
##$PKNL= yes
##$PPARMOD= 0
##$PSCAL= 4
##$PSIGN= 0
##$REVERSE= no
##$SF= 250.13
##$SI= 32768
##$SIGF1= 0
##$SIGF2= 0
##$SINO= 400
##$SIOLD= 32768
##$SREGLST= <1H.DMSO>
##$SSB= 0
##$STSI= 32768
##$STSR= 0
##$SW_p= 5175.98343685301
##$SYMM= 0
##$S_DEV= 0
##$TDeff= 65536
##$TDoff= 0
##$TI= <Analysis number 999999
Compound Code 99
Book Reference 9
Project Code 9>
##$TILT= no
##$TM1= 0
##$TM2= 0
##$TOPLEV= 0
##$USERP1= <user>
##$USERP2= <user>
##$USERP3= <user>
##$USERP4= <user>
##$USERP5= <user>
##$WDW= 1
##$XDIM= 32768
##$YMAX_p= 517593705
##$YMIN_p= -735538
$$ End of Bruker specific parameters
$$ ---------------------------------
##NTUPLES= NMR SPECTRUM
##VAR_NAME=  FREQUENCY,     SPECTRUM/REAL,   SPECTRUM/IMAG
##SYMBOL=    X,             R,               I
##VAR_TYPE=  INDEPENDENT,   DEPENDENT,       DEPENDENT
##VAR_FORM=  AFFN,          ASDF,            ASDF
##VAR_DIM=   32768,         32768,           32768
##UNITS=     HZ,            ARBITRARY UNITS, ARBITRARY UNITS
##FACTOR=    0.157963299565203, 1,           1
##FIRST=     4132.6476996994, 0,             0
##LAST=      -1043.33573715361, 0,           0
##MIN=       -1043.33573715361, -735538,     0
##MAX=       4132.6476996994, 517593705,     0
$$ Real data points
##PAGE= N=1
##DATA TABLE= (X++(R..R)), XYDATA
$$ [...]
25440d7263J44283N1287k3377j06821Q3897J10797L7895j11480M1339j26406r5485
25429d1334K0987k4910J2432r4284r8613K9853k9001J22406J7957L5585j7316
25418f6238J8653j33616J49680R7805P2513j32218k21174q8894l6306p1604M4133
25407c67266L21666J31406j59248n2991L1078j51962j64292P0958K07583n193
25397a38261j06692k8225L987O0676K99011Q1832J01084m183K4488k6878k00338
25386F6501j70489m8932J13663J72991P1500K0101l23428m1302K68427r8244l23709
25375b92921o6759J83674R5236Q7757K12437M6566j47705k25592n424Q2496Q2815
25364E2580o8633q3442K07275L0771l4797j13183q059K08317N1929k21767j52670
$$ plain form
25440 -47263 97020 148307 124930 18109 102006 212803 250698 139218 180557 54151 -41334
25429 -41334 -20347 -45257 -32825 -127109 -225722 -195869 -224870 -102464 -84507 -48922 -66238
25418 -66238 -47585 -181201 -31521 66284 138797 6579 -214595 -303489 -339795 -411399 -367266
25407 -367266 -45600 85806 -73442 -126433 -95355 -247317 -411609 -340651 -133068 -138261
25397 -138261 -244953 -273178 -269191 -208515 90496 172328 273412 269229 293717 266839 66501
25386 66501 -103988 -152920 -39257 133734 205234 225335 -98093 -139395 129032 30788 -292921
25375 -292921 -359680 -176006 -80770 6987 219424 265990 118285 -107307 -112731 -30235 52580
25364 52580 -16053 -99495 107780 138551 103754 -9429 -17488 190829 242758 20991 -131679
25353a31679l4706O6052M7547J30536R60j90070l4887N5252N5395P4010Q7466
25342A25876P3335m61378r4736K19430J48145P5971P75j638n2748j00760p7005
25331a44733k9660J52915J59166J62447j39011J18922K91754l11227l22235o4654
25321a26316K6740J6010N0654P3449J5156j4172j7550K5245l0821l7884J9082
25310d07r0054Q7498J06450k0825N9860K59725j85913j27346O4987j18696l4318
25299I61K66162l8691k52431P323o4670N4440K93134l8316j70054L085P8484K1297
25287A60724Q9767K1033j5155j9971p7888K5583j22828n6591N1704J63549J25054
25276C44981K5298k28377j9146J50342M5741l6720j63519j52619K4433O9649j7000
$$ plain form
25353 -131679 -166385 -100333 -52786 77750 78710 -111360 -146247 -90995 -35600 38410 125876
25342 125876 199211 -262167 -356903 -137473 10672 86643 87418 85780 33032 -67728 -144733
25331 -144733 -174393 -21478 137688 300135 161124 280046 571800 260573 -61662 -126316
25321 -126316 -99576 -83566 -32912 40537 55693 41521 23971 49216 18395 -19489 -407
25310 -407 -90461 -2963 103487 82662 142522 402247 216334 88988 153975 35279 961
25299 961 267123 228432 -23999 -16676 -81346 -26906 266228 227912 57858 60943 139427 160724
25287 160724 250491 271524 256369 236398 158510 184093 61265 4674 56378 219927 344981
25276 344981 370279 141902 122756 273098 318839 282119 118600 -34019 -9586 60063 43063
25265D3063M209K9230p1655R153l8544J1433P2600L6568j18371r7296k3301K9319
25253a13592k22572r1400j1696Q1523K75721P1445M3884O5023K3310r6548q1896
25242e6798N8675Q4276n5020o9872J51417l2604o455k23503K5136q6022o0921
25231b71691R7364j20813N4049K54765M8269j68596j9576O8676Q4252J55934j68330
25220A4303j53917M9590q1863p7772J16913K5585J1370j09027L2994J18553J76840
25209A23569J18795p5685r2991J03187K7677o3607K2333J29705q0336O969M797
25198B24413k01738j67067Q5387J28812J12003n0712q3786J06431M538J85251
25188C43532J49612p9114r5122J9444k0317k38389j33792j59049q3755J17044
$$ plain form
25265 43063 47272 76502 4847 14000 -24544 -13111 59489 96057 -22314 -119610 -142911 -113592
25253 -113592 -336164 -427564 -439260 -357737 -82016 -10571 33313 98336 121646 25098 -56798
25242 -56798 1877 86153 31133 -38739 112678 80074 73619 -149884 -124748 -210770 -271691
25231 -271691 -174327 -295140 -241091 13674 61943 -106653 -126229 -57553 26699 182633 14303
25220 14303 -139614 -90024 -171887 -249659 -132746 -107161 -95791 -204818 -171824 -53271 123569
25209 123569 242364 166679 73688 176875 204552 140945 163278 292983 212647 219616 224413
25198 224413 22675 -144392 -59005 69807 181810 131098 47312 153743 158281 343532
25188 343532 493144 414030 318908 338352 318035 79646 -54146 -213195 -296950 -179906
25178a79906K06261l5742P8228J48305k8625p2547L6694k3968m8954o4588o9829
25167e4671J2138N5966J9097j25266j68791K2141l6511K765J86712m822k07440
25156b98682Q5057J06957Q7497J25099J3283J8868j92342j61303K3334O2970J0594
25145a18668N6364K51646l0471k39869j8187K09334J09201r6835k562j34270M6564
25134C2247j4843J35736k11417j06208r321k1404N1398K29232p9801L9714j21407
25123g6074j14581J61818Q1239p6345K7517l2345n0091J01245M6519K7772k04112
25112a07438j78133K4557N551R1768J44160M1688K7190n0255Q0516J30232K7059
25101B36895k0330m908M6458K6210k13545k40055K6573K8988J81710n833q3053
$$ plain form
25178 -179906 26355 -9387 68841 217146 188521 115974 152668 128700 79746 15158 -54671
25167 -54671 -42533 13433 32530 -92736 -261527 -239386 -275897 -273132 -86420 -91242 -298682
25156 -298682 -213625 -106668 -19171 105928 119211 138079 -54263 -215566 -192232 -129262 -118668
25145 -118668 -62304 189342 158871 -80998 -99185 110149 219350 122515 119953 -14317 32247
25134 32247 17404 153140 -58277 -164485 -173806 -195210 -143812 85420 5619 45333 -76074
25123 -76074 -190655 -28837 52402 -23943 3574 -28771 -78862 22383 68902 96674 -107438
25112 -107438 -285571 -261014 -255463 -163695 -19535 22153 49343 -912 79604 209836 236895
25101 236895 216565 211657 258115 284325 70780 -169275 -142702 -113714 67996 62163 -20890
25090b0890p7133K9330q8461J08140J80020J426N1431m7106k04029j47288j055
25079b15615J2596R4848J94620M2836j24168j94387k8382J3036r3993o3313J81904
25068a80018J93625P0980j26287K0597n4481j26853J51734p840k9565j25574J0358
25057b03324J44092k0217q26k9598O0393K9445j2432K00576O4379j3093k3147
25046A96248l05376k59203j00494K41894M6150l9303P0743J04256Q6771R7002
25036A38688p3640r6875Q7353j08263m0559P1003j77060J5690J25598J5493K2961
25025a9611R0209J3382J46181m2690j76071m3487j53430j30816O4928L7999J42492
25014g0914K6205M6026P1256m9279q2432o045j0095Q6216O4274K2486J37788M9472
$$ plain form
25090 -20890 -98023 -68693 -157154 -49014 131006 132432 183863 136757 -67272 -214560 -215615
25079 -215615 -203019 -108171 86449 129285 5117 -189270 -217652 -204616 -298609 -361922 -180018
25068 -180018 13607 84587 -41700 -21103 -75584 -202437 -50703 -58543 -88108 -213682 -203324
25057 -203324 -59232 -79449 -80275 -109873 -49480 -20035 -32467 168109 232488 219395 196248
25046 196248 -109128 -368331 -468825 -226931 -180781 -220084 -149341 -45085 41686 138688
25036 138688 65048 -31827 55526 -52737 -93296 -22293 -199353 -183663 -58065 -42572 -19611
25025 -19611 70598 83980 230161 187471 11400 -32087 -185517 -316333 -251405 -213406 -70914
25014 -70914 -44709 1317 72573 23294 -59138 -65183 -75278 10938 75212 97698 235486 284958
25002B84958J15093p1464j61925j09829j19278J26213J74871P8966o7610m6778
24992B03217J05059r6402j29066k57021q8563k5733L3226J60193L7510K12466
24982A54886J3627q2124j43390J7018J01713p6563p0449o4369j48146j58261N2005
24971d04053J16250L9944l5931M6308K06808K14489K4833j42846O565P2023N8407
24960B02797K5986Q6939j87929j01155M4139m8421p4980k0668m4432O7089J68102
24949A17467K0448j2006o9076r6675p5671n392n5524r9949l350K8978l8625n3119
24937c42494J30453j386j12602K759R4780J13028J4103L3081J79982j01635j89252
24926a79183j7380K53945L2096j34693j20878k27602O0325j4131q9010J6183L7415
$$ plain form
25002 284958 400051 328587 166662 56833 -62445 63768 238639 317605 249995 203217
24992 203217 308276 211874 82808 -174213 -262776 -288509 -255283 -95090 -57580 154886
24982 154886 168513 86389 -57001 -39983 61730 -14833 -85282 -149651 -297797 -456058 -404053
24971 -404053 -287803 -247859 -283790 -237482 -30674 183815 208648 65802 72367 144390 202797
24960 202797 228783 315722 127793 26638 70777 22356 -52624 -73292 -117724 -50635 117467
24949 117467 137915 125909 56833 -39842 -115513 -120905 -176429 -276378 -279728 -250750 -289375 -342494
24937 -342494 -212041 -213427 -326029 -323270 -228490 -115462 -101359 -68278 111704 10069 -179183
24926 -179183 -196563 57382 89478 -45215 -166093 -393695 -333370 -347501 -436511 -420328 -382913
24915c82913J47771o0596R3071l105O5988Q4400O6685K4176p1471R2401o6843
24904a0436l8588r6906j13473R6078n579o2214J56827J1438j2417O0199M8145
24893C3074q5865r8564J05536J27612l4874p8736r1714N1127j7702J09313k0725
24882a518j78073p2473J38091J72702J70533o505n9754q2452l78063p2466L3965
24871c36013j2595J07215k5030j19197L0826O0946K34989R2770Q9829K9726J20390
24860B73856k79092k59692J33590J93779N7353M724j88936n1809Q620j06454q8529
24849c02590J12025l7450K0656J42885m4559J45432K8504j17439M4058M0242P9662
24838A11426l3144l3206j20211J37943J76577K03121k9757k54000j92525r0511
$$ plain form
24915 -382913 -235142 -295738 -202667 -205772 -139784 -55384 11301 35477 -35994 56407 -10436
24904 -10436 -49024 -145930 -259403 -163325 -168904 -231118 -74291 -62853 -75270 -15071 33074
24893 33074 -52791 -151355 -45819 81793 46919 -31817 -123531 -72404 -90106 19207 -1518
24882 -1518 -179591 -252064 -113973 58729 229262 222757 163003 80551 -297512 -369978 -336013
24871 -336013 -348608 -241393 -266423 -385620 -354794 -293848 -58859 33911 123740 153466 273856
24860 273856 -5236 -264928 -131338 62441 119794 124518 -64418 -116227 -107607 -214061 -302590
24849 -302590 -190565 -228015 -207359 -64474 -109033 36399 64903 -52536 -8478 31764 111426
24838 111426 78282 45076 -75135 62808 239385 442506 412749 158749 -33776 -124287
24828a24287P1405R9879J05367K7943k00084j5091J59237m5148j56895O3414K1167
24817F907p8413j34298j84320L0606k79831K15124L45117J13422K13966j9996
24807B28284K3514n6015k11643p0735j47229o5009Q6684K38488j06571J9730q5677
24796a46179j33224Q684K51567L3102p1398k3643j33120j06924L0776k0094j24979
24785d35432J04988J16741K22709k1611k01096q4716M7405p3034M2774R7547K69725
24774H6000J54709k63544k08213M137N6793o8m3091P2078J82383j1319k52455
24763b22590p3651q5143o2241J06174J71751R2428J9749R6999P4818k57797j40714
24752b80217K13574q5372j97847J32597J86860q1290L7560o345p7329n9170k32588
$$ plain form
24828 -124287 -52882 46997 152364 180307 -19777 -34868 124369 79221 -77674 -14260 6907
24817 6907 -71506 -205804 -390124 -359518 -639349 -424225 -79108 34314 248280 228284
24807 228284 251798 195783 -15860 -86595 -233824 -298833 -212149 26339 -80232 -60502 -146179
24796 -146179 -279403 -270719 -19152 13950 -57448 -81091 -214211 -321135 -290359 -310453 -435432
24785 -435432 -330444 -213703 9006 -12605 -213701 -298417 -251012 -324046 -281272 -183725 86000
24774 86000 240709 -22835 -231048 -226911 -170118 -170186 -213277 -141199 41184 29865 -222590
24763 -222590 -296241 -381384 -443625 -337451 -165700 -73272 -53523 43476 118294 -139503 -280217
24752 -280217 -66643 -152015 -349862 -217265 -30405 -111695 -74135 -80480 -157809 -216979 -449567
24741d49567l157P1749J17927J47094J44751M8113Q145j76521r1939m866k9274
24730b17545Q0774J46488N0752O2974M4711r1645p7667L5583r8151M6784J37225
24719A20283j31452k39885M092n8257K94529J39249k05632j72138O3281J64524
24709b1406J31398K24564j7867j09672k11301j15851J56005L07169J24797r766
24699D58070j03170Q120J41141j48828p0202j64971O3208n7978j850N9515j04892
24688G8163M453K3200o4829j8780J96706l107m178p1195n4436Q562J7877O7544
24676A79980K5299N6518j49487k92554j41625p3811J36443R0888n4453l3618N2435
24665b03985J47211K12714J11806P4929n6584p9680l3604j39169j47804J68975
$$ plain form
24741 -449567 -452724 -380975 -263048 -115954 28797 76910 85055 -91466 -183405 -188271 -217545
24730 -217545 -136771 9717 60469 123443 168154 76509 -1158 34425 -63726 -16942 120283
24719 120283 -11169 -251054 -246962 -305219 -10690 128559 -77073 -249211 -185930 -21406
24709 -21406 109992 334556 316689 207017 -4284 -120135 35870 343039 467836 458070
24699 458070 354900 363020 504161 355333 285131 120160 183368 125390 123540 183055 78163
24688 78163 82616 105816 40987 22207 218913 215806 211628 140433 85997 94559 112436 179980
24676 179980 205279 261797 112310 -180244 -321869 -395680 -259237 -168349 -222802 -256420 -203985
24665 -203985 -56774 155940 267746 342675 286091 206411 172807 33638 -114166 54809
24655E4809j1111J11887j17468j19350N0324O0809k7594j34659k09507j01208
24645d43068R3138K78279J10297m9024j03845O965n5030j8257J8526q0011Q7982
24634a54048r9610o6872Q2828n6106p4859O2069J23748O4291J39863j1286o1204
24623e1186k693j34828p2563J9621r0119p2731k9642J42568J65611Q2366p7048
24612a20644q1024J6766j32164K3721L357p4815k0790Q1149J58162M9706L1573
24601f5003J4493J35091L903o7226k6664J83239L4417K4189k1286k11181M0801
24590D4773O2487j26843q6026J30240J44583L1967r3619k11052o0916o9129J34898
24579i8637J95045N3817K5846j09131m4013j52539J85383P0266L6084j46823k68622
$$ plain form
24655 54809 43698 155585 38117 -81233 -30909 29900 2306 -132353 -341860 -443068
24645 -443068 -349930 -71651 38646 -10378 -114223 -107258 -162288 -180545 -162019 -242030 -154048
24634 -154048 -253658 -320530 -237702 -293808 -368667 -306598 -182850 -118559 21304 10018 -51186
24623 -51186 -53879 -188707 -261270 -241649 -331768 -404499 -434141 -291573 -125962 -43596 -120644
24612 -120644 -201668 -184902 -317066 -293345 -289988 -364803 -385593 -304444 -146282 -96576 -65003
24601 -65003 -50510 84581 88484 21258 -5406 177833 212250 236439 215153 3972 44773
24590 44773 107260 -19583 -105609 24631 169214 201181 107562 -103490 -164406 -233535 -98637
24579 -98637 96408 150225 176071 66940 22927 -129612 55771 126037 162121 15298 -253324
24568b53324o9526R8211J63863J26277k205j49571K4721o6285l8169n7859o9759
24557b93626l3852j58964Q1109K78908K6896J6850J97603m5260j28120L8848j25589
24546a45197J86545J05329k29587o1572k9737j14109j04383m2467l7206K7527
24536d44857K57672L03056l5038k54562j09971m2167J98227J62141p4046J07036
24526F7491R0131l22565l64435Q8139K76511J15227J49205M0564p796j78015m9222
24515i4765j59932J48484j9113m5753J27879J10337K5718k33314q9382J25897
24505a03944J29186N8320r4919Q8387Q3165R7839l2343R2734j09404j69226Q3203
24494A22998j62133j9031J09800K4772m9018O5659J40738K1071P2878j25039l01965
$$ plain form
24568 -253324 -322850 -224639 -60776 65501 63296 -86275 -61554 -127839 -166008 -223867 -293626
24557 -293626 -327478 -486442 -405333 -126425 -99529 -82679 114924 69664 -58456 -19608 -145197
24546 -145197 41348 146677 -82910 -144482 -174219 -288328 -392711 -435178 -472384 -444857
24536 -444857 -187185 115871 80833 -173729 -283700 -325867 -127640 34501 -39545 67491
24526 67491 157622 -164943 -529378 -441239 -164728 -49501 99704 140268 132472 -45543 -94765
24515 -94765 -254697 -106213 -125326 -171079 -43200 67137 92855 -140459 -229841 -103944
24505 -103944 25242 83562 -11357 77030 160195 258034 225691 318425 209021 39795 122998
24494 122998 -39135 -58166 51634 76406 27388 93047 233785 254856 327734 202695 -99270
24483i9270J35123J16885m533j55813k1277J20982j04548r5615j00321j83193
24473c91580N1279J26838n025J19943J59836o9520j598o6486J47544q0429j48768
24462a57966L5356p7413Q2841m7887r0507J1827P9911J15381Q3271J16041J63738
24451C14593M6976m0881q0930k9130j80577j40354J26782j38407l9169n2914j45825
24440c59836K1801Q3305m7921M4882o4420J060K5000J503O2787J87879K61048
24429B17088J16836k23591l37003j71370K29659J78390r4552n9224R1039j24815
24419a77543L487J04454n746j62120j77538n6863M821K62624M6308P4692L2872
24408e0552j45269k6159l2885J6362J54538K8069j25421l579j1094P032J4057
$$ plain form
24483 -99270 35853 152738 148205 -7608 -28885 92097 -12451 -108066 -208387 -391580
24473 -391580 -340301 -213463 -218488 -98545 61291 -8229 -9827 -76313 71231 -9198 -157966
24462 -157966 -122610 -200023 -117182 -165069 -255576 -243749 -163838 -48457 34814 150855 314593
24451 314593 361569 320688 239758 210628 30051 -110303 16479 -121928 -161097 -214011 -359836
24440 -359836 -338035 -254730 -302651 -257769 -322189 -321129 -296129 -294626 -231839 -43960 217088
24429 217088 333924 110333 -226670 -398040 -168381 10009 -84543 -143767 -52728 -177543
24419 -177543 -174056 -69602 -75348 -237468 -415006 -471869 -467048 -204424 -158116 -83424 -50552
24408 -50552 -195821 -221980 -254865 -238503 -83965 -55896 -181317 -184896 -195990 -188958 -174901
24397a74901O6288L2208j96899P8376J60124q3227M6562K66640K16666j51240
24387B60597o9806j8409j87938P3885J02567O0589m0016j96546j05916K0837R83
24376i9173J8981m9609k8714j4490l0275J15114J59309k5296m6733R3460L0475
24365A23049O4122j3413L1746k0544j45612j6483j0459r7341L924J27474J0423
24354E6886q3293k399O9235K1298q6463q2467J10092j38022L5295J42477M223
24343D6862K3765j21898j14640l5084J00824P466J44911J86177L2527k2925j96700
24332E1285k29459j77098m9832O0697J11796J27127K38783m8319m5797P3808N8596
24321A71587j23945j36978m4491K42110k15906r8103Q1103L3558J56121N8189
$$ plain form
24397 -174901 -108613 -76405 -273304 -194928 -34804 -118031 -71469 195171 411837 260597
24387 260597 190791 172382 -15556 58329 160896 221485 181469 -15077 -120993 -100156 -99173
24376 -99173 -80192 -129801 -158515 -173005 -203280 -88166 71143 45847 -886 92574 123049
24365 123049 187171 173758 205504 184960 39348 22865 12406 -84935 -81011 46463 56886
24354 56886 -26407 -28806 40429 61727 -24736 -107203 2889 -135133 -99838 42639 46862
24343 46862 70627 -51271 -165911 -200995 -100171 -92705 52206 238383 270910 247985 51285
24332 51285 -178174 -355272 -405104 -344407 -232611 -105484 133299 84980 39183 112991 171587
24321 171587 47642 -89336 -133827 108283 -107623 -205726 -124623 -91065 65056 123245
24311A23245j49474j03528J33867R968r1541N7514J4630l0239o6284n7488M1033
24300a18297p7722r2701M6397K40536J36418n9791j4485P4173N8355j16355o5155
24289A1373l8531J55283L7225j21945j04074j89831k5636j8805L8541J00917m8182
24278b03665j10948L1404k7991J07275J42681N1117L3933o8782o4152j22290K425
24267b28993J71346J97316P9411l6069j06224n4386k1114O4804l4050j90830j15020
24256b73809N4576l2569J40537J76807K1872N2512N1656j32319L2361j51954j72367
24245b32697R9998R0380J91570K1012j50358j76856o2716n304J90022K80460P746
24234B53257l47778r3758r0665L650J10641R4806K1275P1409P8837n26o1399P9161
$$ plain form
24311 123245 -26229 -129757 4110 14078 -77463 -19949 -5319 -35558 -101842 -159330 -118297
24300 -118297 -196019 -288720 -242323 -1787 134631 74840 60355 134528 192883 76528 11373
24289 11373 -27158 128125 165350 43405 -60669 -250500 -276136 -294941 -256400 -155483 -203665
24278 -203665 -314613 -283209 -311200 -203925 -61244 -10127 23806 -44976 -109128 -231418 -228993
24267 -228993 -57647 139669 219080 183011 76787 22401 1287 66091 32041 -158789 -273809
24256 -273809 -219233 -251802 -111265 65542 87414 139926 191582 59263 91624 -60330 -232697
24245 -232697 -132699 -42319 149251 170263 19905 -156951 -219667 -224971 -34949 245511 253257
24234 253257 -94521 -188279 -278944 -275294 -164653 -69847 -48572 22837 101674 101148 39749 118910
24222A18910p1095L4618k0914p3219n377R0431K26767J26720p8851n9123o0395
24211B28472k57397j91590M3573j42221L3335K48380Q7447L4151O0115M7397r9263
24200I2399R792r2878M45j18249n5350n8772n4095J45652P1292n2101J9469K13637
24188A21241J6198l6931Q4986N4352m7611j75307j84631J05046K02245j0159j52617
24177b3188l776j13982p7169K1488N2837J899M2613J65660J46494r0725k57327
24166a35176k10625J29437K21732K2547R170R5498o3158j73198m3396j434Q34
24155a47769J95796N8608R3841o2188k6242M2874o7495k67645M6344Q3657m3081
24144i3300k0225K9471R8087J63471J20395k46873j40115j04865k0698l4621n6281
$$ plain form
24222 118910 47815 82433 61519 -11700 -17077 73354 300121 426841 347990 288867 228472
24211 228472 -28925 -220515 -176942 -319163 -285828 -37448 49999 84150 144265 191662 92399
24200 92399 102191 9313 9758 -108491 -163841 -222613 -276708 -131056 -59764 -111865 -92396 121241
24188 121241 137439 100508 185494 239846 192235 16928 -167703 -62657 139588 129429 -23188
24177 -23188 -26964 -140946 -218115 -196627 -143790 -141891 -99278 66382 212876 122151 -135176
24166 -135176 -345801 -216364 5368 27915 37085 132583 69425 -103773 -147169 -148603 -147769
24155 -147769 48027 106635 200476 138288 112046 154920 87425 -180220 -133876 -50219 -93300
24144 -93300 -113525 -84054 14033 177504 297899 51026 -89089 -193954 -214652 -249273 -305554
24133c05554N8210J07807j4067j49050K78308q922j50412j11715J50355J22785
24123b2255J08616K143j13665J13820R8216l3373k25656p4227k0826N9273n3196
24112a61130j91293j1380J21442J62246J87777j30410k74574J94154Q7774j32866
24102a48260k13956k5893K6980K5267M9331O7915k4910J9319k0660J6317J37614
24091i0936K63360K26353j64281l45095r2292K8788O2935O4144P2225M6976L7561
24080A09738q0418j70812N5522M6677k26405n3097L3286Q599Q5229Q354J581P1143
24068a10603M435n2557M5127l4694o561P219p5960M2091K06355R8062n4934k26464
24056a58484j07008j39137j25141K87389J81693O6813j85420j76000N2150n2745
$$ plain form
24133 -305554 -247344 -139537 -153604 -302654 -24346 -33268 -183680 -295395 -145040 -22255
24123 -22255 86361 88504 -25161 88659 186875 153502 -72154 -146381 -167207 -107934 -161130
24112 -161130 -352423 -363803 -242361 -80115 107662 -22748 -297322 -103168 -15394 -148260
24102 -148260 -362216 -388109 -361129 -335862 -286531 -218616 -243526 -224207 -244867 -228550 -90936
24091 -90936 172424 398777 234496 -110599 -202891 -174103 -111168 -47024 25201 72177 109738
24080 109738 29320 -141492 -85970 -39293 -265698 -318795 -285509 -276910 -191681 -183327 -181746 -110603
24068 -110603 -106168 -158725 -113598 -148292 -154853 -147634 -223594 -181503 24852 122914 67980 -158484
24056 -158484 -265492 -404629 -529770 -242381 -60688 6125 -179295 -355295 -303145 -355890
24046c55890o2250P1652R354j01229Q1697J69836J63811N7095j90619J6980P3505
24035f6058L6224J85972l238k60010m3672R7236N0277j36116j79970J36426R1412
24024i1517J32555n885Q0657K20619J57658j46187j08467J22934p4845j03404
24014A84118K8767j15609j16593l8924o1472o8564J03435J376j14473o0325J8912
24003b39352O5499l6450n5855K41642J39653K6100k24716J16639J31823Q794N7996
23992B31773q9014n4217j8729o0135j42883m2467J04972n1363k17568J60210m8628
23981b28049m1677r1419M1797o7415K4836k8103K6484P0339J50292j20255Q554
23970b54616K26810j2189o5510r1022m1280J06151Q097K4540J60186J2369k08759
$$ plain form
24046 -355890 -418140 -346488 -337134 -438363 -356666 -186830 -23019 34076 -156543 -139563 -66058
24035 -66058 -29834 156138 152900 -107110 -150782 -53546 -3269 -139385 -319355 -182929 -91517
24024 -91517 41038 35153 115810 336429 494087 347900 239433 362367 287522 184118
24014 184118 212885 97276 -19317 -58241 -119713 -188277 -84842 -83466 -197939 -258264 -239352
24003 -239352 -173853 -210303 -266158 -24516 115137 141237 -83479 33160 164983 173777 231773
23992 231773 142759 88542 69813 9678 -133205 -175672 -70700 -122063 -339631 -179421 -228049
23981 -228049 -269726 -361145 -319348 -386763 -361927 -390030 -363546 -293207 -142915 -263170 -254616
23970 -254616 -27806 -39995 -105505 -196527 -237807 -131656 -123559 -99019 61167 73536 -135223
23959a35223j45162R865J16010Q5723J17563J97217p5462k136j84304j26121N572
23948a36458R9716M5631K16409R1756j4776j08448L5508k1209r9508j61032j76974
23937b29385j63602l7212K90362J22410j87692j9928r0030J06369K84735p3732
23927B295j55889K6312J53838P059j02030m9429P0177O7930K307n012L5955p8237
23915b4724p415K9539P3999m4042k947n0431j00102J18047n1877J24120j04076
23904c9909j70033L666J74876J41244k05097j92290K31119R162J672L9607J2382
23893F399J13046Q2596O3895k2696m9425M0498J25643m3414j15697j26384m9466
23882B4995P5800P9906l65066k19379J0818M7126J89517K4450o1931J7072n328
$$ plain form
23959 -135223 -280385 -270520 -154510 -68787 48776 245993 170531 168395 -15909 -142030 -136458
23948 -136458 -36742 8889 225298 317054 302278 193830 229338 208129 108621 -52411 -229385
23937 -229385 -392987 -430199 -139837 -17427 -205119 -225047 -315077 -208708 76027 2295
23927 2295 -153594 -127282 26556 33615 -68415 -117844 -47667 20263 22570 17558 53513 -24724
23915 -24724 -32139 -2600 71399 27357 24410 -26021 -126123 -8076 -59953 64167 -39909
23904 -39909 -209942 -206276 -31400 109844 -95253 -287543 -56424 -47262 -45590 -5983 6399
23893 6399 119445 202041 265936 243240 193815 234313 359956 316542 200845 74461 24995
23882 24995 100795 180701 -184365 -403744 -392926 -345800 -156283 -131833 -193764 -176692 -182020
23871a82020o5368o1220N7546o3486N2924J24165K6208P6694L8347l3213r5295
23860a24718j46899j1233J46309K50727M9167q879J07206Q0863o3894j78362M9173
23849A49460J31187n2791J5899R846j67741j44838Q0048O2849K7836o088k7071
23838G8596J98491j60799k78146l11717J63459m994j46654K9507J62612Q1234
23828a88411j86701R167M88621o1461j56106J61206K06459K7788r9596k19681
23818a8715k43068J07580J11475k7302J01781J10841k52154j56708Q5724J0133
23808a70413j08465J03739J5509l08688J36432Q2522P294R2497l0870P6769m9977
23797a53651j16989o9747m275Q0628J37030J09082O4471O8154M290j27992n4195
$$ plain form
23871 -182020 -247388 -308608 -251062 -314548 -261624 -137459 -111251 -34557 3790 -29423 -124718
23860 -124718 -271617 -282850 -136541 114186 163353 154474 261680 342543 278649 100287 149460
23849 149460 280647 227856 243755 253601 85860 -58978 21070 83919 111755 105667 78596
23838 78596 277087 116288 -161858 -473575 -310116 -315110 -461764 -432257 -269645 -188411
23828 -188411 -375112 -365945 122676 61215 -94891 66315 272774 300562 200966 -18715
23818 -18715 -261783 -154203 -42728 -70030 31751 142592 -109562 -266270 -180546 -170413
23808 -170413 -278878 -175139 -159630 -468318 -331886 -249364 -242070 -149573 -180443 -103674 -153651
23797 -153651 -270640 -340387 -344662 -264034 -127004 -17922 46549 114703 118993 -8999 -63194
23786f3194O2422j46527o6292J80984P5949J24153k36560p0089o4822p5815q2844
23775c62635N1357K8174o5470O7995K38991M7781o0576N6480o4693r9764k80374
23764d42734K1792K05315Q4630k646n8976N5368r3121k1463J12157P1165l8060
23753a06573J40155j7073n1770J05114m573m1028J77254j52340l5712Q6870N7568
23742A57892n106j95550o769l9420K37381p3188l50303o5633N805l1721j8292
23731c84904N2362J88789q4848j325N956k7072J08425q2453r7551q796j6772j121
23719c49310J20359J21681P4252o5255k23720j29518K01168J1126Q7319o0936
23709b12834R0466O5252n9725k09059j12837O2077k9384J90859N9376O3406O4371
$$ plain form
23786 -63194 -772 -147299 -213591 -32607 43342 167495 -69065 -139154 -203976 -279791 -362635
23775 -362635 -311278 -283104 -348574 -280579 -41588 6193 -54383 2097 -62596 -162360 -442734
23764 -442734 -420942 -215627 -130997 -133643 -192619 -137251 -230372 -251835 -139678 -68513 -106573
23753 -106573 33582 16509 -35261 69853 65280 24252 201506 49166 13454 100324 157892
23742 157892 152786 -42764 -49533 -88953 148428 75240 -275063 -340696 -334891 -366612 -384904
23731 -384904 -332542 -143753 -228601 -229926 -223970 -251042 -142617 -225070 -322621 -331417 -348189 -349310
23719 -349310 -228951 -107270 -33018 -98273 -321993 -451511 -250343 -239217 -151898 -212834
23709 -212834 -122368 -57116 -116841 -325900 -438737 -376660 -406044 -215185 -155809 -92403 -28032
23698b8032J651j20341n835n5820p9526J24016J46438J20491j09135j29990o593
23687a42676J29974k7492K05155Q861j52428L995n0407j60232k6389j6584M6229
23676a81994K6521j27056q672K04288m9788p7594O5334J62418P5715j46899K6145
23665c1582R8643j32064o7344o222m7611L4989j22568K9264o5324k21016P2474
23654d58361L24853J67536Q1178M3236J79184R1717j23259k29416r1952o0664
23644g5948J00412M8672j20262j50555K4728J85937R213j33958q9741J47824Q7554
23633C3876Q8348J1637j8783j01059p7238O7289r9390p2526L6275L7348K36367
23622A42144J97403j226M3639p355j22721k25142j37295K1874J73980M7023j51482
$$ plain form
23698 -28032 -26381 -146722 -152557 -208377 -287903 -163887 -17449 103042 -6093 -136083 -142676
23687 -142676 -12702 -40194 164961 173822 21394 25389 -25018 -185250 -211639 -228223 -181994
23676 -181994 -155473 -282529 -291201 -86913 -136701 -214295 -148961 13457 89172 -57727 -31582
23665 -31582 67061 -65003 -132347 -138569 -186180 -151191 -273759 -244495 -309819 -530835 -458361
23654 -458361 -133508 34028 115206 158442 337626 429343 306084 76668 -15284 -75948
23644 -75948 24464 73136 -47126 -197681 -172953 12984 22197 -111761 -201502 -53678 33876
23633 33876 122224 133861 115078 14019 -63219 4070 -95320 -167846 -131571 -94223 142144
23622 142144 339547 338321 381960 374605 251884 26742 -110553 -88679 85301 132324 -19158
23611a9158O7868q6180P982K0952l1725j4092K8764O9568J20699k1899n9276j35862
23599e2359M4282M1012J03947j66865r0594O7482J0549j24213l5807J4793J5521
23588a72252P0761k9180L1346J57329J20693M370N727N505k46752r5871K3930
23577a24394k8773L0340j6595k5054k6019J37787J23135j34305j88804j15545
23567c68227J20393K1514M5652J95432O5102n2712K6335m8045k19429j07809j27150
23556d48944Q5406J10929N904J70917L0080R6170q2761j3823m6115L8736J50692
23545I7191q9997l0960P0963O9569J01307o5428j5685k3554J9746N5596J07098
23534B95846k2752j71423O0382j1314k2976N5519j25514j51275j5620o7949k767
$$ plain form
23611 -19158 48710 -37470 -29488 -8536 -40261 -54353 -25589 43979 164678 142779 83503 -52359
23599 -52359 -8077 32935 136882 -29983 -120577 -53095 -42546 -166759 -202566 -187773 -172252
23588 -172252 -101491 -130671 -99325 58004 178697 183067 188794 194299 -52453 -148324 -124394
23577 -124394 -153167 -122827 -139422 -164476 -190495 -52708 70427 -63878 -252682 -368227
23567 -368227 -247834 -226320 -180668 14764 79866 27154 53489 5444 -213985 -321794 -448944
23556 -448944 -363538 -252609 -246705 -75788 -45708 50462 -32299 -46122 -92237 -53501 97191
23545 97191 7194 -23766 47197 116766 218073 152645 136960 113406 133152 188748 295846
23534 295846 273094 101671 162053 150739 127763 183282 57768 -93507 -109127 -177076 -179843
23523a79843j23685j44098J39729J92254q633O335Q7694j04953Q8703Q1274n1241
23512a6464k06222j93391K48630R5284j49329J5976J02044O4644P8382M4002L0937
23501A14493K0436j17824m5403M9081r8553M1481J10330J3725M7452M7092m1399
23490A40911J16767p0877j48653j91671r1639J73033l2833N1979K82428N2958
23480B82403j4813N4032L6081p6063p9060J9569L1456p6487k1544j04167l3061
23469A8346k20308J45645L10963j3402j10473m3933j64335p8880R5322n8124Q1244
23458c7935j36739j12822J69245n9551O2688K47871k20993n3902N3143R5178j6059
23447i876P0753j36027k31645l9051K91762n5512j8071J11376M7741l5530j25744
$$ plain form
23523 -179843 -303528 -447626 -307897 -115643 -124276 -117941 -30247 -135200 -46497 34777 -16464
23512 -16464 -222686 -416077 -167447 -72163 -221492 -205516 -103472 -38828 39554 83556 114493
23501 114493 134929 17105 -28298 20783 -77770 -36289 74041 87766 135218 182310 140911
23490 140911 257678 186801 38148 -153523 -245162 -72129 -104962 -52983 229445 282403
23480 282403 267590 321622 357703 281640 202580 222149 253605 177118 155574 51407 18346
23469 18346 -201962 -56317 254646 241244 130771 86838 -77497 -156377 -61055 -119179 -37935
23458 -37935 -174674 -287496 -118251 -177802 -115114 132757 -88236 -142138 -88995 6183 -9876
23447 -9876 60877 -75150 -306795 -345846 -54084 -109596 -127667 -16291 31450 -4080 -129824
23436a29824j80148l306k0254K9931N6036J78428Q5833M3459q7031o7087M7800
23425d6163J26554k8705j21742K16001P5617n1194Q1201Q7923q0241p8569j94453
23414a3771M6095j82998j98988J13029L4456J54848J4292J30649m1848J95994
23404B51758l2396j56970j08195r1205J26456l028j6708Q2839P3812J662m3593
23393H4432j36157j65852j14918q1601o786J5700L2028K37713q4649p6744m8477
23382c45311n3614q776K39874K5353q4998p4198J66648L6587q1601k46509N8082
23371c68463J94654J82473m1323j07742r468J4339J48745J73721j49681l00167
23361b62912J33794Q7536P7604Q5034J19761K2200J1186o4270J6737J7246J1219
$$ plain form
23436 -129824 -309972 -313278 -333532 -303601 -247565 -69137 16696 60155 -26876 -93963 -46163
23425 -46163 80391 51686 -70056 145945 221562 170368 251569 339492 259251 180682 -13771
23414 -13771 32324 -150674 -349662 -236633 -202177 -47329 -33037 97612 55764 251758
23404 251758 219362 62392 -45803 -137008 -10552 -13580 -30288 52551 126363 128025 84432
23393 84432 -51725 -217577 -332495 -414096 -420882 -405182 -373154 -135441 -220090 -296834 -345311
23382 -345311 -398925 -407701 -167827 -142474 -227472 -301670 -135022 -98435 -180036 -426545 -368463
23371 -368463 -173809 8664 -32659 -140401 -149869 -135530 13215 186936 37255 -262912
23361 -262912 -129118 -41582 36022 121056 240817 263017 274203 209933 226670 243916 255135
23350B55135j62753J23590J01065m9206l01247j29237p3552J96050l4580k373
23340g7108K57937O3143l9152L4291o5291j11279j75589j03118k11851J84864
23330b43153J44184j23491M7348J56278J97132n9856j43138k00403K5811J48232
23320e1056Q7629l6441M9821q9444p8926p6749K01622R6033j74233N630r1225
23309a57339j55689P728o4924K1918J84776J07552N5474k2641o3058k5880k12110
23298c24193m4545K53749K29777k21834k25239J55692k3939n0835l5285O694K45215
23287c4743P1413k0203l308M826O9337J1147j99201l5493n1775J06466J10306
23276B8772r193J865R1894O3611M0664O4741k30825k32271k4430l8034J10623
$$ plain form
23350 255135 92382 215972 317037 267831 -33416 -162653 -236205 -40155 -74735 -77108
23340 -77108 180829 243972 204820 239111 173820 62541 -113048 -216166 -428017 -243153
23330 -243153 -98969 -222460 -175112 -18834 178298 118442 -24696 -225099 -199288 -51056
23320 -51056 36573 132 49953 -39491 -118417 -195166 6456 102489 -71744 -66114 -157339
23309 -157339 -313028 -305300 -370224 -348306 -163530 -55978 -504 -23145 -86203 -112083 -324193
23298 -324193 -368738 -114989 114788 -107046 -332285 -176593 -200532 -251367 -286652 -279958 -34743
23287 -34743 36670 16467 13159 17985 87322 98469 -100732 -136225 -188000 -81534 28772
23276 28772 19579 21444 113338 176949 217613 282354 51529 -180742 -205172 -243206 -132583
23265a32583K09524l3371J74767O4416j44649o4199p9281o4782j34335n4886J00252
23254a59127L1879p5509J52988Q0310j53963n0808j10707J28277J51916K39398
23244B34654J28344o8203q3545k83648K1851n2216j11718M3260j475J00128J83059
23233A10491J20575j18826j46822j19474l1365o035K89901J21362j27562J1898
23223A04143M1785J6671n7287M0264j00402j31850K2960J40162r1199q1399r4061
23212a90213J23841N1913L12331J37643J0757r385l18781k72794J82921J19700
23202A47933N2385J9666j50687m0869r0530l1898N2252M7859J89546J37113j59701
23191A73069m8223l8351j22248n0282M0446K77045K9381j87673j18779j35666
$$ plain form
23265 -132583 76941 43570 218337 282753 138104 73905 -5376 -70158 -204493 -259379 -159127
23254 -159127 -127248 -202757 -49769 30541 -123422 -174230 -284937 -156660 -4744 234654
23244 234654 362998 294795 211250 -72398 -50547 -102763 -214481 -171221 -172696 -72568 110491
23233 110491 231066 112240 -34582 -154056 -185421 -191456 98445 219807 92245 104143
23223 104143 145928 162599 105312 145576 45174 -86676 -63716 76446 -14753 -96152 -190213
23212 -190213 -66372 -14459 297872 435515 446272 436887 118106 -154688 28233 147933
23202 147933 200318 219984 69297 28428 -62102 -94000 -41748 6111 195657 332770 173069
23191 173069 124846 86495 -35753 -86035 -45589 231456 260837 73164 -45615 -181281
23181a81281j63385o4748l6668N7132J65474K01949P7366P3214o6305l6464p8937
23170e2653q0343P7258j57234J9697R5323K1099M1579M501l82903j25429L06430
23159b32675K84672J29489P3233J34425l959J1400k25719j79276R2210J40341
23149B24141M93j21423j01266p0623j38941l2168J83731J75476K7753j07341j00697
23138f0865J47J01421j19938j87443K4684K15038J32920k774J78919J39743k8217
23127C93635r8054k35687k26226m6831k8944l101j17319K91286r148J22833K42555
23116B84999l6177j78579N762n1287j40014j11262k0579o9469r1379K52663J28364
23105b6958N3021J7288O0386k9292L1626q5233m4513j33892j80836O0808P7511
$$ plain form
23181 -181281 -344666 -409414 -446082 -388950 -223476 -21527 55839 129053 62748 26284 -52653
23170 -52653 -132996 -55738 -212972 -193275 -97952 -76853 -35274 -30773 -413676 -539105 -232675
23159 -232675 51997 181486 254719 389144 385185 396585 170866 -8410 83800 224141
23149 224141 224634 103211 1945 -68678 -207619 -239787 -56056 119420 147173 39832 -60865
23138 -60865 -60718 40703 -79235 -266678 -241994 -26956 105964 103190 282109 421852 393635
23127 393635 295581 59894 -166332 -213163 -242107 -245208 -362527 -71241 -80389 42444 284999
23116 284999 248822 70243 76005 24718 -115296 -226558 -247137 -316606 -407985 -155322 -26958
23105 -26958 26063 43351 103737 74445 106071 20838 -23675 -157567 -338403 -277595 -200084
23094b00084k5940K3368O4757M6644J99461q1100k01195N346Q3001K425J66062
23083H2745Q6159o3497O1274n01m996o2208J0607n0645R2795m2580O6800r7637
23071G8316j61822k9217k3048n0054J69543K8198l4062j11394j55616M8873J7080
23060b23203p2055J11420n2359m4818k6766j10709k3813L25528R0662p6262Q8128
23049a4247J43021k5513j88277l57678j11882k6601J45547J33916J18169l2881
23039b16426M5202j31830P6795J77508M1440j6651N2715K58853k4441j32319l350
23028A27496J14406J01973j74049q302R3054p4918k11140j46712O4560O7087r3123
23017a39668j15747J5864J26956K1864m1582o0837P7010Q5641j29130j14537J9639
$$ plain form
23094 -200084 -226024 -202656 -137899 -91255 108206 27106 -174089 -168743 -85742 -83317 82745
23083 82745 168904 105407 166681 166180 161184 98976 109583 58938 151733 109153 175953 78316
23071 78316 -83506 -112723 -135771 -185825 -16282 11916 -22146 -133540 -289156 -240283 -223203
23060 -223203 -295258 -183838 -236197 -281015 -307781 -418490 -442303 -116775 -26113 -102375 -14247
23049 -14247 128774 103261 -85016 -442694 -554576 -581177 -435630 -301714 -183545 -216426
23039 -216426 -171224 -303054 -226259 -48751 -7311 -23962 28753 287606 263165 130846 127496
23028 127496 241902 343875 169826 161524 254578 179660 -31480 -178192 -113632 -46545 -139668
23017 -139668 -255415 -239551 -112595 -90731 -132313 -193150 -116140 -30499 -159629 -274166 -254527
23006b54527J8154J63143j02507Q4775J48501j92134j27372J81341k2634r836
22996a13096j2156Q4011J63565j34811m7602J24955M304o8411j74868n7026J49018
22985h2117J52920l5880m4603J9715j9124J04637j14850k86842r2227m623J94779
22974b08215r7658l8322O3739o7824R3525K10450J33936j98753k07742p0432N0582
22963c36714J45401J62341j04062J52226J47464k23333k45441l7646L79843M2563
22953H2642L8071q4872j66601M6775J41907r1443j30356j34066p0739K00083J74897
22942F298J15258p750j18271k77804k21560K0567K19840r782p8499O6303J5023
22931b70377M7593L8965j88118P4194J67157M5836L3024r7742j83891j02510R2277
$$ plain form
23006 -254527 -236373 -73230 -175737 -90962 57539 -134595 -261967 -80626 -103260 -113096
22996 -113096 -125252 -41241 122324 -12487 -60089 64866 69170 759 -174109 -231135 -82117
22985 -82117 70803 34923 -9680 10035 -9089 95548 -19302 -306144 -398371 -402994 -208215
22974 -208215 -305873 -344195 -280456 -348280 -254755 -44305 89631 -109122 -316864 -387296 -336714
22963 -336714 -191313 -28972 -133034 19192 166656 -56677 -302118 -339764 40079 82642
22953 82642 120713 35841 -130760 -83985 57922 -33521 -163877 -297943 -368682 -168599 6298
22942 6298 121556 113806 -4465 -282269 -503829 -483262 -263422 -273204 -351703 -285400 -270377
22931 -270377 -222784 -183819 -371937 -297743 -130586 -84750 -51726 -149468 -333359 -435869 -343592
22920c43592K89885N6047l3018J07908L3472M6916Q2909j07857k62805k66335
22910c96470M7780J52757P3699q1025p4066J753r5924j03571N8817J53071J06987
22899a56192l2045j09938J27048p4160J45035r903J39680M6856p4540l9127r2242
22888a29528J8313L5734M8570J54799P0938r5352r3683N5531m8689o7306O4925
22877A4252j0239M0582M6980q7523j70489k872j22194M0375J39263P4404L5912
22866a549p7025r6940J57041M5885J3762J10615R07r3051k31643k33487J5855
22855c89630j48778j67655J70453J84009O6189P6852j3097m5032J60441Q6568
22845a9680J20017j52626m7441q7985P8380p4147K0613k6996r5764L5013M6917
$$ plain form
22920 -343592 -53707 2340 -30678 77230 110702 157618 240527 132670 -130135 -396470
22910 -396470 -348690 -195933 -122234 -203259 -277325 -275572 -371496 -475067 -416250 -263179 -156192
22899 -156192 -188237 -298175 -171127 -245287 -100252 -110155 29525 76381 1841 -37286 -129528
22888 -129528 -111215 -75481 -26911 127888 198826 103474 9791 65322 16633 -50673 14252
22877 14252 4013 44595 91575 4052 -166437 -169309 -291503 -251128 -111865 -37461 -1549
22866 -1549 -78574 -175514 -18473 27412 41174 151789 152696 59645 -171998 -405485 -389630
22855 -389630 -538408 -706063 -535610 -351601 -285412 -208560 -221657 -266689 -106248 -19680
22845 -19680 100337 -52289 -99730 -187715 -109335 -183482 -162869 -189865 -285629 -250616 -203699
22834b03699M6962J30905Q3147k15397p8279J72829Q5684L9416K3927n3846o6810
22823c5161p1679j89018l3999J86655J23652N0263N848j11784K48355K9726J75954
22812C78812J37080Q8459J8974k09129l77734q9153J58943J23721k18337j7962
22802f326l1986j54947R6415R2335M8115K42077J8056k73680k06194p3914K0639
22791b29410R8105K84641Q1840j10873j07264J75199j75303k76433O5635J14605
22781g9258j39320j19351P4491O8887N8980R4657r7766k36662K33152J07219m7213
22770h2184J06771J97550j94733k17342J4626L4379N5531l0486J7353J20415O3451
22759H5331j41792n2587j04961K4111K13882q461n0889q4792J5129J22065N6139
$$ plain form
22834 -203699 -156737 -25832 57315 -158082 -236361 -63532 22152 61568 85495 31649 -35161
22823 -35161 -106840 -295858 -329857 -143202 -19550 30713 36561 -75223 173132 202858 378812
22812 378812 515892 604351 623325 414196 36462 -52691 106252 229973 11636 -6326
22802 -6326 -38312 -193259 -96844 -4509 43606 285683 303739 30059 -176135 -250049 -229410
22791 -229410 -131305 153336 235176 124303 17039 192238 16935 -259498 -193863 -79258
22781 -79258 -218578 -337929 -263438 -194551 -135571 -40914 -138680 -375342 -142190 -34971 -82184
22770 -82184 24587 222137 27404 -189938 -175312 -140933 -85402 -115888 -98535 21880 85331
22759 85331 -56461 -109048 -214009 -189898 23984 15523 -35366 -120158 -105029 17036 73175
22748G3175q661m7361j10260M4853Q3728j61718O0880k7198q1274j79700j30942
22737d84478Q1873J67556L13143J54492j88186k39029k07194k1347K91476K58092
22727A26398J69555L336k22455j55096n4423Q4401n0625K8484m9782J54648J20784
22716A55225n6326k35476o2798J2549J7382R6519K9254l8553O365p079j43655
22705b26593q7017L2664J43715p2215m4618n9708J37927L85787j823k93006k32794
22694c17681l762O1685R4599J61657J66100p1038J2532n0936p1824j70358m9966
22683b38992J04950J01714O8862K3761j04968l14630j39966l80J46424K15664
22673a37561j92470j64466J86535l4000L0437J81389J06014R3446K552j21538
$$ plain form
22748 73175 64514 17153 -93107 -48254 35474 -126244 -65364 -92562 -173836 -353536 -484478
22737 -484478 -402605 -235049 78094 232586 44400 -194629 -401823 -423170 -131694 126398
22727 126398 295953 299289 76834 -78262 -132685 -48284 -98909 -70425 -120207 34441 155225
22716 155225 98899 -136577 -199375 -186826 -169444 -72925 -43671 -82224 -75859 -82938 -226593
22705 -226593 -313610 -280946 -137231 -209446 -254064 -313772 -175845 209942 208119 -84887 -317681
22694 -317681 -321443 -259758 -165159 -3502 162598 91560 104092 53156 -18668 -189026 -238992
22683 -238992 -134042 -32328 36534 60295 -44673 -359303 -499269 -499649 -353225 -137561
22673 -137561 -330031 -494497 -307962 -341962 -311525 -130136 -24122 69324 71876 -49662
22663d9662o4747q3707r0807J58382J50197N6431N7166j61619k64340M2259J31096
22652a19351J78288M296r2038j91507q1117L477K9984q6737O3337K4627J767l5766
22640c00740J8782N5716J66378J89256J62930j21156j19567j7301J53004j22051
22630F5251j73591j18034l6182R5603J36721l2163j34736N8347J33889J819j29624
22619a32700J92454j5731j29385l4429J1246m9770j08255o1305r4131J26926K33199
22608f1881m5919m5918Q2714R5573j5285J34990K0909p5402j76102m3122j24271
22597b53714K34324J85612j18515o9996n0601j9238L7601j07266N2921o0579M1397
22586a28054J1m8300J40991P5740j24718L1545O769Q2550N459P749p1632k41190
$$ plain form
22663 -49662 -114409 -198116 -288923 -130541 19656 76087 133253 -28366 -292706 -250447 -119351
22652 -119351 58937 63233 -28805 -220312 -301429 -297952 -267968 -354705 -291368 -266741 -264974 -300740
22640 -300740 -281958 -226242 -59864 129392 292322 171166 51599 34298 187302 65251
22630 65251 -108340 -226374 -262556 -166953 -30232 -62395 -197131 -138784 -4895 -3076 -132700
22619 -132700 59754 44023 -85362 -119791 -108545 -158315 -266570 -327875 -422006 -295080 -61881
22608 -61881 -107800 -153718 -71004 24569 9284 144274 165183 89781 -86321 -129443 -253714
22597 -253714 -19390 166222 47707 -22289 -72890 -92128 -54527 -161793 -108872 -169451 -128054
22586 -128054 -128043 -176343 -35352 40388 -84330 -52785 -46016 36534 41993 49742 -21890 -263080
22574b63080r134n1669J88328J75403N5408N6537j07197j11407m8918J4454J5718
22563h5557L2988J9340L7147j37511L7161R9435P3594p6774j05953K69051Q4744
22552B47665j08099k31213p0090k3911Q6414R3451j0446L888L3129k06065j19820
22541c05097K18919n069j96343R7727p0012O6730J1017Q3185o3099N473J02566
22530e4003j4247n2417J79783N609q4226q857J14235J6398K04915k7389k05841
22519G3960K1701r491J4111o3658J3461P8614j05419j98926J12057q716j56069
22508b28375J0137J64571m5822k61701n3824J45488M703k1317M9294j07800j67999
22497e12645J18366J12478J03047Q5839k20560J09426j542n7899R2373J01124
$$ plain form
22574 -263080 -272214 -323883 -135555 39848 95256 151793 44596 -66811 -115729 -101275 -85557
22563 -85557 -52569 -33229 3918 -133593 -96432 3003 76597 -177 -106130 162921 247665
22552 247665 139566 -91647 -161737 -185648 -99234 -5783 -16229 -12341 20788 -185277 -305097
22541 -305097 -86178 -91247 -287590 -189863 -259875 -193145 -182128 -98943 -162042 -156569 -54003
22530 -54003 -68250 -120667 59116 64725 -19501 -28358 85877 102275 307190 279801 73960
22519 73960 95661 86170 100281 36623 50084 128698 23279 -175647 -63590 -72306 -228375
22508 -228375 -218238 -53667 -99489 -361190 -415014 -269526 -264823 -286140 -236846 -344646 -512645
22497 -512645 -394279 -281801 -178754 -92915 -313475 -204049 -205591 -263490 -171117 -69993
22487f9993J39982j35116N2504o5401o247m4590j716J44263p4211k06297r1149
22476c57971M4210J75359L9842j12904R9710L0354j11098l1607K33835R7087q5864
22465B0953r5247q7876L9347J76203N3014n1365N173j98696q0722r6261O2913
22454b52564R2517K06539j74431q3708J08586j49792M454J51142J40038L3240
22444G6021o287j21176m0513L9358R722L7634l5993k85261j52930J81621O6859
22433b30945O4632l1558J70341j73727n5356K32886P3549k98170n9856J80766
22423a27438K0337O7779l1729j9893m2115P0040m2405Q5434M959k3079Q3130Q0659
22411A25679N9966j01878j13371J04115j4106k9283k9896o1261m9022p1328j01676
$$ plain form
22487 -69993 69989 -65127 -12623 -78024 -84271 -128861 -130577 13686 -60525 -266822 -357971
22476 -357971 -313761 -138402 -98560 -211464 -111754 -81400 -192498 -224105 9730 106817 20953
22465 20953 -74294 -162170 -122823 53380 106394 55029 60202 -138494 -219216 -315477 -252564
22454 -252564 -160047 46492 -127939 -211647 -103061 -252853 -248399 -97257 42781 76021
22444 76021 69734 -51442 -91955 -52597 -42875 -5241 -41234 -326495 -479425 -297804 -230945
22433 -230945 -166313 -197871 -27530 -201257 -256613 -23727 49822 -248348 -308204 -127438
22423 -127438 -107101 -39322 -71051 -90944 -133059 -63019 -105424 -19990 -15031 -38110 45020 125679
22411 125679 185645 83767 -29604 74511 60405 31122 1226 -60035 -109057 -180385 -282061
22400b82061j05747l659K4611J25747L6789J38955R2507K7311J11361o0243J59013
22389B64584P4771q6510j37295k93443j02409J8931R1394j10908n0177N2458K4030
22378b54574O2682J6452L7264K16046N9999j33555q4820J47200L9772m5652N7907
22367A18721K4556p8379j03378K5116k2007j45390Q1998J40223p6148O8697P3783
22356A07792K20189N9574N4281j55636k85227J32579K1119M3726M6247j82474
22346F2170o2289k15027k7622J16061l7397k2342l1475n936P5932J47946J49770
22335A49791q9668j19905K8016J44109J74227r5656j50065k14079q8726J8469
22325b43487p769L5222n7905O7269K6345p8857O5462N0435M6868o269j00497l831
$$ plain form
22400 -282061 -387808 -391467 -366856 -241109 -204320 -65365 27142 54453 165814 105571 264584
22389 264584 339355 252845 115550 -177893 -280302 -261371 -169977 -280885 -331062 -278604 -254574
22378 -254574 -191892 -175440 -138176 77870 137869 4314 -80506 66694 106466 60814 118721
22367 118721 143277 64898 -38480 -13364 -35371 -180761 -98763 41460 -34688 34009 107792
22356 107792 327981 387555 441836 286200 973 133552 154671 198397 244644 62170
22346 62170 -119 -215146 -242768 -126707 -164104 -186446 -217921 -223857 -147925 21 149791
22335 149791 60123 -59782 -31766 112343 286570 190914 40849 -173230 -261956 -243487
22325 -243487 -251256 -216034 -273939 -206670 -180325 -259182 -193720 -143285 -96417 -102686 -203183 -207014
22313b07014O0530J28935Q9582j82219N5721Q8735j6531k63480m5229J97330J67357
22302G3717R4335P6783O2370N89j54018P5616N4410j37399Q1295J28752k70157
22291H6293j22338k0869O7593j74627j19352P1355p9071p3738J53567L47661K03793
22280C40267j06804m2827q6897J28689j03470j42013P2588K24201Q5554O0987
22270D30275j18848j23053j72323L0795L4649m8767J0377R254j15028j76751n7538
22259b96958l7871P8049N1873O2121K72275p1164m1969m1278J03649K33163j1200
22248C00690p1903j11778k9214j70775P701M7457j58242O1085J43648k0602j57546
22237a59479P9599n0241k67242j15619M1211K88036L13421K1795j00319r6926
$$ plain form
22313 -207014 -146484 -17549 72033 -110186 -54465 34270 17739 -245741 -290970 -93640 73717
22302 73717 168052 244835 307205 307794 153776 229392 283802 146403 227698 356450 86293
22291 86293 -36045 -56914 10679 -163948 -283300 -211945 -291016 -364754 -211187 136474 340267
22280 340267 233463 190636 103739 232428 128958 -13055 59533 283734 369288 430275
22270 430275 311427 188374 16051 46846 81495 32728 43105 52359 -62669 -239420 -296958
22259 -296958 -334829 -256780 -204907 -142786 129489 58325 16356 -24922 78727 311890 300690
22248 300690 228787 117009 87795 -82980 -75279 -27822 -186064 -124979 18669 -1933 -159479
22237 -159479 -79880 -130121 -397363 -512982 -471771 -183735 129686 151481 51162 -45764
22227d5764j68713Q7487p8640J2340J48287J31898o1543j7628n5735M5186j38361
22216a41186k5960J09546q2804J52391L2202j08223m3114k8974q4464j52409o277
22205c79272K34950J63170q5624J8052K65200L6509k56193j11730P1566k0745
22195f4117r778J02418J37802K6327j84300k43531J23406j3344P1774P0994j4735
22184B916J31449j01038l8407p400J74600J32029L2344r306k5877q0580j59597
22173E1133L6847r6984J31203J04351P1705j65459L6227n4649l5018p6529L6028
22162C8855n9036J434j09096K48118L6023k03320k9208Q0231Q3704k4367n2191
22151A1147j6484M4648j31220N5836k3312k9695J72881k5476k1223P8065Q6074
$$ plain form
22227 -45764 -214477 -126990 -205630 -193290 -45003 86895 25352 7724 -48011 -2825 -141186
22216 -141186 -167146 -57600 -140404 11987 44189 -64034 -107148 -136122 -220586 -372995 -379272
22205 -379272 -144322 18848 -66776 -48724 216476 252985 -3208 -114938 -43372 -64117
22195 -64117 -73895 28523 166325 192652 8352 -235179 -111773 -125117 -53343 17651 2916
22184 2916 134365 33327 -5080 -12480 162120 294149 326493 317187 291310 210730 51133
22173 51133 87980 -9004 122199 226550 298255 132796 169023 114374 79356 2827 38855
22162 38855 -20181 -18747 -127843 120275 156298 -47022 -76230 4001 87705 63338 11147
22151 11147 -5337 39311 -91909 -36073 -59385 -89080 83801 58325 37102 115167 201241
22140B01241n6957j10020q196o6168J72700m8866j42811j22830m4259J4615l5915
22129b47466q4046N617Q8340J16210J94663l9234j10307M1468J33943N1727j57548
22118f633J07046J82857r8800k49952O451J46732M8410q527j05860k21472r2704
22107b92452J520l3647m6828J49664M8335M8319l7622o189L8118N5706q422J5013
22095f8485N9216n5551q691r5294k61588J38786J31275N4036K1281r4904J04733
22084g5186j5321j82165j6955R2069K26368J8567K8306j02593q13K21378J02003
22073B95658o7581p0028j69649L4337m6586Q5Q9012L2414j4313J71664J14964
22062C69977m9058n9660q8709j9594j77060O443O3142K32564K293R3k07312m5529
$$ plain form
22140 201241 144284 34264 26068 -40100 132600 83734 -59077 -181907 -226166 -211551 -247466
22129 -247466 -331512 -325895 -237555 -121345 73318 34084 -76223 -34755 99188 150915 -6633
22118 -6633 100413 283270 184470 -65482 -59031 87701 136111 127584 21724 -199748 -292452
22107 -292452 -290932 -324579 -371407 -221743 -173408 -125089 -162711 -168900 -130782 -75076 -83498 -68485
22095 -68485 -9269 -64820 -73511 -168805 -430393 -291607 -160332 -106296 -85015 -179919 -75186
22084 -75186 -90507 -272672 -289627 -197558 28810 47377 75683 -26910 -27723 193655 295658
22073 295658 228077 158049 -11600 22737 -23849 -23764 65248 97662 83349 255013 369977
22062 369977 320919 261259 172550 152956 -24104 -17661 45481 278045 280338 280431 73119 27590
22050B7590R2252N3619r3472L5689L7697m8295j13647k61666J8250J85312R9216
22039C2545j51615J62006O1342q1926J43691l820j06271r6643M3651R1681J15503
22028B10144j1730J88714p1101j62979l35186J2466j25024j33389J9468J06627
22018c01990J52224k9168r6272k9504J93952j7576J74489J09804m2525J04699
22008B18133k47843j89605O5281r372K22965K41628J949k12100L8467N2007j10979
21997G0531o6499k70086o3555J98211N5088j4702o0782j07101l8138q9832O5298
21986c21567K15995J4184j74434M8612J23549L3201P1829o738J06458o0019j95340
21975a44270q038N2301k9687O5130J2879K6540J62741P9322J24153N6995k94901
$$ plain form
22050 27590 119842 173461 79989 115678 153375 105080 -8567 -270233 -251983 -66671 32545
22039 32545 -119070 42936 104278 22352 166043 162223 55952 -40691 2960 94641 210144
22028 210144 198414 387128 316027 153048 -182138 -169672 -294696 -428085 -408617 -301990
22018 -301990 -149766 -178934 -275206 -304710 -110758 -128334 46155 155959 113434 218133
22008 218133 -29710 -219315 -154034 -163406 59559 301187 303136 91036 129503 181510 70531
21997 70531 4032 -266054 -329609 -131398 -76310 -91012 -151794 -258895 -297033 -386865 -321567
21986 -321567 -105572 -91388 -265822 -217210 -93661 -60460 11369 4631 111089 51070 -144270
21975 -144270 -152308 -100007 -129694 -64564 -51685 -25145 137596 216918 341071 398066 103165
21964A03165l49531m6319r1067J5822J27971J13450J25417J06139L3905M2413
21954A81365J37727R745j24176j70602j44468r4875o2062Q8084O3647p1511n2027
21943b39153k4268N5034N1137j08823J93362J83124q5532k78265j0645R0390J25746
21932d7893J30475l0406j06770j24449m3739k23793N8395J85692R1062k3527K2884
21921a12069Q7809M068p7258j14462J03905q0476l304n2281J06743O7934j67874
21910b37265J13386Q1765m5043j51663k33157K89585J1452o9593n1041K7091J49381
21899a15102L3358K00379N7528O3336N406j44980n2417J1233p9567j14925K1246
21888a14505n7257m0557j0005J6838J31535j3509j00722Q2902N5433m9823j24955
$$ plain form
21964 103165 -246366 -292685 -383752 -367930 -239959 -126509 -1092 105047 138952 181365
21954 181365 319092 328837 204661 34059 -110409 -205284 -267346 -179262 -115615 -187126 -239153
21943 -239153 -263421 -208387 -157250 -266073 -72711 110413 24881 -253384 -264029 -173639 -47893
21932 -47893 82582 52176 -54594 -179043 -222782 -446575 -388180 -202488 -111426 -134953 -112069
21921 -112069 -24260 -20192 -97450 -211912 -108007 -188483 -191787 -244068 -137325 -69391 -237265
21910 -237265 -123879 -42114 -87157 -238820 -471977 -182392 -170940 -240533 -291574 -264483 -115102
21899 -115102 -81744 118635 176163 239499 244905 99925 47508 58741 -20826 -135751 -114505
21888 -114505 -171762 -212319 -222324 -205486 -73951 -87460 -188182 -105280 -49847 -99670 -224625
21877b24625p0359m0069J93134Q2984J80939q308K9617J79102M8687k76479J8645
21866A13268L5831j30466K143q2832j50523K33321j2799J00744J00883m3444j16577
21855D9549O8876P0652J34479K42745j36062p8227J9780o8131j03663o676j53447
21844C9875k19417J94583j23281Q6710J23188k01498Q4681P7861J12902k6533
21834A49071l1324p1198N8954j45043j8752R4772o0276j44764k9182K1744J09836
21823f6162L4631n6046r4847k40702L1117O2144J74671J79832J05570M8530j74130
21812D608q2047L9529P2719j08889j15506J66810k807j55240j78986J73337p4075
21801b60547j85238M047J00992n4463j27766J55317J3473J1699J54368P1762J10173
$$ plain form
21877 -224625 -294984 -335053 -141919 -58935 122004 113696 143313 322415 371102 94623 113268
21866 113268 149099 18633 20776 -62056 -212579 20742 7943 108687 209570 166126 49549
21855 49549 118425 189077 323556 566301 430239 352012 371792 303661 199998 193322 39875
21844 39875 -179542 15041 -108240 -21530 101658 -99840 -15159 62702 175604 149071
21834 149071 117747 46549 105503 -39540 -58292 36480 -23796 -168560 -197742 -175998 -66162
21823 -66162 -31531 -87577 -182424 -423126 -392009 -329865 -155194 24638 130208 178738 4608
21812 4608 -77439 -37910 34809 -74080 -189586 -22776 -25583 -180823 -359809 -186472 -260547
21801 -260547 -445785 -441738 -340746 -395209 -522975 -367658 -354185 -342486 -188118 -116356 -6183
21790f183j56335o8371j46247m6286q3499j1950J39433l6037Q036J94472J69364
21779d3603Q4251J0879o7474P6222J73087j04041k75587j21653J93740K14206
21769A40027j07112j78872j88725L6177R1403K64565j00662j83879j29118J69253
21759a86943K3721p7641l04O8363J62850L4621L409q2963k4629M5562M1981J2290
21747B0317j10102k89310J6042J59100J16957L0438r9275q7649J31703J86422
21737G4643K32269k57923k09916Q3882J78385N0858j28081L8043j7355n6180P0163
21726E8788p7666j2349J94280K84992j41722j50345M8031J39910j39756l12944
21716a08781N3508O5211j53001k1681j9880k5186N9897m5068J43338J54086Q7212
$$ plain form
21790 -6183 -162518 -230889 -377136 -423422 -506921 -518871 -379438 -415475 -407439 -212967 -43603
21779 -43603 40648 51527 -15947 60275 233362 129321 -146266 -267919 -74179 140027
21769 140027 32915 -145957 -334682 -298505 -207102 57463 -43199 -227078 -356196 -186943
21759 -186943 -163222 -240863 -241167 -172804 -9954 24667 28076 -54887 -79516 -33954 8027 20317
21747 20317 -89785 -379095 -363053 -203953 -86996 -56558 -155833 -243482 -111779 74643
21737 74643 306912 48989 -160927 -77045 101340 152198 24117 62160 44805 -11375 58788
21726 58788 -18878 -31227 163053 448045 306323 155978 204009 343919 204163 -108781
21716 -108781 -55273 9938 -143063 -164744 -184624 -209810 -149913 -194981 -51643 102443 189655
21705A89655N4437k90415o2924m9146K739m5153K4260J82476k4943j98892Q8400
21694a29506Q2764M8107J5678o3997O1988R2871q5308j55925o791n5732P2980
21683a22871J7560j04463J6719m6070L32993J45847k44292k5490n0505K8958J19732
21672F8118J3522j03704j46935k57954J45273K11654R8208J63927K35969p5934
21662C52144o8705k59006o7586j1482m769O7245J62183p633j49926k623M653Q5304
21650I9799J47049J27087k7905o8678k39868q3102L8022L7435k10659j88494j11782
21639d81096o6894O1092p9052P3550J99324J57601k1432j47306M430P3347j7855
21628b44291O6954K27451J15554o8012P1177j7060j52883J12042p058k15183r3016
$$ plain form
21705 189655 244092 -46323 -109247 -158393 -155654 -200807 -176547 5929 -19014 -217906 -129506
21694 -129506 -46742 1365 17043 -46954 15034 107905 22597 -133328 -140119 -195851 -122871
21683 -122871 -105311 -209774 -193055 -239125 93868 239715 -4577 -30067 -80572 -51614 68118
21672 68118 81640 -22064 -168999 -426953 -281680 -70026 28182 192109 428078 352144
21662 352144 283439 24433 -43153 -54635 -59404 7841 170024 162391 12465 9842 14495 99799
21650 99799 246848 373935 346030 277352 37484 -45618 -7596 29839 -180820 -369314 -481096
21639 -481096 -547990 -486898 -565950 -492400 -293076 -135475 -156907 -304213 -299783 -226436 -244291
21628 -244291 -177337 50114 165668 97656 168833 151773 -1110 110932 103874 -111309 -204325
21617b04325p0126O2839k822j48934P6599J80763K4876R5668m9991K1459j08065
21606a22059J30368K30264O4591j26487p1885l189j13937q6742k5433j52341L3821
21595b43029R2422J2646n8628R4999k4680R488J54613J69008j92148o2627L59608
21584C11672o7936j90709P5477k33274k07844J13705K67573q5720j77814J17430
21574g7440L2512N3417J77898l3728K760M629M4366j7602p8736j5652K0903M4951
21562A58278j03095j05792M7359J0678j85849J9269J59305j44709j09438K6214
21552b27780L6299r7845M2497J6198r0098j13096q6230l8138R8083K76112j7212
21541b01210k55997Q6714L14453J43714j93275j1000J06854j17153j38440O4073
$$ plain form
21617 -204325 -274451 -211612 -214434 -363368 -286769 -106006 -81130 14538 -35453 -13994 -122059
21606 -122059 8309 238573 303164 176677 104792 101603 -12334 -99076 -124509 -276850 -243029
21595 -243029 -150607 -137961 -196589 -101590 -126270 -116782 37831 206839 14691 -47936 311672
21584 311672 243736 53027 128504 -104770 -312614 -198909 68664 -17056 -194870 -77440
21574 -77440 -44928 8489 186387 152659 155419 160048 204414 186812 108076 92424 113327 158278
21562 158278 55183 -50609 -3250 7428 -178421 -159152 153 -144556 -253994 -227780
21552 -227780 -191481 -289326 -246829 -230631 -320729 -433825 -520055 -558193 -460110 -183998 -201210
21541 -201210 -457207 -370493 -56040 87674 -105601 -116601 -9747 -126900 -265340 -201267
21531b01267J91859r7398l9720l7978M3680m4016J59344j27756q2884Q3223L5042
21520a17871K73986j07662N6149J14117j14665l5217k9836l7343r760m4457j24291
21509a76850r098m1425P4123r7242R4794J49556r4198o2941M0054K4260N3270
21498d5697q0658J14405J2739n7102L8971P1850P4425J0236j06535j08858J43875
21487F7651Q2984j32478j93908j56455Q0116J38470j02839L302n6783J18559R3948
21476e7433q0160P8122R02j11786M9389K48690j14889r5101k2331J3908J20328
21465B9639m2552q8636j08983j41645k5393k3306j8826K53714P5789L2363k9304
21454h7140J00142p5024j35065L6118J54484J02693k3596O4430j96193k91539
$$ plain form
21531 -201267 -9408 -106806 -146526 -184504 -140824 -184840 -25496 -153252 -236136 -152913 -117871
21520 -117871 156115 48453 104602 218719 104054 68837 39001 1658 -8102 -52559 -176850
21509 -176850 -185948 -227373 -153250 -250492 -155698 -6142 -100340 -163281 -123227 -98967 -45697
21498 -45697 -126355 -11950 789 -56313 -17342 54508 128933 139169 32634 -76224 67651
21487 67651 150635 18157 -175751 -332206 -252090 -113620 -216459 -213157 -269940 -151381 -57433
21476 -57433 -137593 -59471 -58569 -170355 -120966 127724 12835 -82266 -104597 -90689 29639
21465 29639 -12913 -101549 -210532 -352177 -377570 -400876 -419702 -165988 -90199 -57836 -87140
21454 -87140 13002 -62022 -197087 -160969 -6485 96208 72612 137042 -59151 -350690
21444c50690p202L41938J53234K740j12379m655J1106k39598j65581K6171J11621
21433b33295J54630M4910q069J0717j91267m9941J13108Q5324o1343j9453P0208
21422h4471j56906K1054j95154j6391J51079J19167J48603l9376J13708J18685
21412A79998j01688j83625R6442Q9143J79726K3720l4898o0767R5997J86756q7200
21401C83604p8391j09997L8613J559Q2061k0739j50968j93622j22970Q4576o4964
21390a51238n0391L50146J29355j45036j33494O3018j17188n1136J6386J51809
21380F2231K8428K2570J35151k96j34767l4662J58329J79146n02L9709q6817j07535
21368B60985j44097Q1680J80873j09081j66856J3717j34969k6892Q6523l4778
$$ plain form
21444 -350690 -357892 -15954 137280 140020 27641 22986 34092 -205506 -371087 -344916 -233295
21433 -233295 -78665 -33755 -41824 -31107 -222374 -272315 -159207 -73883 -135226 -154679 -84471
21422 -84471 -241377 -220323 -415477 -431868 -280789 -161622 -13019 -52395 61313 179998
21412 179998 78310 -105315 -8873 80270 259996 283716 248818 188051 284048 470804 383604
21401 383604 305213 195216 233829 235388 317449 296710 145742 -47880 -170850 -86274 -151238
21390 -151238 -201629 148517 277872 132836 -658 62360 -54828 -105964 -89578 62231
21380 62231 90659 113229 248380 248084 113317 78655 236984 416130 415628 455337 368520 260985
21368 260985 116888 198568 379441 270360 103504 117221 -17748 -44640 41883 7105
21358G105Q1243j56050m9615l6550K2978J03150O3999r5758o9126Q7151P1074
21347B9601J56484O9356J4060j20359k46268k8706K61333K12983j27637j14120
21337A06727P6314K10216j62545k49388J33306J44115M3125j45392j58841l05176
21327c07539j8949J41104N8781j09873L429M1916n0140l4953n5189L32813K35089
21316B36489J30973l6042L7710J13401m22652k59933j3861J47447K7081m9652
21306h9039j0867j8907J341M1206N6517m1691j24073j06118Q1959J54799q8157
21295a43030j10872q0451J33991J89489m8009j04158J12821K17624n3005k2100
21285I2300l4286j12826j62073Q119J71213Q908J42319R1922n1963k37418P0333
$$ plain form
21358 7105 88348 -67702 -117317 -153867 -130889 -27739 36260 -59498 -128624 -41473 29601
21347 29601 186085 255441 269501 149142 -97126 -125832 135501 348484 220847 106727
21337 106727 183041 393257 230712 -18676 114630 258745 301870 156478 -2363 -307539
21327 -307539 -326488 -185384 -126603 -236476 -233047 -191131 -241271 -276224 -331413 1400 236489
21316 236489 367462 331420 369130 482531 59879 -200054 -213915 -66468 -39387 -89039
21306 -89039 -99906 -118813 -117472 -76266 -19749 -61440 -185513 -291631 -209672 -54873 -143030
21295 -143030 -253902 -334353 -200362 -10873 -58882 -163040 -50219 167405 114400 92300
21285 92300 58014 -54812 -216885 -208766 -37553 -28645 113674 205596 153633 -83785 -13452
21274a3452L43709n4955j00970r0070J32268R7402J96912j45503k50301k2384
21264I2656r0439m0245J08594k39093J06511L3709n6605m5217j24092l1549j42301
21253d28071K0422K0336K4223Q258j71205L6070K6655N4484R2127P5474J45579
21242i5648R9493P191k7952O4061O2614j94056j94134R5748L7689R6000J28004
21231G9010O0573j4394n2473k39649N5486L6448K01801M6663j99104j96594J88899
21220c3334J60156j73814j34313J00710q8302J4778N4825k4686O6283J67749J7560
21209A27612k40210q1302N0946j1249J2982j37587N0144N3999Q5573l561j82977
21198b75630j08401l578J31282n172r0265O2132K33784J41201j03742M5430K7480
$$ plain form
21274 -13452 330257 275302 174332 84262 216530 313932 510844 365341 115040 92656
21264 92656 2217 -38028 70566 -168527 -62016 -28307 -84912 -130129 -254221 -285770 -428071
21253 -428071 -407649 -387313 -363090 -354832 -526037 -489967 -463312 -408828 -316701 -241227 -95648
21242 -95648 3845 11036 -16916 47145 109759 -84297 -278431 -182683 -144994 -48994 79010
21231 79010 139583 125189 72716 -166933 -111447 -74999 126802 173465 -25639 -222233 -33334
21220 -33334 126822 -46992 -181305 -80595 -168897 -154119 -99294 -123980 -57697 110052 127612
21209 127612 -112598 -193900 -142954 -154203 -141221 -278808 -228664 -174665 -89092 -92653 -275630
21198 -275630 -384031 -387609 -256327 -261499 -351764 -289632 -55848 85353 -18389 27041 54521
21187E4521J14838j06327j01792J10673K00698k09402N2918L6954j43460j31635
21177a22014j1229K23747Q0304p1574p490j48548j20649J01713j15359j01532
21167b92631N5742q1269Q6561K35935O6307j01100J41927j75474j02815J42156
21157b4661j81817O7999K53163K31372n0858R8881j94122j92641j1061K02211
21147A98466k4570l45142P9708J95703J46626J3925p1481k2097P5827p2729r6599
21136G7637j843O9731k8680j9404r1768j12958j8824J2962l47826J00950K27219
21125a32804L36989q3224k33118m1651o1352M7033k4046l0982J18295M0361l1517
21114i6016j18686N8072M1690j38005Q1156n9972m5156P2881q957N8458j30465
$$ plain form
21187 54521 169359 63032 -38760 71913 272611 63209 116127 153081 9621 -122014
21177 -122014 -133243 90504 170808 99234 91744 -56804 -177453 -75740 -191099 -292631
21167 -292631 -236889 -318158 -231597 4338 70645 -30455 111472 -64002 -166817 -24661
21157 -24661 -206478 -138479 114684 346056 295198 394079 199957 7316 -3745 198466
21147 198466 173896 -171246 -91538 104165 250791 264716 193235 171138 246965 174236 77637
21136 77637 75794 145525 116845 97441 5673 -107285 -126109 -113147 -460973 -360023 -132804
21125 -132804 204185 120961 -112157 -153808 -215160 -168127 -192173 -223155 -104860 -64499 -96016
21114 -96016 -214702 -156630 -114940 -252945 -171789 -231761 -276917 -204036 -212993 -154535 -285000
21103b85000K8127J41924P0065K83860M989r5768L4358J9936k23041j97788M3159
21092a75179P7679J21734O8794R5282j36591J12944K61699o249q9436k8396j15477
21081A86804R787R2990q9776q4248j22557M0275P1296J31449N4233k80494k07430
21070a97671J71098J14840J0125P6972j80354j83963m1361O755j39560J76413
21060a86706J40978n0931j09904O1887K9606l223J8241M1966J23745J38418q0895
21049A23182j43193j18065J10645q1067j1674j1904q3598L6353J40684O9655J57878
21038A88896p1652r8990J71385J05722m3093o2920q8614k26896K1171J88432M629
21027H8070J29704j10983j37722n7639J01790K08688j09054j39549K9188Q175
$$ plain form
21103 -285000 -256873 -114949 -44884 238976 243965 148197 182555 202491 -20550 -218338 -175179
21092 -175179 -97500 24234 93028 188310 51719 164663 426362 420113 330677 302281 186804
21081 186804 196591 289581 199805 115557 -7000 33275 104571 236020 290253 9759 -197671
21070 -197671 -26573 88267 98392 175364 -4990 -188953 -230314 -223559 -363119 -186706
21060 -186706 -45728 -96659 -206563 -144676 -115070 -118293 -100052 -58086 65659 204077 123182
21049 123182 -20011 -138076 -27431 -108498 -120172 -132076 -215674 -179321 -38637 31018 188896
21038 188896 117244 18254 189639 295361 252268 189348 100734 -126162 -104991 83441 88070
21027 88070 217774 106791 -30931 -88570 13220 221908 112854 -26695 2493 10668
21017A0668j83712K3199K80760J51302m3720j5828j21559j84550J26228j65842
21007a23054r2245m4179M8301J20246o2031P3185j18431L5139O1353O7937n9286
20996i3065r5107J01559P1427m037Q6028m2445K8287k3176P711J6324J54424M9878
20984B57808k31728j82055j12163K50637J62892r9122m6669r7369J2219L7840
20974d7710j59816O0395J34667l780L5472K5103K9809j87463j21428P2569J75316
20963A3134k921n5488M660q5247M9654Q0k2463P5876o6195j6105J2517K09864
20951A17366n4401J8213j24134l7892J5852J05021j23067r2144J2072j1097J5085
20940a59126K33183M6115O8717l4853J4069n6488k8489R766j09343k5478K3769
$$ plain form
21017 10668 -173044 -149845 130915 282217 238497 222669 101110 -83440 42788 -123054
21007 -123054 -215299 -259478 -211177 -90931 -152962 -79777 -198208 -163069 -101716 -33779 -93065
20996 -93065 -188172 -86613 -15186 -19223 66805 24360 52647 29471 37182 53506 207930 257808
20984 257808 26080 -155975 -268138 -17501 145391 46269 -400 -97769 -85550 -47710
20974 -47710 -207526 -147131 -12464 -16244 19228 44331 74140 -113323 -234751 -162182 13134
20963 13134 10213 -45275 -40615 -125862 -76208 -76128 -98591 -22715 -88910 -105015 -92498 117366
20951 117366 62965 81178 -42956 -80848 -64996 40025 -83042 -175186 -163114 -174211 -159126
20940 -159126 74057 120172 188889 154036 168105 111617 83128 92894 -16449 -41927 -18158
20929a8158R8820J79831P6833l6034J7746O9083j96183j64480M313K1709o1903
20918h423J43902J31603j34304P4789K5554j89324M2542J41292k06229m5740R5177
20907G0839L0965O2447P5500N7448j64337N4057O332J16331j89268j39626q1444
20896a00756j7898J51537L15697J48606J02324j61664j30387j04669m7913K09031
20886C63908J261o9569J9101k6473n6745j01525j56940K2238K51335N09284K99864
20875A055739P2047K56477L71326L81295M0152j96757k50187j53496L3451J55289
20865A765336O6003N9017p8946M19660M24736j5318m56420n53140j95300j23037
20855A312591j36572k57918q0872j31012P966l6659j09986r0385j33488j24808
$$ plain form
20929 -18158 80662 260493 337326 301292 319038 388121 191938 27458 31771 53480 -8423
20918 -8423 135479 267082 132778 207567 233121 43797 86339 227631 21402 -24338 70839
20907 70839 101804 164251 239751 297199 132862 186919 193251 309582 120314 -19312 -100756
20896 -100756 -118654 32883 348580 497186 599510 437846 307459 202790 154877 363908
20886 363908 365169 295600 314701 288228 231483 129958 -26982 -4744 246591 755875 1055739
20875 1055739 1127786 1384263 1755589 2136884 2177036 1980279 1730092 1576596 1610047 1765336
20865 1765336 1831339 1890356 1811410 2231070 2655806 2640488 2184068 1630928 1435628 1312591
20855 1312591 1176019 918101 837229 706217 714183 677524 567538 477153 343665 218857
20845B18857n3429j73333j07315J91372Q5198j09891J23514O6596j0980Q2337
20835C12926k9340M8378J11692k1262O9644k7955j53690p9608M618l6691n0267
20824A48445O702j82313P7117J32817j94870o2854L1595J3517o8864J12873K4753
20813C8918j4314j50326J11253J73650K06844J52546p588K4143j15092n9492k49446
20802A11096k50399J3688j3293K3913M1631K8250k8901Q5500J12310M9011j07616
20791F5190j96982p1133R4461j2204J17771K5289N687J0204m2117k31139o8251
20780c03224K52389K88950p1629M3064p9269J71611J78212j23120o2254R0694
20770C85424j42387j03556j81990j20522j42853J0818J43050P97j40061J02600
$$ plain form
20845 218857 165428 -7905 -115220 76152 161350 51459 174973 241569 230589 312926
20835 312926 283586 331964 443656 422394 492038 464083 310393 230785 235403 198712 148445
20824 148445 155147 -27166 49951 182768 -12102 -74956 -43361 -29844 -98708 14165 38918
20813 38918 24604 -125722 -14469 159181 366025 518571 510983 535126 420034 360542 111096
20802 111096 -139303 -125615 -138908 -114995 -73364 -45114 -74015 11485 123795 172806 65190
20791 65190 -131792 -202925 -108464 -120668 -2897 22392 28079 38283 -3834 -234973 -303224
20780 -303224 -50835 238115 166486 209550 130281 301892 480104 356984 294730 385424
20770 385424 243037 139481 -42509 -163031 -305884 -295066 -152016 -151219 -291280 -188680
20760a88680K04605n3827o3315J03644j36189J5564q5589l2986o061O6544R5965
20749h0325L8794l4819R3834p3631m1307K41455J96423j01862j03359j45363p0412
20738h0572K44869J37331K4487j21183P3468r0980k29224r025j12622k75998L2405
20727d07044N4024m8508J13744K04308j2458n1353L5531o0078j0687o9111n3785
20716c05417q510J8314J49462K8073L0070r4919p149J485j8626K7904J94914K10256
20704B25857j42049k25889p3202n0029j30194L5245J66571J72379J27602j16010
20694i719J23750R1433j00650o9060j06666K08693k14049j00227J9333P2990L2460
20683e1712n3435J55562K33340p8089q4534j16351R9646o1157m776M96l4281m9347
$$ plain form
20760 -188680 15925 -37902 -101217 2427 -133762 -118198 -203787 -236773 -242834 -176290 -80325
20749 -80325 -41531 -76350 17484 -56147 -97454 144001 340424 238562 135203 -10160 -80572
20738 -80572 164297 301628 326115 204932 278400 187420 -41804 -50829 -163451 -439449 -407044
20727 -407044 -353020 -401528 -287784 -83476 -95934 -147287 -111756 -171834 -182521 -251632 -305417
20716 -305417 -313927 -295613 -146151 -118078 -88008 -182927 -190076 -188591 -207217 -179313 15601 225857
20704 225857 83808 -142081 -215283 -265312 -395506 -360261 -193690 -21311 106291 -9719
20694 -9719 114031 205464 104814 35754 -70912 137781 -76268 -176495 -157162 -84172 -51712
20683 -51712 -105147 50415 283755 205666 121132 4781 104427 43270 38494 38990 4709 -44638
20671d4638J21644J01197J43585l27416k21068J11427k0818m5829J7728Q1036
20661h3152j2910j57049q8057Q626J76204J98826p2780Q7244J30233J25998K36017
20650E49200l1832j00246j06799J979m858j8149k41117J9002Q2231o5001p578
20639G6832J9268j5292k6230J46053o88m3962q0750j51189K1174k007J7004K46642
20627B06855K57465K13528j76344j28340n7943K9092r0046r9699q5918J5022j35850
20616e2178J14868K39233J62504k27587k27511n9159K39914J33831j11337j80202
20606C2376J14330Q1430o8952j56364K13777J64361j42119r4411l1819L1354o6647
20595G7316J42876l3832O945M575P5627n0113m073n8127K2177r732J1037q7038
$$ plain form
20671 -44638 77006 178203 321788 -5628 -226696 -115269 -136087 -181916 -164188 -83152
20661 -83152 -96062 -253111 -341168 -332542 -156338 42488 -30292 56952 187185 313183 549200
20650 549200 517368 417122 310323 312302 307444 289295 48178 67180 149411 84410 76832
20639 76832 96100 80808 54578 200631 199943 155981 75231 -75958 -54784 -56791 -39787 206855
20627 206855 464320 677848 501504 373164 315221 344313 254267 154568 68650 83672 -52178
20616 -52178 62690 301923 464427 236840 9329 -49830 190084 323915 212578 32376
20606 32376 146706 228136 159184 2820 216597 380958 238839 144428 112609 143963 77316
20595 77316 220192 186360 193305 197880 273507 223394 219321 161194 183371 173639 184676 97638
20583I7638R342j40064j04453J15692K36766N5067R6148j95838k15336J82055
20573A37017J79513J28726k28327l97457q755M7757P0040P1228J36111k7838j151
20562A06864R3046O0545j07754r4561N0781J57007J57228J29808j96226k12150
20552A44588l0435m9624o0981O2461K5646Q6645M6467J3118j24281J76030K93049
20541E82683L9400k61854j65342O8737O1785J18778J1798r1268O7054j65878k76265
20530a0372o4715P6474N5183J64569J053J01198n223K0109M5144M0683K3877j8248
20518D29732k3488J42924q9635k05843j46494J54888L65760r228o7293j69719
20508C81604J50390K75028j7290p2299J9999n1093k11939L2552j1779o0909J31728
$$ plain form
20583 97638 106980 -33084 -137537 -21845 214921 269988 366136 170298 -45038 137017
20573 137017 316530 445256 216929 -180528 -189283 -141526 -71486 -258 135853 108015 106864
20562 106864 199910 260455 152701 58140 108921 265928 423156 552964 356738 144588
20552 144588 114153 64529 3548 66009 91655 178300 224767 237885 113604 289634 582683
20541 582683 622083 360229 194887 263624 325409 444187 455985 364717 431771 265893 -10372
20530 -10372 -75087 1387 56570 221139 222192 323390 318167 338276 383420 424103 447980 429732
20518 429732 406244 549168 459533 253690 107196 262084 627844 618616 551323 381604
20508 381604 531994 807022 789732 717433 737432 686339 474400 506952 495173 434264 565992
20497E65992J63133j52195q6121K4950M2492j14352j08136k16134j43972j74595
20487a98938K37458K08611l3456J52222q3850L1449n8204j6062r4415j76013O2394
20476C1196M4255j09319m0695l2863J05220J35799M6966J30901k6728q5483l255
20465A95994R2164j2605r5588k480L0193j51067r4084R9364K42268K1911k13215
20454A12855Q6646J17355l3979p7180O686q6759O9502q8227q2803j95847P9358
20443i2393N74433K85897P990j64098j45841L0799o806K9373n6233j9499N5877
20432D99499l244j00946m4283j45239R2638L2857q1924m834L9407K295J48316
20421D34542R2888O2510J6032j69458j15123J14336N5590J60933K05253L2368
$$ plain form
20497 565992 729125 576930 490809 515759 558251 443899 335763 119629 -24343 -198938
20487 -198938 38520 247131 213675 365897 282047 313496 255292 239230 144815 -31198 31196
20476 31196 75451 -33868 -74563 -107426 -2206 133593 180559 311460 284732 199249 195994
20465 195994 288158 275553 179965 177485 207678 56611 -37473 61891 304159 326070 112855
20454 112855 199501 316856 282877 205697 212383 125624 195126 106899 24096 -171751 -92393
20443 -92393 482040 767937 775927 611829 465988 496787 489981 519354 463121 443622 499499
20432 499499 496255 395309 351026 205787 298425 331282 249358 244524 283931 286226 434542
20421 434542 527430 589940 605972 436514 321391 435727 491317 652250 857503 889871
20411H89871k63212k86220Q1276M4927k12322j52034K505l3116J93874J55302
20401D20851k26163j20344J40236r1192J32307O472K4780O1811J31538n2565k1465
20390D06266K08135R8077K27768M4215k3647Q9636P6527J48793J13155n9894j7573
20379A311458J21195K2281j46166j45521r8514n037o1806k23046P204R1294j09901
20368G63441K8383j1219k8180R0856m5549J69926K06531j81446P3132o5795j10719
20357H89361R6901M2119K00014R0549Q213j30059l9723O4915J07964j71211k406
20346A156637N3841Q8294o6679k88017r751J30573J01920J33601J75515k625J72769
20335A646078J69002k7924J81103Q0258j78012j82910J60815o428J78266K55176
$$ plain form
20411 889871 626659 340439 421715 466642 254320 102286 104791 71675 265549 420851
20401 420851 194688 74344 214580 123388 255695 262167 286947 348758 480296 427731 406266
20390 406266 614401 712478 940246 984461 960814 1050450 1126977 1275770 1388925 1329031 1311458
20379 1311458 1432653 1454934 1308768 1163247 1064733 1059696 997890 774844 782048 873342 763441
20368 763441 791824 780605 752425 843281 797732 967658 1174189 992743 1065875 1000080 889361
20357 889361 986262 1028381 1228395 1318944 1327157 1197098 1157375 1222290 1330254 1159043 1156637
20346 1156637 1210478 1298772 1232093 944076 934325 1064898 1166818 1300419 1475934 1473309 1646078
20335 1646078 1815080 1787156 1968259 2048517 1870505 1687595 1848410 1841982 2020248 2275424
20325B275424J37985N4902N2819r8206J46716Q2531J26181L7904k34212j04768
20315B477276K00868K21801J51006J49563N498O2796P6014k3061J92843J44925
20305C659529R1626Q9011K19255J0731J90070L80473K76960L09741R1350K24983
20295E543729K20455K55047L60489M00365N42617Q64234J221160O34182L0579
20286A0072857P1702M19148N23410N78750N11929N98296J036227J360960J914469
20277A7087748K279992K087415K119018K593739L461099M372296N611160P533306
20269D7145773R346319J2009565J6789299K2966255L0530537M3350941O8267115
20262B50405804J10742456J13441876k036674q3471518q0354155o5808402m0622561
$$ plain form
20325 2275424 2413409 2468311 2521130 2422924 2569640 2652171 2778352 2816256 2582044 2477276
20315 2477276 2678144 2899945 3050951 3200514 3206012 3268808 3344822 3321761 3514604 3659529
20305 3659529 3751155 3840166 4059421 4070152 4260222 4640695 4917655 5227396 5318746 5543729
20295 5543729 5764184 6019231 6379720 6780085 7322702 8186936 9408096 10042278 10072857
20286 10072857 10144559 10563707 11087117 11665867 12177796 12776092 13812319 15173279 17087748
20277 17087748 19367740 21455155 23574173 26167912 29629011 34001307 39612467 47145773
20269 47145773 56492092 68501657 85290956 108257211 138787748 182138689 250405804
20262 250405804 361148260 474590136 472553462 389081944 308727789 242919387 202296826
20255B02296826j5553810L235884J8739546L7292374O9122092J13964253Q8496540
20248E17593705m3722760j01806053r2787366p6609562n1862347l2486273k0623281
20241I7696063j3693746j0223032p930525o311592n337476m253159l371507k304466
20233D4270560j427525j528995j813629j376598q53747n89905m39569n67661r26940
20224C4745991j252887j102085p84546l39875q30193j587319j149711j089782
20216B6609593q66723o60551l79271r07669j126796j181887j036037j133656j051148
20207A8265855q88511r34379r37736r53990q34787o49874o69628o08792o42837
20198A1145321p22414n54205l19101m02016n24339j42384k01492k78179j74745
$$ plain form
20255 202296826 186743016 189978900 208718446 246010820 315132912 429097165 517593705
20248 517593705 473870945 372064892 279277526 202667964 150805617 118319344 97696063
20241 97696063 84002317 73779285 65848760 59537168 54199692 49946533 46575026 44270560
20233 44270560 42843035 41314040 39500411 38123813 37270066 36680161 36240592 35672931 34745991
20224 34745991 33493104 32391019 31606473 31266598 30436405 28849086 27699375 26609593
20216 26609593 25742870 25082319 24703048 23795379 22668583 21486696 20450659 19317003 18265855
20207 18265855 17377344 16442965 15505229 14551239 13716452 13066578 12396950 11788158 11145321
20198 11145321 10422907 9868702 9549601 9147585 8623246 8480862 8279370 8001191 7826446
20189G826446n21173l92185l09472j11569m1972l4603J7289J76488J55799J40082
20179F905130j33345m05746m36099k52768k11880m33065k91749k08790p6753J75975
20169D630910J94904R1343m04027m66911m47807l08568l30148m46828l18531k96252
20159A898085l9121O0162p9863J5497J5794m2261j88989Q4529o3267l54179j2079
20148A294308K16550O7571j30914J8983P6808j18505j30763J87403J59284R5013
20138A735738j60458P1894m1757j52779j12580l1626j39309j05683j9388O6380
20128A110432J5162j3142r9409q2087K1046Q462j07622k77872q8426j8313j57915
20117C10316l6310K82291L5314o2057J53936l5222o6803l5236q0150p9887n3474
$$ plain form
20189 7826446 7305273 6913088 6603616 6492047 6450075 6415472 6432761 6609249 6765048 6905130
20179 6905130 6771785 6366039 5929940 5677172 5465292 5032227 4740478 4531688 4454935 4630910
20169 4630910 4825814 4917157 4513130 4046219 3598412 3289844 2959696 2512868 2194337 1898085
20159 1898085 1858964 1919126 1839263 1854760 1870554 1828293 1639304 1723833 1660566 1306387 1294308
20148 1294308 1510858 1578429 1447515 1466498 1543306 1424801 1294038 1481441 1640725 1735738
20138 1735738 1575280 1647174 1605417 1452638 1340058 1308432 1169123 1063440 1044052 1110432
20128 1110432 1125594 1112452 1013043 930956 952002 960464 852842 574970 486544 468231 310316
20117 310316 274006 556297 591611 529554 683490 648268 581465 546229 466079 386192 332718
20106C32718r910J89443L6241j83122k07727p6123K63467J79826J10236j8776
20096F16273k5324K1595l4545j70174j01441R2144O5766k3144j05053P6320J74927
20085E87344J26103m4649k28156j94369k0678J36272J42589J06753p7643l6437
20075D97129J37131L4199j10598L035j4547j39679o604J41807k2357K3269J93961
20064G36746L65692p6209j3860j5355j01304p6302j05340k53301j39938L25752
20054F46581P3814j48497J76054j21618q6042K91786J67424J11356k8199k07522
20044H75137j74250k24275O1835l0732q6333j8898J04370q7897j97399J16954
20034C38512J58623O1276j12323q0168J10975J91817l2573l4210j61133M6490
$$ plain form
20106 332718 322808 512251 548492 365370 157643 81520 344987 524813 635049 616273
20096 616273 590949 612544 577999 407825 306384 398528 464294 441150 336097 412417 587344
20085 587344 713447 668798 440642 246273 225595 361867 504456 611209 533566 497129
20075 497129 634260 668459 557861 560896 546349 406670 400066 541873 519516 542785 736746
20064 736746 1102438 1026229 1012369 997014 895710 819408 714068 460767 320829 646581
20054 646581 720395 571898 747952 626334 540292 832078 999502 1110858 1082659 875137
20044 875137 700887 476612 538447 507715 421382 402484 506854 418957 221558 338512
20034 338512 497135 558411 446088 365920 476895 668712 636139 601929 440796 487286
20024D87286o9618l9687Q1555M3086k03569N6894l1060n152j49822K2229J0212
20013B02354j46633q8862K666J44419J16640L4045j22777O3070K06748K1239O9535
20002E02444n8507l53198j84051R6275J44945O5710j40108j08103K27767K1561
19992B14735m8463j45681j23956K2169K31238J71014R8861J68509l0907q5052
19982D72467l05385o9516j65386J45102j09623K0397J35584N6571J70960N8602
19972D09773j32737j63551j5997o5885J04143k4907q3664L1717L2123j9819o5086
19961F110j59067O3859K8517O6126Q2395J2084p7057k6486K7147P9902M2568k08664
19949f2566j76453L6172J32491J98278P2793J7126l2838j18283Q2807j25302O4315
$$ plain form
20024 487286 417668 377981 459536 502622 299053 355947 324887 319735 169913 192142 202354
20013 202354 55721 -33141 -30475 113944 230584 264629 141852 204922 411670 432909 502444
20002 502444 443937 90739 -93312 2963 147908 213618 73510 -34593 193174 214735
19992 214735 166272 20591 -103365 -81196 150042 321056 419917 588426 557519 472467
19982 472467 167082 97566 -67820 77282 -32341 -11944 123640 180211 351171 409773
19972 409773 277036 113485 97488 31603 135746 110839 27175 58892 91015 71196 6110
19961 6110 -152957 -89098 -60581 5545 87940 100024 22967 -3519 23628 103530 146098 -62566
19949 -62566 -239019 -202847 -70356 127922 200715 217841 185003 66720 149527 24225 88540
19938H8540J99282j71906n925L8764M652n7141j39831K405K42399K27200j29456
19927B98983j09525J89725l8028j65421p0473k11310K4726J35445P374k1800o589
19916C3107R8188J02359O2052J50153J16934j96496l7376j14927k12776j04401
19906a03183J00807J68912r2464J9902K29371K24121P8086l2734J7218J1590j49601
19895D72025k59280j18811j25511O8822J76288L8198r7926k42819p2932K75607
19885A13661J63712O7484k3813k21847j06187j6833J54656K36534r336j44107
19875B13924j8766p7715r0615R6159J37378J49589o5896K3408J45095R8150J16147
19864G26858q0484j01561N8483J02649o9094m2551r2732l6915O9578o6876J11555
$$ plain form
19938 88540 287822 115916 109991 148755 153407 96266 -43565 -41160 201239 428439 298983
19927 298983 189458 379183 341155 175734 105261 -106049 -81323 54122 61496 39696 33107
19916 33107 131295 233654 295706 445859 562793 366297 328921 213994 1218 -103183
19906 -103183 -2376 166536 74072 93974 323345 547466 625552 592818 610036 621626 472025
19895 472025 212745 93934 -31577 37245 213533 251731 153805 -89014 -161946 113661
19885 113661 277373 344857 321044 99197 -6990 -23823 130833 367367 358031 213924
19875 213924 195158 117443 26828 122987 260365 409954 344058 367466 512561 610711 726858
19864 726858 646374 544813 603296 705945 636851 594300 501568 464653 534231 467355 578910
19853E78910j65925l10185j46884K60860J34498r2401k74882j83361J65529P7290
19843D3449K82726J53295k07662L8685j88452o2479o4748j66029R6836l9965j91565
19832c05909P9158K62612j04192r7263k104L17890J40902L18515k02155k06840
19822B00614j00220n1067m6141J42673P1850J9149j08692j26714j12025R6813
19812a3760M6651J55216P5365l0829l3869q1784p1593j8677j70409j6405O8695
19801i1399L4537J4546K47123K25302J04994P4046P8187j87012j52607j15206
19791B32511r8325l2622J15457J6569p7486k75697j26116L6362K86274J34365
19781B11292K32371J13971R3326j04372k58036P1351J81576J9401l0273m5831
$$ plain form
19853 578910 412985 102800 -44084 216776 351274 258873 -16009 -199370 -33841 43449
19843 43449 326175 479470 271808 310493 122041 59562 -5186 -171215 -74379 -114344 -305909
19832 -305909 -226751 35861 -68331 -165594 -167698 150192 291094 609609 407454 200614
19822 200614 100394 49327 3186 145859 217709 236858 128166 1452 -110573 -13760
19812 -13760 32891 188107 263472 232643 198774 116990 45397 26720 -143689 -160094 -91399
19801 -91399 -56862 -42316 204807 430109 535103 609149 687336 500324 347717 232511
19791 232511 134186 101564 217021 233590 156104 -119593 -245709 -209347 76927 211292
19781 211292 443663 557634 650960 546588 288552 359903 541479 560880 530607 484776
19771D84776j95963m7985R2512r1849n7313J52742R1751j9238o6715j6971j4555
19760C11192K3403j26160L4090J95275j77768k97358k9905L36573J97434J00875
19750E67651k5705o1456J7094J30376o7261m3559L7976l4649J6772J17600O4315
19739G19154J08130j15434O1865o6871k64076j1343J59204J08858m077l2632j40298
19728E22480J35774K37273j0292j9200J3764O779q4371j37500k2977N6010J1209
19717G08949O2398L00239K7303k30041j52379L5049j5150L10607O5525l7852m1221
19706A033427p4508M7170K41099m0179J0094m216Q8670K26204J56001q7433k44540
19695A351789K2723J89607Q6055m1294R9374J01392J02868L89931O5873o2018
$$ plain form
19771 484776 288813 240828 333340 241491 184178 336920 428671 409433 342718 325747 311192
19760 311192 334595 208435 242525 437800 260032 -37326 -67231 269342 466776 567651
19750 567651 541946 480490 497584 627960 560699 517140 555116 520467 537239 654839 719154
19739 719154 827284 711850 773715 706844 442768 431425 590629 699487 695410 662778 522480
19728 522480 658254 895527 885235 866035 879799 886578 802207 664707 641730 697740 708949
19717 708949 771347 1071586 1098889 868848 716469 751518 736368 1046975 1112500 1074648 1033427
19706 1033427 958919 1006089 1247188 1207009 1217103 1212887 1301557 1527761 1683762 1596329 1351789
19695 1351789 1374512 1564119 1650174 1608880 1708254 1809646 1912514 2302445 2368318 2306300
19685B306300r7840J35864k4918L4002J11533j46502j42777m8522L30171K26976
19675B684287O5602K03202J35730M6192N748o0001j65769N8492K36083J46229
19665C355795j76071P411J78579J56919J23164J79594K47859L07465J77689l1015
19655D527389L76810M84695M72365K64257N5734K08314M41193Q58239Q96413N53598
19645I139007L46597K59117K93136N90061L20027K81796L80128N27167Q71086
19636A3008122J231727J538198J430738J502539J795215K306775K698072L108530
19628B8619916L894763N329436P286825R870434J3425016J8276229K4239368L1728365
19620A42670352M3742729O6606650J09076375J25663365J7066975q3504705q6477663
$$ plain form
19685 2306300 2208460 2344324 2319406 2353408 2464941 2318439 2175662 2127140 2457311 2684287
19675 2684287 2749889 2953091 3088821 3135013 3140761 3080760 2914991 2973483 3209566 3355795
19665 3355795 3179724 3187135 3365714 3522633 3645797 3825391 4073250 4380715 4558404 4527389
19655 4527389 4904199 5388894 5861259 6125516 6181250 6389564 6830757 7688996 8585409 9139007
19645 9139007 9485604 9744721 10037857 10627918 10947945 11229741 11609869 12137036 13008122
19636 13008122 14239849 15778047 17208785 18711324 20506539 22813314 25511386 28619916
19628 28619916 32514679 37844115 45130940 55001374 68426390 86702619 110941987 142670352
19620 142670352 186413081 253019731 362096106 487759471 504826446 421321741 334844078
19613C34844078p1953525m5951394k0096420j086610J4147310L1409716O0271163
19606C01584318J04793794R7989775k4460233r7028810r1484786p7123328n3447267
19599A60823463l4460088k3390008j6496210j2336675r076610o453907m839456
19592E3770509l843495l119426k613008k000982j299450r61836p14283r87757
19584C8230272j199225q58203p41994r18810j274357j191857j002123q73817q70379
19575B9299507q17107n59828m20792o55125q36745o17944p51576j028786j372625
19566B2238979j164986j097423j324825j085815q98236q44180n75202p84782q50655
19557A3612875p25968o78436n35707o72408m45572o05853o47725o24106k96054
$$ plain form
19613 334844078 262890553 216939159 196842739 195756129 209903439 241313155 301584318
19606 301584318 406378112 504367887 479907654 382878844 291394058 214270730 160823463
19599 160823463 126363375 102973367 86477157 74140482 65063872 58609965 53770509
19592 53770509 49927014 46807588 44194580 42193598 40894148 39932312 39218029 38230272
19584 38230272 37031047 36172844 35430850 34512040 33237683 32045826 31043703 30169886 29299507
19575 29299507 28482400 27922572 27501780 26846655 26009910 25391966 24640390 23611604 22238979
19566 22238979 21073993 19976570 18651745 17565930 16667694 15823514 15248312 14463530 13612875
19557 13612875 12886907 12208471 11672764 11000356 10554784 9948931 9301206 8677100 8381046
19548H381046j15560j35080k60346m04164l28699l40851m89850k43759l21671
19539E741066m75225l09636m0527q6589j89483m28425k17007l8264o7229k75040
19529C613641o057j30394l06064n18517o3160J15364n7536j29867J5455k54354
19519B278511l3652k057n7645j40247j58970l22620j35156j05644K587P6084J32058
19508A533249L0623j42596j53656N180R2204j15362j1690L9620P2873j39738j21268
19497A089439J71960P6719j22491o1316O7516n0817Q722k31264p3057k27599j6447
19486F31365J86730Q6260J00868N1948j62130L0728Q6711l8835k78488j35205
19476E59952M6942J18879J68382p2313j0316k4462j52012Q0616R5467k3878j42198
$$ plain form
19548 8381046 8265486 8130406 7870060 7465896 7137197 6796346 6306496 6062737 5741066
19539 5741066 5265841 4956205 4915678 4829089 4639606 4211181 3994174 3955910 3888681 3613641
19529 3613641 3607584 3477190 3171126 2652609 2589449 2704813 2647277 2517410 2532865 2278511
19519 2278511 2244859 2242802 2185157 2044910 1885940 1563320 1428164 1322520 1325107 1401191 1533249
19508 1533249 1563872 1421276 1267620 1272800 1365004 1249642 1237952 1277572 1350445 1210707 1089439
19497 1089439 1261399 1338118 1215627 1154311 1221827 1171010 1179732 948468 875411 647812 631365
19486 631365 818095 904355 1005223 1057171 895041 925769 1012480 973645 695157 559952
19476 559952 606894 725773 894155 821842 811526 787064 635052 715668 811135 787257 645059
19465F45059k00227Q433M5157j64687n0258o5386q2930M3778J34653K17337K9297
19454E60226K3757j5590l6527k4605o2194j16022O5282J60942R5143j4610m2824
19443E92978O0757n8951p0308R3306o2742q5570J7691J4385j54397N2605K48168
19432F47922K14350p800N2091O4945j23459j94820n7019m31j6779K5085O5003
19421F69088L4481P0168L8275j57759j20140j26533k718r3965j90180L3808K34653
19410C89178J71179M6641K65673J90463m1282l12161k41623j84783j41673O0673
19400B02285J11263j0802P967K00802j18524k09248Q2770Q4726j9189j76618k4447
19389A30985J04924j05507l6101Q2632k7725K6936P4232j256O9582O4806j87120
$$ plain form
19465 645059 444832 453265 498422 333735 283477 218091 135161 178939 313592 530929 560226
19454 560226 583983 568393 531866 507261 445067 329045 394327 555269 650412 635802 592978
19443 592978 653735 594784 524476 617782 555040 469470 487161 501546 347149 399754 647922
19432 647922 862272 854472 906563 971508 848049 653229 596210 595779 579000 604085 669088
19421 669088 703569 773737 812012 654253 534113 407580 404862 310897 120717 154525 389178
19410 389178 560357 606998 872671 1063134 1021852 709691 468068 283285 141612 202285
19400 202285 313548 302746 310713 511515 392991 183743 266513 351239 332050 155432 130985
19389 130985 235909 130402 94301 176933 149208 176144 250376 249120 318702 383508 196388
19378A96388m616J05693M3822j7090J61804L8912L8873k4272o4062j47250o6615
19367B61587R0959K741K738k44526p7678N6846K9889m6867k13460P0744J04397
19356C7370Q8183N8266J6040L5981P2259j81154n5538l7990K8371r1061k4408
19345e3681l5596J24714r1450j66156K570L1621m1678O4557K15334l6549N6805
19334G0491j23699k3455J49683P145J09873K0354q1804k3381j2143j11811O0635
19323D1888L2542j5720K63949n7670L6636j4848j51696K7253j04516j03171J57967
19312A12614M5335L0699J0009K1542j04986n5861l3076o6970p6861J77600K7072
19301H7117p135o4366J4574k15162m5591o8032L3059J89842P1715J63973J02610
$$ plain form
19378 196388 191772 297465 341287 324197 486001 524913 563786 539514 475452 328202 261587
19367 261587 352546 355287 358025 113499 35821 92667 122556 75689 -137771 -67027 37370
19356 37370 125553 183819 199859 235840 308099 126945 71407 33417 61788 -29273 -53681
19345 -53681 -89277 35437 -56013 -222169 -219599 -187978 -229656 -165099 50235 13686 70491
19334 70491 -53208 -76663 73020 80165 190038 210392 128588 105207 93064 -18747 41888
19323 41888 74430 58710 322659 264989 301625 286777 135081 162334 57818 -45353 112614
19312 112614 157949 188648 198657 220199 115213 59352 26276 -40694 -117555 60045 87117
19301 87117 79982 15616 30190 -184972 -230563 -298595 -265536 -75694 -3979 159994 262604
19290B62604L0438j67952j03048j08026k11275J70690J04704k30835k06702K8766
19280d30636J52725j04109J29333K2369J22370J68409p3763n8975J0691J7604
19270d3982N2469p6153K3314j43932n4529R1974J35029J01923Q5647R0806K052
19259B64618n3351K2410P2358k6074J31725j305k43440O5146n3422k18349P3947
19248C4263L1813j84588M6966M1216J67081J6368J31160p9568O5512j45625k93528
19237a68930j1561J16749r32n1982J17722P2207Q6502N5067r3365j3566k24471
19226a16560N1930J18483O7514l3627j93649m3609p6474J03564J73987o0115o1984
19215g0540m3480j1838J4586J19952J42614Q9615k10514m7219r2410q9180J47847
$$ plain form
19290 262604 293042 125090 22042 -85984 -297259 -126569 -21865 -252700 -459402 -430636
19280 -430636 -277911 -382020 -252687 -230318 -107948 60461 -13302 -72277 -61586 -43982
19270 -43982 8487 -67666 -44352 -188284 -242813 -150839 -15810 86113 171760 262566 264618
19259 264618 211267 233677 306035 279961 411686 410381 166941 232087 178665 -39684 34263
19248 34263 66076 -118512 -71546 -30330 136751 153119 284279 204711 270223 124598 -168930
19237 -168930 -180491 -63742 -64674 -116656 1066 73273 159775 214842 121477 107911 -116560
19226 -116560 -64630 53853 121367 87740 -105909 -149518 -225992 -122428 51559 -8556 -70540
19215 -70540 -114020 -125858 -111272 8680 151294 240909 30395 -16824 -109234 -198414 -50567
19204e0567l2904R3738o1880j19874J59917J6381Q5052j15003j07694O7982L1698
19193c3154j96254q1029o6376k0394J45834J3994m5587l8549P5014N2785J28558
19182f5158J81853P7515K9824M7137m9554k3120N4058m3355r4220J08431l1946
19171A91465l37029j71569p0967J51787R9344l2370j2322l7461k2480l8647J56406
19160a23843J41441M8371L3891j18597p8022k23342J28364J24244J29024J6973
19150G8504o1765q0849l2423j8658j9254j19444p7175j20607l4165K00132J66930
19139a18774j71809j79365K871K54330J53751M7788P9441q2436J36594j8144q5333
19128A8914P5082m5894j42141J45987J66871m7836p6532Q1015j809r5466j99371
$$ plain form
19204 -50567 -83471 10267 -51613 -171487 -11570 4811 89863 -25140 -132834 -64852 -33154
19193 -33154 -229408 -310437 -376813 -397207 -251373 -237379 -282966 -321515 -246501 -193716 -65158
19182 -65158 116695 194210 224034 271171 221617 198497 252555 209200 114980 223411 191465
19171 191465 -145564 -317133 -388100 -236313 -136969 -169339 -181661 -219122 -241602 -280249 -123843
19160 -123843 17598 65969 99860 -18737 -96759 -320101 -191737 -67493 61531 78504
19150 78504 16739 -64110 -96533 -115191 -134445 -253889 -331064 -451671 -485836 -285704 -118774
19139 -118774 -290583 -469948 -467077 -212747 -58996 -11208 68233 -14203 122391 104247 18914
19128 18914 93996 48102 -94039 51948 218819 170983 94451 175466 173657 78191 -121180
19117a21180J73471K05525l4535j2087J454j77891r4433K36158N4779J26785o7216
19106B90830j77342j52598k32621r7165K75444L02088J0038j68691j39416L125
19096h6308J16611J81218J40380p3453j90518j07822k06164j40342m827N910J55661
19085b09654J88542K02991J0099k15084j72842K9193K25882L498j27450J7605
19075d7220J24868o9353n3462j95179Q9384R0642K62484P1629J40202L6250l22211
19064A28034k52792q9708K25028J02227j3282R6314M2730R2196j8725N764N3882
19053C71668K64583J21347J64791L79580N57925K84921L17942N5849m78238m49465
19043A590903q5069j86521j52111k8121q7414L04657L72332L61418R156k06776
$$ plain form
19117 -121180 52291 257816 223281 211194 212648 34757 -59676 176482 231261 358046 290830
19106 290830 113488 -39110 -271731 -368896 -93452 208636 218674 49983 -89433 -86308
19096 -86308 30303 211521 351901 278448 87930 -19892 -226056 -366398 -371225 -365315 -209654
19085 -209654 -21112 181879 191978 -23106 -195948 -166755 59127 62625 -64825 -47220
19075 -47220 77648 8295 -45167 -240346 -150962 -60320 202164 273793 413995 450245 128034
19064 128034 -124758 -214466 10562 112789 99507 195821 238551 330747 312022 317786 371668
19053 371668 636251 757598 922389 1301969 1859894 2144815 2462757 2518606 2040368 1590903
19043 1590903 1505834 1319313 1167202 1139081 1051667 1356324 1728656 2090074 2099230 1892454
19033A892454m21176j56721o6868k37120l10863j8108j139Q950j02463j94587
19023C92359k0179N5478K3078j11401j37712j606o9631r8402Q8133L8664j34616
19012B4165j3989K95634M5684q6909N600j00642r4671o7651J40911k6850M8810
19001A70092J25615J06653n9706j96057j51578Q0316Q3411L0477K6245k05065
18991A0403j89746Q136m6253k3566L1802L8450L1149o6540P5332M4134p2118O9233
18979h9584J38873l18908k22436P259K43759J33919R0497R5143J48180p8462J85523
18968C33763J18633m9885k79058o4890J03451O9600P4644j27798k41472Q8828
18958B5816N4813m0639q8256M8514R720j7182n2067j37064n1088P020J2650n274
$$ plain form
19033 1892454 1471278 1314557 1247689 1010569 699706 681598 680459 689409 586946 392359
19023 392359 372180 427658 450736 339335 201623 200017 130386 31984 120117 158781 24165
19012 24165 10176 305810 351494 264585 270185 169543 74872 7221 148132 121282 170092
19001 170092 295707 402360 342654 146597 -4981 75335 158746 189223 215468 10403
18991 10403 -179343 -171207 -217460 -241026 -209224 -170774 -139625 -206165 -130833 -86699 -158817 -89584
18979 -89584 49289 -269619 -492055 -484796 -241037 -107118 -16621 78522 226702 148240 333763
18968 333763 452396 402511 123453 58563 162014 231614 306258 178460 -63012 25816
18958 25816 80629 39990 -48266 248 9968 -7214 -59281 -196345 -247433 -240413 -227763 -233037
18946b33037j16628O329K25231J92701J29295j41615m0851N2683j39590m1451
18936a06933Q8392O4517P7524o2757M6606O702j21024L2434Q9438J6086j11603
18925A9382K3373p587j13054Q7295q1844P3980L4471m4576j4367K34073J03202
18914C14348j50860p6600J07588k08477j30435m2762R9828J59933j2871o8538
18904h846P9611k06931j43393J10357J96430n7576J22285j5078k8383J2006k32436
18893a71954o6848m4401J11782J98233J16961k01467k08565M568K39058R1911
18883F9278M6810O5990P8417n4071j58216j49806o880m445j29458Q7879L4569
18872a19933j5942k0717M9807k328Q1851n4831K173J50675J58721n9218k6026
$$ plain form
18946 -233037 -349665 -343336 -118105 74596 203891 62276 21425 74108 -65482 -106933
18936 -106933 -18541 45976 123500 60743 107349 114051 -6973 25461 114899 130985 19382
18925 19382 42755 35168 -77886 9409 -72435 1545 36016 -8560 -22927 211146 314348
18914 314348 163488 86888 194476 -14001 -144436 -187198 -87370 72563 59692 -8846
18904 -8846 70765 -136166 -279559 -169202 27228 -30348 91937 76859 48476 60482 -171954
18893 -171954 -238802 -283203 -171421 26812 143773 -57694 -266259 -261691 -22633 69278
18883 69278 116088 182078 260495 206424 48208 -101598 -108478 -112923 -242381 -154502 -119933
18872 -119933 -135875 -156592 -106785 -109113 -27262 -82093 -79920 70755 229476 170258 144232
18861A44232k51319j80865J72789J95930r7535p4949j14788j40597J30900J90520
18851b5682m4965L3404P477J26795J7140r7374j0964J69886M4158j69691r997
18840D0187P2728k79591M4931j19253l5293j22898R6364J32816l9157j36915j9464
18829c65545l9935J04618P2001K9913N1575m3704O2462R2020l5046J3329J83017
18818A24705q931m8159j47554N758J11330j17687N2149K63690J05544k26269j68900
18807e4324o608j1909j90991l3239R2899n9934L0345r6162J80405J362J57231
18796I075J8032j402j48890O1120l9588m2379J1824L8332M9152j02337n7995K77001
18784G1945M0558n1986l940O7658q2662q1353j87161j33177m8720M0294K18980
$$ plain form
18861 144232 -107087 -287952 -115163 80767 -16768 -91717 -206505 -347102 -216202 -25682
18851 -25682 -70647 -37243 -29766 97029 114169 16795 5831 175717 219875 50184 40187
18840 40187 112915 -166676 -121745 -240998 -276291 -399189 -302825 -170009 -209166 -346081 -365545
18829 -365545 -405480 -300862 -228861 -198948 -147373 -191077 -128615 -36595 -71641 -58312 124705
18818 124705 115774 67615 -79939 -74181 37149 -80538 -28389 235301 340845 114576 -54324
18807 -54324 -60932 -72841 -263832 -297071 -204172 -264106 -233761 -329923 -149518 -148156 9075
18796 9075 27107 25705 -123185 -62065 -101653 -144032 -132208 -93876 -44724 -147061 -205056 71945
18784 71945 112503 60517 56577 124235 41573 -39780 -226941 -360118 -408838 -368544 -149564
18773a49564N4856j04737j98804N285Q8181j00533J19783K28625k56k25009K01977
18762h0196J80706k20963j19067k1828L4909K16671J32660N4616j40336m6051
18752h879j52363k00423J31526K00048o3919j39172P5702N1739J9472q628M401
18741i0496k4042J3840J2526l1692j2816j35952k14024M9206n497N919K46090
18730a86938k0018l36033j18990J65565M16652J45780l136j00433K938K79o6633
18719a00967j08392j21389N3156M5279P070N2354m6266R5154K05173l409N0282
18708A28045J2101r2538p8791j58914J96049J1764j00110O6473j03839P0356L4573
18697a4831j55951k02804j10113M0238N8882M5112L6364K7172J54663J20154J39034
$$ plain form
18773 -149564 -94708 -199445 -398249 -392964 -304783 -405316 -285533 -56908 -57164 -282173 -80196
18762 -80196 100510 -120453 -239520 -261348 -226439 -9768 122892 177508 37172 -8879
18752 -8879 -161242 -361665 -230139 -30091 -94010 -233182 -157480 -105741 -86269 -94897 -90496
18741 -90496 -114538 -100698 -88172 -119864 -132680 -268632 -482656 -433450 -438947 -433028 -186938
18730 -186938 -206956 -542989 -661979 -496414 -79762 66018 62882 -37551 -34613 -34334 -100967
18719 -100967 -209359 -330748 -277592 -232313 -225243 -172889 -219155 -124001 81172 77763 128045
18708 128045 140146 47608 -31183 -190097 5952 17716 -82394 -15921 -119760 -49404 -14831
18697 -14831 -170782 -373586 -483699 -443461 -384579 -339467 -303103 -275931 -121268 -1114 137920
18686A37920R8051k04557o2884K8638m9437O7944M265j45625L3037R4564j66214
18675a64298j8296p121J02409m1265J31978o6724l9129J30496J29215O6755p2887
18664A51133m658j53732o9135q0269O0272l8429J42728J29953n0559M1772k8069
18653A01007k4805j34448j92315o2348j3883q89k5825J49863J83535P4088N9940
18642A13920J30414k00417k26284R208J10164J44093k7275k4678j08643J29626
18632E0128N9238j4086l8128j90001k46305O3270P0671m9157P9022N8415J31Q5383
18620g1419J02157j66855j9443R7260J50560J50911k34917j74670j66474r8624
18610d31514j6701R9213N7580L5878l4548M0757O2259K25992Q7894j43530m7612
$$ plain form
18686 137920 235971 31414 -31470 -2832 -52269 15675 19940 -125685 -92648 1916 -164298
18675 -164298 -182594 -189715 -87306 -128571 3407 -63317 -102446 28050 157265 224020 151133
18664 151133 146475 -7257 -76392 -156661 -96389 -134818 7910 137863 87304 129076 101007
18653 101007 76202 -58246 -250561 -312909 -326792 -327681 -353506 -203643 -20108 53980 113920
18642 113920 244334 43917 -182367 -173159 -62995 81098 53823 29145 -79498 50128
18632 50128 109366 95280 57152 -132849 -379154 -315884 -245213 -294370 -215348 -156933 -156802 -71419
18620 -71419 30738 -136117 -155560 -58300 92260 243171 8254 -166416 -332890 -431514
18610 -431514 -448215 -349002 -291422 -255544 -290092 -249335 -187076 38916 126810 -16720 -64332
18599f4332n3497J64294L6095r6762m7950j76886K57944J74398Q4272l5045K0817
18588B63348n0901l3664j16320p1774l8872k3768j84268P7931M0049M7230J4637
18577g6372j58235r0629L87J09053o4946K765j8924J63977K46424k1597k76634
18566a84731N4918R4541p1111L4146q1074j54583J14371K283m1818K25169j75690
18555a83579l16186J49273R6932K22579O0944n2282k2005R4857k6182L8372L4859
18544I7582J00585j40277k76727k721m699L072m2476K0710j290J53588J59711
18533F7058n3012j25149j6296n9247O0218N5953O380J46706j50938Q123r556j04946
18521a74706R8588K71515j60173j84606p6321j3209p8719L3160K32893j22427
$$ plain form
18599 -64332 -117829 46465 82560 -14202 -62152 -239038 18906 193304 277576 242531 263348
18588 263348 212447 178783 62463 -9311 -48183 -71951 -256219 -178288 -138239 -91009 -76372
18577 -76372 -234607 -325236 -324849 -215796 -280742 -277977 -296901 -132924 113500 91903 -184731
18566 -184731 -129813 -35272 -106383 -72237 -153311 -307894 -193523 -191240 -233058 -7889 -183579
18555 -183579 -499765 -350492 -253560 -30981 29963 -22319 -44324 50533 24351 62723 97582
18544 97582 198167 57890 -218837 -221558 -226257 -223185 -265661 -244951 -246241 -92653 67058
18533 67058 14046 -111103 -127399 -186646 -126428 -70475 -64095 82611 -68327 -60204 -69760 -174706
18521 -174706 -76118 195397 35224 -149382 -225703 -238912 -317631 -284471 -51578 -174005
18511a74005k76041r1662j93830K01151L13449J43932l8357j59479j05250o1447
18501d41539K46668L29299m7623q2644k50895j3977J47271P6255r1274K7643j1387
18490a12203o2225r328P5163j22913K7113J19721n4593m9101J38508m2887K6363
18479f6382j26258j92646J26145M1613j38628J72107N5807k0035J03763m9327
18469i3841l6982j9529R5291m8898L2005O1827K5931k18590j63564p6093R8635
18458c43808J42924O0084L9551L8499r3911n6850J78027L337j64924J07234n0716
18447a40553j44773m658j2767K54394K38282j7460o3819o4061j64091Q3739l6803
18436g2570m4544l1809j96143O8509K21853M0755j99410K2425K2778J58228O0717
$$ plain form
18511 -174005 -450046 -541708 -735538 -534387 -220938 -77006 -115363 -274842 -380092 -441539
18501 -441539 -194871 134428 86805 4161 -246734 -260711 -113440 -37185 -128459 -100816 -112203
18490 -112203 -174428 -183756 -108593 -231506 -204393 -84672 -139265 -188366 -49858 -92745 -66382
18479 -66382 -192640 -385286 -259141 -217528 -356156 -184049 -128242 -148277 -44514 -93841
18469 -93841 -130823 -150352 -55061 -103959 -71954 -10127 15804 -202786 -366350 -442443 -343808
18458 -343808 -200884 -140800 -101249 -62750 -156661 -213511 -35484 -32147 -197071 -89837 -140553
18447 -140553 -285326 -289984 -302751 -48357 189925 172465 108646 44585 -119506 -35767 -72570
18436 -72570 -117114 -148923 -345066 -276557 -54704 -13949 -213359 -190934 -168156 -9928 50789
18425E0789K4785M5728j44841j69960Q709j5021j89749j00314Q0093k81955J47561
18414e44175J49295K4452J25735R743J69156J08704j11173j16698K5491O3450
18404i6020K40807P8085r4711L427L470K2334K8851j03841j14115l4562J9922
18393d6353r2257J0218J51351O7192j33842j6104k8516M0301o7197k04233R9041
18382b20399J10396R6843J64177N5015j38695l01721p3297P9449J29330l7178
18372a36080J05638M5421J11427l751k16750j09935O5235J12731q0173q4846L3047
18361a58036J15353K99107j40277n6953k05100k79164J71275K41753J38602O9589
18351A96149j30603j18084J17173P9336M2411R9862N714L2858J07528j62780m5586
$$ plain form
18425 50789 75574 121302 -23539 -193499 -184790 -199811 -389560 -489874 -409781 -691736 -544175
18414 -544175 -394880 -370428 -244693 -234950 -65794 42910 -68263 -184961 -159470 -96020
18404 -96020 144787 222872 128161 131588 135058 157392 186243 82402 -31713 -66275 -46353
18393 -46353 -138610 -128392 22959 90151 -43691 -59795 -88311 -48010 -115207 -319440 -220399
18382 -220399 -110003 -13160 151017 206032 67337 -234384 -307681 -228232 -98902 -136080
18372 -136080 -30442 14979 126406 122655 -94095 -204030 -138795 -26064 -106237 -191083 -158036
18361 -158036 -42683 256424 116147 59194 -145906 -425070 -253795 -12042 126560 196149
18351 196149 65546 -52538 64635 143971 186382 286244 291958 324816 432344 269564 223978
18340B23978j92510P6016J66463j07991j33888k16986l8841K7408O9720J05024
18330b1607J13390J80834m3529l73614J21454O2147o3984n3429j71609q0129j97213
18319e27289J60917J25805q7148O2281j22143M5910k7958J5611K11159j9462j8784
18308a81101k8399L142R7500j51259n0581N256R8752J51821m8175o725j9806j9470
18296a49045J06482l7373J94957j4848O8495j15283N5341J47698l7757p6658O4972
18285B06981k11027j55617j510j63911R748J29032p6675N2205J6808J01010J6521
18274g6435j83232q7590J62940P4488l8598K713k4022q3814N9458K07338j27393
18263a14147k8637Q8637K6719k6346L758p5613j51797J47830L9781Q7288l921
$$ plain form
18340 223978 31468 107484 273947 165956 32068 -184918 -223759 -196351 -126631 -21607
18330 -21607 91783 272617 229088 -144526 -23072 39075 -24909 -78338 -249947 -330076 -527289
18319 -527289 -366372 -240567 -327715 -265434 -387577 -341667 -369625 -354014 -142855 -162317 -181101
18308 -181101 -209500 -206358 -108858 -260117 -310698 -305442 -206690 -54869 -103044 -109769 -129575 -149045
18296 -149045 -42563 -79936 115021 100173 168668 53385 108726 256424 218667 142009 206981
18285 206981 -4046 -159663 -161173 -325084 -315336 -186304 -262979 -210774 -193966 -92956 -76435
18274 -76435 -259667 -347257 -184317 -109829 -148427 -145714 -169736 -253550 -194092 13246 -114147
18263 -114147 -142784 -54147 -27428 -53774 -50016 -125629 -277426 -129596 -89815 -2527 -6448
18252f448k5423r5985j01210K40017K93401n0824r2773K2941J1707l7583J8110
18241A75930J7810r0118Q7839j48341k10411l3928J60470J48531J89793p6948
18231B20627j11029R0918J39115r9985l56416q1195M6693K41431J22624q3498
18221A29285j59570m6481L2984J80397L5954J22048j5269m3519Q8970k10263K3677
18210A38213K7445J05027L2312k86466N4985m1013p7382J6676R0174o3706M0249
18199C6514J48220j03095L7995j85768n737J36293j4636m5097K2804q7340k746
18188f2593M3624o7888J03886J7443l7088q2262O9612k0470N2735m5167N926J25772
18176A03530P9320o1400P473m2867n2733J6375J6627J70739j5976k7253p3315
$$ plain form
18252 -6448 -31871 -127856 -229066 10951 304352 253528 160755 183696 195403 157820 175930
18241 175930 193740 103622 191461 43120 -167291 -201219 -40749 107782 297575 220627
18231 220627 109598 200516 339631 239646 -116770 -197965 -151272 90159 212783 129285
18221 129285 -30285 -76766 -43782 136615 172569 294617 279348 235829 324799 114536 138213
18210 138213 165658 270685 302997 16531 71516 30503 -46879 -30203 59971 -3735 36514
18199 36514 184734 81639 119634 -66134 -71871 64422 49786 4689 27493 -59847 -62593
18188 -62593 -18969 -86857 17029 34472 -2616 -84878 -15266 -35736 16999 -28168 -22242 103530
18176 103530 182850 121450 128923 86056 33323 49698 66325 237064 221088 193835 120520
18165A20520K8507j7389L2130j54973r2280N3900J75408j639n5345J19936J53841
18154C62616q561j23755O079k65171k1588n464j1010j7129K32756J81682k39419
18143I1036m36617R398J64918J83382N1005m8620m345J43M7910j5613n1076r9988
18131a08467J40281m1235m5103M2741Q9185j24395l21562L2327J91455J25336
18121a9437L1880k1074j03515j26607N6366J30459J65085J47695r5391j15113
18111E0348k48960L595N3335j94834J04147J75194Q4431j48744j61207o1121p2580
18100d16396J34696K5133n6854k716o654l7340J34731J26050p902j5264j1234
18089a33750J48608k6280j94024q9069k4792K7325J27735Q0258p1728j9004j40353
$$ plain form
18165 120520 149027 131638 163768 8795 -83485 -29585 145823 144184 88839 208775 362616
18154 362616 354055 230300 236379 -28792 -50380 -55844 -66854 -83983 148773 330455 91036
18143 91036 -345581 -336183 -171265 12117 63122 14502 10157 10300 58210 42597 -8479 -108467
18131 -108467 31814 -9421 -54524 -11783 77402 -46993 -368555 -336228 -144773 -19437
18121 -19437 12443 -8631 -112146 -238753 -182387 -51928 113157 260852 165461 50348
18111 50348 -198612 -195017 -141682 -336516 -232369 -57175 27256 -121488 -282695 -343816 -416396
18100 -416396 -281700 -256567 -313421 -316137 -322791 -360131 -225400 -99350 -107252 -122516 -133750
18089 -133750 14858 -11422 -205446 -294515 -319307 -291982 -164247 -83989 -155717 -174721 -315074
18078c15074L9476P6801K20483J74220m4068L5425k23473j18459K18563n8601
18068E293J5876J39564J96412K2703r6056k26793J7271j28982m4669j63103K6038
18057b36446L32893J7222r0711R4664J63099Q4616k25950r4900J53233J67480
18047C65200j50236j90758j15904j5511j29562J31397J3961j57746l1739O5240
18037b15658J69747J30615J4356j5836J858m1928j70400j20513M6306J63286n2630
18026i0797k4954R3460K05499j15189j9711M4385J5096j25818l9859J91312J11875
18015B45299j37903J55897J07355n1362k23631P5378J66016P8726j82970L9639
18005B72444j51833N7606K4257j83910j33565P3940O9148Q2705P7099L8432n2261
$$ plain form
18078 -315074 -275598 -198797 21686 195906 151838 187263 -36210 -154669 63894 5293
18068 5293 21169 160733 357145 379848 283792 56999 74270 -54712 -99381 -262484 -236446
18057 -236446 96447 113669 22958 117622 280721 365337 139387 44487 197720 365200
18047 365200 214964 24206 -91698 -107209 -236771 -105374 -91413 -249159 -280898 -215658
18037 -215658 -45911 84704 99060 83224 85082 43154 -127246 -247759 -201453 -38167 -90797
18026 -90797 -115751 -22291 183208 68019 48308 92693 107789 -18029 -57888 133424 245299
18015 245299 107396 263293 370648 319286 95655 171033 337049 415775 232805 272444
18005 272444 120611 178217 202474 18564 -115001 -41061 28087 110792 187891 226323 174062
17994A74062p5206N6820J06514K21743q1936k26635p5312n4798j35155n81l4556
17983a25040j69337r6497K19164K36497l6601N7684J29774P6441k00630j19463
17973b8008r8776K22405j6530p8341Q20k44677J16209K47443J61732l4882k71790
17962b4395o1982j1531k21643J07901J41446j60937j7791O9563K27493j53683
17952a05559q3015J34240j01562J3966J35682m7938O4108J05370n889o760P1968
17941A74611l1452k5756k60105n6969J62644l9667J53639M2310j02943n6241k04504
17930b44433q682k8871K3246M3343r9782j02570J1848O3726L05665J54799r5962
17919B2327R969Q9552N1614l3353j22254k0352n4887J1129Q3165P3292L4825J66514
$$ plain form
17994 174062 98856 155676 262190 483933 401997 175362 100050 45252 -89903 -90484 -125040
17983 -125040 -294377 -390874 -171710 64787 28186 85870 215644 292085 91455 -28008
17973 -28008 -126784 95621 79091 750 1570 -243107 -126898 120545 282277 247395 -24395
17962 -24395 -86377 -97908 -319551 -211650 -70204 -231141 -248932 -179369 48124 -105559
17952 -105559 -188574 -54334 -155896 -141930 -6248 -54186 9922 115292 109403 102643 174611
17941 174611 143159 117403 -142702 -199671 -37027 -76694 76945 119255 16312 -39929 -244433
17930 -244433 -253115 -281986 -258740 -215397 -315179 -417749 -405901 -342175 -36510 118289 22327
17919 22327 32296 121848 173462 140109 17855 -2497 -57384 -46255 36910 110202 145027 311541
17907C11541Q7271j18937o7210o0311j48998p8675q3869k0361P3114o395n5475
17896a68305L2028R220p8749j66089o3123J19186J25926K5240J90964K8325L0731
17885H5354J8939N6333p398m7361K9319q4438j08039N7737j04846j10307m8462
17874b63169Q4550J39435M948m2376J01392r1311j57665K649L03261J67767L2426
17863B81907K03507K5219j62700k14787m0209K7680j31177P9315P7567J15161
17853B61483l6398q8320r6606p1885J30032N6696k26364j07892K1395r6142J20243
17842a33758K02424L2054n580J89370k248l40873j76218J94091K78768o6127R0082
17831B61985Q5305k62533o35J5044j25147j62734R05K42748J12793j761q0884
$$ plain form
17907 311541 398812 279875 212665 152354 3356 -75319 -159188 -179549 -106435 -112830 -168305
17896 -168305 -136277 -127057 -205806 -371895 -435018 -315832 -189906 -164666 26298 54623 85354
17885 85354 104293 160626 153228 105867 135186 50748 -57291 446 -104400 -214707 -263169
17874 -263169 -178619 -39184 -34236 -76612 24780 -66531 -224196 -221547 81714 249481 281907
17863 281907 485414 510633 347933 133146 92937 120617 -10560 68755 146322 261483
17853 261483 225085 136765 40159 -31726 98306 155002 -71362 -179254 -157859 -254001 -133758
17842 -133758 68666 100720 95140 284510 282262 -58611 -234829 -40738 238030 171903 261985
17831 261985 347290 84757 84122 99166 -25981 -188715 -187810 54938 167731 165970 85086
17820H5086q7219m215q7841k9626P1274L7991p8061n6906J96009k36527j05658
17809b95693J49288J82833O6719N1659P6406j1112j13000q9168J57072K06618
17799C81622p4411k79970j34060K7047J36813N6838N7431l0388j10105K4524R2228
17788A47569m1472j24250O7386K07538j53373j09434O5833r7733n2114L4818l1145
17777h6377j00059M6636J5087o8084J84552Q3960J22075k5136j50132q3615J10698
17766D9605m7197j19481J97205l4104N6617P3510o3256j99826k13864j06161q580
17755d15532J51167J94018o8961j04797J44479J2901p0745o7593Q2079K08632
17745F5648M5184l9008J40904l8905M8768k6043j20956j48633j05660l8890M6164
$$ plain form
17820 85086 -2133 -6348 -94189 -123815 -52541 -14550 -92611 -149517 46492 -190035 -295693
17809 -295693 -146405 36428 103147 154806 231212 220100 107100 17932 175004 381622
17799 381622 307211 27241 -106819 -79772 57041 113879 171310 140922 30817 55341 147569
17788 147569 106097 -18153 49233 256771 103398 -6036 59797 -37936 -90050 -55232 -86377
17777 -86377 -186436 -139800 -124713 -192797 -8245 75715 197790 172654 22522 -61093 49605
17766 49605 2408 -117073 80132 46028 102645 176155 112899 -86927 -300791 -406952 -415532
17755 -415532 -264365 -70347 -139308 -244105 -99626 -86725 -157470 -225063 -142984 65648
17745 65648 110832 71824 212728 173823 222591 196548 75592 -73041 -178701 -217591 -171427
17734a71427J22780r2882m9711O2778j43136J8896N2126J90232P8164O9883P2645
17723B10348J68026l9555k60829k99576J14268j29397j87354L23231J07548l7725
17713c1015P1532o7873N7700O5715O0033j36728j21849J0367k9536j34130J390
17702b54394Q0263j48515R8178K66973J51488r5234j05231J89021J93914j79661
17692A96802r9819o8895J14113O1306k3543J34740o1199j02044M1544l06973J6669
17681i7299p914n4140J5238J40457m4459o1522o5188L462p8385q8119L0465J35562
17669a71842P6598R6983M833r2726J4744Q0248J8607J0957p7336j08941L8377
17658a09498P9868j88590j61352M4175J28128j0409L8483N4471J14713k9973k29417
$$ plain form
17734 -171427 -48647 -141529 -191240 -128462 -271598 -252702 -200576 -10344 67820 137703 210348
17723 210348 378374 338819 77990 -221586 -107318 -236715 -424069 -100838 6710 -31015
17713 -31015 40517 -27356 30344 96059 156092 19364 -102485 -92118 -121654 -255784 -254394
17702 -254394 -174131 -322646 -224468 42505 193993 98759 -6472 182549 376463 196802
17692 196802 96983 28088 142201 203507 179964 314704 253505 151461 193005 -113968 -97299
17681 -97299 -105213 -159353 -144115 -3658 -48117 -109639 -174827 -171365 -249750 -337869 -307404 -171842
17669 -171842 -95244 1739 6572 -86154 -71410 8838 27445 38402 -38934 -147875 -109498
17658 -109498 -29630 -218220 -379572 -335397 -207269 -217678 -179195 -124724 -10011 -39984 -269401
17647b69401j73028n1476L0832J75692J27963J12330J04563j2363K0180J63246
17637B28538j58116j54672j10235o2727j65172n2670Q8811J10799J63068Q8422
17627b3954J58704Q4881j12402k06914n8448M8830R4563N3237R9540J49049K809
17616B89895o5168k01992j89287k61015Q137j8765J23223K4239L9268J23069J03733
17605b4663j44653k00922J12236K33005J98584j2589j47204m1094j83424p9288
17595b90012k8349J78030K1781O0352J20774q6576J1271J6978j88825p839K31496
17584C9081J15195o6535k34439M8858Q0790N0333N4799M747j11504j82958J1012
17573a90621p0864J17793j2986l1036M6822R6681m4589j54082o3394L4022K6126
$$ plain form
17647 -269401 -442429 -493905 -463073 -287381 -159418 -47088 57475 45112 65292 228538
17637 228538 70422 -84250 -194485 -257212 -422384 -475054 -386243 -275444 -112376 -23954
17627 -23954 134750 219631 107229 -99685 -158133 -109303 -14740 38497 138037 287086 289895
17616 289895 224727 22735 -166552 -427567 -419430 -438195 -314972 -290733 -251465 -128396 -24663
17605 -24663 -169316 -370238 -258002 -24997 173587 160998 13794 -27300 -210724 -290012
17595 -290012 -318361 -140331 -118550 -58198 62576 -24000 -12729 4249 -184576 -192415 39081
17584 39081 154276 87741 -146698 -97840 -17050 33283 88082 92829 -18675 -201633 -190621
17573 -190621 -261485 -143692 -156678 -187714 -140892 -44211 -88800 -242882 -306276 -272254 -246128
17562b46128L676J33580J20199p8797k98592j2402J23676L4078o4783R6935O0541
17551a28017J04191K36972J8050j38902n621k3511j59498m8315l644J78186M9123
17540G9014j21801Q4661l2304j56404R2951K20574N1649m0985n8312j49152l2488
17529f2597o3583j18793J689q9492J31620J56075K9891l1792R474K0895P840R4256
17517H5483q7705j7871N4460n40R9489j28189p6855r4600J8567O2687o9045J24091
17505c0028J75169P7882J59666j53216k40828l28204k6673K54915J27915j27351
17495a10753j07747j00720J3372J70350M8238o8897r9281o4320Q6568o6903o8049
17484c68142J07936n0672Q1490r10p245K9278J30569m3981J19378K82580O5935
$$ plain form
17562 -246128 -242452 -108872 11327 -67470 -366062 -378464 -254788 -220710 -285493 -188558 -128017
17551 -128017 -23826 213146 231196 92294 86673 63162 -96336 -144651 -148295 29891 79014
17540 79014 -42787 41874 9570 -146834 -53883 166691 218340 177355 119043 -30109 -62597
17529 -62597 -126180 -244973 -243284 -332776 -201156 -45081 -15190 -46982 -37508 -16613 -8773 85483
17517 85483 -2222 -20093 34367 33827 133316 5127 -71728 -166328 -147761 -85074 -154119 -30028
17505 -30028 145141 223023 382689 229473 -11355 -339559 -366232 -111317 16598 -110753
17495 -110753 -218500 -319220 -305848 -135498 -87260 -156157 -255438 -319758 -233190 -300093 -368142
17484 -368142 -260206 -310878 -229388 -230298 -237543 -208265 -77696 -121677 -2299 280281 346216
17473C46216r0114K1482J52791j318j35089j34268k7805j9492j61061k92427J58986
17462a82099K22431q1581n2494K02629j02189l22513k1624K76392J93920m7112
17452H5760J42489l8926l35229j78772L4505j23294L6891J70701J81797J47955
17442A23877p2962j57027N8427J1072L0298l7816j9653l8140J27346K8316j1327
17431D2411r3632l8769J1795j05977J17353K92021J05333j65656j00886j92950
17421a28957K9761j44821l9653Q0275L3764o4963N0908L7094J21538K6720O7898
17410F9564j12003N6825k24454n6553k08961m811l1780R2291K64916k0830m0837
17399b16633K13629k6058l2096n6044n8199j0610j22450j52684J09320k1329J5631
$$ plain form
17473 346216 256102 277584 430375 429057 293968 159700 131895 112403 -48658 -341085 -182099
17462 -182099 40332 -41249 -93743 108886 6697 -315816 -337440 -61048 132872 85760
17452 85760 228249 189323 -145906 -324678 -290173 -413467 -376576 -205875 -24078 123877
17442 123877 50915 -106112 -47685 -36613 -6315 -44131 -63784 -101924 25422 53738 42411
17431 42411 -51221 -89990 -78195 -184172 -66819 225202 330535 164879 63993 -128957
17421 -128957 -99196 -244017 -283670 -203395 -169631 -234594 -183686 -146592 -25054 1666 69564
17410 69564 -42439 14386 -210068 -266621 -475582 -480393 -512173 -419882 -154966 -175796 -216633
17399 -216633 -3004 -29062 -61158 -117202 -175401 -186011 -308461 -461145 -351825 -373154 -357523
17388c57523J06391j2662j7988P7079K25869O9217k14525n7257J348M963j7421
17377a92509p886N3576R7845j35651k1016m780K0635M8271p8198O1760l8854p5314
17365b72121o3582j20010J20325K15637m9674j13263o6535J99300K95685l5220
17355A10542j30172l6204j9475M073r2156j40985J71887K61644m5015k9337o3876
17344i074q3780J43338j2392j27308j19812L0208M7657M2458n1740j2063L3146
17333a19362L4674l2655l6929J01680M0374l934Q0175K16164o7692j3530j12212
17322H6753m5798n1186k92472j27964l3693K83203l8510R6178J43674l60322J8590
17311c21547K16330m3977k03149P7159J73741k9110p0578P5441J63753L3185j87831
$$ plain form
17388 -357523 -251132 -263794 -281782 -204703 21166 90383 -124142 -181399 -180051 -175088 -192509
17377 -192509 -200395 -146819 -48974 -184625 -205641 -210421 -189786 -141515 -219713 -157953 -196807 -272121
17365 -272121 -335703 -455713 -335388 -119751 -169425 -282688 -349223 -149923 145762 110542
17355 110542 -19630 -55834 -75309 -71236 -163392 -304377 -132490 129154 84139 54802 -9074
17344 -9074 -92854 50484 38092 -89216 -209028 -178820 -131163 -88705 -140445 -152508 -119362
17333 -119362 -84688 -117343 -154272 -52592 -12218 -16152 64023 280187 212495 198965 86753
17322 86753 40955 -10231 -302703 -430667 -464360 -181157 -219667 -123489 20185 -340137 -321547
17311 -321547 -105217 -149194 -352343 -275184 -101443 -130553 -201131 -125690 38063 71248 -116583
17300a16583j26865N389J22890m5244N7423J83492N3578j19404l9398P5017J64850
17289B15145j50859q3142J3586k04459k00056j61273n4323P1026J85034O180k9270
17278c92411O0871J00206J59400L4930j45604n6657j3295j6386O5375K6840m6160
17267b22891N7377J02642M9545q0985j9220m0930J05349n3856q8872J36610O7228
17256A1997O7124l6310M4607j24128L8376p205j06343l07655P1170J29605p11
17245b19473J26735O763M4432J247k11935J35839K10311j03037M0047m2254j5313
17234b6638R855n2740r0476J42194J79876K3611l6689j33050R8040p0042j9631
17223B4310r0861j30248n6068L30718K30226J99893j08476l65726j85024j09862
$$ plain form
17300 -116583 -243448 -238059 -115169 -160413 -102990 80502 134080 14676 -24722 50295 215145
17289 215145 64286 -18856 -5270 -209729 -409785 -571058 -625381 -554355 -369321 -363141 -392411
17278 -392411 -331540 -231334 -71934 -37004 -182608 -239265 -252560 -268946 -203571 -176731 -222891
17267 -222891 -165514 -62872 -13327 -94312 -113532 -154462 -49113 -102969 -191841 -55231 11997
17256 11997 79121 42811 87418 -36710 1666 -5539 -111882 -419537 -348367 -218762 -219473
17245 -219473 -92738 -85975 -41543 -40296 -252231 -116392 93919 -9118 30929 -11325 -26638
17234 -26638 -16783 -69523 -159999 -17805 162071 185682 148993 15943 113983 43941 24310
17223 24310 -66551 -196799 -252867 77851 308077 507970 399494 33768 -151256 -261118
17213b61118J02428J00536q0807o9316P5488l5472J11812P5652l8314j82009M9750
17202a51370p2341J04484O0191K2307O4127K19614J2612j96857N41J39199r9681
17191A02826j02412q0806j15165j16658M4684M6616J69836N7842m7621j16447
17181a57305J03015K70835J3776l00469k08781R7279K03371l7359j29958k3252
17171a68848o6383N2205J24976N0472n6458j31788j26676l946k9916Q219l5553
17160c83696P1181m7592l6831l3750M554P610J04308J72942M7586j55565m5723
17149b94976J17638L7811K59943j2789q2201P2701J53501R9893L6231j67822M5694
17138B65624J16124k32872k07087o4711O1790Q6331j03568k468k48063J37763
$$ plain form
17213 -261118 -158690 -58154 -138961 -208277 -132789 -168261 -56449 19203 -19111 -201120 -151370
17202 -151370 -223711 -119227 -59036 -36729 27398 247012 259624 62767 63308 202507 102826
17191 102826 414 -80392 -195557 -312215 -267531 -220915 -51079 6763 -40858 -157305
17181 -157305 -54290 216545 230321 -70148 -278929 -181650 21721 -15638 -145596 -168848
17171 -168848 -235231 -183026 -58050 -7578 -64036 -195824 -322500 -326446 -356362 -348143 -383696
17160 -383696 -312515 -360107 -396938 -430688 -426134 -418524 -314216 -141274 -93688 -249253 -294976
17149 -294976 -177338 -139527 120416 107627 25426 98127 251628 351521 387752 219930 265624
17138 265624 381748 148876 -58211 -122922 -61132 25199 -78369 -80837 -328900 -191137
17128a91137L2737j33743p5624J51344Q4543p406p711m5788j8996P0345J45414
17117C978k1904q4675m8249Q1539O5281j06080J7876N4437o4559J6048l0284o7884
17105a84476J14419J29614j885j46791q333m9454j22943J16870j42745J53310
17095a42414m0658j54746j17514J90011K50496J12514O7705J6693k22646K5193
17085a5366Q1300m5985P2306q9934Q3295R2769k07910j39098J03749J09805m9672
17074d741k65159m4588K28229J20948o8427m3105q5300J08438K24326R5449k31062
17063C5008j98692l5327J22195Q4253r2622j61936O2479N7453n124K5713J84484
17052G7884M8486j67953j21561J23685N0904p6121n6686J03067J46026p9546j14980
$$ plain form
17128 -191137 -158400 -292143 -367767 -216423 -131880 -139286 -146997 -192785 -211781 -141436 3978
17117 3978 -17926 -102601 -150850 -69311 -4030 -110110 -92234 -37797 -102356 -86308 -116592 -184476
17105 -184476 -70057 59557 57672 -89119 -97452 -146906 -269849 -152979 -295724 -142414
17095 -142414 -183072 -337818 -455332 -265321 -14825 97689 165394 182087 -40559 -15366
17085 -15366 65934 19949 92255 2321 85616 178385 -29525 -168623 -64874 44931 -4741
17074 -4741 -269900 -314488 -86259 34689 -33738 -76843 -162143 -53705 170621 266070 35008
17063 35008 -163684 -199011 -76816 7437 -85185 -247121 -184642 -127189 -132313 -106600 77884
17052 77884 126370 -41583 -163144 -39459 11445 -64676 -121362 -18295 127731 48185 -66795
17041f6795P8047r4549j04748L5966J14602j3194j0742j5580m3080k41447j86341
17030e47861J68712J92502J16607l3841N1334p3286p9108J37509R7517P4535j6778
17019H7842j1062P628o1198n2180j48963j32933K4881k1194l5974J00106J66324
17008g6723L3404P454j24028N6195K72075Q7339k7667r4711k22693o9328m5315
16997b03998j29947R5628n6569m1583n3903L1908R4622j11955l0513K34527L82456
16986B10673j24304k6302j33335l27227N1843J3497J74906n0J78339J45539M6189
16975B09768q7524j6014r6433j89463j48605J1921j09850J9766M4362J6207N0465
16964b95400J35883J5983J18133J61335n8101N7399L601j98089j76471J16564
$$ plain form
17041 -66795 11252 -83297 -188045 -152079 -37477 -50671 -61413 -76993 -120073 -361520 -547861
17030 -547861 -379149 -186647 -70040 -103881 -52547 -125833 -204941 -67432 30085 104620 87842
17019 87842 76780 84408 23210 -28970 -177933 -310866 -285985 -307179 -343153 -243047 -76723
17008 -76723 -43319 -35865 -159893 -103698 168377 255716 228049 133338 -89355 -158683 -203998
16997 -203998 -333945 -238317 -294886 -336469 -390372 -358464 -263842 -375797 -406310 -171783 210673
16986 210673 86369 60067 -73268 -400495 -348652 -335155 -160249 -160299 18040 163579 209768
16975 209768 122244 106230 9797 -179666 -328271 -316350 -426200 -406434 -362072 -345865 -295400
16964 -295400 -159517 -143534 -25401 135934 77833 135232 138833 -59256 -235727 -119163
16954a19163J45234j3489m8604M4475j67606J2299J05841K02811M2235n3226J889
16943A52696j47340J623J26167j67319m0545J14801j8501j66778l4053J52371
16933b6878m0905N3604J22228m7981j04307L4834n4087L1572o2788k6173K26448
16922A05567k1900j78381J39350K32948p043l48830o0586r0360o7427J67042K5436
16911a04184n5244n8393J27888N9495r1887j42679O1695r925J9338L05881J16633
16900B28618O0842o1383k1524q5575o8783k00777j00383J15362R36k10400P0023
16889b73044K61086O6621Q1434J22698j83464j10446J78238p8706l62459j50890
16879d48932K03994J00546l0616J7940K5473q2838J18128J0946P1193R377k6830
$$ plain form
16954 -119163 26071 12582 -36022 8453 -159153 -146854 -41013 161798 204033 150807 152696
16943 152696 5356 6979 133146 -34173 -74718 40083 21582 -145196 -179249 -26878
16933 -26878 -67783 -14179 108049 60068 -44239 -9405 -63492 -31920 -94708 -120881 105567
16922 105567 83667 -94714 44636 277584 270541 -78289 -138875 -229235 -296662 -129620 -104184
16911 -104184 -159428 -217821 -89933 -30438 -122325 -265004 -203309 -213234 -193896 111985 228618
16900 228618 289460 228077 206553 120978 52195 -148582 -248965 -133603 -132667 -343067 -273044
16889 -273044 -11958 54663 136097 258795 75331 -35115 143123 64417 -298042 -448932
16879 -448932 -244938 -144392 -175008 -157068 -131595 -214433 -96305 -85359 -14166 -4789 -31619
16868c1619q5946m861K37829q1782p6104j0328l4458o3346J63817L6364l8574
16857A0992j45585O3088J18612R0592J08514q7519k73840k50434R1922K00900
16847g2758j17560n4692k77371N6735K00376K48257r0664j03042P0600j82178
16837c22297j08333J06536K11731J6146J116L4952l5318O0359K9915p7744k4981
16826a07918j4030o2256Q291J98496N5019J06969j55485k6460P2563k06118q9539
16815b20468K6503K8315R0191J33653K7632j41296j08734Q555K59938J16015j10722
16804A09582o429j71379n6009J4720J10424J01885K1425L6789P2159m3504j76658
16793A3005k2811j11008N4755P0876m5487r1258O0766N7466K0229J30143j3066
$$ plain form
16868 -31619 -117565 -122426 115403 33621 -42483 -52811 -87269 -150615 13202 49566 10992
16857 10992 -134593 -71505 47107 137699 246213 158694 -115146 -365580 -273658 -72758
16847 -72758 -190318 -245010 -522381 -465646 -265270 -17013 -107677 -210719 -140119 -322297
16837 -322297 -430630 -324094 -112363 -96217 -95101 -60149 -95467 -35108 -5193 -82937 -107918
16826 -107918 -121948 -184204 -175913 22583 77602 184571 29086 2626 75189 -130929 -220468
16815 -220468 -193965 -165650 -75459 58194 85826 -55470 -164204 -155649 104289 220304 109582
16804 109582 103153 -68226 -124235 -109515 909 102794 124219 161008 233167 189663 13005
16793 13005 -9806 -120814 -66059 4817 -40670 -131928 -71162 -13696 6533 136676 123610
16782A23610j46808J12171Q9434j1076j51904j55678M9008J02950k18434J91995
16772a4732M1131o9598N4754J3524o8361O5702L2101j54116L4529J51266J03014
16761A89214L8731j32040l9075Q6101r7811L1745K3496P6654M4638k49908J4056
16750a4199K4564Q1889J18J71227p0302j43038q0165Q7936N3552n1374O88J14072
16738A74968j36831K1597N1377j83423j32126j9955M7323J31072J17068J12478
16728A83548J38574P8491j74199j59359o9624o1671P2657J48491j23503j48061
16718a14656J6977J7532J32183N488k3885o4568K9020j35984k87024J80866K06213
16707c7838N0444n3020O0996n4044J94969K44195j96517k54477r4211n1070O0395
$$ plain form
16782 123610 -23198 88973 178407 167331 15427 -140251 -91243 11707 -206727 -14732
16772 -14732 26399 -43199 11555 25079 -43282 22420 54521 -99595 -65066 86200 189214
16761 189214 227945 95905 56830 142931 45120 76865 100361 177015 221653 -28255 -14199
16750 -14199 10365 92254 92372 263599 193297 50259 -29906 58030 111582 60208 60896 174968
16738 174968 38137 59734 111111 -72312 -204438 -224393 -177070 -45998 71070 183548
16728 183548 322122 400613 226414 67055 -2569 -64240 8417 156908 33405 -114656
16718 -114656 -97679 -80147 52036 57524 33639 -30929 -1909 -137893 -424917 -244051 -37838
16707 -37838 12606 -40414 20582 -33462 161507 405702 209185 -45292 -139503 -190573 -130178
16696a30178j20528j62739J34158J94098n5235j89598R3121O6979r6266N8237
16686b07951m0291N7397j13896R7688K89733k176p5732J02565K28095l31818j54631
16675a51017p407R559J53548J07862J43026J37101N0099j08551p5937j15612P0850
16664B13521R322m8428l2794q5892k67087j56599k3121J31741P9687m6006K8482
16653a97174m8434J88268J45818J2235j33028k69578M2205J25927L2227N3254
16643d8280o1124J59715K29293j19597k61199r3641p8730L7301Q9131O6674J1063
16632f9394J9702J98923j77508j20906j68220R1874J59690n1351J20144Q7053
16622I0007J8166J2375k36443j88499j24564q3857Q9696J06994P4834J1604j9598
$$ plain form
16696 -130178 -250706 -413445 -279287 -85189 -140424 -330022 -236901 -169922 -266188 -207951
16686 -207951 -248242 -190845 -304741 -207053 82680 80504 4772 107337 335432 3614 -151017
16675 -151017 -158424 -148865 4683 112545 255571 392672 442771 334220 258283 142671 213521
16664 213521 222843 174415 141621 55729 -211358 -367957 -391078 -259337 -179650 -225656 -197174
16653 -197174 -245608 -57340 88478 100713 -32315 -301893 -259688 -133761 -101534 -48280
16643 -48280 -109404 50311 279604 160007 -101192 -194833 -273563 -236262 -147131 -80457 -69394
16632 -69394 -49692 149231 -28277 -149183 -317403 -225529 -65839 -117190 2954 90007
16622 90007 108173 120548 -115895 -304394 -428958 -512815 -423119 -316125 -241291 -229687 -249285
16611b49285l9250J2158J48731k301N1493l9014j09918J7039P3792p716J32636
16600a1635J07776l6920K8684L5435J4287M3202j93179j43591N6158K40140K8954
16589A69311R3860K5599l23140q1904o1541p0319N061l901J3829J60663J62906
16578I0424M4666j28048l9166J6081k54753j0146r9280k48630K49828K68426P757
16567a02841m3928q0286j062p0893J42862n6293q3806J39207L6223J08083J34748
16556A22014L4202j13217k979r9724j58174P3185J28102J29212L0106l9981M4492
16545A47238l6452r8673p4473Q6284M3103j04677m4624J29650q841Q8251M5025
16534A71811O729p0068J52942m8788m2932j06491j45891r1610j13544K9754K81281
$$ plain form
16611 -249285 -288535 -276377 -127646 -129947 -78454 -117468 -227386 -210347 -136555 -144271 -11635
16600 -11635 96141 59221 87905 123340 137627 180829 -12350 -155941 -99783 140357 169311
16589 169311 263171 288770 -34370 -116274 -177815 -248134 -243073 -246974 -233145 -72482 90424
16578 90424 135090 7042 -32124 -16043 -270796 -280942 -380222 -628852 -379024 -110598 -102841
16567 -102841 -146769 -227055 -228117 -299010 -156148 -212441 -296247 -157040 -120817 -12734 122014
16556 122014 156216 42999 40020 -59704 -217878 -144693 -16591 112621 142727 102746 147238
16545 147238 110786 12113 -62360 23924 67027 -37650 -82274 47376 38535 126786 171811
16534 171811 178540 108472 261414 212626 169694 63203 -82688 -174298 -287842 -258088 23193
16523B3193K5732M2104J11131P0931M6906j12517j36700k47383N139J96166J1070
16512C5772k24477n6315n4661M8664J30910j41850k07703L8360J53452J24417
16502a53431j08388J97136k1399m9376j5643K34674J29719o3268k52904j91822
16492b94702P1328J26459j71958j51545K16950K48641J76237o5079p2645j15895
16482c2209J4096N1335K6178q7734O6257j15541j36431J7152O2595K6387J05071
16471b844Q1530M8116p4581q3341l3765n9430j5969N1240k5950M4634J9497M771
16459d6092R0794q8673j53758j7948o1748J08521K00203J48533J58604j10926
16449B27510j44154n8227j34439L445J86861L4904n2942P1971p6170L8169n4161
$$ plain form
16523 23193 48925 91029 202160 273091 319997 207480 70780 -176603 -171464 24702 35772
16512 35772 -188705 -245020 -299681 -251017 -120107 -261957 -469660 -431300 -277848 -153431
16502 -153431 -261819 -64683 -86082 -135458 -151101 83573 213292 150024 -102880 -294702
16492 -294702 -223374 -96915 -268873 -420418 -203468 45173 221410 156331 83686 -32209
16482 -32209 -18113 33222 59400 -28334 37923 -77618 -214049 -196897 -134302 -107915 -2844
16471 -2844 78686 126802 52221 -31120 -64885 -124315 -140284 -89044 -114994 -70360 -50863 -46092
16459 -46092 44702 -43971 -197729 -215677 -277425 -168904 31299 179832 338436 227510
16449 227510 83356 25129 -109310 -105865 80996 115900 62958 134929 58759 96928 42767
16438D2767j43186R4792o0020k2854J55768P3118k52808q1155J64176K5679r2194
16427i5917j15435l6729K50370K12796R8097o7911J6577n6075o4777R1029R2795
16416C24820j32859O1399K2578J85494J9861j45261k44855j20747J64207J17731
16406B52368l7701l74364l9935J88708o2167M503Q8783O4547o5320l8065j4809
16395c3452N868J04535J23121j3244r4592j83091r5393j58664K2568N2679J57380
16384a12285q052l6258o2620J42373M4417q9727j81405k8040O3737k060K47932
16373b1988P0646p9492p7974J0008N8845O6281o9138N5407J2065r1227k01772
16362b68339j57316p0932j5328K16296J38971n2287j26753n5822P2643j1196O0423
$$ plain form
16438 42767 -100419 -5627 -65647 -88501 67267 140385 -112423 -193578 -29402 -3723 -95917
16427 -95917 -211352 -248081 2289 215085 313182 245271 261848 205773 140996 232025 324820
16416 324820 191961 253360 275938 461432 481293 336032 91177 -29570 134637 252368
16406 252368 214667 -159697 -199632 -10924 -73091 -68588 20195 84742 19422 -18643 -33452
16395 -33452 -27584 76951 200072 186828 92236 -90855 -186248 -344912 -322344 -269665 -112285
16384 -112285 -120337 -156595 -219215 -76842 -32425 -122152 -303557 -331597 -267860 -269920 -21988
16373 -21988 48658 -30834 -108808 -98800 -39955 26326 -42812 12595 24660 -66567 -268339
16362 -268339 -425655 -496587 -511915 -295619 -156648 -208935 -335688 -391510 -318867 -330063 -269640
16351b69640J64684j00593q5869L1917j477K26085r3873k5297J2397j83137k7808
16340c52611L9352J23262O7475j03320K988l6524O4454J64234K30523j11068m6942
16329D1823K01983k12265j43822O3511j25762n6305r7846R6006N3774R2382L1237
16318e5284n7010J42395k6743m2575l18843k20652J51314J32716o4985J45072
16308b14595M160j08790j3239N063M6335J18631J75649J21529j32641k97204P3065
16297b22037J67586O771J06171R7696O350p0768q6980J35716K75958j00882k45441
16286G0140o5739K43718P6469j55289k28866J79789j69000j91077n7794r1935
16276c89584l0220N3802K25306J79911Q1022j19981r7419P3360N5328n3423l085
$$ plain form
16351 -269640 -104956 -205549 -291418 -259501 -260978 -34893 -128766 -154063 -141666 -324803 -352611
16340 -352611 -313259 -189997 -122522 -225842 -222854 -259378 -194924 -30690 199833 88765 41823
16329 41823 243806 31541 -112281 -48770 -174532 -230837 -328683 -232677 -178903 -86521 -55284
16318 -55284 -112294 30101 3358 -39217 -358060 -578712 -427398 -294682 -359667 -214595
16308 -214595 -210435 -319225 -332464 -327401 -281066 -162435 13214 134743 2102 -295102 -222037
16297 -222037 -54451 -47680 58491 156187 162537 91769 4789 140505 416463 315581 70140
16286 70140 4401 248119 324588 169299 -59567 120222 -48778 -239855 -297649 -389584
16276 -389584 -419804 -366002 -140696 39215 120237 256 -97163 -23803 31525 -21898 -24983
16265b4983M7558J62216p3310j43486O3457k01542n3360k9700J82296l7687k6876
16254a35417J00925K54205Q781j79123J7808L222o9439O4948j99031P6953Q4390
16243B8222O7375R8179j3121k15227l5778K44428M6067O3389k32140k6558L1761
16232E6597k7954J7275K5305l6988O6478N9331j96305r660N9403j38059L4348
16221i0229J12295l5495m9161m8370k7587l4935O0771j42040m90N7770J93940
16210c531K55187j32838K8749k3757j79997R4488M7420L9767J14594o9314k6692
16199A44076n8050o0059M9231R6377j28857l817j8382p594m8780j3130Q7722k2605
16187A6132k82392o6864M7854J39665J98413Q1220j36179q6459k2426k3235j30321
$$ plain form
16265 -24983 22575 184791 111481 -32005 31452 -170090 -223450 -253150 -70854 -108541 -135417
16254 -135417 -34492 219713 228494 49371 67179 70401 962 65910 -133121 -56168 28222
16243 28222 95597 193776 180655 -34572 -70350 174078 220145 283534 51394 24836 56597
16232 56597 28643 45918 71223 34235 100713 160044 -36261 -45921 13482 -124577 -90229
16221 -90229 22066 -13429 -62590 -110960 -138547 -173482 -112711 -254751 -255241 -197471 -3531
16210 -3531 251656 118818 147567 123810 -56187 38301 85721 125488 240082 170768 144076
16199 144076 86026 25967 75198 171575 42718 38901 20519 12925 -35855 -48985 38737 16132
16187 16132 -266260 -333124 -285270 -145605 52808 134028 -2151 -88610 -111036 -134271 -264592
16176b64592P9006R6128J21654K13095J16902j31887p7468j10872l97013l8888
16166c93935J82678J36170q7267Q843N5495J93163R2189p3470q4121q1486j32086
16155a83827L9886n0033M8843N5285R4419J39760Q9466M8039j67274j84182n237
16144g4855J38212J73915P2586o0327o6255l3292j04081qn1306o9380k0589l9341
16132a34721j03441N6918J22775J11231K16717j33303k22822m9302J09139J25921
16122I9112k66860j19025K4176J38327J60079M7114j36939j2786Q2461K4008O0778
16111A00445k1298J33027J0435j30050j3584J588r2341L606J04143P1464P5523
16100B42958J08611J12546l9604j54689j95674N0941p4230k0753p8820j20521
$$ plain form
16176 -264592 -185586 -89458 32196 245291 362193 230306 152838 41966 -355047 -393935
16166 -393935 -211257 -75087 -162354 -153511 -98016 95147 187336 113866 29745 -51741 -183827
16155 -183827 -143941 -193974 -145131 -89846 4573 144333 233799 281838 114564 -69618 -74855
16144 -74855 63357 237272 309858 249531 183276 149984 45903 45895 -5411 -74791 -95380 -134721
16132 -134721 -238162 -181244 -58469 52762 269479 136176 -86646 -135948 -26809 99112
16122 99112 -167748 -286773 -262597 -124270 35809 82923 -54016 -66802 15659 39667 100445
16111 100445 79147 212174 222609 92559 78975 80563 -11778 -8172 95971 167435 242958
16100 242958 351569 464115 424511 269822 74148 125089 50859 30106 -48714 -169235
16090a69235p5520l301J11326K5294J41705L4981j3945j09802n7860j05527j33576
16079c55460Q1489J77085L5938m4167P3754J33369N8048j72193p7571L2475N0629
16068f604Q2440n2311Q7549J32435j58511n2861J01881Q2349K8171K3272j49805
16057A18005N9474o2097R5594K9130j37170j07959J47626R2617J026j47669o0255
16046B8322m6327J21523m9357p6499K9018L1690j02466J4634K895J26618j2191
16035F7860k31127K9631L2354J45243J14111j95491j15291J04531M4813J7685
16025A4319k2917j96193J71909J83998N6021j59399j67392p8190J6160K32361
16015E0677O3281j89644l434J01208J01367J580r6139p0281J23061L50453J9622
$$ plain form
16090 -169235 -244755 -248056 -136730 -111436 30269 65250 51305 -58497 -116357 -221884 -355460
16079 -355460 -273971 -96886 -60948 -105115 -31361 102008 160056 -12137 -89708 -57233 -6604
16068 -6604 75836 23525 111074 243509 84998 32137 134018 216367 244538 267810 118005
16057 118005 177479 115382 210976 240106 102936 -5023 142603 235220 236246 88577 28322
16046 28322 -18005 103518 54161 -22338 6680 38370 -64096 -49462 -46567 80051 67860
16035 67860 -163267 -133636 -101282 43961 158072 -37419 -152710 -48179 -3366 14319
16025 14319 -8598 -204791 -32882 151116 207137 47738 -119654 -197844 -181684 50677
16015 50677 113958 -75686 -79120 22088 123455 125035 28896 -41385 81676 432129 451751
16004D51751k80688j86316J46886j62326K6735M0335j00470J56381N6088N6226
15994B04602M7640j59309m5224L4346J8985o8101k51979J8701K17993k8155j77061
15983a87562Q5882J18439n6477J6900J11704K55040j4348Q1022L1081k53873j60434
15972B7374J40781p6801l4600K28504J06981P8951j0334j28180j80094j89029
15962c6447n4509O6533J04569R600j87234q2977j37208Q1804n4616j3011K13655
15951h9841j283j03010K78072J728p8245o3882o8322N1005J60797K809j40628
15940e0800p4904o7290K4689K01038n6580q6562l1584J1392j51437L8947J44461
15929i8630J27204k25461n5565J51604K14230p0232k83538j41366l2228K81877
$$ plain form
16004 451751 171063 -15253 131633 -30693 -3958 36377 -64093 92288 148376 204602
15994 204602 252242 92933 47709 82055 101040 32939 -219040 -200339 17654 -10501 -187562
15983 -187562 -101680 16759 -39718 -22818 88886 343926 329578 410600 441681 187808 27374
15972 27374 168155 91354 56754 285258 392239 471190 460856 332676 152582 -36447
15962 -36447 -90956 -24423 80146 89746 -97488 -180465 -317673 -235869 -290485 -303496 -89841
15951 -89841 -91124 -194134 83938 85666 7421 -56461 -124783 -73778 87019 89828 -50800
15940 -50800 -125704 -192994 -168305 32733 -23847 -110409 -141993 -130601 -282038 -243091 -98630
15929 -98630 28574 -196887 -252452 -100848 113382 43150 -240388 -381754 -413982 -132105
15919a32105J59362j85665N9445J55840j05522K452J39098P2361l2606K8189L6969
15908A97818n1807n0975j48064O10K684k1685M3093N273L597N4355O4260j00241
15896a082q7976n3304p6446L7631J06947K8032N5791J44725n7588p7603N740p8311
15884e3444o8300j16052k16743K0909j75772J04325l288K21073J91533j22107
15874b17866J11340m9883K7548M0193o4707l9282j4694p0672Q2718M6801K01022
15863E2518j3494J04460L1300r7229N264J0871M933l6656j3054k57p8832N2135
15851B1959M7929K23440J4327K7267J13702r3635n7681K07245j90985j59692N3005
15840B06881J09567Q4697p8932j32766n8149k8727O8004k2295k63673j93771j859
$$ plain form
15919 -132105 27257 -158408 -98963 56877 -48645 -46193 92905 165266 132660 160849 197818
15908 197818 146011 95036 -53028 -52418 -49734 -71419 -28326 -23053 -19456 34899 99159 -1082
15896 -1082 -89058 -142362 -218808 -181177 -74230 -46198 9593 154318 96730 19127 24867 -53444
15884 -53444 -121744 -237796 -454539 -433630 -609402 -505077 -508365 -287292 -95759 -217866
15874 -217866 -106526 -156409 -128861 -88668 -153375 -192657 -207351 -278023 -195305 -148504 52518
15863 52518 39024 143484 174784 77555 82819 93690 98623 61967 48913 48656 -30176 21959
15851 21959 69888 293328 307655 334922 448624 354989 297308 504553 313568 153876 206881
15840 206881 316448 401145 322213 189447 131298 102571 170575 148280 -115393 -309164 -311023
15829c11023K73102J74840N5660j99163l9665O507J0758l4132M2687J8628m599
15818f400l5347j6572n455j19209L4834k9062j43641L4070j36530Q5177M1853
15807b96282J4298P382J27958K03774q8977k02681j83358o7171K33663J63926
15797h7468k6745M3108O4108J22445K66612N2432k0726l87830j61519L5271o108
15786a06420Q2034J08315j29587j47913J2573J9134J75516j37137j43816L4117
15776b33184N7588j6647o2139j8063P2143o6886l4618J09529j46384p5774J0306
15765d04129j33520J11627K5094P9378j0786R3066K03659K2969K49080l4990j58279
15754D3169j9963M1949j64461q4288J40049j5259m254j49155M9709N4669j7060
$$ plain form
15829 -311023 -37921 136919 192579 -6584 -46249 -39742 -28984 -63116 -20429 -1801 -6400
15818 -6400 -41747 -58319 -63774 -182983 -148149 -177211 -320852 -286782 -423312 -338135 -296282
15807 -296282 -281984 -274602 -146644 57130 -31847 -234528 -417886 -485057 -251394 -87468
15797 -87468 -114213 -71105 -6997 115448 382060 434492 413766 25936 -135583 -100312 -106420
15786 -106420 -24386 83929 -45658 -193571 -180998 -161864 13652 -123485 -267301 -233184
15776 -233184 -175596 -192243 -254382 -272445 -200302 -267188 -301806 -192277 -338661 -414435 -404129
15765 -404129 -537649 -426022 -400928 -321550 -332336 -239270 -35611 -12642 236438 201448 43169
15754 43169 23206 65155 -99306 -183594 -43545 -58804 -63058 -212213 -162504 -107835 -124895
15743a24895j05451P635j3194R5416J19512K8103j66503n1504R2170m7020n507
15732a71238K4857O8345J20770p2558l03133j86229J13812J61284J06027L2044
15722a06019N8730J22961j82588q3163m1055o6073R2400K16369l5789J87M34k976
15710b6582n6563j6116n9975J00380R9153M5016l1996j53440n4127N7920j3115
15699a09445O3107J5830R5919r5787p3140P841J8477J23465k0892j54086n3488
15688a82199Q2340j7051j52828p9396R1373L02280L09273J86202p2344k3463k0730
15677D23457j67539j98349n0727M5080N299k79284j41405J76550J22351L8001
15667b6566J98305J81588k0083j27300p2460l7817o1365J40964K9988k32774J05954
$$ plain form
15743 -124895 -230346 -222711 -235905 -140489 -20977 7126 -159377 -210881 -118711 -165731 -171238
15732 -171238 -146381 -78036 42734 -29824 -332957 -519186 -405374 -244090 -138063 -106019
15722 -106019 -47289 75672 -106916 -190079 -231134 -297207 -204807 11562 -24227 -24040 -23606 -26582
15710 -26582 -83145 -99261 -159236 -58856 40297 85313 53317 -100123 -154250 -96330 -109445
15699 -109445 -46338 -30508 65411 -30376 -103516 -95675 -77198 46267 25375 -128711 -182199
15688 -182199 -99859 -116910 -269738 -349134 -257761 44519 353792 539994 467650 444187 423457
15677 423457 255918 57569 6842 51922 57221 -222063 -363468 -186918 -64567 -26566
15667 -26566 171739 353327 333244 205944 133484 95667 34302 175266 205254 -27520 78434
15656G8434p3414p8787O2412K6305l7475q1831o7478M5495J29118J44471n1272
15645I5978j75012J57385J43429m8436o0887r1363N7897n1405r2611k0941Q1192
15634d774O4753L4414k18026j24191J36410j32249k11496M0991J30174Q1309Q0577
15623a22108K39865J36594j83020j67770o795P22J265j31874n0265J82848J18368
15612A7830j65834l7099K03126j9925k36421j04492n7065P9454L9435O5599J78440
15601c6952J21229K14726q6911p1990n1322P1335J23779r8641k9905j49955K3486
15590B8879j5408K5517J12988J03797p5669j67259O0981n3945j89693m8009J54219
15579f3602m2473P3036O3774j6993M5671j71422k38413k8749K70522K47902m3512
$$ plain form
15656 78434 5020 -73767 -11355 14950 -22525 -104356 -171834 -126339 2779 147250 95978
15645 95978 -79034 78351 221780 173344 112457 21094 78991 27586 -65025 -85966 -4774
15634 -4774 59979 94393 -123633 -247824 -111414 -243663 -455159 -414168 -283994 -202685 -122108
15623 -122108 117757 254351 71331 -96439 -103234 -102512 -101247 -233121 -283386 -100538 17830
15612 17830 -148004 -185103 18023 -1902 -238323 -342815 -399880 -320426 -280991 -215392 -36952
15601 -36952 84277 299003 212092 140102 88780 160115 283894 185253 155348 5393 28879
15590 28879 13471 38988 151976 255773 180104 12845 73826 19881 -169812 -217821 -63602
15579 -63602 -106075 -33039 30735 13742 59413 -112009 -350422 -379171 -108649 139253 95741
15568I5741p2579j92762j62899K4048J52817j15622J2169K01423j18504k15800
15558c91968P0457K47199m8230O6959l4084J02901o8458j64994n455J2303j41958
15547c55328j21369L5438J26608J62862P1888K8128J41250R774P2913o8805j85650
15536h2291k7287P7871M1410q6362J37877J22183n0431j53118K4798l0047k47488
15525b72885o056J70891j4055N5310J66724j09812j11932q6619m1878J61279K00653
15514A11620L7960P4229k1915o9075j11387k72954J90797K19779q1510M7362R9180
15503B24086m4896k63681o736O1891J043n5238P8316M0585r9104k91535q5365
15492d40634K27970M7913p4500N6888J65561o98q8028r9390J7498j2234n542r2698
$$ plain form
15568 95741 23162 -169600 -332499 -308451 -155634 -271256 -259087 -57664 -176168 -391968
15558 -391968 -321511 -74312 -122542 -55583 -89667 13234 -55224 -220218 -225673 -213370 -355328
15547 -355328 -476697 -441259 -314651 -151789 -79901 -51773 89477 99251 172164 103359 -82291
15536 -82291 -109578 -31707 9703 -76659 61218 183401 132970 -20148 4650 -25397 -272885
15525 -272885 -278941 -108050 -122105 -66795 99929 -9883 -121815 -208434 -250312 -89033 111620
15514 111620 149580 223809 201894 132819 21432 -251522 -60725 159054 77544 124906 224086
15503 224086 179190 -84491 -91227 -29336 -28293 -83531 -5215 35370 -63734 -355269 -440634
15492 -440634 -212664 -164751 -239251 -182363 -16802 -17500 -105528 -204918 -187420 -199654 -205196 -297894
15480b97894J17224J53609q6466O0914J636j70606P674o2891j31293J64106j1754
15469b55741n9891J65995K91199J58424q9955p1005l8394L3921m1646J4409N1527
15458A58843K8318j18021k24869K35706J44588k17904J20532R356j01777m2092
15448g320l7586J6460p4719l0469j50143o696J40608J88999L2397K25574n0740
15437B46365k55899r3126k4976p9336K4447J33183j34575N2007k70p0137j86029
15426c88346r6913J10746k672J13835J31858j2194O4454L0271j09029R8338Q4567
15415B4915O2176n8768k88170k45196J63016J70630J05045J50156K52918N6073
15405C92795k24163j39717j58540K01471J52662O5102Q4482k27556l16475k66386
$$ plain form
15480 -297894 -180670 -27061 -113527 -52613 -50977 -221583 -213909 -276800 -408093 -243987 -255741
15469 -255741 -315632 -149637 141562 299986 210031 139026 100632 134553 92907 107316 158843
15458 158843 187161 69140 -155729 79977 224565 6661 127193 136549 34772 -7320
15448 -7320 -44906 -28446 -103165 -133634 -283777 -290473 -149865 39134 71531 297105 246365
15437 246365 -9534 -102660 -127636 -206972 -182525 -49342 -183917 -131910 -132180 -202317 -388346
15426 -388346 -485259 -374513 -377185 -263350 -131492 -143686 -79232 -48961 -157990 -59652 24915
15415 24915 87091 28323 -259847 -505043 -342027 -171397 -66352 83804 336722 392795
15405 392795 168632 28915 -129625 71846 224508 289610 374092 146536 -169939 -436325
15395d36325J14452K86982J52035Q87j25218j16815j87029m992M1888O7795J15946
15384i0394L7289J1298J13985J82051m6577j27996o8496k25535J14584K5675k51360
15373c25476j76545l8680J66753J67909L04025k42331J27795P1107j46363P2977
15363a8829q4137r4059j44640J51236J84422k7583J8127N073J1502O6288m8455
15352A8945m9246K3077j13740L1871J29708j1006j15863o9283P9011J84655J97045
15341C05174j26982j06159j13023q9401m9992L6358j44046L912r955O4273K95536
15330F5695O1798q3444o7100j58458l4996P3232k1682O4884K0632j87857Q0881
15319a86415J4081K22247J37757r1520j00993k78361O6583J32990l2241l3962
$$ plain form
15395 -436325 -321873 -34891 117144 118031 -7187 -124002 -311031 -316023 -274135 -206340 -90394
15384 -90394 -53105 -41807 72178 254229 207652 79656 11160 -214375 -99791 -74116 -325476
15373 -325476 -502021 -540701 -373948 -206039 97986 -144345 -16550 54557 -91806 -18829
15363 -18829 -102966 -197025 -341665 -190429 -6007 -33590 -15463 -10390 1112 67400 18945
15352 18945 -30301 -7224 -120964 -89093 40615 29609 -86254 -155537 -76526 108129 305174
15341 305174 178192 72033 -40990 -130391 -180383 -144025 -288071 -284159 -294114 -229841 65695
15330 65695 127493 44049 -23051 -181509 -216505 -143273 -164955 -100071 -79439 -267296 -186415
15319 -186415 -172334 49913 187670 96150 -4843 -283204 -216621 -83631 -115872 -149834
15309a49834r9832m7803Q3461j13900Q1180Q8710J25919J15648J20132m1308l2041
15298A30332j05966m3778R8599O9913r8293J54235o1014k69944m2869Q5368J75247
15287I1830J43610K8035j25845q8777J55709Q488j97522j32798J4229O9530j40270
15276a73781m1122R5768M34k5432L0246J76110Q2929l3905j32656N0895m6375
15265a6889R3948J89K4055q788p8309J07160j05727O7073l544j86824k7877J99609
15253F4076J86563M1704k23409k18164j13164J08139K49006k0593k5661p0808
15243b2311j32468J43946Q7260J4447j15374j15183j02859L8863L0839Q008L2904
15232a31928J87014O7877j89295o0199k9306O8060l2598j37476R964J66240K4281
$$ plain form
15309 -149834 -249666 -297469 -214008 -327908 -246728 -158018 -32099 83549 203681 162373 130332
15298 130332 24366 -19412 79187 149100 50807 205042 144028 -125916 -168785 -83417 91830
15287 91830 235440 263475 137630 48853 204562 213050 15528 -117270 -103041 -33511 -173781
15276 -173781 -214903 -119135 -118701 -144133 -113887 62223 145152 111247 -21409 29486 -16889
15265 -16889 77059 77248 101303 92515 14206 121366 15639 82712 79168 -107656 -135533 64076
15253 64076 250639 292343 68934 -149230 -262394 -154255 94751 74158 48497 -22311
15243 -22311 -154779 -10833 76427 90874 -24500 -139683 -242542 -203679 -172840 -164832 -131928
15232 -131928 55086 122963 -66332 -126531 -155837 -87777 -120375 -257851 -247887 -81647 -57366
15221e7366j81557k10912j03537J18561K09040N2167p1753Q1614J27029M7708
15211A0994J6199j19781K4911J09338j22715k1809J8857k52586o5869k194L34710
15200f9945J00955k8016m765q1942N1253J08541P8341q2155p7411j33594M4273
15189i4465n0406o7313P2014K41743p4632j6093K07339J43258l6840J90642L9509
15178E54756o8415j79927j94992j86140j23460O1801O9952K4972k11246P4434
15168a78265J31147m5418j69218N1984N7622J57042n5715J06448J52161K6955
15158B34743j51590k1103J03053K3196L4651M3048J4563k12966j27104O1457K03712
15147B05660J45457j52503l52856p3240K3305o253J35895J37959j16151j91526
$$ plain form
15221 -57366 -238923 -449835 -553372 -434811 -225771 -173604 -245357 -163743 -36714 10994
15211 10994 27193 -92588 -67677 41661 -81054 -102863 -84006 -336592 -402461 -404655 -69945
15200 -69945 31010 2994 -1771 -83713 -32460 76081 154422 72267 -5144 -138738 -94465
15189 -94465 -144871 -212184 -140170 101573 26941 10848 218187 361445 324605 515247 554756
15178 554756 486341 306414 111422 -74718 -198178 -136377 -66425 -41453 -252699 -178265
15168 -178265 -47118 -92536 -261754 -209770 -152148 4894 -50821 55627 207788 234743
15158 234743 83153 62050 165103 188299 222950 265998 280561 67595 -59509 1948 205660
15147 205660 351117 198614 -154242 -227482 -204177 -210430 -74535 63424 -52727 -244253
15137b44253j8L3044M9185n4358J85835J51723J7159J14696r5067j42934J61201
15126A76213K03345r4790j47884k38426q4730j53906M7829O4533l8054K7720J39529
15115i8621J3270l3023M330J94123O5368o8465p0714K17819K0747j77958m611
$$ plain form
15137 -244253 -244271 -211227 -162042 -216400 -30565 121158 138317 253013 157946 15012 176213
15126 176213 379558 284768 136884 -101542 -186272 -340178 -292349 -227816 -265870 -238150 -98621
15115 -98621 -85351 -118374 -114044 80079 145447 76982 6268 224087 244834 66876 62265
$$ [...]
##END NTUPLES=NMR SPECTRUM
##END=
