##TITLE=Analysis number 307379
Compound Code en 00291
Book Reference 281/180
Project Code qc-cat
Chemist Name simons
##JCAMPDX= 6.0         $$ Bruker NMR JCAMP-DX V2.0
##DATA TYPE= NMR SPECTRUM
##DATA CLASS= NTUPLES
##ORIGIN= Bruker BioSpin GmbH
##OWNER= NMR
$$ XWIN-NMR		Version 3.5
$$ Thu Apr 28 14:47:08 2005 GMT Daylight Time (UT+1h)  MAYBRIDGE\NMR@NMR_250MHZ
##.OBSERVE FREQUENCY= 250.131544655141
##.OBSERVE NUCLEUS= ^1H
##.ACQUISITION MODE= SIMULTANEOUS (DQD)
##.ACQUISITION SCHEME= undefined
##.AVERAGES= 16
##.DIGITISER RES= 18
##SPECTROMETER/DATA SYSTEM= dpx250
##.PULSE SEQUENCE= zg30
##.SOLVENT NAME= CDCl3
##.SHIFT REFERENCE= (INTERNAL, CDCl3, 0, 16.522)
##AUDIT TRAIL= $$ (NUMBER, WHEN, WHO, WHERE, WHAT)
$$ ##TITLE= Audit trail, XWIN-NMR		Version 3.5
$$ ##JCAMPDX= 5.01
$$ ##ORIGIN= Bruker BioSpin GmbH
$$ ##OWNER= NMR
$$ C:\u/data/dgb/nmr/ADRS/2510/pdata/1/auditp.txt
$$ ##AUDIT TRAIL=  $$ (NUMBER, WHEN, WHO, WHERE, WHAT)
(   1,<2005-04-28 14:46:49.27 +100>,<MAYBRIDGE\NMR>,<NMR_250MHZ>,
      <created by zg, POWCHK disabled, PULCHK disabled
       configuration hash MD5:
       62 19 C7 07 E1 42 D1 B7 37 6C 3D D0 77 39 F9 E6
       data hash MD5: 64K
       5B 84 A0 E6 59 5D B2 09 F6 4D 4D F6 B6 B6 EF B6>)
(   2,<2005-04-28 14:47:00.27 +100>,<MAYBRIDGE\NMR>,<NMR_250MHZ>,
      <Start of raw data processing
       ef LB = 0.3 FT_mod = 6 PKNL = 1 SI = 32K 
       data hash MD5: 32K
       9E 24 8D 89 97 19 17 7D C0 6F 01 2C B5 3F 67 89>)
(   3,<2005-04-28 14:47:02.20 +100>,<MAYBRIDGE\NMR>,<NMR_250MHZ>,
      <apk 
       data hash MD5: 32K
       F2 A0 71 09 B6 2A 94 0A CE 30 62 CD 16 AD D6 B0>)
(   4,<2005-04-28 14:47:02.93 +100>,<MAYBRIDGE\NMR>,<NMR_250MHZ>,
      <abs ABSG = 5 
       data hash MD5: 32K
       A9 09 E9 42 63 93 21 A7 69 EC FC 0F 8C CB CA 4D>)
$$ ##END=
$$ 
$$ hash MD5
$$ 44 2A D3 D1 8F C9 EB E6 D6 B6 C1 A3 45 EE 23 57
##$RELAX= 
##$RELAX= 
##$RELAX= 
##$RELAX= 
##$RELAX= 
##$RELAX= 
##$RELAX= 
$$ Bruker specific parameters
$$ --------------------------
##$DU= <C:\u>
##$EXPNO= 2510
##$NAME= <ADRS>
##$PROCNO= 1
##$TYPE= <nmr>
##$USER= <dgb>
##$AMP= (0..31)
100 100 100 100 100 100 100 100 100 100 100 100 100 100 100 100 100 100 
100 100 100 100 100 100 100 100 100 100 100 100 100 100 
##$AQSEQ= 0
##$AQ_mod= 3
##$AUNM= <au_zg>
##$AUTOPOS= <45 >
##$BF1= 250.13
##$BF2= 250.13
##$BF3= 250.13
##$BF4= 250.13
##$BF5= 500.13
##$BF6= 500.13
##$BF7= 500.13
##$BF8= 500.13
##$BYTORDA= 1
##$CFDGTYP= 0
##$CFRGTYP= 5
##$CHEMSTR= <none>
##$CNST= (0..31)
1 1 145 1 1 1 1 1 1 1 1 1 1 1 1 1 1 1 1 1 1 1 1 1 1 1 1 1 1 1 1 1 
##$CPDPRG= <>
##$CPDPRG1= <>
##$CPDPRG2= <>
##$CPDPRG3= <>
##$CPDPRG4= <mlev>
##$CPDPRG5= <mlev>
##$CPDPRG6= <mlev>
##$CPDPRG7= <mlev>
##$CPDPRG8= <mlev>
##$CPDPRGB= <>
##$CPDPRGT= <>
##$D= (0..31)
0 1 0 0 0 0 0 0 0 0.06 0 0 0 0 0 0 0.0002 0 0 0 0 0 0 0 0 0 0 0 0 0 0 
0 
##$DATE= 1114696008
##$DBL= (0..7)
120 120 120 120 120 120 120 120 
##$DBP= (0..7)
150 150 150 150 150 150 150 150 
##$DBP07= 0
##$DBPNAM0= <>
##$DBPNAM1= <>
$$ [...]
##$SUBNAM7= <"">
##$SUBNAM8= <"">
##$SUBNAM9= <"">
##$SW= 20.6930455092707
##$SWIBOX= (0..15)
0 0 3 0 0 0 0 0 0 0 0 0 0 0 0 0 
##$SW_h= 5175.983436853
##$TD= 65536
##$TD0= 1
##$TE= 296.16
##$TE2= 300
##$TE3= 300
##$TEG= 300
##$TL= (0..7)
0 120 120 120 120 120 120 120 
##$TP= (0..7)
150 150 150 150 150 150 150 150 
##$TP07= 0
##$TPNAME0= <>
##$TPNAME1= <>
##$TPNAME2= <>
##$TPNAME3= <>
##$TPNAME4= <>
##$TPNAME5= <>
##$TPNAME6= <>
##$TPNAME7= <>
##$TPOAL= (0..7)
0.5 0.5 0.5 0.5 0.5 0.5 0.5 0.5 
##$TPOFFS= (0..7)
0 0 0 0 0 0 0 0 
##$TUNHIN= 0
##$TUNHOUT= 0
##$TUNXOUT= 0
##$USERA1= <user>
##$USERA2= <user>
##$USERA3= <user>
##$USERA4= <user>
##$USERA5= <user>
##$V9= 5
##$VALIST= <valist>
##$VCLIST= <CCCCCCCCCCCCCCC>
##$VD= 0
##$VDLIST= <DDDDDDDDDDDDDDD>
##$VPLIST= <PPPPPPPPPPPPPPP>
##$VTLIST= <TTTTTTTTTTTTTTT>
##$WBST= 1024
##$WBSW= 4
##$XGAIN= (0..3)
0 0 0 0 
##$XL= 0
##$YL= 0
##$YMAX_a= 322097
##$YMIN_a= -445152
##$ZGOPTNS= <>
##$ZL1= 120
##$ZL2= 120
##$ZL3= 120
##$ZL4= 120
##$ABSF1= 16.522
##$ABSF2= -4.171173
##$ABSG= 5
##$ABSL= 3
##$ALPHA= 0
##$AQORDER= 0
##$ASSFAC= 0
##$ASSFACI= 0
##$ASSFACX= 0
##$ASSWID= 0
##$AUNMP= <proc_1d>
##$AZFE= 0.1
##$AZFW= 0.1
##$BCFW= 0
##$BC_mod= 0
##$BYTORDP= 0
##$COROFFS= 0
##$CY= 12.5
##$DATMOD= 1
##$DC= 0
##$DFILT= <>
##$DTYPP= 0
##$F1P= 14.0000005364418
##$F2P= -0.99999901652339
##$FCOR= 0.5
##$FTSIZE= 32768
##$FT_mod= 6
##$GAMMA= 0
##$GB= 0
##$INTBC= 1
##$INTSCL= 1
##$ISEN= 128
##$LB= 0.3
##$LEV0= 0
##$LPBIN= 0
##$MAXI= 10000
##$MC2= 0
##$MEAN= 0
##$ME_mod= 0
##$MI= 0
##$NCOEF= 0
##$NC_proc= -3
##$NLEV= 6
##$NOISF1= 0
##$NOISF2= 0
##$NSP= 0
##$NTH_PI= 0
##$NZP= 0
##$OFFSET= 16.522
##$PC= 1
##$PHC0= -75.47606
##$PHC1= 8.050176
##$PH_mod= 1
##$PKNL= yes
##$PPARMOD= 0
##$PSCAL= 4
##$PSIGN= 0
##$REVERSE= no
##$SF= 250.13
##$SI= 32768
##$SIGF1= 0
##$SIGF2= 0
##$SINO= 400
##$SIOLD= 32768
##$SREGLST= <1H.CDCl3>
##$SSB= 0
##$STSI= 32768
##$STSR= 0
##$SW_p= 5175.98343685301
##$SYMM= 0
##$S_DEV= 0
##$TDeff= 65536
##$TDoff= 0
##$TI= <Analysis number 999999
Compound Code 99
Book Reference 9
Project Code 9>
##$TILT= no
##$TM1= 0
##$TM2= 0
##$TOPLEV= 0
##$USERP1= <user>
##$USERP2= <user>
##$USERP3= <user>
##$USERP4= <user>
##$USERP5= <user>
##$WDW= 1
##$XDIM= 32768
##$YMAX_p= 351316817
##$YMIN_p= -59399
$$ End of Bruker specific parameters
$$ ---------------------------------
##NTUPLES= NMR SPECTRUM
##VAR_NAME=  FREQUENCY,     SPECTRUM/REAL,   SPECTRUM/IMAG
##SYMBOL=    X,             R,               I
##VAR_TYPE=  INDEPENDENT,   DEPENDENT,       DEPENDENT
##VAR_FORM=  AFFN,          ASDF,            ASDF
##VAR_DIM=   32768,         32768,           32768
##UNITS=     HZ,            ARBITRARY UNITS, ARBITRARY UNITS
##FACTOR=    0.157963299565203, 1,           1
##FIRST=     4132.6476996994, 0,             0
##LAST=      -1043.33573715361, 0,           0
##MIN=       -1043.33573715361, -59399,      0
##MAX=       4132.6476996994, 351316817,     0
$$ Real data points
##PAGE= N=1
##DATA TABLE= (X++(R..R)), XYDATA
$$ [...]
18441F5457j1430q933o36R02q735m321N017J1135J146Q206R14P193J3709p164
18427G2460j4384q902p713N721P82m82M529k365O874l144j5401J1920j947o579
18413D1369m36K655p059J64N190Q741m082j0663J3748k529p059R353q180j2686
18399B8526R2L855n225N2m958N488m002l729Q613J8392j651j834o928k144P114
18384D1661n706J37J797N86l923j4453O634J0465M390j2469o246n109q851O254
18370A5167J1034J2870r924l727j71K2575J815j9699j4276J1166L274j43Q845
18357C8806j810l92J0497J215m236j8383k4355N084R323N881P574n1q66L139o148
18342B5278K042j0940k5982q671J6894J7337Q444k142J050l282r325P078J9136
$$ y = [65457, 54027, 45094, 44458, 45360, 36625, 32304, 37321, 48456, 49602, 57808, 58722, 65915, 79624, 72460, 58076, 49174, 41461, 47182, 47964, 47482, 52011, 49646, 56520, 53376, 37975, 49895, 47948, 41369, 40933, 43588, 36529, 36693, 41883, 50624, 46542, 35879, 49627, 47098, 40039, 49392, 41212, 28526, 28618, 32473, 27248, 27300, 22342, 27830, 23828, 20099, 28712, 47104, 45453, 43619, 36691, 34547, 41661, 35955, 36092, 37889, 38475, 34552, 20099, 26733, 37198, 41588, 29119, 22873, 17764, 8913, 15167, 26201, 39071, 29147, 25420, 25249, 47824, 49639, 29940, 15664, 26830, 30104, 29961, 38806, 36996, 36604, 47101, 48316, 44080, 25697, 1342, 6426, 15749, 21630, 29204, 29153, 28287, 31426, 25278, 27320, 16380, -9602, -18273, -1379, 15958, 24402, 22260, 23310, 20028, 10703, 17781, 36917]
18329C6917k348k2108M270J69j648k083J2647l411q891q247k868Q593J9339M737
18315C5068o027P829J062Mj2211o142j624k43m736n72M964P685p091j1123q820
18300a977K251j1613n251J5909J9706N959J273p490n715l449P650Q602R505m020
18286C1340N950J3045j2474q052p72k123j154L993p006j8798o846R832l890L063
18272F108J5300P660j187r323p71Q332k319n308Q899q317j1500J597R518m467
18258A4222l949M324j2733q983O67J4719j254Q943k459m394L443N784O470p48
18244B4052o884l230j2K813J404r319J351p969q06R121n542M100M455L142J311
18229A7987J4130K790J321O809O920j0484k993L518m885j4541j3041N356J6956
$$ y = [36917, 34569, 12461, 16731, 16900, 15252, 13169, 25816, 22405, 13514, 5267, 2399, 10992, 30331, 35068, 29041, 36870, 37932, 37936, 25725, 19583, 17959, 17716, 12980, 12408, 17372, 25057, 17966, 6843, -1977, 274, -11339, -16590, -681, 19025, 24984, 26257, 18767, 13052, 9603, 17253, 25855, 35360, 31340, 37290, 50335, 37861, 29809, 29037, 26914, 25760, 29753, 22747, 3949, -2897, 6935, 3045, 6108, 21408, 29068, 27881, 18558, 17787, 26119, 23800, 18492, 27391, 19074, 7574, 9171, 18689, 14222, 10273, 14597, 1864, -7119, -6452, 8267, 7013, 15956, 13497, 9103, 12546, 18330, 24800, 24052, 17168, 13938, 13926, 16739, 18143, 8824, 10175, 2206, 1400, 10521, 4979, 9079, 13534, 16676, 17987, 32117, 34907, 36228, 43037, 49957, 39473, 36480, 39998, 35113, 20572, 7531, 12887, 29843]
18216B9843k72j2376J94L673q791o949j428M229k712j352J0929J0105L482P553
18202C6128J5242j0874k7644R84R613l072n199N959K388j2337o637J1932m178
18189A2305J520o096q106O869j0537O474l89r297K319R317M285j034p150l712
18175c232R258J3779o530J223P877L580k190J007O756n007k784J4247M450j2469
18161B9965k254M415j4103p956p2J81Q635R08J1042J8480Q329l899K378N147P916
18146F9112k996M378o04Q345m254L171J1819P719M924p593j655O250L279J9010
18132A20905j864O371K3676J1169N690K6666K1235L4357K7879M6905O7792P4511
18120D65292R0687J27974J55314K16593K84230M13668O15989R20845J424140K274455
$$ y = [29843, 29571, 17195, 17389, 21062, 12271, 5322, 3894, 8123, 5411, 4059, 14988, 25093, 28575, 36128, 51370, 40496, 12852, 13836, 23449, 20377, 15178, 21137, 23525, 11188, 4551, 16483, 12305, 13825, 7729, -377, 6492, -4045, 2429, 2040, -7257, -4938, 4379, 8664, 7630, 480, -3232, 6026, 19805, 13275, 14498, 22375, 25955, 23765, 24772, 31528, 26521, 23737, 37984, 42434, 29965, 27711, 32126, 18023, 10067, 9995, 10176, 18811, 19719, 30761, 49241, 57570, 53671, 56049, 61196, 69112, 66116, 70494, 69890, 78235, 73981, 77152, 88971, 96690, 101614, 94021, 92366, 98616, 101895, 120905, 119041, 125412, 149088, 160257, 165947, 192613, 213848, 248205, 276084, 322989, 390781, 465292, 555979, 683953, 839267, 1055860, 1340090, 1753758, 2369747, 3290592, 4714732, 6989187]
18110F989187L553877M729097L333961M08379p65276k229948m077627l692984
18102H248666k336374j309376p55727m68678l01180j71679j03145j63239k54476
18093B384792k74029k57455k34314j97472j69155j48976j21516j19612j02120
18084G60143r2816p7109n9805m8043m2602l8690l4814m5773l6540l3130k9371
18073B21450k9447k1208j1542p072j4270j4796j2416j4769j0087J0202L748o556
18061I3237q406k2977p738k998J2177r335j1619N423j839R692q02j234q166r976
18047C5439P778m12j3736o388J4975oj914K498N494M961J4138M960o234J0549
18033G2102k159K436o25r27L07Q634M378J8201K0923P884L8857N5577N4720O5174
$$ y = [6989187, 10543064, 15272161, 18606122, 19014501, 18249225, 16019277, 11941650, 8248666, 5912292, 4602916, 3847189, 3378511, 3077331, 2905652, 2802507, 2639268, 2384792, 2110763, 1853308, 1618994, 1421522, 1252367, 1103391, 981875, 862263, 760143, 667327, 590218, 530413, 482370, 439768, 401078, 366264, 320491, 283951, 250821, 221450, 192003, 170795, 159253, 152181, 137911, 123115, 110699, 95930, 85843, 96045, 99793, 93237, 84831, 61854, 54116, 51118, 63295, 53960, 42341, 47764, 45925, 55617, 54815, 53581, 45415, 35439, 43217, 42805, 29069, 22681, 37656, 37650, 35736, 38234, 43728, 48689, 62827, 67787, 61553, 72102, 69943, 72379, 71754, 70827, 71134, 79768, 84146, 102347, 123270, 131154, 170011, 225588, 280308, 345482]
18019C45482O4120L1084K5112K777o262k0827l1027n2522n7592n4616m4583l1328
18007A69818j7624k1494j9918j4650R806Q794k0393k1131j4952o724P036K1128
17995G9696p133j3341r786q164j0404P700n257n758K074l458P520R371n725k178
17981C5157m604j4926J2819J2665o439j809P204j44j6902j2728K141N099Q219
17968B5752P728k666j1054k013k119j426O435P059R440J107J3961j1087k2690
17955A8427j0257j349j3041j0186Q939R382J1925J3307n7j0644q679N026O507
17942A9300p189j8537q066j124J0869J1531L268K771k548R561j278N081R956o153
17928B7442j184n594k148p804P48J434P439j503j0857j4053q370Q088J0607n105
$$ y = [345482, 409602, 440686, 465798, 468575, 462313, 441486, 410459, 357937, 300345, 245729, 201146, 169818, 152194, 130700, 110782, 96132, 105938, 114732, 94339, 73208, 58256, 51532, 58568, 79696, 72563, 59222, 49436, 41272, 30868, 38568, 33311, 27553, 29627, 26169, 33689, 43060, 37335, 35157, 30553, 15627, 28446, 41111, 34672, 32863, 40067, 39923, 23021, 10293, 12434, 17533, 25752, 33480, 30814, 19760, 17747, 15628, 14202, 20637, 27696, 37136, 38243, 52204, 41117, 18427, 8170, 6821, -6220, -16406, -7467, 1915, 13840, 27147, 27090, 16446, 7767, 12793, 19300, 12111, -6426, -14492, -15616, -4747, 6784, 10052, 12823, 10275, 19836, 18558, 23639, 33595, 27442, 26258, 20664, 18516, 10712, 11460, 12894, 20333, 18830, 7973, -6080, -14450, -6362, 4245, -860]
17914h60L989R156Q074m493R8m578n548R38J5060J102j3039k0833m710J4611K2466
17899B1433m808K051q05j830L351j7120Q04k594k814k257j0227M362O071K80N388
17884A285L445M171J5303N342j2725M4Q543n135p806n545L012m451j0734L31J4187
17869I267j976j5127j2569N66J756j568l080J701R305o088r93R114J0295R532
17855A0135P131O75m283M300p417M66n492J071O925q967j8426j2039J4167P722
17841d032J61K0592N929J796j0852o907k1340O567J3327J353j633N331K4394M166
17827C8852l506j4650r346j7606o490j247K026Q868Q233O425j371j3303j169J1282
17813F998J2638p556j7579n550r286q071P348M488Q127l733M386j346L242O749
$$ y = [-860, 3129, 12285, 20359, 15866, 15964, 11386, 5838, 6776, 21836, 22938, 9899, -10934, -15644, -1033, 21433, 16625, 18676, 17871, 16041, 19392, 2272, 3076, 482, -2332, -4589, -14816, -10454, -4383, -4103, 1285, 4730, 8901, 24204, 29546, 16821, 16865, 25408, 20273, 12467, 6922, 9934, 5483, -5251, -4920, 9267, 7291, -7836, -20405, -19839, -18083, -19651, -22731, -21030, -11725, -17813, -18806, -9692, 603, 10135, 17266, 17941, 13658, 17958, 10541, 11007, 5515, 6586, 13511, 4544, -13882, -25921, -11754, -4032, -3871, 16721, 22650, 24446, 13594, 6687, -14653, -8086, 5241, 6594, 4961, 10292, 34686, 38852, 35346, 20696, 11350, -6256, -12746, -13993, -11967, -3099, 5134, 11559, 10188, -3115, -4284, 6998, 19636, 12080, -5499, -11049, -20335, -28406, -21058, -16570, -8443, -12176, -7790, -9136, -5894, 855]
17799H55N007l553j315Q423K469r612j5762k165P160J1439J3742o404J464q253
17785C495p433k349N039N036j1024j5805J148j948Q068L249m68J416L072j6207
17771b4711L367K3992O147p240J0956N115j3105p537K924j034O586P620j0059
17758C021j5027J1700J0293P092j426o165q73k02j071m780N869O872K788k119
17744A5972j008n677L310o747l406M004N506J610j5299j5831J8460K2477o289
17731A7082j3029l909l099L806K506K558j2923j3933Q155P014O254l548j1699
17718a4765j411k598P985J9338l142q158N204J1797j1183r682j004L080N680j024
17704A17P66n587o642M405K828O30k56q456j5485J513J4700J3646m825q412j789
$$ y = [855, 5862, 2309, 994, 9417, 11886, 2274, -13488, -15653, -8493, 2946, 16688, 10284, 11748, 3495, -3938, -6287, -1248, 3788, -7236, -23041, -21893, -23841, -15773, -12524, -12992, -11576, -8504, -24711, -21344, 2648, 8795, 1555, 12511, 17626, 4521, -3016, -92, -1126, 5460, 13080, 3021, -12006, -306, 9987, 17079, 15653, 9488, 8615, 8413, 7342, 2562, 8431, 15303, 18091, 15972, 14964, 9287, 12597, 5850, 2444, 6448, 11954, 13564, -1735, -17566, 894, 23371, 17082, 4053, 144, -2955, 851, 3357, 5915, -7008, -20941, -12786, -5772, 482, -3066, -14765, -16176, -18774, -10789, 8549, 5407, -2751, 2453, 14250, 3067, -6615, -7619, -4539, 1141, 117, 883, -4704, -11346, -6941, -4113, -3483, -3739, -12195, -27680, -26167, -11467, 2179, -2646, -11058, -12847]
17689a2847J6245L315M634J4192L46p768k399p12j3179j4646p652L648N323J2069
17675E69M768q163j2195j0307j1272N554P164J7227o91R07J6720L810j2480j4145
17661a2534o769o197O616K3083k743p921l900j171k513j2601O55j0175J091M426
17647c0653J0648R679l0k919o103p671n883P56Q504O467K645j537m709N226O255
17632i325K934l18j2125l755J1151j405l1K104R849J3367j1253o555J1368j960
17618D046J068K058n351O57j2387k764J4956K212l881K768J0500j1505q528j213
17604g364R519N052m744q368q017K974q30l771j0147j660P920L440J505l233j4031
17589c1755M213J0619R65j426J639L879Q049O561J338j0942M229M209J623K864
$$ y = [-12847, 3398, 6713, 11347, 25539, 25885, 18117, 15718, 15006, 1827, -12819, -20471, -16823, -11500, 569, 5337, -2826, -15021, -25328, -36600, -31046, -23882, -6655, -7346, -6439, 10281, 14091, 1611, -12534, -19303, -25500, -18884, 4199, 1456, -6465, -10365, -11536, -14049, -26650, -25995, -36170, -35079, -30653, -20005, -10326, -10356, -13275, -19378, -27049, -32932, -32176, -23672, -17205, -14560, -16097, -20806, -15580, -9325, -6391, -6709, -18834, -22589, -11438, -12843, -12874, -10770, -921, 12446, 1193, -5362, 6006, 4046, 5114, 7172, 1821, 2478, -9909, -12673, 2283, 4495, 614, 3382, 13882, 2377, -6151, -7364, 2155, 7207, 2463, -5905, -13922, -10948, -11778, -15549, -25696, -27356, -19436, -15996, -14491, -17724, -31755, -27542, -16923, -15958, -17384, -15745, -11866, -3817, 2744, 4082, -6860, -2631, 1578, 3201, 6065]
17575F065L33K72J71j873k343L394O02J408j785l204p391J591q44R749n984N747
17559E908j968j4571P19K2365J5335m783k3757j3562m809j887R72R375J4816J2489
17545A6642K316j0400j5127L515J6685m944j0613r000j592j199L19m478K970L259
17531a1647p158P870J843l161O55M069K975L783m520l469J1199J5306r592j3565
17517e412m66q31M03K775k540k558j6528n414q521j0562P765R712O796n375m87
17502c1243J3286Q635P582n2Q28J1394r499j6594M185J1555M127m449n150r316
17488a4711J218J929P235P550J05r074p22j260M733O378L123j4023k0898r627
17474c8044P346N443n219j4062J3767K1719j710q148L339P433J365n647O206Q42
$$ y = [6065, 6398, 6670, 6841, 4968, 2625, 6019, 6621, 8029, 6244, 3040, -4351, -2760, -3604, 6145, 161, 5908, 3940, -10631, -9912, 12453, 27788, 23005, -752, -14314, -19123, -21010, -20038, -10663, 4153, 16642, 18958, 8558, -6569, -3054, 13631, 8687, -1926, -10926, -12518, -13717, -13398, -17876, -14906, -11647, -18805, -10935, -9092, -12253, -11598, -7529, -4554, -771, -5291, -8760, 2439, 17745, 8153, -5412, -5878, -6709, -6306, -3531, -6071, -8629, -25157, -30571, -39092, -49654, -41889, -32177, -25381, -30756, -31243, -17957, -9322, -1740, -1792, -964, 10430, 931, -15663, -11478, 77, 4204, -245, -5395, -14711, -13493, -11564, -4329, 3221, 3326, -5748, -6470, -7730, -2997, 3381, 6504, -7519, -28417, -38044, -30698, -25255, -30474, -44536, -30769, -9050, -10760, -18908, -15569, -8136, -6771, -12418, -6212, -5370]
17460e370j0483j371Q756L809M659j088p278j764P421R94q234p604J3186J2077
17446G710R758O583J8924K5736L4149J2224O18l083j7312k7843j4604j5874J546
17433C8532j796j3070q706j7939M633J660p530k016O627P878L784r710n406j961
17419e020m124j2636L100Q684m628J90K202n759M671R910l458m244j322M220M250
17404c964J881l172j1390M524j38n969n980K391j599n416L047M095M479R77R095
17389g139m379K91p068k100J2055n298k185R398r952k498R500J0693K431m288
17375e39j2388L853q049Q003K0837P899N453j0103N772l016o384j1842r249K219
17361g534R198P337O080J440L390j59q985m411j368r071k683j37r798j1437O761
$$ y = [-5370, -15853, -17224, -8468, -4659, 0, -1088, -8366, -10130, -2709, -1715, -9949, -17553, -4367, 7710, 17468, 24051, 42975, 68711, 102860, 115084, 115702, 112619, 95307, 67464, 52860, 36986, 38532, 36736, 23666, 14960, -2979, 1654, 3314, -4216, -6232, 395, 8273, 12057, 2347, -3059, -5020, -9144, -21780, -18680, -9996, -14624, -14434, -12232, -17991, -13320, -3410, -6868, -11112, -12434, -8214, -3964, -2083, -5255, -16645, -12121, -12259, -18228, -24208, -21817, -23416, -28832, -25785, -21690, -17211, -16234, -7139, -11518, -11227, -18295, -20395, -8340, -13638, -15823, -6425, -16377, -18875, -9375, 1318, 3749, -539, -12927, -9074, -17123, -9120, 11717, 19616, 25069, 14966, 20738, 17722, 11338, -504, -9753, -7534, 1664, 9001, 15081, 16521, 19911, 19752, 10767, 6356, 4988, -4083, -6766, -6903, -16701, -28138, -21377]
17346b1377M707J620J0392n303m196K5924N728k0219j5037n534J0969k621N01
17333a4446j169O508K908q997l995j613M473J3014Q890J0507J365r66j1167j5676
17319a0364m235K345O873O538P697j0968R038j133k54j289L781K712q871o24L178
17304D424q665Q86p03m16m251L802N945r498j446j0648J1558Q532n921R32m297
17289i766L02k055j2803q346k112J4131K752J1034J0614N88j2819j586O818J1087
17275G839J527k331k762j5781k407k604n527M917N476O905M303M795r447l87K556
17260b928J168K081p384j487k206q618P156J293M279r213r687Q361J7299N313
17246E427o167j3219n833n025k753R557K1887Q424N995L215j0423r251r066n053
$$ y = [-21377, -16670, -15050, -4658, -9961, -14157, 11767, 17495, -2724, -17761, -23295, -12326, -14947, -14446, -15615, -9107, -6199, -15196, -19191, -20804, -16331, -3317, 5573, 16080, 17445, 16479, 5312, -10364, -14599, -12254, -5381, 1157, 8854, -2114, 6924, 5791, 5537, 4248, 8029, 10741, 1870, 1246, 4424, -4241, -3355, -4058, -4474, -8725, -4923, 1022, -8476, -9922, -20570, -9012, -480, -6401, -5469, -9766, -9464, -11519, -24322, -32668, -34780, -20649, -17897, -6863, 3751, 4339, -8480, -10066, -3248, 7839, 9366, 7035, 4273, -11508, -13915, -16519, -22046, -17129, -11653, -4748, -445, 4350, -5097, -5484, -2928, -1760, 321, -7063, -8550, -10756, -19374, -12218, -10925, -6646, -15859, -25546, -17185, 114, 5427, -740, -13959, -19792, -24817, -27570, -18013, 3874, 12298, 18293, 21508, 11085, 1834, -7232, -12285]
17232a2285m727N356M051L224r39o497Q165M071j1083k610k765N595P60N435M072
17217a77P492j072k3671o821P757M307R780J893O648K432M624M819K746K320j5026
17202H051j8970N779j782j784j0834r798L749J9463J2099o712K334j0011q035
17189a6451K256Q80N807l999q792m078o418K3M722P416O910r7j258J4119M902
17174E942j0252j7091K62M831l283l646O536Q744Q371j0569n073P94R54Q08J4412
17159A740r02n764p93j356J673N387l408m352n75N293l279J211Q902o320k2993
17144b5536k218L586J6895q371K357J0053j177l760K862K277L588P871j0335n759
17130g667L811M933J919j469n971q779K403p638N240m635L097J995N86N944k393
$$ y = [-12285, -17012, -11656, -7605, -4381, -5320, -11817, -3652, 419, -10664, -13274, -16039, -10444, -9684, -4249, -177, 7315, 6243, -17428, -24249, -16492, -12185, -2405, -512, 6136, 8568, 13192, 18011, 20757, 23077, 8051, -10919, -5140, -6922, -8706, -19540, -29338, -25589, -6126, 5973, -739, 1595, -8416, -16451, -14195, -13315, -7508, -11507, -20299, -24377, -30795, -30772, -26050, -18634, -11724, -11821, -13079, 1040, 5942, -4310, -21401, -21139, -16308, -19591, -23237, -16701, -7957, 414, -10155, -15228, -14434, -13480, -12672, 1740, 838, -4926, -5719, -7075, -5402, -15, -3423, -7775, -8350, -3057, -6336, -5125, 3777, -2543, -25536, -27754, -24168, -7273, -15644, -13287, -3234, -4411, -8171, -5309, -3032, 556, 8427, -1908, -7667, -3856, 1077, 2996, 1527, -4444, -13223, -10820, -18458, -13218, -17853, -14756, -12761, -12175, -6231, -8624]
17115h624q793m429J1884O712L136j0261j7711J841J1093R327J873j2132M520
17102a1564N861m106k22J521N752K828l267k801m818j0149J648O665M817K884
17088d951k369q441l282o716l274r669j277Q257K0853K2141m872n161q642q434
17074a5837N221k658n468R870P936k711j507j4489o532J821j771q964R416J3110
17060a2563M964o154m531l159p31j046O64l984L487L856J0856j0845l344r04q277
17045c1711Q987J0431L388q097k181N986R883O993q382P047R476N840P379m427
17031B0612j0938k378k0004k626l260J552J162n293O272k141M376L769n288j0206
17017b4391k777j644K4366J4314j5558k1225R778K069j5528n033Q076J6584J1394
$$ y = [-8624, -17417, -21846, -9962, -3250, -114, -10375, -28086, -26245, -15152, -5825, -3952, -16084, -11564, -5703, -9809, -10031, -8510, -2758, 70, -3197, -5998, -10816, -20965, -19317, -12652, -7835, -4951, -7320, -15761, -19043, -25759, -29033, -38702, -39979, -31722, -10869, 11272, 6400, 1239, -7403, -15837, -10616, -13274, -18742, -8872, -936, -3647, -5154, -19643, -26175, -24354, -26125, -35089, -25673, -12563, -7599, -13753, -18284, -21443, -22174, -23220, -22556, -26540, -23053, -19197, -8341, -19186, -22530, -23434, -31711, -22724, -12293, -8905, -17002, -19183, -13197, -3314, 3679, -4703, 2344, 11820, 17660, 25039, 20612, 9674, 7296, -12708, -15334, -18594, -17042, -15880, -21173, -14901, -17042, -12666, -8897, -14185, -24391, -27168, -28812, -4446, 9868, -5690, -26915, -17137, -15068, -30596, -35629, -27553, -10969, 425]
17004D25l362j6872p14R073J8733L301j0618j1190l593n623k3493J1622N874M851
16990b1586M21o116P070K606J1767J445K323R411J2806r17j0011Q324j2637j1610
16976f704l676M630J1816J6615K571r790j3069q225l932L49L299J70j0555r785
16962b6286P109n065j458R869O862L240O537N409m311k165j8448j6625Q788J0094
16948a6450J3098O038P246J4934j1101j1789p854M01P875K194l068R726J1259
16935B2509j0986o294J981K515R17j23n451Q648K2644m122k2159j0761k698r238
16921a2618l639j290M309m900j079K516P292n861M544J6877L544j8174j8429j0299
16907c7207J4260J881P387K976J9749k469r501N134m820o755Q762l0n420M181
$$ y = [425, -2937, -19809, -20523, -11450, 7283, 10584, -34, -11224, -14817, -20440, -43933, -32311, -26437, -21586, -21165, -27281, -20211, -17605, -5838, -4393, -2070, 7341, 20147, 19230, 9219, 17543, 4906, -6704, -10380, -5750, 6066, 22681, 25252, 15462, 2393, -5832, -9764, -9415, -6116, -5946, -16501, -26286, -19177, -24242, -25700, -15831, -8969, -5729, 808, 6217, 1906, -259, -18707, -35332, -26544, -16450, -3352, 2686, 9932, 24866, 13765, 1976, -5878, -5477, 2398, 4592, 1524, 11250, 22509, 11523, 5229, 7210, 9725, 10642, 10519, 5068, 13716, 36360, 32238, 10079, -682, -3380, -12618, -16257, -17547, -13238, -18138, -19217, -16701, -9409, -15270, -10726, 6151, 9695, -8479, -26908, -37207, -22947, -21066, -13679, -10703, 9046, 6577, -2924, 2210, -2610, -9365, -603, -633, -6053, -1872]
16893a872J3311j1562m002m971j4703N887P462M227Q652l282L133J7784J2897
16880C2961N994q141n513n215j1127r674l70l25m978j0425M063J3890n883r287
16866a4030j1119J2347O359r649p964r248L390Q479J3595L972j3396m300J310
16853b0254R483J4162R926p03k1311L030kQ382N116j377j6545p911k028K685M913
16838a2434M189j977O535Q394o599m404L266m790j3979k160L940J0312J05J489
16824h113k509j0786k957N858l673J2044n830m645j950l942L401K394q235P70
16810b8173J1348M446N524L26k1760j538J7328m1J647J520L871k504J1105k061
16796A038o775k403O379K163j989j101j795O943l533q415p032J9095J1339m684
$$ y = [-1872, 11439, -123, -4125, -9096, -23799, -17912, -10450, -6223, 2429, -853, 2280, 20064, 32961, 38955, 30814, 25301, 20086, 8959, -715, -1085, -1410, -6388, -16813, -12750, 1140, -4743, -14030, -25149, -12802, -6443, -16092, -24056, -33304, -29914, -21435, -7840, -3868, -17264, -21564, -20254, -10771, 3391, 13317, 12614, -8697, -5667, -5669, 2713, 7829, 6452, -10093, -18004, -20032, -17347, -12434, -8245, -10222, -3687, 4707, -1892, -6296, -3030, -7820, -21799, -23959, -20019, -9707, -9602, -8113, -10622, -21408, -24365, -18507, -22180, -10136, -15966, -20611, -22561, -26503, -23102, -20708, -28943, -28173, -16825, -12379, -6855, -6529, -28289, -29827, -12499, -12540, -10893, -9373, -5502, -8006, 3099, 1038, -5737, -8140, -1761, 402, -1587, -2688, -4483, 2460, -1073, -9488, -16520, 2575, 13914, 9230]
16782I230j2551j0778p149R996L914j406N880J836J0912n27n932j802q088l736
16768a0201O97J1526J781r42M562J53m258m453o771j65j396l233R15N069N461
16753a255k428J1209r23p261q835k650M194J860N032O20m872N099l57l596n480
16738i643J1217l331j1922k804P020N606K227J2667R495r497j858q907j7914k248
16724a9892K602M728M143j3116J2733J105k423J846Q683K24o742L026p998j5920
16710b7001n964P436J3138K864R115R480P513J3m201M49J3154k680r804k0323
16696f811J2288o549J596M454K779M782n131r34k977j5757p328J725k402N036
16682a5229J3077P085R697q931j9165k0835P045J5692R545J5066m348K522P05
$$ y = [9230, -3321, -14099, -21248, -11252, -7338, -8744, -2864, -1028, 9884, 9357, 3425, 1623, -6465, -10201, -9504, 2022, 3803, 2861, 7423, 7576, 3318, -1135, -7906, -8071, -9467, -12700, -11785, -6716, -1255, -3683, 7526, 6603, -658, -9493, -12143, -7949, -6089, -1057, -437, -5309, -210, -567, -4163, -9643, 1574, -1757, -13679, -16483, -9463, -3857, -1630, 11037, 20532, 11035, 9177, 270, -17644, -19892, -17290, -12562, -8419, -21535, -8802, -7697, -10120, -8274, 409, 633, -6109, -3083, -11081, -27001, -32965, -25529, -12391, -9527, -412, 9068, 16581, 16594, 12393, 12842, 25996, 23316, 13512, -6811, 5477, -1072, 524, 4978, 7757, 12539, 7408, 6474, 3497, -12260, -19588, -17863, -20265, -15229, -2152, 4933, 14630, 5699, -13466, -34301, -27256, -11564, -2019, 13047, 8699, 11221, 11926]
16669A1926o870r137J405L454j3373m769J6063J29k253j0618K259K661l898R625
16655c396M598j2154k380l362l74R81j765L036m300j126N976J5317p121q793J3591
16640a272j3292L278N001J714O47k465k932P875l352Q514k014j3548j3284J499
16626b3631j45J0016J6902M793J512L489p944j6453K308q732o646P305J3575j2491
16612a6142j1946q942J3632J2679j2361k16J1210J0520m085N417J065J452M640
16599F923Q56p276k598J632P571j68o887J61M088o682l869M299k911p046o600
16584a8507r131m818O938J1430N217M613m1Q41n379J0949n64o121J5826J3395
16570B4648K336o322j4699j2135l015j8748l07Q842j479p739r690N873J3835P522
$$ y = [11926, 5056, -4081, -2676, 778, -12595, -17364, -1301, -1172, -3425, -14043, -11784, -9123, -13021, -3396, 1202, -10952, -13332, -16694, -17068, -16087, -17852, -14816, -19116, -20242, -14266, 1051, -6070, -14863, -1272, -14564, -11286, -6285, -4571, -3924, -6389, -9321, -1446, -4798, 3716, 1702, -11846, -25130, -23631, -23776, -13760, 3142, 7935, 9447, 12936, 4992, -11461, -9153, -17885, -24531, -17226, -3651, -16142, -28088, -37030, -23398, -10719, -23080, -23296, -12086, -1566, -5651, -234, 831, 2283, 6923, 7779, 503, -2095, -463, 7108, 6940, 53, 214, 4302, -2380, -6249, -1950, -4861, -11907, -18507, -27638, -32456, -25518, -14088, -8871, -4258, -4299, -3458, -8837, 2112, 1548, -4573, 11253, 24648, 26984, 20662, 5963, -6172, -9187, -27935, -28242, -19400, -20879, -28618, -38308, -32435, -18600, -11078]
16556a1078n230m41P891J5005J2959k927j7241j204J0291m393j2819J537o2r948
16542a7660q100K605J2150R241j453m663l167p529o043m1L026L463J624O225Q14
16527i508P527K07l514J410j009R352k841R273O44r542K681N737L347p299q261
16512a796R94J691n17O533n00M415K111j2859l178N955l041O849k075m421J166
16497A327P428M430j818q517n195J5178M725R668j618p897m051j7130L776N223
16483E529N076K08j4046j1972k960P030Q967j0345K951m017Q59L071M375P393
16469B119J003m999n168j108q25J1337N896p798p523q258J0394J3044j2630K662
16455a854R454k950K247j4026l237O766Q88o732n606r833P723L422P376n971j1031
$$ y = [-11078, -16308, -16749, -8858, 6147, 19106, 16179, -1062, -2266, 8025, 3632, -9187, -7650, -7712, -17660, -25760, -23155, -11005, -1764, -3217, -7880, -11047, -18576, -24619, -24660, -21634, -18171, -16547, -10322, -9508, -1981, -1774, -5288, -3878, -4887, 4465, 1624, 10897, 11541, 1999, 4680, 10417, 13764, 6465, -1796, -802, 889, 372, 6905, 6405, 10820, 12931, 72, -3106, 2849, -192, 6657, 4582, 161, 1327, 8755, 13185, 11367, 2850, -2345, 12833, 17558, 27226, 25608, 17711, 13660, -3470, 306, 5529, 10605, 10813, -3233, -15205, -18165, -11135, -2168, -12513, -9562, -13579, -12720, -9649, -5274, 2119, 3122, -1877, -7045, -8153, -8978, 2359, 8255, 457, -7066, -15324, -4930, 8114, -4516, -1854, 7600, 4650, 6897, -7129, -10366, -3600, -2712, -9444, -15050, -24883, -17160, -13738, -6362, -12333, -23364]
16440b3364p451o916K499r41N819K7849J1794p78J110r349q241J4017p724j533
16426c209p687o092L331n351k098J5280Q842m288j4706P096J1719P075L93j4563
16412d258j2023J9197J3839L137k2745j9448J4125M331k64R219R044j2053M529
16399F630j5102l423Q957O035k3R5l498M463q909j355j2477j1084P682J3843O532
16384a634q999J2362l27j0059k501L180N792j538r824o045j831Q290N526o57j81
16369h446J458j221J1757Q570j9723n519M375J1648Q217j3580q848j4788q984
16356c5084J794J964j016n69J1539Q504n629N399m096J3766P233q422q694L302
16342a0009M028L648O862l770J779j0369M491n234n022K208N95Q985o095n399
$$ y = [-23364, -30815, -37731, -35232, -36173, -30354, -2505, 9289, 8511, 9621, 272, -7969, 6048, -1676, -3209, -10896, -16988, -13657, -19008, -21106, -5826, 3016, -1272, -15978, -8882, 2837, 9912, 10305, -4258, -16281, 2916, 16755, 19892, -2853, -22301, -8176, -3845, -4109, 5110, 14154, 2101, 6630, -8472, -11895, -2938, 3097, 3074, 3169, -329, 4134, -4775, -6130, -18607, -29691, -22009, -8166, -1634, -10633, 1729, 1402, -8657, -11158, -7978, -2186, -3724, -13548, -19593, -21424, -13134, -7608, -8265, -8446, -6988, -8209, 3548, 12118, -7605, -13124, -8749, 2899, 11116, -2464, -11312, -26100, -35084, -33290, -31326, -32342, -32911, -21372, -12868, -18497, -13098, -17194, -3428, 3805, -4617, -13311, -10009, -5981, -2333, 4529, 759, 2538, -7831, -3340, -8574, -13596, -11388, -10793, -1808, -7903, -13302]
16328a3302J6458j539r639r441J1565O775j5659p561j7254M473J3397p120J123
16315b7724O48P041L276N48o451l007K153J0176P433M412N531p824M182Q75k417
16300a148p527m092L600K583J4659J871j3802j903n90j342K012K546q132n74L083
16285h756j1875l302J0895K301R85L674j3428k369L327k066J5061M345j574j493
16271d275j0229j6871K686J3912P661J3802J1831j572J622j1436q324M245J226
16258D278K597l308n590r592M00M814j895L57l665j2487n40L220M336J684P419
16243g972O89m537J380R558k960k615J566M530P534r1j4445j876J5237J1606o362
16228A1242p443n35m489K835n275P802K982J112m552P091m246j1553K105J593
$$ y = [-13302, 3156, 1617, -8022, -17463, -5898, 877, -14782, -22343, -39597, -35124, -21727, -28847, -27724, -27076, -20035, -16759, -16211, -22662, -25669, -23516, -13340, -5907, -1495, 4036, -3788, 394, 1269, -1148, -8675, -12767, -9167, -6584, 8075, 9946, -3856, -5759, -6349, -7691, -5679, -3133, -11265, -11839, -8756, -20631, -23933, -13038, -10737, -9752, -6078, -19506, -21875, -18548, -20614, -5553, -1208, -2782, -4275, -14504, -31375, -28689, -14777, -7116, 6686, 18517, 16945, 18567, 7131, -1193, 3052, 4278, 6875, 3567, -2023, -11615, -11215, -6401, -8296, -7939, -11604, -24091, -24631, -21411, -17075, -15391, -7972, -7283, -11820, -10440, -882, -3842, -6457, -4891, -361, 7173, 7082, -7363, -9239, 5998, 17604, 11242, 3799, 3264, -1225, 1610, -3665, 4137, 7119, 8231, 3679, 10770, 6524, -5029, -2924, -1331]
16214a331K327J0483n333o905Q95j1950j1993R078P906l615M758q960j8628L427
16200b9841K1993J729n002n106M3O801J852o766m427J821m592j1283Q35l141J1406
16185b3678R333j290O267J8806o507j1173l50N09N036O207j7203J2762J4122o226
16171F615l380m407n938M585o130j996n655r84K451R268J0786P959j232j1131
16157H11P02l909j943L541n198q720J3375P651K552j5377n473Q616k168j757P329
16142C2R465o193p986N59j296L409R099J1057R76p389o949J139O257l470k0730
16127a2020O602j561j3147m391q20N740J0431O650r057r277M138N665K847j0731
16113a8931j2559K2497J2230m429L651O13n559j2766O553N768k413q484m575K852
$$ y = [-1331, 996, 11479, 6146, -759, 136, -11814, -23807, -14729, -6823, -10438, -5680, -14640, -33268, -29841, -7848, -6119, -11121, -16227, -16184, -9383, -7531, -14297, -18724, -16903, -21495, -32778, -31943, -35084, -23678, -14345, -15635, -9368, 9438, 2931, -8242, -8592, -8083, -3047, 3160, -14043, -1281, 12841, 6615, 3235, -1172, -7110, -2525, -8655, -10651, -16306, -17290, -14839, -5571, 5215, 13174, 11942, 811, 1513, -2396, -4339, -798, -5996, -14716, -1341, 6310, 8862, -6515, -11988, -3372, -5540, -7297, 32, 9497, 3304, -4682, -4123, -5419, -2010, 7089, 18146, 19122, 11733, 4784, 5923, 12180, 8710, -12020, -5418, -6979, -20126, -24517, -25337, -19597, -9166, -2516, -11573, -20850, -16712, -11047, -8200, -18931, -31490, -8993, 3237, -1192, 2459, 3072, -2487, -15253, -8700, -2932, -5345, -13829, -18404, -15552]
16099a5552L855M476P065P566O101l363n018m202K784K1740j872n331n40Q89O82
16084A9280M289q739j4281L165K348j4019L631O762n339J210L709r825R073R681
16070A0945Q481j3871o452N468P557K750j1222J339J080r10M598m896j281j486
16056B100m874n919K219j3211J55O866L82J312m572m662J0054J851n712J587j1775
16041b4199k128Q948j473J4464J8073k894r683J121O992K67m443l01M96k855p436
16026e051J689L208P997K037J23j779L650j5769J174K636j2351o071j5912J059
16012c3360P791N516O222o244o872j846M544J1806J1757l201p595L12M906Q183
15998A919n574j412J4272M354m271K622M79M655M36r555M105j2687p367n866p206
$$ y = [-15552, -11697, -7221, -156, 7410, 13511, 10148, 5130, 928, 3712, 25452, 23580, 18249, 17709, 18598, 19280, 23569, 14830, 549, 3714, 6062, -7957, -4326, 2436, -2903, -1693, 2016, -7809, 1264, 10945, 19426, 5555, -897, 4571, 12128, 14878, 3656, 4995, 6075, 5165, 9763, 4867, 3586, 2100, -2774, -8693, -6474, -19685, -19530, -12664, -12282, -10970, -15542, -20204, -10150, -8299, -14011, -12424, -24199, -26327, -17379, -18852, -4388, 13685, 10791, 1108, 2229, 9221, 9488, 5045, 4744, 5240, 2385, -5051, -3362, -154, 7843, 9880, 10003, 8224, 11874, -3895, -2721, -85, -12436, -18507, -34419, -33360, -25569, -20053, -13831, -20075, -26947, -28793, -24249, -12443, -686, -3887, -11482, -11170, -6264, 1919, -3655, -5067, 9205, 13559, 9288, 11910, 12389, 17044, 17480, 7925, 12030, -657, -8024, -13890, -21096]
15983b1096j138K921J279O722k764Q079j320j0613j3103J612R156J7494J714L163
15969B106L70M169P639j438p322q910q795N686N843p941l018O012J2162q618m463
15954f518R147l413r844K166j950q215l277J811P73N230J7946k679J0055k072
15940I160j8366n773N167k338N322Q049n891K288j855N676R519l084N459J2068
15926B5401J3335J7899M763j5205j6332j3142J829k5439q638Q375P396M176j305
15913C113k434Q9n077o407j916l82J151k750L842J3239L726J7722m778j2212j2732
15898e806p116p009l778N278M700J5510Q01p14M234L086l621m258N727O142o290
15883F886L826p6L002L743n651j2330K003J977j6226j4561j0336J3789J7254O10
$$ y = [-21096, -22234, -19313, -18034, -11312, -14076, -5997, -7317, -17930, -31033, -29421, -20265, -2771, -1057, 2106, 2476, 6645, 14284, 12846, 5524, -3386, -12181, -6495, -652, -8593, -11611, -5599, 6563, -2055, -6518, 2629, -784, -10628, -8462, -10412, -18627, -21904, -20093, -19320, -14090, 3856, 1177, 11232, 9160, -9206, -14979, -9812, -12150, -6828, 1221, -4670, -2382, -4237, 1439, 10958, 7874, 13333, 25401, 38736, 56635, 61398, 46193, 29861, 16719, 18548, -6891, -15529, -7154, 242, 4418, 3113, 679, 768, -4309, -10716, -12632, -13014, -11863, -14613, -10771, 2468, 6194, 23916, 19138, 6926, -5806, -12922, -19931, -23709, -18431, -13731, 1779, 2580, 1866, 6100, 9186, 5565, 1307, 7034, 13176, 6886, 10712, 10636, 13638, 17381, 11730, -600, 1403, 3380, -12846, -27407, -37743, -23954, -6700, -6090]
15869f090J762j3639PJ4495M916o499K29K241N383P214O264k965j0294j4715l170
15854a4861l760M622Q438J5115Q717k905l810l427j3055k474M122R477m29k812
15840B958n270r390o131j1758N34P865M521O266J1071J1804J005l214j049R158
15826A8370n81j7767n244J0253J3753J296n351m768Q69N199Q95r150j472J0732
15812A7034P719j2744N8j163l117p944n873O067O229k671r130m897P935O264r84
15797B783r089n133R480j962j2652O534J7377j7145j0034J2882J0849l790j0796
15784a0696o033n313k869R294P639L377M284P527R770J2966M603j6057l824j1198
15770C470o986j1315m171R401J721P745m956J9942J5973P69j6454m780q374k833
$$ y = [-6090, -4328, -17967, -17960, -3465, 1451, -5048, -4819, -2578, 2805, 10019, 16283, 13318, 3024, -11691, -14861, -18621, -13999, -5561, 9554, 18271, 15366, 11556, 8129, -4926, -7400, -3278, 6199, 5770, 2958, -2312, -11702, -17833, -29591, -29057, -21192, -16671, -10405, 666, 12470, 13475, 10261, 9212, 18370, 17789, 22, -5222, 5031, 18784, 20080, 14729, 9961, 10830, 16029, 16924, 7774, 6302, 17034, 24753, 12009, 12067, 10904, 7787, -157, -6030, 37, 6266, 3595, -5535, -10432, -2497, 3767, 2783, -6306, -11439, -1959, -3921, -16573, -10039, 7338, -9807, -19841, -6959, 3890, 100, -10696, -16729, -22042, -24911, -15617, -7978, -4601, -317, 7210, 16980, 29946, 34549, 18492, 14668, 3470, -3516, -14831, -19002, -9601, -7880, -135, -5091, 14851, 30824, 31593, 15139, 10359, 1985, -848]
15756h48J1096L158l82j2674q222k890P916j4657J959Q878N081j645k130L72R209
15741D221R050l505p996K088R687L162l689O478L147j0223j5188p324J0136P858
15727G902q063m617l84M809J0564K162p637q135K089J0536m222K671O200m041
15713I834j0485N57J054j7625P08K820P14P522J8253j621l138MQ385j2891k0333
15698a6242O23J2305n424j9574P253Q144J1870J27m327p315R33M234M004l38L198
15683e29m005K129m749j4286n99Q597J2441J9365j349N468N209q585k2399l570
15669f862p17m573J3843Q061K55m682J092K149N437q43k695m953K152j6389j698
15654a0423O461P363O454M939P669o44O755j046j4988q280Q10k697o694j087P72
$$ y = [-848, 10248, 13406, 13024, 350, -7872, -10762, -2846, -17503, -15544, -6666, -1585, -3230, -5360, -4988, 4221, 13271, 9766, 1770, 3858, 13545, 16707, 13018, 19496, 22643, 12420, -2768, -10092, 44, 7902, -161, -4778, -5162, -353, 10211, 12373, 4736, -3399, -1310, 9226, 5004, 7675, 13875, 9834, -651, -94, 960, -16665, -15957, -13137, -12423, -4901, 13352, 11731, 8593, 8597, 16982, 4091, -16242, -15619, -3314, -8738, -28312, -21059, -12915, -1045, -918, -5245, -12560, -11627, -7393, -3389, -3727, -529, -4534, -2405, -7154, -21440, -22039, -13442, -1001, 18364, 17015, 22483, 27692, 19107, -3292, -6862, -7579, -12152, 1691, 9752, 10007, 5325, 6417, 8566, 14003, 13160, 10465, 5512, 7664, -8725, -10423, -3962, 3401, 9855, 14794, 22463, 21819, 28574, 27528, 12540, 4260, 5070, 2373, -4321, -5408, -4636]
15639d636J3461M361p247j2426p05R425P554N567j877j5877K505K500O127O021
15625A4753n449j1009K325L804O984m640j3233j0305o372R262r021j2485j730
15612c7116N067m916Q410K054l511J8216J5286n240k250J3201n052l362M573l620
15598A740k190m448L405O935J1377j889K714r553k8762m403J7038J7060J1973
15585B0997q217l487o008p109J559j917L404J0370m114o904j127j0262n67m366
15571a7748m138J730J4488l517K410L944q571q833O224J0339K948q353J2384Q818
15557A2125K953J078J426q429p985l344K176P540J7504K98m914j676n242p41M307
15542A7076M884q572K763P115O170k40n404J0244n359j7129m751P249P401J5726
$$ y = [-4636, 8825, 13186, 5939, -6487, -7192, 2233, 9787, 15354, 13477, -2400, 105, 2605, 8732, 14753, 9304, -1705, 620, 4424, 11408, 6768, -6465, -16770, -23142, -13880, -22901, -35386, -37116, -32049, -36965, -28555, -26501, -30012, -11796, 3490, -1750, -4000, 9201, 4149, 787, 5360, 1740, -450, -4898, -1493, 5442, 16819, 14930, 17644, 8091, -20671, -25074, -8036, 9024, 20997, 12780, 9293, 3285, -3824, -2265, -4182, -778, 9592, 5478, -1426, -2553, -12815, -13382, -17748, -21886, -20156, -5668, -9185, -6775, -2831, -11402, -20235, -14011, -3672, -724, -9077, 3307, 12125, 15078, 16156, 17582, 9153, 1168, -2176, 0, 7540, 25044, 25342, 20428, 18752, 13510, 12769, 17076, 21960, 13388, 16151, 23266, 29436, 29196, 23792, 34036, 28677, 11548, 6797, 14046, 21447, 37173]
15528C7173M367n420j4634p03n236L614P877L953M20k920m729K904j5180L841
15514A5327O994Q937K1114k256j3656j8550n194L155J561j940j959J134P208J27
15500B2002r36o25N662n884l193j1578j0594M133P810P478R856L714j118r033
15486A7694k81p801n250k330k929Q634l795M055l593J0915J32L468j729o13o314
15471A0263K245N996K1211J982j2882o810k1451P237k947K10m53L641J2228M430
15457B4900j548l523m357P682N542j7358q369r354J5307J4907k5766k3138J2911
15444a2164J0854j890Q617J2203n529o253J6728K0045P023j7441Q10K813q333
15431B7483o484O12M252p946j3772n034J594J882J0729M01k021n52L201J3264
$$ y = [37173, 41540, 36120, 21486, 20783, 15547, 19161, 27038, 30991, 31411, 28491, 23762, 26666, 11486, 15327, 22321, 31258, 52372, 50116, 36460, 17910, 12716, 15871, 17432, 15492, 13533, 14667, 21875, 22002, 21066, 20441, 26103, 20219, 17026, 5448, -5146, -1013, 6797, 14275, 24131, 27845, 26727, 17694, 17413, 9612, 4362, 2032, -897, 7737, 3942, 7997, 4404, 15319, 15451, 18919, 17190, 16577, 10263, 12508, 18504, 39715, 41697, 28815, 22005, 554, 7791, 4844, 5054, 4601, 8242, 20470, 24900, 23352, 19829, 15472, 23154, 28696, 11338, 2969, -6385, 8922, 23829, -1937, -25075, -12164, -1310, -3200, 5417, 17620, 12091, 5838, 22566, 42611, 49634, 32193, 33003, 35816, 27483, 20999, 21611, 25863, 17917, 4145, -889, 705, 2587, 13316, 13717, 11696, 11144, 14345, 27609]
15417B7609N613j573k539J83L208R87n861j479N532J090p029l152m045p310O039
15402A7273J5320l547j5020J608Q627K947M430j414q34k357p239M49N222k219
15388B3246j385k401r499j0898L014L1135N164j0615J0009J1778j675l650m181
15375D0042Q040j0100j4245Q49J3406j1867j8762L251K833r32M902k153J997P56
15361A8017m867J0406Q522K945r759l914P808N063M585r5Q088q814l126j5188
15347A9671m011J860P935K492L29j0206m13p705N302J6679O225l848j7588j652
15333A5070J4942K641j2283J0702J3245N998r576K356J711L47p723j0991P316
15320C3755N253l69q420O517m364O48J0560R425r309N740j0351n852j1731j046
$$ y = [27609, 33222, 31649, 29110, 29293, 32501, 33488, 27627, 26148, 31680, 32770, 25741, 22589, 18544, 11234, 17273, 32593, 29046, 14026, 15634, 24261, 27208, 31638, 30224, 29390, 27033, 19794, 20243, 25465, 23246, 21861, 19460, 9961, -937, 2077, 33212, 38376, 27761, 37770, 49548, 47873, 44223, 40042, 48082, 37982, 23737, 24586, 37992, 26125, 7363, 10614, 13447, 12515, 17417, 15264, 17261, 18017, 13150, 23556, 32078, 35023, 25264, 21350, 29158, 34221, 38806, 38711, 46799, 37985, 34859, 19671, 15660, 17520, 25455, 27947, 28276, 18070, 17657, 9952, 15254, 31933, 38158, 34310, 16722, 15070, 30012, 32653, 20370, 31072, 44317, 50315, 40739, 43095, 44806, 45153, 37430, 26439, 33755, 39008, 38639, 30219, 36736, 32372, 33020, 43580, 53005, 43696, 49436, 39085, 33233, 21502, 20456]
15306B0456n02m272P958K052n641j4383j2833P746K1067P64P190J340k019j788
15292B7135K264o053R218R661M967j5948o671J5887p914k711m32j481J5997j432
15278D2487k1946l673L05J910K780O832o710j7454J760R948J1131M202J1772r340
15264C4004m016o25k54L949O628Q937o28j3784l656j0952J4573J6235N205m295
15250E1321j1261m83P830L801r463K6J3374K454o190j387R993p013J3041K303
15236F8346j0481q751k552J1940R356P726m25m223J967j0063j550N903M06j292
15222F6307o948j5240j4518n59Q084O734k084m291L488J3574O943p642q665j8639
15208B6544n611Q735J8183J5702O585j0580J1380J449j1998q527Q859l684k535
$$ y = [20456, 19954, 15682, 23640, 25692, 20051, 5668, -7165, 581, 21648, 22412, 29602, 30942, 28923, 27135, 29399, 23346, 32564, 42225, 47192, 31244, 24573, 40460, 32546, 29835, 29403, 27922, 43919, 42487, 20541, 16868, 17173, 19083, 21863, 28695, 21985, 4531, 6291, 16239, 27370, 31572, 43344, 34004, 29988, 29363, 29109, 33058, 39686, 48623, 47995, 34211, 30555, 19603, 34176, 50411, 55616, 51321, 40060, 39577, 47407, 51208, 41745, 41771, 55145, 57599, 51409, 50022, 60015, 53002, 66043, 68346, 57865, 49114, 46562, 58502, 67858, 75584, 75159, 70936, 72903, 62840, 61290, 67193, 67599, 66307, 59359, 44119, 29601, 29042, 37126, 43860, 41776, 37485, 40973, 54547, 61490, 53848, 45183, 26544, 20933, 29668, 47851, 63553, 70138, 59558, 70938, 72387, 60389, 51862, 60721, 57037, 54502]
15195E4502q861O180K0899l538j6032j4597o6J2410J3773J579j453O287J2579
15182H3662p900j2511j2003R459k760j21p723M015j718M88K071J762R184j016
15168F4889k954o32n296J2002J6041r585j0853N929q30J0949M459r213j0121q410
15154E6375N231l09N296J3457j491l683m172n681J3567N051l809p664n686J879
15140F8361l999L710J6133K117q899L60J0799j1092l107r85j5069Q023J3034l56
15126G9030L259M937k768r563j4209P219M209L896Q912N869l454p572n515J683
15112G5933k916o39K455P318L682j45L335N668O435q993j7576P061M498P089j427
15097I1778n065J0806j703m971j6533P411j0790j0865M572O071K318M816K549
$$ y = [54502, 45641, 51821, 72720, 69182, 53150, 38553, 38487, 50897, 64670, 66249, 64796, 71083, 83662, 75762, 63251, 51248, 60707, 57947, 57826, 50103, 54118, 52400, 52888, 54959, 56721, 65905, 64889, 61935, 61303, 56007, 68009, 84050, 74465, 63612, 69541, 68711, 79660, 84119, 74906, 64785, 56375, 61606, 61297, 66593, 80050, 78559, 74876, 70704, 65023, 78590, 83641, 79832, 72168, 66482, 68361, 64362, 68072, 84205, 86322, 77423, 77783, 88582, 77490, 74383, 73398, 58329, 66352, 79386, 79030, 82289, 87226, 84458, 74895, 60686, 67905, 72114, 76010, 84922, 90791, 87337, 79765, 74250, 75933, 73017, 72378, 74833, 82151, 85833, 85688, 89023, 94691, 101126, 92133, 74557, 81618, 86116, 93205, 91778, 86713, 97519, 95816, 90845, 74312, 81723, 70933, 60068, 64640, 70711, 73029, 77845, 80394]
15084H0394j2955q423l64J4136J7204N283K045k676M856m522j3857m538M286R718
15070I0587M282O363R6m093q076n083Q838J642R363J898k826R682l443q555m556
15055I6119m103L588J884Q259L521j438O381j471Q166k685k722k909l093m282
15041A05215Q91q089J279J350O277J1333M818N28o044m508m341l50L380J078m771
15026A08046M986N655k704N881O641k183m85J0292j791r679j1025p52N596k956
15012A15522P623J1760K631l041N542K636l388j37N554r063j2679l622O886P234
14998A33458q3q487j996M566m594K939L526O961J1423n360M199J2155Q527K93
14984A67527r077m708j039K056L700r511j170N387J3325J1388j122r868j3396
$$ y = [80394, 67439, 59016, 58652, 72788, 89992, 95275, 97320, 94644, 99500, 94978, 81121, 76583, 80869, 90587, 94869, 101232, 101328, 97235, 89159, 84076, 92914, 94556, 103919, 105817, 102991, 112673, 109230, 100675, 96119, 92016, 95604, 97488, 105747, 109268, 107830, 114211, 112740, 120906, 118221, 115499, 112590, 109497, 105215, 106106, 98017, 99296, 100646, 106923, 118256, 123074, 123602, 117558, 113050, 108709, 108359, 111739, 112817, 108046, 113032, 118687, 115983, 121864, 128505, 126322, 125837, 136129, 134338, 124659, 113634, 112882, 118478, 115522, 123145, 134905, 137536, 134495, 140037, 142673, 139285, 139148, 144702, 135639, 122960, 119338, 126224, 133458, 133375, 124888, 122892, 127458, 122864, 125803, 129329, 136290, 147713, 142353, 146552, 158707, 167234, 167527, 158450, 153742, 152703, 154759, 158459, 148948, 147778, 153165, 166490, 177878, 176756, 166888, 153492]
14971A53492j0737p15K269R321r028o600J1677P578n501L817K322K225p349J5338
14957A68109O835j079p623K7130J5205j0012j0986j1068l003K924k500K265NP717
14943A83919P712J6365r097j2904N533k640j041J409J0304n451M266M799N53p378
14929A96349r053k97J6289J703j0108o270L377M444L298n291k272J8057J0601
14916B20827m055J0119P449l744K077q339K677K075j14j22M382j011o122n639
14902B20460j394N127R734j921o180P21Q243P226L352J3152j753K623l74L774
14888B62790p2L547r042k874p881P681J0363j227l743J188J2188m672n97L701
14874B71350M055m446o534P098R716N171R90l643j032J5553J8933J4732k40j6893
$$ y = [153492, 142755, 142040, 144309, 153630, 144602, 138002, 149679, 157257, 151756, 155573, 157895, 160120, 152771, 168109, 174944, 173865, 166242, 193372, 208577, 198565, 187579, 176511, 173508, 176432, 173932, 176197, 176202, 183919, 191631, 207996, 198899, 185995, 191528, 188888, 187847, 189256, 199560, 194109, 198375, 203174, 203727, 196349, 187296, 186999, 203288, 204991, 194883, 188613, 191990, 196434, 199732, 194441, 192169, 210226, 220827, 216772, 226891, 234340, 230596, 232673, 224334, 227011, 229086, 228972, 228850, 233232, 232221, 226099, 220460, 219066, 224193, 233927, 232006, 225826, 226547, 234790, 242016, 245368, 258520, 256767, 259390, 259016, 262790, 262718, 266265, 257223, 254349, 246468, 254149, 264512, 263285, 259542, 260730, 272918, 268246, 267649, 271350, 275405, 270959, 264425, 271523, 281239, 286410, 287400, 283757, 282725, 298278, 317211, 331943, 331703, 314810]
14860C14810j6675R196J4613L19k793K471P191J0122p598J3681j6737j8087L354
14847C13867l265O777J2545M112J2982Q74J2221J0176K642J8930J1841o850k429
14834C94423J358J967r225M795P051l795l999M978Q691J3825M401N953J765M614
14820D36802J2231J2395J7568L4821M0662M9772M5393M0009K2522J7867J7691
14809G47733k966r086k0639k3098k9821l5134j2213J606n982k5049j0984K513
14797E76880J731p192p936j729j0970N94P427l861J13N453R12Q350J4485j158
14783E83099p211m985J3479J0797M68j3831L091K088N618L054J1410J7861K217
14770F27155M677M949l258m77J898J909J2967O689J8007J3841J851m62J1241k59
$$ y = [314810, 298135, 307331, 321944, 322263, 319470, 321941, 329132, 339254, 331656, 345337, 328600, 310513, 313867, 310602, 317379, 329924, 334036, 347018, 347892, 360113, 370289, 372931, 391861, 403702, 396852, 394423, 395781, 397748, 388523, 393318, 400369, 396574, 392575, 397553, 406244, 420069, 424470, 430423, 432188, 436802, 449033, 461428, 478996, 513817, 554479, 604251, 649644, 689653, 712175, 730042, 747733, 744767, 735681, 715042, 691944, 662123, 626989, 614776, 616382, 610400, 585351, 574367, 576880, 578611, 571419, 563483, 561754, 550784, 551378, 558805, 554944, 555057, 560510, 561422, 569772, 584257, 583099, 575888, 570903, 584382, 595179, 595647, 581816, 584907, 586995, 592613, 595667, 607077, 624938, 627155, 631832, 636781, 633523, 633046, 634944, 636853, 649820, 656509, 674516, 688357, 690208, 689746, 700987, 700728]
14756G00728P033P908J2177O241j537M775J0497J3763M491q804j0708J1913J5325
14743G73802K3916L301J558R050j483Q846R027K3586K5236R828R293J0250J1430
14730I17640Q870k8M419J6560J1759J2479J3903K109L050Q067J592J2604K1228
14717A034252J0147J3516J6888J6180R039o563K2028K6531K125J5604J2840J7298
14705A189885J9342Q340J0834J9115J3474J0880J4301N512J1289K7898L8947J3831
14693A383648J3927J4746J1592K0231K1446J7599K4811J6607K5672L5489J8712
14682A604480K6864L2454K2400J6360J1364K3780K2315L0516J9904J9699K1443
14671A851579L1344K3322L3347K2037K3407K8976L6613M0487L4773K5174M4037
$$ y = [700728, 707761, 715669, 727846, 734087, 732550, 737325, 747822, 761585, 766076, 757272, 746564, 758477, 773802, 797718, 801019, 802577, 811627, 810144, 818990, 828017, 851603, 876839, 886667, 895960, 906210, 917640, 926510, 926482, 930901, 947461, 959220, 971699, 985602, 987711, 990761, 998828, 1000420, 1013024, 1034252, 1044399, 1057915, 1074803, 1090983, 1100022, 1093459, 1115487, 1142018, 1144143, 1159747, 1172587, 1189885, 1209227, 1217567, 1228401, 1247516, 1260990, 1271870, 1286171, 1291683, 1302972, 1330870, 1369817, 1383648, 1397575, 1412321, 1423913, 1444144, 1465590, 1483189, 1508000, 1524607, 1550279, 1585768, 1604480, 1631344, 1663798, 1686198, 1702558, 1713922, 1737702, 1760017, 1790533, 1810437, 1830136, 1851579, 1882923, 1906245, 1939592, 1961629, 1985036, 2014012, 2050625, 2091112, 2125885, 2151059, 2195096]
14660B195096L6082K5678K4234M2325M2990L1591K1525K4530M9734M2957M2027
14649B578769M6936O5216M7293L0657N7794N9793M9572M1497L8521M8137O6665
14638C130850N3249N1487O0908O9407P8084O7097L9885O2403P5697P1650N9007
14627C819724O9323O4761O9091P3922P9011R6110R1662R2848J01808R4236J02920
14616D755416R0343J01705J10842J17749R7304J00084J03351J21990J26246J29138
14606E854168J41523J31746J45527J65393J60841J44262J52585J70457J61183
14597G227685J68087J74508J79080J89430J83828K06080K06825K19736K22432
14588H977691K35559K39967K35226K49570K50683K49879K60962K78783K87666
$$ y = [2195096, 2231178, 2256856, 2281090, 2323415, 2366405, 2397996, 2419521, 2444051, 2493785, 2536742, 2578769, 2625705, 2690921, 2738214, 2768871, 2826665, 2886458, 2936030, 2977527, 3016048, 3064185, 3130850, 3184099, 3235586, 3296494, 3365901, 3443985, 3511082, 3550967, 3613370, 3689067, 3760717, 3819724, 3889047, 3953808, 4022899, 4096821, 4175832, 4271942, 4363604, 4456452, 4558260, 4652496, 4755416, 4845759, 4947464, 5058306, 5176055, 5273359, 5373443, 5476794, 5598784, 5725030, 5854168, 5995691, 6127437, 6272964, 6438357, 6599198, 6743460, 6896045, 7066502, 7227685, 7395772, 7570280, 7749360, 7938790, 8122618, 8328698, 8535523, 8755259, 8977691, 9213250, 9453217, 9688443, 9938013, 10188696, 10438575, 10699537, 10978320, 11265986]
14579A1265986K88619K90094K80231K97575L13571L26805L19003L27687L37909
14570A4047480L46169L41035L41692L47593L47476L40165L49687L49855L59789
14561A7170941L56583L39581L32531L35795L14789L17094L08672L00342K80925
14552B0057253K70775K56643K38453K01614J93288J90253J72957J36994J02549
14543B1820779Q1992N4721L7775J5724k0696n0033o2730q9116j18780j38779j59829
14532B1371028j81769k05293k16747k15526k25999k49554k79547l04967k96877
14523A9194749l08054l15763l23273l18987l27323l44506l34465l18657l23318
14514A6280403l46325l47634l38770l42190l38405l15664l28245l14983l00455
$$ y = [11265986, 11554605, 11844699, 12124930, 12422505, 12736076, 13062881, 13381884, 13709571, 14047480, 14393649, 14734684, 15076376, 15423969, 15771445, 16111610, 16461297, 16811152, 17170941, 17527524, 17867105, 18199636, 18535431, 18850220, 19167314, 19475986, 19776328, 20057253, 20328028, 20584671, 20823124, 21024738, 21218026, 21408279, 21581236, 21718230, 21820779, 21902771, 21957492, 21995267, 22010991, 21990295, 21940262, 21877532, 21788416, 21669636, 21530857, 21371028, 21189259, 20983966, 20767219, 20551693, 20325694, 20076140, 19796593, 19491626, 19194749, 18886695, 18570932, 18247659, 17928672, 17601349, 17256843, 16922378, 16603721, 16280403, 15934078, 15586444, 15247674, 14905484, 14567079, 14251415, 13923170, 13608187, 13307732]
14505A3307732l12223l10776k92295k91211k87319k85335k82389k71092k61492
14496A0713600k40449k38457k42543k37918k31204k22470k25822k23798k11351
14487H639588j98199j92275j79800j81795j94815j86056j54122j68162j57411
14478G026953j51863j44917j42834j47602j38865j29039j27745j36572j36622
14469E770894j21702j08389j17251j23013j07430j06380r9535j05857r2030q4195
14459D705112q4443p2640q1933j05742p7997p9182r1740o9825o3601o3591o8389
14448C846029q3037q2939p2350o2908o4750o3356m9517o1619o7406m6778m2259
14437C149110m5681m3133m7231n5059o0593m6795l9397l4294l4695m7735m8194
$$ y = [13307732, 12995509, 12684733, 12392438, 12101227, 11813908, 11528573, 11246184, 10975092, 10713600, 10473151, 10234694, 9992151, 9754233, 9523029, 9300559, 9074737, 8850939, 8639588, 8441389, 8249114, 8069314, 7887519, 7692704, 7506648, 7352526, 7184364, 7026953, 6875090, 6730173, 6587339, 6439737, 6300872, 6171833, 6044088, 5907516, 5770894, 5649192, 5540803, 5423552, 5300539, 5193109, 5086729, 4987194, 4881337, 4789307, 4705112, 4620669, 4548029, 4466096, 4360354, 4282357, 4203175, 4111435, 4041610, 3978009, 3914418, 3846029, 3762992, 3680053, 3607703, 3544795, 3480045, 3416689, 3367172, 3305553, 3238147, 3191369, 3149110, 3103429, 3060296, 3013065, 2958006, 2897413, 2850618, 2811221, 2776927, 2742232, 2694497, 2646303]
14426B646303m3536m3317m1279l3947l1315l2042j6513l8317n5229m0399l2200
14415B238209k2854l9175l5678j4824k6557k7639l1116k9678k2086k9261l1345
14404A927996k1230k1979k2233j1297l7158k7484k7864k3121j8461k6462j9796
14393A670911k0897k3227k5201j2503k0940k4818j6909j4133j8093k4409k1007
14382A448774j8079j8050j5084j5032j3287j5351n549j7465k5714k0921j7625
14371A266617k0294j6981j4411j5520k1686n868J94J827p2l0076j7958j4941j1349
14358A099482J399j2735j7399P004r258j9282j6931j9534q134q816J398j0743
14346I86451j5200q843j0439k650j0822K866J2503k2259k2558j4659j0496j737
$$ y = [2646303, 2602767, 2559450, 2518171, 2484224, 2452909, 2420867, 2404354, 2366037, 2310808, 2270409, 2238209, 2215355, 2176180, 2140502, 2125678, 2099121, 2071482, 2040366, 2010688, 1988602, 1959341, 1927996, 1906766, 1884787, 1862554, 1851257, 1814099, 1786615, 1758751, 1735630, 1717169, 1690707, 1670911, 1650014, 1626787, 1601586, 1589083, 1568143, 1543325, 1526416, 1512283, 1494190, 1469781, 1448774, 1430695, 1412645, 1397561, 1382529, 1369242, 1353891, 1348342, 1330877, 1305163, 1284242, 1266617, 1246323, 1229342, 1214931, 1199411, 1177725, 1171857, 1172051, 1173878, 1173806, 1143730, 1125772, 1110831, 1099482, 1100881, 1088146, 1070747, 1077751, 1068493, 1049211, 1032280, 1012746, 1004612, 995796, 997194, 986451, 971251, 962408, 951969, 949319, 938497, 941363, 953866, 931607, 909049, 894390, 883894, 882157]
14334H82157n584p143j8398j6328L033m210k2417j5724l255k367k533l116R175
14321G93290j1075j7199j257O813n470j7643j4253k2824j4300Q246n489j9485
14309F79354N780P363M458q629P901p452j7828j5131r785p428P834k165o576o582
14295F31114j1567J1865O731j2993r270j0308p499j4221j433M603n926M709J5157
14282F00962N102J0609M256K6723K5793J7031L6611L6406L3798K0924K96r536
14270H08975j7725l6920m9392l7575k9662k3412k4339j9976j7261P770O948l01
14258E67130j9283r046m086k2914j7514j2955j0034q509o883j784j1365n156J8600
14245D56201p429k2780j0248j0175K169J6784J2779j3153j3972J160k511m166
$$ y = [882157, 876573, 869430, 851032, 834704, 837737, 833527, 811110, 795386, 792131, 789764, 787231, 784115, 793290, 782215, 765016, 763759, 770572, 765102, 747459, 733206, 710382, 696082, 704328, 698839, 679354, 685134, 692497, 696955, 688326, 696227, 688775, 670947, 655816, 646031, 638603, 646437, 644272, 637696, 631114, 619547, 631412, 638143, 625150, 615880, 605572, 598073, 583852, 582419, 587022, 581096, 585805, 600962, 606064, 616673, 620929, 647652, 673445, 690476, 727087, 763493, 797291, 818215, 818511, 808975, 791250, 754330, 704938, 667363, 637701, 614289, 589950, 569974, 552713, 560483, 567431, 567130, 547847, 538801, 534715, 511801, 494287, 481332, 471298, 462789, 455906, 454122, 442757, 437601, 456201, 448772, 425992, 415744, 405569, 407738, 424522, 437301, 424148, 410176, 411336, 408825, 404659]
14233D04659l89M110K128o477j5813j1606j205q236n926O639o114p900j3922j3095
14219C26853n06Q529J682N047J099j1128L462N157J31N967n009n801p060K197
14205C30620j0289R928J150j833j694j514j3481l785q304m810O235P370O831k347
14191C14077O559k939p173l670j2589k387O222k687n133r243j0156R653l468l561
14177B73505j47M339J948n443j1810p986j2366R466M815Q906J4229J904j357o569
14163B73434l440l539j368n262J452O697J1306L116k1896j0543k802l884J987
14150B45258r840l367R715L622L032N453n331j7784p192J0259R204l073M824j1909
14136B32871j2107P820M33L142l607k994j3219L095K8489N16p094l017j6064o104
$$ y = [404659, 404270, 408380, 410508, 404031, 388218, 376612, 375407, 367171, 361245, 367884, 361770, 353870, 339948, 326853, 326347, 334876, 336558, 341605, 342704, 331576, 335038, 340195, 340326, 346293, 341284, 335483, 328423, 330620, 320331, 330259, 331409, 329576, 327882, 326368, 312887, 309102, 300798, 295988, 302223, 309593, 316424, 314077, 320636, 317697, 310524, 306854, 294265, 291878, 298100, 295413, 290280, 281037, 270881, 280534, 277066, 273505, 273358, 277697, 279645, 274202, 262392, 254406, 242040, 251506, 256321, 265227, 279456, 281360, 280003, 273434, 269994, 266455, 265087, 259825, 261277, 267974, 279280, 282396, 260500, 249957, 247155, 243271, 245258, 235418, 232051, 241766, 245388, 248420, 253873, 248542, 230758, 223566, 233825, 243029, 239956, 244780, 232871, 220764, 228584, 229017, 232159, 228552, 225558, 212339, 215434, 243923, 244439, 237345, 234328, 218264, 212160]
14122B12160J0209p539j7232J0561j61k4j185O722M408j4614o621R706m598R21
14108B02713k327O843o804k609P805k551o752l03o236n085M707k061p60N188m114
14093A87654K173M272r400k2229r085J0665K3645J2201m767j6423k84k091q38
14080A75493j2767m373K648J390L826n096j2853q869J25K560J6686J0646n593
14067A63823o814j3442Q193J0185o93M58K67k422k852n089N370N876L067q269
14053A57658M364J0436K892L445r541k2695p420n031M061J127J538n922j0968
14040A23944p456K401J3715J9756N83j5252o677N632K215n258P30J915O281K317
14026A44846J513K107j1285j6793M848j200N038M481r788j785J1197o965N55J0548
$$ y = [212160, 222369, 214830, 197598, 208159, 207998, 207974, 206789, 213511, 217919, 203305, 196684, 206390, 201792, 202713, 200386, 207229, 200425, 197816, 205621, 203070, 196318, 196015, 189779, 184694, 189401, 187340, 186580, 191768, 187654, 189827, 194099, 184699, 162470, 153385, 164050, 187695, 199896, 195129, 178706, 178422, 176331, 175493, 162726, 158353, 161001, 162391, 166217, 161121, 148268, 139399, 139524, 142084, 158770, 169416, 163823, 157009, 143567, 151760, 161945, 161252, 161710, 161977, 159555, 156703, 151614, 156984, 162860, 165927, 157658, 162022, 172458, 175350, 178795, 169254, 146559, 139139, 134108, 138169, 139296, 140834, 134912, 123944, 116488, 118889, 132604, 152360, 152943, 137691, 131014, 136646, 138861, 133603, 134333, 136248, 142529, 144846, 146359, 148466, 137181, 120388, 125236, 124036, 129074, 133555, 123767, 121982, 133179, 126214, 126769, 137317]
14012A37317P481m4j4230j1015J4321J7171P939m239p35j0853j5699Q045O784
13999A42243N056N543N635o099p834r618k820o125q770L572J4085J1793m820j5926
13985A25915m834o121l17J3581P852R78M746j6712r307l285l340l544K3004l791
13971A24825j2869M109Q553J112m344q293k520k873L919K131n532O668O944r438
13957A12392m819n146p072j335J1559o670j5369k128P25r077n014J2842N653l066
13943H3475k920J6110N843J947l712J741Q531l550n350n440q65L293O765j3499
13929I2369p557M402Q542o467k777R593L508r192l239J169n427n218k535O354
13915H3525J444M032l625K682l396r403J179k132r630k927r848L426k894O91j3324
$$ y = [137317, 144798, 144754, 130524, 119509, 133830, 151001, 158940, 154701, 153966, 143113, 127414, 135459, 142243, 147299, 152842, 158477, 152378, 144544, 134926, 132106, 125981, 117211, 120783, 134868, 146661, 141841, 125915, 121081, 114960, 114643, 128224, 136076, 137054, 141800, 125088, 115781, 112496, 109156, 105612, 128616, 124825, 111956, 116065, 124618, 125730, 121386, 113093, 110573, 107700, 111619, 113750, 108218, 114886, 121830, 112392, 107573, 102427, 95355, 94020, 105579, 98909, 83540, 81412, 82137, 73060, 68046, 80888, 86541, 83475, 80555, 96665, 102508, 104455, 100743, 102484, 111015, 107465, 102115, 96675, 95810, 99103, 105868, 92369, 84812, 89214, 97756, 91289, 88512, 98105, 101613, 92421, 89182, 90351, 84924, 79706, 77171, 83525, 84969, 89001, 85376, 88058, 84662, 75259, 76438, 74306, 64676, 61749, 51901, 55327, 52433, 53124, 39800]
13900C9800M982K0647J4498M714k418Q696j3720j2770L988N300N166K936j332
13887H0487j2315o746n52j455R323J0342j4155R995Q954Q508p765n218j2890m5
13873F6468J7876K1480J9985J0497K0636L2199N184J13M129k0957l5483k5929
13861A16198l693K627j115j762q591J206o717j2774L473N245J2501K188j0967
13848I7819n709r823m89j416K325R228k2771j7732R720N871m905L797P450M492
13834G7857J4461J5698N304o015J6897J3669J8164J7900M0095N9284Q0774J00445
13822D54533M6833j0668k5488n3013q6955p5301m9545m4584j4731l839l975L935
13810A37202j0995j6968q221q044j3770K208J16l582r102N27r36p672J26J0904
$$ y = [39800, 44782, 65429, 79927, 84641, 82223, 90919, 77199, 64429, 68417, 73717, 78883, 81819, 80487, 68172, 61426, 60874, 59419, 68742, 79084, 64929, 74924, 83878, 92386, 84621, 79403, 66513, 66468, 84344, 105824, 125809, 136306, 156942, 189141, 194325, 194438, 198567, 177610, 142127, 116198, 112505, 115132, 114017, 112255, 103664, 104870, 98153, 85379, 88852, 94097, 106598, 108786, 97819, 92110, 82287, 81798, 80382, 82707, 91935, 69164, 51432, 61152, 67023, 62118, 65915, 73365, 77857, 92318, 108016, 113320, 107305, 124202, 137871, 156035, 173935, 214030, 273314, 354088, 454533, 501366, 490698, 465210, 412197, 325242, 249941, 200396, 155812, 141081, 137242, 133267, 137202, 126207, 109239, 101018, 92974, 79204, 81412, 81528, 77946, 68844, 69371, 68435, 60763, 60889, 71793]
13796G1793j854N240r46r772l1o643NP634J5669N974J489J1831K1857Q394K7417
13781A58057M6098O2798P0895R5540O9061J8690m4353p8471q4150o4769m8382
13770B01014l9777j8035M337j0376k232j2367r083j601j0730j1283j2564r841
13758F7462J29K741k9153j0314Q890O628O611m086k3705K992J3282j184l35J6192
13744E6150K1522q566m916K814j378P532K1117M295l255J8189K3625J4642J4109
13731A65880P949O437r197j8383l0694r856n801j0645j1043n343l082q019j2185
13718E6018k222j721K019n966j4490p974m779J752l306O775L871o107O34Q300
13704C2804P920P152o565p385k619L413n752o548K4697N807j2657n994J387n478
$$ y = [71793, 69939, 75179, 74233, 64461, 64430, 57787, 57792, 65426, 81095, 87069, 88558, 100389, 122246, 130640, 158057, 204155, 266953, 337848, 433388, 502449, 521139, 476786, 398315, 314165, 249396, 201014, 161237, 143202, 147539, 137163, 134931, 122564, 113481, 111880, 101150, 89867, 77303, 67462, 67591, 70332, 41179, 30865, 39755, 46383, 52994, 48908, 25203, 28195, 41477, 40293, 39958, 56150, 77672, 69106, 64190, 67004, 65626, 73158, 94275, 98570, 95315, 113504, 137129, 151771, 165880, 173829, 180266, 171069, 152686, 121992, 112136, 106335, 95690, 84647, 79304, 76222, 68203, 56018, 53796, 52075, 54094, 48128, 33638, 25664, 20885, 22637, 19331, 26106, 29977, 23870, 24504, 32804, 40724, 47876, 41311, 33926, 31307, 34720, 28968, 22420, 47117, 52924, 40267, 34273, 35660, 30182]
13690C0182r467M077j742j139j3969J0707J4307J1575q80j0794L214J651p121
13677C0601j0537L212N117p414J1649J6620q81m685j6547j5599j0072Q997L233
13664A3694J4450J3488L313j4089M135N6Q940j405k1239j1268r502K828J0728
13651A4129j27qp785N153J525o968L102N226l409P334R746l008r413j378O165
13636B0284J2200O408o978j5508N818J5843l48o516m945o689L957O95r199K583
13622A7605J2690Q429J3074J5o35J368m995Q94o328L21J227J5201k298j2610J332
13607D5290l724P0j4976o288r843Q348K312N591P554m962o973K1j794p363J780
13592A5043N831Q428N251k712J08J3520k526p952L514J6079J640j4117N760Q296
$$ y = [30182, 20715, 24792, 23050, 21911, 7942, 18649, 32956, 44531, 43651, 32857, 36071, 37722, 30601, 20064, 23276, 28393, 20979, 32628, 49248, 48367, 43682, 27135, 11536, 1464, 10461, 13694, 28144, 41632, 44945, 30856, 34991, 35047, 43987, 42582, 21343, 10075, 573, 3401, 14129, 14002, 13994, 6209, 11362, 12887, 5919, 9021, 14247, 10838, 18172, 27918, 24910, 15497, 14119, 20284, 32484, 38892, 31914, 16406, 22224, 38067, 37719, 31203, 26258, 19569, 23526, 24221, 15022, 17605, 30295, 38724, 51798, 51813, 51178, 52546, 47551, 48445, 42117, 42438, 43665, 58866, 56568, 43958, 45290, 41566, 41636, 26660, 20372, 10529, 18877, 21189, 26780, 34334, 29372, 22399, 22420, 20626, 13263, 15043, 20874, 29302, 34553, 31841, 31949, 45469, 42943, 34991, 38505, 54584, 56224, 42107, 47867, 56163]
13578E6163n205n207r652l504p42R845P077J2222p110J916K0767l191j1545N959
13564F7793J710j4531k1552j3117q484o694O406J1873n191K071N868N076K121
13551C3349r235j5393j590M476q75K0773O806m497J67J2321M61O371j2103j1221
13537B9810N150j206m394k814m156Q081J6862o122L844O14j0934J882p672q702
13523B0243P637Q822m345j4458r195J3741J8345J7777P243k058j0057j8476K677
13510C7896J56q208L15J272n232J135q471O401J1781J0006L090L31J412J5440
13496F7324j847R5r523j1376P745K856j6404j177o812J0280J0510K202J8536P779
13482H0188Q389k851M335q77N315j8320j1343j724P890J2730N919L089R765o37
$$ y = [56163, 50958, 45751, 36099, 32595, 31853, 41698, 48775, 60997, 53887, 55803, 76570, 73379, 61834, 67793, 69503, 54972, 33420, 20303, 11819, 5125, 11531, 23404, 18213, 20284, 26152, 31228, 33349, 24114, 8721, 7131, 11607, 10732, 31505, 38311, 33814, 33981, 46302, 46763, 53134, 41031, 29810, 34960, 33754, 29360, 26546, 22390, 30471, 47333, 41211, 45055, 45669, 34735, 36617, 28945, 20243, 27880, 36702, 32357, 17899, 8704, 22445, 40790, 58567, 65810, 63752, 53695, 35219, 37896, 38052, 29844, 30159, 31431, 26199, 27334, 18863, 25264, 37045, 47051, 50141, 50472, 51884, 67324, 65477, 65572, 56049, 44673, 52418, 55274, 38870, 37693, 30881, 41161, 51671, 53873, 72409, 80188, 88577, 85726, 90061, 89184, 94499, 76179, 64836, 63112, 71002, 83732, 89651, 92740, 102505, 101868]
13468A01868O241o220j0265Q044J16L929m132m050K335R189P793J091n652r924
13454A00363J0049P950N879j2395o921O691K1520L750J6086J2767K189o09P092
13441A74411N267J4364L0811K5012K1400R415K782J6258J3476K8926L0165K4206
13429C96493L2702K4620L1765L6216N5807Q0333O6533Q0002J12466J43786J71080
13418A231803K21005K78613L63010M73385N99187P98950J114783J613922K353467
13409I048125L434197M691770N203336L663107J063522r83906k922388m408061
13401A8789702m324899l203148k085968j326350q50973n56369l88671l26836l48802
13392E377686m08716m27248m06747l56660k90566k48310j96552j47543j23702
$$ y = [101868, 108109, 101889, 91624, 99668, 99784, 103713, 99581, 95531, 97866, 107055, 114848, 115939, 110287, 100363, 110412, 118362, 124241, 111846, 104925, 111616, 133136, 136886, 152972, 165739, 167928, 167319, 174411, 179678, 194042, 224853, 249865, 271265, 280680, 283462, 299720, 313196, 342122, 372287, 396493, 429195, 453815, 485580, 521796, 577603, 657936, 724469, 804471, 916937, 1060723, 1231803, 1452808, 1731421, 2094431, 2567816, 3167003, 3965953, 5080736, 6694658, 9048125, 12482322, 17174092, 22377428, 26040535, 27104057, 26120151, 23197763, 18789702, 14464803, 11261655, 9175687, 7849337, 6998364, 6441995, 6053324, 5726488, 5377686, 4968970, 4541722, 4134975, 3778315, 3487749, 3239439, 3042887, 2895344, 2771642]
13383B771642r9596o2040k3118K3920N9238J21353J87299K63568L45192M63479
13373D050937O24749P89999J006725J306441J711644K292362L200836M641502
13365A9625195O838797J0056730J4088862J6730549J3077218M016363k649172
13358H1784542q352891j3972609j4499263j0793133o889053m216682k667687j743123
13350A8650101j222393r75457j076920j340327j421238j320971j163615j003410
13342I125770q58869p35933o36194n54445m69188l87011k98641k24582j60349
13333D800558p6701J7560J20766K23676L49975M92299O92432R36333J226433J623927
13323A0407258K214463L091276M481051O615394R738578J3771885J6863419J4129595
$$ y = [2771642, 2672046, 2610006, 2586888, 2610808, 2670046, 2791399, 2978698, 3242266, 3587458, 4050937, 4675686, 5465685, 6472410, 7778851, 9490495, 11782857, 14983693, 19625195, 26463992, 36520722, 50609584, 67340133, 80417351, 84433714, 81784542, 73431651, 59459042, 44959779, 34166646, 27277593, 23060911, 20393224, 18650101, 17427708, 16452251, 15375331, 14035004, 12613766, 11292795, 10129180, 9125770, 8266901, 7530968, 6894774, 6340329, 5871141, 5484130, 5185489, 4960907, 4800558, 4723857, 4741417, 4862183, 5085859, 5435834, 5928133, 6620565, 7556898, 8783331, 10407258, 12621721, 15712997, 20194048, 26809442, 36548020, 50319905, 67183324, 81312919]
13315H1312919N025458k187467p872835j3830007j5144109j1580229p469020m561021
13307B3693689k854823j893528j314940j032774j081306j356107j474742j397578
13299A1287891j240616j070302r35667q13849p11890o18794n30838m60537m04522
13290D500876l49300k88374k21540j60169j04952m9151p770N5158J36927K19444
13280C731149L19324M72787O74628R71860J423484K136488L148244M439260N387683
13271B2704907M578262J919462n06104k484032m378729m937686l953792k649652
13263A0292636j663067j075385p10524m87174l79450m00054m64262n04570m98452
13254D109698m51706l92126l39716k81107k42310k31402k05891j76278j62106
$$ y = [81312919, 86338377, 84150910, 76278075, 62448068, 47303959, 35723730, 28254710, 23693689, 20838866, 18945338, 17630398, 16597624, 15516318, 14160211, 12685469, 11287891, 10047275, 8976973, 8041306, 7227457, 6515567, 5896773, 5365935, 4905398, 4500876, 4151576, 3863202, 3641662, 3481493, 3376541, 3327390, 3319620, 3374778, 3511705, 3731149, 4050473, 4523260, 5197888, 6169748, 7593232, 9729720, 12877964, 17317224, 22704907, 27283169, 29202631, 28696527, 26212495, 21833766, 16896080, 12942288, 10292636, 8629569, 7554184, 6843660, 6356486, 5977036, 5576982, 5112720, 4608150, 4109698, 3657992, 3265866, 2926150, 2645043, 2402733, 2171331, 1965440, 1789162, 1627056]
13245A627056j60604j41643j09366p9870p6567q2392p4839o5304m2106l0583j5089
13234G48693k6011l7656m9605l6289l0607k3041k1092j1933j8951j9384k6661
13223D47463k1096l323j1185k2426j8402j292n747j6644n317o909p678j861j954
13210C23629l787o072r101j3907q293Q295j2562m393j7479j3409j4903j1968n836
13197B10214n450L533J0753J6714o638L72J9397L3464Q576q235m318M040Q95O417
13183B89734k360J078M933M022j45j1701o832m778o925J2798j5862k2200k031
13170B39731j3543j1698n435j3630q861J0823L174q081j0807Q279J912J710m072
13157A89502j0597j0310k818r794j7634l007K42j4702n907O243J565O628J6821
$$ y = [1627056, 1466452, 1324809, 1215443, 1135573, 1059006, 976614, 901775, 836471, 794365, 763782, 748693, 722682, 685026, 635421, 599132, 568525, 545484, 524392, 512459, 493508, 474124, 447463, 426367, 423044, 411859, 389433, 371031, 369739, 363992, 347348, 342031, 335122, 327444, 325583, 323629, 319842, 313770, 304669, 290762, 282469, 290764, 278202, 273809, 256330, 242921, 228018, 216050, 210214, 204764, 208297, 219050, 235764, 229126, 229498, 248895, 282359, 290935, 282700, 278382, 282422, 283317, 289734, 287374, 288452, 293385, 297407, 297262, 285561, 278729, 273951, 267026, 279824, 263962, 241762, 239731, 226188, 214490, 209055, 195425, 186564, 197387, 200561, 192480, 181673, 189952, 191864, 193574, 189502, 178905, 168595, 165777, 155983, 138349, 135342, 135584, 120882, 114975, 121218, 122783, 129411, 146232]
13144A46232O669O996J178q01Q391J0553P363j2231k1516k3504m377N755o686
13131A24022k3505J0721J2519j913k462k302k627j6787m699J994K4864O131J451
13118A27407j687n821p965l249J834l458q042j2362l387Q090j697L380l403k625
13104H7015P442L79n899K475N437N341o684j0250l281O114k058m041L294O35O531
13089I2450O465m117J160M251r857m383L329n222m819M789j631J1600M629n592
13075I3052o492P486o229r908r278J626R836l562j4129J980L19N485m352M58P411
13060G3703P105l126j0772M716j7844n604R427K342q626j1343j3263M023Q650
13047C9388J0418Q952J1392M473L616j147j8701j7716P534j662k118P616O590
$$ y = [146232, 152901, 159897, 161075, 160274, 168665, 179218, 186581, 174350, 152834, 129330, 124953, 130708, 124022, 100517, 111238, 123757, 121844, 119382, 117080, 114453, 97666, 92967, 94961, 119825, 125956, 127407, 125720, 119899, 111934, 108685, 110519, 107061, 99019, 86657, 83270, 91360, 89663, 93043, 89640, 87015, 94457, 94836, 88937, 91412, 96849, 102190, 95506, 85256, 81975, 88089, 86031, 81990, 85284, 85919, 92450, 98915, 94798, 95958, 100209, 90352, 85969, 89298, 84076, 79257, 84046, 82415, 94015, 98644, 93052, 86560, 94046, 87817, 77909, 68631, 70257, 80093, 76531, 62402, 64382, 64701, 70186, 65834, 66292, 73703, 80808, 77682, 66910, 71626, 53782, 48178, 57605, 59947, 51321, 39978, 26715, 30738, 39388, 49806, 58758, 70150, 74623, 78239, 77092, 58391, 40675, 48209, 46547, 44429, 52045, 58635]
13034E8635j3030o146J9416J4710j348j8909q4O678q038R041P65L988q31j6881
13020D7966O746M398o705j465P442K855m681j7857j3345N179O862N468j306k386
13006C9171l650k196N445J5965K159j261q442j3960M460L388N13j9124j2799J906
12992A1575J2142O185K2962R270j362k393L210p200j7027M263O348m304k110K358
12978D3917k038n490J1996k926m191n49J424q487r57L117l152Q46J3729J3545
12964F0784j5916j4746J7455O608j0784m394o13L805K517k17R45M035J058j110
12950D9427j421l873K133j0143K5190O061q980l918m500j208K6216L9033K6285
12937A40302L1167J9503m923j3905j4130l2359j3970k391o908L597k2137j5625
$$ y = [58635, 45605, 39459, 58875, 73585, 72237, 53328, 53244, 59922, 51884, 60925, 61690, 65678, 64847, 47966, 54712, 59110, 52405, 50940, 58382, 61237, 56556, 38699, 25354, 30533, 37395, 42863, 41557, 39171, 35521, 33325, 38770, 54735, 56894, 55633, 47191, 33231, 37691, 41079, 41592, 22468, 9669, 11575, 23717, 29902, 52864, 62134, 60772, 58379, 61589, 54389, 37362, 41625, 47973, 43669, 41559, 43917, 41879, 36389, 48385, 45459, 41268, 40719, 42143, 33656, 32699, 35816, 32664, 33510, 47239, 60784, 44868, 30122, 47577, 54185, 43401, 39007, 38394, 42199, 44716, 44499, 45444, 49479, 50537, 49427, 48006, 44133, 46266, 36123, 61313, 67374, 58394, 54476, 49976, 48768, 74984, 114017, 140302, 171469, 190972, 186049, 172144, 158014, 125655, 111685, 109294, 102386, 105983, 83846, 68221]
12925F8221j0254j1472Q41J132l043j939Q823J2149L655j3748k110N028k732J0882
12911F5433N651R798n822q821r339J0082J596p616J758Q853Q682K570Q785J4611
12897A06221J0413J6609L3713O3724Q8412R7155O7289Q268l9697o3558o7250n6606
12885B64693m1295l6975k2802j9931n866j8105j5541L239o224j4988j2163r621
12873F4421q588j1707N204J4919R458q50l213l093k156l785O70j198k269j3723
12859D4090L373O438O252L942J744K4468K9028J6030K7294J9802M8457O2784Q3942
12846C77644P7846J2186k1095l7525p3493o8278n7452m3339k4174k9829k2870
12835H9621l31Q470l285J0551P359j6798j4962j049r215j4076m899j3753M463
$$ y = [68221, 57967, 46495, 47336, 48468, 45425, 43486, 52309, 64458, 68113, 54365, 52255, 57283, 54551, 65433, 71084, 80882, 75060, 66239, 56900, 66982, 68578, 60962, 62720, 71573, 80255, 82825, 91610, 106221, 116634, 133243, 166956, 230680, 319092, 416247, 483536, 491804, 452107, 388549, 321299, 264693, 223398, 186423, 163621, 143690, 137824, 119719, 104178, 107417, 101193, 86205, 74042, 64421, 55833, 44126, 49330, 64249, 73707, 72857, 69644, 66551, 64395, 60610, 61280, 60082, 57813, 44090, 47463, 53901, 60153, 64095, 65839, 90307, 119335, 135365, 162659, 182461, 230918, 293702, 377644, 455490, 467676, 446581, 409056, 335563, 267285, 209833, 166494, 142320, 112491, 89621, 89290, 97760, 94475, 105026, 112385, 95587, 80625, 79576, 70361, 56285, 51386, 37633, 42096]
12822D2096R677j0247O432K231n204L903o766m328j4276j0715K862R229N835J1591
12808D2320K2931J0410K092R222J4006J7081L6010K1853J5500j1536j7406k1793
12796A40690k3382j7135k4174k3704K029O105l173r186r931j777N746O123J389
12783D9620l516Q38m699o252n87L004j7793r356M961Q251P831pO287Q367J6424
12768F3373j663n690j075J6001K813O791J3991K9984L6483P4609Q6421J03506
12756D25544J52865K29015L31151L92334K63422O4841o0547k12585l54475l27955
12746I03610k13555j37731r2138n4581k4678l6821l0662k4322k7610k2041j6433
12735B23038k6665l4217k1177n94o556j7983p795j990j2107k1207n486j1147r32
$$ y = [42096, 51773, 41526, 47958, 50189, 44985, 48888, 42122, 37794, 23518, 12803, 15665, 24894, 30729, 42320, 65251, 75661, 77753, 86975, 100981, 118062, 154072, 175925, 191425, 179889, 162483, 140690, 117308, 100173, 75999, 52295, 54324, 60429, 57256, 48070, 38139, 36362, 42108, 48231, 49620, 46104, 46942, 42243, 35991, 35404, 38408, 20615, 11259, 16220, 24471, 32302, 32295, 38582, 46949, 63373, 61710, 56020, 54945, 70946, 73759, 80550, 94541, 124525, 161008, 235617, 322038, 425544, 578409, 807424, 1138575, 1530909, 1794331, 1859172, 1798625, 1586040, 1231565, 903610, 690055, 552324, 460186, 405605, 380927, 344106, 313444, 289122, 261512, 239471, 223038, 196373, 162156, 140979, 140385, 133829, 115846, 108051, 106061, 93954, 72747, 67261, 56114, 55182]
12722E5182j0620k4578j3710O636J8707Q821q082m460j4823j3231P092J5449j0365
12709A2018j0325q573J4732J8420M708j4215J629Q248j06J0772j953q117p768
12696A9470K0694J7068j5786k009q805n637o038j0856j685K610M088N729m406
12683A4437l824q752L592L469R979k740P06J0798q006r753o816k366P31J325K81
12668C061K151k244J3808J2425p881m145J98J3253J2104K068j3937M055K97k1740
12654A3473j1575l149J854O784M82J129j98j2029m203l346j2272o924K4425R853
12640D304K44q158K550O944k2896j5912J3540J0562Q471L18n319Q80J584J989
12626h99L580j021J0606Q757J267O817o989n47J6558j133o143M193j2390p906
$$ y = [55182, 44562, 19984, 6274, 12910, 31617, 40438, 32356, 27896, 13073, -158, 6934, 22383, 12018, 1693, -6880, 7852, 26272, 30980, 16765, 18394, 26642, 26536, 37308, 35355, 27238, 19470, 40164, 57232, 41446, 39437, 30632, 24995, 18957, 8101, 6416, 9026, 13114, 18843, 14437, 10613, 1861, 5453, 8922, 18901, 16161, 16867, 27665, 19659, 9906, 3090, 724, 1455, 2780, 3061, 5212, 2968, 16776, 29201, 21320, 17175, 17373, 30626, 42730, 44798, 30861, 34916, 35213, 13473, 1898, -1251, 603, 7387, 7869, 8998, 8800, -3229, -7432, -10778, -23050, -29974, -5549, 4304, 4548, -3610, -1060, 5884, -17012, -32924, -19384, -8822, -351, -33, -5352, -4472, -2888, -899, 2681, 1660, 12266, 21023, 22290, 29107, 22118, 21571, 38129, 36996, 30853, 35046, 22656, 14750]
12612A4750j4240n325P027L587p507J5890L938J5111R435J9339K4423N6980P4799
12599B18207N2400Q104m546l0057o1786o3451l1496r955j6820j3647p009J050
12587D0994n449J1049K048o618j0462j1169J1300K0075J5728M311K2166L580j5139
12574H2414j5476n159J493J9982L452M934J9857J5162K4552L7081L0735j2213
12562B06814k8331j1146k259k3494j8624k6544k5663m325p708j573j6515j2672
12550B7960m845P436J4600J5330j756M572J312O053K946r19N528J057k175K853
12536G9952N783J063r89j4908p075r517j5728j072p699k67P933pq539r131o283
12521A3516r312M526J5199j0793j7789j7169j217R903P242n07O96j210K52P933
$$ y = [14750, 510, -4815, 2212, 5799, -1708, 14182, 18120, 33231, 42666, 62005, 86428, 143408, 218207, 270607, 278711, 274165, 244108, 182322, 118871, 87375, 77420, 60600, 46953, 39944, 40994, 35545, 46594, 48642, 42024, 31562, 20393, 31693, 51768, 67496, 71807, 93973, 97553, 82414, 66938, 61779, 63272, 83254, 86706, 91640, 111497, 126659, 151211, 188292, 219027, 206814, 178483, 167337, 165078, 141584, 122960, 96416, 70753, 66428, 58720, 57147, 40632, 27960, 23115, 30551, 45151, 60481, 58725, 63297, 64609, 70662, 73608, 72689, 78217, 79274, 77099, 79952, 85735, 86798, 85809, 70901, 63826, 54309, 38581, 37509, 29810, 29543, 37476, 37469, 28930, 19799, 13516, 4204, 8730, 23929, 13136, -4653, -21822, -23039, -13136, -5894, -6401, -5705, -6915, -6663, 1270]
12507A270K6414Q875r288j8692k1809j6908K615L6911M9574L7256M2119L9855
12495A78192L8234K1009J1145q935j9724k7796k3489k7685l1897k1547j0734k448
12483G4325J64k234p598j518p195N662l511K764N39J842k622k0307k3136j5567
12469A608R722J8729J0753J265Q155n023n936j211L709K489K6357K9245M2789
12456A42651O0834O6860O8859O3394N2598L4803J0310l36j1308j0525l4363l2750
12444D11027k5830n0715q0094n4310N304K8516L2844L0382M6356J2484j7672j4411
12432C23881k2754j1213Q280J2461q173k309m682j5769j5894j6845m481M306Q41
12419B47649j3365l487m877n342K989q555M698J3127K001K1437J3094O815J0326
$$ y = [1270, 27684, 36559, 27271, 8579, -13230, -30138, -27523, 9388, 58962, 96218, 138337, 178192, 216426, 237435, 248580, 239645, 219921, 192125, 168636, 140951, 109054, 87507, 76773, 74325, 74489, 72255, 64657, 63139, 55944, 61606, 58095, 60859, 61398, 63240, 60618, 40311, 17175, 1608, 11330, 30059, 40812, 42077, 50232, 45209, 39273, 38062, 41771, 44260, 70617, 99862, 142651, 203485, 270345, 339204, 402598, 455196, 489999, 500309, 499973, 488665, 478140, 443777, 411027, 385197, 334482, 254388, 200078, 205382, 233898, 266742, 297124, 343480, 355964, 338292, 323881, 301127, 289914, 298194, 310655, 302482, 300173, 295491, 279722, 263828, 246983, 242502, 246808, 247649, 234284, 230797, 225920, 220578, 223567, 215012, 219710, 232837, 234838, 256275, 269369, 276184, 286510]
12406B86510m891j0477k539m839k2500j4121q675o237P729O575k548p242L374
12393B20119j0889j0629l477j7976P554K2898R198K567m15J0050J1284L906P527
12380B51717O078K3360K6918J5613K1706J1189l164l626R870J0872Q859K4536
12368D03928J2191L121L0813M1893L1196K6066L7811N1653O4515P8946P2526M7732
12356I02391L8620M3510M3642N9491R1189Q3557R2686J06471J00171R1703Q1483
12345A734914Q5041J08545J70544J76800J52053J85541J94969J89546K07492K69595
12335C475040L41549L84455M49345N43018O79488Q27907J017949J312173J658475
12326A0689399K032658K604602L447910M630512O298620Q542015J1667148J6543299
$$ y = [286510, 281619, 271142, 268603, 263764, 241264, 227143, 218468, 212231, 219960, 226535, 223987, 216745, 220119, 209230, 198601, 195124, 177148, 184702, 207600, 216798, 219365, 218950, 229000, 240284, 244190, 251717, 257795, 281155, 308073, 323686, 345392, 356581, 353417, 349791, 359661, 370533, 379392, 403928, 416119, 419240, 450053, 491946, 523142, 549208, 587019, 638672, 703187, 782133, 854659, 902391, 941011, 984521, 1028163, 1087654, 1178843, 1262400, 1355086, 1461557, 1561728, 1653431, 1734914, 1819955, 1928500, 2099044, 2275844, 2427897, 2613438, 2808407, 2997953, 3205445, 3475040, 3816589, 4201044, 4650389, 5193407, 5872895, 6700802, 7718751, 9030924, 10689399, 12722057, 15326659, 18774569, 23405081, 29703701, 38245716, 49912864, 66456163]
12318F6456163K4233021L6114986N3650899P2627588O9687960K8546200l894431
12311C47422386k4855876n3953699o6793406n2706055l3889232k0574487j2979389
12304H1670242q704149n956659m169180l833998m896168n620321n504092m954789
12296C8030886m324140l795771l345121k957651k632399k322608k051014j768229
12288A4833953j538624j348987j184115j029030r02755q00292p36262o68675o23480
12279F001733n79368n10312m55120m06240l27248k84125k40082j95728j65996
12270B837514j56639j32875j19497j11698r2879r9884r8687q5287q0127p5458
12260A784483o7269n3322n5486n0926o9971n8572n0371n5318n2001l9474k1822
$$ y = [66456163, 90689184, 126804170, 180455069, 253082657, 322770617, 351316817, 347422386, 322566510, 268612811, 201819405, 149113350, 115224118, 94649631, 81670242, 72966093, 67009434, 62840254, 59006256, 54110088, 48489767, 42985675, 38030886, 33706746, 29910975, 26565854, 23608203, 20975804, 18653196, 16602182, 14833953, 13295329, 11946342, 10762227, 9733197, 8830442, 8030150, 7293888, 6625213, 6001733, 5422365, 4912053, 4456933, 4050693, 3723445, 3439320, 3199238, 3003510, 2837514, 2680875, 2548000, 2428503, 2316805, 2223926, 2124042, 2025355, 1940068, 1859941, 1784483, 1717214, 1663892, 1608406, 1557480, 1487509, 1428937, 1378566, 1323248, 1271247, 1231773, 1209951]
12249A209951l2949l5909l4593j4751j5419j9565k8170k0237k3981k3555l8949
12238I21873j2311j9652j8519j9352j7946j2464j4664j0372j1215l3225r515q862
12226G33776m765j1973p105k0114k2590k0974k5422k1524l5563j6918j3921j0751
12214E22156K018k00n159l635O888j3205j9648j9399j445n266j3472J1522L878
12201D65033l282j4937k2806k0568k2593j2976o967p137N671k242O779K0622P7087
12188D61684J11260N7096o5981n0124n398k326k1795k6568o746O185q583j0628
12176D38076j1512j8027k2620p510L74n06p43R040J1737L607L021l03k025n377
12162C97232j5494j0672k6359k6015J637K5519K2032q026k749j7171j9163k0492
$$ y = [1209951, 1177002, 1141093, 1106500, 1091749, 1076330, 1056765, 1028595, 1008358, 984377, 960822, 921873, 909562, 889910, 871391, 852039, 834093, 821629, 806965, 796593, 785378, 752153, 742638, 733776, 729011, 717038, 709933, 689819, 667229, 646255, 620833, 599309, 563746, 546828, 532907, 522156, 524174, 523974, 518815, 515180, 522068, 508863, 489215, 469816, 468371, 463105, 449633, 461155, 465033, 461751, 446814, 424008, 403440, 380847, 367871, 360904, 353767, 359438, 357196, 363975, 384597, 461684, 572944, 630040, 564059, 513935, 508537, 506211, 484416, 457848, 451102, 457287, 448704, 438076, 426564, 408537, 385917, 378407, 378781, 378275, 377532, 386572, 398309, 401916, 404937, 404634, 402609, 397232, 381738, 371066, 344707, 318692, 320329, 345848, 367880, 359854, 357105, 339934, 320771, 300279]
12150C00279r341j720l411k274k4409j2108N705R880m664J1276L2655Q624o992
12137C03500k9821l3790j6912k428j4249k6119j3656J1813P913J3504J9839J0010
12125B29604J6528J1776k3092j3548j6651k4550o443J1763K5090J1437P407N684
12113B35005p266p903j6137o178j4869M298K51M841J0212M831j224j1659j2239
12100A81963j2369O22J3986J1030J3703Q904o456k839n206k885k1891l598j4993
12087A59971j1732P436R56j8081p405k638m669k635M285r87J8683K3149P909Q388
12073A82630P529o60j272K712K4944L1384J4877O149L621m248k7246k0057r665
12060B10698r970j7938j5388n862L0995K0577k663k4434m434q26j5086j4063j2139
$$ y = [300279, 290938, 289218, 285807, 283533, 259124, 247016, 252721, 262601, 257937, 269213, 301868, 310492, 303500, 273679, 239889, 222977, 220549, 206300, 180181, 166525, 178338, 186251, 199755, 219594, 229604, 246132, 257908, 234816, 221268, 204617, 180067, 173624, 185387, 210477, 221914, 229321, 235005, 227739, 219836, 203699, 197521, 182652, 186950, 187201, 192042, 202254, 207085, 205861, 194202, 181963, 169594, 170216, 184202, 195232, 208935, 217839, 211383, 208544, 203338, 200453, 178562, 174964, 159971, 148239, 155675, 156631, 138550, 131145, 128507, 123838, 121203, 125488, 124501, 143184, 166333, 174242, 182630, 190159, 189499, 188227, 190939, 215883, 247267, 262144, 268293, 271914, 267666, 240420, 220363, 210698, 200728, 182790, 167402, 161540, 192535, 213112, 210449, 186015, 181581, 180755, 165669, 151606, 139467]
12047A39467r792r230M353J3122J7784j615R810R357K98j6678k6388o256O348
12034A30580m014o565o412Q217J3352p51J889J486j1832K365M22j5032j1708J1026
12020A13023K8190J3481j6850r089n997L106q516j2710j0808j1230j0198l314
12008F9088M971k98K2095m175j4153j0628J2137J8095K142K481J6469J1393O729
11995A36346j7908j6402L087P894J804k483J574j0839K30o026m906j0306J274
11982H3339J9087J223m024r579K0J1333L612j776N933R379k473o696j3953n718
11968H9707p919j1516P943Q26k723J4236Kr388J3398J2480L730J804q332k0216
11954H4032j0558j1900J4576J0624m780l512K718r152M842J8920P523n726q13
$$ y = [139467, 129675, 120445, 124798, 137920, 155704, 154089, 163899, 173256, 173554, 156876, 130488, 124232, 130580, 126566, 120001, 113589, 121806, 135158, 134407, 136296, 137782, 125950, 128315, 128737, 113705, 101997, 113023, 141213, 154694, 137844, 128755, 122758, 125864, 117348, 104638, 93830, 82600, 72402, 69088, 74059, 73761, 95856, 91681, 77528, 66900, 79037, 97132, 99274, 101755, 118224, 129617, 136346, 118438, 102036, 105123, 113017, 114821, 112338, 113912, 103073, 103303, 97277, 92371, 82065, 83339, 102426, 103649, 99625, 90046, 90066, 101399, 105011, 103235, 109168, 118547, 116074, 109378, 95425, 89707, 81788, 70272, 78215, 79041, 76318, 90554, 90556, 81168, 94566, 107046, 110776, 112580, 104248, 84032, 73474, 61574, 76150, 86774, 81994, 78482, 81200, 72048, 76890, 95810, 103333, 97607, 96794]
11941I6794n144j0413n779P465J5317J294j731k613n379p680n419M155j1646r143
11927F0078M6L061J0425M394O034L822j3649k0735p5J1785M537O946N805N53m657
11912G8370J0727L098k056J2989J1258r004p04o250m947m207N112k020k1502j40
11898G0724L345J5616P155j679N017M17J07L867J677L685J3603R766J1718J9121
11884A64139J4970J0352m236o061P627J4450L3207K6315K2469N5988P0220J10747
11872E20187J47665K26797L35021L92285K50539L8747o5472k19362l28666l06983
11862I90758k36159j45115q9149n7855k7806k8437k4028j4010j5471k3456l0127
11851B99145l0952l3727k6764j4272p080k7396j3168j3602j7778j6489p58J7422
$$ y = [96794, 91650, 81237, 75458, 82923, 98240, 99534, 97803, 95190, 89811, 82131, 76712, 80867, 69221, 60078, 60124, 63185, 73610, 78004, 84038, 87860, 74211, 53476, 53401, 65186, 69723, 76669, 82474, 83027, 78370, 89097, 92195, 90139, 103128, 114386, 105382, 104678, 98428, 93481, 89274, 94386, 92366, 70864, 70724, 74069, 89685, 96840, 95161, 100178, 100595, 100702, 104569, 106246, 109931, 123534, 133300, 145018, 164139, 179109, 189461, 185225, 179164, 186791, 201241, 234448, 260763, 283232, 339220, 409440, 520187, 667852, 894649, 1229670, 1621955, 1872494, 1911241, 1845769, 1626407, 1297741, 990758, 754599, 609484, 520335, 462480, 434674, 406237, 382209, 368199, 352728, 329272, 299145, 268193, 234466, 207702, 193430, 186350, 158954, 145786, 132184, 114406, 97917, 97159, 114581]
11839A14581J541o942j2430j0690N530O155j3884n889l690J3638J1680m315j2517
11826H2768j1750M947m459R3J1789P38k184j4843j16P851N38j4003p03o759L491
11811E7398Q863J631M277j1757j2128j2257q48N321R220P251l409L76j0845j0114
11797C2979R821Q039k782j035m760R401P166J3946J6288j2552o652o815P249p88
11783F9505K472M609N234q534o334p526n760o318J550j1176L129n489o205J6902
11769D6059K1229j674J347K57o327r543j0957M653j676o580P424m592N309l79
11755D4550k550K630J707P149O506m658n436O237J018r168j3507m10P844K675
11741D4587l502j0882j8396N235J1581J945j0190M874J3283P259J5312n707j0070
$$ y = [114581, 116122, 109180, 96750, 86060, 91590, 97745, 83861, 77972, 74282, 87920, 99600, 95285, 82768, 71018, 75965, 71506, 71599, 83388, 84126, 81942, 67099, 66983, 74834, 75372, 61369, 60666, 53907, 57398, 66261, 67892, 72169, 60412, 48284, 36027, 35179, 40500, 49720, 56971, 53562, 53938, 43093, 32979, 42800, 50839, 48057, 47022, 42262, 51663, 58829, 72775, 89063, 76511, 69859, 63044, 70293, 69505, 71977, 76586, 81820, 73286, 66952, 59426, 53666, 47348, 48898, 37722, 40851, 35362, 29157, 46059, 67288, 65614, 66961, 67218, 60891, 51348, 40391, 45044, 43368, 36788, 44212, 39620, 44929, 44550, 42000, 44630, 46337, 53486, 59992, 55334, 49898, 56135, 57153, 47985, 34478, 34068, 41912, 44587, 41085, 30203, 11807, 17042, 28623, 30568, 20378, 25252, 38535, 45794, 61106, 55399, 45329]
11728D5329p265k497N825j154K533P412K8001N314l2k0288n239O644Q628m329
11714F8882p886K358m709q441j0202o064n231J0050J4799l565r110j4638n009
11701B1234P861R228q237N324k304K427J0087k778l869o655J868P142j18j7694
11687B3516J218J2738J0417j7830r006J8294K7105N296p951l274j5074j5302l91
11674B9756l432N394M164l927n084K090N140J182P208j3968o021j64P380m339
11660B5379O357q1q061o781l308P131k704o32R636K777m065O935Q582P102o587
11645D1680N282m979j6141l136K4038L591j5510J143R978O58M031l277j1389n285
11631C0684o846O155N603p13o767n412m100N464J5144q59J695R54J3420M306m732
$$ y = [45329, 38064, 35567, 41392, 40238, 42771, 50183, 78184, 83498, 83466, 63178, 57939, 64583, 73211, 68882, 60996, 63354, 58645, 50204, 40002, 33938, 28707, 38757, 53556, 49991, 40881, 26243, 21234, 29095, 38323, 30086, 35410, 33106, 35533, 45620, 42842, 38973, 32318, 34186, 41328, 41210, 23516, 24734, 37472, 47889, 30059, 21053, 39347, 66452, 71748, 63797, 60523, 45449, 30147, 29756, 26324, 31718, 35882, 31955, 26871, 28961, 34101, 35283, 42491, 28523, 22502, 22338, 29718, 25379, 31736, 31655, 23594, 16813, 13505, 20636, 17932, 17300, 26936, 29713, 25648, 32583, 41165, 48267, 41680, 46962, 41983, 25842, 22706, 46744, 50335, 34825, 35968, 45946, 46604, 50635, 47358, 35969, 30684, 23838, 29993, 35596, 34883, 28116, 22704, 18604, 24068, 39212, 38353, 40048, 41002, 54422, 58728, 53996]
11616E3996r159r76O151O128N452J0116j099k1253m273k868k544O111J1351m179
11602E2954j4118j0193M124n607p226k803j375P467j2290J0440J3034J7633R830
11589F1870r799j9197J0070r02j4326q896J368M552o694R184J6008O822k717J4319
11575F1662R326j4719r298J5216j8736k2673P608K761j4502Q123J2045j671r054
11562B6088r706J531P583R927J2305o755K370Q418j2368N505L628m091l783n074
11548C5578l457r42M816J112K827l089j1113j68R634J7101J6674O834N95L235
11534G9637q811l895J409M39K222m342n316j183l671j3700J573J9824L103k1619
11520D5670k4J5544m49J4938k640j3385n319N457M24j0617L8j426n556j2109P132
$$ y = [53996, 44837, 43861, 50012, 56140, 61592, 71708, 70609, 49356, 45083, 42215, 39671, 45782, 57133, 52954, 38836, 28643, 32767, 27160, 19934, 17131, 15756, 23223, 10933, 21373, 34407, 52040, 61870, 52071, 32874, 42944, 42042, 27716, 18820, 20188, 24740, 18046, 27230, 43238, 50060, 47343, 61662, 70988, 56269, 46971, 62187, 43451, 20778, 28386, 31147, 16645, 24768, 36813, 35142, 26088, 16382, 17913, 25496, 35423, 47728, 40973, 43343, 51761, 39393, 44898, 48526, 44435, 40652, 35578, 32121, 31179, 35995, 37107, 39934, 36845, 25732, 25564, 35198, 52299, 68973, 75807, 76402, 79637, 70826, 66931, 68340, 68779, 71001, 66659, 61343, 60160, 56489, 42789, 44362, 64186, 67289, 45670, 45646, 61190, 60741, 75679, 73039, 59654, 54335, 59792, 60216, 49599, 49637, 48211, 42655, 30546, 37678]
11505C7678K3682j648j4529m395l380p252j2565L464J2245m572n692M732K205
11492B9973M758l451o716O957M806Q87q490j5969L410J8528M039k029m810O400
11478C8293J943r809J3751P875l045Q96j2871J329P074j454o0L102j164j2785
11464C3075m782Q045J040o243j6219k417o526m252M046J3217P102j484o248o367
11450A1987l347O176O971P552R380N220K459L60L86n908j0913r399k819o513L906
11435A5498n165L886J8913J1305L326O782K612n495l31r384p018k654M140q931
11421B7484j4347j4674Q159N036k956R13J1267J2447O775k300r07j3626m973N354
11407B3652O403Q498o132p347J339J927m871n809q12J567r53n073J0631M811O453
$$ y = [37678, 61360, 59712, 45183, 40788, 37408, 30156, 17591, 21055, 33300, 28728, 23036, 27768, 29973, 34731, 31280, 24564, 31521, 36327, 37214, 28724, 12755, 16165, 34693, 38732, 36703, 31893, 38293, 40236, 30427, 44178, 52053, 49008, 49904, 37033, 38362, 45436, 43982, 43922, 47024, 45860, 33075, 28293, 36338, 37378, 31135, 14916, 12499, 5973, 1721, 5767, 18984, 26086, 24602, 18354, 11987, 8640, 14816, 21787, 29339, 38719, 43939, 46398, 46758, 47144, 41236, 30323, 20924, 18105, 11592, 15498, 10333, 14219, 33132, 44437, 47763, 54545, 57157, 51662, 51331, 41947, 34929, 32275, 36415, 27484, 13137, -1537, 6622, 11658, 8702, 9615, 20882, 33329, 40104, 37804, 36897, 23271, 18298, 23652, 30055, 38553, 32421, 25074, 26413, 28340, 23469, 17660, 16848, 18415, 17462, 12389, 23020, 27831, 34284]
11392C4284O688L091n911J0172J6031J9183L7988L2197J6246j0985k651q719l6480
11379A11134k4507j856J211O330j2041Q815o184n351l217k1330j3345j449m887
11366C3323j0631J4308K8124J9248k992l54P864K944J5385K770q789j6789o965
11353G7446j057j2450n588l077j179p116q84P158K855j4765j5070k847P580q703
11339B2303n246O182N131N902J475O816L404J7l283j1717k549P772M090J3544
11325E3841j0044j7874L131J36j800o730j9728L037M857J5069J1138p333K914
11312C0614o377P975m323l68L90K736j0383m072O946m728K648P528Q668r607p227
11297B0420N379J0395P419j659l328j4649j3631n623R480r02M186N605R211J7837
$$ y = [34284, 40972, 44063, 38152, 48324, 64355, 83538, 121526, 153723, 169969, 158984, 156333, 147614, 111134, 86627, 84771, 85982, 92312, 80271, 89086, 82902, 77551, 74334, 53004, 39659, 38210, 33323, 22692, 37000, 65124, 84372, 81380, 81026, 88890, 91834, 107219, 109989, 101200, 84411, 77446, 76389, 63939, 58351, 55274, 54095, 46979, 46095, 53253, 56108, 41343, 26273, 23426, 31006, 22303, 17057, 23239, 28370, 34272, 35747, 42563, 45967, 45984, 42701, 30984, 28435, 36207, 40297, 53841, 43797, 25923, 29054, 29190, 27390, 20660, 932, 3969, 8826, 23895, 35033, 27700, 30614, 24237, 32212, 27889, 27521, 27911, 30647, 20264, 16192, 23138, 18410, 21058, 28586, 37254, 27647, 20420, 25799, 36194, 43613, 41954, 38626, 23977, 10346, 4723, 14203, 13301, 17487, 23092, 32303, 50140]
11283E0140q223o149k3326k001j1924O346M005l146J822K2011N119j1151l449
11270B0074O162N700J1624q05q048k728j8237j8856L171R6L917n295j0184k634
11256a6043K2812L672L97Q872o279j2643r472J8619J4714M810P45m463O876o223
11242B6394j0863L210m491j2359N404j144L429M549M900j1882j6751j429J3691
11229B658J5035L196j2022j1105K30J4341R095R237K999j9437j1350j2261o086
11216a5470L233q329R765R789Q358Q916p765j623r883j4929O455K7065J3133p013
11202B1702n280Q013p578j4016j2556l908K673J4967Q351J1090J48J94p913M42
11188A6329J09J1334M287n936j8872J1947J1563k308n668q293j0298k164J0401
$$ y = [50140, 41917, 35768, 12442, 10441, -1483, 4863, 8868, 5722, 7544, 29555, 34674, 23523, 20074, 26236, 31936, 43560, 42755, 34707, 31979, 13742, -5114, -1943, -1847, 2070, -3225, -13409, -16043, 6769, 10441, 10838, 19710, 13431, 788, -8684, 9935, 24649, 29459, 30204, 25741, 32617, 26394, 15531, 18741, 14250, 1891, 7295, 6151, 9580, 14129, 19029, 7147, -9604, -11033, 2658, 17693, 20889, 8867, -2238, -2008, 12333, 21428, 30665, 33664, 14227, 2877, -9384, -15470, -12237, -20566, -10801, -1012, 7346, 16262, 8497, 6874, -3009, -17938, -11483, 15582, 28715, 21702, 16422, 24435, 16857, 2841, -9715, -13623, -10950, 4017, 12368, 23458, 23606, 23800, 15887, 16329, 16438, 27772, 32059, 26123, 7251, 19198, 30761, 28453, 22785, 14492, 4194, 2030, 12431]
11175A2431p12N846P794m083n068k219k055o484N652K776q509k927o140J0028
11161F330j1643l992Q936J8561N015k0488j4217o59J228J1177Q493O941Q103p243
11147A6542NN869q920m250k703J1584K745L491r586k030J1383k880o329r80j0183
11132C758J943k533j128O11J2859R028n174j4658P572K604p922l361K111K425
11118H135q6k528O442J1398r767k751P10p209l289K957j365M887Q623J1352Q136
11103C5645j030j3053q65n278j0169o448R171R954P565j311n852q869j2540q988
11089a2068J389J6993J6883k682L704k3632m321J306J041m73n78q755M006Q639
11075A452M909K966J0123j169r909M306J4864K717j2398j2482K558r666j3044
$$ y = [12431, 11719, 17565, 25359, 21276, 16208, 13989, 11934, 5450, 11102, 13878, 5369, 2442, -3698, 6330, -5313, -9305, -369, 18192, 23207, 2719, -11498, -12157, -10929, 248, 8741, 15682, 23785, 16542, 16547, 22416, 13496, 9246, 6543, 18127, 20872, 24363, 14777, 12747, 24130, 21250, 14921, 13941, 3758, 5701, 3168, 2040, 2651, 15510, 24538, 19364, 4706, 12278, 14882, 6960, 3599, 5710, 8135, 8049, 5521, 11963, 23361, 13594, 10843, 11553, 4344, 1055, 4012, 2647, 7534, 16157, 27509, 35645, 34615, 21562, 20697, 15419, 5250, -1198, 7973, 17927, 25492, 24181, 18329, 9460, -3080, -12068, -10679, 6314, 23197, 20515, 24219, 587, -3734, -2428, -1387, -1860, -2438, -11193, -7187, 1452, 6361, 9327, 19450, 18281, 8372, 12678, 27542, 30259, 17861, 5379, 7937, -1729, -14773]
11062a4773J4789J3570j719O75o319p623l991o897L739Q257m364O695Q910Q456
11048A9405L021L251m506j0991p382j527q878M75K607J274J797J883o720O287
11034dJ616Q325K706J463r27j3034k210n31K379l205L070O44n27q199q933P933
11018i434O853K0522K202j2979j6833J68R75P303K938N42q298J0133J3608j0225
11004G475k460k964k911J0331p305p605M614P715q967J0606J0336O877l510l793
10990A8439j1827L319k699j6195R571q92r094J1063R165J1604r226k4727j190
10977a2689J3478P330J0847J2121j2744j1826N427L012j8040m24O423m706r655
10964a1446p140k564R295P277J1311P915R398P053J490j7558k2676q094O815N405
$$ y = [-14773, 16, 13586, 11867, 12542, 6223, -1400, -5391, -12288, -8549, -292, -4656, 2039, 10949, 19405, 22426, 25677, 21171, 10180, 2798, 1271, -7607, -7132, -4525, -3251, -1454, 429, -6291, -4, 1612, 9937, 12643, 14106, 13179, 145, -2065, -2596, -217, -3422, -352, 292, -235, -8434, -17367, -9434, -2581, 17941, 20143, 7164, -9669, -9501, -8526, -1223, 1715, 2257, -6041, 4092, 17700, 7475, 5015, 2051, -860, 9471, 2166, -5439, -825, 6890, -2077, 8529, 18865, 25742, 22232, 18439, 6612, 9931, 7232, -8963, 608, -284, -9378, 1685, 10850, 22454, 13228, -11499, -12689, 789, 8119, 18966, 31087, 18343, 6517, 11944, 14956, -3084, -3508, 2915, -1791, -11446, -18586, -21150, -11855, -4578, 6733, 14648, 24046, 31099, 32589, 15031, -7645, -15739, -8924, -3519]
10950c519J3333P166k088m226J0469j7976j1437L120n080j8593M384O171M299
10937a3977N726M593L348k421N784J526p191O647J2613k448k6991j9081M534J2763
10923a4575J4893L580j7179J376R439M745m66k502L046j798R509m458k941l165
10909d96q97R392M864j3267j4214l18J3725l138m105N825k703j594K876J108J151
10894a791q360l626m092Q558O154p14J574k696O312O972q312k8048J589J1771
10880a4709J4826q355o246m437J4314J6573J167n885m734K479P430J627p379j1174
10866d503j2029J68L968J3392O229J191J322k45l998J663J201p530n311n582l693
10851a3757l555n496Q260J3912J126L934j6297r16O836J0377J520k093l388J96
$$ y = [-3519, 9814, 16980, 14892, 10666, 21135, 3159, -8278, -5158, -10238, -28831, -24447, -18276, -13977, -8251, -3658, -310, -2731, 3053, 4579, -2612, 4035, 16648, 14200, -12791, -31872, -27338, -14575, 318, 3898, -13281, -11905, -2466, 2279, 1813, -689, 2357, 559, 10068, 5610, 2669, -496, -1393, 7999, 12863, -404, -14618, -14936, -1211, -4349, -8454, -2629, -5332, -6926, -4050, -2942, -1791, -10151, -13777, -17869, -9311, -3157, -3871, -2297, -4993, 1319, 8291, -21, -28069, -26480, -14709, 117, -8238, -14484, -18921, -4607, 11966, 13133, 7248, 2514, 4993, 12423, 14050, 6671, -4503, -16532, -16364, -12396, 996, 7225, 8416, 9738, 9493, 5495, 7158, 8359, 829, -4482, -10064, -13757, -17312, -22808, -14548, -636, 490, 4424, -11873, -12789, -5953, 4424, 5944, 3851, 463, 659]
10837F59K999P001k897n965j501q711J770M979J6285Q013K941n510K814N33j031
10822B2379O335J131j2525o5q110o255J2l593l4O928R628J1401K704j8738r64
10807A0234j230j577o031Q28J0967Q54j3603r330l873m71L983O322J3549P333
10793A7955n61q974q627j0663L452J0069P475L409K4055J3231j158j4378l755
10780C1530n39L92m713k1771p044n272l788K17J5528L323o609R57k377J4118N914
10765A9866q562q401L394k477l26J3k3P863k568j5045q432j2166J330J5827P575
10750b132o480%K798N888O417j605M24o382M233J718M992R890j7728k4562p312
10735b9841N307k599J5123J5687j4159R030O424j834j933r077o433Q993N962N434
$$ y = [659, 3658, 10659, 7762, 1797, 296, -8415, -6645, -1666, 14619, 22632, 25573, 20063, 22877, 23410, 22379, 28714, 29845, 17320, 17255, 9145, 2890, 2902, -691, -725, 6203, 15831, 27232, 29936, 11198, 10234, 9004, 7427, 1396, 2224, 13191, 14045, 442, -8888, -12761, -13232, -9249, -2927, 10622, 17955, 17394, 8420, -207, -10870, -7418, 2651, 10126, 13535, 37590, 50821, 49663, 35285, 31530, 30991, 31383, 26670, 4899, -2145, -7417, -11205, -10988, 4540, 7863, 1254, 2211, -166, 13952, 19866, 11304, 2903, 6297, 3820, 3494, 3507, 3484, 11347, 8779, -6266, -14698, -26864, -25534, -9707, -2132, -8612, -8612, -5814, 74, 6491, 4886, 5310, -1072, 3161, 4879, 9871, 19761, 2033, -22529, -29841, -24534, -27133, -12010, 3677, -10482, -1452, 4972, 3138, 1205, -7872, -14305, -5312, 650, 6084]
10721F084M120K615k924o168n398q036j037l610J71J404N736k315O416O544j0371
10706f769j670K298o049J103J1318J7436j0066r058J1829N497o687j4732r499
10693a5049M533J21J373M390K373q15q059Q234J1760j4629j1551N714R65l803
10679a4443q452K43J2293N276J2611n886R619O13r090P38m562j43J6553O771o962
10664A5179j4156N589Q733r347q875P86j0960P558j569m204k860O888J8734J0123
10650B1619O779P940o982p406o065n451q210k832M575o617j0506n557r919J3471
10636a5161k62m820k861M256q941K667j303J80O311q599p236J0774K3089Q359
10622F453m24l886L018k811n894l123P592M53n622j1243q906n384P358O103n31
$$ y = [6084, 10204, 12819, 9895, 3727, -1671, -9707, -10744, -14354, -14183, -12779, -7043, -9358, -2942, 3602, -6769, -8439, -6141, -12190, -11087, 231, 17667, 7601, -1457, 10372, 15869, 9182, -5550, -15049, -10516, -10395, -9022, -4632, -2259, -3074, -11133, -2899, 8861, -5768, -17319, -11605, -10640, -14443, -22895, -22652, -10359, -5083, 7528, 1642, 11261, 11874, 2784, 3522, -1040, -1183, 15370, 22141, 15179, 1023, 6612, 15345, 5998, -2877, -2091, -13051, -5493, -7062, -11266, -14126, -7238, 11496, 21619, 28398, 36338, 29356, 21950, 15885, 10434, 2224, -608, 3967, -2650, -13156, -18713, -28632, -15161, -15423, -20243, -23104, -18848, -27789, -25122, -26425, -26245, -19934, -28533, -35769, -24995, -1906, 6453, 6029, 2143, 5161, 2350, -3544, -6667, 925, 1378, -4244, -15487, -24393, -29777, -22419, -16316, -16847]
10607a6847r441m125K93k806J5515J1369n134Q774O308j26j7586n35J6445J004
10593C108o019l115P183R344m833l213L894q21P881j187R879r361L935j5986j915
10578a226P472J056N063M511o965k250J2220j182j3577j7435k084N595J0078J0309
10564A1585l908Q899R45j4803j0293L440r574j419M435J789J2198Q124n921O428
10550A1925J410J364O171r000j5196J329J7861J857l491L505L626j0827j1781
10537a247o373P276j1399l864O26P087J1710P030K376L106N155j2626q875q309
10523h327j1403j2630J334J4133J3949j2418j566L81J0127L31M80p1L418J48o199
10508h313J50L569J648J236p749M898p277J1580O994K790Q746R169L326k0658
$$ y = [-16847, -26288, -30413, -30120, -32926, -17411, -6042, -11176, -2402, 3906, 3780, -13806, -14341, 2104, 3108, -2911, -6026, 1157, 10501, 5668, 2455, 6349, 5528, 13409, 12222, 22101, 12740, 16675, 689, -1226, 6246, 7302, 12365, 16876, 9911, 7661, 19881, 18699, 5122, -12313, -14397, -8802, 1276, 11585, 7677, 16576, 17521, 2718, -7575, -4135, -13709, -15128, -10693, -8904, 3294, 11418, 5497, 11925, 13335, 14699, 20870, 11870, -3326, -1997, 15864, 17721, 14230, 17735, 21361, 10534, -1247, -7620, -344, -11743, -15607, -14981, -7894, 3816, 10846, 13222, 16328, 21483, 8857, -18, -8327, -19730, -32360, -31026, -16893, -2944, -15362, -16928, -16547, -6420, -6089, -5609, -5680, -2262, -2114, -8313, -8163, -4594, -2946, -1710, -9459, -4561, -11838, -258, 6736, 9526, 18272, 27441, 30767, 10109]
10494A0109j5948j4652M934J4815J0290o91R542j1693K026j1033j4710k011J3341
10481e681J0387k949L151j896j4517o871J0399R186j0761L413J795K668k531k764
10467f971j682L652o078j0880n143L590J4198J8051R283p442k0618l318M932Q077
10453c49P67J929P51j1986j758l235N100n94n528q436N126J541q620k788J8077
10438a0003m78q916m935N792Q382k628m634N368J657M643J1032R634j6963j2323
10424a4372L640N027j0013P121N4K602o355m624o309J1095J0234R234p851j064
10410a581N030K554p853m576O3P681O79r812J3275Q319j5995j2502o42J3293r
10395b076K866P243k623M60K651L425q842l717O551j0551n186J3445n233p145
$$ y = [10109, -5839, -20491, -15557, -742, 9548, 8857, 18399, 6706, 8732, -2301, -17011, -19022, -5681, 4706, 1757, 4908, 3012, -11505, -18376, -7977, 1209, -9552, -6139, -4344, -1676, -4207, -6971, -8653, -5001, -11079, -21959, -27102, -23512, -9314, 8737, 18020, 10578, -10040, -13358, -8426, -349, 418, 2347, 3098, -8888, -10646, -13881, -8781, -9375, -14903, -23339, -18213, -16672, -25292, -28080, -10003, -10481, -19397, -24332, -18540, -10158, -12786, -17420, -12052, -10395, -5752, 5280, 14914, -2049, -14372, -10732, -5705, -15718, -8597, -8543, -5941, -12296, -16920, -23229, -12134, -1900, 7334, -517, -1581, 3449, 6003, -1850, -6426, -6363, 1318, 1997, -7815, 5460, 13779, -2216, -14718, -15360, -2067, -2076, 790, 8033, 5410, 5870, 8521, 11946, 3104, -613, 5938, -4613, -9799, 3646, -1587, -8732]
10381h732L386J0931L539j6115q726j510J2583J3504j7958o246Q764R360N238
10368H018P553o932M861l832r006q833Q121p002o792k729K37J5025J1780j978
10354H491K558n432j8215k363J2439o335m902LM111K139J2022L803L669o036m363
10339A589o528n391J046j634O836M337j532K83P177j4597j3201J0055K3729j481
10325A0688j7118O132l283j704Q563m446m497m799J6579o26Q49q475J021R471
10311H355l16n698O22K138K191k387j2298k402j391J535K345L134k246k0694P11
10296b6401J0025l131o369P441J6195J0762M814J248L944l7J489p247j2983m298
10282d548m478q089j3803P958J2288L113J5208J1089j0565k0520j5529p997J842
$$ y = [-8732, -5346, 5585, 9124, -6991, -15717, -17227, -4644, 8860, -9098, -15344, -6580, 2780, 8018, 15571, 8639, 13500, 9668, 662, -8171, -50, -7052, -13844, -16573, -16336, -1311, 10469, 8491, 11049, 5617, -12598, -14961, -2522, -8857, -13759, -13756, -9645, -7506, 4516, 8319, 11988, 5952, 1589, -4939, -10330, -9284, -10918, -4082, 255, -1277, -994, 6183, -8414, -21615, -11560, 12169, 10688, -6430, -298, -3581, -5285, 3278, -1168, -5665, -10464, 6115, 5489, 6338, -2137, -1116, 8355, 8039, 2341, 2963, 5101, 7292, 4905, -7393, -9795, -11186, -9651, -7306, -4172, -6418, -27112, -26401, -16376, -19507, -25876, -18435, -2240, 8522, 13336, 14584, 18528, 18491, 19980, 12733, -250, -4548, -9026, -17115, -30918, -22960, -10672, -7559, 7649, 18738, 8173, -12347, -27876, -35873, -34031]
10269c4031j364J0738K0950J0203L720M475O682J81K125r356k4823j968M899J290
10255f279J345m827k1366J180M952N433J4015J3411p081K7k352l342O551M920
10241F587l586L378j4280p223J0576J1752K594N554j4186j9797k875O064K2J2543
10227b877Q873j206N597K62j1363r920J2721k786j1634p386K305M366M138p116
10213a6026n158L577Q405J2992J608r454L11j067l605L101k485K251J1870J014
10199G334j1891K045j437j454L38k148k838J490k515M632R811j4452r478j2939
10185c3502N050P990K868Q902J635J614Q064p5l327k046O578N535j0032K800k85
10170A769q589O054L543l502k055n502j0581N172J7701J925l13O442L324j0689
$$ y = [-34031, -35395, -24657, -3707, 6496, 10216, 14691, 21373, 21554, 23679, 14323, -10500, -12468, -7569, -6279, -4934, -9761, -31127, -29947, -24995, -19562, -5547, 7864, 783, 810, -1542, -4884, 1667, 6587, 3001, 6379, -7901, -15124, -4548, 7204, 9798, 15352, 1166, -18631, -21506, -15442, -15420, -2877, 5996, 4790, 10387, 10649, -714, -10634, 2087, -699, -12333, -19719, -17414, -13048, -8910, -16026, -21184, -17607, -9202, 3790, 5398, -4056, -3745, -4812, -8417, -5316, -7801, -5550, 6320, 7334, -4557, -2512, -3949, -5403, -5065, -7213, -10051, -8561, -11076, -6444, 3367, -11085, -20563, -33502, -28452, -20462, -17594, -8692, -7057, -5443, 2621, 2546, -781, -2827, 3751, 9286, -746, 2054, 1769, -6820, -766, 2777, -725, -2780, -8282, -18863, -13691, 4010, 5935, 5622, 12064, 15388, 4699]
10156D699q052K056P85K686l396m781J0270R124L955q840j8955K678J9025J3456
10142B4710J551j8018J680M24M95j318k384j4513J036M270L772j3426j918j999
10128a5638R429J1153k298n125j3523l831l45p769k055J2638Q479N191o182j6076
10114b5952R362J4420J70n477p009N013N132O926R033K262o018j6194r518J4147
10100c703O624j3163n306J0003R597j080N123J17j9498m97j02m45J2195m074k3362
10085b7571j50L942P507Q24R875L271o615k228J540k039l124O473N409N594k134
10070E74j28N997L029j9399n894M246L564J097j2315o40J0371K289p439n114J339
10055a8423K240Q58P842N420N41M353n710j603r374l514k183o054L47J1894J3200
$$ y = [4699, -3353, -1297, -512, 2174, -1222, -6003, 4267, 13391, 17346, 8506, -10449, -7771, 11254, 24710, 26261, 8243, 9923, 10347, 10842, 9524, 7140, -7373, -6337, -2067, 1705, -11721, -13639, -15638, -6209, 4944, 2646, -2479, -16002, -19833, -20178, -27947, -30002, -17364, -8885, -3694, -9876, -25952, -16590, -2170, -2000, -7477, -14486, -9473, -4341, 2585, 11618, 13880, 7862, -8332, -17850, -3703, 2921, -10242, -15548, -5545, 4052, 2972, 8095, 8212, -11286, -11783, -11885, -12330, -135, -4209, -27571, -27721, -23779, -16272, -15448, -5573, -2302, -8917, -11145, -9605, -11644, -14768, -8295, -2886, 2708, 574, 446, 6443, 9472, -9927, -15821, -11575, -8011, -6914, -19229, -19869, -9498, -7209, -14648, -19762, -18423, -16183, -15325, -7483, -2063, -1522, 2831, -2879, -4482, -13856, -17370, -19553, -25607, -25260, -13366, -166]
10040a66J1815l825q364j6099J4482J2379M66R174M252q248j0568o847q768qo109
10025a6434J1006J2345n611j3853j0540r604P328J5319q531J7847n768j156k74
10012g926m889o368M39J3097Q84K376O069l25l778l710q691r328M384J7721p50
9997g95M342O128L965j0712m611O98m832o42j315m004p96N900K0558l601j5846
9982e563n495k995r101R369L153R502j1849j587K734J0930j109K043m948r870
9968a4786M187K35J1774N882m664l341J0033O483o997n533m111j8803N824J4904
9954A087J1275J0849M59n983j3906M772j356r357j2536l200Q583M217k604P96
9940f904j049M844Q637Q93n87N04N987r912j372m508J267P178J505q496J0200
$$ y = [-166, 11649, 7824, -540, -16639, -2157, 10222, 10688, 19862, 24114, 15866, 5298, -1549, -10317, -10325, -16434, -5428, 6917, 1306, -12547, -23087, -32691, -25363, -10044, -18575, -728, -6496, -7652, -7926, -12815, -19183, -18744, -5647, -4763, -2387, 3682, 3357, -421, -4131, -12822, -22150, -17766, -45, -795, 3547, 9675, 13640, 2928, -1683, -985, -5817, -6459, -7774, -11778, -12574, -6674, 13884, 10283, -5563, -11058, -14053, -23154, -13785, -10632, -1130, -12979, -14566, -11832, -902, -2011, 32, -4916, -14786, -10599, -10364, 1410, 7292, 2628, -713, 9320, 15803, 8806, 3273, -838, -19641, -13817, 1087, 12362, 23211, 23670, 17687, 3781, 8553, 7197, -2160, -14696, -17896, -9313, -5096, -7700, -6904, -7953, -3109, 5528, 6421, 5834, 6338, 12325, 2413, 1041, -3467, -2200, 4978, 6483, -2013, 8187]
9925H187L570l773m319r160j960J2648J0096j2015j3762J1626P189M860p827K012
9911G372m30M565o17J3951O270j204o204q890J00L067p81P50k981N097m33P119
9895B6751M547M336p529k9657q164P276M294Q67m027k438J0136K245k125o633
9881a21L341R531J3990R354k2512m733J0497K4R501J108m223N17k290o795M898
9866B2087P547O400m854j167n168q71P521J251l163m233n263K307m286j106j038
9851A5964N402l362m002j3602m613J3465M774P91L152P203K632m236p071j1907
9837D590o314M8K1739J6823j2387P006j000N481Q155n112j4642j581J5861K949
9823D1616j3820p270n02K854n23k740R533L27j1357J4317Q287l945k186Q613j3797
$$ y = [8187, 11757, 7984, 3665, -5495, -7455, 5193, 15289, 3274, -10488, 1138, 8327, 13187, 5360, 7372, 6942, 11507, 10890, 24841, 31111, 29907, 23703, 14813, 14913, 17980, 17199, 17949, 14968, 20065, 19632, 26751, 31298, 35634, 28105, -1552, -9716, -2440, 1854, 2721, -1306, -3744, 6392, 8637, 6512, -121, 3220, 12751, 26741, 36095, 13583, 8850, 19347, 19371, 28872, 29980, 25757, 26274, 23984, 17189, 22087, 29634, 36034, 31180, 30013, 24845, 23974, 31495, 32746, 29583, 25350, 20087, 22394, 18108, 17002, 15964, 21366, 18004, 14002, 400, -4213, 9252, 14026, 14817, 17969, 25172, 27804, 23568, 16497, 4590, -1724, -1676, 20063, 36886, 24499, 31505, 30505, 35986, 44141, 39029, 24387, 22806, 38667, 41616, 27796, 20526, 20024, 22878, 22355, 19615, 29148, 29475, 18118, 32435, 40722, 36777, 34591, 43204, 29407]
9808B9407o337m505k063l903k529J464O005N828K114M836Q764J2612J1662O709
9794G0064j1372n191P74k023j7930j3471P65m4P975O401L620j312j210N25k535
9779C5036N026J2841r837k534J0343j0851j6751q100M008J4677k333l989q399
9766A9137k993Q262P217M48J0599O006N696n301O457L886P279j2317m153J3201
9752F3424J7150O640r171L363P358n77m033O232q227j6703n559M426L28K318J0104
9737G7073j434q467J935k002M591Q290L564K0773o406o369K885Q555M380M016
9723A11384K57Q131q394r120L443J0965k621K441k407J0134k17N127n9j6542p40
9708A11782P768K9878J6089J777P409R490p973j8508j7790j344R921J9674p51
$$ y = [29407, 23070, 18565, 16502, 12599, 10070, 11534, 17539, 23367, 25481, 30317, 39081, 51693, 63355, 70064, 58692, 53501, 54275, 52252, 34322, 20851, 21616, 21572, 29547, 35948, 39568, 38256, 37046, 37571, 35036, 40062, 52903, 43066, 40532, 50875, 40024, 23273, 15173, 19181, 33858, 31525, 27536, 19137, 16144, 24406, 31623, 32071, 42670, 48676, 54372, 49071, 55528, 59414, 66693, 54376, 50223, 63424, 80574, 87214, 78043, 81406, 88764, 88187, 84154, 90386, 82159, 65456, 59897, 64323, 64651, 66969, 77073, 75639, 67172, 69107, 67105, 71696, 79986, 83550, 104323, 97917, 91548, 94433, 102988, 107368, 111384, 111641, 119772, 111378, 102258, 105701, 116666, 114045, 116486, 114079, 124213, 123996, 129123, 129064, 112522, 111782, 119550, 149428, 165517, 167294, 174703, 184193, 176220, 157712, 139922, 138578, 148499, 168173, 167422]
9695A67422M807J1143p533p3j1885K393O790J5911M253j143r10J234R591J5962
9681B17962l09O444O748k049j1658O648P123K3562J8981n637K933L26j6R128L165
9666B83351P710J6418K032K251J5296J1686J5907Q218L883J134J1091J7636L782
9653D00395M960J0801m285J7269J1668Q981N644J1497J9061l408J886R057J0008
9640E03534N113O473J5104J8744J7306O675J2082O5J1818K3322K9998R622j5626
9627F44230P753M118J2621J5415J3370P940M662M573L127R746R093R474R108R999
9613G65229Q546k715m774K986n285R255L879K747l635L77L963J627p751n213j660
9598G67576r695R631j3168n559k123N082n969j0333j8294o959n881M442n136j8887
$$ y = [167422, 172229, 183372, 175839, 175766, 163881, 166274, 173064, 188975, 193228, 192085, 191175, 192409, 202000, 217962, 217653, 224097, 230845, 228796, 217138, 223786, 230909, 254471, 273452, 267815, 270748, 271074, 271058, 280186, 283351, 291061, 307479, 309511, 311762, 327058, 338744, 354651, 362869, 366752, 367886, 378977, 396613, 400395, 405355, 416156, 411871, 429140, 440808, 449789, 455433, 466930, 485991, 482583, 484469, 493526, 503534, 508647, 515120, 530224, 548968, 566274, 572949, 585031, 585096, 596914, 620236, 650234, 659856, 644230, 651983, 656101, 668722, 684137, 697507, 705447, 710109, 714682, 717809, 727555, 736648, 746122, 755230, 765229, 773775, 771060, 766286, 769272, 763987, 773242, 777121, 779868, 776233, 776610, 780573, 782200, 774449, 769236, 767576, 757881, 767512, 754344, 748785, 746662, 751744, 745775, 735442, 717148, 710189, 704308, 708750, 703614, 684727]
9584F84727k4076k0271o835j245j1167k0355p072n021n337o208j1789j4555j5557
9571E35239j5482j158P841M064j5850k1039p298j2713q144q190j7897j8654o608
9558D14111o523o25J696o021n001j0139p604r655l4312Q72K4441P86k5682j1405
9544C24939m951j7512l424N65m963r720j7186j5711r665O267Q056j17k1545P527
9530B42560N161j1243j5534o654n760R273n95N910j0787j8391j1926l959k406
9517A75649q898K830m990N899J614l795n694j1545n997K497L122K168p1J0859
9503A63648P048q414j8878r757k498N296m471r592o292L612K176j6413k325K0320
9489A23460Q95k875L743l329l359L939j1893j7493k898L180R689J0849K403l865
$$ y = [684727, 660651, 640380, 633545, 632300, 621133, 600778, 593706, 588685, 583348, 577140, 565351, 550796, 535239, 519757, 518599, 526440, 530504, 514654, 493615, 486317, 473604, 465460, 457270, 439373, 420719, 414111, 407588, 406963, 408659, 402638, 397637, 387498, 379894, 370239, 335927, 336799, 361240, 362026, 336344, 324939, 319988, 302476, 299052, 299617, 294654, 284934, 267748, 252037, 242372, 248639, 256695, 256578, 235033, 242560, 247721, 236478, 220944, 214290, 208530, 217803, 217208, 223118, 212331, 193940, 182014, 178055, 175649, 166751, 169581, 164591, 170490, 172104, 168309, 162615, 151070, 145073, 147570, 150692, 152860, 152789, 163648, 170696, 162282, 143404, 133647, 131149, 136445, 131974, 122382, 116090, 119702, 121878, 105465, 103140, 123460, 124355, 121480, 125223, 121894, 118535, 122474, 110581, 93088, 90190, 93370, 103059, 113908, 116311, 112446]
9475A12446p219j7671o362P860Q318N610j1957j1101j8938q050M391J4636J3230
9462H5193q325n209o200o282n265P552K667l82m857p356k414K903J2265J3757
9448G8047j476j0974j4780j8345R389J1782j030p182o753J577J1996j1714r150
9435C1387J02r973o806J726J6771J8133K0383j8329k2784l533l72p049P182P856
9421C4694R928k116q656n883M435M155o264L674l063n643p164J684k010L93Q4
9406A8248o783J969P563M778p803m61O847J0590L540J2094l799o338K335M672
9392D7452N696l242j1358j1143L042o56j3095J5592J1483j715o771R414L02p922
9378C7079l058r651k026P861j323L425n811J0614o425j1921L089K085p362k00
$$ y = [112446, 105227, 87556, 81194, 89054, 97372, 102982, 91025, 79924, 60986, 52936, 57327, 71963, 85193, 76868, 71659, 65459, 59177, 53912, 61464, 64131, 63749, 58892, 51536, 49122, 52025, 64290, 78047, 76571, 65597, 50817, 32472, 41861, 53643, 52613, 45431, 38678, 40255, 52251, 40537, 31387, 31489, 21516, 14710, 16436, 33207, 51340, 71723, 53394, 30610, 27077, 26705, 19656, 26838, 34694, 44622, 42506, 33850, 27967, 32402, 36557, 30293, 33967, 30904, 25261, 18097, 19781, 17771, 18164, 18248, 11465, 13434, 20997, 25775, 17972, 17511, 24358, 34948, 38488, 50582, 46783, 40445, 42780, 47452, 53148, 49906, 38548, 27405, 30447, 29791, 16696, 32288, 43771, 42056, 35285, 44699, 45001, 37079, 34021, 24370, 22344, 30205, 28882, 32307, 26496, 37110, 30685, 18764, 21853, 23938, 16576, 16376]
9364A6376j0636m933L450q524L921J090N300M307N918K80K399m520j0362J1725
9350A5791K481L102L457k846J504p776n35p244q060M726N665L021j500J5909M099
9335C1794o466r192j4536N660j938K005J276R671p363p753O976j3327n6J7849
9321A4600K927K821q837m590k203N074K262o871j5739P838O537p641k676J1036
9307D538K104J358O845p440L176j0881j9852P373J0463k625L844N350n995L337
9293A595R766N519K091K602j0734R307j806j6294l591q58j617j038q45R818l28
9278C587j0673j3473m826J0609M349P195J2568J8277n151k2711r526r2o562J193
9264a5236N282j1133J1453J9274O757p599j2080K16N799K493J268J6261R66j8676
$$ y = [16376, 5740, 807, 4257, -4267, -346, 744, 6044, 10351, 16269, 16549, 18948, 14428, 4066, 15791, 18272, 21374, 24831, 21985, 23489, 15713, 15178, 7934, -126, 4600, 10265, 13286, 11786, 27695, 31794, 25328, 16136, 1600, 7260, 5322, 7327, 8603, 18274, 10911, 3158, 10134, -3193, -3249, 14600, 17527, 20348, 11511, 6921, 4718, 9792, 12054, 5183, -10556, -2718, 3819, -3822, -6498, 4538, 6642, 8000, 14845, 7405, 10581, -300, -20152, -12779, -2316, -4941, -1097, 4253, -1742, 1595, 11361, 16880, 18971, 21573, 10839, 20146, 18340, 2046, -1545, -2403, -4020, -5058, -5903, 3915, 3587, -7086, -20559, -25385, -14776, -10427, -3232, 9336, 27613, 22462, -249, -9775, -9867, -16429, -15236, -9954, -21087, -9634, 9640, 16397, 8798, -3282, -3066, 2733, 5226, 6494, 22755, 23721, 5045]
9250E045j5188j2315L933O432o353J3264N279j29m237N513N130n877j419Q385
9236G463p320j0284J625K000L660L369M489n816r400N578l577k238M519L844R900
9221G812J0021M555k3543p851K2142Q901j329j2548n178j981P992k774j8121j0100
9207b2002m261J120J712P977n889p231J8103J1417J1006J394O34l468o586l605
9193C21l116k59k264L857K020m622O596r141o937J0799L253L487j4268p46R605
9178a415n118m422M803K249N334P043L527n110J860j7531k1134O389J696R230
9164a2599j966P384l696r614N145J7057Q151o138J2750M618L559K390L273L4207
9150F4521M1378M9454P1842R2768R8063L7584j9856n3108p8098o7390o3144l9934
$$ y = [5045, -10143, -22458, -18525, -12093, -18446, -5182, 97, -32, -4269, 1244, 6374, 497, -922, 7463, 143, -10141, -8516, -6516, -2856, 513, 5002, -814, -10214, -4636, -8213, -10451, -5932, -2088, 7812, 17833, 22388, -1155, -9006, 13136, 22037, 20708, 8160, 2982, 1001, 8993, 6219, -11902, -22002, -26263, -25143, -23431, -15454, -21343, -28574, -10471, 946, 11952, 13346, 13980, 10512, 3926, 321, -2795, -3054, -5318, -1461, 559, -4063, 2533, -6608, -13545, -2746, 507, 3994, -10274, -11020, -1415, -6533, -10955, -6152, -3903, 1431, 8474, 12001, 6891, 8751, -8780, -29914, -23525, -21829, -12599, -14565, -7181, -10877, -20491, -15346, 1711, 9862, 3724, 16474, 21092, 24651, 27041, 30314, 64521, 105899, 155353, 227195, 319963, 418026, 455610, 435754, 382646, 304548, 237158, 174014, 134080]
9138A34080l0845j0297k16k98j7596j4095o245q57j0797j204n749n426k815o326
9124B1314p62m418K040J572K690p126l199M699J423L118L441N338j2098Q158J9383
9109D5573J4191K2552K5143M3099P7519J11653J60233J92650J60296O2399k1540
9098H93768q8108j46790j60389j17498q0654o2614l4657m924k355j8816k0580
9087A56383k6730j8264k3156j6298r397p327q552K883M53j161j56r059j8154k804
9073A8661n02l402q325j0570j0209J3783N114k665R931J0171k454R177J9919M0318
9059H8947L9335N6389Q8246R1750L6567K783k4114o5331q0580o7642l9628j7207
9047A09515k4204j4300q559q453P924j2712j1760o940K672k870q984p443j6406
$$ y = [134080, 103235, 92938, 92722, 92424, 74828, 60733, 54488, 53631, 42834, 41630, 35881, 30455, 27640, 21314, 20552, 16134, 18174, 19746, 22436, 15310, 12111, 16810, 18233, 21351, 24792, 30130, 18032, 26190, 45573, 59764, 82316, 107459, 150558, 228077, 339730, 499963, 692613, 852909, 915308, 893768, 805660, 658870, 498481, 380983, 300329, 237715, 203058, 198134, 195779, 176963, 156383, 129653, 111389, 88233, 71935, 62538, 55211, 46659, 49542, 49995, 48834, 48678, 39619, 21465, 18661, 18159, 14757, 6432, -4138, -14347, -564, 4550, 1885, 11816, 21987, 19533, 28710, 48629, 88947, 128282, 184671, 272917, 364667, 401234, 404017, 379903, 314572, 233992, 166350, 126722, 109515, 85311, 71011, 62452, 53999, 61923, 49211, 37451, 30511, 33183, 30313, 21329, 13886, -2520]
9034b520j3765m69P11j9206p18Q447L81r783m96Q670o221r400N286L887K347N010
9018b7839o397j2624j2539Q214J5164m205L285L819R726J2843n245j2133J8306
9005i625K9731J7432k650n009o06P352o584j7473n897j4056o087K702j1662Q138
8991a4294K146k745Q227k913q979q704q057J668P29L536Q06j2619k940k813n044
8976e1996L99L438r99K885L176R757O578M038L807J1681o12Q021J008o918l024
8961h761R801R692R185m113J462k972M347N561J8260K916j2093j1999q132r905
8947C249l064M547j3912k1272n480L632Q28J1060m080k348J2433J797p92j4238
8933b7640n638P732Q88J2858j714k825n188R221m746j8230q913O586K214K169
$$ y = [-2520, -16285, -16754, -16043, -35249, -35967, -27520, -27139, -36922, -37418, -28748, -34969, -44369, -39083, -35196, -32849, -27839, -34236, -46860, -59399, -51185, -36021, -40226, -36941, -33122, -23396, -10553, -15798, -27931, -9625, 20106, 37538, 34888, 29879, 29273, 36625, 30041, 12568, 6671, -7385, -13472, -10770, -22432, -14294, -12148, -14893, -6666, -9579, -18558, -27262, -35319, -33651, -32922, -29386, -28580, -41199, -44139, -46952, -51996, -51597, -48159, -49158, -46273, -43097, -33340, -26762, -22724, -18917, -7236, -7848, 173, 1181, -5737, -8761, 1040, 10732, 19917, 15804, 17266, 14294, 18641, 24202, 42462, 45378, 33285, 21286, 13154, 3249, 185, 4732, -9180, -30452, -35932, -32300, -31472, -20412, -24492, -26840, -14407, -12610, -13402, -27640, -33278, -25546, -24658, -11800, -13514, -16339, -21527, -12306, -17052, -35282, -44195, -37609, -35395, -33226]
8919c3226M463l935l072L009J521o165K968q119K320J8993k916L082J8684P581
8905E188j8355j4103J0578O058p692k2897r249J1960R522l178K649l23l305p314
8891d0461m166k031J2230R49O511J6719J1824J9386p167k963j692j4821j1375
8878a7057q966L75j3919j0470r211P190K5142K9998J3186o750N439j1853n203
8865b099J1640L739n894j0105p209p037M991K511O021J8358J1184j0734j4307
8852A059J153l192j1278N164n880j0507M7R259K297l728N944R526J5105M151Q455
8837B7575J0799N794j2004j643N988n385j3475j2466j9117L102K7279M3967K5736
8824H6150J7969O830M90j4055j3075J508Q502P319J879j846M319J6225P056P263
$$ y = [-33226, -28763, -32698, -35770, -32761, -31240, -37405, -34437, -42556, -40236, -21243, -24159, -21077, -2393, 5188, -13167, -27270, -16692, -10634, -18326, -41223, -50472, -38512, -28990, -32168, -29519, -29842, -33147, -40461, -44627, -46658, -34428, -33479, -26968, -10249, 1575, 20961, 13794, 10831, 9139, -5682, -17057, -26023, -25648, -39567, -50037, -59248, -52058, -26916, 3082, 16268, 9518, 14957, 3104, -2099, 9541, 13280, 7386, -2719, -9928, -16965, -11974, -9463, -3442, 14916, 26100, 15366, 1059, 2212, -980, -12258, -7094, -12974, -23481, -23434, -14175, -11878, -15606, -9662, -136, 14969, 19120, 27575, 38374, 44168, 32164, 30521, 36509, 31124, 17649, 5183, -13934, -10832, 16447, 60414, 86150, 104119, 110949, 111439, 97384, 84309, 85817, 94319, 101638, 103517, 101671, 105990, 122215, 129271, 136534]
8810A36534K65p799k265J4900p54k1715q769n071j752J3130J6642K0860J5315
8797A69521K1839j083j1098P03k351J8607J6578J5593J7537K6566Q946L154K3297
8784C07809J9214J1309L4505L2616L5769N5872M3491J7777K0132M2557N4711O6296
8772G42058M5429M2479P4624Q9443Q7649J06973J47836J84263K41996K84294L70881
8761B417925M71377N24086N94914P16049R11657J203047J654121K337381L403588
8752A4234145N010517P446717J1014139J5525710J8132689J3276026L846179k914894
8744H5571228r308563j5077370j5076983j1090469p116741m439782k840312j860326
8736A8760682j200025q68381r37420j160804j229145j162967j056367r59429q76572
$$ y = [136534, 136799, 129000, 126735, 141635, 140881, 119166, 110397, 105326, 103574, 116704, 133346, 154206, 169521, 191360, 190277, 179179, 179882, 177531, 196138, 212716, 228309, 245846, 272412, 281358, 284512, 307809, 327023, 338332, 372837, 405453, 441222, 497094, 540585, 558362, 578494, 621051, 675762, 742058, 787487, 829966, 904590, 994033, 1081682, 1188655, 1336491, 1520754, 1762750, 2047044, 2417925, 2889302, 3413388, 4008302, 4724351, 5636008, 6839055, 8493176, 10830557, 14234145, 19244662, 26691379, 37705518, 53231228, 71363917, 84639943, 88486122, 85571228, 76262665, 61185295, 46108312, 35017843, 27901102, 23461320, 20621008, 18760682, 17560657, 16692276, 15754856, 14594052, 13364907, 12201940, 11145573, 10186144, 9309572]
8727I309572q00570o99742n86967m64088l30900k14872j11877L937J20418K78778
8717F503689M72561O66114Q05408R34889J168416J532348K088339K948835M234192
8708B1354791O199342R227518J3843847K0852197L0429945L7532218K8396685
8701A67836543Q238668m832337j7458907l0641615l1213000k2938072j4604934
8694E4386346r008142n741123l759167k422221j671565j789741k300104k518939
8686B5175344k465024k247542k052766j916419j740010j520000j328706j130897
8678A0773980r40742p76260o29353m86166l72718k44831j15051J2683J21113K12144
8668G554799L37959N34195Q16873J256114J906605K847066M256845O373365R517032
$$ y = [9309572, 8509002, 7809260, 7222293, 6758205, 6427305, 6212433, 6100556, 6104493, 6224911, 6503689, 6976250, 7642364, 8447772, 9382661, 10551077, 12083425, 14171764, 17120599, 21354791, 27554133, 36781651, 50625498, 71477695, 101907640, 139439858, 167836543, 176075211, 171242874, 153783967, 123142352, 91929352, 68991280, 54386346, 45378204, 39637081, 35877914, 33455693, 31784128, 29994387, 27694283, 25175344, 22710320, 20462778, 18410012, 16493593, 14753583, 13233583, 11904877, 10773980, 9833238, 9056978, 8427625, 7941459, 7568741, 7323910, 7208859, 7221542, 7342655, 7554799, 7892758, 8426953, 9243826, 10499940, 12406545, 15253611, 19510456, 25883821, 35400853]
8659C5400853J3699817J7098041J4448898N498362j704246p613036j3789568j5228832
8651D7810289j1825552p742845m816892l059205k024461j345447r41140r23825
8643A5130922j117521j234593j230621j157543j059651r88529r01907p94073o98899
8634E947585o18369n20230m53616l89710l41485l08474k62650k43842k09407j92978
8624B406824j76758j56363j23648r6832j27227j16108q1762p3854o3081o1665
8614A329526o1217n5431m7852m7283m8245m5055m3727m0718k4373l1358k8495
8603H55772j7981p776j3692j5009j484j7162l640k332N915K9170M8192P9176M6593
8590I85742m231l4662o4234p9670n9804n5706l7119l6870k2198j5851k524J3K2847
$$ y = [35400853, 49100670, 66198711, 80647609, 86145971, 84441725, 76828689, 63039121, 47810289, 35984737, 28241892, 23425000, 20365795, 18341334, 16995887, 16054747, 15130922, 14013401, 12778808, 11548187, 10390644, 9330993, 8342464, 7440557, 6646484, 5947585, 5329216, 4808986, 4355370, 3965660, 3624175, 3315701, 3053051, 2809209, 2599802, 2406824, 2230066, 2073703, 1950055, 1853223, 1725996, 1609888, 1528126, 1454272, 1391191, 1329526, 1268309, 1212878, 1165026, 1117743, 1069498, 1024443, 980716, 939998, 915625, 884267, 855772, 837791, 830015, 816323, 801314, 799830, 782668, 779028, 776696, 782611, 811781, 859973, 939149, 985742, 981511, 946849, 882615, 802945, 743141, 687435, 650316, 613446, 591248, 575397, 572873, 572886, 595733]
8577E95733M1921M5441o15j5630j1461N62l65j3703j7288j0868j4474k4919l3889
8564E40445l0761k4585j6394p671n43M509J1736J493j1888J0468J5654J3009K0964
8551E26436M1460P5297J06717J55299J34862M1357j8119o9178j41254j50661j09437
8540E92779o6394m2600k0792j9687k1015j7735k352Q948q43j281j0688l655n666
8527C89019P89p784j5283j8906j5057k1535l3349j7286n288L86n18K697J0912
8514B68797K2199J3670N264m20j988O209J6254J3009L2448L9472O6302P8236M6930
8501F06382R289k5438n1196q3922o6531l8390k4346k1449j3097o759o423p83P226
8488B84563l730p601j0442j3304N91l533j4965j97j0764q641p07K088r43P550
$$ y = [595733, 637654, 683095, 682480, 666850, 655389, 655951, 655586, 641883, 624595, 613727, 599253, 574334, 540445, 509684, 485099, 468705, 461034, 460491, 465000, 476736, 478229, 466341, 476809, 492463, 505472, 526436, 567896, 643193, 749910, 905209, 1040071, 1081428, 1063309, 994131, 852877, 702216, 592779, 526385, 483785, 462993, 443306, 422291, 404556, 402204, 411152, 410309, 409028, 398340, 394685, 389019, 389808, 382024, 366741, 347835, 332778, 311243, 277894, 260608, 255320, 255706, 255188, 257885, 268797, 290996, 304666, 309930, 309510, 307522, 313731, 329985, 342994, 375442, 414914, 481216, 559452, 606382, 615671, 590233, 539037, 455115, 388584, 350194, 325848, 304399, 291302, 284543, 278120, 277337, 284563, 280833, 273232, 262790, 249486, 250077, 246544, 231579, 231382, 220618, 211977, 211270, 213358, 212415, 219965]
8474B19965j8448r593p40K866K666j079j3945j2953L715P408M071J109K496M33
8460A87971J0114r561p64r932k4116q38O438J436j445L077R082J2159q177j7194
8446A58250j893J8900M579m349j3374n838Q454Q9n055l488O309m196O909J980
8432A67277k122j834L717Q130r09n35l877j2409l833j1799l084J000J0090J992
8418A51804k109r098n640r060l139J982J6639R388j1869k545M83Q687J373O496
8404A53392n05j5169j6896M785q637k717j6770k0843K492M907J0019J7915O468
8391A18441L210p592K185o24k336l603J962M211l444M582J275J390R896J4794
8377A44347j1537j3030J302P109L356M473J3337j4501k0558j1840J20R750k76
$$ y = [219965, 201517, 191924, 191184, 194050, 196716, 195637, 181692, 168739, 172454, 179862, 183933, 185042, 187538, 187971, 198085, 188524, 187760, 177828, 153712, 152874, 159312, 160748, 159303, 162380, 171462, 183621, 175444, 158250, 156357, 175257, 179836, 175487, 162113, 156275, 164729, 164818, 159763, 156275, 162584, 158388, 165297, 167277, 165155, 163321, 167038, 175168, 174259, 173724, 169847, 157438, 153605, 141806, 138722, 139722, 149812, 151804, 149695, 140597, 134957, 125897, 122758, 124740, 141379, 150767, 138898, 136353, 136836, 145523, 146896, 153392, 152887, 137718, 120822, 125607, 116970, 114253, 97483, 76640, 79132, 84039, 94058, 111973, 118441, 121651, 114059, 116244, 115620, 113284, 109681, 111643, 115854, 112410, 116992, 118267, 119657, 129553, 144347, 132810, 119780, 121082, 128191, 131547, 136020, 149357, 134856, 114298, 102458, 102578, 112328, 112052]
8364A12052j7109j3126P023J5513l595K255p843n695J5840L162J695k484O521
8351A14209J5666K0526J3402J6278M0377M8479P9195J04456Q8139L0912o824k5876
8339E38939p6603q8864o5855l4921k1190j6825j4000j6406K848R51o509l138p435
8326A90992j0199j0597j8548k9377o241k236N966N913j1987n12K0630l112n326
8313A25366J2199j950j0173J6569J1752K471m483J7328K7765K3906M3555O0573
8301C24878R7295J33876J77991J77169R5585o62o1836j21544j64375j42964j02876
8290D12537o5519m5207k0650j7641j7308j2291L226P086n105j6795k3071j8095
8278A81167m41r254m428r930n518p712j9238k1516N80J0175M475J10l398j180
$$ y = [112052, 94943, 81817, 88840, 104353, 100758, 103013, 95170, 89475, 105315, 108477, 110172, 107688, 114209, 129875, 150401, 163803, 180081, 220458, 268937, 348132, 452588, 540727, 571639, 564815, 538939, 462336, 373472, 307617, 272696, 251506, 234681, 220681, 204275, 207123, 208074, 201565, 198427, 190992, 180793, 170196, 151648, 122271, 116030, 113794, 119760, 125673, 113686, 113174, 133804, 130692, 125366, 137565, 135615, 125442, 142011, 153763, 156234, 151751, 169079, 196844, 220750, 264305, 324878, 422173, 556049, 734040, 911209, 1006794, 1006132, 944296, 822752, 658377, 515413, 412537, 347018, 301811, 281161, 263520, 246212, 233921, 237147, 244233, 239128, 222333, 199262, 181167, 180726, 171472, 167044, 157114, 151596, 143884, 124646, 103130, 103710, 113885, 118360, 118470, 115072, 113892]
8264A13892M1R28n368l625P184K9114K2159L6765N1204O2167P2694R5665M3774
8251E26594j0627k8231n9868p7671n9917l4467k5152k6881j6375j1216j3623o397
8239A56169l850j4740j3504n701j51J3680P04k9853k3268r382M636J1750l59k917
8225H3214m773l749m2n23L168J261j1646J7099k138o619j414K761P140j650j7602
8210F4487j0474j154R293J2451q2L745l6p400j1087j250j800K285J822q106m363
8195D8331K251K629K507m297J5369R938r636m247m51l280J846K386j0228p305
8181D5813P27p002N592J595N022J263N797j0954r519P692L041n154O067O294n512
8166E0762L440L533Q206m444q929m70N62o487k936M081P204M574n448J0854l739
$$ y = [113892, 113933, 114861, 109493, 105868, 113052, 142166, 164325, 201090, 252294, 314461, 387155, 482820, 526594, 515967, 487736, 427868, 350197, 290280, 255813, 230661, 203780, 187405, 176189, 162566, 156169, 152319, 137579, 124075, 118374, 118223, 131903, 132607, 102754, 79486, 70104, 74740, 86490, 86131, 83214, 78441, 74692, 74650, 74127, 77295, 78556, 66910, 84009, 81871, 75252, 73838, 76599, 83739, 82089, 64487, 54013, 52859, 62152, 74603, 74521, 78266, 78230, 70830, 59743, 58493, 56693, 58978, 60800, 52694, 48331, 50582, 53211, 55718, 51421, 66790, 76728, 67092, 62845, 62394, 59114, 60960, 63346, 53118, 45813, 46540, 39538, 45130, 46725, 51747, 53010, 58807, 47853, 38334, 46026, 49067, 43913, 49980, 56274, 50762, 54202, 57735, 65941, 61497, 52568, 52098, 52660, 46173, 43237, 47318, 54522, 59096, 53648, 64502, 60763]
8151F0763K356R798j0054j0414o86n326K27J3401m02p536j7505j1221M646K0560
8137D8607N371l764L932R524N161k953r252J570k0663k947J457o000L377Q802
8123D2222R029J172J0859p678m524m553K54O236N847M91N012n806L38O871k767
8108F3003p216r116m478J0326k669p000l735l501O326M372o895j1811K980J5541
8094D6127J1449q956k965m963j3285k63M976m403O779O089m426P424O746J2508
8080F2837N478P77q027j7957j275J420K526j6132k463J8855P779K555l753m081
8066D8539j7092r358L081R838P353J364m982L582R891n351o68O061O48M705P364
8051F4975n468j2981m798o983M956L176n632o319m314p828L467O514J1096R932
$$ y = [60763, 63119, 72917, 62863, 52449, 51763, 46437, 46664, 60065, 59663, 52127, 34622, 23401, 28047, 48607, 53978, 50214, 54146, 63670, 68831, 65878, 56626, 58196, 37533, 34586, 36043, 30043, 33420, 42222, 51251, 52423, 63282, 55604, 51080, 46527, 46781, 53017, 58864, 59355, 64367, 58561, 58899, 65770, 63003, 55787, 46671, 42193, 52519, 49850, 42850, 39115, 35614, 41940, 46312, 39417, 27606, 30586, 46127, 57576, 48620, 45655, 40692, 27407, 27144, 32120, 27717, 34496, 40585, 36159, 43583, 50329, 62837, 68315, 69092, 61065, 43108, 41833, 43253, 45779, 29647, 27184, 46039, 53818, 56373, 52620, 48539, 31447, 22089, 25170, 35008, 42361, 43725, 38743, 42325, 52216, 46865, 46197, 52258, 52906, 57611, 64975, 59507, 46526, 41728, 34745, 39701, 42877, 37245, 30926, 26612, 18784, 22251, 28765, 39861, 49793]
8037D9793N082j104o38l754O844j9219k0297Q237J0263K479J313N984Q795j5272
8023C8506P194k326J984O519M841Q27j5015J7352o486J986j3577m685Q052j724
8009D3448o492O205l140p590N464Q772N449k951p471l53n203n540r37j336j89
7994B8136J0762R067j148r472m491K912j0111q387N206J0065q498j0549J1774
7981B5266J2111P539l770n844N332K558l426l296o581J0290P2j976J4305J6990
7967F9570k3294j2065K2002L133j2183j232o43O721P970k102j4249j0072J0304
7954D3860L484r393j0505r391J7373R217j1286m7J867k578Q693J0833K507j7049
7940C7585J674o222n230m028J1856N025L362R875J823j4588j1894j6983K882J3634
$$ y = [49793, 54875, 53771, 53133, 49379, 56223, 37004, 16707, 24944, 35207, 37686, 38999, 44983, 53778, 38506, 45700, 43374, 45358, 51877, 56718, 57545, 42530, 59882, 53396, 55382, 41805, 37120, 45172, 43448, 36956, 43161, 40021, 32431, 37895, 46667, 52116, 49165, 41694, 41341, 36138, 30598, 29661, 28325, 28136, 38898, 47965, 46817, 37345, 32854, 35766, 25655, 17268, 22474, 32539, 24041, 13492, 25266, 37377, 44916, 41146, 35302, 40634, 43192, 39766, 36470, 29889, 40179, 40251, 38275, 52580, 69570, 46276, 34211, 56213, 59346, 47163, 45931, 45288, 52009, 59979, 57877, 43628, 33556, 43860, 47344, 37951, 27446, 18055, 35428, 44645, 33359, 33312, 35179, 32601, 41294, 52127, 54634, 37585, 39259, 33037, 27807, 23779, 35635, 40660, 44022, 53897, 55720, 41132, 29238, 12255, 15137, 28771]
7926B8771J5186m817K511j439r617j1537L980P463R842p270q939J4642L789L521
7912D6086n972k878Q784M186j0316k464k204L984m53k065M814L114j4679n414
7898B4523J5722N783K569J794R583K057k671j2699j9211N313J5750j0p155j494
7884C9854K163q94j0104P217m998n617M980n490m741P41J5277P536n769j4217
7870B5938n562l789j4198k024J0305m609P206R634K0978R186N402o273k0292N8
7856C1960N370o173L066N934J983o933j538k853P152M246M190o958j2732o228
7842B0486k706O647L963O353J626l668j749o8N227L055j9318j2859k803J0833
7828A5019K496J1277J2632j1099K26p844p613l391J449K3866N361j6458j3614
$$ y = [28771, 43957, 39140, 41651, 40212, 30595, 19058, 23038, 30501, 40343, 33073, 24134, 38776, 42565, 46086, 40114, 37236, 46020, 50206, 39890, 37426, 35222, 39206, 38753, 36688, 41502, 44616, 29937, 24523, 40245, 46028, 48597, 50391, 59974, 62031, 59360, 46661, 27450, 32763, 48513, 48503, 41348, 39854, 42017, 41123, 31019, 38236, 33238, 27621, 32601, 27111, 22370, 23111, 38388, 45924, 40155, 25938, 20376, 16587, 2389, 365, 10670, 6061, 13267, 22901, 43879, 53065, 58467, 52194, 31902, 31960, 37330, 31157, 34223, 40157, 42140, 35207, 33669, 30816, 37968, 42214, 46404, 39446, 26714, 20486, 17780, 24427, 28390, 34743, 36369, 32701, 30952, 30884, 36111, 39166, 19848, 6989, 4186, 15019, 17515, 28792, 41424, 30325, 30551, 22707, 15094, 11703, 13152, 37018, 42379, 25921, 12307]
7815A2307P862R321J42J370m853J989J0863Q821r52Q20n820q843m741J2197q09
7800C9674k087p934K555M591P974M938j2887p494O269o142p044N805j717n829
7786B0672L57m367m67n85O687l446lk454j94j2779K714M436K258J2897M866j4206
7770A6386n804J1093J1427n222M733J316j0649m506N850M005O899j7730p509M464
7756A4753K177Q478J0782j4550j9540j912K369K226P905O135j991O719J435M007
7742B8993J999N165N529j4808l2103m011r854q56J9083J4838j1552N426L163P595
7728A8607L943m777j3583n49J679L236k34o424j3298M279Q253k201p438m782L935
7713i354J0687j821R483M652J2079P414j1864n348l271N307K091R76J4687J9854
$$ y = [12307, 20169, 29490, 29632, 31002, 26149, 28138, 39001, 47822, 46870, 47690, 41870, 33027, 28286, 40483, 39674, 37587, 29653, 32208, 36799, 44773, 49711, 36824, 29330, 35599, 29457, 22413, 28218, 26501, 20672, 21029, 16662, 16195, 15610, 22297, 18851, 18848, 16394, 16200, 3421, 6135, 10571, 12829, 25726, 30592, 16386, 10582, 21675, 33102, 27880, 32613, 33929, 23280, 18774, 24624, 28629, 35528, 17798, 10289, 14753, 16930, 25408, 36190, 21640, 2100, 188, 2557, 4783, 12688, 18823, 16832, 23551, 24986, 28993, 30992, 36157, 41686, 26878, -5225, -9236, -19090, -19946, -863, 13975, 2423, 7849, 11012, 18607, 22550, 17773, 4190, 3641, 5320, 8556, 8322, 1898, -11400, -7121, 1132, -1069, -8507, -13289, -9354, 1333, -488, 8995, 13647, 25726, 33140, 21276, 15928, 12657, 17964, 20055, 21031, 35718, 55572]
7699E5572M551j4543n169m973k2021p935l754J2665K655r594L561Q383o145J553
7685A4806J5631P010K789J160P3j5216m924m887N574q080o083R39L435P801J0974
7670C1002q394l889J2394O152p696j7131n074J9059M963p107J2795j5192Q262
7657C0144o42n465Q162J1010l94j1809m387R67o409q094q748l431J2912J8436
7643C2252J0107r917j2515l191J437J364n274n375l474J2743J1695k755j4138
7630A2959P131k113j5211R889J3076O531r812q365j7631q208P655J789m685J30
7616f865j59J0021O216P223J3764j3392q423J4950k259k2430r052k612O776N333
7602i09k789L662K16p855R205M132P545M568P92L990O189N661K932o003L170k430
$$ y = [55572, 60123, 45580, 40411, 35438, 13417, 5482, 1728, 14393, 17048, 7454, 11015, 19398, 13253, 14806, 30437, 37447, 40236, 41396, 41469, 26253, 21329, 16442, 22016, 13936, 7853, 8792, 12227, 20028, 31002, 22608, 18719, 31113, 37265, 29569, 12438, 7364, 26423, 31386, 24279, 37074, 21882, 30144, 29502, 24037, 32199, 43209, 42815, 31006, 26619, 27586, 21177, 13083, 4335, 904, 13816, 32252, 42359, 32442, 19927, 16736, 18173, 19537, 14263, 8888, 5414, 18157, 29852, 27097, 12959, 20090, 17977, 2766, 12655, 25731, 32262, 22450, 14085, -3546, -11754, -4099, -2310, -6995, -6865, -7024, 2997, 9213, 16436, 30200, 16808, 8385, 23335, 21076, -1354, -10406, -13018, -6242, -909, -3698, -36, 180, -7675, 1530, 5662, 13207, 17775, 18567, 22557, 28746, 34407, 37339, 31336, 34506, 32076]
7586C2076p846J354l459j4278r855K531O218P491m962j6141K933O004k167M94
7572C93K303J3765K1307K620j3074n504m394p542J833K995o48m584r797R376L455
7557A2504m733k897j0297l194J2916Q446R703J0607n962j0958j2659k814R058
7544I720J2459Q207p777n333k010M818J327j871m298K2402P657q451o666k061
7530B8123j3665j1943j9262J29K2073P643O930M524n130p007q006J570J5246L660
7516B4885j0518l01p12L126j596N216M088j0169k894J2993Q026M515J267o717
7502C1209r376o92j97J625P10L951j264J899Q953j3750m52r34L700J6685O261
7487D8328j8533j3050m514r14K1125J1940O370r163k0737k632k800m21n033N862
$$ y = [32076, 24230, 25584, 22125, 7847, -2008, 523, 6741, 14232, 9270, -6871, -3938, 2066, -101, 393, 2696, 16461, 37768, 40388, 27314, 21810, 17416, 9874, 11707, 14702, 14054, 9470, -327, 9049, 12504, 7771, 4874, -5423, -8617, 4299, 12745, 22448, 33055, 27093, 16135, 3476, 662, 9720, 22179, 30386, 22609, 17276, 15266, 20084, 21411, 19540, 15242, 37644, 45301, 36850, 30184, 28123, 14458, 2515, -16747, -16618, 5455, 13098, 20028, 24552, 19422, 12415, 4409, 5979, 21225, 24885, 14367, 14066, 13354, 16480, 14884, 20100, 24188, 14019, 11125, 24118, 32144, 36659, 37926, 31209, 21833, 21141, 20944, 22569, 23279, 27230, 25966, 27865, 36818, 23068, 22616, 21682, 25382, 42067, 48328, 29795, 16745, 12231, 11317, 32442, 44382, 50752, 41589, 20852, 18220, 15420, 14999, 9966, 15828]
7473A5828K1804m253j1840j9930N472J2238J0195j867o093J880J0983k656j7440
7460A4321N6l162j3092N786J1989R999m404M037M780l636o687j3929r988L077
7446h53L612m586L674L391N021R198J4482j2023Q11r341L542P913m138J131M95
7431B2329q917R49M424N594n815o976M570m926p626J583Q219J2275o673j2628
7417F382M758J6310L470j2721o402N1m6o890M760K782r380Q196N703l465l803
7402I705o128L512n365j3864J3722J4042k803R335M291j2080j1053K733J8540
7389B4587j041o875m166Q190O999r219j0942N704N148q622r462J2238J2589m880
7375B0248l702q781M366K999P888J623r570m270m265o284K865M062O431r112q653
$$ y = [15828, 37632, 33379, 21539, 1609, 7081, 19319, 29514, 27647, 21554, 23434, 34417, 31761, 14321, 14377, 11215, -1877, 3909, 15898, 25897, 21493, 25530, 30310, 26674, 19987, 6058, -3930, -853, 2759, -1827, 1847, 5238, 10259, 19457, 33939, 21916, 22727, 13386, 16928, 24841, 20703, 21834, 22329, 13412, 14361, 18785, 24379, 18564, 11588, 16158, 11232, 3606, 5189, 13408, 25683, 19010, 6382, 11140, 27450, 30920, 18199, 11797, 11848, 11802, 4912, 9672, 12454, 3074, 11270, 16973, 13508, 9705, 3577, 7089, 1724, -12140, 1582, 15624, 12821, 22156, 26447, 14367, 3314, 6047, 24587, 23546, 16671, 12505, 20695, 27694, 18475, 7533, 13237, 18385, 9763, 301, 12539, 25128, 20248, 16546, 7765, 12131, 15130, 23018, 24641, 15071, 10801, 6536, 252, 3117, 7179, 13610, 4498, -4155]
7360d155L459P387q722L799J596P265K628l695n701j2615m376O009J6387O606
7346A5872m808R566Q336l327j0932l439q584L94n805r99R123n682N351J4974L291
7331B3331j751l819q090o463K186M382J1666K860m860K871L52k69L125K525n14
7316B7532j0534k059N776l240J49k905j039L08j2621O567J619R846Q460j6806
7302A1053m958j945J4062l042r076m81j6189k3388J9456N805J5414O094j553j5528
7288d276J0335J1314j244O08M016J72j6650l775N683J0453q47N841O839L506m797
7273B7178r400n74K90n798L671j081o781J2966M176n045o608o192N583J2941J930
7258B7256k2945j3817k549R367l74j1770o37n65J4414J2061o543l833J9485K0939
$$ y = [-4155, -696, 6691, -2031, 1768, 3364, 10629, 13257, 9562, 3861, -8754, -13130, -7121, 9266, 15872, 11064, 20630, 28966, 25639, 14707, 11268, 2684, 3078, -2727, -3726, 5397, -285, 5066, 20040, 23331, 21580, 17761, 9671, 3208, 5394, 9776, 21442, 24302, 19442, 22313, 22665, 22396, 25521, 28046, 27532, 16998, 14939, 20715, 17475, 17624, 14719, 13680, 13988, 1367, 7934, 9553, 19399, 27859, 11053, 6095, 4150, 18212, 15170, 6094, 5613, -10576, -33964, -14508, -8703, 6711, 12805, 11252, -4276, 6059, 17373, 16129, 16737, 20753, 20925, 4275, 500, 6183, 16636, 15789, 21630, 28469, 31975, 27178, 17778, 17204, 17494, 11696, 15367, 14286, 7505, 20471, 24647, 19602, 12994, 6802, 12385, 25326, 27256, 4311, -9506, -12055, -2688, -3062, -14832, -15469, -16034, -1620, 10441, 3898, 65, 19550, 40489]
7244D0489J931j1424R636n878n671K814q55m96j0880n504P184J893J300n837N535
7229B4237m507j3249L235P464N616p96q993j2574K44l481j450J4088O182K73K057
7214A8346o571o270m213L801m032j929j0620n531J5123N835M101M452N11m774
7200H229n181j4034J0578L441p37r819j3887J6043J6035K902N95J1500l537n585
7186A6543p340k333J1139R888n105j2961p575j0145n738P9J0361Q041Q740L15
7172A3909n198N781j028L773m66m420K609j0697l500J2272l13q700J6873K877
7158B3772M233j050q975n250O931l699O954O347r523k4603o089M574Q866J0621
7144A3109k629P504l00n402j2054k314L126k931M631M112J174k238k896m816J1019
$$ y = [40489, 42420, 30996, 40632, 34754, 29083, 31897, 31042, 30546, 19666, 14162, 21346, 23239, 24539, 18702, 24237, 19730, 6481, 9716, 17180, 22796, 22000, 13007, 433, 677, -2804, -4254, 9834, 16016, 16289, 18346, 11775, 5505, 1292, 5093, 1061, -868, -11488, -17019, -1896, 3939, 8040, 12492, 13003, 8229, 3048, -10986, -408, 3033, 2296, -7523, -21410, -5367, 10668, 13570, 14165, 25665, 22128, 16543, 9203, 6870, 18009, 27897, 22792, 9831, 2256, -7889, -13627, -13548, -3187, 4854, 13594, 13909, 8711, 14492, 13464, 17237, 16771, 12351, 14960, 4263, 763, 13035, 12722, 4022, 20895, 23772, 28005, 26955, 17980, 12730, 19661, 15962, 22916, 29263, 19740, -4863, -10952, -6378, 2488, 13109, 10480, 17984, 17684, 12282, 228, -2086, 1040, -1891, 2740, 6852, 8026, 5788, 2892, -1924, 9095]
7129I095o353m434k171j1893J0913J5335m410K536R943j5375Q612R695r036n415
7115G042k332J1401p64j2986j834k22j520k090J0913m131o81j605l223j94l847
7100f073J973M899J3291J1215m657J4505p517n873p070p056m619K342n714N848
7086E494P495J4240J853k555m649Q32j583l874k876N349n213r513r807J3867L177
7071A2237j4429j0966J7547K6299K314p100j3436k507M75M486N048j862J704n427
7057A4383j2258k479K945R89J0200L311k636M794N056r216j3616O988J4366m019
7043A8808p637N082j0467p381L704j5075n854J6770O981k402j2151j1990Q955
7030a2657P194n241Q339J5357J7721K619p410J633j1932p955K8m36O490M89k476
$$ y = [9095, 2742, -1692, -3863, -15756, -4843, 10492, 6082, 8618, 18561, 3186, 11798, 21493, 12457, 7042, 4710, 16111, 15347, 2361, 527, 305, -1215, -3305, 7608, 3477, 2796, 1191, -2032, -2226, -6073, -4100, 799, 14090, 25305, 20648, 35153, 27636, 21763, 14693, 7637, 3018, 5360, -354, 5494, 12989, 27229, 29082, 26527, 21878, 22710, 21127, 17253, 14377, 19726, 14513, 5000, -4807, 9060, 12237, -2192, -13158, 4389, 30688, 33002, 25902, 12466, 9959, 10434, 14920, 19968, 18106, 19810, 14383, 2125, -354, 2591, 3580, 13780, 17091, 14455, 19249, 24305, 15089, 1473, 8461, 22827, 18808, 11171, 16253, 5786, -1595, 2109, -12966, -18820, -2050, 4931, 2529, -9622, -21612, -12657, -5463, -10704, -2365, 12992, 30713, 33332, 25922, 27555, 15623, 7668, 7696, 7260, 13750, 14239, 11763]
7015A1763j0537Q64J1838m523r401n929N588K150p745r511M493L980K217J2084
7001G331l619P407J1795j0134j408j169J074O654l314M897m976q102j0893r383
6987a3840p53Q693J8787q897M385J270P206o338J553j2192n994k619J3835k403
6973B693j2584K260N337R7o855N891R896J684L858p02r517O391J2494n620o939
6958H384L572q075j0483m688o51R803J637L523P06k598o879K224K40N795J3344
6943A5854m182o756m484p43j582p680J7209J0786j0655k508j4442q544M705M813
6929h209J7189Q577J075l958N52p572j0628l170K083J2938l473p781O919K732
6915G274j1471O598J801n298n253o399o095q241M083J9892r908j4n535L233J5615
$$ y = [11763, 1226, 2090, 13928, 9405, 4, -5925, -337, 1813, -5932, -15443, -10950, -6970, -4753, 7331, 3712, 11119, 22914, 12780, 11372, 10203, 11277, 17931, 14617, 19514, 14538, 6436, -4457, -13840, -14593, -5900, 12887, 3990, 8375, 9645, 16851, 10513, 12066, -126, -6120, -8739, 5096, 2693, -9891, -7631, -2294, -2197, -9052, -3161, 6735, 8419, 12277, 11575, 2058, 8449, 20943, 15323, 8384, 11956, 3881, -6602, -11290, -11941, -2138, -501, 3022, 3728, 1130, -5749, -3525, -3285, 2510, 15854, 11672, 4916, 432, -311, -1893, -9573, 7636, 18422, 7767, 5259, -9183, -17727, -13022, -8209, 8980, 17557, 18632, 14674, 15226, 7654, -2974, -6144, -4061, 8877, 5404, -2377, 4542, 7274, -4197, 2401, 4202, -1096, -6349, -12748, -18843, -27084, -23001, -3109, -13017, -13031, -18566, -15333, 282]
6900B82l263k534N415J7506m480j875k010p627o208M233j53J456J858m217k580
6885d197j745P485k705j1074l442Q786P224j277l16O408R003o496q632M853K710
6870F585j2994j810M086J1283N216M234j695j0120o496R145O92j5699P39J4178
6856G344J5159j3659j2722J3399J3587N456O92O604p111j11r578k6983n79O490
6842b012m799J202J2415O107K614L74K90k611o745l848j472n853K665J0033j5551
6827g191J987J0552M871M56J492J4971j2331k464J1183m749j2277N1j397l768
6813A386k151j1097o107p3P489q739k273k176J267k32N115J3463J2468l110k781
6798B449l149j651n651j2538J0263Q422k192O594J838m445m805k213M135P265
$$ y = [282, -2981, -5515, -100, 17406, 12926, 11051, 9041, 1414, -4794, -561, -714, 742, 2600, -1617, -4197, -5942, 1543, -1162, -12236, -15678, -6892, 332, -945, -1261, 5147, 14150, 7654, -978, 3875, 6585, -6409, -8219, -4133, 7150, 12366, 16600, 14905, 4785, -1711, 7434, 8126, -7573, -6834, 7344, 22503, 8844, -3878, 9521, 23108, 28564, 29256, 35860, 28749, 28638, 19060, -7923, -8502, -2012, -6811, -5609, 6806, 12913, 15527, 15901, 16191, 13580, 6835, 2987, 1515, -4338, -1673, 8360, -7191, -5204, 5348, 10219, 10675, 12167, 27138, 14807, 12343, 23526, 18777, 6500, 6551, 5154, 1386, -765, -11862, -17969, -18042, -10553, -19292, -21565, -23741, -22474, -22706, -17591, -4128, 8340, 5230, 2449, -700, -2351, -8002, -20540, -10277, -1855, -4047, 2547, 4385, -60, -4865, -7078, -2943, 4322]
6784D322k839o306O043R544j2075j8335m805l033J751L461M09J86N828N031N316
6769e502J993Q533J839j0200q2r281j2433P25P162J1747p395p647K59J2567K726
6754d989P248J1570P475j1111j4442O159K1443j0273J557m445J978l84O256p500
6740A0542M288L068k951o916M66M054R639K257j4889j0153J1324j337L164m760
6726G796l98P782j4293m774q70j510p481N708J3512J0792L144q965o896R237R752
6711B2536p762J0140r346p174n193o492r806R02N413K1578L342j0756P420J6467
6697C1269M182l172j3517r33O259p859j5975K954j309L64j371M880M914m140j3200
6682f654l818l764L520J0419j286J0805P663m286q50m006O451Q222m270q465j0185
$$ y = [4322, 1483, -4823, 1220, 10764, -1311, -19646, -24451, -27484, -25733, -22272, -21863, -21677, -15849, -10818, -5502, -3509, 5024, 6863, -3337, -3419, -12700, -25133, -24408, -17246, -5499, -12894, -20541, -20282, -7715, -4989, 2259, 13829, 21304, 10193, -4249, 1910, 23353, 13080, 14637, 10192, 12170, 11786, 18042, 10542, 14830, 17898, 14947, 8031, 8497, 12551, 22190, 24447, 9558, -595, 10729, 9392, 12556, 7796, 7398, 15180, 887, -3887, -4757, -6267, -13748, -8040, 5472, 16264, 19408, 10443, 3547, 12784, 22536, 14774, 24914, 15568, 8394, 3201, -3291, -13097, -12195, -6782, 14796, 18138, 7382, 14802, 31269, 35451, 32279, 18762, 17829, 24088, 16229, 254, 3208, 1899, 2263, 892, 5772, 10686, 6546, -6654, -10472, -14236, -10716, -297, -1583, 9222, 16885, 12599, 11749, 7743, 14194, 22416, 18146, 9681, -504]
6667e04Q35K741j894n358J301K23N275k345K337L727q393P03j423j2871J0789
6652d857J045m340J498O563m45l148l941O930R656L821j1728r493J129J63P414
6637B67L972M267R985n253j6430r20L818j2639j2374j0758R566J1867Q561J9320
6623A3249J232j1114j402l122M895K660k952o734m504L650N678k378l681O203
6609A680N173j739K641j2258j7397o476M029P508J7346K845m373J069L075Q840
6595A1963k851j0968k20R169K0477L696j2227Q742K742p794k2643n465J3688J1320
6581A9629l994o171q168M310J1893l887j1083m53l496j0556r345n776l71P467
6567b0001P361J95j2063P734J467O288Q937O186R211N065j2056j2182n569L38
$$ y = [-504, 331, 3072, 1178, -4180, -2879, -2656, 2619, 274, 2611, 6338, -2055, -1352, -2775, -15646, -4857, -3812, -8152, -6654, -91, -536, -3684, -7625, -695, 8961, 12782, 1054, -8439, -7310, -7147, 267, 4239, 8506, 18491, 13238, -3192, -4112, -294, -12933, -25307, -36065, -26499, -14632, -6071, 13249, 14481, 3367, 1965, -1157, 3738, 6398, 3446, -3288, -7792, -4142, 1536, -842, -4523, 1680, 6853, 5114, 7755, -4503, -21900, -28376, -24347, -16839, 507, 3352, -1021, 48, 3123, 11963, 9112, -1856, -2076, 7093, 27570, 31266, 19039, 27781, 30523, 22729, 86, -5379, 8309, 19629, 15635, 9464, 1296, 5606, 17499, 13612, 2529, 2076, -1420, -11976, -21321, -27097, -27468, -20001, -12640, -12445, -24508, -16774, -15307, -9019, -82, 6104, 15315, 20380, 8324, -3858, -9427, -9089]
6553i089l490M356j28M226L809R021q41o381J715k972j1808Q660J3504j040r812
6538b70J279K457m627N557p947M434j581k120M873K799o381L014r719q562N803
6523a0991L386J2829r408J653J1230r068Q36O987P252J676J52r524l20Q320j149
6508A3861j1630l538K103J8798k702r984N268r766l380M503m696k493l518m096
6494a1270OJ0091J1700P19q357l868o033k2093J002R372R146K961K942J2150p879
6479E89n738p6N705J1184O65l209J422J5526J774j1507o977j4381r67R490L09
6464C809j4179N125P532N413O926j397j7492J274K85N39n203k727j830Q833j574
6449d666m52M817k232Q691J2208k048m330j6313m611J4346J2727j0919p341o608
$$ y = [-9089, -12579, -8223, -8351, -4125, -316, 8705, 7864, 1483, 3198, 226, -11582, -2922, 10582, 9542, -270, 1009, 3466, -1161, 4396, -3551, 883, -698, -2818, 2055, 4854, -1527, 1487, -8232, -16794, -10991, -7605, 5224, -4184, -2531, 8699, -369, 467, 7454, 14706, 16382, 16534, 7010, 6690, 15010, 13861, 2231, -1307, 796, 19594, 16892, 6908, 12176, 2410, -970, 3533, -1163, -3656, -7174, -11270, -11264, -1173, 10527, 11246, 2889, -979, -7012, -29105, -28103, -18731, -9585, -6624, -3682, 8468, 589, -5149, -5225, 480, 11664, 12329, 9120, 10542, 26068, 27842, 16335, 9358, -5023, -5990, 3500, 3809, -10370, -5245, 2287, 7700, 14626, 13229, -4263, -2989, -2704, -2165, -7368, -10095, -11925, -3092, -4666, -5118, -301, -2533, 6158, 18366, 16318, 11988, -4325, -8936, 5410, 18137, 7218, -123, -6731]
6435f731O869l068j5068k136J0139J138j6165J5169K2976n09j430J455j2047n575
6421d983j888J2711J1341Q442l003j1524p800k780k397J8331j656l976l332l280
6407D206p910kL9j173k042P806j15j2491K845j57o918P346J1909N250n776l070
6391b53N286j591p262N954P958l149L149o896N678j112k002K356k76O990R123
6376B3953M492j258j6924k1425M935q536p773R063K442K555q705J701J0694R063
6362D277P007m83l524J135j4919k852N24j4900o852J828J2606J8477J689r529
6348e516j1705K058l423J0668P072J0780R871Q740l35k0528k705j813j299n191
6334c326j0577n69O805O744q063o456J323J5677J2468j644m626L677j1677k099
$$ y = [-6731, 138, -2930, -17998, -20134, -9995, -8857, -25022, -9853, 13123, 12614, 11184, 12639, 592, -4983, -6871, 5840, 17181, 25623, 22620, 11096, 3296, 516, -1881, 16450, 14794, 10818, 7486, 4206, -3704, -3706, -3667, -4840, -6882, 924, 809, -11682, -8837, -8994, -15912, -8566, 3343, 8593, 2817, -253, 5033, 3442, -3820, 2134, 10092, 6943, 10092, 3196, 8874, 7762, 5760, 8116, 7840, 14830, 23953, 28445, 27187, 10263, -11162, -6227, -14763, -22536, -13473, -11031, -8476, -17181, -15480, -4786, 4277, 11284, 10801, 7277, 8412, -6507, -9359, -8835, -23735, -30587, -28759, -16153, 2324, 4013, -5516, -17221, -15163, -18586, -7918, -846, 9934, 19805, 28545, 28210, 7682, 4977, 3164, 1865, -3326, -13903, -14472, -7667, -923, -8986, -15442, -14119, 1558, 14026, 12382, 7756, 11433, -244, -2343]
6320b343J674j710p451l908Q404Q701p572Q58L142J709Q769m41m07J72n87l712
6304E298P52n39M280M959k330j1004J31l927n885J73m644P00K807r811Q305R019
6288a716n882m446L020J0288l708N060j1579J81J5804j1180j1009J662J2322R895
6274H712J230j118n18n472j3357l349J2952n393j49J5549q237J17j228J274J6406
6259A7419j4534j2805J276J5211J3532j3582o791J1056o59o451l472o165q690
6246a4655j3828j919J2461K1979O841r761o799J2583j0355o185k534R81R803j263
6232b651P500q854j73m737o69p340l41Q406O740n468J735p337l569M869J273O2
6216a0554M532l542J7366l74j6543j4474m681J8997K0006n860j0923j903J4313
$$ y = [-2343, -669, -2379, -9830, -13738, -5334, 3367, -4205, -3347, -205, 1504, 10273, 9832, 9425, 9597, 9010, 5298, 6050, 5511, 9791, 14750, 12420, 1416, 1547, -2380, -8265, -8092, -12736, -12036, -9229, -19040, -10735, -1716, -7598, -12044, -9024, 1264, -2444, 2616, -8963, -8782, 7022, -4158, -15167, -13505, -1183, 8712, 9942, 8824, 8306, 2834, -10523, -13872, -920, -6313, -6462, 9087, 850, 967, -261, 1013, 17419, 2885, -9920, -8644, 6567, 20099, 6517, -274, 10782, 10123, 3672, 200, -5965, -14655, -28483, -30402, -17941, 4038, 10879, 1118, -5681, 6902, -3453, -9638, -12172, -11191, -1388, -2651, 4849, -4005, -4178, -8915, -9584, -16924, -17265, -8859, -2119, -7587, -5852, -13189, -16758, -11889, -10616, -10554, -6022, -9564, 7802, 7428, -9115, -23589, -28270, -9273, 10733, 4873, -6050, -7953, 6360]
6203F360j2820j4579O658K1960M753N335k963n22o648l529Q881r640o304K091
6189i67n514j0004p888P443P358L146r395J019O756m786N636l402r117p160R56
6174b5919m78K786K763J0450N095M953J670M353M060Q60j3904p680O44j754Q289
6159c812O829n931J1492J3561M816j613j8517r576J1678j0448O406J5536M781
6146B5202j4987m760J3444L514p021l948l188q871n727l976l265j764P16R993
6132d638M582l310j440P592N195p552m2Q785j697m943Q01O189M802o623j6750
6117i049L414O39j3101M204J6799P764m361r989R876J399q205p047P769M381m237
6102B56O357P297p504l123l048P379L487r777j9163k951M749l860o35K871P312
$$ y = [6360, -6460, -21039, -14381, 7579, 12332, 17667, 14704, 14182, 7534, 4005, 12886, 3246, -3058, -967, -6481, -16485, -24373, -16930, -9572, -6426, -15821, -14802, -8046, -12832, -7196, -10598, -19715, -26875, -25919, -26397, -23611, -20848, -10398, -5303, -350, 1320, 5673, 9733, 10593, -3311, -10991, -10347, -12101, -3812, 3017, -2914, 8578, 22139, 26955, 25342, 6825, -2751, 8927, -1521, 4885, 20421, 25202, 10215, 5455, 18899, 22413, 15392, 11444, 8256, -615, -6342, -10318, -13583, -15347, -14631, -4638, -56, -3366, -4806, 2786, 7981, 429, 387, 9172, 7475, 2532, 3333, 9522, 14324, 7701, -9049, -5635, -4996, -18097, -13893, 2906, 10670, 6309, -3680, 6196, 7595, -610, -7657, 112, 4493, 256, 6613, 13910, 6406, 3283, 235, 7614, 11101, 1324, -17839, -20790, -16041, -19901, -20536, -17665, -10353]
6087a0353J598q037k804J2219N541M544N811J243n649N494R909p159p354j926
6073C077r512L61M551n718j2r109m628N056R097N332n325q185j517J4426L153
6058A047j1047R05J0995j243J19J1923k5410o780M609p831N120L584Q317p043
6044a2735N532J4399L939l916P086O588J383k3988j8545j277N122J8611R607o480
6030E326j4840j2638J8527J6305r239J2500l386q778J4803Q319j3948j2320r578
6017h947J777Q75P070J486P485O321J938L850O545L371R796j1285j8619l058j7624
6002i019p962P957P023k016Q02j7841n857o128K213J1896P334J06J1552J0277
5988A0337J871M057j876j3526l807L410m821n310R108j83l872p107l55R490p31
$$ y = [-10353, -8755, -16792, -19596, -7377, -1836, 2708, 8519, 9762, 4113, 9607, 19516, 12357, 5003, 3077, -6435, -6074, -1523, -7241, -7253, -16362, -20990, -15934, -6837, -1505, -6830, -15015, -16532, -2106, 1047, -10000, -9095, 1900, 657, 776, 12699, -12711, -19491, -14882, -22713, -17593, -14009, -5692, -12735, -7203, 7196, 11135, 7219, 14305, 20893, 22276, -1712, -20257, -21534, -16412, 2199, 11806, 5326, -9514, -22152, -3625, 12680, 3441, 15941, 12555, 3777, 18580, 26899, 12951, 631, -8947, -7170, -6295, 775, 2261, 9746, 16067, 18005, 21855, 28400, 31771, 41567, 30282, 11663, 8605, -9019, -16981, -9024, -2001, -4017, -3215, -21056, -26913, -33041, -30828, -18932, -11598, -11492, 60, 10337, 12208, 16265, 14389, 863, -2944, 466, -4355, -9665, -557, -740, -4612, -11719, -12074, -2584, -3315]
5973c315n838o879l427j371j0923R40R055K958P151O073n7l456Q102j65k481L417
5957b16L348m140k313L341o706M978M431R295p929k0685j3491k943J8161J0721
5943d148J683p070m866K1886j783k643j727L661q475J354Q224l564j158L547M352
$$ y = [-3315, -9153, -16032, -19459, -20830, -31753, -30813, -21758, -18800, -11649, -5576, -5633, -9089, -987, -1152, -3633, -216, 3132, -1008, -3321, 20, -6686, -1708, 2723, 12018, 4089, -16596, -30087, -33030, -14869, -4148, -2465, -9535, -14401, 7485, 5702, 3059, 1332, 4993, -3482, -2128, 6096, 2532, 1374, 4921, 9273]
$$ [...]
##END NTUPLES=NMR SPECTRUM
##END=
