##TITLE=Analysis number 307108
Compound Code gk 00289
Project Code adrs
Chemist Name dona-fine
##JCAMPDX= 6.0         $$ Bruker NMR JCAMP-DX V2.0
##DATA TYPE= NMR SPECTRUM
##DATA CLASS= NTUPLES
##ORIGIN= Bruker BioSpin GmbH
##OWNER= NMR
$$ XWIN-NMR		Version 3.5
$$ Wed Apr 20 17:16:19 2005 GMT Daylight Time (UT+1h)  MAYBRIDGE\NMR@NMR_250MHZ
##.OBSERVE FREQUENCY= 250.131544655141
##.OBSERVE NUCLEUS= ^1H
##.ACQUISITION MODE= SIMULTANEOUS (DQD)
##.ACQUISITION SCHEME= undefined
##.AVERAGES= 16
##.DIGITISER RES= 18
##SPECTROMETER/DATA SYSTEM= dpx250
##.PULSE SEQUENCE= zg30
##.SOLVENT NAME= CDCl3
##.SHIFT REFERENCE= (INTERNAL, CDCl3, 0, 16.4479)
##AUDIT TRAIL= $$ (NUMBER, WHEN, WHO, WHERE, WHAT)
$$ ##TITLE= Audit trail, XWIN-NMR		Version 3.5
$$ ##JCAMPDX= 5.01
$$ ##ORIGIN= Bruker BioSpin GmbH
$$ ##OWNER= NMR
$$ C:\u/data/dgb/nmr/ADRS/1970/pdata/1/auditp.txt
$$ ##AUDIT TRAIL=  $$ (NUMBER, WHEN, WHO, WHERE, WHAT)
(   1,<2005-04-20 17:16:01.05 +100>,<MAYBRIDGE\NMR>,<NMR_250MHZ>,
      <created by zg, POWCHK disabled, PULCHK disabled
       configuration hash MD5:
       62 19 C7 07 E1 42 D1 B7 37 6C 3D D0 77 39 F9 E6
       data hash MD5: 64K
       6D 35 41 7B 8B 06 4F 68 EF 38 A1 FB 87 67 2D 93>)
(   2,<2005-04-20 17:16:12.37 +100>,<MAYBRIDGE\NMR>,<NMR_250MHZ>,
      <Start of raw data processing
       ef LB = 0.3 FT_mod = 6 PKNL = 1 SI = 32K 
       data hash MD5: 32K
       65 61 1E 4B AB DC 74 D4 F5 C4 1B C2 1E 39 AB B0>)
(   3,<2005-04-20 17:16:13.98 +100>,<MAYBRIDGE\NMR>,<NMR_250MHZ>,
      <apk 
       data hash MD5: 32K
       F3 CD 71 A7 FE E3 8E 7F 8A AA B0 C9 37 0F 6D 43>)
(   4,<2005-04-20 17:16:14.62 +100>,<MAYBRIDGE\NMR>,<NMR_250MHZ>,
      <abs ABSG = 5 
       data hash MD5: 32K
       DE 3E 35 47 0E F0 AC E6 B8 3E 2D BC A2 7D 9D 54>)
$$ ##END=
$$ 
$$ hash MD5
$$ CA BC 5F 4A C6 C9 BB D4 CA 3E 84 A2 EF 92 26 4E
##$RELAX= 
##$RELAX= 
##$RELAX= 
##$RELAX= 
##$RELAX= 
##$RELAX= 
##$RELAX= 
$$ Bruker specific parameters
$$ --------------------------
##$DU= <C:\u>
##$EXPNO= 1970
##$NAME= <ADRS>
##$PROCNO= 1
##$TYPE= <nmr>
##$USER= <dgb>
##$AMP= (0..31)
100 100 100 100 100 100 100 100 100 100 100 100 100 100 100 100 100 100 
100 100 100 100 100 100 100 100 100 100 100 100 100 100 
##$AQSEQ= 0
##$AQ_mod= 3
##$AUNM= <au_zg>
##$AUTOPOS= <47 >
##$BF1= 250.13
##$BF2= 250.13
##$BF3= 250.13
##$BF4= 250.13
##$BF5= 500.13
##$BF6= 500.13
##$BF7= 500.13
##$BF8= 500.13
##$BYTORDA= 1
##$CFDGTYP= 0
##$CFRGTYP= 5
##$CHEMSTR= <none>
##$CNST= (0..31)
1 1 145 1 1 1 1 1 1 1 1 1 1 1 1 1 1 1 1 1 1 1 1 1 1 1 1 1 1 1 1 1 
##$CPDPRG= <>
##$CPDPRG1= <>
##$CPDPRG2= <>
##$CPDPRG3= <>
##$CPDPRG4= <mlev>
##$CPDPRG5= <mlev>
##$CPDPRG6= <mlev>
##$CPDPRG7= <mlev>
##$CPDPRG8= <mlev>
##$CPDPRGB= <>
##$CPDPRGT= <>
##$D= (0..31)
0 1 0 0 0 0 0 0 0 0.06 0 0 0 0 0 0 0.0002 0 0 0 0 0 0 0 0 0 0 0 0 0 0 
0 
##$DATE= 1114013760
##$DBL= (0..7)
120 120 120 120 120 120 120 120 
##$DBP= (0..7)
150 150 150 150 150 150 150 150 
##$DBP07= 0
##$DBPNAM0= <>
##$DBPNAM1= <>
##$DBPNAM2= <>
$$ [...]
##$SUBNAM7= <"">
##$SUBNAM8= <"">
##$SUBNAM9= <"">
##$SW= 20.6930455092707
##$SWIBOX= (0..15)
0 0 3 0 0 0 0 0 0 0 0 0 0 0 0 0 
##$SW_h= 5175.983436853
##$TD= 65536
##$TD0= 1
##$TE= 296.16
##$TE2= 300
##$TE3= 300
##$TEG= 300
##$TL= (0..7)
0 120 120 120 120 120 120 120 
##$TP= (0..7)
150 150 150 150 150 150 150 150 
##$TP07= 0
##$TPNAME0= <>
##$TPNAME1= <>
##$TPNAME2= <>
##$TPNAME3= <>
##$TPNAME4= <>
##$TPNAME5= <>
##$TPNAME6= <>
##$TPNAME7= <>
##$TPOAL= (0..7)
0.5 0.5 0.5 0.5 0.5 0.5 0.5 0.5 
##$TPOFFS= (0..7)
0 0 0 0 0 0 0 0 
##$TUNHIN= 0
##$TUNHOUT= 0
##$TUNXOUT= 0
##$USERA1= <user>
##$USERA2= <user>
##$USERA3= <user>
##$USERA4= <user>
##$USERA5= <user>
##$V9= 5
##$VALIST= <valist>
##$VCLIST= <CCCCCCCCCCCCCCC>
##$VD= 0
##$VDLIST= <DDDDDDDDDDDDDDD>
##$VPLIST= <PPPPPPPPPPPPPPP>
##$VTLIST= <TTTTTTTTTTTTTTT>
##$WBST= 1024
##$WBSW= 4
##$XGAIN= (0..3)
0 0 0 0 
##$XL= 0
##$YL= 0
##$YMAX_a= 531978
##$YMIN_a= -516710
##$ZGOPTNS= <>
##$ZL1= 120
##$ZL2= 120
##$ZL3= 120
##$ZL4= 120
##$ABSF1= 16.44788
##$ABSF2= -4.245293
##$ABSG= 5
##$ABSL= 3
##$ALPHA= 0
##$AQORDER= 0
##$ASSFAC= 0
##$ASSFACI= 0
##$ASSFACX= 0
##$ASSWID= 0
##$AUNMP= <proc_1d>
##$AZFE= 0.1
##$AZFW= 0.1
##$BCFW= 0
##$BC_mod= 0
##$BYTORDP= 0
##$COROFFS= 0
##$CY= 12.5
##$DATMOD= 1
##$DC= 0
##$DFILT= <>
##$DTYPP= 0
##$F1P= 14.0000005364418
##$F2P= -0.99999901652339
##$FCOR= 0.5
##$FTSIZE= 32768
##$FT_mod= 6
##$GAMMA= 0
##$GB= 0
##$INTBC= 1
##$INTSCL= 1
##$ISEN= 128
##$LB= 0.3
##$LEV0= 0
##$LPBIN= 0
##$MAXI= 10000
##$MC2= 0
##$MEAN= 0
##$ME_mod= 0
##$MI= 0
##$NCOEF= 0
##$NC_proc= -2
##$NLEV= 6
##$NOISF1= 0
##$NOISF2= 0
##$NSP= 0
##$NTH_PI= 0
##$NZP= 0
##$OFFSET= 16.44788
##$PC= 1
##$PHC0= -71.21754
##$PHC1= 1.601871
##$PH_mod= 1
##$PKNL= yes
##$PPARMOD= 0
##$PSCAL= 4
##$PSIGN= 0
##$REVERSE= no
##$SF= 250.130018537949
##$SI= 32768
##$SIGF1= 0
##$SIGF2= 0
##$SINO= 400
##$SIOLD= 32768
##$SREGLST= <1H.CDCl3>
##$SSB= 0
##$STSI= 32768
##$STSR= 0
##$SW_p= 5175.98343685301
##$SYMM= 0
##$S_DEV= 0
##$TDeff= 65536
##$TDoff= 0
##$TI= <Analysis number 999999
Compound Code 99
Book Reference 9
Project Code 9>
##$TILT= no
##$TM1= 0
##$TM2= 0
##$TOPLEV= 0
##$USERP1= <user>
##$USERP2= <user>
##$USERP3= <user>
##$USERP4= <user>
##$USERP5= <user>
##$WDW= 1
##$XDIM= 32768
##$YMAX_p= 525675615
##$YMIN_p= -835479
$$ End of Bruker specific parameters
$$ ---------------------------------
##NTUPLES= NMR SPECTRUM
##VAR_NAME=  FREQUENCY,     SPECTRUM/REAL,   SPECTRUM/IMAG
##SYMBOL=    X,             R,               I
##VAR_TYPE=  INDEPENDENT,   DEPENDENT,       DEPENDENT
##VAR_FORM=  AFFN,          ASDF,            ASDF
##VAR_DIM=   32768,         32768,           32768
##UNITS=     HZ,            ARBITRARY UNITS, ARBITRARY UNITS
##FACTOR=    0.157963299565203, 1,           1
##FIRST=     4114.10847709776, 0,            0
##LAST=      -1061.87495975525, 0,           0
##MIN=       -1061.87495975525, -835479,     0
##MAX=       4114.10847709776, 525675615,    0
$$ Real data points
##PAGE= N=1
##DATA TABLE= (X++(R..R)), XYDATA
$$ [...]
19071b5130m390O807J806N413Q602k915J536j6039k775J1010P562R167K0668m503
19057A6819j2635q562l884N144P205r869M275r54j1466j1233n633L381J4540J0049
19043b823j3177r142o05O203l016n404J175K672K650N932J1294O246j445N843
19029F403Q016N02P893J4458J8420L003O111L6646O4493P5948Q6876O3474M5175
19016D37418m786q8780j06499q0237l9900l0546O84L903j7228j1376j0886q099
19004D3668l585J528N739K056k59r069j4824j671M767J8548J0743J482K6097J3280
18990I8500k003J8267L3380O9669R6626Q7894M4806L1052m1374j20962j06615
18979B09240n3285k2926j5003j8945k7425q658l328l685L525j283m374l1532r641
$$ y = [-25130, -29520, -22713, -20907, -15494, -6892, -9807, -8271, -24310, -27085, -16075, -8513, 654, 21322, 16819, 4184, -4378, -8262, -3118, 4087, -5782, -1507, -2461, -13927, -25160, -30793, -27412, -12872, -2823, -16000, -25142, -25747, -19544, -22560, -27964, -26789, -24117, -21467, -15535, -4241, 2005, 560, 6403, 14419, 14921, 22814, 37272, 55692, 58695, 64806, 101452, 165945, 241893, 328769, 392243, 437418, 432632, 343852, 237353, 157116, 117216, 86670, 87354, 91257, 74029, 62653, 51767, 43668, 40083, 41611, 47350, 49406, 49147, 40078, 25254, 23583, 28350, 46898, 57641, 59123, 85220, 98500, 96497, 114764, 148144, 217813, 314439, 402333, 447139, 478191, 436817, 315855, 209240, 155955, 133029, 118026, 99081, 71656, 62998, 59670, 55985, 59510, 58227, 53853, 22321, 12680]
18966A2680J2494L202j0090n695J9189L532j0535o297p604j3563k24Q671r65n023
18952b28q103l602m963N516L841l733m353R486M928j6517r335N135P616J1437
18938b875M839L265J951m831m230o685J1056k425M45J5893K995j1903j8355P44
18924a0116O496n97N102N613j6773j519K1892J1226j3320q486j2567J1639P454
18911F044K853o372m207j4427K727J1360j387J1336P787l418j0419M892j7204
18898a0435n159M57J4215N728j0680N13j1672J457J7698N728l761j105j4720N964
18884e772J590O902j2353j1197o013N772J8321J046p38R524O96m685o494N07K91
18869b603n449o23k969J1888J1805o419l314p263J0731J3530J498l54o891l03
$$ y = [12680, 25174, 28376, 18286, 12591, 31780, 35312, 24777, 18480, 10876, -2687, -2911, 5760, 4795, -228, -8331, -11933, -16896, -11380, -7539, -11272, -15625, -6139, -1211, -17728, -27063, -21928, -14312, -2875, 1964, 5229, 7180, 2349, -1881, -8566, 2490, 65, 510, 16403, 19398, 7495, -10860, -10116, -3620, -4217, 885, 6498, -10275, -11794, 10098, 21324, 8004, -482, -13049, -1410, 6044, 8897, 2525, -1682, -16109, -13382, -2022, -3409, 7927, 15714, 12296, 1877, 6769, -10435, -15594, -15137, -922, 4806, -5874, -5361, -17033, -15576, 2122, 7850, 4089, 2984, -11736, -5772, -4182, 2720, -9633, -20830, -26843, -21071, -2750, -1704, -2442, 7082, 7778, 3093, -3401, -2894, -2603, -8052, -8675, -11644, 244, 12049, 5630, 2316, -4947, 5784, 19314, 20812, 20458, 13567, 13264]
18855A3264j922k939J1975j0867j1103K032q201K47q420Q351P233n163j3187o128
18841b4828J3142P173J6401J0135o754k071j2412j0440L669N590K701n29o17M598
18827E758Q570l414j748Q023L121m034p740m260p204m818j5661L050J4138q798
18813a5017q475L855J0847q821j5241J1717J6370q35M93J4126j438L01j1512J539
18799b091N011Q408K45K119M662M08r627J010P271M269p386m283L757l889j983
18784G901R59L968j3183m264K0471J3582j826N274p057k091J3604J2132J1245
18771F0715J2299O371Q952J7522n86j9234m1609o1375n1102l1283J6757J9636
18759f2937J0772J1484P001r149M175J6469N332L23J1554k996j2446m301Q214
$$ y = [13264, 11342, 8403, 20378, 9511, -1592, 440, -7761, -7514, -15934, -7583, -350, -5513, -18700, -24828, -11686, -4513, 11888, 22023, 15269, 13198, 786, -9654, -5985, -395, 2306, 1777, 1160, 5758, 14328, 10914, 9166, 17189, 20310, 16276, 8536, 4276, -2928, -7746, -23407, -20357, -6219, -15017, -23492, -19637, -8790, -17611, -32852, -21135, -4765, -5600, -5107, 9019, 7581, 7882, -3630, -2091, 2920, 11328, 11573, 13692, 18354, 18762, 9135, 10145, 17416, 21685, 14299, 10016, 13773, 9884, 7901, 8860, 12828, -355, -4619, 15852, 29434, 27608, 32882, 25825, 23734, 37338, 49470, 60715, 73014, 79385, 88337, 105859, 105273, 86039, 44430, -16945, -68047, -99330, -82573, -62937, -52165, -40681, -33680, -42829, -38654, -22185, -16853, -16530, -4976, -7972, -20418, -24719, -16505]
18746a6505kO713J7727j41j5728j3453J1806L381q131k0250m141M382n937j8139
18732e8418l0622j6548k6728m8575p639L6224K4418K3745O946J0296J1279K8665
18720d6957o82j3677p805R935N266M432k354P731j919L284L762K0122n251k292
18706b6405k1324m702Q707P468o711j6191J09l095M046J3977R397j873k341K856
18692c6082M307K0386r690j5678k611M550J1562J2762Q252j609j574L61k665k619
18678a0348P82K4193J1241K561j2092l423P906j3674j421J8086o915m738o229
18665E929k958q503j2569j141r578r300K1068L920n936O185m217o903k7585L336
18651d8252J8207K289J448O48L66J8601M632L735J2319M277l245R269M694k1270
$$ y = [-16505, -16507, -9794, 7933, 7792, -7936, -21389, -9583, -6202, -14333, -34583, -38724, -34342, -40279, -58418, -89040, -105588, -132316, -180891, -188530, -152306, -127888, -104143, -97197, -86901, -75622, -46957, -47639, -61316, -69121, -59186, -53920, -49488, -51842, -44111, -46030, -42746, -38984, -18862, -24113, -26405, -47729, -52431, -43724, -36256, -42967, -59158, -59049, -62144, -58098, -44121, -34724, -36597, -38938, -36082, -31775, -11389, -21079, -36757, -39368, -34818, -23256, -10494, -2242, -3851, -5425, -5064, -7729, -10348, -9566, 14627, 25868, 28429, 16337, 12914, 20820, 7146, 5725, 23811, 16896, 12158, 5929, 2971, -5532, -18101, -19242, -28820, -38120, -17052, -13132, -19068, -12883, -17100, -24003, -51588, -48252, -30045, -27756, -26308, -25660, -25294, -6693, -2061, 1674, 13993, 18270, 15025, 24294, 28988, 7718]
18637G718L060j71p260j1503L282J4601Q413j6077j0582Q580q64R95n923P196
18623A465j3718j4065Q925J13M364M17J1513O600J083p90j6312r473J5284m147
18609h741r129n003N536J2998j3887O304K345n953O797M738J1394P076n068m549
18595D858q846O866L660O063q944j8859K964J4922n251O137n148Q101K329O703
18581A5555J5760m525j992J009O077J4717Q719j2547m873j2610j6768p484n600
18568d562P70L91j2793L224N83R744Q486J2971J5636k763p546k531N311J7284
18554D4205L4354M208l7052m0794P978l9311l8954Q278J201K3840L1377R378j8413
18541i705k692j679l652O759J3698O9k658J2263J87L08P789L267K18N711J8468
$$ y = [7718, 10778, 10607, 3347, -8156, -4874, 9727, 18140, 2063, -8519, 61, -803, 192, -5731, 1465, -12253, -26318, -17393, -17280, -12916, -12499, -986, 5614, 6697, 5907, -10405, -19878, -4594, -8741, -17870, -22873, -17337, -4339, -18226, -11922, -9577, -15530, -8733, -3995, 7399, 14475, 9407, 4858, -3988, 2878, 6538, 12601, 3657, -15202, -12238, 2684, -2567, 3570, -1578, 6523, 8852, 15555, 31315, 26790, 24798, 25807, 31884, 46601, 55320, 42773, 37900, 25290, 8522, 1038, -4562, -3792, -3401, -16194, -12970, -12387, -2643, 5843, 18814, 34450, 31687, 24141, 21610, 26921, 44205, 78559, 82767, 45715, 4921, 12899, -26412, -65366, -57088, -55887, -32047, -670, 8708, -9705, -12397, -14076, -17728, -10969, 2729, 2798, 140, 12403, 12590, 12898, 20687, 23954, 24172, 29883, 48351]
18526D8351n816j9959l589J2677K3460K5159K8773j879l9110m1468o932k7949
18514h282n858J9892J0744J8111O973n502p143J203j0366j4677L742J2233j322
18501A9748Q278l185j043j569L749J2470o729n226L367J40m366J1098P120M279
18487D8131J5699J1684m274n878m972J4917J8636K5502L607n750K526K5375L0311
18474A75514o53j3344P15J1767K5032K8843L9558N6243O5762O9052Q0014Q4759
18462F23262O4707J6370q7467j11423o4790l3641p660J8896M2394M4436M0663
18451E45747N2199N2670O9367R9462J24018J26469J52993J50842K00204K78429
18441A852400L87190M61964N58195O58264P09397P91442R31219J075389J336564
$$ y = [48351, 42535, 22576, 18987, 31664, 55124, 80283, 109056, 107177, 68067, 26599, 19667, -8282, -14140, 5752, 16496, 34607, 41580, 36078, 28935, 30138, 19772, 5095, 8837, 21070, 19748, 28026, 24841, 23798, 22229, 25978, 38448, 31719, 26493, 29860, 30000, 25634, 36732, 43852, 48131, 63830, 75514, 71240, 65362, 60390, 75307, 93943, 119445, 123052, 117302, 119828, 145203, 175514, 174861, 161517, 162232, 173999, 199031, 227874, 267432, 323675, 389437, 458489, 538503, 623262, 687969, 704339, 616872, 505449, 440659, 407018, 399358, 418254, 460648, 505084, 545747, 597946, 650616, 719983, 819445, 943463, 1069932, 1222925, 1373767, 1573971, 1852400, 2239590, 2701554, 3259749, 3918013, 4627410, 5418852, 6350071, 7425460, 8762024]
18432H762024J732151K342417L382561N373037Q812123J4004860J7758674J3987018
18424G6154865Q566463k03963j9548322k2076101j3391583p209563m057147k435651
18416A5798998j614718j049430n45316m91348p93950q25978p33735n71254m51284
18407H721985m10205k39986K9211K50322L63787N59183P55126R61096J320474
18398A2310993J819407K599969M060349O725404J1180228J7093675J8613490J2482156
18390H6885671P144903p912301k4916418k0614216j1575512o374403l834393k466964
18382A6336367j704827j097339o55388q33934j094252j076656r75011q82157r01148
18373G115655r09182p79713o43269n20331m13483l63063k93779k13091k04335
$$ y = [8762024, 10494175, 12836592, 16219153, 21592190, 30404313, 44409173, 62167847, 76154865, 84721328, 84517365, 64969043, 42892942, 29501359, 22291796, 18234649, 15798998, 14184280, 13134850, 12589534, 12098186, 11304236, 10478258, 9744523, 9173269, 8721985, 8311780, 8071794, 8101005, 8351327, 8715114, 9274297, 10029423, 10990519, 12310993, 14130400, 16730369, 20790718, 27516122, 38696350, 55790025, 74403515, 86885671, 94030574, 86118273, 61201855, 40587639, 29012127, 22637724, 18803331, 16336367, 14631540, 13534201, 12878813, 12044879, 10950627, 9873971, 8898960, 8016803, 7115655, 6206473, 5426760, 4783491, 4263160, 3849677, 3486614, 3192835, 2979744, 2775409]
18364B775409k04708j73725j55897j47589j23715r9635p9366p7582m2407j0411
18354A660374l776k2773n2445j44298j82102j54572j17855p9530n0112m9673n1651
18343G51587o1153n2258m2664j9057j0022r797j7758k8685j0293q605m035K500
18331D89760k057k3067j1985J796j0419j604K943j989K6564J8820K4326K4866
18319E37954R749q748j7138l1696l1223q548j744j0168o534K0321J6710J2471
18307D81406K0672K683N941J2575j5495k6832q737R310M171l0410l1718k1741
18295D01825p542P109n293l022j9000k4931r088M596J3625J7925J8262L2640K9957
18282D57063P87j5883j747L1641L2521L8153M9985M5903M4216M8686K8487R73
$$ y = [2775409, 2570701, 2396976, 2241079, 2093490, 1969775, 1870140, 1790774, 1713192, 1670785, 1660374, 1656598, 1633825, 1581380, 1437082, 1254980, 1100408, 982553, 903023, 852911, 803238, 751587, 690434, 638176, 595512, 576455, 566433, 556636, 538878, 510193, 499900, 491295, 487260, 489760, 487703, 464636, 452651, 454447, 444028, 442424, 445367, 443378, 469942, 488762, 513088, 537954, 547703, 538955, 521817, 490121, 458898, 450350, 448606, 438438, 431904, 452225, 468935, 481406, 502078, 504761, 510702, 523277, 507782, 480950, 472213, 481523, 485694, 455284, 423566, 401825, 394283, 401392, 396099, 393077, 374077, 349146, 340058, 344654, 358279, 376204, 394466, 427106, 457063, 457850, 441967, 440220, 471861, 504382, 542535, 592520, 638423, 682639, 731325, 759812, 760785]
18270G60785O469p69k1783k7278k3475m6548l5438r497j6471j4749k6376o134
18258E38736k0809k8766l9046k4514k2649k0583j975m869P703k296m104r312k6504
18245C41012l6777k4140j3737k1228l793j016j7163q690m042m94K0001J4755q124
18232B36564l276J5905K6933R123J9045K6470J2818Q781P698J598P973J2601Q91
18219C83124J1485J6219K7432K8738J8965J2619K3495J5753J5130j981k4916m6070
18207D79993k9406l4399o653r349j0647j0779J4459N868Q241J344j7232k1534
18195C69906j1299k2213k5941l1218n947r476j4229j8224j8993j890k529m915
18183B03032j1846n879J5170O189q506O102J1234O826K010L833o100N084M344
$$ y = [760785, 767254, 766485, 744702, 717424, 693949, 647401, 611963, 602466, 585995, 571246, 544870, 538736, 517927, 489161, 450115, 425601, 402952, 382369, 380394, 375525, 383228, 380932, 376828, 367516, 341012, 304235, 280095, 266358, 245130, 241337, 240321, 223158, 214468, 210426, 209932, 229933, 244688, 236564, 233288, 249193, 276126, 285249, 304294, 330764, 343582, 352363, 360061, 361659, 369632, 382233, 383124, 394609, 410828, 438260, 466998, 485963, 498582, 522077, 537830, 552960, 550979, 526063, 479993, 450587, 416188, 409535, 400186, 389539, 378760, 393219, 399087, 407328, 408672, 391440, 369906, 358607, 336394, 310453, 279235, 273288, 263812, 249583, 231359, 212366, 210476, 207947, 203032, 191186, 185307, 200477, 206666, 198160, 204262, 215496, 222322, 224332, 228165, 222065, 227149, 231493]
18170B31493K1266O688pK919M260M977J3714J2367L438M093j747j4035o769j1758
18156B70899J271j625P21O912J7224M331k1279p396j2159j6227o70j6267j4516
18143B11219p639j0257O081p020o946J012K1238K9453J5510R51N685J5947L1289
18130C06523L2748J7510J7743O1057N4496O0237P5781J06359J47304J87732K18309
18119A285799K40484K90352L46952M44908O17512R56828J582310K654416M100139
18110A2519700M475893K974816J830241j852900o060889m812572k563210j346696
18102E164383p62929m68039l74202l26121k30601k60995l12685k92685k58379
18093A877747k15905j80710j47274j16718j00762q3869o1088o2893r0310o5403
$$ y = [231493, 252759, 259447, 259440, 262359, 266619, 271596, 285310, 297677, 301115, 305208, 303461, 289426, 282657, 270899, 272170, 270545, 271266, 278178, 295402, 299733, 278454, 271058, 258899, 242672, 242002, 225735, 211219, 203580, 193323, 199404, 192384, 185438, 186450, 207688, 237141, 252651, 253602, 259287, 275234, 306523, 339271, 356781, 374524, 435581, 490077, 550314, 626095, 732454, 879758, 1067490, 1285799, 1526283, 1816635, 2163587, 2608495, 3226007, 4182835, 5765145, 8419561, 12519700, 16995593, 19970409, 21800650, 19947750, 13886861, 9074289, 6511079, 5164383, 4401454, 3933415, 3559213, 3233092, 3002491, 2741496, 2428811, 2136126, 1877747, 1661842, 1481132, 1333858, 1217140, 1116378, 1032509, 971421, 908528, 818218, 752815]
18083G52815p3418q0758n2781l9237l4692l4362k2546O55L056j2347l098N292
18071D08579L3213P4388P5690L3083p84q0698j22954r5829n6610k8547k4149O300
18059B21682J302J045M584Q139M371J4197K8745J610k1079l2125m5623n3709k5953
18046A07186k0632M25J9203k823j6835j1124j6536j1370M97q423j2210j0984k63
18033A6111K957J2685J1001R357m603j0938r041L674J1247j1104r702J7978P553
18020D7175R32J205k062j03K158L100L120l134J282m039q999j377p48m367k770
18005C1373r241r301Q504l214j731O563j090L399J0709M529R815j539j6050j7594
17991A5132Q685J9072R719M198m469J0862J2051l707j9278k8322J4294r16J02
$$ y = [752815, 679397, 598639, 545858, 506621, 471929, 437567, 415021, 415676, 418732, 406385, 403287, 408579, 441792, 516180, 591870, 624953, 624169, 543471, 420517, 324688, 268078, 239531, 215382, 221682, 222984, 224029, 228613, 236752, 241123, 255320, 284065, 285675, 264596, 232471, 186848, 133139, 107186, 86554, 86979, 106182, 103359, 86524, 75400, 58864, 47494, 47991, 39568, 27358, 16374, 16111, 19068, 31753, 42754, 52111, 47508, 36570, 27529, 31203, 42450, 31346, 21644, 39622, 47175, 48107, 49312, 47250, 47147, 49305, 52405, 55525, 52391, 53673, 49634, 40635, 39258, 38510, 34143, 31373, 22132, 12831, 21335, 18121, 16390, 22953, 21863, 25262, 35971, 40500, 50315, 48776, 32726, 15132, 23817, 42889, 52608, 56806, 52337, 63199, 75250, 71543, 52265, 23943, 38237, 37321, 37423]
17978C7423j1864j089J2716J4364M644J63q361K598j972j6957p419K774J0127
17965C7147O479j0447j3448P361M554J3587J0727j4272j1874j3666L442J0864
17953C0454R106l271l19K446P989K603n698l138k045j1273j49j134k938Q887K31
17938C1751l407J6681J885j4915j6455k640j389J8700N717N854m310j1652k40
17925B5580N802n478j598n30M303O149J4466L354m167j8313l771J862k422Q751
17911C3988L076p911p649N271p870J0697P126K1398R184j8169k5675k183K181
17898B3464L523Q680M896k3177j2530k6731n3304m8845l659L1203K8798K5733
17886d1949K4623Q834j2472m136N55r541n078J0661p352Q60J9507J304J0260R853
$$ y = [37423, 25559, 24470, 37186, 51550, 56194, 56357, 47996, 50594, 48622, 31665, 24246, 27020, 37147, 43626, 33179, 19731, 27092, 31646, 45233, 55960, 41688, 29814, 16148, 19590, 30454, 39560, 36289, 35970, 38416, 46405, 49008, 43310, 40172, 38127, 26854, 26705, 25571, 22633, 31520, 31751, 28344, 45025, 46910, 31995, 15540, 12900, 11511, 30211, 35928, 41782, 37472, 25820, 25580, 31382, 25904, 24306, 23776, 28079, 34228, 48694, 52048, 47881, 29568, 25797, 27659, 25237, 33988, 37064, 29153, 21504, 26775, 18905, 29602, 36728, 58126, 67310, 49141, 23466, 21283, 23464, 26987, 35667, 40563, 17386, 4856, -21875, -75179, -124024, -127683, -96480, -67682, -41949, -17326, -8492, -20964, -25100, -24545, -34086, -39164, -28503, -35855, -34995, -15488, -14184, -3924, 5929]
17872E929K489J5733q57q389J1680q72n314n17n437j5709j1592j0488j2332k7411
17858f3087l1292m1428R117K7163J1231N900R698Q920O230O435n051M526K1995
17845b9643J9120j5515N265R78r876N638K490N16J1224J7830R176q857M482K0134
17831C2962R435J4890K4010L5027O7103P8512P9295N6946J3506m2764r5052q7408
17819A86462n3681k4587j5093j2531l152k941j3654j989J2256J6468j1037j4536
17807F1985J4536R944J2519k55n820R316J6890M814o200M563J078Q449J6022N0516
17793A98357Q6521J15106Q0745M7458R322r6868j19151o5989n6932m7428l6966
17782A14175p733L956r927j4184n139J3606r34q721J1227J6266P886j0305R805
$$ y = [5929, 8418, 24151, 23294, 14905, 26585, 25713, 20399, 19882, 14445, -1264, -12856, -23344, -35676, -63087, -94379, -135807, -126690, -99527, -88296, -82396, -72698, -63778, -57548, -51113, -56164, -51638, -29643, -10523, -26038, -20773, -19795, -29671, -24033, -21543, -21027, -9803, 8027, 17203, 8346, 12828, 32962, 42397, 57287, 81297, 116324, 183427, 261939, 341234, 398180, 411686, 368922, 273870, 186462, 132781, 108194, 93101, 80570, 77418, 74477, 60823, 58834, 71090, 87558, 76521, 61985, 76521, 86465, 98984, 98729, 92909, 102225, 119115, 123929, 117729, 122292, 123370, 131819, 147841, 198357, 284878, 399984, 480729, 528187, 537509, 440641, 321490, 255501, 198569, 151141, 114175, 106442, 110398, 100471, 86287, 81148, 94754, 93820, 85099, 96326, 112592, 120478, 110173, 119978]
17769A19978j2386j6445K175o292M219q644k5431j4809j1901j3250N666J8852
17757D1732r113j6988p286J0167Q717L836m516l857M68l892J320J2402L593j3881
17743B2702j7664j348J1488r790M744J2257J674j464N716N285q680K215l437m963
17729A8735N929J1271j1443r809r979j4710J0247j578K913M904L787N663k337
17716A3593M671m463p75j1824q391L550P507R831m668J251J2033M917N036j294
17702C0974j2282p644k007R909R608M209p594n956N785J494O01j4241j1581J0130
17688A1405L2512L253j4299r102K9058K8148J8340m37k2420l1339N841m5010m6176
17675d0226O149M313J0460O993j982p204o510LJ3478J5925Q609q594J1380l914
$$ y = [119978, 107592, 91147, 93322, 87030, 91249, 82605, 57174, 42365, 30464, 17214, 22880, 41732, 32619, 15631, 8345, 18512, 27229, 31065, 26549, 22692, 23160, 19268, 20588, 32990, 36583, 22702, 5038, 3690, 15178, 5388, 10132, 22389, 24063, 22599, 28315, 33600, 24920, 27135, 23698, 18735, 24664, 35935, 24492, 14683, 4704, -10006, 241, -1337, 1576, 6480, 10267, 15930, 13593, 18264, 13801, 13026, 1202, -7189, -3639, 3868, 13699, 9031, 10282, 22315, 27232, 32268, 30974, 18692, 11048, 9041, 18950, 28558, 32767, 25173, 19217, 25002, 26496, 27097, 12856, 1275, 11405, 43917, 47170, 32871, 23769, 52827, 80975, 99315, 98878, 76458, 45119, 50960, 5950, -40226, -34077, -29764, -19304, -12311, -14293, -21497, -28007, -28004, -14526, 1399, 10008, 1414, 12794, 8880]
17661H880j1102j5210J1189R299K6678Q710N272q719O038J5598o070J793J6290
17648F8646J9474N875j4982k1812j1475l9969k443J1960J0762j355l633Q487P037
17635C6572M495O91k517O423J976K880o348m331j193L521J0971n091o027O093
17621D8115n268J122P632l510k069J3211N709K956j462J0248Q357M419k107J2669
17607A00022R159L404R396J5719O188J1212R964J3200J2574K5758J6143J1683
17595B44422Q237K1196J2189Q462J2754O067O906K0388K1801J2180J9792J7001
17583D11395N1911N9867M7619R6650J14127J46527J82551K07656J86183J76342
17573A680828R5660Q5840J83111K79490L24871L78249M30397N12502O96493R14342
$$ y = [8880, -2222, -17432, -6243, 3056, 29734, 38444, 43716, 34997, 41035, 56633, 50563, 52356, 68646, 88120, 93995, 79013, 57201, 45726, 5757, 3314, 15274, 26036, 24681, 21048, 29535, 36572, 41067, 41758, 39241, 45664, 47640, 50520, 44172, 39841, 38648, 42169, 53140, 48049, 42022, 48115, 42847, 43969, 51601, 48091, 46022, 59233, 64942, 67898, 66436, 76684, 85041, 89460, 87353, 100022, 109181, 112585, 121981, 137700, 143888, 155100, 165064, 178264, 190838, 216596, 232739, 244422, 252659, 273855, 286044, 294506, 307260, 313327, 320233, 340621, 362422, 374602, 394394, 411395, 463306, 523173, 570792, 667442, 781569, 928096, 1110647, 1318303, 1504486, 1680828, 1776488, 1862328, 2045439, 2324929, 2649800, 3028049, 3458446, 3970948, 4667441, 5581783]
17563E581783J119246J365142J641745K029557K691143M006419O370702J0435421
17555C5241158J6401536J9158074J3532946Q309795l924500k3839027k2147611
17548D2732371j2629567o911606l999237k403144j484448q76278n73153p60891
17540A3094047j120315j199013r92194o90224m48015k41273o3807O1556K13924
17531H614686L91779N23659O87905Q97591J246517J764647K616104M158586O840240
17522B7741714J1411276J6797258J6414515J0204728N310114j1697446k4147194
17515E2034965j7344267r455785n326461l175511k008631j338642q79187p25034
17507A1781447j034859j241269j138744r63694p79161o57587n22096m15362l46794
$$ y = [5581783, 6701029, 8066171, 9707916, 11737473, 14428616, 18435035, 24805737, 35241158, 51642694, 70800768, 84333714, 92643509, 88719009, 64879982, 42732371, 30102804, 23191198, 19191961, 16788817, 15304369, 14428091, 13854938, 13094047, 11973732, 10774719, 9782525, 9092301, 8644286, 8403013, 8339206, 8400762, 8614686, 9006465, 9530124, 10218029, 11115620, 12362137, 14126784, 16742888, 20901474, 27741714, 39152990, 55950248, 72364763, 82569491, 87879605, 76182159, 52034965, 34690698, 25234913, 19908452, 16732941, 14724310, 13385668, 12506481, 11781447, 10746588, 9505319, 8366575, 7402881, 6623720, 5966133, 5444037, 5028675, 4681881]
17498D681881k99197l03173l22913l79201l83141l20798k44696j89641j80102
17489B059019j55466j46142j35349j09857j03172j22276j04687j00803r5503q6522
17479H99242n7435n4062m8315k6313m9151l4138j8657k9618l9657m4388k6115
17468D71393k6326j8220P819j3665j4494j1480j5170K788j1586k1750j4824l72
17456C34113J49n241j0289M289J0253j8984j5337o584l603K149K346J0432J2697
17443C16390Q034J977R748j7651k9569j6618o702o761r861P145N823O196j677
17430B66474J051J428K0121L214l0520j6994p705j7416k1386p735J0087L999n991
17417A98627P999J3237r996q219l312j9398p789p704q286P51K991J2070J8580
$$ y = [4681881, 4382684, 4079511, 3756598, 3377397, 2994256, 2673458, 2428762, 2239121, 2059019, 1903553, 1757411, 1622062, 1512205, 1409033, 1286757, 1182070, 1081267, 985764, 899242, 841807, 787745, 739430, 713117, 663966, 629828, 611171, 581553, 541896, 497508, 471393, 445067, 426847, 434666, 421001, 406507, 395027, 379857, 382645, 371059, 349309, 334485, 334113, 334262, 329021, 318732, 323021, 333274, 314290, 298953, 292369, 288766, 290915, 293261, 303693, 316390, 324424, 326401, 336149, 318498, 288929, 272311, 265609, 258848, 248987, 256132, 261955, 268151, 266474, 267525, 268953, 289074, 292288, 261768, 244774, 237069, 219653, 198267, 190532, 200619, 204618, 198627, 206626, 219863, 209867, 201648, 198336, 178938, 171149, 163445, 155159, 155910, 158901, 170971, 189551]
17404A89551m280p081k63j0175j29j8267N147Q485J2395K4112J8008j2865j971
17391B02667j0025k3215j8620j3540j3398Q777L37N713o797r172r762Q627j3296
17378A08296n416R149K772m885r036j9564j1595J5798Q365O770j684r109k965
17365H6896k301q282R442J581J306p92J6241R140Q699M964n915p750k067k4133
17351H7029j9493j5462j3752O710K7298J0722n682o591L090Q776K073O444m164
17338H6998j484p621j2969n239M459R967j1680k923J0876K268P227j472O305J1758
17324I6470m205M452Q717M704n878k0243n282O117n006m073K961j1305j0739J3291
17310F9981Q502o742j1613K942j3296j4823J0388J4695K6135l007q844j315K4299
$$ y = [189551, 185271, 178190, 177927, 167752, 167623, 149356, 154503, 162988, 175383, 199495, 217503, 204638, 202667, 192642, 169427, 150807, 137267, 123869, 132646, 132983, 138696, 131899, 122727, 112965, 121592, 108296, 102880, 112029, 114801, 109916, 100880, 81316, 69721, 85519, 93884, 100654, 98970, 89861, 86896, 84595, 76313, 85755, 87336, 88642, 87850, 104091, 113231, 121930, 126894, 120979, 113229, 111162, 87029, 67536, 52074, 38322, 45032, 72330, 83052, 77370, 70779, 73869, 82645, 84718, 91162, 86998, 85514, 77893, 64924, 59685, 64144, 74111, 62431, 59508, 70384, 72652, 79879, 78407, 84712, 96470, 92265, 96717, 105434, 110138, 104260, 84017, 78735, 84852, 79846, 75773, 78734, 67429, 56690, 69981, 78483, 71741, 60128, 63070, 49774, 34951, 45339, 60034, 86169, 83162, 74318, 73003, 97302]
17297I7302K5507J2193L14j3414k5115j9588m517p516p177q639p53N052M539o623
17283E1565l129J7514N583p410j822M905l32o209j2497M112j0085q999Q153p59
17269D0590l481J9521Q444J2104J535p256J2698R165R112J019j6855k7760m111
17256E4725L874M413O494L250J7040k600j4593j3363L037J0658j2573k416J4304
17243G2250P733m445J2304R950q587j2444q277j144p53J0399m95o946Q024J3789
17229I1358L104j030N908j075L532n711J923M575j624M146J2400K0306N598J9639
17215A63049J5176M449O77j9098m0948m6004j9891o0j3208p640n400K057k982
17202C0177p344J6313K484M962r423j4874K87M511J4301O102P461j0833n630P310
$$ y = [97302, 122809, 135002, 135316, 121902, 96787, 77199, 72682, 65166, 57989, 49350, 48597, 53649, 58188, 51565, 48436, 65950, 71533, 64123, 62301, 67206, 66874, 60665, 48168, 52280, 42195, 33196, 41349, 40590, 37109, 56630, 65074, 77178, 78713, 71457, 84155, 93320, 102432, 103451, 86596, 58836, 54725, 58599, 63012, 69506, 72756, 89796, 87196, 72603, 59240, 62277, 72935, 60362, 57946, 72250, 79983, 75538, 87842, 97792, 89205, 76761, 68484, 67340, 66587, 76986, 76491, 69545, 77569, 91358, 94462, 93432, 99340, 98265, 101797, 96086, 98009, 102584, 100960, 105106, 117506, 137812, 143410, 163049, 178225, 182674, 183351, 164253, 123305, 77301, 57410, 57350, 44142, 36502, 31102, 33159, 30177, 22833, 39146, 41630, 46592, 37169, 22295, 22582, 27093, 41394, 47496, 54957, 44124, 38494, 45804]
17188D5804r408L248K0468O480J4169L2759L2176K3923P112k2829m9379k4361
17176H0162l5682k9216q898p941K808o792j6214J7109J0699j3408j3601m163J7221
17163g916L736l151J324J4764J1308R097j476l067p195J759l71L893j1582j4110
17149b987k21K2060J2029M996r328j1723m246j4051p974n849P228K276K76j2N049
17134b477R396Q440R198M71m002p478M556J4226Q060k6581K039k751n532j0314
17120b749q365R717J703L290j22J0257J1342j0713q844N717J6399N9r319r631
17106H741Q466N594J1596M049k2620j7782Q407R227R468n842j2730j353M677J0255
17092B0153j7956j1764O464N157p998o429J907N097L484J7331k94o373R91n894
$$ y = [45804, 36396, 39644, 60112, 66592, 80761, 113520, 145696, 169619, 176731, 153902, 104523, 80162, 44480, 15264, 6366, -1575, 1233, -5559, -21773, -4664, 6035, -7373, -20974, -25137, -7916, -4180, -7331, -6007, 8757, 20065, 29162, 27686, 24619, 17424, 19183, 18812, 22705, 11123, -2987, -3208, 18852, 30881, 35877, 26549, 14826, 10580, -3471, -11445, -17294, -10066, -7790, -7514, -7526, -2477, 6919, 15359, 24557, 25028, 21026, 13548, 18104, 32330, 40390, 13809, 15848, 13097, 7565, -2749, -11114, -1397, 306, 3596, 3474, 13731, 25073, 14360, 5516, 11233, 27632, 27691, 18372, 8741, 17207, 22801, 34397, 38446, 15826, -1956, 6451, 15678, 25146, 19304, 6574, 5221, 9898, 20153, 2197, -9567, -3103, 2054, -5944, -12373, -10466, -5369, -1885, 15446, 15152, 8779, 9770, 3876]
17078C876j675J1320L114N759M132j8306R987J0605P697j871j1224j2295o979
17065D140J6413m691Q616l864p105J5294P040R880K653l295k52n793M27j644p199
17050C0620q53p159P061J655o103k829L253l130k965O301P217l181p130o072M964
17035B1649K128p130O577j621n606o528M215p917R724M20K463j997Q63Q752r683
17020A6309j5904m629N357M671J068J0875O659L481R582r137J7348N579O267L341
17006F0867N62M128N990K1492J6935L2635M3363O8202Q3469R2912N3766J0924
16994D95245p0609j22690r6347n0339k2542j7407j2801l125l384n123l058k4199
16982F3621j6661l131K0090O424j0264j0107l914K526O115R828K262J0922P005
$$ y = [3876, 2201, 13521, 16635, 22394, 26526, 8220, 18207, 28812, 36509, 34638, 23414, 11119, 4140, 20553, 15862, 24478, 20614, 13509, 28803, 35843, 45723, 48376, 45081, 44829, 39036, 39463, 37819, 30620, 29767, 22608, 29669, 31324, 25221, 22392, 25645, 22515, 19550, 25851, 33068, 29887, 22757, 16685, 21649, 23777, 16647, 23224, 21603, 15997, 9469, 13684, 5767, 15491, 15911, 18374, 16377, 17240, 25992, 16309, 405, -4224, 1133, 5804, 6872, 17747, 24406, 27887, 37469, 28332, 45680, 51259, 57526, 60867, 61429, 65557, 71547, 93039, 109974, 142609, 185972, 254174, 337643, 430555, 484321, 495245, 424636, 301946, 205599, 155260, 132718, 115311, 102510, 99385, 96001, 90878, 87820, 63621, 46960, 43829, 63919, 70343, 60079, 49972, 46058, 48584, 54699, 64527, 66789, 77711, 84716]
16969H4716J2305L1266K5596M7957P6532Q2373O8442L6361k0184j07956r9227
16958B38181p2516l4445k6716j3076r61p320q446j4j3624j5966j2281J989N843
16945D0648K1842r081n476j1195m133N963Q72n143j7615N385J3014r19J0205J4022
16931E8389j4644j0574m641J0092J4144k3572m041P620q738n121m821P358n03
16918B0948L466K365l168p287L615J6203n932M684M502p926j2374j2747j0635
16905d286j1812P187K6855O972p984p846N248j991j4060K89J1211K086q523j2977
16891i631n579K5544J5352j1238o12J4265o136n832p501o979j854J2574j2413
16878d0o880n745J3858M660O663K909k3334n78j1579L598K4599Q175n52m876q259
$$ y = [84716, 97021, 128287, 153883, 201840, 278372, 360745, 429187, 465548, 445364, 337408, 238181, 165665, 131220, 104504, 91428, 90467, 83147, 74701, 74687, 61063, 45097, 32816, 34805, 40648, 62490, 53409, 47933, 36738, 32605, 38568, 39440, 34297, 16682, 22067, 35081, 34162, 44367, 58389, 43745, 33171, 28530, 38622, 52766, 29194, 25153, 32773, 24035, 18914, 14093, 21451, 20948, 24414, 26779, 23611, 16324, 19939, 36142, 30210, 34894, 39396, 31470, 19096, 6349, -4286, -16098, -8911, 17944, 24916, 16932, 9086, 14334, 12343, -1717, -1428, 9783, 11869, 3346, -9631, -15210, 10334, 25686, 14448, 13836, 28101, 21965, 16133, 8632, 1653, -201, 12373, -40, -6920, -12665, 1193, 5853, 12516, 15425, -7909, -8487, -20066, -16468, 8131, 16306, 15754, 10878, 2619]
16863B619L428K0914j2633k4671L172j945o013m720O153J8429M832k074j3913
16850f422J3023N109j7099j1608M685J7835J0603Q909p738p519k3004o252J1829
16837g649M792p633N687Q169m609q905q564L774l370O034J3057P262o571r426
16823g952n187l787N423O793K65j609M564j1918Q215M085N549R782o150O663P258
16808B1994r106k957N352J471j3985N757J8296n874j2938q739J127n276R909L560
16794H591j411k174j3685m892N231J3859Q532j218l169p108r365j0289M677p322
16780a9743k771K881J9179N800m831k95J064M63R063m027k0727k801j547N959
16766a2333R995J058P842R07j0965J1810J52J0971J0011N158O67l857m278j4653
$$ y = [2619, 6047, 26961, 14328, -10343, -7171, -9116, -15129, -19849, -13696, 4733, 9565, 7491, -6422, 6601, 11710, -5389, -16997, -12312, 5523, 16126, 25035, 17297, 9778, -13226, -19478, -7649, -2857, -10490, -4803, 3366, -1243, -10148, -18712, -14938, -18308, -12274, 783, 8045, 1474, -7952, -13139, -16926, -11503, -4710, -4445, -6054, -1490, -13408, -5193, -1108, 4441, 14223, 8073, 14736, 21994, 12888, 9931, 15283, 16754, 2769, 8526, 26822, 20948, 8010, -729, 398, -4878, 5031, 8591, 7180, 5006, -8679, -13571, -8340, 5519, 14051, 12833, 9664, 2556, -6809, -17098, -12421, -19743, -22514, -19633, -454, 5346, 515, 220, 1284, 1747, 10810, 6783, -13944, -16745, -18292, -12333, -2338, -1280, 6562, 7469, -3496, 8314, 8466, 19437, 29448, 34606, 35273, 31416, 27138, 12485]
16752A2485r782O762n286j2284N618L38J4911q229l422P250J9261Q235J384j1000
16738B6241r889q143p898m740J223J0443K985J027r951m842J0056N177j7795R920
16724C814Q360J16N081J2294K999p184J983r136j4318P844P840P166q356q970
16710I533m795p989J0838m304K571J4376J172q400o369N857n794q769M489M628
16696G044m156p673n998n66K4723J1011l897j4889j2495p986J4060K5503J0171
16683C4852n82k141q070O649j2011n407j2366K47J1620J3417k637k2037P008j2576
16669d034L062L903O430p529p655J0348K3318K308L186r935j8515J22J3M327O640
16654A5989p44o714n390m700J148L327O726M523J2107q584q418j0218O077R651
$$ y = [12485, 2703, 9465, 4179, -8105, -2487, -2149, 12762, 4533, 1111, 8361, 27622, 35857, 37241, 26241, 16352, 8209, 311, -4429, -3206, 7237, 10222, 11249, 1298, -3544, 6512, 11689, -6106, 3814, 12174, 12290, 17371, 29665, 32664, 25480, 27463, 18327, 4009, 11853, 19693, 26859, 18503, 9533, 4738, -3251, 7587, 3283, 5854, 20230, 21402, 13002, 6633, 12490, 6696, -2073, 2416, 7044, 2888, -4785, -10783, -11349, 13374, 24385, 20488, 5599, -6896, -14882, -822, 24681, 34852, 34270, 32129, 24059, 30708, 18697, 13290, 924, 1171, 12791, 26208, 23571, 1534, 8542, -4034, -972, 2931, 9361, 1832, -5823, 4525, 27843, 30151, 33337, 23402, 4887, 5009, 5022, 9349, 15989, 15245, 8531, 3141, -1559, -411, 2916, 9642, 14165, 26272, 17688, 9270, -948, 5129, 14780]
16640A4780O835R393q080j6121o969k11O703j1811q912J6837L309j0835q87J2396
16626F427J4625l717j1094K673J19j131j0684j109p761o069Q355M413O49N574
16612A270j360O463k81o082R066q337J558O21M528n20j2906O311K104O098J1029
16597A9562J564o568p887J7q113n332J6323Q205K554Q524J770r685r95l150M27
16582A7216j090p638N798j1338q370P01L439m877J9455J5159j3601p335l117r55
16568C447R11N431K1747M247j7541q191q610p978Q148J0601j240O781j1280k0026
16554a3553q977R481R284O785K733L22n531j7539m82n690p303p322J3390J8900
16540e502m728m356L810J992K047m8N832m705J202J1458l029p414M914J272J1522
$$ y = [14780, 21615, 31008, 22928, 6807, -162, -373, 6330, -5481, -14393, 2444, 5753, -5082, -5969, 6427, 21052, 17335, 6241, 8914, 9033, 7902, -2782, -3891, -11652, -17721, -9366, -4953, -4304, 1270, -90, 6373, 6092, 10, 9076, 739, 2297, 2918, 7446, 6926, -5980, 331, 2435, 8533, 19562, 21126, 14558, 6671, 6688, -1425, -6757, 9566, 17771, 20325, 28849, 30619, 20934, 19939, 16789, 17216, 16126, 8488, 14286, 2948, -5422, -4721, -1282, -6159, 13296, 28455, 14854, 7519, 4402, 3447, 4358, 9789, 31536, 35783, 18242, 10051, 1441, -6537, 1611, 12212, 10972, 17753, 6473, -13553, -22530, -13049, -3765, 3020, 5753, 6075, 544, -16995, -17477, -23167, -30470, -37792, -24402, -5502, -10230, -14586, -10776, -8784, -6737, -6785, -953, -5658, -4456, 7002, 3973, -3441, 1473, 2745, 14267]
16525A4267M123k255k155j0966r978p301m452O284p64J2234m668K051n13L255
16511h38M510r72q897j7338j950K413R688O752K0866J5985P988l153j6973j3918
16497D163o883J4843P0j4291R91P829j040j706n196J107L518m439p923j546K843
16482g660K144o539M135O83M904J206R058R50J1013j993m289p195N346J089k60
16467A2592L114r774K50O060M545N447k673k092o429n620p378K964Q733m414M954
16452A0279k699k771M62O949M146J284J926N106M44q239k453M45j4674m183Q831
16437D853J0506j1899j0441q710L415n784J3683K077j360M838K481q064J112J9122
16423A5829j390J51j004j76n84n246j2276K915M98m115Q06J1941K214M030J0806
$$ y = [14267, 18390, 16135, 13980, 3014, -6964, -14265, -18717, -12433, -13197, -963, -5631, -3580, -4093, -838, 3672, 2700, -6197, -23535, -25485, -23072, -13384, -6632, 14234, 30219, 38207, 35054, 18081, 4163, -2720, 12123, 12193, -2098, -1107, 6722, 5682, 3976, -1220, -113, 3405, -1034, -8957, -10503, -7660, -5516, -12055, -7920, -7237, -2333, -1127, 7931, 8881, 19894, 17901, 13612, 6417, 11763, 12852, 12592, 15706, 5932, 6182, 12242, 16787, 22234, 19561, 17469, 11040, 5420, -1958, 1006, 9739, 5325, 10279, 7580, 4809, 5271, 12220, 16366, 17650, 19576, 24682, 25126, 16887, 14434, 14879, 205, -3978, 4853, 15359, 3460, -6981, -15691, -12276, -18060, -4377, -2300, -3660, 1178, 3659, -4405, -3293, 15829, 14439, 14590, 13586, 13410, 12826, 7580, -4696, -1781, -1283, -5398, -4592, 7349, 9563, 13593, 24399]
16408B4399J0114K144k0444l0545m443J6319J0382k30Q377K377o357q795J0324
16395A3622N745j1168O924n685L508n896Q963n301j1409J3255o330r782K359L489
16381B294p880K943L795o607p97K525n104m213N097R777k701J419k454o428L950
16366d384J050l262l167R607p559M592M039P800M540L034l290J7441m448M745
16352C0738l177n111j397J155J1001p524p761M473j4468K281j193r396J3056J1162
16338B3839q517j593N97k968n271m82j0304J5061R080J1467J262r736j9042J3629
16324A7022M629N331O972n687j1687M034M719j058l068k1805M115R513K112j7336
16310b194j5832o388J6050J9098M327j2767J5504r096j4891j348K455Q172j590
$$ y = [24399, 34513, 36657, 16213, -14332, -18775, -2456, 7926, 7696, 16073, 18450, 12093, 3298, 13622, 19367, 8199, 15123, 9438, 12946, 7050, 16013, 10712, -697, 12558, 6228, -3554, -1195, 2294, -5586, -2643, 1152, -5455, -6252, -3727, -8831, -13044, -7947, 1830, -871, 548, -1906, -8334, -4384, -3334, -6596, -9763, -156, -7715, -3123, 916, 8716, 13256, 16290, 13000, 30441, 25993, 30738, 27561, 22450, 21053, 22208, 33209, 25685, 17924, 22397, 7929, 10210, 9017, -379, 12677, 23839, 15322, 13729, 14326, 11358, 6087, 5605, -4699, 10362, 19442, 30909, 32171, 22435, 3393, 17022, 21651, 26982, 33954, 28267, 16580, 20614, 25333, 24275, 21207, -598, 3517, 13030, 15142, -2194, -18026, -24414, -8364, 10734, 15061, 2294, 17798, 8702, -6189, -7537, -5082, 3090, 1500]
16297A500J3774O760j716j184m341k060q540k119n273Q924P336j3726J2462j178
16283A0619l726K451M679O10N62M212q003j0525J2098Q577m867j3284j3380J059
16269h918J1730L181j5934Q115K2421o0k0308o20P911R976L122J944Q28m933m043
16254A4412K587Q992j215j5323m321N138M149p001K259j2008J318o037L557M141
16240F48J0641k483p033J0263J4373n679j3497q058J21n93K406K112j4071P083
16226c767P613n77l216m448k973k936k476J2139P97N502q361J0110j034j1255
16212d882q385L379k282R948m0r81k517j7909J1835O15m316J3160n905r533Q557
16197i256J4759R276K681L50q14Q206Q017k327j0281q273j1761p682n366N629
$$ y = [1500, 15274, 22034, 20318, 19134, 14793, 12733, 4193, 2074, -3199, 5725, 13061, -665, 11797, 10619, 6893, 9344, 14023, 14633, 15195, 19407, 11404, 879, 12977, 21554, 16687, 3403, -9977, -8918, 2812, 5993, -9941, -1826, 20595, 20535, 227, -393, 7518, 17494, 20616, 22560, 23388, 18455, 14412, 16999, 25991, 24776, 9453, 5132, 10270, 14419, 7418, 9677, -2331, -1013, -7050, -3493, 648, 11289, 8806, 1773, 12036, 26409, 20730, 7233, -825, -704, -1297, 1109, 3221, -10850, -3767, 3846, 3269, 53, -4395, -7368, -10304, -12780, -641, 156, 5658, -2703, 7407, 6373, -4882, -13267, -9888, -12170, -2222, -2262, -3243, -5760, -23669, -11834, -11219, -15535, -2375, -8280, -17813, -9256, 5503, 14779, 17460, 17810, 16996, 25202, 33219, 30892, 20611, 12338, 577, -7105, -12471, -6842]
16183f842J47n260K892J2165J945p977j2585K454O941P847n165P149K737j7825
16169a1377J6671N897N585j569j1247o300O034J453o759J3893m252j5522k443
16156i936N287J2083O51j7012J753O468j265N866J3256J4644l407k12j2152j7446
16142a422J373P846l324l887O729j2532l611k945J0922P067p090J841J3644L202
16128A7813j1703M828r5j4372K283J0669O138j2423j0852k563J1467M799n830
16115A59m367K704n987K420k299K241O056J3779K814o61r694l391J0373P035j601
16100A9581M515j1756j998L687L970j0032K238p303o620L521L479K0307q349j0029
16086E211j4066M613p320m027k680K737J3817J7164Q475j5391j9101j881k204
$$ y = [-6842, -6695, -11955, -9063, 3102, 5047, -2930, -15515, -13061, -6120, 1727, -3438, 3711, 6448, -11377, 5294, 11191, 16776, 15207, 3960, -2340, 3694, 5147, -1612, 12281, 8029, -7493, -9936, -4649, 7434, 8085, -8927, -7174, -706, -1971, 3895, 17151, 31795, 28388, 28176, 16024, -1422, -49, 7797, 4473, 586, 7315, -5217, -8828, -11773, -851, 6216, -874, 967, 14611, 17813, 6110, 10938, 10843, -3529, -1246, 9423, 15561, 3138, -7714, -10277, 1190, 5989, 159, -4208, -1504, -7491, -5071, -7370, -5129, 927, 14706, 17520, 16859, 7165, 3774, 14147, 21182, 19581, 24096, 12340, 10342, 14029, 17999, 7967, 10205, 2902, -3718, -197, 3282, 23589, 15240, 5211, -8855, -4242, -11562, -15589, -18269, -15532, -1715, 15449, 23924, 8533, -10568, -12449, -14653]
16073a4653R312J8922j1088q269k365j0657o079Q531R054j245P612O7N63o135
16059f430j442O139O141L619O183j7728p066Q298P698o651m077Q69J7704L458
16045A6715j0103L230L943K319j1651m27J090j7862p997l041Q450L768P093q899
16031a3372j229J4275Q05o391M630J2769m809J0805l857M67K00j3062O4N190J616
16016H101p568j0446p816P079P033j0138q2Q175K533o27K108j568l816Q997k608
16001f43O477M916m865P073L710j448J072m172o445j817k450O391M014q051k0041
15986a6279K92P069j6866l934J0308R461K133l538N601k679K780K267j3321N467
15972a1239L840o540j524J323O596O135q810j703J0068j0727M91L207M733j180
$$ y = [-14653, -5341, 13581, 2493, -5776, -8141, -18798, -24877, -16346, -7292, -8537, -925, -858, -295, -6430, -7872, -1733, 4408, 8027, 14210, -3518, -10584, -2286, 5412, -1239, -5316, -4447, 13257, 16715, 6612, 9842, 13785, 16104, 4453, 4026, 5116, -12746, -20743, -23784, -15334, -11566, -4473, -13372, -14601, -326, 479, -5912, -1282, 11487, 6678, 17483, 13626, 14093, 14293, 1231, 1295, 6485, 8101, 533, -9913, -17729, -10650, -3617, -13755, -13837, -5662, -3129, -3756, -1648, -3216, -7032, 1965, -643, 5834, 10750, 5885, 12958, 16668, 15220, 16292, 12120, 5675, 3858, 1408, 7799, 11813, 3762, -16279, -15987, -8918, -25784, -29718, -19410, -9949, -7816, -11354, -5753, -8432, -5652, -3385, -16706, -11239, -7399, -13939, -15463, -14140, -7544, -1409, -10219, -11922, -1854, -12581, -12090, -8883, -4150, -5330]
15958e330N252K758l657K387J130l653o499r310O189K942J6122J4806L54k019
15944B1472N18p207q843P348j2073J003M023M415l111L620j7223M211J6964j42
15930A4975j796K622N876l686l410k116p212L019n220r656Q077J3270M239J3100
15916C2082j0350o843j1715m412L561N655N806N989P380n3m687r472k487J3047
15902B3501l183R099j537j7273j9431K71J2291K393m471K578R652j0253r169j0126
15888a5658K181J2373r24m216M703o789J355O384L353L83m184J4956L189j2208
15874D898N039l26n476J5350j798j2380p454N419J2394p069j0293p370k880Q588
15860c358L992p25k303J043J1011J553m869j3276R306N935M577n599q089M998
$$ y = [-5330, -78, 2680, -977, 1410, 2540, -1113, -7612, -16922, -10733, -7791, 8331, 23137, 23491, 21472, 21990, 14783, 5940, 13288, 1215, 2218, 6241, 10656, 7545, 11165, -6058, -1847, 15117, 14975, 13179, 15801, 21677, 17991, 14581, 12465, 5253, 8272, 3052, -6604, 1473, 14743, 18982, 32082, 21732, 14889, 3174, -1238, 2323, 7978, 13784, 19773, 27153, 27100, 22413, 12941, 10454, 23501, 20318, 29417, 27880, 10607, -8824, -8553, 3738, 6131, 1660, 4238, 13890, 3637, -5532, -15658, -13477, -1104, -2028, -6244, -1541, -8330, -6975, -591, 2762, 3145, -1039, 13917, 17106, 4898, 9937, 9611, 4135, 19485, 17687, 5307, -2147, 3272, 15666, 8597, -1696, -9066, -11946, -3358, 634, -91, -2394, -1351, 9660, 11213, 6344, -6932, 2374, 8309, 12886, 7287, -802, 4196]
15846D196k721j3108J494n576q150N912J9243m324j3211P28P294J1608K0906k396
15832B1895n977L806j7871j9059P411J9302R580j4854j6608j298Q926K577j920
15819d090K558K1725O468n163o686j4812j0750J220L592O052R283J667k1524m119
15805a4579Q112J0249o079j3985j9230J1837J4383O340k641j449J5737Q140o136
15792A0699L129q9L23j0659q272l560q408l321J7161N645o171j5288N353J3236
15778b22J7967P076P356n309n388R2O026j5129j4654j414P01q55j3680j4892J422
15763c0903J7760R656j8071n576J7773K379j0983J1343O703j017j1053Q003L362
15750f24k484j0082P117R965j63K372q270k096K1638J4946k672o707o519r494
$$ y = [4196, 1475, -11633, -10139, -15715, -23865, -17953, 1290, -3034, -16245, -15517, -8223, 3385, 24291, 21895, 15918, 19724, 1853, -17206, -9795, 9507, 19087, 4233, -12375, -13673, -4747, -2170, -4090, -1532, 20193, 26661, 21498, 14812, 0, -10750, -9530, -5938, 114, 9397, 11064, -10460, -14579, -6467, 3782, -2297, -16282, -35512, -23675, -9292, -2952, -5593, -7042, 8695, 16835, 10699, 13828, 13739, 14062, 3403, -4869, -8429, -16837, -20158, -2997, 2648, -3523, -18811, -13458, -222, 17745, 24821, 32177, 26868, 21480, 21572, 27598, 12469, -2185, -3599, -2898, -3753, -17433, -32325, -30903, -13143, -3487, -21558, -27134, -9361, -6982, -17965, -6622, 81, -936, -11989, -3986, -624, -3108, -13190, -6073, 3892, 3729, 6101, -2169, -4265, 17373, 32319, 29647, 22940, 16421, 6927]
15736F927m654J0529r98n115L17J8976l332k1104j3505N742M375R183o563l728
15722b950J6358j792L420N724j0004k236n121P025o475n314J2237j960j6111j3381
15708b0580N628O322q75l201J4295Q682Q578o46k3341m347J2434L227J929l849
15694D256j6J9597M235j0274j2314j7334Q760J5343K189l917j7440L630j0284
15681a3569K235N321K607o452l670J4374N19j8549k001O395J0130J9695K897j0741
15667I191l431k106j9751N673J1368P506L755k606k0373l064J8507R866j100J1877
15653B5312q823k396l754p693p899K913k533n787R543l628M455j795k547k800
15639g432L914R170L942o685J90J4150J8972n830k5436o605N633q303j1537m559
$$ y = [6927, 2273, 12802, 11804, 6689, 7006, 25982, 22650, 1546, -11959, -6217, -1842, 7341, 778, -2950, 13408, 11616, 15036, 20760, 10756, 8520, 3399, 10424, 3949, -1365, 10872, 8912, -7199, -20580, -14952, -8630, -9505, -12706, 1589, 10271, 18849, 18203, -5138, -9485, 2949, 6176, 8105, 4256, 4240, 23837, 28072, 17798, 5484, -11850, -3090, 12253, 14442, 10525, -6915, -3285, -13569, -11334, -6013, -3406, -9858, -13528, 846, 1365, -17184, -19185, -12790, -2660, 17035, 19932, 9191, 5760, 3654, -16097, -10424, 944, 8450, 12205, 9599, -10774, -13838, 4669, 14535, 13435, 25312, 16489, 14093, 10339, 2646, -5253, -2340, -4873, -10660, -1117, -4745, -290, -2085, -4632, -7432, -3518, 5652, 9594, 2909, 3099, 17249, 36221, 30391, 4955, -1650, 3983, -4320, -15857, -20416]
15625b0416j692J6471M222k832j648k935o75j045o557l795O906P761o026N94Q684
15610b983j600K73J169N265r366n315q754N193j111J3324J6684q58j9975q303
15596a6357J1855Q271O498j6395O005j535R360M894O914j180l237r162j4394L319
15582e144M320k985r326P305P966l713M424k785j667R827R587p982j3058K781
15568d50M778K550l879L170j182Q342P934K967j2508p840j3252Q52J6039Q540
15554A6061l70j679k896j0319m121O613N026q464j2946J4709J3150J514N849N686
15540B7813r18j4031m802k479n471k192q472j1295J118l119Q833J142O353r526
15526a7046j409J4222P468J0850r16k132j389J436j4065p966j677j888J0018L249
$$ y = [-20416, -22108, -5637, -1415, -4247, -5895, -8830, -9505, -10550, -17107, -20902, -13996, -6235, -12261, -11667, -2983, -4583, -4310, -3141, 2124, -7242, -12557, -21311, -16118, -17229, -3905, 12779, 11921, -8054, -16357, -4502, 3769, 10267, -6128, -123, -1658, 7702, 12596, 19510, 18330, 15093, 5931, -8463, -5144, -824, -3809, -13135, -5830, 2136, -1577, 2847, 62, -1605, 8222, 17809, 9827, -3231, -450, 4328, 6878, 2999, 6169, 4987, 13329, 21263, 24230, 11722, 3882, -9370, -8518, 7521, 16061, 15691, 14012, 11116, 797, -3324, 3289, 8315, -149, -13095, 1614, 14764, 16278, 22127, 27813, 26895, 12864, 8062, 5583, 112, -2080, -10552, -21847, -20729, -23848, -15015, -13873, -7520, -17046, -18455, -4233, 3235, 14085, 13169, 11037, 9648, 11084, -2981, -10947, -12624, -14512, -4494, -1245]
15512a245m096N396L6k604j7754k0727n021Q113K2294K5144j891J72J7085j7259
15498G643j9620n862M905O74N621J2936Q60j0380n18J0366r546p980l257N870
15484h288N208J8614k565j2770k347m190N840J7446r964k4596j7374M404m692
15471c5274J6863J2501R709N450K052j775J5012O620l410p631q933M869Q030P548
15457C1631j4989j0898l099L595P158l518J2325M043k043Q691j2256j7929j4792
15444a2081j1783Q955K1658J7779R03J0634q46j3055p556l230l623J644p46j2104
15430c451r243O471J6645Q520r314m847K044N594R367K0251o466k6646j0625m412
15416f112q76K381P262O361N847J1280m860j2256m11J102N016j427k887o509j281
$$ y = [-1245, -5341, 55, 91, -2513, -20267, -40994, -46015, -37902, -15608, 9536, 7645, 7817, 24902, 7643, -11977, -17839, -12934, -12260, -6639, 6297, 7157, -3223, -3741, 6625, -2921, -10901, -14158, -8288, -3080, 15534, 12969, 199, -2148, -6338, -498, 16948, 6984, -17612, -34986, -30582, -35274, -18411, -5910, 3799, 9249, 11301, 9526, 24538, 31158, 27748, 20117, 11184, 16053, 24083, 31631, 16642, 5744, 2645, 6240, 13398, 9880, 22205, 26248, 24205, 32896, 20640, 2711, -12081, -23864, -14909, 6749, 24528, 25431, 36065, 35219, 22164, 14608, 11378, 7755, 9399, 8653, -3451, -12694, -6223, 10422, 18942, 9628, 4781, 6825, 12419, 21786, 42037, 35571, 8925, -1700, -6112, -6988, -4607, 2655, 9016, 14863, 26143, 21283, 9027, 8616, 9718, 14734, 13307, 10420, 3911, 2630]
15401B630L21l598j3472J0057J4201J0272k285q502j4124p33O150Q63j0212K723
15387e709K476P564K0557N373k0837m123k0081N214R732k86N017j3281r639J0172
15373g851J4134p856n468N098k42J249j3467p694J0474O38q308J1290J4523j545
15359D975J994n87l312j1839n61L501J4598J2071q996j3077r549J0711L762k472
15345A219N777P450j383q759k257k943N210k405k6913j859J7958J0239k190j5342
15331a6198O857n318p784N574m880K437J6060J632j1989K266P331j2239J239R373
15317e639j2177j6030j1972R610K2075Q814l267j3723m787O216J1748O155J0575
15304G598j1144p352j818R99P313j086j154L920m540M108M036l214Q081o614m54
$$ y = [2630, 2951, -647, -14119, -4062, 10139, 20411, 18126, 9624, -4500, -5233, 917, 1780, -8432, -5709, -3233, 4331, 24888, 30261, 9424, 5301, -14780, -9566, 166, -120, 4897, -8384, -18023, -7851, 6283, -1573, -7041, -1943, -2185, -936, -14403, -22097, -11623, -10985, -19293, -8003, 6520, 4975, 6969, 6382, 3070, -8769, -9330, -5829, 8769, 20840, 11844, -1233, -10782, -71, 3691, 1219, 6996, 14446, 13063, 4304, 2047, -896, 4314, 1909, -25004, -26863, -8905, 1334, -856, -16198, -9341, -14659, -22443, -16869, -21749, -19312, -3252, -1620, -13609, -11343, -4012, -16251, -15012, -5639, -17816, -33846, -45818, -36208, -14133, -5319, -8586, -22309, -27096, -20880, -9132, -2977, 7598, -3546, -10898, -12716, -11717, -4404, -5490, -6644, -2724, -7264, -3156, 880, -2334, 5747, -867, -1321]
15289a321j014n338m76k436O619J0969N164k3990p000J6604J1894j3402p039l02
15275a1068p953m261L954K2052J7214n029p809L274o580k786j7723k3683m825
15262d5223J4601K5570J8327J710j6670r418Q289j385o686J1070R475O89l022
15249G327m32Q820k142j2724k4100K0352K8697k506k3841n09K922N952n84n35
15235F697q673k199m008m95R899J1087J3465m611L653n7j1920j2596R549j1978
15221b187j3545K59k033O618J6132l245L328j3997l254q870p730J0631L606K41
15207a4046l416J008P028K026K585n23P935R651j0521j4528J298o893R668M849
15193c879J1668p410j2159n625K764Q066O008P8q528j543l129k646m611R565j4860
$$ y = [-1321, -2335, -7673, -8149, -10585, -3966, 7003, 12167, -11823, -18823, -2219, 9675, -3727, -10766, -11068, -19021, -23282, -19328, 2724, 19938, 14909, 7100, 10374, 3794, 1008, -16715, -40398, -45223, -30622, -5052, 13275, 14985, -1685, -11103, -2814, -4199, -10885, 185, 9660, 10349, 7327, 6895, 15715, 13573, 849, -23251, -2899, 25798, 23292, -549, -1058, 1864, 7816, 7232, 6697, -1976, -4175, -8183, -8678, 1221, 12308, 25773, 21162, 24815, 24758, 12838, 242, 9791, -2187, -15732, -15473, -17506, -10888, 5244, 1999, 5327, -8670, -11924, -20794, -28524, -17893, -14287, -14046, -17462, -16454, -9426, -7400, -4815, -5338, 2597, 12248, 1727, -12801, -11503, -18396, -8728, -3879, 7789, 379, -11780, -17405, -14641, -6575, -567, -489, -9017, -10560, -13689, -16335, -20946, -11381, -26241]
15178b6241q015J9601J5491R59m063j371J3205J0282n77o580j0946r05J564j2364
15164i960j3995j0829R634M489n966Q239j098m206N010J6213P666N996O854l689
15150A4358R191r058j7686j7894J0047M659o265N075J2641o101j4619j0075p422
15137c3149R997J6625P245J8224j539n976M199j5221l137R041M803P839k6q154
15123A0771k0208Q547J3972l539l816L127P364k6803o483L359J1173j2950r112
15110b4598j225j226J0573J6577n082r022n032N765J5203J1856k843l065r504
15097a623M824l349K890p297j2185J338N193J4487P344m746n829r239L741J6879
15083A2428k727O05J943j111k1780J055N51J229k842L153R814N588n341P703O795
$$ y = [-26241, -34256, -14655, 836, 1795, -2268, -3639, 9566, 19848, 19271, 12691, 1745, 840, 2404, -9960, -23955, -34784, -25150, -20661, -26627, -18388, -19486, -23692, -18682, -2469, 5197, 11193, 18047, 14358, 23549, 14491, -3195, -21089, -11042, -6383, -12648, -7573, 5068, -1033, -15652, -25727, -33149, -23152, -6527, 718, 18942, 17403, 11427, 15626, 405, -2732, 6309, 11112, 18951, 18925, 10771, -9437, -890, 13082, 9543, 5727, 8854, 16218, -10585, -17068, -13709, -2536, -15486, -24598, -25823, -27049, -16476, 101, -4981, -14003, -19035, -13270, 1933, 13789, 10946, 7881, -1623, 3201, -148, 2742, -4555, -16740, -15402, -10209, 4278, 11622, 6876, 1047, -8192, -4451, 12428, 9701, 10306, 12249, 11138, -10642, -9587, -9036, -7807, -10649, -7496, 2318, 7906, 2565, 10268, 17063]
15068A7063q653o316O165P765K211m283k58M399j1601j379J3321j1082j5028J3405
15054E729k946M612J076j7902o413m430J2803J0714n390K0148Q476j3608j2447
15041D22J388N159k660n488M33J2927J001j1924j2252j4845K409Q161P849j378
15027h798Q722p533l649Q446P840J0774o469q309m677Q602M013K762J0026p443
15013A4307o390J3939K69q948j696k382j1764K810L752o712R1J0713J906j2336
14999b441m699j153j98M74J3514J987N931O38Q94L430j1173j0330J3137l63j833
14984G815J569n039J2349Q409j4500j0622j2909N001R679r724j524J929p484J26
14970a4925N872m672n805k556j4571L893J5744J9955j111m029J564P642o009P936
$$ y = [17063, 8410, 2094, 8259, 16024, 18235, 13952, 13694, 18093, 6492, 5113, 18434, 7352, -7676, 5729, 2783, 7395, 8471, -9431, -15844, -20274, -7471, 3243, -2147, 18001, 26477, 12869, 422, 1810, 6969, 4309, -1179, -746, 12181, 13182, 1258, -10994, -25839, -23430, -15269, -7420, -8798, -76, -7609, -11258, -2812, 5028, 15802, 9333, 1024, -3653, 4949, 8962, 11724, 21750, 14307, 7917, 21856, 22125, 13177, 11481, 9099, -2665, 145, 3897, -2815, -2724, 7989, 9895, -2441, -7140, -8293, -8491, -8017, 5497, 7484, 13415, 14053, 14947, 18377, 7204, -3126, 10011, 9648, 7815, 9384, 4345, 16694, 25103, 10603, -19, -12928, -7927, 1752, -7972, -9496, -7567, -15051, -14925, -9053, -13725, -19530, -22086, -36657, -32764, -17020, 2935, 1824, -2205, -641, 7001, 992, 8928]
14956H928N018j6966J134M508l37N171j0898j3277l98j108L105R258j748k329
14942i939J1231J039j1976J6259R906j8540j8549q307J2575K1747j2480r421J8590
14929B135m57j3396O323J2195j0203r734q59J2589j4383o052m12P90K188J3056
14915f220K437L002n25J1751m116R659R813m616j2125k3503K851J4413L497m743
14901A575r896L931P322R021J2156N562p418j5636q671J3166K514J71J1770J4222
14887C9789j5839k3036L278m016o188k934k674K931J5237Q383P51K252j9759J457
14873c68P433n414J585K4063m857l230j4624n089l684k000O431N824J4169k110
14859A8129j7553L631J4866q247j3791l742j1066Q84N170J254n415P23J2050J3221
$$ y = [8928, 13946, -3020, -1886, 2622, 2285, 7456, -3442, -16719, -17117, -18225, -15120, -5862, -7610, -9939, 1292, 2331, -9645, 6614, 16520, -2020, -20569, -28876, -16301, 5446, -7034, -16455, 2135, 1678, -11718, -5395, 6800, -3403, -13137, -13996, -1407, -15790, -21842, -22254, -21464, -19276, -6220, -3783, -781, -1306, 10445, 6329, 15988, 25801, 21185, 9060, -14443, -11592, 2821, 6318, 1575, -8321, -4390, 2932, 11953, 24109, 29671, 22253, 6617, -2054, 11112, 13626, 13797, 25567, 39789, 23950, 914, 4192, 176, -6012, -8946, -11620, -8689, 6548, 14931, 15682, 17934, -1825, -368, 7065, 1651, 3236, 27299, 22442, 19212, 4588, -501, -4185, -6185, 246, 6070, 20239, 18129, 576, 4207, 19073, 10826, -2965, -6707, -17773, -16889, -11719, -10465, -15880, -15157, -3107, 10114]
14845A0114L597k7212r248P041O157m112k698o496j0636M919L107M225o141R861
14831a7522K1817m680J820L533p47N954J893o442J0192L446p648l390J749J972
14817A1947M08j026L23j0270r420J2752O547N781j2388n384q255n883n782N108
14803a5542K1647J0697r442m757N699r32k289j0145j0789J4851P995p477k631
14790c115J650M907K897j2908j0734n306j999p526R403J1868M286J1421N56R000
14776A4400j0566r421P953l848K752K1726j305K711n307j9688m621K372N889l106
14762e9j3271j0371K360P182l031J420J9530J0255j0986j7553j951L107Q189J0405
14748E226K566J153J593O035l098j1197j600l820l038j1656l198J4786K747k51
$$ y = [10114, 13711, -13501, -22749, -15708, -9551, -13663, -16361, -22857, -33493, -28574, -25467, -21242, -27383, -17522, 4295, -385, 1435, 4968, 4221, 10175, 12068, 5626, 15818, 19264, 11616, 8226, 9975, 11947, 12355, 11329, 11652, 1382, -8038, 4714, 11261, 17042, 4654, -730, -8985, -14868, -20650, -15542, 6105, 16802, 7360, 2603, 8302, 7370, 5081, -5064, -15853, -1002, 6993, -484, -3115, -1465, 3442, 6339, -6569, -17303, -22609, -24608, -32134, -22731, -10863, -6577, 4844, 5400, 14400, 3834, -5587, 2366, -1482, 1270, 22996, 21691, 24402, 19095, -593, -5214, -2842, 3047, -59, -13330, -23701, -21341, -14159, -17190, -15770, 3760, 14015, 3029, -14524, -16475, -13368, -5179, 5226, 7792, 8945, 10538, 16573, 13475, 2278, 678, -3142, -6180, -17836, -21034, -6248, -3501, -3752]
14734c752K215n577k085J320J337K471R783o073j475P105Q898K855P624l161k2025
14719e40n850R11J265Q046J3060N963l311r241K771K345n509L884q1q138J925
14704G500k063J0097l695j3064o370P806J046l830p692N478j302m57L05M773N363
14689C895J677r304N055J0180M01J2700J816o368j617j6652L340M640r45J780
14675A0598q432J930m027R76p97L672K12J1340J0541J678l627j4439m953l832
14661H40L30Q53p731j2141N610M320n510j3384j3876P03J6515K61J2457K5602
14647A4849J1696q5n923j8297K983P054Q32j2006L488j942J69K338K755p15P984
14632A5180K0023r294r977r969m95Q194N370K855P301k174q896j0662j319J8735
$$ y = [-3752, -1537, -7114, -9199, -7879, -6542, -4071, 5712, -361, -1836, 5269, 14167, 17022, 24646, 21485, -540, -6390, -5479, -4214, 3832, 16892, 22855, 19544, 10303, 13074, 15419, 9910, 13794, 13713, 5575, 7500, 5437, 15534, 11839, -1225, -7595, 211, 1257, -2573, -10265, -4787, -6089, -6546, -6241, -1468, 3895, 5572, -3732, 1323, 11503, 11904, 24604, 26420, 20052, 18435, 1783, 5123, 9763, 8818, 10598, 2166, 4096, 69, 1045, 248, 3920, 4132, 15472, 26013, 27691, 24064, 9625, 4672, 840, 1170, 2023, -5708, -17849, -12239, -7919, -13429, -26813, -40689, -39986, -23471, -23210, -10753, 14849, 26545, 26460, 20537, 2240, 5223, 12277, 13109, 1103, 4591, 2649, 2818, 5156, 7911, 7196, 15180, 35203, 25909, 15932, 5963, 5468, 13662, 19032, 21887, 29188, 27014, 18118, 7456, 6137, 24872]
14618B4872k497p853k77k932k29K914k391L446l779j8557r62n451P293q570r629
14603b4602Q683K4017J7307o162j2345m823J628N429m430p338j837J4001j614
14590G914k116j1665j5818l45Q348J3449M769L500r044q031J3119L614r70n296
14576A428j599n141m823n842R86J3357R915k662j1284l045j804m531k152N644
14562a1553Q775J8216j4506l581J5131k428l419J4955l500q133j1150R876P150
14549A5833M260k035O76j0491j5660j8282J2108K3581M111N419k242j67k509k1257
14535f655P132m441j0363J8695P966n506L950j806n469P382j165R042J291o955
14521A3098N402n262N85r739q308k44N033q78Q621P445l698j0016J035K426K632
$$ y = [24872, 22375, 14522, 14245, 11313, 11084, 13998, 11607, 15053, 11274, -7283, -8245, -13696, -6403, -14973, -24602, -15919, 8098, 25405, 19243, 6898, 2075, 3703, 9132, 4702, -2636, -4473, 9528, 7914, 5798, -5867, -21685, -22030, -13682, -233, 4536, 8036, -1008, -9039, 4080, 7694, 6724, 1428, -171, -5312, -10135, -15977, -14991, -1634, 8281, 5619, -5665, -8710, -10514, -15045, -17197, -11553, -2778, 15438, 932, -2649, 12482, 10054, 6635, 21590, 18090, 9957, -1193, 8683, 15833, 20093, 18058, 18734, 8243, -7417, -25699, -13591, 9990, 14101, 19520, 17278, 17111, 14602, -6655, 477, -3964, -14327, 4368, 12334, 6828, 10778, 8972, 3503, 10885, 9720, 18762, 20053, 13098, 18500, 13238, 13823, 4084, -4224, -4468, 565, -313, 8308, 15753, 12055, 2039, 3074, 5500, 8132]
14506H132K126J146p421q466J484R897q457j3507J4429J2273q683k972R570l106
14492F445r48K280M844o853m460j7777j5913K908K1817J263j378m255R764p764
14478a0027J805n390r175j1972J4970O837J161N413m798p269R528K0613N608j8689
14464a385O60N121o074Q18K595O449J1845K36K035p56j3658j2548R38R980J591
14449G847M460K313K122K580k792j1032M375m698r256R847N564j691j0744P593
14435F488J114n995r007P376K6249O44j5958O02K678J2118L705j606l052l989
14421B1367L502K7q895m662j3125n069K205N406k957J596p809n431P308r885j438
14406a7860q701Q451L0123J4446m469k973q213P46q552m552n887K301K27k437
$$ y = [8132, 10258, 11404, 3983, -4483, -2999, 6898, -1559, -15066, -637, 11636, 2953, -19, 9551, 6445, 5497, 7777, 12621, 5768, 1308, -16469, -32382, -29474, -7657, -6394, -7772, -12027, -2263, -10027, -8222, -13612, -22787, -34759, -19789, -12952, -11791, -6378, -11176, -18445, -8917, 11696, 17304, -1385, -725, 4396, -1678, -860, 1735, 8184, 20029, 20265, 22300, 21544, 7886, -4662, -3724, 6256, 7847, 12307, 14620, 16742, 19322, 16530, 5498, 9873, 5175, -4081, 5766, 11330, 9639, -1105, 6488, 7602, 1607, -7400, -24, 26225, 26869, 10911, 11513, 14191, 26309, 30014, 28408, 25356, 21367, 24869, 24896, 16001, 11339, -1786, -6855, -4650, 756, -2201, -605, -8414, -13845, -6537, -16422, -17860, -26561, -18110, 12013, 26459, 21990, 19017, 10804, 11550, 2998, -1554, -7441, -5140, -4913, -7350]
14392g350n899J3704J2570r604q596J5310K858j8060O447J5510N009l597K936
14379B1238k0503q670J0842R975j319O652J2162j992q930P63j006m724p603o081
14365H04M226M598l269J350o090n660R212J838k596q68M327M128r15R472j1373
14350I184j8027P963J6248N932j3557Q791J4308j2666o225r749l176l412J0379
14337E993J7423o268m962k801j4274K609m666j855k284P548N495n041J2367o479
14323B805m207k12K1478J1123n933j7069o444K561m071n812P461Q937n238j1359
14309e980R861o519J0122N309r181N638m194K591P73l608l458m026j0448J2258
14295h62L782m408k848n814q683p375j360l388J6258J157p868l659O978K117L07
$$ y = [-7350, -13249, 455, 13025, 3421, -5175, 10135, 12993, -5067, 1380, 16890, 21899, 18302, 21238, 735, -7935, 2907, 12882, 11563, 18215, 30377, 28385, 19455, 20218, 19212, 14488, 6885, 804, 5030, 9628, 6359, 7709, 1619, -4041, 5171, 7009, 4413, 3545, 7872, 12000, 11085, 20557, 9184, -8843, -880, 15368, 21300, 7743, 16534, 30842, 18176, 11951, 2202, -974, -4386, 5993, 23416, 17148, 12186, 9385, -4889, -2280, -6946, -8801, -11085, -3537, 1958, -3083, 9284, 2805, -1402, -1614, 19864, 30987, 25054, 7985, 1541, 4102, 31, -5781, 1680, 10617, 5379, -5980, 3881, -2638, 7484, 12793, 3612, 9250, 5056, 7647, 8420, 4812, 1354, -2672, -13120, -862, 2920, -1488, -4336, -10150, -18833, -26208, -27568, -30956, -14698, -13541, -21409, -25068, -18090, -15973, -15666]
14280a5666p629n534J440J8804J3908J0824N373j0067k630m151N413N131P393
14267B2609L331q526o958k825J5600J1257j5257p246M743j5870j0313R139R937
14254I621m009j049l822l918J906M682J182K891P713l668m847j2878j3910J38
14240a9968P378J7529QL247J2671o555J2824J328n500j1478o589q977L081O223
14226E222q478o145J6514J0980j4692j297J073o63l320L839o05K184R451N265
14212A9328l536L628k2801K257J1534J3858R356m765k0036M472M187r566o133
14199A783l971J3833Q502l115J329N649M897p448j2050q379K045J5929J0464k2916
14185F552j5509n200l983J1815N160L34l935p963L996P342L119m521J685M316
$$ y = [-15666, -23295, -28829, -27389, -8585, 5323, 16147, 21520, 11453, 8823, 4672, 10085, 15216, 22609, 25940, 17414, 10456, 7631, 23231, 34488, 19231, 11985, 16728, 858, -9455, -316, 9621, 5612, 4563, 741, -3177, -1271, 3411, 4593, 7484, 15197, 11529, 6682, -6196, -20106, -19968, -12590, 4939, 4947, 8194, 20865, 14310, 27134, 28462, 22962, 11484, 4895, -4082, -1001, 5222, -3256, -9401, 7113, 18093, 3401, 2104, 3177, 2514, -806, 3033, 2428, 4612, 14063, 19328, 15792, 19420, -3381, -1124, 10410, 24268, 33624, 28859, 8823, 13295, 17482, 7916, 1783, -2188, 11645, 20147, 17032, 18361, 24010, 28907, 21459, 9409, 1030, 3075, 19004, 29468, 6552, -8957, -14157, -18140, -6325, -1165, -831, -4766, -12729, -8733, -1391, 1728, -2793, -1108, 3208]
14171C208J4798j868j6824j7602J3170J5126J1136j0805n919J4756J1175R830
14159D0181o606j6980n158j2792j4496N449N223J3112Q958J4271j1873j0025p798
14146A466m07j2946M750M679j09L683J1654j4711r043o2o528J2933P573N420k201
14131F151j4540n559N415J2185p061J284P019m361o159r568J4630P149q32q305
14117b552L785J3796m627j0688j5903K3335J8974L218k980P1k226j0038Q601J7289
14103D0055J2467J2465q51R995J5768J4054J738J3726K3892J5672N3369N1294
14091B63644O0241Q3497J09810J09200J19333J06693R8855Q4403M3124j4273o2192
14080A002335m9925q8836j20367j04744r0763q0586p4404o9765m6016l0816k3421
$$ y = [3208, 18006, 16138, -686, -18288, -5118, 10008, 21144, 10339, 4420, 19176, 30351, 40181, 33575, 16595, 11437, -1355, -15851, -10402, -5179, 7933, 16891, 31162, 19289, 9264, 1466, 1059, -11887, -7137, -2458, -2567, 1116, 12770, -1941, -10984, -11046, -17574, -4641, 2932, 8352, 6151, -8389, -13948, -8533, 3652, -3409, -2125, 4894, 533, -5626, -15194, -564, 6585, 5753, -2552, 1233, 15029, 10402, -286, -16189, 7146, 26120, 29338, 26358, 26429, 24203, 14165, 22766, 40055, 52522, 64987, 64136, 74131, 89899, 103953, 105691, 119417, 143309, 158981, 212350, 263644, 323885, 407382, 517192, 626392, 745725, 852418, 951273, 1035676, 1078800, 1064527, 1002335, 952410, 863574, 743207, 638463, 547700, 467114, 392710, 322945, 276929, 246113, 222692]
14069B22692j9986j1123L966k2981k6202k8583k9167K161o139p200j1414j1847
14057E4177o628N340J3792O683n881r251n112j9863k4857m023M410J179R341O403
14043B5710r6J071J1423j4869p513Q361K649j1518L359q164M124k169O991j0103
14029I256n310K772O995J8331R202j2956n095o625Q214m068n974j0347q598J1379
14015G176Q686j6034j4967K441J3730R990N768L163k195J683j740k289J299r71
14001A5740Q281N091q487j570j689j6355j0870P72O048k927K808O213J3421l541
13987A2935P9O671M690J0833O4j1861l820n927k509j778n749J268J0537r16N215
13972A9732R398K64o24J3036O59j1009q273j1060O735J1866K661o84Q391M447
$$ y = [222692, 202706, 191583, 195549, 172568, 146366, 117783, 88616, 90777, 84638, 77438, 66024, 54177, 47549, 52889, 66681, 73364, 67483, 58232, 53120, 33257, 8400, 4377, 8787, 9966, 19307, 25710, 25614, 26685, 38108, 23239, 15726, 24087, 26736, 15218, 18577, 10413, 14537, 12368, 19359, 9256, 3946, 6718, 13713, 32044, 41246, 28290, 23195, 16570, 24784, 20716, 14742, 4395, -4203, 7176, 15862, -172, -15139, -12698, 1032, 11022, 16790, 19953, 17758, 19441, 17701, 15412, 16711, 15740, 24021, 29112, 20625, 19055, 17366, 1011, -9859, -9087, -3039, -5966, -3158, 3055, 16476, 12935, 13014, 19685, 24375, 35208, 35272, 23411, 19591, 13664, 11155, 9377, 3628, 4896, 15433, 14517, 19732, 29130, 29394, 28770, 41806, 42465, 31456, 23183, 12123, 18858, 30724, 33385, 32701, 41092, 45539]
13958D5539j1133j0070J10k470r449k990P305P005k943p815p639R483l633j4772
13944c472j0277Q752k3P202o402n422k994J7955J4179M825j008q096M228j6888
13930B559k46o419j051j067k739J0776n094M92J2699L458j570m603J692R186L346
13915B1419m582j0717j7073o355J3848J7355o027J840l002J3250K067q259j0525
13902C239N693J1200P112n256n578r639j2256K597J6138J2042j4j5482j5271N832
13888C57J0519L789O589m146l133M118K589N039M145p496L90l89r787J524j6427
13873b319l280J4385Q092M043P025k46p034q652o563j164o787m790o498J5144
13859A356K0183p487j0323K76M736P387p56j7323k73P944k042N657k89k590P898
$$ y = [45539, 34406, 24336, 24446, 21976, 12527, 9537, 16842, 23847, 20904, 13089, 5450, 14933, 11300, -3472, -13749, -4997, -5020, 2182, -4220, -9642, -12636, 5319, 19498, 24323, 23315, 15219, 19447, 2559, 2313, -4106, -5157, -6224, -8963, 1813, -3281, -2789, 9910, 13368, 11798, 7195, 8887, 18073, 21419, 16837, 6120, -10953, -17308, -3460, 13895, 7868, 9708, 6706, 19956, 22023, 13764, 3239, 8932, 20132, 27244, 21988, 16410, 6771, -5485, -2888, 13250, 25292, 25278, 9796, -5475, 357, 10876, 14665, 21254, 17108, 13975, 18093, 20682, 25721, 29866, 22370, 22760, 22371, 12584, 14108, -2319, -5599, 8786, 16878, 20921, 27946, 27700, 20666, 12014, 5451, 4287, -2500, -7290, -13788, 1356, 21539, 14052, 3729, 4005, 8741, 16128, 15372, -1951, -2224, 5720, 3678, 9335, 9046, 6456, 14354]
13844A4354m048r873l63O021J544O77l156p769J790P79k448m510m994P37J1084
13829a75N724J0167P887N157k339j920m251N976j6842m728J9370N773J210j3679
13815A7330j5052j1367l712J1681J2158N794l853K143J09J287q738L558P917K632
13801B1887k107m784j0873M351J8869j11p795j0640j3933R588N890j0714Q443
13788H071L698k201L258m34j60Q107k593l166l28N776j3252j9827J6373J0253
13774A3575L774J0788o435p068J615r911k045q002n73P041J0260L625n36n118
13760A0990j2179j549N757j0935j5422K752K1967l69L278J641N147q919q835J0530
13746C854j742o464J5464J1657l20p501j932m099j5346R009Q158R146N936o417
$$ y = [14354, 10306, 433, 70, 6091, 7635, 8312, 5156, -2613, -823, -44, -2492, -7002, -11996, -11259, -175, 5549, 15716, 23603, 28760, 26421, 24501, 20250, 26226, 9384, 4656, 24026, 29799, 31009, 17330, 2278, -9089, -12801, -1120, 11038, 16832, 12979, 15122, 15231, 16518, 7780, 11338, 19255, 21887, 19780, 14996, 4123, 8474, 27343, 27232, 19437, 8797, -5136, 4452, 10342, -372, 8071, 11769, 9568, 12826, 12392, 12232, 20339, 17746, 14580, 14252, 20028, 6776, -13051, 3322, 13575, 17349, 28137, 21702, 14634, 16249, 6338, 4293, -3709, -4282, 2759, 13019, 16644, 16108, 10990, -1189, -2738, 3019, -7916, -23338, -20586, 1381, 1012, 4290, 5931, 11078, 2159, -6676, 3854, 2112, -4352, 11112, 22769, 22449, 14948, 13016, 8917, -6429, 2580, 10738, 19884, 25820, 19403]
13732A9403p213l530L016n557J036k037L365J0085M264j4048j0282N108J1672
13719A5282n871j230p482J13J5521k169j1135J1662p197j3422K860O217j897K310
13705C562m077M203K631M361j3771k704R615R288K407K510l945L935M421J376
13691B3812P332r961k2148j795P524Q200M164j930j0188k698J2689R717r540l274
13677A1904J0394j8649j6790O775o549Q434N277N767k229J080M87j0737J1194
13664F358o43N982J6981K023j6824j0207p567j216q277o669P939J3939M08q703
13650f476O183J3502j247J0104J6370r828j4288q120l183R240J0842q53J2883
13637C5129L419q570j106n568pj3580j961O246N713j207n607L058J334n099l214
$$ y = [19403, 12190, 8660, 11676, 6119, 7155, 5118, 8483, 18568, 22832, 8784, -1498, 3610, 15282, 9411, 8181, 699, 812, 16333, 14164, 3029, 14691, 7494, -5928, -3068, 3149, 1252, 3562, -515, 3688, 6319, 10680, -3091, -5795, 3820, 13108, 15515, 18025, 14080, 18015, 22436, 23812, 31144, 21183, -965, -2760, 4764, 12964, 17128, 15198, 5010, 2312, 15001, 24718, 15178, 11904, 22298, 3649, -13141, -6366, -12915, -4481, 796, 6563, 4334, 5414, 5901, -4836, 6358, 5715, 11697, 28678, 30701, 13877, 3670, -3897, -5113, -13390, -20059, -12120, 1819, 2227, -6476, -293, 13209, 11962, 22066, 38436, 28608, 14320, 6200, 3017, 12257, 23099, 22246, 35129, 38548, 29978, 28872, 23304, 23297, 9717, 7756, 14002, 19715, 18508, 12901, 15959, 17293, 12194, 8980]
13622H980j7514R40J2388N039M608L512o255l236R00J2310L352j665J3090Q672
13608D5121n207j1186j0985P11k673q952M461l006p351O551O038K912J904m929
13594A3409J132q306k883J5093j701n788k081o41L640J472M526q5j569J2191P74
13579B9183m620p339l100m505J8376J245p037r465J069l271P746m835o122j2766
13565e441o508J0199J4770J1632O509p216l74K661k478K337j1799j1176k31P44
13551C629J0658l005L823J3574J8370r540j2323j312R4M027j3651j1033M509J0493
13537A8313M940r14j0929q450P563J5851l843l510n851j4716p339M737M083J1958
13523A1893N939J1617M774n499K826p153k0281R94J2544R113n899M955n762j79
$$ y = [8980, -8534, -7594, 4794, 9833, 14441, 17953, 11698, 8462, 9362, 21672, 25024, 23359, 36449, 45121, 39914, 28728, 17743, 18454, 15781, 6829, 11290, 8284, 933, 7484, 13522, 16434, 18338, 13409, 14541, 6235, 3352, 18445, 16744, 10956, 8875, 8234, 11874, 13346, 17872, 17787, 16218, 28409, 29183, 24563, 17224, 14124, 9619, 27995, 29240, 22203, 12738, 13807, 10536, 18282, 13447, 7325, -5441, -11949, -1750, 13020, 24652, 31161, 23945, 23571, 26232, 23754, 26091, 14292, 3116, 2885, 3629, 14287, 11282, 15105, 28679, 47049, 37509, 25186, 23874, 23968, 27995, 14344, 3311, 7820, 18313, 23253, 22339, 11410, 2960, 10523, 26374, 22531, 19021, 13170, -1546, -8885, -4148, -65, 11893, 17832, 29449, 34223, 28724, 31550, 24397, 4116, 5110, 17654, 26767, 20868, 25823, 20061, 19882]
13509A9882K875j182O379K062q230j0895q193N096O878n730l910o154J0205J97
13495I280L403J114O87n98R57k404K139L272o400k0570l235P868J4019N498J974
13480A7004K742q390j1735j4392J467J8964L220Q015J686j625Q031L708j267M651
13466C2079R919k520p658j7112p011N833R160j326m940r312j3028j159p85M314
13452c546j338n029m940J403K1317J0125j9347K059k288L738r41N860L932K266
13438A3271J014J5471J684l862k405R3M517j0435R218M629k0251j2773J6796K1391
13424C8358L758q42p277q815p208m817P313N162p393l952p258o26N986J254j2318
13409A325l174L999J0396m776J3486J8335r955J196j585k480J0258J3212o23j1789
$$ y = [19882, 22757, 21575, 27954, 30016, 21786, 10891, 2698, 7794, 14672, 8942, 5032, -1122, 9083, 9280, 12683, 13797, 14484, 13886, 14843, 12439, 14578, 17850, 11450, -9120, -12355, -4487, 9532, 15030, 17004, 19746, 11356, -379, -14771, -13304, 5660, 8880, 16895, 18581, 16956, 24987, 28695, 27428, 32079, 41998, 39478, 31820, 14708, 7697, 13530, 22690, 21364, 16424, 7112, -5916, -7075, -7860, -3546, -4884, -9913, -14853, -13450, 7867, 17992, -1355, 704, -1584, 2154, 1213, 7073, 11005, 13271, 14285, 29756, 31440, 27578, 25173, 25266, 29783, 19348, 28566, 33195, 12944, 171, 16967, 38358, 42116, 41274, 33997, 25182, 17974, 13157, 20470, 25632, 18239, 14287, 7029, 6403, 12389, 13643, 1325, -1849, 2150, 12546, 7770, 21256, 39591, 29636, 30832, 29247, 26767, 37025, 50237, 49614, 37825]
13395C7825k3681M514N398j0960j5609o53J4420P124r483J24O130M412J9064J1258
13381D9883j5472n27R91j0567q972J0022k423l348M176j090J1990J8136q479o118
13367C8202O09o966k908j484R5r31L291j1998j4900J2099R027J1242m05M306l29
13352C8950P111N441Q53j7304M45M271O845l0408j8751L955J1948L324j463J363
13338A6580j284J6N519J4941O036J12j8552n905J4275l588p825O431J7214N816
13324D9786J0677J1074O099J139l122J3253j147p981J798K911j368k506k378j0614
13310F7621o121P529m671j3052J2422J2024j875O894P442J9338K1125J7528L5045
13297A81249L3893K7172M3576K6827K9277M5570Q5347J17060J95866L14742M58294
$$ y = [37825, 14144, 18658, 24056, 13096, -2513, -3166, 11254, 18378, 8895, 9019, 15149, 19561, 38625, 49883, 34411, 33884, 34875, 24308, 15336, 25358, 22935, 19587, 23763, 22673, 34663, 52799, 44320, 38202, 38811, 31845, 28937, 27453, 27548, 26617, 29908, 17910, 3010, 15109, 24136, 35378, 34973, 39279, 38950, 46061, 51502, 52355, 35051, 35496, 39767, 46612, 16204, -2547, 1408, 13356, 16680, 15217, 16580, 15296, 15312, 20831, 35772, 41808, 41920, 23368, 17463, 31738, 28150, 20325, 26756, 43970, 49786, 60463, 71537, 77636, 78775, 75653, 88906, 87759, 79778, 81576, 84487, 83119, 80613, 78235, 67621, 61500, 69029, 64358, 51306, 63728, 75752, 73877, 80771, 88213, 107551, 128676, 146204, 181249, 215142, 242314, 285890, 312717, 341994, 387564, 472911, 589971, 785837, 1100579, 1558873]
13286A558873N91768M78389K68508m8544o01806p05945m60892k51115j46991p8061
13276F04184n5615o0801l3619j0610l1530n4838m6985m2282k6679j2951j7137
13265B11137j7038j9072r783k5182j9962r030q047r733j058m381R00O88r316j2889
13251F7234N956L668j1042n534O538J6260N656m662O989j1119j0786j4292J094
13238E5960J5846k985q513o567r021r28J4747J710m682Q484J773R100N177j248
13224G8853k451J407O850o74j4783p170J4088k663j7077m492k303J0148R946P755
13210G7434J1253j1889j6472j4328J2079J925n521l098J1759J3577R727n290j4010
13197F7146J0027j680j1542m828K5J0592N035j2130m61K6721K0380O997J2417
$$ y = [1558873, 2150641, 2629030, 2897538, 2848994, 2247188, 1541243, 1080351, 829236, 682245, 604184, 548569, 487768, 454149, 443539, 412009, 357171, 310186, 267904, 241225, 228274, 211137, 194099, 175027, 165244, 140062, 120100, 111070, 103023, 93290, 92232, 87851, 88751, 89439, 80123, 67234, 73190, 76858, 65816, 60282, 66820, 83080, 88736, 84074, 91063, 79944, 69158, 54866, 55960, 71806, 68821, 60308, 53741, 44720, 43792, 58539, 60249, 55567, 64051, 65824, 74924, 80101, 78853, 76402, 77809, 84659, 83985, 69202, 62032, 76120, 73457, 56380, 51888, 49585, 59733, 69679, 77434, 88687, 76798, 60326, 45998, 58077, 60002, 54481, 51383, 63142, 76719, 86446, 81156, 67146, 77173, 75493, 63951, 59123, 59148, 69740, 74775, 62645, 62184, 88905, 109285, 116282, 128699]
13184A28699j1261l621J0288p377n349N893J7654o592J947J0234L784j1798j0345
13171A22156r511L650L1621Q534j3087k6986l6828n6075q7726j22680j43134j79736
13159e09802k09776j15901J27377J66480J08594N4449K7056K5058L6039J4948
13149b75478L4134L0654J7270J3249J4548J5235K616m814Q543J7621R286J6115
13137a01021K8764N921k3759k4659j5815n385j4573o728L8241K8634J5857J4051
13125f0472O691K103M659J1272n542j3967l627n648K800R372J7230J2195o179
13112b9113J566K917j2338j2544Q207J5058O208J6550p91l992m80O440k548O908
13098B048J291J6620J941J664Q969J2735N418j1208L1J7569J10q269k0740j2335
$$ y = [128699, 117438, 113817, 124105, 116728, 111379, 117272, 134926, 128334, 130281, 140515, 144299, 132501, 122156, 112645, 116295, 147916, 156450, 143363, 116377, 79549, 23474, -64252, -186932, -330066, -509802, -719578, -835479, -708102, -541622, -433028, -378579, -351523, -326465, -290426, -275478, -241344, -210690, -193420, -180171, -165623, -150388, -147772, -152586, -144043, -126422, -117136, -101021, -72257, -66336, -90095, -114754, -130569, -135954, -150527, -157255, -119014, -90380, -74523, -60472, -53781, -51678, -47019, -35747, -41289, -55256, -58883, -64531, -61731, -52359, -35129, -22934, -29113, -27547, -24630, -36968, -49512, -41305, -26247, -20039, -3489, -4280, -8272, -8752, -2312, -4860, 2048, 3339, 19959, 21900, 23564, 32533, 45268, 50686, 39478, 39509, 57078, 57188, 48919, 28179, 15844]
13084A5844N168J3498J0742J277M113L0149J8981M583K0059N7004Q8575N0888
13072C20881n818m0533k1867K4282k8291l3989l5064k8541l0780j3030j2300o998
13060H7952m671J647j0472m815J0470K378j0951M653n951O418K614j078r396j4611
13046E4187j8905p224O490j096k02j7008M02J4836K2851O510J6498K939j1744
13033F8534M157J771O04M088q009Q87J2365P872k0148j5275J2724K456j373j00
13019G0553L4377J0979M56P837K3746J1425O849m645p223J721K3648K2010j0019
13006A91714M889o248l326Q03k8272j9065R46j9129j5223L638n96Q290L740Q609
12992A30770K997j0594P673K972q85J928j5475l0649l123J5110J2319P63o726
$$ y = [15844, 21012, 34510, 45252, 46529, 50642, 80791, 99772, 104355, 124414, 181418, 269993, 320881, 315063, 274530, 252663, 276945, 248654, 214665, 179601, 151060, 120280, 107250, 94950, 87952, 83281, 84928, 74456, 69641, 80111, 82489, 71538, 76191, 70240, 76658, 79272, 78194, 68798, 54187, 35282, 28058, 34548, 33452, 33250, 16242, 16644, 31480, 54331, 60841, 77339, 80278, 68534, 72691, 74462, 75066, 79154, 71145, 72032, 84397, 92269, 72121, 56846, 69570, 72026, 70653, 70553, 104930, 115909, 116365, 124202, 147948, 159373, 166222, 161577, 154354, 156075, 179723, 201733, 191714, 196603, 190355, 187029, 187832, 159560, 140495, 141441, 122312, 107089, 110727, 110131, 118421, 122161, 130770, 133767, 123173, 130846, 133818, 132933, 134861, 119386, 88737, 85614, 100724, 113043, 113806, 107080]
12979A07080M792j4350j3458L822K0793L3851J8754J2735J8927r580O030L975
12967A93371j172P153O608J3954L642J987J829r415R635L424N526O589K4080L1727
12953B98938L4869M7989Q4325J49787P0741j18391k27143k3053j46980k20578
12943d9496K0866M5225K3527L0809J815j0665J2265J7588K084P948J4985L4202
12931A51153K1823K1099J6967M073O396J8253M559q118k065k788j134J936K1694
12918B53848L4421K0571J1758k384K41m834j7409J9635M0759K6347L56k5276K577
12905C60610J7553K2280L0530K8055J3116K4824J8059J5106R764j241O915J0331
12893E55902k0102k6273q274J416J0739J1538P935l023o1K7449N0230L5668N4147
$$ y = [107080, 111872, 97522, 84064, 87886, 108679, 142530, 161284, 174019, 192946, 183366, 189396, 193371, 192199, 199352, 205960, 219914, 223556, 225543, 227372, 217957, 227592, 231016, 236542, 243131, 267211, 298938, 333807, 381796, 466121, 615908, 686649, 568258, 341115, 318062, 171082, -49496, -28630, 16595, 40122, 70931, 72746, 62081, 74346, 91934, 94018, 101966, 116951, 151153, 172976, 194075, 211042, 215115, 221511, 239764, 244323, 236205, 234140, 231352, 230218, 232154, 253848, 288269, 308840, 320598, 318214, 318455, 313621, 296212, 315847, 356606, 382953, 383309, 358033, 360610, 378163, 400443, 430973, 459028, 472144, 496968, 515027, 530133, 539897, 538656, 545571, 555902, 535800, 509527, 501253, 502669, 513408, 524946, 532881, 529858, 529797, 557246, 607476, 643144, 697291]
12880F97291O1031N0781M1819M7979L7089K7154N0377N3649L5822N1360O4065
12869A218417N2783L1043L6872P4120J17484J46827J21902J08018Q2942N9465
12859B049873O9893O7141N5071M6778N3106Q4470J46057K00403K36101K51347
12849C260240K64236L03971L83994M38998N63526O83494P68471Q84750R57850
12840H509530J002888J233021J582107K068780K639158L492798M303443M914170
12832B9745895N762086O356854P040072Q636330J1097905J5014702K1911445L4614773
12824A40180062N5980087Q6502957J07511191Q4714651M8961150J825517j06541080
12817D19134535j35285837q9189596n0220429k8927274j7653255j1322791p223992
$$ y = [697291, 758322, 809103, 850922, 898901, 935990, 963144, 1013521, 1067170, 1102992, 1154352, 1218417, 1271200, 1302243, 1339115, 1413235, 1530719, 1677546, 1799448, 1907466, 1990408, 2049873, 2119766, 2186907, 2241978, 2288756, 2341862, 2426332, 2572389, 2772792, 3008893, 3260240, 3524476, 3828447, 4212441, 4651439, 5214965, 5898459, 6666930, 7551680, 8509530, 9512418, 10745439, 12327546, 14396326, 17035484, 20528282, 24831725, 29745895, 35507981, 41864835, 48904907, 57541237, 68639142, 83653844, 105565289, 140180062, 196160149, 282663106, 390174297, 474888948, 523850098, 525675615, 419134535, 283848698, 194659102, 144438673, 115511399, 97858144, 86535353, 79311361]
12810G9311361m201389l964140o211250p115318o697238o270662n686482m758132
12802C4406750l974186l428636k947711k546590k127998j788917j473225j266700
12794A4852787j176289j100549j022274r60032q71339p89239p05125o32199n68957
12785G026784n54605n46903m96789m47708m03420l71817l15626k94087k82879
12776C312950k16089j58444j61001j64923j43375j26876j37038r9553q9679r9187
12766A916785j03431j05776r2196m4421n4120q3907p6905n2235k6022j3256n032
12755A259484k6884m0304o0740n5185l9447l7886k9464m0637o2776m5596k1941
12744G98624l2554l3099m0796l3480j7002n667J1070J2033n973Q75L333j6823
$$ y = [79311361, 75109972, 71145832, 64934582, 57819264, 51122026, 44851364, 39164882, 34406750, 30432564, 27003928, 24056217, 21509627, 19381629, 17592712, 16119487, 14852787, 13676498, 12575949, 11553675, 10593643, 9722304, 8933065, 8227940, 7595741, 7026784, 6472179, 5925276, 5428487, 4980779, 4577359, 4205542, 3889916, 3595829, 3312950, 3096861, 2938417, 2777416, 2612493, 2469118, 2342242, 2205204, 2105651, 2015972, 1916785, 1813354, 1707578, 1615382, 1570961, 1516841, 1432934, 1356029, 1303794, 1277772, 1264516, 1259484, 1232600, 1192296, 1131556, 1076371, 1036924, 999038, 969574, 928937, 866161, 820565, 798624, 766070, 732971, 692175, 658695, 641693, 636026, 647096, 659129, 653156, 654031, 657364, 640541]
12732F40541k6794k3425k31J9733J5252M492j6561l3655o803j0544r811K4545
12720E76739K0206j1198l3510j7680k226n505n86N548k7009o202L5127J2727J419
12707E47850R594L6459N617k197P324j0628j034K7180L0193L6801Q2589J61548
12695I31296P6918q8705p0476l7994j01926j25738q3868j9838p355o850p179k5629
12683D32656l6952p845o133j0556j7944j5553r658o585M460K43q165m886r427
12670C03655k692p005j7900K2422K1720K8254K2886R457j7418o778j4890p084
12658C34627Q303j1051q293O216m927j85J7457K8044J5361j2819k0005l2563r730
12645C10435k3500l1089j2649k6710k5969q915P919j2743l5829l6113j4912J2367
$$ y = [640541, 613747, 590322, 590091, 609824, 625076, 629568, 613007, 579352, 572549, 562005, 552194, 576739, 596945, 585747, 552237, 534557, 532331, 526826, 526240, 531788, 504779, 498577, 533704, 546431, 547850, 557444, 593903, 599520, 597323, 604647, 594019, 592985, 620165, 650358, 687159, 769748, 931296, 1008214, 919509, 849033, 811039, 709113, 583375, 499507, 479669, 472314, 465464, 458285, 432656, 395704, 387859, 381726, 371170, 353226, 337673, 328015, 321430, 325890, 326133, 317968, 313082, 303655, 300963, 293958, 276058, 298480, 320200, 348454, 371340, 380797, 363379, 356601, 341711, 334627, 342930, 331879, 323586, 329802, 324875, 324690, 342147, 370191, 385552, 372733, 352728, 320165, 310435, 286935, 255846, 243197, 216487, 190518, 181603, 189522, 176779, 140950, 104837, 89925, 102292]
12633A02292j1841k2853N766K9977k72j9875j0285J7798J1314J4590j583m024
12621A11004J6215J8347l190m259j691p809Q296L183j006j176l049p409J485R086
12607A38027n911J480m239R068J1269L943J2666J372J0249L710p754O821j2036
12594A68665o976J64n319M45L982N088j2433n929r750j1191j669J294P355j0178
12580A23548j1083m130k2032r709J0803L786j553K473K22O559K4889N873q201
12567A21445Q565j034J5442O158j5964k1941j5071l757M836J6528j4288r028J1411
12554A03302K5117l508j1444j0396P112K0092K4492J9245J4797M655k0777j401
12542A71286J041n851m896l35j0635p268k822j1637j4446J1109M368O617J217
$$ y = [102292, 90451, 67598, 73364, 103341, 103069, 83194, 72909, 90707, 102021, 116611, 115028, 111004, 127219, 145566, 142376, 138117, 136426, 128617, 136913, 140096, 139090, 137914, 134865, 127456, 128941, 138027, 132116, 133596, 129357, 138425, 149694, 153637, 166303, 167675, 177924, 181634, 173880, 180701, 168665, 161689, 161853, 156534, 156979, 160961, 166049, 153616, 147687, 137937, 126746, 125077, 126371, 133726, 123548, 112465, 108335, 86303, 76594, 87397, 91183, 89630, 92103, 92325, 98884, 123773, 129646, 121445, 130010, 128976, 144418, 150576, 134612, 112671, 97600, 93843, 98679, 115207, 100919, 91891, 103302, 128419, 124911, 113467, 103071, 110183, 130275, 154767, 174012, 188809, 193464, 172687, 171286, 172327, 166476, 161580, 161245, 150610, 143342, 140520, 128883, 114437, 125546, 129914, 136531, 137748]
12529A37748p372j2038o161j911J0464j629k443j655J9977R842j5524j8856J4762
12516A25204L290P202O484k412Q524J9076K6263J6218n896j7493k3093j4234r352
12503A39781P459Q539J8176l401J955J9322J9450J2364J5684J8016R941J9819
12491B87105O236J7538K5055N0360M5325M5762Q0916J21238J43204O9793o6829
12480H25703j34763k06316k09177j57503p2321l9241k4662o093j015L615Q42q006
12468b8937j673j1359P187k419j3542p454Q902J0792P941J4561O219l421m478
12455a7681k978N480J2686P679n004p094N367r199p021J5753R903j8686j5128
12442b5923j3700L277J3413M250K360M128N094N461r196P421L245j0510k372P377
$$ y = [137748, 130376, 118338, 112177, 110266, 120730, 119101, 116658, 115003, 134980, 144822, 129298, 110442, 125204, 128494, 135696, 142180, 139768, 148292, 167368, 193631, 209849, 203953, 186460, 163367, 149133, 139781, 147240, 155779, 173955, 170554, 172509, 191831, 211281, 223645, 239329, 257345, 267286, 287105, 293341, 310879, 335934, 386294, 431619, 477381, 558297, 679535, 822739, 892532, 825703, 690940, 484624, 275447, 117944, 45623, 6382, -18280, -24373, -25388, -21773, -20931, -28937, -30610, -41969, -34782, -37201, -50743, -58197, -49295, -38503, -30562, -16001, -9782, -13203, -17681, -20659, -15179, -2493, 5186, 182, -6912, -1545, -10744, -17765, -2012, 7891, -10795, -25923, -39623, -36346, -22933, -18683, -16323, -12195, -7101, -1640, -10836, -3415, -170, -10680, -13052, -5675]
12428e675q81J6762Q275P234j4478j9295j2424J0787l690Q28R328J915N939J6090
12414B0715r926m663m302J942n642o35l582J271L743O42k376O247J0732L637k571
12399A5232L08M172r195M514j0770k2787r650L053J2293J5199J0243N96j0632
12386B576L480J1091K570m990l015k545K4910J3550o411K182M525j6204j887K097
12372C1929R187q61J269l007K250N135n597J4674K8727J7016N950Q927L1867L4082
12358A81548L4567O2646P0889R2869J01407J75307K70923M24612N67542M84429
12348B466739K98360O2576m90898p17075n01104k90554j64817j25264q0392m0382
12338D17189k3188r428k5639l7974l6660m3862k6785k0241k2953j8987k2501k3584
$$ y = [-5675, -6556, 10206, 18481, 25715, 11237, -8058, -20482, -9695, -13385, -12557, -3229, -1314, 4625, 20715, 10789, 6126, 1824, 3766, -1876, -2511, -6093, -4822, -1079, -437, -2813, 3434, 14166, 17803, 15232, 15540, 19712, 10517, 15031, 4261, -18526, -28176, -25123, -12830, 2369, 12612, 13208, 2576, 6056, 17147, 19717, 14727, 11712, 9167, 34077, 47627, 41216, 43398, 47923, 31719, 29832, 31929, 41116, 40255, 41524, 38517, 40767, 45902, 40305, 54979, 83706, 100722, 106672, 115599, 147466, 181548, 216115, 278761, 349650, 442519, 543926, 719233, 990156, 1414768, 1982310, 2466739, 2765099, 2827675, 2336777, 1619702, 1118598, 828044, 663227, 537963, 457571, 417189, 394001, 384573, 358934, 320960, 284300, 240438, 213653, 193412, 170459, 151472, 128971, 105387]
12326A05387r978j0432m248N293p742r123k5191j3369M161J2128q252k6058j4990
12313b414l738o376Q144P752K0626l328M374l789j1431m688o540l460l232J4507
12299F407k060J592J406P846M633J675o05j1100J0661l836N820R40l42m434n912
12284A2691L337K238m074r869J3343J0511J2885j2473j4565q611K273l970n85
12271C131L689l047j972L510K846m138L095J5128M828L44n583j0833J910l020
12257I888M810n984j6900l800r466L717j688J585m719J5696j922l263p028J8556
12243e18Q810j1180j2873M352J909l268K936o004M260J8693O257l18l785L026
12229A2297p132N852O014l9M180P67J183o409m817m966J135K390J2606L110q822
$$ y = [105387, 95409, 84977, 80729, 86022, 78280, 69157, 43966, 30597, 34758, 46886, 38634, 12576, -2414, -6152, -12528, -4384, 3368, 23994, 20666, 25040, 21251, 9820, 5132, -1408, -4868, -8100, 6407, 4347, 5939, 7345, 15191, 19824, 21499, 20894, 9794, 20455, 16619, 22439, 23379, 23037, 18603, 12691, 16028, 18266, 14192, 4323, 17666, 28177, 41062, 28589, 14024, 5413, 7686, 3716, 3131, 6820, 3773, 1801, 5311, 8157, 4019, 7114, 22242, 27070, 27414, 21831, 10998, 12908, 9888, 14698, 8714, -8186, -11986, -21452, -17735, -19423, -17838, -22557, -6861, -8783, -12046, -19074, -518, 8292, -2888, -15761, -11409, -9500, -12768, -9832, -15836, -11576, 7117, 13374, 13056, 9271, 12297, 5165, 11017, 17031, 16992, 21172, 21939, 23122, 16713, 11896, 6930, 8065, 10455, 23061, 26171, 17349]
12214A7349q707N872k3399M676K6060J4107j9361j2828m802m00Q427j133J5153
12201B1014J622r994r19R239L575p209j2420M547K768J572o669L564J9348j1169
12187A8869j3206R53p949k31m490k974L723m160J0255J6031L599L036k610K063
12173B2909o811o661j2868m030K0839M108l876N104j3199K147q852j5553j1252
12160b7995K5118J2808j4494J0559K0173J431j7201L938p482N083l194Q018r149
12147G613j1370R739J7818k972j6118l094J0786J942o121j2491k1175J4481N412
12134e550M420M831J3410n164K550o565j1279L005M005M995N733j2918j5871K277
12120a2121J5349Q898n474j003p367l874m815J3472J8864l950n268j0038l194
$$ y = [17349, 8642, 14514, -8885, -4209, 21851, 35958, 16597, 3769, -1033, -1433, 6994, 5861, 21014, 22636, 12642, 11723, 20962, 24537, 17328, 4908, 9455, 12223, 13795, 7126, 10690, 30038, 18869, 5663, 6616, -1333, -1564, -6054, -9028, -5305, -9465, 790, 16821, 20420, 23456, 20846, 22909, 16098, 9437, -3431, -7461, 13378, 17486, 13610, 18714, 5515, 7662, -1190, -16743, -27995, -2877, 9931, -4563, 5996, 26169, 27600, 10399, 14337, 6855, 11938, 8744, 16762, 7613, -3757, 5982, 23800, 20828, 4710, 1616, 12402, 14344, 8223, -4268, -25443, -10962, -5550, -1130, 3701, 17111, 11947, 14497, 7932, -3347, -342, 3663, 8658, 14391, 1473, -14398, -12121, 3228, 12126, 6652, 5649, -1718, -5592, -10407, 3065, 21929, 17979, 12711, 2673, -521]
12107e21r09m740j7009L722O997l776n929J0345J420P886M219J0374o270q148
12093b339n418O757J3311J9306r165k4103p891m381M501P145P046J2868j348j4926
12079A363p641N679J8794J1437j0087m826j557j4852M9O920O523O578q871j035
12065H474L515J886l167R455m930j3535R542N986r105N72N10j6372j6844P245
12051a6768J5949R963P287p686n717o645q227q433k070k688l447r110J0683K3588
12037c321N573R860k416j4855P738j2748N22K0763P703r620j2949j608k764r8
12023h220n92J0363J1939j855j7180k141J4767q231m547J0540o002j4315j3159
12010b8633n93O245J3585M488L664R245K862j0195p046o660r510q53m716M340
$$ y = [-521, -1430, -6170, -23179, -19457, -12460, -16236, -22165, -11820, -10400, -2514, 1705, 12079, 5809, -2339, -7757, -1000, 12311, 31617, 22452, -1651, -9542, -13923, -9422, -2277, 4769, 17637, 16289, 1363, -6278, -599, 18195, 29632, 19545, 14719, 13162, -1690, -1641, 5279, 11802, 18380, 9509, 8474, 11989, 13875, 10708, 20163, 15233, 1698, 11240, 17226, 8121, 8693, 9203, -7169, -24013, -16768, -819, 9144, 16431, 8745, 3028, -3617, -11844, -20277, -22347, -25035, -28482, -37592, -26909, -3321, 2252, 12112, 9696, -5159, 2579, -10169, -9647, 11116, 18819, 9199, -3750, -5358, -8122, -8220, -8812, 1551, 13490, 11635, -5545, -7686, 7081, -1150, -5697, 4843, -1159, -15474, -28633, -29226, -22981, -9396, -4908, -1244, 8001, 10863, 668, -6378, -13038, -22548, -23401, -28117, -23777]
11996b3777l621j267J5985K2795l727j1049j112k461O546K0945J1657m407j2678
11983A3829j2763k702L727R236n497p71j5044O844N271l569K275O318l530k396
11969A228l930J3541R349p660m967Q086k737J0638L824L793k1237j8046n481N21
11955a3078N107P420k634K293p452N907O835L947l778q086n181j5522k994J1742
11941a5474J1281O115o353j8357j980j901M899P27J755Q68J8349J0949J5312M375
11927C0565q189m383N920R25j9750k075Q629J155p645k718J4681J0627j3599J2811
11913B6954r99k0931N078R587o677o595k421j479j2809L128m454N31J6298m978
11899B33j2131o663r494R171O996L132o50J3814j340j0941QK245L467K6974N96
$$ y = [-23777, -27398, -28665, -12680, 10115, 6388, -4661, -5773, -8234, -1688, 19257, 30914, 26507, 13829, 1066, -1636, 2091, 11327, 5830, 5059, -9985, -3141, 2130, -1439, 836, 7154, 3624, 1228, -2702, 10839, 20188, 12528, 7561, 15647, 12910, 23548, 27372, 31165, 9928, -8118, -13599, -13078, -7971, -551, -3185, -892, -8344, -2437, 4398, 8345, 4567, -3519, -8700, -24222, -27216, -15474, -4193, 1922, -4431, -22788, -24768, -26669, -21770, -21043, -19288, -18420, -71, 10878, 26190, 30565, 22376, 17993, 23913, 24838, 5088, 3013, 11642, 12797, 5152, 2434, 17115, 27742, 14143, 26954, 25955, 5024, 10102, 19689, 13012, 6417, 3996, 2517, -10292, -7164, -11618, -11087, 5211, 233, -11898, -18561, -28055, -18884, -11888, -8756, -9406, 4408, 3068, -7873, -7865, -5620, -2153, 24821, 25417]
11884B5417m086j076r979p165J1145N74j1105p410J503k918p670J1941R306j248
11870G229o034o646N786l171N591R5p973j0503P196R047n223m747o471j655J0402
11855g077K918K075N017o975r303k170O589j1292R544M813j713P810j837K389
11841G88j296j690K122j677J148J9613O851P88r899p153n774Q716J8829j2585
11827A8781j2004P860Q415j5563l424k21j414P366k115O684J0500o719j3669l599
11813H78j280P218K71K926n541j0600L847p631k318K446J0635J5160l147p29q640
11798C495j4305m122k971J314P651K2455R528q007q552j1442r804j295J057J8122
11784C124J4581Q918m087k6593j1405n936j1041r93J5232j8l542K3859J9549J2319
$$ y = [25417, 21331, 20255, 10276, 3111, 14256, 14830, 3725, -3685, -2182, -5100, -12770, -829, 8477, 7229, 1195, -5451, 335, -2836, 2755, 2850, -5123, -15626, -8430, 617, -4606, -9353, -15824, -17479, -7077, -4159, -2084, 2933, -4042, -13345, -15515, -8926, -20218, -10674, -5861, -7574, 236, -1601, 788, -508, -2198, -76, -1753, -605, 19008, 25859, 26647, 16748, 9595, 3821, 12537, 31366, 18781, 6777, 14637, 23052, 7489, 4065, 3844, 2430, 9796, 7681, 14365, 24865, 18146, 4477, 878, -402, 6816, 7087, 10013, 4472, -6128, -2281, -9912, -12230, -9784, 851, 16011, 12864, 12135, 3495, -10810, -14932, -17903, -16589, -8938, 13517, 23045, 15038, 6486, -4956, -14760, -16055, -14998, 3124, 17705, 26623, 22536, -4057, -15462, -21398, -32439, -33432, -18200, -18218, -21760, 2099, 21648, 33967]
11770C3967j1514k818L616J1206j2408k2638L925Q299m859p574o016J687q71j0000
11756a5998M160J4204k499k929L783M302J0736j4523J043k039j647N618p310m440
11742g539l919J4698J3985m810p025n279m767R596N789j044R67J1012K588n865
11728A8387n78j7723n282j1110j1032P702J1893K0208K875l856j2969r815k807
11715a4107N49l269q53p699O498K178J5976J6021o027Q283J5386K67k2296n226
11701E681N411R550L699j5066p104o70J843J3211J0659l144o483j191j3027j1781
11687h412j0895o526l16J1519Q399J5550O554j454R922M761J0755k0301j1109
11674H447J90p749M608j3699j9587R931O891P591K810k526l57j3148o984P946
$$ y = [33967, 22453, 19635, 23251, 34457, 22049, -589, 3336, 11635, 6776, -798, -6814, -5127, -5998, -15998, -11838, 2366, -133, -3062, 721, 5023, 15759, 1236, 2279, 240, -1407, 4211, -3099, -7539, -11458, 3240, 17225, 12415, 5390, 111, -4656, 4940, 10729, 9685, 10652, 21664, 24252, 18387, 17809, 86, -5196, -16306, -27338, -19636, -7743, 12465, 15340, 11484, -1485, -11300, -14107, -13558, -16827, -17680, -25379, -18881, -16703, -727, 15294, 9267, 17550, 32936, 33203, 10907, 5681, 11092, 20642, 24341, 9275, 2171, 1501, 3344, 16555, 27214, 24070, 17587, 16396, 3369, -8412, -19307, -25833, -26149, -14630, -6231, 9319, 15873, 14419, 24341, 29102, 39857, 19556, 8447, 8637, 888, 5496, -8203, -27790, -17859, -10968, -3377, -567, -3093, -3450, -16598, -23582, -15636]
11660a5636J3731O73m757r548J3593J7930m873p373q176M748R573M573o284n210
11646B964R488o71M522j2615p943k45q718o82R831J0362O823q003j7666J0708
11632a845J4323p682k1755J2779R40Q608L297j4456j2023R98K5766o94j4001q220
11618a3965n550J3939J9069p617j7803K409M198j0910q19K0819o723O522J0661
11605A4230p791r739p546l742k712j4476K552J8990o04p507J7300J6075j263j135
11591A2632o812j1892K628O308q314L271m195j5142l593o469J6602J6823R268
11578A1115J9613k999P0j0075k8673J360K793j603L467k237k096K51R578L197
11564C761p719L76j991j0387M398N466N708J978j332l033m365j0618J510J6343
$$ y = [-15636, -1905, -1232, -5989, -15537, -1944, 15986, 11113, 3740, -4436, 312, 9885, 14458, 8174, 2964, 12452, 11781, 16303, 3688, -4255, -4500, -13218, -13900, -4069, 6293, 13116, 5113, -12553, -1845, 12478, 4796, -16959, -4180, -3240, 5368, 8665, -5791, -17814, -16816, 8950, 8256, -5745, -13965, -19515, -5576, 13493, 5876, -11927, -9518, -5320, -16230, -17049, 3770, -2953, 3569, 14230, 6439, -3300, -10846, -14588, -17300, -31776, -29224, -10234, -10838, -18345, -1045, 15030, 13767, 12632, 5820, -6072, -3444, 2864, -5450, -2179, -6374, -21516, -25109, -31578, -14976, 1847, 11115, 30728, 27729, 27799, 17724, -10949, -9589, -6796, -8399, -4932, -7169, -9265, -9014, 564, 3761, -3958, -3582, -5573, -15960, -11562, -6096, -388, 1590, 258, -2775, -7140, -17758, -16248, 95]
11550I5k949n914J1010M486L425o894k394j020n8Q312J069P898Q288j3735l104
11535H515n757Q479O540j1788j0141K340N595J8537O023n383L58m443q214O284
11521A6945J981j9352j7858j8377k140R02P246J1969K066j101J4242J9263M730
11508B0516m99n654j5520q664M165J5861K686R58j7479j844m953K768R964l190
11494h85M316Q038J3305K853p099k5080j0387Q739P165K708K148O453J59L725
11480A6158P447k792l698o08J3942K388j0789j0602j2472j6670L051J1525j1352
11467a4472j5115o03L487M391J4488J2809Q442m539M714k809q49p300M64J4378
11453A7486n68j914q790O413P768o719j4195j0920J5253R709P785m801j2508k291
$$ y = [95, -2854, -8768, 2242, 6728, 10153, 3259, 865, -155, -213, 8099, 9168, 17066, 25354, 11619, 8515, 2758, 11237, 17777, 5989, -4152, -1812, 3783, 22320, 28343, 22960, 23318, 18875, 10661, 16945, 18926, -426, -18284, -36661, -38801, -37899, -30653, -18684, -16618, -17719, -3477, 15786, 20516, 20017, 14363, -1157, -9821, -5656, 10205, 12891, 13849, -3630, -5474, -10427, -7659, 2305, -885, 3431, 11469, 24774, 27627, 20528, -4552, -14939, -6200, 965, 3673, 5821, 12274, 12433, 16158, 23605, 20813, 17115, 16507, 30449, 32837, 22048, 11446, -1026, -17696, -14645, -3120, -14472, -29587, -30190, -26703, -22312, -7824, 4985, 13427, 8888, 13602, 10793, 9944, 2644, 3108, 17486, 16918, 15004, 6214, 12627, 20395, 13676, -519, -11439, 3814, 13523, 21308, 16507, 3999, 1708]
11439A708L038K0455J7771Q765q933j4548R233Q315J079k0975n631l045q10j0756
11425E666j2395l511R924J259r339M858K3460M996m456m457M201M887J24j3274
11411A1943q631J2823J3486k5006j0852M835Q787P072Q893Q711o448o110J2776
11398C2279J0151n004j7157k832j0316r144R48J5524K818j145L399M383p999j2139
11384C766J4034P746q40j1138M998j2312N624O073p868l590J713j0p996P06j1315
11369a0409K1907J5576J300j5732q235J100P221J2999j618j4053r192J9407J2594
11356C2865j5226j9488l034n666p006P312P521j2068r664L645J538Q981L828j434
11342g896j402L452K466q035j8987Q212Q917L387J6220L09j7019O227L252R747
$$ y = [1708, 4746, 25201, 42972, 51737, 42804, 28256, 37489, 45804, 46883, 25908, 20277, 17232, 16422, 5666, -6729, -10240, -316, 943, -8396, -3538, 19922, 24918, 20462, 16005, 20206, 25093, 25217, 11943, 3312, 16135, 29621, 4615, -6237, -1402, 7385, 14457, 23350, 32061, 25613, 19503, 32279, 42430, 37426, 20269, 17437, 7121, -2023, -1075, 14449, 17267, 16122, 19521, 23904, 15905, 3766, 17800, 25546, 24706, 13568, 18566, 6254, 11878, 17951, 10083, 6493, 8206, 8196, 200, 906, -10409, 11498, 27074, 28374, 12642, 4407, 5507, 12728, 25727, 24109, 10056, 864, 20271, 32865, 17639, -1849, -4883, -10549, -17555, -10243, -2722, -14790, -24454, -20809, -19271, -10290, -6462, -7896, -9298, -5846, -3380, -11415, -30402, -22190, -13273, -9886, 6334, 6643, -10376, -4149, -897, 8850]
11328H850N703k789j9595j2979P198N909k341J444J3153Q7k285q701r74J6758
11314I438L335N190l555j4027j0780P61M246R094J1401J0406P89j1759n976K002
11300A0565l922p455k36n534J831j5708j6275J0378K0897J1080j7306N115n315
11287a1885N192K673l260j5867Q001L130N921l010L334R39J1616j670j0811j1037
11273a6734k3868N82K5545J6681N776N972J471o516j3120N653O378O21j2337p218
11259a1114L225M687Q064j0577J55K5334n041k0892j1703o957J7378N875J0175
11246H609j4462j0164r167P299J3546L487j935j0314j895P176J200n017J1280
11233c57R969K391J2601m687J112n157j1027n056J0226J6549l394j2970j0616
$$ y = [8850, 14553, 11764, -7831, -20810, -13612, -7703, -10044, -8600, 4553, 4640, 2355, -6346, -7320, 9438, 12773, 17963, 14408, 381, -10399, -9638, -5392, 3702, 15103, 25509, 26298, 14539, 8563, 10565, 6643, -812, -1048, -6582, -4751, -20459, -36734, -26356, -5459, 5621, -11685, -6570, -11885, -6693, -4020, -7280, -23147, -15146, -12016, -6095, -9105, -5771, -4832, 6784, 5114, -5697, -16734, -40602, -40020, -14475, 2206, 7982, 13954, 15425, 8909, -4211, 1442, 7820, 8441, -3896, -11114, -7889, -3202, 4862, -5715, -5560, 19774, 14733, -6159, -17862, -24819, -7441, -1566, 8609, -5853, -16017, -25184, -17885, -4339, -852, -2787, -13101, -14996, -7820, -6620, -11637, -357, 9612, 12003, 24604, 19917, 21029, 15872, 4845, -211, 10015, 26564, 23170, 10200, -416]
11220d16m675P032q307L180j264O89o497o065q857j0335J8906J3444j4372j590
11206a9127J3844J8042J2829r457j2023N902K708j1010j5451P175J991J2491K433
11193A0347q28l602m9m6J1217J7581p640k517k423p305q173P440m177j4303k888
11178g366J649K882Q045j148j288o115m016M414N141j877K58J1925P475j6178
11164C801k814N643j0596k881P358r550K916J2678L118J2791o347q896p530o632
11150f941K183n248J58K0995J3530j8286o47j4591j8343r885L302J3446O12O546
11136a3169K695P632Q401K8K24j1829j3963O214Q856O382p451O209M124R916q122
11121F147N949L135P67r723j4414j1985N944M115r509r631J837K4392q321p389
$$ y = [-416, -5091, 1941, -6366, -3186, -4450, -3761, -10258, -16323, -25180, -35515, -16609, -3165, -17537, -19127, -5283, 12759, 25588, 16131, 4108, 10010, 12718, 1708, -13743, -6568, -4577, 7914, 10347, 9519, 5917, 5868, 5822, 17039, 34620, 26980, 24463, 22040, 14735, 6562, 14002, 9825, -4478, -7366, -5717, -2835, 5210, 4062, 2774, -3341, -7357, -2943, 2198, 321, 579, 12504, 19979, 3801, 987, 6630, -3966, -6847, 511, -9039, -6123, 6555, 9673, 22464, 16117, 7221, -309, -6941, -4758, -10006, -9848, 11147, 24677, 6391, 5744, -8847, -27190, -37075, -33773, -20327, -19715, -13169, -10474, -2842, 5559, 5587, 5811, -6018, -19981, -13767, -4911, 1471, -5980, 229, 4353, 14269, 6147, 12096, 15231, 15998, 6275, -8139, -20124, -14180, -10065, -19574, -29205, -27368, -2976, -11297, -18686]
11107a8686J9360Q924r243R67L042j479m00q043m068Q026R907O324j1824k146
11093F61N375O016j8314j4387j5175m321Q611O960P885M883J2939P518m030n720
11079a099q022m955j0177O108J3084j773o259j126P983J369O457k48n913O574
11065B003J685l4p016K395m518J002n109J41R982J84M649J1504L93l875j3899
11050e13j6275j431L622O047Q781j1982J399R479j125q793k562P86R280J9779
11036A6492J2336n560o57o343k218r154n515j320j2645O65Q805l463L265K517
11022b795j4851j1414Q479N230m314j582P899R391K360M238l061m337j859K173
11008d443n142j3620O53o488Q622J9425P400j1812k49J0119J9021K325j2869j0970
$$ y = [-18686, 674, 9598, 355, 1322, 4364, 2885, 2485, -5558, -9626, -1600, 8307, 14631, 2807, 661, 6036, 12052, -6262, -20649, -35824, -40145, -31534, -24574, -16689, -11806, 1133, 8651, 4621, -1099, -9121, -14076, -24253, -18145, -5061, -6834, -13093, -14219, -6236, -4867, 1590, 1342, -4571, 2003, 3688, 3654, -3362, -967, -5485, -4483, -9592, -9451, 531, 715, 5364, 16868, 17261, 13386, -513, -16788, -18219, -14597, -8550, 231, -11751, -10352, -873, -1998, -10791, -13353, -12567, -3287, 16492, 28828, 23268, 22611, 16268, 14050, 4896, -619, -1939, -14584, -13919, -5114, -8577, -5312, -2795, -17646, -29060, -20581, -15351, -19665, -21247, -13348, -3957, -1597, 2641, -420, -4757, -6616, -4443, -9585, -23205, -22552, -29040, -20418, -993, 6407, -5405, -5654, 4465, 23486, 25811, 12942, 1972]
10994A972j756J992Kl633Q242o91j2k219n775J0856O223o976m778j594O064K979
10978A0896J4343K5291j654r041m721j1922K611m183L81N754q912j1848n650K836
10964D181K005O796L429j1222p540P147Q211j1528j3085R653J6469M552L495p715
10950A4848L462j6071L665K730j4948L480Q462o552j0554J390j27N253o951P602
10936d311Q513k405m757O216P357J3836K585j0175m452N260n680l766o168j164
10922H89j2900K553J4700p088l703J0789O299J361J0548j7615k1402r300O264
10909a8605J4449O168N437N32Q760o853m481M015j3002o364R236J0212p49L925
10895A2680Q648k778j697P157j3078j4190j1892M479J1614N502j482q124o695
$$ y = [1972, 216, 2208, 2210, -1423, 6819, 6128, 6116, 3897, -1878, 8978, 15201, 8225, 3447, 1853, 7917, 10896, 25239, 50530, 48876, 39835, 35114, 23192, 25803, 21620, 22001, 27755, 18843, 6995, 1345, 4181, 6186, 12982, 16411, 5189, -2351, 4796, 13007, 1479, -11606, -1953, 14516, 19068, 22563, 14848, 18310, 2239, 5904, 8634, -6314, -2834, 5628, -924, -11478, -10088, -10215, -4962, -11913, -4311, 4202, 1797, -2960, 3256, 10613, 24449, 27034, 16859, 12407, 17667, 11987, 8221, 2053, 889, -12011, -9458, 5242, -1846, -5549, 5240, 11539, 12900, 23448, 5833, -15569, -24869, -18605, -4156, 2012, 7449, 7981, 16741, 9888, 5407, 9422, -3580, -9944, -708, 9504, 8755, 12680, 21328, 18550, 16853, 24010, 10932, -3258, -15150, -10671, 943, 6445, 4963, -3161, -9856]
10882i856l959R161j700K959J505k1130J0127K2232k3998q110j722k459P035J3417
10868f498p198J846J2305M226q558j3088L738Q653o165n895q8R764j188j329q774
10853a8249l633j810J2670L924p79K619P298l22R418L351m718j6521M66J5154
10839H868K947M443M622l821m294P706r444j2223L211Q526J0516o802L102m04
10825A6953m667q896M077P097m833o357q130k013K606q907k102N375J2984j300
10811A887Q030p78j9478j4242q815J8915J4607o550o387j4182O324J4161L640
10798b868k463n37J0792k934j0051O232J926N429L857j7251M899K6133l873j0445
10784H846j7843q835J1060K511o484P425R768R72J2429J0986k773p740k782j4977
$$ y = [-9856, -13815, -4654, -6354, -3395, -1890, -23020, -12893, 9339, -14659, -22769, -24491, -26950, -19915, -6498, -13696, -11850, 455, 4681, -3877, -16965, -13227, -4574, -10739, -16634, -16722, -6958, -8146, -9475, -18249, -21882, -23692, -11022, -7098, -7877, -5258, 2040, 1718, 11136, 14487, 9769, -6752, -6286, 8868, 11815, 16258, 20880, 17059, 12765, 20471, 11027, -1196, 2015, 10541, 21057, 14255, 17357, 16953, 12286, 3390, 7467, 14564, 9731, 3374, -4756, -6769, -4163, -13070, -15172, -9797, 3187, 1887, 9917, 9139, -10339, -24581, -33396, -14481, 126, -6424, -12811, -26993, -20669, -6508, -2868, -5331, -5868, 4924, 1990, -8061, -1829, 97, 5526, 9383, -7868, -2969, 23164, 19291, 8846, -8997, -17832, -6772, -4261, -10745, -3320, 6448, 7420, 19849, 30835, 28062, 20322, 17540, 2563]
10770B563M49J3584N11j2795m160j1166J444j2361O090K4853J4644n988j5380
10757B288p643j7496m970k639P728J1197n62j988K687K288p198k411Q23J8113
10743B17k494r022l627N710r029o176R376P194L798k051K275N801M753j631k2175
10728a7081j1919m012J4467J2683J0788M361q735J3457O266o388j1362O98j0656
10715g433K992J1217q369j7m538l474J4456P700k238j3556l923p402q034o98Q196
10700a5121j21J34N953L151o891K1130J0966p251Q908j2637p530L758n273q172
10686h996j0182M913J1766R391K530o819N558j83j1221P51O220o055J64q093Q624
10671a632j812n338P308j867J156Q792k294j715m084Q14K065N70r705l996M410
$$ y = [2563, 3012, 16596, 17107, 4312, 152, -11014, -9570, -21931, -15841, 9012, 23656, 17668, 2288, -5355, -22851, -27821, -30460, -22732, -11535, -12097, -14085, -11398, -9110, -16308, -18719, -17896, 217, -2277, -11299, -14926, -9216, -18245, -24421, -15045, -7851, -4053, -6104, -3829, 1972, 6725, 5094, -17081, -29000, -33012, -18545, -5862, 4926, 9287, 552, 14009, 20275, 13887, 2525, 3223, -7433, -4441, 6776, -1593, -1610, -6148, -9622, 4834, 12534, 10296, -3260, -7183, -14585, -22619, -23317, -15121, -15242, -15108, -9155, -6004, -12895, 8235, 19201, 11950, 20858, 8221, 691, 4449, -824, -8996, -19178, -14265, -2499, 6892, 9422, 2603, 8161, 7978, -3243, -2492, 3728, -2327, -2163, -10256, -1632, -3444, -8782, -1474, -3341, -2185, 6607, 4313, 2598, -1486, -672, 1393, 1963, -7742, -11738, -7328]
10656g328k4015o616J0400J4916R189l839l783Q131Q707J1654j9715j4041Q822
10643g518O391l747L362J4053o178o943j4572J147L879N992J1736L341M609n193
10629A0359j7638O658R117N894q569j0485K2J1853Q813n172J841K364j3803m444
10615c190K1169J2304j503m037k2382j7672J8602j494q707k866r564N299J69k931
10601a6803r24O891j3831M945J9285n34o001o069L952Q745J1321m175j3419j6022
10587b2639j1445J406k601j0068R383J1524Q660q784q615J4517J7061J2524L184
10574A4107j6501L177N191n480j3008k51q311K209K378J0924r26m731p442j4893
10560c3557O696K869O115J4163o762o318l322M052M096k854J2775q192R214j34
$$ y = [-7328, -31343, -37959, -27559, -12643, -3454, -7293, -11076, -2945, 5762, 17416, -2299, -16340, -7518, -1127, -4874, -1512, 12541, 6363, -580, -15152, -14005, -10126, -4134, 7602, 10943, 15552, 10359, -7279, -621, 8496, 14390, 5821, -4664, -4642, 7211, 16024, 10852, 12693, 15057, 1254, -3190, 17979, 30283, 28780, 24743, 2361, -15311, 3291, 1797, -6910, -9776, -19340, -14041, -13872, -16803, -17727, -10836, -24667, -19722, -437, -971, -6972, -13041, -9089, -344, 10977, 6802, -6617, -22639, -34084, -32678, -35279, -45347, -35964, -24440, -15780, -24564, -33179, -18662, -1601, 10923, 14107, -2394, 783, 5974, 494, -12514, -12765, -21076, -18867, -16489, -5565, -6491, -11222, -18664, -33557, -26861, -23992, -17877, -3714, -10476, -16794, -20116, -16064, -11968, -14822, -2047, -10239, -1025, -1159]
10546a159M644k790l339j716O965J1203J2950J78j4865j4842O754Q348L355l301
10532A2385O544J201k0053j2779M904l261k2896j338J1731J0017l556q707r790
10519c5598Q17M50m673O696K6177J0390j1402r354K888J6526K3042p472o866j4614
10505b993j1032o117P020j46j459K209L1550J457j0148K92J1322n183o688o099
10491C985r19J1562J6731r026p528k971k0392r254L894q108K399K34M064Q222
10477g107R614K198P63j2445M494K381l392m361N9J005N498j139K496L395m65
10462B994M182J087q390k696j2114r47j339J430K377O786q305P173M573j814M389
10447f14R972j0805j1636J5070N755q203r109J2266q614j761K1901J4534j255
$$ y = [-1159, 3485, 695, -2644, -4360, 2605, 13808, 26758, 26936, 12071, -2771, 3983, 12331, 15686, 12385, 18929, 20130, 77, -12702, -7798, -11059, -33955, -35293, -23562, -13545, -17101, -25808, -35598, -34781, -34331, -39004, -32308, -6131, 4259, -7143, -16497, -13609, 2917, 25959, 18487, 11621, -2993, -14025, -20142, -13122, -13268, -14727, -12518, 19032, 20489, 10341, 10633, 21955, 16772, 10084, 3985, 3066, 14628, 31359, 22333, 14805, 11834, -8558, -17812, -13918, -22026, -19627, -19393, -15329, -7107, 2507, 4705, 5468, -6977, -2483, -102, -3494, -7855, -7796, -6791, -1293, -2432, 64, 3459, 2994, 7176, 8263, -127, -2823, -14937, -15884, -17223, -15793, -13416, -6630, -14935, -7762, -3189, -5003, -614, 9358, -1447, -13083, 1987, 7742, -461, -9570, 2696, -5918, -7679, 14222, 28756, 27501]
10434B7501k0521j1495o500K877K210k948q110l335O155N003K514L21m572K659
10420h241j0531L525J1325O247pM810J1106r558k5565l634Q987J1592L2270n920
10406B6406j9464j835J6000R480k6697n204r001j0408q852L510J0979N390J1949
10393B253J1955j4782j0412j318J6655L020M627o054k694M305k636P636p154j4212
10379h811j4811j2693l946K4055K3763K920j0461m373K828O029p630j5187j052
10366a9369L573M023j1919j2443J2853J2371O555O093J3608Q547r183r145K299
10353G863o825P394j4403p977q54n864P22n186M910n919K101m366K423M988N957
10338a5036L101j1799l278N98Q776J6729L002p760L894K200O098R953k676p253
$$ y = [27501, 6980, -4515, -11015, -8138, -5928, -8876, -16986, -20321, -14166, -9163, -6649, -6328, -10900, -8241, -18772, -15247, -3922, 2325, 2318, 7128, 18234, 8676, -16889, -20523, -11536, 56, 32326, 26406, 6942, 5107, 21107, 30587, 3890, -1314, -10315, -20723, -29575, -26065, -15086, -9696, 2253, 14208, -574, -10986, -12304, 4351, 7371, 11998, 5944, 3250, 7555, 4919, 12555, 5401, -8811, -23622, -36315, -40261, -16206, 7557, 10477, 16, -4357, -1529, 4500, -3130, -18317, -19369, -15796, -11773, -23692, -36135, -23282, -10911, -4356, 1737, 15345, 23892, 14709, 5564, 7863, 1038, 8432, -5971, -13948, -14802, -20666, -19944, -25130, -20220, -26139, -24038, -28404, -25981, -20993, -15036, -11935, -23734, -27012, -26414, -17638, -909, 2093, -5667, -1773, 427, 6525, 16478, 13802, 6549]
10324F549L970p896p104K6367J0800j5977j4622N329L350p798l435L984K160k757
10310B920P169j1989K552J7979O212r362r912r898m598P306K01L452K574q595
10296c989K888K2918N876j2556P15n678j1705r890k421p574J4470n739o671N961
10282a3395J1806j1444r466O883J0009l076M692R739Q17J655M532q111j0359n827
10268a1545J7910O120m102j342j383K001k3929p533J8654J2128j019l280P746
10255A0426K252k989k554n665o643j706p164R605J008r994j0326J2863J0279r718
10241a0326p392J1661K2307J0075j1600j8531j1455J8318J8436j771j0497J541
10229A0766r841O653j1547N447K1882k693k26j3380l122Q428K01m847J667j184
$$ y = [6549, 10519, 2623, -4481, 21886, 32686, 16709, 2087, 7416, 10766, 2968, -467, 3517, 5677, 2920, 10089, -1900, 652, 18631, 24843, 15481, 5569, -4329, -8927, -1621, -1420, 2032, 4606, -3989, -1101, 21817, 27693, 15137, 15852, 10174, -1531, -11421, -13842, -21416, -6946, -12685, -19356, -13395, -1589, -13033, -22499, -15616, -5607, -8683, -3991, 5748, 6565, 8220, 12752, 4641, -5718, -11545, 6365, 12485, 8383, 7041, 5658, 7659, -16270, -23803, -5149, 6979, 5960, 2680, 10426, 12678, 9689, 7135, 1470, -5173, -6879, -14043, -4438, -3430, -13424, -23750, -10887, -608, -10326, -17718, -6057, 16250, 26325, 14725, -3806, -15261, 3057, 21493, 19722, 9225, 10766, 925, 7578, -3969, 1478, 23360, 20667, 20441, 7061, 3939, 12367, 12568, 7721, 9388, 8204]
10215H204j397m448R829K426k2980o453M273J1451n35n981J650J7421J0743j220
10201B2983j0320j8648L890q508M393n591k087j041K567K233R805j0686k863J2719
10187a154M945L713P448j4881q302L602P664P876j0671o788l960J651J202l342
10173a0997M480M283p291O164N782J387j3985M936m149Q63j0516j1984o99J3289
10159a8437O8j6598J583J9311P563m396o707o550J0184Q917j1149p958j693R034
10145a6828J548R411J8344k728j2560o047L54J0516p022j5313o125q05M042K5943
10131B730J9128o87p88j6046M846P372J2739J3477r364k0902j2213p90N52R369
10117I423N027p30p108j2630R491P178n005N07J0118q233j0033j6246j1849K0012
$$ y = [8204, 6807, 2359, 12188, 14614, -8366, -14819, -10546, 905, 370, -5611, -3961, 13460, 24203, 22983, 12663, -5985, -2095, -10603, -6210, -11801, -13888, -14929, -12362, -10129, -324, -11010, -13873, -1154, 3791, 7504, 14952, 71, -8231, -4629, 3035, 10911, 240, -6548, -10508, -8857, -7655, -10997, -6517, -2234, -9525, -3361, 2421, 3808, -10177, -5241, -9390, -8527, -19043, -31027, -31726, -18437, -18369, -34967, -33384, -14073, -6510, -10906, -17613, -24163, -13979, -5062, -16211, -24169, -25862, -16828, -15280, -5869, 12475, 9747, -2813, -8860, -8506, 2010, -5012, -20325, -26450, -27255, -23213, 2730, 21858, 21171, 20383, 4337, 9183, 16555, 29294, 42771, 33407, 12505, 292, -498, 54, 9423, 14450, 13720, 6612, -6018, 3473, 10651, 5646, 6153, 16271, 8038, -1995, -18241, -30090, -10078]
10103a0078J3465o587j402l282N479R501j001J99j253j4832Q601J0274j7581o125
10089a4622J608j6280N81J6666J2951L683J0979m585J576n177o829P334m015Q637
10075A2507j4071j2360J6416m640K330j823m848M367J7346J0198j6635m464Q229
10062A2552J99P285R53j6538j4257J26K781J5997r70o546p391K579q358O580J9758
10047A4750o439q940O648J7199J8158K699R255P147J8080O591l0553r724m339
10034D0532l794l818j437j4605O077j758P567P754j9234q097N969O923P424J76
10020B9679l170m56m078n183m533L489j1787K57M596j2012m63P993J2787J2678
10006B9797o074j3801o900j0009l116k110N630k282o033l47Q913j880o271P85
$$ y = [-10078, 3387, -3200, -4602, -7884, -2405, 7096, 6095, 6294, 5041, -9791, -1190, 9084, -8497, -14622, -13014, -29294, -28713, -12047, 904, 4587, 15566, 10981, 12557, 7380, 551, 7885, 3870, 12507, -1564, -13924, 2492, -2148, 182, -1641, -6489, -2122, 15224, 25422, 8787, 4323, 12552, 12751, 20036, 20989, 4451, -9806, -9680, -6899, 9098, 8128, 1582, -5809, -3230, -11588, -5008, 14750, 8311, -629, 6019, 23218, 41376, 44075, 53330, 60477, 78557, 85148, 54595, 44871, 40532, 36738, 32920, 31483, 16878, 22955, 21197, 28764, 36518, 17284, 9187, 15156, 22079, 29503, 29679, 26509, 26053, 21975, 16792, 12259, 15748, 3961, 4218, 8814, -3198, -3661, 4332, 17119, 29797, 23723, 9922, 3022, -6987, -10103, -12213, -6583, -8865, -14898, -15245, -6332, -8212, -14483, -13698]
9992a3698P939j229O217J0766j1019k5040j314m308J261J0354J898j1098M323
9979b4948P022l565M829J5635L40k027O073Q672O560K795J272k2133j6293P094
9965h674J4341M007p53k2883p018R886K007p422q051J5297N786J7388J5359q686
9951B0584j6453j668K727J3726J7885R600k4077j9387q739j0114N004J843J7125
9938H056J4003o363k0486K828j265k093O800k928J2107K531n804P147j1689k0516
9924a7672O02N484O05L214M92n1N005K212q873P416R024l518j1424r597N469O507
9908e105l859k959p959k462N989R182M652O658j190j141l120J2632o252k0847
9894a5781j0972J1989M992J7364K546l51J751N997j0478o851N27J1475m774r269
$$ y = [-13698, -5759, -6988, -771, 9995, -1024, -26064, -27378, -31686, -30425, -20071, -18173, -29271, -24948, -17926, -21491, -16662, -1027, -687, -2714, 3359, 12031, 18591, 21386, 22658, 525, -15768, -8674, 5667, 9674, 8921, -13962, -20980, -11094, -9087, -16509, -24560, -9263, -3477, 13911, 29270, 20584, 4131, 2463, 5190, 18916, 36801, 46401, 22324, 2937, -5802, -15916, -10912, -9069, 8056, 22059, 15696, -4790, -1962, -3227, -5320, 1480, -1448, 10659, 13190, 7386, 14533, 2844, -17672, -17070, -11586, -10981, -7767, -7275, -7326, -2321, -109, -8982, -1566, 7458, 3940, -7484, -17081, -11612, -5105, -8964, -11923, -19882, -22344, -16355, -7173, -2521, 4137, 2947, 1806, -1314, 11318, 5066, -15781, -26753, -14764, -9772, 7592, 10138, 9787, 11538, 17535, 7057, 206, 733, 12208, 7434, -1835]
9880a835M827Q560JM91j1008k061N057k113p84J313l946R319K253M814K492M790
9864B2170m377k932j7085j6271p51J8363k648k039J3388M203m736j1851j5149
9851a9715J838J134J856N456R026J7601j0917o623k593J1760M556o014q437l203
9837d275j1004Q2R072N236R218J022j8299k1876k220J0920J0218L842J6528N058
9823A3522m506l004o40j3378M875J1665j0141j4534J3780J7927k593q235j016
9810C722m699j0443J2878j0330o489J0725Q424P049p654k390J47j4541j2989R630
9796a6960J5641M199O429j3615q096J4972J6379K58o487j831l323p638J0553M837
9782A5318o759p874k695N571N34j0441j2457n356J4687Q141l295p441L214P7M656
$$ y = [-1835, 2992, 11552, 11553, 12044, 1036, -1025, 4032, 1919, 1135, 2448, -1498, 7821, 10074, 14888, 17380, 22170, 17793, 14861, -2224, -18495, -19246, -883, -3531, -5570, 7818, 12021, 7285, -4566, -19715, -17877, -16743, -14887, -9431, -405, 17196, 6279, -344, -2937, 8823, 13379, 7365, -1072, -4275, -15279, -15197, -6125, -889, 8329, 9351, -8948, -30824, -33044, -22124, -11906, -8064, 8464, 13522, 9016, 6012, 5372, -8006, -3131, 8534, -1607, -16141, -2361, 15566, 12973, 4738, 3722, -977, -11420, 1458, -8872, -15361, -4636, 3788, 10837, 3183, 793, 940, -13601, -26590, -16960, -1319, 2880, 9309, -4306, -12402, 2570, 18949, 19207, 12720, 10889, 7566, -72, 10481, 15318, 8559, 685, -2010, 3561, 4095, -6346, -18803, -24159, -9472, -1331, -4626, -12067, -8853, -8776, -4120]
9767d120m249o735r89p449P522K460K735M570l220K343N764j104R252J247J524
9752I551L829J8639l684o547k5112p003N159N456J0176l749L058N138j168M255
9738A7998P054Q61q645j6283j1028J8540O39o87p886l773n554j23K799L835k710
9723d963m789j06N116K382J0302M370N827m238j2475j289o295o800J71N110q461
9708a6138l210o383O815J5955J5513O003n046j1253J246J214k551j4068p62k669
9694a5334L71J1983Q055K961L676J0234P515j2065j5650q056R801l182L052J3336
9680A6697J994j1797j5863L657j06j0867J0674K4400j2408k3543l710N489J2418
9667b965J5705J1958j926j5242k958L147J163N554j7714k6032K978Q061L611m050
$$ y = [-4120, -8369, -15104, -16093, -23542, -16020, -13560, -10825, -6255, -9475, -7132, -1368, -2472, 6780, 8027, 9551, 13380, 32019, 28335, 21788, -3324, -10327, -5168, 288, 10464, 6715, 9773, 14911, 13743, 17998, 25052, 25913, 17268, 985, -10043, 8497, 9136, 8449, 563, -3210, -8764, -8887, -6088, -2253, -4963, -9752, -9858, -4742, -2360, 7942, 12312, 18139, 13901, 1426, 137, -6158, -12958, -12787, -7677, -16138, -19348, -25731, -18916, -2961, 12552, 18555, 13509, 2256, 3502, 4716, 2165, -11903, -12665, -15334, -14963, -2980, 5075, 8036, 11712, 21946, 29461, 17396, 1746, -6310, 3491, 309, 3361, 16697, 18691, 6894, -8969, -5312, -5418, -16285, -5611, 18789, 6381, -17162, -20872, -15383, -2965, 12740, 24698, 22772, 7530, 4572, 7719, 8882, 14436, -3278, -29310, -26332, -18271, -14660, -18710]
9653a8710L897R103j045k116o224j1907J0091R625L284o014j4432j1010R788L563
9639b2107L164L112J1195M115M606O623J077j740j1093j1456O276J3141L383p777
9625B519j4268j4897J181Q404r683l562O455Q705J6311N908J996O938M306j3930
9611F383p591l312j5719P895P051l847q556l136k730L832K300L061N405L786P64
9596d414N505o000n523n7J4876J897j0586n189j2730P592J4100j0266N979J4950
9582A0134J6735k304l923j185k1926L40P474p220l279J48q262j1061R857P898
9568f574O090J064m968L245J698n286J244P161n520j4801j2044L755M792n384
9554b5528M413J5191N979q37n674m569k707m650R544N765n929p093J0318J3105
$$ y = [-18710, -14813, -5710, -6755, -8871, -15095, -27002, -16911, -7286, -4002, -10016, -24448, -35458, -25670, -22107, -18943, -15831, -4636, -521, 4085, 10708, 11785, 10045, -1048, -12504, -6228, 6913, 10296, 2519, -11749, -26646, -25465, -17061, -26744, -30306, -23851, -15146, 1165, 7073, 9069, 16007, 20313, 6383, -1208, -4520, -20239, -12344, -5293, -9140, -17696, -20832, -23562, -19730, -17430, -14369, -8964, -5178, -4414, 1091, -4909, -10432, -10489, 4387, 6284, -4302, -9491, -22221, -14629, -529, -10795, -4816, 10134, 26869, 24565, 20642, 19457, -2469, -2129, 5345, -1875, -5154, -5006, -13268, -24329, -14472, -6574, -484, 580, -4388, -1143, 555, -4731, -3487, 3674, -1846, -16647, -28691, -24936, -20144, -25528, -21115, -5924, 55, -782, -6456, -11025, -13732, -18382, -8838, -3073, -9002, -16095, -5777, 7328]
9540G328M25L02Q01n30j5972j607J0599j2952m573k529N217J0563L601K57m584
9525c654K193K1103l590J522l39j0049j0750j2660j2203j818Q927N299m460p182
9511b7661Q588r51J3654Q35p87J5926L536J4091o149m713j3939j0485n079k134
9497a5268J208J0270O406j1692N732J0433N159M947n68L630J121m024l14j6831
9483B09o79J3698j0555J165j77K627N986j442j2801J913j6176J712Q857o411M150
9468g924L442k654k183o134k0166J0856N421R988K3771P764K6785O63k2840l2031
9454e242j2070L389N61L057J3386P353J0063j357o062k0611O752J9438N433j1705
9440A2385j7389L294Q011N656N972q54o532q984p071J966J387q85J654q456l159
$$ y = [7328, 7753, 8055, 8856, 8326, -7646, -9253, 1346, -11606, -16179, -18708, -13491, -2928, 673, 930, -3654, -1461, 19642, 16052, 17574, 17235, 7186, -3564, -16224, -28427, -30245, -21318, -16019, -20479, -27661, -19073, -20024, -6370, -5535, -6322, 9604, 13140, 27231, 21082, 16369, 2430, -8055, -13134, -15268, -14060, -3790, 2616, -9076, -3344, 7089, 12248, 17195, 16627, 20257, 21378, 17354, 17040, 209, -470, 13228, 2673, 3838, 3661, 6288, 12274, 10832, -1969, -56, -16232, -14520, -5663, -12074, -7924, -4482, -7136, -9319, -15453, -35619, -24763, -19342, -9354, 14417, 22181, 48966, 49629, 26789, -5242, -17312, -13923, -13362, -10305, 3081, 10434, 20497, 19140, 13078, -7533, -781, 18657, 24090, 12385, -5004, -1710, 6301, 11957, 17929, 17075, 10543, 1559, -5512, -3546, -2159, -3044, -1390, -9846, -13005]
9425a3005l288K445R237J3584P221J3730o542r981r324o500R784O22n328J3218
9411A5873J178j9602j285J3029N522l845j7877n813K95P611M969O148m186O131
9397H148J5973J550m912q311O402O566j411N574j318l848p850o399R402K297O14
9382B2477Q91J644o1m704J6155R422o714q745k28o624M546P017j4491p380J711
9367A4916m053o990j238j0043J287J7421l661M451p81q755J418N719L976J0471
9353B4138O888J2691J4778R297j9740k9348p607J3231L937M497J0676j0124k704
9340C0610J372n037J056j901l876q716M909K6769K522j697p725j1035r994o048
9326A1209R059J900l236J6315J3481j4896m966R626M592L000q237N011M416p607
$$ y = [-13005, -16293, -13848, -4611, 8973, 16194, 29924, 23382, 13401, 4077, -2423, 7361, 7983, 2655, 15873, 17051, -2551, -3836, 9193, 14715, 10870, -7007, -12820, -12525, -4914, 55, 6203, 2017, 8148, 24121, 25671, 20759, 12448, 18850, 25416, 24005, 29579, 28261, 24413, 16563, 10164, 19566, 21863, 22477, 23368, 25012, 24951, 20247, 36402, 45824, 39110, 30365, 30137, 23513, 28059, 35076, 20585, 13205, 14916, 10863, 3873, 2635, -7408, -6121, 11300, 7639, 12090, 11309, 2554, 3972, 9691, 13667, 24138, 31026, 43717, 58495, 67792, 48052, 18704, 11097, 24328, 28265, 32762, 43438, 33314, 30610, 31982, 26945, 28001, 26100, 22224, 13508, 18417, 45186, 47708, 46011, 38286, 27251, 17257, 11209, 20268, 22168, 18932, 35247, 48728, 33832, 28866, 38492, 43084, 46084, 37847, 42858, 47274, 39667]
9312C9667o006J278n167K978J1577P083n432p004N924O294J2881Q855n676j2947
9298E4305r57J3323Q470R48j5750L965Q729m25l209l136o814j3987m912J3022
9284E3572J3378L362O017l537j3380j4156J7891K016o186q346J1278J4024m087
9271G1846j1187j7645P362J6045M289J1080P237J406p010M710j047n485k535R330
9257H8396L113k92N23M977m306q06M3P606Q588J7235J8602O781p782Q8K525K853
9241A48144n483o601L390J0735O590q387j5848l126Q095O347J3191J1163j726
9228A66484J369Q106p388l752J914O608J6257O203rn318J047m034R744P477N050
9213B09758N061p42J8303K3141J1243M799o12j815P993N450Q292M644K2764K6324
$$ y = [39667, 33661, 34939, 29772, 32750, 44327, 51410, 45978, 38974, 44898, 51192, 64073, 72928, 67252, 54305, 53348, 66671, 75141, 76089, 60339, 64304, 73033, 72608, 69399, 66263, 59449, 45462, 40550, 53572, 66950, 70312, 76329, 72792, 59412, 45256, 63147, 65163, 58977, 50631, 61909, 75933, 71846, 60659, 43014, 50376, 66421, 70710, 81790, 89027, 90433, 83423, 88133, 87086, 81601, 79066, 88396, 91509, 91217, 91740, 96717, 92411, 91605, 91648, 99254, 107842, 125077, 143679, 150460, 142678, 142766, 145291, 148144, 142661, 136060, 139450, 150185, 156775, 148388, 132540, 129414, 137509, 143856, 157047, 168210, 166484, 167853, 175959, 168571, 164819, 166733, 173341, 189598, 195801, 195792, 190474, 191521, 187487, 197231, 204708, 209758, 214819, 214077, 232380, 255521, 266764, 271563, 270951, 269136, 277129, 282579, 290871, 295515, 318279, 344603]
9199C44603l706k835J0450K1681L492o60N083J2372J4459L581K1340J9050M685
9186D53595R376K169J0846J1883R247J3153J0501Q664J0025K062l59P664M31K677
9172E51934L614L985J3289M220j0363j4441N127l188L827K3294q77j1438l167
9159E65816o833m940j5857j102j4957n702J004O451j5790j7255N655j234P06l451
9145D92511j0202j3790k1141p749j4861R583n047m0039k3663R966N170l22k7043
9132C53373k5510k5095J398L295o929p062j2678j1002j2039j0338P118R354l026
9119B60859j3701k1252k1436m829R953K180o40j0169k788p096j2357j448j1813
9106A65463M411O590l887J505m877r257j5448j0456Q153R000j6837r140P20j3261
$$ y = [344603, 340897, 338062, 348512, 370193, 373685, 373025, 378108, 390480, 404939, 408520, 429860, 448910, 453595, 462971, 465140, 475986, 487869, 497116, 510269, 520770, 529434, 539459, 541521, 541162, 548826, 549257, 551934, 555548, 559533, 572822, 577042, 566679, 552238, 557365, 554177, 558004, 581298, 580421, 568983, 565816, 558983, 554043, 538186, 537084, 522127, 516425, 517429, 523880, 508090, 490835, 496490, 495256, 495962, 492511, 482309, 468519, 447378, 439629, 424768, 434351, 429304, 389265, 365602, 375568, 380738, 380416, 353373, 327863, 302768, 304166, 307461, 300532, 293470, 280792, 269790, 257751, 247413, 254531, 263885, 260859, 247158, 225906, 204470, 199641, 209594, 211774, 211134, 200965, 198177, 191081, 178724, 177276, 165463, 169874, 176464, 172577, 174082, 169205, 159948, 144500, 134044, 142197, 151197, 134360, 125220, 125940, 112679]
9092A12679j3685K0614J4237j0988o994n795n724q821q012n539O192N090p694
9079H5560K0018N115k8549l716P438O914J4246k940n491o991j1821j0820j4729
9066E4234P670N001P814m883p693p546O262o753J3098R433j0443p820o112j264
9052E0998Q669k781j5627L261L852j805J947l604R301N305M029j4770l989j214
9038D3572j387O65o40M879q721p216J4910k364O371o958j6587m405P390p546N595
9023B7558Q09K139J4328q657J0760J520j3938n492Q214P370o203K025q318K735
9009C4850P572j55j556n230n009p724o045J866P974N048q99r282j1255j4964J1260
8994F451J877j6799P294J2327J5163J892j1002j1638J0304J6573l83k377k728
$$ y = [112679, 98994, 119608, 133845, 122857, 115863, 110068, 104344, 95523, 87511, 81972, 88164, 93254, 85560, 105578, 110693, 82144, 78428, 85866, 92780, 107026, 104086, 98595, 91604, 79783, 68963, 54234, 61904, 66905, 74719, 69836, 62143, 54597, 60859, 54106, 67204, 76637, 66194, 58374, 52262, 50998, 59667, 56886, 41259, 44520, 48372, 46567, 48514, 44910, 54211, 59516, 63545, 48775, 44786, 43572, 42185, 42850, 42210, 47089, 38368, 31152, 46062, 43698, 50069, 43111, 26524, 22119, 29509, 21963, 27558, 28367, 30506, 44834, 36177, 46937, 48457, 34519, 29027, 37241, 44611, 38408, 40433, 32115, 34850, 42422, 42267, 40711, 35481, 30472, 22748, 16703, 18569, 26543, 31591, 30692, 21410, 10155, -4809, 6451, 8328, -8471, -1177, 11150, 26313, 28205, 17203, 5565, 15869, 32442, 32059, 29682, 26954]
8981B6954M522n112j0695m753J4095Q905J5231m625j8329j0001K613K198M432
8968B5435k973j2007l155j1208n151J7266K25P39K016J2639L94O065P934q32o840
8953C0547r976L907R160n26j2119N539j275j6721Q962L234m90M905l16M229k891
8938B6169q852o440j0902J1702l196j2513j154q422J2938J8008m66k0963j5297
8925a9388Q137j995n595K447n57j1398M807K0994N783R12j4219K96P501L609M788
8910F122j2809J3099N391M679p004O27L730n461j5271Q726M822p665O925R930
8896A5841n765r178o473j5021m978R596M064L808O323K761J587m698j0988J6476
8882C355J1799k159l846l399J7151J6448j8374J660p360j1032J812j916q719o670
$$ y = [26954, 31476, 26364, 15669, 10916, 25011, 33916, 49147, 44522, 26193, 16192, 18805, 21003, 25435, 22462, 10455, 7300, -3908, -9059, 8207, 8432, 9171, 11187, 23826, 24220, 30285, 38219, 37387, 30547, 20571, 24478, 33638, 33112, 20993, 26532, 25257, 8536, 17498, 20732, 20242, 25147, 24831, 29060, 26169, 17317, 10877, -25, 11677, 8481, -4032, -5186, -13608, -670, 17338, 16872, -4091, -19388, -11251, -13246, -18841, -16394, -16951, -28349, -23542, -2548, 3235, 4147, -10072, -9776, -2275, 1334, 6122, -6687, 6412, 11803, 16482, 9478, 10105, 13835, 8374, -6897, 1829, 6651, -1014, 5911, 15841, 10076, 898, -5575, -20596, -25574, -15978, -11914, -8106, -1783, 978, 2565, -2133, -13121, 3355, 15154, 12995, 9149, 5750, 22901, 39349, 20975, 22635, 15275, 4243, 6055, 4139, -4580, -11250]
8868a1250R632J897P339J6251j6733K449Q961o208j5975j4879o815J6324J6929
8855G922J1877m485j956Q078l043k981P573l638j4713P49j2260P342P656K0496
8841B8617k398L272n425o046O777J3102p168J1281K6281N478j7637r793j3072
8828C3269J5327m141j0038q667r362n17J1831K999m823J379k702p076K838k782
8814A7535j1562j4525j3178M394J5182j1133j003J9148R716j2420q62P589J0108
8801A8989M937L149L273r56j456j3035J1848J1152j2348j3800r738m294k209J8094
8787A3606P413o730j0251j6337k303j22p13J0159J2003J3382M513p128j6099q772
8773g379J1671N174K329J6749p805j4117j2312J5167Q909R357k220Q85O200p522
$$ y = [-11250, -1618, 279, 7618, 23869, 7136, 9585, 18546, 12338, -3637, -18516, -25331, -9007, 7922, 19799, 15314, 13358, 21436, 18393, 15412, 22985, 19347, 4634, 5383, -6877, 465, 8121, 28617, 26219, 29491, 24066, 18020, 24797, 37899, 30731, 42012, 68293, 73771, 56134, 46341, 33269, 48596, 44455, 34417, 25750, 16388, 15871, 27702, 30701, 25878, 27257, 24555, 17479, 20317, 17535, 5973, -8552, -21730, -17336, -2154, -13287, -14290, 4858, 14574, 2154, 1292, 8881, 18989, 23926, 27075, 30348, 29392, 27936, 14901, 26749, 37901, 25553, 11753, 2015, -2279, -4488, 13606, 21019, 14289, 4038, -12299, -14602, -14724, -15437, -5278, 6725, 20107, 24620, 17492, 1393, -7379, 4292, 9466, 11795, 28544, 20739, 6622, -5690, 9477, 18386, 27743, 25523, 26408, 32608, 25086]
8759B5086o216Q433o658n18q053nJ572M747j20n390j4545j8086n234K406N913
8744a6668q45J0084Q904J863o860N18j422J0386q048m569O479J1223J1305O769
8730B9119j4570r589M881k807m494M857J1253o974n836J6840k357l974R34j5122
8716B161K497K8747j110l716j9149m526O126J5281N555r465j1903k161j519q28
8702E990N244J4597J418k225p289p733O409K80J11j3634p910L088K40m274p144
8687a2832n29J0523J9O268J5022r149j6615R995P196J1310J0248j868j9931j7543
8673g886O164K5289r381j7376P391O042Q116p680k805K038P487M795j4932o777
8659D85J6630P959M505m638j145j7558K607q188n581j515m311J8659M335K793
$$ y = [25086, 18870, 27303, 20645, 20127, 12074, 12069, 13641, 18388, 18268, 12878, -1667, -19753, -24987, -22581, -16668, -17513, -7429, 1475, 3338, -3522, -3004, -4426, 5960, -2088, -6657, -178, 11045, 22350, 29119, 14549, 4960, 9841, 7034, 2540, 7397, 18650, 11676, 5840, 22680, 20323, 16349, 17283, 2161, 4658, 33405, 32295, 28579, 9430, 4904, 11030, 26311, 31866, 22401, 10498, 8337, 6818, 5990, 11234, 25831, 27249, 25024, 17735, 10002, 16411, 16691, 16802, 3168, -4742, -1654, -1414, -5688, -12832, -13361, -2838, -2819, 3449, 18471, 9322, -7293, 2702, 9898, 21208, 31456, 29588, 9657, -7886, -1722, 23567, 14186, -3190, 4201, 10243, 18359, 10679, 7874, 9912, 17399, 22194, 7262, 485, 17115, 25074, 29579, 24941, 23796, 6238, 8845, 657, -4924, -6439, -10750, 7909, 12244, 15037]
8645A5037O294N33j932N754J4267N6j7079j3212m003M269M280l496J1370O435
8631B8573l508j0434k410N399L497r535K234K616R559n993k175j0197Q709q202
8617H133l992Q628O889k706j0788J0369R000O937o132M003m764r392o396J1003
8603B0792J102j795j612l900J3296K972j6107k290J0413J3452J1004J1114Q595
8590F7036n229j0011j2536j2713l159J5384K1180L304J9395N962m762j0335j8413
8577E5103j1832R329j715k949p018K449j914j2956j954k988Q853M25J650o464
8563B8019L373k177n488L859l919j9695o682K253J7513L581P88N486L584q817
8549B1678j7683j2430K373P687J489j1555l371J0455P967O225o160J432K695R90
$$ y = [15037, 21331, 21864, 19932, 25686, 39953, 40009, 22930, 9718, 5715, 9984, 14264, 10768, 22138, 28573, 25065, 14631, 12221, 17620, 21117, 11582, 13816, 16432, 25991, 19998, 17823, 7626, 16335, 8133, 4141, 12769, 19658, 16952, 6164, 16533, 25533, 32470, 26338, 30341, 25577, 16185, 9789, 20792, 21894, 20099, 18487, 14587, 27883, 30855, 14748, 12458, 22871, 36323, 47327, 58441, 67036, 61807, 51796, 39260, 26547, 23388, 38772, 59952, 63256, 82651, 88613, 83851, 73516, 55103, 43271, 52600, 50885, 47936, 40918, 43367, 41453, 28497, 26543, 23555, 32408, 32833, 34483, 28019, 31392, 29215, 23727, 27586, 23667, 3972, -2710, -457, 17056, 20637, 21425, 26911, 30495, 21678, 3995, -8435, -6062, 1625, 3114, -8441, -11812, -1357, 6610, 12835, 6675, 8107, 10802, 11792]
8535A1792J685L266R509j018k0589o505r98m554K799J2871L853k83n583j576l955
8520G14r877R01p591k1520J0829O292J273J2572q25K559r870j72L256n658J2520
8505d597J2361j703K710M28l079k695o74r852N626R99j0195j570M287O678K828
8490A552p793j574P922K677l421N589Q949l507j2008R412J3501k48K021l436L224
8475B2860l198p207j299j0002K92N779m874m919o547p67J0665O531n383n139J0204
8460F996k861J596J3430k168q727J348j6865m301j6941j53J9185K806O371J528
8446A244k335P531o08p361P300J3211K921j0746l17m154j6583n434J5677L488
8432C834N951o430n555J087J5848N923j3618M117J3742p452m631j1966k637L268
$$ y = [11792, 13477, 16743, 26252, 25234, 4645, -1860, -2858, -7412, -4613, 8258, 12111, 11828, 6245, 4669, 714, -9163, -8262, -15853, -37373, -26544, -20252, -18979, -6407, -7232, -4673, -14543, -14715, -11459, -17117, -4597, 7764, 6061, 8771, 9199, 6120, 3425, 2751, -7101, -1475, -476, -10671, -12241, -7954, -1276, 1552, -6241, -7815, 107, 2784, -637, 4952, 13901, 10394, -1614, 7798, 21299, 21051, 23072, 19636, 22860, 19662, 12455, 11156, 1154, 1446, 7225, 2351, -2568, -9115, -9882, 783, 7314, 1931, -3208, 6996, 4135, 5731, 19161, 16993, 8266, 9614, -7251, -11552, -28493, -28646, -9461, -6655, -284, 1244, -1091, 6440, 5832, -1529, 5771, 18982, 21903, 11157, 10840, 6686, -9897, -15331, 346, 3834, 9785, 3355, -2200, -1113, 14735, 20658, 7040, 11157, 24899, 17447, 12816, 850, -1787, 1481]
8418A481k696j972n390j0108K616K694k926L365J11N746R600J047p866m856r3
8403i247j212l80j4977J706J7090J7790N867N061o530j38R138o321j4626r965
8389f744J513l926j054j735j8879j4277k162K5416J0340Q258R835P718J430r636
8375F097j5489j2566J2490L211Q320m046j3962J5022O163q813k578j361o324l141
8361a6977J1018J4705j859q660k595O073J429M63Q285j5714O36K11m59Q735m667
8346F24p504j927N181K546L401o949K026J4087j1048n145J7252k042j6390R790
8332C902R900P306p759j7150j7086P151L94j636J732o53R662m505o254N299k534
8317a2231j4613j397K0630K0875o673j0394L115p30q315l954m677j0880J1510
$$ y = [1481, -1215, -3187, -8577, -18685, -16069, -13375, -16301, -12936, -12825, -7079, 2521, 3568, -4298, -9154, -9247, -10459, -10839, -25816, -24110, -7020, 10770, 16637, 21698, 15168, 15030, 24168, 17847, 3221, -6744, -5231, -9157, -10211, -11946, -30825, -45102, -47264, -21848, -11508, -3250, 6585, 14303, 15733, 6097, -9392, -21958, -9468, -6257, 2063, -1983, -15945, -923, 5240, -3573, -6151, -7512, -13836, -16977, -5959, 8746, 6887, -1773, -4368, 1705, 3134, 3597, 11882, -3832, -3196, -2985, -3444, 5291, 624, -6880, -8807, -3626, -1080, 2321, -4628, -2602, 11485, 437, -4708, 12544, 10502, -5888, 3902, 13802, 21108, 13349, -3801, -20887, -13736, -13342, -14978, -13246, -13899, -4237, -8742, -14996, -9697, -12231, -26844, -28241, -7611, 13264, 6591, -3803, -688, -1418, -9733, -13687, -18364, -29244, -17734]
8304a7734J4597J260P702J4499L118j2763q229K424q159m23N988R848J271Q655
8290B2054P486l004j4489J293l013r964j3607j616Q807Q23Q714L642p093r89J3437
8275A2481k974j4879Q518K0043p561L151l976J243L469m12j342j5799j2180J1
8261a0207J3374j1479J919M180k740J3041J5469M816l470n053N937p223m09j0128
8247H027q112L444n266K315M947J935k517j3853o326P054J0304J103j4803m294
8233a6042O604J510j662K566N347k748M91L142L525P484q691q551j2453p503m92
8218b7473l301L490J303l725K6185j333j7058L785J5686J6821M599k562L607j7794
8204B230j1198K5131O194k100j1589p265P855q890K376j7811j4358J3977j545
$$ y = [-17734, -3137, -1877, 5825, 20324, 23442, 10679, 2450, 4874, -3285, -3708, 2280, 12128, 13399, 22054, 29540, 26536, 12047, 13340, 10327, 363, -13244, -14860, -6053, -5230, 3484, 7126, 33, -956, 12481, 9507, -5372, 3146, 23189, 15628, 18779, 14803, 16046, 19515, 19103, 17761, 1962, -10218, -10207, 3167, -8312, -6393, -2213, -4953, 8088, 23557, 28373, 24903, 19850, 25787, 18564, 18155, 8027, -85, 3359, -1907, 408, 5355, 7290, 4773, -9080, -15406, -8352, 1952, 3055, -11748, -16042, -9438, -7928, -9590, -7024, -1677, -4425, -3934, -792, 2733, 10217, 1526, -7025, -19478, -26981, -27473, -30774, -27284, -25981, -29706, -3521, -4854, -21912, -18127, -2441, 14380, 18979, 16417, 20024, 2230, -8968, 16163, 22357, 20257, 8668, 1403, 9258, 368, 2744, -15067, -29425, -15448, -16993]
8191a6993R356J0326j1141j2491J6817P591J238k752N034k0307r634J9370m428
8178h014j483J5401M065m830k507J1839o182m209j2392j1008O918K00o46Q335
8164d513R037k757j040J969j2161L068J6852j7737o724J079j40J197M452Q720
8150A302L690o056m027o47l549L510J2634m853j0091r9r221R076J2615q529K031
8135b214j397j379M330N5N502j3725j4028N53n591k066q22J579J3206J6876R883
8120A0762r113n130r896l251N83r396j172P85l921K629k476m797r32J7417J1818
8105f090R555r94R142j0325j0388J465P212O017J0225j6366j8498p091L502M114
8091a8520O804N355R306j719l20j580k858k341M532j3336q350q749j124K0494
$$ y = [-16993, -7637, 2689, -8452, -20943, -4126, 3465, 4703, 1951, 6985, -13322, -22956, -3586, -8014, -9497, 5904, 9969, 5139, 2632, 14471, 8289, 4080, -8312, -19320, -12402, -12202, -12848, -4513, 4524, 1767, 727, 2696, -9465, -6397, 10455, -7282, -14006, -12927, -13067, -11870, -7418, 1302, 4992, -1064, -5091, -5738, -9287, -5777, 6857, 2004, -8087, -8186, -17407, -8331, 4284, -4245, -2214, -3611, -4990, -660, -605, 4897, -8828, -22856, -22303, -27894, -29960, -30782, -29203, -15997, 879, 10762, 1649, -3481, -13377, -16628, -16045, -25441, -26613, -25828, -29749, -27120, -29596, -34393, -35325, -17908, -6090, 3465, 2471, 11613, 1288, -9100, -7635, -423, 5594, 15819, -547, -19045, -26136, -22634, -18520, -11716, -6361, 2945, 1226, 906, -674, -3532, -5873, -1341, -14677, -23027, -31776, -32900, -12406]
8077a2406k169J212j1884Q956L748M681J6776J773n703q398j3624N285K470k765
8063a2048J335J5292m41j5232K622N267p137o933R884L784j8627O854J5080q270
8049h570M062m428m071R93L189J789P968J749m359Q346k18k56Q90l599r780k0672
8033b6967Q843J9478r28p709m404l878J4569J0745Rj3883j8114p751n9L039J5096
8018a1914N973J730L061N907M86L346J6388M248j7221o683p383o334K088J2008
8004E700J1604m0j1841m983k91O46l883Q494R25L433P964j0958J1414M842q088
7989A4938N544n030r71j508O477n419K782p271m602O300P443n871M277o106j6273
7974e290j106L470j40l085Q240J1882j042m38n499J4525r109r856L150J1241n691
$$ y = [-12406, -14575, -13363, -25247, -16291, -12543, -7862, 8914, 10687, 4984, -3414, -17038, -11753, -9283, -12048, -10713, 4579, 4138, -11094, -8472, -3205, -10342, -17275, -7391, -3607, -22234, -15380, -300, -8570, -4508, -8936, -13007, -12014, -8825, -7036, 932, 2681, -1678, 6668, 6450, 6194, 7084, 3485, -6295, -26967, -18124, 1354, 426, -7283, -11687, -15565, -996, 9749, 9758, -4125, -22239, -29990, -30049, -27010, -11914, -5941, -4211, -1150, 4757, 5243, 8589, 24977, 29225, 12004, 5321, -2062, -8396, -6308, 5700, 17304, 17264, 5423, 440, 149, 795, -3088, 5406, 6331, 9764, 17728, 6770, 18184, 23026, 14938, 20482, 15452, 14481, 12973, 19450, 14031, 16813, 9542, 4940, 11240, 18683, 12812, 17089, 10983, -5290, -6396, -2926, -3066, -6151, 2089, 13971, 12929, 12491, 6992, 21517, 12408, 2552, 5702, 16943, 11252]
7959A1252l440k384n887j4541L629M923n52j4590n886K1192J5232L185m963K755
7945I925n185l844J893J3539l022l582o169p91Q157J7029j263j0663r614K5617
7931C2027M46j1896l436J139K626m335Q639m76M93q441O023j1K944M793N210J310
7915C7055l094j1910j5182P08j2157j3214J4617J1670k539Q796R929J511m825
7902B1365j5983K177n279O340Q601k203k5247k732j919j7K254k275J9279k491
7888A870n387J0772k551J265O526J0135K187j5916p678M367m59l572k527P176
7874F208j385n403j556p816k771L672J1362L904k036j553j283l266p51r24N82
7859c016K797j274j230R981p452P10n964K935N647l656J0065J789l493J467j1674
$$ y = [11252, 7812, 5428, -459, -15000, -11371, -6448, -7000, -21590, -27476, -6284, 8948, 12133, 7170, 9925, 4740, 896, 2789, 16328, 13306, 9724, 3555, 2764, 10921, 27950, 26687, 16024, 6410, 32027, 32473, 20577, 17141, 18280, 20906, 16571, 25210, 24734, 25227, 16786, 22809, 22798, 25742, 30535, 35745, 37055, 33961, 22051, 6869, 7577, -4580, -17794, -3177, 8493, 5954, 14750, 24679, 26190, 21365, 5382, 7559, 2280, 8620, 17221, 15018, -10229, -12961, -14880, -14897, -12643, -14918, 4361, 1870, -3517, 7255, 4704, 5969, 12495, 22630, 24817, 8901, 1223, 5590, 5131, 1559, -968, 6208, 4823, -580, -2136, -9952, -12723, -9051, 2311, 6215, 4179, 2626, 1343, -1923, -2674, -3598, -3016, -219, -1493, -2723, 7258, -194, 516, -5448, -2513, 3134, -522, 9543, 11332, 7839, 9306, -2368]
7844b368q950L832l331j4101j552Q702J0453P503K802q042q963J5034R48j6760
7830a4793O11R109O899J0827J829j6584j2663K261P489j0162K76Q991P447J1054
7816A2591M097q440r965m116l235o301n613L170J3292J1975O82n252q060l252
7802h427l786P595q540k080J2901J0325P335K580J5855o728j9231j8249j3429
7789b3879k272j754M829J5065M143J560j4809J5R263q10l118p94j6608J1064K6039
7774G934kp244L060M344K475j6961P066q112j1856j138J958K3642K3052m50p548
7759B0220j5237J957k142j2194k198Q28M86K974j066m073j4627P406J0969J682
7745e015j984J491O249K0992l523j6512j173K38n741j150O946p273k2380k511
$$ y = [-2368, -11318, -7486, -10817, -24918, -26470, -17768, -7315, 188, 2990, -5052, -14015, 1019, 1967, -14793, -14182, -5073, 1826, 12653, 14482, -2102, -14765, -12504, -5015, -15177, -14901, -5910, 1537, 12591, 16688, 8248, -1717, -5833, -9068, -15369, -20982, -17812, -4520, 7455, 8137, 2885, -5175, -8427, -12213, -4618, -13158, -15238, -2337, 7988, 15323, 17903, 33758, 27030, 7799, -10450, -23879, -26151, -27905, -23076, -8011, -3868, -2308, -17117, -17102, -7839, -8649, -11767, -12561, -29169, -18105, 7934, 7932, 688, 3748, 8092, 10567, -6394, 672, -7440, -19296, -20434, -18476, 5166, 28218, 27768, 20220, 4983, 6940, 4798, -7396, -9594, -8766, -8280, -5306, -6372, -10445, -25072, -17666, -6697, -5015, -6999, -5508, 741, 21733, 18210, 1698, 525, 763, -4978, -6128, 818, -6455, -28835, -31346]
7731c1346Q329P535J5166J798n464M832J753m761J0016K12k734J6398M787j1105
7717A5416k525K413r715m932M324J492m519P368j388p698n456m850J8141Q006
7703A6077k715L910j2504o679o863K688r49l728K1258J6429l203l489r533k688
7689H011p712j0629k087k199K88K938o262k796J6600J0257l564k404O969R35l777
7674D568n065k224j047j0519j481K575r35j35j5235K428J1588J2167J4767J3746
7660B5198j317j5483k2221q769n55O184K2604L199j2291N971O756j4062j0506
7647a5292L024O06M120L713N312J792j0076q345l700O079n532q793j147J4556
7633a3683P361p43p157Q797P200r650P93J4677J0507M186r153j2494N031K558
$$ y = [-31346, -23017, -15482, -316, 1482, -3982, 850, 2603, -2158, 7858, 8070, 5336, 21734, 26521, 15416, 12891, 15304, 5589, 657, 4981, 6473, 1954, 9322, 7934, 236, -5220, -10070, 8071, 16077, 13362, 17272, 4768, -1911, -8774, -6086, -7035, -10763, 10495, 26924, 23721, 20232, 10699, 8011, 299, -10330, -12417, -14616, -14328, -11390, -17652, -20448, -3848, 6409, 2845, 441, 7410, 8345, 4568, -497, -2721, -3768, -14287, -15768, -13193, -14128, -14263, -29498, -27070, -15482, -3315, 11452, 25198, 23881, 8398, -13823, -22592, -23147, -16963, 5641, 8840, -3451, 2520, 9276, -4786, -15292, -12268, -11662, -7542, -3829, 1483, 3275, -6801, -15146, -18846, -12767, -18299, -27092, -28239, -13683, -6322, -7065, -14222, -5425, 1775, -7875, -7082, 7595, 18102, 22288, 13135, 641, 5672, 8230]
7619H230q48j0529K508k805m136P63J0209k542k883j0998Q568K2961j5099j0845
7605g446R133j1663j0388N707R242o793j846j1808R810M229N06J441p236J5775
7591a337P470J853j0821j5878J904k048O098J1256k662L577r92j684k773P992
7577A955J3121Q711q760j5211N519N32o235k472l735m867j4382r132M658J1719
7563a8579J7030O031j1664Q041P16r463K484N677j4700N065Q692N12Q636p870
7549F08q659M848n027j073R460N581J4852l344q184M187O884j3576q177J90K341
7534I11J351J946J565p705O327N524p351J6466J933j7152j5706p173Q236J5140
7520D312K407j3024j8986J6165p112M375O976j7219K833K076l606K129J0701O790
$$ y = [8230, 7382, -3147, -639, -3444, -7580, -6817, 3392, 850, -2033, -13031, -4463, 18498, 3399, -7446, 1687, -9976, -20364, -14657, -5415, -12208, -14054, -25862, -16052, -11823, -11317, -9876, -17112, -1337, 6133, 7986, -2835, -18713, -16809, -18857, -12759, -1503, -4165, -588, -1580, -3264, -6037, 1955, 15076, 23787, 15027, -184, 5335, 5867, -368, -2840, -6575, -11442, -25824, -34956, -30298, -18579, -1549, 4482, -7182, 859, 1575, -7888, -5404, 273, -14427, -9362, -670, -158, 8478, 608, -8051, -3203, -8230, -9303, 157, 5738, 20590, 17246, 9062, 13249, 20133, 6557, -1620, -1430, 911, 2262, 4208, 5773, -1932, 4395, 9919, 2568, 19034, 20967, 3815, -11891, -19064, -10828, 4312, 6719, -6305, -25291, -9126, -16238, -11863, -4887, -22106, -19273, -17197, -20803, -18674, -7973, -1183]
7506a183L047P538k324j1036o811m272P544P998N631M312j1671k4051r873J0841
7492b4310J6538R566J0868N63k801j6048n102O740o564P962R878M986J037j852
7478A1461j4124o150m057J880J2745p75r422O638J5296K711J7995N855j1537j1344
7464A7172j4645n614m177k448j0699R404Q478P892L361J5695R4j1825j3673j245
7450b230j660R054q75j0828m866j4060K964N829k065O581k421m587J4381J5458
7436A0675L153p745j5378N64k08k077j839Q551L958J3244L304n110j6129k431
7422g468j1897M172j66L837J2415O939k1798j6063m394J0285J0331J5510J2356
7409A4059r359j8219p065J2288M751k495J5204O178j7282R9Q072j3656J2637P478
$$ y = [-1183, 1864, 9402, 7078, -3958, -10769, -15041, -7497, 501, 6132, 10444, -1227, -25278, -35151, -24310, -7772, 1794, 12662, 13225, 10424, -5624, -10726, -3986, -10550, -2588, 7290, 12276, 13313, 11461, -2663, -8813, -12870, -10990, 1755, 980, -8442, -1804, 13492, 16203, 34198, 40053, 28516, 17172, 2527, -3087, -7264, -9712, -20411, -11007, -2529, 5363, 8724, 24419, 24513, 12688, -985, -2230, -3890, 5164, 4289, -6539, -11405, -25465, -22501, -16672, -18737, -12156, -14577, -19164, -4783, 10675, 13828, 6083, -9295, -8731, -8939, -11016, -12855, -4304, -346, 12898, 16202, 11092, -5037, -7468, -19365, -15193, -15359, -11522, 893, 7832, -13966, -30029, -34423, -24138, -13807, 1703, 14059, 4700, -13519, -20584, -8296, -3545, -6040, 9164, 15342, -1940, -1841, 6231, -7425, 5212, 12690]
7395A2690j116r338q583K169p645M08L529K000R19n370J7547J910j961r447j989
7380d277j633J246R727n916m900q046k558j791K256J237k973N427Q746j667l557
7365h679R717O377o093r76L408j344j816K997Q320O651n526j4252q466L123l912
7350a0471p372J982M261K181k677L441M861j3344o803L057p438Q937P403J0450
7336a532r383Q185p01j4077q599O180L196p135J8913K0483m868o415O848J0909
7322B2004j2126O465j1006j3406j997l596J4860P502O54K543m182j2221j98J7746
7308A3042J452j5700l239o178p168J0219j6157q375J7054J5192L910n75M309j308
7294F478J556m138O02m398l119k347M810m289l061j7963p947N798Q159J3662N844
$$ y = [12690, 11574, 2236, -6347, -4178, -11823, -11415, -7886, -5886, -4967, -10337, 7210, 9120, 7159, -2288, -4277, -5910, -4664, 5063, -853, -5753, -13799, -16357, -18148, -15892, -14655, -17628, -12201, -3455, -5122, -8679, 1038, 7415, 1322, 346, 3754, 2410, 594, 3591, 11911, 18562, 13036, -1216, -9682, -6559, -10471, -17843, -15861, -11600, -9419, -12096, -8655, -3794, -17138, -23941, -20884, -28322, -19385, -11982, -1532, -10915, -2730, -3431, -17508, -26107, -19927, -16731, -23866, -4953, 15530, 10662, 4247, 11095, 22004, 9878, 16343, 5337, -8069, -10066, -13662, 1198, 8700, 9354, 11897, 7715, -4506, -4704, 13042, 14494, -1206, -4445, -10623, -17791, -7572, -23729, -32104, -15050, 142, 4052, 3477, 7786, 6478, 8034, 3896, 4498, 100, -3019, -5366, -556, -4845, -7906, -25869, -33816, -28018, -19859, -6197, -353]
7279c53p927r095L293K0716R241j4240o285m659L324q106n890N138J6888J1210
7265A3255P184m979j0166K044k0441j1348J238O019J5544J1543k6729p265K0152
7252c949J4286Q93R837J1594j6538o562j1597j9980Q2J3595P954m339J334L059
7238c31J0099n88O540j2742j5788P385J2805P519R435m373j3219m941j2285j735
7224a2219m62k281J537M789J6765M586j3501m667j205J6897n308j0260R23q151
7210a2557M575n105j2689O076J6158n776q010l57J179j029m659O238p29m400k144
7195b3229o038N519N901j4891J0740o292O789J4050m62K928j850m931m517r189
7181b5472n650q439J86P861K628Q633J84K461Q814l502L537R591J1393m061j569
$$ y = [-353, -8280, -17375, -14082, 6634, 15875, 1635, -4650, -9309, -5985, -14091, -19981, -14843, 2045, 13255, 20439, 15460, 5294, 7338, -13103, -24451, -23213, -17194, -1650, 9893, -16836, -24101, -3949, 10337, 11230, 21067, 32661, 16123, 9561, -2036, -22016, -21934, -8339, -385, -4724, -3390, -331, 9768, 9180, 15720, 2978, -12810, -5425, 7380, 14899, 24334, 19961, 6742, 1801, -10484, -12219, -12681, -14962, -13425, -8636, 8129, 12715, -786, -5453, -6658, 10239, 4931, -5329, -4406, -12557, -7982, -13087, -25776, -19700, -3542, -9318, -17328, -17685, -16506, -17535, -22194, -15956, -16685, -21085, -23229, -29267, -23748, -17847, -32738, -21998, -28290, -21501, -7451, -7913, -4985, -6835, -11766, -16283, -25472, -31122, -39561, -39375, -31514, -28886, -20253, -20069, -17608, -8794, -12296, -8759, 832, 12225, 8164, 6595]
7166F595J16j0538j0979r567R776r46K868J1864j095L446L509J317n263p377L166
7151c108q022k478Q300J297p001J827k1618j6154J3799N71k124J0965L438l679
7137b3987Q923J6468j1418M3Q754L78o327L918J5280L591m100q906k942o598K250
7122d673J3754J2783n307N194L487q697o226P01R952Q863O274M352j1511q742
7108B0204k167j0367m503j243J9914O343k1386j7589J5920j339R82M043K47J34
7094I193L236m735j2688L963K0785L736j2401j1178j3146J2324J0239r346k1394
7081b1412m109M195J213k961Q773O103J0520l886J9904Q280m079l130l572o326
7067I513n842j6422N861J0574J900J947q07l804N585j084j8477j0348P95n563
$$ y = [6595, 6711, -3827, -14806, -24373, -14597, -15543, -12675, -811, -1906, 1540, 5049, 6366, 1103, -6274, -3108, -11130, -13608, -5308, -4011, -11012, -9185, -30803, -46957, -33158, -32587, -34711, -23746, -20308, -23987, -15064, 1404, -10014, -9971, -1217, -839, -7166, -3248, 12032, 15623, 11523, 2617, -325, -6923, -4673, 9081, 21864, 16557, 21751, 25238, 16541, 10315, 11016, 20968, 29831, 36105, 40457, 28946, 20204, 18037, 7670, 3167, 1924, 21838, 28181, 6795, -10794, 5126, 3787, 4769, 8812, 9059, 9193, 12429, 7694, -4994, -1031, 19754, 23490, 11089, -89, -13235, -911, 9328, -18, -21412, -25521, -21326, -20113, -23074, -14301, -8198, 2322, -1564, 18340, 26620, 22541, 19411, 15839, 9513, 3671, -12751, -6890, 3684, 5584, 7531, 6724, 2920, 8505, 7421, -11056, -21404, -20609, -26172]
7053b6172o739O455J1379N250r429j0195m006L02k02J5927J5154j0248j240J631
7039a2133L886o761j1180l080l960K705J4599q45k846J1042J0940R264n830j2323
7025f522n512p385O08J4087N411J1023l740J935j936N618j2737j1506p671P338
7011a0989J1763Q843q140m622o421J1179P930M379j640o612K034L795o907n728
6997a136k145L272p536o926J3329r08K687M733j131l024k274m30J0934K185j3362
6982a732p621L28j460j405P784J1396j081l479m27Q7O573K556L000j6565j3110
6967a5156l000m103k295m32Q487J3221N294j0584l708Q589m189j7787L729J2854
6953i080J4504J609J790M087p931j4192o306J2807O469j1644m345k977J0275K858
$$ y = [-26172, -32911, -26456, -15077, -9827, -19256, -29451, -33457, -33155, -33357, -17430, -2276, -12524, -13764, -12133, -8247, -15008, -26188, -29268, -33228, -30523, -15924, -16769, -19615, -8573, 2367, 11631, 5801, -6522, -12034, -19419, -18811, -4724, 687, 11710, 7970, 9905, 7969, 13587, 850, -10656, -18327, -10989, 774, 9617, 1477, -3145, -9566, 1613, 9543, 13922, 12282, 5670, 7704, 11499, 4592, -1136, -3281, -9, -7545, -14471, -1142, -2050, 637, 5370, 4239, 1215, -1059, -1489, 9445, 11630, -1732, -9353, -9025, -10485, -11890, -4106, 7290, 6209, 2730, 2303, 2390, 8963, 11519, 14519, -2046, -15156, -18156, -22259, -24554, -24986, -16499, -3278, 2016, -8568, -12276, -3687, -7876, -25663, -21934, -9080, 5424, 7033, 8823, 12910, 4979, -9213, -15519, -2712, 3757, -7887, -12232, -15209, -4934, -2076]
6939b076L335N023l278j4924l371k030q084K972P214P666r730j1718M904K0707
6925c390K1099r092o169j0051J0901R767R36m260k877N19j7286O83K1155Q676
6911B0611Q493j0210j9576N375k962n02l106N507q190J658K934q289J958L950
6897b349Q393M548L083l016N885o855P002J525j6474k703R00J0793O642j7839
6883d65m031j1155Q879l970r915K557J7246K844K202J0040L017j805n801k935
6869F708J0552J3193P452k2154k2156j0280m68k479P301L640q196m672J6456M599
6855e04j4502q608M637N046J3272N206K901m591O016r881k253K214J314P118r307
6840a922k909q90Q582K2876r722k3922o734Q586j5843p407J932Q19O440L758l301
$$ y = [-2076, 1259, 6282, 3004, -11920, -15291, -17321, -25405, -22433, -15219, -7553, -17283, -29001, -24097, -3390, 17709, 8617, 2448, -7603, 3298, 13065, 14001, 9741, 6864, 7383, -9903, -9220, 11935, 20611, 29104, 18894, -682, 4693, 1731, 1229, -1877, 3630, -4560, -2902, 32, -8257, -6299, -2349, 6044, 10592, 13675, 10659, 16544, 9689, 16691, 18216, 1742, -961, -61, 10732, 17374, -465, -4496, -15651, -6772, -10742, -20657, -18100, -854, 1990, 4192, 14232, 17249, 15444, 9643, 6708, 17260, 30453, 37905, 15751, -6405, -16685, -17153, -19632, -12331, -8691, -16887, -21559, -5103, -504, -15006, -23614, -18977, -13931, -659, 4547, 7448, 2857, 8873, -1008, -3261, -1047, 267, 7385, -1922, -4831, -5721, 2861, 25737, 16015, -7907, -14641, -6055, -21898, -29305, -27373, -26554, -20114, -16356, -19657]
6825a9657O501J6868J4682L059M056J1475J0323m881j9906l711j395k783m666
6812I965q392N7j634p55N040Q31O932l993m975J5246M733n277J898k095k318p758
6796G505j852Q51m028J2263L084l0646j0844J1869J589Q228l309m275j5776k174
6782b7515J1372l094J5214K31K051J0537J212l925k929J1894R572L105j3303o202
6768H220R946J3630j567M16r127P533j5827n507N619J3755K042j3171J7918O959
6754D0839R264K547J4480J1933K6903K5764K6720R101k0302m5814j1973N576M108
6741I9146k6003k2153L46K773r39L104j1778j1126k561N994J3148K075J7950J8764
6727H8740M904K9531L7248L7038J8729K66l6026k3076j4490k6452j8844m331n818
$$ y = [-19657, -13156, 3712, 18394, 21453, 25509, 36984, 47307, 42426, 22520, 18809, 17414, 14631, 9965, 1573, 1630, -4, -759, 4281, 5112, 12044, 8051, 3076, 18322, 23055, 17778, 19676, 17581, 15263, 7505, 5653, 6504, 2476, 14739, 17823, -12823, -23667, -11798, -10209, -1981, -5290, -9565, -25341, -27515, -16143, -19237, -4023, -3792, -1741, 8796, 10008, 6083, 3154, 15048, 24620, 27725, 14422, 8220, 18166, 31796, 30229, 30645, 21518, 29051, 13224, 7717, 13336, 27091, 29133, 15962, 33880, 40839, 50103, 52650, 67130, 79063, 105966, 131730, 158450, 167551, 147249, 101435, 89462, 95038, 99146, 73143, 50990, 51336, 54109, 53170, 56274, 44496, 33370, 30809, 36803, 49951, 52026, 69976, 88740, 93644, 123175, 160423, 197461, 216190, 216456, 180430, 157354, 142864, 116412, 97568, 93237, 87419]
6714H7419k875J979K416o268j5666j8959j8767M369o972k0264q805J62J8471J1974
6700B8214j5635m965R583O724l428o822J0438n268j7854J1456J1167m625N220
6687B4205j2877j4586P599O609j0277l246J7564J5982j3494j4534l995P025J6931
6674B2906l896K624m126O4p059j0674n39l237n835l751m099J1293P203o711Q333
6659B496n811j3072p212O945Q373m8J921Q986j042j8308k0796j729P076K650P622
6644b1949N621j7699j1940O699K0869J2203p951o733M313j4706l566Q710J0388
6631a5741K55K256l191j370k669J6410K959P883L604j1194j3314J2733J4922R57
6617A4500j2807Q017J5489q194j6551j2832o050O571J8640p943q007l595O589
$$ y = [87419, 84544, 86523, 88939, 82671, 67005, 48046, 29279, 33648, 26676, 6412, -2393, -2231, 16240, 28214, 12579, 7614, 17197, 23921, 20493, 13671, 24109, 18841, 987, 12443, 23610, 18985, 24205, 11328, -3258, 4341, 10950, 673, -2573, 14991, 30973, 17479, 2945, -1050, 5975, 22906, 19010, 21634, 17508, 17572, 10513, -161, -700, -3937, -9772, -13523, -17622, -6329, 874, -5837, 2496, -3315, -16387, -23599, -16654, -8281, -8329, -6408, 2578, 1536, -16772, -37568, -39297, -32221, -29571, -21949, -16328, -34027, -45967, -39268, -18399, -6196, -14147, -20880, -16567, -31273, -34839, -26129, -15741, -15486, -13230, -16421, -17791, -20460, -4050, -1091, 6792, 10396, -798, -14112, -1379, 13543, 14500, 1693, 9710, 25199, 17005, 454, -12378, -18428, -11857, 6783, -1160, -9167, -12762, -6173]
6604f173J6094M50j0663j5955r706P136J2655K737j4396o480p297J6358J3825
6591a415P934P662j7975r996Q220J2130j379J0622o427j2442j5082j2080p197
6578c7425r41M119J1414J6163N813O149n081j3437n422J9044k257k9578J0883
6565b0556J7661R230J2026l63o129l978j130J079n637m034L902O093l614j0282
6551e732p647k513J1322R293j3140l459O487P83J3851P823M629j5174j4471K986
6537d962J6990l480k110R744l256J584m363j2582j4212N922P70m982J3126M956
6523C145o283j1205J615n762l930K932J2946K017J013m13O256L877q29j7990l541
6508a6152j8570J630K2972P760j3j688l611j642j0241o540J9972j614J440N230
$$ y = [-6173, 9921, 10371, -292, -16247, -25953, -18817, -6162, -3425, -17821, -24301, -31598, -15240, -1415, 6519, 14181, -3794, -13790, -5570, 6560, 5181, 15803, 9376, -3066, -18148, -30228, -37425, -38366, -34247, -22833, -6670, -857, 5292, 211, -13226, -18648, 396, -1861, -31439, -20556, -2895, 6335, 18361, 17998, 11869, 7891, 6761, 7840, 2203, -1831, 2071, 8164, 4550, -5732, -13379, -15892, -4570, 4723, -8417, -11876, -5389, -4606, 9245, 17068, 21697, 6523, -7948, -4962, 12028, 8548, 6438, 16182, 12926, 14510, 10147, -2435, -16647, -10725, -9955, -14937, -1811, 3145, -3138, -14343, -12728, -18490, -22420, -19488, -6542, -4525, -3512, -3925, 2331, 6208, 5379, -12611, -16152, -34722, -33092, -10120, -2360, -2373, -4061, -7672, -9314, -19555, -26095, -6123, -7737, -6297, -1067]
6494a067R015l362j915P661m407l062O58N424N350l661l996j4700n085m634J1425
6479f356Q292m90K665j1637M640M392k567O098J1336r595n371j0856l243o045
6465a8737r59J0310J7545J8639l082q376r479j605O601R42M35Q463O15j6591r191
6450d470K725L688K212q262O424Q482j608m430L695O735j2356k674j5994k883
6436a8716L95J612O305J1749m823J311R087J6571J731p088n569j4927m980n323
6422a2665K713P535Q643J582l98q705j0681p371l244j3441N735l380o383M8K0087
6407a9925L0374k535j2190j4209N797J2105N254j5765p551l534K154J6743J7801
6394A4519Q890j5705k1119O110R834K1376N649j7210r348M48l10j7393m563n654
$$ y = [-1067, 7948, 4586, 2671, 10332, 5925, 2863, 3521, 8945, 14295, 10634, 6638, -8062, -13147, -17781, -6356, 1936, 1446, 4111, -7526, -2886, 1506, -1061, 5037, 16373, 6778, 1407, -9449, -12692, -18737, -19696, -9386, 8159, 26798, 23716, 15340, 5861, 4256, 10857, 11799, 12234, 20697, 21312, 4721, -4470, -1745, 1943, 4155, -4107, 2317, 10799, 9191, 4761, 8456, 15191, 2835, 161, -15833, -18716, -18321, -16709, -10404, 1345, -3478, -2167, 6920, 23491, 25222, 18134, 12565, -2362, -7342, -12665, -9952, -2417, 6226, 7808, 7410, -1295, -11976, -19347, -22591, -36032, -30297, -33677, -40060, -40012, -19925, 10449, 7914, -4276, -18485, -12688, -583, 4671, -11094, -18645, -22179, -20025, -3282, 14519, 23409, 7704, -13415, -7305, 2529, 23905, 29554, 12344, 2996, 3444, 3134, -14259, -18822, -24476]
6380b4476Q154Q629q238K684K639J1491J3777L384j129K757r620M015K951p575
6366I443j7630l483o537j292O471n82j520J8323J3852L152k3722j3890J199l186
6352a9402o084j945Q812Q176J4577J0957j0340n97p39K212K907N746J3721k706
6338B5295j9398n560J789o397M00P029O65o701P518m758M90L48p792L652J327
6323b093l70o654j7644p140J6292r621n443J8085J1920n630p899J0142J3200k379
6309D766j9473p650J0391J2174K97j7276j1272M191l761p49R996J5855J591N317
6295D397M903m036N173J097n699Q631j049j7664J501m355l534N189O919j8362
$$ y = [-24476, -16322, -7693, -15931, -13247, -10608, 883, 14660, 18044, 16915, 19672, 10052, 14067, 17018, 9443, -8187, -11670, -18207, -19499, -13028, -13610, -15130, 3193, 17045, 20197, -3525, -17415, -16216, -19402, -25486, -27431, -18619, -10443, 4134, 15091, 4751, 4154, 3415, 5627, 8534, 14280, 28001, 25295, 5897, 337, 2126, -4271, -3871, 3158, 3823, -2878, 4640, -118, 372, 720, -7072, -3420, -2093, -2463, -9117, -26761, -33901, -17609, -27230, -32673, -14588, -2668, -8298, -16197, -6055, 7145, 4766, -14707, -22357, -11966, 208, 505, -16771, -28043, -23852, -27613, -28362, -18366, -2511, -920, 4397, 9300, 5264, 10437, 11534, 5835, 14466, 13417, -4247, -2746, -7101, -10635, -5446, 1473, -16889]
$$ [...]
##END NTUPLES=NMR SPECTRUM
##END=
