##TITLE=Analysis number 311227
Compound Code gk 00437
Project Code adrs
Chemist Name endeavour
##JCAMPDX= 6.0         $$ Bruker NMR JCAMP-DX V2.0
##DATA TYPE= NMR SPECTRUM
##DATA CLASS= NTUPLES
##ORIGIN= Bruker BioSpin GmbH
##OWNER= NMR
$$ XWIN-NMR		Version 3.5
$$ Mon Jul  4 13:10:25 2005 GMT Daylight Time (UT+1h)  MAYBRIDGE\NMR@NMR_250MHZ
##.OBSERVE FREQUENCY= 250.131544655141
##.OBSERVE NUCLEUS= ^1H
##.ACQUISITION MODE= SIMULTANEOUS (DQD)
##.ACQUISITION SCHEME= undefined
##.AVERAGES= 16
##.DIGITISER RES= 18
##SPECTROMETER/DATA SYSTEM= dpx250
##.PULSE SEQUENCE= zg30
##.SOLVENT NAME= CDCl3
##.SHIFT REFERENCE= (INTERNAL, CDCl3, 0, 16.522)
##AUDIT TRAIL= $$ (NUMBER, WHEN, WHO, WHERE, WHAT)
$$ ##TITLE= Audit trail, XWIN-NMR		Version 3.5
$$ ##JCAMPDX= 5.01
$$ ##ORIGIN= Bruker BioSpin GmbH
$$ ##OWNER= NMR
$$ C:\u/data/dgb/nmr/ADRS/5280/pdata/1/auditp.txt
$$ ##AUDIT TRAIL=  $$ (NUMBER, WHEN, WHO, WHERE, WHAT)
(   1,<2005-07-04 13:10:05.11 +100>,<MAYBRIDGE\NMR>,<NMR_250MHZ>,
      <created by zg, POWCHK disabled, PULCHK disabled
       configuration hash MD5:
       62 19 C7 07 E1 42 D1 B7 37 6C 3D D0 77 39 F9 E6
       data hash MD5: 64K
       4C 66 17 3D 0E 47 74 57 7F 83 7E 80 90 46 DD 30>)
(   2,<2005-07-04 13:10:16.97 +100>,<MAYBRIDGE\NMR>,<NMR_250MHZ>,
      <Start of raw data processing
       ef LB = 0.3 FT_mod = 6 PKNL = 1 SI = 32K 
       data hash MD5: 32K
       E2 92 7A 20 48 6B DF 78 22 0A 5B BB F7 83 39 AC>)
(   3,<2005-07-04 13:10:19.07 +100>,<MAYBRIDGE\NMR>,<NMR_250MHZ>,
      <apk 
       data hash MD5: 32K
       26 D6 9C 0F 74 3B 69 86 32 1D A2 18 7D 53 EB AA>)
(   4,<2005-07-04 13:10:19.88 +100>,<MAYBRIDGE\NMR>,<NMR_250MHZ>,
      <abs ABSG = 5 
       data hash MD5: 32K
       80 01 89 D3 2D D1 51 0A 08 81 64 50 D3 39 D9 7D>)
$$ ##END=
$$ 
$$ hash MD5
$$ CD 38 76 DF D6 C2 AD 6C E8 1A 8C CC C5 A6 FB 9D
##$RELAX= 
##$RELAX= 
##$RELAX= 
##$RELAX= 
##$RELAX= 
##$RELAX= 
##$RELAX= 
$$ Bruker specific parameters
$$ --------------------------
##$DU= <C:\u>
##$EXPNO= 5280
##$NAME= <ADRS>
##$PROCNO= 1
##$TYPE= <nmr>
##$USER= <dgb>
##$AMP= (0..31)
100 100 100 100 100 100 100 100 100 100 100 100 100 100 100 100 100 100 
100 100 100 100 100 100 100 100 100 100 100 100 100 100 
##$AQSEQ= 0
##$AQ_mod= 3
##$AUNM= <au_zg>
##$AUTOPOS= <36 >
##$BF1= 250.13
##$BF2= 250.13
##$BF3= 250.13
##$BF4= 250.13
##$BF5= 500.13
##$BF6= 500.13
##$BF7= 500.13
##$BF8= 500.13
##$BYTORDA= 1
##$CFDGTYP= 0
##$CFRGTYP= 5
##$CHEMSTR= <none>
##$CNST= (0..31)
1 1 145 1 1 1 1 1 1 1 1 1 1 1 1 1 1 1 1 1 1 1 1 1 1 1 1 1 1 1 1 1 
##$CPDPRG= <>
##$CPDPRG1= <>
##$CPDPRG2= <>
##$CPDPRG3= <>
##$CPDPRG4= <mlev>
##$CPDPRG5= <mlev>
##$CPDPRG6= <mlev>
##$CPDPRG7= <mlev>
##$CPDPRG8= <mlev>
##$CPDPRGB= <>
##$CPDPRGT= <>
##$D= (0..31)
0 1 0 0 0 0 0 0 0 0.06 0 0 0 0 0 0 0.0002 0 0 0 0 0 0 0 0 0 0 0 0 0 0 
0 
##$DATE= 1120479004
##$DBL= (0..7)
120 120 120 120 120 120 120 120 
##$DBP= (0..7)
150 150 150 150 150 150 150 150 
##$DBP07= 0
##$DBPNAM0= <>
##$DBPNAM1= <>
##$DBPNAM2= <>
$$ [...]
##$SUBNAM7= <"">
##$SUBNAM8= <"">
##$SUBNAM9= <"">
##$SW= 20.6930455092707
##$SWIBOX= (0..15)
0 0 3 0 0 0 0 0 0 0 0 0 0 0 0 0 
##$SW_h= 5175.983436853
##$TD= 65536
##$TD0= 1
##$TE= 295.16
##$TE2= 300
##$TE3= 300
##$TEG= 300
##$TL= (0..7)
0 120 120 120 120 120 120 120 
##$TP= (0..7)
150 150 150 150 150 150 150 150 
##$TP07= 0
##$TPNAME0= <>
##$TPNAME1= <>
##$TPNAME2= <>
##$TPNAME3= <>
##$TPNAME4= <>
##$TPNAME5= <>
##$TPNAME6= <>
##$TPNAME7= <>
##$TPOAL= (0..7)
0.5 0.5 0.5 0.5 0.5 0.5 0.5 0.5 
##$TPOFFS= (0..7)
0 0 0 0 0 0 0 0 
##$TUNHIN= 0
##$TUNHOUT= 0
##$TUNXOUT= 0
##$USERA1= <user>
##$USERA2= <user>
##$USERA3= <user>
##$USERA4= <user>
##$USERA5= <user>
##$V9= 5
##$VALIST= <valist>
##$VCLIST= <CCCCCCCCCCCCCCC>
##$VD= 0
##$VDLIST= <DDDDDDDDDDDDDDD>
##$VPLIST= <PPPPPPPPPPPPPPP>
##$VTLIST= <TTTTTTTTTTTTTTT>
##$WBST= 1024
##$WBSW= 4
##$XGAIN= (0..3)
0 0 0 0 
##$XL= 0
##$YL= 0
##$YMAX_a= 644830
##$YMIN_a= -597756
##$ZGOPTNS= <>
##$ZL1= 120
##$ZL2= 120
##$ZL3= 120
##$ZL4= 120
##$ABSF1= 16.522
##$ABSF2= -4.171173
##$ABSG= 5
##$ABSL= 3
##$ALPHA= 0
##$AQORDER= 0
##$ASSFAC= 0
##$ASSFACI= 0
##$ASSFACX= 0
##$ASSWID= 0
##$AUNMP= <proc_1d>
##$AZFE= 0.1
##$AZFW= 0.1
##$BCFW= 0
##$BC_mod= 0
##$BYTORDP= 0
##$COROFFS= 0
##$CY= 12.5
##$DATMOD= 1
##$DC= 0
##$DFILT= <>
##$DTYPP= 0
##$F1P= 14.0000005364418
##$F2P= -0.99999901652339
##$FCOR= 0.5
##$FTSIZE= 32768
##$FT_mod= 6
##$GAMMA= 0
##$GB= 0
##$INTBC= 1
##$INTSCL= 1
##$ISEN= 128
##$LB= 0.3
##$LEV0= 0
##$LPBIN= 0
##$MAXI= 10000
##$MC2= 0
##$MEAN= 0
##$ME_mod= 0
##$MI= 0
##$NCOEF= 0
##$NC_proc= -2
##$NLEV= 6
##$NOISF1= 0
##$NOISF2= 0
##$NSP= 0
##$NTH_PI= 0
##$NZP= 0
##$OFFSET= 16.522
##$PC= 1
##$PHC0= 20.56394
##$PHC1= 0.7366092
##$PH_mod= 1
##$PKNL= yes
##$PPARMOD= 0
##$PSCAL= 4
##$PSIGN= 0
##$REVERSE= no
##$SF= 250.13
##$SI= 32768
##$SIGF1= 0
##$SIGF2= 0
##$SINO= 400
##$SIOLD= 32768
##$SREGLST= <1H.CDCl3>
##$SSB= 0
##$STSI= 32768
##$STSR= 0
##$SW_p= 5175.98343685301
##$SYMM= 0
##$S_DEV= 0
##$TDeff= 65536
##$TDoff= 0
##$TI= <Analysis number 999999
Compound Code 99
Book Reference 9
Project Code 9>
##$TILT= no
##$TM1= 0
##$TM2= 0
##$TOPLEV= 0
##$USERP1= <user>
##$USERP2= <user>
##$USERP3= <user>
##$USERP4= <user>
##$USERP5= <user>
##$WDW= 1
##$XDIM= 32768
##$YMAX_p= 332994073
##$YMIN_p= -7625
$$ End of Bruker specific parameters
$$ ---------------------------------
##NTUPLES= NMR SPECTRUM
##VAR_NAME=  FREQUENCY,     SPECTRUM/REAL,   SPECTRUM/IMAG
##SYMBOL=    X,             R,               I
##VAR_TYPE=  INDEPENDENT,   DEPENDENT,       DEPENDENT
##VAR_FORM=  AFFN,          ASDF,            ASDF
##VAR_DIM=   32768,         32768,           32768
##UNITS=     HZ,            ARBITRARY UNITS, ARBITRARY UNITS
##FACTOR=    0.157963299565203, 1,           1
##FIRST=     4132.6476996994, 0,             0
##LAST=      -1043.33573715361, 0,           0
##MIN=       -1043.33573715361, -7625,       0
##MAX=       4132.6476996994, 332994073,     0
$$ Real data points
##PAGE= N=1
##DATA TABLE= (X++(R..R)), XYDATA
$$ [...]
18955A245j13Q24J05o0m26OJ67M6J553m60p2n41N10o42k45J10J054K24p19r54
$$ 1245 1132 1956 2061 2001 1575 1581 1748 1794 3347 2887 2815 2274 2784 2142 1897 2007 3061 3285 2566 1612
18935A612J95J22K47L23l86k45J13l21K36P27r07L77R77j110j323k47Q53j01Q89
$$ 1612 1807 1929 2176 2499 2113 1868 1981 1660 1896 2623 1716 2093 3070 1960 637 390 1243 1142 2031
18916B031K05j395j281P32J109J136J014r34j317M43J05r76n51O75o47r88Q89
$$ 2031 2236 841 -440 292 1401 2537 3551 2617 1300 1743 1848 872 321 996 349 -639 250
18899B50R77N55P1l88k2Q63L95k84m74j600l88Q64J621p14p89Q22k42q95M8Q80
$$ 250 1227 1782 1853 1465 1443 2306 2701 2417 1943 343 -45 819 2440 1726 937 1759 1517 622 670 1550
18879A550J301R78K37k69k52j347q78R73l12J090K15j087q74o97Q64M62o12j9
$$ 1550 2851 3829 4066 3797 3545 2198 1320 2293 1981 3071 3286 2199 1325 628 1492 1954 1342 1323
18861A323K98K06J062j05N12k95L20j258j296J485Q04P60Q5j420J74J244k80m24
$$ 1323 1621 1827 2889 2784 3296 3001 3321 2063 767 2252 3056 3816 3901 2481 2655 3899 3619 3195
18843C195R86j86L90M16j171j167m85M20J63O80l7K27r3M17m8j43r50j110j47
$$ 3195 4181 3995 4385 4801 3630 2463 1978 2398 2561 3241 3204 3431 3338 3755 3707 3564 2614 1504 1357
18824A357N30O57j15K54L72J282r32m3Q72K28p05k22p79o18O19L57n01Q91k68
$$ 1357 1887 2544 2429 2683 3055 4337 3405 3362 4234 4462 3757 3535 2756 2138 2757 3114 2613 3504 3236
18805C236n95J068J030O9p0k25m81p64O68P23r80l51J036R53j38p81m51Q09Q88
$$ 3236 2641 3709 4739 4808 4738 4513 4032 3268 3936 4659 3679 3328 4364 5317 5179 4398 3947 4756 5644
18786E644R5n8L0j011m57o47J40J116n1J76L01K69Q23J76j69O0L30K043L6o58
$$ 5644 5739 5681 5711 4700 4243 3596 3736 4852 4801 4977 5278 5547 6370 6546 6377 6437 6767 8810 8846 8188
18766H188k5K92r31j640p62N22R89N46o69k025p46Q63K78P66L97J05j012j757
$$ 8188 8163 8455 7524 5884 5122 5644 6633 7179 6510 4485 3739 4602 4880 5646 6043 6148 5136 3379
18748C379l56n13N45J37J53J045k91j073L42P17n34o32M35l44M87J194K15N19
$$ 3379 3023 2510 3055 3192 3345 4390 4099 3026 3368 4085 3551 2919 3354 3010 3497 4691 4906 5425
18730E425O50n44j931K81J630P58l60k61jj108j110j6j58N41p1l42q83L14j41
$$ 5425 6075 5531 3600 3881 5511 6269 5909 5648 5647 4539 3429 3413 3255 3796 3725 3383 2500 2814 2673
18711B673N83j85o27J916M41l03K19p5N9j973n91m33O33N19L47N38K70r62n47
$$ 2673 3256 3071 2444 4360 4801 4498 4717 4642 4701 2728 2137 1704 2337 2856 3203 3741 4011 3049 2502
18692B502J205R28n43o75j91P05K87M32l2n79j35n50p0J503Q2J79m1k54mj545
$$ 2502 3707 4635 4092 3417 3226 3931 4218 4650 4618 4039 3904 3354 3284 4787 4869 5048 5007 4753 4749 3204
18672C204Q74k87m6J79j116l8P19l7L53P12K29q72k034K84O60L53J04O01j1L37
$$ 3204 4078 3791 3745 3924 2808 2770 3489 3452 3805 4517 4746 3874 1840 2124 2784 3137 3241 3842 3831 4168
18652D168J129m74l10J28K37j07q92j353K69Q14N63N6m81K99J47O44O50l95q01
$$ 4168 5297 4823 4513 4641 4878 4771 3879 2526 2795 3609 4172 4228 3747 4046 4193 4837 5487 5092 4291
18633D291m69K53N23o63m12J534K00J04K94j465o90K214J471k74k07j199K32P20
$$ 4291 3822 4075 4598 3935 3523 5057 5257 5361 5655 4190 3500 5714 7185 6911 6704 5505 5737 6457
18615F457l25k5N58k84J81J87N26K40n9j051K72m16p59R6l87j60L69J262k36n83
$$ 6457 6132 6107 6665 6381 6562 6749 7275 7515 7456 6405 6677 6261 5502 5598 5211 5051 5420 6682 6446 5863
18595E863l40O09P13M57O1o58j12j160p56k76k87O20J030M34j371j97J023L24
$$ 5863 5523 6132 6845 7302 7363 6705 6593 5433 4677 4401 4114 4734 5764 6198 4827 4630 5653 5977
18577E977j55N81K21P49r0M66Q72m58j610N03O22Q38Q22l05j483q8n96L01N84
$$ 5977 5822 6403 6624 7373 7283 7749 8621 8163 6553 7056 7678 8516 9338 9033 7550 7462 6866 7167 7751
18558G751K51q83K44j98q18R1K191R32o71o08l45L18n32J3K30P48K41n58m58o91
$$ 7751 8002 7119 7363 7165 6347 6438 8629 9561 8890 8282 7937 8255 7723 7736 7966 8714 8955 8397 7939 7248
18538G248K22k48l32R89O88L08R5n93p71l30R72Q07m37j591K18J390J20n44j36
$$ 7248 7470 7222 6890 7879 8567 8875 8970 8377 7606 7276 8248 9055 8618 7027 7245 8635 8755 8211 8075
18519H075R72m20p4k48M66k17m14J000J153O4R3L61q26l81Q6L9n90j55Q14O24
$$ 8075 9047 8627 8553 8305 8771 8554 8140 9140 10293 10357 10450 10811 9985 9604 9690 9729 9139 8984 9798 10422
18499A0422P0m8k07l6Q85n7r83P12R34j372j090P05j47Q26J472k60k37j130k89
$$ 10422 10492 10444 10237 10201 11086 11029 10046 10758 11692 10320 9230 9935 9788 10614 12086 11826 11589 10459 10170
18480A0170J75J127N95M78l52r10k63K46q75j002n98J553J077K25P17J76R3j128
$$ 10170 10345 11472 12067 12545 12193 11283 11020 11266 10391 9389 8791 10344 11421 11646 12363 12539 12632 11504
18462A1504M14J383n46n54q2R72J210o66j214O47N31J87q68o8o9l88O82N61l4
$$ 11504 11918 13301 12755 12201 12119 13091 14301 13635 12421 13068 13599 13786 12918 12850 12781 12393 13075 13636 13602
18443A3602k17k29p14k5j00J352Q05J64O14M86n4M13K69J12m92Q3K05L69M68M34
$$ 13602 13385 13156 12442 12417 12317 13669 14474 14638 15252 15738 15684 16097 16366 16478 15986 16069 16274 16643 17111 17545
18423A7545L90q17m40R24R00k2R52Q09m45p84n0M16p0M57n86o48J42K13m54k74
$$ 17545 17935 17118 16678 17602 18502 18480 19432 20241 19796 19012 18962 19378 19308 19765 19179 18531 18673 18886 18432 18158
18403A8158J793J219n48j053K40l64q5J50Q74Q52q9M93l31n32m0J540J305l09
$$ 18158 19951 21170 20622 19569 19809 19445 19360 19510 20384 21236 21147 21640 21309 20777 20737 22277 23582 23273
18385B3273j188o3Q59K490K42j493m85N76P38R95O02k82Q4l58k96O33j40n09J1
$$ 23273 22085 22022 22881 25371 25613 24120 23635 24211 24949 25944 26546 26264 26348 25990 25694 26327 26187 25678 25689
18366B5689N07O10p3J071J066O67j55J533R77j053P6q9k70M65J211L73o77K49
$$ 25689 26196 26806 26733 27804 28870 29537 29382 30915 31892 30839 30915 30826 30556 31021 32232 32605 31928 32177
18348C2177P90q48m05P50J70J203J362L1O73K288P34j087q82J020J716L00L74
$$ 32177 32967 32119 31714 32464 32634 33837 35199 35230 35903 38191 38925 37838 36956 37976 39692 39992 40366
18331D0366J114o47o04M72N49J02L91P09n7N42M20J206j27m08Q41J534O15J3n92
$$ 40366 41480 40833 40229 40701 41250 41352 41743 42452 42395 42937 43357 44563 44436 44028 44869 46403 47018 47031 46439
18312D6439k46J227L0L17l81q93R70J289J208J287P17J90j155J09K68O5P40R25
$$ 46439 46193 47420 47450 47767 47386 46493 47463 48752 49960 51247 51964 52154 50999 51108 51376 51441 52181 53106
18294E3106M56K97K1M49O38o40J24n53K39O30Q63n12j86l53N61J529j21p39J64
$$ 53106 53562 53859 53880 54329 54967 54327 54451 53898 54137 54767 55630 55118 54932 54579 55140 56669 56548 55809 55973
18275E5973l26L7M88j94n94J18J79p2o06l83n0P96N20m56O18J76j180n54M25J09
$$ 55973 55647 55684 56172 55978 55384 55502 55681 55609 55003 54620 54570 55366 55886 55430 56048 56224 55044 54490 54915 55024
18255E5024p51o74m85n93n37n64o95O44M2R17Q53K46K11p9j453n01P22j9k14m45
$$ 55024 54273 53599 53114 52521 51984 51420 50725 51369 51411 52328 53181 53427 53638 53559 52106 51605 52327 52308 52094 51649
18235E1649k39p30j767q58J038O62m78j246L45L80Q92k28j053m13m58j33l24m04
$$ 51649 51410 50680 48913 48055 49093 49755 49277 48031 48376 48756 49648 49420 48367 47954 47496 47363 47039 46635
18217D6635Q05p31l28j10j216l40J409J523J051p58j269j81J48j80L57N27m66
$$ 46635 47440 46709 46381 46271 45055 44715 46124 47647 48698 47940 46671 46490 46638 46458 46815 47342 46876
18200D6876J232j05j10P05m83j290L44L76k43k29Q55j9r8K91m82m73R48m77j55
$$ 46876 48108 48003 47893 48598 48115 46825 47169 47545 47302 47073 47928 47909 47811 48102 47620 47147 48095 47618 47463
18181D7463J111J04r92K6M33l34k35M28L61q6m27M77J383J980m26p59R59k35j222
$$ 47463 48574 48678 47686 47712 48145 47811 47576 48004 48365 48279 47852 48329 49712 51692 51266 50507 51466 51231 50009
18162E0009J168J181J102j301j071O61L13R84J415L01k06K4k33n96m09J018R27
$$ 50009 51177 52358 53460 52159 51088 51749 52062 53046 54461 54762 54556 54580 54347 53751 53342 54360 55287
18145E5287O12K74P3q6J321J427J45K69L48J828J107N89J312K028J205M13R60
$$ 55287 55899 56173 56246 56160 57481 58908 59053 59322 59670 61498 62605 63194 64506 66534 67739 68152 69112
18128F9112K263L416L463L301L885M639N333O814P418P619J0976J3431J5679J8287
$$ 69112 71375 74791 78254 81555 85440 90079 95412 102226 109644 117263 128239 141670 157349 175636
18114A75636J9341K0942K5363L9785O9238J15146J70669J86906Q2976r1249j70157
$$ 175636 194977 215919 241282 281067 350305 465451 636120 823026 906002 814753 644596
18103F44596j46889r7924o3605m2527l0013k3324j9239j3423r914r162p514o089
$$ 644596 497707 399783 336178 293651 263638 240314 221075 207652 197738 188576 181062 174973
18091A74973n752m402l824l144k686l010l357j066q60j110l47o71M80J020M17
$$ 174973 169221 164819 160995 157851 155165 152155 148798 147732 146872 145762 145415 144744 145224 146244 146661
18076A46661J587J175J228j31j266q31k091l272n517m382j970l367l389k700j609
$$ 146661 148248 149423 150651 150520 149254 148423 146332 143060 137543 133161 131191 127824 124435 121735 120126
18061A20126k129k712l010j766j573j300j606k66j584j808j794j669j85N94l28
$$ 120126 117997 115285 112275 110509 108936 107636 106030 105764 104180 102372 100578 98909 98724 99318 98990
18046I8990j218r94j593r8M01j326l73N78K71n5M94p65m98R4P5K50Rq54K56k83
$$ 98990 97772 96778 95185 95087 95488 94162 93789 94367 94638 94583 95077 94312 93814 93908 93983 94233 94242 93388 93644 93361
18026I3361M15J003O26l52K9O98o68L37N97K92J103Q42j24J689Q16K40J83N53
$$ 93361 93776 94779 95405 95053 95082 95780 95112 95449 96046 96338 97441 98283 98159 99848 100664 100904 101087 101640
18008A01640n86q9J329J566K31k23J100J163O07J587P5m3pR15K141Q34l38K154
$$ 101640 101054 100965 102294 103860 104091 103868 104968 106131 106738 108325 108400 108357 108350 109265 111406 112240 111902 114056
17990A14056K421O32K81o6M09m14l13Q32O84K803K304O47M32M90O34J09N11J191
$$ 114056 116477 117109 117390 117324 117733 117319 117006 117838 118522 121325 123629 124276 124708 125198 125832 125941 126452 127643
17972A27643J353K33R78L08J781J756O12Q39N07P17L38k03N90J019JN54O05K378
$$ 127643 128996 129229 130207 130515 132296 134052 134664 135503 136010 136727 137065 136862 137452 138471 138472 139026 139631 142009
17954A42009K946Q72Q74J573J251k98M73J268J374J359J496P39P04J127N91J091
$$ 142009 144955 145827 146701 148274 149525 149227 149700 150968 152342 153701 155197 155936 156640 157767 158358 159449
17938A59449O05R95J354J104L04j23M75P67J664K129J954J105J607O34L6N75O06
$$ 159449 160054 161049 162403 163507 163811 163688 164163 164930 166594 168723 170677 171782 173389 174023 174059 174634 175240
17921A75240Q37N42J032J373J163N41Q00J375MM06J896O00J647J197J331l24L83
$$ 175240 176077 176619 177651 179024 180187 180728 181528 182903 182907 183313 185209 185809 187456 188653 189984 189660 190043
17904A90043J150O77J602L42K44P11J563K44J396J528P29J32l83l0R93J041K91
$$ 190043 191193 191870 193472 193814 194058 194769 196332 196576 197972 199500 200229 200361 199978 199948 200941 201982 202273
17887B02273J887J211R99O49l88q15q3J856R2R91K100L94L46O27K59M3j50m82
$$ 202273 204160 205371 206370 207019 206631 205816 205733 207589 207681 208672 210772 211166 211512 212139 212398 212441 212291 211809
17869B11809j64L4J792R37M98R59p01q29M31J445O45p55r43J44M74L52r75M02
$$ 211809 211645 211679 213471 214408 214906 215865 215164 214335 214766 216211 216856 216101 215158 215302 215776 216128 215153 215555
17851B15555O92o04jJ060L27L62k09q90o43m40j110L87J217m2n42j342j280O1
$$ 215555 216247 215643 215642 216702 217029 217391 217182 216292 215649 215209 214099 214486 215703 215661 215119 213777 212497 212558
17833B12558M02K37o29j3M4m37j580j339q12j147j242n75O99Q7M86M9M66j278
$$ 212558 212960 213197 212568 212555 212599 212162 210582 209243 208431 207284 206042 205467 206166 206253 206739 206788 207254 205976
17815B05976r33j794q16q5j429m95L9P18L10j160j328j579p48j286r80j685j355
$$ 205976 205043 203249 202433 202348 200919 200424 200463 201181 201491 200331 199003 197424 196676 195390 194410 192725 191370
17798A91370L49n32j573n66q21j254P25J89j174o94j889j259k76r67k502j390
$$ 191370 191719 191187 189614 189048 188227 186973 187698 187887 186713 186019 184130 182871 182595 181628 179126 177736
17782A77736q55o57j197p14m60k57o88q67j611j589j511O48l71j707j155n18p01
$$ 177736 176881 176224 175027 174313 173853 173596 172908 172041 170430 168841 167330 167978 167607 165900 164745 164227 163526
17765A63526n52k04l22k45j887j964j161j493J98q54j763k22k344k214o8L30j258
$$ 163526 162974 162770 162448 162203 160316 158352 157191 155698 155896 155042 153279 153057 150713 148499 148431 148761 147503
17748A47503j400p5j98k025j518r33j226K6k53k218j230l68j294j667j196j155
$$ 147503 146103 146028 145830 143805 142287 141354 140128 140154 139901 137683 136453 136085 134791 133124 131928 130773
17732A30773q53n97M8j270j589K65n64j076M56k48m91j274j208j215q77p1J85
$$ 130773 129920 129323 129371 128101 126512 126777 126213 125137 125593 125345 124854 123580 122372 121157 120280 120209 120394
17715A20394q0j50r37j184j153q13r75r24q44j78o53j642j769j938l69n04N50
$$ 120394 120314 120164 119227 118043 116890 116077 115102 114178 113334 113156 112503 110861 109092 107154 106785 106281 106831
17698A06831k30n36r37l95m30j65k203j549j081l97r35N37m44j051j139m46k29
$$ 106831 106601 106065 105128 104733 104303 104138 101935 100386 99305 98908 97973 98510 98066 97015 95876 95430 95201
17681I5201j005m11n11J30L32j322k196n67j44p93p61m76L35r93p20m84j053o64
$$ 95201 94196 93785 93274 93404 93736 92414 90218 89651 89507 88714 87953 87477 87812 86819 86099 85615 84562 83898
17663H3898o37K32O74r33j285L6j13o46o16n14j349j341L82K37k11M23o61m77
$$ 83898 83261 83493 84167 83234 81949 81985 81872 81226 80610 80096 78747 77406 77788 78025 77814 78237 77576 77099
17645G7099k54j198j461m09p63o28o94k7m16n38K51j45r6K68K21n2j623j025j34
$$ 77099 76845 75647 74186 73777 73014 72386 71692 71665 71249 70711 70962 70817 70721 70989 71210 71158 69535 68510 68376
17626F8376P6l37j226r08K07l40l84j219p44J32k1j219J42j16j298P48J75n10
$$ 68376 68452 68115 66889 65981 66188 65848 65464 64245 63501 63633 63612 62393 62535 62419 61121 61869 62044 61534
17608F1534p37k001m06J78K69l63j93L11j335r72O56O06j320J70N65K18L95J23
$$ 61534 60797 58796 58390 58568 58837 58474 58281 58592 57257 56285 56941 57547 56227 56397 56962 57180 57575 57698
17590E7698J83j054j443J24Q95N09j8j80j225J54k85p67K34J307n08p52m63K64
$$ 57698 57881 56827 55384 55508 56403 56912 56894 56714 55489 55643 55358 54591 54825 56132 55624 54872 54409 54673
17572E4673k72q18p28o02l00l65L6P39n69n08K65l98j830j041q28r1o34P89P60
$$ 54673 54401 53583 52855 52253 51953 51588 51624 52363 51794 51286 51551 51153 49323 48282 47454 47363 46729 47518 48278
17553D8278r85J19r98j525K28J132m25q12q07l8q45j14j74q82ko35j084j289J074
$$ 48278 47293 47412 46414 44889 45117 46249 45824 45012 44205 44167 43322 43208 43034 42152 42150 41515 40431 39142 40216
17534D0216J663k64k12L86p88n83r74O91P03K96p34M2l77n23r91qr8l07M37O0
$$ 40216 41879 41615 41403 41789 41001 40418 39444 40135 40838 41134 40400 40442 40065 39542 38551 38543 38445 38138 38575 38635
17514C8635L26l92m44K05m7q02M52N87r83j215o42l40P49Q01j33j733p70M17J089
$$ 38635 38961 38569 38125 38330 38283 37481 37933 38520 37537 36322 35680 35340 36089 36890 36757 35024 34254 34671 35760
17495C5760J88J83M3j368j078P0N1j14n24Q25K97J768q94j747N11L16K71lJ14
$$ 35760 35948 36131 36174 34806 33728 33798 33849 33735 33211 34036 34333 36101 35207 33460 33971 34287 34558 34555 34669
17476C4669m79k175j412j6K71O49M50R30l19n06j417j31N89k33n77p20M0J62m83
$$ 34669 34190 32015 30603 30587 30858 31507 31957 32887 32568 32062 30645 30514 31103 30870 30293 29573 29613 29775 29292
17457B9292k4P7P43R02j225K85P87Q92M25q23j044k02j64p53N65M79k92O83J108
$$ 29292 29268 29345 30088 30990 29765 30050 30837 31729 32154 31331 30287 30085 29921 29168 29733 30212 29920 30603 31711
17438C1711P07L84k30n69j396j406o32k73L23k30j21m74p13M14p22r5N90O39k18
$$ 31711 32418 32802 32572 32003 30607 29201 28569 28296 28619 28389 28268 27794 27081 27495 26773 26678 27268 27907 27689
17419B7689j67l01M8m84K66J018J252J033m64j042m54M41m64j771n82k33m42Q12
$$ 27689 27522 27221 27269 26785 27051 28069 29321 30354 29890 28848 28394 28835 28371 26600 26018 25785 25343 26155
17401B6155J203m1l66r24j044j13K208R75p39k161q86o30j67J16M85M77l65m13
$$ 26155 27358 27317 26951 26027 24983 24870 27078 28053 27314 25153 24267 23637 23470 23586 24071 24548 24183 23770
17383B3770K1M13N03M48M65j274n66M37O28r64r48k27J60Q54R0p83P1R18m56r97
$$ 23770 23791 24204 24707 25155 25620 24346 23780 24217 24845 23881 22933 22706 22866 23720 23810 23027 23098 24016 23560 22563
17363B2563l29l38j7M76N32O11n00j040J31L43l40j438J91Q47O64M64k62l90q95
$$ 22563 22234 21896 21879 22355 22887 23498 22998 21958 22089 22432 22092 20654 20845 21692 22356 22820 22558 22168 21273
17344B1273n96Q69J012J30K52Q28J15k60q12q04O11m37m92j23k27r36P20M6M46
$$ 21273 20677 21546 22558 22688 22940 23768 23883 23623 22811 22007 22618 22181 21689 21566 21339 20403 21123 21169 21615
17325B1615J758J41j044p03k97j74O10m22J9kj00O80J61p62J190J321k7j514m19
$$ 21615 23373 23514 22470 21767 21470 21296 21906 21484 21503 21501 21401 22081 22242 21480 22670 23991 23964 22450 22031
17306B2031J013j199o72r51P46Q5K68M41J252m67j433L56J38R53R9l89n25l05
$$ 22031 23044 21845 21173 20222 20968 21053 21321 21762 23014 22547 21114 21470 21608 22561 22660 22271 21746 21441
17288B1441K49l60J068p00l11L58K74O31q95o56p32J309K30K8L60q25Q90M69L60
$$ 21441 21690 21330 22398 21698 21387 21745 22019 22650 21755 21099 20367 21676 21906 21934 22294 21469 22359 22828 23188
17269B3188n35n18N26K42M39J97j16j75j980p02J464j94j20p8l29K69O03k30q98
$$ 23188 22653 22135 22661 22903 23342 23539 23423 23248 21268 20566 22030 21836 21716 21638 21309 21578 22181 21951 21053
17250B1053O0Q69Q16M61J90M37M61q41j845j867N09O35L14p09K41K017q8j1O85
$$ 21053 21113 21982 22798 23259 23449 23886 24347 23506 21661 19794 20303 20938 21252 20543 20784 22801 22713 22702 23387
17231B3387ML44K18q41k44j200N57J346r60m39N49m0J17j83p55J379M2r91J3J36
$$ 23387 23391 23735 23953 23112 22868 21668 22225 23571 22611 22172 22721 22681 22798 22615 21860 23239 23281 22290 22303 22439
17211B2439K44M76o6n51p91M7R39Q25n13j244L87R95O72J69n5L30j156j7J10k15
$$ 22439 22683 23159 23093 22542 21751 21798 22737 23562 23049 21805 22192 23187 23859 24028 23973 24303 23147 23130 23240 23025
17191B3025o06K68N95L79J130O2lp60j0l36O05K07P3J393m44r23N86l98j157j61
$$ 23025 22419 22687 23282 23661 24791 24853 24850 24090 24080 23744 24349 24556 24629 26022 25578 24655 25241 24843 23686 23525
17171B3525m28j10j67R86J852j70k37K77p21j349L60O49Q34N94l26j35N1k49J56
$$ 23525 23097 22987 22820 23806 25658 25488 25251 25528 24807 23458 23818 24467 25301 25895 25569 25434 25485 25236 25392
17152B5392R79K1j358j23J56R23O69j199K80R09m39j98j15k25J549M36j278j993
$$ 25392 26371 26392 25034 24911 25067 25990 26659 25460 25740 26649 26210 26012 25897 25672 27221 27657 26379 24386
17134B4386P24R34O28L79M6m33J36K5k40j198J90J313j48j81R09p1k71O60K57
$$ 24386 25110 26044 26672 27051 27097 26664 26800 26825 26585 25387 25577 26890 26742 26561 27470 27399 27128 27788 28045
17115B8045O2Q50Q0m74j303K21O83k38O19R18n35m65p58n2L53j62j47M3R48j4
$$ 28045 28107 28957 29037 28563 27260 27481 28164 27926 28545 29463 28928 28463 27705 27653 28006 27844 27697 27740 28688 28674
17095B8674N81K34J387J802L03j140j443j86J056R10n0R97lO5j72l25M8J86P2
$$ 28674 29255 29489 30876 32678 32981 31841 30398 30212 31268 32178 32128 33125 33122 33187 33015 32690 32738 32924 32996
17076C2996j0R08n64j64O56R80p28j366J90J537p7n72k04M46l33P32L94j84P56
$$ 32996 32986 33894 33330 33166 33822 34802 34074 32708 32898 34435 34358 33786 33582 34028 33695 34427 34821 34637 35393
17057C5393J8M71N38K5J9Q36K24j170M9J007K09q27K03p35O71R83J55P96Q11k91
$$ 35393 35411 35882 36420 36445 36464 37300 37524 36354 36403 37410 37619 36792 36995 36260 36931 37914 38069 38865 39676 39385
17037C9385m20O58n86k79J057J176l09N7J36M21O43j29L15N71R5P42j0k72l95
$$ 39385 38965 39623 39037 38758 39815 40991 40682 40739 40875 41296 41939 41810 42125 42696 42791 43533 43523 43251 42856
17018D2856O34L45K16n13j55R1L02n43N75M08K28J142L82M05L05O01J108Q76n
$$ 42856 43490 43835 44051 43538 43383 43474 43776 43233 43808 44216 44444 45586 45968 46373 46678 47279 48387 49263 49258
16999D9258j74l5p34P02k34K9J078j421J80J269L70k44N65M92K86K86J430q6j91
$$ 49258 49084 49049 48315 49017 48783 48812 49890 48469 48649 49918 50288 50044 50609 51101 51387 51673 53103 53017 52826
16980E2826r38L7L18J775K11j309r72J092J618R66L28p92o96k7j99r51J570J526
$$ 52826 51888 51925 52243 54018 54229 52920 51948 53040 54658 55624 55952 55160 54464 54437 54238 53287 54857 56383
16962E6383j146q89Q96L52M82P39J876M21j237q93J328J237Q82Q0J21O46M08K98
$$ 56383 55237 54348 55244 55596 56078 56817 58693 59114 57877 56984 58312 59549 60431 60511 60632 61278 61686 61984
16944F1984P93M61j07k17M68Q1M92P61J051K50q37P4M05J072P90N86Q89J168%
$$ 61984 62777 63238 63131 62914 63382 63463 63955 64716 65767 66017 65180 65254 65659 66731 67521 68107 68996 70164 70164
16925G0164K81l38r3J034R70O05j28j155j005J199J643J334L01J251M74j29J273
$$ 70164 70445 70107 70014 71048 72018 72623 72495 71340 70335 71534 73177 74511 74812 76063 76537 76408 77681
16908G7681J024m13J99N78J208M55n67K3K99O55P03N46O05J582Q71j02K54Q55
$$ 77681 78705 78292 78491 79069 80277 80732 80165 80188 80487 81142 81845 82391 82996 84578 85449 85347 85601 86456
16890H6456J049k50M01P77Q51J010J74Q79J236J78Q54J01K29P38J119R69K49O1
$$ 86456 87505 87255 87656 88433 89284 90294 90468 91347 92583 92761 93615 93716 93945 94683 95802 96771 97020 97081
16872I7081n66J102N18r2J093M01R6R62J107j3L57K369R27P98R18J81O44N92O50
$$ 97081 96515 97617 98135 98043 99136 99537 99633 100595 101702 101689 102046 104415 105342 106140 107058 107239 107883 108475 109125
16853A09125N52M20Q56K028P13J263j19m07J364J517N19J389J514O37J072N35
$$ 109125 109677 110097 110953 112981 113694 114957 114838 114431 115795 117312 117831 119220 120734 121371 122443 122978
16837A22978P40J012J734J847J532J909J472j044r53q13q52j17J417K007J985
$$ 122978 123718 124730 126464 128311 129843 131752 133224 132180 131227 130414 129562 129445 130862 132869 134854
16822A34854K277J771J172R35L39J228M70J416P58Q31J157J536J663J113J02J56
$$ 134854 137131 138902 140074 141009 141348 142576 143046 144462 145220 146051 147208 148744 150407 151520 151622 151778
16806A51778J029K477J777J568m95P92J275Q76J559Q11R79J038O33o2j48J418
$$ 151778 152807 155284 157061 158629 158134 158926 160201 161077 162636 163447 164426 165464 166097 166035 165887 167305
16790A67305J815J395J815J095J250O11J019N34O7J050J667P70Q94J548J064J238
$$ 167305 169120 170515 172330 173425 174675 175286 176305 176839 176906 177956 179623 180393 181287 182835 183899 185137
16774A85137J590J242M34O08Q6L65J792J881P93J558J183J42J500J665P04J378
$$ 185137 186727 187969 188403 189011 189097 189462 191254 193135 193928 195486 196669 196811 198311 199976 200680 202058
16758B02058K070J015J147J419M22R80J366M31J050K14R71J063Q15k18J106R78
$$ 202058 204128 205143 206290 207709 208131 209111 210477 210908 211958 212172 213143 214206 215021 214803 215909 216887
16742B16887J74O47J64J365J466J639J39Q45O80L69M7J533P16N97J484P58j63
$$ 216887 217061 217708 217872 219237 220703 222342 222481 223326 224006 224375 224422 225955 226671 227268 228752 229510 229347
16725B29347O84J42Q92J589L55P29R03J08M63L34J321M28J54M94J748L57m52n70
$$ 229347 230031 230173 231065 232654 233009 233738 234641 234749 235212 235546 236867 237295 237449 237943 239691 240048 239596 239026
16707B39026M67M7k21R13L07J030j276j266O22J564J359K70j149k642K27K253
$$ 239026 239493 239540 239319 240232 240539 241569 240293 239027 239649 241213 242572 242842 241693 239051 239278 241531
16691B41531N84m04r14O20K08l13n51n73L65j337j2o36N12k02Q92M10K6j567l00
$$ 241531 242115 241711 240797 241417 241625 241312 240761 240188 240553 239216 239204 238568 239080 238878 239770 240180 240206 238639 238339
16672B38339L45Q18j142j842j156K74l18N45M61K26J13l90j594j475n01r75j387
$$ 238339 238684 239502 238360 236518 235362 235636 235318 235863 236324 236550 236663 236273 234679 233204 232703 231728 230341
16655B30341r07l74Q29n79k088k238j43n90o38q32k228q57n62N11j093l039j918
$$ 230341 229434 229060 229889 229310 227222 224984 224841 224251 223613 222781 220553 219696 219134 219645 218552 215513 213595
16638B13595r02j93k091m73j280o28M6j346p53j128j659j137r79l93q95j581j096
$$ 213595 212693 212500 210409 209936 208656 208028 208074 206728 205975 204847 203188 202051 201072 200679 199784 198203 197107
16621A97107j643j088j829k065r63j879k086k14m06j252r95j609j070j017r70
$$ 197107 195464 194376 192547 190482 189519 187640 185554 185340 184934 183682 182687 181078 180008 178991 178021
16606A78021J3k136j548j096k665j752P7p09r57r80m50p63j309j200j058j968
$$ 178021 178034 175898 174350 173254 170589 168837 168914 168205 167248 166268 165818 165055 163746 162546 161488 159520
16590A59520k015j387p77j590j272j419n39n17j376k147j323p01j492r28p60j067
$$ 159520 157505 156118 155341 153751 152479 151060 150521 150004 148628 146481 145158 144457 142965 142037 141277 140210
16574A40210k67Km15j588j602j573m43j139r79j550r94j546j699m03j400j494
$$ 140210 139943 139945 139530 137942 136340 134767 134324 133185 132206 130656 129662 128116 126417 126014 124614 123120
16558A23120l67j481r32r49P68j376k149k229q61J160J208p56j507q72j849j323
$$ 123120 122753 121272 120340 119391 120159 118783 116634 114405 113544 114704 115912 115156 113649 112777 110928 109605
16542A09605n33j034j617j027j46r58j628n44J144m67j473n74j306p36j289j668
$$ 109605 109072 108038 106421 105394 105248 104290 102662 102118 103262 102795 101322 100748 99442 98706 97417 95749
16526I5749m7M76j416j072p5r2q06j536l09k51J634p75j414j354j397K91j16N52
$$ 95749 95702 96178 94762 93690 93615 93523 92717 91181 90872 90621 92255 91480 90066 88712 87315 87606 87490 88042
16508H8042L03k75j491j769m42l09p81j735p05p98n4J73j134j486k2J91j238j418
$$ 88042 88345 88070 86579 84810 84368 84059 83278 81543 80838 80040 79986 80159 79025 77539 77517 77708 76470 75052
16490G5052N95J15K02j073r59j768r84J58j146n92N4O20J306P7n87J5q75j474
$$ 75052 75647 75762 75964 74891 73932 72164 71180 71338 70192 69600 69654 70274 71580 71657 71070 71085 70210 68736
16472F8736k203K27O28q4j241j101n74o24Q21L72o53K58m53j864l63k8j358o03
$$ 68736 66533 66760 67388 67304 66063 64962 64388 63764 64585 64957 64304 64562 64109 62245 61882 61854 60496 59893
16454E9893J93m77R52n9Qk92l16j443k37L43l24n72n98o6N7m79m92J171K90j025
$$ 59893 60086 59609 60561 60502 60510 60218 59902 58459 58222 58565 58241 57669 57071 57005 57062 56583 56091 57262 57552 56527
16434E6527k6L04J30o03j200j976n54N59m85k33L05Q74j168j298K16M99Q44o12
$$ 56527 56501 56805 56935 56332 55132 53156 52602 53161 52676 52443 52748 53622 52454 51156 51372 51871 52715 52103
16416E2103q54j34O95L74j016r79o13j414j424J17K58L00j003j480L39K89m94
$$ 52103 51249 51115 51810 52184 51168 50189 49576 48162 46738 46855 47113 47413 46410 44930 45269 45558 45064
16399D5064j141r14M98M31J050p75q58R55n0k20k97k12j182j729J17N07o29q92
$$ 45064 43923 43009 43507 43938 44988 44213 43355 44310 44260 44040 43743 43531 42349 40620 40737 41244 40615 39723
16381C9723K16R89J458L07n08q55k012m52p0l12J66Q96l9p00k81L66k48j01p49
$$ 39723 39939 40928 42386 42693 42185 41330 39318 38866 38796 38484 38650 39546 39507 38807 38526 38892 38644 38543 37794
16362C7794j521p16O41om75J528n68q45J65k94k20O39kj084r81p3j156n43P13
$$ 37794 36273 35557 36198 36192 35717 37245 36677 35832 35997 35703 35483 36122 36120 35036 34055 33982 32826 32283 32996
16343C2996n20m62M94o01LJ86l60o29q99j90j29J02j120n56K37R21J290M23m7
$$ 32996 32476 32014 32508 31907 31910 32096 31736 31107 30208 30018 29889 29991 28871 28315 28552 29473 30763 31186 31139
16324C1139J84o88P65n38j313j105L68M68n65o95J46M55j20m13p69J9K66j17L10
$$ 31139 31323 30635 31400 30862 29549 28444 28812 29280 28715 28020 28166 28621 28501 28088 27319 27338 27604 27487 27797
16305B7797p5l62O08r28m63j39l04o94n28r6N14P62P7j79J33j0J041m3r17p00
$$ 27797 27722 27360 27968 27040 26577 26438 26134 25440 24912 24816 25330 26092 26169 25990 26123 26113 27154 27111 26194 25494
16285B5494l50l65k36N2l14q32o20m0N01M19K88j39k23n25n6n20O40J035j239
$$ 25494 25144 24779 24543 24595 24281 23449 22829 22789 23290 23709 23997 23858 23635 23110 23054 22534 23174 24209 22970
16266B2970j325J898j52K04J784J45j544k179r26J69Q45J280L9L81K84k61j036
$$ 22970 21645 23543 23391 23595 25379 25524 23980 21801 20875 21044 21889 23169 23208 23589 23873 23612 22576
16249B2576j902J86J019L97l26K16o81j93j118j22R77L38o62j35R69n65J41J3
$$ 22576 20674 20860 21879 22276 21950 22166 21485 21292 20174 20052 21029 21367 20705 20570 21539 20974 21115 21128
16231B1128J063O84j081J29o6j115j49o78n07k26O37p8J46P45n59j413r49k87
$$ 21128 22191 22875 21794 21923 21857 20742 20593 19915 19408 19182 19819 19741 19887 20632 20073 18660 17711 17424
16213A7424J647Q27q62n61J73j46l52Q0J36p92n54P01R6N42O45m97j3k49M31o86
$$ 17424 19071 19898 19036 18475 18648 18502 18150 18230 18366 17574 17020 17721 17817 18359 19004 18507 18494 18245 18676 17990
16193A7990M20n19o32k43L05Q82n03K98o97N4o55n69Q74k55K18J194k79m6Q75
$$ 17990 18410 17891 17259 17016 17321 18203 17700 17998 17301 17355 16700 16131 17005 16750 16968 18162 17883 17837 18712
16174A8712o9k144j59P4J95M16n62K20n6j125j42n03K78l35l82p18R3Q88J167
$$ 18712 18643 16499 16340 16414 16609 17025 16463 16683 16627 15502 15360 14857 15135 14800 14418 13700 13793 14681 15848
16155A5848J91j018K7N19j111q42P77Q68r50N05J145j96j144q44R64Rj8k5M4M81
$$ 15848 16039 15021 15048 15567 14456 13614 14391 15259 14309 14814 15959 15763 14619 13775 14739 14748 14730 14705 14749 15230
16135A5230P82P19j665j809l69R42J077L9r9M39n41K9N53m79Q33O09o20j505j370
$$ 15230 16012 16731 15066 13257 12888 13830 14907 14946 14847 15286 14745 14774 15327 14848 15681 16290 15670 14165 12795
16116A2795r9N69J258k77k4K65Q1M04j6J33j324j716J52Q62M52o50n57n01k37
$$ 12795 12696 13265 14523 14246 14222 14487 14568 14972 14956 15089 13765 12049 12201 13063 13515 12865 12308 11807 11570
16097A1570M3O23k46k16o22Q6l3J150M82j19L18O05l56J50K36q30m55J503L74
$$ 11570 11613 12236 11990 11774 11152 11238 11205 12355 12837 12718 13036 13641 13285 13435 13671 12841 12386 13889 14263
16078A4263r23j058n28o71r08j59J090R5Q13Q45j92r6J93O28P23r64l98n91K06
$$ 14263 13340 12282 11754 11083 10175 10016 11106 11201 12014 12859 12667 12571 12764 13392 14115 13151 12753 12162 12368
16059A2368m39J72q77O74K74l72l50m83j202j810R64J091M76j135%R66L86m40
$$ 12368 11929 12101 11224 11898 12172 11800 11450 10967 9765 7955 8919 10010 10486 9351 9351 10317 10703 10263
16041A0263n53O77M04N63O0M0K43o8m91m96J09Q04N7j092j322q03o48R8J388J541
$$ 10263 9710 10387 10791 11354 11414 11454 11697 11629 11138 10642 10751 11555 11612 10520 9198 8395 7747 7845 9233 10774
16021A0774P99q87m58j42N82m04j67J747O90j542j041p66k50K07j165j019K041
$$ 10774 11573 10686 10228 10086 10668 10264 10097 11844 12534 10992 9951 9185 8935 9142 7977 6958 8999
16004H999J080k41K92m10L53n07M68N28J56K00j296k21R38r7J89j149q03J52J020
$$ 8999 10079 9838 10130 9720 10073 9566 10034 10562 10718 10918 9622 9401 10339 10242 10431 9282 8479 8631 9651
15985I651R31O73J107r67j546q01q62j023q22J707O19k03J494M07k22o50k18L7
$$ 9651 10582 11255 12362 11395 9849 9048 8186 7163 6341 8048 8667 8464 9958 10365 10143 9493 9275 9312
15967I312n50o17P94J53p26K60M5q7l53r6m8M85k16P96J21o21o41p9M60M46J732
$$ 9312 8762 8145 8939 9092 8366 8626 8671 8584 8231 8135 8087 8572 8356 9152 9273 8652 8011 7932 8392 8838 10570
15946A0570M59j391k16n19j866k05K581J364Q1j055k27m8n98R58J274j56J96k32
$$ 10570 11029 9638 9422 8903 7037 6832 9413 10777 10858 9803 9576 9528 8930 9888 11162 11006 11202 10970
15928A0970l76q14l72m12J41l23O9r52m36Q03O27l23k00J34M15J29J39j307J169
$$ 10970 10594 9780 9408 8996 9137 8814 8883 7931 7495 8298 8925 8602 8402 8536 8951 9080 9219 7912 9081
15909I081J136l44r16o71p30P52R44m95L6P23j02j90j432l9R53J21p02J03J030
$$ 9081 10217 9873 8957 8286 7556 8308 9252 8757 8793 9516 9414 9224 7792 7753 8706 8827 8125 8228 9258
15890I258j952j419K1J300M07m45J226P31Q83l97M1o41j265L09L67r05K63J766
$$ 9258 7306 5887 5908 7208 7615 7170 8396 9127 10010 9613 9654 9013 7748 8057 8424 7519 7782 9548
15872I548M26j66j062m83m09n95M72J456J62j002n05O48m26J845k1o60p3j37l62
$$ 9548 9974 9808 8746 8263 7854 7259 7731 9187 9349 8347 7842 8490 8064 9909 9888 9228 9155 9018 8656
15853H656K00j89M21n5j191K96Q41J110m01K12j08o33k15q34n27M89L98j019J06
$$ 8656 8856 8667 9088 9033 7842 8138 8979 10089 9688 9900 9792 9159 8944 8110 7583 8072 8470 7451 7557
15834G557j82k94M8J18N93J41m14Q90k0l74l82l53l75N78k04j249j73K2J211M43
$$ 7557 7375 7081 7129 7247 7840 7981 7567 8457 8437 8063 7681 7328 6953 7531 7327 6078 5905 5927 7138 7581
15814G581q52N56P12o73m07J07n60R4J236R02J12p17m24J44j831p30J158K198
$$ 7581 6729 7285 7997 7324 6917 7024 6464 6558 7794 8696 8808 8091 7667 7811 5980 5250 6408 8606
15796H606n00k39j83m4L01P40n54l23K2m43K50j66J012N90m94j03o71n80j430
$$ 8606 8106 7867 7684 7640 7941 8681 8127 7804 7826 7383 7633 7467 8479 9069 8575 8472 7801 7221 5791
15777E791m69R08k89j13n76j4N19J219K93j130j95Q10K75N64R98m28j337l98j83
$$ 5791 5322 6230 5941 5828 5252 5238 5757 6976 7269 6139 5944 6754 7029 7593 8591 8163 6826 6428 6245
15758F245Qj328q54O10O21M93j52M60J649J214l74r21q13j46q82l73N09J395Q74
$$ 6245 6253 4925 4071 4681 5302 5795 5643 6103 7752 8966 8592 7671 6858 6712 5830 5457 5966 7361 8235
15739H235L93j24n05r08M05P82k43o33n66j239Q8J039J114J257j98n96L41j8j90
$$ 8235 8628 8504 7999 7091 7496 8278 8035 7402 6836 5597 5685 6724 7838 9095 8897 8301 8642 8624 8434
15720H434r94j353l44P45P3L84j89N34p13m41N21m11m28n4K88Q57J107j26j108
$$ 8434 7440 6087 5743 6488 6561 6945 6756 7290 6577 6136 6657 6246 5818 5764 6052 6909 8016 7890 6782
15701F782o84J95P02l07m74j135m22J957N89p2Q34n26j067l21O06J110O56L96
$$ 6782 6098 6293 6995 6688 6214 5079 4657 6614 7203 7131 7965 7439 6372 6051 6657 7767 8423 8819
15683H819L51J044q05j906M43J68k64J138j022j230M27r2J25j49N16J63r01JN1
$$ 8819 9170 10214 9409 7503 7946 8114 7850 8988 7966 6736 7163 7071 7196 7047 7563 7726 6825 6826 6877
15664F877J90M1j072j440n17L20R63R18M35J130j8Q7m50j235o57j97R54Q69q6
$$ 6877 7067 7108 6036 4596 4079 4399 5362 6280 6715 7845 7827 7914 7464 6229 5572 5375 6329 7198 7112
15645G112p69L81J377Jj109o80j13J91l35q27o7K05L89m11J92KJ01J167N7M38
$$ 7112 6343 6724 8101 8102 6993 6313 6200 6391 6056 5229 5162 5367 5756 5345 5537 5539 5640 6807 6864 7302
15625G302J205j008l10P84P7q35l91O14Q34l11q71K29Q90m16p09L02n17p24O84
$$ 7302 8507 7499 7189 7973 8050 7215 6824 7438 8272 7961 7090 7319 8209 7793 7084 7386 6869 6145 6829
15606F829N67j520r27r69M37J433j7l95L41k46N87K48l57j50j033P69J919j48
$$ 6829 7396 5876 4949 3980 4417 5850 5833 5438 5779 5533 6120 6368 6011 5861 4828 5597 7516 7368
15588G368r26j027K62K84O94J244K51O44k29k55k27n34k55n88P5r9m66P1o3J79
$$ 7368 6442 5415 5677 5961 6655 7899 8150 8794 8565 8310 8083 7549 7294 6706 6781 6682 6216 6287 6224 6403
15568F403k72q27J06J09L75P00J228j11k06L1N90n66p63L85l69m81L03k20p81
$$ 6403 6131 5304 5410 5519 5894 6594 7822 7711 7505 7536 8126 7560 6797 7182 6813 6332 6635 6415 5634
15549E634l08J106J389J76J45N76o49l53o90j36L02m57L07J19p1Q37M58j2j018
$$ 5634 5326 6432 7821 7997 8142 8718 8069 7716 7026 6890 7192 6735 7042 7161 7090 7927 8385 8373 7355
15530G355j009M86K66K90q58j264P0J223R69k37j029q15J93l92q64O48N04L08
$$ 7355 6346 6832 7098 7388 6530 5266 5336 6559 7528 7291 6262 5447 5640 5248 4384 5032 5536 5844
15512E844P74K38j008k55M02N06M44R50K9j166n45O94O87l26q05q91J031J676
$$ 5844 6618 6856 5848 5593 5995 6501 6945 7895 7924 6758 6213 6907 7594 7268 6463 5572 6603 8279
15494H279pp04n87o56k39L31j281m57r20N58J176M2M09J065n32L70O07N70k33
$$ 8279 8272 7568 6981 6325 6086 6417 5136 4679 3759 4317 5493 5535 5944 7009 6477 6847 7454 8024 7791
15475G791j57J124p22j459m65L32J04j401j012K93J874K17p90N81N06J9j041p93
$$ 7791 7634 8758 8036 6577 6112 6444 6548 5147 4135 4428 6302 6519 5729 6310 6816 6835 5794 5001
15457E001k3L61N7M48O84P89N59k83N96j055k523j50L53R22Q16L11j90O96j62
$$ 5001 4978 5339 5396 5844 6528 7317 7876 7593 8189 7134 4611 4461 4814 5736 6552 6863 6673 7369 7207
15438G207l88L0P4o36N15K81k58Q3l49L54K37J45k21o03q76m13J204K13n86j30
$$ 7207 6819 6849 6923 6287 6802 7083 6825 6908 6559 6913 7150 7295 7074 6471 5595 5182 6386 6599 6013 5883
15418E883R0k83k16P94J172J015o83o17m59N4O9L55l8K9J53J046K97l07n7k72
$$ 5883 5973 5690 5474 6268 7440 8455 7772 7155 6696 6750 6819 7174 7136 7165 7318 8364 8661 8354 8297 8025
15398H025n82L08Q78q1j091l95p84o44J335M48J139J32n45m00P94q63q07J76J39
$$ 8025 7443 7751 8629 8548 7457 7062 6278 5634 6969 7417 8556 8688 8143 7743 8537 7674 6867 7043 7182
15379G182K15o2M00J35K60m95k74o25N60L45l98J196Q99m70N73J54j148j19J35
$$ 7182 7397 7335 7735 7870 8130 7635 7361 6736 7296 7641 7243 8439 9338 8868 9441 9595 8447 8328 8463
15360H463n1L50l73j459N64J02J08L83n16Q43Q20m14J23q94j027O54L86o83p77
$$ 8463 8412 8762 8389 6930 7494 7596 7704 8087 7571 8414 9234 8820 8943 8049 7022 7676 8062 7379 6602
15341F602J297K80o46p45k81M00J10r13N8J057J004j114l02K50P67j14n0L34n21
$$ 6602 7899 8179 7533 6788 6507 6907 7017 6104 6162 7219 8223 7109 6807 7057 7824 7710 7660 7994 7473
15322G473q4J016J122l67j262j120k95R53Q30N90L39k39M8K01K05j033p09j44
$$ 7473 7389 8405 9527 9160 7898 6778 6483 7436 8266 8856 9195 8956 9004 9205 9410 8377 7668 7524
15304G524m05j09L16O27k27O85J622Q31K49j257r66j87L04j242j153N72N02P15
$$ 7524 7119 7010 7326 7953 7726 8411 10033 10864 11113 9856 8890 8703 9007 7765 6612 7184 7686 8401
15286H401J294m27l93P9K95p38pj38k97j92k34n92K31N22o68L01L65M2o54J28
$$ 8401 9695 9268 8875 8954 9249 8511 8504 8366 8069 7877 7643 7051 7282 7804 7136 7437 7802 7844 7190 7318
15266G318m85M31J121q11j156Q01J157N1q7L41j85J30m0q78J016Q71p90j761j003
$$ 7318 6833 7264 8385 7574 6418 7219 8376 8427 8340 8681 8496 8626 8586 7708 8724 9595 8805 7044 6041
15247F041J547K138p02j37O33o20m65k20J93J84J151M48J70l44j595p20j159P62
$$ 6041 7588 9726 9024 8887 9520 8900 8435 8215 8408 8592 9743 10191 10361 10017 8422 7702 6543 7305
15229G305N73M1M18M35Q45O37m42j525n28K66M56O60m99o2j70m95J78L07O1p12
$$ 7305 7878 7919 8337 8772 9617 10254 9812 8287 7759 8025 8481 9141 8642 8580 8410 7915 8093 8400 8461 7749
15209G749J49K5l61l7P9n39M4Q4m30m41J204J706J527k78r49K41M79k00q09j573
$$ 7749 7898 7923 7562 7525 7604 7065 7109 7193 6763 6322 7526 9232 10759 10481 9532 9773 10252 10052 9243 7670
15189G670j371M30K062R58k7j56L83m32J13K16j79r90k33L41o92o7O28j019l14
$$ 7670 6299 6729 8791 9749 9722 9566 9949 9517 9630 9846 9667 8677 8444 8785 8093 8026 8654 7635 7321
15170G321J356J313j78p17O49L71j336p73k79N66J023m47l57j34J55J61l95m44
$$ 7321 8677 9990 9812 9095 9744 10115 8779 8006 7727 8293 9316 8869 8512 8378 8533 8694 8299 7855
15152G855M53J637O84p94j087J54J165j67q93j92J133L55L76n93k73q83j14J54
$$ 7855 8308 9945 10629 9835 8748 8902 10067 9900 9007 8815 9948 10303 10679 10086 9813 8930 8816 8970
15134H970M36L13j63kM20l82m1M56L85K53m74k31j46q54o10j10k17K40o31L01
$$ 8970 9406 9719 9556 9554 9974 9592 9551 10007 10392 10645 10171 9940 9794 8940 8330 8220 8003 8243 7612 7913
15114G913M60R98K22j076M79J161k26n53j83p47O54j82p3K47L60M2O35n50n62
$$ 7913 8373 9371 9593 8517 8996 10157 9931 9378 9195 8448 9102 8920 8847 9094 9454 9496 10131 9581 9019
15095I019k94n1o17m87n08R61O95K47O74Mk28R87O40J40m51j43r48o93N86o11
$$ 9019 8725 8674 8057 7570 7062 8023 8718 8965 9639 9643 9415 10402 11042 11182 10731 10588 9640 8947 9533 8922
15075H922q25N28R5k39l53K40J213J090m18l62O97m54j013l39R16K52N6m00m38
$$ 8922 8097 8625 8720 8481 8128 8368 9581 10671 10253 9891 10588 10134 9121 8782 9698 9950 10006 9606 9168
15056I168j216l46K032P55K84j16j388P5J81r53P05N69l78Q17J16j249j77R71
$$ 9168 7952 7606 9638 10393 10677 10561 9173 9248 9429 8476 9181 9750 9372 10189 10305 9056 8879 9850
15038I850k9j37j11j275n31J743J364p17n89q52n39L82J108o12L2j76K26P63N67
$$ 9850 9821 9684 9573 8298 7767 9510 10874 10157 9568 8716 8177 8559 9667 9055 9087 8911 9137 9900 10467
15019A0467o41l02J864M10p64j65j349N02P85o79l8j559j554K84J374J981O30
$$ 10467 9826 9524 11388 11798 11034 10869 9520 10022 10807 10128 10090 8531 6977 7261 8635 10616 11246
15002A1246j912o56Q1P74l6L08P35j069l70O86r93M29R26l42O86O48P28r98n96
$$ 11246 9334 8678 8759 9533 9497 9805 10540 9471 9101 9787 8794 9223 10149 9807 10493 11141 11869 10871 10275
14983A0275l25n43o42m42O40P48q87K28r8n84J098J022O08o3l74%m66K53M00K06
$$ 10275 9950 9407 8765 8323 8963 9711 8824 9052 8954 8370 9468 10490 11098 11035 10661 10661 10195 10448 10848 11054
14963A1054j390J47L32n48P59P97m29L90p02M29L22J51M37p71J29j47k42J411
$$ 11054 9664 9811 10143 9595 10354 11151 10722 11112 10410 10839 11161 11312 11749 10978 11107 10960 10718 12129
14945A2129M25k82j547K04J544p74q65m29N3j72O91Q57k80q0p33j017o87N18J030
$$ 12129 12554 12272 10725 10929 12473 11699 10834 10405 10458 10286 10977 11834 11554 11474 10741 9724 9037 9555 10585
14926A0585k97j78K02m5j51j320L18o67J088J237n06n75k66O95N47l21k72n47
$$ 10585 10288 10110 10312 10267 10116 8796 9114 8447 9535 10772 10266 9691 9425 10120 10667 10346 10074 9527
14908I527J054N68j85r34O57O51L44n92K70m92r2L19j6nn53m21k81O73j04p01
$$ 9527 10581 11149 10964 10030 10687 11338 11682 11090 11360 10868 10776 11095 11079 11074 10521 10100 9819 10492 10388 9687
14888I687o43J013J832O74o11j00o31r2j044N37J48Q51o9j14N0L09J22L10M80
$$ 9687 9044 10057 11889 12563 11952 11852 11221 11129 10085 10622 10770 11621 11552 11438 11488 11797 11919 12229 12709
14869A2709K14m81j364p17q36o82L02J158R94J81n78m24k84J080M0L73j343N86
$$ 12709 12923 12442 11078 10361 9525 8843 9145 10303 11297 11478 10900 10476 10192 11272 11312 11685 10342 10928
14851A0928J111P94n94r7k07m21k82r72O43Q88j81Q11Q14q86j045O17Q50J78p00
$$ 10928 12039 12833 12239 12142 11935 11514 11232 10260 10903 11791 11610 12421 13235 12349 11304 11921 12771 12949 12249
14832A2249L35r39j36R79J16q48n11o00j55K18j34j171P64J211K93J13Q03Q6N82
$$ 12249 12584 11645 11509 12488 12604 11756 11245 10645 10490 10708 10574 9403 10167 11378 11671 11784 12587 12673 13255
14813A3255l44o45k26P73L1m98N26k81Q6J046m1j102o86j021q32n3K21l98L82
$$ 13255 12911 12266 12040 12813 12844 12346 12872 12591 12677 13723 13682 12580 11894 10873 10041 9988 10209 9811 10193
14794A0193o25J77Q94M30N6O35Q5O49P33j285r2n59j99L7l22J234K52q14J018
$$ 10193 9568 9745 10639 11069 11125 11760 11845 12494 13227 11942 11850 11291 11092 11129 10807 12041 12293 11479 12497
14775A2497P00j225j055J764J323L02r28m91R49k61r25j858k53Q09J200l69Q35
$$ 12497 13197 11972 10917 12681 14004 14306 13378 12887 13836 13575 12650 10792 10539 11348 12548 12179 13014
14758A3014P85m44k72L32K88J9J887L75k009j61M09j01n72n62O34n32l65n22j019
$$ 13014 13799 13355 13083 13415 13703 13722 15609 15984 13975 13814 14223 14122 13550 12988 13622 13090 12725 12203 11184
14739A1184R44m02n36J597n36n5j42N58m6m07P6k09r36N46K94k3m21P1K36j29
$$ 11184 12128 11726 11190 12787 12251 12196 12054 12612 12566 12159 12235 12026 11090 11636 11930 11907 11486 11557 11793 11664
14719A1664O6O36n56K41O4J22J255J326n29k76k85r23n13N42Q09J30j15j096m62
$$ 11664 11730 12366 11810 12051 12115 12237 13492 14818 14289 14013 13728 12805 12292 12834 13643 13773 13658 12562 12100
14700A2100p75K5M95R35P91M72m73j27O53K60M49j072m22K44m7k20q32L83M56
$$ 12100 11325 11350 11845 12780 13571 14043 13570 13443 14096 14356 14805 13733 13311 13555 13508 13288 12456 12839 13295
14681A3295M26O44M9p28n59K13J46q01j68P19K8J459J241P35n3j091p73q26p37
$$ 13295 13721 14365 14414 13686 13127 13340 13486 12685 12517 13236 13264 14723 15964 16699 16646 15555 14782 13956 13219
14662A3219J48L00j03N47J508j147p59n14j80K12q90q69P17J115J574K18m1r65
$$ 13219 13367 13667 13564 14111 15619 14472 13713 13199 13019 13231 12341 11472 12189 13304 14878 15096 15055 14090
14644A4090j043n96M87O47K80l88K12K93j109l5N95p90j4l64r7k87K80J079J91
$$ 14090 13047 12451 12938 13585 13865 13477 13689 13982 12873 12838 13433 12643 12629 12265 12168 11881 12161 13240 13431
14625A3431o69J401q49j033J344J570O60J21l58j287q46n01N46M54m62k18o60
$$ 13431 12762 14163 13314 12281 13625 15195 15855 15976 15618 14331 13485 12984 13530 13984 13522 13304 12644
14608A2644J85q17R73K82j48k96j358P01K110o9j255k90J042L14j334m7K48l79
$$ 12644 12829 12012 12985 13267 13119 12823 11465 12166 14276 14207 12952 12662 13704 14018 12684 12637 12885 12506
14590A2506O50J398q44j011J46j063K22J395Q0Q53q4L08r70q7N95k73L32J355
$$ 12506 13156 14554 13710 12699 12845 11782 12004 13399 13479 14332 14248 14556 13586 13499 14094 13821 14153 15508
14572A5508k29j004P09O03K2j083p31k45P44k0m1l71R43J41q95m97j29K01m69
$$ 15508 15279 14275 14984 15587 15609 14526 13795 13550 14294 14274 14233 13862 14805 14946 14051 13554 13425 13626 13157
14553A3157N42Q43P7Q0L97k86p55l29J71Q65L64L23o4Q11O35j78P12L0l59o12
$$ 13157 13699 14542 14619 14699 15096 14810 14055 13726 13897 14762 15126 15449 15385 16196 16831 16653 17365 17395 17036 16424
14533A6424m83N41k3j3k62j041j182l55Q18Q64K63j22J70j28l21Q65M82l96N90
$$ 16424 15941 16482 16459 16446 16184 15143 13961 13606 14424 15288 15551 15429 15599 15471 15150 16015 16497 16101 16691
14514A6691L92N34Q21L48j24r28j970J9k97M77n33r59L16J174k54j172m23N67
$$ 16691 17083 17617 18438 18786 18662 17734 15764 15783 15486 15963 15430 14471 14787 15961 15707 14535 14112 14679
14496A4679J098Q23J88m36l80J177r4l65K8n63J54j65L26k26j442M98J137r15
$$ 14679 15777 16600 16788 16352 15972 17149 17055 16690 16718 16155 16309 16144 16470 16244 14802 15300 16437 15522
14478A5522N00P32l3p67p29j24QJ538R02r32l25K5p1r38K88O17M09P7M41k57L1
$$ 15522 16022 16754 16721 15954 15225 15101 15109 16647 17549 16617 16292 16317 16246 15308 15596 16213 16622 16699 17140 16883 16914
14457A6914R7Q34j69k73p44l3J491n12j066j72K16r79j337j86o7p63J092J239
$$ 16914 17011 17845 17676 17403 16659 16626 18117 17605 16539 16367 16583 15604 14267 14081 14014 13251 14343 15582
14439A5582R60l21j027o88l06m16Q09O08Q16P0j295M02Q67P25L84m78p35r10R96
$$ 15582 16542 16221 15194 14506 14200 13784 14593 15201 16017 16087 14792 15194 16061 16786 17170 16692 15957 15047 16043
14420A6043K053L05j167J35j6l20l20n23n93MN37k04L23M60K29q90N56J59o91
$$ 16043 18096 18401 17234 17369 17353 17033 16713 16190 15597 15601 16138 15934 16257 16717 16946 16056 16612 16771 16080
14401A6080o3N87P82M33J271m15j508p18K50Q25M34J67j040N17Q79N01k31m27
$$ 16080 16017 16604 17386 17819 19090 18675 17167 16449 16699 17524 17958 18125 17085 17602 18481 18982 18751 18324
14383A8324j006q39j9j02O09Q99R63o64K96P61N22N2q70p70m37n9R52p37k89O52
$$ 18324 17318 16479 16460 16358 16967 17866 18829 18165 18461 19222 19744 19796 18926 18156 17719 17660 18612 17875 17586 18238
14363A8238J61J6N03l13j17Q0L53q24R5j99M21N24L00J0j2n86O00L4oL35p96r08
$$ 18238 18399 18415 18918 18605 18488 18568 18921 18097 18192 17993 18414 18938 19238 19248 19236 18650 19250 19284 19278 19613 18817 17909
14341A7909q90P95R87l11M49M68J25p17n21j44j00m72J238J8n92j344M25Q07R56
$$ 17909 17019 17814 18801 18490 18939 19407 19532 18815 18294 18150 18050 17578 18816 18834 18242 16898 17323 18130 19086
14322A9086P97P70P5M9o39p37j076K28P37J53L20j986k30J232J822J448p61q58
$$ 19086 19883 20653 20728 20777 20138 19401 18325 18553 19290 19443 19763 17777 17547 18779 20601 22049 21288 20430
14304B0430k29j49l28k0J87R7j24J41m41n55p6M29o64m73l90O76M14J156R37m37
$$ 20430 20201 20052 19724 19704 19891 19988 19864 20005 19564 19009 18933 19362 18698 18225 17835 18511 18925 20081 21018 20581
14284B0581m47qP68m75o7k0J128M18N93J42l36R68J04J284J270n99Q21M13j34
$$ 20581 20134 20126 20894 20419 20352 20332 21460 21878 22471 22613 22277 23245 23349 24633 25903 25304 26125 26538 26404
14265B6404j886j366k26J226K13O15O41K55K9O31K46j358j323j675n2M13m53J59
$$ 26404 24518 23152 22926 24152 24365 24980 25621 25876 25905 26536 26782 25424 24101 22426 22374 22787 22334 22493
14247B2493J78O75R30j05o59j043p33L35J489L09l47l91l2o53m5P06J80m84o9
$$ 22493 22671 23346 24276 24171 23512 22469 21736 22071 23560 23869 23522 23131 23099 22446 22401 23107 23287 22803 22734
14228B2734M31l90J97o46r37J261K90lo07r22o21K03J175O90j075P0J222k86r04
$$ 22734 23165 22775 22972 22326 21389 22650 22940 22937 22330 21408 20787 20990 22165 22855 21780 21850 23072 22786 21882
14209B1882O34J079k29p11j75N69l66j029o45K67R44J021J16o30p18L21O80L5
$$ 21882 22516 23595 23366 22655 22480 23049 22683 21654 21009 21276 22220 23241 23357 22727 22009 22330 23010 23045
14191B3045q8r24P56P39r28m45P41J95O15J95m09J359n4r47P00J22q99j629m49
$$ 23045 22957 22033 22789 23528 22600 22155 22896 23091 23706 23901 23492 24851 24797 23850 24550 24672 23773 22144 21695
14172B1695M27N66R37M1M98R76R94k37j382j016O04l17K56o46J43Ok91L84J028
$$ 21695 22122 22688 23625 23666 24164 25140 26134 25897 24515 23499 24103 23786 24042 23396 23539 23545 23254 23638 24666
14153B4666r18p37R53N07r42q37O04K37R98J119J01j9o68m33L72Q5q74q89Q03
$$ 24666 23748 23011 23964 24471 23529 22692 23296 23533 24531 25650 25751 25732 25064 24631 25003 25088 24214 23325 24128
14134B4128L00L75j3L51J36O73j737r86j2J93l53M02k56M28J358r21k04o5j185
$$ 24128 24428 24803 24790 25141 25277 25950 24213 23227 23215 23408 23055 23457 23201 23629 24987 24066 23862 23797 22612
14115B2612N43Q71O52m02r83m26N45m67l53K60M59N57L37J287O09r21m86L49n30
$$ 22612 23155 24026 24678 24276 23293 22867 23412 22945 22592 22852 23311 23868 24205 25492 26101 25180 24694 25043 24513
14096B4513p6N14j037q29k68N44O12J96L84m24l25N11N61J95o54l75K83J290K85
$$ 24513 24437 24951 23914 23085 22817 23361 23973 24169 24553 24129 23804 24315 24876 25071 24417 24042 24325 25615 25900
14077B5900j03k82l59K01L73j138j439J377O43L94O99M14Q90j029p72M03o6m53
$$ 25900 25797 25515 25156 25357 25730 24592 23153 24530 25173 25567 26266 26680 27570 26541 25769 26172 26106 25653
14059B5653K73L41j31O13R37l3n32l76j038k44k91Q49N35K32k16L24k34j361m57
$$ 25653 25926 26267 26136 26749 27686 27653 27121 26745 25707 25463 25172 26021 26556 26788 26572 26896 26662 25301 24844
14040B4844M04M86J613K18N9k1k66J117l13j656r37J094J431R68p43j249Q74J531
$$ 24844 25248 25734 27347 27565 27624 27603 27337 28454 28141 26485 25548 26642 28073 29041 28298 27049 27923 29454
14022B9454q43o71m70P50m30j517m81P91q3J07J97J027Q62K38o80l17j065L23
$$ 29454 28611 27940 27470 28220 27790 26273 25792 26583 26500 26607 26804 27831 28693 28931 28251 27934 26869 27192
14004B7192J030J138K73r92o44L50P23Q79O9Q63J40j757j138l19J796j39j273
$$ 27192 28222 29360 29633 28641 27997 28347 29070 29949 30018 30881 31021 29264 28126 27807 29603 29464 28191
13987B8191L91J74J03K19j893N16J457j25k70j63J72N26o37m63M63O32M63l64
$$ 28191 28582 28756 28859 29078 27185 27701 29158 29033 28763 28600 28772 29298 28661 28198 28661 29293 29756 29392
13969B9392j076k07J704O46P63L98r2L12q46j335j091o52N51Q59N30M98o10J26
$$ 29392 28316 28109 29813 30459 31222 31620 31528 31840 30994 29659 28568 27916 28467 29326 29856 30354 29744 29870
13951B9870n00N69j08L95j08l24n82j88K87P60O97j092n57J105J33m6J92J417
$$ 29870 29370 29939 29831 30226 30118 29794 29212 29024 29311 30071 30768 29676 29119 30224 30357 30311 30503 31920
13933C1920j15o78j157r98Q5J363P12j83j660J00j031l62J375M27O45L35o61q05
$$ 31920 31805 31127 29970 28972 29057 30420 31132 30949 29289 29389 28358 27996 29371 29798 30443 30778 30117 29312
13915B9312Q20J679L05k36m19k76O46n80m89O24q53L01J427P62o71j675n30O82
$$ 29312 30132 31811 32116 31880 31461 31185 31831 31251 30762 31386 30533 30834 32261 33023 32352 30677 30147 30829
13897C0829J762j56l09K50K36l61l86M92j54M90K30p9o37P7N10K9j71J46l8j33
$$ 30829 32591 32435 32126 32376 32612 32251 31865 32357 32203 32693 32923 32844 32207 32284 32794 32823 32652 32798 32760 32627
13877C2627k31p36o4O91J09j482J94k7K0O9l60m27m13J150R50m02l16O92k65p28
$$ 32627 32396 31660 31596 32287 32396 30914 31108 31081 31101 31170 30810 30383 29970 31120 32070 31668 31352 32044 31779 31051
13857C1051n9N2L52K33R4M50J322p87n00L68J22O19Q68n37m6K94J127r14j366
$$ 31051 30992 31044 31396 31629 31723 32173 33495 32708 32208 32576 32698 33317 34185 33648 33602 33896 35023 34109 32743
13838C2743NM72l42N29J045K82n59K19R6O83j399j47L32Q49L22l08n82j85j40
$$ 32743 32748 33220 32878 33407 34452 34734 34175 34394 34490 35173 33774 33627 33959 34808 35130 34822 34240 34055 33915
13819C3915l32L06P51N48O58m02P85J56O76r1p35Q5Q1o9n56j26M46M20n45k99
$$ 33915 33583 33889 34640 35188 35846 35444 36229 36385 37061 36970 36235 36320 36401 36332 35776 35650 36096 36516 35971 35672
13799C5672O47k92nJ63m0r87P63n96r0q84q29M34j97J148J355J049n64p27J51
$$ 35672 36319 36027 36022 36185 36145 35158 35921 35325 35235 34351 33522 33956 33759 34907 36262 37311 36747 36020 36171
13780C6171M50l03J31M68n02k5M53j001L30K10J270m5m16m37L08R03Q60N84o06
$$ 36171 36621 36318 36449 36917 36415 36390 36843 35842 36172 36382 37652 37607 37191 36754 37062 37965 38825 39409 38803
13761C8803p11p62L10Q99P5o4J93J134k79k07M27N25J126P55o88jl36k97q98j127
$$ 38803 38092 37330 37640 38539 38614 38550 38743 39877 39598 39391 39818 40343 41469 42224 41536 41535 41199 40902 40004 38877
13741C8877Q27M00o83o10J434P79p54k73N65N99J284M78j071j272l11M19l70J46
$$ 38877 39704 40104 39421 38811 40245 41024 40270 39997 40562 41161 42445 42923 41852 40580 40269 40688 40318 40464
13723D0464J167O12m76n57N20J61K57l97M17j47l51k0m43l63q18M7J20p45O86
$$ 40464 41631 42243 41767 41210 41730 41891 42148 41751 42168 42021 41670 41650 41207 40844 40026 40073 40193 39448 40134
13704D0134J572J53m55M82Q05J13K79o00L13m9m62j13j029P07M25l45q91J02O56
$$ 40134 41706 41859 41404 41886 42691 42804 43083 42483 42796 42747 42285 42172 41143 41850 42275 41930 41039 41141 41797
13685D1797K79j83P44m33k44j13k00j19M38N68M10J017O81l02o24l70j38q3M25
$$ 41797 42076 41893 42637 42204 41960 41847 41647 41528 41966 42534 42944 43961 44642 44340 43716 43346 43208 43125 43550
13666D3550J75M86k28p67J80J31N73OJ6M01Q75p28qp78L34J65l09K35J9N88n33
$$ 43550 43725 44211 43983 43216 43396 43527 44100 44106 44122 44523 45398 44670 44662 43884 44218 44383 44074 44309 44328 44916 44383
13645D4383K19P94M01p9q06N51K47q40r0p6O26J074m8j87K67J117q45k159p49
$$ 44383 44602 45396 45797 45718 44912 45463 45710 44870 44780 44704 45330 46404 46356 46169 46436 47553 46708 44549 43800
13626D3800J309J257J8J62p45p64n47P46Q32R91Q60p16j99J039N78o0M06n36r65
$$ 43800 45109 46366 46384 46546 45801 45037 44490 45236 46068 47059 47919 47203 47004 48043 48621 48561 48967 48431 47466
13607D7466J6J095J20p78j24N98k85m24j63P7J78j04K07J187R22M94j39Q79M04
$$ 47466 47482 48577 48697 47919 47795 48393 48108 47684 47521 47598 47776 47672 47879 49066 49988 50482 50343 51222 51626
13588E1626l02p07r62n85k46J10K60K69l39l71O33Q12R0j02K58j19L67K60J046
$$ 51626 51324 50617 49655 49070 48824 48934 49194 49463 49124 48753 49386 50198 50288 50186 50444 50325 50692 50952 51998
13569E1998J100o82Q6J55q55l52q26M14k35k63R44N56J4mJ58L46P78Q9o20m1M28
$$ 51998 53098 52416 52502 52657 51802 51450 50624 51038 50803 50540 51484 52040 52054 52050 52208 52554 53332 53421 52801 52760 53188
13548E3188P8j47k29N23Q09R35l8j514j662J6l22k95L54J230R51J7K59L80o26
$$ 53188 53266 53119 52890 53413 54222 55157 55119 53605 51943 51959 51637 51342 51696 52926 53877 53894 54153 54533 53907
13529E3907L49m75p35J010J376k88m82j46k43m48J25M69O03J045Q59M02j63m17
$$ 53907 54256 53781 53046 54056 55432 55144 54662 54516 54273 53825 53950 54419 55022 56067 56926 57328 57165 56748
13511E6748j011K81P28l78N1J280J193m06j123k89k29n12R8K6q65J46Q24O6NJ
$$ 56748 55737 56018 56746 56368 56419 57699 58892 58486 57363 57074 56845 56333 56431 56457 55592 55738 56562 56628 56633 56634
13491E6634P64N02n40K82n45j070m09J115m07l42J098K5k8L35J80J260P55J014
$$ 56634 57398 57900 57360 57642 57097 56027 55618 56733 56326 55984 57082 57107 57079 57414 57594 58854 59609 60623
13473F0623p13j282j85q50M77O44m43J541J803l93j014j114j27N05Q35l92n89
$$ 60623 59910 58628 58443 57593 58070 58714 58271 59812 61615 61222 60208 59094 58967 59472 60307 59915 59326
13456E9326J10N93J231J384J407o08l55P12j787j852J0J810J337J006n10j474
$$ 59326 59436 60029 61260 62644 64051 63443 63088 63800 62013 60161 60171 61981 63318 64324 63814 62340
13440F2340q7J576K92o74j492j249N43J401P68m37o48q69N53L87l63L15R31P23
$$ 62340 62253 63829 64121 63447 61955 60706 61249 62650 63418 62981 62333 61464 62017 62404 62041 62356 63287 64010
13422F4010O3J133j186r51K77m61J62m23J031n49j56J39l98j78o98p9J312o0N11
$$ 64010 64073 65206 64020 63069 63346 62885 63047 62624 63655 63106 62950 63089 62691 62513 61815 61736 63048 62988 63499
13403F3499O43Q70R49O90O48M51k72N90J6M80m0J78J91J018m83k60j457j775k61
$$ 63499 64142 65012 65961 66651 67299 67750 67478 68068 68084 68564 68524 68702 68893 69911 69428 69168 67711 65936 65675
13384F5675R13k23J737J461R96J027m1m70j028P85J186K15q0o85O52J08O5J418
$$ 65675 66588 66365 68102 69563 70559 71586 71545 71075 70047 70832 72018 72233 72153 71468 72120 72228 72293 73711
13366G3711N11q2k31j219o20J018J142o7l58k75L95J319r19m90J304R21j43o18
$$ 73711 74222 74140 73909 72690 72070 73088 74230 74163 73805 73530 73925 75244 74325 73835 75139 76060 75917 75299
13348G5299Q7M12m79j382k48PO08J664M56J15O8J068m89m83j85K88J00M90Q40
$$ 75299 75386 75798 75319 73937 73689 73696 74304 75968 76424 76539 76607 77675 77186 76703 76518 76806 76906 77396 78236
13329G8236l84L2J066J22j051q9Q32J012Q8p70J350J321L02j570j352Q06Q92m53
$$ 78236 77852 77884 78950 79072 78021 77932 78764 79776 79864 79094 80444 81765 82067 80497 79145 79951 80843 80390
13311H0390n62P52J176k03J059O22m59nL12p09O88L8Q72L52m50p55K09L6K58Q97
$$ 80390 79828 80580 81756 81553 82612 83234 82775 82770 83082 82373 83061 83099 83971 84323 83873 83118 83327 83363 83621 84518
13291H4518P10N09j73j462j282J22j190N80k23L06J466J532J2J74j79M6Q06L24
$$ 84518 85228 85737 85564 84102 82820 82942 81752 82332 82109 82415 83881 85413 85425 85599 85420 85466 86272 86596
13273H6596L93J07m24m11K09n46l16P31J361J200l24M52L27J198O72l26j30j30
$$ 86596 86989 87096 86672 86261 86470 85924 85608 86339 87700 88900 88576 89028 89355 90553 91225 90899 90769 90639
13255I0639P16l48P3J264k60r32r09L19J606J547M81L3j28o05o4L24j08m58j093
$$ 90639 91355 91007 91080 92344 92084 91152 90243 90562 92168 93715 94196 94229 94101 93496 93432 93756 93648 93190 92097
13236I2097O50J096K04L49O94j00L42Q87K36L6l86R21J169o11mJ097j89RJ23L39
$$ 92097 92747 93843 94047 94396 95090 94990 95332 96219 96455 96491 96105 97026 98195 97584 97580 98677 98488 98497 98620 98959
13216I8959l85M15Q13j43k04q9q33P75J068J079Q49n9Q81R14n63n62J99J72p73
$$ 98959 98574 98989 99802 99659 99455 99366 98533 99308 100376 101455 102304 102245 103126 104040 103477 102915 103114 103286 102513
13197A02513L9O22Q78O93J20n03k37R21J421J043N05j365n73k28J067J114P0l42
$$ 102513 102552 103174 104052 104745 104865 104362 104125 105046 106467 107510 108015 106650 106077 105849 106916 108030 108100 107758
13179A07758l79L66K08K80J033J687o99j201K99J346O97n57o87J411R31k10R41
$$ 107758 107379 107745 107953 108233 109266 110953 110254 109053 109352 110698 111395 110838 110151 111562 112493 112283 113224
13162A13224l82J91L93J54k97Q22P05n82L97L1J037l5j66j9K12j24J6R59J073
$$ 113224 112842 113033 113426 113580 113283 114105 114810 114228 114625 114656 115693 115658 115492 115473 115685 115561 115577 116536 117609
13143A17609k03J027M55J83R67j22j459J258J666M04N64L63O13P88M38R17O47
$$ 117609 117406 118433 118888 119071 120038 119916 118457 119715 121381 121785 122349 122712 123325 124113 124551 125468 126115
13126A26115m74n49J418R3J7k24j398P1J59o70N41J609J94p27J348L5M80Q96J36
$$ 126115 125641 125092 126510 126603 126620 126396 124998 125069 125228 124558 125099 126708 126902 126175 127523 127558 128038 128934 129070
13107A29070K30Q27N51J92r21m74J235n08m6R46j187j49O8l3P21J053R18r6J96
$$ 129070 129300 130127 130678 130870 129949 129475 130710 130202 130156 131102 129915 129766 129834 129801 130522 131575 132493 132397 132593
13088A32593J161J244J415K137Q81l22j81J28J87R39J601Q32N81l54Q76m71l86
$$ 132593 133754 134998 136413 138550 139431 139109 138928 139056 139243 140182 141783 142615 143196 142842 143718 143247 142861
13071A42861K34j3j11k2J348M27j85j48J81N83K80J040R48j49j99J41k62k51Q92
$$ 142861 143095 143082 142971 142949 144297 144724 144539 144391 144572 145155 145435 146475 147423 147274 147075 147216 146954 146703 147595
13052A47595J620J143L95Q96Q87j13n11r0L31J420Q28Q00O63n46M3J371J730Q25
$$ 147595 149215 150358 150753 151649 152536 152423 151912 151822 152153 153573 154401 155201 155864 155318 155361 156732 158462 159287
13034A59287J07k74K99J02K07R00K5K63P15K146J561P54P96K70J03R60O70N05
$$ 159287 159394 159120 159419 159521 159728 160628 160653 160916 161631 163777 165338 166092 166888 167158 167261 168221 168891 169396
13016A69396M54J125L78r29O4P04J410J022r55r7M63O5j146J157J733K268R16
$$ 169396 169850 170975 171353 170424 170488 171192 172602 173624 172669 172572 173035 173100 171954 173111 174844 177112 178028
12999A78028k17J291K458m25M40j264l80J609K025P78l98L87J061L82J715J173
$$ 178028 177811 179102 181560 181135 181575 180311 179931 181540 183565 184343 183945 184332 185393 185775 187490 188663
12983A88663K4l61O72Q90N38J92J685R32N31R51J022R08J617O67O74J176O55N76
$$ 188663 188687 188326 188998 189888 190426 190618 192303 193235 193766 194717 195739 196647 198264 198931 199605 200781 201436 202012
12965B02012K30K06J621Q70j04n8J079J537J750N75L07K34P60J403L90q91P90
$$ 202012 202242 202448 204069 204939 204835 204777 205856 207393 209143 209718 210025 210259 211019 212422 212812 211921 212711
12948B12711K356J414N43J169Q91K93k7J148K368K009M50R83M50N13P50J295J259
$$ 212711 215067 216481 217024 218193 219084 219377 219350 220498 222866 224875 225325 226308 226758 227271 228021 229316 230575
12931B30575P55J980J277K66K40M44J757K091J316j05J222K166J30J602J562R65
$$ 230575 231330 233310 234587 234853 235093 235537 237294 239385 240701 240596 241818 243984 244114 245716 247278 248243
12915B48243j23J84J943J462L13J04L65N31J350K042K004M90J437J820J768R30
$$ 248243 248120 248304 250247 251709 252022 252126 252491 253022 254372 256414 258418 258908 260345 262165 263933 264863
12899B64863J082J698M35J423K653J848R47Q66N94J975K196J449J127L29J127
$$ 264863 265945 267643 268078 269501 272154 274002 274949 275815 276409 278384 280580 282029 283156 283485 284612
12884B84612J66R25J205L96P39Q14J049L363L286J786J525O22J044O95K98J875
$$ 284612 284778 285703 286908 287304 288043 288857 289906 293269 296555 298341 299866 300488 301532 302227 302525 304400
12868C04400K719K218J356N19O75O60J138J80J003J565J893K226J274K879K488
$$ 304400 307119 309337 310693 311212 311887 312547 313685 313865 314868 316433 318326 320552 321826 324705 327193
12853C27193L00J270Q46J675J831J190K047K079Q57P56N20J04J080K273K101J613
$$ 327193 327493 328763 329609 331284 333115 334305 336352 338431 339288 340044 340564 340668 341748 344021 346122 347735
12837C47735J203Q93J379L452K422K995K274J269J330J089P51M89J488L866J776
$$ 347735 348938 349831 351210 354662 357084 360079 362353 363622 364952 366041 366792 367281 368769 372635 374411
12822C74411J798L516K194J376J229K134L490L732K808P13J638K707J949J943
$$ 374411 376209 379725 381919 383295 384524 386658 390148 393880 396688 397401 399039 401746 403695 405638
12808D05638L369K378J558J374K979L074L038J560K158K503K575K217K737K490
$$ 405638 409007 411385 412943 414317 417296 420370 423408 424968 427126 429629 432204 434421 437158 439648
12794D39648J777J690K622L527K321K536K588K044J854K095L321L077K555L179
$$ 439648 441425 443115 445737 449264 451585 454121 456709 458753 460607 462702 466023 469100 471655 474834
12780D74834L962L656L328K863K616L254M408O282N126M935M405K992L851M217
$$ 474834 478796 482452 485780 488643 491259 494513 498921 505203 510329 515264 519669 522661 526512 530729
12766E30729K676L211L982M686L562L609L574L720M039M041M303M273N406M567
$$ 530729 533405 536616 540598 545284 548846 552455 556029 559749 563788 567829 572132 576405 581811 586378
12752E86378K834L605M869L692L248L405M551M534L162M325M117K798L493L767
$$ 586378 589212 592817 597686 601378 604626 608031 612582 617116 620278 624603 628720 631518 635011 638778
12738F38778M659M516L643L844M526M593M839M456L549L324M354N432M503M463
$$ 638778 643437 647953 651596 655440 659966 664559 669398 673854 677403 680727 685081 690513 695016 699479
12724F99479N423M353L937N177N277N004M494M815M639N175L878L321M220N792
$$ 699479 704902 709255 713192 718369 723646 728650 733144 737959 742598 747773 751651 754972 759192 764984
12710G64984O678N276N100N337O171P363N892N314O522P537P885P504O794O360
$$ 764984 771662 776938 782038 787375 793546 800909 806801 812115 818637 826174 834059 841563 848357 854717
12696H54717N858P258O696O079Q147Q452P529O622P731Q302P556Q281R836Q810
$$ 854717 860575 867833 874529 880608 888755 897207 904736 911358 919089 927391 934947 943228 953064 961874
12682I61874Q036Q506P726Q755R058R216P925P990R705R784J0045J0365J1478
$$ 961874 969910 978416 986142 994897 1003955 1013171 1021096 1029086 1038791 1048575 1058620 1068985 1080463
12669A080463J1095J0254J1030J0512J0587J0959J0976J1319J1049J1801J2891
$$ 1080463 1091558 1101812 1112842 1123354 1133941 1144900 1155876 1167195 1178244 1190045 1202936
12658A202936J3213J3326J2636J2604J3334J3278J2772J2169J3499J4829J3802
$$ 1202936 1216149 1229475 1242111 1254715 1268049 1281327 1294099 1306268 1319767 1334596 1348398
12647A348398J5303J6178J5389J5329J5538J6160J6746J7435J7264J6845J7224
$$ 1348398 1363701 1379879 1395268 1410597 1426135 1442295 1459041 1476476 1493740 1510585 1527809
12636A527809J7715J7078J7953J9251J9588J9957K0914K0695K1627K1581K1624
$$ 1527809 1545524 1562602 1580555 1599806 1619394 1639351 1660265 1680960 1702587 1724168 1745792
12625A745792K2706K2342K5220K5896K4874K5334K5039K6689K6288K6714K8388
$$ 1745792 1768498 1790840 1816060 1841956 1866830 1892164 1917203 1943892 1970180 1996894 2025282
12614B025282K9060K8946K9686L3193L2769L2456L1641L2363L4484L4749L5136
$$ 2025282 2054342 2083288 2112974 2146167 2178936 2211392 2243033 2275396 2309880 2344629 2379765
12603B379765L6523L7305L7518L7344L8043L8240L9747M1357M2153M2717M2929
$$ 2379765 2416288 2453593 2491111 2528455 2566498 2604738 2644485 2685842 2727995 2770712 2813641
12592B813641M4546M6682M7586M7643M8391N0233N0325N2233N5334N6840N8683
$$ 2813641 2858187 2904869 2952455 3000098 3048489 3098722 3149047 3201280 3256614 3313454 3372137
12581C372137N8674N8126O1501O3529O4560O5944O6772O7738O9761P2798P4818
$$ 3372137 3430811 3488937 3550438 3613967 3678527 3744471 3811243 3878981 3948742 4021540 4096358
12570D096358P4497P6419P9115Q1279Q3424Q5396Q8017R0115R2738R5868R6460
$$ 4096358 4170855 4247274 4326389 4407668 4491092 4576488 4664505 4754620 4847358 4943226 5039686
12559E039686R8923J02743J06259J09650J10873J13690J17458J20111J23745J28053
$$ 5039686 5138609 5241352 5347611 5457261 5568134 5681824 5799282 5919393 6043138 6171191
12549F171191J31917J35262J38823J42350J46279J48913J53241J57071J61468
$$ 6171191 6303108 6438370 6577193 6719543 6865822 7014735 7167976 7325047 7486515
12540G486515J65157J70309J75599J79827J84153J89240J93915J97427K01163
$$ 7486515 7651672 7821981 7997580 8177407 8361560 8550800 8744715 8942142 9143305
12531I143305K07359K13290K17604K23245K27865K32137K36658K40249K44530
$$ 9143305 9350664 9563954 9781558 10004803 10232668 10464805 10701463 10941712 11186242
12522A1186242K48397K51378K57124K60108K63340K65924K68911K69879K71863
$$ 11186242 11434639 11686017 11943141 12203249 12466589 12732513 13001424 13271303 13543166
12513A3543166K73963K73608K72906K69897K68487K66602K62355K58989K53246
$$ 13543166 13817129 14090737 14363643 14633540 14902027 15168629 15430984 15689973 15943219
12504A5943219K48115K40834K31573K22893K13697K01968J92166J78718J64458
$$ 15943219 16191334 16432168 16663741 16886634 17100331 17302299 17494465 17673183 17837641
12495A7837641J50911J37376J22155J06541R2065P5837N5773L9337K4586P719
$$ 17837641 17988552 18125928 18248083 18354624 18446689 18522526 18578299 18617636 18642222 18649941
12485A8649941q543k4937l9877n3531o9071q4690r7019j10414j22865j34726j45518
$$ 18649941 18641398 18616461 18576584 18523053 18453982 18369292 18272273 18161859 18038994 17904268 17758750
12474A7758750j53778j60986j68529j76408j84320j90820j96173k00558k06277
$$ 17758750 17604972 17443986 17275457 17099049 16914729 16723909 16527736 16327178 16120901
12465A6120901k07697k10470k15176k17508k19158k20214k21365k22548k21885
$$ 16120901 15913204 15702734 15487558 15270050 15050892 14830678 14609313 14386765 14164880
12456A4164880k21949k22220k24072k21577k19870k20222k20183k18470k18019
$$ 14164880 13942931 13720711 13496639 13275062 13055192 12834970 12614787 12396317 12178298
12447A2178298k15361k12329k11613k09102k07960k05257k03463j99056j96065
$$ 12178298 11962937 11750608 11538995 11329893 11121933 10916676 10713213 10514157 10318092
12438A0318092j93900j91321j88674j87539j85169j80493j78244j74955j71796
$$ 10318092 10124192 9932871 9744197 9556658 9371489 9190996 9012752 8837797 8666001
12429H666001j69015j66285j64381j62776j57817j54385j52776j51152j47856
$$ 8666001 8496986 8330701 8166320 8003544 7845727 7691342 7538566 7387414 7239558
12420G239558j43230j40084j37812j34553j31046j28611j26021j22622j19732
$$ 7239558 7096328 6956244 6818432 6683879 6552833 6424222 6298201 6175579 6055847
12411F055847j16140j13728j10990j09055j05925j01461r9129r7722r7846r9184
$$ 6055847 5939707 5825979 5714989 5605934 5500009 5398548 5299419 5201697 5103851 5004667
12401E004667r9242r6444r4066r2079q7729q5304q2418q1270p7895p6355p4592
$$ 5004667 4905425 4808981 4714915 4622836 4535107 4449803 4367385 4286115 4208220 4131865 4057273
12390D057273p2820p1539o7704o5952o3982o1973n9194n6849n5005n2927m9313
$$ 4057273 3984453 3912914 3845210 3779258 3715276 3653303 3594109 3537260 3482255 3429328 3380015
12379C380015m7479m5958m5327m2912m0503l4837k3691o833J6455L7580L6142
$$ 3380015 3332536 3286578 3241251 3198339 3157836 3122999 3099308 3092475 3108930 3146510 3182652
12368C182652n792o8357j08379j12460r5415p5318o2901n5991n0697m6461m2942
$$ 3182652 3176860 3108503 3000124 2887664 2792249 2716931 2654030 2598039 2547342 2500881 2457939
12357B457939m1015l9156l6188l4725l4024l1732l0473k8750k6654k8513k7826
$$ 2457939 2416924 2377768 2341580 2306855 2272831 2241099 2210626 2181876 2155222 2126709 2098883
12346B098883k7449k7580k6596k4929k2203k0021j7586j6805j5270j6235j9788
$$ 2098883 2071434 2043854 2017258 1992329 1970126 1950105 1932519 1915714 1900444 1884209 1864421
12335A864421k0273k0534k1247j9756j8875j4089j5345k0749k3106k5676k1572
$$ 1864421 1844148 1823614 1802367 1782611 1763736 1749647 1734302 1713553 1690447 1664771 1643199
12324A643199j7201j7592j9001j7849j5280j4109j5302j6364j6296j6481j6034
$$ 1643199 1625998 1608406 1589405 1571556 1556276 1542167 1526865 1510501 1494205 1477724 1461690
12313A461690j7414j7877j7046j6687j6567j6192j4025j2676j4278j3346j2881
$$ 1461690 1444276 1426399 1409353 1392666 1376099 1359907 1345882 1333206 1318928 1305582 1292701
12302A292701j2337j1947j1039j0439r259j0833j2566j2207j0399p221j933M814
$$ 1292701 1280364 1268417 1257378 1246939 1237680 1226847 1214281 1202074 1191675 1184454 1182521 1187335
12290A187335J1786J0981P939N120K918K785K031K123O029P413J1840J4764J6760
$$ 1187335 1199121 1210102 1218041 1223161 1226079 1228864 1230895 1233018 1239047 1246460 1258300 1273064 1289824
12277A289824K0025K7829L8918M7772N1137N6041O8921J01696J70851K81002M19858
$$ 1289824 1309849 1337678 1376596 1424368 1475505 1531546 1600467 1702163 1873014 2154016 2573874
12266B573874N07703L65561o7358m16558m71025l61195k45297j70229j22667r3143
$$ 2573874 3081577 3447138 3379780 2963222 2492197 2131002 1885705 1715476 1592809 1499666
12256A499666p4673o0717n1165m0684l4877l2953k8062k3394k0464j8071j6593
$$ 1499666 1424993 1364276 1313111 1272427 1237550 1204597 1176535 1153141 1132677 1114606 1098013
12245A098013j3914j0430r148r288p719o588o999n417k526j678r8P35j933p238
$$ 1098013 1084099 1073669 1064521 1055233 1047514 1040926 1033927 1028510 1025984 1024306 1024208 1024943 1023010 1015772
12231A015772j1016j3645j5764j8178j8733j8209j7440j6823j5195j4431j3306
$$ 1015772 1004756 991111 975347 957169 938436 920227 902787 885964 870769 856338 843032
12220H43032j2358j1651j0176j0623j1419r302p973o461p107o128m955m383j890
$$ 843032 830674 819023 808847 798224 786805 777503 769530 763069 755962 749834 744879 740496 738606
12207G38606K396O020R161N257n252r386j1286j4666r037n911j162o13n784j2022
$$ 738606 741002 747022 756183 761440 756188 746802 735516 720850 711813 705902 704740 704127 698343 686321
12193F86321j4338j3219j1041r429o785m489k710m055l692m362l004l440n066
$$ 686321 671983 658764 647723 638294 631509 627020 624310 620255 616563 612201 609197 605757 600691
12180F00691m565m097n204n168m214n508n632m266l170k118j245k944l635k893
$$ 600691 596126 592029 586825 581657 577443 571935 566303 562037 558867 556749 555504 552560 548925 546032
12166E46032l932l407k925k521o12j523l130m476o197o310n598n072l336k007
$$ 546032 542100 538693 535768 533247 532635 531112 527982 523506 517309 510999 505401 500329 496993 494986
12152D94986m45j40j954m60o8k437N6J037j38j873l429l556k172o39J116K941
$$ 494986 494541 494401 492447 491987 491919 489482 489538 490575 490437 488564 485135 481579 479407 478768 479884 482825
12136D82825K330J156N1m46k339l898k315k368k696m287o783o637o506l648p69
$$ 482825 485155 486311 486362 485916 483577 479679 477364 474996 472300 468013 461230 454593 448087 444439 443670
12121D43670K39N5J157J670K114K680K313L133M157L176o53k957m236m746m742
$$ 443670 443909 443964 445121 446791 448905 451585 453898 457031 461188 464364 463711 460754 456518 451772 447030
12106D47030j930L129K726L673M282N239N318N760O866O114O742Q103O614N783
$$ 447030 445100 448229 450955 454628 458910 464149 469467 475227 482093 488207 494949 503052 509666 515449
12092E15449O523J0120J4436J3696J4535K4234M4360N9892P2350Q9146Q8657P0833
$$ 515449 521972 532092 546528 560224 574759 598993 643353 703245 775595 864741 953398 1024231
12080A024231M6160M3943K6735m653L6896J2426r8083j65626j19765p2330m2091
$$ 1024231 1070391 1114334 1141069 1136416 1173312 1185738 1087655 922029 802264 729934 687843
12069F87843l8851k1198j5531j7761j2912j0395j2201j1668j1737j1954j2405
$$ 687843 648992 627794 612263 594502 581590 571195 558994 547326 535589 523635 511230
12058E11230j0525p036m417m212j405j05k7o8p09P24P45J94m94k345n691n690
$$ 511230 500705 493669 489252 485040 483635 483530 483503 483435 482726 483450 484195 484389 483895 481550 475859 470169
12042D70169n422m513l482j600l91J159K183M697P966J1407J4660J5826J5866
$$ 470169 464747 460234 456752 455152 454761 455920 458103 462800 470766 482173 496833 512659 528525
12029E28525J3646P883K645j050m681n198k638l46J505M772P645Q820J1626J3512
$$ 528525 542171 550054 552699 551649 546968 541770 539132 538786 540291 545063 552708 561528 573154 586666
12015E86666J4949J6402J5297J2800O473j030r138j2279j2877j2429j0575q061
$$ 586666 601615 618017 633314 646114 652587 651557 642419 630140 617263 604834 594259 586198
12003E86198m649r87K993M461O59n097r520j0391q883l581P90J164p6k719p11
$$ 586198 581549 580562 583555 588016 588675 583578 574058 563667 554784 551203 551993 553157 553081 550362 549651
11988E49651J709M096P056R326Q438O488O809L942q65n826n986l335m91K317O248
$$ 549651 551360 555456 562512 571838 580276 586764 593573 597515 596650 590824 584838 581503 581012 583329 589577
11973E89577J1219J1154N642q40n181q367p225p679q991k818J1130K5896L8139
$$ 589577 600796 611950 617592 616752 611571 603204 595979 588300 579309 576491 587621 613517 651656
11960F51656M5403M7449L8591L0195K4214K1056K1756K0864J8709J0385r359n9643
$$ 651656 697059 744508 783099 813294 837508 858564 880320 901184 919893 930278 920919 861276
11948H61276p9538k299Q6624Q1559L8130J4269P920J3380K1712K5940K6548K5044
$$ 861276 781738 779439 866063 947622 985752 1000021 1007941 1021321 1043033 1068973 1095521 1120565
11936A120565K6631K5629K5406K8195L1812M2238O0071Q0946J06613J32171J48806
$$ 1120565 1147196 1172825 1198231 1226426 1258238 1300476 1360547 1441493 1548106 1680277 1829083
11925A829083J42496R8897L1125k6883m7786l7496k2470o601P527J9909L2859
$$ 1829083 1971579 2070476 2101601 2074718 2026932 1989436 1966966 1960365 1967892 1987801 2020660
11914B020660M4512N5385O2560P0009P3421P3271P2012O5564N5789M7741M4794
$$ 2020660 2065172 2120557 2183117 2253126 2326547 2399818 2471830 2537394 2593183 2640924 2685718
11903B685718M2947M6022N1605N5166N8409O4241O9046P0736O8142O6822P1064
$$ 2685718 2728665 2774687 2826292 2881458 2939867 3004108 3073154 3143890 3212032 3278854 3349918
11892C349918P2915P5671P8559Q1737Q2691Q5613Q5703Q0705P2062O8626P3496
$$ 3349918 3422833 3498504 3577063 3658800 3741491 3827104 3912807 3993512 4065574 4134200 4207696
11881D207696Q2862Q8657R4441R5188Q7357P9411P7122R0864J14314J29685J38812
$$ 4207696 4290558 4379215 4473656 4568844 4656201 4735612 4812734 4903598 5017912 5147597 5286409
11870E286409J41836J43770J49697J66786J96354K30620K57602K79199L01744
$$ 5286409 5428245 5572015 5721712 5888498 6084852 6315472 6573074 6852273 7154017
11861G154017L19598L28779L37811L43573L57955L85094M24009M85628N58571
$$ 7154017 7473615 7802394 8140205 8483778 8841733 9226827 9650836 10136464 10695035
11852A0695035O38943P31971Q29209R30353J039700J164392J321074J524083J768802
$$ 10695035 11333978 12065949 12895158 13825511 14865211 16029603 17350677 18874760 20643562
11843B0643562K061539K407838K821035L343154L996019M687250N340199O002239
$$ 20643562 22705101 25112939 27933974 31277128 35273147 39960397 45300596 51302835
11835E1302835O799725P940236R450005J0966910J1841911J2516479J4430368
$$ 51302835 58102560 66042796 75492801 86459711 98301622 110818101 125248469
11828A25248469J8460929K5774164L6315153M5864805M6461340L1640138L229075
$$ 125248469 143709398 169483562 205798715 251663520 298124860 329764998 332994073
11821C32994073k4815189m1681878m4666214l6765317k7733767k0819010j5870708
$$ 332994073 308178884 266497006 221830792 185065475 157331708 136512698 120641990
11814A20641990j2368465r889167q112634o742103n647995m773617m079821l518555
$$ 120641990 108273525 98384358 90271724 83529621 77881626 73108009 69028188 65509633
11806F5509633l057992k663858k324683k029020j771908j533700j305958j103434
$$ 65509633 62451641 59787783 57463100 55434080 53662172 52128472 50822514 49719080
11798D9719080r30236p58106n70320l57827j28841J32813M20152O59060M26075
$$ 49719080 48788844 48030738 47460418 47102591 46973750 47106563 47526715 48185775 48611850
11789D8611850l25510p93037r66154j220481j613203j885136k012044k021423
$$ 48611850 48286340 47493303 46527149 45306668 43693465 41808329 39796285 37774862
11781C7774862j968614j883280j786423j700045j618324j533640j438998j343642
$$ 37774862 35806248 33922968 32136545 30436500 28818176 27284536 25845538 24501896
11773B4501896j263658j197392j142074j093262j040741r80363r11583q52213
$$ 24501896 23238238 22040846 20898772 19805510 18764769 17784406 16872823 16020610
11765A6020610q01886p58218p17567o73954o28675n89223n52294n16484m86024
$$ 16020610 15218724 14460506 13742939 13068985 12440310 11851087 11298793 10782309 10296285
11756A0296285m64192m44901m20541l97713l77851l61259l44584l26556l11987
$$ 10296285 9832093 9387192 8966651 8568938 8191087 7829828 7485244 7158688 6846701
11747F846701k99140k85614k75303k65147k56804k47345k36734k29578k20410
$$ 6846701 6547561 6261947 5986644 5721497 5464693 5217348 4980614 4751036 4530626
11738D530626k02477j83371j65387j56074j52906j48827j43249j43021j42308
$$ 4530626 4328149 4144778 3979391 3823317 3670411 3521584 3378335 3235314 3093006
11729C093006j41281j36867j28083j15911j02166r0741q1722q0029q4003q5951
$$ 3093006 2951725 2814858 2686775 2570864 2468698 2377957 2296235 2216206 2132203 2046252
11719B046252q4149q2097p7619p5975p5774p4924p7287q3325r0336r2598q7436
$$ 2046252 1962103 1880006 1802387 1726412 1650638 1575714 1498427 1415102 1324766 1232168 1144732
11708A144732p6503o1439m5412l2674k4973j4872n074n971N824P8537K18070L28845
$$ 1144732 1068229 1006790 961378 928704 903731 888859 883785 877814 883638 962175 1180245 1509090
11696A509090K97214J62281Q917j19741j85511j88957j59943j25131r6040p4363
$$ 1509090 1806304 1968585 1977502 1857761 1672250 1483293 1323350 1198219 1102179 1027816
11686A027816n7998m4946l4106k7506k2371j5398j1956j4397j7335k1991k0812
$$ 1027816 969818 924872 890766 863260 840889 825491 813535 799138 781803 759812 739000
11675G39000j5081q725m14R048J6636J8501J2250Q100J4529J7848J8396K3339
$$ 739000 723919 715194 714780 723828 740464 758965 771215 779315 793844 811692 830088 853427
11663H53427L0438L7212M0682M1119M2081L9539L3195K5452K2757K0389K0556
$$ 853427 883865 921077 961759 1002878 1044959 1084498 1117693 1143145 1165902 1186291 1206847
11652A206847K0914J4316N222k217o306p229n974m090k441m273m570o742j0351
$$ 1206847 1227761 1242077 1247299 1245082 1238776 1231547 1225573 1221483 1219042 1214769 1210199 1203457 1193106
11639A193106j4287j8737k1798j9187j5643r783m099J274Q556J6942L1191M2539
$$ 1193106 1178819 1160082 1138284 1119097 1103454 1093671 1089572 1090846 1099402 1116344 1147535 1190074
11627A190074M2875K6942m449l8233n8680o2291n3735m3824l7904l2076k4251
$$ 1190074 1232949 1259891 1255442 1217209 1158529 1096238 1042503 998679 960775 928699 904448
11616I04448j7355j1769p737n569m133o291j2244j3713j4993j6558j7459k0077
$$ 904448 887093 875324 867587 862018 857885 851594 839350 825637 810644 794086 776627 756550
11604G56550k2347k3509k2868k1673j8507j6967j3182r998p928r517r652p667
$$ 756550 734203 710694 687826 666153 647646 630679 617497 607499 599571 590054 580402 572735
11592E72735o041p265o446p760j0200j3770j5622j3100q974n787l057O316Q141
$$ 572735 566694 559429 552983 545223 535023 521253 505631 492531 483557 477770 474713 481029 489170
11579D89170K045K174R958J4241P546M659J3953J7925k546j0622Q527J1777k4847
$$ 489170 491215 493389 503347 517588 525134 529793 543746 561671 559125 548503 557030 568807 543960
11566E43960l9050l1152k5311k4106k0924j7500j9286j8822j8942j8587j5986
$$ 543960 504910 473758 448447 424341 403417 385917 366631 347809 328867 310280 294294
11555B94294j3751j2186j1650r760q066n406l524l691k539j442L52R25L259M876
$$ 294294 280543 268357 256707 246947 238881 233475 229951 226260 223721 222279 222631 223556 226815 231691
11541B31691M585O049N012K849k69l03K011N482R066J2162J4749J7377K0366K3615
$$ 231691 236276 242325 247337 250186 249917 249614 251625 257107 266173 278335 293084 310461 330827 354442
11527C54442K4157K5544K6492K9167L4179L8069M0205M5114N3771O5641Q1845
$$ 354442 378599 404143 430635 459802 493981 532050 572255 617369 671140 736781 818626
11516H18626R3691J01290J10530J27167J56093J96429K38511K67188K99168L67063
$$ 818626 912317 1013607 1124137 1251304 1407397 1603826 1842337 2109525 2408693 2775756
11506B775756N07490P67278J168589J645006J914152J449486Q9812j233677j698618
$$ 2775756 3283246 4050524 5219113 6864119 8778271 10227757 10317569 9083892 7385274
11497G385274j478920j084677p64590n44088l99173l03500k37698j91174j57380
$$ 7385274 5906354 4821677 4057087 3512999 3113826 2810326 2572628 2381454 2224074
11488B224074j30589j08564q9039p2021o3291o1066n9972n6625m9676m1641l3963
$$ 2224074 2093485 1984921 1895882 1823861 1760570 1699504 1639532 1582907 1533231 1491590 1457627
11477A457627k8634k2368j7524j3084n964N6N788J1415J0538l978j7981k3115
$$ 1457627 1428993 1406625 1389101 1376017 1370053 1370109 1375897 1387312 1397850 1393872 1375891 1352776
11465A352776k3472k8346l1291l6776m7252n9825o5470o1269n4517m7829m3533
$$ 1352776 1329304 1300958 1269667 1232891 1185639 1125814 1060344 999075 944558 896729 853196
11454H53196m3098m0768l9394l8000l4032l3171l3588l0137k4278k0992j6119
$$ 853196 810098 769330 729936 691936 657904 624733 591145 561008 536730 515738 499619
11443D99619j2309r173m465m053j2603j9097j9599j6936j6969j5316j5774j5602
$$ 499619 487310 478137 473672 469619 457016 437919 418320 401384 384415 369099 353325 337723
11431C37723j6069j7043j5548j4592j2525j1221j1958j0571j0045j0589j0672
$$ 337723 321654 304611 289063 274471 261946 250725 238767 228196 218151 207562 196890
11420A96890q735q323q243p821q158p754n286m290l516l094k656j596k131j821
$$ 196890 188155 179832 171589 163768 155610 147856 142570 138280 134764 131670 129014 127418 125287 123466
11406A23466j28M37Q20K801K643M539M725L901K626K720K843M918O318N501O438
$$ 123466 123338 123775 124595 127396 130039 134578 139303 143204 145830 148550 151393 156311 162629 168130 174568
11391A74568N637O942R774J2895J7110K1246K5740L3426M3124N1559N6520N8496
$$ 174568 180205 187147 196921 209816 226926 248172 273912 307338 350462 402021 458541 517037
11379E17037O7963Q8658J35079K20320L49265M90073N11773K35832k23600m63625
$$ 517037 585000 673658 808737 1029057 1378322 1868395 2380168 2616000 2392400 1928775
11369A928775m33090l09101k08356j43696j01611p4617n5061m4605l7883l0532
$$ 1928775 1495685 1186584 978228 834532 732921 658304 603243 558638 520755 490223
11359D90223k5977j7896j0536l433Q91K657O90j799n700o844p292o799n251l180
$$ 490223 464246 446350 435814 432381 433272 435929 436619 434820 429120 422276 414984 408185 402934 399754
11345C99754k092j210P8K989N301K816m887n446o673r476j4376j5238j6405j4472
$$ 399754 397662 396452 396530 399519 404820 407636 402749 397303 390630 381154 366778 351540 335135 320663
11331C20663j3046j2863j1650j1103j0018r137q151q322o922m276l427m653m952
$$ 320663 307617 294754 283104 272001 261983 252846 244695 236373 229451 225175 221748 217095 212143
11318B12143m987n684o814o234o315p083n299l379k327k982m701l715l202l664
$$ 212143 207156 201472 194658 188424 182109 175026 169727 166348 164021 161039 156338 152623 149421 145757
11304A45757l794o087m696m619m895n792n353m771m096l255j600j136k658k297
$$ 145757 141963 135876 131180 126561 121666 115874 110521 105750 101654 98399 96799 95663 93005 90708
11290I0708k951k492k824l919k987k166m074l544l815k341q9L27K67P99j094j481
$$ 90708 87757 85265 82441 78522 75535 73369 69295 65751 61936 59595 59506 59833 60100 60899 59805 58324
11274E8324n24l49j239q69k059k478j700o28k72r47n20j077J71J187K495J194
$$ 58324 57800 57451 56212 55343 53284 50806 49106 48478 48206 47259 46739 45662 45833 47020 49515 50709
11258E0709q67j449l61J43r07m03J39n70p83o60p19K102K415Q19p45J88q85j953
$$ 50709 49842 48393 48032 48175 47268 46865 47004 46434 45651 44991 44272 46374 48789 49608 48863 49051 48166 46213
11240D6213J23j774m98J265J247P97n28l60N91J186J460n10R35J856J80j73o49
$$ 46213 46336 44562 44064 45329 46576 47373 46845 46485 47076 48262 49722 49212 50147 52003 52183 52010 51361
11223E1361q78J25M43P42J099Q17m01k98M9O68J094J175p55q26J708J438J285
$$ 51361 50483 50608 51051 51793 52892 53709 53308 53010 53059 53727 54821 55996 55241 54415 56123 57561 58846
11206E8846J159J113Q63J011R11J80o31l51k64j083j242j80J94j82m65o40k40
$$ 58846 60005 61118 61981 62992 63903 64083 63452 63101 62837 61754 60512 60332 60526 60344 59879 59239 58999
11189E8999l01j668j914j517q85j511j579q70P5r50k370o63r54o87k08j601m73
$$ 58999 58698 57030 55116 53599 52714 51203 49624 48754 48829 47879 45509 44846 43892 43205 42997 41396 40923
11172D0923j377j646r59j659k001k166l152k743j767r41p4R43N78j33k04j737
$$ 40923 39546 37900 36941 35282 33281 31115 27963 25220 23453 22512 22438 23381 23959 23826 23622 21885
11156B1885r97q61l88Q31o3N80m8j362k71K19J24o32l86j47j97n58q81l33O72
$$ 21885 20888 20027 19639 20470 20407 20987 20939 19577 19306 19525 19649 19017 18631 18484 18287 17729 16848 16515 17187
11137A7187J190J850Q42r9j244k67K67k82q59l32J322j90j781j137m58k32p32
$$ 17187 18377 20227 21069 20970 19726 19459 19726 19444 18585 18253 19575 19385 17604 16467 16009 15777 15045
11120A5045O6p12l42M49l29M48J321m56j77n4j105r66O16Q86J677J758R45M35
$$ 15045 15111 14399 14057 14506 14177 14625 15946 15490 15313 15259 14154 13188 13804 14690 16367 18125 19070 19505
11102A9505k87j494J98J765Q12L41J376Q01j37J725J441P25O25r49r88m20K85
$$ 19505 19218 17724 17922 19687 20499 20840 22216 23017 22880 24605 26046 26771 27396 26447 25459 25039 25324
11085B5324J09M57n3J090J551R70O60M92j68l09j091J42L13p35p76q94j001j37
$$ 25324 25433 25890 25837 26927 28478 29448 30108 30600 30432 30123 29032 29174 29487 28752 27976 27082 26081 25944
11067B5944O72O35J110J231Q12J707J821J937M78K24K507K404M442P431Q377P681
$$ 25944 26616 27251 28361 29592 30404 32111 33932 35869 36347 36571 39078 41482 45924 53355 61732 69413
11051F9413J322n819r314q836o262o180n088l508l067j240p40j694k162k260o59
$$ 69413 70735 64916 55602 46766 40504 34324 29236 25728 22661 21421 20681 18987 16825 14565 13906
11036A3906O2k87rq37L76o80J345J159Q25r41m07J800l66j85J017Q63L7L44J517
$$ 13906 13968 13681 13672 12835 13211 12531 13876 15035 15860 14919 14512 16312 15946 15761 16778 17641 17678 18022 19539
11017A9539J84j009j492j413j059j56o42q82j697j359n9q5j813j026J392M86j396
$$ 19539 19723 18714 17222 15809 14750 14594 13952 13070 11373 10014 9955 9870 8057 7031 8423 8909 7513
11000G513l86J81L33k71l18n58l64M5j001J130O52M47L33L06O73P28J19j519k15
$$ 7513 7127 7308 7641 7370 7052 6494 6130 6175 5174 6304 6956 7403 7736 8042 8715 9443 9562 8043 7828
10981G828p79O22Q70J62p21N42O49J91J844P05p88n60P96O72J016M07m36r09q90
$$ 7828 7049 7671 8541 8703 7982 8524 9173 9364 11208 11913 11125 10565 11361 12033 13049 13456 13020 12111 11221
10962A1221n8P21j67R5L86N27r85o22J993L04m01N35j68J74L82P15m01J347O79
$$ 11221 11163 11884 11717 11812 12198 12725 11740 11118 13111 13415 13014 13549 13381 13555 13937 14652 14251 15598 16277
10943A6277m13p77J514k22L57J576R48k32j659k212j462n88K80P61K54j673j348
$$ 16277 15864 15087 16601 16379 16736 18312 19260 19028 17369 15157 13695 13107 13387 14148 14402 12729 11381
10926A1381n4l80rL04Nj278j20l43q65j123r1m78p04K57M22o34m69j94P4o45J41
$$ 11381 11327 10947 10938 11242 11247 9969 9849 9506 8641 7518 7427 6949 6245 6502 6924 6290 5821 5627 5701 5056 5197
10905E197l35o79j609n25M20O12N77J35r33j276m01J30k33J69p84O26Q28J065
$$ 5197 4862 4183 2574 2049 2469 3081 3658 3793 2860 1584 1183 1313 1080 1249 465 1091 1919 2984
10887B984Nj255r23k25k88K7l69o62j58k19O04J1j39J10O88N5K004K077J371Q13
$$ 2984 2989 1734 811 586 298 325 -44 -706 -864 -1083 -479 -468 -607 -497 191 246 2250 4327 5698 6511
10867F511j60o69n23J092p9j490j046o0l4K67j65l80q0k18j146m67k79j105n32
$$ 6511 6351 5682 5159 6251 6172 4682 3636 3576 3542 3809 3644 3264 3184 2966 1820 1353 1074 -31 -563
10848e63O11J13P3m47q69O37R92k00P62J85M87M14r77J2N42k15k8J5J090J452
$$ -563 48 161 234 -213 -1082 -445 547 347 1109 1294 1781 2195 1218 1230 1772 1557 1529 1544 2634 4086
10828D086K98N56l24J049O81J199j207l79L93M35l05n56j174O34j65k18K07O98
$$ 4086 4384 4940 4616 5665 6346 7545 6338 5959 6352 6787 6482 5926 4752 5386 5221 5003 5210 5908
10810E908O26Q74r33L7K09o36n65N26j700j896n69n62K55P47O3r32j39Q29M56
$$ 5908 6534 7408 6475 6512 6721 6085 5520 6046 4346 2450 1881 1319 1574 2321 2384 1452 1313 2142 2598
10791B598k36n04j194nj56r4j87j194p59k90n41N32n15k51p7k118j033J906R83
$$ 2598 2362 1858 664 659 503 409 222 -972 -1731 -2021 -2562 -2030 -2545 -2796 -2873 -4991 -6024 -4118 -3135
10772c135m11o57J023J9o55P32n6K78K14N02l49j233j108j18M12M41R8o49k69
$$ -3135 -3546 -4203 -3180 -3161 -3816 -3084 -3140 -2862 -2648 -2146 -2495 -3728 -4836 -4954 -4542 -4101 -4003 -4652 -4921
10753d921o7n01r90L65r62n49O68K042J528L53J9Q37K53J040k3k64J450j037j195
$$ -4921 -4988 -5489 -6479 -6114 -7076 -7625 -6957 -4915 -3387 -3034 -3015 -2178 -1925 -885 -908 -1172 278 -759 -1954
10734a954j250o46L71l04j693n32j002n81Q66O31N15Q79p71j172R78R05p6j75
$$ -1954 -3204 -3850 -3479 -3783 -5476 -6008 -7010 -7591 -6725 -6094 -5579 -4700 -5471 -6643 -5665 -4760 -4836 -5011
10716e011R62M42o46m45J81j30k29k17K77J84J495K093J087m4k6L55k45R56L95
$$ -5011 -4049 -3607 -4253 -4698 -4517 -4647 -4876 -5093 -4816 -4632 -3137 -1044 43 -1 -27 328 83 1039 1434
10697A434m34r22j551J467l36j056p94n29O45K99p28M78M31L3lM05L03P87j416
$$ 1434 1000 78 -1473 -6 -342 -1398 -2192 -2721 -2076 -1777 -2505 -2027 -1596 -1563 -1566 -1161 -858 -71 -1487
10678a487k21R26Q86m82k22o2m34k37m27O23l3n0J425J11o9j75p95o54M7j63l48
$$ -1487 -1708 -782 104 -378 -600 -662 -1096 -1333 -1760 -1137 -1170 -1220 205 316 247 72 -723 -1377 -1330 -1493 -1841
10657a841r20k28J96m35m27l21Q76j35J36N02Q4J94O2o59M76N81P68P29l97j056
$$ -1841 -2761 -2989 -2793 -3228 -3655 -3976 -3100 -3235 -3099 -2597 -2513 -2319 -2257 -2916 -2440 -1859 -1091 -362 -759 -1815
10637a815q38k96k0J100N57n02j164o78P16L25m33q2R74j98n97l13m11m61r09
$$ -1815 -2653 -2949 -2969 -1869 -1312 -1814 -2978 -3656 -2940 -2615 -3048 -3130 -2156 -2354 -2951 -3264 -3675 -4136 -5045
10618e045P9N88K58J83L34J80J58j187L05J72k88J86J13K31R40p16j021l12J635
$$ -5045 -4966 -4378 -4120 -3937 -3603 -3423 -3265 -4452 -4147 -3975 -4263 -4077 -3964 -3733 -2793 -3509 -4530 -4842 -3207
10599c207L23n90k98J06n65K45P13j56l49N92M06o4j382m06Q61J066r0j39o28
$$ -3207 -2884 -3474 -3772 -3666 -4231 -3986 -3273 -3429 -3778 -3186 -2780 -2844 -4226 -4632 -3771 -2705 -2795 -2934 -3562
10580c562M57p09P50J09l30L53j220j953J31J372R89Q52q65j89J17O22R67j49
$$ -3562 -3105 -3814 -3064 -2955 -3285 -2932 -4152 -6105 -5974 -4602 -3613 -2761 -3626 -3815 -3698 -3076 -2109 -2258
10562b258k9k6Q07O68J024j87K7O6K152l03j036p79K40Q60m66j429o41j36M93
$$ -2258 -2287 -2313 -1506 -838 186 -1 26 92 2244 1941 905 126 366 1226 760 -669 -1310 -1446 -953
10543i53K19r52j163p04M17K0K48P68j61l23Q70q20o7M65j048p32n09L45L27l13
$$ -953 -734 -1686 -2849 -3553 -3136 -3116 -2868 -2100 -2261 -2584 -1714 -2534 -2601 -2136 -3184 -3916 -4425 -4080 -3753 -4066
10523d066q39o6K33R5p0O57n89N24N32k22n62J456n62l07K88J75J21j83M58n34
$$ -4066 -4905 -4971 -4738 -4643 -4713 -4056 -4645 -4121 -3589 -3811 -4373 -2917 -3479 -3786 -3498 -3323 -3202 -3385 -2927 -3461
10503c461o43l11j6l4o94n26n7N72k22r41k3M8j79J239J26k13O52n50J44K13k53
$$ -3461 -4104 -4415 -4431 -4465 -5159 -5685 -5742 -5170 -5392 -6333 -6356 -6308 -6487 -5248 -5122 -5335 -4683 -5233 -5089 -4876 -5129
10482e129J90M69k98j65j11Q47M49j95j129J98J065L67j044j046l7o85P77R42
$$ -5129 -4939 -4470 -4768 -4933 -5044 -4197 -3748 -3943 -5072 -4874 -3809 -3442 -4486 -5532 -5569 -6254 -5477 -4535
10464d535l6j99J161M70q55j496l53J149K50O3k85N45l10j15J48k40K35L99P21
$$ -4535 -4571 -4770 -3609 -3139 -3994 -5490 -5843 -4694 -4444 -4381 -4666 -4121 -4431 -4546 -4398 -4638 -4403 -4004 -3283
10445c283J76m85N18K01j129o97k5m02O8j57N5L44J676M40m7j906k075n86Q85
$$ -3283 -3107 -3592 -3074 -2873 -4002 -4699 -4724 -5126 -5058 -5215 -5160 -4816 -3140 -2700 -2747 -4653 -6728 -7314 -6429
10426f429N68J720N70m69L50m64J03R15P44O05K51m46j067J85L9K62r33j050k30
$$ -6429 -5861 -4141 -3571 -4040 -3690 -4154 -4051 -3136 -2392 -1787 -1536 -1982 -3049 -2864 -2825 -2563 -3496 -4546 -4776
10407d776J65r0J526J101r63j496O67j53k87j75R03o95p61j84P8k66m06P18k23
$$ -4776 -4611 -4701 -3175 -2074 -3037 -4533 -3866 -4019 -4306 -4481 -3578 -4273 -5034 -5218 -5140 -5406 -5812 -5094 -5317
10388e317j141R00J582J19j13R6P29j050M52M82Q75L81J84r02m95j475l08N5k13
$$ -5317 -6458 -5558 -3976 -3857 -3970 -3874 -3145 -4195 -3743 -3261 -2386 -2005 -1821 -2723 -3218 -4693 -5001 -4946 -5159
10369e159L52K15l79J197J70p60O01%j614q63m64P34Q13J58l54M93m83q1n3K03
$$ -5159 -4807 -4592 -4971 -3774 -3604 -4364 -3763 -3763 -5377 -6240 -6704 -5970 -5157 -4999 -5353 -4860 -5343 -5424 -5477 -5274
10349e274N64N40l21j354j2Q16P22l62n24q05P29j056j89M93k5l3j02m87k63J411
$$ -5274 -4710 -4170 -4491 -5845 -5857 -5041 -4319 -4681 -5205 -6010 -5281 -6337 -6526 -6033 -6058 -6091 -6193 -6680 -6943 -5532
10329e532p80j112O53P20n55L57O20P99l53k9q0J77l99n18M03O45J575J035k48
$$ -5532 -6312 -7424 -6771 -6051 -6606 -6249 -5629 -4830 -5183 -5212 -5292 -5115 -5514 -6032 -5629 -4984 -3409 -2374 -2622
10310b622p09p46j53j157J20L41N77M75j15K10o56n1J60j71N51j056r2P7m70J228
$$ -2622 -3331 -4077 -4230 -5387 -5267 -4926 -4349 -3874 -3989 -3779 -4435 -4486 -4326 -4497 -3946 -5002 -5094 -5017 -5487 -4259
10290d259J047j049K18J361J89q94J43p6M28k41Q7k99m4M69n03q60K08L67R76
$$ -4259 -3212 -4261 -4043 -2682 -2493 -3387 -3244 -3320 -2892 -3133 -3046 -3345 -3389 -2920 -3423 -4283 -4075 -3708 -2732
10271b732R99n61k36k26j92J88j6p60K80q87p71N46J437J35p99r44l31q53J396
$$ -2732 -1733 -2294 -2530 -2756 -2948 -2760 -2776 -3536 -3256 -4143 -4914 -4368 -2931 -2796 -3595 -4539 -4870 -5723 -4327
10252d327J110k80K21N07P37k76j272q54J103p56n35R78O36J54N02J6j71l91n84
$$ -4327 -3217 -3497 -3276 -2769 -2032 -2308 -3580 -4434 -3331 -4087 -4622 -3644 -3008 -2854 -2352 -2336 -2507 -2898 -3482
10233c482n58K87N12J041J52j94L44m61N9L99j58q48K97o99j289J006J337L64
$$ -3482 -4040 -3753 -3241 -2200 -2048 -2242 -1898 -2359 -2300 -1901 -2059 -2907 -2610 -3309 -4598 -3592 -2255 -1891
10215a891p02j621p05j91m32j235Q51J097l7m8m33l25Q50R9M69R79k29j65L55
$$ -1891 -2593 -4214 -4919 -5110 -5542 -6777 -5926 -4829 -4866 -4914 -5347 -5672 -4822 -4723 -4254 -3275 -3504 -3669 -3314
10196c314P17q82j228M75O75l7o1L2j228M72K90q9N76l58n61N05L69o43m56%O82
$$ -3314 -2597 -3479 -4707 -4232 -3557 -3594 -3655 -3623 -4851 -4379 -4089 -4178 -3602 -3960 -4521 -4016 -3647 -4290 -4746 -4746 -4064
10175d064n74O31J38k27n71n72J024J97n35j15J98J83l06K53J29r23p00J23K35
$$ -4064 -4638 -4007 -3869 -4096 -4667 -5239 -4215 -4018 -4553 -4668 -4470 -4287 -4593 -4340 -4211 -5134 -5834 -5711 -5476
10156e476J87j32m62J09M00Q74Q29n55N50L58K4O39j798o79K84O97P73o25o9k44
$$ -5476 -5289 -5421 -5883 -5774 -5374 -4500 -3671 -4226 -3676 -3318 -3294 -2655 -4453 -5132 -4848 -4151 -3378 -4003 -4072 -4316
10136d316r46l37m2M50j09m34J217O73J8q10p73n72q8P31M96n14M67O96l15k00
$$ -4316 -5262 -5599 -5641 -5191 -5300 -5734 -4517 -3844 -3826 -4636 -5409 -5981 -6069 -5338 -4842 -5356 -4889 -4193 -4508 -4708
10116d708K62L59J10O57P08j311j600o92Q85M92j024n60N51N09p67R27K32j73
$$ -4708 -4446 -4087 -3977 -3320 -2612 -3923 -5523 -6215 -5330 -4838 -5862 -6422 -5871 -5362 -6129 -5202 -4970 -5143
10098e143L9K32O05M09K60k08K11q70J46j173J95N13n55J106K05l40j177q10N76
$$ -5143 -5104 -4872 -4267 -3858 -3598 -3806 -3595 -4465 -4319 -5492 -5297 -4784 -5339 -4233 -4028 -4368 -5545 -6355 -5779
10079e779J7J94N01P24l10M32O39k53J25N16r03K72L04M87n25o04LK90Q86J51
$$ -5779 -5762 -5568 -5067 -4343 -4653 -4221 -3582 -3835 -3710 -3194 -4097 -3825 -3521 -3034 -3559 -4163 -4160 -3870 -2984 -2833
10059b833J4P1nj161p3J47l52j047L47K95k39J08n85K36L98J55J67N71Q94L20
$$ -2833 -2819 -2748 -2753 -3914 -3987 -3840 -4192 -5239 -4892 -4597 -4836 -4728 -5313 -5077 -4679 -4524 -4357 -3786 -2892 -2572
10039b572P8q71j596n91K91O09n53N7L34J173r6o08J75J25j252R01R81l88l53
$$ -2572 -2494 -3365 -4961 -5552 -5261 -4652 -5205 -5148 -4814 -3641 -3737 -4345 -4170 -4045 -5297 -4396 -3415 -3803 -4156
10020d156O39k09L99N91j154l7m97o64q75N2O27M08R22K29j032J31K09L26P28
$$ -4156 -3517 -3726 -3327 -2736 -3890 -3927 -4424 -5088 -5963 -5911 -5284 -4876 -3954 -3725 -4757 -4626 -4417 -4091 -3363
10001c363N74M79r37k41p74o40%J140k94J44k22l04M14m17l01m37M86L47J63k66
$$ -3363 -2789 -2310 -3247 -3488 -4262 -4902 -4902 -3762 -4056 -3912 -4134 -4438 -4024 -4441 -4742 -5179 -4693 -4346 -4183 -4449
9981d449k59Q14K43p42M69R52Lp60j175l89M42q53R8R1k09M64R92K15M68j7k90
$$ -4449 -4708 -3894 -3651 -4393 -3924 -2972 -2969 -3729 -4904 -5293 -4851 -5704 -5606 -5515 -5724 -5260 -4268 -4053 -3585 -3602 -3892
9960c892l07K8j28J657O03K33m08j099m08m8q94n98OQ6n20M66q99o4Q55j39r18
$$ -3892 -4199 -4171 -4299 -2642 -2039 -1806 -2214 -3313 -3721 -3769 -4663 -5261 -5255 -5169 -5689 -5223 -6122 -6186 -5331 -5470 -6388
9939f388J056P65q03j76r6p62L03j74J30R06J023Q34N05L0j302n36K32J422J495
$$ -6388 -5332 -4567 -5370 -5546 -5642 -6404 -6101 -6275 -6145 -5239 -4216 -3382 -2877 -2847 -4149 -4685 -4453 -3031 -1536
9920a536P55J084j329k004l67J01N9L27m73j26m36l08m53M27P23J12O07O73O68
$$ -1536 -781 303 -1026 -3030 -3397 -3296 -3237 -2910 -3383 -3509 -3945 -4253 -4706 -4279 -3556 -3444 -2837 -2164 -1496
9901a496o61k67k49M51Q67p3O1L34R94J643L307L663J869k417l003j946q73j153
$$ -1496 -2157 -2424 -2673 -2222 -1355 -1428 -1367 -1033 -39 1604 4911 8574 10443 8026 5023 3077 2204 1051
9883A051j364j281j241o62l25Q39P40J143N2K71N30j04K41P21J855J519K294J870
$$ 1051 -313 -1594 -2835 -3497 -3822 -2983 -2243 -1100 -1048 -777 -247 -351 -110 611 2466 3985 6279 8149
9865H149N34J526L126L181M161P927J0840R444M067l436r430j0429p895m602k739
$$ 8149 8683 10209 13335 16516 20677 28604 39444 48888 52955 49519 40089 29660 21765 17163 14424
9850A4424k382j968j972j599m35l45k59j008n60r93j559j060J300J617L36k98
$$ 14424 12042 10074 8102 6503 6068 5723 5464 4456 3896 2903 1344 284 1584 3201 3537 3239
9834C239n78q13l27k96N55j06L29P23M34P5N1L9l45K12j504l69r0r64p46P8n93
$$ 3239 2661 1848 1521 1225 1780 1674 2003 2726 3160 3235 3286 3325 2980 3192 1688 1319 1229 265 -481 -403 -996
9813i96n49J217K61N80K09m19j182j617l66O2M80K98J003J87j60j162l28M61K49
$$ -996 -1545 -328 -67 513 722 303 -879 -2496 -2862 -2800 -2320 -2022 -1019 -832 -992 -2154 -2482 -2021 -1772
9794a772N38l37l59P82K01o84j237k05k52M86m43J03L9N26n30n95N44L06R78N28
$$ -1772 -1234 -1571 -1930 -1148 -947 -1631 -2868 -3073 -3325 -2839 -3282 -3179 -3140 -2614 -3144 -3739 -3195 -2889 -1911 -1383
9774a383j200r11J086q4n19O15p1j22N7p56P5K46r4k62J20J15M49j04K39r55m13
$$ -1383 -2583 -3494 -2408 -2492 -3011 -2396 -2467 -2589 -2532 -3288 -3213 -2967 -3061 -3323 -3203 -3088 -2639 -2743 -2504 -3459 -3872
9753c872L68N22N41L27J04p88K42O49J062J15j315j137o2j8Jp79n72k93N08o1
$$ -3872 -3504 -2982 -2441 -2114 -2010 -2798 -2556 -1907 -845 -730 -2045 -3182 -3244 -3262 -3261 -4040 -4612 -4905 -4397 -4458
9733d458P56J912j55p34j74m05N18l21j28P40n10J13L42n73j585j347k9r84Q09
$$ -4458 -3702 -1790 -1945 -2679 -2853 -3258 -2740 -3061 -3189 -2449 -2959 -2846 -2504 -3077 -4662 -6009 -6038 -7022 -6213
9714f213J014J342P89j06m31q34j92N94N74J283K79m1Q25N52k98j4K63P88r08
$$ -6213 -5199 -3857 -3068 -3174 -3605 -4439 -4631 -4037 -3463 -2180 -1901 -1942 -1117 -565 -863 -877 -614 174 -734
9695g34j57J435J036K586K167K160n15k864k164j131j383l14p4o50j85J42N52
$$ -734 -891 544 1580 4166 6333 8493 7978 5114 2950 1819 436 122 48 -602 -787 -645 -93
9678i3q42p62j65o83O7N58N26P6q80r56P41K1m00L40N48n32m46l16L99k18K96
$$ -93 -935 -1697 -1862 -2545 -2478 -1920 -1394 -1318 -2198 -3154 -2413 -2392 -2792 -2452 -1904 -2436 -2882 -3198 -2799 -3017 -2721
9657b721Q88J03j646n47O51L36J67p2K30O84k27m78j122L22O82m36O10N92M15
$$ -2721 -1833 -1730 -3376 -3923 -3272 -2936 -2769 -2841 -2611 -1927 -2154 -2632 -3754 -3432 -2750 -3186 -2576 -1984 -1569
9638a569L40L5j168m08M48J128k33q25j867J69J131J08K27k08L94k99Q8m01j391
$$ -1569 -1229 -1194 -2362 -2770 -2322 -1194 -1427 -2252 -4119 -3950 -2819 -2711 -2484 -2692 -2298 -2597 -2509 -2910 -4301
9619d301o99j61K04J043M27j83p0P65K77n42m12k99J66M25j004j188J263J002
$$ -4301 -5000 -5161 -4957 -3914 -3487 -3670 -3740 -2975 -2698 -3240 -3652 -3951 -3785 -3360 -4364 -5552 -4289 -3287
9601c287k74k54J178r3J35m61o08k8Q21k14M49k65P98J393M48q2R05K75j69O19
$$ -3287 -3561 -3815 -2637 -2730 -2595 -3056 -3664 -3692 -2871 -3085 -2636 -2901 -2103 -710 -262 -344 561 836 667 1286
9581A286J047K5J390J343J694K234M099M595M801K090m44j494k198k709l396l778
$$ 1286 2333 2358 3748 5091 6785 9019 13118 17713 22514 24604 24160 22666 20468 17759 14363 10585
9565A0585l652k374j761j337P36n72m37l56p84N36N76P30M5p61O3j11k59l1l97
$$ 10585 6933 4559 2798 1461 2197 1625 1188 832 48 584 1160 1890 1935 1174 1237 1126 867 836 439
9546D39J6M78J273m23j504k2N82J9j255K36P23k67n07k3L8n79o7k13L3p22Q4p0
$$ 439 455 933 2206 1783 279 257 839 858 -397 -161 562 295 -212 -235 -197 -776 -843 -1056 -1023 -1745 -1661 -1731
9524a731M70q99j13K83K0n20Q29m61o51K94J077R3j024k72r47kj44o63p13M85
$$ -1731 -1261 -2160 -2273 -1990 -1970 -2490 -1661 -2122 -2773 -2479 -1402 -1309 -2333 -2605 -3552 -3554 -3698 -4361 -5074 -4589
9504d589QN44J530p3o43j79P48nN48K39k90k8p29j11p40o21Q48J60j754M6N78
$$ -4589 -4581 -4037 -2507 -2580 -3223 -3402 -2654 -2659 -2111 -1872 -2162 -2190 -2919 -3030 -3770 -4391 -3543 -3383 -5137 -5091 -4513
9483d513k03k7J92j01l45l04N05P37P24J49j07j000j95L85K17L02m17q85N73J55
$$ -4513 -4716 -4743 -4551 -4652 -4997 -5301 -4796 -4059 -3335 -3186 -3293 -4293 -4488 -4103 -3886 -3584 -4001 -4886 -4313 -4158
9463d158p80k59m77R72J428r83r33N79Q26O62L53J83J80k09n16l04n77K62J248
$$ -4158 -4938 -5197 -5674 -4702 -3274 -4257 -5190 -4611 -3785 -3123 -2770 -2587 -2407 -2616 -3132 -3436 -4013 -3751 -2503
9444b503j96n50p42K86J054R1J57P57o1q91k70K57j17r3J90J89j186O7N49l40
$$ -2503 -2699 -3249 -3991 -3705 -2651 -2560 -2403 -1646 -1707 -2598 -2868 -2611 -2728 -2821 -2631 -2442 -3628 -3561 -3012 -3352
9424c352p50L65P56J7r60m46Q50k43j706M43J183j07M00k36p32l57j018K24J232
$$ -3352 -4102 -3737 -2981 -2964 -3924 -4370 -3520 -3763 -5469 -5026 -3843 -3950 -3550 -3786 -4518 -4875 -5893 -5669 -4437
9405d437J036N57k0r47m55N01j377q23Q90O49P13M74R61Q0j081j274O54O6j171
$$ -4437 -3401 -2844 -2864 -3811 -4266 -3765 -5142 -5965 -5075 -4426 -3713 -3239 -2278 -2198 -3279 -4553 -3899 -3833 -5004
9386e004J305Q45o23k36K96Q62o85j351J64m57l11J384O00R46m72j050n73K48
$$ -5004 -3699 -2854 -3477 -3713 -3417 -2555 -3240 -4591 -4427 -4884 -5195 -3811 -3211 -2265 -2737 -3787 -4360 -4112
9368d112m20O06m08M59l63m67L87N78M08N85j368q17Q75L08L79k18K93L35L88
$$ -4112 -4532 -3926 -4334 -3875 -4238 -4705 -4318 -3740 -3332 -2747 -4115 -4932 -4057 -3749 -3370 -3588 -3295 -2960 -2572
9349b572j034k04O90M52m74r55l49pK95j22j38P18j61l2R15O42L63K31r25j070
$$ -2572 -3606 -3810 -3120 -2668 -3142 -4097 -4446 -4453 -4158 -4280 -4418 -3700 -3861 -3893 -2978 -2336 -1973 -1742 -2667 -3737
9329c737p53J24l53K7K78j239l71k38M84P68N2K76R90l0j13L88m98J68N14M43
$$ -3737 -4490 -4366 -4719 -4692 -4414 -5653 -6024 -6262 -5778 -5010 -4958 -4682 -3692 -3722 -3835 -3447 -3945 -3777 -3263 -2820
9309b820R37j60j026k85K77J656O17k37j362l51n22m24L99j79k69Q6Q06r6j451
$$ -2820 -1883 -2043 -3069 -3354 -3077 -1421 -804 -1041 -2403 -2754 -3276 -3700 -3301 -3480 -3749 -3663 -2857 -2953 -4404
9290d404j146K7J553Q47m29m06Ok79R34m33j201L49Q38M88o42o1l77J1r22J2q4
$$ -4404 -5550 -5523 -3970 -3123 -3552 -3958 -3952 -4231 -3297 -3730 -4931 -4582 -3744 -3256 -3898 -3959 -4336 -4325 -5247 -5235 -5319
9269e319M47P87n07k46n38N21J280L74k21l33j50Q21q68l22R73l90k37N69J049
$$ -5319 -4872 -4085 -4592 -4838 -5376 -4855 -3575 -3201 -3422 -3755 -3905 -3084 -3952 -4274 -3301 -3691 -3928 -3359 -2310
9250b310P20q32r11M80o87o46K00K68P93P46j042n6M70n22p04R09J263P5K7r10
$$ -2310 -1590 -2422 -3333 -2853 -3540 -4186 -3986 -3718 -2925 -2179 -3221 -3277 -2807 -3329 -4033 -3124 -1861 -1786 -1759 -2669
9230b669M76O71j508m61J64Q20P1N25K03M00O36L31m22n31L1M90n61o65l33j25
$$ -2669 -2193 -1522 -3030 -3491 -3327 -2507 -2436 -1911 -1708 -1308 -672 -341 -763 -1294 -1263 -773 -1334 -1999 -2332 -2457
9210b457k26J43N3q51L10o2o53J26J692L26n41J132P17q84r54j036p16O10Q94
$$ -2457 -2683 -2540 -2487 -3338 -3028 -3090 -3743 -3617 -1925 -1599 -2140 -1008 -291 -1175 -2129 -3165 -3881 -3271 -2377
9191b377j002p91J94R3n48J62J124K23p49L30N44p03j320j17J222J376O72r98
$$ -2377 -3379 -4170 -3976 -3883 -4431 -4269 -3145 -2922 -3671 -3341 -2797 -3500 -4820 -4937 -3715 -2339 -1667 -2665
9173b665K22j381M67L41N75R12k74l41k81o07K89j482j048J278J609Q0n10l33
$$ -2665 -2443 -3824 -3357 -3016 -2441 -1529 -1803 -2144 -2425 -3032 -2743 -4225 -5273 -3995 -2386 -2306 -2816 -3149
9155c149O30M23K28l50K83L8q31NL62P39j22k00n75J83n50J015M85k74l82r67
$$ -3149 -2519 -2096 -1868 -2218 -1935 -1897 -2728 -2723 -2361 -1622 -1744 -1944 -2519 -2336 -2886 -1871 -1386 -1660 -2042 -3009
9135c009j06R09m98n71l39K60n72K84k38j178N09Q57J67K29k46K60O77K26j150
$$ -3009 -3115 -2206 -2704 -3275 -3614 -3354 -3926 -3642 -3880 -5058 -4549 -3692 -3525 -3296 -3542 -3282 -2605 -2379 -3529
9116c529N38O71q02n81J041N60K12O43k97j821r85O3j191l18M32J449O69J022
$$ -3529 -2991 -2320 -3122 -3703 -2662 -2102 -1890 -1247 -1544 -3365 -4350 -4287 -5478 -5796 -5364 -3915 -3246 -2224
9098b224M51Q65j909o42o7l50O30Q31L48L5m93o33k61N69L54N67J349N78j826
$$ -2224 -1773 -908 -2817 -3459 -3526 -3876 -3246 -2415 -2067 -2032 -2525 -3158 -3419 -2850 -2496 -1929 -580 -2 -1828
9079a828J43j2n37j03L81Q11j8l84L44J162P55o71L46n36O2K67J105J77p52K05
$$ -1828 -1685 -1697 -2234 -2337 -1956 -1145 -1163 -1547 -1203 -41 714 43 389 -147 -85 182 1287 1464 712 917
9059I17J302Q25M58L27O81J864K55L76K117J948J959J683J431L907N066P346J1464
$$ 917 2219 3044 3502 3829 4510 6374 6629 7005 9122 11070 13029 14712 16143 20050 25116 32462 43926
9042D3926J5212J2199K768o863j3066j1953q705o981m244l139l169j916j601q35
$$ 43926 59138 71337 74105 67242 54176 42223 33518 26537 22293 19154 15985 14069 12468 11633
9028A1633m99K29k84o52j178M6p53j620k43j003n83j14Q08N68l60M16J186O20
$$ 11633 11134 11363 11079 10427 9249 9295 8542 6922 6679 5676 5093 4979 5787 6355 5995 6411 7597 8217
9010H217K76L80j669n63k40P92j069l26j32r48o14R2j216o47j93q1J27q51q16
$$ 8217 8493 8873 7204 6641 6401 7193 6124 5798 5666 4718 4104 4196 2980 2333 2140 2059 2186 1335 519
8991E19K76M28n99O10M3j64O44m30m72j294q95j11L5K16m95r5j073j726M18M19
$$ 519 795 1223 624 1234 1277 1113 1757 1327 855 -439 -1334 -1445 -1410 -1194 -1689 -1784 -2857 -4583 -4165 -3746
8971c746n64k05Q42O00O61l32p57l6Q44J019J3q41j162m81J86J416O13n99l74
$$ -3746 -4310 -4515 -3673 -3073 -2412 -2744 -3501 -3537 -2693 -1674 -1661 -2502 -3664 -4145 -3959 -2543 -1930 -2529 -2903
8952b903r4N04j68l07N38q2j149p31N27k2O55K17J00j360M95J173O20j049n41
$$ -2903 -2997 -2493 -2661 -2968 -2430 -2512 -3661 -4392 -3865 -3887 -3232 -3015 -2915 -4275 -3780 -2607 -1987 -3036 -3577
8933c577l02q77j45Q02J192L46L93M84o06q66r52L84N25K26M65P71o16q64N89
$$ -3577 -3879 -4756 -4901 -4099 -2907 -2561 -2168 -1684 -2290 -3156 -4108 -3724 -3199 -2973 -2508 -1737 -2353 -3217 -2628
8914b628N91L24q10j257r1J163K74O62l01R7R66r24j727R30N28N76Q85L44l80
$$ -2628 -2037 -1713 -2523 -3780 -3871 -2708 -2434 -1772 -2073 -1976 -1010 -1934 -3661 -2731 -2203 -1627 -742 -398 -778
8895g78q13L4m02j47K50O40j168q12N05K59P57j80l93Q57J29l03N45M93o24j79
$$ -778 -1591 -1557 -1959 -2106 -1856 -1216 -2384 -3196 -2691 -2432 -1675 -1855 -2248 -1391 -1262 -1565 -1020 -527 -1151 -1330
8875a330j100p38k77O67K05l39L35Q6J6j67r04j40L42Q48R30k80J1k09L56P41
$$ -1330 -2430 -3168 -3445 -2778 -2573 -2912 -2577 -2491 -2475 -2642 -3546 -3686 -3344 -2496 -1566 -1846 -1835 -2044 -1688 -947
8855i47o5o23j33n46q06K85J050Q5l13l83k45L16p1p62j18l42L76j22j225m8L16
$$ -947 -1012 -1635 -1768 -2314 -3120 -2835 -1785 -1700 -2013 -2396 -2641 -2325 -2396 -3158 -3276 -3618 -3242 -3364 -4589 -4637 -4321
8834d321J50Q03O65J2m23j16O63J73n77m85J84k45Q04O92J74K293o15j890J53
$$ -4321 -4171 -3368 -2703 -2691 -3114 -3230 -2567 -2394 -2971 -3456 -3272 -3517 -2713 -2021 -1847 446 -169 -2059 -1906
8815a906m81O54k38m70m14M34J32K96J158r5J18K74K63k54o88l08N99k61p00N3
$$ -1906 -2387 -1733 -1971 -2441 -2855 -2421 -2289 -1993 -835 -930 -812 -538 -275 -529 -1217 -1525 -926 -1187 -1887 -1834
8795a834M2J73K18k94m32n66k73q5k54l19k15j88J075K80N37P34r36m30j00N52
$$ -1834 -1792 -1619 -1401 -1695 -2127 -2693 -2966 -3051 -3305 -3624 -3839 -4027 -2952 -2672 -2135 -1401 -2337 -2767 -2867 -2315
8775b315K49o60j40O6Q89K98L68N84o45M8R3M07K23r7k2N81o68j15n00p54l51
$$ -2315 -2066 -2726 -2866 -2800 -1911 -1613 -1245 -661 -1306 -1258 -1165 -758 -535 -632 -654 -73 -741 -856 -1356 -2110 -2461
8754b461o34R1J372Rp12J05n02l16p5o17o37Q91J129P95J035R16l42j161J52J33
$$ -2461 -3095 -3004 -1632 -1623 -2335 -2230 -2732 -3048 -3123 -3740 -4377 -3486 -2357 -1562 -527 389 47 -1114 -962 -829
8734h29p16K51J66j121j124o68k03n23R3j05R63J53p70p03L68O8J79L8M17o3k67
$$ -829 -1545 -1294 -1128 -2249 -3373 -4041 -4244 -4767 -4674 -4779 -3816 -3663 -4433 -5136 -4768 -4700 -4521 -4483 -4066 -4129 -4396
8713d396J16R45k18n00j8J496J311l78p14k90n08O85J432l49j626r1n1l60L42
$$ -4396 -4280 -3335 -3553 -4053 -4071 -2575 -1264 -1642 -2356 -2646 -3154 -2469 -1037 -1386 -3012 -3103 -3154 -3514 -3172
8694c172J132K23l5k7L69l83k15p93r40M97Q33L51P64K38j110QJ090r0l01p00
$$ -3172 -2040 -1817 -1852 -1879 -1510 -1893 -2108 -2901 -3841 -3344 -2511 -2160 -1396 -1158 -2268 -2260 -1170 -1260 -1561 -2261
8674b261n60j191J98J72L74R34J57J56l93O81J442l90j133r48q33j23K69Q91O35
$$ -2261 -2821 -4012 -3814 -3642 -3268 -2334 -2177 -2021 -2414 -1733 -291 -681 -1814 -2762 -3595 -3718 -3449 -2558 -1923
8655a923o22j267m30k3O67p60l14J392Q04l49M6K50m8p26M81L95m90j504J57J85
$$ -1923 -2545 -3812 -4242 -4265 -3598 -4358 -4672 -3280 -2476 -2825 -2779 -2529 -2577 -3303 -2822 -2427 -2917 -4421 -4264 -4079
8635d079n59K359Q72j92n97k61r65J13O33K28j2l65k26N85p08n54J153L15j000
$$ -4079 -4638 -2279 -1407 -1599 -2196 -2457 -3422 -3309 -2676 -2448 -2460 -2825 -3051 -2466 -3174 -3728 -2575 -2260 -3260
8616c260J21J646q8o39l95n64Q41n19j01j99l80J32K22m19o0n60K87J296L88O7
$$ -3260 -3139 -1493 -1581 -2220 -2615 -3179 -2338 -2857 -2958 -3157 -3537 -3405 -3183 -3602 -3662 -4222 -3935 -2639 -2251 -2184
8596b184J081K48n33m06n79r02l29J076r75l75K23j53m92K29k15N34J307m81k99
$$ -2184 -1103 -855 -1388 -1794 -2373 -3275 -3604 -2528 -3503 -3878 -3655 -3808 -4300 -4071 -4286 -3752 -2445 -2926 -3225
8577c225K49K95Q70N74j69j91m97n51o23R73k90p08k03K46K133J089n97p90q54
$$ -3225 -2976 -2681 -1811 -1237 -1406 -1597 -2094 -2645 -3268 -2295 -2585 -3293 -3496 -3250 -1117 -28 -625 -1415 -2269
8558b269m47r4N81R09o29n24m35r02q7m86Q99J58R4o72P00N81N12J13o35M18k39
$$ -2269 -2716 -2810 -2229 -1320 -1949 -2473 -2908 -3810 -3897 -4383 -3484 -3326 -3232 -3904 -3204 -2623 -2111 -1998 -2633 -2215 -2454
8537b454k71r58j529K60J71J126N60M26M49r39L44R57J5q37m3J222n21r96p93
$$ -2454 -2725 -3683 -5212 -4952 -4781 -3655 -3095 -2669 -2220 -3159 -2815 -1858 -1843 -2680 -2723 -1501 -2022 -3018 -3811
8518c811J99P94J32n31J91p43o02O79L54n01m41m2K02J536O12K54K96J017J28
$$ -3811 -3612 -2818 -2686 -3217 -3026 -3769 -4371 -3692 -3338 -3839 -4280 -4322 -4120 -2584 -1972 -1718 -1422 -405 -277
8499b77k61o97k91o39j698l53J286O65j89k68o71j322j3P06L18P74Q5m1m61j78
$$ -277 -538 -1235 -1526 -2165 -3863 -4216 -2930 -2265 -2454 -2722 -3393 -4715 -4728 -4022 -3704 -2930 -2845 -2886 -3347 -3525
8479c525O39m11qJ567O44o07r74M91J21J26n5j91L67O06p10q83N79J279j173M34
$$ -3525 -2886 -3297 -3305 -1738 -1094 -1701 -2675 -2184 -2063 -1937 -1992 -2183 -1816 -1210 -1920 -2803 -2224 -945 -2118 -1684
8459a684qm81M99M51J60p4l48J64r59r93l1l56k25L25J100Q40m42j868P67P45
$$ -1684 -1692 -2173 -1674 -1223 -1063 -1137 -1485 -1321 -2280 -3273 -3304 -3660 -3885 -3560 -2460 -1620 -2062 -3930 -3163 -2418
8439b418N08N84p47kp4J507J063l66l44R04k07j139m46j31J094m0j309q25j21
$$ -2418 -1910 -1326 -2073 -2075 -2149 -642 421 55 -289 615 408 -731 -1177 -1308 -214 -254 -1563 -2388 -2509
8420b509k95K87n19L55L48O03q08L79k12L67K24l8J73R86q10k51J40M43J07L21
$$ -2509 -2804 -2517 -3036 -2681 -2333 -1730 -2538 -2159 -2371 -2004 -1780 -1818 -1645 -659 -1469 -1720 -1580 -1137 -1030 -709
8400g09O55l27j200n60j36Q02N19k31n98M98R61O53K76O2j132p58l02O93Q99R
$$ -709 -54 -381 -1581 -2141 -2277 -1475 -956 -1187 -1785 -1287 -326 327 603 665 -467 -1225 -1527 -834 65 74
8380G4j888n45J268M96j070N93j79O0K93q82m01k91J587K33q59Q2N06n82m45J305
$$ 74 -1814 -2359 -1091 -595 -1665 -1072 -1251 -1191 -898 -1780 -2181 -2472 -885 -652 -1511 -1429 -923 -1505 -1950 -645
8360f45o36l60P64l07j071r51Q00R41k17r40j452k08J617M65K31j259o44n99J24
$$ -645 -1281 -1641 -877 -1184 -2255 -3206 -2406 -1465 -1682 -2622 -4074 -4282 -2665 -2200 -1969 -3228 -3872 -4471 -4347
8341d347J440N77k37J14O1L93M22J295L33j163j134J44R23N03n71j073j03J098
$$ -4347 -2907 -2330 -2567 -2453 -2392 -1999 -1577 -282 51 -1112 -2246 -2102 -1179 -676 -1247 -2320 -2423 -1325
8323a325N87r32n27m05M65K4l04j80m22M57M77K36N65k81j153L8O55J047L39j87
$$ -1325 -738 -1670 -2197 -2602 -2137 -2113 -2417 -2597 -3019 -2562 -2085 -1849 -1284 -1565 -2718 -2680 -2025 -978 -639 -826
8303h26j177o67J359J220L83J52p21j278j008k73M71M96M84j82R0K36o61Q15J506
$$ -826 -2003 -2670 -1311 -91 292 444 -277 -1555 -2563 -2836 -2365 -1869 -1385 -1567 -1477 -1241 -1902 -1087 419
8284D19j008n20K31r02j6J51j550n36O29L96J902N96n50k53k01o42r18j047j38
$$ 419 -589 -1109 -878 -1780 -1796 -1645 -3195 -3731 -3102 -2706 -804 -208 -758 -1011 -1212 -1854 -2772 -3819 -3957
8265c957M84P72P87P22M16L17Q90n30j047N27O04M8o52j2L00j20l05K6N30N20
$$ -3957 -3473 -2701 -1914 -1192 -776 -459 431 -99 -1146 -619 -15 33 -619 -631 -331 -451 -756 -730 -200 320
8245C20j23J26j171n40M63n46L66k93K15J6k77k94J4r4rL75j47m49j75R51R14
$$ 320 197 323 -848 -1388 -925 -1471 -1105 -1398 -1183 -1167 -1444 -1738 -1724 -1818 -1827 -1452 -1599 -2048 -2223 -1272 -358
8224c58Q5j055j49O18M07o12O14q24n30n80M00O1k96L51k23M83P95J90k39M63
$$ -358 -273 -1328 -1477 -859 -452 -1064 -450 -1274 -1804 -2384 -1984 -1923 -2219 -1868 -2091 -1608 -813 -623 -862 -399
8204c99m69q20m88m94o84k11K6P52J005O39o19k64K75K54k36J96R0m53Q0k62n60
$$ -399 -868 -1688 -2176 -2670 -3354 -3565 -3539 -2787 -1782 -1143 -1762 -2026 -1751 -1497 -1733 -1537 -1447 -1900 -1820 -2082 -2642
8183b642q08J24J065m10n36L97R93J401P50j76j714j07J259L25n27j154J95l59
$$ -2642 -3450 -3326 -2261 -2671 -3207 -2810 -1817 -416 334 158 -1556 -1663 -404 -79 -606 -1760 -1565 -1924
8165a924m67O5M47o75l19J31P77K14Q77J78l04n45q86m00J550J474q85j96R4J31
$$ -1924 -2391 -2326 -1879 -2554 -2873 -2742 -1965 -1751 -874 -696 -1000 -1545 -2431 -2831 -1281 193 -692 -888 -794 -663
8145f63n79m68r8J87o66o25N86M09k68M21m78J144L29M50l83p56j70l9m48p88
$$ -663 -1242 -1710 -1808 -1621 -2287 -2912 -2326 -1917 -2185 -1764 -2242 -1098 -769 -319 -702 -1458 -1628 -1667 -2115 -2903
8125b903L36K39J54L38n63L1m75j19n06l15O97O81N56O45j9l07k55j242l83P01
$$ -2903 -2567 -2328 -2174 -1836 -2399 -2368 -2843 -2962 -3468 -3783 -3086 -2405 -1849 -1204 -1223 -1530 -1785 -3027 -3410 -2709
8105b709l97j17M77J977K96j72q02q92n07m62R87O86J008o41k066r47K45N47J158
$$ -2709 -3106 -3223 -2746 -769 -473 -645 -1447 -2339 -2846 -3308 -2321 -1635 -627 -1268 -3334 -4281 -4036 -3489 -2331
8086b331j165p27J330R98j90J06K41M34k91r37r37K70P03J011M0K81m96p09q2
$$ -2331 -3496 -4223 -2893 -1895 -2085 -1979 -1738 -1304 -1595 -2532 -3469 -3199 -2496 -1485 -1445 -1164 -1660 -2369 -2451
8067b451j157p17P28L22Q42N06l75j20M64l3N03N32m19k23K6Q10L08k38m26O06
$$ -2451 -3608 -4325 -3597 -3275 -2433 -1927 -2302 -2422 -1958 -1991 -1488 -956 -1375 -1598 -1572 -762 -454 -692 -1118 -512
8047e12K69q13l54K15l20N8K2O37M78l40k40R87j96J62K07k05j063p35r1k75o38
$$ -512 -243 -1056 -1410 -1195 -1515 -1457 -1435 -798 -320 -660 -900 87 -109 53 260 55 -1008 -1743 -1834 -2109 -2747
8026b747J3J399J535J73m79p01n20k99J44J168p68j002j121N1R63Q25p2o83m37
$$ -2747 -2734 -1335 200 373 -106 -807 -1327 -1626 -1482 -314 -1082 -2084 -3205 -3154 -2191 -1366 -1438 -2121 -2558
8007b558K74j21m47j78n76J063L61P45L67K29J046n32m90l89q38o7P01M46J7J68
$$ -2558 -2284 -2405 -2852 -3030 -3606 -2543 -2182 -1437 -1070 -841 205 -327 -817 -1206 -2044 -2111 -1410 -964 -947 -779
7987g79r06p27m02n82k7N79j24N54J40M4N13j044l11j0O91o81N31Q95o33Q07l48
$$ -779 -1685 -2412 -2814 -3396 -3423 -2844 -2968 -2414 -2274 -2230 -1717 -2761 -3072 -3082 -2391 -3072 -2541 -1646 -2279 -1472 -1820
7966a820r68K39Q56J58L16P00r46p91j82o4n27l2P24K53O26N7J017L74k34l91
$$ -1820 -2788 -2549 -1693 -1535 -1219 -519 -1465 -2256 -2438 -2502 -3029 -3061 -2337 -2084 -1458 -1401 -384 -10 -244 -635
7946f35r92n01M53p55RJ16r5J006K92Q97N84l72n41K9m33l68r22N01m33o65O57
$$ -635 -1627 -2128 -1675 -2430 -2421 -2305 -2400 -1394 -1102 -205 379 7 -534 -505 -938 -1306 -2228 -1727 -2160 -2825 -2168
7925b168R43O40M53j898q41j19Q69q62O80J00n40r54J197O51L06j32j46N44J66
$$ -2168 -1225 -585 -132 -2030 -2871 -2990 -2121 -2983 -2303 -2203 -2743 -3697 -2500 -1849 -1543 -1675 -1821 -1277 -1111
7906a111m14Qp2j042k74o42q42P90J648P51j81K37P27o9J45J25j119j342K91O54
$$ -1111 -1525 -1517 -1589 -2631 -2905 -3547 -4389 -3599 -1951 -1200 -1381 -1144 -417 -486 -341 -216 -1335 -2677 -2386 -1732
7886a732N01P12m95p97j53k10R76lp68l61q5J034J149M07m65p74l53l4r31m99
$$ -1732 -1231 -519 -1014 -1811 -1964 -2174 -1198 -1201 -1969 -2330 -2415 -1381 -232 175 -290 -1064 -1417 -1451 -2382 -2881
7866b881o1m85k89P98J514J02k72n90j161j268l05N53J551J169n76k31J51K08
$$ -2881 -2942 -3427 -3716 -2918 -1404 -1302 -1574 -2164 -3325 -4593 -4898 -4345 -2794 -1625 -2201 -2432 -2281 -2073
7848b073L39K32J47l09R08P57P35L34j111q21O85K41p96J26L48Q08K29K2q85j365
$$ -2073 -1734 -1502 -1355 -1664 -756 1 736 1070 -41 -862 -177 64 -732 -606 -258 550 779 801 -84 -1449
7828a449O27P99k209K08P77r9l25J42K86J62o27J32O54L8JJ59J338L81k455n60
$$ -1449 -822 -23 -2232 -2024 -1247 -1346 -1671 -1529 -1243 -1081 -1708 -1576 -922 -884 -883 -724 614 995 -1460 -2020
7808b020R21M25j512j130J150k70m44k78J180J225L92l53K49j72n17J41J810O08
$$ -2020 -1099 -674 -2186 -3316 -2166 -2436 -2880 -3158 -1978 -753 -361 -714 -465 -637 -1154 -1013 797 1405
7790A405K99q23r44j402P24M15j053j131j98O60Q08q02l86L95R64Q61Q7K71J033
$$ 1405 1704 881 -63 -1465 -741 -326 -1379 -2510 -2708 -2048 -1240 -2042 -2428 -2033 -1069 -208 -121 150 1183
7771A183K06j002R56m85o9K67K04q50m03j18m28j20l25L27M07J04Q59J576p18
$$ 1183 1389 387 1343 858 789 1056 1260 410 7 -111 -539 -659 -984 -657 -250 -146 713 2289 1571
7752A571n54l39j039J06J058p32m96J85l42J7L55J77o23l67R59k9k18K67N08p02
$$ 1571 1017 678 -361 -255 803 71 -425 -240 -582 -565 -210 -33 -656 -1023 -64 -93 -311 -44 464 -238
7732b38o67j138M08N56J220R03O9m35M65M1o49m67K75P92m99J08n84q6J63j75
$$ -238 -905 -2043 -1635 -1079 141 1044 1113 678 1143 1184 535 68 343 1135 636 744 160 74 237 62
7712F2J90o18m56L55L25n05p76M28j73K58m84P5P90M52p1N98Q24q57l75o35o23
$$ 62 252 -366 -822 -467 -142 -647 -1423 -995 -1168 -910 -1394 -1319 -529 -77 -148 450 1274 417 42 -593 -1216
7691a216J56L20Q71O4j134l01r33r0L52O69N61l91l07L0o52K48j067j126O18J499
$$ -1216 -1060 -740 131 195 -939 -1240 -2173 -2263 -1911 -1242 -681 -1072 -1379 -1349 -2001 -1753 -2820 -3946 -3328 -1829
7671a829KK15P80l33j283L2l39J17P32J218k94q46N21J388K16j521L0o63j377
$$ -1829 -1827 -1612 -832 -1165 -2448 -2416 -2755 -2638 -1906 -688 -982 -1828 -1307 81 297 -1224 -1194 -1857 -3234
7652c234m51J190N83M42r26j147Q31J397Q15l45K34J83n91P19N82l08n33n62J07
$$ -3234 -3685 -2495 -1912 -1470 -2396 -3543 -2712 -1315 -500 -845 -611 -428 -1019 -300 282 -26 -559 -1121 -1014
7633a014k37M60J433M77K17J27j532o48j021M2K92o24l8N96M67m53n78l39O45
$$ -1014 -1251 -791 642 1119 1336 1463 -69 -717 -1738 -1696 -1404 -2028 -2066 -1470 -1003 -1456 -2034 -2373 -1728
7614a728Q3j00N3k78q76J821K97m52m58n36j36J58K53p7O90K61n54j0P2p41p27
$$ -1728 -1645 -1745 -1692 -1970 -2846 -1025 -728 -1180 -1638 -2174 -2310 -2152 -1899 -1976 -1286 -1025 -1579 -1589 -1517 -2258 -2985
7593b985n06J226P07N04K84M98p47j34L44n42M79k78Q05J48n77p6N5L0J506o08
$$ -2985 -3491 -2265 -1558 -1054 -770 -272 -1019 -1153 -809 -1351 -872 -1150 -345 -197 -774 -850 -795 -765 741 133
7573A33r19N59O2j965Q08N84q43M97L42l66j99L3L87k14L68Q18k75j399j320q21
$$ 133 -786 -227 -165 -2130 -1322 -738 -1581 -1084 -742 -1108 -1307 -1274 -887 -1101 -733 85 -190 -1589 -2909 -3730
7553c730O79K248O89o37o11R0j638Q11J133P21n94j309o9p10o65R88L45J48l98
$$ -3730 -3051 -803 -114 -751 -1362 -1272 -2910 -2099 -966 -245 -839 -2148 -2217 -2927 -3592 -2604 -2259 -2111 -2509
7534b509J170J87r1K91N56r55P53L51l7p74n82k02L41J77O27L64j691j65M45R21
$$ -2509 -1339 -1152 -1243 -952 -396 -1351 -598 -247 -284 -1058 -1640 -1842 -1501 -1324 -697 -333 -2024 -2189 -1744 -823
7514h23N27L16p08j215p79O85R94n15m45p87j446J161J018k95J153O38l10k95
$$ -823 -296 20 -688 -1903 -2682 -1997 -1003 -1518 -1963 -2750 -4196 -3035 -2017 -2312 -1159 -521 -831 -1126
7496a126p01O20O53j04o24L31P3J028r03j197Q71Q20N7o97k35L56N4o61l25J80
$$ -1126 -1827 -1207 -554 -658 -1282 -951 -878 150 -753 -1950 -1079 -259 -202 -899 -1134 -778 -724 -1385 -1710 -1530
7476a530o0M35M16N92q88rK87l98J145O34j834o66K30j77m93l40N7m52J79O74
$$ -1530 -1590 -1155 -739 -147 -1035 -1044 -757 -1155 -10 624 -1210 -1876 -1646 -1823 -2316 -2656 -2599 -3051 -2872 -2198
7456b198L05n76O22j69l51k86N57J437j56j08M72o25n73J457O1j983r25J254L38
$$ -2198 -1893 -2469 -1847 -2016 -2367 -2653 -2096 -659 -815 -923 -451 -1076 -1649 -192 -131 -2114 -3039 -1785 -1447
7437a447k10J94P71l63j226M40O24N34m43N28J637J77j758n70n38l28J35J59M82
$$ -1447 -1657 -1463 -692 -1055 -2281 -1841 -1217 -683 -1126 -598 1039 1216 -542 -1112 -1650 -1978 -1843 -1684 -1202
7418a202P9L71Q62M21j190n43j201j75M90O03J498N6P0J136r90j037r73N4J069
$$ -1202 -1123 -752 110 531 -659 -1202 -2403 -2578 -2088 -1485 13 69 139 1275 285 -752 -1725 -1671 -602
7399f02M71r44j064L47L45N84j22N8r9p82N86l00p58j68L59M34j23J250j76o31
$$ -602 -131 -1075 -2139 -1792 -1447 -863 -985 -927 -1026 -1808 -1222 -1522 -2280 -2448 -2089 -1655 -1778 -528 -704 -1335
7379a335J694J400K31k20o10N4r27l86N60K89M79p48O57q6j116p95j66j27P93
$$ -1335 359 1759 1990 1770 1160 1214 287 -99 461 750 1229 481 1138 1052 -64 -859 -1025 -1152 -359
7360c59k13m56J75M24M9m86q22L42K01n74J14L26n06N3j94l63K99O22K78L65m74
$$ -359 -572 -1028 -853 -429 -380 -866 -1688 -1346 -1145 -1719 -1605 -1279 -1785 -1732 -1926 -2289 -1990 -1368 -1090 -725 -1199
7339a199mK43l81m86J79k59m04q00J556J146K42j155r45r23K22k39O66J487Q57
$$ -1199 -1203 -960 -1341 -1827 -1648 -1907 -2311 -3111 -1555 -409 -167 -1322 -2267 -3190 -2968 -3207 -2541 -1054 -197
7320a97K08M41k62l06nJ79N71K08m14j428n49O4P14o34J26R35M95l01q32L30q34
$$ -197 11 452 190 -116 -121 58 629 837 423 -1005 -1554 -1490 -776 -1410 -1284 -349 146 -155 -987 -657 -1491
7299a491o91J224N66M89L61j85j049n76m09n5J216J1j034K33R70m44oM39J01N84
$$ -1491 -2182 -958 -392 97 458 273 -776 -1352 -1761 -1816 -600 -589 -1623 -1390 -420 -864 -870 -431 -330 254
7279B54r59m94j62r57Q5J81N79J238Q0J82l16O16k0j01L97j77j594j335p75K56
$$ 254 -705 -1199 -1361 -2318 -2233 -2052 -1473 -235 -155 27 -289 327 307 206 603 426 -1168 -2503 -3278 -3022
7259c022K96k91R87R32o89k94N91O45N69J73L3K32o38j219L29N1k8N40M67O3p0
$$ -3022 -2726 -3017 -2030 -1098 -1787 -2081 -1490 -845 -276 -103 -70 162 -476 -1695 -1366 -1315 -1343 -803 -336 -273 -343
7238c43r05O6L27j042M13Q01j0n45J28j08j44R46J74m23k80j640j84J272K288
$$ -343 -1248 -1182 -855 -1897 -1484 -683 -693 -1238 -1110 -1218 -1362 -416 -242 -665 -945 -2585 -2769 -1497 791
7219G91J102q43j302J38L04o30o56L89L26o34K52M46k94o50l01L04N5nJ072J93
$$ 791 1893 1050 -252 -114 190 -440 -1096 -707 -381 -1015 -763 -317 -611 -1261 -1562 -1258 -1203 -1208 -136 57
7199E7l72L3L09Q35p13j666k32O01J276j63r21J48K18J8j445j7K32O16l50j61
$$ 57 -315 -282 27 862 149 -1517 -1749 -1148 128 -35 -956 -808 -590 -572 -2017 -2034 -1802 -1186 -1536 -1697
7179a697L9L96j3j314R3K07J410Q02o27N43J028O8j087n76L96n10l75J251j87
$$ -1697 -1658 -1262 -1275 -2589 -2496 -2289 -879 -77 -704 -161 867 935 -152 -728 -332 -842 -1217 34 -153
7160a53p5l11o92j073l26L74K06M79M3j45k94o2pr7J250j55M62M99p8k9r94K29
$$ -153 -228 -539 -1231 -2304 -2630 -2256 -2050 -1571 -1528 -1673 -1967 -2029 -2036 -2133 -883 -1038 -576 -77 -155 -184 -1178 -949
7138i49M19J44L27j029q30%J8L16N94k53j14m7q81K26R14l03p6M3K15Q41J08n20
$$ -949 -530 -386 -59 -1088 -1918 -1918 -1900 -1584 -990 -1243 -1357 -1404 -2285 -2059 -1145 -1448 -1524 -1481 -1266 -425 -317 -837
7116h37p94m99J05P26J78q05R6Q26L19j248M6j11j00m3P02Pq69J5J643J104L50
$$ -837 -1631 -2130 -2025 -1299 -1121 -1926 -1830 -1004 -685 -1933 -1887 -1998 -2098 -2141 -1439 -1432 -2301 -2286 -643 461 811
7095H11n95j390o18j215o27M78O13O08K90N4O84L31r15p79J360J112k08J12r51
$$ 811 216 -1174 -1792 -3007 -3634 -3156 -2543 -1935 -1645 -1591 -907 -576 -1491 -2270 -910 202 -6 106 -845
7076h45r34Q41K26q84p68O16O95j0o85L33N69p5M3j712n29J057j37J149J283l84
$$ -845 -1779 -938 -712 -1596 -2364 -1748 -1053 -1063 -1748 -1415 -846 -921 -878 -2590 -3119 -2062 -2199 -1050 233 -151
7056a51m55J86R9J40j69J34m33O85J65o16N38m23n69j103R3M64L67M21O20m58
$$ -151 -606 -420 -321 -181 -350 -216 -649 36 201 -415 123 -300 -869 -1972 -1879 -1415 -1048 -627 -7 -465
7036d65O45O67k064j120J63p52J167J43J5J85j224K39J367P70R25R32o92j614
$$ -465 180 847 -1217 -2337 -2174 -2926 -1759 -1616 -1601 -1416 -2640 -2401 -1034 -264 661 1593 901 -713
7018g13k24J688J460N6o85K12j102j028o32R16J3n58p71M12n82n29J370M36j54
$$ -713 -937 751 2211 2267 1582 1794 692 -336 -968 -52 -39 -597 -1368 -956 -1538 -2067 -697 -261 -415
6999d15K67q8qP20J442l0r52k70l53m29p75J58m26p5Q09K75K00p93n89N12n56
$$ -415 -148 -236 -244 476 1918 1888 936 666 313 -116 -891 -733 -1159 -1234 -425 -150 50 -743 -1332 -820 -1376
6978a376o69J475m34q99K79J164J390o00n87j288r30j66K21J713J127J76j04l06
$$ -1376 -2045 -570 -1004 -1903 -1624 -460 930 330 -257 -1545 -2475 -2641 -2420 -707 420 596 492 186
6960A86p04l40k62q7P45J59m79l26q31O00J556K91l29p23J79O79N75k08O16k90
$$ 186 -518 -858 -1120 -1207 -462 -303 -782 -1108 -1939 -1339 217 508 179 -544 -365 314 889 681 1297 1007
6940A007k47l33p33K54l4N66O66o67o31o29k27j225p05J783m82J61P1k26O08L97
$$ 1007 760 427 -306 -52 -86 480 1146 479 -152 -781 -1008 -2233 -2938 -1155 -1637 -1476 -1405 -1631 -1023 -626
6920f26P2q64k33M17N50P00o99j126K99k19P28k97j056N19M85M06K17L57J81J37
$$ -626 -554 -1418 -1651 -1234 -684 16 -683 -1809 -1510 -1729 -1001 -1298 -2354 -1835 -1350 -944 -727 -370 -189 -52
6900e2L18l6j66o31J29P9j11J57P61J85J1n53n73J52j69O33J029k18n57J5L62
$$ -52 266 230 64 -567 -438 -359 -470 -313 448 633 644 91 -482 -330 -499 134 1163 945 388 403 765
6879G65r87n76j41L23J71j14l47L61K16O39n61o92R72R75Q14k98l52n92o55Q7
$$ 765 -222 -798 -939 -616 -445 -559 -906 -545 -329 310 -251 -943 29 1004 1818 1520 1168 576 -79 8
6859HJ111j52n28o53p94J465j96j059j56l09K55N94p34q81O96J621r39k49O89
$$ 8 1119 967 439 -214 -1008 457 261 -798 -954 -1263 -1008 -414 -1148 -2029 -1333 288 -651 -900 -211
6840b11r13l19o45o11O20J163n63K38O57J2m07J35J027l62L65L60j313p69j90
$$ -211 -1124 -1443 -2088 -2699 -2079 -916 -1479 -1241 -584 -572 -979 -844 183 -179 186 546 -767 -1536 -1726
6821a726M16J128K2J50M17J210l48p99J82K63j195k60M66L44j68Q6O79O8j22j0
$$ -1726 -1310 -182 -160 -10 407 1617 1269 470 652 915 -280 -540 -74 270 102 188 867 935 813 803
6801H03r89j78k28m28r12J8J78L28K80K27o26N97K55J84l69J59J019q5K41j123
$$ 803 -186 -364 -592 -1020 -1932 -1914 -1736 -1408 -1128 -901 -1527 -930 -675 -491 -860 -701 318 233 474 -649
6781f49J82l66j99M77n41m37O6M2K13m34O33J207j84K46n52L7L31l52j62J39j66
$$ -649 -467 -833 -1032 -555 -1096 -1533 -1467 -1425 -1212 -1646 -1013 194 10 256 -296 -259 72 -280 -442 -303 -469
6760d69J71n7K07r9o12r0q74j215l63k8N67P75R55J06j229m17Q03k99j67J338
$$ -469 -298 -355 -148 -247 -859 -949 -1823 -3038 -3401 -3429 -2862 -2087 -1132 -1026 -2255 -2672 -1869 -2168 -2335 -997
6740i97Q08K53q99k42Q53j74Q78N96p38L43k58L93J139M5j083nM87R15l95P97
$$ -997 -189 64 -835 -1077 -224 -398 480 1076 338 681 423 816 1955 2000 917 912 1399 2314 1919 2716
6720B716K83n26j524m1L46J091N04j188q60J52K15k9N62p58o14k90m07O5Q72l00
$$ 2716 2999 2473 949 908 1254 2345 2849 1661 801 953 1168 1139 1701 943 329 39 -368 -303 569 269
6700B69l00L03O28o1p73J23j48k38M94N85q6o95r04P45J74n23J87L55J61m72K87
$$ 269 -31 272 900 839 66 189 41 -197 297 882 796 101 -803 -58 116 -407 -220 135 296 -176 111
6679A11N79p16K52K51p00j294L68R87P22J175r46k102k49M33q42J211P71j23j40
$$ 111 690 -26 226 477 -223 -1517 -1149 -162 560 1735 789 -1313 -1562 -1129 -1971 -760 11 -112 -252
6660b52K1q41o82O56R00N8K95o0K01j54J34N08n78j458j040J154M54r43Q9O00
$$ -252 -231 -1072 -1754 -1098 -198 -140 155 95 296 142 276 784 206 -1252 -2292 -1138 -684 -1627 -1538 -938
6640i38o37P25R10k54j81Q79L5q48Q7K8o7J008r7k16L41k03q15L0J282m33L86
$$ -938 -1575 -850 60 -194 -375 504 539 -309 -222 -194 -261 747 650 434 775 572 -243 -213 1069 636 1022
6619A022l83p65J150p44J74K47m31K08n35J84L8J94l45N52M17l66n29j289j31
$$ 1022 639 -126 1024 280 454 701 270 478 -57 127 165 359 14 566 983 617 88 -1201 -1332
6600a332L98P51J226J42m0j93o86P23p75n43l65K71M87O6L91P8R06N3q59m94L96
$$ -1332 -934 -183 1043 1185 1145 952 266 989 214 -329 -694 -423 64 130 521 599 1505 1558 699 205 601
6579F01P4j09n69j29R39J41l8J16L55O98l68J86k76m27p19J6P79j446p82K67P11
$$ 601 675 566 -3 -132 807 948 910 1026 1381 2079 1711 1897 1621 1194 475 491 1270 -176 -958 -691 20
6558B0p25p0K38J061Q95J23q28j144K6J957l57qL91M72o92j07K10M82k83L14k13
$$ 20 -705 -775 -537 524 1419 1542 714 -430 -404 1553 1196 1188 1579 2051 1359 1252 1462 1944 1661 1975 1762
6537A762r59m77J79J04j335q54o18J303J716O82n13k52p18m49l55p66j36j191
$$ 1762 803 326 505 609 -726 -1580 -2198 -895 821 1503 990 738 20 -429 -784 -1550 -1686 -2877
6519b877j45P69J118J184J481N73L62j55K0r30k31O26j042K62l19p94j151p74
$$ -2877 -3022 -2253 -1135 49 1530 2103 2465 2310 2330 1400 1169 1795 753 1015 696 -98 -1249 -2023
6501b023M00M33O85k50j089M69M38J39N92L47j93J512K68j009l28l55j14L9o41
$$ -2023 -1623 -1190 -505 -755 -1844 -1375 -937 -798 -206 141 -52 1460 1728 719 391 36 -78 -39 -680
6482f80n75N5R51K80o7P24n02k26j40O87L74L55j392j57l8l98o23k27r84p65k16
$$ -680 -1255 -1200 -249 31 -36 688 186 -40 -180 507 881 1236 -156 -313 -351 -749 -1372 -1599 -2583 -3348 -3564
6461c564M49O72J220Q02k95J638r8j71j67j049o61M49p04O80M61l70m42J66J275
$$ -3564 -3115 -2443 -1223 -421 -716 922 824 653 486 -563 -1224 -775 -1479 -799 -338 -708 -1150 -984 291
6442B91K82j410n23L59o07q07J65L19J524J67P27K23r91p83k56o52q8J60J84N83
$$ 291 573 -837 -1360 -1001 -1608 -2415 -2250 -1931 -407 -240 487 710 -281 -1064 -1320 -1972 -2060 -1900 -1716 -1133
6422a133P98q98OP85P23r62R64Q36l3L27j68q40k86l7j095j249K80K92j15o48
$$ -1133 -335 -1233 -1227 -442 281 -681 283 1119 1086 1413 1245 405 119 82 -1013 -2262 -1982 -1690 -1805 -2453
6402b453K08M51L53P1L37J068p9K29L59p09p31N3J251L94l02N06j31j041n19P93
$$ -2453 -2245 -1794 -1441 -1370 -1033 35 -44 185 544 -165 -896 -843 408 802 500 1006 875 -166 -685 108
6382A08m54k23J128k09l92M19J250R48K25k55n46j473r52n41N35M80N01l29m96
$$ 108 -346 -569 559 350 -42 377 1627 2575 2800 2545 1999 526 -426 -967 -432 48 549 220 -276
6363b76O22J66j283o25L8N93N73Q29j343J5k35N34j23J51P17Q05N96q52j130j456
$$ -276 346 512 -771 -1396 -1358 -765 -192 637 -706 -691 -926 -392 -515 -364 353 1158 1754 902 -228 -1684
6343a684q77J357J304L57l96l93j64j66r06j125J43J32J25L72R51Q07P40k34N6
$$ -1684 -2561 -1204 100 457 61 -332 -496 -662 -1568 -2693 -2550 -2418 -2293 -1921 -970 -163 577 343 399
6324C99L25n9K05O0n48J065J86j116r95M04L35j31j29L0l08l0K92P69j11M68p10
$$ 399 724 665 870 930 382 1447 1633 517 -478 -74 261 130 1 31 -277 -307 -15 754 643 1111 401
6303D01m14p2J57n15q94K46R68J157K27K74o53j485L05j49o81K72N17j92n6j47
$$ 401 -13 -85 72 -443 -1337 -1091 -123 1034 1261 1535 882 -603 -298 -447 -1128 -856 -339 -531 -587 -734
6283g34K56J799P9n72j005j67O34n75K31P90K04q20j205j74N91O45r15K47K44
$$ -734 -478 1321 1400 828 -177 -344 290 -285 -54 736 940 120 -1085 -1259 -668 -23 -938 -691 -447
6264d47o21m86k2Q62N1Q8O14k34M4J36n03j40p54m63n2J080J632P53J78O1j339
$$ -447 -1068 -1554 -1576 -714 -663 -575 39 -195 -151 -15 -518 -658 -1412 -1875 -1927 -847 785 1538 1716 1777 438
6243D38q30J303N57l95j376K62m15j85j1P46P10k53j74n09k60J63J98r3N28J95
$$ 438 -392 911 1468 1073 -303 -41 -456 -641 -652 94 804 551 377 -132 -392 -229 -31 -124 404 599
6223E99m33p69l37M52Q4m57N87J119J7j08j56o04K53l38n36jo1k99N3J275J341
$$ 599 166 -603 -940 -488 -404 -861 -274 845 862 754 598 -6 247 -91 -627 -628 -689 -988 -935 340 1681
6202A681k58r33l74K2r62O52Q25J225j73j355m44N56M9j21M00J019R2j437j514
$$ 1681 1423 490 116 138 -824 -172 653 1878 1705 350 -94 462 511 390 790 1809 1901 464 -1050
6183a050q00j21j09R92J091j263j519R61R99l51J274Q79k51j460m65L76P45p30
$$ -1050 -1850 -1971 -2080 -1088 3 -1260 -2779 -1818 -819 -1170 104 983 732 -728 -1193 -817 -72 -802
6165h02J05O17q20k0O16N32k44l96j043l28K7R18O5j023L58R86R87Q16O54j160
$$ -802 -697 -80 -900 -920 -304 228 -16 -412 -1455 -1783 -1756 -838 -773 -1796 -1438 -452 535 1351 2005 845
6145H45o14n64J76n2n65k15K67J72M95q75P84k19j91J007m04L40J68R46k9K07
$$ 845 231 -333 -157 -209 -774 -989 -722 -550 -55 -930 -146 -365 -556 451 47 387 555 1501 1472 1679
6125A679O41K44l89m41j88j041j144o39N18L59P04L4N21N94n52r10m15p73M32
$$ 1679 2320 2564 2175 1734 1546 505 -639 -1278 -760 -401 303 337 858 1452 900 -10 -425 -1198 -766
6106g66J57n37j108R94j65J327J087m61j674O34N08o23J96P23m54l18p42M11J60
$$ -766 -609 -1146 -2254 -1260 -1425 -98 989 528 -1146 -512 -4 -627 -431 292 -162 -480 -1222 -811 -651
6087f51O4K02J0m95K34O07q89l90Q59M15l02O35O56j136j614j1k33N72O61J391
$$ -651 -587 -385 -375 -870 -636 -29 -918 -1308 -449 -34 -336 299 955 -181 -1795 -1806 -2039 -1467 -806 585
6067E85J953j96o6K1n96j946j596J072R2L41J238Q35r46j532q31j045L36Q32Q83
$$ 585 2538 2342 2276 2297 1701 -245 -1841 -769 -677 -336 902 1737 791 -741 -1572 -2617 -2281 -1449 -566
6048e66L66J0J45j142K88K25m7J965M17m99n11j7j99O84jK18j024q13K5L02k54
$$ -566 -200 -190 -45 -1187 -899 -674 -721 1244 1661 1162 651 634 435 1119 1118 1336 312 -501 -476 -174 -428
6027d28k3J395R17M24M49l15r35j005j165l12J253J226j71p75R99N13N30k64j474
$$ -428 -451 944 1861 2285 2734 2419 1484 479 -686 -998 255 1481 1310 535 1534 2047 2577 2313 839
6008H39o35P50P10J24o29j53p12K73o07o87N63O43J432n69J95l77l13r19j185
$$ 839 204 954 1664 1788 1159 1006 294 567 -40 -727 -164 479 1911 1342 1537 1160 847 -72 -1257
5989a257N66j90J28O00O11o21k00P17l04n58P41M8r2M11m3m4M24m89K63r6N8O29
$$ -1257 -691 -881 -753 -153 458 -163 -363 354 50 -508 233 281 189 600 557 513 937 448 711 615 673 1302
5967A302N13j180r75K32L61j046p04J023K282r8J67K83o53j193M45j16l54L00
$$ 1302 1815 635 -340 -108 253 -793 -1497 -474 1808 1710 1877 2160 1507 314 759 643 289 589
5949E89q56n55J148N60n10l1O92K35l11R65o10j150n22r1k77K98J62l5j97j352
$$ 589 -267 -822 326 886 376 345 1037 1272 961 1926 1316 166 -356 -447 -724 -426 -264 -299 -496 -1848
5929a848l19J262M11J73o82o63o58Q99J194O4q7p29J616L04l49M31Q7P26l41p46
$$ -1848 -2167 -905 -494 -321 -1003 -1666 -2324 -1425 -231 -167 -254 -983 633 937 588 1019 1106 1832 1491 745
5909G45P53J280j014j253m88n11p0m32O94R31O10J76o22L40m81k312P2P16P24
$$ 745 1498 2778 1764 511 23 -488 -558 -990 -296 635 1245 1421 799 1139 658 -1654 -1582 -866 -142
5890a42m18Q2R27J25M35k90j90n00k35L78o8P35M72o83p46m37R23J357j700p73
$$ -142 -560 -478 449 574 1009 719 529 29 -206 172 104 839 1311 628 -118 -555 368 1725 25 -748
5870g48Q87J16l78j76O15J562n98M88K82j61q5l21L90k24r66l0N04J29k81o31
$$ -748 139 255 -123 -299 316 1878 1280 1768 2050 1889 1804 1483 1873 1649 683 653 1157 1286 1005 374
5850C74N85P66l49j004j343J046J757k42M28N4j40j80m19j206p72K63l56J59Q35
$$ 374 959 1725 1376 372 -971 75 1832 1590 2018 2072 1932 1752 1333 127 -645 -382 -738 -579 256
5831B56N20M21K9j58q59k3M12Q72p69l58j43O62N20k06o74K48K61k40L74l60K75
$$ 256 776 1197 1226 1068 209 186 598 1470 701 343 200 862 1382 1176 502 750 1011 771 1145 785 1060
5810A060r05J67K00N56k46o41J93L01N16J13k2l74l10l40j144L27M87N3p29m69
$$ 1060 155 322 522 1078 832 191 384 685 1201 1314 1292 918 608 268 -876 -549 -62 -9 -738 -1207
5790a207J683M85L88r6j508p95k27J525J330m85r54M3J271l18N0O01M13J09j020
$$ -1207 476 961 1349 1253 -255 -1050 -1277 248 1578 1093 139 182 1453 1135 1185 1786 2199 2308 1288
5771A288j832K79L27l11L21L66N9l3m03j43j64k11J017l10m40P64R19m18l59m86
$$ 1288 -544 -265 62 -249 72 438 497 464 61 -82 -246 -457 560 250 -190 574 1493 1075 716 230
5751B30M84O61N85m50j528p08M7q75p43M95P5Q24J059M60P88r42m08L20Q5n78
$$ 230 714 1375 1960 1510 -18 -726 -679 -1554 -2297 -1802 -1727 -903 156 616 1404 462 54 374 459 -119
5731a19J0m41M92Q24K32j015K39j94N39Q99l80p79q1M72k02n90K64O13k7j494
$$ -119 -109 -550 -58 766 998 -17 222 28 567 1466 1086 307 226 698 496 -94 170 783 756 -738
5711g38j093L4J042R30J351L95k62j603q50Q17p32l58P48Q18M30RP78k64r27r
$$ -738 -1831 -1797 -755 175 1526 1921 1659 56 -794 23 -709 -1067 -319 499 929 938 1716 1452 525 516
5691E16l23J9J120j49q42j25L55L94L35r13n61m9J91m49m96J373K45m4q84m25
$$ 516 193 212 1332 1183 341 216 571 965 1300 387 -174 -223 -32 -481 -977 396 641 597 -287 -712
5671g12L88M97j351p01P08N4M9J618J757j84p63j67o79q60J410p59j518k34J331
$$ -712 -324 173 -1178 -1879 -1171 -1117 -1068 550 2307 2123 1360 1193 514 -346 1064 305 -1213 -1447 -116
5652a16J210o35p01P32J81j146o26J68p73P12M96P5k66J61L61L14O31n11M66J260
$$ -116 1094 459 -242 490 671 -475 -1101 -933 -1706 -994 -498 -423 -689 -528 -167 147 778 267 733 1993
5632A993L47M58N94p56k26J39n76o15o4j74K90R53M10k63j227L4M30L2J148L55
$$ 1993 2340 2798 3392 2636 2410 2549 1973 1358 1294 1120 1410 2363 2773 2510 1283 1317 1747 1779 2927 3282
5612C282M93n38n93o67M0q4k0m56M61l18j019L69P66R6J33L86L25r10o90j178
$$ 3282 3775 3237 2644 1977 2017 1933 1913 1457 1918 1600 581 950 1716 1812 1945 2331 2656 1746 1056 -122
5592a22j019K09J021l70o09j33M92J96P08M30N7n09m95L21J843o06m36kK40l65
$$ -122 -1141 -932 89 -281 -890 -1023 -531 -335 373 803 860 351 -144 177 2020 1414 978 976 1216 851
5572H51m73o53J095l43O15r9q65L71J154k65P58O60p8J20J65j61nn78j17o7q04
$$ 851 378 -275 820 477 1092 993 128 499 1653 1388 2146 2806 2728 2848 3013 2852 2847 2269 2152 2085 1281
5551A281m85K99K8j56j37q11M01l33J48R17O50K86q0j35R97M08j176j165N61L81
$$ 1281 796 1095 1123 967 830 19 420 87 235 1152 1802 2088 2008 1873 2870 3278 2102 937 1498 1879
5531A879P9o71J44R78M71l90j302o91L84J24q25j407R71K105L65j138j94l08k67
$$ 1879 1958 1287 1431 2409 2880 2490 1188 497 881 1005 180 -1227 -256 1849 2214 1076 882 574 307
5512C07K24K98n58J002J28r22L62l31j87R50K42m25l64m4J122L05l33j200k21
$$ 307 531 829 271 1273 1401 479 841 510 323 1273 1515 1090 726 682 1804 2109 1776 576 355
5493C55P0m87m84M0r46N6K57m45J87P23J74J155k16l84l24J463M50n0l3r07o25
$$ 355 425 -62 -546 -506 -1452 -1396 -1139 -1584 -1397 -674 -500 655 439 55 -269 1194 1644 1594 1561 654 29
5472B9O87J535J140n71j359o16R95M21P34n61m88L6R66O62P9m80r27j358n10m00
$$ 29 716 2251 3391 2820 1461 845 1840 2261 2995 2434 1946 1982 2948 3610 3689 3209 2282 924 414 14
5452A4O3p61l53R20J049m12m66O00L43N23O77P96r47q15k89O03J244Q15j919j981
$$ 14 77 -684 -1037 -117 932 520 54 654 997 1520 2197 2993 2046 1231 942 1545 2789 3604 1685 -296
5432b96n0J548L4j458n3O13P94J97J42j139k93l27O26K5m13o72N25K94P2o51O73
$$ -296 -346 1202 1236 -222 -275 338 1132 1329 1471 332 39 -288 338 363 -50 -722 -197 97 169 -482 191
5411A91J15k30p81j94O45J77M7k78K16J012R99Q00r13l53r17K14p56R47J777K12
$$ 191 306 76 -705 -899 -254 -77 -30 -308 -92 920 1919 2719 1806 1453 536 750 -6 941 2718 2930
5391B930j305q33M09j60K01M98j256l79m24J06K79O63n23j771p42J176Q29M10
$$ 2930 1625 792 1201 1041 1242 1740 484 105 -319 -213 66 729 206 -1565 -2307 -1131 -302 108
5373A08J74m57L14J23K91n1J25o63L23L05r45O93j01N04J563L19l26N2k10K11
$$ 108 282 -175 139 262 553 502 627 -36 287 592 -353 340 239 743 2306 2625 2299 2351 2141 2352
5353B352J27o67o74j266j391j4N32M77j58n05J278M78o82L60J425K93o28P9r64
$$ 2352 2479 1812 1138 -128 -1519 -1533 -1001 -524 -682 -1187 91 569 -113 247 1672 1965 1337 1416 452
5334D52J69O04P31l83o61j58J04J619M00j137q26J48k3l86K85K21M25L38P52j51
$$ 452 621 1225 1956 1573 912 754 858 2477 2877 1740 914 1062 1039 653 938 1159 1584 1922 2674 2523
5314B523j624j067K0l3l14J220Q32r28o22L09N85O35l07r47n55p78o71r8R37O87
$$ 2523 899 -168 -148 -181 -495 725 1557 629 7 316 901 1536 1229 282 -273 -1051 -1722 -1820 -883 -196
5294a96K54l54m25oj40M44R72Q58k42m12L45l16K96l68j4r25p66O46K24K49q4
$$ -196 58 -296 -721 -727 -867 -423 549 1407 1165 753 1098 782 1078 710 696 -229 -995 -349 -125 124 40
5273D0j089J70L04q90K65L68R95P34J29K01m97k92L8k1L10l74K12j86J064m5p39
$$ 40 -1049 -879 -575 -1465 -1200 -832 163 897 1026 1227 730 438 476 455 765 391 603 417 1481 1436 697
5252F97j340j243j30L80k0P44O45j1J1J311k12r90p30N02P05n65N21l3q52M6Q76
$$ 697 -643 -1886 -2016 -1636 -1656 -912 -267 -278 -267 1044 832 -158 -888 -386 319 -246 275 242 -610 -564 312
5231C12R79K55o58j041k74M72J028j74M2Q46k72k71M36M88m60R66M8j056r1M55
$$ 312 1291 1546 888 -153 -427 45 1073 899 941 1787 1515 1244 1680 2168 1708 2674 2722 1666 1575 2030
5211B030n47l96n95N9Q1j57m59J46M9q57K02P71j26k21l71k97R09j10M6N84J774
$$ 2030 1483 1087 492 551 632 475 16 162 211 -646 -444 327 201 -20 -391 -688 221 111 157 741 2515
5190B515R5n75q67M79J132q24k07r18M00m50p09m17O4j139N22L86l9n11m56K033
$$ 2515 2610 2035 1168 1647 2779 1955 1748 830 1230 780 71 -346 -282 -1421 -899 -513 -552 -1063 -1519 514
5170E14N45J136J108p49j291N53L74l19k26j411L41K54M58J104m17j089m52O75
$$ 514 1059 2195 3303 2554 1263 1816 2190 1871 1645 234 575 829 1287 2391 1974 885 433 1108
5152A108J098P98j063r24r24m16j71L15J438j69j095J14M70j06m18N8J59k77m38
$$ 1108 2206 3004 1941 1017 93 -323 -494 -179 1259 1090 -5 109 579 473 55 113 272 -5 -443
5133d43O86O32Q39M80K51j450r41k50L61Q3q50R56J264k85O1N70L07l37j49Q92
$$ -443 243 875 1714 2194 2445 995 54 -196 165 248 -602 354 1618 1333 1394 1964 2271 1934 1785 2677
5113B677M61q23j374p19j65o86M74Q77K26N67k35K43o15p68N37M09J010j85o89
$$ 2677 3138 2315 941 222 57 -629 -155 722 948 1515 1280 1523 908 140 677 1086 2096 1911 1222
5094A222K32R12j079n76k80K28J80o0P14m88n63P23M28j000J32J51J66K64L13
$$ 1222 1454 2366 1287 711 431 659 839 779 1493 1005 442 1165 1593 593 725 876 1042 1306 1619
5075A619r66l26K23L64N47o04j101k69k22K06O86o16Q69O12n93M84l2r7L78k27
$$ 1619 653 327 550 914 1461 857 -244 -513 -735 -529 157 -459 410 1022 429 913 881 784 1162 935
5055I35n16Q1l17j95k54M56L36K83J67K26J254L13J85n53q58j81N52O8m28n26
$$ 935 419 500 183 -12 -266 190 526 809 976 1202 2456 2769 2954 2401 1543 1362 1914 1982 1554 1028
5035A028M17p5l59m28J282M98J016m31j107K23J232o49p23k99j024%K26J135R01
$$ 1028 1445 1370 1011 583 1865 2363 3379 2948 1841 2064 3296 2647 1924 1625 601 601 827 1962 2863
5016B863J48M04q11m24j43q74r15j873N00J146J178J019p13nK77K78K54m95o63
$$ 2863 3011 3415 2604 2180 2037 1163 248 -1625 -1125 21 1199 2218 1505 1500 1777 2055 2309 1814 1151
4997A151p7O9l11J000R9n18M61k60J54N98q04o93k79J48q3n81k54l1L44K40L20
$$ 1151 1074 1143 832 1832 1931 1413 1874 1614 1768 2366 1562 869 590 738 655 74 -180 -211 133 373 693
4976F93r06K83j79j58K51J07J336Q52j000j203k12Q9J367M76L65n70n47p10r0
$$ 693 -213 70 -109 -267 -16 91 1427 2279 1279 76 -136 -47 1320 1796 2161 1591 1044 334 244
4957B44J39k95m7q03m88J324J19q5R5Q53P07O25m88l30l81P72l11j232n44N65
$$ 244 383 88 41 -762 -1250 74 193 108 203 1056 1763 2388 1900 1570 1189 1961 1650 418 -126 439
4937D39K20N57k69L09k75k2q75q70QJ285J97O73M72m85q19o49l90n41N94N74Q28
$$ 439 659 1216 947 1256 981 959 84 -786 -778 507 704 1377 1849 1364 545 -104 -494 -1035 -441 133 961
4916I61p8n45j97q4N21P62M1j148N71l28O8M02q78q17m25O16N09n45J70M52m19
$$ 961 883 338 141 57 578 1340 1381 233 804 476 544 946 68 -749 -1174 -558 -49 -594 -424 28 -391
4895c91J374N57n7o9L14L77n90p75q41m72j49Q3N53L69L15L93K39o29M87L16m37
$$ -391 983 1540 1483 1414 1728 2105 1515 740 -101 -573 -722 -639 -86 283 598 991 1230 601 1088 1404 967
4874I67Lq69l8J51L85J51L48L80j97m05n36J659N17j138m7k58n5Q02P80j796q02
$$ 967 970 101 63 214 599 750 1098 1478 1281 876 340 1999 2516 1378 1331 1073 1018 1820 2600 804 2
4853Bm93J184Q47k60J75J93o79r14m63l83J23q7p7R7O25l14M60k27Q88P75m00
$$ 2 -491 693 1540 1280 1455 1648 969 55 -408 -791 -668 -755 -832 -735 -110 -424 36 -191 697 1472 1072
4832A072J52J10n03q22k98k8L96j609p49J706J660K94l96j39j65N81p9K94l44
$$ 1072 1224 1334 831 9 -289 -317 79 -1530 -2279 -573 1087 1381 985 846 681 1262 1183 1477 1133
4813A133M00M26o64k86k12k32J103Q5r94o45N20m70q41k45J083N37q11O1L60J355
$$ 1133 1533 1959 1295 1009 797 565 1668 1753 759 114 634 164 -677 -922 161 698 -113 -52 308 1663
4793A663N57J66l36r56J608J225J12j93j992m93mn7n01k34N44M52j32n31K30n4
$$ 1663 2220 2386 2050 1094 2702 3927 4039 3846 1854 1361 1357 1300 799 565 1109 1561 1429 898 1128 1074
4773A074L71r9J13K09o47J098J275o42j162M14L68O16M95m92m81n20j135k93R69
$$ 1074 1445 1346 1459 1668 1021 2119 3394 2752 1590 2004 2372 2988 3483 2991 2510 1990 855 562 1531
4754A531l09K01N95M61j14j237q21Q45P19j28J92j70m5N32L46q51q3R83N79k6
$$ 1531 1222 1423 2018 2479 2365 1128 307 1152 1871 1743 1935 1765 1720 2252 2598 1747 1664 2647 3226 3200
4734C200p56r03O88Q35q3j167L81P98m89l48L2r96P58P39j34N4M53J43n31j922
$$ 3200 2444 1541 2229 3064 2981 1814 2195 2993 2504 2156 2188 1192 1950 2689 2555 2609 3062 3205 2674 752
4714G52j334N91J741J606K49j082m59k94K23J2L49p09n85j17J224O15l82j540
$$ 752 -582 9 1750 3356 3605 2523 2064 1770 1993 2005 2354 1645 1060 943 2167 2782 2400 860
4696H60j25p85p46q40L22N34J67k13J424J598l43p27j68J63J73q44N58K4K77L56
$$ 860 735 -50 -796 -1636 -1314 -780 -613 -826 598 2196 1853 1126 958 1121 1294 450 1008 1032 1309 1665
4676A665j146O84J361Q1J9l22o67j08j74n84N31k89m51m22L44P14j7m26O27N2
$$ 1665 519 1203 2564 2645 2664 2342 1675 1567 1393 809 1340 1051 600 178 522 1236 1219 793 1420 1472
4656A472M92n05n6L03j514j53K8O01L71R3l65O3k36Q23K79n02J37m69l03l15j592
$$ 1472 1964 1459 1403 1706 192 39 67 668 1039 1132 767 830 594 1417 1696 1194 1331 862 559 244 -1348
4635a348P01J453l66P41l95q72m35O58M68p39J56L95n54P56O28M44O14p61o43
$$ -1348 -647 806 440 1181 786 -86 -521 137 605 -134 22 417 -137 619 1247 1691 2305 1544 901
4616I01j138o32L79O54j216Q62r5p3M66K63J99R6R4r4n38l93N72K67n64K41L19
$$ 901 -237 -869 -490 164 -1052 -190 -285 -358 108 371 570 666 760 666 128 -265 307 574 10 251 570
4595E70j146L47P61J22J61l90l68Q10j02P38K53O36j553p43K22Q08N86K28L31
$$ 570 -576 -229 532 654 815 425 57 867 765 1503 1756 2392 839 96 318 1126 1712 1940 2271
4576B271o29P03J817k77p43Rj228j650m9O92J247J903k96j897k61K16r8n54J1
$$ 2271 1642 2345 4162 3885 3142 3151 1923 273 224 916 2163 4066 3770 1873 1612 1828 1730 1176 1187
4557A187m74J071N49n84R13j24n58M02j189p26J59O14m13o30q86j75M86P19o7
$$ 1187 713 1784 2333 1749 2662 2538 1980 2382 1193 467 626 1240 827 197 -689 -864 -378 341 274
4538B74j115O38J636J251j97K35j167k51J6O15n33l30n32q15n67P89J95j036n72
$$ 274 -841 -203 1433 2684 2487 2722 1555 1304 1320 1935 1402 1072 540 -275 -842 -53 142 -894 -1466
4519a466j58k28K16J762J343o86m98j213k1J394J254l6K27R7j511M41J189R85
$$ -1466 -1624 -1852 -1636 126 1469 783 285 -928 -949 445 1699 1663 1890 1987 476 917 2106 3091
4501C091p6l8r74j119MO39K43p46J63R33j279j232N27O44k79o23P16N20K69Q3
$$ 3091 3015 2977 2003 884 888 1527 1770 1024 1187 2120 841 -391 136 780 501 -122 594 1114 1383 1466
4481A466o93k71L17m14P45K57j331n16J12M59N14L41L74O44o34m86j341n85K4
$$ 1466 773 502 819 405 1150 1407 76 -440 -328 131 645 986 1360 2004 1370 884 -457 -1042 -1018
4462a018P52N90Q86N80j1m40O67J47n14o84k50m29q08L52p9Q49J869N41o42m51
$$ -1018 -266 324 1210 1790 1779 1339 2006 2153 1639 955 705 276 -532 -180 -259 590 2459 3000 2358 1907
4442A907m70p84k81K73l22Q04L44r25j76r6K74K0P2n05q35k11J358M77R87K09
$$ 1907 1437 653 372 645 323 1127 1471 546 370 274 548 568 640 135 -700 -911 447 924 1911 2120
4422B120q80j024pP78O95j83j76l21J488J244q04j461L95O5L12P19J46p44J73
$$ 2120 1240 216 209 987 1682 1499 1323 1002 2490 3734 2930 1469 1864 1929 2241 2960 3106 2362 2535
4403B535j29O99J34n68j029M25o31q09l73K61L76J60o21m62O12n23q92J100Q10
$$ 2535 2406 3105 3239 2671 1642 2067 1436 627 254 515 891 1051 430 -32 580 57 -835 265 1075
4384A075j15L0p05l63m87JJ50J048L05O69J104J40K16k63p69k9j016p91K15m2
$$ 1075 960 990 285 -78 -565 -564 -414 634 939 1608 2712 2852 3068 2805 2036 2007 991 200 415 373
4364C73Q5R93j59q76P4J46j038J58P31O07p79j469L01J711J295n88q54J90j91
$$ 373 458 1451 1292 416 490 636 -402 -244 487 1094 315 -1154 -853 858 2153 1565 711 901 710
4345G10M56K02k06p04r42P81l61M51R9n7J08N37M58J4r03j138J018O81p70r96
$$ 710 1166 1368 1162 458 -484 297 -64 387 486 429 537 1074 1532 1546 643 -495 523 1204 434 -562
4325e62M09Q47Q96k95L12k39K62Q30M17J1p69r07l9K90O39k5N78l62k98L29n93
$$ -562 -153 694 1590 1295 1607 1368 1630 2460 2877 2888 2119 1212 1173 1463 2102 2077 2655 2293 1995 2324 1731
4304A731k312k32K59l19j78R34J448K42m66P38k53j272n65j1R05J129k90K94L5
$$ 1731 -581 -813 -554 -873 -1051 -117 1331 1573 1107 1845 1592 320 -245 -256 649 1778 1488 1782 1817
4285A817m83n4R53O42L33q04j163m41j07q89M4m45k77J70R85P66o16l0M95M9j264
$$ 1817 1334 1280 2233 2875 3208 2404 1241 800 693 -196 -152 -597 -874 -704 281 1047 431 401 896 945 -319
4264c19O90L56j036L26M9J25O76L61J46m28K28r0O3m56J847l79m42m09Rm42O06
$$ -319 371 727 -309 17 66 191 867 1228 1374 946 1174 1084 1147 691 2538 2159 1717 1308 1317 875 1481
4243A481N43n76M39n17q33P89J208p22K7O96q4r4l85l59k15r57K11K062n87p08
$$ 1481 2024 1448 1887 1370 537 1326 2534 1812 1839 2535 2451 2357 1972 1613 1398 441 652 2714 2127 1419
4223A419R67J014m23p83jp36j072j19J592J9j123m79K41J68k17K33m1k24j83p70
$$ 1419 2386 3400 2977 2194 2193 1457 385 266 1858 1877 754 275 516 684 467 700 659 435 252 -518
4203e18N6R04Q30N6J17n20m10O94J377L7q28j39l21j170l49J635K17J04k43l2
$$ -518 -462 442 1272 1328 1445 925 515 1209 2586 2623 1795 1656 1335 165 -184 1451 1668 1772 1529 1497
4183A497m09N4Q35J94K91m87q24Q9K96j10o09R26j48m55n14J815M12n05j590p03
$$ 1497 1088 1142 1977 2171 2462 1975 1151 1240 1536 1426 817 1743 1595 1140 626 2441 2853 2348 758 55
4163E5k7k04Q1m15j3O26K23Q12L86q04j00k0o66M07Pk51l35L77J098j94m30J0
$$ 55 28 -176 -95 -510 -523 103 326 1138 1524 720 620 600 -66 341 348 97 -238 139 1237 1043 613 623
4141F23l63J53L00K98L43P21L98p68P44k86q47l83k97l6J136O98P2l88j148p14
$$ 623 260 413 713 1011 1354 2075 2473 1705 2449 2163 1316 933 636 600 1736 2434 2506 2118 970 256
4121B56k53J0q9R22j00m70M16K83m36l92k26J75M19J057J22M13o95j170k41L68
$$ 256 3 13 -76 846 746 276 692 975 539 147 -79 96 515 1572 1694 2107 1412 242 1 369
4101C69J305J218J45j015q82k51p4R1J363n80l58j238R3J944J423K61j638j536
$$ 369 1674 2892 3037 2022 1140 889 815 906 2269 1689 1331 93 186 2130 3553 3814 2176 640
4083F40L20P9p49k09N25l10M09j35m9M54O23j15L63j38j15j350L40J311P54j12
$$ 640 960 1039 290 81 606 296 705 570 521 975 1598 1483 1846 1708 1593 243 583 1894 2648 2536
4063B536j222j010O7P74P79o99K68N73o91r32O61J085j100j018k87M86J330R10
$$ 2536 1314 304 371 1145 1924 1225 1493 2066 1375 443 1104 2189 1089 71 -216 270 1600 2510
4045B510L0j985r89Q70Q84j174k90K55k01O27P63j76J051J257n23j78m55M07M3
$$ 2510 2540 555 -434 436 1320 146 -144 111 -90 537 1300 1124 2175 3432 2909 2731 2276 2683 2726
4026B726p27l60p23O60k84J01o28l69k65m69J82O34J248J3k73j465k16J013P52
$$ 2726 1999 1639 916 1576 1292 1393 765 396 131 -338 -156 478 1726 1739 1466 1 -215 798 1550
4007A550q29n71Q39L21P61J684O05j095r11O93L27K33q10K45m78l95p09J56J19
$$ 1550 721 150 989 1310 2071 3755 4360 3265 2354 3047 3374 3607 2797 3042 2564 2169 1460 1616 1735
$$ [...]
##END NTUPLES=NMR SPECTRUM
##END=
