##TITLE=Analysis number 307806
Compound Code gk 01297
Book Reference 380/200/3
Project Code adrs
Chemist Name ronp
##JCAMPDX= 6.0         $$ Bruker NMR JCAMP-DX V2.0
##DATA TYPE= NMR SPECTRUM
##DATA CLASS= NTUPLES
##ORIGIN= Bruker BioSpin GmbH
##OWNER= NMR
$$ XWIN-NMR		Version 3.5
$$ Fri May 13 12:17:46 2005 GMT Daylight Time (UT+1h)  MAYBRIDGE\NMR@NMR_250MHZ
##.OBSERVE FREQUENCY= 250.131544655141
##.OBSERVE NUCLEUS= ^1H
##.ACQUISITION MODE= SIMULTANEOUS (DQD)
##.ACQUISITION SCHEME= undefined
##.AVERAGES= 16
##.DIGITISER RES= 18
##SPECTROMETER/DATA SYSTEM= dpx250
##.PULSE SEQUENCE= zg30
##.SOLVENT NAME= CDCl3
##.SHIFT REFERENCE= (INTERNAL, CDCl3, 0, 16.4522)
##AUDIT TRAIL= $$ (NUMBER, WHEN, WHO, WHERE, WHAT)
$$ ##TITLE= Audit trail, XWIN-NMR		Version 3.5
$$ ##JCAMPDX= 5.01
$$ ##ORIGIN= Bruker BioSpin GmbH
$$ ##OWNER= NMR
$$ C:\u/data/dgb/nmr/ADRS/2880/pdata/1/auditp.txt
$$ ##AUDIT TRAIL=  $$ (NUMBER, WHEN, WHO, WHERE, WHAT)
(   1,<2005-05-13 12:17:27.63 +100>,<MAYBRIDGE\NMR>,<NMR_250MHZ>,
      <created by zg, POWCHK disabled, PULCHK disabled
       configuration hash MD5:
       62 19 C7 07 E1 42 D1 B7 37 6C 3D D0 77 39 F9 E6
       data hash MD5: 64K
       1C 57 12 BD 43 EA CA B6 2E C9 82 3F E1 23 50 20>)
(   2,<2005-05-13 12:17:38.48 +100>,<MAYBRIDGE\NMR>,<NMR_250MHZ>,
      <Start of raw data processing
       ef LB = 0.3 FT_mod = 6 PKNL = 1 SI = 32K 
       data hash MD5: 32K
       12 C5 DE 39 EE EB 71 05 A1 EA E7 1F 70 4C C1 0A>)
(   3,<2005-05-13 12:17:40.17 +100>,<MAYBRIDGE\NMR>,<NMR_250MHZ>,
      <apk 
       data hash MD5: 32K
       4B 86 C4 CD 22 5A 4F FE 7D A4 34 39 F6 DD 27 7E>)
(   4,<2005-05-13 12:17:40.84 +100>,<MAYBRIDGE\NMR>,<NMR_250MHZ>,
      <abs ABSG = 5 
       data hash MD5: 32K
       83 38 FE 18 FF 2D DC A8 05 DC 87 2B 3A 9B 2E BD>)
$$ ##END=
$$ 
$$ hash MD5
$$ 41 63 3A FA 05 81 D2 F8 A4 89 A1 09 E7 41 55 FB
##$RELAX= 
##$RELAX= 
##$RELAX= 
##$RELAX= 
##$RELAX= 
##$RELAX= 
##$RELAX= 
$$ Bruker specific parameters
$$ --------------------------
##$DU= <C:\u>
##$EXPNO= 2880
##$NAME= <ADRS>
##$PROCNO= 1
##$TYPE= <nmr>
##$USER= <dgb>
##$AMP= (0..31)
100 100 100 100 100 100 100 100 100 100 100 100 100 100 100 100 100 100 
100 100 100 100 100 100 100 100 100 100 100 100 100 100 
##$AQSEQ= 0
##$AQ_mod= 3
##$AUNM= <au_zg>
##$AUTOPOS= <25 >
##$BF1= 250.13
##$BF2= 250.13
##$BF3= 250.13
##$BF4= 250.13
##$BF5= 500.13
##$BF6= 500.13
##$BF7= 500.13
##$BF8= 500.13
##$BYTORDA= 1
##$CFDGTYP= 0
##$CFRGTYP= 5
##$CHEMSTR= <none>
##$CNST= (0..31)
1 1 145 1 1 1 1 1 1 1 1 1 1 1 1 1 1 1 1 1 1 1 1 1 1 1 1 1 1 1 1 1 
##$CPDPRG= <>
##$CPDPRG1= <>
##$CPDPRG2= <>
##$CPDPRG3= <>
##$CPDPRG4= <mlev>
##$CPDPRG5= <mlev>
##$CPDPRG6= <mlev>
##$CPDPRG7= <mlev>
##$CPDPRG8= <mlev>
##$CPDPRGB= <>
##$CPDPRGT= <>
##$D= (0..31)
0 1 0 0 0 0 0 0 0 0.06 0 0 0 0 0 0 0.0002 0 0 0 0 0 0 0 0 0 0 0 0 0 0 
0 
##$DATE= 1115983046
##$DBL= (0..7)
120 120 120 120 120 120 120 120 
##$DBP= (0..7)
150 150 150 150 150 150 150 150 
##$DBP07= 0
##$DBPNAM0= <>
##$DBPNAM1= <>
$$ [...]
##$SUBNAM7= <"">
##$SUBNAM8= <"">
##$SUBNAM9= <"">
##$SW= 20.6930455092707
##$SWIBOX= (0..15)
0 0 3 0 0 0 0 0 0 0 0 0 0 0 0 0 
##$SW_h= 5175.983436853
##$TD= 65536
##$TD0= 1
##$TE= 295.16
##$TE2= 300
##$TE3= 300
##$TEG= 300
##$TL= (0..7)
0 120 120 120 120 120 120 120 
##$TP= (0..7)
150 150 150 150 150 150 150 150 
##$TP07= 0
##$TPNAME0= <>
##$TPNAME1= <>
##$TPNAME2= <>
##$TPNAME3= <>
##$TPNAME4= <>
##$TPNAME5= <>
##$TPNAME6= <>
##$TPNAME7= <>
##$TPOAL= (0..7)
0.5 0.5 0.5 0.5 0.5 0.5 0.5 0.5 
##$TPOFFS= (0..7)
0 0 0 0 0 0 0 0 
##$TUNHIN= 0
##$TUNHOUT= 0
##$TUNXOUT= 0
##$USERA1= <user>
##$USERA2= <user>
##$USERA3= <user>
##$USERA4= <user>
##$USERA5= <user>
##$V9= 5
##$VALIST= <valist>
##$VCLIST= <CCCCCCCCCCCCCCC>
##$VD= 0
##$VDLIST= <DDDDDDDDDDDDDDD>
##$VPLIST= <PPPPPPPPPPPPPPP>
##$VTLIST= <TTTTTTTTTTTTTTT>
##$WBST= 1024
##$WBSW= 4
##$XGAIN= (0..3)
0 0 0 0 
##$XL= 0
##$YL= 0
##$YMAX_a= 390107
##$YMIN_a= -401238
##$ZGOPTNS= <>
##$ZL1= 120
##$ZL2= 120
##$ZL3= 120
##$ZL4= 120
##$ABSF1= 16.45217
##$ABSF2= -4.241003
##$ABSG= 5
##$ABSL= 3
##$ALPHA= 0
##$AQORDER= 0
##$ASSFAC= 0
##$ASSFACI= 0
##$ASSFACX= 0
##$ASSWID= 0
##$AUNMP= <proc_1d>
##$AZFE= 0.1
##$AZFW= 0.1
##$BCFW= 0
##$BC_mod= 0
##$BYTORDP= 0
##$COROFFS= 0
##$CY= 12.5
##$DATMOD= 1
##$DC= 0
##$DFILT= <>
##$DTYPP= 0
##$F1P= 14.0000005364418
##$F2P= -0.99999901652339
##$FCOR= 0.5
##$FTSIZE= 32768
##$FT_mod= 6
##$GAMMA= 0
##$GB= 0
##$INTBC= 1
##$INTSCL= 1
##$ISEN= 128
##$LB= 0.3
##$LEV0= 0
##$LPBIN= 0
##$MAXI= 10000
##$MC2= 0
##$MEAN= 0
##$ME_mod= 0
##$MI= 0
##$NCOEF= 0
##$NC_proc= -2
##$NLEV= 6
##$NOISF1= 0
##$NOISF2= 0
##$NSP= 0
##$NTH_PI= 0
##$NZP= 0
##$OFFSET= 16.45217
##$PC= 1
##$PHC0= -65.77915
##$PHC1= 7.017061
##$PH_mod= 1
##$PKNL= yes
##$PPARMOD= 0
##$PSCAL= 4
##$PSIGN= 0
##$REVERSE= no
##$SF= 250.130017464325
##$SI= 32768
##$SIGF1= 0
##$SIGF2= 0
##$SINO= 400
##$SIOLD= 32768
##$SREGLST= <1H.CDCl3>
##$SSB= 0
##$STSI= 32768
##$STSR= 0
##$SW_p= 5175.98343685301
##$SYMM= 0
##$S_DEV= 0
##$TDeff= 65536
##$TDoff= 0
##$TI= <Analysis number 999999
Compound Code 99
Book Reference 9
Project Code 9>
##$TILT= no
##$TM1= 0
##$TM2= 0
##$TOPLEV= 0
##$USERP1= <user>
##$USERP2= <user>
##$USERP3= <user>
##$USERP4= <user>
##$USERP5= <user>
##$WDW= 1
##$XDIM= 32768
##$YMAX_p= 370380964
##$YMIN_p= -97630
$$ End of Bruker specific parameters
$$ ---------------------------------
##NTUPLES= NMR SPECTRUM
##VAR_NAME=  FREQUENCY,     SPECTRUM/REAL,   SPECTRUM/IMAG
##SYMBOL=    X,             R,               I
##VAR_TYPE=  INDEPENDENT,   DEPENDENT,       DEPENDENT
##VAR_FORM=  AFFN,          ASDF,            ASDF
##VAR_DIM=   32768,         32768,           32768
##UNITS=     HZ,            ARBITRARY UNITS, ARBITRARY UNITS
##FACTOR=    0.157963299565203, 1,           1
##FIRST=     4115.18142393416, 0,            0
##LAST=      -1060.80201291885, 0,           0
##MIN=       -1060.80201291885, -97630,      0
##MAX=       4115.18142393416, 370380964,    0
$$ Real data points
##PAGE= N=1
##DATA TABLE= (X++(R..R)), XYDATA
$$ [...]
23522 -12563 -41463 -47836 -41142 -30754 -24261 -39047 -19735 -19412 -13899 -4483 12276 26622 48630
23509 48630 25647 9710 33179 13592 -26677 -14839 -9787 -50957 -35153 -458 15031 12680
23497 12680 4762 -14429 -33544 -8316 -3327 -45080 -45925 -10717 -19988 -19917 -21897 -27930 -21225 -3620
23483 -3620 12625 22077 54332 73416 71902 63200 38076 29801 14857 7549 -1955 -2030 1008 4326
23469 4326 1450 -15184 -25388 -32075 -27921 -17660 -17558 -15639 -13548 -41055 -29797 -9457 1077
23456 1077 30997 50124 39782 27051 14745 17658 7978 12007 23483 28123 1929 -9394 -2967
23443 -2967 -8249 -24446 -21189 2883 13398 2944 -7096 2183 -10552 1418 -5154 -30063 -42034
23430 -42034 -43278 -20539 13428 29893 314 -27696 -6205 7922 12881 -3478 -1474 8831
23418 8831 4369 31504 28661 17353 8673 2752 12982 3382 904 1944 -20791 -19422 -18794 -13601
23404 -13601 13073 2179 -8558 -6945 -7036 -1114 -15428 -2173 -2728 4197 12994 14758 30145 43144
23390 43144 48398 40177 44186 44903 48812 51384 18706 -5299 3774 9022 -2648 -19867 -48498
23377 -48498 -37946 -35413 983 21420 20952 7402 -3777 13109 3342 -5633 2068 12108 19543
23364 19543 25687 -4498 -17526 3156 30119 5305 -23876 -26232 -44247 -39999 -15872 5307
23352 5307 -9103 -19079 -4054 3733 -8495 -21456 2976 8809 -8284 -9186 -847 -13686 -33464
23339 -33464 -15699 9926 10481 15830 39123 46956 39693 21955 17783 13924 7256 2021 29388
23326 29388 43972 21995 16526 9901 -20780 -21992 -30052 -41288 -19820 17507 24851 12959 24154
23313 24154 42555 46225 30154 1880 753 -19606 -27129 -7586 7800 14746 2539 -26255
23301 -26255 -22849 -28269 -31421 -17082 -1411 -7269 -27045 -25216 16121 38997 16713 29600 21100
23288 21100 11015 15873 11148 -17545 717 34474 42343 11476 1058 -9659 -23001 -20402
23276 -20402 1042 2403 -6382 -10890 3220 3325 -8689 -42855 -36126 -16432 -9559 216 17264
23263 17264 10710 23249 16506 -33094 -41161 -2904 24304 7935 18008 13053 11962 15080 3470
23250 3470 2034 5784 -4359 -8484 -3794 -14369 -35180 -40844 -15930 -9482 -6727 2144 -18602
23237 -18602 -25305 -51716 -68930 -52612 -21592 -18395 -18227 -34433 -6458 32568 32460 31406 29280
23224 29280 22030 7444 7462 12543 -32301 -44052 -29605 -9109 -17887 -36734 -37120 -41672 -37015 -13406
23210 -13406 9583 18168 4972 -10110 -24825 -27213 -10453 -3303 2228 23296 30932 -4112 -19987
23197 -19987 -680 214 -25737 -35315 -8818 9618 -6413 3176 3431 -6517 -12623 -4174 -14699
23184 -14699 -29681 -23979 -1235 17033 23357 18575 14609 19153 -13331 -15671 -28858 -53927 -49957
23171 -49957 -50987 -31961 -17766 -45490 -58358 -40836 -52298 -44945 -41470 -52488 -36332 -27667
23159 -27667 -26276 -12015 -23481 -16453 -19457 -6645 7146 -16647 -19937 -11557 -25642 -23885 -12522
23146 -12522 3032 -3204 -16263 -19647 -5790 2817 -15558 -22044 3920 38224 26951 26843 17964
23133 17964 5605 -28916 -43206 -34589 -30156 -23059 3136 2013 -24642 -36786 -27107 -25632 -18055
23120 -18055 22526 48809 37319 8676 -15462 -32113 -25359 2211 3052 3308 16950 818 2541
23107 2541 4477 -7886 -27228 -46566 -45593 -20329 -9531 -6239 8950 -1231 -216 18717 47244
23094 47244 20596 -22269 -9428 4082 -14742 9137 22799 26770 9910 8572 12950 23691
23082 23691 12566 9262 22604 25104 62419 58132 40649 46155 39613 12053 -15562 -7471 18721
23069 18721 23245 18985 30472 24423 11522 16768 5979 8077 -11863 -22361 -10570 -25110 -14835
23056 -14835 -9000 -5273 -1425 -12526 -9405 -12845 -7803 -1338 -12165 -11111 8069 26059 8702
23043 8702 16206 21391 14784 -13173 -4331 -3724 -9335 -26636 -18988 10 1107 -7694 -25144 -22245
23029 -22245 -7986 -1361 6468 8588 8447 -27169 -10221 10343 26617 25622 7675 15458 3402
23016 3402 -7679 -2391 -17333 -22206 -8805 -2218 9379 31339 22932 14294 1663 -11815 -15649
23003 -15649 207 28498 25189 10072 13662 12665 7717 11894 2354 9187 21972 12906 3566 21314
22989 21314 18712 -13181 -21454 -20001 -8597 -2395 22585 19407 7244 16876 9860 14473 14703 9856
22975 9856 16358 15663 3614 4231 -184 -3297 -12486 -24643 -18275 -18181 -10258 -18977 -18356 -24800 -19300
22960 -19300 -12070 -5033 6270 -3691 -8184 10394 31328 7027 -35163 -31628 -37317 -24082 -4286
22947 -4286 -14013 -12016 -5086 6441 8292 -5206 -14246 -9047 -1504 5165 15308 17226 -14747 -25887
22933 -25887 -44997 -44803 -21923 9037 8507 6304 20408 11759 1416 -407 2030 22250 17786
22920 17786 -2865 -15103 -25066 -16467 -125 62 -10448 -7807 363 -15851 -29094 -51030 -25966
22907 -25966 -13325 -28655 -18111 20788 55983 52581 28107 11380 12731 10934 23721 40116
22895 40116 60894 45340 25745 9719 8003 16251 24600 8698 -6776 -21913 13710 14311 -6992
22882 -6992 -20838 15968 42461 41927 45980 44090 27128 9539 18401 13034 -23116 -39916 -38853
22869 -38853 -49372 -41970 -47028 -50804 -55353 -56226 -41365 -16926 -24206 -30158 -18334 -3603 14248
22856 14248 16747 28459 52359 50779 46067 47746 39052 34783 28808 3183 12027 16569 21101 -11253
22842 -11253 -25426 -23479 -20632 16615 32132 4070 -486 16309 11500 -874 -4213 8613 1815
22829 1815 -16321 -28110 -5059 2935 1252 -9682 -21050 -21220 -7124 17046 20615 30710 38682
22816 38682 40917 31872 44393 39188 36601 16507 17163 13445 8722 4020 13066 -2728 -16781 -30815
22802 -30815 -45563 -50350 -37399 -35180 -40507 -28337 -21732 -44654 -37184 -22105 -5683 18315 28451
22789 28451 28925 40550 25572 31953 17710 13822 9434 3156 -17072 -1189 -22935 -34777 -11462
22776 -11462 3894 8129 -15581 -11458 -7502 -5015 -9400 5472 6147 -7256 -44438 -52180 -32868
22763 -32868 -37615 -50635 -49208 -33612 -19671 -3643 -12512 -7968 -14465 -7419 -2994 -18953 -32604
22750 -32604 -11963 -30394 -47713 -41216 -4072 28098 33609 42451 15294 -12963 1936 -1544
22738 -1544 -50007 -58890 -42350 -31881 -10191 2029 29257 34076 11846 -6909 -2772 -20862
22726 -20862 -13599 13240 -553 -4140 22028 24684 3538 9898 36737 33634 22743 -14052 -33450
22713 -33450 -35399 -37487 -40252 -33590 -19364 -7028 1896 -658 -41471 -61912 -53172 -43066 -27159
22700 -27159 -5163 688 -5679 11170 20343 7804 -12224 -21243 -30550 -15004 -171 -18127 -12270
22687 -12270 2491 3616 -2828 4785 30491 6873 -28898 -31537 -1260 6548 36798 17505 4662
22674 4662 -17758 -19439 -19341 -7747 -3101 -5130 -10343 -6303 -5640 -5460 -6615 -9336 -8900 -7580 74
22659 74 -6605 -27966 -23750 -13551 -28350 -47212 -55108 -57299 -42385 -21778 4728 3577 -8000
22646 -8000 -584 -4598 -13045 9732 2449 -7359 17284 15473 16695 10933 8769 5510 13892 1644
22632 1644 -3057 331 14371 -9211 -31853 -23374 -23239 -29960 -15498 -3669 6171 13594 8155 22387
22618 22387 25479 31031 44485 43639 13571 13492 12997 17746 11181 3447 24045 9520 6443 52443
22604 52443 65520 40943 34522 41768 39722 22629 3882 -1899 11714 8247 7444 21928 43099
22591 43099 25720 24357 7459 7101 8553 26255 43479 52224 18120 -5463 -20364 -11572 11143
22578 11143 22745 9049 -134 27575 30749 43432 53305 10625 -15227 -5392 -5220 -17668 3024
22565 3024 18963 9820 -7203 -22516 -18466 -2507 -15182 -10200 -7108 -8049 -17098 1665 2409 11778
22551 11778 33489 29354 -541 -16000 -22890 -33101 -31590 -23817 -12389 -523 8652 16624 17926
22538 17926 24293 12747 3399 -17904 -20782 15310 38990 31840 58643 73966 40736 9103
22526 9103 14525 19120 -1198 -15714 -13728 -16030 6453 9467 5107 10042 -2309 6992 24113
22513 24113 28675 18275 19930 22765 16574 41686 43383 25400 26168 23443 -12010 -21117 6198
22500 6198 14980 -11452 -26638 -12348 15843 27088 34474 31923 19116 1764 -3483 -14016 -19140
22487 -19140 -12210 -23416 -21420 -8158 9461 30937 34566 27399 3887 -7562 -20961 -10867
22475 -10867 -23181 -23375 -25349 2007 913 -12575 -32446 -34545 -25340 -25730 -31168 7205 17780
22462 17780 -4178 -19498 -24500 -26718 -2957 9484 1468 -2918 2112 8572 30098 58330 48632
22449 48632 31562 12265 2221 12666 34345 42557 28748 32087 44479 34908 15696 7282
22437 7282 -10598 -6665 2313 -9853 -8439 7995 4133 13846 38297 68832 58804 56049 68419
22424 68419 42650 6903 -21881 1116 1368 1540 840 -10420 -13538 -6648 -2411 -28922 -46789
22411 -46789 -26892 -31595 -36943 -22034 -2933 -11855 -8361 5391 4492 2963 7354 24829 39994
22398 39994 41593 18495 2905 7443 5354 4175 20418 29081 22813 508 -17494 10253 20258
22385 20258 20794 -735 18528 3308 -16335 -15276 11897 13339 -675 11639 16430 37519 43102
22372 43102 52309 30167 20908 13747 -3070 -12492 -14086 -42698 -31667 -16384 -9459 -17730 -15536
22359 -15536 5529 17600 23988 9365 -19357 -14271 -13168 -9468 22970 36559 32248 16817 10454
22346 10454 -5133 -35175 -37940 -35649 -54619 -55564 -46119 -17041 -12197 -2118 7803 -18086 -13391
22333 -13391 3450 -23315 -27305 21350 23846 4926 -4717 -27823 -37816 -23888 -5220 611 10860
22320 10860 8258 -14614 -6917 565 -3485 429 -20455 -19982 -18951 -16043 -24993 -27873 -22181 -12785
22306 -12785 -16064 -15729 -27930 -36726 -51674 -17190 9469 36626 43157 21786 -11480 -9069 6735
22293 6735 19131 33061 19230 9839 3674 7367 -7698 -7140 10449 5144 10625 26310 53282
22280 53282 31601 9204 15050 16914 -11014 -5887 12999 4169 -14104 8328 20068 24636 28128
22267 28128 13890 9521 2841 -24000 -27053 -30197 -20235 -2809 -17311 -16359 -22567 -9643 -12221
22254 -12221 -4623 -1910 14654 19302 13377 10211 5834 11822 18841 9316 951 -4945 -14207 -13269
22240 -13269 -1350 13089 11513 29521 30392 25382 40296 27297 -9431 -34174 -24840 9848 12962
22227 12962 5595 11659 35062 35057 -19946 -9186 -5293 -3243 -17019 -39356 -30358 -11160 2856
22214 2856 6846 44029 43548 37641 16040 -3152 -35109 -22774 -16281 -25905 -24041 -10212 -14215
22201 -14215 -2568 2514 9915 11843 17539 -17343 -18721 -18343 -29694 -31201 -49212 -48124 -25210
22188 -25210 -32029 -34113 -34219 -35843 -13852 -40069 -47810 -8213 12591 10722 -2157 -15704 -15554
22175 -15554 -20561 -27260 -2278 28891 36957 28820 18940 -9174 -16968 -10188 -7338 5012 17591
22162 17591 32969 21938 13884 13057 4941 -5485 -8583 15201 21443 15552 -5725 16107 35400
22149 35400 36839 19393 25871 25464 9484 13797 18013 1770 -13734 -49623 -36953 -18201 -24841
22136 -24841 -21359 -7976 -9998 -9541 -5133 6304 28527 19910 2496 -7012 10463 5526 -1609
22123 -1609 -14624 -15337 -25475 -20778 -11823 14020 6310 -7902 17465 12515 6598 12131 16199 21366
22109 21366 4580 3099 16777 18071 15988 29486 39497 27946 -11966 -12483 -18379 9529 16221
22096 16221 7251 1219 -24819 -33244 -17056 10540 18415 35690 28772 11979 -2979 16087 -7393
22083 -7393 -14942 -5237 -5412 2180 -25938 -12063 -13843 -34697 -39676 -25327 -12092 -3769 2986 8948
22069 8948 30635 29160 10763 -1528 21453 47914 19968 3278 926 10290 11574 -4001 10116
22056 10116 -14930 -33905 -32516 -22755 -13736 -5044 4474 -2689 20804 26422 2936 -7683 -13219
22043 -13219 -12795 -40172 -37407 -1953 28819 32632 2207 -32134 -41904 -12138 -18132 -28451 -5667
22030 -5667 -19775 -26379 -35719 -57386 -63742 -30978 -7601 -4838 -9936 -22367 -20082 -13063 9276
22017 9276 11869 12818 -3593 -14550 -5910 -23833 -22321 -37165 -25551 -9425 2703 10810 20127
22004 20127 17712 11366 6969 -1061 10317 10909 11092 22916 21446 11842 -3518 -2271 6251 15205
21990 15205 8470 22791 38405 24151 746 18184 48007 34780 17133 6136 36846 54293
21978 54293 40502 23430 24147 20747 -359 -32765 -15113 24414 18035 -16622 -22879 -20346 -22271
21965 -22271 -13001 -9824 9542 -2507 -14641 -22140 -15519 7224 13961 -1252 15195 -1348 6828
21952 6828 6531 -11965 -19577 -31467 -26330 -16508 13736 23755 27977 4633 27606 29857 12740
21939 12740 24230 27370 6236 11151 14567 6172 6898 4883 -151 -13748 -17069 -21917 -16820 -22941
21925 -22941 -37623 -39329 -36488 -34447 -22911 -50909 -45917 -19929 -16120 -3438 -18649 9116 46065
21912 46065 44070 33866 33942 28680 20754 12508 -19196 -16919 -23151 -31601 -25975 -55707 -63436 -34187
21898 -34187 -11640 -259 23522 23792 9518 12943 23207 31644 23062 868 16613 32286 35289
21885 35289 27706 34809 16208 3592 33447 36284 24405 4521 25593 56118 37304 32827
21873 32827 24476 17575 14510 13657 9468 -5467 -24883 5568 10358 1192 23571 21066 37192
21860 37192 18791 -2449 -9988 -3461 -13091 7747 27131 57344 56361 39029 13640 -189 -12864
21847 -12864 -14666 1808 25898 22030 8775 11806 16536 27671 23667 13229 4736 6209 -1049
21834 -1049 -10537 -4376 -2317 5167 2524 -715 3924 2224 -16813 -51574 -55176 -54781 -39672 -18639
21820 -18639 -2918 -13863 10289 8007 -14583 -14803 5710 -7176 -8312 5108 699 -3446 -12340
21807 -12340 -6007 13838 9887 8623 20694 36906 20407 19630 850 -3062 7894 15586 -5558
21794 -5558 -36222 -34052 -10432 9388 22655 23897 14240 6432 6906 -2193 -9128 -13478 -8512 26734
21780 26734 44730 15717 3074 11687 24754 14896 24849 36491 36103 19071 21975 36035 34975
21767 34975 14162 15536 13635 9183 -8090 -7942 -10624 -18815 473 -8606 -1084 14171 4385 -3520
21753 -3520 16066 7397 15561 -687 -9872 -26447 -36132 -14796 -22990 -19487 -13492 -19246 -21431 2573
21739 2573 12795 17704 13857 13684 7608 876 8276 23290 22624 540 -11692 -36366 -40772 -30332
21725 -30332 -1903 -14422 -27452 -41775 -12025 21811 27561 30758 30859 20411 3345 -1334 2730
21712 2730 -4631 -27202 -38317 -17281 8852 -15360 -19041 7224 7275 64 19571 32544 28512
21699 28512 24881 16036 14170 10647 -17434 -35847 -11256 -16269 -7503 -2148 13417 7092 -24231
21686 -24231 -18422 2878 10483 -3075 17161 52728 42271 21712 -1461 -13934 -28464 -31621
21674 -31621 -22756 -11803 1272 9066 25375 44112 34116 10022 -6201 -38666 -56867 -61940
21662 -61940 -49301 -1044 13336 -18429 -37960 -38732 -51085 -46961 -50762 -48064 -28839 -34583 -30030
21649 -30030 -20323 -19756 -26193 -25942 -28323 -16329 19336 24480 19491 -1746 -10132 9178 5667 3527
21635 3527 -1449 -19738 4950 -4870 -6124 -6945 -14381 -23153 -19492 -26845 -10507 -3766 -16278 -20549
21621 -20549 -6942 10311 16923 4106 14412 23184 21678 26125 -783 -30826 -30239 -19756 -18650
21608 -18650 -11302 610 -3876 -1562 -5820 7738 24322 21414 11265 -8288 -10379 -547 19358
21595 19358 19102 4144 4962 -9896 -30251 -17014 22606 26621 -6176 -27313 -21266 14007 8126
21582 8126 -267 -24727 -1334 12850 -9527 -1884 -7066 -2715 -8029 -8704 -13283 -16098 -9162 -18610
21568 -18610 -15719 -15097 -17255 9078 29889 33714 52393 37908 12549 5428 5299 -3785 -29301
21555 -29301 -30521 -16780 -7832 -25951 -58485 -50168 -18178 -24227 -18768 -18028 -9898 -17471 -39416
21542 -39416 -46062 -45065 -52471 -50741 -37660 -7283 -6237 -30028 -26629 -16126 -22938 -33947 -2339
21529 -2339 20346 34609 33416 3341 -3197 -17011 -20606 4087 14536 -5693 -23248 -18274 -23873
21516 -23873 -26530 -12902 -6124 -37572 -21015 -9566 4927 -1288 -82 -8936 878 9150 -577
21503 -577 -19490 -22022 -5039 7402 11596 28307 31753 21103 26187 42745 21384 -10206 -5746
21490 -5746 635 17996 9097 -9373 12504 43629 56590 67591 79009 31512 1907 -11399
21478 -11399 3351 23993 3329 -9755 6970 36671 60794 58924 38102 411 -3870 8265
21466 8265 5484 2271 -2037 -1412 -17596 -25433 -15660 7797 -8058 1551 27887 48576 54394 24898
21452 24898 4576 2024 35528 39697 21644 6212 -11603 -18944 -1592 808 7999 41619 29511
21439 29511 11109 11587 -8035 13087 41067 18202 14730 15901 19470 14172 -1758 -12621 -13163
21426 -13163 -30101 -29977 -20335 -12569 -19426 -57481 -73333 -86253 -88660 -64384 -23443 -38880 -40401
21413 -40401 -38769 -40830 -30341 -23796 -29892 -43606 -43417 -22369 1626 8318 23997 26148 8122
21400 8122 1570 12692 14044 23933 44007 26954 25401 19096 26181 37461 43164 39104 19305
21387 19305 3342 -5008 2730 11496 -4337 -22305 -18135 3753 6538 -686 6437 8212 114
21374 114 -5309 7345 3085 -13502 -24371 -16748 -16075 -3276 -22953 -35428 -22226 -20278 -23789
21361 -23789 -14368 -25340 -37371 -23452 -8891 4439 10572 7434 -2590 -14331 1262 -10371
21349 -10371 -35555 -25586 -15416 -10288 7434 35319 20100 21369 5148 -3474 -719 -8806 -3143
21336 -3143 1475 -14608 -12224 668 2623 -21457 -22706 -3406 -2642 -5591 -4894 9846 8486 3045
21322 3045 -18304 -34163 -6910 11691 10834 707 -16917 -16983 5130 4172 -21650 -35919 -27649
21309 -27649 10328 16893 3763 2883 8033 -2178 -5281 17720 12670 -2586 -8784 -28061 -38870
21296 -38870 -36450 -43442 -41865 -33411 -29181 -21035 -24474 -14183 -15237 -9458 17687 39541 16359
21283 16359 -1647 4245 -21719 -22801 -29457 -22812 -34727 -31956 -9198 -20846 -22525 -4140 -12303
21270 -12303 -20288 -24276 -15068 -19950 -27236 -25793 -24179 -39679 -56722 -57029 -50336 -28052 -21583 -13921
21256 -13921 39 -9940 -708 -3676 -11816 4926 -8826 -20049 -15926 -17449 -962 2301 -12468
21243 -12468 -8784 -11563 -12437 -26700 -32001 -13411 2963 -964 1931 11628 15627 10697 23281 26496
21229 26496 24282 6828 16808 3937 -22130 -25890 -26598 -14017 -12832 2108 -2765 -42148 -48648
21216 -48648 -40595 -30902 -49326 -37401 -27655 -5663 23945 19976 -4054 -28160 -22974 -9553 -8575
21203 -8575 -12389 15616 948 -10568 3514 24057 23819 1681 -7297 3927 32646 40558 23142
21190 23142 -17315 -21989 -589 14867 34711 18531 3436 12562 23382 8566 -11399 -45155
21178 -45155 -35584 -25802 -7172 -3414 -44447 -22602 -1164 -6492 2756 -6337 46 -11125 -18411
21165 -18411 -23018 -6278 -6525 -7607 -12869 -16629 -17371 -4853 6941 -709 6312 10971 4361 607
21151 607 -3422 11121 24389 15290 2809 -5460 -19808 -38081 -42647 -36046 -13729 -15950 -217
21138 -217 -4368 -17716 4921 7149 -3383 -10142 10421 6620 5356 -7888 -14691 -21203 -39716
21125 -39716 -35377 -46378 -38065 -27415 -28370 -37127 -53483 -16347 28195 46952 60540 43750 2556
21112 2556 -17988 -26098 -9192 -10556 -15226 -31209 -23623 4932 9293 -9591 18499 13080 -14909
21099 -14909 -20270 -24822 -24250 -10411 -9535 -9654 11826 12358 -9294 6382 21598 30829 28417 38032
21085 38032 39733 31950 13313 8064 -4757 -10176 -12347 -26019 -10065 15533 2276 -2575 -8240
21072 -8240 -19420 -9279 -29757 -31633 -19131 -22672 -12882 17695 9493 15613 20661 -5833 -34231
21059 -34231 -25934 -17116 -6916 -5825 1293 1851 13448 36828 9949 9841 -7774 -13033 -3027
21046 -3027 -5234 -6793 -3857 -4833 -18908 -34742 -28114 -5467 -16238 -14621 -469 1122 -18100
21033 -18100 -36769 -39768 -36455 -36063 -16108 3432 -6497 -18749 -42983 -37487 -6968 11366 -1652
21020 -1652 -12146 -18955 -41 11890 11575 25236 38038 24690 -3011 22955 20541 -4856 -21216
21007 -21216 -37946 -20895 -2929 16876 15828 4538 6354 13034 21529 40557 45965 24801 -12274
20994 -12274 -11387 -33860 -34262 -652 16499 9876 2498 22058 45658 43559 31695 35462 16280
20981 16280 10298 12611 31571 48704 35055 11967 20357 30164 29472 15000 -3 3471 94
20968 94 3653 28234 24509 15613 6647 7162 13925 -97 8098 -323 -39735 -46894 -58200 -63040
20954 -63040 -44952 -17247 9171 26601 13243 -12491 -32700 -16225 5420 7355 -17449 -26198
20942 -26198 -53582 -48567 -41258 -25647 -16181 -6745 -12606 -8782 6379 566 -14508 -29030 -24335
20929 -24335 -31176 -16119 -15184 -3671 -14438 -38908 -44508 -54531 -48012 -31769 -24996 -16172 9978
20916 9978 11013 24338 34921 20639 26188 43150 61359 67991 30222 -574 24783 28977 21275
20903 21275 8264 -4811 7183 12770 4149 -5425 8688 10741 -148 9090 26624 29131 24718
20890 24718 6161 -22402 -37502 -28573 -21051 -16425 -21731 -6045 -7089 -32216 4389 31351 36308
20877 36308 41680 23135 28515 48347 48976 38481 13311 -10522 245 15648 13359 10603 13770
20864 13770 29160 22944 29755 37597 31992 16314 -4035 5599 20611 -11725 -37709 -28211 -17691
20851 -17691 -20777 -49693 -40502 -32749 -26176 -9645 -11685 -10189 -33825 -23048 -25098 -24325 -15754 -13276
20837 -13276 -12718 -5999 34973 36330 27299 20 -7110 15817 16808 4647 -5607 18297 17673 24194
20823 24194 20966 18759 8009 3615 -1336 -2944 1835 6973 -10538 -13375 -12988 -1192 -4636 -33150
20809 -33150 -42477 -38629 -41497 -29014 -24483 -12875 18496 8065 -22085 -35350 -43280 -34177 -32431
20796 -32431 -20464 -17113 -30310 -33415 -51149 -53469 -52779 -37117 -21816 -19926 -6934 -12801 -9892
20783 -9892 2441 6589 -4544 -28680 -31011 -38009 -53917 -43822 -9322 2427 -4110 -3395 13752
20770 13752 18713 33345 1258 -13257 -7971 -14019 -29109 -5936 10859 10032 27637 25379 9250
20757 9250 -2760 -4056 -26288 -31171 -29630 -32452 -26249 -15263 -24676 -26191 -10581 1404 -22876
20744 -22876 -5090 8081 10891 25048 39212 29768 941 -8381 15448 52105 28892 -22702
20732 -22702 -41046 -31218 -49271 -40123 -29272 -31358 -28453 -19587 -12189 -3198 -11982 -19749 -18980 -11722
20718 -11722 920 6045 7828 17911 33181 8769 -24686 -1798 22053 28126 18681 3254
20706 3254 -8940 -2598 14013 38451 36893 29434 40332 21267 478 -3855 22164 25528 20115
20693 20115 20577 33550 20315 34647 31031 16218 37658 52358 44699 21826 2362 14494
20681 14494 24354 20623 54717 44934 2257 -18601 -6632 -16902 -2555 4696 10193 -16961 -33678
20668 -33678 -36303 -38931 -5430 35621 38230 40285 36091 13287 4632 -1444 -10156 2910 9240
20655 9240 17198 17774 4604 2326 -6059 -9139 -9147 -18252 3441 44901 58583 37316 18980 8029
20641 8029 -10153 11889 34368 29926 42344 46754 36716 19398 1418 -36986 -35126 -12490
20629 -12490 19002 20211 30413 23678 29877 29164 35502 26840 -17504 -14100 -7456 -34845 -19277
20616 -19277 -7632 6672 -14627 -15169 -7269 -5566 -11129 -20683 1208 -1045 -13802 -4490 6123
20603 6123 -6170 -14400 757 -23277 -26632 -25173 -35936 -15831 -8680 -21456 -30601 -22150 -16345
20590 -16345 -28911 -21216 -34842 -37025 -31933 -17843 -15954 -29516 -28838 -20121 -14581 -29484 -35262
20577 -35262 -36468 -46590 -51803 -41207 -23783 -22945 -14966 -14876 1131 6921 5976 7569 -695 -12463
20563 -12463 -18870 -19667 -14006 -13875 -29282 -29815 -4843 16571 -15450 -30559 -15099 -20817 -13947 -24418
20549 -24418 -34052 -44209 -24450 -20700 -29638 -35055 -16085 15285 38484 52469 56545 41636 38612
20536 38612 19687 -5608 -21899 -7118 13782 13445 -24064 -27308 -10845 -12983 -12538 52 14450
20523 14450 -300 -3055 -13158 -10704 3412 -19081 -11750 6901 16340 24618 1757 -5373 -19774
20510 -19774 -21118 -11231 -9577 -7047 28825 42388 21483 -22077 -8251 450 4012 5412 4890
20497 4890 20889 25582 32499 20024 16215 17182 1478 -11437 1971 15169 13380 -2293 -11070
20484 -11070 7048 7790 7727 26159 -4386 -19956 -21428 -45822 -45221 -31334 -19495 -24212 -30399 -28894
20470 -28894 -6864 -14562 -14763 -36520 -37150 -32539 -25077 -22583 -20153 -9478 -10533 -7466 -17793 -14555
20456 -14555 -9253 -6783 -25283 -28150 -1766 -1174 -14130 -40346 -69370 -52536 -10866 -9465 -1988
20443 -1988 560 7288 20156 8959 18306 24212 -4082 -18280 -21680 -17580 -4523 9181 12851
20430 12851 7262 16808 26260 32001 1173 6792 -4443 -24799 -44063 -53235 -52568 -27183 -314
20417 -314 9126 -22453 -38679 -35810 -27842 -61200 -63335 -43746 -27579 1872 15541 13183 28076
20404 28076 12929 18287 31702 42788 22577 26514 16013 -14723 -29110 -16393 -1245 -566
20392 -566 -11038 -18378 -18124 -16136 -11807 -1575 -215 -13611 -12131 -10979 12655 8674 -7624 -26277
20378 -26277 -16175 4567 13741 30056 32522 9486 -13186 2091 15204 7532 -4698 -15993
20366 -15993 -39845 -25367 -8036 -34171 -32870 -29181 -33849 -15697 13390 23772 12533 9756
20354 9756 12633 3159 -24830 -24079 -12589 -25043 -23339 -29695 -22154 -25449 -26439 -5578 366 -10449
20340 -10449 -16967 -12270 -5848 6993 -6311 -17621 -9657 -2907 -7426 -10620 -2580 -7539 -20840
20327 -20840 484 22459 31131 26997 -2852 -14706 569 -303 -6979 -3604 3200 -20872 -30224
20314 -30224 -11877 9367 13788 5898 14246 15066 -2952 -19729 -1645 32056 20471 15484 10119
20301 10119 2874 24114 39667 20816 -26588 -29664 4591 13594 -1411 12302 17636 21264 679
20288 679 5097 -10765 -4745 -3248 189 15528 11663 21335 11695 7370 -14112 -21693 -18615 -2895
20274 -2895 -23397 -36757 -26742 -8091 25853 19622 17478 18341 17834 4320 -17437 -20033 -29281
20261 -29281 -2675 17472 5999 -1491 19189 18101 -2057 -8009 2079 -10225 -31436 -30305
20249 -30305 -18058 -15108 1183 15583 14153 -9224 -17725 -13523 -4662 -9220 -26541 -19397 -3949
20236 -3949 -633 -13143 -15761 -40915 -51867 -41219 -18930 -20521 -16533 1959 -13110 -50971 -60511
20223 -60511 -41175 -17286 -5740 -19420 -15617 -12381 -21866 -19085 -22773 -31317 -17999 4581 8538
20210 8538 -5680 -20351 -37715 -35760 -53621 -40980 -51263 -50393 -35406 -23915 -23242 -16270 -7900
20197 -7900 2098 22640 25996 18477 -10922 -2459 -31299 -44951 -46207 -39885 -39599 -39117 -58135 -68549
20183 -68549 -62574 -54904 -37067 -21300 -20239 -38687 -10775 11281 -2964 11266 6680 -19547
20171 -19547 -32774 -47072 -47849 -28537 -6420 9470 25144 178 -38633 -55703 -57382 -56702 -37991
20158 -37991 -17825 -1157 13657 4223 -5640 -44002 -73694 -75582 -50325 -15212 -23125 -22323 -9940
20145 -9940 -15967 -12268 2305 15908 8256 15558 28815 12877 -14830 -34209 -20172 -2324 -14279
20132 -14279 -23160 -6871 15810 7100 1555 -13415 1783 -750 -24868 -39941 -37766 -35727 -26380
20119 -26380 -22576 -17674 -20786 -26290 -21983 -21598 -12059 14 -14097 -22082 -25900 -23642 -15082 -20797
20105 -20797 16546 42051 18184 2283 9254 21871 -1479 -9184 -3131 2399 -12032 -34226
20093 -34226 -25488 16580 11369 9078 12747 5279 1708 72 32985 55941 41048 15661 -3955
20080 -3955 -15455 -21194 -18828 -19906 -32238 -27176 -33834 -63903 -59897 -47659 -60105 -56967 -40177
20067 -40177 -29593 -25633 -14154 -2405 18471 7983 2792 584 -10305 -13676 -10823 -7004 11307
20054 11307 15342 5788 -13681 -26197 -13156 -10556 -6188 -21681 -24791 -22553 -14846 -2070 5572
20041 5572 9234 24376 44193 36435 22752 20736 10526 23211 27138 -1705 -2723 -14010 -20047
20028 -20047 16148 34507 19951 14781 19658 19109 30561 52234 60858 45061 42080 44342 28761
20015 28761 1117 -13160 -28761 -16972 206 23756 34939 11885 2366 -17400 13921 25629
20003 25629 37901 22402 -9441 -22204 -14884 519 13380 26934 15422 -10176 -12310 6162
19991 6162 34961 33066 29955 30836 12833 38721 40702 6923 -24853 -30997 -22506 -32020 -43898
19978 -43898 -37796 -40897 -31425 -18473 -22765 -33202 -31836 -29899 -32183 -42936 -40977 -15961 2227
19965 2227 -2301 7899 -3285 -16644 -31114 -20713 827 -5154 -17019 -21340 -24930 -16344 1338
19952 1338 1000 -15334 -9657 1516 -11529 -20845 -12550 3807 -5384 -2091 -19728 -39771 -35301
19939 -35301 -21796 -11832 1361 5081 13253 -3993 -2154 -4228 -30810 -52803 -37023 8422 27111
19926 27111 22136 -492 -16272 -19683 -29863 -10228 19790 41829 29506 12795 14704 22780
19914 22780 -568 17210 7830 2782 -20815 -25394 -3079 8189 28193 28114 10816 -4938 -17998
19901 -17998 -17944 3431 18181 36183 57733 50284 25835 24793 11435 34827 28412 18261 43856
19888 43856 66198 34278 8300 -6257 -13341 -10549 107 10999 17252 -6707 -33229 -11860
19876 -11860 9559 -19054 -15438 17648 29559 45499 39798 19595 -33888 -42615 -9171 28422
19864 28422 50700 37416 37120 47144 65935 62144 49469 26155 35676 39401 23853 -6368 -9495
19851 -9495 -13383 -8963 -6255 2919 2842 -287 -17700 -17115 10464 19945 30552 39511 32788 24843 8789
19836 8789 7034 -8764 10637 -3431 -16634 -15773 -27453 -19011 666 -4290 -18889 -11175 545
19823 545 17354 12586 21807 26103 16600 15324 19231 27169 8786 10302 6188 -7995 -11222 -17843
19809 -17843 -29169 -40821 -57133 -53212 -37282 -10493 -18113 -37002 -26709 -2996 -10445 -18254
19797 -18254 -9072 -13166 762 19514 19404 -13266 -35203 -34775 -21479 -3436 7852 27443 36304
19784 36304 22252 10073 -12059 -3409 -3389 -3835 -7775 -4436 -11019 -17883 -12737 -12732 -7364 -1177 -4672
19769 -4672 -13712 -25223 3659 30767 48725 50548 44618 55232 63536 49635 9614 4860 197
19756 197 -4498 -8922 -44789 -49816 -27976 -17153 2600 23838 4700 -16014 -19333 -33734 -35375
19743 -35375 -120 -956 -17337 -31046 -7736 253 15513 9746 -4726 -14152 -16078 -27443 -19047
19730 -19047 -3420 -39175 -17234 10514 9375 6483 5721 -22680 -57204 -67760 -58468 -20536 8215
19717 8215 17600 25592 43426 38082 4128 -14810 532 -699 -16248 -19236 -23187 -55464 -22881
19704 -22881 12736 -4415 -7788 5778 16391 28839 17086 -3670 -22940 -38795 -19283 19052
19692 19052 15106 3058 -19084 -16201 -3666 8672 -703 -13927 -10076 -29907 -49737 -45842 -36630
19679 -36630 -10969 10260 10199 -5921 -9441 -22889 -30358 -18765 -12755 1412 16573 22812 15694
19666 15694 -10775 -44485 -50224 -49933 -11905 3922 -17786 -20742 1998 10872 10188 5125 9820
19653 9820 11431 519 -1683 -1594 -1830 -10431 -12820 -1685 -1300 19142 7074 -13065 15543 23593
19639 23593 25232 -8459 -30419 -13814 -1131 3446 16882 3351 11873 17484 19556 19822 -9087
19626 -9087 -11025 -283 -8447 -15812 9354 8912 -13248 -11506 -30704 -17375 -6459 -4205 -22698
19613 -22698 -37885 -60779 -48785 -45377 -29530 -16475 -15126 -1535 730 18898 44628 46362
19601 46362 8478 9483 11352 24837 -19124 -39950 -38870 -28441 -9542 8282 13967 -1916
19589 -1916 -12572 -7631 2590 23763 47282 46701 21805 -5197 12605 14423 2503 13408 35230
19576 35230 25998 19902 20839 -831 1729 2753 5135 3515 382 3155 20706 12416 12532 11235
19562 11235 -13734 -2182 -13896 -10177 13289 -4202 -12005 13574 24613 21566 4055 7348
19550 7348 632 -22927 -13101 7306 12159 -2959 -3516 16465 57191 34668 9371 17694 4953
19537 4953 -14088 -4923 4883 8993 34132 44151 34220 40249 32118 35621 27613 17088 14301 21277
19523 21277 27763 43768 34108 34089 22228 9606 -29969 -13642 -741 -12867 -19724 -39819 -7076
19510 -7076 643 -25484 -38799 -30487 7413 36668 24107 8137 6792 14961 31403 43196 40210
19497 40210 42096 12335 -3124 -11935 -7384 16110 6510 5945 -8999 -5473 -19387 -31283 -12161
19484 -12161 -2909 -5902 -51 19887 29343 39187 33220 -622 -21573 -35808 -32330 -24826 -4179
19471 -4179 17133 17028 12900 6161 11594 16562 41103 37511 13933 13014 6760 -18199 -17456 3994
19457 3994 44031 48155 21034 326 24391 58688 39284 35081 22671 -4419 -10684 -23750
19445 -23750 -31369 -61433 -66243 -49220 -26820 -18248 -4288 12411 -1795 -1022 13622 32021 37964
19432 37964 30426 34857 50088 38283 18957 10765 3193 -21774 -15353 -5818 -29075 -15482 -22403
19419 -22403 -28370 -19829 6362 -4640 -1758 1423 -802 145 -8965 12906 25316 10606 -25731
19406 -25731 -27560 -10094 -27132 -19615 -3219 18593 15325 4052 -7683 -12282 9300 -1694
19394 -1694 -29523 -28129 -16593 -9612 -4313 -19560 -45989 -26035 4360 16453 4531 10047 9333
19381 9333 4306 5101 16621 23665 -7791 1531 21990 15105 22201 5162 40328 24234 4407
19368 4407 -11270 -17987 -18324 -22562 -14616 -20922 -15141 -19863 -22207 -22122 -12032 -19789 -21023 -28364 -14148
19353 -14148 -26575 -27414 -924 20205 8600 -10121 -35371 -46031 -25661 197 3740 675
19341 675 -7618 -7777 -4557 4123 -1487 -25154 -32282 -19049 -1893 -5945 -11470 -14251 -6451 -18572
19327 -18572 -14503 5509 -13224 -38948 -41083 -23957 -44742 -33859 -20352 -49180 -65844 -17781
19315 -17781 15698 11427 -428 -13003 -31937 -13099 4410 4110 -13459 -5357 -723 12699 16677
19302 16677 30790 24662 35769 43712 31918 31356 31367 22645 12599 -4767 -44731 -42523 -26964
19289 -26964 -25348 -26289 -26399 -22715 -20626 -34886 -26809 -16977 -26127 -19072 -630 -2751 -10096 4236
19275 4236 7698 18169 30575 30292 18714 25007 15675 3753 -3419 -14179 -26561 -6157 14577
19262 14577 3562 -20362 -39230 -25695 -28314 -16102 1116 9833 -10793 -24309 -22832 -38467
19250 -38467 -53878 -33883 -23090 -27702 -34735 -20126 -13730 -23177 -32150 -45716 -44125 -28331 -15764
19237 -15764 2505 15900 2763 -14761 -3559 12895 29733 41080 36361 -6307 -15456 5890
19225 5890 5192 -19106 -15287 -22525 -24169 -7883 -9819 -14275 23571 34672 33000 34659 37482 26182
19211 26182 16499 3921 12185 15395 3167 -3920 -8015 -10590 -10205 -9364 -794 -9081 -20651 -30945
19197 -30945 -10131 -1120 14775 43738 73268 50172 14532 -11649 2925 -1419 -10444 -9438
19185 -9438 -5832 -16815 -13955 10452 46538 41958 39163 32153 44497 55716 60477 35474 10463
19172 10463 13328 9800 -4501 -12701 -29717 -22161 -11946 3523 6541 2522 713 11856 7844
19159 7844 4017 14208 21474 22959 14207 9865 -15544 -5332 3395 22327 -4098 -21512 -45819
19146 -45819 -54952 -38820 -23015 -37001 -54524 -31298 -18303 -18861 -29614 -14176 -1331 -5139
19134 -5139 -39759 -50628 -55242 -30960 -8 4903 5311 8429 1806 -12925 -8409 15343 18141
19121 18141 1506 -5794 -3390 -714 -11028 -1743 -5965 -12059 -4792 -2724 -16362 9717 21473
19108 21473 8918 -8265 -11786 6893 17074 16398 864 -23558 -26164 -14719 -4598 -4343 -15825
19095 -15825 -21853 -16443 -2271 11564 -15769 -42908 -17032 -20413 -11143 3082 610 3147 -12918
19082 -12918 -16185 -1849 17354 -5528 7905 8999 7316 14241 22803 25505 16652 14479 22344
19069 22344 3920 -4964 20522 26254 8521 -17510 -20586 -24691 -7211 18243 49786 14376
19057 14376 273 26331 48820 18677 4063 -24254 -12639 5379 21476 32663 19720 -14099
19045 -14099 12257 11621 30864 17900 7 -13104 -40504 -39147 -10743 13755 12853 31482 13231
19032 13231 -5868 -10343 11535 16847 18389 33703 28576 171 20113 24644 3384 -8467 -5007
19019 -5007 7283 -922 -11663 19422 14873 1735 -14301 -7034 1162 -1312 -9387 -8934 -117 -5919
19005 -5919 -27167 -38384 -21526 -2379 -9789 6585 16286 25692 29273 18890 -8870 -19331 797
18992 797 4418 -1534 -771 -5303 9344 13492 4991 5280 22172 15007 3903 6916 18142 9743
18978 9743 16329 9094 -21346 -6854 23373 8315 8657 -6452 -9337 -16529 -19758 -44919 -68564
18965 -68564 -31851 -27583 -33487 -26970 -28645 -28559 -26261 -21746 -7551 3730 -9367 -15000 4192 14940
18951 14940 -5703 -18828 -20037 -15908 -17833 -13637 -3832 -14385 -23286 -2262 16488 14291 10773
18938 10773 1653 -13467 -40943 -46835 -62063 -61489 -28473 -10110 4862 13889 1744 -29336 -31148
18925 -31148 -21015 -42764 -59898 -58463 -46295 -22924 -9117 -12291 -1767 23412 31853 -2801
18913 -2801 -16318 -15403 -10912 -26650 -19613 -15454 -11893 -6309 3160 11322 7877 1806 13819 15372
18899 15372 -9053 -16001 -14797 3025 1250 16273 -393 8070 18387 12006 12674 17992 14617
18886 14617 -838 -14875 -15266 -5171 12846 4650 -25149 -15189 17956 14836 1677 17275 32279
18873 32279 15641 4881 -11799 -34168 -46034 -16367 -24477 -27091 -9208 -4476 -1591 909 -3675
18860 -3675 12407 8534 -3023 -3560 -3768 3596 9280 -4580 -13648 -20364 -14097 14545 32502 32083
18846 32083 26268 2898 -10226 7138 10269 11477 -1995 -8706 -14073 4669 -14182 -12146 629
18833 629 14568 8860 -3934 2073 -10814 -1189 6614 5109 -9772 2676 26786 9291 -1676
18820 -1676 15867 5514 15181 24124 33663 29526 15136 -5357 -24248 -46677 -48797 -46817 -23776
18807 -23776 -7217 14021 23368 11450 19475 -4857 -20822 -27762 -56185 -39701 -23272 -16319
18795 -16319 -12897 -12005 -37159 -37825 -20194 -33575 -44062 -25519 1450 14381 25728 10467 -7964
18782 -7964 -7574 -9482 -28250 -29982 -502 21979 39042 20534 -4408 504 34875 83998 98479
18769 98479 101444 158298 229911 310496 365562 298512 206761 131884 68622 45888 16207 5759
18757 5759 22419 5545 3987 -1800 -20085 245 40816 56824 36827 15791 9738 -682
18745 -682 4234 7907 33168 27460 18355 8387 -19727 -36192 -16255 -138 8214 41477 26921
18732 26921 -1333 -26596 -23460 -4977 9918 7926 -10319 -5770 -18051 -26321 -4979 -9344 -9252
18719 -9252 -14923 -15675 7554 2130 -16723 -22121 4409 43250 52138 19232 -20113 -21456 -11163
18706 -11163 -1475 -14616 -25158 -34173 -14869 -997 7633 9653 9734 6842 -12944 -15613 13862
18693 13862 9737 -20437 -32664 -18327 9329 19478 7523 13464 37836 40989 26775 13934
18681 13934 22893 26239 15693 11729 9802 18639 13138 -5302 8834 18420 7622 1520 40470
18668 40470 63346 57129 59088 34133 8148 22838 41911 82013 82421 71462 92863 116733
18656 116733 142677 200078 264509 333627 341957 331939 333618 320172 310403 294520 275593 279523
18644 279523 300616 346423 377870 385791 351390 324768 299182 238688 190142 164835 131626 154222
18632 154222 166500 119064 108389 106200 114267 82362 56004 24220 18161 29281 41680 36864
18620 36864 43447 20090 8341 -7396 -18169 -18023 -7967 -25809 -33458 -9106 -985 -9807 4929
18607 4929 35191 58991 72526 52714 48109 36803 32596 44191 39883 23988 21684 36807 21474
18594 21474 20335 42974 72240 65244 78973 95087 101007 103268 120571 167030 223668 260811
18582 260811 278891 276065 230035 178240 187336 236352 265332 254858 218625 167715 146289 144552
18570 144552 138006 115143 85780 55985 31417 2931 11955 10406 -11399 -12240 -192 8967 -5779
18557 -5779 -8693 -14273 -5325 16348 29094 41483 16583 10500 7609 10684 12319 7041 16700 4791
18543 4791 -6656 -37109 -45704 -29256 -18255 -17948 -21429 -8777 19152 7458 12186 24070 20618
18530 20618 28468 17106 10595 -2028 -19013 -50896 -49729 -14434 -5006 -8060 -19257 2746 17496
18517 17496 27120 36769 30863 10999 -111 16073 38192 26615 32032 40043 52811 37381 18642
18504 18642 4861 -2209 -5683 7891 4979 10017 33500 65140 47765 35442 55149 47477 24855
18491 24855 11029 -16322 -30366 -41095 -33884 -10919 18685 22735 13213 4245 -5076 664 815
18478 815 -14965 -4838 3498 8263 -1109 2808 13261 25410 38708 34440 44865 35804 6469
18465 6469 -17710 -21259 -3122 2647 -8357 1490 -8996 -8844 3538 9738 15459 9931 452 -27039
18451 -27039 -32457 -21642 -15325 -6768 -15250 -20555 -3180 18310 19944 -4408 -33274 -44782 -54824
18438 -54824 -51683 -7079 22937 25858 32718 3242 -20601 -14722 -18664 -15959 -11596 -24671 -25138
18425 -25138 -10971 8206 21477 27580 15850 11895 4737 14462 1824 -3627 19911 38147 61072
18412 61072 54058 52287 32093 26237 29589 3822 -34684 -16490 -8246 1668 18364 21048 23396
18399 23396 31770 40761 46582 45988 46360 14314 6954 -5565 90 5482 8542 -23326 -29880 -15080
18385 -15080 6861 34372 33116 57168 39387 635 -13774 -14185 9640 -11986 -23156 5553
18373 5553 29957 15833 -6131 -5332 -8283 -11556 -257 16256 45038 29530 2437 4132 13857
18360 13857 17683 6618 6499 9034 -12997 -32505 13181 37975 35268 27667 14640 -5037 -17319
18347 -17319 -17472 -9532 12128 13322 -14169 -23139 -20295 -16582 -9704 12427 24908 18715 14353 24938
18333 24938 23290 6826 1272 9844 12499 27787 32257 31226 13752 16335 25501 19050 13239 10825
18319 10825 -4837 1955 8483 16700 16484 23521 2645 -4450 -14196 -3511 3853 -4600 -6340 -1711
18305 -1711 -8133 4507 9632 22313 29216 18814 18157 22156 29004 35361 39277 36795 40734 46199
18291 46199 38177 24574 59454 86171 81591 68368 60386 31150 34385 42672 46375 31274 8904
18278 8904 -14146 -17022 -28974 -43237 -58277 -64296 -25150 12366 29097 49844 70684 89265
18266 89265 76916 57312 37677 17915 14594 37161 30818 8534 1299 29653 36672 47734
18254 47734 35413 37099 34521 22108 29873 48281 52406 64060 60103 62230 49971 36309 35186
18241 35186 31727 17219 -5629 13604 20493 45194 51538 36701 31465 30032 23935 22376 18687
18228 18687 16284 -11119 -10064 1133 18700 35496 44912 45432 14601 370 7439 31130 61815
18215 61815 43840 33650 20860 14870 14531 22054 9214 21011 17455 26690 40698 56930 59899
18202 59899 53543 46178 36638 40571 41959 26456 14484 3780 9279 -944 9363 12503 5208
18189 5208 12610 34458 53818 55871 69986 83342 92862 95999 95290 75493 86778 105139 74359
18176 74359 68433 59284 63803 48143 31454 35798 57162 76475 64546 57585 43467 33763 48907
18163 48907 77213 87300 98898 120006 138827 155461 143839 123467 86870 85986 87442 95910
18151 95910 110170 141520 164188 153718 140045 145508 125688 118898 138690 182140 200241 195275
18139 195275 199867 212746 222665 226918 242805 258371 270764 265194 267352 320853 371473 421518
18127 421518 503386 579556 630435 675700 714540 748201 830585 942256 1052227 1263813 1564704
18116 1564704 2040193 2772343 3896851 5777745 9004865 14496146 23275082 36321844
18108 36321844 49916451 56967048 50292307 34394695 21810136 14384500 9903744 6985027
18100 6985027 5050627 3789607 2947760 2372936 1912704 1537554 1232930 1015735 856480
18091 856480 703614 583271 522065 468023 406452 373708 353350 330753 306483 298866 297867 266079
18079 266079 233175 203765 209668 227713 228435 221134 204973 191688 200714 184775 149104 169766
18067 169766 184319 184515 176323 181816 199181 178610 162901 162134 165158 149497 138522 125810 143059
18054 143059 164181 159824 160928 170610 173721 191196 192953 205971 212043 233999 255822 296554 332529
18041 332529 324790 322398 360913 410591 485010 523771 523532 525300 511773 515246 543898 609270 632380
18028 632380 600542 569523 586871 622652 637530 682228 740946 798460 863963 943574 1054704
18017 1054704 1228733 1449052 1696591 1967326 2274580 2720923 3422395 4579130 6339920
18008 6339920 8897009 12377558 16208563 19337474 20890309 21898157 24932662 31524787
18000 31524787 40699627 48470835 49971085 44014078 38053591 37609176 42461077 48663724
17992 48663724 50915238 45075716 34699681 27137179 23626081 22411200 21372943 18835475
17984 18835475 14661518 10646615 7792360 5874005 4549100 3634872 2978799 2483388
17976 2483388 2104346 1792795 1519238 1302976 1152807 1026447 936675 892034 824263 732666
17966 732666 676475 659728 652788 676509 703224 681388 591013 522656 501754 525457 545515 515197
17954 515197 447456 359121 319308 327586 295569 275289 260428 240143 214288 183750 176690 183931
17942 183931 179425 162474 167386 177548 152283 124921 113487 126363 105838 85372 69554 76158
17930 76158 101519 129333 123824 144575 156004 151436 145243 140771 121886 102064 115021 150551
17918 150551 174478 207094 244062 276531 264112 255148 267731 296266 306812 319859 326363 320522
17906 320522 332359 343065 302107 253532 242535 265049 256068 259928 243930 222775 173257 127654
17894 127654 110342 114054 113586 75849 63852 51974 49231 56458 41974 31499 10541 18104 25988
17881 25988 47652 28730 13378 15365 16070 33882 79268 101585 75854 34697 10806 9386
17869 9386 15244 29007 24510 25875 32785 37672 41759 17498 3547 -6291 5506 5988 18880 35675
17855 35675 51120 46071 27984 14336 -3077 1963 -29089 -21358 11040 19781 -2213 -17069
17843 -17069 -30270 -3471 11117 20808 33529 45242 32034 28759 33090 27166 28732 50880 52377
17830 52377 46295 50541 36468 24161 41728 37794 23302 18221 12046 -1673 -14697 -29053 -13991
17817 -13991 8181 26377 31094 8286 2268 7058 7725 8320 -8337 -11850 -11344 7198 12240 5962
17803 5962 -1660 7368 20255 13785 8872 31303 21765 18167 32125 12848 5278 35838 58433
17790 58433 60928 46690 35679 23811 5283 15646 20714 32541 23391 3857 19 15055
17778 15055 34248 36732 21749 30456 41662 20990 -3222 9875 682 -1348 19014 16738 13070
17765 13070 3124 -4532 -9644 -15374 8642 37403 25193 -8093 -7943 -7568 -881 5731 18131 16611
17751 16611 -4691 3419 14198 8860 -2708 -4373 -36867 -41778 -20134 -6394 16087 18395 15288
17738 15288 19456 32092 20220 -8069 299 -7743 -26086 -22973 -2846 7499 27420 38450
17726 38450 21914 28621 3899 -3050 -2573 -4153 12466 27999 59342 66436 38794 12536 6214
17713 6214 -17877 -8829 23334 46308 3383 -10565 1383 6115 865 -4493 24657 38804 8822
17700 8822 -6439 7954 3127 -5466 -3656 9086 10247 232 8022 6727 -8800 -12921 -11673
17687 -11673 -9046 -34953 -72184 -57916 -22675 2612 38217 8102 1738 -708 677 -16692
17675 -16692 -14197 1441 -7332 -26522 -10059 3861 9804 -14306 -6851 2819 12877 24833 16921
17662 16921 687 -8006 -9680 3982 9506 4487 10763 -3618 -17297 -21694 -23320 -7606 -10868
17649 -10868 -17027 849 5817 1975 19963 22662 23385 18880 13341 -3896 -13912 -26639 -28350
17636 -28350 -14808 17916 28954 35469 36716 26341 3521 -4746 -4225 -5354 962 5564 12134
17623 12134 8621 6518 21324 4647 -25265 -25795 -5105 -2874 12602 27695 20545 -6263 -12830
17610 -12830 -15408 -11717 -4965 18480 17588 128 -12778 -6984 952 6526 8138 8976 -676 -6321
17596 -6321 -7361 -7393 2407 10937 22728 35120 18573 1723 4806 -5139 -37658 -47853 -58232
17583 -58232 -41602 -13350 -7527 -12091 -8831 -16443 -29366 -27574 -28265 -12423 17434 15833 11373
17570 11373 8981 5766 -17901 -30236 -36638 -22813 -28171 -24700 -22691 -25295 -11051 14062 35316
17557 35316 9531 -1252 -12930 10569 -18267 -21398 -18012 1999 5042 -2468 971 -12754 -8134
17544 -8134 17379 28966 14683 29725 20991 3027 -3697 14990 41729 58258 40784 26343
17532 26343 -11697 -18127 2750 12515 21792 32915 7405 -17657 -40677 -28544 -8983 23423
17520 23423 23444 13899 15286 20062 40474 22533 -15638 -3373 14119 12312 7236 8434 -2256
17507 -2256 2972 30205 31325 37263 33775 14583 -1827 -10519 -12921 -47631 -59056 -32995 -18935
17494 -18935 -37321 -39056 -24025 -6464 -4378 -28005 -52229 -49298 -20306 -1767 -13134 -27002
17482 -27002 -12941 -327 -23386 -19436 15433 31163 25518 27099 21311 10268 2074 -7936 18944
17469 18944 34136 63214 81463 66243 50471 17898 18609 28154 -14318 -36505 -55197 -51272
17457 -51272 -42650 -34964 -10343 1700 -15707 -21605 -14756 486 22284 36081 59674 71823
17445 71823 111798 141790 134061 184865 256304 260324 185152 106186 71896 49643 15387 11170
17433 11170 -34 -5342 -9314 -1212 11338 17106 22569 27251 36214 33853 1562 9905 27080
17420 27080 38210 22417 27627 46038 97297 117810 101825 136416 140698 172516 192797 237341
17408 237341 266263 269827 239606 205432 196828 199271 230461 252375 222391 175989 139290 136692
17396 136692 146609 127218 95590 72725 64418 84015 59256 28370 20098 21096 16410 1534 -9480
17383 -9480 -6986 -253 1766 -15774 -19860 -16603 -48553 -37020 -23491 -25340 -24482 -32522 -52089 -27812
17369 -27812 -34894 -13191 29265 40058 14179 1933 25020 56432 72461 53527 42589 30556
17357 30556 32858 21075 3432 -1129 9075 -87 -8597 10017 16831 9443 -1134 -13496 -22986
17344 -22986 -6234 11123 16117 -1609 -8937 -26027 -25220 -1312 -21718 -33587 -67072 -86935
17332 -86935 -45218 -24046 5133 46569 43664 55671 45044 31682 26685 16154 28342 22782
17320 22782 11994 -6045 -30598 -16851 -10495 -24382 -30518 -34828 -44952 -43081 -34449 -41859 -39543
17307 -39543 -28814 -32550 -36683 -9704 -23883 -38255 -21607 -6740 2126 -14102 -48084 -48696 -49945
17294 -49945 -49877 -24795 -1599 10217 7661 6484 27091 29799 23006 32531 19528 5960 16677
17281 16677 11592 29947 38985 8799 -104 -1171 24483 4463 -6079 15724 47149 52789 40791
17268 40791 33901 -4450 -12651 -2800 -19911 -13845 -5277 -30671 -21708 -16632 -41197 -46452 -29845
17255 -29845 9381 7109 21445 27141 7191 -8021 -4350 -18998 5832 25699 13969 -1432
17243 -1432 1826 -8296 -9214 -8114 16063 46456 52022 31961 25011 17176 -4512 -14201 -23558 2786
17229 2786 -4961 -6325 -1973 -30216 -51559 -40610 -29543 -2446 16245 9465 -23943 -43939 -27460
17216 -27460 -4376 5681 1124 4552 -33825 -19364 -1681 5172 -22925 -27157 -19611 -29410 -12785
17203 -12785 6564 -6066 -24443 -60247 -44056 141 22153 10794 7046 1464 13624 35505
17191 35505 62666 73792 67128 22809 10710 12273 8421 14088 46333 48586 16351 675 17768
17178 17768 26735 24700 32519 31578 19505 20440 13961 20708 24422 29459 -6949 -11826 5428 -2031
17164 -2031 -4058 -4354 -20199 -271 5055 2335 -2360 5016 10617 19121 47641 53954 65330 51594
17150 51594 7007 -642 -3162 12502 19550 20207 16196 -6229 -20610 2401 203 -25566 -29999
17137 -29999 -4672 3330 3187 -14841 -29530 -26292 1070 21525 15228 -4870 -4091 3359 5171
17124 5171 -16752 3291 30775 8188 -28432 -45883 -41710 -29862 -20329 -20183 -34588 -52230 -77618
17111 -77618 -69908 -46153 -37606 -10796 -5069 559 10390 4651 -9567 -24940 -19031 -6038 -1932
17098 -1932 -23427 -5097 20295 36268 24319 17536 3913 -2508 -13969 -10476 -2785 11906 31571
17085 31571 13037 14171 14377 9194 -4378 -28762 -22231 -1071 4468 8548 32324 40084 25830
17072 25830 -8380 -18854 -8654 19703 40370 28305 4728 4409 24364 17312 3159 11984
17060 11984 17210 17021 17072 3938 -7092 -3466 -864 -3430 -6046 -13647 -10139 16624 14490 -4832
17046 -4832 -11109 -22282 -15040 -22031 -36267 -27964 19467 43110 13154 -22110 -32679 -35426 -44926
17033 -44926 -55966 -48432 -43293 -31066 -30053 -23302 -17955 -5970 -13628 -16780 -10744 -15666 -20515 -4592
17019 -4592 8603 -1082 -15633 -13224 -15652 -13757 -28690 -22914 -27268 -28106 -5747 -12317 -19026 -12539
17005 -12539 -12486 5452 -9197 -28068 -29209 -32211 -43807 -36415 -32013 -37468 -35625 -18346 -20659 -3202
16991 -3202 10319 -3334 -23093 -21122 -21371 -18099 -7928 -18416 -23805 -42116 -38918 -14459 14910
16978 14910 21369 17506 8498 -16576 -15884 9697 24337 -3161 -17153 -16928 -6959 4347 5839
16965 5839 7233 -21771 -36501 -13680 -11179 2780 7286 11527 15404 5797 -9769 -3828 10711
16952 10711 21745 23785 25185 2761 2247 -4894 12000 17929 9474 -17784 -11532 -29237 -38020
16939 -38020 -34843 -23768 -1065 7882 12120 8807 -4776 10326 20240 16771 13511 15197 34329
16926 34329 27955 5326 -1556 9758 19817 23194 659 -5549 15953 27252 21111 10336 8623
16913 8623 9274 -8027 -22017 -14284 14100 5928 -19070 -31170 -26418 3063 -8265 -12335 -16100
16900 -16100 -416 7140 -23367 -13807 -22832 -35254 -67005 -46563 -28711 -20842 -13416 -14121 -20393
16887 -20393 -13224 10641 19083 1432 -10622 -5559 -138 7297 -2075 -30316 -42044 -31505 -15276
16874 -15276 -348 1971 -20813 -28730 -30108 -14480 -1911 3102 -367 -21127 -45272 -43138 -52602
16861 -52602 -52423 -54045 -43444 -32290 -27916 -22307 -29484 -32329 -26602 -21887 -21163 -8214 4003 3182
16847 3182 -3009 -8266 -15143 -10530 -5812 29559 21518 10132 -2375 15242 33342 30360 33975
16834 33975 29562 -9155 -11439 -23306 -38993 -5152 32931 42248 25093 -13168 -35994 -42107
16822 -42107 -17790 13929 22233 9377 -22738 -8244 -1835 -3779 -27395 -32219 -29162 -26044 -2487
16809 -2487 22439 21813 10207 -20511 -24071 -8428 -11136 -19932 -807 -536 -5721 -7525 -10688 -1631
16795 -1631 -5813 -4487 -10265 -5696 -1622 2704 12847 4864 -3891 -18565 -49080 -72131 -48982
16782 -48982 -10889 -18562 -30232 -21619 -24802 -15942 -8429 -605 890 -16406 -35690 -28486 -11538
16769 -11538 17932 18970 -8463 -41316 -71569 -54062 -11457 -7871 -11574 -11215 -22507 -15273 -13543
16756 -13543 -1843 3043 -3459 -15908 -24555 -11727 -5814 13974 15093 -19991 -38026 -2109 21796
16743 21796 9522 10304 12853 3006 6256 3005 7796 11908 9283 14895 25935 882 2501 -7863
16729 -7863 -10355 -16747 9959 16780 12778 -8757 -10118 -10234 -11540 -2468 -2914 -2332 19087 37635
16715 37635 35985 -711 -20275 -3199 5312 7021 -16700 -8739 -20752 -17042 -1468 764 13441
16702 13441 18660 18267 30622 22655 -12960 -21092 -7089 18391 7248 -2506 -27342 -8569 6020
16689 6020 12692 -3076 -32550 -37026 -21658 -32458 -46347 -69552 -61343 -44432 -44123 -45859 -37179
16676 -37179 -41944 -10653 -6929 -42836 -55271 -39664 -40893 -27467 -17082 -10131 -6389 -2479 -2959
16663 -2959 11185 40061 26622 10703 15132 2976 -583 -11703 11451 33652 26031 22215 48171
16650 48171 44912 37081 22707 11141 1945 -1214 7295 3118 10101 17708 13385 -9814 -23549
16637 -23549 -18967 -10279 -2562 8067 13720 33856 31822 25092 11732 4277 -2520 -5183 -9830 -7483
16623 -7483 5763 15493 18477 15089 -3938 -30823 -25884 -6094 36932 45785 28669 16988 26678
16610 26678 18792 30287 31921 16530 -22814 -23789 317 -10984 -6233 -450 9951 -7121 899
16597 899 18961 8578 7613 18372 -15771 -35605 -43313 -50956 -38561 -9053 -43343 -46078 -17115
16584 -17115 9567 14656 -7959 -30559 -15306 -27795 -17402 4854 20200 1239 11760 21590
16572 21590 28950 4325 -9730 -47282 -40302 -13861 8758 -15904 -30549 3231 10944 6320
16560 6320 -16012 -32602 -39822 -40465 -9266 -13439 -19484 -16481 -9974 -13423 -44094 -48180 -35524 -21952
16546 -21952 -9108 -16969 -11829 8447 18041 10879 -317 -13361 1042 -7831 -12911 -15870 -6960
16533 -6960 -9582 -13009 15479 33551 29050 26048 27530 36823 16736 -7057 -23111 926 11014
16520 11014 6999 2438 6421 8154 -4689 -21348 -16790 -21562 -33086 -22390 9375 29584 25545
16507 25545 -3579 -6674 -16696 -29142 -24525 -36818 -21250 -12164 -7489 -8619 -1380 15850 12906
16494 12906 9579 -20331 -4449 698 -1859 5049 11047 1586 -6164 16992 17864 8143 5575 25467
16480 25467 33020 28972 16520 22186 4835 -4870 -25515 -33390 -22432 5458 -6318 -6300 -14342
16467 -14342 -26609 -13181 -6721 -3110 -1660 16809 -6590 -11581 8603 -1274 5041 13150 -10000
16454 -10000 -36061 -33919 -14061 -3336 7660 14079 936 11978 18537 3173 1049 -21896
16442 -21896 -16890 -18308 -5295 8816 -3059 9930 35056 39650 31458 10745 -14563 -16069 -41091
16429 -41091 -44717 -8720 15921 17055 -2555 11618 32239 16980 -19456 -48955 -19510 17028
16417 17028 48192 37433 11142 13465 -2678 -7749 271 498 -8088 -1064 -3530 -12424 -22493
16404 -22493 -19231 -14180 -17564 -8766 -16838 -10278 -1256 3452 19277 -21870 -45972 -27981 -15883
16391 -15883 13422 24591 21525 -11976 -17001 -27159 -21133 -42990 -40856 -55894 -40557 -47917 -51865
16378 -51865 -19858 -9740 -12311 -1742 13804 31039 7236 2453 -4920 -13633 -3533 -112 1302
16365 1302 -4001 -32106 -45211 -29549 -15061 4828 18094 11009 2331 -3818 -22859 -37262 -17823
16352 -17823 -29507 -37048 -17784 -2318 -12914 -23311 -32822 -38640 -30286 -31407 -12785 2682 16560
16339 16560 13490 18930 32731 10352 -2509 -36463 -36883 -49053 -73796 -60870 -65748 -74233 -47408
16326 -47408 -20661 16818 27841 27104 44299 33955 -2818 -12250 -17925 -39411 -48166 -51117 -49859
16313 -49859 -41574 -37105 -18078 -18090 -10555 -10672 -7811 -3552 -970 -17814 -18406 -33140 -13499 -2596
16299 -2596 -16796 -24442 2303 23811 12962 -1985 -15702 -7767 9003 22047 3285 -11894
16287 -11894 -17010 -15219 -23921 -64867 -62553 -30735 -23503 -41482 -52815 -35979 -10151 -5096 -12215
16274 -12215 -17481 -9750 -31590 -51488 -36249 -22918 3647 -5961 -25967 3027 31310 40179
16262 40179 49327 36904 6556 14401 27553 33056 34903 13364 13560 2893 613 3597 -5360
16249 -5360 -2763 3507 6080 16459 11368 12293 13310 25356 39351 49527 25815 -2841 -10638
16236 -10638 -6265 -25906 -41797 -13060 -10936 -11421 -3538 8176 34 -13223 -9092 -4100 26366
16223 26366 13450 -5171 -761 -1100 -14650 -19702 7369 6986 -9330 -2823 -5415 -11893 654
16210 654 9199 18358 3090 -10527 -6528 -18580 -35019 -32785 -23948 -1863 249 -2103 923 6537
16196 6537 -189 1299 1784 10059 1689 -11002 -12393 -29510 -18037 2170 5540 8176 -3363 -5717
16182 -5717 28035 56613 68386 55370 13443 2467 -3283 -10763 -7494 -294 14120 3873 11538
16169 11538 26350 18477 -6090 -21670 -26668 -38305 -36811 -46344 -51108 -25845 -21326 -37970 -39343
16156 -39343 -30383 -35870 -20731 -10583 -685 -9996 -18893 -31564 -28036 -9038 12290 5775 -13667
16143 -13667 -30581 -27976 -25985 -26733 -32419 -6549 16078 -4855 -21548 -8019 13644 27952 40714
16130 40714 23352 -4028 -5957 -5092 -3344 -30632 -23455 8625 4155 -29781 -46733 -12978 -10898
16117 -10898 19277 29640 14573 5351 163 -6413 12552 14859 36885 56203 58501 47149 31233
16104 31233 41570 35583 -43 -5584 966 2854 -13275 -19606 -27404 -20007 -14817 -13383 -10974 -4035
16090 -4035 -5145 -8496 -18707 -18321 -26522 -14665 -2332 4464 1865 -18482 -7290 -7630 -16229 -27150
16076 -27150 -10371 -20149 -6838 9678 16226 -5613 -18578 -21005 -2516 13832 26068 16473
16064 16473 -654 -11989 6167 6283 -15862 -52558 -51964 -61967 -65093 -44893 -14864 14512 25508
16051 25508 25738 9035 -12625 -12247 -26329 -28922 865 11595 32384 33478 -9616 -42556 -49131
16038 -49131 -31051 -16533 -6529 -14171 -18787 -15128 -1326 11277 11202 11568 6965 7445 18828 5100
16024 5100 10568 13703 -9734 -1594 15040 -2795 1869 -723 16295 14374 5869 -18689 3880
16011 3880 22759 25429 6278 -15758 -59322 -60349 -15734 -14327 -23838 12923 19727 26139 1193
15998 1193 -16088 -19115 -14922 4092 -5617 -1819 7582 23414 9353 25835 30034 17159 11785
15985 11785 12970 20104 32006 30099 17445 8219 8047 901 5959 -16611 -19303 -15483 -7524 4989
15971 4989 8963 5360 7317 -4696 -8495 7992 21079 7088 -6298 -3417 14750 -4792 17065
15958 17065 33688 18104 -15379 -23812 -27961 -32969 -13435 -26984 -36519 -19413 -7394 -19443
15946 -19443 -35340 -47938 -40247 -29066 -15256 3927 13758 8456 1884 -27 -2760 -22844 -31267
15933 -31267 -22193 -24510 -12661 -8865 -1260 -31372 -28094 -15607 -13229 -23357 -18734 -30675 -46465
15920 -46465 -48439 -27734 -20129 -4315 -23680 -38476 -23085 -26057 -21687 4845 -466 195 17442
15907 17442 4049 -4817 -25140 -19103 -6691 -3222 -34129 -28897 -34606 -29819 -14914 3891 2378
15894 2378 23558 29502 7512 15473 39931 24134 26901 55600 44919 18048 14541 16829 27719
15881 27719 39487 22686 4647 -4167 -4139 -15736 -14770 19791 49876 45456 34319 30883 32200
15868 32200 8854 -43373 -47543 -29398 851 41119 30996 22824 24543 43590 37731 18523
15856 18523 11105 200 12672 -19646 -14794 2776 13222 13616 -4177 -17377 -29453 -37564 -41804
15843 -41804 -23112 -12706 -11772 -22301 -33319 -44779 -40193 -32380 -25169 6423 8878 7077 17821
15830 17821 27748 18604 5563 -2543 1130 9564 15244 7304 -11394 -11795 -3271 34874 65799 55754
15816 55754 53261 27694 8002 501 929 -1285 -7276 -31014 -36892 -21007 -3819 -17994 -24985
15803 -24985 -34252 -30244 -11094 -11402 -12482 -16303 -3449 -4492 -3997 7309 1071 -10875 9758 41976
15789 41976 37397 14480 -7856 -19897 -25835 -10925 9193 3886 3610 18870 -6137 -13650 -21563
15776 -21563 -16625 19876 21462 -8426 -35809 -27519 -16481 -23156 -41318 -31092 -66728 -74774 -62875
15763 -62875 -22033 5477 12409 7452 4242 -3081 3686 -3812 -11339 -10980 -25228 -7460 16827
15750 16827 16672 -5177 -2510 11434 38078 37677 20601 -2947 -8417 389 5006 2256 865 1101
15736 1101 15916 23695 40613 43983 36640 3741 11774 18802 35474 12474 -12600 -16568 -28273
15723 -28273 -18953 -20225 -18698 -3776 20290 8586 12766 22606 18484 4784 19653 21483 5809
15710 5809 -4418 11525 20462 43016 41059 27005 24416 -1370 -342 5799 1155 1650 -7880 4079
15696 4079 5121 -12056 -34990 -43173 -35557 -48098 -42856 -30382 -35739 -50691 -22391 750 -2873
15683 -2873 23851 25152 32004 43324 20549 7393 -6404 18805 15390 18249 16489 1211 -8987
15670 -8987 7672 6 -13717 -6512 -21806 -24779 8966 18753 6466 -1073 13151 15477 -14881
15657 -14881 -8900 18071 32487 52359 49384 55566 44442 25376 19536 11238 22340 24864 -289
15644 -289 389 41495 28681 -14124 -12631 9272 13986 18296 13658 5012 -17117 1073 4881 9304
15630 9304 7944 16980 27209 28339 -2351 -32725 -21257 -29932 -12764 -3765 754 10936 733
15617 733 1094 11131 21292 316 -10239 19618 19586 29065 37434 9798 19724 27357 9691 -10859
15603 -10859 -16994 -15596 -17278 -6451 -10987 -1758 11848 5959 5037 15986 20685 15619 28786 39823
15589 39823 34921 37530 25674 -1627 -1120 1218 -10659 -6520 -886 -1495 -1968 912 4959 10158
15575 10158 -6310 -27074 -36085 -19993 -193 -8434 -15076 -19371 -28443 4112 14368 33174 15681
15562 15681 -15107 -25450 -13180 9457 6369 2125 -92 5229 4607 1341 -7793 1782 28759
15549 28759 46014 47686 31421 12750 5534 18754 16699 172 8945 14843 23743 7291 11387
15536 11387 35239 9064 11621 32867 23130 15495 32749 70126 61670 45565 36516 21155 12251
15523 12251 20249 15271 16440 8189 -22915 -9552 1779 20535 9524 33014 37490 42522 41393
15510 41393 48138 42194 20798 8220 12543 6453 -15580 -24438 -1935 23205 2669 -4760 -15661
15497 -15661 -17372 -7078 -13333 -10345 -19860 -16403 -27664 -16268 -7998 14190 18487 27576 54197
15484 54197 66884 68480 39135 26308 17341 -6484 -34460 -46706 -35639 -15487 -1868 -971
15472 -971 3753 -12603 -16709 -21603 -42954 -50161 -20836 -4985 -10665 -18520 -30084 -18492 -2937
15459 -2937 5202 2496 11171 11107 17863 15596 14365 12527 -4819 -2551 7410 9324 -16267 -22520 -16599
15444 -16599 -18658 8090 15811 21990 26707 13994 5744 7096 14005 -446 -11564 1163 16454
15431 16454 -7694 -35171 -22564 -14568 -16932 -18090 -31757 -38352 -39108 -43191 -28903 -16018 -24544
15418 -24544 -32611 -33960 -6888 -7685 -29085 -46163 -45919 -28509 -40949 -57576 -33621 -11077 -19939
15405 -19939 -31180 -34411 -36551 -17132 13234 27616 45652 60907 26934 -9858 -25558 -26038
15393 -26038 -31759 -10889 36315 57471 25337 9116 15879 14116 19881 37772 20231 -8505
15381 -8505 -12764 -19690 -21183 -23211 -16377 -2020 14300 24239 11543 17882 18464 -2572 -39787 -37088
15367 -37088 -16424 -10985 -4007 -11494 -637 -3635 13320 -15564 -31725 -36243 -9741 23901 39930
15354 39930 25435 14264 29730 54140 64487 49957 18314 8800 15614 14031 13924 5651 10764
15341 10764 -16126 -46805 -46298 -37037 -48570 -25601 -7372 17285 21887 2732 13846 36127
15329 36127 51347 37160 16374 17379 4982 -4269 -23947 -17102 -31147 -47826 -49952 -22292
15317 -22292 -9277 -6482 -6358 627 -10609 -27832 -12911 -22193 -24157 -15552 -1474 10470 39431
15304 39431 38158 33707 29763 23330 5034 14162 50327 27018 -21277 -11645 27194 24534 10084
15291 10084 -3408 -327 9094 26187 39999 24896 1568 7836 33078 34916 22969 11239
15279 11239 1956 -15697 7197 26271 46597 45049 20368 29457 36133 23760 18323 2061 4998
15266 4998 24888 3642 -11414 12330 4169 -19833 -37714 -25556 1487 7010 -788 -18682
15254 -18682 -31874 -21697 -3370 -8522 -15398 4105 2842 -6232 -17764 -7116 9245 17868 7629
15241 7629 2226 6250 -3597 4251 6776 8723 900 -5575 -2659 -2674 -10575 -18124 -23894 -1082 6879
15226 6879 -1021 -6585 -7393 -2615 4930 -1364 12280 37350 19908 12843 -3096 -18149 -20711 -12244
15212 -12244 -19248 -19143 -5322 15192 22515 57657 60447 28770 824 27895 35779 16446 1062
15199 1062 -20736 3261 24702 31374 12814 13232 -8765 -15317 418 22904 9474 -11524 24610
15186 24610 44601 9290 -13427 -21131 16499 26788 32317 47709 35820 21886 11953 -7000
15174 -7000 -15847 -32752 -46848 -27186 -15344 2883 -8112 5573 3018 26378 45112 12683
15162 12683 -15122 -22246 -8887 22172 15030 -13398 -19123 -19384 -15648 23916 33452 -5292 -18284
15149 -18284 3604 21598 18113 -20559 -34340 -9705 -16539 -40461 -35927 -10101 3332 15966
15137 15966 20866 13021 24409 13185 -7537 -13579 -7839 13781 23243 10599 -13376 -12667 -10239
15124 -10239 15239 12468 16819 7076 4758 -2323 7094 -4449 -22390 -21781 3638 5610 8521 7288
15110 7288 -28520 -45490 -31268 6682 10337 -14211 -9423 9778 25303 11262 8430 10260 25614
15097 25614 21496 25872 33136 39617 40110 21816 17971 21127 -3427 -29739 -30953 -175 8514 -2545
15083 -2545 6844 -8874 -12461 -8808 -27028 -2055 16458 2559 13185 3281 -18451 -11219 -3573
15070 -3573 9480 7966 -1779 -10788 -30837 -41658 -30475 -23337 -6113 19502 20237 32234 46841
15057 46841 34529 9378 10650 13377 28488 12182 1992 -707 14267 21531 13243 10396 39106
15044 39106 54457 48277 45981 25321 15844 -5501 4543 23638 8571 19414 10470 -12801
15032 -12801 -17520 -8478 -1336 -629 7081 -70 -6809 5779 11509 19400 26518 15238 27207 22794
15018 22794 22687 37343 48716 29038 25095 20399 21994 24612 28035 42182 90531 166307 245262
15005 245262 400350 671417 1052070 1469676 1706616 1512064 1025278 652425 425212 301081
14995 301081 190933 138850 110434 76764 59018 58066 53176 49018 41985 11246 -20365 -33537
14983 -33537 -9278 2829 -30066 -58261 -54985 -22371 -16195 -12941 -9655 9638 12290 -13544 -25033
14970 -25033 -18350 -17553 -21363 -7522 -13953 -36842 -46736 -31354 2434 20359 11904 20096 29136
14957 29136 23077 9935 5332 4648 6332 -15569 -11716 5618 25462 -2337 4573 2189 6104
14944 6104 20475 24253 20935 -5656 -14943 17539 9160 6057 1069 6652 27366 17558 -3338
14931 -3338 8532 6498 2001 -725 -12573 -5705 20507 22424 24749 22739 12616 -7749 -15533
14918 -15533 2400 -3014 -3296 13519 -4948 -8865 12604 24888 19075 9895 3860 1373 -6201
14905 -6201 7804 4696 10818 32728 18351 -20125 -31862 -24772 -11258 -28684 -47298 -24658
14893 -24658 -4323 598 -2937 -32016 -23021 -15374 -33625 -12255 -18440 -30718 -4271 -11487 -22415
14880 -22415 4974 9046 7331 -3575 -11194 -22849 -15847 -12142 -24858 -40856 -15808 -7502 14329
14867 14329 37435 48739 23150 22626 19143 1200 -223 -2399 -5523 -1772 -15592 -27749 -3750
14854 -3750 1521 3766 13268 7771 23654 34144 15039 28100 42311 45089 6677 -12881 -9667
14841 -9667 -5118 -3022 -650 -4627 10557 -6525 -20173 -14311 -239 4035 -16100 3398 23473
14828 23473 9179 -28420 -21873 3765 8305 381 -23939 -39678 -31896 -16081 9262 7434 26118
14815 26118 16993 8778 21115 3428 14742 24408 34452 24631 14298 12667 21514 -5053 -1552
14802 -1552 7229 -22994 -26714 5951 45442 47202 12663 -9828 -5437 6232 1918 11744 19176
14789 19176 27785 -4452 -21581 -7049 -4162 4614 3400 -30707 -30109 -22298 -15811 -6081 6833
14776 6833 -16733 -28644 -27190 -26777 -43719 -40342 -32088 -16623 14941 40761 41780 29335 4047
14763 4047 7984 3053 -13377 -17489 -6454 5814 -5577 -26036 -38690 -26904 233 2919 -9380
14750 -9380 1607 33053 46805 30962 16380 -11613 -23827 -20248 -27842 -48356 -38729 -12101
14738 -12101 -13425 -21863 -19936 -16791 4127 23461 33484 27316 18955 -3360 -21269 -19968 -5730
14725 -5730 -13294 -6087 -1000 -4420 5626 12464 28187 25788 7256 -19127 -26600 -30374 -27896 -16931
14711 -16931 -1986 1900 -1547 -17137 -22349 -16220 -14746 -10232 -27182 -26296 -25272 -16208 -1323 21271
14697 21271 22881 34367 27714 -12343 -36034 -53569 -47327 -12973 -13108 -26240 -42501 -47971 -14324
14684 -14324 -639 -1523 6649 29273 26757 31245 22634 -23293 -34292 -1624 4987 752 -7623
14671 -7623 -8324 14562 48006 43731 32325 11301 8204 7891 2644 6285 -13337 -39257 -21211
14658 -21211 -6051 -5889 -10323 4628 -124 -8904 -26175 -29696 -28639 -1560 7471 24165 29668
14645 29668 29692 30663 5850 702 6144 15094 10100 30435 30247 4357 -14987 -24202 -42666 -37586
14631 -37586 -13597 -7357 -5353 -3762 -469 4879 -1021 -25020 -31969 -36024 -56620 -49187 -15575
14618 -15575 -10071 -27437 -31892 -46592 -41763 -17005 -25443 -32344 -25243 -22425 -13736 29815 30772 683
14604 683 -27602 -36363 -15391 5083 2069 20046 63757 63058 9055 -8521 10353 11826 9918
14591 9918 14572 20674 21703 17447 -11539 -11433 -9663 18278 28175 31406 13332 27079 32198 -252
14577 -252 -2107 10280 -9512 -39927 -25697 4758 22232 29122 11332 14839 -27518 -33878 -23910
14564 -23910 -17959 -14671 -17683 -6069 27263 26087 23180 14340 -8979 -26101 -12493 -5938 -3782
14551 -3782 12357 27106 8557 -9968 948 20255 31464 21262 -3887 -7486 -5974 4792
14539 4792 -4996 -11819 -1254 -4686 -35510 -57238 -36729 -17173 4101 13853 -18590 -20767 6144
14526 6144 -3342 -26518 -8478 1674 -13005 -7907 8466 3605 3023 8960 30133 45681 32891
14513 32891 15469 9572 10702 10212 20038 29628 18896 11072 29446 40523 32655 35275 -4102
14500 -4102 -16454 -11124 -24562 -22019 -14624 -10361 4882 -15024 -22710 -24273 -21315 -17462 -15046 -12069
14486 -12069 -31485 -27652 -40423 -33776 -49387 -41933 -59028 -57462 -34573 -17529 -27582 -11908
14474 -11908 35515 64083 50376 15945 -349 -11173 -24202 -38640 -34464 -20629 16891 31799
14462 31799 36845 13243 3275 -8891 -7984 -17087 -8751 3215 -117 -8904 -10144 -12466 -21881 -14440
14448 -14440 -16430 -15312 -20014 -39303 -12464 -12855 11754 30928 -7927 -11857 3570 9316 26956
14435 26956 25286 23573 4544 -1319 8599 16522 13733 17987 16595 16607 21436 654 -5643 -5968 15240
14420 15240 9676 24089 37191 27070 19211 2403 27728 36712 22909 24862 19235 17158 -4740
14407 -4740 7286 8664 31076 60246 43365 12934 -7271 -5765 -12008 1036 13914 31630
14395 31630 40043 29007 24096 3177 -20850 -20622 -31855 -52853 -37495 -22432 10414 44186
14383 44186 38676 17974 8435 18687 41773 38857 12620 -14316 -12691 4459 13992 22694 33041
14370 33041 29190 12840 21780 -6320 -30997 -1620 -7916 -9563 -19106 -23970 -13739 4895 16818
14357 16818 14048 8447 -12769 -26879 -55768 -52811 -20259 -25742 -26465 -13683 -15964 -26882 -39428
14344 -39428 -34092 -33972 -22881 -21071 -28759 -30694 -22066 -22074 -19301 11500 41838 42296 44503 25790 27662
14329 27662 38478 39581 36390 48592 58285 32722 -14127 -9093 11852 -22980 -54857 -56056 -40309
14316 -40309 -35123 -11170 -14972 -16536 19977 27807 21416 24061 28470 15966 13025 -5059 -19103
14303 -19103 24699 18256 4105 23638 24456 31573 19067 -12447 -2612 814 4119 6826 12058
14290 12058 -16420 -21833 -6215 21660 30341 7501 -19395 -27327 -14749 12175 -352 19362
14278 19362 7774 4882 5265 5851 14973 21521 13499 -16795 -23931 -18986 -6735 -2481 -6699 -25383
14264 -25383 -25529 -20180 -4721 -1250 25724 22005 10066 12660 35765 51146 16985 6801 14322
14251 14322 1828 16033 5914 -12614 -20246 8318 9620 -15664 -32215 -19164 -17780 -10815
14239 -10815 10717 8923 12863 5983 6483 11372 -13929 -719 32504 25450 2359 3383 19654
14226 19654 -2730 -11597 -15526 -9802 7053 -11551 -15476 -16668 13119 11675 -1146 13570 -22856
14213 -22856 -79108 -62577 -31753 -14697 -25901 -29505 -28511 -13939 -19640 -11795 16224 43559 43696
14200 43696 46779 26055 31628 26211 9297 8694 -9238 -13551 8642 18627 23476 33145 18168
14187 18168 621 13529 7172 -985 17981 27391 10989 -7066 -8089 -4862 -864 -25670 -51761
14174 -51761 -51274 -24684 -3591 5060 8268 5036 5784 28533 55105 63799 43989 27445 16241
14161 16241 -15002 -19587 -2827 11538 19975 -3346 14368 13576 9129 30803 25657 39837 48431
14148 48431 57089 41520 15010 6903 9530 21852 1150 -2855 11242 9717 -1733 -8242 3243
14135 3243 -6555 -2330 9975 -5863 -14134 -27358 -39566 -40094 -39729 -29734 -35918 -34807 -8000 2714
14121 2714 -5871 -4192 -8403 -10370 -3300 -14121 13434 24822 5989 799 13076 8588 10473
14108 10473 26113 -1819 -2220 24770 29658 5891 -10448 -27002 -40010 -19392 9905 -13767
14096 -13767 -25269 -39451 -39804 -47504 -559 31999 38687 58068 35228 -16623 -10880 -14766 5240
14083 5240 13598 30930 27240 12256 -7912 -1230 -9346 -8623 2878 19448 46538 47601 74790
14070 74790 53220 39320 19045 -6366 -27963 -34442 -21232 2770 -4733 -9639 15533 1165
14058 1165 -25804 -8370 -4587 1695 13535 29535 26996 19199 12362 11118 3931 -6511 -5006
14045 -5006 14952 14453 19998 14103 4041 12171 10453 4997 -9898 -23062 -12892 -6556 -30392
14032 -30392 -27621 -26433 -22544 -6896 -11564 1128 1573 -18699 -12377 -11379 -13057 -6309 18437 43991
14018 43991 27570 37201 -7196 -21369 -25231 -10480 251 3585 -2758 -7900 -20037 -2032 21710
14005 21710 16696 8070 1077 -5398 15155 12472 6634 1162 -3741 21098 54110 34095 15470
13992 15470 -2228 16617 10856 25739 4785 241 16598 12038 7956 -9193 -7473 21339 8750
13979 8750 -22695 -61578 -52409 -40273 -34899 -51576 -31109 -3232 -11260 -34655 -17315 -12561 -2982
13966 -2982 -3917 -307 34007 42249 28280 6858 -3966 10311 18423 469 -6541 -893 6245
13953 6245 4549 7778 8584 -26154 -53205 -31491 -13034 -6327 22446 14262 -9213 -35026 -4044
13940 -4044 19730 47418 27533 2099 18887 25486 27944 16198 28160 24344 33066 26237 -636
13927 -636 -17471 -19388 -2125 19172 10600 -10819 -35146 -32003 -2511 16154 18357 10388 15252
13914 15252 -17119 -4293 5719 5751 -4162 -807 -4918 -14141 6726 17848 18322 17164 21291 29175
13900 29175 36195 51492 43632 38687 13140 -4732 -7605 23311 56182 44441 19013 21001 29415
13887 29415 44494 34143 16564 35946 23172 17517 25479 32309 13303 26681 38414 25293
13875 25293 11770 -7399 -14262 6473 22227 32144 63312 53399 25906 15240 2235 9635
13863 9635 6938 -10762 2060 11340 2917 -4801 -5052 -6622 -14157 728 18634 35852 56834
13850 56834 81145 91491 104843 161357 212565 219201 229064 242324 242095 253739 244236 180997 130609
13837 130609 95845 90957 88964 68834 63740 56097 31433 34878 42239 52263 52911 11629 -38518
13824 -38518 -23537 -5920 -27058 -31548 -30383 -26695 -12730 -3052 -8607 -26432 -23421 1347 6672
13811 6672 -6684 -24653 -12288 -21784 -11863 20837 53760 58915 38504 36377 19766 8135 -7458
13798 -7458 -26596 -15178 16771 54431 73779 54731 14363 6182 -11519 -25156 -14520 -931
13786 -931 4905 -942 3488 19727 14646 -970 1070 9204 6561 -14927 8424 35924 28674 -8172
13772 -8172 -30523 -12712 -3821 6467 15314 17130 36356 25735 29018 38216 31318 -9588 -29430
13759 -29430 -28435 -29276 -32709 -42383 -44771 -40368 -29725 -2056 1561 -20239 -11888 21169 24589 14358
13745 14358 5745 -12760 -439 -8995 1802 12178 5957 -11748 -4283 14553 11984 -858 5448
13732 5448 10588 -7989 -7684 220 -16426 -6063 -18034 -34190 -11432 -33868 -43410 -46745 -16870
13719 -16870 21592 29234 4083 -20917 -18913 -12411 3901 -2004 -25012 -41248 -36371 -22949 -17060
13706 -17060 18399 45745 45022 30294 20898 17602 -98 16912 20973 7705 787 -542 9912
13693 9912 12712 16299 14406 -17153 -40510 -40580 -43365 -53703 -52046 -41548 -26160 -7830 14641
13680 14641 7592 1465 -7667 -8746 -15354 -31737 -31857 -23105 -14540 -34318 -53717 -49280 -16968 6407
13666 6407 25007 22052 -13464 -25914 -4749 6299 -15448 -25024 -28455 -38713 -43519 -38951 -31282
13653 -31282 -39015 -51689 -51198 -34442 -10887 10571 10944 15643 -8572 -23530 -14524 14522 16806
13640 16806 18984 10139 18940 23961 29977 -7023 -5001 -6174 -7859 -22552 -14135 2892 -7544
13627 -7544 -1119 -3514 -21375 -16784 -22031 -445 33296 24531 31516 19707 -18085 -27819 -12188
13614 -12188 -6621 -6919 1946 -395 -12901 -3386 5969 18341 19612 22338 16070 1067 3240 8595
13600 8595 28424 45449 31554 10304 4918 2564 10946 17665 10871 2035 -15937 -9913 9237
13587 9237 19173 23260 40076 46772 46966 36320 -4368 -11701 23305 48509 32096 20595 6944
13574 6944 -2202 5171 3673 -9041 663 21983 19966 37737 37384 12367 -5248 -17095 -7221
13561 -7221 28014 47847 52761 34847 6142 -939 8492 14283 1585 -1847 2292 -7178 -24552
13548 -24552 -19924 -6565 -10518 -7051 5562 20843 3491 5032 -3401 -14311 -44260 -49187 -48812
13535 -48812 -45591 -44877 -58340 -51542 -43956 -63370 -48236 -25317 -21270 -1717 7932 -13164 -12269
13522 -12269 -15519 3381 -4775 -4335 6899 23898 8699 2780 8764 35182 14529 -27974 -13142
13509 -13142 -17698 -12992 8878 -1822 -16924 -19419 347 -12881 -18714 -16571 -14009 12487 31504
13496 31504 39966 -7164 -21039 -24235 -23862 19147 30937 11064 -11587 -7741 11529 7201 -5340
13483 -5340 2976 -11862 -29162 -4828 16012 23222 4589 -163 16480 21528 20233 10904 -19693
13470 -19693 -37427 -38480 -27403 -12030 -1896 308 17290 12294 15845 19135 40195 37889 29617
13457 29617 -44 -14203 -17624 -32076 -36527 -40070 -37242 -12282 -12181 -17155 12868 -1343 1317
13444 1317 37284 44651 9578 -8491 6124 22560 25306 23241 4643 95 21249 35512 28935
13431 28935 6422 19686 12552 5884 6889 17163 21865 22386 10837 937 -23756 -15059 -3512
13418 -3512 20337 16553 3534 22961 32945 25630 7563 -9817 -25425 -31577 -18051 -12551 -11956
13405 -11956 -23853 -25482 -36072 -32068 8790 12530 -6854 6811 -4700 -7949 3464 18963
13393 18963 33593 40940 36440 32808 20530 8123 9447 33871 47678 17802 4811 26498
13381 26498 45183 24794 -7839 -23508 -1937 3074 5295 19066 19585 13922 12201 -2609 -29505
13368 -29505 -5140 -1391 -1427 20175 26796 18897 -8558 -4474 14013 29469 28507 3791 -17279
13355 -17279 -27306 -21534 -31552 -21451 -18294 -17523 -3600 -14824 -50451 -52152 -30530 -5707 -17924
13342 -17924 -34051 -16658 2787 8062 -8962 7887 18261 34442 33792 27691 11994 17532 19561
13329 19561 18836 15583 -4155 -17771 -31353 -50676 -63119 -54215 -35832 -24459 -15951 1701 7178
13316 7178 16453 -4901 -6115 14062 5914 -19290 7995 26708 41817 20195 29759 33218 11274
13303 11274 -1801 -1458 -369 13583 41036 19120 6823 5155 1548 -6519 -8459 -5188 -6386
13290 -6386 -3864 -467 14613 41993 53612 61038 48082 41407 39107 45839 37065 26802 28421
13277 28421 17871 -31305 -14957 31178 29862 22161 -789 13285 27537 51969 71066 67450
13265 67450 50137 57790 84534 77596 62781 46461 70996 67169 49407 21507 36020 55474
13253 55474 68038 35807 15038 18288 48546 79379 80073 70552 74789 86690 111314 136915 173924
13240 173924 217455 289154 416478 645069 967183 1412148 1799608 1912270 1598138 1112720
13230 1112720 770062 519627 354206 248530 198830 167819 134971 94341 67613 54560
13220 54560 40752 28946 49441 27667 -18863 -9814 8269 -4165 -26306 -14273 7542 23969
13208 23969 56699 54583 37094 38940 37776 33187 45106 64505 76354 53428 58571 66828 66279
13195 66279 40440 7922 3281 10602 13398 2642 -1581 31601 52252 40291 8304 29199
13183 29199 31742 27320 -931 -3344 -2850 -4241 28382 36299 33400 39067 30775 34878 20323 4070
13169 4070 11449 13910 18302 23149 9567 22682 54009 38504 2612 -3527 24210 59734 37396
13156 37396 28933 26857 10071 -3623 -8977 11662 11788 -205 -2966 2942 10056 -3126 9712
13143 9712 19603 8352 16137 34120 19232 -5685 -10976 4224 15960 13181 12783 24074 26903
13130 26903 8841 324 5916 26237 21161 49779 60396 55254 46562 44981 45934 29654 25260
13117 25260 9214 24760 40568 7111 -19068 -10085 -9506 3493 19041 42733 65808 46150
13105 46150 31794 4521 -23327 -38391 -25568 -3135 729 26547 20545 16210 19500 396
13093 396 -11409 -7602 -11801 -24053 -31233 -16098 1768 26105 100591 141813 129367 106667 85257
13080 85257 60805 58732 23740 11219 41332 35936 47235 59770 82980 90599 62591 50779
13068 50779 49786 64905 63447 52914 47307 37863 50199 49088 26953 15066 41254 44492 32651
13055 32651 34089 22140 31169 28881 4547 14841 17914 27933 23311 21101 2517 13568 32347
13042 32347 48207 39514 42362 83467 85775 56660 59225 70433 70584 77405 84159 66693 86730
13029 86730 115526 146617 180196 150622 120449 123403 128090 137221 107742 73228 88930 94081
13017 94081 111433 147437 164009 97218 29378 25717 45812 47544 19073 30534 23967 19575
13005 19575 -21968 -40599 -1069 31310 42181 46995 65437 71997 44443 35993 31118 21552 33964
12992 33964 35209 56078 45211 26737 18280 6744 3715 29565 47763 48920 48452 54647 34444
12979 34444 42506 41194 43325 26240 9461 15776 6187 -11070 14144 21076 28107 21560 -678
12966 -678 -21417 -19295 -22829 -13991 -7556 12564 28766 38503 51945 86568 82577 89784 85193 85626
12952 85626 68128 43248 21909 -2993 -12098 -2170 34353 66154 96935 84268 50462 45684
12940 45684 30909 17158 10873 11903 33530 59245 49682 26974 7714 33503 64616 69273
12928 69273 70824 83292 87669 75573 76167 97251 113274 96223 95256 110069 102113 98743 89644
12915 89644 80525 83585 93239 103851 85801 70328 57982 76916 75558 62895 73123 77655 97720
12902 97720 128221 130190 108792 104132 148423 179013 196884 259305 291709 254635 162683 75961
12890 75961 44394 51222 40168 39603 61367 112088 169644 162621 163779 154385 152591 142148 119795
12877 119795 91945 83219 82129 76275 103719 97905 96822 92996 95854 107472 109333 110306 112234 103191
12863 103191 112472 147769 142721 105780 99858 111416 147485 171712 169827 169225 171396 186233 191674
12850 191674 186588 167619 122047 131662 154633 186133 226829 232225 221121 202413 178720 143427
12838 143427 152293 176173 195811 218372 220109 218235 224042 231098 251234 285318 330483 337404 333279
12825 333279 339382 376734 451540 520930 541343 554548 535338 530080 554066 566141 543585 535569
12813 535569 564102 585624 603348 618049 688750 737062 806131 955571 1160071 1371425 1588394
12802 1588394 1686523 1666259 1602655 1587422 1623276 1700373 1797891 1920187 2105287 2355579 2640312
12791 2640312 3011474 3467951 3966005 4434451 4976190 5678639 6561207 7683265 8902672
12782 8902672 10074792 11359141 13342877 16712129 22164758 30928183 45319486 69656207
12774 69656207 109488940 171139782 256151131 336909420 370380964 320544209 223688876
12767 223688876 146857490 99219134 69455242 49696126 36480152 27788090 21994004
12760 21994004 18022607 15180334 13049854 11326582 9574815 7808578 6330501 5206228
12752 5206228 4407114 3826517 3452457 3192352 2973969 2794936 2630967 2472005 2327749
12743 2327749 2213904 2129882 2095300 2096578 2202590 2465652 2960965 3560683 3980670 3849694
12733 3849694 3150010 2433129 1941421 1668215 1457872 1254952 1100830 1000757 911515 827633
12723 827633 775052 727140 677708 598793 540562 518644 537331 556768 562737 535201 523092 504628
12711 504628 501204 474288 440686 436168 456704 475301 449267 413383 419445 402031 388734 360334
12699 360334 310695 307619 312375 314381 328708 318079 304362 313716 310362 276632 276490 263037 247953
12686 247953 218351 197529 195541 208681 250004 247145 215538 199289 205336 187681 172202 150041
12674 150041 141872 156555 148983 144842 140075 152671 193128 201187 195134 212334 235214 223813 201737
12661 201737 155675 120583 90131 87351 101442 140437 159395 184848 215519 189278 111721 54524
12649 54524 55110 70215 80655 85571 123976 174756 180893 174624 168461 205433 242091 222983 161699
12636 161699 137859 144872 144336 138657 124334 116674 109156 102377 102416 87260 76210 79655 87682 85063
12622 85063 61100 63009 69868 69255 48102 53200 73537 67163 38054 29309 27587 28091 60844 76345
12608 76345 57571 45647 61196 116566 125298 94280 89236 102151 85506 79086 46859 23319
12596 23319 13677 23618 61888 52659 40225 30622 2437 -17002 -15072 -11831 2988 22078 34644
12583 34644 23777 32537 59873 67096 76392 114117 119066 100224 58091 34494 34383 46719 52631
12570 52631 60478 74945 48172 6988 15509 26159 5763 -8485 7404 28819 43736 74706
12558 74706 114118 148297 168919 148230 127972 106202 101039 76600 55651 25232 7475 11595
12546 11595 8707 9659 -6458 -10710 -16767 -15333 1249 18392 48749 96601 89005 78167 61356
12533 61356 60691 62925 41298 34933 49573 44562 56799 68453 82663 58738 11991 -3754 17567
12520 17567 12425 15534 18590 28778 29792 6439 -8551 17796 42865 33446 30557 24238 12096
12507 12096 7731 15025 19887 11144 -18509 -14420 -1307 20086 35575 28833 11976 -8365 -17458
12494 -17458 -18071 -10807 -2580 30263 58458 56903 34592 21352 39587 23165 -11347 429 -5941
12481 -5941 -6074 -781 2256 16497 12004 -10491 -29652 -33429 -27153 3678 31582 24230 921
12468 921 1022 -4926 -31457 -32711 -32025 -34223 -80770 -90926 -59973 -51662 -60315 -74120 -68215 -29462
12454 -29462 835 25986 58807 77159 68652 55751 63256 66377 49019 25761 21922 42486
12442 42486 58677 27709 3821 -738 -994 -1127 -3411 -13456 -22216 -21469 -442 -4618 -11529 2304
12428 2304 -184 6384 6658 18526 27566 20565 8409 23871 33079 14659 -11323 -27463 -38240
12415 -38240 -36229 -45115 -51894 -25085 3560 -10837 -6217 -3298 -27940 -42486 -30373 -14999 -1362
12402 -1362 8498 11378 14466 28934 38560 14053 -11900 -17726 1951 42546 37241 49614 28783
12389 28783 49 14147 26148 32375 23481 -5102 18354 19560 -16784 -12398 6642 18676
12377 18676 12162 4289 -7934 -12299 -6566 8189 7345 -13902 -18308 23875 59175 54884 49230
12364 49230 39833 47224 70734 51891 39335 30102 53588 59295 44128 33688 37048 27583 20882
12351 20882 15753 8646 8647 5686 1015 8340 18683 17708 9790 -17194 -35107 -50029 -43072 -26783
12337 -26783 7770 44493 73963 66810 59735 18627 -22444 -21265 -13785 -12591 -15827 -21629 -703
12324 -703 35354 50105 56067 39611 18133 37708 45381 24978 17572 29992 39892 34152 22698
12311 22698 49449 61707 60271 85274 130072 177219 260405 382926 577848 880581 1299753
12300 1299753 1741174 1952049 1727344 1225559 825020 583732 401222 272926 218982 182870
12290 182870 148193 128768 113821 114334 114047 98793 64437 47553 54736 82026 86577 54578 36866
12277 36866 38101 40020 52825 71985 69300 35179 13764 29513 24062 2350 12693 26850
12265 26850 25117 27354 22349 6548 25577 33944 29848 26231 26477 16169 44987 62685 39470
12252 39470 34503 20396 -6279 -7667 15976 23106 8045 -2893 3647 -15352 -48680 -43392 -25076
12239 -25076 -12811 5606 -5562 -17799 -28530 -28349 -35664 -53632 -44758 -28113 4112 34393
12227 34393 36653 18431 6585 10522 -4090 -26303 -50434 -36192 -35014 -42289 -26932 -41635
12215 -41635 -53246 -49269 -23170 -8995 -6091 5525 12568 29082 23936 5091 7333 129 110
12202 110 4078 6052 -10551 -24447 -36963 -28365 -10492 -17725 -29725 -37594 -48245 -42169 -47174
12189 -47174 -46661 -52145 -43847 -24267 -15859 -30692 -37921 -16669 -10371 -8193 -40464 -39612 -42788 -51555
12175 -51555 -58531 -53917 -26077 -7425 -11360 -6276 35961 67786 46513 49321 26971 13423 4394
12162 4394 11081 21311 22299 37274 25009 13782 7563 17148 -761 -25908 -43927 -53561 -31329
12149 -31329 -35084 -29356 -13456 -14949 -3199 -3986 -8917 -13469 1097 -21800 -22931 176 -15340
12136 -15340 -16003 -7989 4982 1525 -4337 7127 32247 27049 16334 29138 9130 8779 1423
12123 1423 -3497 6593 -9277 -13468 12789 33622 33374 -4053 -2120 13256 5697 -8905 16162
12110 16162 35856 22806 16518 27925 40526 46456 26443 7159 10552 12827 19506 18032 3411
12097 3411 -15710 -28752 -23746 -18120 -25263 -43334 -35291 -46806 -69634 -68570 -51047 -60778 -51995
12084 -51995 -17044 16826 18737 13357 21378 26673 6357 3463 16895 28106 25654 11676 44829
12071 44829 54008 37812 23474 14923 7698 -9713 -14882 -21985 -15913 -13630 1125 36205 28086
12058 28086 16682 39088 36817 38528 28141 25063 21311 10221 9355 19568 28240 18501 15627
12045 15627 -2768 -11405 -35003 -47307 -26270 -21112 4376 18563 24835 28305 -2110 -24311
12033 -24311 -41518 -24472 9299 13206 12575 1302 -15404 -35664 -45624 -41003 -20146 -6379 -18652
12020 -18652 -39934 -35549 -30836 -16629 -24243 -34772 -26235 -17760 10364 4132 8107 -823 -33858
12007 -33858 -22284 4955 7115 -5939 7684 9996 -4859 -5579 10780 20067 37101 22406 16461
11994 16461 4334 25841 28299 17117 16113 22059 40391 24406 5437 3995 13063 17307 -1133
11981 -1133 -3468 -20142 -30817 -28016 -31319 -23109 -17103 -6387 466 1087 -12056 -29725 -13589
11968 -13589 -5269 12119 22286 57089 64629 27695 7856 3848 14861 -3449 -13019 -16107 -16937
11955 -16937 -13271 -5836 -10291 -11662 -16979 -18159 -6320 -10176 859 23881 17394 -12020 -4512
11942 -4512 -6391 -3907 14192 3184 20092 11847 13146 16705 15561 3059 2135 -6186 14745 13345
11928 13345 -9515 -8735 18990 30615 29741 26607 17306 21394 1834 -25063 -14695 -17136 -35393
11915 -35393 -31342 -23763 -18902 -9647 1298 17325 23906 10335 -5964 -14491 -15433 2058 -2801
11902 -2801 -3177 -6303 -5360 11095 12604 7088 20668 -15542 -26887 3433 4522 15751 19759 10428
11888 10428 11559 -889 -14975 7564 19667 13789 -19892 -48138 -56278 -51676 -36704 -27490 -36732
11875 -36732 -39358 -17956 -11398 -14263 16157 37274 23801 -1956 -6157 -5453 -1797 2870 17678
11862 17678 10083 31244 30800 36889 17735 4928 -427 -10023 1970 3492 9044 43263 60975
11849 60975 41998 8525 -7683 -9438 -7461 4551 26581 5735 17845 53934 41441 30578
11837 30578 -4983 -11500 -24714 -43250 -20618 -7848 -20192 -41398 -45147 -30387 15535 5597
11825 5597 -27831 -31014 -5031 -2767 -16319 -24710 -476 801 24743 34126 18168 -2488 -22832
11812 -22832 -23547 -16603 -22391 -15802 11888 18306 15633 -2679 -14798 -7168 5949 -8453 -6959
11799 -6959 -25180 -22258 -7010 3230 -5688 -2082 1827 -15178 -19897 -18340 -14915 10955 27923
11786 27923 39894 28588 10422 16106 26090 17169 25506 1096 -24779 -13366 6205 17187
11774 17187 14501 -7742 -3936 -986 12156 28332 45395 36394 37310 36991 41547 16954 10456 20880
11760 20880 35034 30381 7897 -4175 -13563 -9295 11743 5640 5508 13316 -21131 -12751 12388
11747 12388 16101 21023 5961 -10644 -11686 -27390 -36405 -39089 -56120 -68071 -59305 -31079 -16965
11734 -16965 -36676 -19115 -7965 -9357 -13690 -13435 -29306 -45533 -29749 -23997 -14152 -4958 15965
11721 15965 24424 664 6459 -1765 -26462 -29830 -16817 804 11119 15360 36206 27598 32073
11708 32073 29783 -8067 -37385 -27241 -14300 -2153 -18138 -15007 -6031 -9190 -12728 -27207 -30889
11695 -30889 -27077 -37747 -19715 -432 -2186 -7786 4117 10681 16432 -2416 -14039 12737 40056
11682 40056 34265 28676 11667 23291 14468 20599 23506 21598 27803 16567 6504 -4896 -39388
11669 -39388 -65587 -53988 -34759 -44765 -29175 -20901 -44479 -27131 -12856 27766 13758 7250
11657 7250 7979 10433 5601 -36712 -40571 -30320 -23372 -33189 5814 5818 -6501 -20829 -9483 6702
11643 6702 -13382 8616 1593 -5543 -17375 -27431 -47057 -50539 -52848 -43615 -47869 -37422 -31513
11630 -31513 -12865 3081 -21574 -33598 -27330 -23970 -15081 -6543 980 -9699 -28410 -29351 -18042
11617 -18042 -7246 -5802 -39865 -18118 5571 12559 2424 -33010 -48458 -42655 -54618 -72226
11605 -72226 -51380 -23152 -23977 -22526 210 10467 20182 9375 5010 7094 -24977 -7603 -6
11592 -6 -22889 -48150 -54759 -44138 -31763 -28951 -10553 -17092 1045 24734 16292 20270 34072
11579 34072 42933 49377 33278 7643 13096 19181 28004 27807 16735 -5798 -3725 13890 16804
11566 16804 10577 -3882 -6685 -10065 -710 -6338 -23263 -28673 -17099 -4131 -9898 -14456 -15285 -11153
11552 -11153 3147 25565 17491 17023 7310 -16286 -20143 -9689 -18076 -33311 -53281 -61687 -60576
11539 -60576 -40269 -14777 218 -4326 12969 21855 -1181 -39213 -23363 -13834 -7697 10859
11527 10859 6979 -8815 -5001 -19311 -14133 -17252 -21127 -22347 -21794 -38472 -28300 -29195 -48401 -35125
11513 -35125 -17417 -9598 -6001 11863 36317 11564 -10104 1550 -7874 -24948 -19768 -30879
11501 -30879 -14929 -16542 -28339 -22331 -2888 784 2041 -21715 -38790 -65135 -66509 -53677 -32880
11488 -32880 -13006 -4262 -14332 -4069 9713 4698 2832 -23631 -34033 -48352 -45219 -13609
11476 -13609 -33167 -23095 14919 21531 9171 2688 -7388 -26749 -1146 24173 8616 21754
11464 21754 18526 9112 12254 -4620 -27062 793 21520 -15624 -16972 11918 28769 7324
11452 7324 -2528 8497 3708 -4024 19831 39578 28027 15818 10676 9496 10644 10973 36177
11439 36177 20378 4316 4491 -17091 -5907 22509 42371 -200 -5783 8087 -8843 -4927
11427 -4927 13823 17600 -4917 -26942 -30716 -29988 -10907 16366 1564 -19849 -13081 9979 6417
11414 6417 542 2342 10221 9697 26673 33899 -3624 -3629 -8503 4694 2385 -9961 -13857 9019
11400 9019 17526 -1028 -5137 20481 -4542 -20555 -20044 -18713 -17186 -23968 -33975 -33958 -18131 -10478
11386 -10478 3958 4969 2301 -1212 -14055 -1646 35043 37770 22670 27824 55210 44134 12097
11373 12097 -27843 -6851 14064 35849 35624 45712 52289 29557 14890 -8930 -24933 -38945
11361 -38945 -36098 -4470 17768 21414 12437 5823 -8468 -27286 -24658 4543 35580 42059 40607
11348 40607 13795 -5526 -8422 -18670 -35016 -15749 -7817 -8245 -24827 -14957 -1649 15678 21570
11335 21570 25489 27521 3259 -12940 -28249 -12198 -7550 -9256 12233 7641 807 -17377 -48175
11322 -48175 -65175 -39021 -22648 -20308 -9418 9728 -10104 -13038 6931 -4849 2300 -35130
11310 -35130 -68504 -61037 -29055 -22511 -2625 451 -18270 -16454 -4555 9088 22467 17817 -10806
11297 -10806 -54865 -48197 -38264 -31640 -37279 -17549 -4484 -11871 -10130 -11331 -29958 -31333 -27291
11284 -27291 -8625 -5176 -10832 -22100 -24610 -22907 -18987 -17333 -22423 -36401 -29361 -24474 -11468
11271 -11468 -16551 -29736 -53645 -8755 10362 -4147 -1508 -15666 -29194 -10458 9031 -2305
11259 -2305 -16007 -13687 -21649 -38295 -27327 -13257 -9617 -15227 -23607 -20590 -15623 -31766 -40730
11246 -40730 -47858 -30455 -682 9548 10551 -4910 -11901 -31463 -39961 -45882 -24806 -22778 -26699
11233 -26699 -14043 -23699 -25356 -25912 -33865 -45792 -69174 -57024 -33771 -18751 -34534 -52035 -41954
11220 -41954 -37752 -9456 28098 6238 -21511 -8789 22075 60117 58476 32995 33575 45896
11208 45896 26987 4799 902 -10704 -30123 -58429 -60229 -33090 -29634 -16598 11082 -18407
11196 -18407 -17809 3465 -2613 -14174 -5590 9873 6820 -16367 -18426 -25229 -40623 -9058 30681
11183 30681 28189 19110 19817 28745 5632 -8139 -26016 4521 28398 27955 30294 33571 15918
11170 15918 -1683 2086 5700 7782 10972 29031 55336 65512 39276 33976 8451 -2106 7490
11157 7490 17240 12453 11884 14360 7510 5529 18162 -7024 -38122 -41814 -7667 -32821 -23623 12462
11143 12462 -373 5615 13760 10397 -6731 16131 36886 9011 -8320 -4494 -24642 -25384 4465
11130 4465 9402 -23138 -6311 4800 -579 26082 37257 7261 -5190 -20515 -13944 -7245 7151
11117 7151 11100 13722 5635 -10412 -11124 -12542 -29622 -28354 -10075 -10263 -4230 -16217 -11028 6025
11103 6025 31891 41177 28287 9877 1446 7966 26355 13905 -24829 -50752 -57704 -27147 -12664
11090 -12664 9716 -1932 -15501 -49476 -51907 -20423 5012 12931 -2368 -24349 -20136 -25195
11078 -25195 -24215 5317 19018 23357 20817 26822 21598 -25835 -20972 -20658 -3009 19672 23178 18902
11064 18902 26928 41909 24528 28329 11322 641 -11625 -18105 -18072 -21557 -13055 15135 9326
11051 9326 1949 -6391 6719 22532 21200 224 -10426 5086 5068 -13023 2307 4794 -20296
11038 -20296 522 1087 -16608 -8270 -7771 -22640 -313 31230 43404 49025 24152 15457 6844
11025 6844 5562 4446 -2060 -17056 -32210 -17484 -1189 5706 29446 19731 6658 35219 31841
11012 31841 13296 11292 13534 -450 -14842 -23392 -8345 8528 13156 29690 16332 -4146
11000 -4146 -5882 19488 31674 9598 -7822 -5120 -17617 10827 29618 4297 -897 458 24259
10987 24259 40097 34297 17123 -1183 -2253 -2333 -13238 -5314 -1289 20948 16843 15481 12483 15235
10973 15235 17414 10281 -22233 -37261 -43553 -44843 -62416 -47626 -35576 -19955 -13360 13409 3307
10960 3307 5236 18413 6215 -7392 -25681 -29119 -17327 -10839 -12596 -20412 -23914 -41067 -26583
10947 -26583 -9965 -5047 10262 18453 24166 18496 24293 19018 16328 -259 -8926 11847 13414
10934 13414 10723 11364 14412 1499 784 10399 4444 -7624 -6180 -13347 -5991 9798 -1327 -7597
10920 -7597 10168 35503 65158 29178 20853 18890 9598 -17776 1160 21608 21883 19598 16059
10907 16059 -13605 -14602 2946 -9366 -18324 -6758 2720 6895 14092 -4056 2451 18951 8089
10894 8089 4621 -3118 4205 21398 32772 8336 7501 19894 19086 22713 8232 -13423 -9757 -637
10880 -637 23826 17461 -13837 -11500 -4605 16699 -12128 -19212 2639 15071 16250 3892 -5185
10867 -5185 -21832 -25556 -21590 -23936 -52373 -49515 -7772 5741 11263 6101 -16004 -22305 -23315
10854 -23315 -7622 11193 16896 30127 33215 -3089 -11757 -30939 -20117 -20073 -13022 -6685 25865
10841 25865 26893 12609 -17322 -34276 -48824 -54100 -35794 -26913 1258 17627 19112 6745
10829 6745 6034 -31779 -30315 -4694 -38878 -62017 -28760 11246 10040 -30493 -45595 -47836 -50201
10816 -50201 -52185 -44493 -36033 -41960 -21198 12353 -2448 -5018 -28403 -37918 -15049 6841 -5236
10803 -5236 5515 24720 26767 18824 16417 4334 177 -9234 6346 35608 37383 50607 44041
10790 44041 54608 55143 17300 -15513 11339 29467 9140 -959 -1417 538 -8857 204 11992
10777 11992 1595 -15994 -34050 -23046 15682 24435 25538 3048 -7946 -31936 -27468 -9867
10765 -9867 -46439 -76881 -75849 -63419 -62562 -50706 -30958 -21329 -15396 6722 1185 -13549 -7593
10752 -7593 -2249 8305 9325 -931 3 -12013 -6451 14185 29994 27677 13139 19079 35187
10739 35187 32869 -2910 -18668 2339 23674 27206 26384 1454 -7252 17544 10286 8163 23780
10726 23780 19254 35750 25313 15451 -6067 -9144 -1833 -12713 -26130 -8950 -23936 -36381
10714 -36381 -37591 -31781 -35964 -31093 -15846 -26304 -24583 1542 20218 7694 -1453 -2630 18043
10701 18043 45291 67533 58203 48831 47529 29085 10123 -15133 -9898 36815 48372 71759
10689 71759 49951 48014 57358 35889 -2203 -23284 -20316 5597 32826 27689 22286 24707 38398
10676 38398 44492 23718 15982 8589 7444 21104 19489 -4490 -16296 -14211 -13398 -25801 -17183
10663 -17183 -5174 -11123 8145 3948 -3798 -11677 -49804 -53347 -16905 -19159 -28187 -15339 -30208
10650 -30208 -54354 -27066 5576 16961 15325 11766 20645 50333 31458 11762 11243 3996 -10437
10637 -10437 -40123 -44919 -26930 -24727 -14830 -2545 1900 -16564 -32987 -46765 -62890 -72638 -71081
10624 -71081 -28775 -12426 -541 3358 -23545 -16752 10805 1309 -1921 8658 23701 29631 10377
10611 10377 19365 29127 25820 8412 12866 32093 25539 4105 10025 20072 24841 20452 26303
10598 26303 38360 30956 1745 -44607 -59093 -47750 -15694 3062 12016 -8794 13207 30297
10586 30297 6671 -12792 -12088 13693 18661 24551 18589 11167 20350 21383 52217 65838 44998
10573 44998 62268 68451 81778 100634 99847 89178 102883 90983 74438 68261 66566 83995 121052
10560 121052 147914 206490 325527 498281 700107 921212 1055774 992798 836696 790394
10550 790394 880802 1007883 1072521 1010649 831824 580912 385614 265213 180219 150543
10540 150543 111786 110864 123999 96869 79005 84032 72180 75792 51822 12457 -2302 -9769
10528 -9769 -7201 -7655 -14201 -7771 -29395 -19293 -19830 1243 28632 35379 32990 23779 27297 18477
10514 18477 15291 39704 32433 8393 2185 -9524 -25738 -20241 -17094 -11375 -3745 -8098 -17235
10501 -17235 -19665 -23044 487 -3935 -22896 -22375 -11258 -1023 -14354 -19346 -9056 -3788 -4967
10488 -4967 7159 20006 18649 -1479 16492 50545 66807 43839 40914 48467 50953 31726 41033
10475 41033 40058 31323 8690 2221 119 -29158 -45387 -25098 -12334 -25212 -4685 31914 49405
10462 49405 46468 13221 31396 45795 59136 77382 68849 51379 46014 34069 15918 -16066
10450 -16066 -11907 720 4011 22563 24801 21173 -12723 -16178 -26556 -33422 -27103 -28493 -14009
10437 -14009 -33388 -19417 -19846 -8681 2870 23011 44605 25644 16004 30558 42080 49513
10425 49513 49019 24301 13941 29394 39056 37043 18665 49801 83960 58218 32659 35966 34125
10412 34125 53860 75440 85365 71648 51059 46775 50054 43661 40602 58341 83789 83262 68022
10399 68022 67353 77045 77013 92578 97051 82024 82300 63961 43471 40549 36258 7851 21280 48789
10385 48789 53273 75977 59489 30055 16965 30820 27467 14140 21262 27305 20495 6332 27612
10372 27612 52596 40062 2850 7498 29505 12565 6102 3462 -11916 -1554 22047 6017
10360 6017 4378 3088 17545 11762 3651 -7345 -5994 10603 11519 13919 20569 13439 -6259 -19871
10346 -19871 -25274 -23366 -21479 -7057 -15602 -6933 3418 1495 -1089 -7870 11035 23987 16754
10333 16754 30966 44086 51288 60483 70732 84400 67612 42036 42613 42215 39896 53227 81167
10320 81167 64511 41419 30037 32231 31821 32230 47323 39146 45790 44561 44075 67412 67547 45748
10306 45748 14653 25035 60147 66418 49627 25299 1684 4264 25864 30552 27728 42813
10294 42813 61671 65688 51975 49990 49120 69841 57534 61097 60313 84022 77415 63933 40746
10281 40746 58799 79293 108457 109721 114932 131755 173549 210984 222905 204071 190049 157268
10269 157268 114731 94467 100274 120528 120065 101296 89504 83467 93132 108615 102558 96195 106782
10256 106782 119839 136241 154100 163902 142633 140377 111125 108156 120217 137458 154396 160048
10244 160048 149715 155010 163248 148054 141606 151251 153848 145201 170492 153089 134528 127716 132861
10231 132861 148088 172272 213244 214077 187198 202614 233612 282130 340589 398573 499176 644961
10219 644961 866833 1108108 1286179 1376573 1420089 1420435 1400093 1441149 1507270 1503680 1412656
10208 1412656 1261890 1035825 825594 674417 594133 564490 547536 522338 504528 495712 497355
10197 497355 504074 538014 582386 595789 593210 568753 560903 558344 562206 588531 623007 675870
10185 675870 722575 773642 834091 889489 931890 1004005 1077015 1158500 1295180 1427914 1558853
10174 1558853 1721858 1987992 2407681 2970972 3623491 4334936 4893948 5236843 5593772
10165 5593772 6091308 6793117 7567283 8200169 8726695 9433318 10640652 12649042 15757818
10156 15757818 20537850 28303810 41456610 62750363 95242174 138441714 178909053
10149 178909053 197222574 181324799 154031952 145243461 159821508 185251530 199867011
10142 199867011 182958966 137173000 93474926 64388901 45972236 33877449 25765511
10135 25765511 20293874 16492628 13740060 11770833 10408925 9472261 8728890 7947022
10127 7947022 7054012 6213684 5673681 5329378 4971107 4518600 4003738 3447647 2939255
10118 2939255 2555873 2269518 2069729 1921626 1765452 1636084 1533632 1422167 1347571 1298547
10108 1298547 1240249 1192970 1137996 1043047 996060 956423 908177 837249 756698 701531 663245
10097 663245 634655 600986 600648 580439 561520 538390 511149 511539 517537 518695 511617 518914 530904
10084 530904 540027 498408 453056 427829 411749 397387 381658 374468 350783 355217 351163 365733
10072 365733 381254 351255 295625 300568 293992 306583 346260 370298 333087 281872 276367 293679
10060 293679 289618 285854 277624 260106 246683 234979 228682 208045 235098 255584 233959 217819
10048 217819 227182 227260 198252 184304 167621 171041 156337 130406 127024 123765 118328 116860 119004
10035 119004 138843 139375 115788 111642 118644 122422 106960 108940 118515 136907 179341 177762 166892
10022 166892 146203 168796 180664 176697 177342 193981 218199 212028 167189 155179 154547 155183 139722
10009 139722 124945 110287 97130 69500 79256 89883 106828 116118 107977 99555 87891 68818
9997 68818 59378 47802 51839 55191 35401 35794 49555 36067 44039 48695 60326 64381 85693
9984 85693 104281 141574 127604 105821 85224 74037 81064 79801 99929 110174 97879 72066
9972 72066 34757 44878 38456 24184 37457 34645 33158 50978 45077 27604 3974 3605 26504
9959 26504 31438 28870 34406 75059 88481 89836 106163 121325 129775 107453 93768 58735 40342
9946 40342 35500 58178 54440 45635 78866 94951 70452 33665 29872 33659 42364 40252 36536
9933 36536 13641 17427 19312 19163 34415 47228 46559 52332 29399 38685 42602 18087 -5396 -28456
9919 -28456 5018 14789 -7918 7347 7743 -9308 6855 15713 16361 12405 28818 32814 27819 46372
9905 46372 46828 17582 31303 76269 66000 46878 54908 66129 73816 88690 79222 75429 83379
9892 83379 78090 90665 80617 66488 48481 55663 37952 49858 71646 52066 28196 37589
9880 37589 44157 20351 34495 31961 44383 45291 34992 38037 50287 29153 9107 12948 -8429
9867 -8429 -15830 14917 2903 -12278 -8293 21821 23230 203 -6204 8626 27376 31997 27361
9854 27361 31902 23526 -7879 -19705 -34336 -32327 -36895 -36794 -27403 -7119 11732 19184 -14219
9841 -14219 314 11638 14196 35915 35395 41491 25384 73369 95263 79329 55776 59451 59382
9828 59382 67797 98387 106832 108893 78939 45571 33040 20616 13155 37334 57737 43662 46939
9815 46939 58909 62668 77596 74501 37488 3248 -12835 -11222 -2726 10636 -3470 -18244 -9146
9802 -9146 13586 1915 -15484 -12320 -4573 25284 20735 12465 26134 44897 15949 10832 18551
9789 18551 39539 86359 87318 35038 -15387 -16538 -12573 13616 33912 36292 16712 10845 11595
9776 11595 27650 31232 16379 -7355 -19994 -6283 -1838 12238 26975 32499 42021 55211 69313
9763 69313 65977 49293 31768 15219 24481 45127 28538 38316 59134 47467 14307 31039
9751 31039 34815 3410 -12989 5296 30546 40587 78598 144503 242708 380257 584879 828810
9739 828810 1026229 1058925 932617 801842 775590 876470 1001931 1055191 923119 681093
9729 681093 474517 355381 289588 204966 157026 120728 63381 63502 50541 38518 74140 80584
9717 80584 81645 106655 109532 142580 157962 162995 169596 113665 78144 77993 71288 48558 37683
9704 37683 35029 41515 29771 36355 21502 15683 14883 23535 53234 37296 18168 29567 28637 26658
9690 26658 14405 30328 39539 37952 15181 12558 28501 28867 71361 82837 75260 87063 87475
9677 87475 60944 48370 55999 48467 28293 38223 44118 20631 -8412 -32338 -43263 -15830 -645
9664 -645 2116 14587 29010 22621 30272 39469 6364 -1750 -14715 -744 21424 10072 4
9651 4 -16029 -3678 26901 -4113 -6149 -22551 -27564 -2918 -12382 -20291 15009 16874 14800 9216
9637 9216 26224 31825 25186 -149 -20232 -31329 -38189 -23842 -20641 -10192 -2414 -11996 1028
9624 1028 11124 -6507 -9481 20407 40314 24359 13568 40733 49594 43346 52044 38928 30865
9611 30865 36405 20207 20470 23668 21593 2408 -6105 38964 36842 31344 34050 751 -10155 7335
9597 7335 13651 17898 10010 -11354 -6797 -13245 -29871 -21799 -10765 -230 8061 13217 13670 12295
9583 12295 -8627 -24722 -15401 -4000 4412 4728 8783 -25676 -19751 10691 33133 52418 37291
9570 37291 28628 38380 23564 38110 34392 19811 13256 34612 51498 42956 24138 11798 -5577
9557 -5577 -1771 18648 21731 16220 5082 1496 6926 8728 -26007 -18161 -28641 -19753 7651 12056
9543 12056 20424 -6735 4003 32463 19362 3039 18767 38835 16380 -14359 -12752 -469
9531 -469 16850 25197 37746 21470 14640 14018 -3446 -4630 -2557 -11945 -14663 -42109 -22393 -12972
9517 -12972 1464 -10070 -29126 -11635 15522 21015 5627 13206 13354 12128 6066 21863 26941
9504 26941 24563 23433 32567 21874 -1894 -19485 -21631 -1319 39726 45233 -6317 -36010 -19200
9491 -19200 9109 -1006 -25448 -26499 1348 -3063 -15724 -15251 -13941 -15521 -9065 -5831 352 26794
9477 26794 19445 2363 1304 -571 3760 17076 14803 6085 -14960 -85 5346 -3199 -8910 21613
9463 21613 4276 5446 5125 -10962 -14427 -15733 -8328 -3229 -13719 -3270 12769 -3648 -16969
9450 -16969 11895 22475 12924 2332 880 9884 2946 -17543 1806 24075 19537 20045 32104
9437 32104 27563 39095 47329 45001 48813 61490 40441 25336 39962 25956 29697 29221 7846
9424 7846 3570 9285 18489 45511 30275 6476 15315 24473 8254 34939 42128 15113 29346
9411 29346 44697 23599 -30783 -56196 -61595 -56655 -19379 14650 14224 15562 15226 14858 -4558 -26161
9397 -26161 -25692 -21477 -7446 -12026 -26462 -11332 3279 -1617 10555 -15579 -20325 -17503 -23209
9384 -23209 -21486 -13023 -8887 2245 1862 27981 17283 11626 -11620 4813 23804 27743 17470
9371 17470 21259 32642 36692 15210 11719 45975 36345 36031 24707 6292 25623 29197 38215
9358 38215 29685 23020 27691 28768 11276 -825 15644 17553 5344 8746 23974 29104 20605
9345 20605 8515 17131 12566 7585 15837 22162 16150 -1669 -7940 6847 19402 2355 -7806
9332 -7806 -6890 10130 22969 45621 57670 44900 57076 56613 44945 34279 14812 8031 21
9319 21 -5912 -5371 6211 35126 24414 23128 15230 14035 11529 2971 -14784 -17465 3885 -1540
9305 -1540 8281 23929 25711 23306 4909 -19310 4795 8427 9257 14222 -8249 -11220 -11248 5980
9291 5980 14652 19215 27562 40797 34873 15630 19919 19102 12530 16527 8946 26732 38365 22176
9277 22176 -7900 7501 24299 7583 -3802 22284 16699 1461 -26158 -10282 22093 6218
9265 6218 -24675 -27332 -38792 -16946 -10193 -3872 17354 7041 17177 20214 28539 7191 13895
9252 13895 10744 -1481 -16703 -11237 -10985 -7278 19704 23074 18009 -4528 4275 10818 6401 19003
9238 19003 40606 47897 38382 24610 29581 18313 15397 23920 27686 25591 29387 19756 10657 16570
9224 16570 20296 32084 38828 46121 51236 37201 28482 19477 793 7255 18707 22754 15187 20143
9210 20143 40046 59580 53914 41229 12185 2129 5449 18863 35875 43756 24722 39167
9198 39167 28575 33786 34984 13814 16318 -1393 -4288 20951 35996 46268 47605 22921 1871
9185 1871 9064 27239 21664 22366 10873 -20169 -16133 6518 19110 1626 -13372 1020 3480
9172 3480 22628 40206 17146 1124 8422 18555 17348 15307 -1300 11341 38233 63756 34791
9159 34791 23072 3664 -15594 -6789 -1107 16515 38516 34651 19581 23003 36725 22193 10810
9146 10810 9323 6824 36559 58297 52365 21979 9770 683 5776 5678 -7385 -13959 8111 26253
9132 26253 6890 -22770 -34940 -19010 4679 14842 40356 85859 64509 42618 40816 43419
9120 43419 42265 46930 50280 81936 106602 115271 134944 176419 220071 257189 267216 265864 289501
9107 289501 377548 510812 706857 1020666 1533670 2403989 3820642 6125992 9259976
9098 9259976 11984587 12538975 9859796 6395794 4161821 2839005 2003512 1439823 1055612
9089 1055612 798125 640002 523437 421415 337266 293387 258613 242681 200721 153141 107982
9078 107982 91714 115790 101797 75293 84529 87850 99965 105322 112737 96099 71056 85336
9066 85336 66303 37301 30976 54280 58352 63840 57063 51313 13224 -17073 5616 7671 15963
9053 15963 9924 21733 36703 37410 51787 61429 28973 6132 14391 40654 27911 18794 22084
9040 22084 32550 20468 10129 636 9500 14491 2808 -38576 -47944 -5139 22917 300 286
9027 286 15235 10889 2711 398 30948 33198 8752 1687 31787 42979 43716 53464 52946 33285
9013 33285 2147 20056 15785 28249 30826 21850 26169 25260 13464 6277 15661 17353 17998 9131
8999 9131 21888 35108 41750 37279 32614 26099 18095 12490 15071 16033 2695 7772 19195 14894
8985 14894 40068 48180 52925 24273 2421 -20996 -43698 -24207 -15953 6281 19634 2661
8973 2661 30028 34460 35516 27722 24190 8993 -4399 3593 7605 10074 563 7060 8198 24714
8959 24714 21955 -9016 -33012 -21061 -8599 -17510 -19170 -35086 -22183 842 -244 26279 42602
8946 42602 44768 40732 37724 33250 16195 9959 -20042 -31089 -16858 -7967 564 -9006 -13168 -22706
8932 -22706 -22514 -18495 -9990 7666 26853 32854 27475 11496 -15137 8275 36919 -6527 -1688
8919 -1688 23009 14411 4532 -45684 -53673 -45688 -15516 -6122 -8185 -15909 -6294 5977 18285 4844
8905 4844 -25295 -5765 34802 35641 15996 20648 15525 12511 -6323 2979 12919 22831 22877 19985
8891 19985 7652 7543 1766 -18479 -26076 -15339 -20906 -15935 -16705 -13397 -13369 -19206 -22994 -25436 -22631
8876 -22631 -11694 5642 11651 -5777 -8659 28179 -5313 -37125 -40660 -49874 -46656 -36417 -25014
8863 -25014 -5276 -10126 12794 22267 26241 4257 -26543 -35723 -43919 -13984 12869 23532 11526
8850 11526 -5610 7443 5440 31511 29025 -12587 -10725 -2760 7644 36784 42804 31228 13602
8837 13602 -16868 -24487 -30306 -25874 -33056 -23578 -9564 -16507 -25337 -4476 -4053 -11409 -26781 -35970
8823 -35970 -35677 -39613 -22454 -4562 11535 6887 -4256 -11335 14834 18617 15238 -692 -19716
8810 -19716 -10038 4303 -17480 4454 18201 13315 22901 22296 -1449 12849 6157 -3147 -4128 -5528
8796 -5528 -23053 -25040 -13847 -7915 1225 -11986 -34000 -69921 -56510 -39014 -34313 -24865 -8339
8783 -8339 83 3545 -16080 -9196 -8410 1218 39408 55505 31000 34455 48848 17988 -1045
8770 -1045 -2138 -11600 -14747 2306 12469 22281 51789 18534 6089 2868 12353 9481 -1938
8757 -1938 -3457 11434 2308 29455 1738 -36860 -17529 -16519 -18728 -3099 -4912 -4079 18232
8744 18232 5605 9118 5640 19244 19363 28556 6287 -8538 -16214 -29979 -29092 -9655 -1203 -9816
8730 -9816 -18700 -23861 -14279 11346 -1867 11556 25222 23632 16126 27586 15798 -14625 -790
8717 -790 28565 19740 -27326 -51952 -30606 -14229 -22635 -28972 -17135 11350 17422 9237 36031
8704 36031 26318 -151 -8434 7849 16017 4587 1109 17752 39941 38354 37727 15000 21982
8691 21982 46725 42032 12050 -1014 4532 8782 5310 -6254 16365 41351 22255 23541 42530
8678 42530 23099 2404 15346 2589 -1851 -12922 -18809 -22646 -9730 14654 37790 38428 30401
8665 30401 18886 41731 41833 52852 68706 58975 39622 9690 -33743 -24235 -19623 -10696 8032
8652 8032 43214 59387 66081 55049 25696 40598 24613 -783 4067 -7259 -11807 601 -11420
8639 -11420 -6964 -6371 -8095 -9116 -7926 2473 14178 29285 37180 8705 -15228 -4659 9740
8626 9740 -14321 -20704 -5616 2205 7374 5995 3010 -18791 -24969 3792 35043 44003 63847
8613 63847 69670 57920 22842 33542 27573 17756 14585 54093 55078 50838 49838 44414 41814 33259
8599 33259 12657 18311 39779 43906 36816 20847 1150 3502 9952 21530 12496 -10277 1151
8586 1151 -3520 16 5044 -22756 -27683 -6125 -10841 5892 -18426 -6990 7306 15239 22701
8573 22701 36615 47862 33144 42999 54337 23590 -13730 -29985 -33070 -25933 -31841 -18281 -1997
8560 -1997 -4698 7905 37432 27041 4857 13419 12491 23998 9572 -1582 -23791 -11253 7242
8547 7242 2384 -21301 -13321 -2926 -343 25329 15697 423 -42710 -75760 -51745 -17371 1177
8534 1177 6591 -21671 -44848 -25882 -14979 5958 15050 40101 14329 -16693 -34389 -32661 -30373
8521 -30373 -8355 -10764 -22409 -22299 -20416 -18796 -5657 -11068 -26159 -34625 -11070 11474 5007
8508 5007 14218 -2586 -5474 9834 26276 14507 18602 53787 60761 28312 -962 -11979 4271
8495 4271 -7218 -20189 6853 58438 44365 20689 12985 20835 20491 28318 32192 33704 -15955
8482 -15955 -28886 -10085 -6217 14020 22238 18755 4564 -6206 24049 26331 19210 15362 13973
8469 13973 1966 -6366 6388 6794 -6205 -13129 -23950 -22178 -15374 -29616 -31292 -24929 -5527
8456 -5527 12026 26708 14797 9262 6754 -661 -1480 12921 1920 -5082 20756 56681 52999
8443 52999 23916 26728 44551 31902 25333 37369 25793 21763 35328 22301 -6756 -4629 15072
8430 15072 24210 22612 35629 35633 531 1205 2960 -8680 -13040 -14717 -14797 -35736 -39955 -38240 -39715
8415 -39715 -29923 -16582 -7318 1609 2033 10041 15161 -13439 -36797 -39798 -4586 30257 18126
8402 18126 6907 21705 38235 44249 42656 37971 13709 -8507 -11662 -17471 -6008 505 5956
8389 5956 11352 5550 -22275 -27158 -14394 5836 1433 4430 21360 13495 8993 -4 -18325 -18231
8375 -18231 6969 20756 -8116 -13354 -12963 -13293 -666 31582 40825 30845 23097 -13233 -18884 3148
8361 3148 19881 5578 12022 10762 495 325 -16097 -1389 1599 -16723 -10592 -35196 -35848 -24456
8347 -24456 -11744 1548 1893 9628 3613 -8753 -17969 -29562 -1249 -7290 -18120 -16846 -6873
8334 -6873 13058 -9399 -27561 -30766 -14495 -4876 -5046 -7077 16341 24978 25179 7584 -11203 3251
8320 3251 -3814 -16147 -3553 -14813 -9280 3983 -7962 -3686 -3796 10328 14389 7837 -10650
8307 -10650 3220 21632 18230 -14586 -3888 25593 34411 13295 667 -10539 -23484 -12867
8295 -12867 -7481 -13437 -8293 -7159 628 22333 21771 40507 16199 33936 22943 3615 310
8282 310 6273 9065 -17300 -31665 -36321 -37552 -28687 -37829 -45464 -40532 -18857 -19173 -18671 -8489 -8865
8267 -8865 -21214 -20922 20800 30849 20743 -3826 -2484 5026 -13555 -11249 -11162 2297 -2146 -5277
8253 -5277 -5984 13948 14262 22515 7399 -8971 -17564 -35345 -47777 -33677 -24191 -38094 -46228 -4289
8239 -4289 19587 -5629 10689 22221 22925 2989 288 -13614 3515 22744 26458 27175 45346
8226 45346 38920 7922 -7523 -12759 -19554 -24116 -2199 -3247 5153 -9033 -23036 -8493 20019
8213 20019 14948 6305 -2006 17001 25096 30823 9386 -2733 -23600 -33091 -21126 -18955 15720
8200 15720 30899 17887 -9042 396 30594 30792 38581 32356 12026 -6688 -18799 -23801 -28462
8187 -28462 -15318 -2979 7034 20980 42860 35104 26483 7105 -12625 -20557 -27750 -36713 -38243
8174 -38243 -43827 -11735 19987 32055 31189 23623 11505 17793 47519 42396 47533 35454 15957
8161 15957 19786 25462 1734 -11745 6352 12888 22253 24884 -75 -12763 -12530 -12826 -10131 -31059
8147 -31059 -22998 2766 31219 49092 41000 30170 8212 -12313 -11986 10291 30213 16758 -2574
8134 -2574 -15971 3023 20775 6302 -26358 -27052 -8971 -983 1970 14391 15904 -2422 -3867
8121 -3867 -27124 -40265 -12239 12506 18146 19099 13127 20946 -5918 -7606 -3025 1105 6331 1515
8107 1515 10337 -17924 -24359 -20905 -2365 734 12156 19417 -4713 -5413 -261 526 6110 5502 -22298
8092 -22298 -41440 -32158 -20986 10449 34544 30430 15424 11336 22362 11983 -87 -6354 12221
8079 12221 9896 698 -5463 -74 17648 22704 2867 -25143 -30261 -5056 4002 17600 9481
8066 9481 5005 34122 34537 1919 -11754 -18158 -19561 -10624 1647 10302 30674 32864 3568 -10743
8052 -10743 -1452 17313 9083 4332 15524 19142 32489 38411 25191 16093 2114 -1470 -5532
8039 -5532 391 -34554 -49634 -29735 7270 18164 6378 -18538 -24164 -41214 -41385 -32074 -15182
8026 -15182 4228 824 -8398 -281 -15420 -10052 -2255 -3321 22633 29571 41745 29569 14855
8013 14855 14412 18901 -886 -1123 -5838 -5449 -2365 6120 -3504 -10690 -13820 -21478 -14392 -19776 -18502
7998 -18502 -2717 2909 24550 16141 14462 10468 -3574 -21474 -14906 -18317 -27950 -33944 -22417
7985 -22417 -646 11767 -4889 -10288 -6989 -28470 -45125 -9998 -400 -39203 -36953 -36872 -30627
7972 -30627 -23230 -19619 -18040 -10550 14793 12179 4374 19931 26813 33877 12878 -31378 -43766
7959 -43766 -41430 -3691 12494 14199 34529 51536 38722 37688 37448 40425 56427 55811 51511 34046
7945 34046 33673 28389 27912 40867 57003 56660 32202 -11004 -12615 -32632 -60709 -54613 -37803 -19583
7931 -19583 -10444 19647 32325 12703 6967 -16403 113 20152 7443 6279 28169 251
7919 251 -16242 1513 19376 30511 29393 41605 22977 -6452 23194 54933 48105 16540 15253
7906 15253 14605 -5288 -33435 -24258 -10978 3371 28964 39038 26703 1752 -12517 -24976
7894 -24976 -15435 -4133 1998 -3934 -5081 12041 1291 12522 11991 -20768 -13573 -5091 -15581
7881 -15581 -41128 -31438 7623 14182 12342 11808 11144 4605 -6495 6136 22993 30233 7401 14307
7867 14307 10544 -1459 -36527 -44328 -41550 -34170 -34529 -43999 -51944 -43542 -35670 -32156 -17128 -10601
7853 -10601 -33986 -19986 13731 13947 14733 15896 11795 2748 -10493 -12163 -9889 -21883 -11969 -5870
7839 -5870 -13754 -10225 -23347 -49407 -30422 -17112 -18020 -5338 5318 -4710 -4718 14559 -7882 -32640
7825 -32640 -36373 -31994 -21911 -13374 -227 -20802 -31764 -8205 -8540 -16762 -21708 -22374 -8639 17220
7811 17220 42116 46433 19812 14001 16485 22368 17377 29617 55639 36034 14100 9798 9703 14691
7797 14691 9486 -6819 -38205 -21153 -12030 -3105 -938 -2416 -15389 -11835 5128 13608 14440 -17552
7783 -17552 -18467 -11495 -12712 17551 22503 3994 -85 16972 55692 54215 49018 23294 -908
7770 -908 -52 -4240 -2093 23187 52039 26804 9295 -17167 -33972 -22092 -35998 -40752 -24959
7757 -24959 2815 28657 30059 5511 -8908 24999 28928 18787 31568 14153 1981 2765 14196
7744 14196 21722 3206 757 15377 23926 20808 3917 25793 53539 43983 43638 26281 28622
7731 28622 24316 28292 22600 13085 18363 9045 7342 -5421 -11520 4349 3988 -16024 -3415 13345
7717 13345 10523 14453 20401 16114 -9745 -17002 -8714 -10648 -19517 -41683 -32298 -18391 -6925 2182
7703 2182 -4467 17249 32883 7548 -12929 -14560 -24710 -32449 -24000 -7727 -13544 -24004 -18716
7690 -18716 -6078 -15548 -18656 -32304 -32596 -19919 132 1038 -28139 -27953 -10150 -18045 -14654 -18713
7676 -18713 -38400 -38471 -32493 -8891 -10045 -19092 -33329 -40305 16198 35116 18419 -5770 -28237
7663 -28237 -32109 -20477 -16994 -54060 -43015 -18903 -19111 -22421 -47773 -39325 -4836 -9508 7372
7650 7372 3129 13962 21924 8462 2654 3127 11918 10358 -9397 -20983 -5057 -8051 -4480 -33086
7636 -33086 -40665 -40959 -25654 3932 14269 -2552 -25126 -40284 -36190 -35697 -37296 -18930 8076
7623 8076 11130 25658 44992 26614 15567 10322 -13727 -16347 -12963 -13741 -12378 -15247 -30790 -19935
7609 -19935 -979 -6476 -11350 -12496 -23455 -20880 4631 25932 29952 37921 47288 22825 16440
7596 16440 -12385 -27279 -30178 -22202 -22029 -7212 2080 6894 34392 50476 28836 975 13519
7583 13519 5882 -15240 460 7520 3707 6524 -17521 -4726 -4915 -67 15499 7286 -15602
7570 -15602 1096 12473 5759 8136 12313 8500 -4491 -193 11516 31081 22461 28430 34125
7557 34125 19996 29049 29393 19405 4892 -21357 -22766 3472 29728 34083 13178 5578 19188
7544 19188 46419 56224 47587 29205 -8392 -10362 12338 31334 15586 10025 11487 1935 -18976
7531 -18976 -9136 1702 28306 46259 26329 18923 12170 12521 25242 12935 -3230 -2796 -11296
7518 -11296 -22998 -23579 12817 32800 25647 -2520 16586 45023 36034 17804 14671 20117 12404
7505 12404 -1855 -16982 -2110 -2345 -9707 -23222 -17433 -8958 5503 -3775 -15023 -31746 -26763
7492 -26763 -1553 10795 28942 22311 44703 31111 -5480 -31920 -26478 -26686 -35898 -39000 -18048
7479 -18048 7287 4076 1777 -6719 -16022 -5219 17236 35000 41619 39793 38946 40421 25164 18790
7465 18790 11988 16591 6422 -22355 -21909 -8695 -2236 -4566 4647 -14574 -28402 -23613 14633
7452 14633 24347 26398 22868 4290 -15901 -25588 -11955 4537 21852 21782 20635 14526 -15099 -19109
7438 -19109 -3936 2181 2144 -11866 -9601 6075 25359 19710 3698 -5839 12201 14556 5534 14796
7424 14796 22201 36950 46648 38286 33587 20347 304 -24838 -19568 -7129 -2520 -20080 -9257
7411 -9257 -4879 -5040 -1270 -22897 -10439 -17607 -27198 -32163 -30973 -21425 -4862 -5282 -5731 -8208 -11721
7396 -11721 -13304 -18019 -12788 -27071 -42834 -60448 -41499 -13688 -524 7657 658 9577 14517
7383 14517 -2240 -15239 -14782 -7179 -15938 -32040 -44578 -14316 -2412 22055 14916 -15805 -25473
7370 -25473 -13250 11189 22823 16708 26328 4505 -21401 -9859 5190 -15662 -14819 -2417 -334
7357 -334 -5319 -23041 -46268 -34843 -9706 -5284 -221 -3894 12619 700 -22903 -17491 -25367
7344 -25367 -29814 -24559 -27790 -32792 -32593 -34647 -24832 -22265 -29061 -49698 -27315 -4195 20655 12389
7330 12389 -6394 -19287 -18538 2112 8184 -1869 -7818 -17121 -8268 11870 22986 -18427 -24849
7317 -24849 -19490 -19961 -16421 -11052 25719 23636 -15659 -37219 -31233 -21857 -19494 -36730 -27242 -35815
7303 -35815 -41844 -19548 -19646 -25912 -46174 -45018 -21841 -7067 36735 39489 28661 13028 13872 -4
7289 -4 -26193 -38038 -32258 -41188 -45130 -28916 -32614 -22054 -4821 -17362 -27206 -34678 -35993 -45452
7275 -45452 -56902 -29459 -15309 -14434 7560 18659 14124 10955 -20133 -24413 -88 4406 -18265
7262 -18265 -17955 2212 3700 5942 5733 -5530 -13855 -3782 7596 533 -25024 -36736 -37116 -39947
7248 -39947 -35960 -18663 13363 -4132 -19070 -1667 4541 -518 -9186 -35043 -12277 2214 -7750
7235 -7750 -14151 -14964 -20850 -8150 -8691 -8257 -25079 -18024 484 14736 1080 3041 27310 43074
7221 43074 37503 21003 20818 25013 21694 25331 33129 18204 -2378 2084 14644 2575 -19450
7208 -19450 -41498 -51012 -50928 -60069 -61143 -60845 -38506 -19442 -19733 -41460 -67574 -46051 -23505 -25328
7194 -25328 -27812 -20826 -20417 -14830 -2752 19939 13844 5147 -1859 -21782 -35039 -33700 -44543 -35427
7180 -35427 2308 5564 4629 16387 8158 -9127 2611 8909 -1094 10522 14924 9295 -28576
7167 -28576 -42516 2044 19160 9142 16846 -3271 -6300 12622 15639 6263 5542 22189 41409
7154 41409 40787 19586 27741 50319 43741 18113 -15200 -26462 -23039 5172 -10746 -16739 -8391
7141 -8391 9361 38191 51223 29007 12299 -16092 -13548 -12205 -15067 -24299 -202 778 2988
7128 2988 13944 2380 -2095 10889 31396 25249 32958 26086 6146 -9866 -9788 -13235 -2247 4403
7114 4403 23059 42877 57474 36180 59 -9400 19566 39778 25648 21578 -9220 -23197
7102 -23197 -30249 -12472 11030 3734 7062 10709 11012 24843 21593 12987 -3165 -23564 -18375 16939
7088 16939 51626 61733 46008 13729 7153 -6668 -24394 -43005 -44922 -8757 -6564 -5872 -13988
7075 -13988 -18714 9225 -7285 -48293 -34280 -10983 211 -2673 -25716 -36884 -28190 -29342 -12950
7062 -12950 25190 51501 33336 -6669 -18054 -1479 12575 24407 37058 43483 64931 51072
7050 51072 32561 42684 23593 -8897 6764 9223 22210 1946 -12763 -10023 13266 19559
7038 19559 20895 8352 -15614 -43702 -38875 -18906 9274 10460 12667 -923 -3679 11822 -2945
7025 -2945 -48673 -50581 -22803 -12281 -14455 -3960 11412 -7962 1105 15095 29223 43607 39171
7012 39171 16505 -13532 -21018 -11859 -21169 -11726 -14925 -17310 -8252 5301 10053 16112 10740 5490
6998 5490 3313 20118 50407 57559 55020 18999 -4135 1349 8471 3378 11033 7718 3959 15103
6984 15103 15307 6649 930 -1967 3625 7725 8374 -8440 -4647 3186 14964 5477 2279 15752
6970 15752 22813 29521 6853 -4482 -10131 -33211 -49044 -45814 -20775 -3680 -28073 -21401 -3976
6957 -3976 -15060 -17794 -3520 -8138 -24793 -36435 -18012 -8303 -4603 4726 -6181 -7751 -26863
6944 -26863 -12513 12528 25549 33586 45322 36618 20983 15183 8910 2644 5482 1865 2555 -12839
6930 -12839 -17932 -16164 -36117 -32757 -31221 -28065 -8472 4427 19864 7631 -801 -360 130 18319
6916 18319 30507 14083 -11181 -20819 -19630 -33913 -38189 -44151 -55535 -45224 -26334 -11654 -13843
6903 -13843 -19368 -15919 -9881 -9530 -11528 5082 -14084 -6281 -5072 856 11082 9662 -18448 -25353
6889 -25353 -25922 -8598 4682 -2067 -41233 -70304 -67076 -57847 -51557 -48673 -32457 -36307 -35560 -36752
6875 -36752 -24399 -18646 -11658 5691 4920 5171 6297 6061 3803 3431 -5424 -17831 -12448 -12619 901
6860 901 -8693 -18948 -15591 -21287 -35003 -31243 -36558 -37099 -22382 -19471 -10614 -9733 4592 35139
6846 35139 42131 16623 8669 20307 18039 18967 36288 20036 5274 -8059 -38146 -16679 -32685
6833 -32685 -32298 -43092 -52553 -47062 -20118 -9984 -16110 -32801 -21878 8368 238 -9005 -31663
6820 -31663 -32976 -9714 -8390 -1104 10173 -2079 385 8937 936 840 -4041 6213 27597 29930
6806 29930 1135 -29538 -31820 -40670 -52229 -31668 -11892 -4331 5673 10363 18714 11976 5527
6793 5527 -12275 -26814 -33444 1442 12232 -6337 -13731 -12766 6221 19279 3858 32905 30332
6780 30332 3512 -21156 -24891 -15229 -9498 804 -1839 25666 46297 37373 28526 12782 11731
6767 11731 15969 -8546 -16990 -4828 10576 4686 -7499 -3740 21442 22688 23594 21642 11331
6754 11331 12857 -19164 -16330 634 30681 46283 13157 -11905 7434 14168 13433 14293 22872
6741 22872 15511 31417 21575 10953 989 -16760 -51967 -71249 -55905 -17102 15008 24952 35253
6728 35253 52245 44197 28078 49460 57263 97185 127515 184673 264056 395627 535726 676790
6716 676790 777086 752867 578587 394347 259292 177023 136764 104513 72584 84681 115713
6705 115713 99600 66001 61468 46216 17538 -518 -4479 -18558 -12375 -3063 -14350 5248
6693 5248 19614 12595 18389 21575 34842 45729 28927 25084 17660 -5560 -20726 -37721 -29705
6680 -29705 -20280 -22894 -2701 -231 -21069 -29928 -22866 -13212 -24683 -27825 -8371 -20305 -8612
6667 -8612 7620 17527 2041 -5365 -11140 -15170 -15566 -32961 -30242 -9969 -2090 20419 20682 17791
6653 17791 -3171 -17012 -5176 7545 30845 35183 4691 -18776 -30819 -845 16754 6968
6641 6968 7224 20527 22585 17455 6630 -11766 -29225 -46500 -46335 -45219 -42517 -26982 -25247 -30405
6627 -30405 -43624 -30808 -7243 2519 14421 16451 11560 3238 7621 19459 16210 -4680 -22781
6614 -22781 -15721 -26944 -31846 -11239 -7033 -19479 -36524 -39076 -16915 -8789 -31483 -42429 -5102
6601 -5102 24224 43167 28129 7488 5332 -16617 -13511 5634 19620 24684 12047 14166 32850
6588 32850 20116 10432 -3334 8268 2676 -22392 -20923 -8365 -10676 -5643 -2136 2630 -7540
6575 -7540 -38252 -31789 12824 8865 27225 49740 38470 22466 -10551 -5491 14520 39485 42682
6562 42682 20606 -12500 10532 19226 7087 5304 -14277 -29217 -37228 -20347 -9362 -4484 -24108
6549 -24108 -20107 -3092 4653 16904 34377 30994 38154 17562 11854 14215 43159 80145 103813
6536 103813 84288 32412 2174 -13821 -25014 -27155 -15468 -4859 -2146 -11264 18724 31297
6524 31297 36718 42566 35390 22602 18012 5923 -5497 -5523 12106 12698 -3826 1857 -16922 -16508
6510 -16508 -41656 -32996 -25894 -18497 -28207 -22992 -19461 -14011 3995 8471 2514 -8701 -26220 -31877
6496 -31877 -10895 2956 -12169 -16221 -18207 -21230 -21875 1945 18810 8068 11261 17540 17212 9238
6482 9238 2651 15740 17150 1402 15860 2564 -19678 -29113 -39785 -20786 14947 -16079 -43722
6469 -43722 -53025 -48527 -32077 -33494 -16636 3294 12598 8488 -10457 9630 23902 14599 -9820
6456 -9820 -19556 -20853 15663 48034 48719 21711 21643 19202 19475 32649 36996 23204 5153 14469
6442 14469 34388 41642 48701 10328 -23785 -26436 -22956 -11042 32423 32019 439 -4317 -8919
6429 -8919 10372 12466 -1279 25892 27455 6639 -4213 -10837 3141 5399 1290 -15922 -17999
6416 -17999 26270 57845 53309 45713 14467 31385 35031 34810 14413 -5442 -1113 13227 -9895
6403 -9895 -26467 -11850 29988 29420 25687 11195 -5803 1419 25677 40943 38456 46761 37756
6390 37756 -4186 -13034 -2568 21545 16698 8674 -6922 -8659 -15384 -12712 5879 1130 -30996
6377 -30996 -10204 -11251 -14800 4458 25559 36628 22279 2675 -19366 -11415 18580 9730 -19288
6364 -19288 -43934 -29133 -3941 -9200 -26484 -52532 -67468 -37973 -20878 -2923 -8118 -11219
6352 -11219 -5962 -26364 -8571 22325 24955 29456 50341 32779 12791 5111 9186 28211 29430
6339 29430 16703 4732 6232 1637 -349 -13339 -26771 -16718 -14168 -40339 -53888 -25895 -12948
6326 -12948 -1019 -17392 -4683 26325 34987 696 -20390 -13508 -44141 -50696 -31692 -18805
6314 -18805 -22682 -37608 -34414 -27753 -45727 -35916 -24384 -6653 1997 5385 14102 3752 6314
6301 6314 -14958 -31571 -12880 5123 16317 17829 20445 5882 -7261 -11353 -16416 -15804 6536
6288 6536 3801 -16258 -45689 -38740 -27173 -20368 -12511 13054 22039 22551 19463 17780 42009 34845
6274 34845 -6507 -14438 -5306 -6411 -22778 -30597 -39418 -36230 -38998 -54978 -40131 2424 11097
6261 11097 -232 -17435 -27273 -7802 13388 -12 15406 -17255 -46680 -46869 -42395 -25227 -4196
6248 -4196 16237 12287 18787 22444 21243 55330 31754 1377 22850 33456 18293 -15283 -44743
6235 -44743 -6830 9175 4390 14516 -3771 2247 6112 357 -24313 -17792 -18181 -20333 -29939 -27604
6221 -27604 -16127 -22063 -25907 -33087 -5728 25055 19020 -20852 -3192 24613 22755 36939 37214
6208 37214 32296 12815 -6969 5676 9507 -2213 -19372 -22215 1608 2651 -1104 -32183 -39205
6195 -39205 -31082 -6154 -6184 12471 24748 8834 -20097 -6472 -9994 -26972 -35782 -44527 -18777
6182 -18777 -7408 1112 -1740 -8913 -31085 -26304 -4384 21646 40830 26092 5818 6977 7698
6169 7698 8894 15646 27269 28991 18834 3593 16530 12285 -7876 19711 59945 54889 -5661
6156 -5661 -33431 -28783 -20389 -24360 -27020 10770 14635 489 -2922 -12781 -1315 -17960 -7170
6143 -7170 -14523 -27689 4519 20235 -2335 677 6696 -3089 23507 20691 17430 28183 35536
6130 35536 31043 17929 -5396 -627 3731 -30774 -39304 -20240 -5460 -6607 -1533 -13492 -20242
6117 -20242 -23121 -4703 6963 1759 1188 -12857 10081 24936 27123 53368 41564 33161 54935
6104 54935 48675 6446 -33860 -52597 -38711 -33108 -33701 -53301 -44310 -25192 -11112 -26338 -29891
6091 -29891 -30275 -4011 -11133 -27515 -37482 -34691 -17661 -4117 19773 252 -37658 -42314 -23575
6078 -23575 -3591 -17110 -11289 8223 -1469 -11013 3861 -9195 -19190 -3946 -931 19456 16145
6065 16145 10954 19567 26369 8117 -4329 -1663 -7217 -8646 -866 -5243 -9633 -24829 -37468 -29951
6051 -29951 -21466 -16288 3598 5280 4355 3639 -21046 -19606 -18873 -27835 -10962 -12349 -44198 -39280
6037 -39280 -34269 -42366 -18086 -12121 -15309 -14937 13448 28639 34433 26586 -6103 -33139 -25629 -26622
6023 -26622 -21575 -481 20971 20620 1647 -5557 -6975 -24342 -26651 -10915 9625 32556 32580 9731
6009 9731 -17116 -27492 -43005 -23162 -23054 -18874 -2725 230 -10905 -22020 -18862 -7449 13766
5996 13766 19814 -583 -7175 -38550 -31928 -41538 -66957 -30394 -28922 -39632 -3354 16419 14452
5983 14452 -20715 -45162 -38182 -26628 1273 5610 -301 -7256 -16807 1575 15898 13968 32428
5970 32428 20955 16179 20161 18420 8232 -10166 -3618 -14129 -15615 -21799 -32146 -10710 -3156
5957 -3156 5812 12114 -8323 3470 17036 16095 1931 22248 25478 23057 35828 52433 53469
5944 53469 22916 7403 -27345 -51420 -21977 -18828 -5382 -2885 -26782 -25915 -20055 -19217 -37433
5931 -37433 -31393 -6874 -12708 -29001 256 42431 38987 29002 -5029 -14566 2953 10089 -14404
5918 -14404 -19065 6300 39384 31324 -1480 -23445 -21760 -10635 6559 6830 6236 -16208 -43546
5905 -43546 -40512 -32222 -32943 -29520 -20031 -4668 5934 27037 27438 36141 2078 -4498 21445 48487
5891 48487 61163 50249 23070 -6112 -13050 -14032 -10177 -29330 -32282 -20170 -15416 -3627 14052
5878 14052 21573 3686 -20133 -16559 -27149 -28497 -27591 -47058 -42494 -31456 -24734 -24603 -22833 -36356
5864 -36356 -34692 -20483 -14625 -6951 -12723 -19418 -25847 -42783 -46358 -27150 -28435 -36422 -48580 -46985
5850 -46985 -52085 -41350 -43885 -49136 -38872 -12357 -1556 373 -13494 -28041 -22002 -28371 -24735
5837 -24735 -19785 -43604 -38722 -44058 -52324 -45275 -7929 -16666 -37037 -25297 -27605 -1248 29559
5824 29559 27502 24197 40172 3091 -29889 -28312 -392 14835 19532 6392 28867 11981 5428
5811 5428 2998 -16693 -33164 -20558 2947 20201 14429 -12783 -24748 -32022 -34925 -18219 -16865
5798 -16865 -5820 4562 25172 45925 27970 -16407 -24659 -25212 -22206 -39885 -38517 -19477 3359
5785 3359 5507 -3078 -7035 -13932 -20276 -12741 3007 2473 838 19332 5268 -16165 -34084 -22085
5771 -22085 -40940 -24481 -14508 -4408 19684 34197 14329 -22069 -22609 -20674 -24777 -4867 17857
5758 17857 31159 24741 9895 5674 -11280 -9028 -1713 3937 4918 10427 24056 20131 22584 8435
5744 8435 -6340 -10222 -13045 -8100 -11988 -11322 -3345 -3294 8408 4898 -11266 -21887 4342 22184
5730 22184 29895 18639 -21701 -16203 10312 -538 -3214 -2367 5344 8390 2874 -14811 -12061 4926
5716 4926 -2637 -15857 -9421 245 -3629 -24230 -38469 -17969 -7208 -15908 -13660 -8944 13888
5703 13888 9471 21990 42159 39479 16735 -28003 -33059 -23956 -9919 -5827 4564 36642 47170
5690 47170 43323 21370 23064 12215 -5298 -22750 -31910 -20867 -283 -2872 -28202 -26638 -31849
5677 -31849 -37160 -27607 16408 44742 56823 28195 -2694 -16025 -9608 -6405 7091 3180 -4919
5664 -4919 -33680 -35927 -36581 -35083 -25827 -29375 -37791 -30965 -21925 -48251 -41860 -15491 17925 16337
5650 16337 -15572 -27251 -1793 14467 11258 31199 33310 18088 6001 -11880 -18938 -8587
5638 -8587 -1811 -12467 -25491 -15279 -16496 -23835 1245 4901 6648 25012 28262 16155 -3953
5625 -3953 -2641 2097 9323 15075 19211 33723 32570 11709 3884 16512 28021 15534 -8124
5612 -8124 -13471 -11051 -8487 -24901 -27455 -45574 -71517 -77532 -35417 -19663 -14182 -4648 26691
5599 26691 30333 17768 -16536 -35018 -31942 -20244 9116 -12375 -31427 1461 29290 13570
5587 13570 7430 17801 6415 4034 19039 16600 -2976 -10581 1323 -14354 -35515 -35069 -51563
5574 -51563 -52374 -23536 -9372 -4721 -8879 -27513 -27533 -9592 -159 -7665 -2676 -2179 9411 4722
5560 4722 -717 1529 -8853 -31271 -17745 -4954 -7139 7656 9303 7424 7798 3264 18018 15893
5546 15893 20020 7341 2733 16711 32453 18192 14861 22920 23170 31513 11591 -9057 -19551
5533 -19551 -20731 -18776 -29560 -29377 -24644 -47730 -50031 -48650 -57773 -43057 -21137 -37975 -41669 -34700
5519 -34700 -35667 -8908 -5115 11338 -14784 -40058 -36374 -12925 -43995 -65688 -41554 -15816 8464
5506 8464 -2582 -8449 3136 6893 -2429 -39476 -24829 -12842 -9245 -8953 -24581 -36343 -33469
5493 -33469 -45838 -62173 -35657 4858 8828 1490 1942 6352 4372 39938 75009 54228 57604
5480 57604 49670 52567 40912 29095 10197 -8355 -9294 -17932 -19877 -15195 -32654 -19350 -7164
5467 -7164 12604 21829 30231 21292 18982 34031 38093 48243 19446 -3569 -31460 -49112 -48316
5454 -48316 -38866 -42856 -30355 -7222 11169 -1560 3941 2683 1054 6413 15881 5667 11170
5441 11170 -5665 -26589 -18935 -5881 -4623 -17587 -52641 -45450 -17289 -20631 -52841 -51538 -16559
5428 -16559 863 15246 22442 32140 10958 -22158 -3442 18297 26724 1151 1516 6493 9207
5415 9207 -258 -1585 9795 4825 -9755 -33994 -50307 -48588 -33750 -73500 -69850 -19901 -5182
5402 -5182 -586 -8859 -14011 2004 -1662 3784 12124 8832 -16410 -18176 -28941 -5402 -5278 -20029
5388 -20029 1590 6577 -10332 -17054 -24101 -16951 3351 11316 13711 32838 53323 57377 58728
5375 58728 41303 34366 7045 9102 -3407 -6898 252 24698 10728 3311 7824 13744 9867
5362 9867 5886 -2292 -7245 13026 35175 35465 11563 -6331 -13446 -27 -976 3167 11513 16709
5348 16709 -3060 -9223 20897 14121 18531 20354 42695 45614 11179 5320 33235 50608 35577
5335 35577 9051 -24664 -36781 -18220 -8102 -11944 -5136 2823 18991 -2324 -9449 -22401 -10536
5322 -10536 -18684 -12251 9370 19101 19129 -17295 -43649 -41627 -44805 -15938 13553 36159 42330 2702
5308 2702 3085 19210 29659 18436 -14760 -14093 -5825 37 -11288 -17339 14286 56491 75303
5295 75303 83075 50520 16619 11879 10918 -2229 -5991 11341 31194 18062 13725 33817 35090
5282 35090 -17482 -5127 -617 -30543 -32773 -26961 -24334 -15160 -17907 -2998 -2040 -43092 -53728
5269 -53728 -45469 -27718 -27304 -26176 -7276 -20859 -28879 -7718 16799 6425 12230 5993 -2201
5256 -2201 24007 42512 28060 35614 41418 31260 2095 -12368 -6881 -9729 13099 35110 18209
5243 18209 359 -3813 -2608 22744 41747 39736 33387 19902 33172 48280 41741 26049 15020
5230 15020 23691 4695 -24754 -6799 -6817 -12664 -23718 -23128 486 14136 -1485 -7181 -5419 1607
5216 1607 23734 12586 -14126 -18259 -16289 10141 15853 27347 10821 6198 5734 25106 28563
5203 28563 11451 16452 13383 10773 -2950 -8012 -14844 -1907 -12693 -10929 -7078 -21373 -32401
5190 -32401 -9345 -8246 -4141 -2379 -1853 -1822 5903 7501 26025 46131 43228 23698 3666 -10187
5176 -10187 -14219 -17539 -44327 -39016 -8136 -24935 -25456 -31786 -23661 -20616 -22777 -19680 -11680 398
5162 398 33965 32533 48528 45233 32258 25229 19287 39774 41042 23361 32644 35292 4721 -6050
5148 -6050 -1864 14912 -6909 -5444 -16062 -892 5886 -10856 -11679 -4604 2221 11845 14534 141
5134 141 -32392 -39675 -15305 6386 15599 7408 -408 5191 -12625 -25630 -14842 1808 -5012
5121 -5012 -31354 -18640 -9937 -4093 13394 11602 -2010 -10014 -19694 -45657 -39124 -12300 -2259
5108 -2259 17164 42617 27612 33400 42572 41195 35082 16198 22139 16402 4420 -228 -3493 -8065
5094 -8065 -12084 -5475 -27610 -33909 -32348 -39864 -51071 -35927 -20154 -10952 9711 23416 1368
5081 1368 -12010 -7231 -3610 -27926 -27007 -9583 17083 14936 2820 7404 25324 10482 -10535
5068 -10535 -20948 -14154 -3007 9261 18102 -9164 -41783 -65279 -61730 -45154 -5518 -2472 -25742
5055 -25742 -13871 -16040 -19592 -15399 -12432 -12596 1012 7294 -9483 -2313 14945 9671 18209 -2674
5041 -2674 1598 -597 -15177 -20635 -17819 -28916 -22229 -702 12888 13742 21624 42087 40510 34499
5027 34499 11855 20371 21115 7821 -9150 -18111 8595 41313 50662 43096 38180 11308 19345
5014 19345 36713 27501 27792 29940 25507 45017 30611 13512 3278 9951 33273 54759 37205
5001 37205 11702 -11934 -21616 -10955 -30890 -17337 -12896 -25220 -18992 -18325 22213 48616 45800
4988 45800 15052 -8530 -7564 -8635 1897 13345 8227 22009 22566 4572 9591 9392 -26458 -18552
4974 -18552 -260 1892 7842 13644 24512 25201 16283 -2892 -22789 -20827 -16206 -16110 -25574 -48170
4960 -48170 -58814 -36925 -719 7512 -15247 702 -7322 -11039 -11319 -22412 -2683 8191 32050
4947 32050 43628 49878 59177 35253 14965 -1517 -14213 6029 21738 3477 -4120 -23755
4935 -23755 -11500 -6678 -29010 -40964 -45401 -27853 -11594 880 -29009 -40167 -28663 -19923
4923 -19923 -26784 -7225 -514 -24176 -33050 -6662 25238 24941 20084 12118 6104 -457 -2569 765
4909 765 19508 7231 -2876 7476 -15576 -29696 -24418 -30677 -43526 -29287 -10200 -404 -28801
4896 -28801 -28213 -26415 -13482 -4935 5279 -10656 4804 23319 23748 32999 9975 -14097 -4796
4883 -4796 28149 24412 14895 8235 1868 2011 -263 -30508 -28436 -36906 -16670 -8386 -21814 -11895
4869 -11895 -11771 -471 25598 49366 50472 44761 26735 16066 16680 15547 23122 41008 42840 32410
4855 32410 34767 27141 -2820 -104 3855 5120 5814 12439 -669 1737 -5564 4529 17358 15027
4841 15027 1965 18619 30487 30053 7119 3532 338 -15766 -33426 -36333 -32313 -35965 -22814
4828 -22814 -8362 -15658 -38006 -35851 -20266 12747 15409 10378 -12877 918 5084 -12483 -11669
4815 -11669 7467 16751 14025 1245 15281 -16905 -5842 29922 57952 65706 48869 30518
4803 30518 11131 -6713 -13246 -855 28248 23874 3796 -10106 -29724 -23870 -4372 -6476 -32226
4790 -32226 -37238 -10645 -12454 -11092 2145 6000 5746 -6312 -23340 -16584 -3890 -19332 -17048
4777 -17048 -7129 -8870 -22109 -38330 -37898 -37489 -21558 -14979 -14235 -1887 16016 -2902 -13069 -2445
4763 -2445 -6342 -2326 -2264 3084 2320 18660 12540 2847 9029 13891 23795 33727 12490 24145 26136
4748 26136 8271 -12754 -20553 -17052 4562 14125 -15846 -23964 -21548 -17612 -23929 -38472 -49237
4735 -49237 -48995 -43902 -14401 -2569 12610 16016 28838 26804 9509 -18650 -30552 -36603 -50924
4722 -50924 -62255 -29425 1613 24360 45755 35278 12772 -1891 26885 47869 47234 48834
4710 48834 13406 -9913 -5390 12889 1470 -31690 -36861 -31021 -38414 -51653 -56233 -40845 -28454
4697 -28454 -18664 -26128 -36695 -46344 -47012 -26216 -27249 -53855 -21732 -5109 -14010 -36158 -49713
4684 -49713 -12442 -215 -2712 1886 -3835 -6689 -7619 3107 5735 8752 -7917 -23919 -1332
4671 -1332 5254 -21626 -7481 -9355 -13615 -13967 11315 -268 -14939 4924 8501 11710 4376 -4502
4657 -4502 4470 22591 22264 5933 -2194 -12892 -22397 -16751 -16044 -4365 -19143 -10599 21623 10555
4643 10555 11776 28168 22649 10826 18249 33970 41832 43367 14759 -38807 -51099 -40917 -32090
4630 -32090 -29114 -12975 -12455 -25060 -25122 -22083 -25441 -27881 -13823 7019 -3820 -27766 -39995 -23743
4616 -23743 6936 -7787 -9191 9087 23357 31179 22981 10303 -5222 -33845 -14126 26709
4604 26709 25289 2923 1016 5974 12208 20548 23114 40691 31198 14619 618 -29894 -38127
4591 -38127 -42391 -43653 -38566 -20372 19060 29791 30434 33878 14288 7619 5177 -829 -9005 -21484
4577 -21484 -9480 -22270 -22497 -1029 9519 -30332 -61437 -35442 -7141 3284 5956 -14903
4565 -14903 -19024 -21103 -4813 -4519 -15059 -2880 -8615 -4151 -9147 23062 13634 760 15284
4552 15284 31049 15387 -2011 -10428 17156 13132 10664 4906 6137 -9983 -803 28045 49773
4539 49773 46061 40782 7342 -35297 -29494 -2102 8704 -12458 -39481 -43042 -51356 -55459 -38295
4526 -38295 -23704 6524 19835 21289 7990 1474 -13164 -28772 -6720 1751 13642 20521 30853
4513 30853 -2373 -20605 -16389 -4571 13260 10529 -16049 -27828 -20413 -17930 -36626 -42542 -27370
4500 -27370 7875 3598 -18000 -9474 3228 -3901 -8080 -15712 -11264 -25310 -34771 -35971 -20068
4487 -20068 -14379 -27322 -13216 402 -1848 7615 275 -19007 -26763 -39109 -35994 -51446 -51287
4474 -51287 -44003 -37354 -19919 -29898 -25542 -33583 -39639 -28062 -27841 -11164 653 -8010 -6536 16470
4460 16470 6927 -32947 -25821 -32581 -43969 -43238 -11034 -6349 -23801 -17243 -13922 -23074 -28779 -14925
4446 -14925 -19758 -16636 -22254 -25493 -28467 -45996 -66213 -39178 -11259 -5510 -14475 2933 217
4433 217 -6783 -19475 -21055 -34384 -30444 -9127 -2081 -17951 -28856 -15611 -17253 -13904 -9791 -36009
4419 -36009 -45830 -29535 -29698 -54396 -29455 -18276 -23684 -3188 -6781 8340 -2546 16724 13337
4406 13337 16637 744 -4858 -10893 -28231 -38913 -9390 12344 23129 19236 18981 17220 9777
4393 9777 -7671 -16720 -3394 1888 -7156 -34041 -43480 -23998 -23704 -45807 -36690 -28656 -15664 9338
4379 9338 17441 12043 8903 1734 6228 -1657 -3239 -8319 -5247 1204 16918 43964 28869 6081
4365 6081 13526 4351 7942 -1170 -18738 -7930 20522 10231 5669 -7123 -20560 -31542 -38609
4352 -38609 -28968 -22919 -33836 -15339 17902 13528 25484 22155 9145 -16415 -21848 -3501 -7754
4339 -7754 10540 28022 32184 41327 39735 62056 51234 23446 33798 23905 -5055 -28825 -24251
4326 -24251 5392 23279 22475 40173 28240 -3599 804 -111 32351 21971 6154 -1239 -19897
4313 -19897 -31907 -11078 17387 40543 44662 15509 14001 17323 2148 219 -7143 -22445 -8250
4300 -8250 9506 33248 7950 19744 4093 -12368 -14919 -24084 -46421 -29293 47 -2504 5661
4287 5661 175 3464 9053 -8506 10626 23565 56006 50170 16534 -21994 -37509 -25733 -2332
4274 -2332 -792 -27080 -28489 -16838 577 2453 -3083 -3281 9583 7929 -4976 -12560 -16374 -14862
4260 -14862 -2138 -1935 -8714 -10542 -2124 16460 16585 2232 -25247 -22725 -16391 -35371 -29666 11769
4246 11769 6684 -9771 -29717 -35308 -40105 -38209 -39441 -29277 -15515 -18754 -24837 -15652 -5498
4233 -5498 -12005 -20407 -25229 -21109 14164 17388 9693 19991 548 -11380 -23307 -32957 -18080
4220 -18080 -21528 -24035 -13502 -14819 -16691 -17351 -18249 -21384 9785 7405 4679 32002 50919 49739
4206 49739 54869 43450 25949 21303 17720 10350 23237 42940 36502 39459 28603 22943 -6448
4193 -6448 -9206 -37707 -40601 -22479 -30371 -17301 7685 15803 27557 31152 12652 -2214 -48117
4180 -48117 -35968 -23254 -28519 -29770 -19080 8464 13133 5306 14169 -4062 -14863 -14577 -12932
4167 -12932 -10607 2760 -6924 -15265 -2736 1543 3805 10574 9600 15926 21780 24213 17928 19155
4153 19155 22328 27359 45761 43159 41469 25977 16444 17685 -3054 -5498 -4950 -12583 -29529 -33332
4139 -33332 -28411 -34141 -33212 -30391 -30874 -10227 -3660 -11730 -23205 -18446 -4183 -35411 -40495 -36107
4125 -36107 -51575 -29567 -5692 -994 -8074 -16033 -11588 -27103 -31942 -16352 -5407 3529 11643
4112 11643 -10285 -12106 -9944 -9473 19010 29671 14501 688 -20680 -21803 -18551 -18859 -12795 -3932
4098 -3932 11122 26996 25588 18901 13031 2114 3681 2652 -5693 -1956 3151 3841 5547 6463 7532
4083 7532 19225 40852 28192 39333 50305 45918 41511 30336 22698 27376 45321 40620 14570
4070 14570 -6717 2059 15567 5635 35890 17228 -18803 -24288 -30013 -44405 -47968 -22487 1164
4057 1164 1133 -28050 -22703 -17939 -11285 -187 13378 -11807 -12803 -19529 -21329 -22462 -12677 -19836 -22863
4042 -22863 -20067 -36432 -28378 -15733 14432 24412 11819 14193 -4965 -17198 9790 -11750 -14998
4029 -14998 -22949 -26770 -38343 -28437 -10252 22858 19771 -103 -26195 -14625 -3572 -4229 440
4016 440 11426 15621 10287 28261 47675 49066 16671 6639 29123 18208 5848 -16097 -15442
4003 -15442 -4702 -8835 -4170 -11513 10627 40563 52394 41213 39315 38039 14839 9947 -15623
3990 -15623 -17595 -5424 -95 -586 7103 9383 44656 31780 21837 34138 23782 21412 13628 1831
3976 1831 -18280 -18624 2204 3944 16096 8598 16793 22246 7674 9749 11825 10742 526 -13203
3962 -13203 -18988 -30512 -41104 -30459 -13796 -17769 -14512 -3378 -9498 -21988 -13890 1597 30929
3949 30929 40542 12068 -5641 6670 7517 -7059 -7934 -709 7905 1328 -2457 7764 13351 33921
3935 33921 35872 15986 -2480 -17592 -21943 -9793 -16661 -18728 3096 -5440 -30758 -20964 -1374
3922 -1374 -16334 -13648 -3202 -8185 -2142 -2129 16846 19888 -8903 -11337 2644 -14687 -21656 -15928
3908 -15928 440 9591 -5884 -14852 -1088 9306 8523 10124 7653 -27248 -31417 -24407 -52059
3895 -52059 -36164 -15974 -23404 -38806 -16517 6126 -1298 -142 13557 9097 12353 11931 14803
3882 14803 21963 6477 -11448 -1521 24044 37124 25707 18366 24873 25342 21001 32200 24326
3869 24326 25030 34806 40695 31022 23730 760 14132 -8991 -12868 -2870 5050 9180 10699 23842
3855 23842 5241 26613 33936 29083 23799 13889 -9521 -11624 -2769 -10491 7278 18282 4770
3842 4770 -5092 -4874 -16704 -23006 -8368 -12362 4288 18441 4634 -184 17780 22435 16355 -11903
3828 -11903 -7820 -4234 -2371 -1139 -15340 -27005 -20798 -23185 -5222 -10762 -9619 -12440 2100 -498
3814 -498 13853 32999 18152 13150 496 -5210 10392 8039 17229 21821 24664 24309 30406 15641
3800 15641 1196 4576 11230 -316 4974 -2848 -10127 10273 23092 25825 -4339 -9237 -26223
3787 -26223 -26749 -5980 6525 5478 8056 14888 -145 -24943 -14156 -13226 -23486 1312 23311
3774 23311 20522 8138 -14857 -16156 -11706 -5577 -26686 -11940 4753 2825 12173 19303 10271
3761 10271 2979 3566 1682 -14110 -8634 13567 10362 -141 -5198 -11900 -31661 -43284 7416
3748 7416 50433 44567 56555 38531 11081 -8979 -6069 3527 23221 8710 -4704 10084 24433
3735 24433 19721 5008 2250 -11224 30339 37445 26071 7551 -4586 7494 10770 -13584 -2850
3722 -2850 14934 17409 1910 4569 4828 -16666 -11399 -6785 8798 35836 58463 51038 60427 74095
3708 74095 53559 27768 28522 28171 30382 40182 48021 45128 34659 29058 13866 -4428 -18430 -16778
3694 -16778 -8720 5138 40363 21301 25262 27290 11303 27593 34154 7167 3547 4219 -4361
3681 -4361 -18842 -17451 -426 10928 11830 13662 10613 2991 34890 44139 36418 21510 -1404 -11816
3667 -11816 -12686 264 -7559 -26910 -17473 517 14407 10500 -5939 13958 8210 -4019 -22198
3654 -22198 -40802 -35585 -19413 -18255 -21848 -30577 -24908 -37987 -42127 -24656 -9145 -1714 -29160
3641 -29160 -12910 -9136 5922 8213 -6542 -21655 -25731 -28109 -20479 12917 3077 2892 6430 -17646
3627 -17646 -35200 -28375 -28767 -32188 -41897 -21623 -5326 -30671 -62657 -51214 -27881 -9255 1365
3614 1365 6735 880 -30082 -3141 39539 32604 4805 -656 -5201 -5375 -11140 -14021 -6999 29391
3600 29391 12545 -13417 -30144 -27027 -13596 -14286 -10620 850 -3106 -7208 20399 6921 -9728
3587 -9728 10664 -10104 -28586 -26049 -32327 -22620 -17019 -16912 7474 8694 11475 1843 29380 16555
3573 16555 -6120 -20082 -25117 -11710 -14380 -17911 -3698 2486 9356 2934 -15259 6864 26090
3560 26090 12695 -10364 -37014 -12420 -16632 -41492 -20944 -15782 -22945 -30986 15075 8873 -21519
3547 -21519 -35351 -19204 -8069 -5533 -29376 -35410 -41232 -48957 -39366 -17700 -5329 -31084 -21363
3534 -21363 -9473 7799 4166 -25291 -25050 -5659 5416 1964 -3206 -7449 1918 13447 13095 26475
3520 26475 21857 13195 -5647 -474 17347 4264 -17759 -20430 -23384 -16970 -2829 -18448 -20921
3507 -20921 -13587 -28892 -24689 -18386 -6745 12438 -13920 -31971 -34630 -26464 -24906 -17897 -27402
3494 -27402 -36489 -17115 -5767 -12037 -4691 -9927 -19753 -14943 906 9349 24080 40351 48153
3481 48153 43532 693 3800 34450 51690 34795 15067 4157 14149 11793 12657 9670 -4099
3468 -4099 -13862 -27313 -15907 153 5133 -2790 -2754 -21703 -20830 -19499 -8526 4469 -1814 -35589
3454 -35589 -46910 -8700 8286 22470 3715 -30711 -54717 -37272 -23139 -14740 2589 17515
3442 17515 24465 -3373 -11172 -12837 -18681 -26036 -38013 -8737 -9019 -11222 -16549 -27064 -3916 7616
3428 7616 10395 23565 32656 18051 10881 22183 10251 -11823 -5189 -2362 -2470 15329 12030 -7046
3414 -7046 -23396 -10350 -7139 12229 17414 5133 -22656 -4949 -5928 -11192 -9043 -6724 -17702
3401 -17702 8764 20409 20715 9223 -3260 9562 10687 -10613 -6615 4282 -6003 -10256 15511
3388 15511 4471 -20560 -38554 -56220 -41566 -2443 5463 7708 5046 7696 7234 14301 16525
3375 16525 14663 -2921 3464 -1717 -10476 -16547 495 -12629 -30318 -34685 -36355 -31750 -23752 -21070
3361 -21070 -20213 -11383 -411 -5487 1358 -11040 -7026 -4736 -3104 2975 -33753 -51531 -9428 23175
3347 23175 39146 42919 47036 43578 35883 42659 39465 33768 39115 33914 17102 -9221 8236 14053
3333 14053 21747 26713 9474 22119 40531 20415 -1022 3276 13047 8461 -6646 -15538 1858
3320 1858 4781 11329 16200 27430 30077 39750 53416 52367 38254 36983 2898 -17843 -23689 -21643
3306 -21643 1894 21170 27322 12798 -2285 4696 4965 6338 6599 21474 58793 72554 80219
3293 80219 77230 73674 52013 23336 -8496 -15077 13586 -8139 -6762 -6109 -12867 -34896 -13134
3280 -13134 17882 40803 30425 9975 -8700 -29619 -20123 -28038 -20060 -5259 -28062 -65842
3268 -65842 -47231 -11380 8932 -3052 -24202 -21795 -33276 -18282 10931 704 -4924 -29511
3256 -29511 -56523 -49582 -48133 -49950 -36922 4297 14851 -9859 -8702 3088 9793 17695 38257
3243 38257 39664 35715 22962 3893 -940 9910 5060 8922 21880 15032 11184 7707 -3081
3230 -3081 -40478 -62973 -64727 -37688 -10023 7168 25772 36689 34996 32746 31470 22053 7610
3217 7610 -18227 7770 10336 13434 20128 -2656 -2123 4426 14287 28360 14363 39173 24294
3204 24294 2002 2661 -4892 -20314 -17363 -6081 -19156 -26653 -3554 5714 71 18267 41212
3191 41212 37112 -1796 -20706 -26129 -2552 -17814 -9537 -9330 -29069 -25913 -23306 -8700 6046
3178 6046 7315 -10789 -870 31925 58068 39877 23505 22831 2048 -3010 5789 16240 22776
3165 22776 21430 4373 -32698 -38683 -19855 -29124 -15196 -3234 -2854 -8583 -2899 20063 17748
3152 17748 -13251 -18933 -15021 2466 32194 29756 9392 799 18061 2191 -8065 -8588 1025
3139 1025 5013 3870 -5705 -6162 -587 9695 23175 14904 12667 20533 41512 30597 11969 49979
3125 49979 62960 19652 -3330 2117 5924 4908 23443 30966 30128 34354 23223 35036 41442
3112 41442 14502 -29786 -26728 -2156 1263 -26547 -23053 11366 20316 24401 11300 -11299 -27106
3099 -27106 -21041 -20706 -29369 -38130 -22390 928 2867 10733 -6675 3935 -6298 -31726 -50742
3086 -50742 -68086 -64458 -56469 -22380 -18899 -19442 -12134 -13627 -21430 -47769 -70254 -30490 12589
3073 12589 22875 16691 7041 -31308 -39400 -26385 -25513 13907 21276 254 -31706 -54760 -41573
3060 -41573 -11832 -1144 -3397 -12642 -10090 -8003 6832 20271 -16623 -12723 -14769 -32016 -43095
3047 -43095 -25371 -35819 -33012 -6949 20160 -821 -5713 -581 9420 29993 41954 18131
3035 18131 -11829 -10278 -8769 20387 14775 -11729 798 8466 2567 12695 24526 27196 37432
3022 37432 26547 -11118 -9570 -14944 -2934 24270 31683 32518 12510 8306 3566 -7606 -12472
3009 -12472 -18309 -28350 -263 -5585 -19737 -12417 -4879 -12739 -26854 -15141 -1366 13677 15682
2996 15682 20933 30059 28304 36413 37372 49717 30425 -1321 6666 14737 17350 21050 31100 24678
2982 24678 14278 11215 -4340 7008 8433 9309 -15337 -44022 -34381 -5668 -8658 -6367 -16845
2969 -16845 -17328 -21806 -29137 -16548 -6329 20545 4945 -22400 -31501 -27055 -28685 -38491 -38851 -32100
2955 -32100 -19391 -7083 16863 28408 4288 -5066 19475 25374 15421 1981 7309 30601 42127
2942 42127 45061 44650 35649 30841 13657 13521 11497 37877 28821 47816 46489 34907 13066 8689
2928 8689 8629 -2308 7435 9188 14374 27023 40843 26788 9353 -1575 -18626 -14162 -14374 -6661
2914 -6661 2254 -2775 -5294 -7424 16287 33302 54553 63731 53481 20027 -7474 -10067 27781
2901 27781 36296 24231 27343 3807 -2223 -3767 891 -10013 -7636 -1970 20450 24573 29766 14087
2887 14087 -22932 -38259 -32698 -22163 -14824 -9503 -9440 -1504 -17440 -41398 -36916 -14270 -7677 -19895
2873 -19895 -27123 -1293 5739 -18829 473 4525 -22249 -18715 -10082 -31710 -48306 -44250 -16874
2860 -16874 12832 12548 24155 11450 -4937 -16893 -13583 7952 -336 -3053 30109 45878 37050
2847 37050 31359 8627 16258 29212 27024 32266 13858 32195 16717 -15649 -4042 3405 22540
2834 22540 23359 13585 20549 26870 1860 -23330 -9724 -636 -22600 -8401 12445 4123 12872
2821 12872 16299 12698 8058 10707 19003 14401 24873 5105 13845 -2065 -21532 -18419 -28749
2808 -28749 -42215 -42515 -58464 -42763 -16530 -14575 -23533 -43360 -19234 26613 48351 73336 54252
2795 54252 27624 27181 15650 7596 10979 4352 -19235 -5806 4169 -39074 -57807 -22052 1163
2782 1163 -8227 -30662 -34979 -15742 9409 22367 16812 -11967 -42339 -20299 -9521 -34860 -41130
2769 -41130 -27111 -25635 -16228 -7163 14110 8751 -7021 -4335 -15703 -19552 -27577 -321 -3239
2756 -3239 -19119 -21497 7498 -5688 -49399 -46616 -21836 2547 49233 51708 26935 28710 30494
2743 30494 13146 9767 1679 30304 33197 34131 29020 -3924 8831 21935 1162 -8018 -8708 -11234
2729 -11234 -25136 -27595 -15906 -1348 12073 23392 13311 1159 9094 11561 13200 36630 46216
2716 46216 20884 -5109 -14650 -12589 -25934 -34655 -26194 -13795 -13697 -8932 17645 11841 4935 -3672
2702 -3672 -11681 4089 49 -5251 11966 23260 49942 49605 39421 31878 12604 19978 24187 35097
2688 35097 16757 4327 -26951 -22630 -11120 -21336 7194 10445 10133 12518 -15957 -8566 -5407
2675 -5407 -22091 -31435 -12911 26420 12226 -11035 494 2984 14311 19467 1799 -11630 -11865
2662 -11865 9115 3856 -4508 -23220 -23795 -18022 -18053 -8080 -2379 -3206 -11144 -19694 -28298 -32234 -15107
2647 -15107 -19872 -17842 -30904 -948 -2910 -5206 218 -16904 -13835 15125 6712 -26112 -21331
2634 -21331 -7368 -2558 -1293 -6488 -4676 1865 -20502 -29065 -37394 -20486 -4043 -15892 -27
2621 -27 16164 5219 4194 11846 6305 15114 9928 3539 11606 11918 -2686 -21693 -22880 -11213
2607 -11213 -12928 11650 13110 20447 22709 5666 16363 53681 72300 42813 -14553 -50611 -32786
2594 -32786 7099 29584 27486 43088 29692 11585 4125 2064 17366 15840 10777 -1287 -13346
2581 -13346 -8765 -178 10371 24644 11921 14475 5170 -4638 9705 14497 15350 9354 2381 7310
2567 7310 -4543 -3917 19753 31431 24915 21267 9063 4397 3141 9713 15440 32518 40609 30914
2553 30914 7457 4887 -10608 -7708 -6388 -13298 7221 28123 -3891 -17259 -13318 -24259 -40947
2540 -40947 -18671 -16188 -7464 -7366 -11727 -28188 -45628 -25214 -52760 -46252 -25524 3724 27421
2527 27421 32278 45732 48669 41330 48365 23327 8902 24038 6253 -4783 -5248 6565 28796
2514 28796 43972 39853 31650 6653 -8244 -24295 -6393 18195 -101 -14790 1423 -879
2502 -879 -17965 -19067 -5648 -10552 -21666 -16127 146 -2206 21942 35054 48114 43179 29236
2489 29236 20489 10167 15972 17949 -4052 -8060 411 -12610 -31504 -31391 -28771 -1324 -4350 -14003
2475 -14003 2731 9151 12266 8883 28072 35172 18266 -4190 -6892 -22108 -21563 -1149 -10046
2462 -10046 -11599 4488 5514 2898 -12367 -29665 -17533 14448 21128 -6344 -40929 -40100 -19964
2449 -19964 -10219 30010 40851 19092 20444 37291 42004 54537 41297 44471 37313 25671 11159
2436 11159 5982 11544 9965 -563 -4305 -2967 -11699 -7553 -5463 14945 -5592 -7282 11364 26752
2422 26752 40939 25422 7579 16364 32992 42507 64136 66625 49579 17946 -5192 -19234
2410 -19234 -10592 -14371 -27754 -38628 -46649 -56803 -17416 3511 -30812 -56410 -34064 8700
2398 8700 45071 34091 13390 -836 7444 16705 15838 22281 20888 17924 -4428 -16644 -13710 -3863
2384 -3863 17686 23511 25125 1108 2902 -5425 -21868 -16921 -3617 5588 -9082 -25346 -22688
2371 -22688 135 12214 13534 -8413 2407 33889 43245 31552 12954 -1520 7200 14995 1495
2358 1495 -18091 -32491 -27856 -15415 10551 11010 31339 45146 46884 888 -28243 -15606 -11046
2345 -11046 -15853 -16176 -1653 11528 9507 14105 10203 13431 31563 45447 51950 33377 21680
2332 21680 3067 -2187 6038 -13183 -13474 5374 17702 48715 37524 -3055 -19197 -8511 3794
2319 3794 2598 20473 13740 4819 2043 15957 24306 33340 8200 -2545 7480 -8960 -20061
2306 -20061 -13947 -5376 -6875 -7696 -24620 -36592 -15839 -5532 967 10647 22434 30861 3813
2293 3813 -12526 -19234 -10818 -22361 -9253 -6398 -30423 -19732 -1894 -7772 16255 21584 -3938
2280 -3938 7615 -3498 5187 12717 11720 -3296 -17621 2573 13216 7909 -4201 8134 13579
2267 13579 -9236 -5937 -7727 7801 -817 -27568 -32112 -23470 -4763 -4883 -11569 -3907 5427 24253
2253 24253 48279 50010 47629 25893 -6948 -10812 -17956 -19909 -10038 -22191 -22235 -28070 -15088 -34318
2239 -34318 -39120 -16865 -1060 5632 3576 8739 1248 -15689 -17190 -19679 -22685 -28738 -36342 -24225
2225 -24225 -34027 -36851 -25574 -3875 3574 33393 41496 24970 27885 7388 -1004 10173 8952
2212 8952 18717 6162 -7627 -39766 -50298 -28463 -13192 7517 8754 -5842 -14525 167 21910
2199 21910 16291 6651 -5001 16539 13073 -2389 -4349 -10167 -7806 -3348 -5231 -27333 -48252
2186 -48252 -67598 -75166 -35055 -20478 -37660 -27672 5571 -11000 -26101 -31778 -24210 -19359 4427
2173 4427 -6203 -40396 -30435 -22685 -1584 8377 19379 19349 -6844 -28602 -35401 -27932 -22668 -24709
2159 -24709 -20664 -40729 -52226 -30887 -24074 -19716 -7490 6366 9116 25122 17868 5694 14240
2146 14240 25824 35496 20887 7145 18106 8998 6822 24275 40128 53459 50213 43980 47369
2133 47369 64773 58949 42071 29562 614 -1612 8256 -27549 -47489 -48911 -56281 -37074 -22181
2120 -22181 -30880 -14349 -101 9209 5820 5129 11481 11696 7886 16214 20582 897 -5616 -19907
2106 -19907 -34279 -22792 -6885 3880 8074 9187 25605 9623 -13942 -8951 4808 11922 5818
2093 5818 -344 -5042 -23193 -12141 -1017 -4522 -4155 -8329 5520 24025 13827 178 -43090
2080 -43090 -55919 -20924 -13166 8957 18589 26413 43471 38717 52021 47692 32154 13697 8155
2067 8155 10969 21419 5449 -4800 -21766 -20217 -39965 -35791 -28449 -13290 2106 14870 15863
2054 15863 610 3506 10320 -17082 11917 4797 7289 20369 1777 -12697 -6414 24251 26899
2041 26899 3591 -661 -11470 -6194 6166 11162 16918 20930 13966 3070 -16266 -27087 -44691
2028 -44691 -38999 -52893 -74919 -73065 -38059 -15482 -2213 -11222 -5392 19837 31493 19746 -1068
2015 -1068 -27066 -17735 3940 8408 28607 33107 11385 691 639 2677 -10059 -32293 -9686
2002 -9686 8808 20176 31495 19186 18099 -248 14139 16092 -4140 -1358 4498 37044 31013
1989 31013 30047 27639 14454 18957 25394 28624 20344 9818 -230 -5281 -1840 -7686 -3927 6037
1975 6037 17068 5545 8671 17889 6008 9968 16484 1129 4625 -13010 7506 -12766 -22377
1962 -22377 7753 18446 26276 12925 14277 23760 35227 31323 -26888 -14413 524 -13610 4716
1949 4716 26959 28654 28122 33777 22519 13909 7533 -749 678 20567 47907 55930 64834 41297
1935 41297 48786 39171 26998 40411 45291 48370 32448 27766 5555 -9455 19397 16395 -3182
1922 -3182 21442 46206 30570 27100 38951 30139 3848 -22403 -23930 -31590 -31011 -10458 -253
1909 -253 1687 876 -9415 -21766 -37730 -31917 -31228 -37514 -97 4992 -13561 -20396 -24435 -26106
1895 -26106 -35149 -41547 -29870 -32328 -20983 -4507 -1301 -583 -16596 -13224 -17892 -3677 -3702 11173
1881 11173 5451 -24863 -12588 -16161 -27734 -29343 -25168 12386 17052 -7042 -25495 -23856 57
$$ [...]
##END NTUPLES=NMR SPECTRUM
##END=
