##TITLE=Analysis number 311192
Compound Code gk 01821
Project Code adrs
Chemist Name ugmt
##JCAMPDX= 6.0         $$ Bruker NMR JCAMP-DX V2.0
##DATA TYPE= NMR SPECTRUM
##DATA CLASS= NTUPLES
##ORIGIN= Bruker BioSpin GmbH
##OWNER= NMR
$$ XWIN-NMR		Version 3.5
$$ Fri Jul  1 10:52:23 2005 GMT Daylight Time (UT+1h)  MAYBRIDGE\NMR@NMR_250MHZ
##.OBSERVE FREQUENCY= 250.131544655141
##.OBSERVE NUCLEUS= ^1H
##.ACQUISITION MODE= SIMULTANEOUS (DQD)
##.ACQUISITION SCHEME= undefined
##.AVERAGES= 16
##.DIGITISER RES= 18
##SPECTROMETER/DATA SYSTEM= dpx250
##.PULSE SEQUENCE= zg30
##.SOLVENT NAME= CDCl3
##.SHIFT REFERENCE= (INTERNAL, CDCl3, 0, 16.522)
##AUDIT TRAIL= $$ (NUMBER, WHEN, WHO, WHERE, WHAT)
$$ ##TITLE= Audit trail, XWIN-NMR		Version 3.5
$$ ##JCAMPDX= 5.01
$$ ##ORIGIN= Bruker BioSpin GmbH
$$ ##OWNER= NMR
$$ C:\u/data/dgb/nmr/ADRS/5200/pdata/1/auditp.txt
$$ ##AUDIT TRAIL=  $$ (NUMBER, WHEN, WHO, WHERE, WHAT)
(   1,<2005-07-01 10:51:39.96 +100>,<MAYBRIDGE\NMR>,<NMR_250MHZ>,
      <created by zg, POWCHK disabled, PULCHK disabled
       configuration hash MD5:
       62 19 C7 07 E1 42 D1 B7 37 6C 3D D0 77 39 F9 E6
       data hash MD5: 64K
       C9 AF 81 8C 40 48 83 B8 43 F7 50 82 7C 37 A5 AE>)
(   2,<2005-07-01 10:51:58.47 +100>,<MAYBRIDGE\NMR>,<NMR_250MHZ>,
      <Start of raw data processing
       ef LB = 0.3 FT_mod = 6 PKNL = 1 SI = 32K 
       data hash MD5: 32K
       CF 61 1D 9E BB 29 98 02 DB E9 50 AA 5C 2D DB E3>)
(   3,<2005-07-01 10:52:04.07 +100>,<MAYBRIDGE\NMR>,<NMR_250MHZ>,
      <apk 
       data hash MD5: 32K
       AA AA 66 E3 22 B9 D8 78 F1 D8 6A D9 D5 7D D7 43>)
(   4,<2005-07-01 10:52:05.63 +100>,<MAYBRIDGE\NMR>,<NMR_250MHZ>,
      <abs ABSG = 5 
       data hash MD5: 32K
       F1 74 B7 F3 5F F4 AE 8C 89 50 BE E2 21 A7 CD 25>)
$$ ##END=
$$ 
$$ hash MD5
$$ 93 82 32 AC 44 68 75 B8 B6 16 3F F3 81 02 99 3F
##$RELAX= 
##$RELAX= 
##$RELAX= 
##$RELAX= 
##$RELAX= 
##$RELAX= 
##$RELAX= 
$$ Bruker specific parameters
$$ --------------------------
##$DU= <C:\u>
##$EXPNO= 5200
##$NAME= <ADRS>
##$PROCNO= 1
##$TYPE= <nmr>
##$USER= <dgb>
##$AMP= (0..31)
100 100 100 100 100 100 100 100 100 100 100 100 100 100 100 100 100 100 
100 100 100 100 100 100 100 100 100 100 100 100 100 100 
##$AQSEQ= 0
##$AQ_mod= 3
##$AUNM= <au_zg>
##$AUTOPOS= <18 >
##$BF1= 250.13
##$BF2= 250.13
##$BF3= 250.13
##$BF4= 250.13
##$BF5= 500.13
##$BF6= 500.13
##$BF7= 500.13
##$BF8= 500.13
##$BYTORDA= 1
##$CFDGTYP= 0
##$CFRGTYP= 5
##$CHEMSTR= <none>
##$CNST= (0..31)
1 1 145 1 1 1 1 1 1 1 1 1 1 1 1 1 1 1 1 1 1 1 1 1 1 1 1 1 1 1 1 1 
##$CPDPRG= <>
##$CPDPRG1= <>
##$CPDPRG2= <>
##$CPDPRG3= <>
##$CPDPRG4= <mlev>
##$CPDPRG5= <mlev>
##$CPDPRG6= <mlev>
##$CPDPRG7= <mlev>
##$CPDPRG8= <mlev>
##$CPDPRGB= <>
##$CPDPRGT= <>
##$D= (0..31)
0 1 0 0 0 0 0 0 0 0.06 0 0 0 0 0 0 0.0002 0 0 0 0 0 0 0 0 0 0 0 0 0 0 
0 
##$DATE= 1120211497
##$DBL= (0..7)
120 120 120 120 120 120 120 120 
##$DBP= (0..7)
150 150 150 150 150 150 150 150 
##$DBP07= 0
##$DBPNAM0= <>
##$DBPNAM1= <>
##$DBPNAM2= <>
##$DBPNAM3= <>
$$ [...]
##$SUBNAM7= <"">
##$SUBNAM8= <"">
##$SUBNAM9= <"">
##$SW= 20.6930455092707
##$SWIBOX= (0..15)
0 0 3 0 0 0 0 0 0 0 0 0 0 0 0 0 
##$SW_h= 5175.983436853
##$TD= 65536
##$TD0= 1
##$TE= 295.16
##$TE2= 300
##$TE3= 300
##$TEG= 300
##$TL= (0..7)
0 120 120 120 120 120 120 120 
##$TP= (0..7)
150 150 150 150 150 150 150 150 
##$TP07= 0
##$TPNAME0= <>
##$TPNAME1= <>
##$TPNAME2= <>
##$TPNAME3= <>
##$TPNAME4= <>
##$TPNAME5= <>
##$TPNAME6= <>
##$TPNAME7= <>
##$TPOAL= (0..7)
0.5 0.5 0.5 0.5 0.5 0.5 0.5 0.5 
##$TPOFFS= (0..7)
0 0 0 0 0 0 0 0 
##$TUNHIN= 0
##$TUNHOUT= 0
##$TUNXOUT= 0
##$USERA1= <user>
##$USERA2= <user>
##$USERA3= <user>
##$USERA4= <user>
##$USERA5= <user>
##$V9= 5
##$VALIST= <valist>
##$VCLIST= <CCCCCCCCCCCCCCC>
##$VD= 0
##$VDLIST= <DDDDDDDDDDDDDDD>
##$VPLIST= <PPPPPPPPPPPPPPP>
##$VTLIST= <TTTTTTTTTTTTTTT>
##$WBST= 1024
##$WBSW= 4
##$XGAIN= (0..3)
0 0 0 0 
##$XL= 0
##$YL= 0
##$YMAX_a= 621644
##$YMIN_a= -612572
##$ZGOPTNS= <>
##$ZL1= 120
##$ZL2= 120
##$ZL3= 120
##$ZL4= 120
##$ABSF1= 16.522
##$ABSF2= -4.171173
##$ABSG= 5
##$ABSL= 3
##$ALPHA= 0
##$AQORDER= 0
##$ASSFAC= 0
##$ASSFACI= 0
##$ASSFACX= 0
##$ASSWID= 0
##$AUNMP= <proc_1d>
##$AZFE= 0.1
##$AZFW= 0.1
##$BCFW= 0
##$BC_mod= 0
##$BYTORDP= 0
##$COROFFS= 0
##$CY= 12.5
##$DATMOD= 1
##$DC= 0
##$DFILT= <>
##$DTYPP= 0
##$F1P= 14.0000005364418
##$F2P= -0.99999901652339
##$FCOR= 0.5
##$FTSIZE= 32768
##$FT_mod= 6
##$GAMMA= 0
##$GB= 0
##$INTBC= 1
##$INTSCL= 1
##$ISEN= 128
##$LB= 0.3
##$LEV0= 0
##$LPBIN= 0
##$MAXI= 10000
##$MC2= 0
##$MEAN= 0
##$ME_mod= 0
##$MI= 0
##$NCOEF= 0
##$NC_proc= -2
##$NLEV= 6
##$NOISF1= 0
##$NOISF2= 0
##$NSP= 0
##$NTH_PI= 0
##$NZP= 0
##$OFFSET= 16.522
##$PC= 1
##$PHC0= -79.19917
##$PHC1= 5.841799
##$PH_mod= 1
##$PKNL= yes
##$PPARMOD= 0
##$PSCAL= 4
##$PSIGN= 0
##$REVERSE= no
##$SF= 250.13
##$SI= 32768
##$SIGF1= 0
##$SIGF2= 0
##$SINO= 400
##$SIOLD= 32768
##$SREGLST= <1H.CDCl3>
##$SSB= 0
##$STSI= 32768
##$STSR= 0
##$SW_p= 5175.98343685301
##$SYMM= 0
##$S_DEV= 0
##$TDeff= 65536
##$TDoff= 0
##$TI= <Analysis number 999999
Compound Code 99
Book Reference 9
Project Code 9>
##$TILT= no
##$TM1= 0
##$TM2= 0
##$TOPLEV= 0
##$USERP1= <user>
##$USERP2= <user>
##$USERP3= <user>
##$USERP4= <user>
##$USERP5= <user>
##$WDW= 1
##$XDIM= 32768
##$YMAX_p= 496520264
##$YMIN_p= -63817
$$ End of Bruker specific parameters
$$ ---------------------------------
##NTUPLES= NMR SPECTRUM
##VAR_NAME=  FREQUENCY,     SPECTRUM/REAL,   SPECTRUM/IMAG
##SYMBOL=    X,             R,               I
##VAR_TYPE=  INDEPENDENT,   DEPENDENT,       DEPENDENT
##VAR_FORM=  AFFN,          ASDF,            ASDF
##VAR_DIM=   32768,         32768,           32768
##UNITS=     HZ,            ARBITRARY UNITS, ARBITRARY UNITS
##FACTOR=    0.157963299565203, 1,           1
##FIRST=     4132.6476996994, 0,             0
##LAST=      -1043.33573715361, 0,           0
##MIN=       -1043.33573715361, -63817,      0
##MAX=       4132.6476996994, 496520264,     0
$$ Real data points
##PAGE= N=1
##DATA TABLE= (X++(R..R)), XYDATA
$$ [...]
19605a6359K560N295M096K190M701k367J57n11l850m30k42N729j940K132o860
19590e699m462R4K235m479m942k090L16M506K492l189n340N26L068N332m90k051
19574a4173L341J323K89R021j097l054l36J71k453j1953R66O459J293P157J431
19559a615q70p199o84P124J221j2333m148N272P9P60k392J997N773j615j414j041
19543a1085J920k453o932nK314L013o99m721k778j269L460j670k627M683J0290
19528h559J961m34N044M346k815j859j706k689m935m597J745nk132P04L689o96
19512a2938K438J555J667K31J573L055J722Q53K795l585m144j29N594j169j318
19497a800m705o490L03K209r996k320O013L994J660M984P69j858k939k721l968
$$ y = [-16359, -13799, -8504, -4408, -2218, 2483, 116, 273, -238, -4088, -4518, -4760, 969, -971, 1161, -5699, -10161, -10067, -7832, -12311, -17253, -19343, -19027, -14521, -12029, -15218, -20558, -20032, -16964, -11632, -12122, -14173, -10832, -9509, -9220, -199, -1296, -4350, -4686, -4515, -6968, -18921, -17955, -11496, -10203, -3046, -1615, -2485, -9684, -10368, -3244, -2023, -14356, -18504, -13232, -13153, -12393, -14785, -12788, -7015, -8630, -10044, -11085, -9165, -11618, -18550, -18555, -16241, -13228, -13927, -18648, -21426, -22695, -19235, -20905, -23532, -18849, -8559, -6598, -7032, -1988, 2358, -457, -2316, -4022, -6711, -11646, -16243, -14498, -14503, -16635, -15931, -12242, -12938, -10500, -8945, -7278, -7047, -5474, -2419, -697, 156, 2951, -634, -4778, -4907, 687, -482, -1800, -6505, -12995, -12692, -10483, -20479, -22799, -16786, -12792, -11132, -6148, -5379, -7237, -10176, -12897, -16865]
19482a6865K551o56L97P57J776j693j140q2J074K772Q921L604m36K29n948r8k259
19465g096k148J394K212K265K279n094j532p43N622K083n509k068J558K076R36
19450c765j907l814K106l129N621Q624n386m86j064m852m678J912q5O549P253
19435B899L70j977k797j461l993j2234m581J566Q189J6458L881o656j0036j326
19421a1698K346R75J261k219K815l234N471k480j286L005N653l86j145R76p426
19406g372m848J316K497J087Q08r46l890K62J531l710Q56L655L798j632p88K72
19390g104j994O499O908k871k895l406M158l827J309N174J179K277j407j776l263
19375a039l122L184j455m232o189j768K102J3553R32p25m964m488K89O73K414
$$ y = [-16865, -14314, -14970, -14573, -13816, -12040, -13733, -14873, -14955, -13881, -11109, -2188, 1416, 980, 1209, -4739, -4837, -7096, -9244, -7850, -5638, -3373, -1094, -6188, -7720, -8463, -2841, -758, -6267, -8335, -6777, -4701, -3765, -5672, -9486, -7380, -10509, -4888, 3736, -1650, -2136, -3200, -8052, -12730, -10818, -10903, -4354, 2899, 3269, 1292, -1505, -2966, -6959, -19193, -23774, -22208, -14019, 2439, 6320, -336, -10372, -11698, -9352, -8377, -7116, -9335, -6520, -9754, -4283, -6763, -8049, -5044, 609, 223, -922, 54, -7372, -12220, -10904, -8407, -7320, -6512, -7458, -11348, -11086, -9555, -13265, -12409, -8754, -4956, -6588, -7376, -7104, -9098, -2599, 4309, 1438, -1457, -4863, -705, -4532, -3223, 1951, 3130, 5407, 4000, 2224, -1039, -4161, -977, -2432, -6664, -12853, -14621, -12519, 1034, 1966, 1241, -3723, -8211, -7922, -7249, -4835]
19360d835K400k748O08J391J782m19J671n494k102L305J301J62m37l881L490M909
19344A103q394L969K347k711k492L48m425l048O441N148L532M710m052q681n770
19329a1975k603l864J753Q214q6k445N714O24q276m370p55n24M22n76N465L371
19313i911L149L637p713o510M417O624J433k829l472K87L901k395l84K277R12
19298f577J112K479k684n548m17O849R966M033j80l737q839k324O99L288j385
19283c265N77m563q969l612J463M971P702r61n960K321N85o532N810P348j089
19268d174m098K135L059J628L298K763k376j122k054j2299j405J91J1072Q80k035
19253d537K401p54J370l371N83O622L343j03N49M426m523p150j322l131M493L337
$$ y = [-4835, -2435, -5183, -4575, -3184, -1402, -1821, -150, -5644, -7746, -4441, -3140, -2978, -3415, -7296, -3806, 1103, -7291, -3322, -975, -3686, -6178, -5830, -10255, -13303, -6862, -1714, 1818, 6528, 2476, -6205, -11975, -14578, -18442, -16689, -8475, -8561, -11006, -5292, -4668, -12944, -17314, -18069, -18593, -18171, -18747, -13282, -9911, -6762, -3125, -10838, -17348, -12931, -6307, -4874, -7703, -11175, -10888, -6987, -9382, -9766, -7489, -6577, -5465, -2986, -5670, -11218, -11635, -4786, 5180, 9213, 9033, 5296, -3543, -5867, -5168, -1880, -3265, -2688, -7251, -16220, -19832, -18369, -13398, -5696, -6657, -12617, -10296, -9711, -16243, -10433, -3085, -4174, -8272, -6137, -3078, -1450, 1848, 4611, 2235, 1113, -941, -13240, -14645, -14454, -3382, -2502, -4537, -2136, -2890, -1520, -4891, -4308, 2314, 5657, 5554, 6103, 10529, 6006, -1144, -2466, -5597, -1104, 2233]
19237B233j382M288N093q7p635o220k949k515m03J266J539L744r69j640n367o85
19221a1689N925q2K179O512j276m01j372k689l309M748M310J842n611q73M174
19206B388n742p393k483R70k363J741O84M079J712k542K558L007P5l027k407N312
19190c431L104L025l48l536l689l136M952j353l944k141k590l461K433K831j1064
19175b2348Q210N197j966L244p501l740J894K636j748l348L770M491K666L034
19161e509o286k807N844L273k300R01j87J804j32j897o86o10j637k331L221N333
19145d006O919j84q73p83J596l906K339n384r012j790k27l0K578l629N949J828
19129h615k139n023K419L597o114K709K778l338m747K109M822J402J187R445Q118
$$ y = [2233, 851, 5139, 10232, 10145, 2510, -3710, -6659, -9174, -9577, -8311, -6772, -3028, -3997, -5637, -11004, -11689, -5764, -5846, -3667, 2845, 1569, 1168, -204, -2893, -6202, -1454, 2856, 4698, -913, -1786, 2388, -3354, -10747, -13230, -12260, -14623, -12882, -12198, -8119, -6407, -8949, -6391, -3384, -3309, -6336, -8743, -3431, -327, 2698, 2350, -1186, -4875, -8011, -3059, -4412, -8356, -10497, -13087, -16548, -14115, -11284, -22348, -14138, -8941, -10907, -7663, -15164, -18904, -17010, -14374, -16122, -19470, -15700, -11209, -8543, -5509, -11795, -14602, -8758, -5485, -7785, -6884, -7071, -5267, -5399, -7296, -7982, -8592, -10229, -12560, -9339, -4006, 2913, 2729, 1856, 1073, 2669, -1237, 1102, -4282, -13294, -15084, -15311, -15341, -12763, -16392, -10443, -8615, -10754, -15777, -13358, -9761, -15875, -13166, -10388, -13726, -18473, -16364, -11542, -10140, -8953, 492, 8610]
19114H610j779p045q148n663o16N535R56r317r64N069J0442J908k394j622L705
19099a323N558J957j157n202j0806M522k762o88N1k095n040J168O477j427l949
19084a4716k19Q526O256j533l163k268N039j924j528L322j642m515N139O493j760
19069A507j1684k881J407K732k898Q02L192Q284P04m842P187J265j0847L727M426
19054B081r789J057M473J557n205j1142J232L871n184l431l509N813N191j903
19040a4888M273M921l667J84K77O901j188m265L488j50k770L124o373m444P96
19025a3781l293o074O571P205l848J424J2617J989k301n12j772K981K767J827
19011E800N98j444k482J95q002j370J527j901J976j472J868K251n43K852Q27q99
$$ y = [8610, 6831, -214, -8362, -14025, -14641, -9106, -8150, -17467, -18431, -13362, -2920, -1012, -3406, -5028, -1323, 4235, 6192, 5035, -167, -10973, -6451, -9213, -9901, -9850, -11945, -16985, -15817, -9340, -10767, -14716, -14935, -6409, -153, -1686, -4849, -7117, -2078, -4002, -5530, -2208, -3850, -8365, -3226, 3267, 1507, -10177, -13058, -11651, -8919, -11817, -11015, -7823, 461, 1165, -3677, 3510, 4775, -6072, -2345, 2081, -7708, -6651, -2178, -621, -5826, -16968, -15736, -11865, -17049, -20480, -23989, -18176, -12985, -14888, -10615, -5694, -9361, -9177, -8900, -1999, -3187, -7452, -3964, -4114, -6884, -3760, -10133, -14577, -13781, -17074, -23148, -16577, -9372, -13220, -11796, 821, 2810, 509, -3, -1775, 1206, 3973, 5800, 6398, 4954, 2472, 2667, -5335, -6705, -5178, -7079, -5103, -6575, -4707, -2456, -2999, -147, 680, -219]
18995b19m536j06k361j426K306L835Ln82K09J570J13k622K717k487j685l411q245
18978a6927m060Q416O460J951N485j745N946J398l028j382l245q043k035p58M139
18963g428M142M731L458k643l534m584N821N003R621k159m701m983l011J77p030
18948g120n507k677O44R443O014K180q747l924L576M360K379j0589j0638M932
18934a5674Q090Q657l81o176n377l254m376P274P588L091K755J825K124O425L83
18919A2974o033n606r193Q41J641J942l254K805m16p754l233M560J130k34P870
18904a960L7j1259k768Q563J849P325n873n724J471J397j799L98M809o99L36L166
18888g31L284j359o43l201p086n879o342J0065J245M70L464N896O84K407k54o51
$$ y = [-219, -4755, -4861, -7222, -8648, -6342, -2507, -2504, -3086, -2877, -1307, -1194, -3816, -1099, -3586, -5271, -8682, -16927, -20987, -12571, -6111, -4160, 1325, -420, 5526, 6924, 3896, 2514, -731, -8774, -10809, -11567, -7428, -3286, 1445, 4903, 2260, -1274, -5858, -37, 4966, 14587, 12428, 7727, 2744, -267, -90, -7120, -12627, -15304, -14660, -5217, 797, 2977, -5770, -9694, -6118, -1758, 621, -9968, -20606, -15674, -7584, 1073, 692, -5484, -10861, -14115, -18491, -11217, -3629, -538, 2217, 4042, 6166, 12591, 12974, 6941, 1335, -7858, -7017, -5376, -3434, -6688, -3883, -4299, -12053, -15286, -10726, -9596, -9830, -1960, -1923, -13182, -15950, -7387, -5538, 1787, -4086, -9810, -8339, -6942, -8741, -8343, -3534, -4233, -3897, -731, 2553, 1194, 551, -2650, -9736, -15615, -21957, -11892, -10647, -10177, -6713, -817, -133, 2274, 2020, 1369]
18872A369q392r170O150J583j276L849L471j538q435j63N230N475K668m674r98
18857d851K838L709l567m389L88J0505r65o819j512k794q124J280O20K241j393
18842a2833k85j567L061R341j253l207M147L270k035J105m2k217k416l874j017
18827i822o536M688K982K962m197N161N35n89K769k21l008n011k27q48p757Q560
18811a0559Q262N51j124J512L382M65j1604o941J270K775N560N134k372l667J383
18796e973K194J212L34m199o294k731M754L139j885M044j632j373j088N329L211
18781i58N759j240l174L904j569K91m687k621K490k735L602P001N818O645R771
18766B8297K678o837j4395k841K847L12n927k667J050M856o418q266m771l105
$$ y = [1369, -7023, -16193, -10043, -8460, -9736, -5887, -2416, -3954, -12389, -12552, -7322, -1847, 821, -3853, -4851, -2013, 1696, -1871, -6260, -5872, 4633, 3668, -3151, -4663, -7457, -15581, -14301, -13681, -11440, -12833, -13118, -14685, -11624, -2283, -3536, -6743, -2596, 674, -1361, -256, -298, -2515, -4931, -8805, -9822, -16358, -11670, -8688, -5726, -9923, -4762, -4227, -4816, -2047, -2268, -5276, -10287, -10514, -11362, -19119, -10559, -2297, -1746, -2870, -1358, 2024, 2489, -9115, -16056, -14786, -12011, -6451, -1317, -3689, -7356, -5973, -3779, -2567, -2233, -6432, -12726, -15457, -10703, -7564, -9449, -5405, -7037, -8410, -9498, -4169, -958, 4801, 3561, 387, 4291, 2722, 3013, -1674, -4295, -1805, -4540, -938, 6063, 11881, 18526, 28297, 30975, 24138, 9743, 6902, 9749, 10061, 4134, 1467, 2517, 7373, 955, -7311, -12082, -15187]
18752a5187K444L359j52M426p15n376n60L212N298N17K247l178o031M510l234
18737h420r7o31J404J534l397k374l330k233M864k35l285O891R468J735q997k180
18721i283J352M767l919m549J332Q761J045J327l265L06N676k177n0n134q18K125
18705b504K517k517K062N8p671l768J148K1O308L953L066L100j681m499n41k476
18689c424r513N149L808m01N450M041k65l89M039j558o782r08k071j589l284J157
18673f540P419L494j785l13o217q291j813k837L138M496N77J900L001O561L645
18658F435j0888o268o199q19Q181N631O726j105o68N409p79J627m481n012p006
18643i216n025N224M033m57k441N093k509l984n115L532M036M414O770m128j0553
$$ y = [-15187, -12743, -9384, -9536, -5110, -5825, -11201, -11761, -8549, -3251, -2734, -487, -3665, -9696, -5186, -8420, -8517, -9148, -7744, -6210, -9607, -11981, -15311, -17544, -12680, -12915, -16200, -9309, 159, 1894, -7103, -9283, -7931, -3164, -7083, -11632, -10300, -1539, -494, 833, -2432, -2126, 3550, 1373, 1323, -3811, -4629, -2504, 13, -2504, -442, -384, -8055, -11823, -10675, -10654, -4346, -393, 2673, 5773, 4092, -407, -948, -3424, -12937, -7788, -3980, -4381, 1069, 5110, 4845, 4456, 8495, 6937, 155, -753, -2824, -4413, -7697, -6540, 879, 4373, 2588, 2275, -3942, -12233, -14046, -16883, -13745, -9249, -8672, -6772, -3771, 2790, 6435, -4453, -10721, -16920, -17739, -9558, -3927, 2799, 1694, 1026, 6435, 5656, 7283, 2802, -2210, -9216, -14241, -9017, -4984, -5441, -7882, -2789, -5298, -9282, -14397, -10865, -6829, -2415, 4355, 227, -10326]
18628a0326l390p61L20L531Q738K413rL836N646M472k778o359m992j592j190o287
18612h728j493k366Q610k852l116L37k295j603n55L18M198O984R743j206k225
18597C751r50Q05p786p98J815n257LM106L919M6L959n639n931o188K192j185k327
18580a5465O310O987j200p43K128N514K467N441O64p664r87l909o559m37k951
18565a0404n64K911R268O446K003o383m113j091j888J699J390p8J111l229l739
18550f661P31O795K519q760r881N655O655k521K5m832J040L119O747l06j932k739
18534d346l094L880R64j091M720L933J858K192o451r910L446P403j44j924j236
18519B00k211m76R313K772o087j831k361l28K329L5j297L28o36k158K486m729
$$ y = [-10326, -13716, -14477, -14157, -10626, -1888, 525, 516, 4352, 9998, 14470, 11692, 5333, 341, -1251, -2441, -8728, -10221, -12587, -3977, -6829, -9945, -9608, -11903, -13506, -14061, -13743, -9545, -2561, 7182, 5976, 3751, 2801, 3606, -4180, -4978, -3163, -8420, -8417, -4311, -392, -346, 3613, -2026, -7957, -14145, -11953, -13138, -15465, -9155, -2168, -3368, -4111, -1983, 3531, 5998, 11439, 12103, 4439, 3452, -457, -7016, -7453, -10404, -10968, -8057, 1211, 7657, 9660, 3277, -836, -1927, -3815, -2116, -726, -804, 307, -2922, -6661, -5930, 865, 3384, -5376, -15257, -9602, -2947, -5468, -5443, -10275, -9235, -6116, 631, 325, -1607, -4346, -7440, -3560, -2596, -3687, 1033, 4966, 6824, 9016, 2565, -7345, -3899, 3504, 3360, 1436, 200, -2011, -2487, 6826, 9598, 3511, 1680, -681, -1009, 1320, 1355, 58, 386, -250, -2408, 78, -4651]
18503d651r933k274Q024O308J210j303J534J295J983O456q21m670n153m80l922
18488f397o383K415J524L273M214K985p44J031n022k26J899j480J778K018Q434
18473I319k510n039j409m5l334l499K063o24L133N63J284n739j035j876k31J372
18457g607n19k237J111L410o88K621K435n307n368R066O294M541N635j272m291
18442G824p312m843l609N366M091P552J728o882k964j963l024n77Q232P80k045
18427B354p14n547o27j466r90M871q25K707R02J643L16o285o003k359M548J486
18411e989J088M229m272M116Q848m964Q04n652p255o034J141O007N528N502K306
18396E403o356m658J568n97J176L223J589l277k258m78K295j257J573R86P479
$$ y = [-4651, -14584, -16858, -8834, -2526, -1316, -2619, -1085, 210, 2193, 8649, 7828, 3158, -1995, -2475, -6397, -12780, -10365, -8841, -5568, -1354, 1631, 887, 1918, -3104, -3330, -1431, -2911, -1133, 885, 9319, 6809, 1770, 361, 316, -3018, -6517, -4454, -5078, -1945, -1382, -98, -5837, -6872, -8748, -8979, -7607, -8126, -10363, -9252, -5842, -6530, -3909, -1474, -6781, -12149, -3083, 3211, 7752, 13387, 12115, 7824, 512, -4331, -7940, -2574, 1517, 9069, 10797, 3915, 951, -1012, -4036, -4613, 3619, 4399, 2354, 1640, -3907, -4534, -6000, -6990, -2119, -2944, -237, 665, 2308, 2624, -3661, -9664, -12023, -7475, -5989, -4901, -672, -4944, -828, 8020, 3056, 3860, -1792, -9047, -15081, -13940, -7933, -2405, 3097, 5403, -953, -5611, -4043, -4640, -3464, -241, 1348, -1929, -4187, -4665, -2370, -3627, -2054, -1068, 6411]
18381F411L559n775q47j080r1L429r81o810n534m309M214R263q37N374k35K526
18365H277O31J394J347j43r72j46P267n641n746j62O11j945m584N575O856Q17
18349A3436p716J015N460j080m753n525p589l791j735M330N486N128o88M208m912
18334A274k251Q612P12p404l251j498J734L574n31J509m27n337l030l579K16k246
18318a1923R546M292k151J492j916n488j561k15l2n040R44M596L431j858n582
18303a1465l413P093R269k360j906k519N241K05m044J621L57O90N090j60o904
18288c205J562J72k677J335K370P24q492J500N400L495M629p91j155j975O10k257
18272A245o330p265j16j39L290K981M191K016m705j826N508L93n653l489J377
$$ y = [6411, 9970, 4195, 3348, 2268, 2177, 5606, 4625, -2185, -7719, -12028, -7814, 1449, 612, 5986, 5751, 8277, 8908, 10302, 11649, 11506, 10534, 10388, 17655, 12014, 6268, 6106, 6717, 4772, 188, 5763, 12619, 13436, 5720, 6735, 12195, 11115, 6362, 837, -6752, -10543, -12278, -7948, -2462, 2666, 1978, 6186, 1274, -977, 7635, 8347, 943, -2308, -3806, -2072, 1502, 971, 2480, 2053, -3284, -6314, -9893, -9677, -11923, -2377, 1915, -236, 1256, -660, -6148, -7709, -7924, -7956, -12996, -12052, -7456, -4025, -5883, -11465, -14878, -7785, 1484, -876, -2782, -5301, -60, 145, -3899, -2278, -1921, -1231, 3859, 3699, -3205, -1643, -1471, -4148, -2813, -443, 281, -8211, -6711, -1311, 2184, 6813, 6022, 4867, 2892, 3502, 1245, -5085, -12350, -12466, -12605, -9315, -6334, -2143, -127, -4832, -6658, -1150, -757, -6410, -9899, -8522]
18257h522p74L389M940M454N036K59n880m510N63o667M90P217L202J618o149n29
18241a863J0400m42l750m513n5M622k115q469k214L726J061k342L828M028j994
18226i2m334Q882J531k092o199J426l524p337L119Q229Q301j339k586m317L006
18211B674J930k494L79N166j52l257N068p50n405M998J894o149M706M446l713
18196I341l251q990k257Q013O022q3P27Q23l959K599Q029K75n035l199K789M430
18180A6274n799J473K290K932N641l160j791P01L925P928L359l763o213j938M732
18165B6591r23M293k671K049K362l809J551Q114K642J80O91L567K510k176O826
18150E1797K138M436M511Q75r81K669N037j973j885p83K677N886Q326M602J0170
$$ y = [-8522, -9296, -5907, -967, 3487, 8523, 8782, 2902, -1608, -1045, -7712, -7222, -5, 3197, 4815, -1334, -1863, 8537, 8095, 4345, -168, -223, 4399, 2284, -6185, -8399, -4673, -3612, -5954, -2126, 1902, -92, -4426, 4456, 5987, 3895, -2304, -878, -4402, -11739, -8620, -391, 7910, 6571, 3985, -332, 2674, 4604, 2110, 2489, 7655, 7503, 4246, 9314, 8564, 3159, 8157, 10051, 3902, 8608, 13054, 9341, 6090, -2900, -5157, 2856, 8878, 8795, 9522, 10345, 6386, 8985, 17014, 17289, 12254, 9055, 11844, 16274, 10475, 11948, 14238, 17170, 22811, 19651, 17860, 18561, 22486, 30414, 33773, 30010, 23797, 21859, 26591, 25668, 29961, 27290, 29339, 31701, 27892, 29443, 37557, 40199, 40379, 41070, 44637, 47147, 44971, 51797, 53935, 58371, 62882, 63757, 62776, 65445, 70482, 68509, 66624, 65841, 68518, 74404, 82730, 87332, 97502]
18135I7502R969Q719O412J3340J1943J3872J8513K0994L1223M4017M6598M8393
18123C71495O0097P6219Q5075P9685P3250P5606P9275O9764Q4412J26474J73406
18112A354758K61653M43361P66857J340158J918322J130490q07476j740496j343285
18103C324342q00080m82130l19223k24355j67691j23337j01023p6411o1552o0403
18093I08137n2762l9803l3094k7230l4182k4863j8047j2548k3290j9695k555l14
18081F19754L566m109q396L418J4590J4273R096n496j0466j9674l0309k9746k9733
18068E26768l0447l2428k6156j8879k4130k2189k7218k2417j7959j5442j8415
18057B71088j1534j0954j4782j8904j9307j2176p951j1084l523r478q474m455
$$ y = [97502, 107471, 116190, 122602, 135942, 147885, 161757, 180270, 201264, 232487, 276504, 323102, 371495, 431592, 507811, 592886, 672571, 745821, 821427, 900702, 970466, 1054878, 1181352, 1354758, 1616411, 2059772, 2826629, 4166787, 6085109, 7215599, 6408123, 4667627, 3324342, 2524262, 2042132, 1722909, 1498554, 1330863, 1207526, 1106503, 1030092, 968540, 908137, 855375, 815572, 782478, 755248, 721066, 696203, 678156, 665608, 642318, 622623, 620068, 619754, 623320, 619211, 610815, 614233, 628823, 643096, 652192, 646696, 636230, 616556, 586247, 556501, 526768, 496321, 463893, 437737, 418858, 394728, 372539, 345321, 322904, 304945, 289503, 271088, 259554, 248600, 233818, 214914, 195607, 183431, 175480, 164396, 160873, 151395, 142921, 138466]
18045A38466q145j956Q0l698r484j3267k089o334r350m184m228o264l343k872
18031F3332J469l238j1710m556N5k376m532q948r851Q993L889l64o304j0177M91
18016A6173L584l129l29K860N798Q29J504N295r367m208k447m548n887N153L524
18001A4805j710L465p252q283L169K340J696J614N55l426j572j620j534R109k234
17986I122K06L2l419M681L659q777k657L204M582l662p712k612L404j08k410j687
17970d154n112P55K004K93m597P293Q595J043q728o560K916K393q29p41O904P883
17954I358O404p960o223O90J045l364K709k384l947j45j303J476K954M735l037
17939A008j139M524O636N759k385n191j130l264n118J32M78L201L414k771q26
$$ y = [138466, 130321, 128365, 128445, 124747, 115263, 101996, 99907, 93573, 84223, 80039, 75811, 69547, 66204, 63332, 64801, 61563, 49853, 45297, 45352, 42976, 38444, 29496, 19645, 28638, 32527, 32163, 25859, 15682, 16173, 19757, 16628, 16299, 19159, 24957, 25786, 27290, 32585, 23218, 19010, 16563, 12015, 6128, 11281, 14805, 13095, 16560, 9308, 1025, 4194, 6534, 8230, 9844, 10399, 6973, 5401, 3781, 2247, 11356, 9122, 9328, 9360, 5941, 10622, 14281, 5504, 2847, 6051, 10633, 6971, -741, -3353, 51, -57, -2467, -4154, -9266, -8511, -6507, -6214, -10811, -3518, 5077, 6120, -2608, -9168, -6252, -3859, -4688, -5429, 1475, 9358, 15762, 7802, 1579, 2269, 3314, -50, 2659, 275, -3672, -3817, -5120, -3644, -690, 4045, 1008, -131, 4393, 11029, 16788, 14403, 9212, 8082, 4818, -300, -168, 310, 3511, 6925, 4154, 3328]
17924C328K869J045k721p651N487M583J059L340n60m521k57J721K178K306n151
17909G055j3004o78J2388L027N162k930j1478k164L73O51M160q78m817Q783N565
17894A1215j61q913K896j754o368J731M522j254j557K903K484J508k219q754m825
17879h546M404O768q69M73m358k966K749L023l59l9M26J203r70J161o264n101
17863i265M003P349M904M43j302K723R80o20m391k837N71J968Q39k157m892J530
17847a54K921R65m74K425j872L069K213L02m191J008K600j683k231r56L995J859
17831I796n366J165L082Q15n126n675j669K657n952J627O624o41J761o386m832
17816h120K800k22J714J797K644O318n730p114J4129K483n155J293L777l042N84
$$ y = [3328, 6197, 7242, 4521, -3130, 2357, 6940, 7999, 11339, 10779, 6258, 6001, 7722, 9900, 12206, 7055, -5949, -6627, 5761, 8788, 13950, 11020, -458, -2622, -2249, -1598, 2562, 1684, -3133, 5650, 11215, 11054, 2141, 5037, 3283, -3085, -1354, 3168, 1914, 357, 3260, 5744, 7252, 5033, -3721, -8546, -4142, 2626, 1757, 2230, -2128, -5094, -2345, 678, 319, 280, 706, 1909, 939, 2100, -4164, -9265, -5262, 2087, 6991, 7434, 6132, 8855, 9835, 9215, 4824, 1987, 2558, 4526, 5365, 3208, -1684, -154, 2767, 3732, 3258, 5683, 3811, 6880, 9093, 9395, 5204, 6212, 8812, 7129, 4898, 3942, 7937, 9796, 4430, 5595, 8677, 9492, 4366, -1309, -2978, -321, -6273, -4646, 1978, 1337, 3098, -3288, -8120, -5320, -5542, -3828, -2031, 613, 6931, 1201, -5913, 8216, 10699, 5544, 6837, 10614, 7572, 8156]
17801H156L311p421n635p587J692L627P257O098j409n590L202K445J860J674L065
17786A4745o008m650q076p169M227Q728M124N751O94p575n841K778l034K035L445
17771D174j255m091K796n536J141N401Q79L485k506n688j691L051m44M701K566
17756F983J0982M482P862n42J488j0158m117K542l066q652k978j776l59r057q186
17741a4552R332K623l415p10N810N960k022p276m805K163L89n86k165M647L609
17726i98M285R637R36l098l57P41J270j1304o934l966L856j346P87K724K274J510
17710A7k192M653J1996M430j152K80j343n302k483n224P913O2n985p481m104J107
17694d808L596K949k496j642L565j629m824j1999L072J2194K033l956Q74M570
$$ y = [8156, 11467, 4046, -1589, -9176, -7484, -3857, 3400, 9498, 8089, 2499, 5701, 8146, 10006, 11680, 14745, 8737, 4087, -3989, -11158, -6931, 1797, 5921, 11672, 12366, 4791, -1050, 1728, -1306, 729, 4174, 2919, -1172, 1624, -3912, -2771, 2630, 3509, 6994, 4488, -1200, -2891, 160, -284, 4417, 6983, 17965, 22447, 30309, 29767, 31255, 21097, 16980, 19522, 16456, 7804, 4826, 3050, 2691, -6366, -14552, -5220, -2597, -6012, -6722, -912, 5048, 3026, -4250, -9055, -6892, -6503, -7089, -9254, -4607, -998, 3287, 12924, 13860, 10762, 10405, 11146, 12416, 1112, -5822, -9788, -5932, -7278, -6491, -3767, -1493, 17, -2175, 2478, 14474, 18904, 17752, 18032, 16689, 11387, 8904, 3680, 11593, 11655, 5670, -1811, -5915, -4808, -1212, 1737, -759, -2401, 1164, -465, -5289, -17288, -14216, -2022, 11, -3945, -3071, 1499]
17680A499M146n221J999k256l663q95L681O950L752R81k506l407K523N31p10o479
17664I25K379k522p311Q62M89M01l499k037M534O045R02m740O620O488j724J491
17648I303n111R96P010k086P132j180O0P48m420O50P593p105q431q8O387N917
17632A7375j0515k778J237N97M438j198q449L933J086l529O43N999K279k018m203
17617D897K132N247j604m538N171M995n01k686o624o337L436R000N866L523j668
17602B0309o498j0347m382Q21J1266Q412j922p441N70k807L199K233m423M131
17588A3121k210J173J681Q342K30r517J889M640q618m952M43P45r35k343J298
17573D987L049N348l171m82R43R64m311L726k141M66j115l890k161K286j94j253
$$ y = [1499, 5645, 424, 2423, 167, -3496, -4391, -710, 6240, 9992, 10973, 8467, 5060, 7583, 8114, 7404, 925, 3304, 782, -6529, -5667, -5178, -4777, -8276, -10313, -5779, 266, 1168, -3572, 3048, 9536, 7812, 9303, 4192, 5188, 12198, 10112, 17244, 16064, 16124, 16872, 12452, 13102, 20695, 13590, 5159, 5071, 11458, 17375, 6860, 4082, 5319, 5916, 10354, 9156, 707, 4640, 5726, 2197, 2840, 8839, 11118, 9100, 4897, 7029, 12276, 10672, 6134, 11305, 16300, 15799, 13113, 6489, 152, 3588, 12588, 18454, 21977, 20309, 13811, 3464, -918, -97, 11169, 19581, 17659, 10218, 10788, 7981, 11180, 13413, 8990, 13121, 10911, 12084, 13765, 22107, 22337, 12820, 14709, 19349, 10731, 5779, 6222, 6967, 6032, 3689, 4987, 8036, 13384, 10213, 9731, 10674, 11638, 7327, 11053, 8912, 9378, 8263, 4373, 2212, 4498, 4304, 3051]
17557C051j0434n788l80P769R185L492p76P16J189j570p737j79L419J747j259
17542B445l116k24l61l040N497L067J555J531K546J470r08L658K96Q06L003j476
17526A6749o609n697p720m370M575N529L218l37k35P18N412j764n058j156J338
17511D593J551J301m513P33J139l175m038k231j233J28N448k153q38J084l958
17496f162n536j020L293L837j849q80R12j183k488J184k617n967R720J0569j659
17481A54n961Q410L127p208n005P36P863P301m756K619l018m147l682L618N332
17466E383n081n454j477j466M235M140N84M087l12P63M738r40j732J969O674j513
17450A4598j0101k991J830L465n539k935O421R005O824J5563J3164o056j4080
$$ y = [3051, -7383, -13171, -13551, -5782, 3403, 6895, 6119, 6835, 8024, 6454, -1283, -1462, 1957, 3704, 2445, -671, -895, -1256, -4296, 1201, 4268, 5823, 7354, 9900, 11370, 10462, 14120, 14416, 15222, 18225, 16749, 10140, 4443, -3277, -7647, -3072, 2457, 5675, 5338, 5103, 5821, 11233, 9469, 4411, 3255, 4593, 6144, 7445, 2932, 3665, 4804, 1629, -2409, -4640, -5873, -5745, -297, -2450, -3288, -2204, -6162, -11698, -12718, -9425, -5588, -7437, -8317, -7405, -8588, -11076, -9892, -12509, -18476, -8756, 1813, 154, -5807, 2603, 5730, -1478, -6483, -5747, 2116, 9417, 4661, 7280, 4262, 115, -3567, 51, 5383, 302, -5152, -6629, -8095, -3860, 280, 864, 4951, 4639, 5402, 10140, 9200, 7468, 9437, 16111, 14598, 4497, 1506, 3336, 6801, 1262, -1673, 4748, 13753, 20577, 36140, 49304, 43248, 29168]
17437B9168o663j492n244k471P748m59j474k333j459o168o297o602j144O539L999
17422E648L839m477l766j940j854M167O494k081K648j150J711M263R8l466j660
17407H474j712m576k341k509j895p096K106O202j487L405K400l730j0875R33N202
17392g499J18R75N91j517j544M68O822K120J208N77K871l438r06o34r810k337
17376a1935L920J146o213k084L036N644M176J06m297l184n714j73L032O300m424
17361a0664J165q95K69P086N970k989m433n143j36j399J756M427l556j610L746
17346f406J528k455L435L405O282J226n644n965j250K093l457j48N520K804K661
17331C629k101n708m093M506N18q449J997J995L629k90L98K594J592r72r06J50
$$ y = [29168, 22505, 21013, 15769, 13298, 21046, 20587, 19113, 16780, 15321, 9153, 2856, -3746, -4890, 1649, 5648, 9487, 5010, 1244, -696, -2550, 1617, 8111, 6030, 8678, 7528, 9239, 13502, 13600, 10134, 8474, 6762, 2186, -155, -2664, -4559, -11655, -9549, -3347, -4834, -1429, 971, -2759, -13634, -12701, -7499, -7381, -6406, -5815, -7332, -8876, -8408, -1586, 534, 1742, 2319, 5190, 1752, 846, 212, -9598, -11935, -8015, -6869, -13082, -15166, -12130, -6486, -2310, -2204, -6501, -9685, -15399, -15572, -12540, -6240, -10664, -9499, -10394, -10125, -3039, 2931, -58, -4491, -9634, -9770, -11169, -9413, -4986, -8542, -10152, -6406, -4878, -7333, -3898, -493, 5789, 7015, 1371, -4594, -5844, -3751, -7208, -7356, -1836, 968, 3629, 1528, -4180, -8273, -3767, -3249, -11698, -9701, -7706, -4077, -4367, -3969, -1375, 217, -755, -1661, -1511]
17315a511J691l044N089P961J799j0773l027N88j109k181o958j254r73N563Q418
17300B79J98j927L063k220k370M589J642j1693Q48M072Q149n9k595n9L316P75
17284F008k128M725l563n430j974J381M917K023k695p758k575K72N259J681n76
17269d33L263K64m984k49K26J663P629k957Q0K650J654j0389n969k57N865L670
17253A726k864J74O759l000m665N120J843k926K293J675l006k370o99K090l642
17238a492n488L544q284N31L521M510J016M068q01k698k46n025l44L810J253r85
17222c110j258L348k063l304l690M535L713N343L487j199j607o439j217r19k623
17207g003k097L873n08j741l769K278P382J461J321R26o220j0425l237k129L501
$$ y = [-1511, 180, -2864, 2225, 10186, 11985, 1212, -1815, -1227, -2336, -4517, -11475, -12729, -13702, -8139, 279, 477, -1450, 1613, -607, -2977, 1612, 3254, -8439, -7591, -3519, 4630, 4571, 1976, 1917, 5233, 6008, 3880, 8605, 5042, -388, -2362, -981, 3936, 5959, 3264, -4494, -7069, -6797, -1538, 143, -433, 2830, 3094, -1890, -2139, -1913, -250, 7379, 4422, 4502, 7152, 8806, -1583, -7552, -7809, -1944, 1726, -1138, -964, 5795, 2795, -1870, 3250, 5093, 2167, 4460, 6135, 3129, 759, 60, 2150, -1492, -6980, -3436, -11720, -11189, -7668, -3158, -2142, 1926, 1125, -1573, -1819, -6844, -7188, -3378, -2125, -3110, -4368, -1020, -3083, -6387, -10077, -5542, -1829, 3514, 7001, 5802, 4195, -2244, -3461, -4380, -7003, -9100, -5227, -5735, -7476, -11245, -8967, -1585, -124, 1197, 2123, -4097, -14522, -17759, -19888, -16387]
17192a6387L952M704Q384j20o481M465M13j539l149M16J715K747L051m12K193
17177C952p510m414M669k502J354k881j644M744n598m590r61J069J289L610m0
17162i453N6K182Q38K096j408k713N463L880J203J135l57P9p708j880L20J419
17146d848k730M808M49J735K252o653k583L205K973L598p270N54J65K883l624
17131e086q148j780O295M330J123K230n397k242M795j115P62J365L154K248l413
17116h79L315K63k500j105m091j203n6n611K533J0521K535K920r288k575Q123
17101B902k741q034M09J732M311m290J748O201k11K063m29n696q06M376j756l659
17085c880N28r12M197L27M06j774r04l858k885J914O846K996m441m206l598p117
$$ y = [-16387, -12435, -7731, 653, 533, -5948, -1483, -1070, -2609, -5758, -5342, -3627, -880, 2171, 1759, 3952, -3558, -7972, -3303, -5805, -4451, -7332, -8976, -4232, -9830, -14420, -15381, -14312, -13023, -9413, -9453, -9397, -7215, -6377, -4281, -5689, -8402, -2939, 941, 2144, 3279, 2922, 3001, -4707, -6587, -6267, -4848, -7578, -2770, -2321, -586, 1666, -4987, -7570, -4365, -1392, 2206, -5064, -4510, -4345, -1462, -5086, -13234, -15014, -8719, -4389, -3266, -1036, -6433, -8675, -3880, -4995, -4233, -2868, 286, 2534, -879, 2436, 2699, 199, -906, -4997, -6200, -6256, -11867, -9334, 1187, 3722, 6642, -2646, -5221, 2902, 161, -7873, -7464, -5732, -1421, -5711, -3963, 2238, 2027, 4090, 3661, -2035, -2841, 1535, -221, -3880, -3352, -4264, -67, 260, 666, -1108, -2012, -5870, -8755, -6841, 5, 3001, -1440, -5646, -9244, -16361]
17069a6361k446L377L113L939K418L007L432p73j725l632k455k037j937O26P406
17054d048O193n897q417j771J870L618j060N008N292j732n282p60K288O848o600
17039d450j528M347K534o6L152j05m685o592J244j814n558M384N462k797n836
17024a2308O819R649J433l131J330J540m713m350m974j110J248P028N445O173
17010A0079Q81n728p712n045J572l720k141P05O450K73o216l1J546j499n979l395
16994a9960M236j695M563R103R40N692m081k612J90K407O387R25l965p055l80
16979e305L128k515m549K000J028q876M14N837j261k32K845l880j976L611M932
16964d799K026J232m89n884r36m45J82J0245J439k555j0385o186k09Q340M989
$$ y = [-16361, -18807, -15430, -12317, -8378, -5960, -2953, 479, -294, -2019, -5651, -8106, -10143, -12080, -11454, -4048, 2145, -3752, -12169, -13940, -12070, -8452, -9512, -4504, 788, -944, -6226, -6986, -4698, 2150, -4450, -5978, -1631, 903, 837, 3989, 3884, -801, -7393, -6149, -7963, -13521, -9137, -3675, -6472, -12308, -5489, 4160, 5593, 2462, 3792, 5332, 619, -3731, -8705, -9815, -8567, -1539, 3906, 10079, 10960, 5232, -2480, -7525, -5953, -9673, -11814, -11109, -4659, -4386, -10602, -10633, -9087, -10586, -16565, -19960, -15724, -17419, -12856, -3753, -2813, 2879, -1202, -3814, -3624, -1217, 5170, 6095, 2130, -4925, -5305, -2177, -4692, -9241, -7241, -6213, -15089, -14675, -8838, -10099, -10331, -7486, -11366, -13342, -9731, -4799, -2773, -1541, -2030, -7914, -8850, -9295, -9113, 1132, 2571, 16, -10369, -16555, -16764, -8424, -3435]
16949c435j027m740L751K14M76j108n96K088P143J845o987p14l677j76O284j318
16933a977K615J674n882j217L390J121J745l316l681J372L647J355j603j033N623
16918C833n713l828L770m416l507n121J430P01K196K973R938r075K355M872k637
16903b229n809R34j452m037p102O331M953K744N10k356k002P03O943J847n851
16888e873n201L18K056N918j180m888k580M934L127J369N940Q639J922k587m206
16873G708o405k369n192k452k638k471N175P080O329L768j653j310j0153j008
16859e591L968j484m24K647L404o746q64O925L038l269n168k949M592j136l998
16844g055l154k725k051N120Q250q94j753l390j955j10k546o107N892L668L795
$$ y = [-3435, -4462, -9202, -5451, -5237, -4761, -5869, -6465, -4377, 2766, 4611, -2376, -3090, -6767, -6943, -659, -1977, 638, 2312, -3570, -4787, -1397, -276, 1469, -1847, -5528, -4156, -509, 846, -757, -1790, 3833, -1880, -5708, -1938, -6354, -9861, -14982, -13552, -12851, -10655, -7682, 2256, -6819, -4464, 408, -2229, -8038, -7104, -8556, -12593, -19695, -13364, -8411, -5667, -5157, -7513, -9515, -8812, -1869, -22, -5873, -11074, -10756, -8700, -2782, -3962, -8850, -11430, -6496, -3369, -2000, 3940, 12579, 14501, 11914, 7708, 1303, -1066, -6258, -8710, -11348, -13819, -8644, -1564, 4765, 8533, 6880, 5570, -4583, -5591, -1623, -3107, -3531, -884, 2520, -4226, -5090, 1835, 4873, 1604, -3564, -6513, -1921, -3057, -7055, -10209, -12934, -14985, -9865, -1615, -2509, -4262, -7652, -9607, -9717, -12263, -18370, -12478, -8810, -5015]
16829e015P683M930n898m430j840q184N03j836j285K983Q656M017k253j157l26
16814c452k590J825K134J880L345n89l204k428j64Q293o15r218n066k085o526
16799a8460J670O027m291M116J643k024k921n49k37Q999P192L85l765p80L047
16784E2l569l953k965l49O89k381n140M105O777J718M251j819K24N235J182j496
16768B561j781j641L232J154o886L730Q560l286q658p885r89N953L577j500K034
16753a825J503N6p78L854r581m637L36M28J933L84N065n17k780l291q95N365K14
16736e166J472J121j983n787N0j601J162L799m6j0044J512P001M790O360L410
16721F050L353m086j2278J18K299L349K703n196l085J330P812k164m652m398j109
$$ y = [-5015, 2668, 7598, 1700, -2730, -4570, -12754, -12251, -14087, -15372, -12389, -3733, 284, -1969, -3126, -3452, -6042, -4217, -2083, -203, 3142, 2553, -651, -3079, -3243, 5050, 4435, -4783, -9849, -11934, -18460, -16790, -10763, -15054, -10938, -9295, -11319, -14240, -14789, -15026, -6027, 1165, 1550, -2215, -2995, 52, -3517, -7470, -10435, -10784, -10095, -12476, -17616, -13511, -6734, -5016, -765, -2584, -2360, 2875, 4057, 2561, 780, -861, 2371, 3525, -3361, 369, 8929, 5643, -3015, -10900, -11889, -5936, -2359, -3859, -1825, -322, -266, -1044, 2810, -6771, -11408, -11072, -10644, -8711, -8327, -3262, -3779, -6559, -9850, -10745, -5380, -5166, -3694, -2573, -4556, -10343, -10293, -11894, -10732, -6933, -6979, -17023, -15511, -8510, -3720, 2640, 6050, 9403, 5317, -6961, -6843, -4544, -1195, 1508, -3688, -6773, -5443, 2369, 205, -4447, -8845, -9954]
16706i954J372L195M551o170N184M870j31j215j0395j092k76O455J0722J773q937
16691d8n927L296J4o688q000P76Q482p74q14K891j40k827m105Q00M996K403N581
16674h4k434O484J272n677Q47Q19l648o824l181o85j136k7K234J307K123k316
16658a0926N201M154K80J746J827p31m181M277r58M748K526l283j546r938l051
16643i855M997o578n802J843P122R80P6J948J932l829k507J0243M317J793M211
16628A0891L909L456n217r135L937n797n264j054Q625J0446q1j1139n138N347
16614C786J990k616p45m414j846L94K464l790m697J547J075k680K283L678J142
16599b429q50L25j16q45J327Q02m355R86K648O959k276j482m004L68M293O90m476
$$ y = [-9954, -8582, -5387, -836, -7006, -1822, 3048, 2917, 1702, -8693, -9785, -10061, -3606, 7116, 8889, -48, -5975, -2679, -2665, -9353, -17353, -16577, -8095, -8869, -9683, -6792, -6932, -9759, -13864, -13064, -8068, -5665, -84, -2518, 3966, 5238, -439, 408, 1227, -2421, -9245, -12426, -13111, -14247, -14274, -12040, -10733, -8610, -10926, -5725, -1571, -1291, 455, 2282, 1551, -2630, 1647, 689, 5437, 7963, 4680, 3134, -6804, -9855, -4858, -11436, -17238, -15395, -8273, -7293, -7217, -5269, -3337, -7166, -9673, 570, 4887, 6680, 10891, 14800, 18256, 13039, 3904, 7841, 2044, -3220, -4274, 4351, 14797, 14716, 3577, -1561, 3786, 5776, 3160, 2415, -1999, -3845, -3451, -987, -4777, -9474, -7927, -6852, -9532, -7249, -3571, -2429, -3279, -2954, -3070, -3915, -2588, -1786, -6141, -5155, -2507, 4452, 2176, 694, -3310, -2942, 1351, 2041, -2435]
16582b435k383o760j601k066k95k61N985P966K986K139j653o876L414J454k926
16567c312n478K973M436K774l087K006K807k090l710k256L526J120J141q535n166
16552a2851K337J946Q719J0559l17r932o229k758k038k794Q324J0512k385p437
16538d344L173N603K952l504l57n743j266J935L15J977M81j94l101L275J074J072
16522C348p274q957m76J79M275Q996m78K301K634N85o079r728n44O681P49l716
16506g504r84P503N741N067l226m981m173L757j153l182o39J722n923J103L468
16491c404L04l637l746o410L188N430J212N39m014j717m412O023N994L611J627
16476E88l358n85o18l286j727J774o05J040L612K303q52J874l752M8K595M706
$$ y = [-2435, -4818, -11578, -13179, -15245, -15540, -15801, -9816, -1850, 1136, 3275, 1622, -5254, -1840, -386, -3312, -8790, -5817, -1381, 1393, -1694, 312, 3119, 1029, -2681, -4937, -1411, -291, 850, -7685, -12851, -10514, -8568, 151, 10710, 10393, 461, -5768, -8526, -10564, -13358, -5034, 5478, 3093, -4344, -1171, 4432, 7384, 3880, 3523, -2220, -3486, -1551, -1236, 741, 1222, 1028, -2073, 1202, 2276, 3348, -3926, -12883, -13359, -13180, -8905, 91, -387, 1914, 4548, 5133, -946, -10674, -11218, -4537, -3788, -7504, -8488, -985, 4756, 9823, 6597, 1616, -2557, 1200, 47, -3135, -3774, -2052, -7975, -6872, -3404, -3100, -6737, -10483, -16893, -13705, -8275, -7063, -6524, -10538, -12255, -16667, -10644, -4650, -1039, 588, -2770, -3355, -3973, -7259, -8986, -7212, -7817, -6777, -3165, -862, -1714, 160, -3592, -3544, -949, 3757]
16460C757L594o46j3233k733L844L391L859M010k573k682o638n749J063J466j328
16445a0598O47N257p32n755J947L887l67j707M283j284L609L321K489L251n366
16430B882l073m58L899J64n733j510M106k864p968o590J636M851P893M007R41
16415B183k348j507J420m075L507l021m106K217n547m29m12k88l087K804J28O166
16399f395O861k402q474N640Q32n067J229N52M060k665k584l481L708J998j406
16384g594j736P80L256L962K305M457N884K682m438j4152p152Q50L781L030M293
16369B08l043J812M031n003K567L026k583J425q6m331j830J932M822l069Q4J207
16353A169j505r62N983L660k56J040o29k908l828J03o23k325j585o90l771k748
$$ y = [3757, 7351, 6705, -6528, -9261, -5417, -2026, 1833, 5843, 3270, 588, -6050, -11799, -10736, -9270, -10598, -9951, -4694, -5426, -11181, -9234, -5347, -5714, -7421, -3138, -4422, -813, 2508, 4997, 8248, 2882, -191, -649, 3250, 3414, -2319, -3829, 277, -2587, -10555, -17145, -15509, -10658, -2765, 1242, 2183, -165, -1672, -252, -4327, -820, -3841, -7947, -5730, -11277, -11706, -12118, -12406, -15493, -12689, -12561, -6395, 466, -1936, -10410, -4770, -3938, -9005, -7776, -7224, -3164, -5829, -8413, -11894, -8186, -6188, -7594, -9330, -8550, -5294, -1332, 973, 5430, 11314, 13996, 9558, -4594, -11746, -10896, -7115, -4085, 208, -2835, -1023, 3008, -1995, 572, 3598, 1015, 2440, 2354, -1977, -3807, -1875, 2947, -122, -38, 1169, -336, -1298, 4685, 8345, 8089, 9129, 8500, 5592, 1764, 1867, 1244, -1081, -2666, -3356, -7127, -9875]
16337i875L491P799k300p431o10l280P978j033P11L517L097l63l713o686N92N622
16321b484m78j695P18K073K772P59j145k364j719n966K10L452J569k581L365l738
16305g252o313J877M668K734n600M173j16j491Q90k947j132j89O912p398j642
16290a2826K725O958l647j604J313L719P016n14k034o47j93K573J115K262l604
16275B612l271M936L991l825l422o313o668K370L191P992O690n200J113N160k615
16260F741q810R97m556M616K834n42j64j881j714N688j822p969K923K674QK062
16244A085m73l936K467j424m359m078P730J825p759O7Q256L793o125l800P18M590
16228a423M170K047j010j621L947m317l83L03m10O625J804o026o842K191N437
$$ y = [-9875, -6384, 1415, -885, -8316, -8926, -12206, -4228, -5261, -4550, -1033, 2064, 1701, -2012, -8698, -8106, -2484, -2962, -4657, -3939, -1866, 906, 1665, 520, -1844, -3563, -9529, -9319, -5867, -4298, -6879, -3514, -7252, -13565, -11688, -7020, -4286, -9886, -5713, -5829, -7320, -6430, -9377, -10509, -10698, -3786, -11184, -12826, -10101, -3143, -6790, -8394, -7081, -3362, 3654, 3140, 1106, 459, 266, 2839, 3954, 6216, 2612, -659, 4277, 8268, 4443, 1021, -5292, -11960, -9590, -6399, 1593, 8283, 3083, 4196, 9356, 6741, -2069, -1072, -5628, -1012, 1822, 1280, 1116, -765, -2479, 3209, 1387, -6582, -3659, -985, -977, 1085, 612, -3324, -857, -2281, -6640, -10718, -2988, -1163, -8922, -8855, -599, 3194, -2931, -6731, -6013, -1423, 2747, 4794, 3784, 2163, 6110, 1793, 1410, 1713, 1303, 7928, 9732, 3706, -3136, -945, 4492]
16213D492j785K817k676p770n469K391O783L86K890P91r375k773L237K154L42
16198c565K30K255k764P5k766J738L68j042o836J946O139j696L734N370L602K342
16182I130l922j143k250rR97Q73P103j563j0971l422N154k741l443K487k83m481
16166h484j566K354Q748K170J771M56J630l598o057j385m200L877R82N130P26
16151B554k165l198M411j876m547o883k032P319L525K843j363k908j240j332L93
16136f499Q524M852o523r855m947J343M102M529J516L737k957J221J705J887K866
16121E501R38r433k431j546l811O08K583J53M657L09p79n114P88K041O758q526
16105g304J131P369M05p683p351l853L628R179J686K217J945L0K990L30n554P40
$$ y = [4492, 2707, 5524, 2848, -4922, -10391, -8000, -1217, -831, 2059, 2850, -6525, -9298, -6061, -3907, -3565, -3335, -1080, -3844, -3769, -6535, -4797, -4429, -5471, -12307, -10361, -4222, -5918, -2184, 3186, 6788, 9130, 5208, 4065, 1815, 1806, 2803, 3676, 10779, 9216, -1755, -5177, -23, -2764, -6207, -3720, -4003, -8484, -10050, -7696, 1052, 3222, 4993, 5449, 7079, 3481, -2576, -3961, -8161, -4284, -3302, 1828, 2554, 389, -2809, 1602, -274, -4821, -11704, -13736, -6417, -2892, -49, -1412, -4320, -5560, -6892, -6499, 2025, 6877, 354, -9501, -14448, -13105, -9003, -4474, -2958, 779, -2178, -957, 748, 2635, 5501, 6439, -2994, -5425, -6971, -10782, -10174, -7591, -7438, -2781, -2472, -3251, -8365, -7577, -5536, 1222, -7304, -6173, 1196, 1601, -6082, -13433, -17286, -13658, -4479, -2793, -576, 1369, 1399, 4389, 4719, -835, -95]
16089i5J108n776J956l332j480K352J973J315K292m347Q01K676J615J756N18o754
16073c422l994j263M672R957k290p92n306j258J03M513J576K011k590r57K155
16058C115j698n047n073m551j517J844N135M865K995m549n679Q88O007J1497K877
16043A1109n464L64p664k749l303j0830m035o79Q02J884N400K676M431m965M562
16028h461j803J252Q146N575k803p882J798L89j418p38P92j476j250M67L785j056
16012d683q78K01L923J303n95j543l214L019M635k594n532m531j267j09J226K696
15996g943L050k980N592K330J745l59K914R42K059m922k962N541j803p183q182
15981a2161Q818P167J380p70l188Q22M121K361m449m962o925n42J992J398P375
$$ y = [-95, 1013, -4763, -2807, -6139, -7619, -5267, -3294, -1979, 313, -4034, -3233, -557, 1058, 2814, 3332, -3422, -7416, -8679, -4007, 5950, 3660, 2868, -2438, -3696, -3593, 920, 2496, 4507, 1917, 960, 3115, 1417, -3630, -8703, -13254, -14771, -12927, -7792, -2927, 68, -4481, -10160, -9272, -3265, 8232, 11109, 5645, 6009, -1655, -4404, -7707, -18537, -22572, -23251, -22449, -20565, -15165, -12489, -8058, -13023, -8461, -10264, -9012, -866, 4709, 1906, -5976, -4178, -3789, -5207, -5945, -5153, -6629, -7879, -7412, -3627, -4683, -5561, -5360, -1437, -134, -729, -2272, -5486, -2467, 2168, -426, -5958, -10489, -11756, -11865, -10639, -7943, -4893, -7873, -2281, 49, 1794, 1435, 4349, 5291, 7350, 2428, -534, 5007, 3204, -3979, -12161, -3343, 3824, 5204, 4434, 1246, 2068, 6189, 8550, 4101, -861, -7786, -8328, -6336, -4938, 2437]
15966B437K697L049j757p52M70l094o621k298N734O811K841p168j812J437j357
15951F17m971m39J275k734m442j126O728P293O120P245k795p225o38j956m933
15936a981o102R95O856K271m768p328K309L352K135J64M390l213j1103K596M336
15921e091K622l627l27J559K508J228q347k555J414O994P17j348L758k285j789
15906d569P679J3478l61j0842o687n953J016J036J034R151J207K860O09K890m504
15891H044Q4p05m736m853o355R55j740L28K222J95k004l587L487M481j842m90
15875f516R85N444n679j063K89k066Q301K365r06J562j137J758L401l264k121
15860A353M726J86l026O54m74m45O123k859m541j618M919o63k732K370l590j51
$$ y = [2437, 5134, 8183, 6426, 5674, 6144, 3050, -3571, -5869, -135, 6676, 9517, 2349, 537, 1974, 617, -4354, -4793, -3518, -6252, -10694, -11820, -5092, 2201, 8321, 15566, 12771, 5546, 4908, 2952, -1981, -8083, -7088, -232, 2039, -2729, -10057, -7748, -4396, -2261, -2097, 2293, -920, -12023, -9427, -5091, -2469, -6096, -6423, -4864, -2356, -1128, -9475, -12030, -10616, -3622, -2905, -4253, -495, -2780, -4569, 3110, 16588, 16227, 5385, -1302, -7255, -6239, -5203, -4169, 4982, 6189, 9049, 9658, 12548, 8044, 8128, 7423, 2687, -2166, -8521, -7566, -9306, -8978, -6756, -6561, -8565, -12152, -8665, -4184, -6026, -6516, -5531, -87, -5766, -6829, -6540, -8606, -305, 2060, 1154, 2716, 1579, 3337, 6738, 3474, 1353, 6079, 6265, 3239, 3893, 3419, 2974, 9097, 6238, 1697, 79, 4998, 4335, 1603, 3973, 383, 232]
15844B32J974L95k565J716M453K407l402k764p32q08J432m604o768j358r80N748
15828e624P286l177J314P284o642o028k461L649Q284K02r775L985l92l98N262
15813B769o76L45r41K34N71l352L685N566j64n136o585J023M072m753l616L004
15797c954m88J154M614k105O373n404j657K709O194P17J99m971m308r68L856Q369
15781A0330J110m670k00L034j813O182P56l638n885o230P3K06o952J389N343l319
15765d284q576M370J0128L475J344L795j38K19l248K6j127m768j020l921m097
15750g822p50L959J990k510J100k728J522J1114J54l478k188O478P794k229m928
15735G478O31m871n02l952k800Q23J07j998m72L349L805L560M557N273m363q424
$$ y = [232, 2206, 2601, 36, 1752, 6205, 8612, 5210, 2446, 1714, 906, 2338, -2266, -9034, -10392, -11372, -5624, 1662, -1515, -201, 7083, 441, -5587, -8048, -4399, 3885, 4087, -5688, -1703, -2095, -2493, 2769, 2093, 2438, 1497, 1731, 2302, -1050, 2635, 8201, 8037, 2901, -3684, -2661, 1411, -3342, -6958, -3954, -4442, -3288, 1326, -779, 5594, 190, -1467, 1242, 7436, 8153, 8352, 3381, -927, -1895, 1961, 10330, 11440, 6770, 6570, 9604, 7791, 13973, 14729, 11091, 5206, -1024, -951, -745, -7697, -6308, -965, -4284, -12860, -8490, 1638, 5113, 6457, 10252, 10114, 10333, 7085, 7111, 5984, 1216, 196, -3725, -7822, -8572, -4613, -2623, -5133, -4033, -6761, -5239, 5875, 6029, 2551, 363, 6841, 14635, 12406, 7478, 8109, 3238, 2736, -1216, -4016, -3193, -3086, -5084, -5556, -2207, 1598, 5158, 9715, 14988, 10625, 2201]
15719B201m314l648k672O331L052m30L232L475p95p880P427O672j631J004N276
15704A7300j41m324J10N019l227n753l834j398N7j767L749n068p908P296L533
15689C644m009K952K983l387J273K524l510o519l011l831k334J1096J505j814
15675b438J243K212J11M962M203k460L016R36K230q177l575M412J409m201l049
15660H34k582P0K156O805k693k895N203M96P3P46r871r169k14O580j190j740R36
15643f455K472k466K736L167l03k822N25m172Q726L498P93M99j231N000N45q413
15627B099q342l8L903J427L058M457m126l681m884K513l631j534P382n65m981
15612f943N314m760p056l785N212J236J21l741r70L989p72m23J900J077M193P731
$$ y = [2201, -2113, -5761, -8433, -2102, 950, 520, 3752, 7227, 6432, -1448, 5979, 12651, 11020, 12024, 17300, 17159, 12835, 12945, 17964, 14737, 8984, 5150, 3752, 3809, 2042, 5791, 723, -7185, 111, 3644, -365, 2587, 5570, 2183, 3456, 5980, 2470, -4049, -7060, -10891, -13225, -2129, -624, -2438, -1195, 1017, 1128, 6090, 10293, 7833, 10849, 11785, 14015, 5838, 2263, 6675, 8084, 3883, 834, -1748, -1678, 478, 7283, 4590, 1695, 6898, 7394, 7467, 8213, -1658, -10827, -11041, -4461, -5651, -7391, -6455, -3983, -6449, -3713, -546, -849, -3671, -3146, -7318, 1408, 4906, 5699, 6198, 4967, 9967, 10512, 2099, -6243, -6281, -2378, -951, 2107, 6564, 2438, -1243, -6127, -3614, -7245, -8779, -1397, -1962, -6943, -1629, -6389, -13445, -17230, -12018, -10782, -10661, -14402, -15372, -11383, -12155, -12578, -10678, -9601, -5408, 2323]
15596B323K773o010J127N391n005K160j362L823l70J267o140r413O04P922J148
15581B38L874K425N456M030k719M23J054L50j977q286q614N202Q740k311q230
15566c45k776k891O162j630l063k15k5J0339R530o792n491m136J390L630K322
15551F009r073J159M014Q615K841m529n155q61j935Q305L782k85j273j682m233
15536E699P321N449k675m660J989N149J1966O174J2777R493q166j6393r832J06
15522B4397R01p974r009p381r109M334K304K664k254O198K502k306j488L668L942
15507A1389l836k751M183J256k876L629l903r96p893j251J584O029J0250o15m98
15492A3701K15J615j085p120k317M469L2j637N464J231o390L51M533N210J37p585
$$ y = [2323, 5096, -914, 213, 5604, 599, 2759, 1397, 5220, 4850, 6117, -23, -9436, -8832, -910, 238, 4112, 6537, 11993, 16023, 13304, 13727, 14781, 15131, 13154, 4868, -3746, 1456, 10196, 7885, -345, -3121, -6012, 150, -1480, -4543, -4758, -4783, 5556, 15086, 8294, 2803, -1333, 57, 3687, 6009, -3064, -1905, 2109, 10724, 13565, 9036, 3881, 3020, 1085, 9390, 13172, 12887, 11614, 9932, 5699, 13020, 18469, 15794, 11134, 13123, 18272, 30238, 36412, 49189, 58682, 50516, 34123, 24291, 24397, 25298, 17324, 8315, 934, -8175, -3841, -1537, 1127, -1127, 5071, 7573, 5267, 3779, 7447, 11389, 7553, 4802, 8985, 10241, 7365, 10994, 7091, 6095, -1798, -3049, -1465, 4564, 14814, 14199, 13701, 13916, 15531, 14446, 7326, 5009, 9478, 9510, 7873, 13337, 14568, 8178, 8529, 13062, 18272, 18409, 10824]
15476A0824p105P074J1990l118j0486n676k028K486k478o106L869K582O277j636
15462F469m917m300j243n46M725P40m59K391J670l33J883J080K481K78m61o813
15446B645o118J484L911J239j10j212j0491o45L347J569O113j344j792j277P466
15431D785j027j778P241K897m418L602n955m469o942m158J945L502M863L630p069
15416c351n318p31N730m575l620k330r89J085M012P029M284j986o89K495J013
15401B059j002K377L513l083m509n805O671M492k736k693L383k662k267Q48P83
15386f31J85N42n1j969K19L946K120K927N384j690l99L871m595K475K788q189
15370F933m006k198j740J370L62L462M556m007j786K053O24n375M272n972m990
$$ y = [10824, 3719, 10793, 22783, 19665, 9179, 3503, 1475, 3961, 1483, -4623, -754, 1828, 8105, 6469, 1552, -2748, -3991, -4537, 188, 928, 469, 2860, 4530, 4197, 6080, 7160, 9641, 9919, 9458, 2645, -3473, -1989, 1922, 3161, 3051, 1839, -8652, -9297, -5950, -4381, 1732, 388, -1404, -2681, 4785, 3758, 1980, 9221, 12118, 7700, 11302, 5347, 878, -6064, -10222, -8277, -4775, 88, 3718, -3351, -8669, -9400, -3670, -8245, -11865, -14195, -15184, -14099, -10087, -3058, 1226, -760, -1449, 1046, 2059, 1057, 3434, 6947, 3864, -645, -6450, 221, 4713, 1977, -716, 2667, 5, -2262, -1414, -631, -446, 96, 45, -1924, -1705, 2241, 4361, 7288, 12672, 10982, 10583, 14454, 9859, 12334, 15122, 6933, 2927, 729, -1011, 359, 721, 4183, 8739, 4732, 2946, 4999, 5623, 248, 4520, -1452, -6442]
15355f442N84l019J428L740J495m999K977K626o90K582K318P961K699j110m868
15340G282k849P988j812r277j657L159M206N31k897j228j485j3K317m125k347
15325b207j81j481p076K024O598J711n482P60L243Q32K993N98j216j14L931j498
15309C435O94k430J208j261J266J315J452l43j438L422J177M304M079p950K119
15294A1049j725l2K910l756K66M765j343m340l088N580K372l705l825L893L404
15279A2425j548L0l790m131l32J797r12k913l287K130Q689O94l166q96L48O48
15263E786R71m00q48K95j926K673q02l515j700J223R54L834K46J577M893L521
15247A6782j904j0145n424J736R28J245O63p76l715k86O288J233J078K160J109
$$ y = [-6442, -5858, -8877, -7449, -3709, -2214, -7213, -4236, -1610, -2300, 282, 2600, 10561, 13260, 12150, 7282, 4433, 12421, 10609, 1332, -325, 2834, 7040, 7571, 4674, 3446, 1961, 1948, 4265, 140, -2207, -2388, -3869, -10945, -8921, -2323, -612, -6094, -5334, -2091, -1259, 1734, 2332, 1116, 1002, 4933, 3435, 4129, 1699, 2907, 1646, 2912, 4227, 5679, 5336, 3898, 7320, 8497, 12801, 16880, 8930, 11049, 9324, 9292, 12202, 8446, 8712, 13477, 12134, 7794, 4706, 10286, 12658, 8953, 5128, 9021, 12425, 10877, 10907, 7117, 2986, 2654, 4451, 3539, 626, -2661, -531, 8158, 8852, 5686, 4790, 5138, 5786, 6757, 6357, 5509, 5804, 3878, 6551, 5749, 2234, 534, 1757, 2711, 6545, 6791, 8368, 13261, 16782, 14878, 4733, -691, 1045, 1973, 3218, 3881, 3105, -610, -896, 5392, 6625, 7703, 9863, 10972]
15232A0972l219j758J368n16R16M876N219J510M72O154k460q83k541o303L294
15217A7101N182j480n424m692L380M195j0261o419K168k389n86N853P250P93n124
15202I547n478K407L117l859N8r55O87r81K248k60J19R01j732k279O513J562j858
15185I757m942K896n44m483k952M320M389N020P59j567J26j590j300k686L89N150
15169A2742K868l004m172p3j930K32k89l693L133R147p646n985j952M96Q658j082
15153G450j744j579K507L8K346J066O328L846l52j844m313l290o733m025L722
15138C423J733p862L572P76K718j285K602K217n825J04K223K050l329K052L466
15123H635p74j539r38K849O831L258M439k722k053j63P26L814n58N776j703j1315
$$ y = [10972, 7753, 5995, 7363, 6847, 7763, 12639, 17858, 19368, 19840, 25994, 23534, 22651, 20110, 13807, 17101, 22283, 20803, 15379, 10687, 14067, 18262, 8001, 1582, 3750, 1361, 775, 6628, 13878, 14671, 9547, 4069, 6476, 9593, 5734, 5792, 4837, 5524, 4543, 6791, 6531, 6650, 7551, 5819, 3540, 10053, 11615, 9757, 4815, 7711, 7167, 2684, -268, 4052, 8441, 13461, 14220, 12653, 12779, 11189, 9889, 7203, 7592, 12742, 15610, 12606, 8434, 8361, 6431, 6663, 6374, 2681, 5814, 14961, 7315, 1330, -622, -126, 8532, 7450, 5706, 4127, 6634, 6672, 9018, 10084, 16412, 20258, 19906, 18062, 13749, 10459, 3726, -299, 3423, 5156, -2706, 866, 1642, 4360, 3075, 5677, 7894, 2069, 2173, 4396, 6446, 3117, 5169, 8635, 7861, 6322, 5384, 8233, 15064, 18322, 22761, 20039, 17986, 17823, 18549, 22363, 21805, 27581, 25878, 14563]
15107A4563o258l594L224M148M660o16m651J887j080L072o67l844j957P08l770
15092E825J749P107Q70K91p737n847P143o392N416J0973m593l999M376J624L27
15077A7133M840m524j0171k899P589P376m617K512P465l708m679j763M605l890
15063A5269k147N800l04l534L911N83j17J0548L466N394J325j003m837j0714n332
15048A8308M414J0848Q420M842k44m907N44L66k921N82K9N929O007M628j0263
15033D6582p523N929O244J524J890j025P412O412o466M85P07N310j78J259k123
15018F6439l484q30J08K711Q994P380K083j690P24N342N639J930K594Q346Q822
15003A15108K78L343R205P220l31O24R892K0394J5888K3467K4826K7509L1366
$$ y = [14563, 8305, 4711, 7935, 12083, 16743, 16127, 11476, 13363, 12283, 15355, 14688, 10844, 8887, 9595, 5825, 7574, 14681, 15551, 15842, 8105, 2258, 9401, 3009, 8425, 19398, 14805, 10806, 15182, 16806, 17133, 21973, 17449, 7278, 4379, 11968, 19344, 14727, 17239, 24704, 20996, 16317, 14554, 19159, 15269, 13122, 18922, 18618, 15084, 18995, 19578, 19461, 30009, 33475, 38869, 40194, 39191, 34354, 23640, 18308, 22722, 33570, 41990, 46832, 46588, 41681, 42225, 42591, 39670, 40252, 40281, 46210, 52217, 56845, 46582, 39059, 44988, 51232, 52756, 54646, 53621, 61033, 67445, 60979, 61464, 62171, 67481, 67303, 68562, 66439, 62955, 62125, 62233, 64944, 73938, 81318, 83401, 81711, 82435, 87777, 93416, 95346, 97940, 106286, 115108, 115386, 118729, 127934, 135154, 134823, 135447, 145339, 165733, 181621, 205088, 229914, 257423, 288789]
14990B88789L0352L6261N1906O3440P5989R4229J08400J17508J19980J11488R9297
14979A197639R5704J03356J38088J91788K78392M43912P48476J310381K227559
14970F735295K637754O83018j891117k382467j592850r33729n76773l85953k72274
14961B020904k03338j60790j26437j06701q6041p8772o7456o1763m5123l7315
14951A047168k4783k7865k3202k2792l6123k4249j1735p584n837o866L165O241
14939H65538J2274K4149J0917j6623j5682k0017l2138m2880m6033m5264m3004
14928F51237l6809l6424m0807m0911l1315k8150k5805k1762k1859j8282k1025
14917C28088k9479j2437j2146j6305j2022p721r086j0241l171r743j0875r318
$$ y = [288789, 319141, 355402, 407308, 470748, 546737, 640966, 749366, 866874, 986854, 1098342, 1197639, 1293343, 1396699, 1534787, 1726575, 2004967, 2448879, 3197355, 4507736, 6735295, 9373049, 10056067, 8164950, 5782483, 4189633, 3255904, 2679131, 2293178, 2020904, 1817566, 1656776, 1530339, 1423638, 1337597, 1258825, 1191369, 1129606, 1084483, 1047168, 1022385, 994520, 971318, 948526, 912403, 888154, 876419, 868835, 862998, 856132, 859297, 865538, 877812, 901961, 912878, 896255, 880573, 860556, 828418, 785538, 739505, 694241, 651237, 614428, 578004, 537197, 496286, 464971, 436821, 411016, 389254, 367395, 349113, 328088, 298609, 286172, 274026, 257721, 245699, 237978, 228892, 218651, 215480, 205737, 194862, 185544]
14905A85544j4680j2514l969m534L684p082n704p262p912j016q862q721p810l834
14891I5328J432L877m452j1731n972l768k812k512p811J005m860l995l683j986
14877D8060n685r351Q84Q428j0548k964J2127O362o795o803O68N216K591n553
14863C6637m869j721m574m088M797l925o301l383J2677N560q01l633m725J0501
14849C2152K934j1787m964K924J2152M380l858k519k895j559r085o615J566L480
14835A6306n79j0152p289P08K574J818O11J766M338J578k787j726M749M598k780
14820A3733l326O54m094l691L238m814J533L932N752K140P50K484Q19O26q024
14805A1712k207O325K687k243m719j954k313M283O748N356M95l638k054k982J362
$$ y = [185544, 170864, 158350, 154381, 149847, 153531, 146449, 140745, 133483, 125571, 124555, 115693, 106972, 99162, 95328, 96760, 100637, 96185, 84454, 78482, 74714, 71902, 69390, 61579, 62584, 57724, 53729, 50046, 48060, 42375, 33024, 33908, 42336, 31788, 28824, 40951, 47313, 40518, 33715, 34383, 39599, 42190, 36637, 31768, 30047, 25473, 21385, 26182, 22257, 15956, 12573, 25250, 30810, 30009, 26376, 21651, 32152, 35086, 23299, 18335, 21259, 33411, 37791, 33933, 31414, 28519, 26960, 17875, 11260, 12826, 16306, 15727, 5575, -1714, -1006, 1568, 3386, 3997, 5763, 10101, 11679, 8892, 7166, 11915, 16513, 13733, 10407, 11061, 6967, 3276, 6514, 1700, 3233, 7165, 12917, 15057, 15807, 18291, 19110, 19736, 11712, 9505, 15830, 18517, 16274, 11555, 9601, 7288, 11571, 18319, 23675, 24170, 20532, 18478, 15496, 16858]
14790A6858L544J260N893j05J58M636P05o08o555j1399k900L240M984K42l281
14775A6672J478Q784O256l938q268J34J633J142l297q69N338M094m344L72j012
14760B4175O55j881P54l354m755K212M183o601r202L172O081J292n665l223k254
14745E589L362m949K186m173L798J800L43K52L413j112q298k862N958N663k953
14730H017L078k91j609q81j084l8j55Q81K676m36L50L175o381p551K189P692P975
14713A7607l029q593J130K240m418k868L425J51K718L589q9L63m337l889l445
14698E55o744Q81M654n74K75M278K178P81m387J945K899O383q84p402J219J811
14682G868J965J58l850L044P55k572Q41L822J731l662l197L391K152o290N286
$$ y = [16858, 20402, 21662, 27555, 27450, 27608, 32244, 32949, 32341, 25786, 14387, 11487, 14727, 19711, 19953, 16672, 18150, 26934, 33190, 29252, 20984, 21118, 22751, 23893, 20596, 19727, 25065, 29159, 24815, 25187, 24175, 24830, 22949, 23703, 20349, 15594, 17806, 21989, 15388, 6186, 9358, 15439, 16731, 11066, 7843, 5589, 8951, 4002, 6188, 2015, 5813, 7613, 7956, 8208, 11621, 10509, 2211, -651, 5307, 10970, 8017, 11095, 10804, 9195, 8314, 7230, 7192, 7037, 7918, 10594, 10158, 10508, 13683, 7302, -249, 1940, 9632, 17607, 14578, 5985, 7115, 9355, 4937, 2069, 5494, 5645, 8363, 11952, 11863, 12226, 7889, 4000, 555, -6189, -5308, -654, -1228, -953, 3325, 5503, 6284, 1897, 3842, 6741, 13124, 12240, 4838, 6057, 7868, 9833, 9991, 6141, 9185, 9940, 7368, 8209, 12031, 13762, 10100, 6903, 10294, 12446, 6156, 11442]
14667A1442j297m362K580L053l089l222J098J017r38j140l769l59j538N675P138
14652A2289L851m5K559k90J230n579o193j003M725o673n144M359M821J724L031
14637A3662J519j257K077J727K332n867l930K975j568k009k319k182K352J1156
14623A8668L297Q80J305o824o290k604k534o214j014M249N631p47O94k020m794
14608A683k344K451N810L107N08K803K205P23l683o771k982r72M32M06M369K183
14592I928j899l109J284l170K972J1206J143Q73n876q123K405j263k087j335O625
14577I574P004J242k836J318j195j148J764k092m627j796k201J700M199N567L794
14562B0267p79l299q090o414Q87K527K144k777J33j202q95K783P81L97L859J648
$$ y = [11442, 10145, 5783, 8363, 11416, 8327, 5105, 6203, 7220, 6282, 5142, 1373, 1014, -524, 5151, 12289, 16140, 16095, 18654, 18364, 19594, 14015, 7822, 6819, 11544, 4871, -273, 4086, 8907, 10631, 13662, 15181, 13924, 16001, 17728, 20060, 14193, 10263, 13238, 11670, 9661, 7342, 5160, 7512, 18668, 21965, 22845, 24150, 17326, 11036, 8432, 5898, -316, -1330, 2919, 8550, 7803, 8497, 6477, 1683, -661, 1790, 7600, 10707, 11215, 14018, 16223, 16946, 13263, 6492, 3510, 2538, 2970, 3376, 7745, 9928, 8029, 4920, 6204, 3034, 6006, 17212, 18355, 19228, 13352, 5229, 7634, 6371, 4284, 2949, 9574, 16578, 17820, 14984, 16302, 15107, 13959, 15723, 13631, 9004, 7208, 5007, 6707, 10906, 16473, 20267, 19488, 16189, 8099, 1685, 2572, 5099, 7243, 4466, 4599, 3397, 2502, 5285, 6066, 6463, 10322, 11970]
14546A1970l332m268m914K623P11O120O346N494K57p033n160N592J967n927n609
14531D837k649r09K546P26L126R99m131L974M319m57K997m097m204O11M726J79
14515A2593j631K965N377O514m853n624m779Q31J256J986K622j09m8l653Q54j788
14499A2513J129j844j379K279J565l439q804k95R673N249J86P275l401k651o60
14484A7396j279n24j836k610j943j78M374K547L462l028l957K788L372l701k287
14469A2596L253J24m977J247Q302l56n723J424J910J395n185q649p585L603K220
14454C599L980k63K835k002L861O422l057l068m294J785K872N048N467r358q664
14439E163m586N80M676o41K841o033n038N206R864L156o48l178q675L275N214
$$ y = [11970, 8638, 4370, -544, 2079, 2790, 8910, 15256, 20750, 21007, 13974, 8814, 14406, 16373, 10446, 4837, 2188, 1279, 3825, 4551, 7677, 8676, 4545, 8519, 12838, 12381, 15378, 11281, 7077, 7688, 12414, 12593, 10962, 13927, 19304, 25818, 20965, 15341, 10562, 11393, 12649, 14635, 17257, 17148, 17100, 13447, 14301, 12513, 13642, 11798, 10419, 12698, 14263, 10824, 2020, 1725, 11398, 16647, 16833, 24108, 20707, 18056, 17396, 16117, 15593, 13757, 11147, 9204, 9026, 13400, 15947, 19409, 16381, 12424, 15212, 18584, 14883, 12596, 15849, 15973, 10996, 12243, 20545, 20189, 14466, 15890, 17800, 19195, 14010, 5361, -2224, 1379, 3599, 7579, 7316, 10151, 8149, 12010, 18432, 15375, 12307, 8013, 9798, 12670, 17718, 23185, 13827, 5163, 577, 1157, 5833, 5192, 8033, 2000, -3038, 2168, 12032, 15188, 14540, 11362, 2687, 5962, 11176]
14424A1176l789m52J863J614L627j567j92J207M546m829k045l175P807P624j156
14409B2259M047j478J658K242M524P405Q925m99j541r485q385p040k776O487J504
14394B7847l689p860n475j801J098L137L325L028K525k724M930j437n47j104m414
14379A6839o105n021O84N126M958J803J481k151N65L76k692l070j907N094O545
14364B2525l243k910j328l374j392k112J805L188K671j938O82k694o40k121l676
14349E443J497l03P218K806l323m175l619l425r55K709R21p96m95K035r888m609
14333h959j428J497J012O651J6011N84K715J966l945K962J467j634m332n706m798
14318D063Q466O121j64q40J090k890n639j010R201O244n130n324j593L278K513
$$ y = [11176, 7387, 6935, 8798, 10412, 14039, 12472, 12280, 13487, 18033, 13204, 11159, 7984, 15791, 23415, 22259, 26306, 24828, 26486, 28728, 33252, 40657, 49582, 49083, 47542, 38057, 29672, 22632, 19856, 26343, 27847, 24158, 16298, 10823, 9022, 10120, 13257, 16582, 19610, 22135, 19411, 24341, 22904, 22357, 21253, 16839, 10734, 5713, 6397, 11523, 16481, 18284, 19765, 17614, 18179, 18555, 15863, 12793, 10886, 15980, 22525, 19282, 16372, 15044, 11670, 10278, 8166, 9971, 13159, 15830, 13892, 14574, 11880, 11240, 9119, 5443, 6940, 6637, 13855, 16661, 13338, 9163, 5544, 2119, 1164, 3873, 4794, 3998, 3503, 5538, -4350, -8959, -10387, -8890, -7878, -1227, 14784, 15368, 18083, 20049, 16104, 19066, 20533, 18899, 14567, 8861, 4063, 12529, 18650, 18486, 17646, 18736, 15846, 10207, 9197, 18398, 24642, 19512, 14188, 12595, 15873, 18386]
14303A8386p12m657p254j359m331J066M309j993j271J5210l22j1510K266J1199
14289A9027q88m784k68j600j895o049J112p54N068j655K113M375J47k923N200
14274A6226o972l760M919P406n755k980M536J291P05O031k301o955R19L54l417
14259A0247k595N623O858N156p99j760o22l718j939Q74O242P643q32J232J627
14244C3237J209p367o946R48k467l451n452m985L325J489J059J007q086k04M592
14229G908P013K964J776K015j185m918M261K172O149J938J45k3m207o918l753
14214A5337L085M264K204j958k17k40K506j444n002L117K839N74K055K179l433
14199B5866n324n4n359P31Q572M864k162j0054o753j958N293K651m564l979L465
$$ y = [18386, 17674, 13017, 5763, 4404, 73, 1139, 5448, 3455, 2184, 17394, 17072, 5562, 7828, 19027, 18139, 13355, 13087, 11487, 9592, 3543, 4655, 3901, 8969, 7314, 9427, 13802, 13949, 11026, 16226, 9254, 5494, 10413, 17819, 12064, 9084, 13620, 14911, 15616, 21647, 19346, 12391, 13310, 13664, 10247, 7652, 13275, 20133, 25289, 24490, 22730, 22108, 18390, 16451, 17325, 23567, 31210, 30378, 31610, 33237, 34446, 27079, 20133, 21081, 18614, 15163, 9711, 4726, 8051, 9540, 10599, 11606, 3520, 3316, 7908, 14921, 17885, 19661, 21676, 20491, 15573, 19834, 22006, 28155, 30093, 30238, 30215, 26008, 19090, 15337, 18422, 22686, 24890, 22932, 22715, 22475, 24981, 23537, 18535, 21652, 24491, 25065, 27120, 29299, 25866, 20542, 20488, 15129, 15860, 24432, 29296, 27134, 17080, 10327, 8369, 13662, 16313, 11749, 7770, 11235]
14184A1235M660K535q40j94l594K867L105J705Q25k508j221o358J241k568j740
14169I150M773J0667L85n592l280k295J403J847l02k349L774j004M011K833l852
14154B0169N58K742k26j697p82m012K560J243j588j649m687J012R33n286j32M755
14138A3913L580k533K681K197J483j190j985J282o87p784J827J0261m184r25m353
14123A3583K043L382m010m803L543N613N045L485k899o8J127l327k2J454k636
14108B1510n526M255O027k95O23q327m056m167o592L523Q860L399N66K507r337
14093A2970l975N981L439J0323K239O8n134m978k274k307K044M27j751L631R63
14078B1666r2j697n670l36J316Q73Q9L227J461n580M06N801K868k590O51n394
$$ y = [11235, 15895, 18430, 17590, 17396, 13802, 16669, 19774, 21479, 22304, 19796, 18575, 12217, 13458, 10890, 9150, 13923, 24590, 24975, 19383, 16103, 13808, 15211, 17058, 16756, 14407, 18181, 17177, 21188, 24021, 20169, 20727, 23469, 23243, 21546, 20764, 16752, 19312, 20555, 18967, 17318, 12631, 13643, 14576, 9290, 9158, 13913, 17493, 14960, 17641, 19838, 21321, 20131, 18146, 19428, 18741, 10957, 12784, 23045, 18861, 17936, 13583, 15626, 19008, 14998, 10195, 13738, 19351, 24396, 27881, 24982, 24914, 26041, 22714, 22692, 24146, 21510, 15984, 20239, 26266, 25971, 26594, 18267, 14211, 10044, 3452, 6975, 15835, 19234, 19800, 22307, 12970, 8995, 14976, 18415, 28738, 30977, 31045, 25911, 20933, 18659, 16352, 18396, 18823, 17072, 20703, 21666, 21574, 19877, 14207, 13871, 15187, 16060, 16149, 19376, 20837, 15257, 15663, 21464, 24332, 21742, 22393, 16999]
14062A6999m753J143j18k596K556M110k168n996R67O247P310o112M538L996l574
14047B2549k132J944L949M34m884j752K761n724J712q9k341N17k093k348j402
14032A1101K762M602L025K617K838K011m216o254N280m338q867J0580R777n142
14018B5776n037o538p359q15P587J473J842m547P316K138k246K409L529N091K968
14003C3587n714J069m137n275l181P29J464p93Q818J2321j670l918n722p965J848
13988B1461M623m532k846K082J933k0k351n470N235O543ro281n722J050m001K726
13972A4421J896J210j583K395J70l617K257L222k16j273J31P605m16k906l296
13957B0000l96J522J239J548k672l251m459K778L222J77K476Q382L871R82k938
$$ y = [16999, 12246, 13389, 13271, 10675, 13231, 17341, 15173, 9177, 10144, 16391, 23701, 17589, 22127, 26123, 22549, 20417, 22361, 26310, 26744, 21860, 20108, 22869, 17145, 18857, 18768, 16427, 16944, 14851, 12503, 11101, 13863, 18465, 21490, 24107, 26945, 28956, 24740, 18486, 23766, 19428, 10561, 21141, 30918, 25776, 20739, 14201, 6842, 6027, 13614, 15087, 16929, 12382, 19698, 21836, 19590, 21999, 25528, 30619, 33587, 27873, 28942, 24805, 19530, 16349, 17078, 18542, 17749, 26567, 38888, 37218, 33300, 27578, 19613, 21461, 26084, 21552, 18706, 20788, 22721, 22701, 20350, 14880, 20115, 26658, 26649, 20368, 14646, 15696, 11695, 14421, 16317, 17527, 15944, 18339, 18509, 14892, 17149, 20371, 20155, 18882, 19013, 26618, 26202, 23296, 20000, 19604, 21126, 22365, 23913, 21241, 17990, 13531, 16309, 19531, 19708, 22184, 30566, 34437, 35419, 32481]
13942C2481k461n98l624k946K153L858J157L194L572O62j590k979J80r186m379
13927A9494M293m071j936K801Q424N095K618L019l525l477O62L861n813r63m6
13912C0436k506R91J081J120O81k790k201q240L321O69n56J842P381j820k764
13897B6645j864k029k901j071M112P2k079k265J816M181L55J398J859k307P04
13882B6626R17M33m309K01K396m326R83K284K191J205j073k281J30K683M125L299
13866C5484M174k484r290p96J674k239o257l817j107L25J3614N094m519m186J647
13851B7317n964o76O506L673O897o915M246J043n88j886k659l946L891M546M44
13836C5929l358m252j33l87K969n037m609J280O93J695P115M96l202m73l949l078
$$ y = [32481, 30020, 29422, 25798, 22852, 25005, 28863, 30020, 33214, 36786, 37448, 35858, 32879, 33059, 23873, 19494, 23787, 19716, 17780, 20581, 29005, 34100, 36718, 39737, 36212, 32735, 33397, 37258, 31445, 30482, 30436, 27930, 28921, 30002, 31122, 31803, 29013, 26812, 18572, 21893, 22562, 22006, 23848, 31229, 29409, 26645, 24781, 22752, 19851, 18780, 22892, 22964, 20885, 18620, 20436, 24617, 24972, 26370, 28229, 25922, 26626, 27543, 27976, 23667, 23868, 26264, 21938, 22921, 25205, 27396, 28601, 27528, 25247, 25377, 28060, 32185, 35484, 39658, 37174, 27884, 27088, 28762, 26523, 20266, 16449, 15342, 15667, 29281, 34375, 29856, 25670, 27317, 21353, 20677, 27183, 30856, 37753, 30838, 35084, 36127, 35539, 33653, 30994, 27048, 30939, 35485, 35929, 32571, 28319, 28186, 27799, 30768, 25731, 21122, 22402, 23095, 24790, 31905, 32401, 29199, 28726, 24777, 21699]
13820B1699R613L301m987l573n407K128N360R70Q82L17K608j612q059P900P633
13805C8773J258p4o563j383M293k296m799M34l865m679J469L555p374j748N07
13790A7508M783R398R369o82l847K605K373k585Q78m815N06K212M789K842k568
13775D2766o804k343P83P35p260n934P365L692J936L837k799K859M398K202O562
13760E1995o644j3602m539p65K199K699O33J900j818j280J280L567M235L685j807
13745D1738m679J966j376o776K925o04r525j8P440O017J551O432K126J36o647
13730D0706l853J613P999M240j244J970L613j422Q46M901L379m779k096j954J006
13715E4925Q766Q659k372L073M215N621R019J5559L2143L5367J2473p753k3615
$$ y = [21699, 31312, 34613, 29626, 26053, 20646, 22774, 28134, 29104, 29986, 30303, 32911, 31299, 23240, 31140, 38773, 40031, 39957, 33394, 32011, 36304, 34008, 29209, 29643, 25778, 21099, 22568, 26123, 18749, 17001, 17508, 22291, 31689, 41058, 40376, 36529, 39134, 41507, 38922, 39800, 34985, 35491, 37703, 42492, 45334, 42766, 35962, 33619, 34402, 35137, 27877, 21943, 29308, 33000, 34936, 38773, 35974, 38833, 43231, 45433, 51995, 45351, 31749, 27210, 26445, 28644, 31343, 31976, 33876, 32058, 30778, 32058, 35625, 39860, 43545, 41738, 37059, 39025, 37649, 30873, 33798, 33194, 23669, 23651, 31091, 37108, 38659, 45091, 47217, 47353, 40706, 36853, 38466, 46465, 50705, 49461, 51431, 55044, 53622, 54468, 59369, 62748, 57969, 55873, 53919, 54925, 63691, 72350, 69978, 73051, 77266, 82887, 91906, 107465, 139608, 174975, 187448, 179695, 156080]
13702A56080k3336j7830j5638j2375o051k573n55l867J267m594O258o27M648Q258
13688H9065L502p127r338J37k809p473K226K530K288l486K570N981J5287J3456
13674A06809M399j015j754J3848J2608P937N901J2021J5479K9671M1577N9359
13662C06840Q0490Q7567N3802k2779p9734q2884p0019m3456k6878k1186j1392
13651A70371p574l707j1302r306k289K082k510p091n682p973k756Q38J1791O411
13637A31303j405J914J045K20N436N954k024J0139J1491O042Q708N28l04j399
13623A77648N984J2067J2054J4222K7319N2674P7427R5027P5224j773p1762q9868
13611C86243p1360n3415m0791j9174j4091j0143q108l597p974n322q543r655r039
$$ y = [156080, 132744, 114914, 99276, 86901, 80850, 78277, 77722, 73855, 75122, 70528, 76786, 76159, 80807, 89065, 92567, 85440, 76102, 76239, 73430, 65957, 68183, 70713, 73001, 69515, 72085, 78066, 93353, 106809, 111208, 110193, 108439, 122287, 134895, 142832, 148733, 160754, 176233, 205904, 247481, 306840, 387330, 474897, 528699, 505920, 426186, 343302, 273283, 229827, 202949, 181763, 170371, 162797, 159090, 147788, 138482, 136193, 138275, 135765, 128674, 122992, 115019, 112263, 113101, 124892, 131303, 129898, 131812, 132857, 133077, 138513, 144467, 142443, 152582, 164073, 170115, 178823, 179351, 179047, 177648, 183632, 195699, 207753, 221975, 249294, 301968, 379395, 474422, 549646, 547873, 476111, 386243, 314883, 261468, 220677, 201503, 187412, 177269, 169161, 165564, 157590, 152268, 143725, 134070, 125031]
13598A25031l693l612p098o90n329K381L965J8o06J853l78m807l590M998r0M79
13582A08832J3213R119m341k661P365j174j968M179J5842J5189K0654K6092K7265
13569B37606O172k1018k5556k9053k1398j2942j2790m846j697J328p373n129o236
13556I7068M271Q476J419J07o845r737n371j269p674p746m142K200L764p35J177
13541G4963J443O747K511m336j788o329q28k886J105m585j179K247L343Q301l077
13526G5652j484m36J556m078k629j558m377k506O36M637M75m109m540l191Q19
13511E4867K356K562J067N255p72Q28j026L145l614l326l121o642K40M823J3872
13496G0514K305n107l158o924m876J875N576m754M019L696o054N436L373j048
$$ y = [125031, 121338, 117726, 110628, 109938, 104609, 106990, 110955, 110973, 110367, 112220, 111842, 107035, 103445, 108443, 108353, 108832, 122045, 131164, 126823, 124162, 131527, 130353, 128385, 132564, 148406, 163595, 184249, 210341, 237606, 243778, 222760, 197204, 168151, 146753, 133811, 121021, 116175, 114478, 115806, 108433, 103304, 97068, 101339, 109815, 111234, 111341, 104496, 94759, 89388, 88119, 80445, 72699, 68557, 70757, 74521, 73786, 74963, 76406, 83153, 85664, 81328, 79540, 73211, 72383, 69497, 70602, 66017, 64838, 67085, 70428, 78729, 75652, 74168, 73732, 75288, 71210, 68581, 67023, 62646, 60140, 60776, 65413, 65888, 61779, 57239, 54048, 54867, 57223, 59785, 60852, 66107, 65335, 66163, 65137, 68282, 64668, 61342, 58221, 51579, 51819, 56642, 70514, 72819, 67712, 64554, 57630, 52754, 54629, 60205, 55451, 59470, 63166, 57112, 62548, 65921, 64873]
13482F4873K050k959N083m880n874j709k70N161K970m084o89K098L005L616l724
13467F4667O02n33P904M406j53k92o693m364K24k80J808K863O083k09l781j211
13451G1041N972N527M313n269k369L222Q35j656N588J4196O653j255K464l496
13437A05766p14N715L936L724O308M806k212l276j980J214R454K993n642o268
13423A23824l205m4k082k715K486J961Q18R9K219O008J0995J6330J6680K8229
13409B01603K8387K9327L4428M2305L7061L7915L6288L0060L2842L8537N3251
13398F02004P4061J08987J70916K77558M35322O03193M98811l7099m96116n34837
13388A702800l74610k43857j69253j25485r1440o3870m6727l2181k9548k7252
$$ y = [64873, 66923, 63964, 69047, 64167, 58293, 56584, 56314, 61475, 64445, 60361, 59672, 61770, 64775, 68391, 64667, 65269, 64736, 72640, 77046, 76893, 76601, 69908, 65544, 65768, 65488, 67296, 70159, 76242, 76033, 72252, 71041, 77013, 82540, 86853, 81584, 79215, 82437, 83272, 81616, 87204, 101400, 108053, 106798, 109262, 105766, 105052, 110767, 114703, 118427, 124735, 129541, 127329, 124053, 122073, 123287, 132741, 135734, 130092, 123824, 120619, 120575, 118493, 115778, 118264, 120225, 121043, 121142, 123361, 129369, 140364, 156694, 173374, 201603, 229990, 259317, 293745, 336050, 373111, 411026, 447314, 477374, 510216, 548753, 602004, 676065, 785052, 955968, 1233526, 1668848, 2272041, 2770852, 2733753, 2237637, 1702800, 1328190, 1084333, 915080, 789595, 698155, 634285, 587558, 555377, 525829, 498577]
13378D98577k3570k8148j8184j9946j5535p610j2408o427j0934r207p992K264
13366C40880Q43K003Q059J1090J0887J3832O490J224j2355j3433j3730j0820j8578
13353C26392k0103j3142j1479r911k814m492j4325q035o587r953j7779j3620q488
13340A85664j3740j9082r754j928q32n171j933J269P37j911j445l263L992L505
13326A36108k353m771K046L404k135K137J3140P139N080J33k28k221L861Q478
13312A69818K80k736l456o9Q098j18o097p357l034q340q726m939n821j091O20
13297A27032l875r161o254n864p959j1223j3811j2435N58K768l421n38M995O339
13283F7151J3838J236k996J030O7M634N517m237j831n512n024o779o454l186k799
$$ y = [498577, 475007, 446859, 428675, 408729, 393194, 385584, 373176, 366749, 355815, 346608, 338616, 340880, 341723, 343726, 351785, 362875, 373762, 387594, 394084, 395308, 382953, 369520, 355790, 344970, 326392, 306289, 293147, 281668, 271757, 268943, 264451, 250126, 242091, 235504, 225551, 207772, 194152, 185664, 171924, 152842, 143088, 141160, 140328, 135157, 133224, 134493, 135230, 133319, 131874, 128611, 132603, 136108, 133755, 128984, 131030, 134434, 132299, 134436, 147576, 154715, 159795, 159928, 159700, 157479, 161340, 169818, 170098, 167362, 163906, 163837, 171935, 171817, 165720, 158363, 155329, 146989, 138263, 133324, 127503, 126412, 127032, 123157, 113996, 107742, 101878, 93919, 82696, 68885, 56450, 57008, 59776, 56355, 55817, 60812, 67151, 80989, 82225, 79229, 80259, 80326, 84960, 90477, 86240, 84409, 78897, 73873, 67094, 60640, 57454, 54655]
13268E4655K090M30o541r758r401j2245j8660k2181k1093k1113K986N1827O2790
13255E3786M2608K5653R675M010n103p873L601J8103J4736Q11j2249j324k605
13242A43829o412k611K394O21Q01n221L161J0492R495Q310J1268N028O311O604
13228A94070M771J931k935o206j0838n664p991k468p825j5004n398J0120J2808
13215A59371J1554M118L051P895N682l57N65M379J1870R604P508P271o29p378
13201B24504N91Q788J490K348O614O503J3007K3020K5270L3208M0755L8269M6263
13188D70630N4852O4983O8565Q0123P9678O9987N5771N6175N2488K179m1903r9849
13176I13679r0638n6834n1897p0573p6702o4172l6621k4982k5776j9526j1601
$$ y = [54655, 56745, 57175, 50634, 40876, 31475, 19230, 570, -21611, -42704, -63817, -60831, -9004, 53786, 96394, 122047, 131722, 135732, 130629, 122756, 126357, 144460, 159196, 160007, 147758, 146434, 143829, 137417, 134806, 137200, 137821, 138622, 133401, 136562, 147054, 156549, 164859, 176127, 181155, 187466, 194070, 198841, 200772, 197837, 191631, 180793, 175129, 167138, 164670, 156845, 141841, 136443, 146563, 159371, 170925, 175043, 178094, 185989, 191671, 191314, 191879, 196258, 208128, 217732, 225240, 232511, 231882, 224504, 225095, 233883, 235373, 237721, 244335, 250838, 263845, 286865, 312135, 345343, 386098, 424367, 470630, 525482, 590465, 659030, 739153, 818831, 888818, 944589, 1000764, 1053252, 1055431, 1013528, 913679, 823041, 766207, 714310, 643737, 567035, 502863, 466242, 441260, 415484, 395958, 384357]
13165C84357j4796j5500j2133j1226n125r257j2077j0172J240J572j2689j0945
13153B73249r383p445l442k924L439M847L865l202l451R490J6596J0702k677q816
13139B80848l062M448R465M485j1004j9729j4263K787O453p618j704k41R857N633
13125B66355n603n198j1027o323O663K3462J5389N651M323k247j1014j4842m998
13112B60591J1510J7618K0499Q877j1837k405K0597L1038K9780K0494J929r385
13100C99306n913j2151j9801j1579J36r05q95Q981P200L739N135N526N070J6657
13086D00506K5148K8168J2458M930J3022N968P366K8014L5817K3454j38k5037
13074E59676k6414k1249J836J9971K8365J6910J6929K5431J5199n197q755l854
$$ y = [384357, 369561, 354061, 341928, 330702, 325577, 316320, 304243, 294071, 295311, 296883, 284194, 273249, 263866, 256421, 252979, 250055, 253494, 258341, 262206, 259004, 255553, 265043, 281639, 292341, 289664, 280848, 277786, 282234, 291699, 296184, 285180, 265451, 251188, 253975, 260428, 252810, 251106, 250865, 260722, 266355, 260752, 255554, 244527, 238204, 244867, 268329, 283718, 289369, 293692, 291445, 280431, 265589, 260591, 272101, 289719, 310218, 319095, 307258, 304853, 325450, 356488, 386268, 406762, 408691, 399306, 393393, 381242, 361441, 349862, 349998, 349093, 348198, 357179, 364379, 368118, 373253, 378779, 383849, 400506, 425654, 453822, 466280, 471210, 484232, 490200, 497566, 525580, 561397, 584851, 584713, 559676, 533262, 512013, 513849, 533820, 562185, 579095, 596024, 621455, 636654, 631457, 622702, 618848]
13062F18848q509o723K1005L7662N7647P5423P9690M6377n16m1992p2943j24982
13050F80987j77995j53496l6055L6209M5087M0361L3384K8457L3216K9448K4314
13039E83917K0475K2716K9302K8707L4033L0465J5490J430M330K1748K3219K1927
13027H37759J5037J8302J0245J542O482J6729L5593N7965Q1234Q1332Q5038O4510
13015A311768M8717P3158Q7861R2712R7094R3051P3824M8308K4697J4935J1065
13004A977190K3134L3249N6884O0625N2936M8204N3140O1604O3558M7366K8648
12993B506538K7645N1260M8449L8294N0793P9342R6023Q9124O6207N4217N2068
12982C159960O5452J05131J36490J23515Q9221O8107O1848O5214N3460Q1193J44599
$$ y = [618848, 610339, 603616, 624621, 662283, 719930, 795353, 875043, 921420, 920904, 878912, 805969, 680987, 502992, 349496, 313441, 349650, 394737, 435098, 468482, 496939, 530155, 559603, 583917, 604392, 627108, 656410, 685117, 719150, 749615, 765105, 766535, 770865, 792613, 815832, 837759, 852796, 871098, 881343, 882885, 889367, 906096, 941689, 999654, 1080888, 1162220, 1247258, 1311768, 1360485, 1433643, 1521504, 1614216, 1711310, 1804361, 1878185, 1926493, 1951190, 1966125, 1977190, 2000324, 2033573, 2090457, 2151082, 2204018, 2252222, 2305362, 2366966, 2430524, 2477890, 2506538, 2534183, 2585443, 2633892, 2672186, 2722979, 2802321, 2898344, 2987468, 3053675, 3107892, 3159960, 3225412, 3330543, 3467033, 3590548, 3679769, 3747876, 3809724, 3874938, 3928398, 4009591, 4154190]
12971D154190J97971J97693J94023K07731K07292K14771K00340J65871J88168
12962E928050K42640L14281L32683L07217L09283L56246M20689N03713N76439
12953I291241O51508P77041R74302J182339J362925J471112J633982J930494K400808
12944B1675752K967724L520738M166004N059665O108885P028226P553191P346240
12936F5426425O479802N799639N824760P024687R666989J3802544K0408354L1387395
12928A65820595M9566385P8512772J10568105R2052407k843778q7510703r9422216
12921C06743567p1855342m6571815l1044209k1685675j5644179j1690537r118760
12914I9133050p175391n623676m517100m231763m203504l804418l172373k689938
$$ y = [4154190, 4352161, 4549854, 4743877, 4951608, 5158900, 5373671, 5574011, 5739882, 5928050, 6170690, 6484971, 6817654, 7124871, 7434154, 7790400, 8211089, 8714802, 9291241, 9942749, 10719790, 11694092, 12876431, 14239356, 15710468, 17344450, 19274944, 21675752, 24643476, 28164214, 32330218, 37389883, 43498768, 50526994, 58080185, 65426425, 71906227, 77705866, 83530626, 90555313, 100222302, 114024846, 134433200, 165820595, 215386980, 293899752, 404467857, 496520264, 493676486, 406165783, 306743567, 234888225, 188316410, 157272201, 135586526, 119942347, 108251810, 99133050, 91957659, 86333983, 81816883, 77585120, 73381616, 69577198, 66404825, 63714887]
12906F3714887k286683j927677j688687j543173j373058j146855q43979n52821
12898E2351954l56684k07173n6374K21177N87033P65822K24808o30195j185044
12889E1715324j705109k094192k341004k504112k532081k422692k245615k082290
12881C3788229j912018j779495j657615j518617j418419j372497j334675j273041
12873B1521852j186347j096771j019001r51904q56501p91675p79191p47847p20527
12864A3372088o83247o26424n68057n25966n20749n06459m83823m44917m25039
12855H587407m25200m17144l74721l22805l12039l10148k99797k65719k44463
12846E615371k42365k52054k54938k54890k55124k32995k09124j76539j44163
$$ y = [63714887, 61428204, 59500527, 57811840, 56268667, 54895609, 53748754, 52904775, 52351954, 51995270, 51788097, 51731723, 51952900, 52539933, 53305755, 53530563, 52900368, 51715324, 50010215, 47916023, 45575019, 43070907, 40538826, 38116134, 35870519, 33788229, 31876211, 30096716, 28439101, 26920484, 25502065, 24129568, 22794893, 21521852, 20335505, 19238734, 18219733, 17267829, 16411328, 15619653, 14840462, 14092615, 13372088, 12688841, 12062417, 11494360, 10968394, 10447645, 9941186, 9457363, 9012446, 8587407, 8162207, 7745063, 7370342, 7047537, 6735498, 6425350, 6125553, 5859834, 5615371, 5373006, 5120952, 4866014, 4611124, 4356000, 4123005, 3913881, 3737342, 3593179]
12837C593179j34521j31002j37812j44397j49468j36685j15674q4979q8671j01698
12827B368272j05978j24915j27312j20617j04068r7960j00325p9648o1968o7268
12817A378213p5262p8095m9682k7133n352J4778K2525K4354L0696L3850M8036
12806A316928O4289O8981N9890N9669Q5178J09430P9828k7176j72459k54010k57964
12795A132584k53522j98195j25105p1969m1821k9069l1289l7332l1388l1667j7056
12784B64171k0058r715M766J7746J7459K2744K4437J3309J219q366k9508l1036
12772B67168j889K6029M4985M2473K7783L2846L7742M5015N8167O1539N1819M8308
12760G41985L6947L6345L2269J7343J5835J5402J9971J7344J1527M59j218O45
$$ y = [3593179, 3458658, 3327656, 3189844, 3045447, 2895979, 2759294, 2643620, 2558641, 2469970, 2368272, 2262294, 2137379, 2010067, 1889450, 1785382, 1687422, 1587097, 1507449, 1445481, 1378213, 1302951, 1224856, 1175174, 1148041, 1142689, 1157467, 1179992, 1204346, 1235042, 1268892, 1316928, 1381217, 1450198, 1510088, 1569757, 1654935, 1764365, 1844193, 1817017, 1644558, 1390548, 1132584, 879062, 680867, 555762, 483793, 441972, 412903, 381614, 344282, 312894, 281227, 264171, 244113, 234398, 239164, 256910, 274369, 297113, 321550, 334859, 336078, 327712, 298204, 267168, 265279, 291308, 336293, 378766, 406549, 439395, 477137, 522152, 580319, 641858, 693677, 741985, 778932, 815277, 847546, 864889, 880724, 896126, 916097, 933441, 944968, 945427, 944209, 944854]
12748I44854m952p363p703O14J6100K8798K2257L037q480r99J1130O783r36j6806
12734I86334l8346k3362l383n231m530K26P104K834j5241l0485k6029j5554r649
12721H24688j7377k0964k1266j7306r250k1530l3780m1307k7167r146j0731j3499
12709E81365j5922k3426k5745n964j382p363j0485j7653j1540j2574n741j2689
12697D30881j1062j8667k5880j7065j6447q671q901l818o600j2140o248k414n196
12684B87772r41L264k34O500J3588J8662J7638k520j168J5507K3351J6696O874
12671D04989j2602l3309m1953m6362m3999l7658l0667l1156j8299j6159j5290
12660G7535j0734q02R50o121o821l939j0571j6401l261j2150j3052M11p687j2015
$$ y = [944854, 939902, 932539, 924836, 925450, 941550, 970348, 992605, 995642, 987162, 986163, 997293, 1004076, 1003140, 986334, 947988, 924626, 921243, 916012, 911482, 911708, 918812, 921646, 906405, 875920, 849891, 834337, 824688, 807311, 786347, 765081, 747775, 738525, 716995, 683215, 641908, 614741, 605595, 594864, 581365, 565443, 542017, 516272, 510308, 508926, 501563, 491078, 473425, 461885, 449311, 443570, 430881, 419819, 401152, 375272, 358207, 341760, 333089, 324188, 320370, 313770, 301630, 295382, 292968, 287772, 286831, 290095, 289861, 296361, 309949, 328611, 346249, 343729, 342561, 358068, 381419, 398115, 404989, 392387, 359078, 317125, 270763, 226764, 189106, 158439, 127283, 108984, 92825, 77535, 66801, 65999, 66949, 60828, 54007, 50068, 39497, 23096, 19835, 7685, -5367, -4956, -12643, -24658]
12646b4658l230o421P906N005Q699M324M743J40L631O623R001O179J6693J6421
12632E5056J3064J514M185n91q180N232k067p287j0249P457K458l53N276N428
12618G0943N963R133N456J5604K6181K0430M274K806P490N611K596o741j0171
12605A59575Q07l742k294m423P152J0438M237k218p094M620Q470K8963M7390O3453
12591C15334M9075N679j7523k3857k4940k0322j6390j2256k922m216p299j0394
12579B29969l247o791m460m847q741n888j05p693L894k524j1728l172M206J590
12565A80463K443Q78O081n366k571k019j570k14K205m055n218o604j1510o156
12551A46787m452o018j923l263o870q198o981l306j119k532o024p639j1584j2383
$$ y = [-24658, -27888, -34309, -26403, -21398, -12699, -8375, -3632, -3492, 139, 6762, 15763, 21942, 38635, 55056, 68120, 69634, 73819, 73228, 65048, 70280, 68213, 60926, 50677, 58134, 60592, 60239, 65515, 70943, 76906, 86039, 91495, 107099, 133280, 153710, 157984, 160790, 168280, 173891, 176487, 169746, 159575, 160382, 156640, 154346, 149923, 157075, 167513, 171750, 169532, 162438, 167058, 175528, 204491, 251881, 315334, 364409, 370088, 352565, 328708, 303768, 283446, 267056, 254800, 251878, 247662, 240363, 229969, 226722, 219931, 215471, 210624, 201883, 195995, 195890, 188197, 192091, 189567, 177839, 174667, 178873, 180463, 182906, 183784, 189865, 184499, 181928, 179909, 178339, 178125, 180330, 176275, 171057, 164453, 152943, 146787, 142335, 136317, 134394, 131131, 124261, 116063, 109082, 105776, 104657, 102125, 96101, 88462, 76878, 64495]
12537F4495p757J277n528j018o820q062n480m072K152L538J98K716j194J503m253
12522C1695K362L191o518J996P587N470n720l087k075K863k006k138J502k051
12508C3071n91l555p196m196n273j33j207n373k574K160R597N651N594k869q182
12493A4924K27j360K32N940N490m238N056J5716J9445J5645J0377J2100P740O319
12479A13613l07M761L626N196L420P309J1234O324J4897J1884J3328J6996K5638
12466B37919K4156K5742L4897L6436L2035K5776L0706M2072M5161N4123N6424
12455F45447Q6979J40853K32018L68183N51846O05948J99359l74463n68345m48718
12445A439107k89832j88910j30434r3701o5853n3926m0837k8942j9864k0377k3640
$$ y = [64495, 56738, 58015, 52487, 51469, 44649, 36587, 31107, 27035, 29187, 32725, 32923, 35639, 34445, 35948, 31695, 34057, 37248, 30730, 32726, 40313, 45783, 40063, 36976, 34901, 37764, 35758, 33620, 35122, 33071, 32480, 28925, 21729, 17533, 12260, 12127, 10920, 5547, 2973, 5133, 14730, 20381, 25975, 23106, 14924, 15151, 13791, 14023, 19963, 25453, 21215, 26271, 41987, 61432, 77077, 87454, 99554, 107294, 113613, 113306, 118067, 121693, 126889, 130309, 137618, 148852, 155176, 170073, 181957, 195285, 212281, 237919, 262075, 287817, 322714, 359150, 391185, 416961, 447667, 489739, 534900, 589023, 645447, 732426, 873279, 1105297, 1473480, 2025326, 2631274, 2830633, 2456170, 1887825, 1439107, 1149275, 960365, 829931, 736230, 670377, 616451, 575614, 546672, 526808, 506431, 482791]
12434D82791k7957j7460j5357j3255k0327j7863q654p089q802j1048m973j197
12422C28809l921p888r68k469n280m24l778j2016p519l151r774j7178j3488j8317
12408B22638o051o758p992n395j0939j9259r481j2601j4124p668n261n781o516
12395A04812o616k815j0445j0253p287l072j765m574n781r821k390j807j404J026
12381C7808O652q87M400l762j1174r60K003N13J007k563l719k666l299q137l498
12366A1718P940L112j856k383l822m39m45N47K174K612l50j119j296j440p63k8
12350A4162o47Q01q32J448J609L471R60Q512k861j172q638k178O521K488O346
12335B9990K469k836n350J320J2470J560p273k221j725o844k894M267P265J201
$$ y = [482791, 454834, 437374, 422017, 408762, 388435, 370572, 361918, 354829, 346027, 334979, 330006, 328809, 324888, 317000, 316032, 313563, 308283, 307859, 304081, 292065, 284546, 281395, 271621, 254443, 240955, 222638, 216587, 209829, 201837, 196442, 185503, 166244, 156763, 144162, 130038, 122370, 117109, 111328, 104812, 98196, 95381, 84936, 74683, 67396, 64324, 62559, 57985, 52204, 42383, 39993, 38186, 36782, 37808, 44460, 43573, 47973, 44211, 33037, 32077, 34080, 34593, 35600, 33037, 29318, 26652, 23353, 15216, 11718, 19658, 22770, 20914, 18531, 14709, 14270, 13825, 14372, 16546, 19158, 18808, 17689, 16393, 14953, 14190, 14162, 13515, 14316, 13484, 14932, 16541, 20012, 20972, 29484, 26623, 25451, 16813, 14635, 21156, 23644, 29990, 32459, 29623, 24273, 25593, 38063, 39623, 32350, 30129, 28404, 21560, 18666, 22933, 30198, 31399]
12321C1399P840k854M59R19R33l381l748o729J047N131m20L51n375j408K101k195
12305B4070k492L627m70J748q688q883m821L357N088l553J706M02m411k754L77
12290D303N623P572q20n204L813J317j613M962r153r465k463M43M886K165K12
12275F578K86M042M949K019j0964o756M002L28j866j25l440n852q0Q58o303j502
12259a3826J824j053L446P6m655p73L091J32M021j599m200l186M348k324N377
12244i301L80K550m10M82M011J219l06L906P052l121r070m18K364k938Q62N263
12228B525m039q250L578K209o64n620j0094O939O097q61O34N419P83k742L399
12213f87M263m812r274n712J1431N389K328j576j346L396N219N067j724j0906
$$ y = [31399, 39239, 36385, 36844, 37763, 38696, 35315, 31567, 24838, 25885, 31016, 30596, 30947, 25572, 24164, 26265, 24070, 21578, 25205, 24735, 26483, 17795, 8912, 4091, 7448, 12536, 8983, 10689, 11091, 6680, 3926, 4303, 9926, 17498, 16678, 11474, 15287, 16604, 14991, 19953, 10800, 1335, -1128, -685, 4201, 6366, 6578, 6864, 10906, 15855, 17874, 6910, 154, 4156, 4484, 2618, 2493, -947, -6799, -6879, -6021, -12324, -13826, -12002, -13055, -9609, -9533, -14188, -14961, -11870, -11738, -7717, -9316, -13516, -16702, -12354, -14678, -9301, -8921, -6371, -6781, -6299, -2288, -1069, -1375, 2531, 9583, 6462, -2608, -3026, -662, -3600, -2738, 2525, -1514, -9764, -6186, -3977, -4641, -10261, -20355, -13416, -7319, -8180, -7546, -2127, -1344, -4086, -687, 3576, -1236, -10510, -16222, -4791, 598, 2926, 1350, 4, 3400, 8619, 13686, 11962, 1056]
12199A056o158n35L836l389N986M354L157P491m487l004l87J94K940j112k290
12184G652J246L324m445l601NK984P5p066k787n65k134N35j383K163N280m354
12168c071j368N644M534M83J065J001m575r05O549N124j003L56N159n302j862
12153A1829J178r62n705q311k69K572P809J27j0048L35L381P05l814k074N270
12138B023l287l223j999l611k007N747j296m892k294j264j783j796l15J868J1
12123a8118M168L326M19m73N663j529k969L759J054K6L96m43o294n817L832Q503
12107d497M703J177M51L021n230r941r288k130J346M241M244Q07M294q028J471
12092a3359K862k932J368M523p32j409p608l266M139P064L685n700O50Q180N342
$$ y = [1056, -5102, -5637, -1801, -5190, 796, 5150, 8307, 15798, 11311, 8307, 7920, 8114, 11054, 9942, 7652, 8898, 12222, 7777, 4176, 4181, 7165, 7240, 174, -2613, -3178, -5312, -4777, -6160, -3997, 1283, -3071, -4439, 1205, 5739, 6222, 7287, 8288, 3713, 2808, 9357, 14481, 13478, 13834, 18993, 13691, 11829, 13007, 12045, 6340, -1971, -2240, 332, 8141, 8268, -1780, -1445, 1936, 2641, -1173, -3247, 2023, -1264, -4487, -6486, -10097, -12104, -6357, -7653, -12545, -14839, -16103, -17886, -19682, -19997, -18129, -18118, -13950, -10624, -10205, -10678, -5015, -6544, -9513, -5754, -4700, -4674, -4278, -4721, -11015, -16832, -13000, -4497, 206, 1383, 1834, 4855, -375, -10316, -19604, -21734, -20388, -16147, -11903, -11096, -6802, -14830, -13359, -10497, -13429, -12061, -7538, -8270, -9679, -17287, -20553, -16414, -9350, -5665, -11365, -10715, -2535, 2807]
12077B807n952m505N5J875J4497N691j3847o242k120k059l484j882m51K323K445
12062a0849O585L957m54J89k986P56J937Q038j623o855L600R85k320l632K55k29
12046b646M737j229l478J028k03L871l295J868K097m80j224o624L647l230k187
12031g348p66N166L14K78Q97j229N805j068J222m124k104j306l872K031q46J877
12015e073J224K538k114q705N79j49k076k35k574j630k98p75R468M076l31J377
11999d698J471j718o401n319k064L331O173P67p779N932K460Q57j418J178P06
11984f522J6j777r622k223k093L342K046K767J720J162K769l942j49J957Q34K412
11968g303n896l031m74J762J703j704J212q60j319k313p62M759k851m472l676
$$ y = [2807, -3145, -7650, -7595, -5720, 8777, 14468, 621, -5621, -7741, -9800, -13284, -15166, -15617, -13294, -10849, -4264, -307, -761, -572, -3558, -2802, -865, 7173, 5550, -1305, 2295, 3280, 960, -2672, -2417, -2646, 2091, 862, -2616, -1588, -1791, 2080, -1215, 653, 2750, 2270, 1046, -5578, -1931, -5161, -7348, -8114, -2948, -2634, -2356, -1459, -2688, 3117, 2049, 3271, -853, -2957, -4263, -8135, -6104, -6950, -5073, -3849, -1311, -3425, -12130, -11551, -11700, -13776, -14011, -16585, -18215, -18513, -19288, -9820, -5744, -6075, -4698, -3227, -4945, -11346, -16665, -18729, -15398, -9225, -8458, -16237, -10305, -7845, -6988, -8406, -7228, -6522, -6506, -8283, -17905, -20128, -22221, -18879, -16833, -14066, -12346, -11184, -8415, -12357, -12506, -10549, -9715, -7303, -13199, -16230, -16704, -14942, -13239, -14943, -13731, -14591, -15910, -18223, -18985, -14226, -17077, -21549, -25225]
11953b5225K52P71P585P953J912R84k161K341l262m726L066L409N805l115k630
11938g041J522k38o364j478L001O979N519p369r342L09J875K048N763K201J492
11923a123K30l087n256L08J561O673k318r334j364k492Q902L947j0737J346Q147
11908d597m12j358N383P324l546l364n708m845K803Q002K87j0780k952K591P031
11893d141j580j055j620K645k820L380L568L078m462p461P57o6o949k929L455
11878a6200J83M11q20l23K185k730j079j105j560N19N075J473j8k152l173j031
11862b0345n802P07K844m48P08K416j548Q36j049K554n351j92J045K544L164p06
11846a8623O47L113J865m852K325L561r628J418O436o71q57M676L489q832j886
$$ y = [-25225, -24973, -24202, -16617, -8664, -6752, -5768, -7929, -5588, -8850, -13576, -10510, -7101, -1296, -4411, -7041, -5519, -5757, -12121, -13599, -10598, -3619, 1900, -5469, -14811, -14502, -12627, -10579, -4816, -2615, -1123, -893, -3980, -9236, -8928, -7367, -694, -3012, -12346, -13710, -16202, -7300, -3353, -14090, -12744, -4597, -5009, -6367, -984, 6340, 2794, -570, -6278, -11123, -8320, -318, -31, -10811, -13763, -11172, -4141, -5721, -6776, -8396, -5751, -8571, -5191, -1623, 1455, -3007, -10468, -9711, -9777, -16726, -19655, -16200, -16017, -15606, -16426, -16749, -14564, -17294, -18373, -19478, -21038, -20519, -15444, -13971, -13989, -16141, -19314, -20345, -26147, -25440, -22596, -23044, -22336, -19920, -21468, -20632, -21681, -19127, -24478, -24670, -23625, -21081, -17917, -18623, -17976, -14863, -12998, -17850, -15525, -11964, -21592, -20174, -13738, -14409, -15266, -10590, -7101, -15933, -17819]
11831a7819O451J1303j683k895n088k812m582k624p053R45J55l363L805M482M818
11816a5960J357l949K570Q86K420m300l2K619M515N124M124p421j2101j17O641
11801a3624J72l696R35J087K565j251M58l495J751k605N84j462n67j609K247K596
11785a5914m84R331n71j494J647P036o60p305p221j406L018N442j311j681N366
11770f207M137J426r829o787J577O283N458k090m543o970j010O769N198n29L730
11755c387m252l457p395k200P224P984N05j0267j283L908k978l225P945L909J279
11740e690l842l292j676M272L76p375p47j283k92M593j851k43O053L844k450l403
11724a3006m863M110K829j102L848j777K212p033m60N279L152k819r58m993q89
$$ y = [-17819, -11368, -65, -1748, -4643, -9731, -12543, -17125, -19749, -26802, -25857, -25702, -29065, -25260, -20778, -15960, -14603, -18552, -15982, -15096, -12676, -16976, -17008, -14389, -9874, -4750, -626, -8047, -20148, -20265, -13624, -13452, -17148, -16213, -15126, -12561, -13812, -13354, -16849, -15098, -17703, -17119, -18581, -19148, -20757, -18510, -15914, -16398, -7067, -7638, -9132, -7485, -449, -1109, -8414, -15635, -17041, -14023, -8581, -9892, -11573, -6207, -2070, -644, -10473, -17260, -15683, -9400, -3942, -6032, -10575, -17545, -18555, -11786, -6588, -7117, -3387, -7639, -11096, -18491, -20691, -13467, -5483, -4978, -15245, -16528, -12620, -15598, -18823, -10878, -6969, -5690, -9532, -12824, -14500, -10228, -9852, -17227, -17974, -19257, -19549, -14956, -16807, -17050, -10997, -7153, -9603, -13006, -17869, -13759, -10930, -12032, -8184, -9961, -7749, -14782, -15242, -9963, -6811, -9630, -10588, -15581, -16470]
11709a6470L84Q1O042r70l442K543N94M847j624r035k710K116L697L742o043j817
11693a8065K164k241P67O733K06k758n98L992Q385L923k375n436M23j142k547
11678h569j407l598L7K782m967j781L257Q411M122l518K849k453k747K459J834
11663c289r83m494l727j542K286m7o179k198Q38n559K902J040j701n20R78o38
11647b2833M857P482J783n543m125J0872L488m369l585P47p867Q74J869l545n06
11632b0401q28M705P278o93L360j236k972L132P73M618J214k070k721L321n405
11617g925j676k000L129q93p297J425N688Q21n935J079M07l62q85m908K468N840
11601a1024M380K484K898R80M067J11N838J995r817j2751l201m177r85M587K591
$$ y = [-16470, -16086, -16005, -9963, -10933, -14375, -11832, -11238, -6391, -8015, -17050, -19760, -17644, -13947, -10205, -16248, -18065, -15901, -18142, -17375, -10642, -10436, -13194, -13792, -9800, -1415, 2508, 133, -5303, -4880, -6022, -8569, -9976, -13574, -13537, -10755, -15722, -17503, -14246, -5835, -1713, -5231, -2382, -4835, -7582, -5123, -3289, -4272, -8766, -12493, -14035, -11749, -11796, -17975, -20173, -19335, -24894, -21992, -20952, -22653, -23173, -22195, -22833, -17976, -10494, -8711, -14254, -18379, -7507, -4019, -8388, -11973, -11226, -19093, -18219, -16350, -19895, -20401, -21229, -16524, -9246, -9939, -6579, -7815, -10787, -7655, -6882, -2264, -1050, -3120, -5841, -2520, -7925, -9601, -11601, -8472, -9365, -16662, -15237, -9549, -8728, -14663, -13584, -13177, -13539, -14424, -19332, -16864, -11024, -6644, -4160, -1262, -282, 3785, 3896, 9734, 11729, 1912, -10839, -14040, -18217, -19202, -14615, -12024]
11586a2024m964K634M466R17k881j774l992P276N913l933o366p175M1P013M981
11571i868J680l921o287O741N580K585m267l920L159M572K842O942j312q318l130
11556f922m903N109L146K527P89M07n297o448j951N338K637j751m08j261L195
11541e793N023M3m027m06q754l712N335K620N978j030j0459p95J938l28M93k625
11525a6499m44j006k47K255J831n642n787M483K720M458N872O365O862j859n511
11510b149p155j1104j431L658q54R28J52L756M582L564L338P04J059o438p569
11495a4959j804L544j744M854L55J800J288j601p25M037l969o979L735k49p57
11480a3174L684K614l943J673M015k340k545r31O85K933k200J665L953j830r67
$$ y = [-12024, -16988, -14354, -9888, -8971, -11852, -13626, -17618, -10342, -4429, -8362, -14728, -21903, -21862, -14849, -9868, -8188, -12109, -18396, -11655, -6075, -3490, -7757, -11677, -8518, -3946, -1104, 5838, 4526, -3792, -6922, -11825, -6716, -3570, -1043, -254, 153, -5144, -11592, -13543, -8205, -5568, -7319, -7727, -8988, -5793, -770, -727, -4754, -5160, -13914, -17626, -12291, -9671, -3693, -4723, -15182, -15977, -14039, -14367, -13874, -16499, -16943, -17949, -18196, -15941, -14110, -19752, -25539, -21056, -18336, -13878, -8006, -1641, 5221, 3362, -2149, -9304, -20408, -21839, -18181, -19035, -18107, -17955, -14199, -9617, -6053, -2715, -2011, -952, -7390, -14959, -16763, -13219, -14963, -10109, -9754, -7954, -6666, -8267, -8992, -4955, -8924, -15903, -12168, -12417, -13174, -9490, -6876, -10819, -9146, -5131, -7471, -10016, -10947, -10262, -7329, -9529, -7864, -3911, -5741, -6708]
11465f708m29l394j334N55J304l539L594O06P32l136m857M121R686l397m431J084
11449i543j741k136o516n713L050J889O861J616O986K330r568l624O721M286m445
11434i547m905j366R21P996K229l170K084j60J576k092n498m085l365M789L641
11419a0952M509L353M444p41n105k394o052K485J625K424k081l925j556L181Q325
11404b460N004o259J82P892m419m139m912o100j745N643O123L261n221o311j658
11389a5119N318R878j591p128l874J37L264M293q539o247Q75L633L238N724O469
11374C31j042R17l103M65j058k64n925n658k122L609N595J605J288m131p160J174
11358a5479J210K455r593M507R587Q735m314p839l005L97P687N25p634k108P00
$$ y = [-6708, -7137, -10531, -11865, -11310, -10006, -13545, -9951, -9345, -8613, -11749, -16606, -12485, -2799, -6196, -10627, -9543, -11284, -13420, -19936, -25649, -22599, -20710, -13849, -12233, -5247, -2917, -12485, -16109, -9388, -5102, -9547, -14452, -15818, -14897, -6901, -4672, -7842, -5758, -5918, -4342, -6434, -11932, -16017, -19382, -14593, -10952, -6443, -3090, 1354, 613, -4492, -6886, -12938, -10453, -8828, -6404, -8485, -12410, -13966, -10785, -2460, 2544, -3715, -3533, 4359, -60, -4199, -9111, -15211, -16956, -11313, -5190, -1929, -7150, -13461, -15119, -9801, 77, -1514, -8642, -12516, -12379, -9115, -4822, -13361, -19608, -18733, -15100, -11862, -6138, 331, -711, 206, -2897, -2432, -3490, -3754, -9679, -15337, -17459, -13850, -8255, -6650, -5362, -9493, -16653, -15479, -14269, -11814, -21407, -16900, -7313, 1422, -2892, -10731, -13736, -13339, -5652, -5127, -12761, -14869, -14169]
11343a4169j59P18J38k209K577O738M504m135n622n193k199j978J1638L08J507
11328g536j612K215Q321k887j0094o260J463L302J775l236n975j48R609J769k539
11313a1833n080R561Q721m633l927L985l61j1039j677L331P58n22l861j0990M802
11298b2765J0380L296K393L212J133J30k088l419k509m282J425M546M334K803
11284a411m216n887j685K540K969l973j65j924k675M138K55J851J926o906k970
11269a8133L277L640L220j742k459n20m250n09M711M929L107q904K806L150J189
11254f488k389j424k226m31O971O955l32n258m448l239o577L775m28n149k20k282
11238b3190J099K081J0139L031m100k561K739M246M30O135j087k898n268n762
$$ y = [-14169, -14328, -13610, -13472, -15681, -13104, -6366, -1862, -5997, -11619, -16812, -19011, -20989, -9351, -9043, -7536, -9148, -6933, 1388, -1499, -11593, -17853, -16390, -13088, -11313, -14549, -20524, -20672, -11063, -9294, -11833, -16913, -7352, 1369, -3264, -7191, -3206, -3567, -14606, -16283, -12952, -12194, -12716, -16577, -27567, -22765, -12385, -9089, -6696, -3484, -2351, -2221, -4309, -7728, -10237, -14519, -13094, -8548, -4214, -1411, -5627, -11514, -13199, -10659, -7690, -11663, -11828, -13752, -16427, -12289, -12034, -10183, -8257, -15163, -18133, -14856, -11216, -7996, -9738, -12197, -12717, -16967, -17476, -12765, -7836, -4729, -13633, -10827, -7677, -6488, -8877, -10301, -12527, -12958, -5987, 968, 636, -4622, -9070, -12309, -18886, -15111, -15539, -20688, -20908, -23190, -22091, -20010, -9871, -6840, -10940, -13501, -10762, -6516, -6086, 49, -1038, -3936, -9204, -14966]
11224a4966L824L493J177J828o075n028K790k89p30R93M345P09r463q917N379
11209b0930P674m13j1247J601L149M416O734o92j047L740R772K047m217R06o3
11194A430L262P32r470n997j309J395N764j33m287n216k930l550K896L198K671
11179a1544N865P286p51m987l607L9J541k436M275J09N97k270l340l343O192J466
11163d908J17J230n96m949J661j301j388n02K684m325O10m706l348J0283P923
11148a515j737p28m88k340K60j423l342n445j738n66L064L893n4Q55j239L169
11132i374O062J896j711q526r848L766N483J565K353m597l233M262M994m640n481
11117a7029n28M324L612M136m072N49J013N450j952n417n925J622L739m209m459
$$ y = [-14966, -11142, -7649, -6472, -4644, -10719, -15747, -12957, -13246, -13976, -12983, -8638, -7929, -17392, -26309, -20930, -13256, -13669, -24916, -23315, -20166, -15750, -9016, -9708, -10755, -7015, 2757, 4804, 587, 1493, 1430, 4692, 5424, -4046, -10043, -11352, -9957, -4193, -4326, -8613, -13829, -16759, -20309, -17413, -14215, -11544, -5679, 1607, 856, -4131, -7738, -7699, -6158, -8594, -4319, -4210, -3613, -5883, -9223, -12566, -6374, -4908, -4791, -3561, -4157, -9106, -7445, -8746, -10134, -10636, -7952, -12277, -11667, -16373, -19721, -9438, -1515, -3252, -3980, -4468, -6808, -6548, -7971, -11313, -16758, -18496, -19062, -15998, -12105, -12159, -11304, -12543, -9374, -3312, -1416, -3127, -11653, -21501, -17735, -12252, -10687, -8334, -12931, -16164, -11902, -6908, -11548, -17029, -17557, -13233, -9621, -5485, -9557, -9008, -7995, -2545, -4497, -9914, -15839, -14217, -10478, -14687, -19146]
11102a9146k284M073M906L627m0M488j139l518J364L478J092J707j464R78J460
11087d18j179K576j0590J913J2128O43o418n801m818P375J578m509o70M577J544
11072b069m126R85j222M82K888j400K35o077k386k641P22j770J176K977o074P52
11056a7548O399J0597j909l229j566j897r13k80lL299O33K458l89j682M37L25
11040e268J423j795L293N38o491n21J192N935J788k504m31K944n227q759n005
11025a8888k693J0305O069K689k883J965r23N11P799j806n267l492k741P6L274
11010f005k628m867o369K226k746k466k26N046P600L882r57j489j050l181n183
10995a8413M53L807J272L056m230o603j730P171K424l43K9K776M244p26o457l618
$$ y = [-19146, -21430, -17357, -12451, -8824, -8864, -4376, -5515, -9033, -7669, -4191, -3099, -1392, -2856, -1878, -418, -1597, 979, -9611, -7698, 4430, 5073, -1345, -7146, -11964, -4589, -3011, -7520, -8190, -3613, -2069, -6195, -5210, -6432, -5950, -3062, -4462, -4227, -10304, -12690, -15331, -14609, -16379, -15203, -12226, -18300, -17548, -11149, -552, -2461, -5690, -7256, -9153, -10066, -10346, -10349, -7050, -6417, -3959, -4348, -6030, -5593, -5268, -3845, -5640, -2347, -1809, -8300, -8821, -7629, -1694, 94, -2410, -2841, 103, -5124, -13883, -18888, -21581, -11276, -5207, -2518, -5401, -3436, -4359, -3848, 3951, 2145, -3122, -6614, -9355, -9279, -6005, -8633, -13500, -19869, -17643, -20389, -22855, -23081, -18035, -10435, -6553, -7510, -8999, -10049, -13230, -18413, -17960, -14153, -12881, -9825, -14055, -20658, -22388, -15217, -12793, -13136, -13107, -10331, -6087, -6813, -13270, -16888]
10979a6888L132J2514N141l492l590k086K389q723J102L404M71K915j187j976
10965f874J970K574L25J966Q29k299M75k272n486j508J980R61k910j641k664M30
10949a4144M115M652O224k04o149k672l69L977l851j102O634n63o93q41j784L003
10933c767L364k625J112K252O9L198m912n461p57j880K630l437P71K404m651k330
10917a4020O011l779K52R283P385L28n933k146J096N22J343o178k454m068Q39
10902a1519O820m61l900m9L205l860m009p767q577N432J3026L973j312j771K265
10887h504Q8o8j845K428k494N36K138l587n632k244M570P257O68k041k180m10
10871a1320L629K252O209N61N42K353k885k455L051j534m617p274N558o74m972
$$ y = [-16888, -13756, -1242, 3899, 407, -3183, -5269, -2880, -11603, -10501, -7097, -6626, -3711, -4898, -6874, -4904, -2330, -2005, -39, 790, -1509, -1034, -3306, -8792, -10300, -8320, -7359, -10269, -11910, -14574, -14144, -10029, -5377, 847, 643, -5506, -8178, -8547, -4570, -8421, -9523, -2889, -3452, -4145, -4986, -6770, -3767, -403, -3028, -1916, 336, 405, 3603, -1309, -6770, -7527, -9407, -6777, -10214, -9443, -7039, -11690, -14020, -8009, -11788, -11536, -2253, 5132, 5460, -473, -2619, -1523, -1001, 342, -5836, -8290, -12358, -11519, -4699, -5160, -9060, -9109, -5904, -9764, -13773, -21540, -30117, -24685, -11659, -7686, -8998, -10769, -8504, -8416, -8484, -10329, -7901, -10395, -9859, -7721, -11308, -16940, -19184, -14614, -7357, -6689, -8730, -10910, -11320, -7691, -5439, 770, 1331, 1873, 4226, 1341, -1114, 1937, 403, -4214, -11488, -5930, -6604, -11576]
10856a1576j01M39k049j101j463k726m583L660P902M445N09L285L949l672l42
10841c424K386l959N528l28o887P05J265j10l515o269N880j098o56L096j530k352
10825a1268K336J005m159k111N184J00l804n754K827R162M813P5m02k343n855
10810a0194K228J0984j374l877m285k498r43J297P223P672m682P4L513O602J26
10795A1866p510p189k931l217k580K991J783P42l67p8M77J1122K167J715m968
10780D023k471J00R01m306Q58N892R687O923Q445Q307R322K707J925P610J2682
10765G2605Q923o00J365J468Q83j794p155j9451j0601l017r991o598l602j400
10751B1035m83N382j237m380n828m685J930L140k425p65N406N142M020q16q73
$$ y = [-11576, -11677, -11238, -13287, -14388, -15851, -18577, -23160, -19500, -11598, -7153, -6644, -3359, 590, -3082, -3424, -1038, -4997, 531, 203, -6684, -5979, -4714, -4824, -8339, -14608, -8728, -9826, -10482, -7386, -8916, -11268, -8932, -7927, -12086, -14197, -9013, -8913, -12717, -18471, -15644, -6482, -1669, -1594, -1996, -4339, -10194, -7966, 3018, 1644, -2233, -6518, -9016, -9959, -8662, -1439, 6233, 1551, 1625, 5138, 11740, 11866, 4356, -2833, -5764, -8981, -11561, -8570, -6787, -6045, -6412, -6490, -6013, 5109, 7276, 8991, 4023, 1552, 1652, 2553, -1753, -895, 4997, 14684, 21607, 30052, 38359, 47681, 50388, 52313, 59923, 72605, 81528, 80928, 82293, 83761, 84644, 82850, 75695, 56244, 45643, 42626, 32635, 26037, 22435, 21035, 20552, 25934, 24697, 20317, 14489, 9804, 11734, 14874, 12449, 11684, 17090, 22232, 26252, 25436, 24563]
10736B4563N017J63m163p891j254k89J809K200J527o841k368N563N347J817j3282
10721A1918r743n348j039K784N213J882J542k478K304j043J81N779j382l852m74
10706F244J03o46o338K054P974J382r291K400J635o59L356L367l748n493k032
10691C08m106n31J114k289K957J680l908j026J680M518J405l936m295l648J783
10676h294K746J892L303M342k423j898n57p788k349J014N884L063M443M842l188
10661E032m304Q623K045m631J374m802q44j212n217L949K963M988l827l246j962
10646a071R80j996m730q64q18j296L86J919N819l407p80l338j0446n420R82O958
10630a7122P006O525M133k461j2387j067K255N453J291N756n90j253m20N13J91
$$ y = [24563, 29580, 29743, 25580, 17689, 16435, 16146, 17955, 20155, 21682, 14841, 12473, 18036, 23383, 25200, 11918, 2175, -3173, -4212, -1428, 3785, 5667, 7209, 4731, 7035, 5992, 6173, 11952, 10570, 6718, 6244, 6347, 5701, -637, 1417, 9391, 10773, 1482, 3882, 5517, 4858, 8214, 11581, 7833, 2340, 308, -3798, -4329, -3215, -5504, -2547, -867, -4775, -5801, -4121, 397, 1802, -2134, -6429, -10077, -8294, -5548, -3656, -353, 3989, 1566, -332, -889, -8677, -11026, -10012, -4128, -1065, 3378, 8220, 5032, 728, 9351, 11396, 6765, 8139, 3337, 2493, 1281, -3936, 13, 2976, 7964, 4137, 891, -1071, -91, -2087, -6817, -7681, -8499, -9795, -9409, -7490, -1671, -5078, -5858, -9196, -19642, -25062, -24080, -17122, -10116, -3591, 542, -1919, -14306, -15373, -13118, -7665, -6374, -618, -1208, -2461, -2881, -2368, -2177]
10615b177n136j134l483O150L117j169J950J963j458q62o36M307M171j381r052
10600d830q47l475l119j019m966J664j60M902K585L815O445q050J190J28O00J804
10584c333l550M666l95q660J300P03J105N481o94j018m333l600J631L354P282
10569f1J651j1126k827O407R17k050J20R855o75N222K078k577k892m513l750m312
10553h533Q237M499J992n889l043l14m146m143J815K254l65k774k649l661n69
10538a7289O870N305j286K926N118j033k004K391j085m36n444L273k713j067P447
10523I73p57j568M333k567j131r491J522K08K459N534n12l400J351j425j0063
10508a4534k981N484P171L389L024m996K012L483M51N57m886K981P247o457k770
$$ y = [-2177, -7313, -8447, -11930, -5780, -2663, -3832, -1882, 81, -1377, -2239, -2875, 1432, 5603, 4222, -4830, -5677, -9152, -12271, -13290, -18256, -16592, -16752, -11850, -9265, -5450, 995, -7055, -5865, -5737, -5137, -3333, -6883, -2217, -2612, -11272, -9972, -9269, -8164, -2683, -3377, -4395, -8728, -12328, -10697, -7343, -61, 1590, -9536, -12363, -5956, -5039, -7089, -6969, 2886, 2211, 7433, 9511, 6934, 4042, -471, -4221, -8533, -296, 4203, 6195, 306, -2737, -3051, -7197, -11340, -9525, -7271, -7636, -10410, -13059, -16720, -17289, -10419, -5114, -6400, -3474, 1644, 611, -1393, 998, -87, -523, -5967, -2694, -5407, -6474, 973, 216, -1352, 2981, 414, -717, -10208, -8686, -8478, -6019, -485, -997, -4397, -3046, -4471, -14534, -17515, -12031, -4860, -1471, 1553, -3443, -1431, 2052, 2503, 3060, -1826, 1155, 8402, 1945, -825]
10493h25N913j847k209k028n402m783q86L134O290J374R12m833l535R71l76J603
10477f527n323l693P116L916m509O412q62J208N166J275j89m012n020K028K861
10462a53o014k259J685m84M737J700n149o615K337J331J252K382M288P121J426
10447G585p899L453O931m949k729k9p368m514n57L570n17K320j625r365j644q85
10431a8222M199N327O157Q240N96l206m788Q17J39p09K13L569J156l278m340K238
10415a892k958K690K113K296o520k531M778l037J359k642n636L272P090O942j518
10400C806r72n409n654q330J094J0670K095O664O68J417J622p807k295M259J108
10385B936j473j482j270o6n382k507J626m1N347M037j099R90k332N861J891q079
$$ y = [-825, 5088, 3241, 1032, -996, -6398, -11181, -12067, -8933, -2643, -1269, -357, -5190, -8725, -7754, -8130, -6527, -11850, -15543, -8427, -4511, -9020, -2608, -3470, -2262, 2904, 4179, 3990, -22, -5042, -3014, -153, -6167, -8426, -6741, -7225, -2488, -788, -5937, -12552, -10215, -8884, -7632, -5250, -962, 6159, 7585, -314, 3139, 10070, 5121, 2392, 2363, -5005, -9519, -10076, -6506, -7023, -4703, -6328, -15693, -17337, -18222, -14023, -8696, -2539, 5701, 6297, 3091, -1697, -880, -741, -1450, -1237, 2332, 3488, 210, -4130, -1892, -4850, -2160, -47, 2249, -4271, -6802, -2024, -5061, -3702, -6344, -11980, -8708, -1618, 5324, 3806, 2834, -2575, -8229, -16559, -15465, -4795, -2700, 3964, 4632, 6049, 7671, -136, -2431, 1828, 2936, 1463, -19, -1289, -1355, -6737, -9244, -7618, -7659, -2312, 1725, 626, 1616, -716, 5145, 7036, -1043]
10369a043N52K914m199l0j294M90j616l902M679N518l447j59l839p881K265L287
10353g705K220k360L657j156J826J618Q428N4n033q313l9J635K272N3O767o21
10337C303J967p382n162k748K828o540k48K738L913Q345K426m671j375L933k25
10322A102j771j913l476m252m544j705Q562M449n794k104K171N025r19j392J242
10307e319J257P13L959k373M292K949n584l785j527J098j376m105Q32J860L802
10292c307j079K62O58k413L379R456o425k768j1713l033j702J982N097Q748J142
10277a716m597J314K233J218R215M414j2863m037O493k458o897l315K51O962J772
10262b011J777L41j795m767K97N85J628M611m846N589J498p923l650N753M877
$$ y = [-1043, -491, 2423, -1776, -1806, -3100, -2610, -4226, -8128, -3449, 2069, -1378, -1537, -5376, -13257, -10992, -7705, -5485, -7845, -4188, -5344, -3518, -1900, 6528, 6582, 1549, -6764, -6803, -5168, -2896, -2843, 3924, 3303, 5270, -2112, -7274, -10022, -7194, -13734, -13982, -11244, -7331, 1014, 3440, -1231, -2606, 1327, 1102, -669, -2582, -6058, -10310, -14854, -16559, -7997, -3548, -9342, -11446, -9275, -4250, -5169, -6561, -5319, -4062, -3349, 610, -1763, 2529, 5478, -106, -3891, -5418, -4320, -5696, -9801, -8969, -7109, -3307, -4386, -4124, -3466, -5879, -2500, 6956, 531, -2237, -13950, -16983, -18685, -16703, -11606, -2858, -1716, -6313, -4999, -2766, -1548, 7667, 12081, -782, -4819, 1674, -784, -7681, -10996, -10745, -3783, -2011, -234, 107, -1688, -6455, -6158, -5573, -3945, 666, -4180, 1409, 2907, -5016, -8666, -2913, 1964]
10247A964P75o1n768K515N368M297O851l326m760N05K054N690O562m227m343O14
10231A4710Q270Q180K081k95m929l62p15o114n094k475k150R07N19R60O61k923
10215A1231k173o51p11J165k327M177j144J612K2M980O766l376l701J646N806
10200B3322J713p858o623n688p159K186J930j472k271J1177N020Kj5J553K906
10185A8723o64l302o290l118k946o364q14N155K831r315p374P642N643J716L071
10170D594K610o77J07K56L174O432j07l080M182K571M049k79j298j349P975M817
10154C3977L640M913l558M848R146p18P018N291Q758L551k754j0594n91J433O781
10139G1141J810n62Q020n31k545M735j247j7565j0940o154K96l683n455j442k949
$$ y = [1964, 2739, 2678, -3090, -575, 4793, 9090, 15941, 12615, 7855, 8360, 10414, 16104, 22666, 18439, 14096, 14710, 22980, 31160, 33241, 32946, 28017, 27655, 26940, 20826, 15732, 13257, 11107, 12014, 12533, 13493, 14154, 11231, 9058, 8407, 7696, 8861, 6534, 10711, 9567, 11179, 11201, 16181, 22947, 19571, 15870, 17516, 23322, 25035, 17177, 10554, 4866, -2293, -107, 1823, 351, -1920, 9257, 14277, 14279, 14264, 15817, 18723, 18059, 14757, 8467, 5349, 2403, -3961, -4775, 380, 3211, -6104, -13478, -5836, -193, 1523, 4594, 7204, 6527, 6634, 6890, 10064, 16496, 16389, 13309, 17491, 20062, 24111, 23832, 22534, 21185, 29160, 33977, 37617, 42530, 38972, 43820, 52966, 52248, 59266, 64557, 73315, 76866, 74112, 63518, 62927, 64360, 71141, 72951, 72389, 80409, 79878, 77333, 82068, 80821, 63256, 52316, 46162, 46458, 42775, 37320, 35878, 32929]
10124C2929m698n893m99N580R56q95r54J740j644m169p300L36L657k166M03k301
10108A5082k513L024J2371L828r203J054j524l218l862o199j17m300n754L366
10094B035J856O033k362k074J381L075N394L924N646o483q105n467J878J511l10
10079G932m9P91j10P84M256N463o60J539L67l530j137J742N634j014q42J479J593
10062B4238N911L720R850L187P059K021k955m278M428Q578O784L933l82l48j520
10047G0226n752n81j308m480l095q88L967N5m600j0279j921O558m109r627n248
10032B8918m55K684L012K3n310j372K14L937m887l602K03n98o304O25K417L927
10016B3432J0939L003l312m640m4J454R291Q428M516P422N417R387P275O286l055
$$ y = [32929, 28231, 22338, 21839, 27419, 28375, 27480, 26526, 28266, 26622, 22453, 15153, 15489, 19146, 16980, 17383, 15082, 12569, 15593, 27964, 31792, 22589, 23643, 22119, 18901, 15039, 8840, 8723, 4423, -1331, 2035, 3891, 9924, 7562, 5488, 6869, 9944, 15338, 19262, 24908, 18425, 10320, 4853, 6731, 8242, 7932, 7883, 8674, 8564, 9348, 13604, 19067, 18407, 19946, 20313, 16783, 15646, 17388, 23022, 22008, 21166, 22645, 24238, 30149, 33869, 43719, 46906, 53965, 55986, 53031, 48753, 53181, 61759, 68543, 72476, 72094, 71746, 70226, 64474, 63893, 62585, 58105, 55010, 54122, 58089, 58144, 53544, 43265, 41344, 47902, 43793, 34166, 28918, 28463, 31147, 34159, 34182, 28872, 27500, 27714, 31651, 26764, 23162, 23365, 22767, 16463, 17088, 19505, 23432, 34371, 37374, 34062, 29422, 29378, 30832, 40123, 48551, 53067, 60489, 65906, 75293, 82568, 88854, 85799]
10001H5799Q976O039K885Q853K0746M0860P7972J33235J68448O5209j07204j46842
9989C64976j00744n9721l1320k0536j5037n862o770n479l443p945j5718j1262
9977H1139k189m409K132o389q715j292L594P70n696k675M054j56j716l775r345
9962D5332J12K248M087L340n83j865O877q09r594r770j962K117l167K222j269
9947C7316j1206o092m58J018m090n429n168J152L397O065N657l598p998o874L612
9932G304K803L531J917k538r637n04K689J726R567Q52m91j024o925m295l449L201
9916D727N614L08L125N820K33k859j265j804n066N408K61n949m634m009K715P534
9900A0159L151n250m646k45n974J362M432n764k973L116K08K958N150j240n264
$$ y = [85799, 94775, 100814, 103699, 112552, 133298, 174158, 252130, 385365, 553813, 619022, 511818, 364976, 264232, 204511, 173191, 152655, 137618, 131756, 124986, 119507, 116064, 108119, 92401, 81139, 78950, 74541, 76673, 70284, 61569, 60277, 63871, 64641, 58945, 56270, 60324, 60168, 58452, 54677, 45332, 45444, 47692, 51779, 55119, 54536, 52671, 59548, 58739, 49145, 39375, 37413, 39530, 36363, 38585, 37316, 26110, 20018, 19560, 20578, 16488, 11059, 5891, 7043, 10440, 16505, 22162, 18564, 10566, 3692, 7304, 10107, 13638, 15555, 13017, 3380, 2876, 5565, 7291, 16858, 17710, 17219, 16195, 9270, 4975, 1526, 4727, 10341, 10649, 13774, 19594, 19827, 16968, 15703, 13899, 8833, 14241, 14502, 8553, 3919, -90, 2625, 10159, 13310, 8060, 3414, 3169, -2805, -1443, 2989, -2775, -5748, -2632, -2424, 534, 5684, 4444, -820]
9885h20p055K707q35M950k735l339K751M798J401j228P62J008m005k394l567M73
9869g128Q66O068O02m609l557K636N083o81k608j682j820n855N233R882K943K078
9853G451j287r06j803k225o774k437J916K204m390m783N185K467J315K1k683P32
9837e997K282j362n779K247J2967N245p74q359q34j242L226R752l040j4618l468
9822i754N039r00k879m141J399L892J903m22j91N439k644q77J042m75o174Q82
9806h861M036j341K647R172L179K95l861J667K055k648l693J224J753k973m869
9791b218M755O987J568q63q367l284L84j808M933k30l798q195K126J383L537J834
9775a256N069J955o363l881k54n094O265P238R12j608O305k326l702K99j118n501
$$ y = [-820, -7875, -5168, -6003, -1053, -3788, -7127, -4376, 422, 1823, 595, 1357, 2365, -1640, -4034, -7601, -7128, -6262, -194, 408, -4201, -7758, -5122, -39, -720, -3328, -5010, -6830, -12685, -7452, 2430, 5373, 7451, 6164, 5258, 3455, 1230, -5544, -7981, -6065, -3861, -8251, -13034, -7849, -5382, -4067, -4046, -6729, -5997, -3715, -5077, -10856, -8609, 4358, 9603, 8829, 470, -364, -1606, 1620, 11372, 8332, -6286, -9754, -4715, -5615, -8494, -12635, -11236, -7344, -5441, -5863, -6054, -615, -3259, -4136, -3094, -3569, -9743, -8861, -4825, -6166, -3519, 5653, 8832, 9127, 5266, 6933, 8988, 6340, 2647, 3871, 5624, 2651, -2218, 2537, 9524, 11092, 10229, 1862, -1422, -1038, -2846, 2087, 1857, -1941, -10136, -8010, -6627, -3090, -1256, 3813, 5768, -595, -4476, -4730, -9824, -3559, 3679, 4591, 2983, 9288, 6962, 3260, 3559, 2441, -3060]
9759c060Q251M699k573j501l500l365l195K890K315J710K658Q10L777J434n300
9744F050q652k205K636R026M766o83n794l132j602j20L039n642J618K831m61j719
9728d4K208K181p060R01P054k153K025Oj270m651n463q64O650M299j403K63M102
9711F781J733l415n182j578R68M439J296j372p307M966K385q50j509n474n23K015
9695b627j01N208l143p8M150k582j60K344J233m038m810O10j867P554J0404l312
9679H785m915l94J962J848K559p658l794J609j94N257R95p943J63J926o855n260
9663a1909K247O337L224k039L389P770O234p14o559m158m7K714Q306j592j210
9648A1993k076o36p817J668M826M553L925j823l196O74n075p145l006p564j251
$$ y = [-3060, 5191, 9890, 7317, 5816, 2316, -1049, -4244, -1354, 961, 2671, 5329, 6139, 9916, 11350, 6050, -2602, -4807, -2171, 6855, 11621, 10938, 5144, 2012, 410, 290, 3329, -2313, -695, 2136, 1675, -44, 2164, 4345, -2715, -1814, 5240, 3087, 5112, 5118, 3848, -803, -6266, -7130, -480, 3819, 2416, 2679, 6781, 8514, 5099, -83, -1661, -693, 3746, 5042, 3670, -3637, 1329, 3714, 2864, 1355, -4119, -4642, -2627, -2728, 2480, -663, -741, 3409, 827, 667, 3011, 4244, 206, -4604, -3994, -5861, 1693, 12097, 8785, 3870, 3476, 5438, 7286, 9845, 2187, -1607, 2, -192, 5065, 6060, -1883, -1720, 206, -6649, -11909, -9662, -3325, -101, -2140, 1249, 9019, 15253, 14539, 7980, 3822, 3775, 6489, 14795, 13203, 11993, 9917, 9281, 1464, 3132, 7958, 12511, 16436, 14613, 11417, 12091, 7016, -129, -3135, -10699, -11950]
9633a1950J352k63L519R649O930N520N18p741m140k810m069J090O22N180J97N184
9617H788l64l742K233m255l540J205N029L131Q74k148J950K380O50J966k191k555
9601I411m75K544l179k632L494N598j36M467o317j748j137J632M208K891l710
9586A4911n321j583M345J7l184o32k287j49k264M002O25p05j051M437K57K96k19
9569A1495L652K341N504O590r48n502j0546m337J125m273k665j007N046P102J392
9554A4969j559p13K26l015J769L476m613o982L182L560O251N565n345L350M786
9539B4907k220m263j662n878P69j315O637O923j373p047K134l295L143P009k554
9524B1915J78j83j2457j073K491L694Q601r42o925J928P83L912m627m892k01J0198
$$ y = [-11950, -10598, -10861, -7342, 2307, 9237, 14757, 15275, 7534, 3394, 584, -3485, -2395, -1773, 3407, 3604, 8788, 8424, 4682, 6915, 2660, -880, 325, 5354, 8485, 9359, 7211, 9161, 11541, 12191, 14157, 11966, 9411, 8936, 11480, 8301, 5669, 9163, 14761, 14625, 19092, 12775, 11027, 9890, 11522, 15730, 18621, 14911, 9590, 8007, 12352, 12369, 9185, 8553, 6266, 6117, 3853, 7855, 8480, 7775, 6724, 11161, 11418, 11714, 11495, 15147, 17488, 22992, 29582, 28634, 23132, 12586, 8249, 9374, 5101, 2436, 1429, 6475, 13577, 14969, 13410, 12697, 12923, 9908, 11677, 15153, 10540, 3558, 6740, 10300, 16551, 22116, 16771, 20121, 24907, 22687, 18424, 16762, 10884, 11653, 10338, 16975, 23898, 22525, 15478, 17612, 14317, 17460, 24469, 21915, 22093, 21910, 9453, 8380, 10871, 14565, 23166, 22224, 15299, 17227, 18010, 21922, 17295, 12403, 12202, 22400]
9508B2400M007o149n932k979k268Q11j802p206J831Q350K284L58j719l442n241
9493C303P46J237Q416J0966p97P8k086q211k207MK55L123j462l971K75J0619k669
9476A7619n509K12J290J720J087j613M253j036p33P629m861q437J348k754m354
9461E861m528L343O477K958R213O563n53o728l720N956m196j209N322j040j266
9446B2453L58n335n32l379j026n64q02J771k583p712n830L603Q125O881M956P170
9430B7554q525o757P68L798j858k134j879M269J282K55l30l573J536l551Q54J712
9414A3421n579K67M344o80j471L89L683M951l007m392K542l131R35M821m38m699
9398A1956L54M159P707K559J332L52k873l617l197L338j322k809N91M071j759
$$ y = [22400, 26407, 20258, 14326, 11347, 9079, 9890, 8088, 882, 2713, 11063, 13347, 13705, 11986, 8544, 3303, 4049, 5286, 13702, 24668, 23871, 23949, 21863, 13652, 11445, 11449, 11704, 14827, 13365, 9394, 9669, 20288, 17619, 12110, 12322, 13612, 15332, 16419, 14806, 19059, 18023, 17290, 24919, 20058, 11621, 12969, 10215, 5861, 1333, 4676, 11153, 14111, 23324, 29887, 29334, 22606, 18886, 24842, 20646, 19437, 24759, 23719, 22453, 22811, 17476, 16944, 13565, 12539, 11975, 11173, 12944, 10361, 2649, -3181, 422, 8547, 15428, 20384, 27554, 19029, 12272, 13040, 16838, 14980, 12846, 10967, 15236, 16518, 16773, 16443, 12870, 14406, 10855, 11709, 13421, 7842, 8109, 12453, 11773, 10302, 10691, 14374, 19325, 16318, 11926, 14468, 11337, 12272, 17093, 16655, 11956, 12310, 16469, 24176, 26735, 28067, 28419, 25546, 21929, 18732, 22070, 20748, 17939, 18530, 22601, 20842]
9383B0842m075L70J522j084r42m929m490m384O872O420K840L127n191j023O250
9368B2125L232N174k16K006l954l218L657L141j442J486N507J733k036K64N975
9353D3434K033q70N37l142Q26k75m665o135k355N408l91l540k990P335J0478M539
9337E0227k604P53j193o419k00N775p24M307M330k59R97J424j728L710N534O129
9321G0059L771J89j350L256n737n59M666j38p220L749O867N264j05j417R56j980
9305H0271P97O27L798L461N372N281r15j997M041J485l16J508N753J4090J1783
9290A35039J3737J9481J3362O962J6325J3840J4058K6469L7603L9784M8607N7205
9278D42472N8700O9523O5464O5115N4137N9315O8579R1976J32735K00866L25659
$$ y = [20842, 16767, 17137, 18659, 17575, 16633, 11704, 7214, 2830, 9702, 16122, 18962, 22089, 16898, 15875, 22125, 25357, 30531, 30315, 32321, 28367, 25149, 28806, 31947, 30505, 31991, 37498, 39231, 37195, 37459, 43434, 45467, 44597, 45134, 41992, 42818, 42543, 37878, 31743, 29388, 34796, 34405, 30865, 27875, 35210, 45688, 50227, 47623, 48376, 47183, 40764, 40564, 46339, 45615, 49922, 54252, 53993, 54990, 56414, 54686, 58396, 63930, 70059, 73830, 74019, 72669, 75925, 70188, 69629, 74295, 74157, 66937, 70686, 77553, 82817, 82712, 81295, 82251, 80271, 81068, 81695, 85493, 88954, 94326, 99607, 98692, 96695, 100736, 102221, 101905, 103413, 109166, 123256, 135039, 148776, 168257, 181619, 188581, 204906, 218746, 232804, 259273, 296876, 336660, 385267, 442472, 501172, 570695, 636159, 701274, 755411, 814726, 883305, 975281, 1108016, 1308882, 1634541]
9267A634541N25422Q84802J385549J219658j42774j236139j170481p55717m60265
9258A884596l04300k09900j51917j09292q8337p3707n7191m8391m5588l4688k6329
9247G34956k8225k5774j7842j7301j8917j5533r677p610o502k988l445q061p71
9234E72310M024P613R945J300o238j1874j9067k1761k8250l0436k4612k3596k4401
9221D04957k4647j1133j0918j5783j9368j5882j1956j3923j4649r446j4456j1681
9209B31115r058p114m752m245p453j2724j4536m278m576j603o760l084o766k881
9195A41285K066K012k469K220n082n219J481n697o119l396l383m950k260k817
9181A07672n111l069l280k231l954j778P273L420J769j010k026M87m296j15j706
$$ y = [1634541, 2159963, 3044765, 4430314, 5649972, 5507198, 4271059, 3100578, 2344861, 1884596, 1580296, 1370396, 1218479, 1109187, 1020850, 947143, 889952, 841561, 795973, 761285, 734956, 706731, 680957, 663115, 645814, 626897, 611364, 601687, 594077, 587575, 584587, 581142, 573081, 572310, 576334, 583947, 593892, 595192, 588954, 577080, 558013, 536252, 508002, 477566, 452954, 429358, 404957, 380310, 369177, 358259, 342476, 323108, 307226, 295270, 281347, 266698, 257252, 242796, 231115, 222057, 214943, 210191, 205946, 198493, 185769, 171233, 166955, 162379, 160776, 154016, 150932, 144166, 141285, 143351, 145363, 142894, 145114, 140032, 134813, 136294, 130597, 124478, 121082, 117699, 112749, 110489, 107672, 102561, 99492, 96212, 93981, 90027, 88249, 95522, 98942, 100711, 99701, 97675, 98162, 93866, 93751, 92045]
9166I2045m879m415K053o695l832J843o043l298M932M398K58L56J10J645k094
9151G6384p185l231M828O381N255m647k502k104K08l340K075L138N071K040r92
9136H1379j316k396r127k335L07K91K074l641k524k900l782L274l020J670L818
9121F1772m344j105k747n268J748N912o620p99k703k295R11P611K560M525j033
9106E8125k277L893n515k37k865j244n061L011M610l90Q25R17m338N255Q132O84
9090F3525M9n534o868N97K178M025l893N414M989l754o43N147J811q34K59m138
9074F2330m031p975K011J733O844n9l372K287j820O646K22l46o401m914M766m007
9058E3914k991o90J452R160k692m093K828J634j733N876k638o79L973O440o69
$$ y = [92045, 87166, 82751, 84804, 78109, 74277, 76120, 70077, 66779, 71711, 76109, 76367, 76723, 76833, 78478, 76384, 69199, 65968, 70796, 77177, 82432, 77785, 75283, 73179, 73387, 70047, 72122, 75260, 80331, 82371, 81379, 80063, 77667, 68540, 66205, 66512, 66803, 68877, 65236, 62712, 59812, 56030, 59304, 56284, 57954, 61772, 57428, 56323, 53576, 48308, 50056, 55968, 49348, 48549, 45846, 43551, 44462, 52073, 54633, 59158, 58125, 55848, 59741, 54226, 53989, 51124, 49880, 44819, 47830, 52440, 52050, 52875, 53792, 49454, 54709, 62841, 63525, 63574, 58040, 51172, 51769, 53947, 57972, 54079, 59493, 64482, 60728, 60085, 65232, 67043, 66209, 66468, 62330, 58299, 50324, 52335, 54068, 60912, 60853, 57481, 59768, 57948, 64594, 64816, 64470, 58069, 53155, 57921, 53914, 50923, 50233, 51685, 60845, 58153, 54060, 56888, 58522, 56789, 62665, 60027, 59348, 63321, 69761, 69092]
9043F9092o572J43k231n300j959j192M805N413J753j827M31n808m819M447R58
9028E7334R8L962k593n533n894N413J574l831j223P57J746m089l752N416k299
9013D7086k57Q15L909Q619k598k044l630j034m755m890O243L420J378K878q449
8998D6691m411J858m102o02j091M256P237L719j143J571j93k001J145m313K975
8983E1596N925N477J165M493k292m355J452j22J427J370j0191n029k691k820j394
8968D4011Q286P794L816k341J125O62o557k780J765k825L715K255L61L566O06
8953F3459j135n37L848p13k662l399q10l51Q257L988j294l817q997m577P457Q345
8937F7062j604n274o233o538j456J991M741N729q15J509R78k37L657m450o012
$$ y = [69092, 62520, 62663, 60432, 55132, 53173, 51981, 56786, 62199, 63952, 62125, 62556, 56748, 51929, 56376, 57334, 57432, 61394, 58801, 53268, 47374, 52787, 54361, 50530, 49307, 50064, 51810, 47721, 43969, 49385, 47086, 46829, 47644, 51553, 60172, 57574, 55530, 51900, 50866, 46111, 41221, 47464, 50884, 52262, 55140, 46691, 42280, 44138, 40036, 39434, 38343, 42599, 49836, 53555, 52412, 53983, 53790, 51789, 52934, 48621, 51596, 57521, 62998, 64163, 68656, 66364, 62009, 63461, 63339, 64766, 66136, 55945, 50916, 48225, 45405, 44011, 52297, 60091, 63907, 61566, 62691, 63353, 56796, 54016, 55781, 52956, 56671, 58926, 59287, 62853, 63459, 62324, 61787, 65635, 64922, 62260, 58861, 58051, 57700, 65957, 69945, 68651, 64834, 55837, 51260, 58717, 67062, 65458, 60184, 53951, 47413, 45957, 47948, 52689, 58418, 57603, 59112, 60090, 59853, 63510, 59060, 53048]
8922E3048m186K449R650L971p69q027j17K422J469l04Q93r46L791M330k8k451
8906F5195j250J573O30j2889l07K015K476M148q1j721o11j899M972O31P661L118
8890G3661j609O16m054k683K746m99l07L395K7l681k816J509N122K682Q211m50
8874H1870p51L747O514O394P448Q91O873O835M820Q192L876N676J3343J4660J9573
8859A89961K9449L8657M9567P2664Q6803P5215J7774n4233q4835p5042n5829l4269
8847B55882l0870j9783q320n752j4674p724q428k531n732p288l383M59K586K851
8833A47293M913M259R73m074O591O870K496J5319R647J1954M821J2960J8732Q706
8819B51460N418J4927J9032J9630K7010L3493N5145R3202J39470J83754J71408
$$ y = [53048, 48862, 51311, 60961, 64932, 64163, 56136, 56019, 58441, 59910, 59606, 60499, 59553, 63344, 67674, 67646, 65195, 63945, 65518, 66148, 53259, 52952, 54967, 57443, 61591, 61510, 59789, 59178, 57279, 62251, 62882, 70543, 73661, 72052, 72668, 68614, 65931, 68677, 68178, 67871, 71266, 71293, 67612, 64796, 66305, 71427, 74109, 82320, 81870, 81119, 84866, 91380, 97774, 105222, 106113, 112986, 119821, 124641, 132833, 136709, 142385, 155728, 170388, 189961, 219410, 258067, 307634, 380298, 467101, 542316, 560090, 505857, 421022, 345980, 290151, 255882, 225012, 205229, 196909, 191157, 176483, 168759, 160331, 157800, 152068, 144780, 141397, 141856, 144442, 147293, 152206, 156465, 157438, 153364, 159955, 166825, 169321, 184640, 194287, 206241, 211062, 224022, 242754, 251460, 256878, 271805, 290837, 310467, 337477, 370970, 426115, 519317, 658787, 842541, 1013949]
8808A013949N8560q4487j63504j60090j23176q4206n8332l3604j4968q738p798
8797C33606j2204j6966j4271j7738j3727j3955j1972m662r230j2232k512n35n323
8784A98279l48k529l455O365N516J0715O732K985Q754M992K658M197L013L911
8770B51785J1819J1738K1929M1745N7880P9773Q4838L8950k7560p2868p8954o8073
8758C53002n3449l4106k7410k6776j5106j0646p639J426J175k982j5549o970L104
8745A58074l330q603j327L295J949M19r895q477l297L027p96l733L811P557k601
8730A36073n648P81l273o224k402L284L12n162q9k172K455J669m035n323j1385
8715I8861J084J083j0680n518L070K814N769l322m512n924m32L89K985K141K08
$$ y = [1013949, 1072509, 988022, 824518, 664428, 541252, 457046, 398714, 365110, 350142, 341404, 333606, 321402, 304436, 290165, 272427, 258700, 244745, 232773, 228111, 218881, 206649, 204137, 203602, 198279, 197931, 195402, 191947, 198312, 203828, 214543, 221275, 224260, 233014, 238006, 240664, 244861, 247874, 251785, 263604, 275342, 297271, 339016, 396896, 476669, 561507, 600457, 572897, 500029, 421075, 353002, 299553, 265447, 238037, 211261, 196155, 185509, 177870, 179296, 180471, 177489, 161940, 154970, 158074, 154744, 146141, 144814, 148109, 150058, 150477, 140582, 132105, 128808, 131835, 131039, 127306, 131117, 138674, 136073, 130425, 131206, 127933, 121709, 119307, 122591, 122903, 117741, 117652, 115480, 117935, 119604, 115569, 110246, 98861, 99945, 101028, 90348, 84830, 87900, 90714, 96483, 93161, 88649, 82725, 82293, 82682, 85667, 87808, 88016]
8700H8016J556l602j251M725K708r1p221j981j92J13j297J98K166P8n284O87R843
8683H9171m74n287m890K558N237L950J578M1O175J906Q26J438j110J052O687m709
8667A04149n850l000Q203o99p483l57O691N312l690J669M277M735k986m481K292
8652A08782M529j230l865K698M209N09J391j790p213l145m85j858M365O53Q36
8637A08386R601M633N9k940L899l610k606M505O384M676m731l272L651R742M642
8622A43019L509k136l00J70j396n684r01J243R096j527n484Q24L405M796P845
8607A56479R23O34j929L753M932M3J192J226K344l793M90Q013n18K995P662J972
8591A86418J709j095j720M881K967K961M201M21M33j370M945Q336p873n467N333
$$ y = [88016, 89572, 85970, 84719, 89444, 92152, 92061, 84840, 82859, 82667, 82780, 81483, 81681, 83847, 83925, 78641, 79328, 89171, 88697, 83410, 78520, 81078, 86315, 90265, 91843, 91884, 98059, 99965, 100791, 102229, 101119, 102171, 108858, 104149, 98299, 95299, 103502, 102803, 95320, 94963, 101654, 106966, 103276, 104945, 109222, 113957, 110971, 106490, 108782, 113311, 112081, 108216, 110914, 115123, 115632, 117023, 115233, 108020, 104875, 104390, 102532, 106897, 107550, 108386, 117987, 122620, 122679, 119739, 123638, 120028, 117422, 121927, 128311, 132987, 128256, 124984, 128635, 138377, 143019, 146528, 144392, 144092, 144262, 142866, 137182, 136281, 137524, 146620, 145093, 139609, 140433, 143838, 148634, 156479, 157402, 158036, 156107, 159860, 164792, 164835, 166027, 167253, 169597, 165804, 166294, 174307, 173789, 176784, 184446, 186418, 188127, 187032, 185312, 190193, 193160, 196121, 200322, 200743, 201176, 199806, 204751, 213087, 205214, 199747, 205080]
8576B05080J708O600j47K274N320J5694Q413j071Q642J0334K590O815J2048O177
8562B90477P036J1793J2048m271Q959J5094K1877K1569J7357J2223J7935J3350
8550D45447R425J9633K1616J6699K1442K5190K1056J5834K0946K1793J7925J2939
8538F69945l147j3996k3813l4374l0389l0876j9652k2195k1966k0549k1634j3445
8526D13909j7383j9789j1233j956o226r029m405r393j0330m156m768l806L705
8513C15140o773o607m067l234q597q260M22j574o41k389q024l994K12m057k723
8498B54834q174j1482j445L245n500j389n291n962r272M135Q926o76l9q12p865
8483B13233j3049r105J025j0528m337j424L643N738l9p404k574k485k063k712
$$ y = [205080, 206788, 213388, 213241, 215515, 220835, 236529, 244942, 243871, 252513, 262847, 265437, 272252, 284300, 290477, 297513, 309306, 321354, 317083, 326042, 341136, 363013, 384582, 401939, 414162, 432097, 445447, 454872, 474505, 496121, 512820, 534262, 559452, 580508, 596342, 617288, 639081, 657006, 669945, 666798, 652802, 628989, 594615, 564226, 533350, 513698, 491503, 469537, 448988, 427354, 413909, 396526, 376737, 365504, 363548, 357322, 348293, 343888, 334495, 324165, 320009, 315241, 311435, 315140, 308367, 301760, 297693, 294459, 285862, 277602, 278024, 276450, 275809, 273420, 265396, 261402, 261614, 257557, 254834, 246660, 235178, 233733, 236978, 231478, 230089, 224798, 218836, 209564, 213699, 222625, 221949, 221910, 221098, 213233, 200184, 191079, 192104, 181576, 177239, 175815, 179458, 185196, 185157, 177753, 175179, 172694, 170631, 167919]
8469A67919o093q203m635m825O92n87K313n146p608r09J471L554k276L238o118
8454A32787j1558j1395j511O715K195N475N691L123L444k881k516o538R53k359
8440A21625k288K763M164k890k825o57j96L09M35k880J527j946l592M147L971
8425A21667O456O28k200k290k019n25l930r098k940N828N42k879k304o635j232
8410I9069m459M486L18l794m573P699L174l748m22j113k904L49Q370N118n855
8395A01715m077K190k410N462N563L060O21L453k434n340j640j114O083r65j1159
8380I9008p657n261O762J709j580j425m881P955N996l032k630M258l512n339k585
8365H7786p46N719O393n427M123M533Q2o628o183k288M44K370j470O763J0362
$$ y = [167919, 161826, 153623, 148988, 144163, 144855, 144268, 146581, 141435, 133827, 132918, 134389, 137943, 135667, 138905, 132787, 121229, 109834, 108323, 115038, 117233, 122708, 128399, 131522, 134966, 132085, 129569, 123031, 123984, 121625, 119337, 122100, 126264, 123374, 120549, 119892, 119696, 120005, 120440, 117560, 119087, 117141, 113549, 117696, 121667, 128123, 128751, 126551, 124261, 122242, 121717, 117787, 108689, 105749, 111577, 112119, 109240, 106936, 100301, 99069, 94610, 99096, 99414, 95620, 91047, 98746, 101920, 98172, 97750, 96637, 93733, 94082, 102452, 107570, 101715, 97638, 99828, 97418, 102880, 108443, 111503, 112124, 115577, 113143, 107803, 106163, 105049, 111132, 110167, 99008, 91351, 86090, 92852, 94561, 92981, 91556, 86675, 94630, 100626, 97594, 94964, 99222, 95710, 90371, 87786, 87040, 92759, 99152, 93725, 97848, 102381, 102463, 95835, 89652, 87364, 87808, 90178, 88708, 95471, 105833]
8350A05833K173l019o219l151q86n074j326K266J611l34j003Q89l791k094k128
8335H3747p835j772J374l57j385j485J718M626j71M27R23J4n098j135L535m275
8319G2851m68k801O00M554L757j087o825J049L217l995o604p74K263O569q13j02
8303G1391O432O26m544q277l924l27L299J081j556l463k478K02M25o068n05j666
8287E0648P955O334K137J883p853L090Q224n499J722L643q165m072j113J549O716
8272F7199l881l081Q841P36j913K443l356M245J014m799m676r50j400M934j508
8257F3848R79j786k249j063J775m463L584K797m257l887Q21j778r88J242O043
8242F0618K082m580M351l78K99k494l368K513J898l790k069N64L518L934l354
$$ y = [105833, 108006, 104987, 98768, 95617, 94731, 89657, 88331, 90597, 92208, 91874, 90871, 91760, 87969, 85875, 83747, 75912, 74140, 75514, 75157, 73772, 72287, 74005, 78631, 78460, 78887, 79810, 79824, 74726, 73591, 77126, 72851, 72383, 69582, 70182, 74736, 78493, 77406, 70581, 71630, 74847, 70852, 64248, 63474, 65737, 72306, 71493, 71391, 77823, 78449, 73905, 65628, 61704, 61377, 64676, 65757, 64201, 60738, 58260, 58462, 58887, 52819, 52314, 50648, 58603, 64937, 67074, 68957, 61104, 64194, 72418, 66919, 68641, 72284, 64119, 60047, 58934, 60483, 67199, 63318, 60237, 69078, 69814, 67901, 70344, 66988, 71233, 72247, 67448, 62772, 61822, 60422, 65356, 63848, 64827, 63041, 60792, 59729, 61504, 57041, 60625, 63422, 59165, 55278, 56099, 54321, 53333, 54575, 60618, 62700, 58120, 62471, 62093, 62392, 59898, 56530, 59043, 60941, 57151, 55082, 55646, 59164, 63098, 59744]
8227E9744l243J20k804O6O448K435l870o86J930L887l829l153M49n15L674l59
8211F0294m171N44M065P528M490o648m381M06L116L11J600k052m198j033j472
8196E8399m025m136P680M984O223J815p48r019n108k931j328m550J364L696k294
8181E0022j269l198j51N137K427l27n836m987r150o9J4346M39m344j958Q435N745
8165E5262J619l482o630m395M949O331J812l600R84r38n004k575m410k556m423
8150C2944K665Q197L550R21l949j726n190L997N382j511n972k927J773J829L3
8135D0016m006k68J335K43P079J673K58j919m821N589J90K783J326j0302J486
8120D0662N315l649L65L321K875k362o730k607m11L494M182Q857k941l149L843
$$ y = [59744, 56501, 56621, 53817, 53883, 60331, 62766, 58896, 58210, 60140, 64027, 60198, 57045, 57494, 56979, 60653, 60294, 56123, 56667, 60732, 68260, 72750, 66102, 61721, 62127, 65243, 65554, 67154, 65102, 60904, 59871, 58399, 54374, 50238, 57918, 62902, 69125, 70940, 70192, 61173, 56065, 53134, 51806, 47256, 48620, 52316, 50022, 48753, 45555, 45404, 50541, 52968, 52641, 46805, 41818, 32668, 32599, 46945, 47384, 43040, 41082, 49517, 55262, 56881, 53399, 46769, 42374, 47323, 53654, 55466, 51866, 52850, 51912, 46908, 44333, 39923, 37367, 32944, 35609, 43806, 47356, 48277, 44328, 42602, 37412, 41409, 46791, 45280, 39308, 36381, 38154, 39983, 40016, 36010, 35742, 37077, 37320, 44399, 46072, 46330, 44411, 39590, 45179, 45369, 48152, 49478, 39176, 40662, 45977, 42328, 42693, 46014, 48889, 46527, 39797, 37190, 36779, 40273, 44455, 53312, 50371, 47222, 51065]
8105E1065R531j094l021j461J363O030O951m874m164L269M900L800J827K536J530
8090G8188J2295J5161J4409j424j3513j2472j3802k317L494M999K136q54q328
8077G7972n563j876L818L313j179k13k77M371Q232M420N143K369j116K755N850
8062A08019m200n761M416J348N049P234O531J1301K487m565Q90J544j469R330
8048A42154J0385R214m313j199p863q919o291l307j032p306q882K079l151l497
8034A08072k836J984M764L022j190j3537p747L595R316Q116J783k44q56L151l035
8019A14358J447j030L033M960J813P63J06p559n3O83Q577L89j8J095k411J942
8003A28095M80m37j062L957L139M296Q136K803N960m990l839L606K941l492K231
$$ y = [51065, 60596, 59502, 56481, 55020, 56383, 62413, 69364, 64490, 60326, 63595, 68495, 72295, 74122, 76658, 78188, 90483, 105644, 120053, 118629, 105116, 92644, 78842, 76525, 80019, 85018, 87154, 86300, 77972, 72409, 70533, 74351, 77664, 76485, 76272, 75995, 80366, 88598, 93018, 98161, 100530, 99414, 102169, 108019, 103819, 98058, 102474, 103822, 108871, 116105, 122636, 133937, 136424, 131859, 132749, 134293, 132824, 142154, 152539, 161753, 157440, 156241, 148378, 139459, 133168, 129861, 128829, 121523, 112641, 114720, 111569, 108072, 105236, 107220, 111984, 115006, 113816, 100279, 92532, 96127, 105443, 113559, 115342, 115098, 114242, 117393, 114358, 115805, 114775, 117808, 122768, 124581, 125344, 125450, 117891, 117838, 118521, 127098, 127487, 127469, 128564, 126153, 128095, 128575, 128138, 127076, 131033, 134172, 138468, 146604, 149407, 155367, 150377, 146538, 150144, 153085, 149593, 151824]
7988A51824M560O966L689R808N760L341P227Q719N954J128k733Q1K996m527M6
7973B04839j351m848L675J0699J0738J0360J609q52l500q316O275L386J455N718
7959B39887N718J1061P210L765N917J0080n49K97N893J2977J3812M542J107N410
7945C27127J5804J7750J3659J8471K2167J9368R528K4478L0590J8386J1595m145
7933E24778L410M3O280K525M596J3045O170q685k2936k0387j3704r456l679n566
7919D76434p574j2746q389l716j359l532K591O527M870J914M316R039l106m804
7905D60465q54P647Q343J2392N319k03L605L580J5074J1117N792K0311J9809Q032
7891E80429j577m053j2696r758l808q924q993j8626k3688j9061k5869j7304q827
$$ y = [151824, 156384, 163350, 167039, 176847, 182607, 185948, 193175, 201894, 207848, 208976, 206243, 206324, 209320, 204793, 204839, 203488, 198640, 202315, 213014, 223752, 234112, 235721, 234869, 231369, 223053, 229328, 232714, 234169, 239887, 245605, 256666, 263876, 267641, 273558, 283638, 283089, 283386, 289279, 302256, 316068, 320610, 321717, 327127, 342931, 360681, 374340, 392811, 414978, 434346, 443874, 468352, 498942, 517328, 528923, 524778, 528188, 528231, 534511, 537036, 541632, 554677, 560847, 552162, 529226, 508839, 495135, 485679, 482000, 476434, 468860, 456114, 447725, 444009, 442650, 439118, 441709, 448236, 453106, 455020, 459336, 468375, 465269, 460465, 459611, 467258, 475601, 487993, 493312, 493109, 496714, 500294, 515368, 526485, 532277, 552588, 572397, 580429, 578852, 574799, 562103, 552345, 548537, 539613, 530620, 511994, 488306, 469245, 443376, 426072, 417245]
7878D17245k244q280q700j0051j2379j1116n445M3j291k150J325L332L439L274
7864C67002K061m986q077k591l171o111k621Q160K395M34K329j639p865n699n316
7849C34305p407p013j3906j8265j1154j0033j3509p714q835l867k83q452j2221
7836B11646q989p058j386l598n217k429K375m799n646N074P910J462o062m915
7822A78368l877P55j954j1004l313l567m591o441J379l990k21K923K707n688l74
7807A41112l839l624k990k062l319m381p371n216q824m137m383q884m965O661
7793H3778R630j581J273N70j313j856n154O18o165n117l827p37N154o988n570
7778F2715l163P085m485q457n362N374P63m0N150R36K936l978j040m346l240L91
$$ y = [417245, 415001, 406721, 398021, 387970, 375591, 364475, 359030, 359073, 357782, 355632, 356957, 360289, 363728, 367002, 369063, 364077, 356000, 353409, 350238, 344127, 341506, 349666, 352061, 352495, 354824, 353185, 345320, 339621, 334305, 326898, 319885, 305979, 287714, 276560, 266527, 253018, 245304, 236469, 232602, 232319, 223867, 211646, 202657, 195599, 194213, 190615, 185398, 182969, 185344, 180545, 174899, 179973, 187883, 189345, 183283, 178368, 174491, 175246, 173292, 162288, 158975, 155408, 150817, 144376, 145755, 141765, 141544, 144467, 147174, 141486, 141112, 137273, 133649, 130659, 128597, 125278, 120897, 113526, 108310, 99486, 95349, 90966, 82082, 77117, 83778, 93408, 91827, 93100, 93670, 92357, 90501, 85347, 85965, 79800, 74683, 70856, 70119, 75273, 68285, 62715, 59552, 66637, 62152, 53695, 48333, 53707, 54470, 54430, 59580, 60516, 63452, 59474, 58434, 54088, 50848, 51239]
7762E1239K742O971n982L200l357k581j084l287j976j924J51l259p837o365M123
7747C0774P15K071J2230O441O331j879n14o042j041k975m906o216L86Q366J197
7732D4938m653P673j90j904j600j596o544m460Q41R18L82j348K442J443o164r56
7716B9222K514j35k770J479m626p264l486J20O120N751J10J366j594j947M921
7701B9781O041m238m155j089N644l869n267k488L183K594m878m683M61M622M499
7686B6158o97o003n964L954l56Q73M111N236K319J189j1543K22R52l692j032L420
7670A9147k274j518n860k865L650r12K765j643l869N5N203o22j638m27J222o23
7654I791J924l386k703j510K990M042Q511M932o066p348l622l773j402M164J1979
$$ y = [51239, 53981, 60952, 54970, 58170, 54813, 52232, 51148, 47861, 45885, 43961, 44112, 40853, 33016, 26651, 30774, 31489, 33560, 45790, 52231, 58562, 56683, 56169, 50127, 49086, 46111, 41205, 34989, 35375, 43741, 44938, 40285, 47958, 47768, 45864, 44264, 42668, 36124, 31664, 32505, 33423, 33805, 32457, 34899, 36342, 30178, 29222, 31736, 31601, 28831, 30310, 25684, 18420, 14934, 15054, 21174, 26925, 27035, 28401, 26807, 24860, 29781, 35822, 31584, 27429, 26340, 31984, 28115, 22848, 20360, 23543, 26137, 21259, 16576, 17037, 21659, 26158, 25461, 19458, 13494, 17448, 17092, 17965, 22076, 27312, 29631, 30820, 19277, 19499, 20451, 16759, 15727, 19147, 16873, 15355, 9495, 6630, 10280, 9368, 12133, 10490, 6621, 6676, 11879, 11257, 9619, 9192, 10414, 9791, 11715, 8329, 5626, 4116, 7106, 11148, 19659, 24591, 18525, 11177, 7555, 3782, 2380, 6544, 18523]
7639A8523J835j892j0114m093K508J373K753K718J1166q578n754N343m940k098
7625H750M565O811r546m393l83L923r75p000k619n818K551M959L513J578l08L142
7609H750K676m051l045j249m311Q76Q53O827R100N414n983l800l060N05j699N83
7593H386M760l245l66l11l108P15r39m716m427l401O718P092o33M168N983K807
7577A9483L514j819o802m256j867n004j48J456M601K634Q60j646n770r493J169
7562c088O339M275k640k953o006K843O182K17K787n825k264J452J156J429P962
7547A1866K921k642j389P254k903n786j594p606p549j133K995M679k201N39J700
7532h49k843j215M71J909L743n155j779N127Q180K536p604k475M54P554K482j606
$$ y = [18523, 20358, 18466, 8352, 4259, 6767, 8140, 10893, 13611, 24777, 16199, 10445, 15788, 10848, 8750, 13315, 20126, 10580, 6187, 5804, 9727, 8752, 1752, -867, -6685, -4134, 825, 4338, 5916, 5608, 8750, 11426, 7375, 4330, 3081, -1230, -354, 499, 7326, 16426, 21840, 15857, 12057, 8997, 9502, 7803, 8386, 13146, 9901, 9535, 9224, 6116, 6831, 5892, 1176, -3251, -6652, 66, 7158, 6525, 10693, 16676, 19483, 22997, 21178, 14376, 10120, 8253, 3249, 3101, 4557, 9158, 11792, 12652, 11006, 5236, -4257, -3088, 3251, 7526, 4886, 1933, -4073, -1230, 4952, 5169, 7956, 2131, -133, 1319, 2475, 3904, 11866, 14787, 12145, 10756, 18010, 15107, 9321, 7727, 121, -7428, -8561, -5566, -887, -3088, -2549, -849, -3692, -4907, -4436, -2527, 1216, -3939, -5718, -591, 7589, 10125, 2521, 46, 500, 8054, 10536, 8930]
7516H930m638m023Q00M559K661m167r39M854K496J264o097q852l83L719n977k262
7500h055R576L224J699M163L807o91j13j666M397j816m618k778j677J561N81P279
7484A4873K37k566L785j282O54O05o904m635L486L683J06n394l295J288K076p084
7468c67k01K015K924J887k650K489K436P05m255K26j562L406N836L071P77p015
7452I722q811m744J508Q276q88j928J662q91n601l779Q668R354j665r306J944
7437C521J344L220m149m649K877J614o245L329K376K982J285K7J070n886p289
7422d573r60L271N169J982M41Q61n03m821o368M063M065J967K095j613m380J187
7406A883j757k109m699L644R962L117n080k61k782o6L149K098n617k526J654n29
$$ y = [8930, 4292, 269, 1069, 5628, 8289, 4122, 3183, 8037, 10533, 11797, 5700, -3152, -3535, 184, -5793, -8055, 1521, 4745, 6444, 10607, 14414, 13723, 13610, 11944, 16341, 14525, 9907, 7129, 5452, 7013, 7594, 14873, 15110, 12544, 16329, 15047, 15701, 16306, 9402, 4767, 8253, 11936, 12042, 6648, 3353, 4641, 6717, -367, -568, 1447, 4371, 6258, 3608, 6097, 8533, 9238, 4983, 5209, 3647, 7053, 12889, 15960, 16737, 9722, 911, -3833, -2325, 5951, 5063, 3135, 4797, 3906, -1695, -5474, 3194, 12548, 10883, 1577, 3521, 4865, 8085, 3936, -713, 2164, 3778, -2467, 862, 3238, 6220, 7505, 7532, 8602, 2716, -4573, -5533, -2262, 2907, 4889, 5330, 6191, 5688, 867, -5501, -1438, 2627, 4594, 6689, 5076, 696, 1883, 126, -1983, -6682, -3038, 6924, 10041, 4961, 4700, 1918, 1852, 5001, 7099, 1482, -1044, 610, 81]
7390H1N627J834k816n081k669m130L442N472L136j714Q4N27o669n920j119K949
7374f966L335l7l008K179O958j05j764J863N036r04k338j508L7J37q237l12N294
7357c40M537K634l733m579J273K12Q606N072k74j0935q294K468k303k927M685
7342c898M931L005k983N891N515L328p701k722n24j0716m388N552O383M288J253
7327G214P37K47q62j785j491q063o51J310n707o60lJ838R220N37k750P318J622
7310H071J820m232m134J068O909p43j656l815L17J81r41j0214o209O278M018M816
7294A534k966l414J577k063K234j558J61o861Q843J709Q64K177l393K938L422
7279E204p80m453n46K82k397L02n3Q45k087N696M724l426m980m860K366L364P376
$$ y = [81, 5708, 7542, 4726, -355, -3024, -7154, -3712, 1760, 4896, 3182, 3266, 3793, -2876, -8796, -9915, -6966, -3631, -3668, -6676, -4497, 2461, 2356, 592, 2455, 7491, 6587, 4249, 2741, 2778, 2915, -5322, -5634, -340, 4197, 6831, 3098, -1481, -208, 4, 8610, 13682, 13408, 2473, -5821, -3353, -5656, -8583, -3898, 1033, 4038, 1055, 6946, 12461, 15789, 8088, 5366, 4842, -5874, -10262, -4710, 1673, 5961, 7214, 7951, 8198, 7336, 5551, 4060, -4003, -4654, -3344, -9051, -9711, -9714, -7876, 1344, 1881, -869, 6449, 8071, 9891, 5659, 1525, 2593, 9502, 8759, 7103, 3288, 3605, 3786, 2845, -7369, -13578, -7300, -3282, 1534, -1432, -4846, -3269, -5332, -3098, -4656, -4495, -11356, -2513, -804, 60, 2237, -1156, 1782, 5204, 4424, -29, -575, -293, -2690, -2388, -2441, -1596, -3683, 2013, 6737, 3311, -1669, -6529, -4163, -799, 6577]
7262F577j048n822L371N314n713n832K970L384K979L148l673p920l769Q22J037
7247d175J981m158n333k708m665N589M037k59N71j724m232K267P297M358L168
7232B014j513j246m457J101m40L846q02L596K783k953K271l368o694K317P13n45
7216c377K82O907o336N60L70q34M22K03j117l062l634M196M73p83j027m774N684
7199e847R086m472o9J470L47n607l225Q09J633J84K004J200J547o85L517L383
7183E275n209j047n698l610K276m7r96K545L625N099N948K669q00n292J355p26
7167E367l401k924N238O212m204n471p727N289J000l015j888O56j17K047M866
7152A928k3R40k020M639K20p916M31K037k650o034J158Q061K928n028k58n133
$$ y = [6577, 5529, -293, 3078, 8392, 2679, -3153, -183, 3201, 6180, 9328, 5655, -2265, -6034, -5212, -4175, -2194, -6352, -11685, -14393, -19058, -13469, -9432, -9691, -9120, -10844, -15076, -12809, -5512, -1154, 2014, 501, -745, -5202, -4101, -4541, -695, -1497, 2099, 4882, 1929, 4200, 832, -5862, -3545, -2832, -3377, -3095, 3812, -2524, -1964, -1594, -2428, -2006, -1803, -2920, -5982, -9616, -5420, -4947, -5730, -6757, -11531, -5847, 3239, -1233, -1302, 168, 515, -5092, -8317, -7508, -5875, -5691, -3687, -2487, -940, -1625, 1892, 5275, 66, -981, -6679, -10289, -8013, -8060, -9056, -6511, -2886, 2213, 8161, 10830, 10030, 4738, 6093, 5367, 1966, -958, 4280, 10492, 6288, 817, -6910, -1621, -621, -3636, -5524, -4868, -4985, -2938, 1928, 1905, 2845, 825, 5464, 5684, -2232, -1801, 236, -2414, -8448, -7290, 771, 3699, -1329, -1587, -6720]
7136f720j066J0580N899J249N35n95l845l81O947j639o359l846n951L10l084K391
7120e575R020O416k970n536j059j602q065q302J925Q457M199k295l85l39O39M349
7104a123J426k174j015p644N83L627n982j85M245M785M789O040l007q407j714
7089e756K619j100J229q70K229j929m355MP44j511J363j589m105R144M731l121
7073b273m169J891j370N382N937j786O35m146l216J588j231J893L5m133l269n424
7057a3656O755Q533n008o408o402o9N499J1324k916l668L210k682M44N511m548
7042d081q228l444K936P014L874n653p377J978K240R460J2982n948p62O48m933
7027G06n323l555M60n101l322N601Q795K481k201o148m245q56J181L824J0341
$$ y = [-6720, -7786, 2794, 8693, 9942, 10477, 9882, 6037, 5656, 12603, 10964, 4605, 759, -5192, -4882, -7966, -5575, 3445, 9861, 6891, 1355, 296, -1306, -9371, -17673, -15748, -7291, -3092, -5387, -5772, -6111, -5472, -1123, 303, -1871, -2886, -10530, -9947, -6320, -12302, -12487, -8242, -3457, 1332, 7372, 4365, -4042, -5756, -3137, -4237, -3008, -3878, -1649, -3578, -7933, -7929, -7185, -8696, -7333, -8922, -13027, -3883, 848, -2273, -6442, -4551, -5921, -539, 5398, 3612, 4247, 101, -3115, -1527, -2758, -865, -830, -4963, -8232, -13656, -6901, 1632, -3376, -9784, -16186, -16255, -10756, 568, -2348, -6016, -2806, -5488, -5044, 467, -4081, -12309, -15753, -12817, -5803, -1929, -7582, -14959, -12981, -10741, -1281, 11701, 5753, 4991, 5639, 706, -4617, -8172, -7712, -12813, -16135, -10534, -1739, 742, -1459, -7607, -11852, -12708, -11527, -7703, 2638]
7012B638p92K80j524n69j214M031J466J936N786q930m353K465Ll995l051n55J708
6995d670O964m472m02J119k676p968j540K645J236k482J93K029k219L128N124
6980c991M898n24l761k482J658J848K818O625k308p773j46N359L505l239l431
6965i44n066n721N147N488K646k42j596L527K47l151L517l669o183q290N034O620
6949b636l72R16N975L352N75j09l921r111n400j660J250m057L894N157J395n276
6933a0028j272K791k275M11J921l71O699l848o323K781K033M220J674J03L037
6918A553M48k791n75L367M190p35j946j25m970L600R48n493l539K297J581P775
6902E585Q910N90p482m830m850L577K851k645j111j804j189o812J999O350O146
$$ y = [2638, 1846, 2126, 602, 33, -1181, 2850, 4316, 6252, 12038, 3108, -1245, 1220, 1223, -2772, -5823, -6378, -4670, 2294, -2178, -2580, -1461, -4137, -12105, -13645, -11000, -9764, -12246, -12053, -10024, -12243, -9115, -3991, 907, 383, -3378, -5860, -4202, -2354, 464, 7089, 4781, -2992, -3138, 2221, 5726, 2487, -944, -6010, -11731, -6584, -1096, 1550, 1308, -288, 3239, 3486, 335, 3852, 183, -6000, -14290, -9256, -2636, -3008, -2092, 3883, 7235, 7810, 7701, 3780, -5331, -10731, -12391, -11141, -15198, -11304, -6147, -4752, -10028, -11300, -8509, -10784, -10373, -8452, -8823, -2124, -5972, -12295, -9514, -7481, -3261, -1587, -1484, 1553, 2001, -790, -1365, 2002, 6192, 5457, 3511, 3386, -1584, 2016, 2964, -2529, -6068, -3771, -2190, 5585, 14495, 15085, 7603, 2773, -2077, 1500, 4351, 1706, 595, -1209, -2398, -9210, -7211, -861, 5285]
6887E285l74P11J950J298n046r611m51R8K680m364N137O934L470j631Q75M146
6871A1107j986r962l891p88l025n077j670N867K202J86j80m022m079Q304j194
6856h208l661L59J792j970M922Q404M489K442l860l609q291K429M406J758Q27
6841B229l261N2l986m190R01N080P36j530L323l735J894O376k847n373K316j994
6825d009L691k224L92O148O631J405j593l845k797j933j1633K397P357N063m307
6810G43R23K665J444K093p471k183M397K710M746n108m66J97l006l774p263n4
6794i407L819L297P968n278p775l883k824L867P279K181J075j381r16L593J153
6779B768q44j595j608K968o708P58K630K797K15n177N067K554l581K600J877k173
$$ y = [5285, 4911, 5622, 7572, 8870, 3824, -5787, -6238, -6140, -3460, -7824, -2687, 4247, 7717, 6086, 6961, 11107, 9121, -841, -4732, -5520, -8545, -13622, -15292, -9425, -7223, -7037, -7217, -11239, -15318, -7014, -8208, -11869, -11510, -9718, -11688, -6766, 1638, 6127, 8569, 4709, 1100, -7191, -4762, -356, 1402, 2229, -1032, -980, -4966, -9156, -8255, -3175, -2439, -3969, -646, -4381, -2487, 3889, 1042, -4331, -2015, -4009, -318, -2542, -2150, 3998, 10629, 12034, 10441, 6596, 3799, 1866, -9767, -7370, -13, 5050, 743, 1666, 4331, 5775, 7868, 397, -1786, 2611, 5321, 10067, 4959, 4493, 4690, 1684, -2090, -9353, -9407, -5588, -2291, 5677, 399, -7376, -11259, -14083, -10216, -2937, -756, 319, -1062, -1978, 1615, 2768, 1924, 329, -1279, 1689, -5019, -4261, -1631, 1166, 1381, -3796, 1271, 3825, 244, 2844, 4721, 2548]
6763B548r32J343J591j267l746q20K544P899j698J8p26M338L752J202m552n916
6747E578o440m715N32J22r87M440l184n340J355P070l02J530n75o090P08M960
6731a338Q36K014L532k40K58K345K491r433j4106J69J0814J95j1P82L560j699
6715A69j812K660j160K777k099J750m910O821Q046M338J036j796n298P904l209
6700A5217j2985J853R06k426N786q35L945j031j60N411M65J539Q592M58M284K732
6684C3751j076n509j2213n742n227L842q53j768r270q10p980l830N224Q397P53
6669b311M18J247L38r83K309N98J515N25l6n92k643j551M79M539L249N382K129
6652A4612r572m128K92l193p824L207O890L912K130R0l839l26k256L018R9K703
$$ y = [2548, 1616, 2959, 4550, 3283, -463, -1283, 1261, 9160, 7462, 7480, 6754, 11092, 14844, 16046, 11494, 5578, -862, -5577, -5045, -4923, -5910, -1470, -4654, -9994, -8639, -1569, -1871, -341, -916, -7006, -6298, -1338, -502, 1512, 5044, 4804, 5062, 7407, 9898, 465, -13641, -13472, -2658, -2463, -2474, -1692, 1868, 169, -1643, 1017, -143, 2634, 535, 2285, -2625, 4196, 12242, 16580, 17616, 15820, 10522, 18426, 15217, 2232, 4085, 4991, 2565, 8351, 7516, 11461, 10430, 10270, 15681, 16146, 17685, 26277, 26735, 31019, 33751, 32675, 27166, 14953, 9211, 3984, 7826, 6973, 5205, -4065, -4875, -12855, -16685, -11461, -3064, -2311, -1893, -646, -308, -1291, 1018, 1616, 3131, 3656, 3620, 3028, 385, -1166, -687, 3852, 7101, 12483, 14612, 5040, 912, 1204, -1989, -9813, -6606, 284, 4196, 6326, 6416, 2577, 2251, -5, 3013, 3112, 5815]
6636E815p87J381K596l847j303K909j761n094P20q96n361K251K7j630j828K342
6620d466j195k276j745J11N471R706M621k828J8m043p663M643O841L951k086p555
6604A505o827j78J435L34K248J750q02j129P53O491M590m585k222l518m074m836
6588i065j751Q20M137k134L641O571Q71k155o888J289J202L904L671l451j955
6573a293M913L523L0p095j0232l356P069O331k079M184l956j260K097N760L752
6558H388n045r988k367K742J583j265M384k113k033q70L06k144L952K245j56l802
6542f183P178K886k964l499R67l448N759j582o332P21Q502L639K294Q65l944n145
6526b86k733Q52Q262l24o134L160k139J97r28r83j44j714j382K902L882M950n158
$$ y = [5815, 5028, 6409, 9005, 5158, 3855, 6764, 5003, -91, 629, -267, -5628, -3377, -3350, -4980, -6808, -4466, -5661, -7937, -9682, -9571, -4100, 5606, 10227, 7399, 7417, 3374, -4289, 354, 7195, 11146, 9060, 1505, -5322, -5500, -4065, -3731, -1483, 267, -535, -1664, -911, 5580, 10170, 5585, 3363, -155, -4229, -9065, -10816, -9996, -5859, -7993, -4352, 2219, 3090, 935, -5953, -4664, -3462, 442, 4113, 662, -1293, 3620, 7143, 7173, 78, -10154, -13510, -6441, -110, -2189, 1995, -1961, -3221, -1124, 4636, 8388, 3343, -6645, -9012, -6270, -4687, -5952, -1568, -3681, -5714, -6584, -6278, -8422, -4470, -2225, -2381, -6183, 995, 3881, 917, -2582, -1615, -5063, 696, -886, -7218, -6497, 2005, 5644, 7938, 8803, 4859, -286, -3019, -2167, 6095, 5771, -363, 2797, 658, 855, -73, -1056, -1200, -2914, -4296, -1394, 2488, 7438, 2280]
6509B280j717O65j096J019L611m260n143r37K747L315J415Q027m247q007j961
6494d289m976J402L284O544r81L314p792j293O96j872m7L968N81M867n512j1486
6478a3592k601P182J196m586J408L380M141l932J591R25K2o30J393K735J959K724
6462C315O175k196r034p167L772J16K50j869L917K473M58k136K329M562l158m369
6446b562O752K854r88M632n008n316N299M783j069j177j016j930m251o739k778
6431h514O565K063j907m25J010L54L993O277k885p786k590K865M509m18o113R94
6415b008J07K883L95k030L83K256k949k654J06j190k127L988j478m789L340J859
6399c908j551n438J535J1912L725P74n961o082L596J073K305j649J553j062L813
$$ y = [2280, 563, 1228, 132, 1151, 4762, 502, -4641, -5578, -2831, 484, 1899, 9926, 5679, -2328, -4289, -9265, -7863, -4579, 1965, 984, 4298, -3494, -4787, -4091, -5963, -6010, -2042, -1461, 3406, -2106, -13592, -16193, -9011, -7815, -12401, -10993, -7613, -3472, -7404, -5813, -4888, -4866, -5496, -4103, -1368, 591, 3315, 9490, 7294, -1740, -8907, -5135, -5019, -4769, -6638, -2721, -248, 210, -1926, 403, 4965, 1807, -2562, 4190, 7044, 6056, 10688, 5680, 364, 5663, 10446, 9377, 8200, 7184, 5254, 1003, -5736, -8514, -1949, 114, -1793, -2218, -1208, -854, 3139, 9416, 6531, -1255, -3845, -980, 3529, 3111, -3002, -2008, -1901, 982, 1377, -653, -270, 1986, -963, -3617, -3511, -4701, -6828, -2840, -4318, -9107, -5767, -3908, -5459, -10897, -9362, 2550, 6275, 7049, 1088, -4994, -1398, -325, 1980, 331, 1884, 822, 4635]
6384D635P390n826k986r860k960K51J560O279o47k612n318j485k246L49R871l695
6368g300l818l998J232L801O917L056l061k03n942K571L068k121j438m696n473
6353a7405k602K543J554N180L276L429n01j480K079N149o941j286L908o3j705
6338d865J71l42j39M387k44K505o9Q16q81N843m146r274L423j673O9k209J073
6321e555M862n41J704k662m523j0316q05J0493K280j714l075o515O786Q501l111
6306d191q81M018k479j0j556K90m871j645l30k52J948K796J909j532J738Q07J797
6289b444j229L726O506M515q19p424l778j823J272P148k730j518p324m757N462
6274e217k657J497L219K729k441J006j094J38j537N56J57m057M454k14K69k204
$$ y = [4635, 12025, 6199, 3213, -6647, -9607, -9356, -7796, -1517, -2164, -4776, -10094, -11579, -13825, -13476, -3605, -7300, -11118, -15116, -13884, -10083, -3166, -110, -3171, -3374, -9316, -6745, -3677, -5798, -7236, -11932, -17405, -20007, -17464, -15910, -10730, -7454, -4025, -4526, -6006, -3927, 1222, -5719, -7005, -3097, -3160, -4865, -4694, -5036, -5175, -788, -1032, 1473, 1404, 2220, 1339, 7182, 3036, -6238, -2815, -4488, -4419, -6628, -5555, -693, -1234, 470, -2192, -6715, -17031, -17836, -7343, -5063, -6777, -9852, -16367, -9581, -1080, -4191, -5072, -1054, -3533, -3543, -5099, -4809, -9680, -11325, -11655, -11907, -9959, -7163, -5254, -6786, -5048, -4241, -2444, -3673, 53, 6559, 11074, 10255, 2831, -947, -2770, -1498, 5650, 2920, 1402, -5922, -10679, -5217, -7874, -6377, -3158, -429, -2870, -1864, -2958, -2820, -4357, -3801, -3644, -7701, -3247, -3461, -3192, -5396]
6258e396m324q54Q409M472j420p477K406L954L614L38k998o755k635L563k275
6243g378o302K991L079J385P088J0183O394j566q743q326J135k185K75k336l542
6228g848l075k699L243L463j838l243k658P347J2234l111k234J984j737l243M14
6213c001n596j950J355L6j052O354Q30k172K258J040p57J039j986m59k067k294
6197h422l081L352L158q62L201r97l899m07Q247N653k772j0559L212K121M873
6182B818l769r363O0n387j393k908J587M03J548R568K948M01j735R24R964j128
$$ y = [-5396, -9720, -10574, -2165, 2307, 887, -6590, -4184, -230, 3384, 3722, 724, -6031, -8666, -5103, -7378, -13680, -10689, -7610, -6225, 863, 11046, 17440, 15874, 7131, -1195, -60, -2245, -1970, -4306, -7848, -10923, -13622, -10379, -6916, -8754, -11997, -14655, -7308, 4926, 1815, -419, 1565, -172, -3415, -3001, -8597, -10547, -9192, -9156, -10208, -3854, -3024, -5196, -2938, -1898, -2655, -1616, -3602, -4061, -6128, -8422, -11503, -8151, -4993, -5855, -2654, -3651, -7550, -7957, 290, 5943, 3171, -7388, -4176, -2055, 2818, -951, -10314, -10254, -15641, -17034, -19942, -18355, -17952, -16404, -6836, -3888, -3487, -5222, -4298, 5666, 4538]
$$ [...]
##END NTUPLES=NMR SPECTRUM
##END=
