##TITLE=Analysis number 312536
Compound Code gk 01910
Project Code adrs
Chemist Name endeavour
##JCAMPDX= 6.0         $$ Bruker NMR JCAMP-DX V2.0
##DATA TYPE= NMR SPECTRUM
##DATA CLASS= NTUPLES
##ORIGIN= Bruker BioSpin GmbH
##OWNER= NMR
$$ XWIN-NMR		Version 3.5
$$ Mon Aug  8 10:49:13 2005 GMT Daylight Time (UT+1h)  MAYBRIDGE\NMR@NMR_250MHZ
##.OBSERVE FREQUENCY= 250.131544655141
##.OBSERVE NUCLEUS= ^1H
##.ACQUISITION MODE= SIMULTANEOUS (DQD)
##.ACQUISITION SCHEME= undefined
##.AVERAGES= 16
##.DIGITISER RES= 18
##SPECTROMETER/DATA SYSTEM= dpx250
##.PULSE SEQUENCE= zg30
##.SOLVENT NAME= CDCl3
##.SHIFT REFERENCE= (INTERNAL, CDCl3, 0, 16.522)
##AUDIT TRAIL= $$ (NUMBER, WHEN, WHO, WHERE, WHAT)
$$ ##TITLE= Audit trail, XWIN-NMR		Version 3.5
$$ ##JCAMPDX= 5.01
$$ ##ORIGIN= Bruker BioSpin GmbH
$$ ##OWNER= NMR
$$ C:\u/data/dgb/nmr/ADRS/7280/pdata/1/auditp.txt
$$ ##AUDIT TRAIL=  $$ (NUMBER, WHEN, WHO, WHERE, WHAT)
(   1,<2005-08-08 10:48:38.37 +100>,<MAYBRIDGE\NMR>,<NMR_250MHZ>,
      <created by zg, POWCHK disabled, PULCHK disabled
       configuration hash MD5:
       62 19 C7 07 E1 42 D1 B7 37 6C 3D D0 77 39 F9 E6
       data hash MD5: 64K
       B1 D8 44 FC 2A FA 45 88 C6 74 6C 58 87 2D 93 D6>)
(   2,<2005-08-08 10:48:53.35 +100>,<MAYBRIDGE\NMR>,<NMR_250MHZ>,
      <Start of raw data processing
       ef LB = 0.3 FT_mod = 6 PKNL = 1 SI = 32K 
       data hash MD5: 32K
       5B C4 30 CF 4B 2A 2B 97 90 97 B9 F9 44 85 F3 6D>)
(   3,<2005-08-08 10:48:55.42 +100>,<MAYBRIDGE\NMR>,<NMR_250MHZ>,
      <apk 
       data hash MD5: 32K
       66 4C 2D 06 C5 9F 9A 01 F9 03 8C 39 C9 F8 4E 40>)
(   4,<2005-08-08 10:48:56.46 +100>,<MAYBRIDGE\NMR>,<NMR_250MHZ>,
      <abs ABSG = 5 
       data hash MD5: 32K
       AA 45 96 FD 3E C7 85 9C 2F 1E 37 E9 A0 99 BE CE>)
$$ ##END=
$$ 
$$ hash MD5
$$ 2A D0 F7 32 0F 3E 57 67 B3 31 4F BD 8C 26 01 6D
##$RELAX= 
##$RELAX= 
##$RELAX= 
##$RELAX= 
##$RELAX= 
##$RELAX= 
##$RELAX= 
$$ Bruker specific parameters
$$ --------------------------
##$DU= <C:\u>
##$EXPNO= 7280
##$NAME= <ADRS>
##$PROCNO= 1
##$TYPE= <nmr>
##$USER= <dgb>
##$AMP= (0..31)
100 100 100 100 100 100 100 100 100 100 100 100 100 100 100 100 100 100 
100 100 100 100 100 100 100 100 100 100 100 100 100 100 
##$AQSEQ= 0
##$AQ_mod= 3
##$AUNM= <au_zg>
##$AUTOPOS= <18 >
##$BF1= 250.13
##$BF2= 250.13
##$BF3= 250.13
##$BF4= 250.13
##$BF5= 500.13
##$BF6= 500.13
##$BF7= 500.13
##$BF8= 500.13
##$BYTORDA= 1
##$CFDGTYP= 0
##$CFRGTYP= 5
##$CHEMSTR= <none>
##$CNST= (0..31)
1 1 145 1 1 1 1 1 1 1 1 1 1 1 1 1 1 1 1 1 1 1 1 1 1 1 1 1 1 1 1 1 
##$CPDPRG= <>
##$CPDPRG1= <>
##$CPDPRG2= <>
##$CPDPRG3= <>
##$CPDPRG4= <mlev>
##$CPDPRG5= <mlev>
##$CPDPRG6= <mlev>
##$CPDPRG7= <mlev>
##$CPDPRG8= <mlev>
##$CPDPRGB= <>
##$CPDPRGT= <>
##$D= (0..31)
0 1 0 0 0 0 0 0 0 0.06 0 0 0 0 0 0 0.0002 0 0 0 0 0 0 0 0 0 0 0 0 0 0 
0 
##$DATE= 1123494516
##$DBL= (0..7)
120 120 120 120 120 120 120 120 
##$DBP= (0..7)
150 150 150 150 150 150 150 150 
##$DBP07= 0
##$DBPNAM0= <>
##$DBPNAM1= <>
##$DBPNAM2= <>
$$ [...]
##$SUBNAM7= <"">
##$SUBNAM8= <"">
##$SUBNAM9= <"">
##$SW= 20.6930455092707
##$SWIBOX= (0..15)
0 0 3 0 0 0 0 0 0 0 0 0 0 0 0 0 
##$SW_h= 5175.983436853
##$TD= 65536
##$TD0= 1
##$TE= 295.16
##$TE2= 300
##$TE3= 300
##$TEG= 300
##$TL= (0..7)
0 120 120 120 120 120 120 120 
##$TP= (0..7)
150 150 150 150 150 150 150 150 
##$TP07= 0
##$TPNAME0= <>
##$TPNAME1= <>
##$TPNAME2= <>
##$TPNAME3= <>
##$TPNAME4= <>
##$TPNAME5= <>
##$TPNAME6= <>
##$TPNAME7= <>
##$TPOAL= (0..7)
0.5 0.5 0.5 0.5 0.5 0.5 0.5 0.5 
##$TPOFFS= (0..7)
0 0 0 0 0 0 0 0 
##$TUNHIN= 0
##$TUNHOUT= 0
##$TUNXOUT= 0
##$USERA1= <user>
##$USERA2= <user>
##$USERA3= <user>
##$USERA4= <user>
##$USERA5= <user>
##$V9= 5
##$VALIST= <valist>
##$VCLIST= <CCCCCCCCCCCCCCC>
##$VD= 0
##$VDLIST= <DDDDDDDDDDDDDDD>
##$VPLIST= <PPPPPPPPPPPPPPP>
##$VTLIST= <TTTTTTTTTTTTTTT>
##$WBST= 1024
##$WBSW= 4
##$XGAIN= (0..3)
0 0 0 0 
##$XL= 0
##$YL= 0
##$YMAX_a= 292579
##$YMIN_a= -393526
##$ZGOPTNS= <>
##$ZL1= 120
##$ZL2= 120
##$ZL3= 120
##$ZL4= 120
##$ABSF1= 16.522
##$ABSF2= -4.171173
##$ABSG= 5
##$ABSL= 3
##$ALPHA= 0
##$AQORDER= 0
##$ASSFAC= 0
##$ASSFACI= 0
##$ASSFACX= 0
##$ASSWID= 0
##$AUNMP= <proc_1d>
##$AZFE= 0.1
##$AZFW= 0.1
##$BCFW= 0
##$BC_mod= 0
##$BYTORDP= 0
##$COROFFS= 0
##$CY= 12.5
##$DATMOD= 1
##$DC= 0
##$DFILT= <>
##$DTYPP= 0
##$F1P= 14.0000005364418
##$F2P= -0.99999901652339
##$FCOR= 0.5
##$FTSIZE= 32768
##$FT_mod= 6
##$GAMMA= 0
##$GB= 0
##$INTBC= 1
##$INTSCL= 1
##$ISEN= 128
##$LB= 0.3
##$LEV0= 0
##$LPBIN= 0
##$MAXI= 10000
##$MC2= 0
##$MEAN= 0
##$ME_mod= 0
##$MI= 0
##$NCOEF= 0
##$NC_proc= -2
##$NLEV= 6
##$NOISF1= 0
##$NOISF2= 0
##$NSP= 0
##$NTH_PI= 0
##$NZP= 0
##$OFFSET= 16.522
##$PC= 1
##$PHC0= -77.40504
##$PHC1= 6.168421
##$PH_mod= 1
##$PKNL= yes
##$PPARMOD= 0
##$PSCAL= 4
##$PSIGN= 0
##$REVERSE= no
##$SF= 250.13
##$SI= 32768
##$SIGF1= 0
##$SIGF2= 0
##$SINO= 400
##$SIOLD= 32768
##$SREGLST= <1H.CDCl3>
##$SSB= 0
##$STSI= 32768
##$STSR= 0
##$SW_p= 5175.98343685301
##$SYMM= 0
##$S_DEV= 0
##$TDeff= 65536
##$TDoff= 0
##$TI= <Analysis number 999999
Compound Code 99
Book Reference 9
Project Code 9>
##$TILT= no
##$TM1= 0
##$TM2= 0
##$TOPLEV= 0
##$USERP1= <user>
##$USERP2= <user>
##$USERP3= <user>
##$USERP4= <user>
##$USERP5= <user>
##$WDW= 1
##$XDIM= 32768
##$YMAX_p= 339989746
##$YMIN_p= -140396
$$ End of Bruker specific parameters
$$ ---------------------------------
##NTUPLES= NMR SPECTRUM
##VAR_NAME=  FREQUENCY,     SPECTRUM/REAL,   SPECTRUM/IMAG
##SYMBOL=    X,             R,               I
##VAR_TYPE=  INDEPENDENT,   DEPENDENT,       DEPENDENT
##VAR_FORM=  AFFN,          ASDF,            ASDF
##VAR_DIM=   32768,         32768,           32768
##UNITS=     HZ,            ARBITRARY UNITS, ARBITRARY UNITS
##FACTOR=    0.157963299565203, 1,           1
##FIRST=     4132.6476996994, 0,             0
##LAST=      -1043.33573715361, 0,           0
##MIN=       -1043.33573715361, -140396,     0
##MAX=       4132.6476996994, 339989746,     0
$$ Real data points
##PAGE= N=1
##DATA TABLE= (X++(R..R)), XYDATA
$$ [...]
##PAGE= N=2
##DATA TABLE= (X++(I..I)), XYDATA
17950I5332J0206l683N160R733m20k79K246J1669L843j3047k304M686o56n410
17936A17076K939R861K771Q61N675J0231J0730L017l6m369j242J664k9J3292P631
17921A80072O403M9M041R040Q831M489Q866K706L355R764L827J3987j052l0562
17907B23816l4704k6808j5236r193P200R701Q564R309P390L951Q891M743O325
17894B03949P973J3407J4107J5949J1300j1213l4100l3366l1406j5472R460J1359
17882A61947Q549J7821K5647J6284J6206k612l0064l0967k8256k7963o795L101
17870A22898J3098J6009N823R507J0687R458K425N355J7092J4773J4147J3586
17858B54858N621j8298l2180l8255l4964j6560N102N801Q427O549J0051L719n345
$$ plain form
17950 95332 105538 101855 107015 116748 116328 116049 118295 129964 133807 120760 118456 123142 122486 117076
17936 117076 120015 129876 132647 133508 139183 149414 160144 163161 163125 158756 157514 159178 159149 172441 180072
17921 180072 186475 186524 190565 199605 208436 212925 221791 224497 227852 237616 241443 255430 254378 223816
17907 223816 189112 162304 147068 137875 145075 154776 163340 172649 180039 183990 192881 197624 203949
17894 203949 211922 225329 239436 255385 266685 255472 221372 188006 156600 141128 150588 161947
17882 161947 170496 188317 213964 230248 246454 243842 213778 182811 154555 126592 119797 122898
17870 122898 135996 152005 157828 167335 178022 187480 189905 195260 212352 227125 241272 254858
17858 254858 260479 242181 210001 171746 136782 120222 125324 131125 139552 146101 156152 159871 154526
17845A54526p43J0486O549M801P556j564n72R752P390L355Q25J292O518N805n14
17830B15462L792P113L891l317k086J338L568q22p26N365n261j5563j2317L461
17816B03898J279J867J760k11K689J847R172k460K910J681r82J411N822q93M499
17801B34289J3074K191p185J851N647O236m31l82k669l191l119l447J623L092
17787B47579N277o911o829l391M876m993J76J1027K669K149l431o518M281M801
17773B50762p86J374N315K515n12L68J594l707L852L504K063M901M810R21n728
17758B71246p339N500P506l101P269M317m536J013n040q51M736J722k951M83m60
17743B79514K347L952o8m325p184K323P023O334k014N900L070m454K89N810j851
$$ plain form
17845 154526 153783 164269 170818 175619 183175 181611 181039 190791 198181 201536 202361 203653 210171 215976 215462
17830 215462 219254 226367 230258 226941 224855 226193 229761 228939 228213 233578 228317 212754 200437 203898
17816 203898 205177 207044 208804 208593 211282 213129 222301 219841 222751 224432 223450 224861 230683 229790 234289
17801 234289 247363 249554 242369 244220 249867 256103 255672 255290 252621 249430 246311 242864 244487 247579
17787 247579 252856 245945 239116 235725 240601 235608 235784 246811 249480 251629 248198 241680 245961 250762
17773 250762 249976 251350 256665 259180 258668 259036 260630 256923 260775 264279 266342 271243 276053 276974 271246
17758 271246 263907 269407 276913 273812 281081 285398 280862 281875 276835 275984 280720 282442 279491 279974 279514
17743 279514 281861 285813 285745 281420 274236 276559 283582 289916 287902 293802 296872 292418 292707 298517 296666
17728B96666j239K10J326K305P568L380J14l941j683j472J449J741N039m681k408
17713C04374O118j788j494K247l176k032K182N339k93q05L608Q003M814L539n349
17698C25287m592q612n240M314K496P942L745K286K854M118o404r254q19l711
17684C14410K911P724Q949j3J406L490m484j072Q9M120M240j738k85k780n75N68
17668C36960N014J056L448l438q033m318M528J2656L843k924l764p874l261M613
17654C38506N19j82P261L239k39N216o492N40L692K334q582l667K655J182J623
17639C47605M512L632K664P958N68j807n582j471K311j137O491r37L410M273k85
17624C72205J938M107O688k711J168q69p390l342J789O701P071l08R2K656j764
$$ plain form
17728 296666 295427 295637 296963 299268 306836 310216 310330 306389 304706 303234 304683 306424 311463 306782 304374
17713 304374 310492 308704 307210 309457 306281 304249 306431 311770 311477 310672 314280 322283 327097 330636 325287
17698 325287 320695 312083 306843 311157 313653 321595 325340 327626 330480 334598 328194 318940 318121 314410
17684 314410 317321 325045 333994 333981 335387 338877 334393 333321 333410 337530 341770 340032 339747 336967 336392 336960
17668 336960 341974 343030 346478 343040 335007 330689 335217 347873 351716 348792 345028 337154 333893 338506
17654 338506 339025 338843 346104 349343 349104 354320 347828 348368 352060 354394 345812 342145 344800 345982 347605
17639 347605 352117 355749 358413 366371 366939 365132 359550 358079 360390 359253 365744 364807 368217 372490 372205
17624 372205 374143 378250 384938 382227 383395 382526 375136 371794 373583 380284 387355 387047 387139 389795 388031
17609C88031K841k072j0265q103o204l229p13M907J683k947k6R731L989L648l110
17594C78161o246L262j346K278Q551N366L085l909J585N64K346M110k838JN704
17579D00674L151q7L022m428j0575n027j1020o322M371J658k387M85M800K731
17565C81046J839J0756J0250j777N80N568R71p904n63N171l111n965j256J865
17551C97470q604J625K748L80M591N721N536l173N200j127k358k59l848K449O376
17536D12727j160K038m24o780m033L224K139P232j918l244Q35L606N191k663n306
17521D11464k741j462P81M182M637Q740J432O084k76o401m139L060K433N164J184
17506D34142j007K674M664n309p969k442N839R928J260K171k856n928k220L39
$$ plain form
17609 388031 390872 388800 378535 370432 364228 360999 360286 365193 366876 363929 363903 373634 377623 381271 378161
17594 378161 371915 375177 373831 376109 384660 390026 393111 389202 390787 391351 393697 397807 394969 394970 400674
17579 400674 403825 403738 406760 402332 391757 386730 375710 369388 373759 375417 373030 373515 378315 381046
17565 381046 382885 393641 403891 402114 402694 408262 409233 401329 400766 405937 402826 396861 395605 397470
17551 397470 388866 390491 393239 393619 398210 403931 409467 406294 411494 410367 408009 407750 403902 406351 412727
17536 412727 411567 413605 413181 406401 402368 405592 407731 414963 413045 409801 410636 414242 419433 416770 411464
17521 411464 408723 407261 408042 412224 416861 425601 427033 433117 432841 426440 422301 425361 427794 432958 434142
17506 434142 433135 435809 440473 435164 427195 424753 430592 440520 441780 443951 441095 435167 432947 433286
17492D33286M297K482L811l175j984m672M222l280P143P050l146K501L253L750
17478D55538l138j353J547O670J949J635n682O028P17k277L855N961M478j0121
17464D65807k73N122J0037K237K19R37k131J900J0243R308k724j1399j1602o115
17450D71566N698M596P628J3002P963k7o465j0808j7934k9901k3177n655j0254
17437D06232o88J0740J6292J2355K744q704k512J2202Q377R289R182L351k827
17424D76033n65P877P614j0133j6092p040M925M850P553j065j79O895o865j1133
17410D62675j675q157m634N42J29j95j456J121P659N588o91p70l77J182k995K90
17394D58236P757O69J184K646J1313Q86J48m51l927L736K24R62N66J789j120p260
$$ plain form
17492 433286 437583 440065 443876 440701 438717 434045 438267 434987 442130 449180 446034 448535 451788 455538
17478 455538 452400 451047 452594 459264 461213 462848 457166 463194 463911 461634 465489 471450 475928 465807
17464 465807 465534 470656 480693 482930 483149 484086 481955 483855 494098 503406 500682 489283 477681 471566
17450 471566 477264 481860 489488 502490 510453 510426 503961 493153 475219 445318 422141 416486 406232
17437 406232 405544 416284 432576 444931 447675 438971 436459 448661 457038 466327 475509 478860 476033
17424 476033 475468 483345 490959 480826 464734 457694 462619 467469 475022 473957 473778 480673 473808 462675
17410 462675 461000 452843 448209 448751 448880 448685 447229 448350 456009 461597 460906 460136 459759 460941 457946 458236
17394 458236 465993 466662 467846 470492 481805 482691 482839 482388 478461 482197 482421 483383 483949 485738 484618 477358
17378D77358K311K595O058O82m722l201K461M017P217M068n397k838L389M140
17364D98138l13J090o051m215N097P905K098j972l495L18l33M27j073j811O904
17349E02714K231k416J297N375K373M88K422k077J972o18o39M213J919l965J642
17334E16931j446k812L792k830j019P134J005K665l671J197P879j139n402J542
17320E23826k672L458n319l340J600J031N102M100l720o6K166k693P650O559j518
17305E36164M518J968n892k047k043l541N240P920j75n752m213J341N912M900
17291E44300J674j832l25L385L369j975l617o337K459N314K328n582J17K723N881
17276E51882p97m894M331o09N974j785P62k833n651R614P140m082j717M476m91
$$ plain form
17378 477358 479669 482264 488322 489004 484282 481081 483542 487559 494776 498844 493447 490609 493998 498138
17364 498138 497825 498915 492864 488649 493746 501651 503749 501777 498282 498600 498267 498694 497621 495810 502714
17349 502714 504945 502529 503826 509201 511574 512062 514484 512407 514379 513761 513122 517335 519254 515289 516931
17334 516931 515485 512673 516465 513635 512616 519750 520755 523420 519749 520946 528825 527686 522284 523826
17320 523826 521154 524612 519293 515953 517553 518584 523686 527786 524066 524000 526166 523473 531123 537682 536164
17305 536164 540682 542650 536758 534711 532668 529127 534367 542287 542112 536360 532147 533488 539400 544300
17291 544300 545974 544142 543817 547202 550571 548596 544979 538642 541101 546415 548743 543161 543278 546001 551882
17276 551882 551085 546191 550522 549913 555887 554102 554864 552031 546380 555994 563134 559052 557335 561811 561320
17261E61320o389J652j039L811L066N749N422m878j350K02K570k299m310n271
17247E58256l839O354O236O475O930l564k739p343m154j151N195J047R00P149
17233E75752Q349P909j926m57Q92L214K921j316K014k770m251J718Q058L573l251
17218F00429n584o274K392J201L803J380j385l363l605K253L184L883J057j324
17204E98047J1845O728j771K863m532n589k475N089K198j909J89m75K684J574
17190F14466M645m250j598O843L498J0603K236j759M249j241j063M190K364K752
17176F45935pL598m05m912k260j540L836Q277k88L012P40Q578J519l10k30l09
17160F65234j152J354P400K376k12K537N922L127Q119M186R211J3282J0120Q114
$$ plain form
17261 561320 554931 556583 555544 559355 562421 568170 573592 568714 567364 567566 570136 567837 563527 558256
17247 558256 554417 560771 567007 573482 580412 576848 574109 566766 562612 561461 566656 567703 568603 575752
17233 575752 584101 592010 590084 589627 590519 593733 596654 595338 597352 594582 590331 592049 600107 603680 600429
17218 600429 594845 588571 590963 592164 595967 597347 595962 592599 588994 591247 594431 598314 599371 598047
17204 598047 609892 616620 614849 617712 613180 607591 605116 610205 612403 610494 610683 610208 612892 614466
17190 614466 619111 614861 613263 620106 623604 634207 636443 634684 638933 637692 636629 640819 643183 645935
17176 645935 645928 649526 649121 644209 641949 640409 644245 652522 652234 655246 655986 664564 666083 665773 665543 665234
17160 665234 664082 665436 672836 675212 675000 677537 683459 686586 694705 698891 708102 721384 731504 739618
17146G39618P514k967j7438k7398k8615j9759j2727R280J6443J6163J5480l337
17134F92257l2966l6206l3308k6339k261J1413J3433J1907J3195M912Q366P153
17122F31556P995K607J698J2572J3310J6457J8534J1855R360N3k5388l0640l0922
17109F39047j8110q655J3470J6563K1146J6661o063l4166l7895k9050k2718j4405
17097E35825J3269J4385Q737J1497J4151O372J095L427K727R125N812n302J703
17084F22823N075J243K336N816J1578l057K358P069P86P000k222J992j342j938
17070F59517p17O548N635L381R56O816l707m058J518o192k137M661Q640J471J0281
17055F92613K510k682k442O978j667J880J4251k600n133L360R152J1483R572j886
$$ plain form
17146 739618 747132 744165 726727 699329 670714 650955 638228 647508 663951 680114 695594 692257
17134 692257 659291 623085 589777 563438 561177 572590 586023 597930 611125 616037 624403 631556
17122 631556 639551 642158 643856 656428 669738 686195 704729 716584 725944 725997 700609 669969 639047
17109 639047 620937 612282 625752 642315 663461 680122 674059 639893 601998 572948 550230 535825
17097 535825 549094 563479 572216 583713 597864 604236 605331 608758 611485 620610 626422 621120 622823
17084 622823 627898 629141 631477 637293 648871 645814 648172 655241 656027 663027 660805 662797 661455 659517
17070 659517 658800 665348 670983 674364 675320 682136 678429 674371 675889 669697 667560 672221 680861 682332 692613
17055 692613 695123 692441 689999 696977 695310 697190 711441 708841 703708 707068 716220 727703 737275 735389
17041G35389q197q278o503p740j851O519J1299J2708j687j0469j4377j4911q183
17028F83719J624l735L244P538O448P927K945o904p843k750o218M964O842O697
17014G04498J0162O195l768j733j0053j0627m753J487P765R130J468J0519L780
17001G24070j816R16j241j595l039J87j251k465l717O149k398J1590J1959L869
16987G41218o833q92O564Q30M397N137m334j990M864J0159N494J137J0221M374
16973G80346l257p85R065K837K070K43P551J7209O235J3701J4372J7721K0660
16960H87968K0139J3031r311n6413p5657o4416o4738l7406Q060K3184J8572K0925
16948F83938Q594N489L044P098Q186M847J2406J2799M211J82L16J2073P095O216
$$ plain form
17041 735389 727192 718914 712411 704671 702820 709339 720638 733346 731659 721190 706813 691902 683719
17028 683719 685343 681608 684852 692390 698838 706765 709710 702806 694963 692213 685995 690959 697801 704498
17014 704498 714660 720855 717087 715354 705301 694674 689921 691408 699173 708303 709771 720290 724070
17001 724070 722254 723170 721929 720334 717295 717482 716231 713766 710049 716198 713800 725390 737349 741218
16987 741218 734385 733493 740057 740887 745284 750421 746087 744097 748961 759120 764614 765751 775972 780346
16973 780346 777089 776304 785369 788206 790276 790519 798070 815279 821514 835215 849587 867308 887968
16960 887968 908107 921138 911827 855414 779757 715341 650603 613197 621257 644441 663013 683938
16948 683938 692532 698021 701065 708163 716349 721196 733602 746401 750612 750794 751110 763183 770278 776494
16934G76494Q341J2143Q181J2750O978K0939J4895J4484J8956J0909j3705n6546
16922H34819p9132o2663m7572k8680Q638K0346J9564J4356Q649R633Q733M972
16910G11663L386N116R005L614J883Q50L694k598K204P564Q571L263J135N026
16896G64376P818K076q0K886J0910P614P098P826M626n963r215r461o26o16L27
16881G89596K137N033p379Q92N146N112O209J52J705N676N641J2686K463m527
16867H30542L76M422N519M040m171k939R738R030M758K532J133m713j662p501
16853H51104n722j442K346J208J840K529L184N651P233P774L741K139L079K644
16839H87308K955p79Q888J4519Q825N494O924L935R912J8569K1122J2043J1041
$$ plain form
16934 776494 784835 796978 805159 817909 824887 845826 860721 875205 894161 905070 891365 834819
16922 834819 755687 693024 645452 616772 625410 645756 665320 679676 688325 697958 706691 711663
16910 711663 715049 720165 729170 732784 734667 735517 739211 736613 738817 746381 754952 758215 759350 764376
16896 764376 772194 774270 774190 777076 787986 795600 802698 810524 815150 809187 799972 790511 789885 789269 789596
16881 789596 791733 796766 789387 790279 795425 800537 806746 806898 808603 814279 819920 832606 835069 830542
16867 830542 830918 835340 840859 844899 840728 837789 847527 856557 861315 863847 864980 860267 858605 851104
16853 851104 845382 843940 846286 847494 849334 851863 855047 860698 867931 875705 879446 881585 884664 887308
16839 887308 890263 889484 898372 912891 921716 927210 934134 938069 947981 966550 987672 999715 1010756
16826A010756K3800K2531N18l8381q0194q4568o1794m1199j3643R925K2182K4624
16814G94557J5265J1084R149J4910K2299J9272J2536J6250J8540K0985K0320J6151
16802I91318J1439j1034o1753p8883o5630n6211k7796N682J9619K4981Q645J4435
16790G74812J2942K73K986Q656J0848O796M530Q426M374N484K041O840L897k109
16776H50796R727J580m098L274N609R355L857J138L686M697K205J006L961R935
16762I06728J97r275J910M244k590J516O160M925O010M680K92m161L574N073N02
16747I29785K145R764O352K46m65j018J931j296O401M255k30j308n68K008k757
16732I55245k318M522k07R3m242P44Q614L776p570j030L575J2547Q549j139K321
$$ plain form
16826 1010756 1034556 1057087 1057605 1019224 939030 854462 792668 751469 737826 747751 769933 794557
16814 794557 809822 820906 830055 844965 867264 886536 899072 915322 933862 954847 975167 991318
16802 991318 1002757 991723 929970 851087 785457 729246 701450 707132 726751 751732 760377 774812
16790 774812 787754 788027 791013 799669 810517 817313 821843 830269 834643 840127 842168 849008 852905 850796
16776 850796 860523 862103 858005 861279 866888 876243 880100 881238 884924 889621 891826 892832 896793 906728
16762 906728 906925 897650 899560 903804 901214 902730 908890 913815 919825 924505 924797 920636 924210 929283 929785
16747 929785 931930 941694 948046 948292 947827 946809 948740 947444 953845 958100 957870 956562 955994 958002 955245
16732 955245 952927 957449 957242 957335 953093 953837 962451 966227 958657 957627 961202 973749 982298 981159 983480
16717I83480k596j44O65m491K574P449k305j239M282O962N057N731M634M805N865
16702A020729n609k601J037O40L718L239J950O929m76n385m118P142J313m178
16688A024330K890N539L754P355Q357N586L463N422N26j32P015M254K432J735
16674A082526m445o705P135N412O505q867o027L148Q98K36j422P28O046M523Q665
16659A098356J3248K525n603m813j395j037L484L661k322k64J144O383L820J945
16645A119132Q195J835L513K991j126j717L220j363K468n13M222M830M180J716
16631A151583O864R818M332j253m279M922K032k38M297M829q85O824M585L148
16617A196579L437P055J866O39M86m401n708O826P085J711p7m76k267r652K65
$$ plain form
16717 983480 980884 980740 981405 976914 979488 986937 984632 983393 987675 994637 999694 1005425 1010059 1014864 1020729
16702 1020729 1015120 1012519 1013556 1014196 1017914 1021153 1023103 1030032 1029556 1024171 1020053 1027195 1028508 1024330
16688 1024330 1027220 1032759 1036513 1043868 1052225 1057811 1061274 1066696 1067222 1067090 1074105 1078359 1080791 1082526
16674 1082526 1078081 1071376 1078511 1083923 1090428 1081561 1075534 1078682 1079580 1079816 1078394 1079122 1085168 1089691 1098356
16659 1098356 1111604 1114129 1108526 1103713 1102318 1101281 1104765 1108426 1106104 1105840 1106984 1113367 1117187 1119132
16645 1119132 1127327 1129162 1132675 1135666 1134540 1132823 1136043 1134680 1137148 1136635 1140857 1145687 1149867 1151583
16631 1151583 1158447 1168265 1172597 1171344 1167065 1171987 1174019 1173781 1178078 1182907 1182022 1188846 1193431 1196579
16617 1196579 1200016 1207071 1208937 1209576 1210062 1205661 1199953 1206779 1213864 1215575 1215498 1215022 1212755 1203103 1203368
16602A203368K0067J7212P307l368K360P26O287P215N720M340m183l516J512M637
16588A269684M907Q509J72R23K16M736M461J536O370O359O444j325K733M723L974
16573A324422M56q462r447j0525k234K742L891N651R372J1819R017J416Q822J0284
16559A357224M815O718L678m593K059N698O640N33L653L411j774o104l252R190
16545A387896J0293N398J808J624k045K349L027L140K830K394K420J5604J2130
16532A448868j380J280L163N925O113N629J041O294R088N243N328N896O64J81
16518A503333L275N615P930O668Q554K973J366j12P417L895M708P980L638J0873
16504A578113N063O353J0854P625M982r9n433r872k236K55J08O278J1367M618
$$ plain form
16602 1203368 1223435 1240647 1247954 1244586 1246946 1247672 1253959 1261174 1266894 1271234 1267051 1263535 1265047 1269684
16588 1269684 1274591 1283100 1283272 1284195 1284411 1289147 1293608 1295144 1301514 1307873 1314317 1312992 1315725 1320448 1324422
16573 1324422 1324878 1316416 1306969 1296444 1294210 1296952 1300843 1306494 1315866 1327685 1336702 1338118 1346940 1357224
16559 1357224 1362039 1368757 1372435 1367842 1369901 1375599 1382239 1382772 1386425 1389836 1388062 1381958 1378706 1387896
16545 1387896 1398189 1403587 1405395 1407019 1404974 1407323 1410350 1413490 1416320 1418714 1421134 1436738 1448868
16532 1448868 1447488 1448768 1451931 1457856 1463969 1469598 1470639 1476933 1486021 1491264 1496592 1502488 1503152 1503333
16518 1503333 1506608 1512223 1520153 1526821 1535375 1538348 1539714 1539602 1547019 1550914 1555622 1563602 1567240 1578113
16504 1578113 1583176 1589529 1600383 1608008 1612990 1612891 1607458 1597586 1595350 1595605 1595713 1601991 1613358 1617976
16490A617976K33O915J0605J1011R053L21P538J0736P943R404O007O205K774L346
16476A710067N946m225j1652M805P321O128P061N794J1808J5520K093P858J1743
16463A780267J1148R538N4M940J0898N477R526J2389Q076P753O049K094O210K817
16449A877236P98L436J7494J4171M626k548Q587J6753J1773J6032J6301J9263
16437B003922J0021R04k864J34K952J281P734J3834O633L942N336M333J3103J4035
16423B085300R894Q964J0549J3504R642N370J6859K1643J9847J4317O406J893
16411B224188k53K768L512J1255R887J1557J0059J1343Q791J8505J2365J7013
16399B340990J6066J2574J4735J6919J4519R857P330J0835J8216J9846J6570K2151
$$ plain form
16490 1617976 1618209 1625124 1635729 1646740 1655793 1656114 1663652 1674388 1682331 1691735 1697742 1703947 1706721 1710067
16476 1710067 1716013 1711788 1700136 1704941 1712262 1718390 1725451 1731245 1743053 1758573 1760666 1768524 1780267
16463 1780267 1791415 1800953 1801007 1805947 1816845 1822322 1831848 1844237 1852313 1860066 1866115 1868209 1874419 1877236
16449 1877236 1878034 1881470 1898964 1913135 1917761 1915213 1923800 1940553 1952326 1968358 1984659 2003922
16437 2003922 2013943 2014847 2011983 2012117 2015069 2016350 2024084 2037918 2044551 2048493 2053829 2058162 2071265 2085300
16423 2085300 2095194 2104158 2114707 2128211 2137853 2143223 2160082 2181725 2201572 2215889 2222295 2224188
16411 2224188 2223935 2226703 2230215 2241470 2251357 2262914 2272973 2284316 2293107 2311612 2323977 2340990
16399 2340990 2357056 2369630 2384365 2401284 2415803 2425660 2432990 2443825 2462041 2481887 2498457 2520608
16387B520608L1119K3448K6099K9591K2870J2433J314q794q048j2481P071K7796
16375B673026M1630M2219K7168m914k7050k8259j5412J2225K7184K0249K8616
16364B796682M3862M6800L1817P563j1671j0033o126J3384K9815M5358M6676M9562
16352C083689K8281k966k9295m3515k0718J0468M2662N8798L8256K5748K6836
16341C218244L3845K9070K0776K8507L4792L8725L8433L5784L9157L5030L3277
16330C585640K9868L7642L5924K5698L1473L1493L8445N1614N4412M6966M7811
16319D016986M6002M7138N3636N1209M9119M7770N1818N2340N3493O1846N6931
16308D588288N9995O0404O3614O2565N9370O6594P1732P3518P8577Q2203Q3175
$$ plain form
16387 2520608 2551727 2575175 2601274 2630865 2653735 2666168 2667482 2658688 2650640 2638159 2645230 2673026
16375 2673026 2714656 2756875 2784043 2779129 2752079 2723820 2708408 2720633 2747817 2768066 2796682
16364 2796682 2840544 2887344 2919161 2926724 2915053 2905020 2898894 2912278 2942093 2987451 3034127 3083689
16352 3083689 3111970 3109004 3079709 3036194 3015476 3025944 3068606 3127404 3165660 3191408 3218244
16341 3218244 3252089 3281159 3301935 3330442 3365234 3403959 3442392 3478176 3517333 3552363 3585640
16330 3585640 3615508 3653150 3689074 3714772 3746245 3777738 3816183 3867797 3922209 3969175 4016986
16319 4016986 4062988 4110126 4163762 4214971 4264090 4311860 4363678 4416018 4469511 4531357 4588288
16308 4588288 4648283 4708687 4772301 4834866 4894236 4960830 5032562 5106080 5184657 5266860 5350035
16297E350035Q7779P9661Q8072Q9869R1291J03758J07912J05811J12802J17254
16287F334244J23341J27873J37038J50759J55787J53855J60546J64199J79718
16278G687360J99325K02322K19390K32788K27237K11137J78654J81787K18188
16269I558188K60910L21610L93349M33075M63158M89782M93616M96827N48814
16260A3459329O33581P37728Q72956J010726J169826J367825J582339J861046
16252B2695356K259211K769648L355148M059299M114766O86979r271832j6899879
16244A3768696j5175441j2686225p811181m5892L817146M081858L450116K788472
16236g812451K162419J786890J761742J978044K247979K471034K725531L069448
$$ plain form
16297 5350035 5437814 5517475 5605547 5695416 5786707 5890465 5998377 6104188 6216990 6334244
16287 6334244 6457585 6585458 6722496 6873255 7029042 7182897 7343443 7507642 7687360
16278 7687360 7886685 8089007 8308397 8541185 8768422 8979559 9158213 9340000 9558188
16269 9558188 9819098 10140708 10534057 10967132 11430290 11920072 12413688 12910515 13459329
16260 13459329 14092910 14830638 15703594 16714320 17884146 19251971 20834310 22695356
16252 22695356 24954567 27724215 31079363 35138662 39253428 39940407 30668575 13768696
16244 13768696 -1406745 -14092970 -21904151 -21950043 -18132897 -14051039 -10600923 -7812451
16236 -7812451 -5650032 -3863142 -2101400 -123356 2124623 4595657 7321188 10390636
16228A0390636L476785M026387M487306L157326l638315j4318689j6184598j3595081
16220b2198243j0565517l698589K438357L945285L467947K746559K015202J374565
16212b0474434J041975J002951J067569J092242J049685R48624Q31643O95480
16204a2744265N94248N36304M85775M69972M68690M44580M00396L13163K40741
16195h790396K13330K03565K23499K58208K66345K49173K31490K17232J94760
16186f732794J86655J72434J62199J61420J50332J35682J26739J22224J22444
16177e392665J17129J12710J06187R9808J01324J00818R0640Q7136Q5205Q2597
16167d409111Q2971P3892O8549O9188P0359O7636O8266P2168O8699O2666O3643
$$ plain form
16228 10390636 13867421 17893808 22381114 25538440 21900125 7581436 -8603162 -22198243
16220 -22198243 -32763760 -36462349 -34023992 -30078707 -26610760 -23864201 -21848999 -20474434
16212 -20474434 -19432459 -18429508 -17361939 -16269697 -15220012 -14271388 -13439745 -12744265
16204 -12744265 -12150017 -11613713 -11127938 -10657966 -10189276 -9744696 -9344300 -9031137 -8790396
16195 -8790396 -8577066 -8373501 -8150002 -7891794 -7625449 -7376276 -7144786 -6927554 -6732794
16186 -6732794 -6546139 -6373705 -6211506 -6050086 -5899754 -5764072 -5637333 -5515109 -5392665
16177 -5392665 -5275536 -5162826 -5056639 -4956831 -4855507 -4754689 -4664049 -4576913 -4491708 -4409111
16167 -4409111 -4326140 -4252248 -4183699 -4114511 -4044152 -3976516 -3908250 -3836082 -3767383 -3704717 -3641074
16156c641074O1819N5700M6572N0933N2798N2367N2670M3726M0190M1335L9317
16145c103647M2754L1851L7064M1016M1809L9688L9957M9691M1365L7102M0113
16134b661237L4562K9586L4010L3119L3540L2849K7662K7996K8067L2617L7188
16123b310041M2366N4946L0030N488M263J5911L2688P107k936M991J8099K7704
16111b069384K5864K3639K8136K5884K5927K5776J6901J3675J5212J3678J9624
16100a835068M0507M4043J7372j535J2340J8109L186j4241r301R958K0047K0258
16088a674325J4698J6903K2867J9026J9522J9429J4652J3512J0419J2382J3815
16077a497100J6291J8044J1190J0584J0790J7698J0780P769J8012J7500R224N209
$$ plain form
16156 -3641074 -3579255 -3523555 -3476983 -3426050 -3373252 -3320885 -3268215 -3224489 -3184299 -3142964 -3103647
16145 -3103647 -3060893 -3029042 -2991978 -2950962 -2909153 -2869465 -2829508 -2779817 -2738452 -2701350 -2661237
16134 -2661237 -2626675 -2597089 -2563079 -2529960 -2496420 -2463571 -2435909 -2407913 -2379846 -2347229 -2310041
16123 -2310041 -2267675 -2212729 -2182699 -2177211 -2172948 -2157037 -2124349 -2117242 -2120178 -2115187 -2097088 -2069384
16111 -2069384 -2043520 -2019881 -1991745 -1965861 -1939934 -1914158 -1897257 -1883582 -1868370 -1854692 -1835068
16100 -1835068 -1794561 -1750518 -1733146 -1734681 -1722341 -1704232 -1701046 -1715287 -1724588 -1714630 -1694583 -1674325
16088 -1674325 -1659627 -1642724 -1619857 -1600831 -1581309 -1561880 -1547228 -1533716 -1523297 -1510915 -1497100
16077 -1497100 -1480809 -1462765 -1451575 -1440991 -1430201 -1412503 -1401723 -1393954 -1375942 -1358442 -1349218 -1344009
16065a344009R939J4277P719J9146J2256N944J4523J8520J3677K2564J8226J0813
16053a176405K0225J2826M327Q031m30r8J691M177J4620J1843Q352J0663J0326
16040a069852O969O127O554J2381J3539J0435J2619J3673J5941J6813J8825J436
16028i34540O33L426L543m970P199O066N863Q910N207K223R705J1770P779J2129
16014h55057J3842J885K128K476R910J4199Q496Q715L626K486M948M132N168L275
16000g69771p722K673Q198O735O425L457J1315J2391M996R686J1479L348o36N639
15986f91787J0226R287P975L741L362N259O166M291M369P158M200l76J772J0422
15972f13935N479k107M149L414K479J0852J1861N762K38L304k746m480N953R254
$$ plain form
16065 -1344009 -1334070 -1319793 -1312074 -1292928 -1280672 -1274728 -1260205 -1241685 -1228008 -1205444 -1187218 -1176405
16053 -1176405 -1156180 -1143354 -1139027 -1130996 -1131426 -1131524 -1129833 -1125656 -1111036 -1099193 -1090841 -1080178 -1069852
16040 -1069852 -1062883 -1056756 -1050202 -1037821 -1024282 -1013847 -1001228 -987555 -971614 -954801 -935976 -934540
16028 -934540 -933907 -930481 -926938 -931908 -924709 -918643 -912780 -903870 -898663 -896440 -886735 -874965 -867186 -855057
16014 -855057 -841215 -839330 -837202 -834726 -824816 -810617 -802121 -793406 -789780 -787294 -782346 -778214 -773046 -769771
16000 -769771 -777493 -774820 -766622 -759887 -753462 -750005 -738690 -726299 -721303 -711617 -700138 -696790 -697426 -691787
15986 -691787 -681561 -672274 -664299 -660558 -657196 -651937 -645771 -641480 -637111 -629953 -625753 -626129 -624357 -613935
15972 -613935 -608456 -610563 -606414 -603000 -600521 -589669 -577808 -572046 -571808 -568504 -571250 -575730 -569777 -560523
15958e60523P358R627M533R28K719P091M467j248K891N318O319P693M742M499
15944d93586k323P995J1207L895q97M678M758L728R080j656l408P385J0582K602
15930d35960p62K215j785N60O255M393K440j869k459O834Q372P619J2464R217
15916c82466N121J705M814J158L755J819N106M209J116O517R120M574K018j308
15902c32742q513m124J296k654Q303J5314J1456M012M106J1596N745m260j181
15889b91646Q12O5O280Q467N156j887l295m803P328J0670M190J188K410k421M134
15874b53352K720K699O769L18K478M929J485J15Q600N900N107J12Q0l1l360J357
15858b14074N202l263m780l112J1946J0034P424j061k792P658R148O259o65J843
$$ plain form
15958 -560523 -553165 -543538 -539005 -538077 -535358 -528267 -523800 -525048 -522157 -516839 -510520 -502827 -498085 -493586
15944 -493586 -495909 -487914 -476707 -472812 -473709 -469031 -464273 -460545 -451465 -453121 -456529 -449144 -438562 -435960
15930 -435960 -436722 -434507 -436292 -435732 -429477 -425084 -422644 -424513 -426972 -420138 -411766 -404147 -391683 -382466
15916 -382466 -377345 -375640 -370826 -369668 -365913 -364094 -358988 -354779 -353663 -347146 -338026 -333452 -331434 -332742
15902 -332742 -341255 -345379 -344083 -346737 -338434 -323120 -311664 -307652 -303546 -291950 -286205 -290465 -291646
15889 -291646 -290834 -290769 -284489 -276022 -270866 -272753 -276048 -280851 -273523 -262853 -258663 -257475 -255065 -257486 -253352
15874 -253352 -250632 -247933 -241164 -240846 -238368 -233439 -231954 -231839 -223239 -217339 -212232 -212120 -212040 -212071 -215431 -214074
15858 -214074 -208872 -212135 -216915 -220027 -208081 -198047 -190623 -191684 -194476 -186818 -177670 -171411 -172076 -170233
15844a70233L16J948P499Q445N219L772o827N493N948K105r21m091k553l803Q368
15829a39315M883l010J342Q976M750M806L988k213J806N522O178M32N119M45M77
15814i5814j867j707L342O739J1381J096k751L711N216k854k472J206J0284J0763
15800e3727M750L502N555M102n988o246l755k732J354L953Q165R45K451K449o95
15785c5917K788J061j856Q877N315K106L737M676K778l472j678L33M700p57r477
15770a6786j430n56k94j101M357R665K872p5L323R625M084J922j408n535r134
15755d71l188N951J2317O999J159K904K071l444N041P740j61J364N483N195M293
15740E3253K477j517k127J572N799M712J946K778j750k041N284K705j09l322j563
$$ plain form
15844 -170233 -169917 -167969 -160470 -152025 -146806 -143034 -149861 -144368 -138420 -136315 -137236 -141327 -143880 -147683 -139315
15829 -139315 -134432 -137442 -136100 -127124 -122374 -117568 -113580 -115793 -113987 -108465 -102287 -101855 -96736 -96291 -95814
15814 -95814 -97681 -99388 -96046 -89307 -77926 -76830 -79581 -75870 -70654 -73508 -75980 -74774 -64490 -53727
15800 -53727 -48977 -45475 -39920 -35818 -41806 -48052 -51807 -54539 -53185 -49232 -41067 -40122 -37671 -35222 -35917
15785 -35917 -33129 -32068 -33924 -25047 -19732 -17626 -13889 -9213 -6435 -9907 -11585 -11252 -6552 -7309 -16786
15770 -16786 -18216 -18772 -19066 -20167 -15810 -6145 -3273 -3348 -25 9600 13684 15606 14198 8663 -471
15755 -471 -3659 2292 14609 21608 22767 25671 27742 24298 29339 37079 36918 38282 43765 48960 53253
15740 53253 55730 54213 52086 53658 59457 64169 66115 68893 67143 65102 70386 73091 72982 69660 68097
15725F8097M271K916R108J364R81j044p39N474L255k026M213M357J292N841N511
15710A12871j495M006J600k171K969N727k474k257J0492R985P96K722l981p179
15696A31611L205N832M763K606K142O725O58K028O277j936J418M086o2L531J230
15681A74114M305K36J0540P071j784P507P766K730K096Q887P646J0140J1896J4021
15667B67171Q072J7310K6998L4369J4209k9566p2422q2393p2434n6388j4218J5168
15655E5876K1150K7192J4332O753J8355J5989R258R766J3270J6203J5577J3449
15643B37170K0604K7537J9975o294n0404p9460p3764n9179l4470n137K2251K9640
15631D8469J5393J0880Q153P670J1062J2592L724r94Q984N515J22R823J774N695
$$ plain form
15725 68097 72368 75284 84392 85756 86737 85693 84954 90428 93683 91657 95870 100227 101519 107360 112871
15710 112871 111376 115382 116982 114811 117780 123507 121033 118776 129268 139253 140049 142771 138790 131611
15696 131611 134816 140648 145411 148017 150159 156884 157542 159570 165847 163911 165329 169415 169353 172884 174114
15681 174114 178419 178655 189195 196266 194482 201989 209755 212485 214581 223468 231114 241254 253150 267171
15667 267171 275243 292553 319551 353920 368129 338563 266141 183748 111314 54926 40708 55876
15655 55876 77026 104218 118550 125303 143658 159647 168905 178671 191941 208144 223721 237170
15643 237170 257774 285311 305286 298992 248588 169128 95364 36185 1715 -3422 18829 48469
15631 48469 63862 74742 82895 90565 101627 114219 117943 116949 125933 131448 131570 141393 143167 148862
15617A48862J4348N793m740n738K928P489k709O706O405K972m942j003M941J0733
15603A92045N479P900k23J309r7K505J192L851R447n760k615Q138P174M253j821
15588B32777n491o529p742O947J0860P722M76N357L002k51K491J31k023L563j647
15573B49643Q277l496M353j040N963j342k167L847O460J335N650O744o012n250
15559B72965N05N666O907O191P049k094j970M01l120o06N335O565l96l947P56
15544C00207j598r50L977J630k544N172n94j085m740j159R205Q658Q108j564l296
15529C19427n94K046O212J490k098o39J610p60K516N12p07RM982k324j652L121
15513C33151M732N420l319n56J762l416j332N346O879m387O068J821l331J420
$$ plain form
15617 148862 163210 169003 164263 158525 161453 168942 166233 172939 179344 182316 177374 176371 181312 192045
15603 192045 197524 205424 205201 206510 206413 208918 210110 213961 223408 217648 215033 223171 230345 234598 232777
15588 232777 227286 220757 213015 219962 230822 238544 239020 244377 247379 247128 249619 249750 247727 251290 249643
15573 249643 257920 254424 258777 257737 263700 262358 260191 264038 270498 271833 277483 284227 278215 272965
15559 272965 273470 279136 286043 292234 299283 297189 295219 295620 292500 291894 297229 303794 303398 299451 300207
15544 300207 298609 297659 301636 303266 300722 305894 305300 304215 299475 298316 307521 316179 324287 322723 319427
15529 319427 318833 320879 327091 328581 326483 325844 327454 326694 329210 329722 329015 329024 334006 331682 330030 333151
15513 333151 337883 343303 339984 339428 341190 337774 336442 341788 348667 344280 350348 352169 348838 350258
15499C50258L451K905K809j253n11M526Q161M773m835k626J800N972j103n501
15485C68826L84N771O569M101M465o651r32N507N274m38o154o185o14O542M883
15470C91348N376O199k716J999N551O046j969K334J308L874M814m6l595K442M435
15455D27400O152m400p149p207o75L643m409L781L631L1R630O292L184k958o896
15440D30050m469O827j474k915m324Q77k877J1361R483K916l78K443J221k002
15426D46739O182K773q80m799n61J556K970O761k775l116L330k937m71J2358N908
15411D73038k620l359O714p40J80N029K779N149N877L484m741m815M059r32R29
15396D90031O514M55m894n32J374O989N136J202P663O427M758o78m17L308P574
$$ plain form
15499 350258 353709 356614 359423 358170 357659 362185 370346 375119 370284 367658 369458 375430 374327 368826
15485 368826 369210 374981 381550 385651 390116 383465 382533 388040 393314 392876 386722 380537 379923 386465 391348
15470 391348 396724 402923 400207 402206 407757 413803 411834 414168 415476 419350 424164 424118 420523 422965 427400
15455 427400 433552 429152 422003 414796 414121 417764 413355 417136 420767 420798 430428 436720 439904 436946 430050
15440 430050 425581 432408 430934 428019 423695 424572 421695 433056 442539 445455 445077 447520 448741 446739
15426 446739 452921 455694 454814 450015 449454 451010 453980 460741 457966 454850 458180 455243 454772 467130 473038
15411 473038 470418 467059 473773 473033 473213 478242 481021 486170 492047 495531 490790 485975 490034 489102 490031
15396 490031 496545 497000 492106 491574 492948 499937 505073 506275 513938 520365 525123 524445 524028 527336 534910
15381E34910O201j2055l032K708j194m769Q009J0176J310l151K28L445N937N529
15367E54252P052J224N95q661q40m5r158j3595p085j0826q367j960l942j801Q24
15352D97667N39N565P929R585Q303P426O206N573L623k619L470q386j9218q619
15338E17044j840p089k743J092O149j032N82M831n56P683N410O813M029l041L343
15323E40675L214P406k239q25O841l196k953O848n991p384M716M120J450N548
15309E58230J324k192j815R584L897r167K249J678k898P01O665K438J366K137
15295E74197K396k46k611L14L923j185m871m87P420O513K332k04j565O56J912
15280E88494J329J170K888K390j052K41Q8n458j212L17J590q12m471j868L477
$$ plain form
15381 534910 541111 529056 526024 528732 527538 522769 530778 540954 542264 539113 539341 542786 548723 554252
15367 554252 561304 562528 563123 554462 553622 553577 544419 530824 523739 512913 504546 502586 498644 496843 497667
15352 497667 498206 503771 511700 521285 529588 537014 543220 548793 552416 549797 553267 544881 525663 517044
15338 517044 515204 508115 505372 506464 512613 511581 512163 516994 516438 524121 529531 536344 540373 537332 540675
15323 540675 543889 551295 549056 548231 555072 551876 548923 555771 549780 542396 547112 551232 552682 558230
15309 558230 559554 557362 555547 565131 569028 559861 562110 563788 560890 561591 568256 570694 572060 574197
15295 574197 576593 576347 573736 574050 577973 576788 571917 571430 578850 585363 587695 587491 585926 586582 588494
15280 588494 589823 590993 593881 596271 595219 595460 595548 590090 588878 589195 590785 589973 585502 583634 587111
15265E87111K042O16N232j876k028k986o290L49J0862O045N74p526o186K553N464
15250E93956q78M310N993k68k171j377j916N947j17j645m149P076j409p655J460
15235E97157P028K752j54l10q22M694K277R01P345N36p24l578J046m74q60K501
15219F19315L962J997j910M803N656K000j181M80K116k158j851L892K536J735
15205F41392L66j618k428J19L854L127p73L208N87O95L194l516l052j065O713
15190F50803L648O18K870J0036L722p238J415m559J60O002Q86l27j465J180j856
15175F65895k959O404O074L123K187L478J964J362j136J902N537K811l812m954
15161F87876j665k37P649O281m031j578L833k484l406R81P341R237K657j699l446
$$ plain form
15265 587111 589153 589769 595001 593125 591097 588111 581821 582170 593032 599077 599651 592125 585939 588492 593956
15250 593956 593078 597388 603381 603113 600942 599565 597649 603596 603479 601834 597685 604761 603352 595697 597157
15235 597157 604185 606937 606783 606473 605651 610345 612622 613523 620868 621404 620680 617102 618148 617674 616814 619315
15219 619315 623277 625274 623364 628167 633823 635823 634642 635122 637238 635080 633229 637121 639657 641392
15205 641392 641758 640140 637712 637831 641685 644812 644039 647247 647834 648529 651723 648207 645155 644090 650803
15190 650803 654451 655069 657939 667975 671697 664459 665874 661315 661475 667477 668363 668036 666571 667751 665895
15175 665895 662936 669340 675414 678537 680724 684202 686166 687528 686392 688294 693831 696642 692830 687876
15161 687876 686211 685974 693623 699904 695873 694295 698128 695644 692238 693219 700560 709797 712454 710755 707309
15146G07309r35M186l68K598j770j680M023O554L811J132K768O44N492N982J155
15131G40901p643K479J592N5L929K297L470O7Q569M422k941L159J4k86K998O35
15115G63717k891j447K659K919l114m746n597L540N197N25k583J508N130K620
15101G67437N360n33N580N851R34N73N43l646K227K908Q902L188M151J772J548
15086H06795l630j895k039R82K85j573K133Q709J365L708M223J108q63m423n593
15071H09292n662L484K124k096J696M111R99J355N255N027J0410R502j649o928
15057H36920O017k591J356P369L634k733R94J733J299j183m483n549L539J6231
15043H62553N63p676o934K963j807K650M668L601J0948M959m76k705M431q4p26
$$ plain form
15146 707309 706374 710560 710192 712790 711020 709340 713363 719917 723728 724860 727628 728272 733764 739746 740901
15131 740901 733258 735737 737329 737384 741313 743610 747080 747147 755716 760138 757197 760356 760370 760084 763082 763717
15115 763717 760826 759379 762038 764957 761843 757097 751500 755040 760237 760762 758179 759687 764817 767437
15101 767437 772797 772264 777844 783695 784629 785202 785745 782099 784326 787234 796136 799324 803475 805247 806795
15086 806795 803165 801270 799231 800213 800498 798925 801058 809767 811132 814840 819063 820171 819308 814885 809292
15071 809292 803630 807114 809238 807142 808838 812949 813948 815303 820558 825585 835995 845497 843848 836920
15057 836920 842937 840346 841702 849071 852705 849972 850966 852699 853998 852815 848332 842783 846322 862553
15043 862553 863116 855440 848506 851469 849662 852312 856980 860581 871529 876488 876012 873307 877738 877654 876928
15028H76928O365M057O324m394o38L949Q50p2O346L864Q603j18p38M523P94p484
15012I09159j186J028K348q74J281Q397J592o004l404K158J426K348M188O726
14998I29183P16l0L531L886j737j6273n429L579M479O553O375K295n51L954O42
14983I41173M04M105M456J885K206K78N385M806k219l097j768O588J61L377L97
14968I68137J395j547J073n66R35M109P002L001k491J958M966K715o132O00P539
14953I92694N833P475j625o395O947K594l563l913M878L489J533J105L262L507
14939A017821K615N01L393J592j770K528M174j592k679L972p80M958K105j643
14925A035195k822J467P804n47n18r31k978K027J1216Q246L816p45N744J346j658
$$ plain form
15028 876928 883293 887350 893674 889280 888642 892591 893441 893369 899715 903579 912182 912064 911326 915849 916643 909159
15012 909159 907973 909001 911349 910475 911756 920153 921745 915741 912337 914495 915921 918269 922457 929183
14998 929183 929899 929869 933400 937286 935549 919276 913847 917426 921905 928458 934833 937128 936577 940531 941173
14983 941173 941577 945682 950138 952023 954229 954507 959892 964698 962479 959382 957614 964202 964363 967740 968137
14968 968137 969532 967985 969058 968492 969427 973536 980538 983539 981048 983006 987972 990687 984555 985155 992694
14953 992694 998527 1006002 1004377 997982 1004929 1007523 1003960 1000047 1004925 1008414 1009947 1011052 1014314 1017821
14939 1017821 1020436 1020937 1024330 1025922 1024152 1026680 1030854 1029262 1026583 1030555 1029775 1034733 1036838 1035195
14925 1035195 1032373 1033840 1041644 1041097 1040579 1039648 1036670 1038697 1049913 1058159 1061975 1061230 1066974 1068320 1066662
14910A066662L987L872p43Q34O235O602L708l142q59M591J323O049m688q87O936
14895A100480M39m285L983M975m430K555P52R17k27N322N906k547k474M642M799
14880A120807r36l781O27J016N750J044Q524J0483K269P339N127R99p354k125
14866A149789k34K995M10M452J750K2N210K947p74J994J065n836K019M488m520
14851A165777O44P610k802L98J580J1046k026q25J3714Q338o69k467O455rP09
14836A207473J183L258K37J238l345j706L778R642O271K313N118L600L896J687
14822A244643K088k546l144L382Q480k376m75J644M181R81j083J128J625p98P153
14807A264883R418L979k195L719M439n867o558M485Q169J1365M058L390L090R36
$$ plain form
14910 1066662 1070649 1074521 1073778 1074612 1080847 1087449 1091157 1088015 1087156 1091747 1093070 1099119 1094431 1093544 1100480
14895 1100480 1100919 1096634 1100617 1105592 1101162 1103717 1104469 1105386 1105159 1110481 1116387 1113840 1111366 1116008 1120807
14880 1120807 1119871 1116090 1116717 1117733 1123483 1124527 1133051 1143534 1145803 1153142 1158269 1159268 1151914 1149789
14866 1149789 1149555 1152550 1152960 1157412 1159162 1159184 1164394 1167341 1166567 1168561 1169626 1163790 1165809 1170297 1165777
14851 1165777 1166421 1174031 1171229 1171627 1173207 1184253 1182227 1181402 1195116 1203454 1202785 1200318 1206773 1206764 1207473
14836 1207473 1208656 1211914 1212151 1213389 1210044 1208338 1212116 1221758 1228029 1230342 1235460 1239060 1242956 1244643
14822 1244643 1246731 1244185 1241041 1244423 1252903 1250527 1250052 1251696 1255877 1256858 1255775 1256903 1258528 1257730 1264883
14807 1264883 1274301 1278280 1276085 1279804 1284243 1278376 1271818 1276303 1284472 1295837 1299895 1303285 1306375 1307311
14793A307311q16J468J0935n513o807M269r75P818j998m570J599O652Q660O011
14779A334044k383P496O258l035k695J535l212N387L802N570N37O11j402M342
14765A356855M623J892N640M675J562L931M753L779L738Q182J3511J621L39J018
14751A416119J568O649o26j95k303k151M070P323K801k523j719N695j3N072J215
14736A440982K443K975P18Q697j344J769O237K568L030K053r98K795N086N701
14722A482712p06J650N960K190n151k48P406Q493J872M148j949O95Q458K930M223
14707A522683R982J730K00O515K734k13K947J0456J942l659K021P437L851O164
14693A574790L900P4k256L154J898N723j946R15N356L494J0848N525R147o684
$$ plain form
14793 1307311 1306495 1307963 1318898 1313385 1306578 1310847 1309872 1317690 1315692 1311122 1312721 1319373 1328033 1334044
14779 1334044 1331661 1339157 1345415 1342380 1339685 1341220 1338008 1343395 1347197 1352767 1353304 1353915 1352513 1356855
14765 1356855 1361478 1363370 1369010 1373685 1375247 1379178 1383931 1387710 1391448 1399630 1413141 1414762 1415101 1416119
14751 1416119 1417687 1424336 1423710 1423515 1421212 1419061 1423131 1430454 1433255 1430732 1429013 1434708 1434695 1439767 1440982
14736 1440982 1443425 1446400 1447118 1455815 1454471 1456240 1462477 1465045 1468075 1470128 1469130 1471925 1477011 1482712
14722 1482712 1482006 1483656 1489616 1491806 1486655 1486407 1493813 1502306 1504178 1508326 1506377 1507072 1515530 1518460 1522683
14707 1522683 1532665 1534395 1534595 1541110 1543844 1543631 1546578 1557034 1558976 1555317 1557338 1564775 1568626 1574790
14693 1574790 1578690 1578764 1576508 1579662 1581560 1587283 1585337 1586252 1591608 1595102 1605950 1611475 1620622 1613938
14679A613938J129K261K480P915O143l378o42m09J0644O983m994J496J0098N616
14665A659280K805J663N446J759o455J0587Q499O668Q833J483k120J172J0067
14652A709687J4978k575J119N877Q42M345n865K593N813O788K125N227O949k57
14638A757646M884Q838P808L238k36Q842K752J0264M147O604M559j476J03K63
14624A818236Q558O049L833O570K325P33L639O776Q543K091P857J2469M551J604
14610A893834k035k965P56j919N675J3357P589J1064M182Q42k962K228O243P175
14596A943064J1013P366N385N606l189q65J0819J0923Q670j606L01n74O737N895
14582B009545J498O336Q473N730M401R023N934L261J70M375O252P624L753M343
$$ plain form
14679 1613938 1615067 1617328 1619808 1627723 1633866 1630488 1629846 1629437 1640081 1647064 1642070 1643566 1653664 1659280
14665 1659280 1662085 1663748 1669194 1670953 1664498 1675085 1683584 1690252 1699085 1700568 1698448 1699620 1709687
14652 1709687 1724665 1722090 1723209 1729086 1729928 1734273 1728408 1731001 1736814 1743602 1745727 1750954 1757903 1757646
14638 1757646 1762530 1771368 1779176 1782414 1782178 1791020 1793772 1804036 1808183 1814787 1819346 1817870 1817973 1818236
14624 1818236 1826794 1832843 1836676 1843246 1845571 1846304 1849943 1856719 1865262 1867353 1875210 1887679 1892230 1893834
14610 1893834 1891799 1888834 1889590 1887671 1893346 1906703 1914292 1925356 1929538 1930380 1927418 1929646 1935889 1943064
14596 1943064 1954077 1961443 1966828 1972434 1969245 1968380 1979199 1990122 1998792 1997186 1997487 1996913 2003650 2009545
14582 2009545 2011043 2017379 2025852 2031582 2035983 2045006 2050940 2054201 2054371 2058746 2064998 2072622 2076375 2080718
14568B080718J779K315J0181Q085O499K22J0138R311O50N618J1050N580K843N307
14554B160296O724R17m080O670J4929O869O974P453m586N582R065J4759O145l249
14540B234468O793J4783L984M412J2686L493O448O964J403O711L335q38P463J3224
14526B325329J1208M567M140M973J2375J5998L560N981Q63M902J4586M785K434
14513B415701J2006R973P269L536N680J4023O798P290O694J3165J2417M791N052
14500B524395Q634O123O364R847M576J2593Q015P934P873J1346l608M856O614
14487B615562J0491P262Q446J0684R094J4475N780J0241J4318Q214M915P652M677
14474B731811J3431N520L945K817O089J0743Q250Q207J3367P913R602J2166R229
$$ plain form
14568 2080718 2082497 2084812 2094993 2103078 2109577 2109799 2119937 2129248 2129898 2135516 2146566 2152146 2154989 2160296
14554 2160296 2167020 2167937 2163857 2170527 2185456 2192325 2199299 2206752 2202166 2207748 2216813 2231572 2237717 2234468
14540 2234468 2241261 2256044 2260028 2264440 2277126 2280619 2287067 2294031 2295434 2302145 2305480 2304642 2312105 2325329
14526 2325329 2336537 2341104 2345244 2350217 2362592 2378590 2382150 2388131 2388994 2393896 2408482 2413267 2415701
14513 2415701 2427707 2437680 2444949 2448485 2454165 2468188 2474986 2482276 2488970 2502135 2514552 2519343 2524395
14500 2524395 2533029 2539152 2545516 2555363 2559939 2572532 2580547 2588481 2596354 2607700 2604092 2608948 2615562
14487 2615562 2626053 2633315 2641761 2652445 2661539 2676014 2681794 2692035 2706353 2714567 2719482 2727134 2731811
14474 2731811 2745242 2750762 2754707 2757524 2763613 2774356 2782606 2790813 2804180 2812093 2821695 2833861 2843090
14461B843090J3301P731Q893J1290J5898J4148N007M505N159J0265J0496K227
14449B952010J3727K4905J5719M896O483R136J1472J3927R276P998J1378J2712
14437C093639N118Q676J2712J4939R306P473J3717K0847J2293J235Q932J1934
14425C220821J2925J7149J7262J4889Q878J1674J1397J0634Q530J6537J1091K1909
14413C383696K1740J3764J1954J6527J3748N028J2314J8283J6799J2046J2752
14402C538651J8481J7933K2646J7892J0136J5485J9720J9938J4578J7967J3864
14391C727291J8900R928J1753J8974K0642K3400J5813J5281J7160K3336J1260
14380C913738K0568J6405J4259J7694K2987K2543J7457K2883J9628J9253J7072
$$ plain form
14461 2843090 2856391 2864122 2873015 2884305 2900203 2914351 2919358 2923863 2929022 2939287 2949783 2952010
14449 2952010 2965737 2990642 3006361 3011257 3017740 3026876 3038348 3052275 3061551 3069549 3080927 3093639
14437 3093639 3098757 3107433 3120145 3135084 3144390 3151863 3165580 3186427 3198720 3199955 3208887 3220821
14425 3220821 3233746 3250895 3268157 3283046 3291924 3303598 3314995 3325629 3334159 3350696 3361787 3383696
14413 3383696 3405436 3419200 3431154 3447681 3461429 3466457 3478771 3497054 3513853 3525899 3538651
14402 3538651 3557132 3575065 3597711 3615603 3625739 3641224 3660944 3680882 3695460 3713427 3727291
14391 3727291 3746191 3756119 3767872 3786846 3807488 3830888 3846701 3861982 3879142 3902478 3913738
14380 3913738 3934306 3950711 3964970 3982664 4005651 4028194 4045651 4068534 4088162 4107415 4124487
14369D124487J7295K2494J7162J7267K2631K1286J9470K8758K3765J9293K3634
14358D357542K3635K6605K6161K2787K3774K0983J8917J6331K2363K7052L0344
14347D616494K8644K8188K6684K9821K9217K6675K0594K0450K3995K8717L2328
14336D911807K8365K4120K1882L1673K9189L1960L2795L0884K8789K4331L8541
14325E234336L3940L1900K9815K7874L5670L4437L6628L6213L4073L2459L1027
14314E598372L2038L9900L9881L1919L1752L7562L1343L6975M3244L4676K9132
14303E986794L4284M4194M5231L7336M3475L3625L4469L9529L8631M4256M2214
14292F424038M1770M4801M1814M2369L7586L5059M3405M9071M2046M3087M5951
$$ plain form
14369 4124487 4141782 4164276 4181438 4198705 4221336 4242622 4262092 4290850 4314615 4333908 4357542
14358 4357542 4381177 4407782 4433943 4456730 4480504 4501487 4520404 4536735 4559098 4586150 4616494
14347 4616494 4645138 4673326 4700010 4729831 4759048 4785723 4806317 4826767 4850762 4879479 4911807
14336 4911807 4940172 4964292 4986174 5017847 5047036 5078996 5111791 5142675 5171464 5195795 5234336
14325 5234336 5268276 5300176 5329991 5357865 5393535 5427972 5464600 5500813 5534886 5567345 5598372
14314 5598372 5630410 5670310 5710191 5742110 5773862 5811424 5842767 5879742 5922986 5957662 5986794
14303 5986794 6021078 6065272 6110503 6147839 6191314 6224939 6259408 6298937 6337568 6381824 6424038
14292 6424038 6465808 6510609 6552423 6594792 6632378 6667437 6710842 6759913 6801959 6845046 6890997
14281F890997M7016M3362L7892L3912L4250L7363M5006M5397L7442L8993L3475
14270G325105L7411L5989L6220L7622L3515L4275L7134K8681K2742J7671K4029
14259G670394K8799K5365J6912J2803J1135J3892M330N083Q275n859j4681k926
14247G773522r805k2818l2404l1507k9384m1960n1697n9146o6499p6565q5191
14236G266546q4480r3132j06465j12831j38613j39865j37149j46014j65801j75767
14226E966429j86268j96192k09235k22875k29945k43660k50779k60312k72435
14217C894728k77400k93644l00911l02109l06316l14573l20535l22905l18379
14208A137956l28055l26184l27618l31268l39683l30608l25303l16952l09197
$$ plain form
14281 6890997 6938013 6981375 7019267 7053179 7087429 7124792 7169798 7215195 7252637 7291630 7325105
14270 7325105 7362516 7398505 7434725 7472347 7505862 7540137 7577271 7605952 7628694 7646365 7670394
14259 7670394 7699193 7724558 7741470 7754273 7765408 7779300 7783630 7788713 7796988 7791129 7776448 7773522
14247 7773522 7763717 7740899 7708495 7676988 7647604 7605644 7553947 7494801 7428302 7351737 7266546
14236 7266546 7182066 7088934 6982469 6869638 6731025 6591160 6454011 6307997 6142196 5966429
14226 5966429 5780161 5583969 5374734 5151859 4921914 4678254 4427475 4167163 3894728
14217 3894728 3617328 3323684 3022773 2720664 2414348 2099775 1779240 1456335 1137956
14208 1137956 809901 483717 156099 -175169 -514852 -845460 -1170763 -1487715 -1796912
14199a796912l05660l08967k97233k88034k71351k64116k60119k37183k31467
14190d261042k24382k11503k04887j91189j85713j73265j69388j52861j36010
14181e910240j26124j17282j02666j03830r8203q1440p4898o4842o2131n3030
14171f794686m1547l4883l7359k3353k0831j8257j3138j1162o177j247N583M542
14159f992515L588J4073J8400J8862K5325K2908K6414K9183K9149L0713L5408
14148f738492L4801L1216L7319L6225L3875L4991L7088L9587M5790M4740M0272
14137f322588M1902L6521L8721M7837M1659M0329M4675N1805M0508L3797M0628
14126e864206M4741L8429M4955M6177L3513M2828M9826M1281L6143L7199L6896
$$ plain form
14199 -1796912 -2102572 -2411539 -2708772 -2996806 -3268157 -3532273 -3792392 -4029575 -4261042
14190 -4261042 -4485424 -4696927 -4901814 -5093003 -5278716 -5451981 -5621369 -5774230 -5910240
14181 -5910240 -6036364 -6153646 -6256312 -6360142 -6458345 -6539785 -6614683 -6679525 -6741656 -6794686
14171 -6794686 -6836233 -6871116 -6908475 -6931828 -6952659 -6970916 -6984054 -6995216 -7001393 -7002640 -6997057 -6992515
14159 -6992515 -6988927 -6974854 -6956454 -6937592 -6912267 -6889359 -6862945 -6833762 -6804613 -6773900 -6738492
14148 -6738492 -6703691 -6672475 -6635156 -6598931 -6565056 -6530065 -6492977 -6453390 -6407600 -6362860 -6322588
14137 -6322588 -6280686 -6244165 -6205444 -6157607 -6115948 -6075619 -6030944 -5979139 -5938631 -5904834 -5864206
14126 -5864206 -5819465 -5781036 -5736081 -5689904 -5656391 -5613563 -5563737 -5522456 -5486313 -5449114 -5412218
14115e412218M3268L9188L5270M4037M4962L9170M4171L3370M1512M2110L0761
14104d974399L6779L3798L8113L8364L9339L3735L4499L4496L5303K7445K9165
14093d593363L7642L6006K7125K9342L3626L7498L5547L1596K3270J9598K9571
14082d252542L9425L0552L0272L4584L0345L4035K4180J7992K8790K7164L2799
14071c922404L0236K1495K2775L2796K9758K1880K1297K6183K4505K3577J8607
14060c649295K5498K7412K8020K5206J8741K1435K5812K3067K1120J5980J4945
14049c402059J8047K3177K6022K8811K0970J8755K0117J9328K3052K1886K2919
14038c158975J5324J8484K4693J6182J2905J2004K2083K0693J3229J3904K4390
$$ plain form
14115 -5412218 -5368950 -5329762 -5294492 -5250455 -5205493 -5166323 -5122152 -5088782 -5047270 -5005160 -4974399
14104 -4974399 -4937620 -4903822 -4865709 -4827345 -4788006 -4754271 -4719772 -4685276 -4649973 -4622528 -4593363
14093 -4593363 -4555721 -4519715 -4492590 -4463248 -4429622 -4392124 -4356577 -4324981 -4301711 -4282113 -4252542
14082 -4252542 -4213117 -4182565 -4152293 -4117709 -4087364 -4053329 -4029149 -4011157 -3982367 -3955203 -3922404
14071 -3922404 -3892168 -3870673 -3847898 -3815102 -3785344 -3763464 -3742167 -3715984 -3691479 -3667902 -3649295
14060 -3649295 -3623797 -3596385 -3568365 -3543159 -3524418 -3502983 -3477171 -3454104 -3432984 -3417004 -3402059
14049 -3402059 -3384012 -3360835 -3334813 -3306002 -3285032 -3266277 -3246160 -3226832 -3203780 -3181894 -3158975
14038 -3158975 -3143651 -3125167 -3100474 -3084292 -3071387 -3059383 -3037300 -3016607 -3003378 -2989474 -2965084
14027b965084K2719J6308J9824K2823K2385J2513J5614J4927J3720J4774J0635
14016b778842K0163K1084K4393K5968J2373J0823J5555K1050J8454J4507J2706
14005b581766J3271Q205J0024J1250J4689K1388J6726J2583J0159R983Q491J8646
13993b426351J6430P736J3194J8721J8556J4761J3345J5334J6997N716R006J1569
13981b264986J2401K570J2232J1334J7702J6153Q220J2153J1523J5317J2158Q497
13969b124726J989O073J2455J1046R905J5459J5382J1736J2737J0373N515O102
13957b005954J5169Q736O514J1200J4779J4245M858J2775R841L023J352J0332
13945a893130J1440J3509J4748O849R441R962J194K638J4533J1521J3309P312
$$ plain form
14027 -2965084 -2942365 -2926057 -2906233 -2883410 -2861025 -2848512 -2832898 -2817971 -2804251 -2789477 -2778842
14016 -2778842 -2758679 -2737595 -2713202 -2687234 -2674861 -2664038 -2648483 -2627433 -2608979 -2594472 -2581766
14005 -2581766 -2568495 -2560290 -2550266 -2539016 -2524327 -2502939 -2486213 -2473630 -2463471 -2453488 -2444997 -2426351
13993 -2426351 -2409921 -2402185 -2388991 -2370270 -2351714 -2336953 -2323608 -2308274 -2291277 -2285561 -2276555 -2264986
13981 -2264986 -2252585 -2250015 -2237783 -2226449 -2208747 -2192594 -2184374 -2172221 -2160698 -2145381 -2133223 -2124726
13969 -2124726 -2122737 -2116664 -2104209 -2093163 -2083258 -2067799 -2052417 -2040681 -2027944 -2017571 -2012056 -2005954
13957 -2005954 -1990785 -1982049 -1975535 -1964335 -1949556 -1935311 -1930453 -1917678 -1907837 -1904814 -1903462 -1893130
13945 -1893130 -1881690 -1868181 -1853433 -1846584 -1837143 -1827181 -1825987 -1823349 -1808816 -1797295 -1783986 -1776674
13933a776674N612L103J6315J2802J0926N493O948M904N664R382M024N414J4718
13920a671369J3617Q480J0114J683l853M741J6742J1322P453M184M348J3285O906
13907a572347R763O868O65N900J0559J0497O443R005J3317J1090O025Q069K362
13894a471784K083M308J1661N513j982R961J6121J2634O303L881M255O545Q361
13881a382140J0421J1258N837L518K783L66K982N136M188R668J5579J1028J118
13868a298258J468R362J1617O535L204O415Q471L925M610L590J1723J0361l52
13855a217329Q720Q979N030N370r83N328K259O718J2112K617J586Q114J2406J5183
13841a123890J1292P178M597P02oO530J303K251K770J1189Q013M740O903J0872
$$ plain form
13933 -1776674 -1771062 -1767959 -1751644 -1738842 -1727916 -1722423 -1715475 -1710571 -1704907 -1695525 -1691501 -1686087 -1671369
13920 -1671369 -1657752 -1649272 -1639158 -1637475 -1641328 -1636587 -1619845 -1608523 -1601070 -1596886 -1592538 -1579253 -1572347
13907 -1572347 -1562584 -1555716 -1555051 -1549151 -1538592 -1528095 -1521652 -1512647 -1499330 -1488240 -1482215 -1474146 -1471784
13894 -1471784 -1469701 -1465393 -1453732 -1448219 -1450201 -1440240 -1424119 -1411485 -1405182 -1401301 -1397046 -1390501 -1382140
13881 -1382140 -1371719 -1360461 -1354624 -1351106 -1348323 -1347957 -1344975 -1339839 -1335651 -1325983 -1310404 -1299376 -1298258
13868 -1298258 -1296790 -1287428 -1275811 -1269276 -1266072 -1259657 -1251186 -1247261 -1242651 -1239061 -1227338 -1216977 -1217329
13855 -1217329 -1208609 -1199630 -1194600 -1189230 -1190213 -1184885 -1182626 -1175908 -1163796 -1161179 -1159593 -1151479 -1139073 -1123890
13841 -1123890 -1112598 -1105420 -1100823 -1100121 -1100127 -1093597 -1092294 -1090043 -1087273 -1076084 -1068071 -1063331 -1056428 -1045556
13827a045556O664k783L916K395R38J851R480O477O083R286j21L599J0460M480
13813i82831J031N405P762L371R686O874K693J933M980N069Q760P478P529N5L925
13798i06280J459Q385N808j908N543J4258M366O902K863L261Q51j344M318K497
13784h49021Q578K902L202J4543J2102J191j881j137Q409P536M920q31L340L440
13770g82707R496O986K319J843Q837M176j455K979j952N354O671L047L923J0671
13756g19812M890N138Q612j952J755L576l73M180N217N695K424L083M548l53J459
13741f71913P059R031L701M946P931L893L424M69Q370O440M19K976Q651N142O325
13726e93136O196N792M882n969J344P418K526N8O7K409L740N433R450K4M424N042
$$ plain form
13827 -1045556 -1038892 -1041675 -1037759 -1035364 -1034426 -1032575 -1023095 -1016618 -1010535 -1001249 -1001370 -997771 -987311 -982831
13813 -982831 -981800 -976395 -968633 -965262 -955576 -948702 -946009 -944076 -939096 -934027 -925267 -917789 -910260 -910205 -906280
13798 -906280 -904821 -896436 -890628 -892536 -886993 -872735 -868369 -861467 -858604 -855343 -854492 -855836 -851518 -849021
13784 -849021 -840443 -837541 -834339 -819796 -807694 -806503 -808384 -809521 -801112 -793576 -788656 -789487 -786147 -782707
13770 -782707 -773211 -766225 -763906 -762063 -753226 -749050 -750505 -747526 -749478 -744124 -737453 -734406 -730483 -719812
13756 -719812 -714922 -709784 -701172 -703124 -701369 -697793 -698166 -693986 -688769 -683074 -680650 -677567 -673019 -673372 -671913
13741 -671913 -664854 -655823 -652122 -647176 -639245 -635352 -631928 -631459 -623089 -616649 -616230 -613254 -604603 -599461 -593136
13726 -593136 -586940 -581148 -576266 -582235 -580891 -573473 -570947 -570889 -570822 -568413 -564673 -559240 -549790 -549766 -545342 -540300
13710e40300P484Q267j697n24R004N440L512M11Q516J995j125R11Q000O234l0
13695d83902j235J692k109J1048J0696J249L432Q730O725M531R51J656J199P031
13681d28306k287J207Q341O755j80L6K470L560P001R181J522l235M152p592j003
13666c98378M256K428P922O137R900J988J19P118N682k59N728O203O830K30J409
13651c32687P490N095n766J371L995J0893L943K673K172j497K880K746n515M516
13637b97691J2428J0839N348N409R59k299M498J049l666n463L545R920P775Q802
13623b38547R04J944O454N797O19J003N562Q387P623l977j890M532N035o6j293
13608a97913L739M268J914N72K86Q170O297N642N230n352J189K167m91J1414Q820
$$ plain form
13710 -540300 -532816 -524549 -526246 -526770 -517766 -512326 -508814 -508403 -499887 -497892 -499017 -498106 -490106 -483872 -483902
13695 -483902 -485137 -483445 -485554 -474506 -463810 -462561 -459129 -450399 -443674 -439143 -438192 -436536 -435337 -428306
13681 -428306 -430593 -429386 -421045 -414290 -414470 -414434 -411964 -408404 -401403 -392222 -390700 -393935 -389783 -397375 -398378
13666 -398378 -394122 -391694 -383772 -377635 -367735 -365747 -365628 -358510 -352828 -353087 -347359 -341156 -334326 -334096 -332687
13651 -332687 -325197 -320102 -325868 -324497 -320502 -309609 -305666 -302993 -300821 -302318 -299438 -296692 -302207 -297691
13637 -297691 -285263 -274424 -269076 -263667 -262708 -265007 -260509 -259460 -263126 -268589 -265044 -255124 -247349 -238547
13623 -238547 -237643 -235699 -229245 -223448 -222829 -221826 -216264 -207877 -200254 -204231 -206121 -201589 -196554 -196620 -197913
13608 -197913 -194174 -189906 -187992 -187420 -187134 -178964 -172667 -167025 -161795 -167147 -165958 -163791 -164282 -152868 -144048
13593a44048p63L067K071J796l364J0196R537m24L463K435N29Q29N358O941N418
13578i6959M257J778M527J755n258K598Q799L638K375J997N229O254M787M929
13564d9294n965L761N945L293J402J082M408K656J401m82K032L542N492N069L701
13549a1957k588J973O417P987K949p23j026J604J295Q816O595k682K407Q207L184
13534C2458P960p50j314J766O015k33K626R39Q383R538L565K813n994J643L502
13519G2917Q895J072p204P35P577Q584Q766O30K886k89N05L106M244P054M518
13504A23996M62n846N265K482M121L470J425J348O963O758k39Q76O433M62p03
13489A57273k21Q140O154J985J225L08K390L164J447M482P330L31N76M969k573
$$ plain form
13593 -144048 -144811 -141744 -139673 -137877 -141241 -131045 -121508 -121932 -118469 -116034 -115505 -114676 -109318 -102377 -96959
13578 -96959 -92702 -90924 -86397 -84642 -89900 -87302 -78503 -74865 -72490 -70493 -65264 -59010 -54223 -49294
13564 -49294 -55259 -51498 -45553 -42260 -40858 -39776 -35368 -32712 -31311 -31793 -29761 -26219 -20727 -15658 -11957
13549 -11957 -14545 -12572 -6155 1832 4781 4058 3032 4636 5931 14747 21342 18660 21067 29274 32458
13534 32458 40418 39668 38354 40120 46135 45902 48528 49467 57850 67388 70953 73766 67772 69415 72917
13519 72917 81812 82884 75680 76415 83992 92576 101342 101972 104858 104569 105074 108180 112424 119478 123996
13504 123996 124458 118612 123877 126359 130480 133950 135375 136723 143686 150444 150205 151081 157514 157976 157273
13489 157273 157052 165192 171346 173331 174556 174864 177254 180418 181865 186347 193677 194008 194584 199553 196980
13474A96980L816P440J1568J0598L389l06J672N36K046R945J676n167L936l120
13460B45009o645K326N270M294R116M407N095j837R679N637k762N274K095M839
13446B91797Q021M752o42L768j124k6M529M83j43J038P610P010O377j367M402
13431C36485l919J156P071L881N212J655K339J400J481K645j282O318O155P049
13417C77646O550k740J404R536M466L67K863N839N132o02m7J238L914R874Q033
13402D33473J585m87K063N778N627L36k589M221J140k699N575P867J676M940L585
13387D72091K575k148o554l311J0682J2749N412L757K923M346K027L354L944J472
13373E13319L071M779K15O81K599J1545P759L591j75P592L474j045K396j714L694
$$ plain form
13474 196980 200796 208236 219804 230402 233791 233485 235157 235693 237739 247684 249360 244193 248129 245009
13460 245009 238364 240690 245960 250254 259370 263777 268872 267035 276714 282351 279589 284863 286958 291797
13446 291797 299818 304570 303928 307696 306572 306546 311075 311558 311415 312453 320063 327073 333450 332083 336485
13431 336485 332566 333722 340793 344674 349886 351541 353880 355280 356761 359406 358124 364442 370597 377646
13417 377646 384196 381456 382860 392396 396862 397229 400092 405931 411063 410461 410414 411652 415566 425440 433473
13402 433473 435058 434571 436634 442412 448039 448375 445786 450007 451147 448448 454023 461890 463566 468506 472091
13387 472091 474666 472518 465964 462653 473335 486084 491496 495253 498176 502522 504549 507903 511847 513319
13373 513319 516390 521169 521384 522065 524664 536209 543968 547559 547384 554976 558450 557405 559801 558087 561781
13358E61781L909L231P821M590K198J043P31P696Q599J331k091L647P524J759
13344F13769k92l83M369Q292J049j720N215M141L031N759O979J1098N505k247
13330F64565k07O940P688N302L355K000L64k102k335M221L307J0539j106l529
13316F99002R970O750M330r66K265K688l465M269P768R979O730l401l008P728
13302G50639Q373K087J458m51O945J5347J5499p75P96N733N556K768o93L630l697
13287H13215J0373Q985K160L768n42k015P632Q865M656L990M524P555L745L962
13273H80873N283Q882L289K170K31J164N695N184l912J688J0555O986P875J3546
13259I49509NL296N169M566k791j175L053J4124L798N492M571M867O045M913N208
$$ plain form
13358 561781 565690 568921 576742 581332 583530 584573 585304 593000 601599 602930 600839 604486 612010 613769
13344 613769 613477 613094 617463 625755 626804 625084 630299 634440 637471 643230 650209 661307 666812 664565
13330 664565 664358 671298 678986 684288 687643 689643 690007 687905 685570 689791 693098 703637 702531 699002
13316 699002 708972 715722 720052 719086 721351 724039 720574 724843 732611 742590 749320 745919 742911 750639
13302 750639 759012 761099 762557 762106 769051 784398 799897 799122 799918 805651 811207 813975 813282 816912 813215
13287 813215 823588 832573 834733 838501 837959 835944 843576 852441 857097 861087 865611 873166 876911 880873
13273 880873 886156 895038 898327 900497 900728 901892 907587 912771 908859 910547 921102 928088 935963 949509
13259 949509 949514 952810 957979 962545 959754 958579 961632 975756 979554 985046 989617 994484 1000529 1005442 1010650
13244A010650K885Q78O155O877P557L397K722j794Q039O693M451L654N612P676
13230A075452R830P426L997L911L020J4853Q588k694J471N457O478M759M113N737
13216A152398J0621Q903Q956J1607J6095Q13n070J459Q856M092P423J3637J1072
13203A250862O523j068M993Q685R642Q095J7027J5236N722J5742J9811J1599J2812
13190A385681Q843M896O090N978J3500N468J0118J3897J4903J7404K0337K4686
13178A531801L0698K9346K5607L3046L1829L7546M5188N6837O9467R1811J06710
13167B089886J31974J33430K4857k66771n36540n11445m26334k78661l0585J04641
13157D34452J27288J01031Q1902O5555L8604M1416M4617L7434K8722K3164K5500
$$ plain form
13244 1010650 1013535 1014413 1020568 1027445 1035002 1038399 1041121 1039327 1047366 1054059 1058510 1062164 1067776 1075452
13230 1075452 1085282 1092708 1096705 1100616 1103636 1118489 1127077 1124383 1125854 1131311 1137789 1142548 1146661 1152398
13216 1152398 1163019 1171922 1180878 1192485 1208580 1209393 1204323 1205782 1214638 1218730 1226153 1239790 1250862
13203 1250862 1257385 1256317 1261310 1269995 1279637 1287732 1304759 1319995 1325717 1341459 1361270 1372869 1385681
13190 1385681 1394524 1399420 1405510 1411488 1424988 1430456 1440574 1454471 1469374 1486778 1507115 1531801
13178 1531801 1562499 1591845 1617452 1650498 1682327 1719873 1765061 1821898 1891365 1983176 2089886
13167 2089886 2221860 2355290 2380147 2113376 1576836 1065391 639057 360396 329811 434452
13157 434452 561740 662771 744673 810228 848832 890248 934865 972299 1001021 1024185 1049685
13146A049685K6470K3513K7589K7554K4548J6618J1633J4793K2142J2420J4632
13135A271597J4088J3965J3957R199J2970J4935J4561O636P284J9901J1170M680
13123A414943J945K853L619M043O816P889P770Q943J3535J4476J1839P528J1281
13110A517480M938J464J0133J1170N479J571J1243J1953O321J0824J3454R386
13098A615416J4304J1573R472N366n14J27l499P53N072J3567J1785K1008J6712
13085A721142P002P361P278J0918Q615J0855P149N536J0109J5077N516K442N492
13072A824492R928M699j1190p408J2985J0815O700L909J3863J4256J3860K618
13060A899527Q24R952P143P741J3156J5778J5361R779J833P253J9395J8335J1208
$$ plain form
13146 1049685 1076155 1099668 1127257 1154811 1179359 1195977 1207610 1222403 1244545 1256965 1271597
13135 1271597 1285685 1299650 1313607 1322806 1335776 1350711 1365272 1371908 1379192 1399093 1410263 1414943
13123 1414943 1416888 1419741 1423360 1427403 1434219 1442108 1449878 1458821 1472356 1486832 1498671 1506199 1517480
13110 1517480 1522418 1523882 1534015 1545185 1550664 1552235 1563478 1575431 1581752 1592576 1606030 1615416
13098 1615416 1629720 1641293 1650765 1656131 1655617 1655744 1652245 1652998 1658070 1671637 1683422 1704430 1721142
13085 1721142 1728144 1735505 1742783 1753701 1762316 1773171 1780320 1785856 1795965 1811042 1816558 1819000 1824492
13072 1824492 1834420 1839119 1827929 1820521 1833506 1844321 1851021 1854930 1868793 1883049 1896909 1899527
13060 1899527 1900351 1910303 1917446 1925187 1938343 1954121 1969482 1979261 1981094 1988347 2007742 2026077 2037285
13047B037285J3564J4867O432R360J0473J6754J5011J4698M317P124J6764J3450
13035B180099P221K078P317P209L303q36O279j4853m0275k3265o420o724Q381
13022B129514L4571M1007K5821K2644K5986K5135K0426K0490K1223J7120R737
13011B393674O716O872L475J2151J7396R352K464R410J3272J6907J6521J5455
12999B523665K2936R208Q689R896J1820M943J067O603J2244J0910J7363J8004
12987B657348O155J5109K0749J7214J0215J6396J9197J9558J0409R581J1799Q625
12975B822355J5286K2982K4002K3920J5342J1431J1296J0113J7070K3308K7592
12964C024697K5955J2680J3431J6117K2859K2112K9669J9767J0873j9161n6335
$$ plain form
13047 2037285 2050849 2065716 2072148 2081508 2091981 2108735 2123746 2138444 2142761 2149885 2166649 2180099
13035 2180099 2187320 2189398 2196715 2203924 2207227 2206391 2212670 2197817 2157542 2134277 2127857 2121133 2129514
13022 2129514 2164085 2205092 2230913 2253557 2279543 2304678 2325104 2345594 2366817 2383937 2393674
13011 2393674 2400390 2407262 2410737 2422888 2440284 2449636 2452100 2461510 2474782 2491689 2508210 2523665
12999 2523665 2546601 2555809 2564498 2574394 2586214 2591157 2592224 2598827 2611071 2621981 2639344 2657348
12987 2657348 2663503 2678612 2699361 2716575 2726790 2743186 2762383 2781941 2792350 2801931 2813730 2822355
12975 2822355 2837641 2860623 2884625 2908545 2923887 2935318 2946614 2956727 2973797 2997105 3024697
12964 3024697 3050652 3063332 3076763 3092880 3115739 3137851 3167520 3187287 3198160 3178999 3122664
12953C122664n7947o105n349J5712J9932K2885K7713L2264K9086K1266K6931K4025
12941C273077K2326K3624K5730K8559K8395J9911J5976K4776J8967R603J1325
12930C502269J8224J5540R981J7228K7223L1077L0319K5052L0744L0846L6298
12919C774801L3308K4127J8364J8018J6168J1346J8130K2910K6400K6810K7107
12908D017489J5777R612R412J5045K3140L0894K4993K0287K6172K6862M2234N6695
12896D318612O3858P4070P0190N3035N525m6562l9151j7682l358N702K9095M1062
12884D554396L0673L6264L8310L2236K7094K5431K4340L0353L5081L7132K8625
12873D899935K4379K7931K4944M1456M4252L6528L4141L0369L1876K9275L4068
$$ plain form
12953 3122664 3064717 3058612 3053263 3068975 3088907 3111792 3139505 3171769 3200855 3222121 3249052 3273077
12941 3273077 3295403 3319027 3344757 3373316 3401711 3421622 3437598 3462374 3481341 3490944 3502269
12930 3502269 3520493 3536033 3546014 3563242 3590465 3621542 3651861 3676913 3707657 3738503 3774801
12919 3774801 3808109 3832236 3850600 3868618 3884786 3896132 3914262 3937172 3963572 3990382 4017489
12908 4017489 4033266 4042878 4052290 4067335 4090475 4121369 4146362 4166649 4192821 4219683 4261917 4318612
12896 4318612 4382470 4456540 4526730 4579765 4585290 4538728 4499577 4481895 4478537 4484239 4513334 4554396
12884 4554396 4585069 4621333 4659643 4691879 4718973 4744404 4768744 4799097 4834178 4871310 4899935
12873 4899935 4924314 4952245 4977189 5018645 5062897 5099425 5133566 5163935 5195811 5225086 5259154
12862E259154L5454L3720L2429K7760K3341L2854N2796N9180M6164N7844N7317
12851E718013N4451M3482L9533L4867M2449N2753N5863N9633O1876O1179O6967
12840F291066O0386N8501P0247O4082P4497Q0185P9845Q9645R4795J09077P9875
12829G152201k4778j38387r5829j0713N6707J73277J13272K0096J7894N7544O8797
12818G390081O1260O2561P3989Q1548Q9541Q4910R1924Q9588P5277P8622Q1929
12807H261230P7384P9657P7511Q5867R5394R8729R6295Q9745R8461R3195J07185
12796I260653J18041J19596J14912J12797J18985J13437J11516J16377J19204
12787A0305518J12752J09296J08823J10014J27044J38792J43763J64993J86033
$$ plain form
12862 5259154 5294608 5328328 5360757 5388517 5411858 5444712 5497508 5556688 5602852 5660696 5718013
12851 5718013 5772464 5815946 5855479 5890346 5932795 5985548 6041411 6101044 6162920 6224099 6291066
12840 6291066 6351452 6409953 6480200 6544282 6618779 6698964 6778809 6868454 6963249 7072326 7152201
12829 7152201 7127423 6989036 6893207 6882494 6939201 7112478 7225750 7245846 7263740 7321284 7390081
12818 7390081 7451341 7513902 7587891 7669439 7758980 7843890 7935814 8025402 8100679 8179301 8261230
12807 8261230 8338614 8418271 8495782 8581649 8677043 8775772 8872067 8961812 9060273 9153468 9260653
12796 9260653 9378694 9498290 9613202 9725999 9844984 9958421 10069937 10186314 10305518
12787 10305518 10418270 10527566 10636389 10746403 10873447 11012239 11156002 11320995 11507028
12778A1507028J91719J94937J99602J98743J89770J69601J66262J74131J81842
12769A3173635J92248K08270K22726K32636K46233K49482K51931K52367K55623
12760A5285151K71613K75745K93902K95838K94720K91722K97007L09389L35535
12751A7950622L58760L89332M13203M35853M42116M56967M81300N04485N35862
12742B1968500N61383N84538O02657O29405O60729O95286P35491P65756Q12489
12733B8016234Q70034R14696R58906J026825J122146J240104J337558J420726
12725C6907229J538829J673032J841516K040874K246885K477298K751577L098484
12717E4575724L496947L874198M172830M346204M863033N898240P299157R186643
$$ plain form
12778 11507028 11698747 11893684 12093286 12292029 12481799 12651400 12817662 12991793 13173635
12769 13173635 13365883 13574153 13796879 14029515 14275748 14525230 14777161 15029528 15285151
12760 15285151 15556764 15832509 16126411 16422249 16716969 17008691 17305698 17615087 17950622
12751 17950622 18309382 18698714 19111917 19547770 19989886 20446853 20928153 21432638 21968500
12742 21968500 22529883 23114421 23717078 24346483 25007212 25702498 26437989 27203745 28016234
12733 28016234 28886268 29800964 30759870 31786695 32908841 34148945 35486503 36907229
12725 36907229 38446058 40119090 41960606 44001480 46248365 48725663 51477240 54575724
12717 54575724 58072671 61946869 66119699 70465903 75328936 81227176 88526333 97712976
12709I7712976J1485598J4120348J7346740K1245862K4186996J8268271j5438495
12702A88928296p8322472j01255492q5742140p1056349l7813850M213967K1129525
12695a59918515K1115007J6906961J2302630Q171796N966012N428426N430672
12688h4597011N508678N315815M801108M372325M059640L666713L274994K913637
12680e0684101K584316K284106K069839J905510J759301J630637J515064J402967
12672c5532361J321165J249004J189162J131638J062135J006684R73501R64438
12664b6634634R23916Q33177N85899J68674l4314j3633P6395K90291N21458O02969
12654b2679802N81666N35364M90397M57879M29995M33420M34621M06861L75755
$$ plain form
12709 97712976 109198574 123318922 140665662 161911524 186098520 204366791 188928296
12702 188928296 110605824 9350332 -76391808 -147448157 -185262007 -181048040 -159918515
12695 -159918515 -138803508 -121896547 -109593917 -101422121 -95456109 -90027683 -84597011
12688 -84597011 -79088333 -73772518 -68971410 -64599085 -60539445 -56872732 -53597738 -50684101
12680 -50684101 -48099785 -45815679 -43745840 -41840330 -40081029 -38450392 -36935328 -35532361
12672 -35532361 -34211196 -32962192 -31773030 -30641392 -29579257 -28572573 -27599072 -26634634
12664 -26634634 -25710718 -24877541 -24291642 -24122968 -24157282 -24170915 -24094520 -23804229 -23282771 -22679802
12654 -22679802 -22098136 -21562772 -21072375 -20614496 -20184501 -19751081 -19316460 -18909599 -18533844
12645a8533844L54041L39505L19577L03007K89642K79260K75526K59516K47693
12636a5866077K39965K31703K13892K18575K27120K27557K20478K09365J93093
12627a3884329J75256J64775J48923J38447J37597J29509J37598J54283J62264
12618a2535677J64934J64796J68624J56760J47059J40014J29495J26343J26300
12609a1211352J19051J16137J16619J16791J10575R9167R1679R8716J05720J06314
12599a0130583J00820R3596R5348J00962R8102R8152R2143R8929R6462Q7304P5687
12588i093078O9956P7221Q6355Q1669Q1640Q7706Q9531J00370J09590J40713J71731
12577g996596J01660l0583l1023M1762K5711j08788j12628j6536R6278J04524
$$ plain form
12645 -18533844 -18179803 -17840298 -17520721 -17217714 -16928072 -16648812 -16373286 -16113770 -15866077
12636 -15866077 -15626112 -15394409 -15180517 -14961942 -14734822 -14507265 -14286787 -14077422 -13884329
12627 -13884329 -13709073 -13544298 -13395375 -13256928 -13119331 -12989822 -12852224 -12697941 -12535677
12618 -12535677 -12370743 -12205947 -12037323 -11880563 -11733504 -11593490 -11463995 -11337652 -11211352
12609 -11211352 -11092301 -10976164 -10859545 -10742754 -10632179 -10533012 -10441333 -10342617 -10236897 -10130583
12599 -10130583 -10029763 -9936167 -9840819 -9739857 -9641755 -9543603 -9451460 -9352531 -9256069 -9168765 -9093078
12588 -9093078 -9023122 -8945901 -8859546 -8777877 -8696237 -8608531 -8519000 -8418630 -8309040 -8168327 -7996596
12577 -7996596 -7894936 -7925519 -7956542 -7914780 -7889069 -7997857 -8110485 -8127021 -8030743 -7926219
12567g926219Q6910P5184O7808O0604M6549L5804M2628M6519M8884M3788L9681
12556g331860M2325M8871N3322N6477N6093N1522N4649M2680M0492M5827N3097
12545f786505M2844L1347L0272L0997J0758k965N782K4350L6002M5458N2298N5264
12533f424098N5913M5947M0691L2773L2939L6604L9583L3235L2344L3005L2077
12522f008987L1623K9817K3782J5896J8844K5443J9617K7254M2518O5217R4607
12511e614369R7127P8445N7695K0465j0463j8811n049J580M491K0160K7920K6818
12499e313991J8823J4571K4855L5336M3996M3291L7816K3367K0655J5259J7502
12488e018520J9097K9011K8621K8783J8469K2794K5279J3228R451P173N904Q520
$$ plain form
12567 -7926219 -7839309 -7764125 -7696317 -7635713 -7589164 -7553360 -7510732 -7464213 -7415329 -7371541 -7331860
12556 -7331860 -7289535 -7240664 -7187342 -7130865 -7074772 -7023250 -6968601 -6925921 -6885429 -6839602 -6786505
12545 -6786505 -6743661 -6712314 -6682042 -6651045 -6640287 -6643252 -6637470 -6613120 -6577118 -6531660 -6479362 -6424098
12533 -6424098 -6368185 -6322238 -6281547 -6248774 -6215835 -6179231 -6139648 -6106413 -6074069 -6041064 -6008987
12522 -6008987 -5977364 -5947547 -5923765 -5907869 -5889025 -5863582 -5843965 -5816711 -5774193 -5708976 -5614369
12511 -5614369 -5517242 -5438797 -5381102 -5360637 -5371100 -5389911 -5394960 -5393380 -5388889 -5368729 -5340809 -5313991
12499 -5313991 -5295168 -5280597 -5255742 -5220406 -5176410 -5133119 -5095303 -5071936 -5051281 -5036022 -5018520
12488 -5018520 -4999423 -4970412 -4941791 -4913008 -4894539 -4871745 -4846466 -4833238 -4823787 -4816614 -4810710 -4802190
12476d802190P536R538K7424K7767L0802M4276L1197K1572J2698K703O708J567
12464d578402K424O785J6943J8504K3326K0027Q403J4129Q264J3245K4217K1439
12452d400696K1683J5594J6294J2645J5559J6222J1980J8961J9220J3531K0959
12441d218048J3632K2209L0275K7922K0108J0360K714M022K307O646J2916J0964
12429d053973m88K06J271P868R366J8500J2809J1388J1714J0693R268J1126J7582
12416c932670J4137J4640J7696J6560J0413J0476R133J4369J7766J6470K0391
12405c770619J8853J9179J5998J4439J4117J0263J3401R318O420J2060P076nJ1801
12392c617699J7966J1509J3676J2559J3423J4544P404k05J515J546K596j833j4682
$$ plain form
12476 -4802190 -4794654 -4785116 -4757692 -4729925 -4699123 -4654847 -4623650 -4602078 -4589380 -4586677 -4579969 -4578402
12464 -4578402 -4575978 -4569193 -4552250 -4533746 -4510420 -4490393 -4481990 -4467861 -4459597 -4446352 -4422135 -4400696
12452 -4400696 -4379013 -4363419 -4347125 -4334480 -4318921 -4302699 -4290719 -4271758 -4252538 -4239007 -4218048
12441 -4218048 -4204416 -4182207 -4151932 -4124010 -4103902 -4093542 -4090828 -4086806 -4084499 -4077853 -4064937 -4053973
12429 -4053973 -4054461 -4054255 -4052984 -4045116 -4035750 -4017250 -4004441 -3993053 -3981339 -3970646 -3961378 -3950252 -3932670
12416 -3932670 -3918533 -3903893 -3886197 -3869637 -3859224 -3848748 -3839615 -3825246 -3807480 -3791010 -3770619
12405 -3770619 -3751766 -3732587 -3716589 -3702150 -3688033 -3677770 -3664369 -3655051 -3648631 -3636571 -3629495 -3629500 -3617699
12392 -3617699 -3599733 -3588224 -3574548 -3561989 -3548566 -3534022 -3526618 -3526823 -3525308 -3523762 -3521166 -3522999 -3537681
12379c537681j7366j0992J2340L9423M2032M5731M6656L8531J8975J3442J1607
12368c297302J7483K0999J8790J2649J6278J2887J4863J9501K2665J9639J5050
12357c106498J1632J0213j036k4064l9099l2505j3517O512K7572K5332K4175L2388
12345c078895L5941L1437L0928L6132K4025k5023r6674j24722j06091q3992l5730
12334c392664J7230M0728L4119L3165L4483K3084J6879J1220J5738K5994K4815
12323c115209J1713K0861J4922Q674J3755J2977J4541O076L021L039P557N928
12311b992145J0329J0100J2328J4946J5752J1351O965Q788M588N502J1846J0012
12299b869638R2M395J2900P618L616M865N385P794J0130K943L169P473O221N585
$$ plain form
12379 -3537681 -3555047 -3566039 -3553699 -3514276 -3472244 -3426513 -3379857 -3341326 -3322351 -3308909 -3297302
12368 -3297302 -3279819 -3258820 -3240030 -3227381 -3211103 -3198216 -3183353 -3163852 -3141187 -3121548 -3106498
12357 -3106498 -3094866 -3084653 -3085689 -3109753 -3148852 -3181357 -3194874 -3188362 -3160790 -3135458 -3111283 -3078895
12345 -3078895 -3042954 -3011517 -2980589 -2944457 -2920432 -2945455 -3042129 -3166851 -3272942 -3356934 -3392664
12334 -3392664 -3375434 -3334706 -3300587 -3267422 -3232939 -3209855 -3192976 -3181756 -3166018 -3140024 -3115209
12323 -3115209 -3103496 -3082635 -3067713 -3059039 -3045284 -3032307 -3017766 -3011690 -3008669 -3005630 -2998073 -2992145
12311 -2992145 -2981816 -2971716 -2959388 -2944442 -2928690 -2917339 -2910374 -2901586 -2896998 -2891496 -2879650 -2869638
12299 -2869638 -2869546 -2865151 -2852251 -2844633 -2841017 -2836152 -2830767 -2822973 -2812843 -2809900 -2806731 -2799258 -2793037 -2787452
12285b787452N396P842Q312O448J2951K0524J4614J1935J2840J0925J0524Q179
12273b656962O033J1218L428J0865P439O82J1428J2545J2695J6274J3740Q259
12261b542356J6826J2038N761R015J0329Q249J1621J2618J7548K3922K2427J6223
12249b375779J5909J7946K8268K7232L3679L2472L1693L3842M2202N2661P1230
12238a988645Q9472J02811J24204J28322N3017k00322m97624n24469m50108l21350
12228c484692q2280Q8344J26990J11431Q7293N9732N0256L6672L0516L2376L5192
12217b908170L2779L6703L4686K6809K1968J4854J1136J7549J4041K0864J5093
12206b661688J5907J9406J1959R667J1629K448R202N723P504R445J1669J4553
$$ plain form
12285 -2787452 -2782056 -2774214 -2765902 -2759454 -2746503 -2725979 -2711365 -2699430 -2686590 -2675665 -2665141 -2656962
12273 -2656962 -2650929 -2639711 -2636283 -2625418 -2617979 -2617297 -2605869 -2593324 -2580629 -2564355 -2550615 -2542356
12261 -2542356 -2525530 -2513492 -2507731 -2498716 -2488387 -2480138 -2468517 -2455899 -2438351 -2414429 -2392002 -2375779
12249 -2375779 -2359870 -2341924 -2313656 -2286424 -2252745 -2220273 -2188580 -2154738 -2112536 -2059875 -1988645
12238 -1988645 -1899173 -1796362 -1672158 -1543836 -1490819 -1691141 -2188765 -2713234 -3163342 -3484692
12228 -3484692 -3566972 -3478628 -3351638 -3240207 -3152914 -3093182 -3042926 -3006254 -2975738 -2943362 -2908170
12217 -2908170 -2875391 -2838688 -2804002 -2777193 -2755225 -2740371 -2729235 -2711686 -2697645 -2676781 -2661688
12206 -2661688 -2645781 -2626375 -2614416 -2604749 -2593120 -2590672 -2581470 -2575747 -2568243 -2558798 -2547129 -2532576
12194b532576N343Q074J0514J448J118l15N782J2662n22R07Q508J3002O659P825
12180b451571L710Q193P831O199J2354J8966J654j342K407N846J0470P027L568
12167b364688N761P916L244O095N492m34J422k218l580R831P736R769Q118L160
12153b302376R322j107l537K450j934L981P726Q481M831K278l013J1024J1618
12140b250256N735N650J469L49N734J538r56L677N020L918M201P978K403Q63J588
12125b201089P546O290L96k784N108O557k499O015J0128P982K488K532M708K927
12111b143695M300O3O193J157L918K337L220j533K246j160q35p50L178J0652N354
12096b105355K430K026N9J054R190N139q35L267L003N165K959J468K283J104O217
$$ plain form
12194 -2532576 -2527233 -2519159 -2508645 -2507197 -2506079 -2506394 -2500612 -2487950 -2488472 -2487565 -2479057 -2466055 -2459396 -2451571
12180 -2451571 -2447861 -2439668 -2431837 -2425638 -2413284 -2394318 -2392664 -2394006 -2391599 -2385753 -2375283 -2368256 -2364688
12167 -2364688 -2358927 -2351011 -2347767 -2341672 -2336180 -2336614 -2335192 -2337410 -2340990 -2331159 -2323423 -2313654 -2305536 -2302376
12153 -2302376 -2293054 -2294161 -2297698 -2295248 -2297182 -2293201 -2285475 -2276994 -2272163 -2269885 -2272898 -2261874 -2250256
12140 -2250256 -2244521 -2238871 -2237402 -2237053 -2231319 -2229781 -2230737 -2227060 -2222040 -2218122 -2213921 -2205943 -2203540 -2202677 -2201089
12125 -2201089 -2193543 -2187253 -2186857 -2189641 -2184533 -2177976 -2180475 -2174460 -2164332 -2156350 -2153862 -2151330 -2146622 -2143695
12111 -2143695 -2139395 -2139332 -2133139 -2131982 -2128064 -2125727 -2122507 -2124040 -2121794 -2122954 -2123789 -2124539 -2121361 -2110709 -2105355
12096 -2105355 -2102925 -2100899 -2100840 -2099786 -2090596 -2085457 -2086292 -2083025 -2080022 -2074857 -2071898 -2070430 -2068147 -2067043 -2060826
12081b060826K078P880L154M284N886m342o39J0966O500L095L458P573M291Q340
12067a998302K652j356j703N023M27K544k895L797O834J779R13N777J538l03O844
12052a966431J388k612O540J550j949O455N839M634N393O120p37N05q54J544Q8
12037a932527p292m373J064Q334M157N008J0430J0692K247k575m134K433L374
12024a903162R90K640l642K626P267J0279J093L599K894J857N773J004L16j142
12010a867608N33N55M090J2540J0045L937l921N943L354l787l247K024O11q46
11996a835777P93k334M115L149L497M149L865J2359J718k119nJ49K486J4137k31
11981a790049l909R73M725Q851M783k693J267k01K69k348l755N834J6795J1800
$$ plain form
12081 -2060826 -2058748 -2050868 -2047714 -2043430 -2037544 -2041886 -2042525 -2031559 -2025059 -2021964 -2018506 -2010933 -2006642 -1998302
12067 -1998302 -1995650 -1997006 -1998709 -1993686 -1993259 -1990715 -1993610 -1989813 -1982979 -1981200 -1980287 -1974510 -1972972 -1973275 -1966431
12052 -1966431 -1965043 -1967655 -1961115 -1959565 -1961514 -1955059 -1949220 -1944586 -1939193 -1933073 -1933810 -1933305 -1934159 -1932615 -1932527
12037 -1932527 -1939819 -1944192 -1943128 -1934794 -1930637 -1925629 -1915199 -1904507 -1902260 -1904835 -1908969 -1906536 -1903162
12024 -1903162 -1902172 -1899532 -1903174 -1900548 -1893281 -1883002 -1881909 -1878310 -1875416 -1873559 -1867786 -1866782 -1866466 -1867608
12010 -1867608 -1867075 -1866520 -1862430 -1849890 -1839845 -1835908 -1839829 -1833886 -1830532 -1834319 -1837566 -1835542 -1834931 -1835777
11996 -1835777 -1834984 -1837318 -1833203 -1830054 -1826557 -1822408 -1818543 -1806184 -1804466 -1806585 -1806590 -1806441 -1803955 -1789818 -1790049
11981 -1790049 -1793958 -1792985 -1788260 -1779409 -1774626 -1777319 -1776052 -1776253 -1775984 -1778332 -1782087 -1776253 -1759458 -1747658
11967a747658K043k547n57k797M67K00K027N7l66j225K554Q009N274m207K544
11952a736182K521K70K401O575M635K117J303O008O436L702Q858R481n88k078
11938a684541o695n144p081r997k825L973N20N252O459K247M009k421p03j531
11924a698478N118N382P723J051m236K2P18m160J863K145M503j262Q452M783M947
11909a661429m126K54P069N604Q282R880l96n553k139q109j102P985P081P376
11895a629323Q863n751o49O230N037J318J023J169N748j89o857n568M580J337
11881a613032O313k938M640N476K638M615m575m963n89P835K677L118m66Q04L587
11866a584860M90J84N094J889n807K110K097O739N363l150L175K686J445M022
$$ plain form
11967 -1747658 -1745615 -1748162 -1748719 -1751516 -1751049 -1750849 -1748822 -1748765 -1749131 -1750356 -1747802 -1739793 -1734519 -1738726 -1736182
11952 -1736182 -1733661 -1733391 -1730990 -1724415 -1719780 -1717663 -1716360 -1710352 -1703916 -1700214 -1691356 -1681875 -1682463 -1684541
11938 -1684541 -1691236 -1696380 -1703461 -1713458 -1716283 -1712310 -1711790 -1706538 -1700079 -1697832 -1693823 -1696244 -1696947 -1698478
11924 -1698478 -1693360 -1687978 -1680255 -1679204 -1683440 -1683418 -1682700 -1686860 -1684997 -1682852 -1678349 -1679611 -1671159 -1666376 -1661429
11909 -1661429 -1665555 -1665301 -1658232 -1652628 -1644346 -1634466 -1634862 -1640415 -1642554 -1650663 -1651765 -1643780 -1636699 -1629323
11895 -1629323 -1620460 -1626211 -1626860 -1620630 -1615593 -1614275 -1613252 -1612083 -1606335 -1606524 -1613381 -1618949 -1614369 -1613032
11881 -1613032 -1606719 -1609657 -1605017 -1599541 -1596903 -1592288 -1596863 -1601826 -1602415 -1594580 -1591903 -1588785 -1589251 -1588447 -1584860
11866 -1584860 -1584370 -1584186 -1579092 -1577203 -1583010 -1580900 -1578803 -1572064 -1566701 -1569851 -1566676 -1563990 -1562545 -1558523
11852a558523M530j071j537K617K825m297j604J690Q42P252N938M293k10j056
11838a538311J148J223L045Q323J771j393j773P573N025r37L41O29k921l975M718
11823a515514N904K812m455P84J2240M971P733M715K543K536N397J540m693l742
11809a477229j2051r65r286j4072l948O845P115J500k596N992O584k77M066N647
11795a482675N268J197n992m659K088k512Q463K187M050J709o47r84P952K309
11781a462246M757M744j578o916M21O922J941j3K40P419K621K045O180K528Q94
11766a430041K128N208o33L6P807Q009J591r63n174o742j2678j1084q152m519
11752a455207O772J689N103J148j974j241J694K442P72K291J794L564K031m408
$$ plain form
11852 -1558523 -1553993 -1555064 -1556601 -1553984 -1551159 -1555456 -1557060 -1555370 -1554528 -1547276 -1541338 -1537045 -1537255 -1538311
11838 -1538311 -1537163 -1535940 -1532895 -1524572 -1522801 -1524194 -1525967 -1518394 -1513369 -1514306 -1513965 -1513336 -1516257 -1520232 -1515514
11823 -1515514 -1509610 -1506798 -1511253 -1510469 -1498229 -1493258 -1485525 -1480810 -1478267 -1475731 -1470334 -1468794 -1473487 -1477229
11809 -1477229 -1489280 -1490245 -1499531 -1513603 -1517551 -1510706 -1503591 -1502091 -1504687 -1498695 -1492111 -1492388 -1488322 -1482675
11795 -1482675 -1477407 -1476210 -1482202 -1486861 -1484773 -1487285 -1478822 -1476635 -1472585 -1470876 -1471523 -1472507 -1464555 -1462246
11781 -1462246 -1457489 -1452745 -1454323 -1461239 -1460818 -1453896 -1451955 -1451968 -1451728 -1444309 -1441688 -1439643 -1433463 -1430935 -1430041
11766 -1430041 -1427913 -1422705 -1423338 -1423302 -1415495 -1407486 -1405895 -1406858 -1412032 -1418774 -1431452 -1442536 -1450688 -1455207
11752 -1455207 -1448435 -1446746 -1441643 -1440495 -1442469 -1443710 -1442016 -1439574 -1438802 -1436511 -1434717 -1431153 -1429122 -1433530
11738a433530K927N387J2863Q127J185m083M22m981P91K892O513j301m033k55
11724a407076M497K339M334J825n49N642J006P44M458J711l021L564N261P168
11710a368097l800m509J135P406K965l150L10k434k68J040N355J441j796n853
11696a370255Q75K966m89K872P24K592o46o119k825J0060Q602N324l563l7L84
11681a349535K322J526M362L407j437m22K605M177L310L228p299r049p39K221
11667a341323J0219J0704m90q2k948J092J981r4N40P590L2L285K441j424K025
11652a306452M734l104j980L002J255j436q3N975K381L193J892j150J822K206
11638a287745Q03j311M978l234o172N25J235J801M44R17K977m37j325k656L035
$$ plain form
11738 -1433530 -1430603 -1425216 -1412353 -1404226 -1403041 -1407124 -1406702 -1411683 -1410892 -1408000 -1401487 -1402788 -1406821 -1407076
11724 -1407076 -1402579 -1400240 -1395906 -1394081 -1394630 -1388988 -1387982 -1387238 -1382780 -1381069 -1384090 -1380526 -1375265 -1368097
11710 -1368097 -1371897 -1376406 -1375271 -1367865 -1364900 -1368050 -1367740 -1370174 -1370442 -1369402 -1364047 -1362606 -1364402 -1370255
11696 -1370255 -1369380 -1366414 -1366903 -1364031 -1363307 -1360715 -1361361 -1367480 -1370305 -1360245 -1351643 -1346319 -1349882 -1349919 -1349535
11681 -1349535 -1347213 -1345687 -1341325 -1337918 -1339355 -1339777 -1337172 -1332995 -1329685 -1326457 -1333756 -1342805 -1343544 -1341323
11667 -1341323 -1331104 -1320400 -1320890 -1320972 -1323920 -1322828 -1320847 -1320941 -1320401 -1312811 -1312779 -1309494 -1307053 -1308477 -1306452
11652 -1306452 -1301718 -1304822 -1306802 -1303800 -1302545 -1303981 -1304064 -1298089 -1295708 -1292515 -1290623 -1291773 -1289951 -1287745
11638 -1287745 -1286942 -1288253 -1283275 -1286509 -1292681 -1292156 -1290921 -1289120 -1288676 -1287759 -1284782 -1285219 -1286544 -1289200 -1286165
11623a286165J107P216K738l041L275N833L084n015m624O98J849k167O523K652
11609a266037N11k84n653j376M429M256J330Q29R64l439K874r01j486L696N796
11594a254491J2425r140q574L537L098p10l85k17k108N26K634O650P638J193P01
11579a237223M965K221n206L41J168N41j683M882K86J195N021N156k217m850n872
11564a231275Q72Q66J2169O31o390J681m08L643M754K47k55P21K322J843k8p28
11548a209335O600J285n148j805K5J219l08O822M5M152M56K802R7J680M328r23
11532a188008N637Q73l467o595j140J895k227m793l675L400M68K10O932J0091
11518a180399J31L657M520j690j232n732k086M765N422P935l391n567j830n07
$$ plain form
11623 -1286165 -1285058 -1277842 -1275104 -1278145 -1274870 -1269037 -1265953 -1270968 -1275592 -1274894 -1273045 -1275212 -1268689 -1266037
11609 -1266037 -1265526 -1265810 -1271463 -1272839 -1268410 -1264154 -1262824 -1261995 -1261031 -1264470 -1261596 -1262497 -1263983 -1260287 -1254491
11594 -1254491 -1242066 -1251206 -1259780 -1256243 -1253145 -1253855 -1254240 -1254457 -1256565 -1256039 -1253405 -1246755 -1239117 -1237924 -1237223
11579 -1237223 -1232258 -1230037 -1235243 -1234902 -1233734 -1233193 -1234876 -1229994 -1229708 -1228513 -1223492 -1218336 -1220553 -1225403 -1231275
11564 -1231275 -1230403 -1229537 -1217368 -1216737 -1223127 -1221446 -1221854 -1218211 -1213457 -1213210 -1213465 -1212744 -1210422 -1208579 -1208607 -1209335
11548 -1209335 -1202735 -1201450 -1206598 -1208403 -1208378 -1207159 -1207467 -1200645 -1200600 -1196448 -1195992 -1193190 -1193093 -1191413 -1187085 -1188008
11532 -1188008 -1182371 -1181498 -1184965 -1191560 -1192700 -1190805 -1193032 -1197825 -1201500 -1198100 -1197632 -1197422 -1190490 -1180399
11518 -1180399 -1180268 -1176611 -1172091 -1173781 -1175013 -1180745 -1182831 -1178066 -1172644 -1164709 -1168100 -1173667 -1175497 -1176004
11504a176004j06L769L948n773K496L592M431j411k465J298N07M730M791k40K685
11489a153752l332p762m683L708P544j605L630Q029j356O665O842l898l443L161
11475a140252k813m177p584p076J2299Q250K3K037l00p63K104j929J168m229p72
11460a144014O578J894K838L410l805m378l758J556K356L534j59j592P36k749
11446a137553L641m71K268N024M076l328o552K639R603O666L168q769j479L883
11432a117184O87K313K00L725j656k530K997K774m591j253K667J3214M862j983
11418a095758j729k896j006M289K885m900N588R165k291k890j458j102n417L315
11404a094205Q323J150J093Q91q45k0L303r58N88J829M430N129p872K254R447
$$ plain form
11504 -1176004 -1176110 -1172341 -1168393 -1174166 -1171670 -1168078 -1163647 -1165058 -1167523 -1166225 -1165718 -1160988 -1156197 -1156437 -1153752
11489 -1153752 -1157084 -1164846 -1169529 -1165821 -1158277 -1159882 -1156252 -1148223 -1149579 -1142914 -1136072 -1139970 -1143413 -1140252
11475 -1140252 -1143065 -1147242 -1154826 -1161902 -1149603 -1141353 -1141330 -1139293 -1139593 -1140356 -1138252 -1140181 -1139013 -1143242 -1144014
11460 -1144014 -1137436 -1135542 -1132704 -1129294 -1133099 -1137477 -1141235 -1139679 -1137323 -1133789 -1133948 -1135540 -1134804 -1137553
11446 -1137553 -1133912 -1134383 -1132115 -1127091 -1123015 -1126343 -1132895 -1130256 -1120653 -1113987 -1110819 -1119588 -1121067 -1117184
11432 -1117184 -1116497 -1114184 -1113984 -1110259 -1111915 -1114445 -1111448 -1108674 -1113265 -1114518 -1111851 -1098637 -1093775 -1095758
11418 -1095758 -1097487 -1100383 -1101389 -1097100 -1094215 -1099115 -1093527 -1084362 -1086653 -1089543 -1091001 -1092103 -1097520 -1094205
11404 -1094205 -1085882 -1084732 -1083639 -1082748 -1083593 -1083613 -1080310 -1081268 -1080680 -1078851 -1074421 -1069292 -1077164 -1074910 -1065463
11389a065463N56J654K803l676l920m26m694p412J150n40J224R20k299L069L182
11374a073872l243o13L88Q451R145n388k268K452o95l514L926M434j204K632j143
11359a060512l723m402K227K08M186N096Q24j514J053P175J506j634J744N063
11345a042703O221K202k302j430M635k150k980j56K97j809p816n599j649p455
11331a062694n755j443O397J716J851j796m504L326O428k718j751p505K600J5691
11317a050157Q755L483n246K604J83J093R938P203k474m680L093p249m022L649
11303a033827j39n41J994l173j715k208O731Q482J3024J241q031l489j650K778
11289a020523j720P41L04O512K595p146j959J77q140m246l10n272p18N86O952
$$ plain form
11389 -1065463 -1064907 -1063253 -1060450 -1064126 -1068046 -1068472 -1073166 -1080578 -1079428 -1079968 -1078744 -1077824 -1080123 -1077054 -1073872
11374 -1073872 -1077115 -1077728 -1077340 -1068889 -1059744 -1065132 -1067400 -1064948 -1065643 -1069157 -1065231 -1060797 -1062001 -1059369 -1060512
11359 -1060512 -1064235 -1068637 -1066410 -1066202 -1062016 -1056920 -1056096 -1057610 -1056557 -1049382 -1047876 -1049510 -1047766 -1042703
11345 -1042703 -1036482 -1034280 -1036582 -1038012 -1033377 -1035527 -1038507 -1038663 -1038366 -1040175 -1047991 -1053590 -1055239 -1062694
11331 -1062694 -1068449 -1069892 -1063495 -1061779 -1059928 -1061724 -1066228 -1062902 -1056474 -1059192 -1060943 -1068448 -1065848 -1050157
11317 -1050157 -1041402 -1037919 -1043165 -1040561 -1040378 -1039285 -1029347 -1022144 -1024618 -1029298 -1026205 -1033454 -1037476 -1033827
11303 -1033827 -1033966 -1034507 -1032513 -1035686 -1037401 -1039609 -1032878 -1024396 -1011372 -1010131 -1018162 -1021651 -1023301 -1020523
11289 -1020523 -1022243 -1021502 -1021198 -1014686 -1012091 -1019237 -1021196 -1021019 -1029159 -1033405 -1033715 -1038987 -1039705 -1039119 -1032167
11274a032167N369k983j492O467J54n100L350R137P683l567l409l296L730Q291
11260a007833J233J858J45q326p267Q724K956N424p93J109M355l680n11J718J669
11245i99219Q73j848L60L383k426l38Q74J489N210O928j392j0084q57J476K228
11230i93343q69P919P081k981q983m916l207L079Q899L424k563l605M129K025
11216i83911M045j517p09M474P19l47K300M557L213l126K629Q19K57n705n886
11201i78188P411M859O92m640m657k601M09P160L715m237L897L130o22n381n220
11186i74273M77L756L255J602k313l814n311L723M877N65L514O85J980Q164O14
11171i52499k807J300j603K262J664J033P014K699p547M038K079K791R65m38M720
$$ plain form
11274 -1032167 -1026798 -1029781 -1031273 -1024806 -1024652 -1029752 -1026402 -1017265 -1009582 -1013149 -1016558 -1019854 -1016124 -1007833
11260 -1007833 -1006600 -1004742 -1004597 -1012923 -1020190 -1011466 -1008510 -1003086 -1003879 -1002770 -998415 -1002095 -1002606 -1000888 -999219
11245 -999219 -998346 -1000194 -999834 -996451 -998877 -999215 -998341 -996852 -991642 -984714 -986106 -996190 -997047 -995571 -993343
11230 -993343 -994212 -986293 -979212 -982193 -991176 -996092 -999299 -996220 -987321 -983897 -986460 -990065 -985936 -983911
11216 -983911 -979866 -981383 -982092 -977618 -976899 -977246 -974946 -970389 -967176 -970302 -967673 -966854 -966597 -972302 -978188
11201 -978188 -970777 -965918 -965226 -969866 -974523 -977124 -976715 -969555 -965840 -970077 -966180 -963050 -963672 -969053 -974273
11186 -974273 -973796 -970040 -966785 -965183 -967496 -971310 -976621 -972898 -968021 -967456 -963942 -963257 -961277 -953113 -952499
11171 -952499 -955306 -954006 -955609 -953347 -951683 -950650 -943636 -940937 -948484 -944446 -942367 -939576 -938611 -939049 -934329
11156i34329m528n207l048L08J308l647N760q83K655J335K423R18m95M735N485
11141i27210j548n802j720l786L707l987n443o032m248J289K880k259L761M351
11127i46047K447k414j387K432J617O799J1339K898j772O253j271L97m318p625
11113i30652n903N988M0l716m636L313R275n498j3195r108k233K420Q54k961n269
11098i61281J029J3304L700P24m758M554M741K535j611r56N214K413n388O572
11084i29208O260p354j83M645N277l749r845K153L098K245J0179N19l996o83J886
11069i18756k276j346L402M219l8n356q75N986N327J53m722l983K844n650r29
11054i22000R220K396M198k729m123K738Q28M923r01M801k451J201N082J104k
$$ plain form
11156 -934329 -938857 -944064 -947112 -946804 -945496 -949143 -943383 -944266 -941611 -940276 -937853 -936935 -937430 -932695 -927210
11141 -927210 -928758 -934560 -936280 -940066 -936359 -940346 -945789 -951821 -956069 -954780 -951900 -954159 -950398 -946047
11127 -946047 -943600 -946014 -947401 -944969 -943352 -936553 -925214 -922316 -924088 -917835 -919106 -918709 -923027 -930652
11113 -930652 -936555 -930567 -930527 -934243 -938879 -935566 -926291 -931789 -944984 -954092 -956325 -953905 -953051 -956012 -961281
11098 -961281 -960252 -946948 -943248 -942524 -947282 -942728 -937987 -935452 -937063 -938019 -932805 -930392 -935780 -929208
11084 -929208 -922948 -930302 -930485 -925840 -920563 -924312 -934157 -932004 -928906 -926661 -916482 -915963 -919959 -920642 -918756
11069 -918756 -921032 -922378 -918976 -914757 -914795 -920151 -921026 -915040 -909713 -909560 -914282 -918265 -915421 -921071 -922000
11054 -922000 -912780 -910384 -906186 -908915 -913038 -910300 -909472 -904549 -905450 -900649 -903100 -901899 -896817 -895713 -895715
11039h95715j832o65o99K757L015L356N309o253k027k189Q630m10l257o127L800
11024h92307K669K068J127J2k758J300M025l654O242N494J471o914r55K819p030
11009h86391j133R582K862l193J194Q307K724k024m38k369j076N95k918n894k116
10994h82288K925M215M510M676J121J267n023p156R015J565O275K844L003l377
10980h56428p606l336l138n402m01Q11J838K607n513M148l252o964K781J53P239
10965h72463L576J520k263l328L787L696O035J219P344p536k434Q673L450k693
10951h51417m315J810n59r86j12J182j548K53J704K897M642J259o87N404J923
10936h38550r06n326j250l581O047N841n407p64o172j1687j1151l792k678m720
$$ plain form
11039 -895715 -897547 -898212 -898911 -896154 -893139 -889783 -884474 -890727 -892754 -894943 -886313 -886723 -889980 -896107 -892307
11024 -892307 -889638 -887570 -886443 -886431 -889189 -887889 -883864 -887518 -881276 -875782 -874311 -881225 -882180 -879361 -886391
11009 -886391 -887524 -877942 -875080 -878273 -877079 -868772 -866048 -868072 -868510 -870879 -871955 -871360 -874278 -880172 -882288
10994 -882288 -879363 -875148 -870638 -865962 -864841 -863574 -868597 -875753 -866738 -865173 -858898 -856054 -853051 -856428
10980 -856428 -864034 -867370 -870508 -875910 -876311 -875500 -873662 -871055 -876568 -872420 -875672 -882636 -879855 -879702 -872463
10965 -872463 -868887 -867367 -869630 -872958 -869171 -865475 -859440 -858221 -850877 -858413 -860847 -852174 -848724 -851417
10951 -851417 -855732 -853922 -854481 -855467 -855579 -854397 -855945 -855692 -853988 -851091 -846449 -845190 -845877 -840473 -838550
10936 -838550 -839456 -844782 -846032 -849613 -843566 -837725 -843132 -843896 -850068 -861755 -872906 -876698 -879376 -884096
10922h84096L565O75K965p8n0N054O251j989O919M863p907j544j969J105j075
10907h67311l804J258M129O687M975L669l468l641R433L018J254J324m680j830
10893h48987l954J219L016J1061P630J692o570l132L943K236k837m434m205R58
10879h42364m248l409J766J42Q520l258j776n795K552P430l685L362R22K157j661
10864h39345O581K250j898J342O072m067l689P225N898R41m696J178J366l547
10850h24389k384J205l476q909l492L533N726Q726M918L37q45J403M87J546O81
10835h14933J849j482J104L389K913k300n555M358L130p9Q34k913j563j61M101
10820h07308j117k641K904P31J422K208Rn724q0K668m946L69l007J956M514j902
$$ plain form
10922 -884096 -880531 -879856 -876891 -876969 -877019 -871965 -865714 -867703 -860784 -855921 -863828 -865372 -867341 -866236 -867311
10907 -867311 -871115 -869857 -865728 -859041 -854066 -850397 -853865 -857506 -848073 -845055 -843801 -842477 -847157 -848987
10893 -848987 -852941 -851722 -848706 -837645 -830015 -828323 -834893 -838025 -834082 -831846 -834683 -839117 -843322 -842364
10879 -842364 -846612 -850021 -848255 -848113 -839593 -842851 -844627 -850422 -847870 -840440 -844125 -840763 -839841 -837684 -839345
10864 -839345 -832764 -830514 -832412 -831070 -824998 -829065 -832754 -825529 -819631 -818690 -823386 -822208 -820842 -824389
10850 -824389 -826773 -825568 -829044 -837953 -841445 -837912 -832186 -823460 -818542 -818205 -819050 -817647 -817160 -815614 -814933
10835 -814933 -813084 -814566 -813462 -810073 -807160 -809460 -815015 -810657 -807527 -807606 -806772 -809685 -811248 -811409 -807308
10820 -807308 -808425 -811066 -808162 -807431 -806009 -803801 -803792 -809516 -809596 -806928 -811874 -811505 -814512 -812556 -808042 -809944
10804h09944Q38m823k392j378N390K654J713N820r943Q13Q32k431k246j120L321
10789h12896N868M933M503M212m960o845l08l048r87k7N480k167k129l645O557
10774h05459M115J694J954M182m817l781O636O000L726M570J99k181l420o489
10760g93071o760M714J1693L616M182p571K137J433k210k545q285O98k354N131
10746g89192K692m834o605N757o73l235Q187N958Q3m661j834q656L784N339K271
10731g85619K718L045r248l468k52j490P69N409L835j582O35L045O286n248o236
10716g87401L738P219K705O172N102p814p322O18Q7L75j125j837K772J2062K467
10701g62182l373l443j263j238o087l948M636N188J782p855j315O763k823J375
$$ plain form
10804 -809944 -809106 -813929 -816321 -817699 -812309 -809655 -807942 -802122 -812065 -811252 -810420 -812851 -815097 -816217 -812896
10789 -812896 -807028 -802095 -797592 -793380 -798340 -805185 -805493 -808541 -809528 -809555 -804075 -806242 -808371 -812016 -805459
10774 -805459 -801344 -799650 -797696 -793514 -798331 -802112 -795476 -789476 -785750 -781180 -780981 -783162 -786582 -793071
10760 -793071 -799831 -795117 -783424 -779808 -775626 -783197 -781060 -779627 -781837 -784382 -792667 -791969 -794323 -789192
10746 -789192 -786500 -791334 -797939 -792182 -792855 -796090 -787903 -781945 -781862 -786523 -788357 -797013 -793229 -787890 -785619
10731 -785619 -782901 -779856 -789104 -792572 -792824 -794314 -793545 -788136 -784301 -785883 -785248 -782203 -775917 -781165 -787401
10716 -787401 -783663 -776444 -773739 -767567 -762465 -770279 -777601 -776983 -776896 -776521 -777646 -779483 -776711 -764649 -762182
10701 -762182 -765555 -768998 -770261 -771499 -777586 -781534 -776898 -771710 -769928 -777783 -779098 -772335 -775158 -773783
10687g73783N28N726j05q75K533m063n697m826k25N708K93O152J993k681M50j285
10671g70157k490L394j496k23N000K165N45q21n49k749J871M242M96P20j734n586
10655g67372L328N592Q400j863p680O82K980p457l513O148Q211N423j395j898
10641g50414j51Qk089o106k408K401L111O797R733J137m09k904n190p463L551
10626g50396K046j071k129O591q5n312m83L538L324p01o825M81k074M503k648
10611g51241O392N876J21l190k485K392L91M774j492j300M254J388O97M340L703
10596g25380k257n483q049j489L738J321J293j80j623j597o3K182L093k680J568
10581g35606K335K998J365o802L501l426l09j053k381L626K952j148L08P757j6
$$ plain form
10687 -773783 -773255 -767529 -767634 -768509 -765976 -770039 -775736 -780562 -780787 -775079 -774786 -768634 -766641 -769322 -768872 -770157
10671 -770157 -772647 -769253 -770749 -770972 -765972 -763807 -763262 -764083 -764632 -767381 -765510 -761268 -760772 -760052 -761786 -767372
10655 -767372 -764044 -758452 -750052 -751915 -759595 -758913 -755933 -763390 -766903 -760755 -752544 -747121 -748516 -750414
10641 -750414 -750565 -750557 -752646 -758752 -761160 -758759 -755648 -748851 -739118 -737981 -738390 -741294 -746484 -753947 -750396
10626 -750396 -748350 -749421 -751550 -744959 -745044 -750356 -750839 -747301 -743977 -744678 -751503 -751022 -753096 -748593 -751241
10611 -751241 -744849 -738973 -738852 -742042 -744527 -742135 -741744 -736970 -738462 -739762 -735508 -734120 -733423 -729083 -725380
10596 -725380 -727637 -733120 -741169 -742658 -738920 -737599 -736306 -736486 -738109 -739706 -739769 -737587 -734494 -737174 -735606
10581 -735606 -733271 -730273 -728908 -735710 -732209 -735635 -735944 -736997 -739378 -735752 -732800 -733948 -733640 -725883 -725899
10566g25899o621K79K535J389l656M193M195N958M651L207J916l705l045m038
10552g18641N282J822r323n702J25k983L12L273L605o048q770M181J0374J0372
10538g12121J865n826N08K423J222K469j0210k778L182r45J397J959j396K558
10524g15693K339M10O102L668j015n229q066m14n567l24P266m985M076p49j532
10509g19713J354M696l94J393Q80m172R07N80K763j388j871o33j041p01K45m410
10493g21505k900J377M055O002P410N185r22M615R44o328k752q96K429j962L40
10478g04908J228J764L189j008q502K211M557Q693n414q316j813j839L602o51
10464g07207K309J502j520J246Q598L386j937j0082j962K79J871N321N713j545
$$ plain form
10566 -725899 -732520 -732241 -729706 -728317 -731973 -727780 -723585 -717627 -712976 -709769 -707853 -711558 -714603 -718641
10552 -718641 -713359 -711537 -720860 -726562 -726437 -729420 -729108 -725835 -722230 -728278 -737048 -732867 -722493 -712121
10538 -712121 -710256 -716082 -715574 -713151 -711929 -709460 -719670 -722448 -719266 -720211 -718814 -716855 -718251 -715693
10524 -715693 -713354 -712944 -706842 -703174 -704189 -709418 -717484 -717898 -723465 -723789 -716523 -721508 -717432 -718181 -719713
10509 -719713 -718359 -713663 -714057 -712664 -711784 -715956 -715049 -714469 -711706 -713094 -714965 -715598 -716639 -717340 -717095 -721505
10493 -721505 -724405 -723028 -718973 -712971 -705561 -700376 -701298 -696683 -695739 -702067 -704819 -705715 -703286 -705248 -704908
10478 -704908 -703680 -701916 -698727 -699735 -708237 -706026 -701469 -692776 -698190 -706506 -708319 -710158 -706556 -707207
10464 -707207 -704898 -703396 -704916 -703670 -695072 -691686 -693623 -703705 -705667 -705388 -703517 -698196 -692483 -694028
10450f94028k541m845j92m5N955j946n480j839K032m424n782Q097K534Q61N005
10435f96638M06r550n764M4K734N172L220n51n83L148R584j862k635k433m9J354
10419f94403o65r87j558K145M123k725O70K797J316L367Q990j431n638n758m443
10404f94200O999Q292N729j134n249k556J953j792P558k805o675q130P48O891
10390f84371K758p31l086j881J264Q284M470l979N17K018l401r274n370L044L432
10375f86306L748J007J629R286n4n26m585j719K014j596k467Q90P429K546k4M755
10359f63973J878J080l006m857L006R92k993J131K061k021l479k113l994k088
10345f78376L439l19L350L810L387j373o903k206n003k722L739O124K171K209
$$ plain form
10450 -694028 -696569 -701414 -701606 -701651 -695696 -697642 -703122 -704961 -702929 -707353 -713135 -705038 -702504 -701643 -696638
10435 -696638 -696232 -705782 -711546 -711502 -708768 -703596 -700376 -700927 -701510 -698362 -688778 -690640 -693275 -695708 -695757 -694403
10419 -694403 -695068 -696055 -697613 -695468 -691345 -694070 -693400 -690603 -689287 -685920 -676930 -678361 -683999 -689757 -694200
10404 -694200 -687201 -678909 -673180 -674314 -679563 -682119 -680166 -681958 -674400 -677205 -683880 -692010 -691262 -684371
10390 -684371 -681613 -682344 -685430 -687311 -686047 -677763 -673293 -677272 -676755 -674737 -678138 -687412 -692782 -689738 -686306
10375 -686306 -682558 -681551 -679922 -670636 -670690 -671216 -675801 -677520 -675506 -677102 -679569 -678679 -671250 -668704 -668728 -663973
10359 -663973 -662095 -661015 -664021 -668878 -665872 -664880 -667873 -666742 -664681 -666702 -670181 -672294 -676288 -678376
10345 -678376 -674937 -675256 -671906 -668096 -664709 -666082 -672985 -675191 -680194 -682916 -679177 -673053 -670882 -668673
10331f68673M044J406L45j277j907k709K82L210R948L892r57l338o400l72L639
10316f58867L460o85r241k879J736K165N056J476L669j451J981L001k170k876
10302f55625m877o296l017K960K857N562J00q01K850N275R72L686q75L567M679
10287f38983r376n740K3r62m670L496L805K075J237m498o74L610P069N4o001P52
10271f48783n577k370M323R66M852O065m366J07M765M584n465m448m961l989M832
10256f49465J143M11k374L334L680q891m379J0012N494l008k313N53j436n685
10242f52924n982n167N301J6724J641L281J299r072j0232k302Q856R173K520J945
10228f34939l310q137p562L750q17N443k555L3N285Q93M144N149L605N467l935
$$ plain form
10331 -668673 -664629 -663223 -662878 -664155 -666062 -668771 -668489 -665279 -655331 -651439 -652396 -655734 -662134 -662506 -658867
10316 -658867 -655407 -656092 -665333 -668212 -666476 -664311 -659255 -657779 -654110 -655561 -653580 -650579 -652749 -655625
10302 -655625 -660502 -666798 -669815 -666855 -663998 -658436 -658336 -659137 -656287 -651012 -650040 -646354 -647229 -643662 -638983
10287 -638983 -648359 -654099 -654076 -655038 -659708 -656212 -652407 -650332 -649095 -653593 -654267 -650657 -643588 -643534 -649535 -648783
10271 -648783 -654360 -656730 -652407 -651441 -646589 -640524 -644890 -644783 -640018 -635434 -640899 -645347 -650308 -654297 -649465
10256 -649465 -648322 -647911 -650285 -646951 -643271 -652162 -656541 -646529 -641035 -644043 -646356 -645803 -647239 -652924
10242 -652924 -658906 -664073 -658772 -642048 -640407 -637126 -635827 -644899 -655131 -657433 -648577 -639404 -636884 -634939
10228 -634939 -638249 -646386 -653948 -650198 -651015 -645572 -648127 -648094 -642809 -641916 -637772 -632623 -629018 -623551 -627486
10213f27486n493K003j778q61R055N466o085n307j394j765L897M071P20l710r171
10198f37838l220k954N08L93J671J428j437O776P305J059n044j736j71P99k389
10183f34850k777l821K523R979J007m884J298N151O4k041k286k790r12l098j417
10168f38854K298O491N267N86L50L967k991Q7J748K60L712L443K15q971j188O829
10152f16751L385k661l58o065k503P043l104j972K183P301l05j992j514L92m865
10137f21786l061L730J006j2204O26O494R037N139k703k006J368K443l055O76
10123f14296M831J870M145J104o075j0730r18k233K703M908J380m623L039N86
10109f14309R76K342K043J271J524L136M461o55K126p36O33M47R17M02n384j0331
$$ plain form
10213 -627486 -632979 -630976 -632754 -633615 -624560 -619094 -625179 -630486 -631880 -633645 -629748 -625677 -624957 -628667 -637838
10198 -637838 -641058 -644012 -643504 -643111 -641440 -640012 -641449 -634673 -627368 -626309 -631353 -633089 -633260 -632461 -634850
10183 -634850 -637627 -641448 -638925 -628946 -627939 -632823 -631525 -626374 -626310 -628351 -630637 -633427 -634339 -637437 -638854
10168 -638854 -636556 -630065 -624798 -624212 -623862 -619895 -622886 -622799 -621051 -620791 -617079 -613636 -613421 -622392 -623580 -616751
10152 -616751 -613366 -616027 -616385 -622450 -624953 -617910 -621014 -622986 -620803 -613502 -613807 -615799 -617313 -616921 -621786
10137 -621786 -624847 -621117 -620111 -632315 -631689 -625195 -616158 -611019 -613722 -615728 -614360 -611917 -614972 -614296
10123 -614296 -609465 -607595 -603450 -602346 -608421 -619151 -620069 -622302 -619599 -614691 -613311 -617934 -614895 -614309
10109 -614309 -613333 -610991 -608948 -607677 -606153 -603017 -598556 -599211 -597085 -597821 -597188 -596741 -595824 -595422 -600806 -611137
10093f11137m093k455k109Ml230k001j73Q782R395J681J063n24L673j236m56j207
10077f04023p438k935J955J836J056J324n429M353K176Q67o82N48q04j442j134
10062f09772K515J483j951M747o649L902N939K703K30l239L090N739l440l391
10048e98094K981k055k575j511L649J783j47l9L809m20N933M031r932p783j1451
10033f11821j414l01L298N081J3133L918o314l941M708k236m080J906Q352O811
10019e82900k248j555l118o376j88J3669M948m498q825n16j918Q145M484k348
10005e83244j447j657l229P38J022K721p92k42p08K369l654n960O954K2l481p297
9989e97885p095m079l618K304Q81J786M205o92J712Q29J652O27N01P029R888k718
$$ plain form
10093 -611137 -615230 -617685 -619794 -619790 -623020 -625021 -625194 -616412 -607017 -605336 -604273 -604797 -601124 -602360 -602816 -604023
10077 -604023 -611461 -614396 -612441 -610605 -609549 -608225 -613654 -609301 -607125 -606258 -606940 -606392 -607196 -608638 -609772
10062 -609772 -607257 -605774 -607725 -602978 -609627 -605725 -599786 -597083 -596853 -600092 -597002 -591263 -594703 -598094
10048 -598094 -595113 -597168 -599743 -601254 -597605 -595822 -595969 -596008 -592199 -592619 -586686 -582655 -592587 -600370 -611821
10033 -611821 -613235 -613536 -610238 -605157 -592024 -588106 -594420 -598361 -593653 -595889 -599969 -598063 -589711 -582900
10019 -582900 -585148 -586703 -589821 -596197 -596385 -582716 -577768 -582266 -591091 -591607 -593525 -585380 -580896 -583244
10005 -583244 -584691 -586348 -589577 -588839 -587817 -585096 -585888 -586130 -586838 -584469 -588123 -594083 -587129 -587107 -590588 -597885
9989 -597885 -604980 -609059 -612677 -610373 -609492 -607706 -603501 -604193 -602481 -601652 -600000 -599373 -598872 -591843 -581955 -584673
9973e84673R53L190J203m045j200M126R77n847M20K847q439q81R24m07N739K795
9957e82318M452L761m366m376N704m829m839k021k710J05N394j713q42P130m594
9942e86062J153K690J842J192l37o610o521j526N289N898N054M534N650K824r767
9927e74697q815L8K349Q34j08Q981J026n410R27R241N10l081L790q31o644M69
9911e71421j028j96J072K85n66R63K431L321R80J715l333J429j970K417J114m878
9895e67665Q41K462q033O88N245j228p41L459o975L887Q685L985j149o475J188
9880e61826J080k891o02J355J896l295L26J842K149L658n0j989m091M185K214
9865e56039K242k827J307N026K198p724l730j485K392q55j813M535l078j148K141
$$ plain form
9973 -584673 -583720 -580530 -579327 -583372 -584572 -580446 -579469 -585316 -584896 -582049 -590488 -591369 -590445 -590852 -585113 -582318
9957 -582318 -577866 -574105 -578471 -582847 -577143 -581972 -586811 -588832 -591542 -591437 -586043 -587756 -588598 -581468 -586062
9942 -586062 -584909 -582219 -580377 -579185 -579522 -586132 -592653 -594179 -588890 -582992 -577938 -573404 -567754 -564930 -574697
9927 -574697 -583512 -583474 -581125 -580291 -580399 -571418 -570392 -575802 -574875 -565634 -565124 -568205 -564415 -565246 -571890 -571421
9911 -571421 -572449 -572645 -571573 -571288 -571854 -570891 -568460 -565139 -564159 -562444 -565777 -564348 -566318 -563901 -562787 -567665
9895 -567665 -566824 -564362 -572395 -571707 -566462 -567690 -568431 -564972 -571947 -568060 -559375 -555390 -556539 -563014 -561826
9880 -561826 -560746 -563637 -564239 -562884 -560988 -564283 -563957 -562115 -559966 -556308 -556358 -558347 -562438 -558253 -556039
9865 -556039 -553797 -556624 -555317 -550291 -548093 -555817 -559547 -561032 -558640 -559495 -561308 -556773 -559851 -560999 -558858
9850e58858k905P017K93k683k822M891J1105R39p05n421o668n277q219p321K420
9835e74214M467L316l584O580N054n286K020j204n317J0650M591J282R16m73q776
9820e59978n074J42O749j932J012m11Q3N796j117J589L316P51n561o887N655Q577
9804e47290m598O087M426K318M33J028n624R0j686j220J618L735J863N239M423
9789e29158j734r017j2435r207k359j84m08J995m465N4P897K706N95N078L96l184
9773e53430K937N981k279l41L591n327K032K788K359m117k812N314P337N95l968
9758e39340k052k883K157J583K266k993Q85J304j801P753k388q346o360j175L110
9743e48280Q8J644k85L639M371k282J2395P187j2582j1544k293k074L375L068
$$ plain form
9850 -558858 -561763 -554746 -554453 -557136 -559958 -555067 -543962 -543023 -543728 -549149 -555817 -561094 -569313 -576634 -574214
9835 -574214 -569747 -566431 -570015 -563435 -558381 -563667 -561647 -562851 -568168 -557518 -552927 -551645 -550729 -551202 -559978
9820 -559978 -565052 -564910 -558161 -560093 -559081 -559492 -559409 -553613 -554730 -553141 -549825 -549074 -554635 -561522 -555867 -547290
9804 -547290 -551888 -545801 -541375 -539057 -538624 -537596 -543220 -543130 -544816 -546036 -544418 -540683 -538820 -533581 -529158
9789 -529158 -530892 -539909 -552344 -561551 -563910 -564094 -564502 -562507 -566972 -566918 -559021 -556315 -555720 -550642 -550246 -553430
9773 -553430 -550493 -544512 -546791 -547132 -543541 -548868 -546836 -544048 -541689 -545806 -548618 -543304 -535967 -535372 -539340
9758 -539340 -541392 -544275 -542118 -540535 -538269 -541262 -540377 -539073 -540874 -533121 -535509 -543855 -550215 -551390 -548280
9743 -548280 -548192 -546548 -546833 -543194 -538823 -541105 -528710 -521523 -534105 -545649 -547942 -550016 -546641 -543573
9729e43573J974k150j780J523O821L643Q41q311l530O115j418N857m266m639L730
9714e39163J470M720R522j40m969n754j909p4J825K739k026N94P068p991q520
9699e42608Q031N658k531Q672N065N43l082l773j934M010O32N02J19q647J085
9684e28258L565n348l020L298K304J45K571N906J988J373J562m25m666p271J073
9669e25203l536L629L398O291l635l469j435n18J673J369L309K214L059p114m999
9654e24967j599M152l586j638O315L356J045O916n7N48l41k792O916K534q96J061
9638e03033m231K55m331m999K452k933o434k8L344l443K605O368J655N834k518
9623e09437o456j274J666L551L125K582k899N26J635K019N008K709n061J75o643
$$ plain form
9729 -543573 -541599 -543749 -545529 -544006 -537185 -533542 -532701 -541012 -544542 -538427 -539845 -533988 -538254 -542893 -539163
9714 -539163 -537693 -532973 -523451 -523591 -528560 -534314 -536223 -536297 -534472 -531733 -533759 -533165 -526097 -534088 -542608
9699 -542608 -534577 -528919 -531450 -522778 -517713 -517170 -520252 -524025 -525959 -521949 -521317 -520815 -520696 -529343 -528258
9684 -528258 -524693 -530041 -533061 -529763 -527459 -527314 -524743 -518837 -516849 -515476 -513914 -514339 -519005 -526276 -525203
9669 -525203 -528739 -525110 -521712 -515421 -519056 -522525 -523960 -524478 -522805 -521436 -518127 -515913 -512854 -519968 -524967
9654 -524967 -526566 -522414 -526000 -527638 -521323 -517967 -516922 -510006 -510063 -509515 -509856 -512648 -505732 -503198 -504094 -503033
9638 -503033 -507264 -507009 -511340 -516339 -513887 -516820 -523254 -523282 -519938 -523381 -520776 -514408 -512753 -506919 -509437
9623 -509437 -515893 -517167 -515501 -511950 -508825 -506243 -509142 -508616 -506981 -504962 -499954 -497245 -502306 -502131 -508774
9608e08774l212N181Q530O716l50q700j073K45o808l67O191R218J1996J960J907
9593d77340o152l576J726j986o98L458n862o035j88O098j352j933k658k372Q38
9578d98032Q192M693n281j422k657Nm086L113J108k800J670N311n484p764l210
9563e06644k77R15O069L077L58M471L862q16J320n25K449k099k031n46K325P69
9547d87323n004K152Q238J009l656k214j970N934k635K74M800j457m864k028J642
9532d87102J036M232j56J839n208N868j043n238J681l459P09J109j821M801J0813
9517d71939R93k460K150K596j742l868L20L475j637j635j509N693O100r95k859
9502d67317m365M010K419J3p77o891k007M83P980P219r15P92Q72k928M554N245
$$ plain form
9608 -508774 -511986 -506805 -498275 -491559 -491909 -500609 -501682 -501437 -508245 -508612 -502421 -493203 -481207 -479247 -477340
9593 -477340 -483492 -487068 -485342 -487328 -488026 -484568 -490430 -496465 -496653 -490555 -491907 -493840 -496498 -498870 -498032
9578 -498032 -489840 -485147 -490428 -491850 -494507 -494502 -498588 -495475 -494367 -497167 -495497 -490186 -495670 -503434 -506644
9563 -506644 -506921 -506006 -499937 -496860 -496502 -492031 -488169 -488985 -487665 -488190 -485741 -487840 -489871 -490417 -488092 -487323
9547 -487323 -492327 -490175 -481937 -480928 -484584 -486798 -488768 -482834 -485469 -485195 -480395 -481852 -486716 -488744 -487102
9532 -487102 -486066 -481834 -481990 -480151 -485359 -479491 -480534 -485772 -484091 -487550 -486841 -485732 -487553 -482752 -471939
9517 -471939 -470946 -473406 -471256 -468660 -470402 -474270 -473950 -470475 -472112 -473747 -475256 -469563 -463463 -464458 -467317
9502 -467317 -471682 -467672 -465253 -465240 -466017 -472908 -474915 -474432 -466452 -459233 -460148 -459356 -458484 -461412 -456858 -451613
9486d51613r397p591j050l98j837L738J2292M858n600J834l633r87K518K276k310
9471d56900m849M76M692P119R20J306L838k429o196N354R56n701M448p34N908
9456d41792M101k340J406O944j88k810l27k749q13J813l882k997O64N019l61N605
9440d32707Q530j029l799j553J622j99k377j056K465O54n049M258Q140j36j1839
9425d34075N53R593P531n715J941k668m322N540r90O782J42l62j556m805o054
9410d28465P292J3244l182m478R24O418M270M326n19J882j15o250j134M523q40
9395d02104L400N69r90p724m226n75L411K704Q241K545O807L78M704M482k037
9380c80415m185K877N722o94L242j434J0138Q812j236r897p329Q745N634k331
$$ plain form
9486 -451613 -461010 -468601 -469651 -470049 -471886 -468148 -455856 -450998 -456598 -454764 -458397 -459384 -456866 -454590 -456900
9471 -456900 -461749 -461273 -456581 -449462 -448542 -447236 -443398 -445827 -452023 -446669 -445713 -451414 -446966 -447700 -441792
9456 -441792 -437691 -440031 -438625 -431681 -431869 -434679 -435006 -437755 -438568 -436755 -440637 -443634 -442970 -437951 -438312 -432707
9440 -432707 -424177 -425206 -429005 -430558 -428936 -429135 -431512 -432568 -430103 -429449 -434498 -430240 -422100 -422236 -434075
9425 -434075 -433522 -423929 -416398 -422113 -420172 -422840 -427162 -421622 -422612 -415830 -415688 -416050 -417606 -422411 -428465
9410 -428465 -421173 -407929 -411111 -415589 -414665 -408247 -403977 -399651 -400170 -398288 -398403 -404653 -405787 -401264 -402104
9395 -402104 -398704 -398135 -399125 -406849 -411075 -411650 -408239 -405535 -397294 -394749 -387942 -387564 -382860 -378378 -380415
9380 -380415 -384600 -381723 -376001 -376695 -373453 -374887 -364749 -355937 -357173 -367070 -374399 -365654 -360020 -362351
9366c62351l018r96j66N77j92J77o61k88L650Q300N876L914N667k487o261j255
9350c49514N259L547n94K191O214M913k93L503M023j419j618L777k521n247K280
9335c25499K360N428L501L092M692o754n555M151M746N984n994J678j283K074
9321c07379L790P093P187J1219P304K924J176J813K463K717j514l302r51J050
9307b64410k79J0046K355n286L347J188Q12Q85K159m592j337L496n709k486r427
9292b69238r73l363r587j1229q880q896k944o57j1679j2435j5151j7282j0719
9279c83033j9420k3381j6350j6940l0838j7622j4375j6396j0878j5862k2246j4764
9267f02105r109j5538j3848j8293j8765j0533r746p159j1339p944j4939q936l714
$$ plain form
9366 -362351 -365369 -366365 -366531 -365954 -366146 -365969 -366630 -366918 -363268 -354968 -349092 -345178 -339511 -341998 -348259 -349514
9350 -349514 -344255 -340708 -341302 -339111 -332897 -327984 -328277 -324774 -320751 -322170 -323788 -320011 -322532 -327779 -325499
9335 -325499 -323139 -317711 -314210 -311118 -306426 -313180 -318735 -314584 -309838 -303854 -309848 -308170 -309453 -307379
9321 -307379 -303589 -296496 -289309 -278090 -270786 -267862 -266686 -264873 -262410 -259693 -261207 -264509 -265460 -264410
9307 -264410 -264689 -254643 -252288 -257574 -254227 -253039 -252227 -251342 -249183 -253775 -255112 -251616 -257325 -259811 -269238
9292 -269238 -270211 -273574 -283161 -294390 -303270 -312166 -315110 -315767 -327446 -339881 -355032 -372314 -383033
9279 -383033 -402453 -425834 -442184 -459124 -489962 -507584 -521959 -538355 -549233 -565095 -587341 -602105
9267 -602105 -611214 -626752 -640600 -658893 -677658 -688191 -697937 -705096 -716435 -724379 -739318 -748254 -751968
9254g51968n077j2489j1872L230O591L311O293J654j321p307M521J0116R92r154
9240g62480n306n21k801M294P095Q848k110o553P924R549L196m07Q992Q747l148
9225g24681n231J28Q037p077n762R203J4681K655k203O318Q853M629K757j029
9211f88722K455J928J144R161O148p509m554j126j72j418J0442J1448O529n352
9197f59598m529n090L662Q836P516k799N98K116J611j694j219l207J197P031J3055
9182f32514R477j477k193j1753J171k143L991O559N143m900m163K320M937R459
9168f16086L547l806k594J267Q385k349M535P196q89J863k770q419n212J220Q434
9153f05678N45l86k813K448L10Q32K117n821m059K853M615O810Q483k014l757
$$ plain form
9254 -751968 -757045 -769534 -781406 -778176 -771585 -768274 -761981 -760327 -761648 -768955 -764434 -754318 -753326 -762480
9240 -762480 -767786 -768307 -771108 -766814 -759719 -750871 -752981 -759534 -751610 -742061 -738865 -739272 -730280 -721533 -724681
9225 -724681 -729912 -729784 -721747 -728824 -734586 -725383 -710702 -708047 -710250 -703932 -695079 -690450 -687693 -688722
9211 -688722 -686267 -684339 -683195 -674034 -667886 -675395 -679949 -681075 -681247 -682665 -672223 -660775 -654246 -659598
9197 -659598 -664127 -669217 -665555 -656719 -649203 -652002 -651404 -649288 -647677 -649371 -650590 -653797 -652600 -645569 -632514
9182 -632514 -623037 -624514 -626707 -638460 -637289 -639432 -635441 -628882 -623739 -628639 -632802 -630482 -625545 -616086
9168 -616086 -612539 -616345 -618939 -617672 -609287 -611636 -607101 -599905 -600794 -598931 -601701 -610120 -615332 -614112 -605678
9153 -605678 -605133 -605519 -608332 -605884 -605574 -604742 -602625 -608446 -612505 -609652 -605037 -598227 -589744 -591758 -595515
9138e95515O870k193N28l049J734J0719j564m309m82l912L38n257K978M513j220
9123e89821J731N046L579J223l338j686L275J631l200k86M452N814J575K522l830
9108e71313l87l188j711M243K332K456J833L556P392R42k079J334j430r62j093
9093e58075o423J326L567J0209j038J057l094j012M68m742l839j082O570M233
9079e51875l217N214m617k502N704O715R77l029L97k69p965j790Q30J598O173
9064e47656Q068P337o135k636j910k864K892K631L356K209k457n669p711m745
9050e55290L850j23n27P48P313J109N341m010m2j220j202m303Q34Q143K704l905
9034e40580o838M427O067P370K964r163k81K206o047o43J490J2980M391o432M966
$$ plain form
9138 -595515 -588645 -590838 -590310 -593359 -591625 -580906 -582470 -586779 -587261 -591173 -590835 -596092 -593114 -588601 -589821
9123 -589821 -588090 -583044 -579465 -578242 -581580 -583266 -579991 -578360 -581560 -581846 -577394 -571580 -570005 -567483 -571313
9108 -571313 -571700 -574888 -576599 -572356 -570024 -567568 -565735 -562179 -554787 -553845 -555924 -554590 -556020 -556982 -558075
9093 -558075 -564498 -563172 -559605 -549396 -550434 -549377 -552471 -553483 -553015 -557757 -561596 -562678 -556108 -551875
9079 -551875 -555092 -549878 -554495 -556997 -551293 -544578 -543601 -546630 -546233 -546502 -554467 -556257 -555427 -553829 -547656
9064 -547656 -539588 -532251 -538386 -541022 -542932 -545796 -542904 -540273 -536917 -534708 -537165 -542834 -550545 -555290
9050 -555290 -551440 -551563 -552090 -551342 -544029 -542920 -537579 -541589 -541631 -542851 -544053 -548356 -547522 -539379 -536675 -540580
9034 -540580 -547418 -542991 -536924 -529554 -526590 -535753 -536034 -533828 -539875 -540518 -539028 -526048 -521657 -528089 -523123
9019e23123j227k507M006M265R86O62j311j935L005J135K56m678o939M441M807
9004e18157m167J492j076j323k044n576L74J711j150o179j889J900P597J892K524
8989e24071K501N587n775k908N475N724L797l211l385j48m20M024j057N59L75
8974e12933q24q16K949M643j188p326p098j835L98L116P845k799o547q52O860
8959e16407R31j0161l939L613Q931J818K409P679R29M794N962j379j450j375k48
8944d97893l727j800j414m950K87j469j439K785P45K572N695j742l620m002K104
8929e07868L07J655n278k975O748L659J814N42J887j672J354L911j447j149j862
8914e00374K913j046M421m2l258j38L97k223m196l173Q881L298m509k616j923
$$ plain form
9019 -523123 -524350 -526857 -522851 -518586 -517600 -516938 -518249 -520184 -517179 -516044 -515788 -520466 -527405 -522964 -518157
9004 -518157 -522324 -520832 -521908 -523231 -525275 -530851 -530477 -528766 -529916 -536095 -537984 -536084 -528487 -526595 -524071
8989 -524071 -521570 -515983 -521758 -524666 -519191 -513467 -509670 -512881 -516266 -516414 -516834 -512810 -513867 -513308 -512933
8974 -512933 -513757 -514573 -511624 -506981 -508169 -515495 -522593 -524428 -524030 -520914 -513069 -515868 -522415 -523267 -516407
8959 -516407 -515476 -525637 -529576 -525963 -517032 -515214 -512805 -505126 -504197 -499403 -493441 -494820 -496270 -497645 -497893
8944 -497893 -501620 -503420 -504834 -509784 -509497 -510966 -512405 -509620 -508875 -506303 -500608 -502350 -505970 -509972 -507868
8929 -507868 -507561 -505906 -511184 -514159 -507411 -503752 -501938 -501396 -499509 -501181 -499827 -495916 -497363 -498512 -500374
8914 -500374 -497461 -498507 -494086 -494128 -497386 -497524 -497127 -499350 -503546 -506719 -497838 -494540 -499049 -501665 -503588
8899e03588k096M735J282K93P88n574L54O813O785j795p13J0352M636n052q311
8884d91091L2J828M445m826J708L480L848J119j581k353J425J1537N487M633O426
8869d53883o018j2049j5583j3066o054J346k7l40K616M047M33p619P03J174o69
8854e04989j655m044l015L74L520Q889L311l705o35P433Q28P95K50k557J298L219
8838d90683l146J987L040J897K157o353l172K067L677J56J046p517P43Q014K637
8823d83450k284k682R48P448m410l731n512q06p19J175P485k827m382K830M270
8808d86647j910M14j008J736K187P704m118l30k61r544l728J744m08P388J0747
8793d76034O29m65l983l117J100M29R611J065m378l519j023m413m972O540M634
$$ plain form
8899 -503588 -505684 -500949 -499667 -499374 -498586 -504160 -503806 -496993 -490208 -492003 -492716 -482364 -477728 -482780 -491091
8884 -491091 -491059 -489231 -484786 -489612 -487904 -484424 -480576 -479457 -481038 -483391 -481966 -470429 -464942 -460309 -453883
8869 -453883 -459901 -471950 -487533 -500599 -506653 -505307 -505334 -505674 -503058 -499011 -498578 -506197 -505494 -504320 -504989
8854 -504989 -506644 -510688 -513703 -513329 -509809 -500920 -497609 -501314 -501949 -494516 -493688 -492893 -492643 -495200 -493902 -490683
8838 -490683 -493829 -491842 -488802 -486905 -484748 -491101 -494273 -492206 -488529 -488373 -487327 -494844 -494101 -486087 -483450
8823 -483450 -485734 -488416 -487468 -480020 -484430 -488161 -493673 -494479 -495198 -494023 -486538 -489365 -493747 -490917 -486647
8808 -486647 -488557 -488143 -489151 -487415 -485228 -477524 -481642 -481972 -482233 -491777 -495505 -493761 -494169 -486781 -476034
8793 -476034 -475405 -475870 -479853 -482970 -481870 -481441 -471830 -470765 -475143 -478662 -479685 -484098 -489070 -482530 -477896
8778d77896o81l807J0321R936J771o955p329N977L271M606p001q282n66M484M982
8763d67169l23m193l032K399n804m23J238m491P69k810l335k14J754J933Q2m116
8747d87735P707M493j280M250l890n54M521J436j291p878m624j245L917J767l96
8732d80802k40M799L603o779J672L489L344k161k18J088M228j011k28j310K861
8717d67665J475n217j81K263K164P13k917k555N372K351M621o20j566k076J703
8702d62135q83p174R91M609l266m333k51J347J500J560k130m529J270m415L743
8687d74096N64M775J081J139J110k389P600J413r448q967N858R511J184k790o397
8672d69852J243K326O129J393K380o4k082l923p992j318l583J482N295M026N62
$$ plain form
8778 -477896 -478577 -482384 -472063 -462127 -460356 -467311 -474640 -468663 -465392 -460786 -467787 -476069 -476635 -472151 -467169
8763 -467169 -467492 -471685 -474717 -472318 -478122 -478545 -477307 -481798 -481029 -483839 -487174 -487388 -485634 -483701 -483619 -487735
8747 -487735 -480028 -475535 -476815 -472565 -476455 -477009 -472488 -471052 -472343 -480221 -484845 -486090 -482173 -480406 -480802
8732 -480802 -481042 -476243 -472640 -479419 -477747 -474258 -470914 -473075 -473293 -472205 -467977 -468988 -469216 -470526 -467665
8717 -467665 -466190 -471407 -471588 -469325 -467161 -466448 -469365 -471920 -466548 -464197 -459576 -460196 -461762 -463838 -462135
8702 -462135 -463018 -470192 -469201 -464592 -467858 -472191 -472442 -471095 -469595 -468035 -470165 -474694 -473424 -477839 -474096
8687 -474096 -473532 -468757 -467676 -466537 -465427 -467816 -460216 -458803 -468251 -477218 -471360 -461849 -460665 -463455 -469852
8672 -469852 -468609 -466283 -460154 -458761 -456381 -456445 -458527 -462450 -470442 -471760 -475343 -473861 -468566 -464540 -463978
8657d63978O582p52k790o255l270k050M032L749m65M287N087K671k703n547O6
8642d61336k923n323o789n12J3828q87l086k424j363K724N005J695N416k763l934
8627d62672j915k373Q594N598k156m75L408N90q602l001k526N290K016J149o104
8612d63179m990j194L826K832O382P100L862K797n820l150L09l983Q995n07l775
8597d50495K085J93l135K807p497m464P056j943k281L947l035m082K415k581P94
8582d60216j305K397j295l532M243M338N878n662p240J106O661N39o208k169r53
8567d63418O156J126j385k016J414K680K108M737Q17l96n3P687L477m703r652
8552d51421m901k798n230J0787L525l824l440n506m01N063M617N785l976m031
$$ plain form
8657 -463978 -457396 -458148 -460938 -467193 -470463 -472513 -468481 -464732 -465197 -460910 -455823 -453152 -455855 -461402 -461336
8642 -461336 -464259 -469582 -476371 -476883 -463055 -463942 -467028 -469452 -470815 -468091 -463086 -461391 -455975 -458738 -462672
8627 -462672 -464587 -466960 -458366 -452768 -454924 -455399 -451991 -451401 -460003 -463004 -465530 -460240 -458224 -457075 -463179
8612 -463179 -468169 -469363 -465537 -462705 -456323 -449223 -445361 -442564 -448384 -451534 -451225 -455208 -446213 -446720 -450495
8597 -450495 -448410 -448217 -451352 -448545 -456042 -460506 -453450 -455393 -457674 -453727 -456762 -460844 -458429 -461010 -460216
8582 -460216 -461521 -459124 -460419 -463951 -459708 -455370 -449492 -455154 -462394 -461288 -454627 -454088 -460296 -462465 -463418
8567 -463418 -457262 -456136 -457521 -459537 -458123 -455443 -453335 -448598 -447781 -448177 -448230 -440543 -437066 -441769 -451421
8552 -451421 -456322 -459120 -464350 -453563 -450038 -453862 -457302 -462808 -463209 -458146 -453529 -447744 -451720 -455751
8538d55751K62O865J066K071l508m475j177L118O1K188j963r96J804M052m005
8523d50388O851M073r63j976l408l635M319O28l094N197l693p355K543m219J241
8508d53879J012M31J105n476K589M457M207J872p140j008K296j734M886K536k705
8493d46551k037K637j985N490M38O53m494k351L39M966l922M529O330m700j0402
8478d51060n760M351O96j615J929J754p06m559l999L759L283Q411N573m144n89
8463d42676J674L161K088k689l019p859K189J899M465J797n297l926k088j293
8449d51574K599R155P221L000K291k750m065l190j880K331J610J629l598k824
8435d40045n338M714M795O078J3643l153j1446o437n256L733M385M340p090r54
$$ plain form
8538 -455751 -455489 -448624 -447558 -445487 -448995 -453470 -454647 -451529 -451468 -449280 -451243 -452239 -450435 -446383 -450388
8523 -450388 -443537 -439464 -440427 -442403 -445811 -449446 -445127 -444499 -447593 -442396 -446089 -453444 -450901 -455120 -453879
8508 -453879 -452867 -452436 -451331 -456807 -454218 -449761 -445554 -443682 -450822 -451830 -449534 -451268 -446382 -443846 -446551
8493 -446551 -448588 -445951 -447936 -442446 -442008 -441355 -445849 -448200 -447861 -442895 -446817 -442288 -435958 -440658 -451060
8478 -451060 -456820 -452469 -451773 -453388 -451459 -449705 -450411 -454970 -458969 -455210 -451927 -443516 -437943 -442087 -442676
8463 -442676 -441002 -437841 -435753 -438442 -441461 -449320 -447131 -445232 -440767 -438970 -444267 -448193 -450281 -451574
8449 -451574 -448975 -439820 -432599 -429599 -427308 -430058 -434123 -437313 -439193 -436862 -435252 -433623 -437221 -440045
8435 -440045 -445383 -440669 -435874 -429796 -416153 -419306 -430752 -437189 -442445 -438712 -434327 -429987 -437077 -438031
8421d38031O4Q676P756l445J1r30n526r459j017J1236N752o686m780j2229j922
8406d50530Q185M867j892K710J575q24N648M049k350m148o832k691N69L906o75
8391d38433N375L334r47k919p964k600J1091P458n049j887M990J625o08o720n009
8376d38263J849L300J615M979j912j081K79k796j219n206j381N118M931L196J077
8361d25514K968j993L512p034r556K874L473n143k238L187r57J430P617L272K159
8346d21943j0k086M375k99l482J084q41K522P155j368m634k654L43Q25r52M381
8330d17584o21l864o035o160l700N02J917M332M215L194n624j627j118L65L609
8315d28199M335R66p777j87M531j826k485L883L013N24n831o45q5j904q248p843
$$ plain form
8421 -438031 -437967 -429291 -421535 -424980 -424969 -425899 -431425 -440884 -441901 -430665 -424913 -431599 -436379 -448608 -450530
8406 -450530 -442345 -437478 -439370 -436660 -435085 -435909 -430261 -426212 -428562 -432710 -439542 -442233 -441664 -437758 -438433
8391 -438433 -433058 -429724 -430671 -433590 -441554 -444154 -433063 -425605 -430654 -432541 -427551 -425926 -426534 -433254 -438263
8376 -438263 -436414 -433114 -431499 -426520 -428432 -429513 -429234 -432030 -433249 -438455 -439836 -434718 -429787 -426591 -425514
8361 -425514 -422546 -424539 -421027 -428061 -437617 -434743 -431270 -436413 -438651 -435464 -436421 -434991 -427374 -424102 -421943
8346 -421943 -421953 -424039 -419664 -419963 -423445 -422361 -423202 -420680 -413525 -414893 -419527 -422181 -421838 -421013 -421965 -417584
8330 -417584 -418205 -422069 -428104 -434264 -437964 -437462 -435545 -431213 -426998 -423804 -429428 -431055 -432173 -431808 -428199
8315 -428199 -423864 -422898 -430675 -430862 -426331 -428157 -430642 -426759 -423746 -423222 -429053 -429698 -429783 -431687 -439935 -447778
8299d47778O711N084k293j34M791J788J622K055k663R67j347j531P624L926k972
8284d24150O694L221r094j097j051J755j77k835L378J208M121M69p247o3K789
8269d22079j207L497J735q68m659K462L991M699j02k146o89R65k3L465k685m825
8253d18469K02k248L08N053J438m599k996k731K241R89r16j422j891O17O74L550
8237d20200K618J68L099j007j004n165J415J366j859o74J227J617J952R40O847
8222d08660K111m566k642j443k987L231K806K031K074n417o710n351M264K220
8208d19039O72Q47k358L036Q885J986n355n587r08O49n741J340L038J048L343
8193d14144j587j173r0r39K943L150m695j569M42J110J358l339J996J757J0461
$$ plain form
8299 -447778 -441067 -435983 -438276 -438410 -433619 -431831 -430209 -428154 -430817 -429850 -431197 -432728 -425104 -421178 -424150
8284 -424150 -417456 -414235 -423329 -424426 -425477 -423722 -423899 -426734 -423356 -422148 -418027 -417558 -424805 -424868 -422079
8269 -422079 -423286 -419789 -418054 -418922 -423581 -421119 -417128 -412429 -412531 -414677 -415366 -414401 -414424 -410959 -413644 -418469
8253 -418469 -418267 -420515 -420207 -415154 -413716 -418315 -421311 -424042 -421801 -420812 -421728 -423150 -425041 -424424 -423750 -420200
8237 -420200 -417582 -417414 -414315 -415322 -416326 -421491 -420076 -418710 -420569 -421243 -420016 -418399 -416447 -415507 -408660
8222 -408660 -406549 -411115 -413757 -415200 -418187 -414956 -412150 -410119 -408045 -413462 -420172 -425523 -421259 -419039
8208 -419039 -418367 -417520 -419878 -416842 -407957 -405971 -411326 -416913 -417821 -417172 -422913 -421573 -418535 -417487 -414144
8193 -414144 -415731 -416904 -416994 -417933 -414990 -411840 -416535 -418104 -417662 -416552 -415194 -418533 -416537 -414780 -404319
8178d04319J432n435n781n326K906N584m228N094K528p140k113r84k567K749m966
8163d22566N88J2970M902l051r48K092M489P07l473l124m205j248O72k528L48
8148d14375j441J373M367j14P824L695m568K357n572l993K17L006l999l544P017
8133d07750L526k035J000J237j634l21k943j823L430r17m38m435o50M617J407
8118d07729r40o76L580l798M77k837N135K522j899j565m360L422r09p48N15j704
8102d11514L886R94p309j942K168L734j923Q12o09j513l687P449M823k087j60
8087d06878K825K072k1j922R63j31p32P20k73M461k4n958L806L94M243O618O034
8070c83803k432n972r19l27p35j312J131n063l505P180O998m284p564N942J144
$$ plain form
8178 -404319 -402887 -408322 -414103 -419429 -416523 -410939 -415167 -410073 -407545 -414685 -416798 -417782 -420349 -417600 -422566
8163 -422566 -421978 -409008 -404106 -407157 -408105 -406013 -401524 -400817 -404290 -407414 -411619 -412867 -412195 -414723 -414375
8148 -414375 -415816 -414443 -410076 -410190 -402366 -398671 -403239 -400882 -406454 -410447 -410230 -407224 -411223 -414767 -407750
8133 -407750 -404224 -406259 -405259 -404022 -405656 -405977 -408920 -410743 -407313 -408230 -408668 -413103 -413753 -409136 -407729
8118 -407729 -408669 -409345 -405765 -409563 -409086 -411923 -406788 -404266 -406165 -407730 -412090 -408668 -409577 -410325 -409810 -411514
8102 -411514 -407628 -406634 -413943 -415885 -413717 -409983 -411906 -411094 -411703 -413216 -416903 -409454 -404631 -406718 -406878
8087 -406878 -404053 -401981 -402002 -403924 -402961 -403092 -403824 -403104 -403377 -398916 -398940 -404898 -401092 -400698 -396455 -389837 -383803
8070 -383803 -386235 -392207 -393126 -393453 -394188 -395500 -394369 -399432 -402937 -395757 -388759 -393043 -400607 -394665 -393521
8055c93521p190n087J39J30j208L038j176p75l388n060N840Q214m12O50N54J298
8039c97954k754J062k40l127k575P925q0o027K89j171j294M94l529j14J0095J4
8023c98986K405Q85J141j675m104m28K266L077l63l452n088J128l38K836O403
8008c94293K183m049r436m295K996K459l883j149M442L277K841O086K49o291n728
7993d04591n988J065m868m803L207K36P31k356k614O336L841r74M774N35M675
7978d00794P6m683n47M789L227L386Q89k302r146l359M095N86M475P8L408J744
7962c94078j19J465p533q411O86P125O012K903n582m039j461o043J556l59M963
7947d02915Q310O805k291j817n846p960k214K060L721K382J445L953N272M112
$$ plain form
8055 -393521 -400711 -405798 -405659 -405529 -406737 -403699 -404875 -405650 -409038 -414098 -408258 -400044 -400456 -399806 -399252 -397954
8039 -397954 -400708 -399646 -399886 -403013 -405588 -397663 -397743 -403770 -403481 -404652 -405946 -405452 -408981 -409095 -399000 -398986
8023 -398986 -396581 -395696 -394555 -396230 -400334 -400762 -398496 -395419 -395782 -399234 -404322 -403194 -403532 -400696 -394293
8008 -394293 -392110 -396159 -405595 -409890 -406894 -404435 -408318 -409467 -405025 -401748 -398907 -392821 -392572 -398863 -404591
7993 -404591 -410579 -409514 -414382 -419185 -415978 -415742 -415011 -417367 -419981 -413645 -409804 -410778 -406004 -405469 -400794
7978 -400794 -400718 -405401 -405948 -401159 -397932 -394546 -393657 -395959 -405105 -408464 -404369 -403783 -399308 -399230 -395822 -394078
7962 -394078 -394197 -392732 -400265 -408676 -407990 -400865 -394853 -391950 -397532 -401571 -403032 -409075 -407519 -407878 -402915
7947 -402915 -394605 -387800 -390091 -391908 -397754 -405714 -407928 -405868 -402147 -399765 -398320 -394367 -389095 -384983
7933c84983j923m107j026l896m890j569N649J784n095l117K212j59M66K348O275
7918c92031l55J305M212N006m19p772l990k315J302k275j70q86j062M421K473
7903c92556M291j785p31j0681p34L916K76N250M598K012j145n389o966L434M007
7888c92203m737m283N246k054L835k226j0039k366L011j899M395Q865l527K251
7874c95731Q94n49M177O307k541j1787l552O792M022L168K37j456J98j149M917
7859c86053k902o445q5J450K61l427l591N932P33m212M279N947m96p645J955L058
7843c91241m56L936q7o525p03l871l118O232N370o543l25O611K613l626l246J938
7827c93041L812P898M290O91j913q604n98M289L139p32p407J221P249j837M046
$$ plain form
7933 -384983 -386906 -391013 -392039 -395935 -400825 -402394 -396745 -394961 -400056 -403173 -400961 -401120 -400654 -398306 -392031
7918 -392031 -392386 -391081 -386869 -381863 -382282 -390054 -394044 -396359 -395057 -397332 -397502 -398388 -399450 -395029 -392556
7903 -392556 -388265 -390050 -390781 -401462 -402196 -398280 -398004 -392754 -388156 -386144 -387289 -392678 -399644 -396210 -392203
7888 -392203 -396940 -401223 -395977 -398031 -394196 -396422 -406461 -408827 -405816 -407715 -403320 -394455 -397982 -395731
7874 -395731 -394837 -395386 -391209 -384902 -387443 -399230 -402782 -395990 -391968 -388800 -388563 -390019 -389821 -390970 -386053
7859 -386053 -388955 -395400 -395485 -394035 -393774 -397201 -400792 -394860 -394127 -398339 -394060 -388113 -388609 -396254 -394299 -391241
7843 -391241 -391697 -387761 -387848 -394373 -395076 -398947 -402065 -395833 -390463 -397006 -397331 -390720 -388107 -391733 -394979 -393041
7827 -393041 -389229 -381331 -377041 -376350 -378263 -386867 -387465 -383176 -380037 -380769 -388176 -386955 -379706 -381543 -377497
7812c77497J998l455J090m356J397L69N508l170l852j300m938j683J96k721k216
7797c94630J723J604J611j542K013J613J475R4n549L324R389M628o088j023Mj861
7781c83215K34l3N042n049j44j07M15l78l008l920l684k49Q4l686m55J558L419
7764c93176Q196P926J950l323L84j006o177l329J759O03J786k022m292n513L55
7749c95879N202k536M505J2646K373M158k205j489l101L875n446n082j131L278
7735c80832l90J6m39o606o152l71Q603O904M90j85m099j485o048J628K409m223
7719c90780n90R512O190L563n545n796L02m092Q639M839j57q880q099k466Q549
7704c84811K683M210l570m869l225N259J0592K077n880n319K93J512R49k569m98
$$ plain form
7812 -377497 -375499 -378954 -377864 -382220 -380823 -380454 -374946 -378116 -381968 -383268 -388206 -389889 -389693 -392414 -394630
7797 -394630 -392907 -391303 -389692 -391234 -389221 -387608 -386133 -386039 -391588 -388264 -378875 -374247 -380335 -381358 -381354 -383215
7781 -383215 -382981 -383014 -377972 -383021 -383165 -383272 -382857 -383235 -386243 -390163 -393847 -394096 -394012 -397698 -398153 -396595 -393176
7764 -393176 -384980 -377054 -375104 -378427 -378043 -379049 -385226 -388555 -386796 -386193 -384407 -386429 -390721 -396234 -395879
7749 -395879 -390677 -393213 -388708 -376062 -373689 -369531 -371736 -373225 -376326 -372451 -377897 -382979 -384110 -380832
7735 -380832 -381222 -381206 -381645 -388251 -394403 -394774 -386171 -379267 -378777 -378962 -383061 -384546 -390594 -388966 -386557 -390780
7719 -390780 -391370 -381858 -375668 -372105 -377650 -383446 -383144 -387236 -378597 -373758 -373915 -382795 -390894 -393360 -384811
7704 -384811 -382128 -377918 -381488 -386357 -389582 -384323 -373731 -371654 -377534 -382853 -382560 -381048 -380099 -382668 -383166
7689c83166j574p11J085j732n16L155m361o504O40Q575J1174P015k611k140m429
7674c76100m216L125m457p271l425L343O074N405P950J757j5134q631Q595J970
7660c81015N335p332k889J413M584P04q4O121r56r06m221k66k508j716L670k211
7644c82277n618M798J0725J446m185j38J116l016l586K325K666l120m6r15M578
7629c75247J195l012l559k231L043l98l302J829o92N976M674L23k405O965L585
7614c63256k645m485o218L158R548j78K819J167j0334l727l161o652L039N525
7600c75400k309L29o06J672Q852O172l174n183m241j372K644L725J283k234K356
7585c67486k577L433K329J123J645K794l508n21J283M50j674m113r19Q99m243
$$ plain form
7689 -383166 -384740 -385451 -384366 -386098 -386614 -383459 -387820 -394324 -393684 -385109 -373935 -366920 -369531 -371671 -376100
7674 -376100 -380316 -377191 -381648 -388919 -392344 -389001 -382927 -377522 -369572 -367815 -382949 -391580 -382985 -381015
7660 -381015 -375680 -383012 -385901 -384488 -379904 -379200 -379284 -373163 -374119 -375025 -379246 -379512 -382020 -383736 -380066 -382277
7644 -382277 -387895 -383097 -372372 -370926 -375111 -375249 -374133 -377149 -380735 -378410 -375744 -378864 -378910 -379825 -375247
7629 -375247 -374052 -377064 -380623 -382854 -379811 -380209 -383511 -381682 -382374 -376398 -371724 -371401 -373806 -366841 -363256
7614 -363256 -365901 -370386 -376604 -373446 -363898 -364076 -361257 -360090 -370424 -374151 -377312 -383964 -380925 -375400
7600 -375400 -377709 -377380 -377986 -376314 -367462 -361290 -364464 -369647 -373888 -375260 -372616 -368891 -367608 -369842 -367486
7585 -367486 -370063 -366630 -364301 -363178 -361533 -358739 -362247 -362768 -361485 -361035 -362709 -366822 -367741 -366842 -371085
7570c71085P086m741J32K048J796q6K865l793k184P229o121n920j614P771J925
7555c64692j686m431J597K709r94L989P22R35j657K595L695p61n255k348n982
7540c71564j987J401L565L929L572K496J783j634p35j0459o855M066l818m078
7526c80318N504O345K919l526r07M448k247J086m23O691n56p900L355j474l550
7511c70553m239q1M447l205j780K288k7k475J958M216L586O155J738K236j933
7496c57669k035J603l733k660J442N892K757O73l237k996j073j620J76n830k767
7481c71077K259N871J91k222k781L922K190M200M693J637k436n175j237k859n9
7466c62883l797k601j460L969k893J757M887K138j151Q703j163M862K473L293
$$ plain form
7570 -371085 -363999 -368740 -368608 -366560 -364764 -364850 -361985 -365778 -367962 -360733 -366854 -372774 -374388 -366617 -364692
7555 -364692 -366378 -370809 -369212 -366503 -367497 -363508 -362786 -361851 -363508 -360913 -357218 -357979 -363234 -365582 -371564
7540 -371564 -373551 -372150 -368585 -364656 -361084 -358588 -356805 -358439 -359174 -369633 -376488 -372422 -376240 -380318
7526 -380318 -374814 -368469 -365550 -369076 -369983 -365535 -367782 -366696 -367119 -360428 -360984 -368884 -365529 -367003 -370553
7511 -370553 -374792 -374873 -370426 -373631 -375411 -373123 -373150 -375625 -373667 -369451 -365865 -359710 -357972 -355736 -357669
7496 -357669 -359704 -358101 -361834 -364494 -363052 -357160 -354403 -353730 -356967 -359963 -361036 -362656 -362480 -368310 -371077
7481 -371077 -368818 -362947 -362756 -364978 -367759 -363837 -361647 -357447 -352754 -351117 -353553 -358728 -359965 -362824 -362883
7466 -362883 -366680 -369281 -370741 -366772 -369665 -367908 -363021 -360883 -362034 -353331 -354494 -349632 -347159 -343866
7452c43866n711j2096K52M818l36j429L525m707j1439j823N533n707K736Q819
7438c61431n109k88o23R662j375k496M572k844p62J151l438l440m38j558J013
7423c67404p2L251l126k987K463N173o15l150M856O196O62j577k637j063n362
7408c65392P336L243K88r33N188l234o656k10o261L083L211P12m407J430O900
7393c55702L200J394k396q686k18J539j62j162r90M680L358Q3n687n7k835l234
7377c66875J548J16o61L682j156l028j22Q240K555j1694q15J828j57J0192L011
7362c53336l30N242N792j1140l998j708j780R31J250o865J80J535O172M323K687
7347c51045o067k065r7J041K460P89P9j855l478q98J635N288L93q23J997m961
$$ plain form
7452 -343866 -349577 -361673 -361421 -356603 -356939 -358368 -354843 -359550 -370989 -372812 -367279 -372986 -370250 -361431
7438 -361431 -366540 -366828 -367451 -357789 -359164 -361660 -357088 -359932 -360694 -359543 -362981 -366421 -366859 -368417 -367404
7423 -367404 -367476 -364225 -367351 -370338 -367875 -362702 -363317 -366467 -361611 -355415 -354753 -356330 -358967 -360030 -365392
7408 -365392 -358056 -354813 -354525 -355458 -350270 -353504 -360160 -360370 -366631 -363548 -360337 -359625 -364032 -362602 -355702
7393 -355702 -352502 -351108 -353504 -362190 -362408 -360869 -361031 -362193 -363183 -358503 -355145 -355062 -360749 -360806 -363641 -366875
7377 -366875 -365327 -365211 -365872 -362190 -363346 -366374 -366496 -358256 -355701 -367395 -368210 -366382 -366539 -356347 -353336
7362 -353336 -353666 -348424 -342632 -353772 -357770 -359478 -361258 -360327 -359077 -365942 -365762 -364227 -358055 -353732 -351045
7347 -351045 -357112 -359177 -359274 -358233 -355773 -354984 -354905 -356760 -360238 -361136 -359501 -354213 -353820 -354643 -352646 -357607
7331c57607k052P08j39R128P26k453o462M12L189J480p59O653l477j01L281N392
7315c42081j733j3043j0011J457J0087K914k660j02p587J477M945l714O05J570
7301c57876j57k981m672L5L802L395m461m71j866L409N276p84L657K680j922L62
7285c52574L453M65j081l931n969O575Q891r911m988L121k60l820j126O250P743
7270c47162K111l445m688J747l427l915L111J937J379k163R25n67k271J467n44
7255c55505j153k710k174N980O369j377J459L053K671j56j334K561n647j178P659
7240c41482j284l605n351n582L513L497K269O904j353k406j308k556k048j279
7226c52071K96J598K085l986j783k127R63L395n181l459L567N011j665k173k338
$$ plain form
7331 -357607 -359659 -358951 -359090 -349962 -349236 -351689 -358151 -357739 -354550 -353070 -353829 -347176 -350653 -350754 -347473 -342081
7315 -342081 -343814 -356857 -366868 -365411 -355324 -352410 -355070 -355172 -362759 -361282 -356337 -360051 -359446 -357876
7301 -357876 -358033 -361014 -365686 -365651 -361849 -358454 -362915 -363386 -365252 -361843 -356567 -357351 -353694 -351014 -352936 -352574
7285 -352574 -349121 -348656 -349737 -353668 -359637 -353062 -344171 -354082 -359070 -355949 -356209 -360029 -361155 -354905 -347162
7270 -347162 -345051 -348496 -353184 -351437 -354864 -358779 -355668 -353731 -352352 -354515 -353590 -354157 -356428 -354961 -355505
7255 -355505 -356658 -359368 -361542 -355562 -349193 -350570 -349111 -346058 -343387 -343543 -344877 -342316 -347963 -349141 -341482
7240 -341482 -342766 -346371 -351722 -357304 -353791 -350294 -348025 -341121 -342474 -344880 -346188 -348744 -350792 -352071
7226 -352071 -351775 -350177 -348092 -352078 -353861 -355988 -355025 -351630 -356811 -360270 -356703 -351692 -353357 -355530 -357868
7211c57868M095N903p066m597J647L589J498R313n563k761N349N45K066M640p463
7196c46673n285L452M487K147R58L623n265N24l405J216R98K100k40p526l364
7181c52253L512M452n675k997L738Q452m40J169J485k796p181L03N784l13K767
7166c39993M230k713p574J92N167k286l088L490L39q850l514O220P22P74M40k450
7150c48894r040k204O381l031M916J1683p71k71L235o483k698O757L709j799k10
7135c38720l654j251L021J483K889j201J348k650O25R05N134n082p208l926L246
7120c45041N534L719m75K291k293r11K3n463K918o266p625L070J213L016M746
7105c41544M983K87p580O33p63J52K608M633K42m247J413L942J663l503R64m192
$$ plain form
7211 -357868 -353773 -347870 -354936 -359533 -357886 -354297 -352799 -343486 -349049 -351810 -346461 -345916 -343850 -339210 -346673
7196 -346673 -351958 -348506 -344019 -341872 -340914 -337291 -342556 -342032 -345437 -344221 -343223 -341123 -341363 -348889 -352253
7181 -352253 -348741 -344289 -349964 -352961 -349223 -340771 -341211 -340042 -338557 -341353 -348534 -348231 -342447 -342760 -339993
7166 -339993 -335763 -338476 -346050 -345858 -340691 -342977 -346065 -342575 -342236 -351086 -354600 -348380 -347658 -346884 -346444 -348894
7150 -348894 -357934 -360138 -353757 -356788 -351872 -340189 -340960 -341231 -337996 -344479 -347177 -340420 -336711 -338510 -338720
7135 -338720 -342374 -343625 -340604 -339121 -336232 -337433 -336085 -338735 -338110 -337205 -332071 -337153 -344361 -348287 -345041
7120 -345041 -339507 -335788 -336263 -333972 -336265 -337176 -337153 -342616 -339698 -345964 -353589 -350519 -349306 -346290 -341544
7105 -341544 -336561 -336274 -343854 -343221 -343984 -343832 -341224 -336591 -336349 -340596 -339183 -335241 -333578 -337081 -336117 -340309
7089c40309n708O948J795l805M155O855j959m814q230j245k276n860M241J657
7075c48555M359K044r50m10K257k25p294l192L50P860Q147J101m019n036P057
7060c36506J518j085J068O97K679l92o31n803Q67j189k094k443J995j902L441
7045c39780o70K049J069k325K396L327L554K924m70o641n893k178L5R33J246j152
7029c41576j049o726p93N387J993n06K467M209j611j69J988m463L739q2p472l427
7013c48091j16Q172M722q67L893l252J473k473K963J336J912o670l131n185M358
6998c40956R58l236l52p132J78M775Q318K721r78o266Q71l621p334J635M06L596
6982c46417K708L839m57n093K398M243o019p774Q373O593K798K487j301J643L124
$$ plain form
7089 -340309 -346017 -339069 -337274 -341079 -336924 -330069 -332028 -336842 -345072 -346317 -348593 -354453 -350212 -348555
7075 -348555 -344196 -342152 -343102 -343512 -341255 -341480 -348774 -351966 -351616 -343756 -335609 -334508 -338527 -343563 -336506
7060 -336506 -334988 -336073 -335005 -334308 -331629 -332021 -332652 -338455 -337588 -338777 -340871 -343314 -341319 -343221 -339780
7045 -339780 -340450 -338401 -337332 -339657 -337261 -333934 -330380 -327456 -327926 -334567 -340460 -342638 -342603 -341670 -340424 -341576
7029 -341576 -342625 -349351 -350144 -344757 -342764 -343270 -340803 -336594 -338205 -338374 -336386 -340849 -337110 -337192 -344664 -348091
7013 -348091 -348207 -340035 -335313 -336180 -332287 -335539 -334066 -336539 -333576 -332240 -330328 -336998 -340129 -345314 -340956
6998 -340956 -339998 -343234 -343586 -350718 -350540 -345765 -337447 -334726 -335704 -341970 -341099 -344720 -352054 -350419 -350013 -346417
6982 -346417 -343709 -339870 -340327 -345420 -343022 -338779 -344798 -352572 -344199 -337606 -334808 -332321 -333622 -331979 -328855
6967c28855K029k463J613m698m580M79k635O044M504m684O024k83L392l427l375
6952c30915K92n263k435L870Q535M340l690o074j3467m465P186J194K185r15m772
6937c44394K224Q325L520p87J302N31Q075j46L435o442j3472n364L606J0502J743
6922c27342l402J652j309k600J509M979M407o632l014L321j296j845O423l039
$$ plain form
6967 -328855 -326826 -329289 -327676 -332374 -336954 -336475 -339110 -333066 -328562 -333246 -327222 -327505 -324113 -327540 -330915
6952 -330915 -330623 -335886 -338321 -334451 -325916 -321576 -325266 -331340 -344807 -349272 -342086 -340892 -338707 -339622 -344394
6937 -344394 -342170 -333845 -330325 -331112 -329810 -329279 -321204 -321350 -317915 -324357 -337829 -343193 -339587 -329085 -327342
6922 -327342 -330744 -329092 -330401 -333001 -331492 -326513 -322106 -328738 -331752 -328431 -329727 -331572 -325149 -328188
$$ [...]
##END NTUPLES=NMR SPECTRUM
##END=
