##TITLE=Analysis number 307266
Compound Code gk 03657
Book Reference 382/62/1
Project Code adrs
Chemist Name simons
##JCAMPDX= 6.0         $$ Bruker NMR JCAMP-DX V2.0
##DATA TYPE= NMR SPECTRUM
##DATA CLASS= NTUPLES
##ORIGIN= Bruker BioSpin GmbH
##OWNER= NMR
$$ XWIN-NMR		Version 3.5
$$ Tue Apr 26 14:00:37 2005 GMT Daylight Time (UT+1h)  MAYBRIDGE\NMR@NMR_250MHZ
##.OBSERVE FREQUENCY= 250.131544655141
##.OBSERVE NUCLEUS= ^1H
##.ACQUISITION MODE= SIMULTANEOUS (DQD)
##.ACQUISITION SCHEME= undefined
##.AVERAGES= 16
##.DIGITISER RES= 18
##SPECTROMETER/DATA SYSTEM= dpx250
##.PULSE SEQUENCE= zg30
##.SOLVENT NAME= CDCl3
##.SHIFT REFERENCE= (INTERNAL, CDCl3, 0, 16.4507)
##AUDIT TRAIL= $$ (NUMBER, WHEN, WHO, WHERE, WHAT)
$$ ##TITLE= Audit trail, XWIN-NMR		Version 3.5
$$ ##JCAMPDX= 5.01
$$ ##ORIGIN= Bruker BioSpin GmbH
$$ ##OWNER= NMR
$$ C:\u/data/dgb/nmr/ADRS/2260/pdata/1/auditp.txt
$$ ##AUDIT TRAIL=  $$ (NUMBER, WHEN, WHO, WHERE, WHAT)
(   1,<2005-04-26 14:00:19.30 +100>,<MAYBRIDGE\NMR>,<NMR_250MHZ>,
      <created by zg, POWCHK disabled, PULCHK disabled
       configuration hash MD5:
       62 19 C7 07 E1 42 D1 B7 37 6C 3D D0 77 39 F9 E6
       data hash MD5: 64K
       E6 1B 87 3E 15 97 68 60 C8 FB F0 54 26 B9 5C 91>)
(   2,<2005-04-26 14:00:30.04 +100>,<MAYBRIDGE\NMR>,<NMR_250MHZ>,
      <Start of raw data processing
       ef LB = 0.3 FT_mod = 6 PKNL = 1 SI = 32K 
       data hash MD5: 32K
       08 7B CF C6 2F CF E8 E9 8A A8 C8 F2 B9 CD 3A 3E>)
(   3,<2005-04-26 14:00:31.62 +100>,<MAYBRIDGE\NMR>,<NMR_250MHZ>,
      <apk 
       data hash MD5: 32K
       1C 4E 12 FA 25 10 39 3A 66 03 3E B3 00 1B 40 4C>)
(   4,<2005-04-26 14:00:32.26 +100>,<MAYBRIDGE\NMR>,<NMR_250MHZ>,
      <abs ABSG = 5 
       data hash MD5: 32K
       4F 49 70 AD 5D 62 74 D2 8B D4 48 A1 BB BA E9 F6>)
$$ ##END=
$$ 
$$ hash MD5
$$ 18 93 69 57 BA 50 90 72 ED D5 13 56 CF F4 B2 AD
##$RELAX= 
##$RELAX= 
##$RELAX= 
##$RELAX= 
##$RELAX= 
##$RELAX= 
##$RELAX= 
$$ Bruker specific parameters
$$ --------------------------
##$DU= <C:\u>
##$EXPNO= 2260
##$NAME= <ADRS>
##$PROCNO= 1
##$TYPE= <nmr>
##$USER= <dgb>
##$AMP= (0..31)
100 100 100 100 100 100 100 100 100 100 100 100 100 100 100 100 100 100 
100 100 100 100 100 100 100 100 100 100 100 100 100 100 
##$AQSEQ= 0
##$AQ_mod= 3
##$AUNM= <au_zg>
##$AUTOPOS= <33 >
##$BF1= 250.13
##$BF2= 250.13
##$BF3= 250.13
##$BF4= 250.13
##$BF5= 500.13
##$BF6= 500.13
##$BF7= 500.13
##$BF8= 500.13
##$BYTORDA= 1
##$CFDGTYP= 0
##$CFRGTYP= 5
##$CHEMSTR= <none>
##$CNST= (0..31)
1 1 145 1 1 1 1 1 1 1 1 1 1 1 1 1 1 1 1 1 1 1 1 1 1 1 1 1 1 1 1 1 
##$CPDPRG= <>
##$CPDPRG1= <>
##$CPDPRG2= <>
##$CPDPRG3= <>
##$CPDPRG4= <mlev>
##$CPDPRG5= <mlev>
##$CPDPRG6= <mlev>
##$CPDPRG7= <mlev>
##$CPDPRG8= <mlev>
##$CPDPRGB= <>
##$CPDPRGT= <>
##$D= (0..31)
0 1 0 0 0 0 0 0 0 0.06 0 0 0 0 0 0 0.0002 0 0 0 0 0 0 0 0 0 0 0 0 0 0 
0 
##$DATE= 1114520418
##$DBL= (0..7)
120 120 120 120 120 120 120 120 
##$DBP= (0..7)
150 150 150 150 150 150 150 150 
##$DBP07= 0
##$DBPNAM0= <>
##$DBPNAM1= <>
$$ [...]
##$SUBNAM7= <"">
##$SUBNAM8= <"">
##$SUBNAM9= <"">
##$SW= 20.6930455092707
##$SWIBOX= (0..15)
0 0 3 0 0 0 0 0 0 0 0 0 0 0 0 0 
##$SW_h= 5175.983436853
##$TD= 65536
##$TD0= 1
##$TE= 295.16
##$TE2= 300
##$TE3= 300
##$TEG= 300
##$TL= (0..7)
0 120 120 120 120 120 120 120 
##$TP= (0..7)
150 150 150 150 150 150 150 150 
##$TP07= 0
##$TPNAME0= <>
##$TPNAME1= <>
##$TPNAME2= <>
##$TPNAME3= <>
##$TPNAME4= <>
##$TPNAME5= <>
##$TPNAME6= <>
##$TPNAME7= <>
##$TPOAL= (0..7)
0.5 0.5 0.5 0.5 0.5 0.5 0.5 0.5 
##$TPOFFS= (0..7)
0 0 0 0 0 0 0 0 
##$TUNHIN= 0
##$TUNHOUT= 0
##$TUNXOUT= 0
##$USERA1= <user>
##$USERA2= <user>
##$USERA3= <user>
##$USERA4= <user>
##$USERA5= <user>
##$V9= 5
##$VALIST= <valist>
##$VCLIST= <CCCCCCCCCCCCCCC>
##$VD= 0
##$VDLIST= <DDDDDDDDDDDDDDD>
##$VPLIST= <PPPPPPPPPPPPPPP>
##$VTLIST= <TTTTTTTTTTTTTTT>
##$WBST= 1024
##$WBSW= 4
##$XGAIN= (0..3)
0 0 0 0 
##$XL= 0
##$YL= 0
##$YMAX_a= 234775
##$YMIN_a= -239915
##$ZGOPTNS= <>
##$ZL1= 120
##$ZL2= 120
##$ZL3= 120
##$ZL4= 120
##$ABSF1= 16.45073
##$ABSF2= -4.242443
##$ABSG= 5
##$ABSL= 3
##$ALPHA= 0
##$AQORDER= 0
##$ASSFAC= 0
##$ASSFACI= 0
##$ASSFACX= 0
##$ASSWID= 0
##$AUNMP= <proc_1d>
##$AZFE= 0.1
##$AZFW= 0.1
##$BCFW= 0
##$BC_mod= 0
##$BYTORDP= 0
##$COROFFS= 0
##$CY= 12.5
##$DATMOD= 1
##$DC= 0
##$DFILT= <>
##$DTYPP= 0
##$F1P= 14.0000005364418
##$F2P= -0.99999901652339
##$FCOR= 0.5
##$FTSIZE= 32768
##$FT_mod= 6
##$GAMMA= 0
##$GB= 0
##$INTBC= 1
##$INTSCL= 1
##$ISEN= 128
##$LB= 0.3
##$LEV0= 0
##$LPBIN= 0
##$MAXI= 10000
##$MC2= 0
##$MEAN= 0
##$ME_mod= 0
##$MI= 0
##$NCOEF= 0
##$NC_proc= -2
##$NLEV= 6
##$NOISF1= 0
##$NOISF2= 0
##$NSP= 0
##$NTH_PI= 0
##$NZP= 0
##$OFFSET= 16.45073
##$PC= 1
##$PHC0= -67.38592
##$PHC1= 5.373235
##$PH_mod= 1
##$PKNL= yes
##$PPARMOD= 0
##$PSCAL= 4
##$PSIGN= 0
##$REVERSE= no
##$SF= 250.130017824359
##$SI= 32768
##$SIGF1= 0
##$SIGF2= 0
##$SINO= 400
##$SIOLD= 32768
##$SREGLST= <1H.CDCl3>
##$SSB= 0
##$STSI= 32768
##$STSR= 0
##$SW_p= 5175.98343685301
##$SYMM= 0
##$S_DEV= 0
##$TDeff= 65536
##$TDoff= 0
##$TI= <Analysis number 999999
Compound Code 99
Book Reference 9
Project Code 9>
##$TILT= no
##$TM1= 0
##$TM2= 0
##$TOPLEV= 0
##$USERP1= <user>
##$USERP2= <user>
##$USERP3= <user>
##$USERP4= <user>
##$USERP5= <user>
##$WDW= 1
##$XDIM= 32768
##$YMAX_p= 267132476
##$YMIN_p= -126888
$$ End of Bruker specific parameters
$$ ---------------------------------
##NTUPLES= NMR SPECTRUM
##VAR_NAME=  FREQUENCY,     SPECTRUM/REAL,   SPECTRUM/IMAG
##SYMBOL=    X,             R,               I
##VAR_TYPE=  INDEPENDENT,   DEPENDENT,       DEPENDENT
##VAR_FORM=  AFFN,          ASDF,            ASDF
##VAR_DIM=   32768,         32768,           32768
##UNITS=     HZ,            ARBITRARY UNITS, ARBITRARY UNITS
##FACTOR=    0.157963299565203, 1,           1
##FIRST=     4114.82123057112, 0,            0
##LAST=      -1061.16220628189, 0,           0
##MIN=       -1061.16220628189, -126888,     0
##MAX=       4114.82123057112, 267132476,    0
$$ Real data points
##PAGE= N=1
##DATA TABLE= (X++(R..R)), XYDATA
$$ [...]
18806H29M2023J0122k5182k6102K5201J1178j5330m616p627j6733k6667j1005
$$ 829 42852 52974 27792 1690 26891 38069 22739 18123 10496 -6237 -32904 -43909
18794d3909N599J1624M1848J4585J9220J1643N051N839n6868l406L5117Q387P51
$$ -43909 -38310 -26686 15162 29747 48967 60610 65661 71500 14632 11226 46343 54730 55481
18781E5481J959l7953k77J2702J2537k0753l5821k8826L0579P5581P0265K4361
$$ 55481 57440 19487 19210 31912 44449 23696 -12125 -40951 -10372 65209 135474 159835
18769A59835O3013J8601K4845P263k5134m7462k4323m3704l3772L113L2821n154
$$ 159835 222848 241449 266294 273557 248423 200961 176638 132934 99162 102275 135096 129942
18757A29942l3150j6343m2327n0852j9658r101m309j8306J5363K6927J5967J2245
$$ 129942 96792 80449 38122 -12730 -32388 -41489 -45798 -64104 -48741 -21814 -5847 6398
18745F398L4575j3840n242N37K7520L9607k933m662j4131r142R061L2217K6016
$$ 6398 40973 27133 21891 22428 49948 89555 86622 81960 67829 58687 67748 99965 125981
18732A25981L0218L0868Q494O5849N1861J5835j1946M800l0694j0115m7527o7382
$$ 125981 156199 187067 195561 261410 313271 329106 317160 321960 291266 281151 233624 166242
18720A66242l2656j3976n965N9l4318k5579m2391j4426j0718K5725K2897l188
$$ 166242 133586 119610 113645 113704 79386 53807 11416 -3010 -13728 11997 34894 31706
18708C1706L5589n996j5925k395j5046j0370j0341k2548j8534L213J4121M951
$$ 31706 67295 61299 45374 42979 27933 17563 7222 -15326 -33860 -30647 -16526 -11575
18696a1575Q637M141P642K0706k1211j7101o254m423m798K4334O317j5263J9987
$$ -11575 -2938 1203 8845 29551 8340 -8761 -15015 -19438 -24236 98 6415 -8848 11139
18683A1139R935l893P325J1096J4066l926m3452k1297m97J6534K3595o109L451
$$ 11139 21074 17181 24506 35602 49668 45742 2290 -19007 -19504 -2970 20625 14516 17967
18670A7967m344k624k532j6481p741N421K5037J495l6636k4637m627L8050M4722
$$ 17967 13623 10999 8467 -8014 -15755 -10334 14703 16198 -20438 -45075 -49702 -11652 33070
18657C3070J3861j4950l3056l0786j7219L1573J8188L412Q288j9022k3357K1504
$$ 33070 46931 31981 -1075 -31861 -49080 -17507 681 4093 12381 -6641 -29998 -8494
18645h494o994r328L647j3379l69J7847K4159L0949j2824j0222j2656l7434j8573
$$ -8494 -15488 -24816 -21169 -34548 -34917 -17070 7089 38038 25214 14992 2336 -35098 -53671
18632e3671J9450J6581k1709j0568J1675L5955J2629l1492J2148O505j6569K3916
$$ -53671 -34221 -17640 -39349 -49917 -38242 -2287 10342 -21150 -9002 -2497 -19066 4850
18620D850K8588J2605p210k6920n705L7743J3486k9825L524m425k9579R733j6189
$$ 4850 33438 46043 38833 11913 6208 43951 57437 27612 31136 26711 -2868 6865 -9324
18607i324K1375J1427j6382J8388j971l719J2994J8906o709p386r201l357k4105
$$ -9324 12051 23478 7096 25484 23513 19794 32788 51694 44985 37599 28398 25041 936
18594I36K957j469O858M1550J8870r984J2118k8613m2731o72O592n12K882m3548
$$ 936 3893 2424 9282 50832 69702 59718 71836 43223 492 -180 6412 5900 8782 -34766
18580c4766j2026K6121L8548J6187J7473J1044j5563p448j4117k1364K7750J0730
$$ -34766 -46792 -20671 17877 34064 51537 62581 47018 39570 25453 4089 31839 42569
18568D2569j2047p037k0279j0142j3780j1498J2590K9287J4354j1801J1608K6382
$$ 42569 30522 23485 3206 -6936 -20716 -32214 -19624 9663 24017 12216 23824 50206
18556E0206K1179j1107j138R562j87j9085l7214q153P794k9903Q781R565k5309
$$ 50206 71385 60278 59140 68702 68515 49430 12216 4063 11857 -18046 -9265 300 -25009
18543b5009j9652N654R792n1498L081L8346K9520K2133l521l6586Q722K4541l450
$$ -25009 -44661 -39007 -29215 -80713 -77632 -39286 -9766 12367 8846 -27740 -19018 5523 2073
18530B073p624K9407j6802k7767J4422J8287K6546j0166R120q202n12p781O179
$$ 2073 -5551 23856 7054 -20713 -6291 11996 38542 28376 37496 29294 28782 21001 27180
18517B7180P18L92L700k926m650k7635l4253K0747L9585o531k0192O602K0943
$$ 27180 27898 28290 31990 29064 24414 -3221 -37474 -16727 22858 16327 -3865 2737 23680
18504B3680L3933J2259k2696o315j5773K2562K4133K3514J2507k340k3582j1731
$$ 23680 57613 69872 47176 40861 25088 47650 71783 95297 107804 105464 81882 70151
18492G0151k4274k1514j7425m3678J779L6743M334J3820l2515l6602j5850L966
$$ 70151 45877 24363 6938 -36740 -34961 1782 6116 19936 -12579 -49181 -65031 -61065
18480f1065J2333j244J9340L459l059K5352K8165k6082p498J2995J2717M614l1561
$$ -61065 -48732 -49976 -30636 -27177 -30236 -4884 23281 -2801 -10299 2696 15413 20027 -11534
18467a1534j0967J5926K3234k227p085J3542r041K1070l3964k1685R702j4414
$$ -11534 -22501 -6575 16659 14432 7347 20889 11848 32918 -1046 -22731 -13029 -27443
18455b7443O698J9347r216K6040k60l7062l8260N43J9162O751J5871k106J3041
$$ -27443 -20745 -1398 -10614 15426 15166 -21896 -60156 -59613 -40451 -33700 -17829 -19935 -6894
18442f894P7j2960q610N8481L0621j0858k2646Q808n992j8027J200K514M222l792
$$ -6894 -6817 -19777 -28387 30094 60715 49857 27211 36019 30027 12000 13200 15714 19936 16144
18428A6144l655j4465K4023L4481j2499l1087k3320J2068J4105p06J9768K3462
$$ 16144 12489 -1976 22047 56528 44029 12942 -10378 1690 15795 15089 34857 58319
18416E8319m0022j1422J4907J3453o1022p0571L2387N5858J0192J6475J2287m493
$$ 58319 18297 6875 21782 35235 -25787 -96358 -63971 -8113 2079 18554 30841 26348
18404B6348J4302r195K5730L8962k307n3352l6484m116J7580M024O116J7786l643
$$ 26348 40650 31455 57185 96147 93840 40488 4004 -112 17468 21492 27608 45394 41751
18391D1751K3498M549K204N29o056k8312j6998K7928Q658k2535N972N947J9548
$$ 41751 65249 69798 72002 72531 66475 38163 21165 49093 57751 35216 41188 47135 66683
18378F6683J933N702J2772Q971q807j7544m4531j7003O033K8206L5780M0646k1438
$$ 66683 68616 74318 87090 96061 87254 69710 25179 8176 14209 42415 78195 118841 97403
18365I7403m2285m2431N228J6476K6991M45P680l424k2786K0024j6116k317l2777
$$ 97403 55118 12687 17915 34391 61382 61827 69507 66083 43297 63321 47205 44888 12111
18352A2111K505j3943o789K0255K8310k0166k0775K460n144K6042K2367j5366
$$ 12111 14616 673 -6116 14139 42449 22283 1508 3968 -1176 24866 47233 31867
18340C1867l2445K3406K8016m572k9380N406L428K3602M5008J7339j0323q498
$$ 31867 -578 22828 50844 46272 16892 22298 25726 49328 94336 111675 101352 92854
18328I2854r443j7664J1525O670L1803Q904m649j4561l5133j396j4948J4046j5305
$$ 92854 83411 65747 77272 83942 115745 124649 120000 105439 70306 68910 53962 68008 52703
18315E2703l3140L2876j366L4134J584k0630j2581j7152j7269o701l356o525K115
$$ 52703 19563 52439 51073 85207 86791 66161 53580 36428 19159 12458 9102 2577 4692
18302D692K6772J5002l200R267L090n078j2601l7157j6061k0979j500j1694N417
$$ 4692 31464 46466 43266 52533 55623 50545 37944 787 -15274 -36253 -37753 -49447 -44030
18289d4030M1882J8280j9556l4320J1028P213j0478K0039K1992j6323j1913k4223
$$ -44030 -2148 16132 -3424 -37744 -26716 -19503 -29981 -9942 12050 -4273 -16186 -40409
18277d0409J7482K7595K2078J0082k72r762j6233J1337J6277m3140k9365Q68n462
$$ -40409 -22927 4668 26746 36828 36556 26794 10561 21898 38175 -4965 -34330 -33462 -38924
18264c8924K8266P047M022k7781o133n43L3251J199R041J8125N518L718j0611
$$ -38924 -10658 -3611 411 -27370 -33503 -34046 -795 404 9445 27570 33088 36806 26195
18251B6195j3643J7878K4009j939J0586R955K2189j4009j827R309J5685K1506
$$ 26195 12552 30430 54439 52500 63086 73041 95230 81221 79394 88703 104388 125894
18239A25894K354o149k3791m0887l3835j1839J0091N690L8778J969k7327Q550
$$ 125894 128248 122099 98308 57421 23586 11747 21838 27528 66306 68275 40948 49498
18227D9498n662K680K282l3272J1863l9109q074J4470N57K579k6037j5410L0175
$$ 49498 43836 46516 48798 15526 27389 -11720 -19794 -5324 -4767 -2188 -28225 -43635 -13460
18214a3460Q174J1087J4057N430k5478K8236J0179n278p570j225l376L7392Q537
$$ -13460 -5286 5801 19858 25288 -190 28046 38225 32947 25377 24152 20776 58168 66705
18201F6705k4370j4030j1175N451J4021K0352n7921j0830M1992M1083l4216k1099
$$ 66705 42335 28305 17130 22581 36602 56954 -967 -11797 30195 71278 37062 15963
18189A5963J1476K0564J657Q575J4710n024q445j9717J8451N630k5325j6099j7775
$$ 15963 27439 48003 49660 58235 72945 67921 59476 39759 58210 63840 38515 22416 4641
18176D641R348R81m17j452M2556n592n660L6147J8875j0187l5117l659k670l557
$$ 4641 13989 14970 14553 13101 55657 50065 44405 80552 99427 89240 54123 50464 47794 44237
18162D4237K8487L778o25K0734o411p381L411r892Q168K0702L9049M260j0942
$$ 44237 72724 76502 75877 96611 90200 82819 86230 76338 84506 105208 144257 148517 137575
18149A37575K8277j9214j4887o991J3945L7930J5102j544M859K0062k9219o877
$$ 137575 165852 146638 131751 124760 138705 176635 191737 190193 195052 215114 185895 179018
18137A79018N801K2659K7857J9455P4885O0638K9338K4249L3641O3338Q7475J03279
$$ 179018 184819 207478 235335 254790 329675 390313 419651 443900 477541 540879 628354 731633
18125G31633J13702J29623J73099J78687K50506L05281M18727O22009R26407J418997
$$ 731633 845335 974958 1148057 1326744 1577250 1882531 2301258 2923267 3849674 5268671
18115E268671K265863L638092O172118J0606609J4937122R256035j564653l116175
$$ 5268671 7534534 11172626 17344744 27951353 42888475 52144510 50579857 47463682
18107D7463682l300605q623422j1108962p331114l999903k102418j231457j149364
$$ 47463682 44163077 35539655 24430693 17099579 13099676 10997258 9765801 8616437
18099H616437j231157j147210r36328p68826p00242n50373m51337l90196k94122
$$ 8616437 7385280 6238070 5301742 4532916 3832674 3282301 2830964 2440768 2146646
18090B146646k63168k26220j76694j93066j45851j05067j12602j04036r6265l3744
$$ 2146646 1883478 1657258 1480564 1287498 1141647 1036580 923978 819942 723677 689933
18080F89933l8673m8271q1988o7202p4630m0607p377j2880r131P880k4989j7918
$$ 689933 651260 602989 521001 453799 379169 338562 331185 318305 309174 317054 292065 274147
18068B74147j9108k1440j6416j3583r018m321L814Q496K834k4049k8631J1098
$$ 274147 255039 233599 217183 203600 194582 190261 194075 202571 205405 181356 152725 163823
18056A63823J2280k297k0827k0698k6919k736P648J2192K0081k2226k0591k1865
$$ 163823 176103 173806 152979 132281 105362 102626 110274 122466 142547 120321 99730 77865
18044G7865Q756J8027m6566n3464L5077M3293K751m010j0561M0408j3201l4286
$$ 77865 86621 104648 58082 4618 39695 82988 85739 81729 71168 111576 98375 64089
18032F4089j3290L3076l019J4513J6366K5017k7888k8338r809J1651j748K237
$$ 64089 50799 83875 80856 95369 111735 136752 108864 80526 70717 82368 80620 82857
18020H2857m1986p360j4556p391K4190K7737L5264P499j3198J8226J0349j2633
$$ 82857 40871 33511 18955 11564 35754 63491 98755 106254 93056 111282 121631 108998
18008A08998j3679j7687P000j4797j4594j5735m6267j208M1896l367j5208n787
$$ 108998 95319 77632 84632 69835 55241 39506 -6761 -7969 33927 30560 15352 9565
17996I565K4149M3494k195j5382j4637J074l4047k1681L6344P0382J8446l9397
$$ 9565 33714 77208 75013 59631 44994 46068 12021 -9660 26684 97066 115512 76115
17984G6115q896j4923J3828l837l2619P292p66j4132K1261j370j5680l3355J241
$$ 76115 67219 52296 66124 62287 29668 36960 36194 22062 43323 41953 26273 -7082 -5841
17971e841J6848K3980k4380Q199k5760o846J1428K7511o512k740L7267q327n174
$$ -5841 11007 34987 10607 18806 -6954 -13800 -2372 25139 18627 15887 53154 44827 39653
17958C9653N920m320Q298n388M0866K0831l928k2198k9592J851K0671J9860j1991
$$ 39653 45573 41253 49551 44163 85029 105860 101932 79734 50142 51993 72664 92524 80533
17945H0533k7563k2070K9536j0984m935l5746p248M1850K7014J5841q436k8136
$$ 80533 52970 30900 60436 49452 44517 8771 1523 43373 70387 86228 77792 49656
17933D9656k762J8466J1923M135o257M420j3682J7380j3922l2303J9992j4917
$$ 49656 46894 65360 77283 81418 75161 79581 65899 83279 69357 37054 57046 42129
17921D2129l2510k4385J1272O121p718J5577K2927J425k6356j1315J7762L0499
$$ 42129 9619 -14766 -3494 2627 -5091 10486 33413 34838 8482 -2833 14929 45428
17909D5428J8315p918l0609l183l3531j8517p542k047L834O331J3376O965n152
$$ 45428 63743 55825 25216 22033 -11498 -30015 -37557 -39604 -35770 -29439 -16063 -9098 -14250
17896a4250L2680J8116R16j6752J5062Q355j7384l162o69K188l593l1047j0319
$$ -14250 18430 36546 37462 20710 35772 44127 26743 23581 22912 25100 21507 -9540 -19859
17883a9859k0283k0593j0042K0354j3452O595N5918L5869o182p722j2318k7252
$$ -19859 -40142 -60735 -70777 -50423 -63875 -57280 -1362 34507 28325 20603 8285 -18967
17871a8967j8704J668J24M0135J0852K4088m806j4326l745Q645j5398J358L179
$$ -18967 -37671 -36003 -35879 4256 15108 39196 34390 20064 16319 24964 9566 10924 14103
17858A4103L52k6246j1173J3999J6976L202k4572l024J8051k16n104J3059J5481
$$ 14103 14455 -11791 -22964 -8965 8011 11213 -13359 -16383 1668 1452 -3652 9407 24888
17845B4888j0298j9149l8959N1741L3490j9339k5360k9155N711J7791M4268J2154
$$ 24888 14590 -4559 -43518 8223 41713 22374 -2986 -32141 -26430 -8639 35629 47783
17833D7783K66j0299j0369j4863o255R147p013j7777O496M4366O341q323p113
$$ 47783 48049 37750 27381 12518 6263 15410 8397 -9380 -2884 41482 47823 39500 32387
17820C2387k9350k052J2093k286J2355k4662R535j3236m3956j6125J8995M1237
$$ 32387 3037 985 13078 10792 23147 -1515 8020 -5216 -49172 -65297 -46302 -5065
17808e065j5096m704J198j9461J6674J1103O052j9763l3447l198L7994M0518M1761
$$ -5065 -20161 -24865 -23667 -43128 -26454 -15351 -9299 -29062 -62509 -65707 -27713 12805 54566
17795E4566m993j7543n3209K0273L5351o805k0418K1401j672j7401R383j4409
$$ 54566 49573 32030 -21179 -906 34445 27640 7222 28623 26951 9550 18933 4524
17783D524j0949J9000J1143J9521j5810r132n118q086l1042J2535L2006k0393
$$ 4524 -6425 12575 23718 43239 27429 18297 13179 5093 -25949 -13414 18592 -1801
17771a801J536J2289p093j965K6237k594m9932l6512j0929P514L0118N919K886
$$ -1801 -265 12024 4931 2966 29203 26609 -23323 -59835 -70764 -63250 -33132 -27213 -24327
17758b4327K1529K7382p992q963j1154Q816r56J0812k4331k6329k7025J1187O1106
$$ -24327 -2798 24584 16592 7629 -3525 5291 4335 15147 -9184 -35513 -62538 -51351 9755
17745I755M5287k036k3724j8438m750O968J2892m599j1595J4932k228k8712k7057
$$ 9755 55042 53006 29282 10844 6094 13062 25954 21355 9760 24692 22464 -6248 -33305
17732c3305m312N18k7404j9760M1951L0315p619K2107J8180j3129j4237p732o01
$$ -33305 -37617 -37099 -64503 -84263 -42312 -11997 -19616 2491 20671 7542 -6695 -14427 -15028
17719a5028J0646o245r615J6718j0275N829k975J8099j9265l728J3325p529k9871
$$ -15028 -4382 -10627 -20242 -3524 -13799 -7970 -10945 7154 -12111 -15839 -2514 -10043 -39914
17706c9914K6637j0335l8876k5909M0414L9404l674K5314J0239j9454J7877K507
$$ -39914 -13277 -23612 -62488 -88397 -47983 -8579 -12253 13061 23300 3846 21723 24230
17694B4230j1915r404J0831K4625O885j6893j8043j0023K5794j5703l3623j5673
$$ 24230 12315 2911 13742 38367 45252 28359 10316 293 26087 10384 -23239 -38912
17682c8912J8913J1223P694K3389L8938k0595k4378j3908n913r786K2234k7726
$$ -38912 -19999 -8776 -1082 22307 61245 40650 16272 2364 -3549 -13335 8899 -18827
17670a8827j9168o013P78J6259L3863J974l079K8615j3195k2008o633M372l1183
$$ -18827 -37995 -44008 -43230 -26971 6892 8866 5787 34402 21207 -801 -7434 -3062 -34245
17657c4245K966J1791N289L1056l2016l6286P47M22J9786k153p645K3118L986
$$ -34245 -31279 -19488 -14199 16857 -15159 -51445 -50698 -50276 -30490 -32643 -40288 -17170 -13184
17644a3184l892l0576r01p096l7810J7595j3304N805K5377l050Q532j8411o179
$$ -13184 -17076 -47652 -48553 -55649 -93459 -75864 -89168 -83363 -57986 -61036 -52504 -70915 -77094
17631g7094K1826j368J9565j349j4525j3040M1800O9600n642R724j7716k224O471
$$ -77094 -55268 -56636 -37071 -38420 -52945 -65985 -24185 45415 39773 49497 31781 29557 36028
17618C6028K545M10l2929l8558l419J0924J3646J6106k1034m4531j4467L3064
$$ 36028 38573 38983 6054 -32504 -35923 -24999 -11353 4753 -16281 -60812 -75279 -42215
17606d2215L7862K6924L7358L5777n1590q006J1197j6215k8274k8867K3362J2842
$$ -42215 -4353 22571 59929 95706 44116 36110 47307 31092 2818 -26049 -2687 10155
17594A0155J3251J3167k2657k6863K375m805J675m006j1847j8560j2574J0880
$$ 10155 23406 36573 13916 -12947 -10572 -15377 -13702 -17708 -29555 -48115 -60689 -49809
17582d9809M4217j406l699L4133l0066n8046j1186K9694M5002O690j6503M1748
$$ -49809 -5592 -6998 -10697 23436 -6630 -64676 -75862 -46168 -1166 5524 -10979 30769
17570C0769m36l3908k0758j8975J7126N3595K0447l6516k5828K4873Q17O402J5973
$$ 30769 30333 -3575 -24333 -43308 -26182 27413 47860 11344 -14484 10389 11206 17608 33581
17557C3581k1297m0548K2059K9402Q388k3292l2593K1477K5238P912n597J4179
$$ 33581 12284 -28264 -6205 23197 31585 8293 -24300 -2823 22415 30327 24730 38909
17545C8909L159q444n78k1688k1067L767K7669J4141l4826k9210L5554O358R736
$$ 38909 42068 33624 33046 11358 -9709 -5942 21727 35868 1042 -28168 7386 13744 23480
17532B3480l6758l0185J9126N459O313J7639J9638n86J9684q278k6998j6167J1164
$$ 23480 -13278 -43463 -24337 -18878 -12565 5074 24712 24126 43810 35532 8534 -7633 3531
17519C531k7820j9662J9797K8352K2841l8930k4998J1746n270l5102j899J6465
$$ 3531 -24289 -43951 -24154 4198 27039 -11891 -36889 -25143 -30413 -65515 -67414 -50949
17507e0949L0986J5866J8011p737j7052m4761J2048M1433L201J1018K4660q552
$$ -50949 -19963 -4097 13914 6177 -10875 -55636 -43588 -2155 1046 12064 36724 28172
17495B8172p751J1925K8087M715k1161N805L58o1694o305j3240O799M858n988
$$ 28172 20421 32346 60433 65148 43987 49792 50150 -11544 -17849 -31089 -24290 -19432 -25420
17482b5420K408o971J2513K3658L432l2676l0835R420J32j8888K3179Q12J790
$$ -25420 -23012 -29983 -17470 6188 9620 -23056 -53891 -44471 -44339 -63227 -40048 -39236 -37446
17469c7446O515r630P434j7316L389K3334J360m921K1321q425j36k2544J4367
$$ -37446 -30931 -40561 -33127 -50443 -47054 -23720 -22360 -27281 -5960 -14385 -14521 -37065 -22698
17456b2698J142q767J2260L2479J5999J5483J1732K3707N233J1170M9818P1706
$$ -22698 -21556 -30323 -18063 14416 30415 45898 57630 81337 86570 97740 147558 219264
17444B19264N6885l121r408k7198k0382l3754o3405k8142l8627l2810j9772k3156
$$ 219264 276149 273028 263620 236422 216040 182286 118881 90739 52112 19302 -470 -23626
17432b3626j8826M4477L3694k8320m414j1852J9477j7520l4605o096n863j6461
$$ -23626 -42452 2025 35719 7399 2985 -8867 10610 -6910 -41515 -47611 -53474 -69935
17420f9935k1441L2030L6268J8620L1673j800k1719k1116l4120K0738K7487l739
$$ -69935 -91376 -59346 -23078 -4458 27215 25415 3696 -17420 -51540 -30802 -3315 -7054
17408g054N120K470r129m6J2947k0625l4743K2970o466J3948J884r904k485J6604
$$ -7054 -1934 536 -8593 -8639 4308 -16317 -51060 -28090 -34556 -20608 -18724 -28628 -31113 -14509
17394a4509L3491J4768L72j0466n0399k0014J1487K9692r340j693P211M455L611
$$ -14509 18982 33750 34122 23656 -26743 -46757 -35270 -5578 -14918 -16611 -9400 -4945 -1334
17381a334j3119j8435J6911J4134o960N573m310K0036J8611K438J5298k0144J1581
$$ -1334 -14453 -32888 -15977 -1843 -8803 -3230 -7540 12496 31107 33545 48843 28699 40280
17368D0280k9015j5943N106j3646M86r085J6590j1474K8483M145r619j5105L2703
$$ 40280 11265 -4678 428 -13218 -12732 -21817 -5227 -16701 11782 15927 6308 -8797 23906
17355B3906j9310J4907r569m3930k4781l182M0397K0957k1085l0037j8621Q177
$$ 23906 4596 19503 9934 -33996 -58777 -61959 -21562 -605 -21690 -51727 -70348 -62171
17343f2171L8837n286R109O979J9148J8734J8645J0603J9757r614m4532m4995
$$ -62171 -23334 -28620 -19511 -12532 6616 25350 43995 54598 74355 64741 20209 -24786
17331b4786j358L5668K253J5309j7937n638n704R789J9131P114k8667J437N350
$$ -24786 -26144 9524 11777 27086 9149 3511 -2193 7596 26727 33841 5174 6611 11961
17318A1961k2210p000P805j9809J869J3268j0014J2697o10j1110j4739L8140M249
$$ 11961 -10249 -17249 -9444 -29253 -27384 -14116 -24130 -11433 -12043 -23153 -37892 248 4497
17305D497m1370r210J5608L6867L021l1412j907J3966k8086o880J3726L409k3311
$$ 4497 -36873 -46083 -30475 6392 9413 -21999 -23906 -9940 -38026 -44906 -31180 -27771 -51082
17292e1082P181K1691M3697l257r772Q447j3797k7663j8320K0654n344Q186J4643
$$ -51082 -43901 -22210 21487 18230 8458 16905 3108 -24555 -42875 -22221 -27565 -19379 -4736
17279d736K1653n804j4234k1306k1790L068J9947K7394K1743K0424j3437K898
$$ -4736 16917 11113 -3121 -24427 -46217 -43149 -23202 4192 25935 46359 32922 35820
17267C5820j5807k5246n218J0717L1998k3368m4698L7531j226j0372q476j4457
$$ 35820 20013 -5233 -10451 266 32264 8896 -35802 1729 503 -9869 -18345 -32802
17255c2802j214M7654K5232K803Q15r234k6478m3121j1191M6724M7123k150j466
$$ -32802 -34016 13638 38870 41673 42488 33254 6776 -36345 -47536 -812 46311 44161 42695
17242D2695K118j7703l3617j7402j8051K0665K3306P967J2375j973j4157K5712
$$ 42695 44813 27110 -6507 -23909 -41960 -21295 2011 9978 22353 20380 6223 31935
17230C1935k4049k4969l9083j7749j6127r236M8209R43q408K8534q548L958K2221
$$ 31935 7886 -17083 -56166 -73915 -90042 -99278 -51069 -50126 -58534 -30000 -38548 -34590 -12369
17217a2369n783K879J1550K0435K0295l4609m602R73k6473j2903j5961k5206j1171
$$ -12369 -18152 -15273 -3723 16712 37007 2398 -2204 -1231 -27704 -40607 -56568 -81774 -92945
17204i2945J9286M6546M3658J4530l2256k3895Q770l7211k2631O862P7727M6139
$$ -92945 -73659 -27113 16545 31075 -1181 -25076 -16306 -53517 -76148 -69286 8441 54580
17192E4580p769j010j2597m3512j60l218j8350r171M8159K0449K3177j6910j8237
$$ 54580 46811 45801 33204 -10308 -10468 -13686 -32036 -41207 6952 27401 50578 33668 15431
17179A5431q055l4746J4431L4086j1072l5211L958L3233j6262n597K2315q411
$$ 15431 7376 -27370 -12939 21147 10075 -25136 -21178 12055 -4207 -9804 12511 4100
17167D100K964m335m881K7211l29k577J0134l874K0958K0178k9587k9842j2281
$$ 4100 7064 2729 -2152 25059 24730 22153 32287 28413 49371 69549 39962 10120 -2161
17154b161P439O105K2261j3340j7281K428K167J2581L357q398P280m413k0853
$$ -2161 5278 11383 33644 20304 3023 5451 7618 20199 23556 15158 22438 18025 -2828
17141b828k7550j9032m106L8739k2677k6382m146N3623L6282j8542J5749j8847
$$ -2828 -30378 -49410 -53516 -14777 -37454 -63836 -67982 -14359 21923 3381 19130 283
17129B83r346K3515K8314l8407j4426M903j6327j4807K0837K2639j069j9992o00
$$ 283 -9063 14452 42766 4359 -10067 -5164 -21491 -36298 -15461 7178 6109 -13883 -14483
17116a4483j933j0454N851M518N570P304M34p621j6286r338k5624m7478o25K654
$$ -14483 -16416 -26870 -21019 -16501 -10931 -3627 -3193 -10814 -27100 -36438 -62062 -109540 -110165 -107511
17102a07511J1135K3695j2697L4252K1732l872J3192J4335K8379k3813m863m209
$$ -107511 -96376 -72681 -85378 -51126 -29394 -33266 -20074 -5739 22640 -1173 -6036 -10245
17090a0245J7110K1189k601j3911k4952j4512m469N514J6376J7307l9300j9903
$$ -10245 6865 28054 25453 11542 -13410 -27922 -32391 -26877 -10501 6806 -32494 -52397
17078e2397j3883L7704N712J2159J8451J0235k6351k8576l2299J0201N593M984
$$ -52397 -66280 -28576 -22864 -10705 7746 17981 -8370 -36946 -69245 -59044 -53451 -48467
17066d8467J958N9007K0205O858J7459l1331m0835M038K5274K4099k5703k1683
$$ -48467 -46509 12498 32703 39561 57020 25689 -15146 -11108 14166 38265 12562 -9121
17054i121J9058N842j5912k1430q673k0402J4335J911K0010L1709N457J3700k815
$$ -9121 9937 15779 -133 -21563 -30236 -50638 -36303 -34392 -14382 17327 22784 36484 33669
17041C3669j1918J8945J2863J999q014l6428j4582m3726n2926M7693K4151n231
$$ 33669 21751 40696 53559 55558 47544 11116 -3466 -47192 -100118 -52425 -28274 -33505
17029c3505J295K8486M3492L186r688l6526j8982K8696p071m5001Q016K3256J3217
$$ -33505 -32210 -3724 39768 42954 33266 -3260 -22242 6454 -617 -45618 -37602 -14346 -1129
17016a129L0082k0475n3703j6973L9344J0124J1893q04j4268M551N47L507m0486
$$ -1129 28953 8478 -45225 -62198 -22854 -12730 -837 -1641 -15909 -11358 -10811 -7304 -47790
17003d7790r478K9954J6626J8349O227l8713M204L327j6678k7160j336K9588M940
$$ -47790 -57268 -27314 -10688 7661 13888 -24825 -20621 -17294 -33972 -61132 -62468 -32880 -27940
16990b7940n666J2040J5688L706J6693m1899l3175J7229J4199P952o813n953j7358
$$ -27940 -33606 -21566 -5878 -2172 14521 -27378 -60553 -43324 -29125 -21173 -27986 -33939 -51297
16977e1297J9848p250M8455J3770l3467k0108K304r672N952q640q03L0589N407
$$ -51297 -31449 -38699 9756 23526 -9941 -30049 -27745 -37417 -31465 -40105 -40908 -10319 -4912
16964d912J8440M258j0358Q915J4392j1783n3934j7027l6734N152K13K1644M7570
$$ -4912 13528 17786 7428 16343 30735 18952 -34982 -52009 -88743 -83591 -83378 -61734 -14164
16951a4164p51l146N5077J7398k6251m4976j1962q18k9990q170O614K2422n748
$$ -14164 -14915 -18061 37016 54414 28163 -16813 -28775 -29593 -59583 -67753 -61139 -38717 -44465
16938d4465R924J5209K2904N407p504p654j2545j0255k718K0095o882J581Q894
$$ -44465 -34541 -19332 3572 8979 1475 -6179 -18724 -28979 -31697 -11602 -18484 -16903 -8009
16925h009m20J0420k0778P757J6372L456L5789n982m1570K342N771j046l8986
$$ -8009 -8429 1991 -18787 -11030 5342 8798 44587 38605 -2965 -623 5148 4102 -34884
16912c4884j6969k9013K9212L2601P201J83K441P956m9983j0624L0869J2000J5772
$$ -34884 -51853 -80866 -51654 -19053 -11852 -11669 -9228 -1272 -51255 -61879 -31010 -19010 -3238
16899c238k190P528p485R079M0476K1134k211k4878k7461K076j2740K160j6300
$$ -3238 -5428 2100 -5385 3694 44170 65304 63093 38215 10754 12830 90 2250 -14050
16886a4050r886r460J7495K3647K4868j968P18P920R266q407j5008k7085J624
$$ -14050 -23936 -33396 -15901 7746 32614 30646 31364 39284 48550 40143 25135 -1950 -326
16873c26m0250J1346p939K4143M3220J6861k7234R769K2132m077m3840J073l319
$$ -326 -40576 -29230 -37169 -13026 30194 47055 19821 29590 51722 47645 3805 4878 1559
16860A559k87n03l6586j4731K6734J6102J6266R425K7627m5410n1635j0544J5605
$$ 1559 1272 769 -35817 -50548 -23814 -7712 8554 17979 45606 196 -51439 -61983 -46378
16847d6378j1324n270M9447L7348j605m2729k9761L1177J3380j5003J780K8021
$$ -46378 -57702 -62972 -13525 23823 22218 -20511 -50272 -19095 -5715 -20718 -18938 9083
16835I083N789j6558k5134P062n610J9354M256l8012L860K1572m607O27K2479
$$ 9083 14872 -1686 -26820 -19758 -25368 -6014 -1758 -39770 -35910 -14338 -18945 -18318 4161
16822D161L0075k291j4297j0282n304K1918L0776P284l7358j7171p359L352j5196
$$ 4161 34236 31945 17648 7366 2062 23980 54756 62040 24682 7511 152 3504 -11692
16809a1692K74p326l662J035J5416p334p829k194K530N981J5427k8474j3413J8065
$$ -11692 -11418 -18744 -22406 -21371 -5955 -13289 -21118 -23312 -20782 -14801 626 -27848 -41261 -23196
16795b3196j525K6754M919m3909K2237J050k2586M175n614j2307M432J6316L6693
$$ -23196 -24721 2033 6952 -36957 -14720 -13670 -36256 -32081 -37695 -50002 -45570 -29254 7439
16782G439j2802j7382p122K1632J2871J8168j0175j3108O129L470J0844J1780
$$ 7439 -5363 -22745 -29867 -8235 4636 22804 12629 -479 5650 9120 19964 31744
16770C1744P364K5255k6185k8427m699l1140q779K366J7390J9314K3393k1701
$$ 31744 39108 64363 38178 9751 5052 -26088 -34867 -32501 -15111 4203 27596 5895
16758E895j937J5119k360j2764q931j971j0301r84K9468j702k1611j353j1350
$$ 5895 3958 19077 16717 3953 -4978 -6949 -17250 -18234 11234 9532 -12079 -13432 -24782
16745b4782L3925J4479j7724j8372j9276J5775M683l4840k2161K1708J8433K7747
$$ -24782 9143 23622 5898 -12474 -31750 -15975 -11292 -46132 -68293 -46585 -28152 -405
16733d05L2320l8010l5740O214o435o15J5261J7777k82l825j1862J2187R238L7870
$$ -405 31915 -6095 -41835 -35621 -42056 -42671 -27410 -9633 -9915 -13740 -25602 -13415 -4177 33693
16719C3693R102k2482N284j8048l5855j2784o305L1823K8647l3660l7472r056
$$ 33693 42795 20313 25597 7549 -28306 -41090 -47395 -15572 13075 -20585 -58057 -67113
16707f7113L3703M5382j3117l618K768k2810P663J0242J6335J0410K6660R631
$$ -67113 -33410 11972 -1145 -4763 -1995 -24805 -17142 -6900 9435 19845 46505 56136
16695E6136K850L7828j3494m6284k894q070j2884k1092j6759o472K4825p866j8922
$$ 56136 58986 96814 83320 37036 34142 26072 13188 -7904 -24663 -31135 -6310 -14176 -33098
16682c3098K3518j0296j594j0601R629l0141l5291O458L1898J6530J4738K2151
$$ -33098 -9580 -19876 -21470 -32071 -22442 -52583 -87874 -81416 -49518 -32988 -18250 3901
16670C901p702j5487J7458K8026k2037O607L667j2757j1903j2860J2390K1845
$$ 3901 -3801 -19288 -1830 26196 4159 10766 14433 1676 -10227 -23087 -10697 11148
16658A1148L399k673k6937J730l5J0077J2628M291L1574k123l5549m372j6398
$$ 11148 14547 11874 -15063 -13333 -13368 -3291 9337 13628 45202 43079 7530 3158 -13240
16645a3240k0894N227K3813J4939J5672k99O68j9249l2001J1647J5419j5443k4038
$$ -13240 -34134 -28907 -5094 9845 25517 25218 25886 6637 -25364 -13717 1702 -13741 -37779
16632c7779R923o398K2252L1157j8203M404M429q542O60r762L9026L1056j3452
$$ -37779 -27856 -34254 -12002 19155 952 5356 9785 1243 1903 -7859 31167 62223 48771
16619D8771l0780j5346M1237L0384l7674o7800J0329j5674n2696J5215M8687O681
$$ 48771 17991 2645 43882 74266 36592 -31208 -20879 -36553 -89249 -74034 -25347 -18666
16607a8666k1982J845L818L041n874m739J7455q936P780K871J1820o303K2694
$$ -18666 -40648 -38803 -34985 -31944 -37818 -42557 -25102 -34038 -26258 -23387 -11567 -17870 4824
16594D824r397j5447J0269Q891j461j1784J2409J2908K7620K481K671L4354K430
$$ 4824 -4573 -20020 -9751 -860 -2321 -14105 -1696 11212 38832 41313 43984 78338 80768
16581H0768k8299q335l2207l561L990k3576K4594K8177K506K6828P472j493J0550
$$ 80768 52469 44134 11927 8366 12356 -11220 13374 41551 44057 70885 78357 76864 87414
16568H7414l1909k6876J4657M763k6967j7482r301J9360l7327m975J4979J1615
$$ 87414 55505 28629 43286 48049 21082 3600 -5701 13659 -23668 -28643 -13664 -2049
16556b049J0602N883l4039j2809p36L0268K6120j3503q570j6101M480J8461o170
$$ -2049 8553 14436 -19603 -32412 -33148 -2880 23240 9737 1167 -14934 -10454 8007 1837
16543A837j834R65l812J0767K764m457r304K7671J155o8068M213L7825O923j2940
$$ 1837 3 968 -2844 7923 10687 6230 -3074 24597 25752 -42316 -38103 -278 6645 -6295
16529f295q620K9009k286m7655m5460K8572M3806j4816K688K479q240J1621J1990
$$ -6295 -14915 14094 11808 -35847 -81307 -52735 -8929 -23745 -21057 -18578 -26818 -15197 -3207
16516c207K0264R530j1455j3201N931j4930l4095J4093K8557K9165M564K8302
$$ -3207 17057 26587 15132 1931 7862 -7068 -41163 -27070 1487 30652 35216 63518
16504F3518j3091j3970k6206O432M573j5545j7178R01M286R474j4103k0689J2050
$$ 63518 50427 36457 10251 16683 21256 5711 -11467 -10566 -6280 3194 -10909 -31598 -19548
16491a9548K0471j4120j189L2039o546k6359o076l7014k9929L1142K6388K6886
$$ -19548 923 -13197 -14386 17653 11107 -15252 -21328 -58342 -88271 -57129 -30741 -3855
16479c855K0946j6357j7149j7844k6436j6483L3782L6892J2273k0531k4629j2313
$$ -3855 17091 734 -16415 -34259 -60695 -77178 -43396 -6504 5769 -14762 -39391 -51704
16467e1704k2155J0133L8386j3665J1595J0477M472k1499L8573L0693l7031l2279
$$ -51704 -73859 -63726 -25340 -39005 -27410 -16933 -12461 -33960 4613 35306 -1725 -34004
16455c4004J9221J0459L2087J8852j8314q240K5023k8211o5876j16J9344J3394
$$ -34004 -14783 -4324 27763 46615 28301 20061 45084 16873 -49003 -49119 -29775 -16381
16443a6381Q610K5744L4742j467m1687j3035P918n559k8352L2520m860J8730j5957
$$ -16381 -7771 17973 52715 51248 9561 -3474 4444 -1115 -29467 3053 -1807 16923 966
16430I66j6226J5938j7323k8473L294K0870L7058N427l1239r31n552J5275L2204
$$ 966 -15260 678 -16645 -45118 -41824 -20954 16104 21531 -9708 -10639 -16191 -916 31288
16417C1288l4143m5460J7142n470q460L167j1935n934K9889j0535N168N672R682
$$ 31288 -2855 -48315 -31173 -36643 -45103 -41936 -53871 -59805 -29916 -40451 -35283 -29611 -19929
16404a9929m430P132K2663O625m226r373J1393j3881l299K3846J861J1500k5999
$$ -19929 -24359 -17227 5436 12061 7835 -1538 9855 -4026 -7325 16521 18382 29882 3883
16391C883J3460J3153j7376k329m103l3582j654j317m65Q513R087k4251J2110
$$ 3883 17343 30496 13120 10791 6688 -26894 -28548 -29865 -30330 -21817 -12730 -36981 -24871
16378b4871j3075L798K4001L0293j9189n901J2720j3878N910J7606J1464j2422
$$ -24871 -37946 -34148 -10147 20146 957 -4944 7776 -6102 -192 17414 28878 16456
16366A6456M272P685j3742O792J1261l1799n4831R609M2583K979J0909p202J2894
$$ 16456 20728 28413 14671 21463 32724 925 -53906 -44297 -1714 1265 12174 4972 17866
16353A7866R417j1329p130J1428J621k0068j5423Q304P5788J3851m5579j6556
$$ 17866 27283 15954 8824 20252 21873 1805 -13618 -5314 70474 84325 38746 22190
16341B2190M103n597M3058k5202m9243k8423Q686r965K8131K3978n519J742q855
$$ 22190 26293 20696 63754 38552 -10691 -39114 -30428 -40393 -12262 11716 6197 7939 -916
16328i16j4544M552J5794K4360m600k8368o849q569N225J1827L824l0339j4629
$$ -916 -15460 -10908 4886 29246 24646 -3722 -10571 -19140 -13915 -2088 1736 -28603 -43232
16315d3232N8559j1735j1369J7912J1340J4563j5164j9346m6480M888j178l322
$$ -43232 15327 3592 -7777 10135 21475 36038 20874 1528 -44952 -40064 -41242 -44564
16303d4564K0309q666j2220J4994n973N372M4902M1135j132j3479k1260n0133
$$ -44564 -24255 -32921 -45141 -30147 -36120 -30748 14154 55289 54157 40678 19418 -30715
16291c0715m39j2091R015M685K1975J4965k0389j2162J8347p212j6124j0509J9773
$$ -30715 -31154 -43245 -34230 -29545 -7570 7395 -12994 -25156 -6809 -14021 -30145 -40654 -20881
16278b0881J6557k2522N447q490J0971M1867o517k0646l384L15J02o029j1526
$$ -20881 -4324 -26846 -21399 -29889 -18918 22949 16432 -4214 -7598 -7283 -7181 -13210 -24736
16265b4736L5388j0089j7665R040J6141p763k2972k2067k4751J2363K7379P511
$$ -24736 10652 563 -17102 -8062 8079 316 -22656 -44723 -69474 -57111 -29732 -22221
16253b2221Q383L8261K8950m1860l5883k2012J595j2496P715M0684J4345N997
$$ -22221 -13838 24423 53373 11513 -24370 -46382 -44787 -57283 -49568 -8884 5461 11458
16241A1458Q854l654k1126j8032j2055O248p709k301J1120K5101K501j847J4956
$$ 11458 20312 16658 -4468 -22500 -34555 -28307 -36016 -38317 -27197 -2096 405 -1442 13514
16228A3514K506j6826j6184K2015k4320k2019l013j2296K984k1621j599L4627
$$ 13514 16020 -806 -16990 5025 -19295 -41314 -44327 -56623 -53639 -75260 -76859 -42232
16216d2232J6593M5862l348j4957n886k0686j5178K3370L8277J5489l851K1430
$$ -42232 -25639 20223 16875 1918 -3968 -24654 -39832 -16462 21815 37304 33453 54883
16204E4883P659k8591j7016j3085l9742J558L3114P852l3424j4644K9731L350
$$ 54883 62542 33951 16935 3850 -35892 -34334 -1220 6632 -26792 -41436 -11705 -8355
16192h355n029j3999n339L4944L7935M904k0572k9639P992J5593r79k6695K1117
$$ -8355 -13384 -27383 -32722 2222 40157 45061 24489 -5150 2842 18435 17456 -9239 11878
16179A1878K5096j3266j8108q178l710P811m572j9218J2610K2035p333j4924R041
$$ 11878 36974 23708 5600 -2578 -6288 1523 -3049 -22267 -9657 12378 5045 -9879 -838
16166h38J9441p439N90K3942K0601l7045k5231r007M5263M874k9918j8792j2639
$$ -838 18603 11164 11754 35696 56297 19252 -5979 -14986 30277 35151 5233 -13559 -26198
16153b6198K5348K1157J0886l878L0121r485k6060m3668j0163j100J930M0770
$$ -26198 -850 20307 31193 27315 57436 47951 21891 -21777 -31940 -33040 -31110 9660
16141I660J673k0206j3176k5683k2918O892J5751L137l4745L227J0306j1346J5319
$$ 9660 11333 -8873 -22049 -47732 -70650 -63758 -48007 -44870 -79615 -76388 -66082 -77428 -62109
16128f2109j0823j4331M795R620j2685K497K4948J4714j1039n84J6471K6412L7100
$$ -62109 -72932 -87263 -82468 -72848 -85533 -83036 -58088 -43374 -54413 -54997 -38526 -12114 24986
16115B4986k2999n7930K2625K9024j4886k927K6371L7446J1158k1133k6839m07
$$ 24986 1987 -55943 -33318 -4294 -19180 -22107 4264 41710 52868 31735 4896 4489
16103D489K3491K890R591J6099M665q785n113k3011l0782j2712R647J7387j1599
$$ 4489 27980 30870 40461 56560 61225 52440 47327 24316 -6466 -19178 -9531 7856 -3743
16090c743j0054q189M820K5380m99j5574N648j6385j1535K4892J7140J90j6773
$$ -3743 -13797 -21986 -17166 8214 7715 -7859 -2211 -18596 -30131 -5239 11901 12091 -4682
16077d682j1430N428j4974r420J2263P8k812j2617J2873J3852p263K73J2895J6861
$$ -4682 -16112 -10684 -25658 -35078 -22815 -22737 -25549 -38166 -25293 -11441 -18704 -18431 -5536 11325
16063A1325O327k5799q290k5444l0051R368K2646K6491j7666j5037P39K4681K6814
$$ 11325 17652 -8147 -16437 -41881 -71932 -62564 -39918 -13427 -31093 -46130 -45391 -20710 6104
16050F104n390l842k4006J1754r187R714L020n599k2204J3559m057J662J99K7328
$$ 6104 714 -3128 -27134 -15380 -24567 -14853 -11833 -17432 -39636 -26077 -30134 -28472 -28273 -945
16036i45k0450R553L8456j2927J3035J1231O154j0536l546l2333J839M6215K514
$$ -945 -21395 -11842 26614 13687 26722 37953 44107 33571 30025 -2308 -469 45746 48260
16023D8260j233l1334l0505j9444o939m458J4479j301r686J674m1372j4689J2146
$$ 48260 47027 15693 -14812 -34256 -41195 -45653 -31174 -32475 -42161 -40487 -81859 -96548 -84402
16010h4402K4831J4919L4560K1014k0461l323j663K8819L8969K012j4889p957
$$ -84402 -59571 -44652 -10092 10922 -9539 -12862 -14525 14294 53263 55275 40386 32429
15998C2429J06m9806j5353J3674q328K629j2156j037l323J2627J2372j411O733
$$ 32429 32535 -17271 -32624 -18950 -27278 -24649 -36805 -37842 -41165 -28538 -16166 -17577 -10844
15985a0844J8703M8555r049l0898k2248k0264k0501L251M5051L37k1465j1645
$$ -10844 7859 56414 47365 16467 -5781 -26045 -46546 -43295 1756 2093 -19372 -31017
15973c1017O100M1114O412J2909K3796k2773l6025j6312J0237J2119j7751k8251
$$ -31017 -24917 16197 22609 35518 59314 36541 516 -15796 -5559 6560 -11191 -39442
15961c9442O8358N4624r267j873k7147j9000l6773J1947K521l378J296k637n055
$$ -39442 28916 83540 74273 72400 45253 26253 -10520 1427 3948 570 1866 -771 -5826
15948e826o827k7480l884N123K4120N2101O591p0840k4380j7797N7682K1381j0360
$$ -5826 -12653 -40133 -44017 -38894 -14774 37327 43918 -26922 -51302 -69099 -11417 9964 -396
15935c96O057j5495K566k96L5754L1740k8969k5026J2164Q39k051J0916k868J2176
$$ -396 5661 -9834 -7268 -7564 28190 59930 30961 5935 18099 18938 16887 27803 24935 37111
15921C7111L0712k0641k5933K8481M3720k0626o4363j198j1612r807K3873J8986
$$ 37111 67823 47182 21249 49730 93450 72824 8461 7263 -4349 -14156 9717 28703
15909B8703j965K0783K2441j9134r558n860p383j4424j2847J8593j5307J3087
$$ 28703 26738 47521 69962 50828 41270 35410 28027 13603 756 19349 4042 17129
15897A7129J2319k4332k0902j2397K4133K4696N214l4621m1500J4084K2839N2716
$$ 17129 29448 5116 -15786 -28183 -4050 20646 25860 -8761 -50261 -36177 -13338 39378
15885C9378L1732m0190l0366l8758K6447J1555J9361J0046j1243Q476o949K3955
$$ 39378 71110 30920 554 -38204 -11757 -202 19159 29205 17962 26438 19489 43444
15873D3444L7707j632k8242j4423k6747k8112j5346J4368J4191L0858k3813J756
$$ 43444 81151 79519 51277 36854 10107 -18005 -33351 -18983 -4792 26066 2253 4009
15861D009J603J9906P460o949l1259j9431K0042O558J398j0002J707j6866j3200
$$ 4009 5612 25518 32978 26029 -5230 -24661 -4619 1939 3337 -6665 -4958 -21824 -35024
15848c5024J795Q021L2379r79K459j8789M0828o973j8516L2268K5985k8250l6840
$$ -35024 -33229 -25208 7171 6192 8651 -10138 30690 23717 5201 37469 63454 35204 -1636
15835a636r466K5035K5584j6985m3069J0717J0930M478j2696K6486J6810K921
$$ -1636 -11102 13933 39517 22532 -20537 -9820 1110 5588 -7108 19378 36188 39109
15823C9109J3318J342m5634r489O736J6183O73l8218O654L532l6474O853j515
$$ 39109 52427 53769 8135 -1354 5382 21565 22238 -15980 -9326 -5794 -42268 -35415 -36930
15810c6930J9321j8087n448j734k3425K1395q18K8360L4086J1122J4983q951P891
$$ -36930 -17609 -35696 -41144 -42878 -66303 -44908 -45726 -17366 16720 27842 42825 33874 41765
15797D1765J9459o338l2002k0583K1312J883L750r594j3599j8430K120K9753M1349
$$ 41765 61224 54886 22884 2301 23613 25496 29246 19652 6053 -12377 -10257 19496 60845
15784F0845j4418n0972j8663K0202q19j2939k8707k7461J5744J3482K2787R934
$$ 60845 46427 -4545 -23208 -3006 -3825 -16764 -45471 -72932 -57188 -43706 -20919 -10985
15772a0985P71J2376K4076k0390k6748P0L0458J7109Q255j1539N378J7462L6784
$$ -10985 -10214 2162 26238 5848 -20900 -20830 9628 26737 34992 23453 28831 46293 83077
15759H3077R813n9693n0903J7563q860L370q692N842J1158j0501P877k2235j4911
$$ 83077 92890 33197 -17706 -143 -9003 -5633 -14325 -8483 2675 -7826 51 -22184 -37095
15746c7095j4979j3631J6969K679K7112J2221M002k129k6420K9810J2299K425
$$ -37095 -52074 -65705 -48736 -46057 -18945 -6724 -2722 -4851 -31271 -1461 10838 13263
15734A3263P257n5266j9915L8085k852P626k254K754k1627J51o505j7959K6192
$$ 13263 20520 -34746 -54661 -16576 -19428 -11802 -14056 -11302 -32929 -32778 -39283 -57242 -31050
15721c1050L0743l87j6961J8352k3977l4748L673L8653L0583j5744j05L599k6
$$ -31050 -307 -694 -17655 697 -23280 -58028 -54355 -15702 14881 -863 -968 2631 2605
15708B605n51M9327K4841m0143l6081k8895K0261j3494j2833J3000J2706J6480
$$ 2605 2054 51381 76222 36079 -2 -28897 -8636 -22130 -34963 -21963 -9257 7223
15696G223j000R64N780M483P916l1772k2845k9388K678M8270K737j7230k9l06
$$ 7223 6223 7187 12967 17450 25366 -6406 -29251 -58639 -55961 -7691 -4954 -22184 -22213 -22519
15682b2519k6101k059J0987m816j5004j572J624K3646j0040l895j0447K2808J7195
$$ -22519 -48620 -50679 -39692 -44508 -59512 -61084 -59460 -35814 -45854 -49749 -60196 -37388 -20193
15669b0193J2248j0499k2780j4640J2095N446m315K2970M1491J8697K0467p377
$$ -20193 -7945 -18444 -41224 -55864 -43769 -38323 -42638 -19668 21823 40520 60987 53610
15657E3610k8311j0822j1123l7276Q001N2226r277N64K3066J3217l5536j8307
$$ 53610 25299 14477 3354 -33922 -25921 26305 17028 17592 40658 53875 18339 32
15645C2k6670j591P563k8094J2024J9796L2425K2768m522n990J1347k8365j965
$$ 32 -26638 -28229 -20666 -48760 -36736 -16940 15485 38253 33731 27741 39088 10723 8758
15632H758K8930k1086m5149j6170L0249K6057L0760K3902k0781m4167n514l7711
$$ 8758 37688 16602 -28547 -44717 -14468 11589 42349 66251 45470 1303 -4211 -41922
15620d1922J8228M3319m348j9181J0582J8154L4347J078j1094n133l1397j6240
$$ -41922 -23694 19625 15277 -3904 6678 24832 59179 60257 49163 44030 12633 -3607
15608c607J358r079k3406q817K2172L0331r099k3151J8117K304q095J4876N0902
$$ -3607 -2249 -11328 -34734 -43551 -21379 8952 -147 -23298 -5181 -2877 -10972 3904 54806
15595E4806j8511m4318k9149j1201n295M513j6752q767j4437J5338j4390N648
$$ 54806 36295 -8023 -37172 -48373 -53668 -49155 -65907 -74674 -89111 -73773 -88163 -82515
15583h2515J0755L2713K6378R562j8726j5377k392L817K2148Q49j2180P538L4357
$$ -82515 -71760 -39047 -12669 -3107 -21833 -37210 -39602 -35785 -13637 -12788 -24968 -17430 16927
15570A6927k3196J7587K6621m3041M667M5219j2845m3896j4359J4654J180Q136
$$ 16927 -6269 11318 37939 -5102 -435 44784 31939 -11957 -26316 -11662 -10482 -2346
15558b346K0464j0402j4734j3660J1139J8407j8128l0710n198p22O764J5668K3109
$$ -2346 18118 7716 -7018 -20678 -9539 8868 -9260 -39970 -45168 -45890 -39126 -23458 -349
15545c49J8291j5722j3361M811l2570l2126K1320Q966K655R231R551M9113R845
$$ -349 17942 2220 -11141 -6330 -38900 -71026 -49706 -40740 -38085 -28854 -19303 29810 39655
15532C9655k0018l409O510N33J792o774j4792k969K3355J8081l337l2326l3956
$$ 39655 19637 16228 22738 23271 25063 18289 3497 528 23883 41964 38627 6301 -27655
15519b7655L695k809k0723M269J0999M5309j5137j8902j0679r286L3767L280K5401
$$ -27655 -23960 -26769 -47492 -43223 -32224 13085 -2052 -20954 -31633 -40919 -7152 -3872 21529
15506B1529k55j1003q589L5995L1937k0634l3591j3945O447J1615J1666K0951
$$ 21529 21274 10271 1682 37677 69614 48980 15389 1444 7891 19506 31172 52123
15494E2123j1187L799q806j3771k4748L196J3640J3581J3455j7381k0586m028
$$ 52123 40936 44735 35929 22158 -2590 606 14246 27827 41282 23901 3315 -713
15482g13M1903l700m9282j8401J0628P018m418q312L2325n469k8499J6340J7767
$$ -713 41190 37490 -11792 -30193 -19565 -12547 -16965 -25277 7048 1579 -26920 -10580 7187
15469G187K2421r291r654n453n0278l7907K1175L3466M181J5374R69O053J5156
$$ 7187 29608 20317 10663 5210 -45068 -82975 -61800 -28334 -24153 -8779 -7810 -1757 13399
15456A3399r106M0061j5361k5781K6503k0610k4483J8370o325K356r973K4721
$$ 13399 4293 44354 28993 3212 29715 9105 -15378 2992 -3333 -977 -10950 13771
15444A3771N3975j1831m7936j9031k6962R241O079k821K1017L2206q073N767j9081
$$ 13771 67746 55915 7979 -11052 -38014 -28773 -22694 -25515 -4498 27708 19635 25402 6321
15431F321m8622m895J5604J6351J9741m883k4585L652N6098K0776n335l0165m5447
$$ 6321 -42301 -47196 -31592 -15241 4500 -383 -24968 -21316 34782 55558 50223 20058 -25389
15418b5389K028K4602L7088l179l6774n006P52L370J1245J4779o688m7357l6220
$$ -25389 -23361 1241 38329 35150 -1624 -6630 -5878 -2508 8737 23516 16828 -30529 -66749
15405f6749M7984N3438K515n0229J1124M1518j7369m5961k8417q769J1782K1925
$$ -66749 -18765 34673 37188 -13041 -1917 39601 22232 -23729 -52146 -60915 -49133 -27208
15393b7208M0063J6657J079N858l8870J21K3524Q702K395N519m68l0630k0911
$$ -27208 12855 29512 30591 36449 -2421 -2300 21224 29926 32321 37840 37372 6742 -14169
15380a4169j8628K5278N0017k4346j1885j565j485K7410N5501j5335l9047j8899
$$ -14169 -32797 -7519 42498 18152 6267 4702 3217 30627 86128 70793 31746 12847
15368A2847o600m5646j1951M068L6441j2561J2646R331R783l280j954K8195L5452
$$ 12847 6247 -39399 -51350 -47282 -10841 -23402 -10756 -1425 8358 5078 3124 31319 66771
15355F6771J0044j2665l626k211j7887j5313P542j3461j5336K3276K3746l744
$$ 66771 76815 64150 60524 58313 40426 25113 32655 19194 3858 27134 50880 47136
15343D7136j5844j2681q072p694j2162M3582J2092k8032k3632j1094J3557n2968
$$ 47136 31292 18611 10539 2845 -9317 34265 46357 18325 -5307 -16401 -2844 -55812
15331e5812p682K7805J4995K4382J982j3113l5539j327K0495o4L5894P88J4220
$$ -55812 -63494 -35689 -20694 3688 5670 -7443 -42982 -44309 -23814 -23878 12016 12804 27024
15318B7024O016p428k1059k2136j7962O953L1545j9989K2731k7377l0681l629
$$ 27024 33040 25612 4553 -17583 -35545 -28592 2953 -17036 5695 -21682 -52363 -55992
15306e5992R727L3939q851N149l19p778j5747j470K6957M9085J4436j0341o972
$$ -55992 -46265 -12326 -21177 -16028 -16347 -24125 -39872 -41342 -14385 34700 49136 38795 31823
15293C1823m030k6732p581k6357l366J9141L373j1225R650Q325J4379L088l637
$$ 31823 27793 1061 -6520 -32877 -36243 -17102 -13729 -24954 -15304 -6979 7400 10488 6851
15280F851K6936K4810k810L226o55j2558o2866l4524L0122J8666N190k1509j2247
$$ 6851 33787 58597 55787 59013 58358 45800 -17066 -51590 -21468 -2802 2388 -19121 -31368
15267c1368k0615J8287J5397J8636J2516p691J0052O620p424o061J7757J2610
$$ -31368 -51983 -33696 -18299 337 12853 5162 15214 21834 14410 8349 26106 38716
15255C8716k791l0247m4871r328L215K1517J1359j4476l7616k78O553J3383N61
$$ 38716 35925 5678 -39193 -48521 -45306 -23789 -12430 -26906 -64522 -64800 -58247 -44864 -44303
15242d4303J5339K0225M4391R85m5503l198J5019j0003L3947L7j9650k4562L284
$$ -44303 -28964 -8739 35652 36637 -8866 -12064 2955 -7048 26899 26936 7286 -17276 -13992
15229a3992l0987r60K0691O415j3167m3683k7K4736J9236L0920J2702l3563J171
$$ -13992 -44979 -45939 -25248 -18833 -32000 -75683 -75710 -50974 -31738 -818 11884 -21679 -20508
15216b0508q866P158L5803q145k865P544q208r696L8127j0995k2869O491K3141
$$ -20508 -29374 -22216 13587 5442 2577 10121 1913 -7783 30344 19349 -3520 2971 26112
15203B6112k238o479K3731j3486l7261K378L543Q163l932j0711n053M684J7581
$$ 26112 23874 17395 41126 27640 -9621 -7243 -3700 4463 531 -10180 -15233 -10549 7032
15190G032j1695P375K6967k1137k4305K6394k95o112l0622j2554J1766r689J9764
$$ 7032 -4663 2712 29679 8542 -15763 10631 10336 4224 -26398 -38952 -27186 -36875 -17111
15177a7111Q707K6410Q054J2878j4332j7440K3675K931j0814K937j951Q619k1238
$$ -17111 -8404 18006 26060 38938 24606 7166 30841 33772 22958 25895 23944 32563 11325
15164A1325m6604M290n093r911Q267J8020J0478J3714j7576k523J8877K6847m0607
$$ 11325 -35279 -30989 -36082 -45993 -37726 -19706 -9228 4486 -13090 -15613 3264 30111 -10496
15151a0496k3086J1485J7920J3212M716m432r969N006k5311j4675K6869L3137
$$ -10496 -33582 -22097 -4177 9035 13751 9319 -650 4356 -20955 -35630 -8761 24376
15139B4376J0599L959n401J2251j3267l7921j0519K1185M1296k4279k1618J4232
$$ 24376 34975 38934 33533 45784 32517 -5404 -15923 5262 46558 22279 661 14893
15127A4893P081j3121k9463j8402L4142P804l7328j0856K1430L195J4399K1577
$$ 14893 21974 8853 -20610 -39012 -4870 2934 -34394 -45250 -23820 -20625 -6226 15351
15115A5351j6360n3891M0487N3892k8l8342J3285j6081J3650O844m403j5859k2007
$$ 15351 -1009 -54900 -14413 39479 39451 1109 14394 -1687 11963 18807 14404 -1455 -23462
15102b3462j7545L0282K0531m349O543l0741M601L1045L1238Q854n660L313k2760
$$ -23462 -41007 -10725 9806 5457 12000 -18741 -14140 16905 48143 56997 51337 54650 31890
15089C1890l2804k0196j5701j5937J3116N8774O893j500J300r959k1792Q430J3540
$$ 31890 -914 -21110 -36811 -52748 -39632 19142 26035 24535 25835 15876 -5916 2514 16054
15076A6054q515l6262j8397k1854P137J7112O067K1207J1862K2198L538j6595
$$ 16054 7539 -28723 -47120 -68974 -61837 -44725 -38658 -17451 -5589 16609 20147 3552
15064C552J1859R838k8663j0697j1486J5148J3320R346L1833r293m799q655n626
$$ 3552 15411 25249 -3414 -14111 -25597 -10449 2871 12217 44050 34757 29958 21303 15677
15051A5677l1709n236J8138l1425q949j0304j3032J1137J9516M801J0398K5951
$$ 15677 -16032 -21268 -3130 -34555 -43504 -53808 -66840 -55703 -36187 -31386 -20988 4963
15039D963r199L809m662J0266l2687M76J0871K3709J5446k120K5843N994k1462
$$ 4963 -4236 -427 -5089 5177 -27510 -27034 -16163 7546 22992 20872 46715 52709 31247
15026C1247k3013Q657l576J3867J5332j3861p482j7843k02k0805j7411k6320j5712
$$ 31247 8234 16891 13315 27182 42514 28653 21171 3328 3126 -17679 -35090 -61410 -77122
15013g7122K1026M2215M3895j4932l8114p390n60l983j3074J802K8482J3478j4785
$$ -77122 -56096 -13881 30014 15082 -23032 -30422 -30982 -34965 -48039 -46237 -17755 -4277 -19062
15000a9062k8606Q132M5502K279k0799m192J8191J6006j1909l0087j5835m85K4229
$$ -19062 -47668 -39536 5966 8245 -12554 -16746 1445 17451 5542 -24545 -40380 -40865 -16636
14987a6636P457j4827j1804M072j8812K1132m565l5089M8762M649L8459O124K1675
$$ -16636 -9179 -24006 -35810 -31738 -50550 -29418 -33983 -69072 -20310 -15661 22798 28922 50597
14974E0597j681j1216o977L680p358J4030j7363l5647L587K8293j848j9059m536
$$ 50597 48916 37700 30723 34403 27045 41075 23712 -11935 -8348 19945 18097 -962 -5498
14961e498J4778K5992K2512J5814Q746J641o1245l0235K7294M804l968j2959J9091
$$ -5498 9280 35272 57784 73598 82344 83985 22740 -7495 19799 24603 20635 7676 26767
14948B6767j7149n7987k9349M052M5427M2366j682j5278J6938K5578j7056l359
$$ 26767 9618 -48369 -77718 -73666 -28239 14127 12445 -2833 14105 39683 22627 19268
14936A9268J4600K914n75p648k3980j261L1305J0469l3485o052k5472J0152K6655
$$ 19268 33868 36782 36207 28559 4579 3318 34623 45092 11607 5555 -19917 -9765 16890
14923A6890j6051j3781P145k0937k9343M174J1901j702P104O408L2695L0808k3135
$$ 16890 839 -12942 -5797 -26734 -56077 -51903 -40002 -41704 -34600 -28192 4503 35311 12176
14910A2176k7958J30O328J0265J2767m132k4076M894M6446n104m1720k0741q313
$$ 12176 -15782 -15652 -9324 941 13708 9576 -14500 -9606 36840 31736 -9984 -30725 -39038
14897c9038j1459O264o168N809L3508K8856K4574M146N728j1331L1664N986l36
$$ -39038 -50497 -44233 -50401 -44592 -11084 17772 42346 46492 52220 40889 72553 78539 78203
14884G8203l4356k8308j014r173J3226P782L743m3764J608L0293j569n5569j5707
$$ 78203 43847 15539 14525 5352 18578 26360 30103 -13661 -12053 18240 16671 -38898 -54605
14871e4605R13L0270Q488j9193K2498L2844j5036o46j3381j4443n327J7043n166
$$ -54605 -53692 -23422 -14934 -34127 -11629 21215 6179 5533 -7848 -22291 -27618 -10575 -15741
14858a5741k0452J4939K469j8887K0004j9874N59L5639J3003q452n149l974K5791
$$ -15741 -36193 -21254 -18785 -37672 -17668 -37542 -36983 -1344 11659 3207 -1942 -5916 19875
14845A9875J2091J3141k551k6797m3689j5520O038J8602K474k9093j175J5309
$$ 19875 31966 45107 42556 15759 -27930 -43450 -37412 -18810 -16336 -45429 -46604 -31295
14833c1295J7044M1530P039l7110m0507J7792J281N23l6931J3564K0290j6991
$$ -31295 -14251 27279 34318 -2792 -43299 -25507 -24226 -23703 -60634 -47070 -26780 -43771
14821d3771j4428J595J024Q272K992j245K6026j8001j5142l973Q763K4657J8290
$$ -43771 -58199 -56604 -55580 -47308 -44316 -45561 -19535 -37536 -52678 -56651 -47888 -23231 -4941
14808d941n317k3671M746K3908L0009l362j788J6150J4903l2037l2122n182J6872
$$ -4941 -10258 -33929 -29183 -5275 24734 21372 19584 35734 50637 18600 -13522 -18704 -1832
14795a832K0270K5097k2569p466l3774M959l215J8600K3089l3748k0389j2884
$$ -1832 18438 43535 20966 13500 -20274 -15315 -18530 70 23159 -10589 -30978 -43862
14783d3862J2190L6020q377J345K6863o866k1963j0659j4735J2920K992k899J1992
$$ -43862 -31672 4348 -4029 -2684 24179 17313 -4650 -15309 -30044 -17124 -14132 -17031 -5039
14770e039k674r652J0742L0005j917j1853j5531R076J3156o076j1452L857j4290
$$ -5039 -7713 -17365 -6623 23382 21465 9612 -5919 3157 16313 10237 -1215 2642 -11648
14757a1648j9691L6834p970j5883q225L7409R427J0340k1699j6027k009O838m063
$$ -11648 -31339 5495 -2475 -18358 -26583 10826 20253 30593 8894 -7133 -9142 -2304 -6367
14744f367j2002k1554l4333n451K2796K4299J1860J7678q418Q613K2064k5070
$$ -6367 -18369 -39923 -74256 -79707 -56911 -32612 -20752 -3074 -11492 -2879 19185 -5885
14732e885o382j8761j8362J6572J7078M829J2546R617K7324L000J1845j303m9728
$$ -5885 -12267 -31028 -49390 -32818 -15740 -10911 1635 11252 38576 41576 53421 52118 2390
14719B390j4623L0811j1038j7981k9694K2724J8405J324L471J6834N557l1186
$$ 2390 -12233 18578 7540 -10441 -40135 -17411 994 2318 5789 22623 28180 -3006
14707c006Q930o164j094Q429j6711J1783j7086r503l4198j314J6588N664L3135
$$ -3006 5924 -240 -1334 7095 -9616 2167 -14919 -24422 -58620 -59934 -43346 -37682 -4547
14694d547j385J1045K0736J9324N2172j4082o4523p5238k9394J3168J2058L3738
$$ -4547 -5932 5113 25849 45173 97345 83263 18740 -56498 -85892 -72724 -60666 -26928
14682b6928L5458J4428l5275n270l5536j1774L6393M7246q53M537K1100N100K2286
$$ -26928 8530 22958 -12317 -17587 -53123 -64897 -28504 18742 17889 22426 43526 48626 70912
14669G0912j7650L442L269J1816k2541R351j4976k8328n882J3240K4578j7773
$$ 70912 53262 56704 59973 71789 49248 58599 43623 15295 9413 22653 47231 29458
14657B9458k3768k9677k2279k92J930J4181J8907L022j2542j5000K0725q61r242
$$ 29458 5690 -23987 -46266 -46558 -44628 -30447 -11540 -8518 -21060 -36060 -15335 -16196 -25438
14644b5438Q642M743k0507n319O346L1462k486j4895m362j7876k7313J7559O5328
$$ -25438 -16796 -12053 -32560 -37879 -31533 -71 -2557 -17452 -21814 -39690 -67003 -49444 15884
14631A5884K5867j6252K7171o217j4311n972j0947k6677J5038J1177R455k9189
$$ 15884 41751 25499 52670 46453 32142 26170 15223 -11454 3584 14761 24216 -4973
14619d973j9075J4918K2475j8433j2726k4693J1122K2394n947K189j9676j6530
$$ -4973 -24048 -9130 13345 -5088 -17814 -42507 -31385 -8991 -14938 -12749 -32425 -48955
14607d8955O085L8723K0697J5721j4194l2444L5749m09k4324R8j8708R959K1126
$$ -48955 -42870 -4147 16550 32271 18077 -14367 21382 20973 -3351 -3253 -21961 -12002 9124
14594I124j9062k441j7432J6575k35J5870K2317P157R841j311j7911q970N138
$$ 9124 -9938 -12379 -29811 -13236 -13471 2399 24716 31873 41714 40403 22492 13522 18660
14581A8660p34J868K9249L9139m4347k4631K9016M2091k5277l7510k5261r391
$$ 18660 17926 19794 49043 88182 43835 19204 48220 90311 65034 27524 2263 -7128
14569g128q974Q578l511m4667j6913J2490K8298N5813K4462R978l1862k7987j9203
$$ -7128 -16102 -7524 -11035 -55702 -72615 -60125 -31827 23986 48448 58426 26564 -1423 -20626
14556b0626j8854o550l816J2141J2689J709q640J2969L4584M934k1970k0819j8457
$$ -20626 -39480 -46030 -49846 -37705 -25016 -23307 -31947 -18978 15606 20540 -1430 -22249 -40706
14543d0706J0332K4586J6877k2991J8327N2340K930l2309k2578K024m12j1811
$$ -40706 -30374 -5788 11089 -11902 6425 58765 61695 29386 6808 8832 8420 -3391
14531c391j3691J599L003O298J7196j1498O457O0765M7113O81m0568m4605k4262
$$ -3391 -17082 -15483 -12480 -6182 11014 -484 5973 66738 113851 114532 73964 29359 5097
14518E097K811p03l292J6004j0342l7251K265J6395k4343r986K7731K1890j1053
$$ 5097 7908 7205 3913 19917 9575 -27676 -25411 -9016 -33359 -43345 -15614 6276 -4777
14505d777m0689J1772J1053K3488k335k833J9674J8763k0243j5570K1709Q512
$$ -4777 -45466 -33694 -22641 847 -1488 -4321 15353 34116 13873 -1697 20012 28524
14493B8524r33O628k701j8876j6325j9785O661l6239K4430M7608P288m7229j9752
$$ 28524 27591 34219 31518 12642 -3683 -23468 -16807 -53046 -28616 18992 26280 -20949 -40701
14480d0701R777K3940Q192r822l3448q418J8583J3511J7022L509k8371k7138l172
$$ -40701 -30924 -6984 1208 -8614 -42062 -50480 -31897 -18386 -1364 2145 -26226 -53364 -56536
14467e6536R239K3849N075j21J5352Q916m093k0730J4293O840K5053k4329K2659
$$ -56536 -47297 -23448 -18373 -18494 -3142 5774 1681 -19049 -4756 2084 27137 2808 25467
14454B5467K9817J9167k3613k8710j6069p81o440p164l44j0237K2763n205q877
$$ 25467 55284 74451 50838 22128 6059 5278 -1162 -8326 -8670 -18907 3856 -1349 -10226
14441a0226J1956r612j6307K6854p750k1742J2962r394j1775J4774M2410r270
$$ -10226 1730 -7882 -24189 2665 -5085 -26827 -13865 -23259 -35034 -20260 22150 12880
14429A2880l5101k4428k8514J7026K1449J5573j049R305K0706K8371k1685l0849
$$ 12880 -22221 -46649 -75163 -58137 -36688 -21115 -22164 -12859 7847 36218 14533 -16316
14417a6316m41m60Q036M1329J7465k812k5462k3596k1360j4895L124M6031K6746
$$ -16316 -16757 -17217 -9181 32148 49613 46801 21339 -2257 -23617 -38512 -35388 10643 37389
14404C7389n736j609K0829l3040l9929n917O298J8185N0252J16m2949p327J5826
$$ 37389 31653 30044 50873 17833 -22096 -28013 -21715 -3530 46722 46838 3889 -3438 12388
14391A2388N513m836L1534J2637j21k7263P53p029k2422k6791j3592J042J0588
$$ 12388 17901 13065 44599 57236 57115 29852 30605 23576 1154 -25637 -39229 -38187 -27599
14378b7599J8017k4206j9116K4076J9002j2239p93j2232n420M0153K3876o309
$$ -27599 -9582 -33788 -52904 -28828 -9826 -22065 -22858 -35090 -40510 -357 23519 17210
14366A7210o797m2430j5331J5247M27j692K8561J9878J826q570j5251J540j849
$$ 17210 10413 -32017 -47348 -32101 -31674 -33366 -4805 15073 16899 8329 -6922 -5382 -7231
14353g231j8334L1240J6046l1195j0148J433o408J6084r355Q754J0815j6291M391
$$ -7231 -25565 5675 21721 -9474 -19622 -18189 -24597 -8513 -17868 -9114 1701 -14590 -10199
14340a0199J8742j672o1921k3513J8119J8445J9680J83M865K1608r304J3752K1828
$$ -10199 8543 6871 -55050 -78563 -60444 -41999 -22319 -22136 -17271 4337 -4967 8785 30613
14327C0613o443N230K822Q04k3841o189J4339M451J2684k1869J0931l5028k8297
$$ 30613 24170 29400 32222 33026 9185 2996 17335 21786 34470 12601 23532 -11496 -39793
14314c9793J4529Q150L5230K648r959n275j2875j5543l4199J5298K4052j1714
$$ -39793 -25264 -17114 18116 20764 10805 5530 -7345 -22888 -57087 -41789 -17737 -29451
14302b9451L059J3688q552l47L2757O4296J4071k2136k2702l5473p583L451k0233
$$ -29451 -26392 -12704 -21256 -21603 11154 75450 89521 67385 44683 9210 1627 5078 -15155
14289a5155L693j6530j7180n966J1038J2175R177K5147J5878k8625O349M2758
$$ -15155 -11462 -27992 -45172 -51138 -40100 -27925 -18748 6399 22277 -6348 1 42759
14277D2759K3313k5140n813K4670j0312q226n827k343o007l2213R111J5514j7023
$$ 42759 66072 40932 35119 59789 49477 41251 35424 33081 27074 -5139 3972 19486 2463
14264B463j8391J8444j2902n109p913m1333j0595K2808L1980L2061j1873n3519
$$ 2463 -15928 2516 -10386 -15495 -23408 -64741 -75336 -52528 -20548 11513 -360 -53879
14252e3879l5543p184K1035L8771K6744o378M6836J5667k7032j519k4052j5293
$$ -53879 -89422 -96606 -75571 -36800 -10056 -16434 30402 46069 19037 17518 -6534 -21827
14240b1827O688p935l9719J9773K7124J5211k474k155J4597O791L1474K0777l0479
$$ -21827 -15139 -23074 -62793 -43020 -15896 -685 -3159 -5314 9283 16074 47548 68325 37846
14227C7846j4967M588k003J1880K050j9838M141k0772k2012j6752j3122J939M420
$$ 37846 22879 27467 25464 37344 39394 19556 23697 2925 -19087 -35839 -48961 -47022 -42602
14214d2602K4624K4385l847J635r331L7638j6390l8549k2898R123K4420K2533
$$ -42602 -17978 6407 2560 4195 -5136 32502 16112 -22437 -45335 -36212 -11792 10741
14202A0741n2896m7732L1080K4496K734n467j7845J061J8366M4006K0903j9678
$$ 10741 -42155 -89887 -58807 -34311 -31577 -37044 -54889 -53828 -35462 8544 29447 9769
14190I769j3726j7082M74j1488J2802J053j9399L8617j411k3997m420J4514L7823
$$ 9769 -3957 -21039 -20565 -32053 -19251 -18198 -37597 1020 -391 -24388 -28808 -14294 23529
14177B3529r929j1517K1642j0384l2292j4522k262l1M3042J2524O46j5173K6366
$$ 23529 13600 2083 23725 13341 -18951 -33473 -35735 -35766 7276 19800 20446 5273 31639
14164C1639l8073n9035K656K0259M1343n210j1712j493k6890k9941K0868J9499
$$ 31639 -6434 -65469 -62813 -42554 -1211 -6421 -18133 -19626 -46516 -76457 -55589 -36090
14152c6090J3286P36J4141J7916J7433r213O008K9976K8736l4965l1818K9549
$$ -36090 -22804 -22068 -7927 9989 27422 18209 24217 54193 82929 47964 16146 45695
14140D5695J0709j9768m1087k9223j2880J9259R683q411k3615Q902R154O763j687
$$ 45695 56404 36636 -4451 -33674 -46554 -27295 -17612 -26023 -49638 -40736 -31582 -24819 -26506
14127b6506j8621j5711R108P100j2342k6834J0026J3513L2271K0718j599J5388
$$ -26506 -45127 -60838 -51730 -44630 -56972 -83806 -73780 -60267 -27996 -7278 -8877 6511
14115F511j7724L7945p530k8770L914K085J3122n617l6804N17J6442p646J8603
$$ 6511 -11213 26732 19202 -9568 -5654 -3569 9553 3936 -32868 -32351 -15909 -23555 -4952
14102d952J2211K9430J7613J0829r589k95j9270k1367q278q732j9164J298L070
$$ -4952 7259 36689 54302 65131 55542 55247 35977 14610 6332 -2400 -21564 -20266 -17196
14089a7196K3135J8331j4800j5472O97J7878K3253l1120l0827r75J4503l46R475
$$ -17196 5939 24270 9470 -6002 -5305 12573 35826 4706 -26121 -27096 -12593 -12939 -3464
14076c464J5037Q99l498P007j9131j2112J8632J4508j9641Q742k16K3377l359
$$ -3464 11573 12472 8974 15981 -3150 -15262 3370 17878 -1763 6979 6763 30140 26781
14063B6781m6836J0801j8374l6843K0789M3354J3458N816j2241p780k1304l9345
$$ 26781 -20055 -9254 -27628 -64471 -43682 -328 13130 18946 6705 -1075 -22379 -61724
14051f1724J5725M3337N7035j0549j8169l3023n514P117K0138P247K460k5919
$$ -61724 -45999 -2662 54373 43824 25655 -7368 -12882 -5765 14373 21620 24080 -1839
14039a839k7637K3812l435j0561R709L3245j9936n652L0119l9613j2909L507r391
$$ -1839 -29476 -5664 -9099 -19660 -9951 23294 3358 -2294 27825 -11788 -24697 -21190 -30581
14026c0581n951K0230J637j4209R765r043j8880M5033K0374k0713q111k4276q804
$$ -30581 -36532 -16302 -14665 -28874 -19109 -28152 -47032 -1999 18375 -2338 -10449 -34725 -43529
14013d3529J4794M0903o182n435r587j9837j6285k9643Q648K5720M054L1408M0811
$$ -43529 -28735 12168 5986 551 -9036 -28873 -45158 -74801 -66153 -40433 -36379 -4971 35840
14000C5840k979K113P440k014m2612k3473l27K6721K0746m182j9013P968N080
$$ 35840 32861 34974 42414 40400 -2212 -25685 -26012 709 21455 17273 -1740 6228 11308
13987A1308p642p506j5358n2679k655K0538Q857L5647J9498J2714O987J285k126
$$ 11308 3666 -3840 -19198 -71877 -74532 -53994 -45137 -9490 10008 22722 29709 30994 28868
13974B8868k2286n444Q311q726o26k7846K578P555N253j00R415J2059Q634K2556
$$ 28868 6582 1138 9449 723 97 -27749 -25171 -17616 -12363 -12463 -3048 9011 17645 40201
13960D0201j4679k5956j4218J0085R953o446J0103R944j6007j8168r230M378l6584
$$ 40201 25522 -434 -14652 -4567 5386 -1060 9043 18987 2980 -15188 -24418 -20040 -56624
13947e6624j4023K1408N3715L8092j273j2780l3237j4359n279J9244k8291m0715
$$ -56624 -70647 -49239 4476 42568 41295 28515 -4722 -19081 -24360 -5116 -33407 -74122
13935g4122j6002Q66K1995N011O577J1409J6990o528P259J7837K1839j8424j4463
$$ -74122 -90124 -89258 -67263 -62252 -55675 -44266 -27276 -33804 -26545 -8708 13131 -5293 -19756
13922a9756k2024j9875L04Q504J8183l016J6348J2008j125j9786j7240J3849M4226
$$ -19756 -41780 -61655 -61351 -52847 -34664 -37680 -21332 -9324 -10449 -30235 -47475 -33626 10600
13909A0600K0971l440p023M881j5950k4357K5753J1863j9613n350M729m802P932
$$ 10600 31571 28131 21108 25989 10039 -14318 11435 23298 3685 -1665 3064 -1738 6194
13896F194j1097j9668J3079L0952M8550J1854j2288J5506q359r992J2274j6982
$$ 6194 -4903 -24571 -11492 19460 68010 79864 67576 83082 74723 64731 77005 60023
13884F0023j4616j5623j7599J306Q834M5783p601k4299l8021q962O271R372o732
$$ 60023 45407 29784 12185 13491 22325 68108 60507 36208 -1813 -10775 -4504 4868 -1864
13871a864K6684J1680Q79R585l5642q505K4846O794j8775k1071J9599K3516l1738
$$ -1864 24820 36500 37379 46964 11322 2817 27663 34457 15682 -5389 14210 37726 5988
13858E988q265N049L654q96o523J2749k4830l4609L5658L4972M034o914j2595
$$ 5988 -2277 2772 6426 5530 -993 11756 -13074 -47683 -12025 22947 26981 20067 7472
13845G472j6198j1313J4535L691J5303K0465j0953k2396j8556L240k1619L711
$$ 7472 -8726 -20039 -5504 -1813 13490 33955 23002 606 -17950 -14710 -36329 -32618
13833c2618K2342Q93j7041L4167K8077J2316k205k2788k4846k5992q058M658N242
$$ -32618 -10276 -9383 -26424 7743 35820 48136 45931 23143 -1703 -27695 -35753 -31095 -25853
13820b5853K0815j9459j2559q189j1570q8P965L0848L3282j3226J0032j7403K7043
$$ -25853 -5038 -24497 -37056 -45245 -56815 -56903 -48938 -18090 15192 1966 11998 -5405 21638
13807B1638j8985k6915R391K4808R853k1226J0499L398o864o581K7369L9178j1851
$$ 21638 2653 -24262 -14871 9937 19790 -1436 9063 12461 5597 -984 26385 65563 53712
13794E3712l0845J4964J7543r690j3898k4128o937K6576K8577k436k2333l7035
$$ 53712 22867 37831 55374 45684 31786 7658 721 27297 55874 53438 31105 -5930
13782e930k9148N73J9702J7018p834j2090j4243k8357R928J1897O885K5009o477
$$ -5930 -35078 -34505 -14803 2215 -5619 -17709 -31952 -60309 -50381 -38484 -31599 -6590 -13067
13769a3067k2622O864M185o102R461J3236j5865Q043L3031l8924l223o009m695
$$ -13067 -35689 -28825 -24640 -30742 -21281 -8045 -23910 -15867 17164 -21760 -24983 -30992 -35687
13756c5687k943Q521L1105J1871j8567l10L8286K2350k3382k1312k3204k0232
$$ -35687 -38630 -30109 996 12867 -5700 -6010 32276 54626 31244 9932 -13272 -33504
13744c3504j3980J276O27Q598J78j5982o155M3067J2363J9309j1398N064j2073
$$ -33504 -47484 -46208 -45581 -36983 -36805 -52787 -58942 -15875 -3512 15797 4399 9463 -2610
13731b610l6296m573L3267L9808r601l7509k8393K0166J1584m041k1866j0310
$$ -2610 -38906 -43479 -10212 29596 19995 -17514 -45907 -25741 -14157 -18198 -40064 -50374
13719e0374o83K7357r145j4028Q763K4003M9539J3871k9352M848J6197K962o979
$$ -50374 -51057 -23700 -32845 -46873 -38110 -14107 35432 49303 19951 24799 40996 43958 36979
13706C6979l3459m8324o180M8089O580j0503l3655j5501q328O908J9245K1463
$$ 36979 3520 -44804 -50984 -2895 3685 -6818 -40473 -55974 -64302 -57394 -38149 -16686
13694a6686n289K3882M0688J038M830j5434k8935R478p187l7563O61J6043k318
$$ -16686 -21975 1907 42595 43633 48463 33029 4094 13572 6385 -31178 -30517 -14474 -16792
13681a6792r775o068K1562N6191J0020r094m738k7583p560K8952k9587l9731l6810
$$ -16792 -26567 -32635 -11073 45118 55138 46044 41306 13723 6163 35115 5528 -34203 -71013
13668g1013K5573N218j6840k5816O937K4353J6507p914r903j546M783J4731j6878
$$ -71013 -45440 -40222 -57062 -82878 -75941 -51588 -35081 -42995 -52898 -54444 -49661 -34930 -51808
13655e1808R489N0922j5997O862M341K05J8826r97l2155k1195k147K6671j7778
$$ -51808 -42319 8603 -7394 -532 3809 4014 22840 21843 -10312 -31507 -33654 -6983 -24761
13642b4761M027j1390k25K2933J3262Q75J8158k1378J330J8299l370o510Q949
$$ -24761 -20734 -32124 -32349 -9416 3846 4721 22879 1501 2831 21130 17760 11250 20199
13629B0199M051J5558M915P998l4615R14J0563j3065l7618l400J4772J3426q50
$$ 20199 24250 39808 44723 52721 18106 19020 29583 16518 -21100 -24500 -9728 3698 2848
13616B848j9353M762J5281J9571q566j432K0501k2372o927J6073k2356J0714K8491
$$ 2848 -16505 -11743 3538 23109 14543 13111 33612 11240 4313 20386 -1970 8744 37235
13603C7235k5524J823J1597L0387r578L527j5793j7858k2876j4827K972j9286
$$ 37235 11711 13534 25131 55518 45940 49467 33674 15816 -7060 -21887 -18915 -38201
13591c8201P460M1752L5622J7770j4761j4377o2611q907K2128q86l645N933L1827
$$ -38201 -30741 11011 46633 64403 49642 35265 -27346 -36253 -14125 -15011 -18656 -12723 19104
13578A9104Q600j2316k688j9135P763k837j8867m0172J2583M2409k0370l0667
$$ 19104 27704 15388 12700 -6435 1328 -1509 -20376 -60548 -47965 -5556 -25926 -56593
13566e6593j2816K6387j147M040O788K2136K8248K6465R650m800k6485m0149J5355
$$ -56593 -69409 -43022 -44169 -40129 -33341 -11205 17043 43508 53158 48358 21873 -18276 -2921
13553b921N901M845j2319J2650J2215L3415j5441m9712J4193J1758J59L0691K3472
$$ -2921 2980 7825 -4494 8156 20371 53786 38345 -11367 2826 14584 14743 45434 68906
13540F8906j0025k8769J2089K1863L805j5921l7542j6780l530N770m8282k3422
$$ 68906 58881 30112 42201 64064 67869 51948 14406 -2374 -5904 -134 -48416 -71838
13528g1838M1157J3859j6780m964j5276k1049L2673J7135K1929K9823Q987k6765
$$ -71838 -30681 -16822 -33602 -38566 -53842 -74891 -42218 -25083 -3154 26669 35656 8891
13516H891K0405Q821Q655J612J1490l2754k7535O507R530Q457r710k7335K2868
$$ 8891 29296 38117 46772 48384 59874 27120 -415 6092 15622 24079 14369 -12966 9902
13503I902O30J6173K3138Q451j3147j8106j1777j5999M425N865J6079j1095l2985
$$ 9902 10532 26705 49843 58294 45147 27041 15264 -735 3690 9555 25634 14539 -18446
13490a8446l1901j0312J2388M5775O66j8546J312K8335P145J9386Q567k1469o633
$$ -18446 -50347 -60659 -48271 -2496 -1830 -20376 -19064 9271 16416 35802 44369 22900 16267
13477A6267R350j4637k6430J009o11J4359m4873p115J4434J1647Q094N931j808
$$ 16267 25617 10980 -15450 -14441 -15052 -693 -45566 -52681 -38247 -26600 -18506 -12575 -14383
13464a4383N208J8882K3220J718K3332j4304r0564k4525K1610L4959j2617J6880
$$ -14383 -9175 9707 32927 34645 57977 43673 -46891 -71416 -49806 -14847 -27464 -10584
13452a0584K0304J4744J95J6091k5939k6550K759K6046M388k8058j56k0006K0619
$$ -10584 9720 24464 24659 40750 14811 -11739 -8980 17066 21454 -6604 -6760 -26766 -6147
13439f147r822j2042Q541r669J8854J6744j1898j5566J830K0097O192p321M752
$$ -6147 -15969 -28011 -19470 -29139 -10285 6459 -5439 -21005 -19175 922 7114 -207 4545
13426D545J5811j029k0842r5L0678Q402k7493L086m3433l4534L0841J3156j297
$$ 4545 20356 19327 -1515 -1610 29068 37470 9977 13063 -30370 -64904 -34063 -20907 -22204
13413b2204N972K4707M110L5415m088j1423k8131k9112m896J5196J677M1123p955
$$ -22204 -16232 8475 12585 48000 43912 32489 4358 -24754 -29650 -14454 -12777 28346 20391
13400B0391j2666q31M447J0759k590j1789j3042J975J0505M298n130r903K9249
$$ 20391 7725 6894 11341 22100 19510 7721 -5321 -3346 7159 11457 6327 -3576 25673
13387B5673K2816J59k923j1770j0296m090K0870j3468k2304j3751J1190j800j0225
$$ 25673 48489 48648 45725 33955 23659 19569 40439 26971 4667 -9084 2106 306 -9919
13374i919p85K9307j8956j6736J293j1142L708K2566J0907R684k8617o328k010
$$ -9919 -10704 18603 -353 -17089 -15796 -26938 -23230 -664 10243 19927 -8690 -15018 -17028
13361a7028k631j8353o457R232L736L0732Q465M4626r246l2834m028K8711q01
$$ -17028 -19659 -38012 -44469 -35237 -31501 -769 7696 52322 43076 10242 6214 34925 34124
13348C4124J566J8690l950k6856r393J6914l018j853J6007k2400n942K7810j5202
$$ 34124 35690 54380 50430 23574 14181 31095 28077 26224 42231 19831 13889 41699 26497
13335B6497k3557k3929j8550J8050L5431O284m0080J6491Q71J583k811J4163k099
$$ 26497 2940 -20989 -39539 -21489 13942 20226 -19854 -3363 -2492 -909 -3720 10443 8344
13322H344N129N033k5241J1355J049n37k9700k1971N187m654J9305M6198j3282
$$ 8344 13473 18506 -6735 4620 5669 5132 -24568 -46539 -41352 -46006 -26701 19497 6215
13309F215O859K7534K8161k250k690q478q041j4763J715K110m1429m2545J1655
$$ 6215 13074 40608 68769 66519 63829 55351 47310 32547 34262 36372 -5057 -47602 -35947
13296c5947K6190k0110L237K3997j5702O471K1044J9832j4328l5962l973K7521
$$ -35947 -9757 -29867 -26630 -2633 -18335 -11864 9180 29012 14684 -21278 -25251 2270
13284B270J934j5343o55J2367O986j1079K156j6145j1666L835L5153k8250j5749
$$ 2270 4204 -11139 -11794 573 7559 -3520 -1364 -17509 -29175 -25340 9813 -18437 -34186
13271c4186J6907N3466K9467l1350l5921j0754k0048k264j6950J2750k817K4922
$$ -34186 -17279 36187 65654 34304 -1617 -12371 -32419 -34683 -51633 -38883 -41700 -16778
13259a6778n341K9297K2303q758J3203m784L573q220k7588O232O6461K8007k0715
$$ -16778 -22119 7178 29481 20723 33926 29142 32715 24495 -3093 3139 69600 97607 76892
13246G6892J1093L4162N9242Q1799P9979J68628K72015L64117K51371j6953j02750
$$ 76892 87985 122147 181389 263188 343167 511795 783810 1147927 1399298 1382345 1279595
13235A279595q4299k19895k61815j90605j12280p8366p7227k3221n371k5817m9319
$$ 1279595 1195296 975401 713586 522981 410701 332335 255108 231887 226516 200699 151380
13224A51380k5797K073j4656K1302n864j0433n668l8304l6507l9119n221K4826
$$ 151380 125583 127656 113000 134302 128438 118005 112337 74033 37526 -1593 -6814 18012
13212A8012J9175L28L2162K6966k7231k749n418O138k9370n4076k4795k2061K9410
$$ 18012 37187 37515 69677 96643 69412 66663 61245 67383 38013 -16063 -40858 -62919 -33509
13199c3509O2133r94l4157p281J4213K699M162n962J8030K953q680J7592r889
$$ -33509 28624 27630 -6527 -13808 405 3104 7266 1304 19334 22287 13607 31199 21310
13186B1310j5261P890L9127q890o695m179J0356J7406L030n92l1331n8625j7565
$$ 21310 6049 13939 53066 44176 37481 33302 43658 61064 64094 63502 32171 -26454 -44019
13173d4019K4718l2762o498M7813K9306Q119J898j5617J239j0673L8829L0901
$$ -44019 -19301 -52063 -58561 -10748 18558 26677 28575 12958 14197 3524 42353 73254
13161G3254L4196j1532j7588L2279Q555k5204k2143j5667K0874k7260l0945J4216
$$ 73254 107450 95918 78330 110609 119164 93960 71817 56150 77024 49764 18819 33035
13149C3035J4284J373L969k0438l985l412J2067K5023L0796L5247J6837O9581
$$ 33035 47319 48692 52661 32223 28238 24826 36893 61916 92712 127959 144796 214377
13137B14377J20763J64290P1583l8138l8027m7291r4468r6999p5897j3885n4244
$$ 214377 335140 499430 571013 532875 494848 447557 353089 256090 180193 166308 112064
13126A12064j2926k2026q671m3457n2981j693J2932j1033L4646K6367l9438j8826
$$ 112064 99138 77112 68441 24984 -27997 -29690 -16758 -27791 6855 33222 -6216 -25042
13114b5042j207j6398k0226k9404J9103J659p856j491K6239J3183L8N594j0243
$$ -25042 -26249 -42647 -62873 -92277 -73174 -71515 -79371 -80862 -54623 -41440 -41402 -35808 -46051
13101d6051k4289k9777N4761O0866L6546J4812J6517K7460l4061n511R705J7852
$$ -46051 -70340 -100117 -45356 15510 52056 66868 83385 110845 76784 71273 80978 98830
13089I8830J5949k2256l1519o8697j5754J1836k0139L771L0335L780j5646K2243
$$ 98830 114779 92523 61004 -7693 -23447 -11611 -31750 -27979 2356 6136 -9510 12733
13077A2733K6204J797l0170j6017L8556N408m1726k1938K6531J3271r63P876q175
$$ 12733 38937 40734 10564 -5453 33103 38511 -3215 -25153 1378 14649 13686 21562 13387
13064A3387k0432M427J1616J8431J7039R254J5132K3731L3067j6023j6280L4154
$$ 13387 -7045 -2618 8998 27429 44468 53722 68854 92585 125652 109629 93349 127503
13052A27503M6835J477M412k672N871O319j868l0645l0202o982j514K6817k6259
$$ 127503 174338 175815 180227 177555 183426 189745 187877 157232 127030 120048 118534 145351 119092
13039A19092l8518J4696q996p660j0726K5973l8199Q28L3818k099k4935j1536
$$ 119092 80574 95270 86274 78614 67888 93861 55662 56490 90308 88209 63274 51738
13027E1738j3851J2407J9390l8239m973O636J0651J4293l710q336O102M548J791
$$ 51738 37887 50294 69684 31445 26472 33108 43759 58052 54342 46006 52108 56656 58447
13014E8447J7818k2484k9142o817J2453l226l6172P336M5575L3618O1789M9860
$$ 58447 76265 53781 24639 17822 30275 27049 -9123 -1787 43788 77406 139195 189055
13002A89055K7480k0206k0574l0997j8749j1293j9705k723Q566m323R988K6249
$$ 189055 216535 196329 175755 144758 126009 114716 95011 92288 100854 96531 106519 132768
12990A32768K982l0926m1368o988j0421j0537m7762Q561J2809r134m3103k1785
$$ 132768 135750 104824 63456 56468 46047 35510 -12252 -3691 9118 -16 -43119 -64904
12978f4904r497k860k1335L9408L1539K6752j4287l089m42P788L0323P086k24
$$ -64904 -74401 -77261 -98596 -59188 -27649 -897 -15184 -18273 -18715 -10927 19396 26482 26258
12965B6258R160J5953m23k6076j908l0141j5419L804L2447J5822k5834k2550j2705
$$ 26258 35418 51371 50948 24872 22964 -7177 -22596 -18792 13655 29477 3643 -18907 -31612
12952c1612L7438L6247M552J193k611Q459K290l628P642o19q541K2044J1116L6152
$$ -31612 5826 42073 46625 47818 45207 53666 55956 52328 59970 59351 50810 72854 83970 120122
12938A20122M908N226J4767K7899j4585k9369J5434J4708J9359O573j928O833
$$ 120122 125030 130256 145023 172922 158337 128968 144402 159110 178469 185042 183114 189947
12926A89947J6196K9905L0084N6115N6059N8847J0644K0995m70k6305j7563m6915
$$ 189947 206143 236048 266132 322247 378306 437153 447797 468792 468322 442017 424454 377539
12914C77539o9643j8516j306k2618k4862o183K6623K1662L9164Q181L0470M8383
$$ 377539 307896 289380 288074 265456 240594 234411 261034 282696 321860 330041 360511 408894
12902D08894P2673J39294J90032K96175M82010O31879N58709L94792L78465J44145
$$ 408894 481567 620861 810893 1107068 1589078 2220957 2779666 3174458 3552923 3697068
12892C697068k97920m69714m33374m93720m46757k91996k12031j54540j09852
$$ 3697068 3399148 2929434 2496060 2002340 1555583 1263587 1051556 897016 787164
12883G87164j04487j31099p6790k5852k9557p1925m5592r743J6945k1148N931
$$ 787164 682677 551578 474788 448936 419379 347454 301862 292119 309064 287916 293847
12872B93847N8435M9652K5633K1889O8949L0762n4025m8065k4829k8863m4113
$$ 293847 352282 401934 427567 449456 518405 549167 495142 447077 422248 393385 349272
12861C49272r050o663L2476O3257K7452J7659J938J6533p585J8842j7677l9172
$$ 349272 340222 333559 366035 429292 456744 474403 476341 492874 485289 504131 486454 447282
12849D47282Q613l8149J0868L8586k6991j0357L7162p827j3619L103J6968K4894
$$ 447282 455895 417746 428614 467200 440209 429852 467014 459187 445568 448671 465639 490533
12837D90533q034L1250O6883K1061K034L7499O7526M2145O13J5168M7411O8021
$$ 490533 482499 513749 580632 601693 603727 641226 708752 750897 751510 766678 814089 882110
12825H82110Q3210Q9169P2656Q2926P8671O4215L8963N8820J14331J77086J69068
$$ 882110 965320 1054489 1127145 1210071 1288742 1352957 1391920 1450740 1565071 1742157 1911225
12814A911225J77734K16813K35339K33952L22226M19764N11244O13347O62741
$$ 1911225 2088959 2305772 2541111 2775063 3097289 3517053 4028297 4641644 5304385
12805E304385P74724R66497J186214J654923K182862K713895L494357M887922
$$ 5304385 6079109 7045606 8231820 9886743 12069605 14783500 18277857 23165779
12797B3165779P085600J0552953J6834176K7828620M6097119O7831060N9614011
$$ 23165779 30251379 40804332 57638508 85467128 131564247 199395307 259009318
12790B59009318Q123158j4805544j5634360l3107148n3983649m3561005k5708225
$$ 259009318 267132476 252326932 236692572 203585424 149601775 106040770 80332545
12783H0332545j4232529p889059o141386o745544o521523n671390m914301m289683
$$ 80332545 66100016 58210957 52069571 45324027 38802504 33131114 28216813 23927130
12775B3927130l470486k821078k328872j961799j623649j321140j100523j023066
$$ 23927130 20456644 17635566 15306694 13344895 11721246 10400106 9299583 8276517
12767H276517r27427q03054o66570n57829m87086m65814l95204l63814l50986
$$ 8276517 7349090 6546036 5879466 5321637 4834551 4368737 3973533 3609719 3258733
12758C258733l40543k98806k39278k23371j74646j62075j23478j11460j20266
$$ 3258733 2918190 2619384 2380106 2156735 1982089 1820014 1696536 1585076 1464810
12749A464810q7254o8882m4377l7099n7000q6961o0259l8423l7522q952j4070
$$ 1464810 1377556 1308674 1264297 1227198 1170198 1083237 1022978 984555 947033 938081 924011
12738I24011k3774l5868m5505k0619j347l1000k5454j0157M642R0l1719l1414
$$ 924011 900237 864369 818864 798245 796898 765898 740444 730287 734929 735019 703300 671886
12726F71886k0962n2457m8904j9437o087L4593j482k5702k8760j9853K3326L0980
$$ 671886 650924 598467 549563 530126 524039 558632 557150 531448 502688 482835 506161 537141
12714E37141J1755j2756j3213k7631j4300L649o180l808K4Q595j7668K4193J6527
$$ 537141 548896 536140 522927 495296 480996 484645 478465 474657 474681 483276 465608 489801 506328
12701E06328k628J8910K2312O13l6865l2806o6403j7115j611k860r618k2434K3112
$$ 506328 503700 522610 544922 545535 508670 475864 409461 392346 390735 387875 378257 355823 378935
12688C78935l9892o0303m2548L84j1970P703K5736M944j09o114J3741j3348k6611
$$ 378935 339043 278740 236192 236576 224606 232309 258045 262989 262880 256766 270507 257159 230548
12675B30548k0262M7036M8955O1806l4512j8976M1023O903K7355N9574n82L146
$$ 230548 210286 257322 306277 368083 333571 314595 355618 362521 389876 449450 448868 452014
12663D52014R417m660j8722m8173q0386j02817o4402l0993n955o633K6853J8417
$$ 452014 461431 456771 438049 389876 309490 206673 142271 111278 105323 98690 125543 143960
12651A43960l140j6520j8022J0425L3064M0170N420l6214k4065J9436L0574j7631
$$ 143960 140820 124300 106278 116703 149767 189937 195357 159143 135078 154514 185088 167457
12639A67457m3934q513K4899J2094j564K0675K3149J8351k3303K7369M5683M6715
$$ 167457 123523 115010 139909 152003 150439 171114 194263 212614 189311 216680 262363 309078
12627C09078R496J2265J497l1935k2393n1317k5113P135k5578m7602p33J8758
$$ 309078 318574 330839 332336 300401 278008 226691 201578 208713 183135 135533 134800 153558
12615A53558P762J4702k1056J5950j9335l0036q234N4927J975j8440J0265k0705
$$ 153558 161320 176022 154966 170916 151581 121545 113311 168238 170213 151773 162038 141333
12603A41333P817L9351K7651q311j9325k9414K2081L8135k4409m3290k5501l2287
$$ 141333 149150 188501 216152 207841 188516 159102 181183 219318 194909 151619 126118 93831
12591I3831j9187k9590j3506L677k9625m0371q07K0096K4718p74q425K2004n775
$$ 93831 74644 45054 31548 35225 5600 -34771 -35578 -15482 9236 8462 37 22041 16266
12578A6266R158l0233J5280K7259K8347O320k2398l1176q628K3854M429j1247
$$ 16266 25424 -4809 10471 37730 66077 72397 49999 18823 10195 34049 38478 27231
12566B7231j0764L6493M535j1946L720k7428j4949L8658N78J5406K5499k7155
$$ 27231 16467 52960 57495 45549 49269 21841 6892 45550 46128 61534 87033 59878
12554E9878k5992k6005J7070J1353O321K9291K093k8050m7090P567M7107K0712
$$ 59878 33886 7881 24951 36304 42625 71916 74009 45959 -1131 6436 53543 74255
12542G4255j2101k711J680O353o497K975J1534J0496K7269j8962N426L786l4016
$$ 74255 62154 59443 61123 67476 60979 63954 75488 85984 113253 94291 99717 103503 69487
12529F9487l3966K0475K9203p622k6925l0283L014O644l9329m655M5744M513m7877
$$ 69487 35521 55996 85199 77577 50652 20369 23383 30027 -9302 -13957 31787 36300 -11577
12516a1577o58J4414l575K1187J4827L3852J2781j7695o298J6677K0477q445k0736
$$ -11577 -12235 2179 -1396 19791 34618 68470 81251 63556 57258 73935 94412 85967 65231
12503F5231j491L6288L488m9329m1531J2323k8411k4504K4425M664L800o307r07
$$ 65231 63740 100028 103516 54187 12656 24979 -3432 -27936 -3511 1153 4953 -1354 -2261
12490b261j6301J104K4774j9855j1945K2211L2717N200L3767K1607K5618O1519
$$ -2261 -18562 -17458 7316 -12539 -24484 -2273 30444 35644 69411 91018 116636 178155
12478A78155J8245l3069r456K2355L1653j2638n1359l7212M258J8783j8491k360
$$ 178155 196400 163331 153875 176230 207883 195245 143886 106674 110932 129715 111224 108864
12466A08864j5920J4204J1178L293k5779k7649k2483K698j9451p43N1092J873
$$ 108864 92944 107148 118326 121619 95840 68191 45708 48406 28955 28212 79304 81177
12454H1177k2500k079j2794l6296l63J6066N184j1789m769K853L6093L0179q81
$$ 81177 58677 56598 43804 7508 7145 23211 28395 16606 11837 14690 50783 80962 80081
12441H0081N648l383k0229m0137J0321k9612m1503o248L5556j0396L9783k1003
$$ 80081 85729 82346 62117 21980 32301 2689 -38814 -45062 -9506 -19902 19881 -1122
12429a122k6179n968J4082j0925L4255M1543k464k5766j2383J3642J3283O163
$$ -1122 -27301 -33269 -19187 -30112 4143 45686 43222 17456 5073 18715 31998 38161
12417C8161Q189o498r987J6825j1184j7169j112j7921p240J2737p3n066m409J7699
$$ 38161 46350 39852 29865 46690 35506 18337 17225 -696 -7936 4801 4728 -338 -4747 12952
12403A2952L3962K7421Q39J432o189r281J3784k953l3761J7849j5998l008R470
$$ 12952 46914 74335 75174 76606 70417 61136 74920 71967 38206 56055 40057 37049 46519
12390D6519P743j956k2784k5508j6155j3551K5420K1825J1391L3766K6384l4379
$$ 46519 54262 52306 29522 4014 -12141 -25692 -272 21553 32944 66710 93094 58715
12378E8715l5232j956L9337L5785l3013r319J472j1889M011j4730j9431k579K6579
$$ 58715 23483 21527 60864 96649 63636 54317 55789 43900 47911 33181 13750 11171 37750
12365C7750K2521L1131l2741k7372q035J904L5802J4033M309L002K1930l2814
$$ 37750 60271 91402 58661 31289 23254 25158 60960 74993 79302 82304 104234 71420
12353G1420k2181M284J684j0424k1954k8160K6102P3295M7957J9388k02L1482
$$ 71420 49239 53523 55207 44783 22829 -5331 20771 94066 142023 161411 161209 192691
12341A92691Q1632R2831K29858L29408L65571J76683p0251r4679j55961k78905
$$ 192691 274323 367154 597012 926420 1291991 1468674 1398423 1303744 1147783 868878
12331H68878k58709j75884o7040o039l0736m5986k6977l3546k8666q713j8692
$$ 868878 610169 434285 367245 361206 330470 284484 257507 223961 195295 186582 167890
12320A67890j6712j501j2830l2341m099k4934m3736N649J9063j3267l6711O411
$$ 167890 151178 149677 136847 104506 100407 75473 31737 37386 56449 43182 6471 12882
12308A2882J5008n070N25p782l4212J8156L2377j8823M879M1411J2310j5185n642
$$ 12882 27890 22820 23345 15563 -18649 -493 31884 13061 17940 59351 71661 56476 50834
12295E0834j0307P052K4262M223k9405j0291Q769J4541k6393q213n094j2378O8
$$ 50834 40527 47579 71841 76064 46659 36368 45137 59678 33285 25072 19978 7600 7668
12282G668J6528J1571q6L4652R498n1232l6722J5838N0598O319m0319R331L0472
$$ 7668 24196 35767 35681 70333 79831 28599 -8123 7715 58313 64632 24313 33644 64116
12269F4116r592k8267o224k665K4539j9953l640j3117q766P420N909j4513Q064
$$ 64116 54524 26257 20033 17368 41907 21954 18314 5197 -3569 3851 9760 -4753 3311
12256C311p163r417j3776K8752j502k6017J4347M8864j3085l9115O359j16k775
$$ 3311 -3852 -13269 -27045 1707 205 -25812 -11465 37399 24314 -14801 -8442 -8558 -11333
12243a1333M0533J5775k2892k0272j393J2448J126n995J8691K2784j1172P20P541
$$ -11333 29200 44975 22083 1811 418 12866 13992 7997 26688 49472 38300 39020 46561
12230D6561o855n897j3065o2888j0169M3023j8461M41K709j2813M170K7173J5442
$$ 46561 39706 33809 20744 -42144 -52313 -9290 -27751 -27310 -24601 -37414 -33244 -6071 9371
12217I371Q334J0975R947j1225k8119M0979J4251P194k0163m935J973j3689k4149
$$ 9371 17705 28680 38627 27402 -717 40262 54513 61707 41544 36609 38582 24893 744
12204G44m2137j4646K0645M4195m5121o8889K9056L7557M0633K7573m7580m2799
$$ 744 -41393 -56039 -35394 8801 -36320 -105209 -76153 -38596 2037 29610 -17970 -60769
12192f0769k860K5760k209k355k1067K8459L9633J1255j3374m937k4049N089R052
$$ -60769 -63629 -37869 -40078 -42433 -63500 -35041 4592 15847 2473 -2464 -26513 -21424 -12372
12179a2372J7429M264j1098K6472L8877k4597q012n942J0227N763k4712k4877
$$ -12372 5057 9321 -1777 24695 63572 38975 30963 25021 35248 41011 16299 -8578
12167h578j6066j3797L7324n245j4595K1161O003l492k4140k0824Q161J5841J6565
$$ -8578 -24644 -38441 -1117 -6362 -20957 204 6207 2715 -21425 -42249 -34088 -18247 -1682
12154a682J9185J0482J750M424j4380k898R320J0652k4445J4431r103o34L2851
$$ -1682 17503 27985 29735 34159 19779 16881 26201 36853 12408 26839 17736 17102 49953
12141D9953m658j0941l476j7479J614J9816J9551k8370k7771j3737o530K6939
$$ 49953 45295 34354 30878 13399 15013 34829 54380 26010 -1761 -15498 -22028 4911
12129D911j4360J246J742M28J3848k287K431L6874J1238r022k8658J9456l399
$$ 4911 -9449 -8203 -6461 -6033 7815 5528 7959 44833 56071 47049 18391 37847 34448
12116C4448k6570o248R940k07K3224j6971j6529Q746l304j1141j4911j0064K0543
$$ 34448 7878 1630 11570 11363 34587 17616 1087 9833 6529 -4612 -19523 -29587 -9044
12103i044J6764J6163J7030K840j215N635r010j1980l7077j0099j7336J4917l715
$$ -9044 7720 23883 40913 43753 42538 48173 39163 27183 -9894 -19993 -37329 -22412 -26127
12090b6127M564Q292R999J5806N217q88L3762J262j989k991o334J6080k723J3558
$$ -26127 -21563 -13271 -3272 12534 17751 16863 50625 51887 49898 46907 40573 56653 53930 67488
12076F7488K5708K6622m9094m9889J3472K3657K2301o16j9605L87R016j5783l6004
$$ 67488 93196 119818 70724 20835 34307 57964 80265 79649 60044 60431 69447 53664 17660
12063A7660N570k793Q404M56N54j2748q173J7560J8518m6549l648J515m79r085
$$ 17660 23230 20437 28841 29297 29851 17103 8930 26490 45008 -1541 -5189 -3674 -4153 -13238
12049a3238J9569j2879K3964J7843j3683q545k8874K395K4743K6470p247l6636
$$ -13238 6331 -6548 17416 35259 21576 13031 -15843 -13448 11295 37765 30518 -6118
12037f118m2787j3675K6302J1787j2253K6201m615k1213Q678j0068L0965K894
$$ -6118 -48905 -62580 -36278 -24491 -36744 -10543 -15158 -36371 -27693 -37761 -6796 -3902
12025c902r16k833j3745l6883J2174K2880k8697Q212K5674J7735k2810j858M2980
$$ -3902 -4818 -7651 -21396 -58279 -46105 -23225 -51922 -43710 -18036 -301 -23111 -24969 18011
12012A8011K2401n1476N385K2282k2343p206j0509j7L0908K0397J4177K3069J1887
$$ 18011 40412 -11064 -5679 16603 -5740 -12946 -23455 -23472 7436 27833 42010 65079 76966
11999G6966m1830m9897p634k568L2268M8014j0425k6802m4956j8106L9348J1514
$$ 76966 35136 -14761 -22395 -24963 7305 55319 44894 18092 -26864 -44970 -5622 5892
11987E892k5258O35L460k6194j6251K3799o58j7353M2574J5685l654j7208j1469
$$ 5892 -19366 -18731 -15271 -41465 -57716 -33917 -34575 -51928 -9354 6331 2677 -14531 -26000
11974b6000R163J7816n370O39k6178j971j1069R86j3121n007J7597K1656K3396
$$ -26000 -16837 979 -4391 -3752 -29930 -31901 -42970 -41984 -55105 -60112 -42515 -20859 2537
11961B537K1349O375L2236J7317n7746j9119K1418N1587K1687N577p061P182k6695
$$ 2537 23886 30261 62497 79814 22068 2949 24367 75954 97641 103218 96157 103339 76644
11948G6644p320j8740k3908k1049j5399K3554J2699k4184n8843o564N4053L7860
$$ 76644 69324 50584 26676 5627 -9772 13782 26481 2297 -56546 -63110 -9057 28803
11936B8803J1331k2779n848J4668K0538J6455k5243j1723Q39j4031k470k7775
$$ 28803 40134 17355 11507 26175 46713 63168 37925 26202 27041 13010 10540 -17235
11924a7235l6045N464J9393j2528J9609L4215Q181p208j1702l4742L10K2630R320
$$ -17235 -53280 -47816 -28423 -40951 -21342 12873 21054 13846 2144 -32598 -32288 -9658 -338
11911c38P75M605M082n4068K747j027J4754L0083K265j7957j3437L3178j2074
$$ -338 437 5042 9124 -44944 -42197 -43224 -28470 1613 3878 -14079 -27516 5662 -6412
11898f412j5018j3061R178j2490j7001j8804L461M1332J0333J1619J5006R285
$$ -6412 -21430 -34491 -25313 -37803 -54804 -73608 -70147 -28815 -18482 -6863 8143 17428
11886A7428m586m880k152j366k528M607j3860k8231o735p800n52J6716L4029j8624
$$ 17428 12842 7962 5810 4444 1916 6523 -7337 -35568 -42303 -50103 -50655 -33939 90 -18534
11872a8534j0529J7914L467J15J1508j809j6860N0J8518R534l8216k3856K9347
$$ -18534 -29063 -11149 -7682 -7567 3941 2132 -14728 -14678 3840 13374 -24842 -48698 -19351
11859a9351L2688J8089o35j1064K6065k87J2538j1879m1764l5216M3939j1275
$$ -19351 13337 31426 30791 19727 45792 45505 58043 46164 4400 -30816 13123 1848
11847A848j630J2742k2657J0482M0279K0131L0945K9704J5171k5799k1319m379
$$ 1848 218 12960 -9697 785 41064 61195 92140 121844 137015 111216 89897 85518
11835H5518k1037k1283j4183p39K3877L234j0361l6850M736J3393J614j4365j209
$$ 85518 64481 43198 29015 28276 52153 55387 45026 8176 12912 26305 27919 13554 12345
11822A2345j8333q709k2115J1435K0699L1637K083j210l2628J9789p808l078j2614
$$ 12345 -5988 -14697 -36812 -25377 -4678 26959 29042 27832 -4796 14993 7185 4107 -8507
11809h507J2759J9947q066j6075k205p004L3006j1096p58o490J1652N4364K1996
$$ -8507 4252 24199 16133 58 -2147 -9151 23855 12759 12001 5511 17163 71527 93523
11796I3523k57l3854n7271j7159k3619J0544J8038k6580J7416J3102n449l1247
$$ 93523 93266 59412 2141 -15018 -38637 -28093 -10055 -36635 -19219 -6117 -11566 -42813
11784d2813Q579m226j2308k4599J0373L6336k596J326J3546J8636K6635L1280
$$ -42813 -34234 -38460 -50768 -75367 -64994 -28658 -31254 -29928 -16382 2254 28889 60169
11772F0169o4078k9363P140k852l9078M3002K7508j0918q597M931J0258M366J6697
$$ 60169 -3909 -33272 -26132 -28984 -68062 -25060 2448 -8470 -17067 -12136 -1878 2488 19185
11759A9185k1633m3003K2172Q219M561J6638m925n162k6506k2283K275L7097K5314
$$ 19185 -2448 -45451 -23279 -15060 -10499 6139 1214 -3948 -30454 -52737 -50462 -13365 11949
11746A1949R999N281j8210j4115m1008j8671P570L0242j4680L8005R597n257O787
$$ 11949 21948 27229 9019 -5096 -46104 -64775 -57205 -26963 -41643 -3638 5959 702 7489
11733G489M841j134j9728K0094M649j7082L584p524k2402l2136k4067Q925K6553
$$ 7489 12330 11196 -8532 11562 16211 -871 2713 -4811 -27213 -59349 -83416 -74491 -47938
11720d7938O988K5150J7529O169k441J396k1673q665J7201O174J9859o548j1112
$$ -47938 -40950 -15800 1729 7898 5457 6853 -14820 -23485 -6284 -110 19749 13201 2089
11707B089O483k042j8067k5830K1358J1106k5786k5952P77K8350J484k812j0792
$$ 2089 8572 6530 -11537 -37367 -16009 -4903 -30689 -56641 -55864 -27514 -26030 -28842 -39634
11694c9634j6222K5761J2545q916o252Q752r42L2160K4999j2222j1110K4477J4705
$$ -39634 -55856 -30095 -17550 -26466 -32718 -23966 -24908 7252 32251 20029 8919 33396 48101
11681D8101k1912n612J995k8557O841Q730m2286j4532J5857K970P417K6315k0440
$$ 48101 26189 20577 22572 -5985 856 9586 -32700 -47232 -31375 -28405 -20988 5327 -15113
11668a5113p467j4978k7702l2672k151K3854L8645K9598K3334J4638Q351J9401
$$ -15113 -22580 -37558 -65260 -97932 -100083 -76229 -37584 -7986 15348 29986 38337 57738
11656E7738m8935n731M214J9866k0906l4864M331J6069J520j0634j1406K8726
$$ 57738 8803 3072 7286 27152 6246 -28618 -24287 -8218 -6698 -17332 -28738 -12
11644a2P287k1143j725k0398L5395J5213K6438J2609l2456M231N628k8333j3400
$$ -12 7275 -13868 -15593 -35991 -596 14617 41055 53664 21208 25439 31067 2734 -10666
11631a0666m52K6203L8016L125o4287l6086k5924o655M1137M8555l103j860k543
$$ -10666 -11118 15085 53101 56226 -8061 -44147 -70071 -76726 -35589 12966 9863 8003 5460
11618E460O101j6327k4344K4978L4579j8625n682l634j8922j6114K4195J1083
$$ 5460 11561 -4766 -29110 -4132 30447 11822 6140 2506 -16416 -32530 -8335 2748
11606B748j0450m9266k5427J4449R97K7073K21r949N22j097O631M7610K852q45
$$ 2748 -7702 -56968 -82395 -67946 -66949 -39876 -39655 -49604 -49082 -50179 -43548 4062 6914 6069
11592F069O12j2218j6457K0913J3123K328j0177N738O522j3631k7782L531J0740
$$ 6069 6681 -5537 -21994 -1081 12042 14370 4193 9931 16453 2822 -24960 -21429 -10689
11579a0689o721P2934M9887k564k3325k1154k305l0702l758k7925R993J8816j8080
$$ -10689 -17410 55524 105411 102847 79522 58368 56063 25361 21603 -6322 3671 22487 4407
11566D407m995j7556k8555n657J3456K6953J5526k7442k2375k0931J2164q577
$$ 4407 -588 -18144 -46699 -52356 -38900 -11947 3579 -23863 -46238 -67169 -55005 -63582
11554f3582L6109L2919j7196J0263p05K98M7663l589j622r542j4474K1551L111
$$ -63582 -27473 5446 -11750 -1487 -2192 -1894 45769 42180 40558 31016 16542 38093 41204
11541D1204k5937O722m39M492j2956J9870J559j10J0245j1804m254j2002k2693
$$ 41204 15267 21989 21550 26042 13086 32956 34515 34405 44650 32846 28592 16590 -6103
11528f103O241P339K3433j4262m0799k1760Q470m187L1221K8317j5755N744J0337
$$ -6103 138 7477 30910 16648 -24151 -45911 -37441 -41628 -10407 17910 2155 7899 18236
11515A8236J63J6572n492k0549l1835j1567J6451J3242R719J5920j9450r351K7847
$$ 18236 18399 34971 29479 8930 -22905 -34472 -18021 -4779 4940 20860 1410 -7941 19906
11502A9906n119l881K4163k3615j0816K434J6276L9328k3764n1304j7382K9055
$$ 19906 14787 10906 35069 11454 638 3072 19348 58676 34912 -16392 -33774 -4719
11490d719J3723M8157Q810k922p292J2439k2549k7720j5678j55o812k6000n940
$$ -4719 9004 57161 65971 63049 55757 68196 45647 17927 2249 2094 -4718 -30718 -36658
11477c6658m169k8256N173K2148J1632L1251J449l407l2572j1598k1626q610K4680
$$ -36658 -40827 -69083 -63910 -41762 -30130 1121 2570 -837 -33409 -45007 -66633 -75243 -50563
11464e0563n018N709K7462o667q649k76J6077M5117J1891j2326N252p788l0533
$$ -50563 -55581 -49872 -22410 -29077 -37726 -38002 -21925 23192 35083 22757 28009 20221 -10312
11451a0312L1445L2149P986o485n3763n4497K3068K8206N190K2489K3664l4866
$$ -10312 21133 53282 61268 54783 1020 -53477 -30409 -2203 2987 25476 49140 14274
11439A4274q483j8003L629L9630J7662k7248k1529J5243J9769J2918j2564p284
$$ 14274 5791 -12212 -8583 31047 48709 21461 -68 15175 34944 47862 35298 28014
11427B8014K3551J44j2242m0249l7449J3775Q752m641L004R978L9339m7392j9188
$$ 28014 51565 51709 39467 -782 -38231 -24456 -15704 -20345 -17341 -7363 31976 -15416 -34604
11414c4604J5784K7216K2782M59j5061j4633q986J0377j0011O068K5028k4060
$$ -34604 -18820 8396 31178 31637 16576 1943 -7043 3334 -6677 -609 24419 359
11402C59J9071P106k4275j4143J126j256j7030j2927J8467K0380M067J5442l6169
$$ 359 19430 26536 2261 -11882 -10756 -12012 -29042 -41969 -23502 -3122 945 16387 -19782
11389a9782o6762q204L5620L0809n5N984J9435J8442K332k5083j8492L3583J041
$$ -19782 -86544 -94748 -59128 -28319 -28374 -22390 -2955 15487 17819 -7264 -25756 7827 8868
11376H868q388q616j4076o686r660k6215q809k876J7444K5532K0719m671m075
$$ 8868 480 -8136 -22212 -28898 -38558 -64773 -73582 -76458 -59014 -33482 -12763 -17434 -21509
11363b1509L5258J701k4697l6624N4417j0186j4603k1142k6160k0685J1595M26
$$ -21509 13749 15450 -9247 -45871 8546 -1640 -16243 -37385 -63545 -84230 -72635 -72209
11351g2209R402L0615J7079J3309m7152m3608J9207L7041R142K2719K143k1137
$$ -72209 -62807 -32192 -15113 -1804 -48956 -92564 -73357 -36316 -27174 -4455 -2312 -23449
11339b3449k4313k7486J8980M9726L2879j4857l9815n282J3610K5961R21K920
$$ -23449 -47762 -75248 -56268 -6542 26337 11480 -28335 -33617 -20007 5954 6875 9795
11327I795k6868j4281k7513k3321J6461J1513Q807P907k0869J607o107j688L1555
$$ 9795 -17073 -31354 -58867 -82188 -65727 -54214 -45407 -37500 -58369 -56762 -62869 -64557 -33002
11314c3002R959J515R580K276j9564K8417K5647J0450k1071J1756J0581l7663
$$ -33002 -23043 -21528 -11948 -9672 -29236 -819 24828 35278 14207 25963 36544 -1119
11302a119l2875N289j2478L839m143L741P568L6317O146k1836k479k736K6427
$$ -1119 -33994 -28705 -41183 -37344 -41487 -37746 -30178 6139 12285 -9551 -12030 -14766 11661
11289A1661l195n771j8799M860K0388K659l611j4891K8943J1497K56j9284j217
$$ 11661 8466 2695 -16104 -11244 9144 11803 8192 -6699 22244 33741 33997 14713 13496
11276A3496j3858m042K6735k0965j8252J0348n805j1253l154k0857r906K2648
$$ 13496 -362 -4404 22331 1366 -16886 -6538 -12343 -23596 -26750 -47607 -57513 -34865
11264c4865P305J375m3286j8883Q027M3451K5667L778n410L727J1670l474p397
$$ -34865 -27560 -26185 -69471 -88354 -80327 -36876 -11209 -7431 -12841 -9114 2556 -918 -8315
11251h315J2115n457J0766K2897j5182k9028k581K3807m290j1814K3355J6093
$$ -8315 3800 -1657 9109 32006 16824 -12204 -14785 9022 4732 -7082 16273 32366
11239C2366p236k6262P739J6203J4703l4519J2128Q579Q858J9787j9139q290o859
$$ 32366 25130 -1132 6607 22810 37513 2994 15122 23701 32559 52346 33207 24917 18058
11226A8058L199K0193L0798l7498m2236j023j2827L0803K9513K9047l0844m2827
$$ 18058 21257 41450 72248 34750 -7486 -8509 -21336 9467 38980 68027 37183 -5644
11214e644L9990j3595j110L8412M3409P191j5508n2305k6999m566J919m207R789
$$ -5644 34346 20751 19641 58053 101462 108653 93145 40840 13841 9275 11194 6987 16776
11201A6776p6J862L3317j8377l4892j6984K1218J0560j0339k6865k1932k9088
$$ 16776 16700 18562 51879 33502 -1390 -18374 2844 13404 3065 -23800 -45732 -74820
11189g4820j1857M4748L0235J1256j2630j3632J2380L2388p078K955k0367j7001
$$ -74820 -86677 -41929 -11694 -438 -13068 -26700 -14320 18068 10990 13945 -6422 -23423
11177b3423j0599l804j1316R333m765J8350m957K5017K6175j3794j8447K5492
$$ -23423 -34022 -37826 -49142 -39809 -44574 -26224 -31181 -6164 20011 6217 -12230 13262
11165A3262Q447K0106m2119j4871R929j7911n526P95j4458j9800M1665K7944J9114
$$ 13262 21709 41815 -304 -15175 -5246 -23157 -28683 -27888 -42346 -62146 -20481 7463 26577
11152B6577k1928j7494k6888n083J8690K3355K1093K0650L17j5717J1543k3024
$$ 26577 4649 -12845 -39733 -44816 -26126 -2771 18322 38972 39289 23572 35115 12091
11140A2091l823J1617j8573J2782q921p843J8290K4516J1149j5950m150j8978
$$ 12091 8268 19885 1312 14094 5173 -2670 15620 40136 51285 35335 31185 12207
11128A2207j0773R717K9216N697k5546m4848j7442M1038M2833j1565J0496j0970
$$ 12207 1434 11151 40367 46064 20518 -24330 -41772 -734 42099 30534 41030 30060
11116C0060m991N400j0794m367j5501j3094K1331J2966j8452j368J0458j0214
$$ 30060 25069 30469 19675 15308 -193 -13287 8044 21010 2558 1190 11648 1434
11104A434j3356j1274J6575N4240O638m1238k1793p850j9655k5635J4871J8383
$$ 1434 -11922 -23196 -6621 47619 54257 13019 -8774 -16624 -36279 -61914 -47043 -28660
11092b8660q728p686L1660K3373K4665k0017p254n734K0067J7589k5794l2254
$$ -28660 -37388 -45074 -13414 9959 34624 14607 7353 1619 21686 39275 13481 -18773
11080a8773L066M850J3721M080q021m3453l1518j0572K2117j1465Q709M8486L1367
$$ -18773 -15707 -10857 2864 6944 -1077 -44530 -76048 -86620 -64503 -75968 -67259 -18773 12594
11067A2594J7731j7759k0888L743Q215k2681o025K178j0979J0916P857J5038Q6
$$ 12594 30325 12566 -8322 -4579 3636 -19045 -25070 -22892 -33871 -22955 -15098 -60 26
11054B6J0221J1250R934N17J5629k1654m2168j9365K5792j0452l9349M239M6703
$$ 26 10247 21497 31431 31948 47577 25923 -16245 -35610 -9818 -20270 -59619 -55380 -8677
11041h677r661M660K673k3673M79R97P022L992j4271R033K2128L4540j399P320
$$ -8677 -18338 -13678 -11005 -34678 -34199 -33202 -26180 -22188 -36459 -27426 -5298 29242 27843 35163
11027C5163L887m1424k3834J3130Q139j4919k5871J4689L4377J3425K2353r478
$$ 35163 39050 -2374 -26208 -13078 -4939 -19858 -45729 -31040 3337 16762 39115 29637
11015B9637l2304k3299k1949j479K5069K2146M167O736n040J741j1331k3114K139
$$ 29637 -2667 -25966 -47915 -49394 -24325 -2179 1988 8724 3684 5425 -5906 -29020 -26881
11002b6881L1489k330k6010n073J6736J5420l137O323J0362J3322K3633N428l4941
$$ -26881 4608 2278 -23732 -28805 -12069 3351 214 6537 16899 30221 53854 59282 24341
10989B4341q414l947M812N00n802l5147m928M339K7134L6205k3699l3332j688
$$ 24341 15927 11980 16792 17292 11490 -23657 -28585 -24246 2888 39093 15394 -17938 -19626
10976a9626n014K8775l2532K798R081K9134K8081J0911j9841k4283k1297K0736
$$ -19626 -24640 4135 -28397 -25599 -16518 12616 40697 51608 31767 7484 -13813 6923
10964F923l061k5104M311K5571M1q155k291j4293J3377l592m1832l615L3235K0162
$$ 6923 3862 -21242 -16931 8640 8681 526 -1765 -16058 -2681 -6273 -48105 -51720 -18485 1677
10950A677j1535m6971Q28m863J1966L1403P691k1138j7586J3331M0580P239k625
$$ 1677 -9858 -56829 -56001 -60864 -48898 -17495 -9804 -30942 -48528 -35197 5383 12622 9997
10937I997J1315l7433k3333L2919J5511M276K1651J5136K3488k1810m1099m046
$$ 9997 21312 -16121 -39454 -6535 8976 13252 34903 50039 73527 51717 10618 6572
10925F572J1092j313N617J087J0009J8009j0224k2097l9527k0158J0719J0984
$$ 6572 17664 16351 21968 23055 33064 51073 40849 18752 -20775 -40933 -30214 -19230
10913a9230P673J447K2843Q019j8436P440K1925K1856k4419k586j0468j3508j2265
$$ -19230 -11557 -10110 12733 20752 2316 9756 31681 53537 29118 26532 16064 2556 -9709
10900i709O382n503p003R375O042L5128q516o672k1814m7473m527j4300K5430
$$ -9709 -3327 -8830 -15833 -6458 -416 34712 26196 19524 -2290 -49763 -54290 -68590 -43160
10887d3160L2725K7089j1509j4670j6313M921L1133J1574O152n331O707j6155
$$ -43160 -10435 16654 5145 -9525 -25838 -20917 10216 21790 27942 22611 29318 13163
10875A3163k7934K110J5017J1274p555Q934k7397l2595J0725K5360j8186k4582
$$ 13163 -14771 -12661 2356 13630 6075 15009 -12388 -44983 -34258 -8898 -27084 -51666
10863e1666J4586J1815K7859j9737q64M913Q939q232q274j0833k4569m664J4406
$$ -51666 -37080 -25265 2594 -17143 -18007 -13094 -4155 -12387 -20661 -31494 -56063 -60727 -46321
10850d6321N2028L6147L9182n8968k8917r064j9010J3780l0729l1007J1335J0262
$$ -46321 5707 41854 81036 22068 -6849 -15913 -34923 -21143 -51872 -82879 -71544 -61282
10838f1282o906j8326j1528J348L776N636L9158K4208J0814k1841Q792k821L0068
$$ -61282 -68188 -86514 -98042 -96694 -92918 -87282 -48124 -23916 -13102 -34943 -26151 -28972 1096
10825A096j1832j6783N813Q069Q863J648l1817k3200m568J8284N604J1752L3122
$$ 1096 -10736 -27519 -21706 -13637 -4774 -3126 -34943 -58143 -62711 -44427 -38823 -27071 6051
10812F051O230J6429j8134L0004J3995j7075j7934l3402q074j1717K0600J4494
$$ 6051 12281 28710 10576 40580 54575 37500 19566 -13836 -21910 -33627 -13027 1467
10800A467l3424j4997M1282J6047j618r209K1491K4761j1210J912K0298k6542
$$ 1467 -31957 -46954 -5672 10375 8757 -452 21039 45800 34590 36502 56800 30258
10788C0258J0599j1458o762P131p155l4543j8556K7479K356K0759n038J0773M975
$$ 30258 40857 29399 22637 29768 22613 -11930 -30486 -3007 -651 20108 15070 25843 30818
10775C0818n433l6106j7188k166L9319j5537l3175k3151J966J1854L0929M0058
$$ 30818 25385 -10721 -27909 -30075 9244 -6293 -39468 -62619 -60653 -48799 -17870 22188
10763B2188L7097j123j7784j9017m6316l5738r234K0193K3029J7087o677l838
$$ 22188 59285 58162 40378 21361 -24955 -60693 -69927 -49734 -26705 -9618 -16295 -20133
10751b0133j9164k0587j6593L1433J8827j1439j9149j5562J0449J8537q690L2478
$$ -20133 -39297 -59884 -76477 -45044 -26217 -37656 -56805 -72367 -61918 -43381 -52071 -19593
10739a9593Q838l5642J7202K6989k6467O163J9607L597j9517k2533N078O303j7950
$$ -19593 -10755 -46397 -29195 -2206 -28673 -22510 -2903 694 -18823 -41356 -36278 -29975 -47925
10726d7925J890L1181M5793K5488m850j5671j0324J4362m614J6628P354j6681
$$ -47925 -46035 -14854 30939 56427 51577 35906 25582 39944 35330 51958 59312 42631
10714D2631j6698k8715k4795k917M5183K7126J144L362r42J9232N912L131k137
$$ 42631 25933 -2782 -27577 -30494 14689 41815 42959 46321 45379 64611 70523 73654 71517
10701G1517l1331J3354k705J3665K0479J6886O106n9132j5956k399n865K4512
$$ 71517 40186 53540 50835 64500 84979 101865 107971 48839 32883 30484 24619 49131
10689D9131R459l2853n400m008m981O818N891Q652J94m1699n246K1439K258l9591
$$ 49131 58590 25737 20337 16329 11348 18166 24057 32709 32903 -8796 -14042 7397 9655 -29936
10675b9936n0148J2865L4201L676q02Q256K8469L10J1983M6978J0245n990j011
$$ -29936 -80084 -67219 -33018 -29342 -30144 -21888 6581 6891 18874 65852 76097 70107 69096
10662F9096K334m592j5873n575j403j0241j8078m5787P262l644K9553J5426J5582
$$ 69096 71430 66838 50965 45390 43987 33746 15668 -30119 -22857 -26501 3052 18478 34060
10649C4060m056k4171k4424j8359L5835K2992q647j4238n883J4980l19J1884j3890
$$ 34060 30004 5833 -18591 -36950 -1115 21877 13230 -1008 -6891 8089 7770 19654 5764
10636E764O75J2221J4084K850j844N687J1555m758k3834L887J7221L648j2461
$$ 5764 6439 18660 32744 35594 33750 39437 50992 46234 22400 26287 43508 47156 34695
10623C4695m619o763J876J0406l5015l4173R836L1805K2803L4555O177n739l4437
$$ 34695 30076 23313 25189 35595 580 -33593 -23757 8048 30851 65406 71583 65844 31407
10610C1407l6861l9960Q955K145L1482J2717P37K7306Q813k5268r383j0364L2160
$$ 31407 -5454 -45414 -36459 -34314 -2832 9885 10622 37928 46741 21473 12090 1726 33886
10597C3886J8485J1574q8j7248j1490j1824o372l4631j7895l171K8568K1021Q04
$$ 33886 52371 63945 63857 46609 35119 23295 16923 -17708 -35603 -38774 -10206 10815 11619
10584A1619Q370p058J4500K1282K0583m361p371m8863N009J7826o90M194K7480
$$ 11619 19989 12931 27431 48713 69296 64935 57564 8701 13710 31536 30846 35040 62520
10571F2520k365j6928r440j2581K0595L327k6934K7032M6957K1548k4818m2305
$$ 62520 60155 43227 33787 21206 41801 45128 18194 45226 92183 113731 88913 46608
10559D6608m1350Q385K9713J3329M173J3964p482n8102O153j4580j6696M383K1263
$$ 46608 5258 13643 43356 56685 60858 74822 67340 9238 15391 811 -15885 -11502 9761
10546I761K2135j565K5678p566o2428n1950j2276J386J3671n291J830J9009K9373
$$ 9761 31896 30331 56009 48443 -13985 -65935 -78211 -76825 -63154 -68445 -66615 -47606 -18233
10533a8233O766l1554J7735M4512r42K695M4008l0342k2692P534p433k4835n962
$$ -18233 -11467 -43021 -25286 19226 18284 20979 64987 34645 11953 19487 12054 -12781 -18743
10520a8743p122l352L413j4335r134J5490M680K8696J6163j8903j2256K0838J3318
$$ -18743 -25865 -29217 -25804 -40139 -49273 -33783 -29103 -407 15756 -3147 -15403 5435 18753
10507A8753j1837p365J8244l0615l5442K2523Q797l126J7594K6222R660N601q881
$$ 18753 6916 -449 17795 -12820 -48262 -25739 -16942 -20068 -2474 23748 33408 39009 30128
10494C0128k9209m308K4838L522j660l4841j0853Q252M2368J5980m444q442j3688
$$ 30128 919 -3389 21449 24971 23311 -11530 -22383 -14131 28237 44217 39773 31331 17643
10481A7643j0425j6734L905L5912N0639K2038o781l0421n9407l5839K693J8245
$$ 17643 7218 -9516 -5611 30301 80940 102978 96197 65776 6369 -29470 -26777 -8532
10469h532k3086L81M1639N3373J375k4383j229j5872j1136J9797O217j0480j4969
$$ -8532 -31618 -31237 10402 63775 65150 40767 39538 23666 12530 32327 38544 28064 13095
10456A3095J0990J0084j1180k955j1522O543J4573j0228k9979l209N3673L3949
$$ 13095 24085 34169 22989 20034 8512 15055 29628 19400 -10579 -13788 39885 73834
10444G3834J4093m979p893k1795j9856L1168J3992m1796l6069r955k0316K8465
$$ 73834 87927 82948 75055 53260 33404 64572 78564 36768 699 -9256 -29572 -1107
10432a107J2247q189J1244k174Q05R373l2225O639O127n4370J871J8865J3704
$$ -1107 11140 2951 14195 12021 12826 22199 -10026 -3387 2740 -51630 -49759 -30894 -17190
10419a7190J7821J7910P187O63L857j4408m4800R336K0990mj6553k2658k0311
$$ -17190 631 18541 25728 26391 30248 15840 -28960 -19624 1366 1362 -15191 -37849 -58160
10406e8160J6721M9615K5867l4924k2278m199K6060K8910L894l5753j2540J417
$$ -58160 -41439 8176 34043 -881 -23159 -27358 -1298 27612 31506 -4247 -16787 -15370
10394a5370K5121K1899p868N957k022k1729q859J5752n577k1077j8638j005j4726
$$ -15370 9751 31650 23782 29739 27717 5988 -2871 12881 7304 -13773 -32411 -33416 -48142
10381d8142J4853K682J4540R17j4183L8828K8275j8295q583k0426L458J4229N845
$$ -48142 -33289 -30607 -16067 -15150 -29333 9495 37770 19475 10892 -9534 -6076 8153 13998
10368A3998j0459m4834L0762J1895J7033O225m2332q76J7379J7611l7575O479
$$ 13998 3539 -41295 -10533 1362 18395 24620 -17712 -18588 -1209 16402 -21173 -14694
10356a4694K3640L4780M979l7747J136m794k1015Q065R703L5362J6357k319l2189
$$ -14694 8946 43726 48705 10958 12094 7300 -13715 -5650 4053 39415 55772 53453 21264
10343B1264r546p836l208r340j4761O610K5360q209j847Q880j0182r345m059k6476
$$ 21264 11718 3882 674 -8666 -23427 -16817 8543 334 -1513 7367 -2815 -12160 -16219 -42695
10329d2695o137K6748J5174K2257k4316O388j2730j0689j225q481J9586K7302
$$ -42695 -48832 -22084 -6910 15347 -8969 -2581 -15311 -26000 -27225 -35706 -16120 11182
10317A1182k6688o714r5N849J5109M255l9275L411R387Q434J569O106n542j5490
$$ 11182 -15506 -22220 -22315 -16466 -1357 2898 -36377 -32966 -23579 -15145 -13576 -7470 -13012 -28502
10303b8502J5769J802J223N074q872m947J9481N30l1975j5274R525j4047K1068
$$ -28502 -12733 -10931 -9708 -4634 -13506 -18453 1028 1558 -30417 -45691 -36166 -50213 -29145
10290b9145K4435j0175q164q868K9587m024J0146k5770j3625j024O165L2313j942
$$ -29145 -4710 -14885 -23049 -31917 -2330 -6354 3792 -21978 -35603 -36627 -30462 1851 -91
10277i1n568k5480k945J2570L8147J2108l595k6292q190j258K5058K987j0059
$$ -91 -5659 -31139 -34084 -21514 16633 28741 25146 -1146 -9336 -10594 14464 17451 7392
10264G392m697J3759R611o808M557K0087J5966m2866l7164j7699k697J635L3925
$$ 7392 2695 16454 26065 19257 23814 43901 59867 17001 -20163 -37862 -40559 -38924 -4999
10251d999K5068Q963k2814K8129j0994k2424j3266K4050J4809J4971l0973j7232
$$ -4999 20069 29032 6218 34347 23353 929 -12337 11713 26522 41493 10520 -6712
10239f712J5989r099r654Q775J3844j2743K7702K0650j3634k0098j4534Q176J9246
$$ -6712 9277 178 -9476 -701 13143 400 28102 48752 35118 15020 486 8662 27908
10226B7908k3942J3434K3140l3044j3678R508r939j6797q808p204J2117J8155
$$ 27908 3966 17400 40540 7496 -6182 3326 -6613 -23410 -32218 -39422 -27305 -9150
10214i150J5001k2982j3359L917j7092K8276J3490J2973j9559L637J6675R194
$$ -9150 5851 -17131 -30490 -26573 -43665 -15389 -1899 11074 -8485 -4848 11827 21021
10202B1021P093j0478k6250k0494J7777P27k652J0190K7298r295j7369J1941J5087
$$ 21021 28114 17636 -8614 -29108 -11331 -10604 -13256 -3066 24232 14937 -2432 9509 24596
10189B4596k557l8524k725K0892n665k1888J2367L1452J127j1069K5763k9883
$$ 24596 22039 -16485 -19210 1682 -3983 -25871 -13504 17948 19075 8006 33769 3886
10177C886K0490O3053n567p6440k0687J5403j0671j048k347l8526k2046j144R346
$$ 3886 24376 87429 81862 5422 -15265 138 -10533 -11581 -13928 -52454 -74500 -75644 -66298
10164f6298K3448J3637L1457j089M927m806j4127k2718K6045Q057k8228j9384
$$ -66298 -42850 -29213 2244 1155 6082 1276 -12851 -35569 -9524 -1467 -29695 -49079
10152d9079L5250O950J1280J3669M566L351k313r046K8080o464k8948k2182j7432
$$ -49079 -13829 -6879 4401 18070 22636 25987 23674 14628 42708 36244 7296 -14886 -32318
10139c2318N1906K8357r068j1094j9429j9908J1153k807N859M8448R370K2392
$$ -32318 19588 47945 38877 27783 8354 -11554 -401 -3208 2651 51099 60469 82861
10127H2861j1566k2188k6854l0568n744l319J5512l979q312L1210P769J2546R503
$$ 82861 71295 49107 22253 -8315 -14059 -17378 -1866 -5845 -14157 17053 24822 37368 46871
10114D6871p447q478M865K132J987l8659j3031l427j1892m481p34K3398K7085
$$ 46871 39424 30946 35811 37943 39930 1271 -11760 -15187 -27079 -31560 -32294 -8896 18189
10101A8189j8314j2285Q634j1616k607J537J118K8653J0649J3195K515l0540j7742
$$ 18189 -125 -12410 -3776 -15392 -17999 -16462 -15344 13309 23958 37153 39668 9128 -8614
10088h614k4808k5584m524L2614K5742K2552q656j6037l870N8245J2753J25q206
$$ -8614 -33422 -59006 -63530 -30916 -5174 17378 8722 -7315 -11185 47060 59813 59938 51732
10075E1732j9005q27Q238j9987k8936k3839Q334J4493K1423n750k4125j5365j3878
$$ 51732 32727 31900 40138 20151 -8785 -32624 -24290 -9797 11626 5876 -18249 -33614 -47492
10062d7492K5115M3499L7040J8537k573k8891k0129q8R992K8638p458k12j8853
$$ -47492 -22377 21122 58162 76699 74126 45235 25106 25018 35010 63648 56190 55978 37125
10049C7125n369j252j6114O360L8385m22n314J514J9201j1096j3389l1282n5319
$$ 37125 31756 30504 14390 20750 59135 58713 53399 54913 74114 63018 49629 18347 -36972
10036c6972k1449m660N1629N3177j2388o064J9363j5251o615l3262l2679j1886
$$ -36972 -58421 -63081 -11452 41725 29337 23273 42636 27385 20770 -12492 -45171 -57057
10024e7057J0852J5947J9106P669P991J2220p547K136R465k396p856j8768L1414
$$ -57057 -46205 -30258 -11152 -3483 4508 16728 9181 11317 20782 18386 10530 -8238 23176
10011B3176K5106n131L528Q04j3757q03k1475o550j1693J2347j4451P372J177
$$ 23176 48282 43151 46679 47483 33726 32923 11448 4898 -6795 5552 -8899 -1527 -350
9998c50o03o828l76R732P212J6934j1819o877l311J9053N70K61K130M765j9947
$$ -350 -953 -7781 -8157 1575 8787 25721 13902 7025 3714 22767 23337 23598 25728 30493 10546
9983A0546J7335N467r787l8775K3975j0364j6521J6977J9480n316M635M015Q830
$$ 10546 27881 33348 23561 -15214 8761 -1603 -18124 -1147 18333 13017 17652 21667 30497
9970C0497j9144j9269j5903J0722j8198n799L3829J8540k2922k0215J1008J2775
$$ 30497 11353 -7916 -23819 -13097 -31295 -37094 -3265 15275 -7647 -27862 -16854 -4079
9958d079l098J7677L5377m810k5736K2530N081J1169K5492J9666k8339n132J4142
$$ -4079 -7177 10500 45877 41067 15331 37861 42942 54111 79603 99269 70930 65798 79940
9945G9940O270J0563k6541k466j2J6648l89k0133n2689J0256M4529k01l341j3534
$$ 79940 86210 96773 70232 67766 67754 84402 84013 63880 11191 21447 65976 65775 62434 48900
9931D8900k2257l0573p799K5390J391N282L3866M494J98k4881k7486k193k6597
$$ 48900 26643 -3930 -11729 13661 15052 20334 54200 58694 58892 34011 6525 4332 -22265
9918b2265n99R61j762L9367k5018j2908p993J310R729m18L1995p143r552p493
$$ -22265 -22864 -21903 -23665 15702 -9316 -22224 -30217 -28907 -19178 -19596 12399 5256 -4296 -11789
9904a1789K5424K6442J16L8789j0092l8778j9775j125j0835J4313J5490L0355
$$ -11789 13635 40077 40193 78982 68890 30112 10337 9212 -1623 12690 28180 58535
9892E8535k3999m8712j0736L0666J9332j9342R541k822l0203P175K4237k068L311
$$ 58535 34536 -14176 -24912 5754 25086 5744 15285 12463 -17740 -10565 13672 11604 14915
9879A4915K9848j2936l3939R889K0406K166j6724k1411r415j5933J7025M1781
$$ 14915 44763 31827 -2112 7777 28183 30349 13625 -7786 -17201 -33134 -16109 25672
9867B5672o331r966J6772K0475K1306L796m3502k0741N466N128L1664J4028m6108
$$ 25672 19341 9375 26147 46622 67928 71724 28222 7481 12947 18075 49739 63767 17659
9854A7659j3168L303j671j718N0864J8287o57M265L968p962n088j0062K6426j1544
$$ 17659 4491 7794 6123 4405 55269 73556 72899 77164 81132 73170 68082 58020 84446 72902
9840G2902k9361l986k5857k6776L9767J9215P65r963L695r758K6029O47l6477
$$ 72902 43541 39555 13698 -13078 26689 45904 46669 36706 40401 30643 56672 57319 20842
9827B0842k0205p781L0539L1373Q504L376j2028L8372r214k3715L880j5178Q25
$$ 20842 637 -7144 23395 54768 63272 66648 54620 92992 83778 60063 63943 48765 49590
9814D9590p893j1163k7547j9540L1366K9092J7332k1325l920n226p94M4J1078
$$ 49590 41697 30534 2987 -16553 14813 43905 61237 39912 35992 30766 29972 30016 41094
9801D1094l990L0848M3267l0567l2574j4575Q787k054l2952J602o759L541p68
$$ 41094 37104 67952 111219 80652 48078 33503 42290 40236 7284 8886 2127 5668 4900
9788D900N088L348j009J047j4996j570M378K8625J6642k1753l9341J2068K5041
$$ 4900 9988 13336 12327 13374 -1622 -3192 1186 29811 46453 24700 -14641 -2573 22468
9775B2468j872r871P273J2058l0166j4942N571L457J9893J5875P554K334K2436
$$ 22468 20596 10725 17998 30056 -110 -15052 -9481 -6024 13869 29744 37298 39632 62068
9762F2068R683j7037k7485O73q652k4181j1056M135N0271K8145j9424k700k3666
$$ 62068 71751 54714 27229 27902 19250 -4931 -15987 -11852 38419 66564 47140 44440 20774
9749B0774k6633k2701m0327M697K2647K227M273J2271K3470L8871Q64p21N717
$$ 20774 -5859 -28560 -68887 -64190 -41543 -39316 -35043 -22772 698 39569 40433 39712 45429
9736D5429k446j1005p230J5056j0676J3909J340q377j7007l9502p791J9043j3400
$$ 45429 42983 31978 24748 39804 29128 43037 44377 36000 18993 -20509 -28300 -9257 -22657
9723b2657K1007L2022k0930j7102K3905Q990p794j2539j9513p04M4553K8879o484
$$ -22657 -1650 30372 9442 -7660 16245 25235 17441 4902 -14611 -15315 29238 58117 51633
9710E1633k2419J0780M228L825J4790P948j9621p443j4384j4511P591K9480J9932
$$ 51633 29214 39994 44222 48047 62837 70785 51164 43721 29337 14826 22417 51897 71829
9697G1829M3933J1098k5922o1125l9883K0939K3230l5322k2834L6771N2227R897
$$ 71829 115762 126860 100938 39813 -70 20869 44099 8777 -14057 22714 74941 84838
9685H4838o7640l9324J0046K393l867k1841L2165K0934m768K279P135k7320K8707
$$ 84838 17198 -22126 -12080 -9687 -13554 -35395 -3230 17704 12936 15215 22350 -4970 23737
9672B3737j480n142l3945n806K2581j1032j0974J8861Q729k4535k1008L3470k697
$$ 23737 22257 17115 -16830 -22636 -55 -11087 -22061 -3200 5529 -19006 -40014 -6544 -9241
9659i241o347j4842J5364L3934L682J7417J1718l0031k3141j4137j4213K4556
$$ -9241 -15588 -30430 -15066 18868 22550 39967 51685 21654 -1487 -15624 -29837 -5281
9647e281L4442p782m713J0439r251K27J174J1836L7279j9848O107J0183l3865
$$ -5281 29161 21379 16666 27105 17854 18081 19255 31091 68370 48522 54629 64812 30947
9634C0947J942r241r579J5021Q173l95J4749j3142K586q764k3939m517K9805K7915
$$ 30947 32889 23648 14069 29090 37263 36868 51617 38475 41061 32297 8358 3841 33646 61561
9620F1561M158j5535Q861k295N418j2724N649l0287p450L2810M2457J451n4781
$$ 61561 65719 50184 59045 56750 62168 49444 55093 24806 17356 50166 92623 94074 39293
9607C9293j1129K4959L705j0918r227j8469L3230J0033j8613q633r723J2332K9614
$$ 39293 28164 53123 56828 45910 36683 18214 51444 61477 42864 34231 24508 36840 66454
9594F6454N841L46J0325k09k6632j667J4915k7377o696k0804J9411K8257r205
$$ 66454 72295 72641 82966 82757 56125 54458 69373 41996 35300 14496 33907 62164 52959
9581E2959j5631J0570l4227J4546K9991J8539k3069j4453J148j8748l1780j7236
$$ 52959 37328 47898 13671 28217 58208 76747 53678 39225 40373 21625 -10155 -27391
9569b7391J2730K4299L5730J2701J9870J3172l630n450R873Q166q359k5006j5814
$$ -27391 -14661 9638 45368 58069 77939 91111 87481 82031 91904 100070 91711 66705 50891
9556E0891L1280n946m9807l4437L1159K3247L502M263Q514K020N687K0035J800
$$ 50891 82171 76225 26418 -8019 23140 46387 49889 54152 62666 64686 70373 90408 92208
9543I2208j7046k223o828j5472K3634J1190j6899n492M1764K6298k0346m0946
$$ 92208 75162 72939 66111 50639 74273 85463 68564 63072 104836 131134 110788 69842
9531F9842o318r161k163J7820K7109J4787l6048r931K5766k791n162l1172j5030
$$ 69842 63524 54363 52200 70020 97129 111916 75868 65937 91703 88912 83750 52578 37548
9518C7548L0081J3758l4529j3163K9276J3737k174k0105R926J9192n879L1808
$$ 37548 67629 81387 46858 33695 62971 76708 74534 54429 64355 83547 77668 109476
9506A09476K2381l1565j5552J126k1660p267J4505k771j7052k5392R902r768J9574
$$ 109476 131857 100292 84740 85866 64206 56939 71444 68673 51621 26229 36131 26363 45937
9493D5937K0297r428j0397k0571K5514j1816k9079J2565K7547P90Q318K4589j1056
$$ 45937 66234 56806 46409 25838 51352 39536 10457 23022 50569 51359 59677 84266 73210
9480G3210N339L834J6783j316q305m2391L603k467k555K1503R284K007R346N597
$$ 73210 78549 82383 99166 97850 89545 47154 50757 48290 45735 67238 76522 78529 87875 93472
9466I3472P084l7186J262N826J4394O033R9k2297k4149J5157J3228p078j9949
$$ 93472 100556 63370 64632 70458 84852 90885 90984 68687 44538 59695 72923 65845 45896
9453D5896m5255j5634J9361O1222P1365P182k9765k9100l3181J4640N883J1483
$$ 45896 641 -14993 4368 65590 136955 144137 114372 85272 52091 66731 72614 84097
9441H4097j2606j9769k9488K7840M2273L6623K1411K0783j1037j8318J7132K6340
$$ 84097 71491 51722 22234 50074 92347 128970 150381 171164 160127 141809 158941 185281
9429A85281l4700l3243j0174j7222j8789k4435k2528L4324P207R147K9664J3909
$$ 185281 150581 117338 107164 89942 71153 46718 24190 58514 65721 74868 104532 118441
9417A18441m588m86l942k2129j9719J9303l9043k8890O2214M3241J1071j3424
$$ 118441 113853 113367 109425 87296 67577 86880 47837 18947 81161 124402 135473 122049
9405A22049n9887k433K0083q745k272n903M227J4325K7569K8022j7097j8793k7572
$$ 122049 62162 59729 79812 71067 68795 62892 67119 81444 109013 137035 119938 101145 73573
9392G3573j2745K0674K0078M1390J0424m0902l6945m389K1562j0552J2166K0222
$$ 73573 60828 81502 101580 142970 153394 112492 75547 71158 92720 82168 94334 114556
9380A14556J5248M357J2748J6880j6529o0211m7091K3744Q741M8330L9360j5675
$$ 114556 129804 134161 146909 163789 147260 87049 39958 63702 72443 120773 160133 144458
9368A44458l9264K772J1450p109K7533K5571L5016J3269l8353l2296k6161L2551
$$ 144458 105194 107966 119416 112307 139840 165411 200427 213696 175343 143047 116886 149437
9356A49437J3114L461R341j2377m2377N091L801l227P920j4537j426M3915L5007
$$ 149437 162551 166012 175353 162976 120599 125690 129491 126264 134184 119647 118221 162136 197143
9343A97143K1649j3392l5783J2794J2682J5523J1695k118k0272J9010K1302N621
$$ 197143 218792 205400 169617 182411 195093 210616 222311 220193 199921 218931 240233 245854
9331B45854l4712K1536k1793k8254k7385j4845K6231L6469k7645k1272J7011q822
$$ 245854 211142 232678 210885 182631 155246 140401 166632 203101 175456 154184 171195 162373
9319A62373J7269o743j1639N48K0981N5534R397o752K0245l3055l1714J7444k612
$$ 162373 179642 172899 161260 161808 182789 238323 247720 240968 261213 228158 196444 213888 211276
9306B11276J407l7870L2790L3082l829k6007K1359j5445l6029M821k3385j2883
$$ 211276 212683 174813 207603 240685 236856 210849 232208 216763 180734 185555 162170 149287
9294A49287L5737J8839M0082j025q043j0121J3225K0192M25J4469k312P42K8683
$$ 149287 185024 203863 243945 242920 234877 224756 237981 258173 258598 273067 270755 271497 300180
9281C00180l4296r797j1503k8o45r144j576J7098M4005P769j284j8580j4246l3120
$$ 300180 265884 256087 244584 244556 243911 234767 233191 250289 294294 302063 300779 282199 267953 234833
9267B34833J3064R435j2994J0799J0391P857M522J3638j0201K4261J8922n873
$$ 234833 247897 257332 244338 255137 265528 273385 277907 291545 281344 305605 324527 318654
9255C18654j4878k5466k0482J0720N2695K2796J8380J0257R653m0027k2195l059
$$ 318654 303776 278310 257828 268548 321243 344039 362419 372676 382329 342302 320107 317048
9243C17048q213L525Q423j8329k4523r978K1626L4535L4584K5032K0679J652k1573
$$ 317048 308835 312360 320783 302454 277931 267953 289579 324114 358698 383730 404409 406061 384488
9230C84488l1324j3375M504K4453M228R411k3926p87k1509j6596M293J6792j3067
$$ 384488 353164 339789 344293 368746 372974 382385 358459 357672 336163 319567 323860 340652 327585
9217C27585j1933p821Q616K5178k226K8199K3767n815k1143L937k9960K90K3969
$$ 327585 315652 307831 316447 341625 339399 367598 391365 385550 364407 368344 338384 338674 362643
9204C62643j0497J454L557j5005l655J7211M0261M391N875O542Q546j2319n711
$$ 362643 352146 353600 357157 342152 338497 355708 395969 400360 406235 412777 421323 409004 403293
9191D03293K407j5925j3432O838n479k2725J2059R120K6078Mm683j0502n091K085
$$ 403293 405700 389775 376343 383181 377702 354977 367036 376156 402234 402238 397555 387053 381962 384047
9177C84047j1566K3636k2218k0549K246L4947J9521J1638N970K360J2247n429
$$ 384047 372481 396117 373899 353350 355596 390543 410064 421702 427672 430032 442279 436850
9165D36850m436k3357k1683j5817k5423J4530J7385N8612k4458k8188M1442k7478
$$ 436850 432414 409057 387374 371557 346134 360664 378049 436661 412203 384015 425457 397979
9153C97979r913O560K291j4803p704l503j2064o449J8416k5386J4834N821j0767
$$ 397979 388066 394626 396917 382114 374410 370907 358843 352394 370810 345424 360258 366079 355312
9140C55312l77K6066J4048k1999o940m2337j5965k440k634L188l399K28J1833
$$ 355312 354935 381001 395049 373050 366110 323773 307808 305368 302734 305922 302523 302751 314584
9127C14584R853p142j2919J034J5645j5805M195J7519M1461J2513k8517k6198
$$ 314584 324437 317295 304376 305410 321055 305250 309445 326964 368425 380938 352421 326223
9115C26223M611K2452J8058j7296j1135k9280L953Q588l034j3795j2261K0404
$$ 326223 330834 353286 371344 354048 342913 313633 317586 326174 323140 309345 297084 317488
9103C17488j4778j0727J436K3108K2440R514k6760k9391q859J1129K7005O954
$$ 317488 302710 291983 293419 316527 338967 348481 321721 292330 283471 294600 321605 328559
9091C28559k0405j8500K7111J148n0312j6234J2543J4640J6852j4256n346P437
$$ 328559 308154 289654 316765 317913 267601 251367 263910 278550 295402 281146 275800 283237
9079B83237j0661n850k145k885o55p541J9933L350k7995j5969P23K6321p162j852
$$ 283237 272576 266726 264581 261696 261041 253500 273433 276783 248788 232819 233542 259863 252701 250849
9065B50849J9183j4882n1304k26J2841K7078L652O170P906k6750l1348J584N984
$$ 250849 270032 255150 203846 203620 216461 243539 247191 253361 261267 234517 203169 204753 210737
9052B10737j780J189L52k2294j0284r704j1690J7466L3581L0019k317j7462J3937
$$ 210737 208957 210146 210498 188204 177920 168216 156526 173992 207573 237592 235275 217813 231750
9039B31750N999k3246l6312o853k9715m357K6038K8519o839K7886j0137j1683
$$ 231750 237749 214503 178191 171338 141623 137266 163304 191823 184984 212870 202733 191050
9027A91050m4188p766K0578K7797L8137J4050m8006Q347j8063m3288k2658J2599
$$ 191050 146862 139096 159674 187471 225608 239658 191652 199999 181936 138648 115990 128589
9015A28589M3128O781L6774k6550m9247K0232o324J3693R800r9L9463K8522n019
$$ 128589 171717 178498 215272 188722 139475 159707 153383 167076 176876 176777 216240 244762 239743
9002B39743j7669o509k7388j5911k0951k5838P924J2052j7661k9325J9911J1068
$$ 239743 222074 215565 188177 172266 151315 125477 133401 145453 127792 98467 118378 129446
8990A29446k6919k6885J1633K1625J7763j4311m183K8104j237k3911j8602k1330
$$ 129446 102527 75642 87275 108900 126663 112352 108169 136273 135036 111125 92523 71193
8978G1193l5922K1409N7092N5543j2162j6583j5043L47M3217j8109j6970k1341
$$ 71193 35271 56680 113772 169315 157153 140570 125527 125874 169091 150982 134012 112671
8966A12671j6391l346L811o093l1343k8502J7746J5383k4029J1745K7653J6786
$$ 112671 96280 92934 96745 90652 59309 30807 48553 63936 39907 51652 79305 96091
8954I6091k136j5142j1555K7783K5423j4074p78K5116J7965o153j3577J5327J329
$$ 96091 93955 78813 67258 95041 120464 106390 105612 130728 148693 142540 128963 144290 145619
8941A45619k5272j855J1923l0813j3579l9610l336N7213K091K1140R089l4194
$$ 145619 120347 118492 130415 99602 86023 46413 43077 100290 102381 123521 132610 98416
8929I8416P7k0507k2908K5427K8103j1242m498J9880J5226q451Q499J0745N283
$$ 98416 98493 77986 55078 80505 108608 97366 92868 112748 127974 119523 128022 138767 144050
8916A44050j0386l638l6459l4385L1554M2442k2165r284K071l5466q809J7685
$$ 144050 133664 130026 93567 59182 90736 133178 111013 101729 103800 68334 59525 77210
8904G7210l99k441k346j3224l455k14J4602J2899K3904k7768l1386j7962n018
$$ 77210 76811 74370 72024 58800 55345 55131 69733 82632 106536 78768 47382 29420 24402
8891B4402J916J6263N178K3710J8405k921j2393J2812O9k1084N080J9986J5587
$$ 24402 26318 42581 47759 71469 89874 86953 74560 87372 87441 66357 71437 91423 107010
8878A07010J2034l2664j9387K8404J4455k743j1602k5959k7291J2410K7402l155
$$ 107010 119044 86380 66993 95397 109852 107109 95507 69548 42257 54667 82069 78914
8866G8914k176K5713k2236k7553J9380K1759r090l5795K9371O6008m402k1477
$$ 78914 76738 102451 80215 52662 72042 93801 84711 48916 78287 144295 139893 118416
8854A18416k4303j1568J2214l3564L839L9271K916k8891K58K9784r818l3364k7467
$$ 118416 94113 82545 94759 61195 65034 104305 107221 78330 78588 108372 98554 65190 37723
8841C7723N398M5616L7727r737o310l6412r999m785K5942k4748j2964j811j6864
$$ 37723 43121 88737 126464 116727 110417 74005 64006 59221 85163 60415 47451 45640 28776
8828B8776J082K6410J5284J3883j9839k1055J7634O63n056P680j6736j6470M4075
$$ 28776 29858 56268 71552 85435 65596 44541 62175 62838 57782 65462 48726 32256 76331
8815G6331R847k9657k8710k3024l015j6282K3472K7055j4598j4841P382J8532
$$ 76331 86178 56521 27811 4787 1772 -14510 8962 36017 21419 6578 13960 32492
8803C2492M9562o243k2762J9517o70k5947l0535k5761K4867J2862K0315R169k3175
$$ 32492 82054 75811 53049 72566 71896 45949 15414 -10347 14520 27382 47697 56866 33691
8790C3691j3208K6173L1918m1116l8999l4153N30K9942J7307j8844L56P169L2839
$$ 33691 20483 46656 78574 37458 -1541 -35694 -35164 -5222 12085 -6759 -6403 766 33605
8777C3605J7298j2497J51K87Q799m895l2577j6832J8707r463k9853J814R915N761
$$ 33605 50903 38406 38557 38844 47643 42748 10171 -6661 12046 2583 -27270 -25456 -15541 -9780
8763i780k036J8568P127k3428j8336K1342L7059j5694j0609r720l630M9954Q537
$$ -9780 -11816 6752 13879 -9549 -27885 -6543 30516 14822 4213 -5507 -9137 40817 49354
8750D9354j0892K1723j0875p328N333J1433k1751j0194K1150J4214j3236j6978
$$ 49354 38462 60185 49310 41982 47315 58748 36997 26803 47953 62167 48931 31953
8738C1953k3270J9708M567O689P487j8189k7514q256M369j772K9468K1390J0455
$$ 31953 8683 28391 32958 39647 47134 28945 1431 -6825 -2456 -4228 25240 46630 57085
8725E7085K7918o077j2863m2966k0761J2579L6824k1070j7799p457J6772K8120
$$ 57085 85003 78926 66063 23097 2336 14915 51739 30669 12870 5413 22185 50305
8713E0305k5044k11R793q664L9120K1739m6075k2611k777M1172K8083l220l8498
$$ 50305 25261 25050 34843 26179 65299 87038 40963 18352 15575 56747 84830 81610 43112
8700D3112k6196N318K2800O939n274K6053J9487j3150l541J9425l9543n0532k6446
$$ 43112 16916 22234 45034 51973 46699 72752 92239 79089 75548 94973 55430 4898 -21548
8687b1548k5463j5192L3672M0382J817K9908L8897L114j5226j9296J1259j8893
$$ -21548 -47011 -62203 -28531 11851 13668 43576 82473 85587 70361 51065 62324 43431
8675D3431j2149j2277j755O934l6443J4991P376r521q649J9355j1769R758J1794
$$ 43431 31282 19005 17250 24184 -12259 2732 10108 587 -8062 11293 -476 9282 21076
8662B1076R201J3773N984K0139J9374l2826n6724J6037K6474L854J731j5160n182
$$ 21076 30277 44050 50034 70173 89547 56721 -3 16034 42508 46362 48093 32933 27751
8649B7751l220k0126k6304j1780L166K2277K7814J7941J0538r701p669k6878J2563
$$ 27751 24531 4405 -21899 -33679 -30513 -8236 19578 37519 48057 38356 30687 3809 16372
8636A6372n654k8055J5829Q663j1751P522L746r881p83P091L7649J484o700J5799
$$ 16372 10718 -17337 -1508 7155 -4596 2926 6672 -3209 -3992 3099 40748 42232 35532 51331
8622E1331J2342P43R918J2596o139P012r613n5397l3249p581L792M0087j1880
$$ 51331 63673 64416 74334 86930 80791 87803 78190 22793 -10456 -18037 -14245 25842 13962
8609A3962m326j857j8294J7928j3739j6968J3845K7527J3308M715J9961J7446
$$ 13962 9636 7779 -10515 7413 -6326 -23294 -9449 18078 31386 36101 56062 73508
8597G3508n718j0883r067l398j8234l5864j255K3295J0864j5285p962k3082L027
$$ 73508 67790 56907 47840 44442 26208 -9656 -10911 12384 23248 7963 1 -23081 -20054
8584b0054J747J4909K6193M456j1923r159K416k3935l2535j2049N6626K6677J0790
$$ -20054 -18307 -3398 22795 27251 15328 6169 8585 -15350 -47885 -59934 -3308 23369 34159
8571C4159L2353J6367M413j6411l3345k4700J0601K6775l5963O329K4657L1304
$$ 34159 66512 82879 87292 70881 37536 12836 23437 50212 14249 20578 45235 76539
8559G6539k1804j1828n22j2265J6153L4376N429k9968j4795J5210k4008j5813
$$ 76539 54735 42907 42385 30120 46273 80649 86078 56110 41315 56525 32517 16704
8547A6704J7744j7465j2948q599j3076N042J6020j9695K0314O7988J0384l0745
$$ 16704 34448 16983 4035 -4564 -17640 -12598 3422 -16273 4041 72029 82413 51668
8535E1668k8057l9804J2889M884J6037N204k7726j0089K8874N266k3440L2592
$$ 51668 23611 -16193 -3304 1580 17617 22821 -4905 -14994 13880 19146 -4294 28298
8523B8298p281n391j3372K2609K0677m934P858j0114K3033j2529k3332K4723J3806
$$ 28298 21017 15626 2254 24863 45540 40606 48464 38350 61383 48854 25522 50245 64051
8510F4051k2627l3214l3412O919R943K1368k4050j2790L3083K8755k393k0511
$$ 64051 41424 8210 -25202 -18283 -8340 13028 -11022 -23812 9271 38026 35633 15122
8498A5122L921j3940K2870m038j5442R576J6507P191o34k4536l4702k4052L866
$$ 15122 19043 5103 27973 23935 8493 18069 34576 41767 41133 16597 -18105 -42157 -38291
8485c8291J4587q887K9432K5292n0152Q822K0625j6686j2153m914J2815N0588
$$ -38291 -23704 -32591 -3159 22133 -28019 -19197 1428 -15258 -27411 -32325 -19510 31078
8473C1078R380l0129l8055k377J5614J1671j6778K7083N2186K3378l2094l9535
$$ 31078 40458 10329 -27726 -30103 -14489 -2818 -19596 7487 59673 83051 50957 11422
8461A1422j7637k0504J9877j0821K836K4381K0521q077q136m843q80K941j6699
$$ 11422 -6215 -26719 -6842 -17663 -14827 9554 30075 21998 13862 9019 8139 11080 -5619
8448e619J974n086M327Q089J9454l677L917J3067J4031Q103j2331J4880Q309J1392
$$ -5619 -3645 -8731 -4404 3685 23139 19462 23379 36446 50477 58580 46249 61129 69438 80830
8434H0830l1260l1285j3647l059K1229m625k137r515J0632P146m4907l2724L2328
$$ 80830 49570 18285 4638 1579 22808 18183 16046 6531 17163 24309 -20598 -53322 -20994
8421b0994K8901M5675L3517Q193q687l7821j0146K33p972J2904j0993l332l5368
$$ -20994 7907 53582 87099 95292 86605 48784 38638 38871 30899 43803 32810 29478 -5890
8408e890j8195L7906j0667J5660K1781J2410o646k4642j9722J1657K608J3313
$$ -5890 -24085 13821 3154 18814 40595 53005 46359 21717 1995 13652 16260 29573
8396B9573n856O739J2528j3490j948J6353J8799J8886k2212m7378l3247M459K7864
$$ 29573 23717 30456 42984 29494 27546 43899 62698 81584 59372 11994 -21253 -16794 11070
8383A1070p841J5942O018k990q188l9179l6P128l550Q894J0624p727p315l6K5927
$$ 11070 3229 19171 25189 22199 14011 -25168 -25204 -18076 -21626 -12732 -2108 -9835 -17150 -17186 8741
8368H741K5640j5393L2717k567k7357k33J8596K9636K098j1842j1760l273n193
$$ 8741 34381 18988 51705 49138 21781 21548 40144 69780 71878 60036 48276 45003 39810
8355C9810j4487p567k1457j1333K3198M4420M390j9887r958L885j5945J335P599
$$ 39810 25323 17756 -3701 -15034 8164 52584 56974 37087 27129 31014 15069 16404 24003
8342B4003M336j908K4039l5627m1410l1863n382M1590K6536K3360j779k8681J8661
$$ 24003 28339 26431 50470 14843 -26567 -58430 -63812 -22222 4314 27674 25895 -2786 15875
8329A5875J1746j6508k5023l1896j1382l328L0283K9717N8750J2427l567k4396
$$ 15875 27621 11113 -13910 -45806 -57188 -60516 -30233 -516 58234 70661 67094 42698
8317D2698j908N219j9554L9329l6282m1743r324J2005P753n356j8707N683p688
$$ 42698 40790 46009 26455 65784 29502 -12241 -21565 -9560 -1807 -7163 -25870 -20187 -27875
8304b7875J5143K8395K7983l4820L295L2792k4350n2308J786K2369N1178M0885
$$ -27875 -12732 15663 43646 8826 12121 44913 20563 -31745 -29959 -7590 43588 84473
8292H4473J454j0123n8401k5347j1437k4334K7150J5569J1546j97q417r757M1735
$$ 84473 85927 75804 17403 -7944 -19381 -43715 -16565 -996 10550 10353 1936 -7821 33914
8279C3914l071k2377j8789n482K0603K7028Q484k5361K541K492P45j5525l02p671
$$ 33914 30843 8466 -10323 -15805 4798 31826 40310 14949 17490 19982 20727 5202 4900 -2771
8265b771P160N8578J6653l5610J8138m948m629M757m0515m51L208k423J3452j6807
$$ -2771 4389 62967 79620 44010 62148 57200 52571 57328 16813 16362 19570 17147 30599 13792
8251A3792j6321k5412L7152J9790Q915k9059k9801N764R259J845J2231J0450L5270
$$ 13792 -2529 -27941 9211 29001 37916 8857 -20944 -15180 -5921 -4076 8155 18605 53875
8238E3875J4774K705k8369l5523j5538K9165K904k550m6306j8103L137L2064N6986
$$ 53875 68649 71354 42985 7462 -8076 21089 23993 21443 -24863 -42966 -39829 -7765 49221
8225D9221j9920j1506l9868r654k6942k9141K7518P189N103J6780J2115n780Q142
$$ 49221 29301 17795 -22073 -31727 -58669 -87810 -60292 -53103 -48000 -31220 -19105 -24885 -16743
8212a6743J618K1247k179q519N501R088j0656k513j219K5667m43K0472J1376k8663
$$ -16743 -15125 6122 3943 -4576 925 10013 -643 -3156 -4375 21292 20849 41321 52697 24034
8198B4034k7951k0706j8250J9904J9845O684K2485J3538k4504l1374J895n159
$$ 24034 -3917 -24623 -42873 -22969 -3124 3560 26045 39583 15079 -16295 -14400 -19559
8186a9559J5244J2969J7365j5608J255J1419M4268k0862j5566J2594J3912l3842
$$ -19559 -4315 8654 26019 10411 11666 23085 67353 46491 30925 43519 57431 23589
8174B3589j9482k1965j1628K6912M4046r82K0555J2842k1057j5779j959k6399
$$ 23589 4107 -17858 -29486 -2574 41472 40490 61045 73887 52830 37051 35092 8693
8162H693l961J0374l486J6728J8501J0693j0680j2920j0866j0486l9055O427L8693
$$ 8693 4732 15106 11620 28348 46849 57542 46862 33942 23076 12590 -26465 -20038 18655
8149A8655K0422J4949j4695k3498l0999O823J8673J5118m08P396J9748K9044L5915
$$ 18655 39077 54026 39331 15833 -15166 -8343 10330 25448 25040 32436 52184 81228 117143
8136A17143j108l8561j5445j1167K0410L6533j853o024N345m1163o1510j6755
$$ 117143 116035 77474 62029 50862 71272 107805 105952 99928 105273 64110 2600 -14155
8124a4155J1405M5168p20j8182k4269K7415J7575l836l6302k4543L0488M0881
$$ -14155 -2750 42418 41698 23516 -753 26662 44237 40401 4099 -20444 10044 50925
8112E0925J4893m785k2088J78M126P129j1495M468N13K1185R220j8910m083m0488
$$ 50925 65818 61033 38945 39123 43249 50378 38883 43351 43864 65049 74269 55359 51276 10788
8098A0788R37M7040L450k9750o9243j6797K9899K5235R876j8706K2572M2903K2250
$$ 10788 11725 58765 62215 32465 -36778 -53575 -23676 1559 11435 -7271 15301 58204 80454
8085H0454J933j4354p107K1223j3748m6731l8851N15P426J0305l146L5333L308
$$ 80454 82387 68033 60926 82149 68401 21670 -17181 -16666 -9240 1065 -2081 33252 36560
8072C6560j6892J8418K8824m273k0870j8652j5256R215r172L26J8382J5630M649
$$ 36560 19668 38086 66910 62637 41767 23115 7859 17074 7902 8228 26610 42240 46889
8059D6889J3176J0241j9172k6216P619k36J033O184K8738m494k2306N443n293
$$ 46889 60065 70306 51134 24918 32537 32301 33334 39518 68256 63762 41456 46899 41606
8046D1606j4469j3107M7221j5064p146M4771K8002m2246j7520R308m7753k7547
$$ 41606 27137 14030 61251 46187 39041 83812 111814 69568 52048 61356 13603 -13944
8034a3944J6535M6138k2762k4872j0816J1062K2442J8256r751k0244j0908O803
$$ -13944 2591 48729 25967 1095 -9721 1341 23783 42039 32288 12044 1136 7939
8022G939K838l909Q491j6147K3175J690k602m914P673N506j4445l593R21K816
$$ 7939 10777 6868 15359 -788 22387 24077 21475 16561 24234 29740 15295 11702 12623 15439
8008A5439j2185Q0J0113j0775K0075q869J2087j7572k4757L6959N1781l3977n901
$$ 15439 3254 3334 13447 2672 22747 13878 25965 8393 -16364 20595 72376 38399 32498
7995C2498M648j2368l2458n667O785N405J8355K0791k315l2839j6271r237L875
$$ 32498 37146 24778 -7680 -13347 -6562 -1157 17198 37989 35674 2835 -13436 -22673 -18798
7982a8798j3637j5207L6871Q02r088L3577M43j6645j4239j3791K315M2532Q415
$$ -18798 -32435 -47642 -10771 -9969 -19057 14520 14963 -1682 -15921 -29712 -27397 15135 23550
7969B3550r398q107l0092l7954K6494J55l017r853j63J5081k6320l9826j2747
$$ 23550 14152 6045 -24047 -62001 -35507 -35352 -38369 -48222 -48385 -33304 -59624 -99450 -112197
7956a12197P870J0452M4704K4144J1629M1157J6912k388j1578j5271j7996r058
$$ -112197 -104327 -93875 -49171 -25027 -13398 27759 44671 42283 30705 15434 -2562 -11620
7944a1620P920j7269J4727p059k416J5043J1162j1118N991j1449j20q723K0433
$$ -11620 -3700 -20969 -6242 -13301 -15717 -674 10488 -630 5361 -6088 -6208 -14931 5502
7931E502K4949j1775k6727j7354l3123m862J9369L2078J5716j6081k4806j2460
$$ 5502 30451 18676 -8051 -25405 -58528 -63390 -44021 -11943 3773 -12308 -37114 -49574
7919d9574K0511J4442J1524q346k6073M1795q44j0075k1742j4573L4434j1763
$$ -49574 -29063 -14621 -3097 -11443 -37516 4279 3435 -6640 -28382 -42955 -8521 -20284
7907b0284j7387J5066J7374L028J766L4692K1392j0584o802q702j4497M942p650
$$ -20284 -37671 -22605 -5231 -2203 -437 34255 55647 45063 38261 29559 15062 20004 12354
7894A2354k0905j4764J0788K5740L5974l4136j6192j94J1692r89k2871k2251P266
$$ 12354 -8551 -23315 -12527 13213 49187 15051 -1141 -1335 10357 9368 -13503 -35754 -28488
7881b8488J3676J2834J2284J843J2503J5292j1625o6609j5566M4232N1610J930
$$ -28488 -14812 -1978 10306 12149 24652 39944 28319 -38290 -53856 -9624 41986 43916
7869D3916Q786j8931j8127r318o274J7230O679k8175j0299L2625K7429k3037k6012
$$ 43916 52702 33771 15644 6326 52 17282 23961 -4214 -14513 18112 45541 22504 -3508
7856c508k9908O866L7194J4905j7015j6896j8266k156J2767Q199R674J0447k0393
$$ -3508 -33416 -26550 10644 25549 8534 -8362 -26628 -28784 -16017 -7818 1856 12303 -8090
7843h090k6296J4883L3987M0400k408l3410j4298L0393j009L257j0991J2526k0631
$$ -8090 -34386 -19503 14484 54884 52476 19066 4768 35161 34152 37409 26418 38944 18313
7830A8313k7023j8601j4565j1897K8604L7500K9284l1623p727J0658P316k6019
$$ 18313 -8710 -27311 -41876 -53773 -25169 12331 41615 9992 2265 12923 20239 -5780
7818e780R389k8654J57M5496K6760m5679k9801O037K790o411R768P971j2303P132
$$ -5780 3609 -25045 -24888 20608 47368 1689 -28112 -22075 -19285 -25696 -15928 -7957 -20260 -13128
7804a3128J9306J0693K6255L1252l7516j9577K180j5158o657P177n105q932O080
$$ -13128 6178 16871 43126 74378 36862 17285 19465 4307 -2350 4827 -278 -9210 -3130
7791c130L819n939m0091o068L5836K0617J6308l8183j095j2511N47J5335O476
$$ -3130 689 -5250 -45341 -51409 -15573 5044 21352 -16831 -17926 -30437 -29890 -14555 -8079
7778h079K3250K4245k2642k6550k2761K4359M0935j3626l4570r529O932j1569
$$ -8079 15171 39416 16774 -9776 -32537 -8178 32757 19131 -15439 -24968 -18036 -29605
7766b9605K7922L4340J4251q776l8686m255J5153n271J6766L5224J6515J6635
$$ -29605 -1683 32657 46908 38132 -554 -4809 10344 5073 21839 57063 73578 90213
7754I0213k9839o4964j5314J9494j7879K66m912j7165m804Q956Q532l516L533
$$ 90213 60374 -4590 -19904 -410 -18289 -18023 -22935 -40100 -44904 -35948 -27416 -30932 -27399
7741b7399J8858J8962l2057j3500k1259o582J9048J180K1023j5548j0324J2118
$$ -27399 -8541 10421 -21636 -35136 -56395 -62977 -43929 -42749 -21726 -37274 -47598 -35480
7729c5480j245L464P414K4841L715Q771K1940j8680r526J2306K626j165l477k7048
$$ -35480 -36725 -33261 -25847 -1006 2709 11480 33420 14740 5214 17520 20146 18981 15504 -11544
7715a1544m933l281j5336K0556k5229J9814K5332L3970j7785m1654j3135j5883
$$ -11544 -16477 -19758 -35094 -14538 -39767 -19953 5379 39349 21564 -20090 -33225 -49108
7703d9108J0640J738n950J7712K0687r416j5894l7862k0134J7573r28K1193M5459
$$ -49108 -38468 -36730 -42680 -24968 -4281 -13697 -29591 -67453 -87587 -70014 -70942 -49749 -4290
7690d290j1767L438J3737K2830m0404Q326K9810l0638j7399R871m683K9531j0945
$$ -4290 -16057 -12619 1118 23948 -16456 -8130 21680 -8958 -26357 -16486 -21169 8362 -2583
7677b583j2480R09J7980K8595J2241M016k3788j269k8887J4851L7473j4710k1590
$$ -2583 -15063 -14154 3826 32421 44662 48678 24890 23621 -5266 9585 47058 32348 10758
7664A0758m1095k1987j0363K7856L0292J0981m221q457K1501l9926k9881K1072
$$ 10758 -30337 -52324 -62687 -34831 -4539 6442 2221 -6236 15265 -24661 -54542 -33470
7652c3470K0231L7512j3263l4899j7872M4452J445j1755m947L633N970j7269K895
$$ -33470 -13239 24273 11010 -23889 -41761 2691 4136 -7619 -12566 -8933 -2963 -20232 -17337
7639a7337L335l4105O626O820J0731J2617J9889J6068J9370j3594m3818o838J2761
$$ -17337 -14002 -48107 -41481 -34661 -23930 -11313 8576 24644 44014 30420 -13398 -20236 -7475
7626g475N151j8300j3018l055J2299J3047J1962j2111j7431q463N991r388J8407
$$ -7475 -2324 -20624 -33642 -36697 -24398 -11351 611 -11500 -28931 -37394 -31403 -40791 -22384
7613b2384L3240q389j3554k3560J562J9749N297L74J2629L4738J2859k5563N868
$$ -22384 10856 2467 -11087 -34647 -33085 -13336 -8039 -7665 4964 39702 52561 26998 32866
7600C2866j8364k7166Q046r249k0084N6984J7962j2937k9481J2406R401l3488
$$ 32866 14502 -12664 -4618 -13867 -33951 23033 40995 28058 -1423 10983 20384 -13104
7588a3104j9296j4502J4244k0008J7501J7300M152P682m722K7741k5188j2908
$$ -13104 -32400 -46902 -32658 -52666 -35165 -17865 -13713 -6031 -10753 16988 -8200 -21108
7576b1108r926J481L2761Q32k0951J4796J2252j2908K3925r842r714J6368Q626
$$ -21108 -31034 -29553 3208 4040 -16911 -2115 10137 -2771 21154 11312 1598 17966 26592
7563B6592j8273j3524J1502j1898k340n2641O085J7449L1440j196M116p297k4103
$$ 26592 8319 -5205 6297 -5601 -7941 -60582 -54497 -37048 -5608 -6804 -2688 -9985 -34088
7550c4088L4514M5075l05l2815m846n397m5305m0323Q28N5184M9941o038k9334
$$ -34088 426 45501 45196 12381 7535 2138 -43167 -83490 -82662 -27478 22463 16425 -12909
7537a2909k0647Q101J8235j3271k7976J8083N0156K5512R454K599l4826j8966
$$ -12909 -33556 -25455 -7220 -20491 -48467 -30384 19772 45284 54738 57337 22511 3545
7525C545J5969J5964l2827l006K2158J9355M788j1185k4226j0086n937k9650m080
$$ 3545 19514 35478 2651 -355 21803 41158 45946 34761 10535 449 -5488 -35138 -39218
7512c9218o130L2714o130j7170p880l1295k100L1297J4140K5296o968n654J0013
$$ -39218 -45348 -12634 -18764 -35934 -43814 -75109 -77209 -45912 -31772 -6476 -13444 -19098 -9085
7499i085k856m3948P115L193k2506J333L403K65L9575J6215j7748K679O950j7699
$$ -9085 -11941 -55889 -48774 -45581 -68087 -66754 -63351 -63086 -23511 -7296 -25044 -22365 -15415 -33114
7485c3114p837k4629n534K2406L0307J6910m644R360j5763j5767m689K5280J421
$$ -33114 -40951 -65580 -71114 -48708 -18401 -1491 -6135 3225 -12538 -28305 -32994 -7714 -6293
7472f293J205J4401J862q418j9558p797J5321j1413j2017K3749P060k121K1717
$$ -6293 -5088 9313 11175 2757 -16801 -24598 -9277 -20690 -32707 -8958 -1898 -4019 17698
7459A7698L1285k4479p785J0921J402j9592j7529J3661j9956L380l507j5455j1029
$$ 17698 48983 24504 16719 27640 29042 9450 -8079 5582 -14374 -10994 -14501 -29956 -40985
7446d0985P796j0130K1180l548j4889j7908J4017N568j5058l0725L1746K4274
$$ -40985 -33189 -43319 -22139 -25687 -40576 -58484 -44467 -38899 -53957 -84682 -52936 -28662
7434b8662J5799N263J5998J8161J9097j5602k5923J142J4971J5331j6857l0097
$$ -28662 -12863 -7600 8398 26559 45656 30054 4131 5273 20244 35575 18718 -11379
7422a1379J2377j1622l904L2504L6192P632j1819j0497l690j9437j2794j9615
$$ -11379 998 -10624 -14528 17976 54168 61800 49981 39484 35794 16357 3563 -16052
7410a6052k4619L5581K2889L996n441j6214j3367L1946k1872j5486N086K9684
$$ -16052 -40671 -5090 17799 21795 16354 140 -13227 18719 -3153 -18639 -13553 16131
7398A6131m0784j0631k282j8943J8951M7271J3873k1669j4610L2523M3962k0035
$$ 16131 -24653 -35284 -37566 -56509 -37558 9713 23586 1917 -12693 19830 63792 43757
7386D3757l2724l524L408L456J5938j0071o313j8151j2593k0333M7165J8509R452
$$ 43757 11033 7509 10917 14373 30311 20240 13927 -4224 -16817 -37150 10015 28524 37976
7373C7976m5173l5263j0982K3098L8100j122k3610j7548r279J1746k7246K9547
$$ 37976 -7197 -42460 -53442 -30344 7756 6634 -16976 -34524 -43803 -32057 -59303 -29756
7361b9756L1627q720k361J8566j7073n986j3599j086J5361n870k317J0863L2181
$$ -29756 1871 -6849 -9210 9356 -7717 -13703 -27302 -28388 -13027 -18897 -21214 -10351 21830
7348B1830K1456l5073m3102l5334J1349M6195O467m5876j9957n843K0923J4235
$$ 21830 43286 8213 -34889 -70223 -58874 -12679 -6212 -52088 -72045 -77888 -56965 -42730
7336d2730J8615L5121m189k1835k4093M58J959j671J0569J4539j5831k3578P124
$$ -42730 -24115 11006 6817 -15018 -39111 -38653 -36694 -38365 -27796 -13257 -29088 -52666 -45542
7323d5542n249o202J5589K5173k278J9814J1166k8374j3117K6073q189j3336K7121
$$ -45542 -50791 -56993 -41404 -16231 -18509 1305 12471 -15903 -29020 -2947 -11136 -24472 2649
7310B649J8928J0195m4921o944K0446k5424j4644K5867L9921N270j2625q110j0880
$$ 2649 21577 31772 -13149 -20093 353 -25071 -39715 -13848 26073 31343 18718 10608 -272
7297b72j9019K1135L7919o3347k8846J8024J8160M695j4050j606J6303J2713J8862
$$ -272 -19291 1844 39763 -23584 -52430 -34406 -16246 -11551 -25601 -27207 -10904 1809 20671
7284B0671k0033N788k7048m4465L048L8979K5271l2018P791J1396O2349J6740
$$ 20671 638 6426 -20622 -65087 -62039 -23060 2211 -29807 -22016 -10620 51729 68469
7272F8469l2606m9020r815q477J6366K7944j828Q669j388l0797j6260j7093K8801
$$ 68469 35863 -13157 -22972 -31449 -15083 12861 11033 19702 18314 -12483 -28743 -45836 -17035
7259a7035K2379j8302n394J729J0175j7286j098K2633K4178m2338j7335J3613
$$ -17035 5344 -12958 -18352 -16623 -6448 -23734 -24832 -2199 21979 -20359 -37694 -24081
7247b4081J2138j526J7724j6939j4767j8844k3413J2771r84o016Q253K6841J199
$$ -24081 -11943 -13469 4255 -12684 -27451 -46295 -69708 -56937 -57921 -63937 -55684 -28843 -27644
7234b7644J1360j3541m2933O150K9570J9635J2967K4809K2916J4779p352O493
$$ -27644 -16284 -29825 -72758 -66608 -37038 -17403 -4436 20373 43289 58068 50716 57209
7222E7209l180o628l5867l819J1280k5403m1539R573K7460K7604j8535n389j807
$$ 57209 54029 47401 11534 7715 18995 -6408 -47947 -38374 -10914 16690 -1845 -7234 -9041
7209i041M225L967p637k4371k3030K2403L9976J4307j3425m3554N718K9989o236
$$ -9041 -4816 -849 -8486 -32857 -55887 -33484 6492 20799 7374 -36180 -30462 -473 -6709
7196f709j7250Q551j8951J4752j2605j586L4816j1420K092K0897l6342j5381K5240
$$ -6709 -23959 -15408 -34359 -19607 -32212 -33798 1018 -10402 -8310 12587 -23755 -39136 -13896
7183a3896K5084k7301k1108J9361J7839J7880j3585k3662j2395O002P270j1908
$$ -13896 11188 -16113 -37221 -17860 -21 17859 4274 -19388 -31783 -25781 -18511 -30419
7171c0419m3889J322P314L511K9186L1495K2356m610k715j1124l8706K8144J888
$$ -30419 -74308 -72986 -65672 -62161 -32975 -1480 20876 16266 13551 2427 -36279 -8135 -6247
7158f247J661L3114K4117k8468k4811J0862J9082j7555K3833R700m2453k2751
$$ -6247 -4586 28528 52645 24177 -634 10228 29310 11755 35588 45288 2835 -19916
7146a9916L61p804K7678m100p52k3552J8629K2081j661p434J1238p490K4094r136
$$ -19916 -19555 -27359 319 -3781 -4533 -28085 -9456 12625 10964 3530 14768 7278 31372 22236
7132B2236j8390R725j396k0891j6848K0096K4719p649J738J7662l540k532M631
$$ 22236 3846 13571 12175 -8716 -25564 -5468 19251 11602 13340 31002 27462 24930 29561
7119B9561l4984m914J2221J0056N880k5639n1218p25K2304k303Q71k216L3302
$$ 29561 -5423 -10337 1884 11940 17820 -7819 -59037 -59762 -37458 -39761 -38890 -41106 -7804
7106g804J3291l3619k4136p403L1154K5667L0899J7959j0380m668k8132k1443
$$ -7804 5487 -28132 -52268 -59671 -28517 -2850 28049 46008 35628 30960 2828 -18615
7094a8615j4756p534K4650K1424K9441Q330m7782k0744M107m954N384k2160L4953
$$ -18615 -33371 -40905 -16255 5169 34610 42940 -4842 -25586 -21479 -26433 -21049 -43209 -8256
7081h256K5460o949m7273l2393L2764J8439O220J937k0622m0894r934J6129J5838
$$ -8256 17204 10255 -37018 -69411 -36647 -18208 -11988 -10051 -30673 -71567 -81501 -65372 -49534
7068d9534K3781r867m418L703J9391J9165J4720J3775J0784l7439n0423k2172
$$ -49534 -25753 -35620 -40038 -36335 -16944 2221 16941 30716 41500 4061 -46362 -68534
7056f8534K829J6893k238J1009M4153K401j9284j7827k4807k4667J9060K4404
$$ -68534 -65705 -48812 -51050 -40041 4112 6513 -12771 -30598 -55405 -80072 -61012 -36608
7044c6608J7610K620L100K432k3805J0515K3986J8399J2034j0891j3959J2700
$$ -36608 -18998 -16378 -13278 -10846 -34651 -24136 -150 18249 30283 19392 5433 18133
7032A8133K5763l57k2432o762j427k5938O83K4140k2438m0304L2363J1828k787
$$ 18133 43896 43539 21107 14345 12918 -13020 -12337 11803 -10635 -50939 -18576 -6748 -9535
7019i535k3911o339o990j1657J282M7741n611k5974k28N924J7921L276n88m547
$$ -9535 -33446 -39785 -46775 -58432 -57150 -9409 -15020 -40994 -41222 -35298 -17377 -14101 -14689 -19236
7005a9236K2865p475j5102j7648l7948n2344K1140M6673L3494j6902J6281N843
$$ -19236 3629 -3846 -18948 -36596 -74544 -126888 -105748 -59075 -25581 -42483 -26202 -20359
6993b0359l331j3344n287N314K4111j174M3053n846q573r646q277l457O323P227
$$ -20359 -23690 -37034 -42321 -37007 -12896 -14070 28983 23137 14564 4918 -3359 -6816 -493 6734
6979F734J7448K4004p083j7284N886k3058Q406J6157k1540l7159K5924K0091k161
$$ 6734 24182 48186 41103 23819 29705 6647 15053 31210 9670 -27489 -1565 18526 16365
6966A6365k7139l882J1149j9018m873j9016j3300K4134J7233J275R698q523j3352
$$ 16365 -10774 -14656 -3507 -22525 -27398 -46414 -59714 -35580 -18347 -17072 -7374 -15897 -29249
6953b9249j846k0049q830j8148R821L4475K9105J5023Q653j169m6006m9277o634
$$ -29249 -31095 -51144 -59974 -78122 -68301 -33826 -4721 10302 18955 17786 -28220 -77497 -84131
6940h4131J8032L2057J3752J057L0502L7292k7474k4002o5597M275J2631J2850
$$ -84131 -66099 -34042 -20290 -19233 11269 48561 21087 -2915 -68512 -64237 -51606 -38756
6928c8756L3004j1430L1245K8423k6371j0666J1215k4586l6247j0264p444j722
$$ -38756 -5752 -17182 14063 42486 16115 5449 16664 -7922 -44169 -54433 -61877 -63599
6916f3599l6512k258K5644Q101J2963M549K4771J8379q880L7664L931P479j6806
$$ -63599 -100111 -102369 -76725 -68624 -55661 -51112 -26341 -7962 -16842 20822 24753 32232 15426
6903A5426k2486k3593q829R075j2780J3727J7760j8834l131j226K4554J9183j8945
$$ 15426 -7060 -30653 -39482 -30407 -43187 -29460 -11700 -30534 -33665 -34891 -10337 8846 -10099
6890a0099o931K2614j9906k6311J9035j8741n163J9101K2490J5014k1416l631
$$ -10099 -17030 5584 -14322 -40633 -21598 -40339 -45502 -26401 -3911 11103 -10313 -13944
6878a3944N254j8878R076K5610L934N764P108P0m2991m0024J7899K4606K8045
$$ -13944 -8690 -27568 -18492 7118 11052 16816 23924 23994 -18997 -59021 -41122 -16516 11529
6865A1529M59m388k4592p044K897K3254R330K2733K3402J458m4003l4134m204
$$ 11529 11988 7600 -16992 -24036 -21139 2115 11445 34178 57580 59038 15035 -19099 -23303
6852b3303q946n567k1012j4408P014L1214j0825j9856J2172K1915q97l661j1413
$$ -23303 -32249 -37816 -58828 -73236 -66222 -35008 -45833 -65689 -53517 -31602 -32499 -36160 -47573
6839d7573L7J7308l302m1041K0784L6501Q589K1000l256j632j7936j152J1995
$$ -47573 -47536 -30228 -33530 -74571 -53787 -17286 -8697 12303 9047 7415 -10521 -11673 322
6826C22J3819K753q332j2374L3804L095L2995L246l1514k2256K600Q435p735p537
$$ 322 14141 16894 8562 -3812 29992 33087 66082 69328 37814 15558 18158 26593 18858 11321
6812A1321j5692k4029q469j2754k5648J0313J7635Q776J4793J566l593K4469Q386
$$ 11321 -4371 -28400 -36869 -49623 -75271 -64958 -47323 -38547 -23754 -22188 -25781 -1312 7074
6799G074J8606J1862J6854k4125k6630P825k451j6497j4029O578L5851r589j5087
$$ 7074 25680 37542 54396 30271 3641 11466 9015 -7482 -21511 -14933 20918 11329 -3758
6786c758J0936j3440j4503L001j3983R256K6468r335k633L5368j4302l6442j1783
$$ -3758 7178 -6262 -20765 -17764 -31747 -22491 3977 -5358 -7991 27377 13075 -23367 -35150
6773c5150k0917j1061Q786m01J4442L948N4624K7642j9544j2894k6013n799J4973
$$ -35150 -56067 -67128 -58342 -58743 -44301 -40353 14271 41913 22369 9475 -16538 -22337 -7364
6760g364K9989j3042J3239k0386J0839K8273J8283q112M416K2464q192k6306j6609
$$ -7364 22625 9583 22822 2436 13275 41548 59831 51719 56135 78599 70407 44101 27492
6747B7492m9192K435N3377J3182q660q800q961m520p697j7872r121L5179K191
$$ 27492 -21700 -19265 34112 47294 38634 29834 20873 16353 8656 -9216 -18337 16842 19033
6734A9033j959L3879m2992j7111N106j934M4694K7788j8675j2269J880m413J2668
$$ 19033 17074 50953 7961 -9150 -4044 -5978 38716 66504 47829 35560 37440 33027 45695
6721D5695O6827O4454Q8639L4321l0905k735k5076m7283r8715m1699K2712O876
$$ 45695 112522 176976 265615 299936 269031 266296 241220 193937 95222 53523 76235 83111
6709H3111j3075R837n1569m3385L879L1080M2570k1293k9106N126N619L0474j1676
$$ 83111 70036 79873 28304 -15081 -11202 19878 62448 41155 12049 17175 22794 53268 41592
$$ [...]
##END NTUPLES=NMR SPECTRUM
##END=
