##TITLE=Analysis number 312986
Compound Code km 00084
Book Reference 335/160
Project Code adrs
Chemist Name davee
##JCAMPDX= 6.0         $$ Bruker NMR JCAMP-DX V2.0
##DATA TYPE= NMR SPECTRUM
##DATA CLASS= NTUPLES
##ORIGIN= Bruker BioSpin GmbH
##OWNER= NMR
$$ XWIN-NMR		Version 3.5
$$ Mon Aug 22 14:41:20 2005 GMT Daylight Time (UT+1h)  MAYBRIDGE\NMR@NMR_250MHZ
##.OBSERVE FREQUENCY= 250.131544655141
##.OBSERVE NUCLEUS= ^1H
##.ACQUISITION MODE= SIMULTANEOUS (DQD)
##.ACQUISITION SCHEME= undefined
##.AVERAGES= 16
##.DIGITISER RES= 18
##SPECTROMETER/DATA SYSTEM= dpx250
##.PULSE SEQUENCE= zg30
##.SOLVENT NAME= CDCl3
##.SHIFT REFERENCE= (INTERNAL, CDCl3, 0, 16.522)
##AUDIT TRAIL= $$ (NUMBER, WHEN, WHO, WHERE, WHAT)
$$ ##TITLE= Audit trail, XWIN-NMR		Version 3.5
$$ ##JCAMPDX= 5.01
$$ ##ORIGIN= Bruker BioSpin GmbH
$$ ##OWNER= NMR
$$ C:\u/data/dgb/nmr/ADRS/8330/pdata/1/auditp.txt
$$ ##AUDIT TRAIL=  $$ (NUMBER, WHEN, WHO, WHERE, WHAT)
(   1,<2005-08-22 14:40:45.55 +100>,<MAYBRIDGE\NMR>,<NMR_250MHZ>,
      <created by zg, POWCHK disabled, PULCHK disabled
       configuration hash MD5:
       62 19 C7 07 E1 42 D1 B7 37 6C 3D D0 77 39 F9 E6
       data hash MD5: 64K
       28 B9 5F 67 8E A4 16 E7 DB 51 71 3A 11 D1 EB 5F>)
(   2,<2005-08-22 14:41:00.60 +100>,<MAYBRIDGE\NMR>,<NMR_250MHZ>,
      <Start of raw data processing
       ef LB = 0.3 FT_mod = 6 PKNL = 1 SI = 32K 
       data hash MD5: 32K
       36 31 DF B0 3C 52 AA EA 72 F6 D2 02 C5 2A AF A7>)
(   3,<2005-08-22 14:41:06.33 +100>,<MAYBRIDGE\NMR>,<NMR_250MHZ>,
      <apk 
       data hash MD5: 32K
       CA 7E 75 2B D0 D7 66 19 0E 59 E2 34 94 D1 E7 6B>)
(   4,<2005-08-22 14:41:08.00 +100>,<MAYBRIDGE\NMR>,<NMR_250MHZ>,
      <abs ABSG = 5 
       data hash MD5: 32K
       94 16 B0 FE 6A CF B0 9F 42 41 2E 61 EF 31 24 F5>)
$$ ##END=
$$ 
$$ hash MD5
$$ 4B 68 F3 AA A8 0A C4 99 90 27 A3 ED 56 35 82 04
##$RELAX= 
##$RELAX= 
##$RELAX= 
##$RELAX= 
##$RELAX= 
##$RELAX= 
##$RELAX= 
$$ Bruker specific parameters
$$ --------------------------
##$DU= <C:\u>
##$EXPNO= 8330
##$NAME= <ADRS>
##$PROCNO= 1
##$TYPE= <nmr>
##$USER= <dgb>
##$AMP= (0..31)
100 100 100 100 100 100 100 100 100 100 100 100 100 100 100 100 100 100 
100 100 100 100 100 100 100 100 100 100 100 100 100 100 
##$AQSEQ= 0
##$AQ_mod= 3
##$AUNM= <au_zg>
##$AUTOPOS= <28 >
##$BF1= 250.13
##$BF2= 250.13
##$BF3= 250.13
##$BF4= 250.13
##$BF5= 500.13
##$BF6= 500.13
##$BF7= 500.13
##$BF8= 500.13
##$BYTORDA= 1
##$CFDGTYP= 0
##$CFRGTYP= 5
##$CHEMSTR= <none>
##$CNST= (0..31)
1 1 145 1 1 1 1 1 1 1 1 1 1 1 1 1 1 1 1 1 1 1 1 1 1 1 1 1 1 1 1 1 
##$CPDPRG= <>
##$CPDPRG1= <>
##$CPDPRG2= <>
##$CPDPRG3= <>
##$CPDPRG4= <mlev>
##$CPDPRG5= <mlev>
##$CPDPRG6= <mlev>
##$CPDPRG7= <mlev>
##$CPDPRG8= <mlev>
##$CPDPRGB= <>
##$CPDPRGT= <>
##$D= (0..31)
0 1 0 0 0 0 0 0 0 0.06 0 0 0 0 0 0 0.0002 0 0 0 0 0 0 0 0 0 0 0 0 0 0 
0 
##$DATE= 1124718044
##$DBL= (0..7)
120 120 120 120 120 120 120 120 
##$DBP= (0..7)
150 150 150 150 150 150 150 150 
##$DBP07= 0
##$DBPNAM0= <>
##$DBPNAM1= <>
$$ [...]
##$SUBNAM7= <"">
##$SUBNAM8= <"">
##$SUBNAM9= <"">
##$SW= 20.6930455092707
##$SWIBOX= (0..15)
0 0 3 0 0 0 0 0 0 0 0 0 0 0 0 0 
##$SW_h= 5175.983436853
##$TD= 65536
##$TD0= 1
##$TE= 295.16
##$TE2= 300
##$TE3= 300
##$TEG= 300
##$TL= (0..7)
0 120 120 120 120 120 120 120 
##$TP= (0..7)
150 150 150 150 150 150 150 150 
##$TP07= 0
##$TPNAME0= <>
##$TPNAME1= <>
##$TPNAME2= <>
##$TPNAME3= <>
##$TPNAME4= <>
##$TPNAME5= <>
##$TPNAME6= <>
##$TPNAME7= <>
##$TPOAL= (0..7)
0.5 0.5 0.5 0.5 0.5 0.5 0.5 0.5 
##$TPOFFS= (0..7)
0 0 0 0 0 0 0 0 
##$TUNHIN= 0
##$TUNHOUT= 0
##$TUNXOUT= 0
##$USERA1= <user>
##$USERA2= <user>
##$USERA3= <user>
##$USERA4= <user>
##$USERA5= <user>
##$V9= 5
##$VALIST= <valist>
##$VCLIST= <CCCCCCCCCCCCCCC>
##$VD= 0
##$VDLIST= <DDDDDDDDDDDDDDD>
##$VPLIST= <PPPPPPPPPPPPPPP>
##$VTLIST= <TTTTTTTTTTTTTTT>
##$WBST= 1024
##$WBSW= 4
##$XGAIN= (0..3)
0 0 0 0 
##$XL= 0
##$YL= 0
##$YMAX_a= 346684
##$YMIN_a= -560454
##$ZGOPTNS= <>
##$ZL1= 120
##$ZL2= 120
##$ZL3= 120
##$ZL4= 120
##$ABSF1= 16.522
##$ABSF2= -4.171173
##$ABSG= 5
##$ABSL= 3
##$ALPHA= 0
##$AQORDER= 0
##$ASSFAC= 0
##$ASSFACI= 0
##$ASSFACX= 0
##$ASSWID= 0
##$AUNMP= <proc_1d>
##$AZFE= 0.1
##$AZFW= 0.1
##$BCFW= 0
##$BC_mod= 0
##$BYTORDP= 0
##$COROFFS= 0
##$CY= 12.5
##$DATMOD= 1
##$DC= 0
##$DFILT= <>
##$DTYPP= 0
##$F1P= 14.0000005364418
##$F2P= -0.99999901652339
##$FCOR= 0.5
##$FTSIZE= 32768
##$FT_mod= 6
##$GAMMA= 0
##$GB= 0
##$INTBC= 1
##$INTSCL= 1
##$ISEN= 128
##$LB= 0.3
##$LEV0= 0
##$LPBIN= 0
##$MAXI= 10000
##$MC2= 0
##$MEAN= 0
##$ME_mod= 0
##$MI= 0
##$NCOEF= 0
##$NC_proc= -2
##$NLEV= 6
##$NOISF1= 0
##$NOISF2= 0
##$NSP= 0
##$NTH_PI= 0
##$NZP= 0
##$OFFSET= 16.522
##$PC= 1
##$PHC0= -108.2926
##$PHC1= 52.01711
##$PH_mod= 1
##$PKNL= yes
##$PPARMOD= 0
##$PSCAL= 4
##$PSIGN= 0
##$REVERSE= no
##$SF= 250.13
##$SI= 32768
##$SIGF1= 0
##$SIGF2= 0
##$SINO= 400
##$SIOLD= 32768
##$SREGLST= <1H.CDCl3>
##$SSB= 0
##$STSI= 32768
##$STSR= 0
##$SW_p= 5175.98343685301
##$SYMM= 0
##$S_DEV= 0
##$TDeff= 65536
##$TDoff= 0
##$TI= <Analysis number 999999
Compound Code 99
Book Reference 9
Project Code 9>
##$TILT= no
##$TM1= 0
##$TM2= 0
##$TOPLEV= 0
##$USERP1= <user>
##$USERP2= <user>
##$USERP3= <user>
##$USERP4= <user>
##$USERP5= <user>
##$WDW= 1
##$XDIM= 32768
##$YMAX_p= 273473261
##$YMIN_p= -406013
$$ End of Bruker specific parameters
$$ ---------------------------------
##NTUPLES= NMR SPECTRUM
##VAR_NAME=  FREQUENCY,     SPECTRUM/REAL,   SPECTRUM/IMAG
##SYMBOL=    X,             R,               I
##VAR_TYPE=  INDEPENDENT,   DEPENDENT,       DEPENDENT
##VAR_FORM=  AFFN,          ASDF,            ASDF
##VAR_DIM=   32768,         32768,           32768
##UNITS=     HZ,            ARBITRARY UNITS, ARBITRARY UNITS
##FACTOR=    0.157963299565203, 1,           1
##FIRST=     4132.6476996994, 0,             0
##LAST=      -1043.33573715361, 0,           0
##MIN=       -1043.33573715361, -406013,     0
##MAX=       4132.6476996994, 273473261,     0
$$ Real data points
##PAGE= N=1
##DATA TABLE= (X++(R..R)), XYDATA
$$ [...]
20509 2286 8310 -289 -1327 81 3668 5055 7577 14000 11314 4810 7313 5187 726 -558 10
20494 10 6474 6357 4990 4984 8980 8535 3538 4780 1105 7404 6944 4699 440 -1899 -1473 -5693 -3491
20477 -3491 5384 9888 5883 488 -5260 -3477 -7289 -12112 -7549 -9532 -11438 -9217 -726 2776 -3182
20462 -3182 -5997 -5553 1537 5970 1097 -3699 -311 1464 8007 8028 1124 3585 6908 7934 3154
20447 3154 -811 -3076 1201 2779 4555 4084 5659 7513 5790 1535 5254 5637 1170 -779 1395
20432 1395 1262 -213 5216 11555 8346 14318 16411 15408 17263 16787 10170 4482 5713 10727 11841
20417 11841 9659 7206 7786 6450 3191 5953 5564 4467 6535 8734 5310 1033 4334 14412 16181
20402 16181 11629 1837 -1262 3979 4130 -815 -1447 -2171 -3993 -6495 -1374 -4764 -7565 -5516 353
20387 353 5813 11681 15840 10324 10371 5117 -3305 -5522 -3869 393 4922 -2663 515 30 3978 6007
20371 6007 2996 -4958 -7110 -9084 -544 5114 7140 -705 -21 -338 -6521 -6264 997 1211 1884 833
20355 833 -2053 -3263 335 -1136 -1431 -1313 1019 -5004 -5115 -7305 -6727 -7576 -12151 -7427 -4189 -7753
20339 -7753 -12650 -7911 2007 3751 332 755 5130 4312 6181 8317 631 -45 -1526 -5742 -7133
20324 -7133 -9596 -1262 6308 1772 2351 10991 11924 2946 -1152 -1684 -3130 -2642 -41 -3686 -5764 -7507
20308 -7507 -1644 2116 1041 -4192 -4376 375 -2889 -10825 -9460 -12874 -10794 -8877 2208 4330 -877
20293 -877 4255 9845 7786 -1928 -11320 -20426 -18900 -10108 1423 1088 5166 5755 7720 2536 -2640
20278 -2640 -2667 -4430 -4320 -2999 -4322 -10513 -13974 -19445 -15420 -12472 -9228 -6643 -2611 2709 -413
20263 -413 -1854 -9054 -10093 -3749 -2058 -7174 -5172 -3041 -2008 -3758 -94 -7758 -6043 -6429 4290
20248 4290 11004 9015 682 -5579 -8989 -6932 -9484 -12715 -14187 -13812 -16453 -15294 -13327 -14096 -14874
20233 -14874 -9633 -7068 -2651 -901 -3805 1987 -5094 -6690 -2600 -1214 5642 3222 -788 -3077
20219 -3077 -5812 -8787 -11601 -10479 -9314 -7142 -8042 -9038 -8933 -7813 -11156 -11354 -5338 -1817 -6586 -10693
20203 -10693 -11243 -5839 -9975 -20806 -15720 -16411 -18009 -17334 -15456 -8005 -3528 -4457 -6341 -4327 -5439
20188 -5439 -7851 -4601 -7387 -5972 -374 -888 -3621 -4815 4389 7833 5316 6250 -2883 -7895 -2371
20173 -2371 7063 5828 -1146 -8631 -3656 -619 -1022 -669 7133 4279 1711 -1319 -3859 -5714 -10489
20158 -10489 -13883 -15110 -12668 -13506 -14467 -8987 -10857 -18346 -18097 -12572 -4545 982 -724 -8648 -6070
20143 -6070 -7085 -2981 -2119 -2698 -6077 -9342 -7072 -6993 -9696 -7217 -9669 -8539 -10851 -8904 -4757 -8237
20127 -8237 -4127 -2004 -6346 -9849 -3787 -902 -641 -4697 -5220 -6472 -4234 -10986 -7229 -6823 -8995
20112 -8995 -12527 -19898 -17389 -12612 -7456 -7577 -11826 -9481 -4239 -4017 -5651 -10585 -10628 -7297 -5739 -8148
20096 -8148 -11957 -17013 -18549 -15606 -13309 -14648 -6999 -2418 -2477 -9110 -12182 -11474 -9391 -6282 -2716
20081 -2716 -7002 -7776 -4952 -4524 -8341 -11493 -15093 -11428 -9817 -9657 -6515 -9665 -12091 -10476 -6436
20066 -6436 -4668 -10014 -11559 -11845 -10193 -4527 -5982 -13906 -17204 -16032 -16141 -7899 -5464 -3950 -8670
20051 -8670 -9371 -12623 -17806 -16635 -14751 -16029 -18195 -20814 -15212 -15452 -13879 -10832 -13707 -15993 -20536
20036 -20536 -22746 -19662 -11883 -7411 -9806 -13545 -9104 -13426 -19468 -26854 -23153 -20965 -18685 -14742
20022 -14742 -19560 -17402 -13181 -9039 -5147 -6927 -8379 -7539 -8606 -9751 -10505 -10390 -10571 -6924 -8507
20007 -8507 -9726 -11083 -11394 -3558 -1945 -4324 -4970 -10514 -8930 -4716 -9695 -14873 -13804 -7253 -10509
19992 -10509 -19129 -15246 -6355 -8510 -12069 -10786 -10995 -12648 -9635 -11134 -9890 -14552 -15580 -17083 -9941
19977 -9941 -2194 -7253 -15175 -20971 -25546 -12750 -9522 -9797 -9296 -13565 -14318 -12585 -17619 -19897 -11559
19962 -11559 -6466 -11646 -13993 -11645 -12699 -11720 -15640 -17320 -17800 -13504 -10402 -14563 -11379 -5243 -12619
19947 -12619 -22755 -23873 -21826 -24008 -24848 -21401 -22066 -21090 -20270 -21505 -17261 -10810 -14883 -11825 -12131
19932 -12131 -18780 -17655 -12175 -16347 -17698 -16744 -21090 -23241 -19183 -20689 -18474 -16461 -13727 -15933 -21014
19917 -21014 -19436 -13199 -11639 -21207 -28854 -34367 -33345 -29956 -27694 -25349 -14018 -6666 -4997 -7765
19903 -7765 -9781 -15944 -11314 -14161 -18518 -24310 -25259 -19055 -21718 -21610 -16510 -15290 -16309 -21587 -23753
19888 -23753 -22261 -20587 -22309 -19358 -12692 -16003 -20728 -24262 -25924 -27564 -27703 -21639 -19652 -19610 -26351
19873 -26351 -21873 -22551 -18083 -14670 -17609 -20268 -19457 -26988 -29249 -29095 -26826 -22510 -18312 -9770 -12675
19858 -12675 -16280 -15915 -20631 -20719 -14091 -17334 -19796 -21202 -20525 -19813 -19783 -23348 -21555 -14428 -15658 -17340
19842 -17340 -18694 -15135 -11956 -13697 -12236 -16222 -12881 -9443 -21306 -24533 -23279 -23907 -24287 -26263 -32178
19827 -32178 -36276 -32454 -27040 -26569 -27470 -20263 -14493 -19981 -20123 -18765 -16855 -13733 -24455 -24605 -25603
19812 -25603 -27672 -22861 -18787 -20165 -13975 -12605 -16945 -23075 -26457 -29873 -23814 -19194 -22024 -27688
19798 -27688 -27376 -21593 -14445 -12142 -13570 -13524 -13796 -19182 -21732 -18330 -17369 -22733 -25724 -14315 -10192
19783 -10192 -14294 -17866 -17762 -18098 -16136 -14767 -23962 -28235 -17930 -5179 -4455 -12969 -27707 -34009
19769 -34009 -31577 -32218 -28161 -26903 -28405 -30445 -30425 -27904 -21997 -17076 -13504 -16528 -18620 -14550 -17145
19754 -17145 -19523 -23191 -27036 -20562 -14917 -19291 -19250 -17873 -20086 -16014 -14486 -21410 -26109 -28717 -25891
19739 -25891 -18897 -20813 -21881 -20937 -22347 -23740 -23745 -19486 -17186 -23360 -21556 -23102 -31266 -27772 -25774
19724 -25774 -34872 -34872 -31317 -29578 -28840 -27865 -25386 -25983 -30254 -30007 -25231 -22821 -15064 -16365 -21831 -29786
19708 -29786 -29552 -25590 -26145 -22416 -23360 -21249 -21945 -22257 -23765 -23498 -24139 -26049 -25452 -24499 -23496 -27347 -25068
19691 -25068 -23697 -22998 -23396 -24589 -21600 -19802 -18914 -15358 -14274 -10821 -17822 -21566 -24275 -20034 -20365
19676 -20365 -19757 -15772 -21514 -24864 -28579 -27998 -26919 -24305 -25817 -27123 -28232 -27548 -28609 -31595 -31456
19661 -31456 -29635 -20402 -18191 -22797 -20536 -27209 -30154 -21767 -22511 -23617 -26568 -29693 -30904 -33222 -32395
19646 -32395 -35866 -36032 -30764 -23362 -22595 -22820 -26317 -27424 -27235 -32809 -32274 -24396 -22561 -28281 -25747 -31805
19630 -31805 -31584 -30099 -24915 -22232 -29453 -28336 -24655 -32485 -34520 -34190 -28700 -26541 -27860 -28867 -30685
19615 -30685 -31299 -30540 -26949 -26728 -25085 -21228 -31028 -37667 -28799 -21611 -17550 -16347 -24462 -27487 -22633
19600 -22633 -22670 -26987 -34952 -34201 -31991 -28137 -19680 -19152 -23440 -26489 -18626 -16539 -17788 -22726 -27219
19585 -27219 -25717 -26911 -28555 -32765 -34726 -29647 -34440 -42278 -44580 -39657 -30561 -28099 -27456 -30460 -32592
19570 -32592 -28061 -26320 -18962 -25680 -26276 -26999 -34139 -33710 -31163 -29475 -31747 -30405 -21978 -17767 -21673
19555 -21673 -27017 -27076 -25585 -22984 -22457 -26669 -27308 -23372 -24393 -25264 -26727 -33127 -33256 -35287 -38260 -42646
19539 -42646 -39763 -35338 -35536 -33228 -22812 -22002 -22551 -16838 -17993 -19799 -18754 -20523 -13900 -15241 -22633
19524 -22633 -27893 -32851 -32355 -31665 -31099 -33519 -26355 -24980 -19299 -19025 -22497 -24164 -26406 -25901 -27527 -32979
19508 -32979 -28589 -38680 -40258 -33657 -31635 -32667 -29122 -26642 -22664 -25478 -24491 -17313 -23318 -21960
19494 -21960 -20596 -27338 -36992 -34764 -25860 -23524 -22380 -21461 -18314 -18718 -20275 -26394 -30933 -30885 -29840
19479 -29840 -28080 -30204 -37179 -43178 -44866 -37704 -30049 -23290 -28236 -28996 -24480 -26309 -25189 -26923 -33333
19464 -33333 -40627 -41899 -36050 -24909 -17461 -21877 -29446 -37689 -40528 -43144 -40642 -38990 -38532 -36251
19450 -36251 -29906 -25488 -24493 -21894 -18643 -16236 -23059 -31885 -32731 -26162 -26799 -29654 -23710 -17459 -16093
19435 -16093 -25349 -30095 -27611 -21527 -24307 -27091 -22608 -14268 -17832 -23670 -24304 -29799 -28733 -31520 -32792
19420 -32792 -34067 -35435 -33549 -31910 -28630 -26800 -23928 -24434 -27468 -22164 -22806 -29298 -31553 -31717 -27400
19405 -27400 -28694 -34624 -37811 -39479 -42362 -46135 -39633 -36429 -31098 -32730 -35171 -31818 -27716 -32651
19391 -32651 -36932 -39122 -34690 -32360 -34294 -37608 -42984 -40367 -37829 -32643 -37112 -32274 -26810 -30172
19377 -30172 -34338 -31015 -20655 -17896 -17355 -23329 -23663 -24599 -29547 -27698 -25203 -25682 -26906 -28373 -28842
19362 -28842 -30716 -34726 -34613 -33954 -30114 -23213 -27382 -33607 -35770 -31035 -32791 -31527 -29759 -20511 -17722
19347 -17722 -20664 -29662 -36428 -38325 -36171 -32391 -34169 -40306 -46172 -45609 -38941 -24955 -17606 -20583
19333 -20583 -22462 -22018 -19495 -28489 -32208 -34698 -38356 -33264 -35645 -36802 -36591 -32364 -30839 -39415 -39298
19318 -39298 -33294 -30449 -34333 -38192 -39578 -38783 -38561 -37859 -41311 -36741 -30671 -25936 -28977 -32397 -24048
19303 -24048 -19971 -25046 -27306 -29269 -30148 -23433 -27440 -26368 -26930 -28709 -33858 -33114 -28469 -33889 -28828
19288 -28828 -24018 -21816 -22755 -19885 -26780 -26495 -26913 -26317 -26084 -23441 -20967 -28956 -35618 -33767 -32185 -35632
19272 -35632 -38970 -39478 -32896 -27023 -25099 -26300 -33457 -34090 -34440 -32331 -32300 -37344 -38145 -38323 -35518 -31045
19256 -31045 -31668 -34559 -31912 -29797 -32988 -31370 -26184 -25556 -32676 -37883 -32358 -29128 -34220 -32324 -36011
19241 -36011 -38618 -33967 -36977 -34628 -24518 -22408 -27879 -28632 -27428 -24884 -21632 -27350 -34204 -31933
19227 -31933 -28097 -30687 -32452 -26983 -21611 -24319 -30920 -33180 -33252 -39329 -41612 -40874 -37015 -39622 -36663
19212 -36663 -34043 -29156 -29376 -29973 -31359 -36639 -37337 -32108 -27630 -27937 -27096 -21184 -16187 -18966 -19162 -26512
19196 -26512 -27215 -24354 -26382 -22273 -23716 -18899 -23296 -32217 -34415 -30088 -32765 -39515 -35326 -30043 -36024
19181 -36024 -42920 -43330 -42390 -36693 -37971 -37039 -33361 -33030 -33195 -31571 -24897 -19730 -20459 -23788 -33778 -33113
19165 -33113 -26587 -19933 -18496 -20756 -23868 -23054 -24078 -19138 -19202 -22300 -27752 -22454 -19275 -19116 -23747
19150 -23747 -28604 -31077 -27518 -18249 -20361 -22542 -25184 -32029 -30449 -27250 -28151 -29666 -32515 -30543 -28605
19135 -28605 -28557 -36219 -37429 -33458 -34018 -31645 -29425 -29248 -29361 -25940 -18439 -17975 -18204 -23645 -25201 -24419
19119 -24419 -28382 -32203 -29730 -26657 -23579 -21157 -20909 -21789 -24128 -30970 -33098 -37954 -40322 -40648 -36080
19104 -36080 -34249 -29857 -28313 -27310 -31660 -32731 -27080 -31626 -33650 -26816 -20811 -17177 -17424 -19500 -21987
19089 -21987 -21178 -27045 -25945 -21062 -17652 -15410 -15250 -21926 -26873 -28183 -28097 -22984 -20940 -24322 -26580
19074 -26580 -31744 -38037 -34132 -30370 -26778 -29594 -37008 -38589 -39947 -40463 -36650 -33495 -35811 -30705 -27285
19059 -27285 -25729 -22008 -21276 -20106 -20768 -24397 -30324 -32539 -32172 -32124 -29159 -28850 -29835 -32728 -34034 -36035
19043 -36035 -28187 -25598 -25937 -28183 -28875 -27576 -31377 -34906 -34754 -23450 -14740 -14029 -17374 -18544 -22043
19028 -22043 -23045 -25138 -31505 -37751 -33455 -32144 -31979 -33585 -36828 -43854 -44880 -39382 -32363 -28824 -34568
19013 -34568 -41887 -36672 -21746 -18255 -26273 -34045 -35447 -38300 -44170 -40443 -43255 -44183 -40173 -33916
18999 -33916 -21312 -15033 -23050 -33587 -32550 -28012 -28477 -31368 -30560 -28288 -26087 -27427 -26733 -29363 -33258
18984 -33258 -35197 -37617 -39764 -39264 -44597 -44351 -44202 -39617 -36845 -36771 -34108 -32100 -31846 -33796 -30344 -28949
18968 -28949 -35117 -35562 -33402 -31420 -30958 -36234 -36220 -35210 -35323 -32484 -27845 -30790 -35480 -38860 -34980 -34791
18952 -34791 -41370 -34184 -28562 -31019 -39230 -43161 -42240 -41875 -39099 -33622 -28573 -32238 -30829 -30700 -31723
18937 -31723 -36272 -32529 -32156 -27809 -27676 -32261 -37719 -46245 -47836 -41288 -35380 -27701 -28433 -34252 -30024
18922 -30024 -27531 -28926 -31244 -32658 -32755 -33577 -37620 -31737 -33453 -32736 -32061 -32537 -34424 -34600 -34861 -32196
18906 -32196 -30071 -30390 -35380 -33462 -34785 -36734 -35246 -32582 -34811 -35449 -37506 -39793 -39378 -38648 -39173 -36547
18890 -36547 -37562 -38928 -39098 -32847 -35672 -38197 -39155 -36899 -33719 -36207 -33475 -32580 -39787 -41428 -34970
18875 -34970 -34369 -36709 -35650 -32774 -31122 -29049 -33019 -25760 -26664 -33254 -33735 -33486 -31337 -28846 -30040
18860 -30040 -36908 -37754 -35174 -31099 -29793 -27441 -32734 -37952 -30858 -28951 -26122 -30022 -30867 -28602 -21164
18845 -21164 -20259 -24491 -25293 -21574 -21413 -27807 -29198 -31906 -30783 -33123 -36651 -29118 -30158 -31799 -31407
18830 -31407 -30226 -30702 -33474 -33367 -34405 -37335 -35676 -35711 -36871 -32967 -35077 -34852 -29023 -28505 -27858 -14576
18814 -14576 -9763 -14291 -17499 -14732 -15391 -18787 -24967 -33541 -41269 -41777 -37089 -35765 -36296 -38853 -42298
18799 -42298 -36544 -34848 -39572 -37647 -31548 -26588 -28262 -32716 -34064 -34372 -36094 -37432 -34014 -34368 -37577
18784 -37577 -37374 -33892 -34494 -36867 -37937 -30020 -23726 -25837 -24158 -24600 -25164 -21951 -25847 -25573 -20869 -18055
18768 -18055 555 12547 19568 18491 352 -19673 -19972 -17762 -21940 -27363 -31969 -29234 -30220 -38061
18754 -38061 -39543 -34303 -32131 -35462 -29978 -29663 -37881 -41361 -39275 -31945 -29002 -32805 -33797 -35457 -36817
18739 -36817 -32001 -31538 -31444 -33657 -35556 -37214 -37276 -31309 -30578 -26322 -32361 -42503 -47032 -41605 -42421 -45258
18723 -45258 -43499 -38577 -35839 -34349 -37266 -40866 -33040 -30659 -32803 -29652 -36427 -38271 -39137 -39860 -38835
18708 -38835 -33493 -24154 -23520 -30954 -32043 -34498 -45794 -48088 -39375 -33724 -38861 -37927 -36246 -32986 -33642
18693 -33642 -38187 -38490 -32199 -26582 -33398 -42096 -36759 -35333 -36658 -30509 -33056 -33918 -30599 -30342 -31298
18678 -31298 -30562 -37627 -40233 -41008 -37863 -35289 -33564 -35983 -42604 -39376 -39239 -36614 -34028 -36777 -38428
18663 -38428 -41524 -42286 -41392 -36610 -38188 -40240 -32395 -24821 -26587 -28513 -34575 -37071 -34943 -31217 -36725
18648 -36725 -38760 -34961 -38646 -38099 -37457 -36377 -34079 -33408 -33654 -39927 -45850 -39633 -29379 -32821 -38873
18633 -38873 -40315 -37935 -40835 -42511 -43978 -42594 -39639 -36714 -31617 -31672 -27367 -38088 -39550 -38785 -33998
18618 -33998 -34732 -40629 -39507 -35405 -32015 -34019 -30060 -23920 -25789 -34849 -39680 -45389 -42634 -38778 -43218
18603 -43218 -37017 -36650 -37333 -33894 -36123 -38319 -40559 -38900 -35040 -38039 -37912 -39865 -39036 -39438 -30451 -25651
18587 -25651 -28199 -32560 -38407 -40057 -34867 -40308 -41985 -42384 -47900 -48451 -39356 -32439 -34441 -29663 -30563
18572 -30563 -36506 -33876 -36872 -40802 -38992 -39420 -40726 -31781 -31743 -32056 -33658 -35250 -37379 -36208 -36034 -28615
18556 -28615 -25145 -21861 -25850 -27354 -30887 -34206 -36747 -35119 -32688 -29534 -28112 -32591 -37639 -43986
18542 -43986 -44203 -41184 -35361 -31220 -29675 -27698 -32397 -31957 -31522 -34430 -29815 -30761 -34712 -34842 -39278 -41453
18526 -41453 -35857 -31231 -31259 -31419 -38815 -42513 -42792 -40852 -46117 -42338 -30429 -21714 -19345 -21538 -26698
18511 -26698 -28279 -30962 -33933 -39739 -40869 -40505 -34824 -32795 -26428 -23254 -33596 -37893 -36869 -30802
18497 -30802 -29632 -32173 -30728 -26570 -29242 -35989 -34755 -35647 -38377 -46850 -49154 -44276 -40461 -34306 -33188
18482 -33188 -41508 -44668 -40799 -39167 -39062 -30250 -29214 -27548 -28368 -31981 -33449 -35785 -30920 -28442 -31738
18467 -31738 -29968 -21144 -26096 -30632 -33671 -29828 -30142 -31207 -28225 -29990 -35376 -42581 -40962 -35843 -30303
18452 -30303 -29714 -29414 -24370 -19755 -22365 -26591 -28236 -27727 -31501 -32237 -34799 -37482 -33630 -28120 -25330
18437 -25330 -20045 -17354 -23649 -27918 -28608 -24283 -20778 -16512 -20919 -22125 -23015 -30272 -30372 -24066 -25709
18422 -25709 -26129 -24583 -24769 -23673 -25651 -30148 -34530 -33354 -29331 -28889 -25561 -28600 -34329 -29524 -25234
18407 -25234 -30340 -39035 -40260 -43407 -44431 -38398 -35080 -29252 -27781 -30447 -30793 -34782 -38831 -33815 -33853
18392 -33853 -32085 -25845 -22092 -20927 -21990 -23981 -22964 -25024 -29276 -32059 -28724 -27529 -30575 -28016
18378 -28016 -23801 -20698 -20563 -24354 -29934 -24948 -23353 -17601 -20598 -36732 -39591 -31642 -26517 -21495
18364 -21495 -18265 -11843 -13458 -18910 -28760 -32498 -25588 -18236 -21668 -32556 -36721 -36427 -30363 -25795
18350 -25795 -21324 -21000 -25060 -28735 -26678 -24872 -24132 -24651 -27295 -18148 -17569 -22509 -26470 -25034 -21724
18335 -21724 -16745 -18148 -15471 -20942 -17409 -14327 -22175 -27316 -23633 -20690 -21520 -18189 -19248 -21305 -24301
18320 -24301 -22903 -23949 -23086 -22264 -21474 -20772 -21040 -21231 -20144 -21840 -24525 -20973 -19346 -13734 -10631 -6972
18304 -6972 -9280 -12546 -16455 -22245 -19442 -18579 -20133 -29180 -27018 -17905 -17400 -21577 -22438 -22764 -20115 -18549
18288 -18549 -18692 -14733 -11555 -14082 -11302 -2489 -3812 -7310 -11250 -11497 -9781 -11431 -18400 -21117 -16886
18273 -16886 -13560 -18600 -27009 -24610 -17481 -18955 -17855 -16408 -17806 -20206 -19143 -20489 -20540 -24426 -34721
18258 -34721 -33223 -26302 -19755 -15261 -21288 -18216 -17719 -10675 -3088 1353 -5260 -5113 -5875 -4087 3099
18243 3099 1438 851 3506 2127 -2418 1310 5544 2237 -686 -184 6076 483 -3532 -1308 2774
18228 2774 -4638 -10019 -13207 -20653 -20099 -13261 -7348 -2641 2526 4177 3253 5203 10110 5234 2547
18213 2547 5149 13113 17288 13850 13183 14392 15857 10858 4572 2300 12574 16097 11966 12686 14790
18198 14790 15159 8551 8934 14017 11217 5389 10180 19146 19834 17021 15801 18496 21961 18618 16269
18183 16269 20431 23838 30135 37411 41563 41813 44227 36017 27880 31625 33864 37407 41647 46273 48795
18168 48795 47754 48906 49268 49694 47673 53642 54214 54618 58361 64992 76479 79032 75844 74983 72808
18153 72808 80047 86085 84904 86427 87735 88779 94007 111625 119145 126197 131264 137177 133968 137313
18139 137313 147157 155757 169385 181474 187993 201282 216247 226533 241798 268480 288218 310236
18127 310236 342233 378148 417101 463618 520875 582456 661949 759270 870920 1012941 1199772
18116 1199772 1443808 1758958 2179579 2748563 3536151 4609330 5885879 7215602 8444017
18107 8444017 9019818 8492664 6486743 3930015 2292778 1433379 972605 712141 563387
18098 563387 469824 410931 371534 345177 318991 305254 298398 276112 258493 251251 247631 247181
18086 247181 251117 246199 255025 271922 288728 287446 259463 237811 208694 181842 156813 139536
18074 139536 128691 112436 91676 69475 62453 52322 41810 32510 21202 5881 1526 -813
18062 -813 -5203 -16598 -24036 -33813 -37139 -37059 -41612 -43350 -48087 -49281 -47735 -54216 -55941 -59968 -62756
18047 -62756 -64457 -65325 -65610 -72182 -74244 -68495 -70637 -73638 -71823 -76752 -77103 -74169 -75557 -79087 -78989 -84663
18031 -84663 -86547 -81910 -69440 -61678 -64226 -74700 -84808 -86749 -89541 -92780 -92531 -89757 -88287 -87134
18017 -87134 -80986 -71906 -70741 -79242 -82880 -82133 -81087 -80588 -81198 -83556 -90791 -92346 -92065 -90888 -85570
18002 -85570 -87545 -86090 -89875 -90738 -92979 -97147 -86778 -83943 -83119 -81733 -79288 -83964 -87283 -79357 -75488
17987 -75488 -71627 -70004 -70296 -71388 -79532 -84278 -82217 -76705 -75211 -80589 -81325 -76608 -74762 -70872 -69794
17972 -69794 -75437 -75478 -67943 -64419 -65906 -61788 -63787 -69898 -68731 -66177 -65038 -71117 -75935 -74624 -73711
17957 -73711 -70591 -67669 -62964 -60797 -63808 -60983 -63503 -68630 -70344 -71153 -71068 -67495 -68449 -71987 -70252
17942 -70252 -67563 -72592 -69903 -70860 -65911 -61187 -60023 -61743 -61245 -64149 -67604 -68547 -68467 -70142 -67113 -66016
17926 -66016 -68894 -66377 -65329 -64687 -57224 -59078 -58509 -60652 -63007 -58679 -63341 -72289 -75921 -77359 -67602
17911 -67602 -66846 -80435 -79576 -72270 -67848 -69016 -70542 -65985 -65160 -69335 -65188 -58252 -54728 -53983 -50545
17896 -50545 -55657 -55729 -56583 -54013 -50184 -50430 -55903 -60574 -60651 -60479 -61293 -65475 -66164 -59786 -64360 -65111 -68765
17879 -68765 -67268 -74402 -69586 -63711 -64237 -68688 -63803 -62622 -63831 -59790 -55409 -51098 -48057 -53523 -68590
17864 -68590 -69278 -63847 -63374 -59522 -52155 -52700 -57934 -54511 -49919 -45620 -49779 -52379 -54401 -58732 -57397
17849 -57397 -52090 -54602 -63135 -67624 -65693 -65042 -61963 -58884 -57192 -51454 -51230 -47554 -46431 -52237 -54114
17834 -54114 -52699 -51183 -54694 -48503 -42503 -49178 -56181 -55930 -55739 -53245 -58124 -57187 -61312 -58976 -53354
17819 -53354 -52072 -52434 -53044 -52039 -52143 -54212 -54791 -49681 -48587 -47537 -46016 -45064 -41949 -44600 -45845 -42362
17803 -42362 -40867 -41496 -55565 -59782 -60223 -59003 -58051 -58447 -54576 -47569 -48129 -49980 -52783 -51665 -44272
17788 -44272 -48428 -59616 -66943 -62276 -58851 -55716 -62576 -64128 -54745 -50212 -49738 -48810 -52683 -50606 -44560
17773 -44560 -48846 -56884 -61092 -56994 -50078 -44537 -51497 -54547 -57538 -57235 -55055 -58978 -58223 -60728 -66038
17758 -66038 -59617 -54750 -59706 -57653 -55033 -60050 -61573 -58407 -53684 -47683 -43858 -42913 -42182 -43527 -45396
17743 -45396 -43169 -40129 -47178 -51642 -58370 -62403 -61746 -64298 -59401 -52387 -44315 -44396 -43619 -48549 -53817
17728 -53817 -57046 -58132 -60476 -61104 -66650 -66206 -61719 -51640 -47425 -46687 -48527 -46386 -46642 -57481 -70256
17713 -70256 -65825 -54196 -50321 -44538 -43713 -44272 -42904 -42929 -45638 -47210 -48217 -49795 -42748 -34014 -40569
17698 -40569 -42909 -38100 -39144 -35866 -38842 -42259 -41345 -44074 -46243 -46613 -47785 -49926 -47497 -45651 -46852
17683 -46852 -45319 -42779 -48211 -47843 -54882 -62513 -65383 -56261 -52010 -51719 -46959 -48549 -49070 -54432 -59718
17668 -59718 -55719 -48909 -38952 -35428 -39825 -44592 -46297 -51425 -50283 -43821 -43400 -45720 -49663 -48049 -52516
17653 -52516 -58545 -62691 -62573 -57572 -54799 -49545 -45582 -45794 -42325 -44423 -48202 -50559 -54923 -58476 -54330
17638 -54330 -54268 -54106 -51392 -44804 -44015 -46506 -51549 -49371 -43746 -42429 -47461 -46916 -51122 -53438 -44984 -39004
17622 -39004 -39863 -38509 -42511 -46935 -49667 -51301 -52549 -55155 -53630 -49224 -51060 -49917 -52000 -52535 -54708
17607 -54708 -57918 -61116 -64679 -53114 -47587 -48705 -47714 -45217 -49509 -52117 -54745 -52485 -47945 -49367
17593 -49367 -43588 -51488 -53923 -42705 -37644 -38504 -39916 -41647 -40601 -36749 -41672 -47976 -47390 -41076 -41134
17578 -41134 -41986 -45757 -45635 -46220 -49103 -50865 -51287 -52738 -53775 -49498 -46589 -41932 -44010 -46017 -45103 -44534
17562 -44534 -45496 -47602 -48098 -49400 -54750 -57070 -52193 -48529 -47605 -41903 -38150 -43705 -51133 -53704 -52169
17547 -52169 -47190 -43144 -41405 -43327 -40354 -33309 -32188 -38765 -43893 -42074 -30662 -27902 -30563 -31449
17533 -31449 -27188 -28073 -29176 -33070 -40857 -45002 -46925 -46278 -54204 -56306 -50595 -51146 -49374 -46766 -43313
17518 -43313 -41557 -39335 -41315 -41325 -38605 -35961 -41253 -38019 -35174 -36287 -41301 -38373 -37542 -38152 -44797
17503 -44797 -46879 -43598 -40564 -41073 -43237 -45005 -44628 -34514 -34815 -38311 -44139 -50809 -48951 -46707 -50262
17488 -50262 -47760 -43766 -42032 -46366 -42082 -43342 -47162 -47026 -51629 -46805 -43427 -45359 -41418 -44444 -46596
17473 -46596 -50480 -54664 -56904 -52861 -47599 -45443 -39550 -34218 -33691 -33188 -36560 -39526 -46844 -46819 -45023
17458 -45023 -44781 -43680 -44506 -41456 -36935 -41253 -37906 -36836 -37945 -37871 -36315 -33966 -29751 -24167 -14043
17443 -14043 -6569 -2110 4517 7630 2096 -7903 -23378 -32128 -36830 -33316 -32349 -29307 -30720 -30891 -31482
17428 -31482 -31393 -36859 -40813 -42713 -36299 -31456 -27430 -32924 -37993 -35390 -32714 -37636 -43163 -46195 -40145
17413 -40145 -33814 -34906 -33345 -26371 -28483 -29797 -33212 -40379 -41762 -44670 -48714 -44211 -35373 -30132
17399 -30132 -33133 -35850 -34908 -27603 -29733 -33436 -33231 -35151 -33568 -39418 -37371 -34154 -33396 -33983 -36952
17384 -36952 -36121 -28585 -23595 -29720 -29972 -33712 -33277 -27756 -29788 -31491 -33044 -37346 -39292 -39635 -44209
17369 -44209 -48280 -46599 -52477 -54094 -47722 -34228 -32578 -35007 -38714 -37955 -39916 -35366 -36268 -41369 -41154
17354 -41154 -42581 -45117 -45663 -48307 -48935 -45083 -47054 -44281 -42336 -36505 -40800 -43617 -42268 -38122 -39855
17339 -39855 -43976 -46182 -39702 -30706 -35240 -34985 -35816 -41989 -44334 -45143 -40607 -34033 -30942 -27486 -32247
17324 -32247 -40033 -42922 -46166 -45327 -40484 -37912 -41453 -46956 -49595 -50236 -41656 -39239 -41187 -39726 -38132
17309 -38132 -46069 -47463 -42093 -37300 -30773 -24643 -19201 -27608 -35542 -32295 -32214 -37368 -38609 -37589 -33991
17294 -33991 -32693 -36864 -35340 -36536 -37476 -35127 -32692 -28385 -26441 -32079 -33131 -32102 -33787 -32880 -26316
17279 -26316 -26715 -31114 -33591 -34387 -32901 -32167 -31485 -28152 -33376 -42488 -42017 -39990 -34326 -29570 -39653
17264 -39653 -45456 -37939 -32097 -31694 -30693 -36559 -42573 -42051 -38980 -37310 -37522 -35263 -34662 -31988 -29683
17249 -29683 -25651 -30152 -34119 -38500 -38597 -44107 -44372 -37913 -36559 -39650 -39210 -44195 -47349 -44050 -38590
17234 -38590 -34205 -30899 -24990 -23229 -20057 -19745 -28280 -35130 -33726 -31282 -31214 -33940 -40128 -45949 -48362
17219 -48362 -47596 -45495 -39827 -34670 -30208 -28271 -33303 -34536 -34538 -34548 -33981 -30478 -26473 -26784 -25965 -25936 -27646
17202 -27646 -34540 -31073 -24924 -27029 -24375 -28169 -32669 -35938 -39895 -39893 -38827 -37546 -35659 -35864 -37060
17187 -37060 -38198 -34455 -34445 -38332 -41406 -41390 -40009 -40196 -37029 -35908 -41775 -45531 -42400 -34186 -28053 -23756
17171 -23756 -28579 -35061 -42872 -41923 -34664 -33414 -40892 -42845 -36600 -37175 -41873 -34613 -29514 -28989 -31106
17156 -31106 -28737 -28539 -32885 -32101 -32608 -30388 -30520 -33667 -40960 -49269 -48018 -51229 -47624 -44417 -40665
17141 -40665 -39812 -41722 -48126 -50835 -42761 -40565 -38506 -36717 -36337 -36070 -39499 -39625 -39113 -33084 -26779 -30874
17125 -30874 -38028 -36491 -25158 -24900 -31139 -30313 -30948 -35914 -35665 -30320 -28093 -27771 -32506 -33580 -30038
17110 -30038 -33373 -29898 -30798 -36203 -37992 -35525 -35042 -34792 -28662 -32697 -37160 -34103 -31564 -39276 -47841
17095 -47841 -41889 -33341 -32312 -30663 -31015 -32242 -26440 -21197 -27326 -31444 -26879 -27676 -34449 -34812 -28393
17080 -28393 -27231 -22514 -19946 -27465 -34883 -38978 -38396 -36414 -29149 -23425 -27285 -29230 -18929 -21357
17066 -21357 -29110 -31101 -21481 -19204 -19970 -24879 -23645 -28192 -35793 -38577 -33114 -32700 -29921 -30602 -35838
17051 -35838 -39499 -39173 -35495 -29495 -26413 -29371 -27208 -26947 -30286 -29845 -29959 -30592 -33918 -31095 -35353 -31942
17035 -31942 -26574 -24210 -22178 -22279 -22438 -16247 -13454 -14584 -20541 -24378 -28213 -26512 -28321 -24575 -19348
17020 -19348 -19871 -18806 -19700 -25567 -30938 -32880 -30274 -24481 -21609 -28461 -37977 -36823 -32519 -24448 -23267
17005 -23267 -25233 -28319 -31831 -36184 -26948 -22658 -22588 -26427 -31361 -32172 -32778 -35451 -31583 -27603 -25170
16990 -25170 -23143 -20236 -21464 -23053 -22614 -29678 -32206 -32213 -30925 -26359 -25428 -24736 -27627 -28380 -32560 -28077
16974 -28077 -26061 -21464 -20302 -22288 -24816 -31684 -34106 -35014 -35383 -32802 -32294 -26211 -22420 -23160 -20368
16959 -20368 -16857 -18217 -21042 -23802 -27797 -26776 -25244 -26135 -29699 -32884 -27668 -25643 -19635 -21278 -23173
16944 -23173 -28535 -33755 -35772 -30896 -27823 -28418 -31455 -41288 -45512 -34033 -23074 -24195 -28674 -32739
16930 -32739 -36642 -35295 -25459 -22344 -31096 -33542 -28613 -18447 -17511 -23907 -20671 -18944 -26699 -27159 -25407
16915 -25407 -18276 -15640 -9621 -12535 -20394 -20605 -17642 -14644 -15649 -18444 -18414 -18851 -17065 -18192 -18087 -16891
16899 -16891 -15107 -15984 -13376 -17254 -22870 -24845 -22998 -16654 -18219 -19435 -20772 -26806 -23107 -23671 -21016
16884 -21016 -24532 -28334 -23554 -22265 -27103 -27205 -22007 -20482 -17616 -15306 -15770 -13668 -15402 -16375 -14016
16869 -14016 -15793 -21522 -18899 -20745 -18989 -17086 -18794 -21606 -18846 -21229 -23829 -20136 -14726 -12159
16855 -12159 -10614 -10538 -10048 -12767 -11059 -9511 -11273 -9227 -11425 -8520 -8170 -8558 -13082 -14330 -17449 -21291
16839 -21291 -18901 -20402 -22846 -23069 -28967 -31826 -27053 -20613 -15746 -14536 -14756 -18131 -26050 -28201 -25249
16824 -25249 -20819 -14490 -13826 -18203 -10493 -5049 -3887 -6682 -10875 -12460 -13855 -18907 -20199 -18949 -19821
16809 -19821 -20955 -22511 -21880 -25369 -26674 -20197 -8612 -7012 -8787 -8471 -2929 3475 747 1038 -1640
16794 -1640 -1838 -10224 -13507 -16881 -18725 -14679 -8903 -6611 -11136 -13630 -17813 -17440 -17945 -16000 -17028
16779 -17028 -15086 -8679 -6802 -8599 -11517 -16988 -13570 -13073 -13056 -6148 -13505 -18135 -16037 -8508 -2588
16764 -2588 641 -6753 -12399 -13343 -14787 -16353 -15578 -22942 -20511 -16088 -11331 -9801 -12541 -12436 -11382
16749 -11382 -14472 -12673 -6649 -4087 -3736 -7259 -11824 -16461 -19124 -8143 -2928 -4781 -3412 -2853 783
16734 783 1026 977 3034 -2502 -7334 -3361 51 2475 1382 671 1217 -3457 -5449 -7002 -5893 -6945
16718 -6945 -5200 -10005 -10162 -11064 -13050 -11269 -11262 -9727 -11654 -20498 -20254 -18202 -15614 -14843 -22084 -21110 -11759
16701 -11759 -13748 -14694 -14957 -13169 -15652 -9063 -6638 -12728 -10345 -2164 -1968 -3809 -1672 -4818 -5836
16686 -5836 -7700 -6199 -9661 -6892 -5797 -10516 -10880 -12541 -13195 -12435 -9830 -9660 -13844 -14801 -11145 -6145
16670 -6145 -7904 -10911 -10981 -11655 -17385 -21851 -19217 -18056 -15779 -15866 -16619 -13877 -11558 -5121 -1236 -7933
16654 -7933 -7235 808 1235 -9641 -17920 -16363 -14732 -11234 -16388 -14368 -4235 -3872 -3160 -3434 -7304
16639 -7304 -7284 -7246 -13016 -10323 -3474 -4607 -1433 341 927 2821 -1067 -4801 -8050 -7871 -4276 -1740
16623 -1740 -10571 -16981 -25067 -23130 -8523 -8718 -13254 -14416 -8400 24 2819 7651 145 -5427 -6337
16608 -6337 -6124 -2273 7256 11406 5964 -714 -6447 -10144 -7588 -2725 943 2803 5847 5858 1212
16593 1212 1982 2863 161 -2881 -13095 -18184 -17940 -22593 -20925 -14479 -12053 -5674 1462 2875 1576
16578 1576 2684 4031 -256 -5799 -3237 -1729 -4910 -6672 -9197 -7297 113 -3979 -8816 -3229 1269
16563 1269 6940 -1265 -6890 -10191 -15007 -13201 -8511 -3576 -2826 885 9128 6042 1860 -624 -3164
16548 -3164 -6572 -3079 -3166 -5916 -8470 -8604 -5418 -7864 -12840 -12031 -12828 -12660 -7034 -2290 -3426 -6272
16532 -6272 -10354 -5600 -5202 2973 3903 -1126 -9229 -3899 1702 -4604 -13071 -15289 -14698 -12053 -9920
16517 -9920 -1903 426 7106 10767 6619 3077 2604 716 -3007 -224 -1558 -838 4286 8058 13996
16502 13996 7754 4858 -262 652 -1470 -1802 -7938 -2545 -1088 -1612 -641 5343 10230 10349 8047 11276
16486 11276 11449 9482 5958 7972 2134 -5092 -9021 -6375 -4836 -2403 1870 -2123 -2569 1777 3821
16471 3821 6549 8315 1750 8345 12682 10539 3156 -1447 -5047 -4285 -3682 -2048 6688 -239 -9323
16456 -9323 -12071 1168 4167 6217 9450 5545 272 6262 7374 8311 3103 274 4549 8278 3062
16441 3062 824 4239 8605 12381 11871 9360 7426 9577 10078 5917 2056 -4193 -8560 -8447 -7717 -6395
16425 -6395 -14695 -12685 -7209 -1631 -1023 2528 2724 2604 3122 1963 -2544 -7270 -4385 1228 7033 7202
16409 7202 7618 4178 -1641 4166 11173 18754 20085 19317 13560 4285 -955 6596 9525 2545 1002
16394 1002 2170 -193 6022 12527 10851 11325 14060 10632 8386 2996 -234 6261 14346 7009 2654
16379 2654 9138 9734 8803 4035 3120 3220 13797 14800 14499 6937 2649 1532 4168 13994 20369 18888
16363 18888 18137 15462 18465 19497 21929 29073 29674 32949 35301 37537 41977 48886 51874 53102 59744
16348 59744 64225 79900 95316 106901 118417 132345 156456 180651 204523 226178 245494 255821
16336 255821 264937 271206 271385 267455 263291 253320 234561 216073 198002 172210 150996 137051 124186
16323 124186 102319 85565 73768 62572 51378 42806 42449 41195 37941 43052 42164 40227 38152
16310 38152 32227 25687 25111 25210 22245 25660 27082 25839 26387 30207 28849 20074 15790 17633 17474 16899
16294 16899 17867 15300 15969 10933 6382 11561 13243 8094 5097 -917 -677 4887 9178 13893 17651
16279 17651 13209 11524 13566 13418 17910 19063 23341 23249 21286 18839 16565 13620 15859 21251 19331
16264 19331 16052 13419 16390 18236 23703 26788 31282 27945 23625 22227 21769 21039 22502 15689 13510
16249 13510 15941 17008 17828 15495 18088 27249 26531 23932 26609 29810 33885 40208 36097 37950 39488
16234 39488 31737 36477 45205 55460 64297 72647 81195 88139 92209 98116 107641 114839 120242 121581
16220 121581 124512 119328 104899 94867 82385 70279 60202 51267 40607 40558 42207 36071 26621
16207 26621 22958 27121 18785 17239 25967 25470 26968 25581 26580 26197 23645 19330 22760 26629 30774
16192 30774 29771 24410 24807 22083 16639 11522 13647 23491 21261 10233 13341 20275 22115 23262
16178 23262 22271 18029 19187 25901 25548 22073 19505 23708 23161 19761 21500 21946 24116 30767 35364
16163 35364 27539 20990 19041 20592 15569 23669 34642 36371 32016 29301 27125 26655 19283 16893
16149 16893 17552 16203 22110 23281 25055 25822 32059 32779 27322 25901 23678 23578 22529 23406 26164 27780
16133 27780 28758 29181 26556 26812 23455 19319 22510 20961 25373 28002 25119 23010 17768 14327 10351
16118 10351 16369 10617 7006 14868 18456 23450 17663 12064 20726 22224 24188 23947 19272 21549 22833
16103 22833 22503 34801 40470 35348 26654 28194 33562 43459 42671 32633 27052 27104 24094 22563 25029
16088 25029 31346 30705 26312 21966 20129 24824 23974 26475 31170 33304 35896 30989 29740 28760 28505
16073 28505 26762 27033 27260 28557 28175 29049 27734 25666 21345 21132 19015 16893 21626 29923 30036 31557
16057 31557 24732 18557 22139 23463 24205 25208 22920 27168 31379 29926 28921 31626 31078 32400 35624
16042 35624 33130 27935 29152 29790 35978 37882 33825 37242 41765 40738 40189 39188 34745 25153 22828
16027 22828 28165 24850 22249 26352 27746 30578 35473 31527 31298 36323 41421 37192 29892 32980 37098
16012 37098 41365 38679 33071 27844 24600 28771 25205 20604 21846 21701 32641 39728 44476 31488
15998 31488 21630 24774 30353 36408 37180 37731 35273 36873 36496 39782 39744 38013 33677 39821 41860 39204
15982 39204 33788 36458 41745 45036 43253 42518 38916 38760 45466 43403 37127 34967 36489 35883 44514
15967 44514 50463 43725 35912 39211 43071 55221 66135 58721 50001 58178 62123 63591 58151 56366
15953 56366 58262 59204 55117 52785 50904 50548 48705 53420 52693 54481 53684 44507 40919 38933 41146
15938 41146 50143 50551 46810 46973 48629 50104 48875 51362 50904 50256 41050 29087 31968 39321 37153
15923 37153 40400 45997 48440 47690 50952 53255 49149 47952 43723 47645 45305 51325 51426 50400 56185
15908 56185 57381 55197 51797 53052 52152 46839 43479 43278 36937 35568 43949 45802 48248 47219 51844
15893 51844 56020 56985 59890 61598 49011 54212 58170 57192 56925 56349 56689 55925 55920 61948 60420 57647
15877 57647 59678 63262 61266 58348 58843 62908 61591 66093 61368 55096 55800 54255 54363 57398 54486
15862 54486 54236 55268 56656 57595 61118 63890 64733 63338 61700 60044 67797 67972 65535 67263 62288
15847 62288 57777 56723 64520 75821 71925 69421 72115 65161 55666 54287 59305 62757 63254 61962
15833 61962 64377 56557 57860 57632 55036 57772 60320 63267 60120 59760 61151 66988 65845 64174 58601
15818 58601 57410 65342 68674 64208 63278 65573 70649 68321 63227 57901 55741 58263 64799 69767 74289
15803 74289 70665 69607 68500 64600 68017 74879 76274 71671 60634 55802 60768 71522 72800 66516
15789 66516 70545 75423 76836 75729 71656 68439 69550 69584 76147 75391 76147 72986 73952 75798 71998 68514
15773 68514 71093 74103 74366 74976 77217 76582 68401 67787 70541 69033 67293 75629 85371 89811 83791
15758 83791 79076 71073 73657 73450 72085 75344 82964 85398 79749 80365 81068 84798 86723 90749 86418
15743 86418 83632 73376 69304 76440 81988 88787 86291 89120 89991 88161 86727 91357 96093 97472
15729 97472 92618 86818 92858 105620 103542 92696 92947 103142 106239 99229 94433 95380 89921 92827
15715 92827 96842 107824 105360 93891 96712 101779 103846 108345 112102 113671 109058 110321 112228 117644
15701 117644 124096 126353 128828 130035 138501 145039 149728 151818 153429 160854 172805 185164 203813
15688 203813 217652 243724 267535 304978 343628 375864 411162 446689 477605 502667 510704 493901
15676 493901 479865 465127 435004 386827 338870 299264 270409 241522 209276 185682 171858
15665 171858 164072 154354 154620 154746 152510 152018 153298 155671 151584 153197 156640 158315 161141 163918 158757
15650 158757 145931 134582 130250 135093 134395 132910 123480 115994 113608 110272 110650 111825 115329 112504
15636 112504 106902 100116 100230 103797 97488 94876 98105 96852 96943 97615 102562 97828 92720 99436 107195
15621 107195 108400 106772 100304 102870 100794 100503 102826 98059 102358 106686 107215 104227 107206 109899 107140
15606 107140 97121 101296 106887 100190 91616 93626 95258 95108 90836 85715 83068 89625 95180 106385
15592 106385 111337 109210 116294 115379 105369 108676 108817 106739 103555 100506 99430 99553 99185 94795 93674
15577 93674 96575 94406 93508 94462 97427 104440 108970 113690 107226 102684 107837 106853 101098 95405 96056
15562 96056 97585 97271 104645 112852 114113 108679 106482 108917 109111 104185 114956 115552 108507 110024 112731
15547 112731 117355 118376 119922 112589 112901 115015 120766 125209 125562 126952 120796 111858 109435 109677 108760
15532 108760 111474 118374 121259 118353 114371 115212 126241 124985 119022 118508 125678 128315 130255 126572
15518 126572 125557 126641 129609 128325 130001 132355 138155 136515 133691 137494 132800 134518 135465 133729
15504 133729 122250 120336 122792 131266 134927 131268 133115 138221 135602 129963 133283 133588 130560 133371
15490 133371 133083 132771 130818 132653 132502 137095 138366 139201 137952 134326 130824 131372 140682 147344 143710
15475 143710 142827 139717 144506 146386 140528 140554 145419 146364 142464 137087 133982 138220 138698 141838 142355 147161
15459 147161 147404 148736 155429 162910 163500 163826 162869 162505 168037 157342 148470 158438 165016 170759 171839
15444 171839 163758 161697 164197 159341 159293 162172 159443 160597 157829 151497 144851 139651 136819 144184 154236
15429 154236 151485 150351 154027 159432 163309 166795 167651 167526 165306 168127 175784 179441 177820 169009 165072
15414 165072 163430 159565 168068 170911 176791 178335 181358 180795 179493 179406 181410 187949 185417 188534 190749
15399 190749 200482 203445 199564 201563 206387 212192 233515 249624 251331 253806 261587 264461 256763 249637
15385 249637 253904 257985 249553 238474 232786 227197 217322 210276 205630 205588 203762 198710 193060 197025
15371 197025 202009 202029 198211 200110 202161 202827 204331 213103 214658 214279 214296 215162 218751 219489 218216 219948
15355 219948 224028 225049 219735 223877 228038 229797 237925 241492 238379 235735 237830 240016 241450 238291
15341 238291 236472 245366 250151 255196 262532 263250 261246 262284 265762 274888 286822 294827 300224 305609
15327 305609 306819 302817 298990 289698 278080 263206 256763 246852 232650 211646 206015 205499 205444 216743
15313 216743 220911 225038 229947 225067 225504 224917 223695 228144 239906 249702 248618 255295 260876 262522
15299 262522 266874 271770 279516 281343 278731 283422 286688 284757 281369 291097 284606 274917 267995 272240
15285 272240 277624 289068 290841 285654 281565 284626 292096 301866 308149 308423 311493 325889 337327 348474
15271 348474 358517 373400 372386 381902 391556 397221 412050 427594 441749 447623 445083 444459 443337
15258 443337 435069 425229 423561 420854 413416 407223 404753 407207 413264 415598 418083 419716 422407 427121
15244 427121 432872 438294 447152 459594 465411 473164 480211 487676 492753 495010 496103 496020 501261 514270
15230 514270 532852 545886 553719 560771 570835 576272 576302 584135 593992 603997 614975 620433 630550
15217 630550 636364 639852 655909 673086 678925 687047 695029 698935 709286 714265 726508 739606 743904
15204 743904 763857 782178 790459 801006 812453 825253 836029 849378 861777 880152 891612 898802
15192 898802 909415 924704 943237 963433 986653 1000314 1018846 1037207 1063864 1086472 1110607
15181 1110607 1139789 1164794 1193482 1228647 1267764 1303403 1340221 1379153 1422953 1472095 1514346
15170 1514346 1568002 1631343 1705798 1772317 1849614 1951080 2057541 2179377 2311947 2465568
15160 2465568 2646717 2851034 3078199 3332766 3627273 3951272 4308465 4694752 5137697
15151 5137697 5658873 6259044 6954599 7782473 8808332 10104348 11716634 13769712 16465266
15142 16465266 19994446 24439899 29836338 36225577 43473784 51016811 58062788 64621529
15134 64621529 70837825 75273904 76144683 72930029 69593147 66621068 61610241 52683850
15126 52683850 42662746 35002270 29024260 23483016 18362591 14484495 11936907 10290754
15118 10290754 9211842 8479502 7938063 7524874 7217812 7004717 6838521 6665597 6514022
15109 6514022 6409586 6301883 6140102 5931794 5724939 5535694 5291628 4978027 4656165
15100 4656165 4349644 4046756 3737215 3438690 3169703 2928160 2710968 2507511 2324348
15091 2324348 2160578 2008723 1864926 1732298 1617163 1508526 1408567 1318057 1228208 1146175
15081 1146175 1071551 997667 926717 861537 805829 753538 706381 659621 613269 570274 532118
15070 532118 498872 464942 427723 395091 372719 355055 327502 301533 283047 261719 240001
15059 240001 217454 202613 188412 174957 160516 147146 145099 129529 113808 99818 84839 72028
15047 72028 68498 57369 52794 52724 53508 50338 50412 42178 34869 26280 18615 7648 7211 9893 -1777
15032 -1777 -12555 -17584 -17685 -15649 -17390 -16935 -19504 -27611 -30439 -27654 -26658 -26922 -23331 -19514 -12295
15017 -12295 1281 8421 8539 15163 23340 25643 28370 29888 37903 42374 40653 40330 39094 27374
15003 27374 10333 3621 10947 -1846 -12837 -16699 -16199 -23020 -35661 -40598 -40070 -33381 -24901 -21822
14989 -21822 -21053 -23677 -24451 -21180 -16060 -12715 -8472 -7234 -6423 -2639 1791 4940 6947 12667 6498
14974 6498 1798 4494 13535 12955 7901 15555 17586 10916 14428 19926 25856 29075 28216 28902 35161
14959 35161 41731 36845 31161 33786 35698 39167 45041 46960 51320 47408 49382 50084 45528 32206
14945 32206 18435 18628 7652 -11394 -25203 -30606 -30291 -27794 -27989 -41673 -50931 -45864 -46332 -47010
14931 -47010 -41712 -37669 -27187 -24274 -25099 -26999 -28512 -26927 -31525 -36885 -33021 -26016 -19743 -13539
14917 -13539 -21212 -22152 -22538 -23443 -25672 -33590 -35069 -33053 -35519 -35626 -27228 -24959 -27696 -29698 -32478
14902 -32478 -32707 -31425 -25649 -23936 -29832 -23999 -21308 -20365 -16436 -16683 -18750 -14393 -16062 -21838 -24231
14887 -24231 -21398 -18279 -14630 -9842 -11895 -9024 -6656 -4305 -6091 -15956 -23634 -25488 -22993 -18043
14873 -18043 -13922 -11822 -8144 -6052 -11720 -12761 -16200 -17065 -14571 -11158 -12269 -9700 -9006 -8670 -10152
14858 -10152 -10829 -5909 -4079 -3951 -3926 -2714 -1559 -7356 -5230 -1712 -2382 -5024 -744 9738 13447
14843 13447 16622 16394 15077 16128 15659 16362 15394 17282 18538 18851 19541 22848 22640 19199 20695 21335
14827 21335 20270 17961 14102 7801 6248 4488 4673 3386 2431 3129 5606 8485 10949 7703 5631
14812 5631 6603 4076 12212 15443 15128 19823 20819 24387 22998 20736 20319 17526 16227 21360 20121 23316
14796 23316 19264 15829 16767 21494 25093 20852 20556 16499 14663 15413 21860 23025 18289 14596 18198
14781 18198 17278 11898 15048 17966 19338 24530 28971 25541 18843 16016 25660 28526 22106 19199 20964
14766 20964 24245 23318 18856 19100 23795 25764 22860 24182 27716 32547 26121 21820 19503 23170 22827
14751 22827 19446 22794 21499 16933 6940 2238 -3942 518 9148 11009 17631 20473 20885 22277 28747
14736 28747 33816 32783 26509 18002 13592 10661 15260 14002 21612 24778 24419 27621 28366 26212 23123
14721 23123 23708 26714 31975 35704 34552 33440 28872 30115 37100 41324 43156 44311 46460 48691 45204
14706 45204 50711 49170 48706 52353 50970 50930 51182 45339 45895 47370 45682 45844 47971 55010 51390 52755
14690 52755 58852 60451 59423 60035 52663 48610 51056 54708 56443 57610 56264 57448 60643 58675 53449
14675 53449 57551 61203 65697 63198 64942 64861 67774 62803 64408 69141 70707 66519 68097 65664 61844
14660 61844 64691 66329 61248 63565 63703 59464 60354 68556 63952 62008 64297 66011 69249 68764 59638
14645 59638 52906 46903 48532 51732 51238 56878 63772 66237 65173 69575 65079 58315 57152 64624 59607
14630 59607 56300 60196 58187 57463 53636 59490 62714 63048 68616 66459 65151 72504 82656 86241 83329
14615 83329 84449 74981 69630 71029 69777 67405 69702 75892 75981 76954 82006 81704 84485 90856 95924
14600 95924 102742 107281 114907 120529 126205 128847 129185 139884 153785 162321 178880 203678 235560
14587 235560 265208 302967 344887 378037 415206 450512 468722 475932 469754 459370 443970 418700
14575 418700 371580 310306 270287 242558 214818 184068 159430 142324 143047 139859 134568 132531
14563 132531 133756 136026 131459 122871 120200 121432 122304 123195 120398 120790 117926 121038 123808 120079 112259
14548 112259 110232 113739 115839 116318 117752 116383 112951 114916 113885 112196 112067 113334 111540 102939 95343
14533 95343 98650 100118 105118 106882 105919 105647 105541 105981 105492 102149 94351 91681 89431 96091 97615 91116
14517 91116 89504 94777 94173 96385 98884 99638 100155 100817 95465 100425 103270 101368 102839 99020 96345
14502 96345 93708 91685 98027 101670 104997 100131 106430 108560 106132 107720 108704 104285 97650 91713 95400
14487 95400 94959 98810 103455 107432 100217 96378 98224 100724 105770 109497 117326 125159 126344 129561 127512
14472 127512 121151 118176 116176 111582 109987 113320 113024 115875 115839 110966 111409 115189 111869 112330 110188
14457 110188 105541 101920 106586 118954 129461 126382 119430 117444 124214 123922 126641 123973 123051 125884
14443 125884 122521 124791 125795 122982 123666 122372 118479 117307 115429 112119 115871 119504 120895 119994 122599
14428 122599 128972 124165 118055 121572 128094 124007 129089 130185 127951 134646 136579 134587 125958 122060
14414 122060 127810 132090 129599 128092 133073 137771 139541 139869 136660 139599 136499 132379 131885 131221 135797
14399 135797 140009 137855 134777 133191 134841 135454 139864 136968 131460 133073 130703 131037 129052 130223 140405
14384 140405 138176 138047 140492 135098 134063 136497 139941 143414 137164 133703 134249 136380 134895 132058 132397
14369 132397 130437 128487 134255 131369 127564 133331 130616 125987 129520 135087 135774 138988 145829 148664
14355 148664 152097 148447 149518 152515 149847 151235 154509 145858 141937 142001 143750 142826 142012 150685 152820
14340 152820 148031 148899 152125 153806 155572 155281 154040 144651 141236 138761 139810 146225 151578 153056 152717
14325 152717 155015 153156 149897 146174 148795 155887 157470 151524 146092 145661 151822 158184 155904 153365
14311 153365 150264 154023 158017 155726 156329 164984 169475 162854 161640 156824 153490 150310 155077 161449
14297 161449 165789 161760 155259 157516 163567 166611 160128 153091 152606 154197 158841 158384 159769 162966 165600
14282 165600 161019 160647 165026 168013 167884 164296 161482 165507 168599 170241 173799 173680 174914 172453 171117
14267 171117 165078 169894 177085 180546 180174 178113 172032 171866 172067 170856 172172 169618 167572 172245 172178
14252 172178 173377 175044 175870 170410 167640 166505 172421 176242 175502 177002 183019 184128 180297 179542 181100
14237 181100 185099 185274 187932 193110 195055 188448 179312 175699 181853 181643 179441 181122 183422 185670 181773
14222 181773 177269 177118 181538 184784 182804 187242 191921 192138 187937 188931 197217 202101 205802 200701 191191
14207 191191 190075 188998 186282 179968 173099 175490 187028 193140 194856 190400 189533 189215 186601 190066
14193 190066 200411 201796 201629 197403 194068 194138 199479 203262 197531 188957 188130 192182 199076 199578 201335
14178 201335 204684 207346 210266 208956 204189 204544 205456 204503 204388 202354 203748 202265 199308 200300 204249
14163 204249 204184 199523 195438 193747 195470 204957 207404 207855 207458 214401 211276 208732 209835 204735 204071
14148 204071 206410 203082 205074 208128 208623 210136 209455 207283 216779 218732 207477 200769 201610 201187 195167
14133 195167 195730 197949 199439 202622 200581 199502 206990 212619 214728 212996 205739 202694 209352 218248
14119 218248 215911 217412 217394 215570 218752 223726 221633 218524 216821 214999 215567 216489 220512 220498 217339 215206
14103 215206 217049 219356 216879 223216 229361 234592 234112 228739 226564 232029 240430 240016 238829 239490 233332
14088 233332 231971 229722 230680 230381 231258 229300 229879 232657 236520 236710 238204 235759 229843 230868 231662 232586
14072 232586 235243 234387 237436 239319 242053 243372 239271 237336 233218 237073 245300 245150 244368 244738 243650
14057 243650 235930 232169 235555 233222 238406 246743 243594 244065 243765 243338 239790 240642 248205 252212 254979
14042 254979 253968 253417 257515 257461 257809 262593 262178 261116 258802 253112 252375 251640 252903 258793 256714 254497
14026 254497 256477 258176 258657 261965 264688 258116 255043 258855 261054 258380 257264 255156 255389 253186 259357
14011 259357 267822 270942 271679 266793 264172 265211 259654 253417 255787 263345 257309 260141 265987 264420
13997 264420 266675 266122 262618 269024 269352 274483 271816 265087 265688 265965 257737 256532 259662 265678 271019
13982 271019 272580 270298 263039 261603 265350 266233 270592 276952 286270 287144 286881 284995 284636 279360 280869
13967 280869 282900 283559 277137 272845 273606 275556 276783 280774 285579 281745 279447 277624 271319 274562 277782
13952 277782 277643 273525 271631 275203 279227 287516 289993 292231 287993 289809 295132 295490 291182 290309 280342
13937 280342 283165 283923 276650 279639 288148 287212 292534 293115 291384 290900 294525 293722 291169 290892 296932 298915
13921 298915 292117 291813 293384 300433 295821 291010 296652 300944 300219 297698 298586 300891 298242 299822 311684
13906 311684 311285 310635 319500 317886 313636 310898 304369 299467 299982 302584 302095 308288 314452 311358 307657
13891 307657 301446 304942 309190 310937 313801 312979 317330 316151 316867 317032 320069 322384 321306 323331 325040
13876 325040 326036 327365 326148 323587 319444 314799 319049 315641 315173 318012 321804 324386 321877 324885 332291
13861 332291 332337 330015 324980 323761 326945 332083 333768 330753 329074 336037 332391 326151 325725 333654 340424
13846 340424 336337 334193 340286 337547 328836 325802 324530 324366 333637 336252 339594 338801 338031 342343 344704
13831 344704 341489 339453 330629 316228 320116 334655 344334 340483 339559 341970 346021 348855 343913 346892
13817 346892 341827 341189 349334 351142 354131 353031 348589 354743 351677 345209 342344 344421 345131 346640 355194
13802 355194 361827 359147 356342 352291 351073 356833 361601 364426 369982 363091 362481 361835 366223 365606 362893
13787 362893 365923 367338 369055 366270 360069 364648 373379 373613 375213 371907 369740 366123 364447 365419 366366
13772 366366 374951 376282 376271 374371 368181 367620 371454 370958 370425 371562 369208 366464 363357 361297 360575 363614
13756 363614 364801 363371 367616 372318 378318 382988 380573 378761 377427 368947 374365 382181 382990 381995 386520
13741 386520 389911 391136 391602 386023 379049 385289 392443 396086 399833 395088 392775 396039 395652 390288 388808
13726 388808 389586 389519 398044 400798 397172 395726 394883 397075 392123 388354 391882 395978 397947 394555 402172
13711 402172 406080 403935 400526 400959 402953 405203 414476 417329 409319 402692 401198 396690 396239 398734 406671
13696 406671 409921 403635 398742 405479 409136 413524 417268 418698 414489 415752 418007 418461 416993 419596
13682 419596 416407 421640 421988 420721 419625 418282 421465 423482 424324 429598 432825 432367 430564 428209 426656
13667 426656 427403 436870 438161 440183 440795 433559 424099 428571 429364 425393 424718 422250 421821 428529 434548
13652 434548 435672 430312 426491 433772 439027 441876 444633 444408 450797 450837 448301 448466 448680 444043 446000
13637 446000 450100 447598 445195 445113 440619 442817 447384 443355 443246 447528 438509 433774 437310 435818 435291
13622 435291 440728 446279 448211 450188 454714 453474 454971 449656 453625 460134 461202 460477 459165 458708 461192
13607 461192 463751 462414 461198 463377 465540 464766 455031 451547 461792 469739 467268 466913 467849 466386 469912
13592 469912 478823 483544 487144 487433 482640 477938 474079 475336 477716 470744 460898 456416 453712 457639
13578 457639 460494 467531 471234 475521 483647 480367 481660 482141 477372 475218 479823 479588 486787 487620 485719
13563 485719 486254 486700 488803 492286 494446 489622 491175 496906 498308 497923 493345 488299 487077 483441 478193
13548 478193 482212 492042 497265 497296 496277 498179 498049 502034 502267 503168 500090 496849 497429 496777 501297 500958
13532 500958 498303 502403 507309 510216 512021 515043 512771 511931 509697 506784 506578 506781 509024 509429 509709
13517 509709 510322 516220 515158 516658 518406 515994 517619 524271 520640 517314 518525 524167 521779 518457
13503 518457 522153 530062 527632 523180 523239 529026 527238 525323 533718 538010 537911 535507 541760 541543 537498
13488 537498 537718 537828 536189 534112 535371 535442 535691 542836 545837 548203 546746 545330 545516 539283 541352 546979
13472 546979 554370 556125 549609 552879 559349 562589 565113 556586 548377 545320 544002 545520 551136 550190
13458 550190 553630 554865 558120 556782 557637 560505 567003 566192 558468 555761 558188 560417 552143 546703 551059
13443 551059 556737 560054 564990 568380 574982 573699 572901 575563 573270 572636 570859 571063 574393 576056 573052
13428 573052 568356 568720 574433 573979 576315 578672 570420 572351 581171 577343 576842 581553 579931 581041 588522
13413 588522 588937 583482 589274 592728 588391 583973 587481 592238 592093 594427 594830 592280 589310 590234 592480
13398 592480 597371 598392 595506 593903 593144 598999 603068 600580 602463 605300 605104 604858 599818 599954 598721
13383 598721 604408 603409 601660 609488 621322 621529 623906 623506 619342 612189 618188 621506 614023 609013 613228
13368 613228 609182 614479 619716 618215 619052 619739 627200 630494 625457 626191 636690 640080 641477 638061 632833
13353 632833 632951 639203 643019 640538 638220 634682 632741 638534 637818 636906 638166 636383 638787 647107 654030
13338 654030 650886 644772 640629 645265 647436 643633 652145 658852 663534 668340 672074 672029 664214 653827
13324 653827 644678 647731 646539 647298 650518 656814 660090 665682 661774 660298 665804 660473 654446 658537
13310 658537 665901 666737 667432 665877 660590 660420 662037 660640 665273 661883 658806 658608 661997 669606 675188
13295 675188 676954 681349 686718 686924 679679 676006 680721 686666 684584 684346 684993 686334 684728 688662 688310
13280 688310 691463 690578 688998 691198 691767 690031 684573 680720 675268 674885 682813 684814 682178 685474 683202
13265 683202 685088 691581 699418 695220 689941 682583 679397 683587 691449 701283 707180 709184 714002 713553
13251 713553 720454 719404 715786 716951 717243 715099 712964 710543 710025 712396 710140 712363 716048 722033 722613
13236 722613 721327 724169 728012 732329 731216 731019 725597 723251 725669 725427 721826 713774 715901 722699 724380
13221 724380 727306 732460 736898 737911 733922 730077 729139 731352 733437 742259 744823 743405 737328 734570
13207 734570 744492 749576 751807 752087 753181 751589 753753 753620 756673 753059 749740 753018 756761 758352 756495
13192 756495 758799 761328 762737 756544 752171 747371 744543 744007 751026 755735 758177 761630 768045 771476
13178 771476 769844 769892 768292 762560 756747 760100 758763 761028 768134 767356 765427 768122 766601 770865 774665
13163 774665 773020 775836 775615 779411 784224 783429 789616 784252 781019 784257 780138 781455 782017 781140 783647
13148 783647 785082 784871 788124 791368 787456 780948 784749 792383 789878 788827 785611 780200 783376 788764
13134 788764 793332 798554 799669 799123 799694 802266 802871 807715 802175 796586 796868 799219 800758 797852 799996
13119 799996 807572 808674 810709 809755 817866 823693 825366 817275 806001 805763 813020 818794 819392 811436 807965
13104 807965 814434 815478 819333 823900 832036 837205 830214 826977 824341 824377 822578 827419 828039 825764 832681
13089 832681 839524 834543 832008 833092 824182 830241 836334 834393 839288 845043 842161 833252 834365 841071
13075 841071 838594 842037 844875 837356 833305 832009 833370 841153 845382 844009 846419 851923 855713 854962
13061 854962 854596 856671 857440 858295 854912 852469 853797 855845 858622 855963 856005 860145 858148 855255 864407
13046 864407 868753 870359 867526 871045 879649 879645 875383 870956 864702 863237 864822 871070 871056 883530 888234
13031 888234 881335 881066 887116 887444 885917 889169 885502 884539 889306 890613 887119 884690 880857 876896 876739
13016 876739 882471 883342 881615 885740 883803 880114 883674 885455 890166 885381 883141 884783 883591 885143
13002 885143 893766 901242 903476 900691 890443 896008 902814 903920 910859 916382 918748 914815 916318 909328
12988 909328 903188 908094 910223 911107 907444 902337 893259 899748 909923 912299 906426 903762 901346 904490
12974 904490 899293 900534 899202 903573 911301 910631 905750 907409 902515 900147 907645 911623 912123 910979 916860
12959 916860 921141 929723 925886 920512 925023 928530 934936 926587 919030 926818 930444 930599 924317 919431
12945 919431 920054 912116 916777 922435 928159 934676 939817 939786 934365 934609 935876 936853 937106 942041 946773 943132
12929 943132 935053 932920 932517 930218 940857 947991 949121 950540 945994 940668 937532 935306 936978 934329
12915 934329 933836 935400 938476 944861 951214 956499 955273 954018 954176 949820 958447 967266 969985 969984 963182
12900 963182 960313 950017 947857 952901 946743 943921 939886 940628 947121 950312 947987 948989 949811 952784
12886 952784 952366 953251 955463 954934 959744 964887 962636 969869 975105 976367 974130 969843 966808 962283 960066
12871 960066 963696 975744 977624 968800 967531 967049 967121 966059 966747 967743 971624 972308 967207 968135 966452 964744
12855 964744 962854 964314 963714 967803 972222 968743 969949 972889 975751 973908 974893 981097 982648 978142 981979
12840 981979 985249 979647 980080 983022 986356 985991 991122 991302 990333 993000 994526 992360 990413 990907 989830
12825 989830 982883 983787 978914 980393 986443 993379 997207 990992 978440 976894 981282 978966 971160 964099
12811 964099 966683 975547 995569 1003787 1003786 996379 994577 992092 990521 991939 988642 983316 983701 991138 994303
12796 994303 989685 995501 995877 999442 997468 994732 990670 989150 995553 996009 992302 996456 1001510 1001907 994181
12781 994181 988398 990771 989461 995146 992029 996885 1004135 996848 995653 998937 996743 1001380 1007712 1001409
12767 1001409 998818 1002786 998106 996198 996721 996818 997053 998362 1001563 1005448 1007699 1008741 1009311 1009985 1014085
12752 1014085 1009306 1004902 1006728 1011826 1018820 1012257 1006406 1013690 1015779 1014438 1010373 1011609 1007998 1003904
12738 1003904 1000822 1002255 998128 997034 998627 1001411 1005813 1005538 1006692 1012238 1018879 1020166 1019461 1016277
12724 1016277 1007649 1002441 1004391 1006448 1007870 1008074 1005859 1006110 1000733 1009819 1013392 1011601 1014589 1011738
12710 1011738 1006153 1009731 1018133 1018931 1017973 1011512 1010045 1011832 1017321 1016411 1013208 1010340 1007770 1002578 1002419
12695 1002419 1002417 1007522 1013788 1018323 1017015 1008728 999436 1007595 1007352 1003419 1003035 1004015 1004044 996278 994164 996130
12679 996130 991469 985199 988155 995636 1001239 1003399 999565 1000169 993164 988205 993563 998385 1001243 999511
12665 999511 994821 988635 995798 1001985 1003249 1001958 998974 997780 998802 1004145 1004220 998408 990679 987942 988255
12650 988255 988047 990462 992494 987085 991834 995769 996690 1000053 999783 999610 1000829 1002874 999154 990268 985160
12635 985160 984634 983230 988662 991359 994254 996231 994175 990966 995121 1003187 1003957 1001082 996154 991039 987320
12620 987320 990482 996056 995515 995325 998569 997608 995511 997276 996355 991564 991563 997091 1001896 997160 992855 988430
12604 988430 986091 978023 980799 988095 995103 989702 985718 988084 984304 985169 987039 989016 987665 980961
12590 980961 987190 991401 987661 989417 982107 976689 976052 979166 985404 989421 989363 990168 990528 979731 977654
12575 977654 981596 987345 980725 981232 986219 989592 982841 981152 986473 988549 987778 985753 979767 984204 985389
12560 985389 985133 980993 983756 983590 970478 968747 967071 965973 969995 971530 972979 965780 960353 959619 962430
12545 962430 956577 950546 950765 956596 963297 970038 967609 962526 961468 962150 965479 965083 962561 960575 961064
12530 961064 958981 966915 971320 964029 961726 965081 962977 952596 948221 942864 943017 948960 951090 950195
12516 950195 948923 944438 947129 948409 950024 953596 950294 942866 942887 950151 955828 953505 948568 943594 944599
12501 944599 940922 941802 942030 940334 937875 942673 939482 940407 944039 940979 944792 938633 928740 931106 931603
12486 931603 927569 924223 936415 943037 939076 931463 931558 937042 936264 936984 935797 933097 936341 938131 936835
12471 936835 932930 922464 924485 922766 918611 908976 913235 911536 911878 908170 911340 917059 915049 919101
12457 919101 913311 908006 910622 914565 915855 915583 911799 904459 906721 904504 902783 900148 901712 902168 902754
12442 902754 903242 899548 898353 898185 896032 895557 904259 901568 896975 897600 898379 900623 897736 895121 898144
12427 898144 891419 880296 881535 885865 886160 883937 876744 872833 869451 869930 878083 883934 876525 871740
12413 871740 869572 874083 882369 883388 879179 873667 868937 868888 863902 863021 868462 867062 864031 864059 859470
12398 859470 857916 858421 853903 855526 861020 866760 872805 872955 869963 865595 860268 859758 867448 867861 868545
12383 868545 866057 863404 862286 867714 864640 858579 852906 846951 844011 846836 855671 856274 850568 851362 851079
12368 851079 852566 855643 852592 848001 836245 830931 830355 833267 837768 842756 848668 847144 848381 843784
12354 843784 834665 832364 832681 828208 830439 826583 824779 821709 821057 821148 818938 813306 811621 808237 814490
12339 814490 813122 808136 812108 820772 822703 816736 816895 811286 814214 812411 809275 805496 807009 813778
12325 813778 814294 811869 807512 805262 798101 800623 803173 798942 793328 793632 797113 804139 802198 797461 800742
12310 800742 797532 794588 791682 787828 790654 794787 792533 789647 790848 791954 791081 788681 782798 774862
12296 774862 770669 772820 783410 787967 779762 780429 776604 777914 775179 769296 768689 766374 771642 770031
12282 770031 770034 770738 768704 765641 764543 767199 764145 763623 767405 768048 769186 767071 768963 766627 755672
12267 755672 755126 760264 759934 758631 755424 747648 743895 740220 727583 733634 741523 747202 741746 738434
12253 738434 741042 741059 737859 737751 736947 742189 743090 744815 739845 732469 730195 727428 723680 720913 726322
12238 726322 725974 722190 715371 717053 726275 731832 730438 724675 721512 716321 718501 719106 717407 716030 721726
12223 721726 718236 707965 709269 717116 719336 710470 710286 714766 714555 712507 706503 700981 697625 695680
12209 695680 694721 703548 712406 707753 698404 698853 700103 699823 698909 699775 699189 694441 693203 690525 684949 686542
12193 686542 690662 687950 690026 692184 686165 678026 677987 681124 681138 671099 668793 663333 662346 666881 667996
12178 667996 676089 670497 661343 661999 661402 663540 661874 661019 659579 657173 657253 657484 656488 664717 662419 651891
12162 651891 648804 649081 652962 653008 647485 642734 644689 643565 649240 650179 644261 644358 645059 647229 646712 649018
12146 649018 647768 643899 638210 641839 640257 640536 635250 636452 634861 635170 637086 631269 632624 638325 635424
12131 635424 633058 633110 633212 635634 629381 619539 617913 618513 618626 619129 621310 619540 614440 614349 612375 617291
12115 617291 620559 620438 616413 610707 612399 612902 612458 610805 609235 601383 588685 588671 595485 596568 600368
12100 600368 605566 603352 597659 591700 595979 596205 596605 594335 595488 592611 587289 587811 593239 591461 585699
12085 585699 580818 578505 582033 583535 579329 577965 580470 583517 579391 578181 574952 569330 571358 565703
12071 565703 568016 576129 578848 566893 562713 562289 560841 559843 559116 556925 563926 568040 565580 566240 563796
12056 563796 550120 545091 546978 555280 552462 550496 548919 541439 546933 549674 550405 548956 544272 545341
12042 545341 543690 545350 543755 539994 540547 546477 544910 542649 546375 545127 533878 523043 520988 533279
12028 533279 531073 533196 542158 531389 523307 528936 524616 520865 513758 515093 506046 503879 508823 506959
12014 506959 509232 515995 518782 520301 523209 526429 523679 523487 526313 524318 517334 512837 503520 507003
12000 507003 509097 505839 503514 507843 512159 506865 499084 500284 499943 494418 491506 494078 499127 495145
11986 495145 497994 499419 493594 496149 498131 495173 499542 498379 492483 491624 491268 484650 482479 486059 490275
11971 490275 485470 482881 481266 485798 486669 484187 484498 486498 486490 476695 467524 468981 475442 476843 474853
11956 474853 474164 470414 466475 467865 469077 466933 464436 457797 459100 460057 464674 467167 461374 461854 459956
11941 459956 455254 454452 462863 466243 469685 466557 457777 451235 447426 452603 453752 455515 457176 452132
11927 452132 443732 435683 433189 437389 445067 447938 443968 443534 450908 452776 451613 446830 447197 445781 441644
11912 441644 439522 438506 435627 439629 446239 441379 441248 435776 431250 429451 424410 426235 426266 427220 422963
11897 422963 420158 423760 431464 425411 425761 426192 428331 430581 424797 420342 416054 407917 407943 408458 406121
11882 406121 407253 407905 401551 402267 410348 414575 411198 414497 411070 404475 404392 403631 399912 399723 402476 407066
11866 407066 409480 409263 412455 412954 407667 404997 402557 403602 393039 386618 388306 388264 388269 387656 391118 388825
11850 388825 387013 379097 379214 380244 383222 382737 385101 386789 384563 384195 384453 381323 375733 373495 370434
11835 370434 370718 370785 377156 381466 385459 382748 377591 372813 372473 369701 370092 369557 374221 373946 369399 370333
11819 370333 363916 362090 360629 366096 364994 365396 365447 364488 369465 366308 360109 361032 360062 358986 353953 347937
11803 347937 351730 351900 354582 352636 348928 348689 350683 346687 345680 347809 349401 349977 347803 347773 349388
11788 349388 353380 358629 357781 348217 338332 330026 325764 329843 328984 333395 341925 339705 337193 342400 337024
11773 337024 330126 328691 328611 332173 332615 336690 336170 331748 328574 323236 326157 333753 333418 335163 331329
11758 331329 331291 331220 325348 320301 318296 323621 318070 316931 318055 319736 317173 322371 328687 323905 325433
11743 325433 328463 320220 318678 318814 315386 312099 308049 301502 304276 304817 306355 304817 301319 298991 302806
11728 302806 304097 311247 311291 310869 306627 305446 306427 309889 309106 302787 299434 299517 299194 294535 286152 291224
11712 291224 297554 290396 291250 293736 292969 294606 289721 288739 288786 283521 290747 294902 287268 280185 281658
11697 281658 288716 291603 286474 288137 287552 289046 288636 284090 280815 281615 284348 280653 282543 286509 293206
11682 293206 292389 281694 270140 267913 272027 276646 277323 272777 270742 270123 268859 268827 264083 264242 270700
11667 270700 271736 271987 273176 273988 269070 271618 269041 262474 260157 259620 265630 270703 272256 266715 261942
11652 261942 268302 268443 263946 262212 271340 275185 270677 266625 267546 266207 262801 258385 258012 258097 257562 255861
11636 255861 257349 255132 254462 252389 256467 256805 247699 243032 240399 243056 241503 244628 245103 244518 245578
11621 245578 248120 242796 246077 247349 246611 245485 250849 256211 254984 251333 246523 244658 242724 240229
11607 240229 243599 244617 242319 241907 238896 239915 240676 243696 240209 234386 236810 236078 241798 236170 227551
11592 227551 227131 230957 229850 221476 223177 229176 230812 228611 229635 230972 232427 219228 213545 217524
11578 217524 223141 225782 227759 219132 218685 223012 222589 217784 214636 214914 213987 223943 223561 223384 218444 218336
11562 218336 217722 215331 218392 223602 218856 220398 224870 223238 217574 216275 215854 216340 215732 214888 209711
11547 209711 204660 204830 208170 209323 210242 211809 208991 206166 208820 212762 212684 214770 215972 217984 217634
11532 217634 212431 211520 204553 197411 198678 201635 195539 202487 207946 205943 200378 191619 189500 188481
11518 188481 190173 189450 192247 193141 190987 189873 195490 197799 187695 177179 178606 179699 178907 180712
11504 180712 185744 188114 189818 187402 184567 188438 183778 181274 179704 179569 185017 193532 193086 189462 183350
11489 183350 183371 189523 185635 178937 178628 183898 182684 177413 175496 171110 173012 174533 175340 177745 175909
11474 175909 173950 169792 166749 167442 171957 163404 164432 173916 171822 165073 164434 168941 163146 158975 151462
11459 151462 153118 152210 157204 166740 175129 176198 174199 170329 171003 174036 169728 169815 168217 160861 159274
11444 159274 157798 157089 162669 163415 164825 169019 172024 167817 163616 162387 164872 159878 150754 148372 153789
11429 153789 152990 154422 152706 151514 145123 142538 145285 148172 145032 148219 155753 157126 158472 157170
11415 157170 155989 153776 150506 153042 147794 140308 145057 158815 158300 157848 154439 151551 148767 151129
11401 151129 154553 150247 145438 147808 145506 144348 144427 145377 146514 146869 143457 137495 134645 140021 145061
11386 145061 150749 152742 159099 158334 148251 143061 136669 137394 146109 141677 135100 132515 136494 136436 131366
11371 131366 132524 128469 133843 139333 132837 128235 135688 138236 137393 129433 130322 126985 125772 128862 125808
11356 125808 122083 123533 129457 134635 125152 119795 120867 129547 128410 129602 140981 134378 123445 124066
11342 124066 121229 120113 122023 123184 118668 115400 112694 112617 119839 118503 119854 127578 126438 118559 115377
11327 115377 116028 118288 115147 110813 110133 107067 109990 116611 118601 122165 122026 116610 116103 114485 114031
11312 114031 114880 114640 110668 105882 107274 113553 114881 111355 108180 105036 102261 106816 110686 106740 106319
11297 106319 104012 104594 100601 101584 104862 106667 107659 113256 113739 108704 108997 102735 98214 102484 108531
11282 108531 106547 100805 96389 96205 99833 102753 98755 97812 99154 98094 100191 103248 100468 94655 87701
11267 87701 84720 87965 85325 87200 92717 92702 98507 92819 93158 95659 93650 94019 94083 96614 98674 93435
11251 93435 96118 97618 97196 90259 85791 89109 91333 94321 91880 87038 88414 86326 83403 89050 91980
11236 91980 91441 87698 84505 86189 88727 90726 89616 91810 84207 80777 83183 84545 79491 73349 70800
11221 70800 73100 77095 76920 79848 87691 81008 71054 70014 61909 65514 73407 80448 86369 84411 83229
11206 83229 83305 76557 73669 69500 73115 87010 90040 81122 74729 76239 83901 79548 75130 69996 70943
11191 70943 73456 67960 63577 64893 68983 73477 80576 77507 74496 74121 71830 66974 69659 68428 67582
11176 67582 66813 68318 67456 69586 67507 69335 65849 63530 63310 68295 68116 69740 70265 64891 67435 62586
11160 62586 58432 60923 58897 56254 63713 64324 60147 55079 49191 44891 44449 48114 52842 53502 56682
11145 56682 59562 62690 56773 54923 57687 56582 58958 61822 56024 56488 56185 58219 56535 58385 54432
11130 54432 49136 48240 47446 51417 51416 51979 55794 60136 59861 63899 64749 65362 55838 49221 48019 45325 42465
11113 42465 42798 45354 43742 49378 49555 45171 41208 44081 49400 47680 46034 45135 43029 41654 43776
11098 43776 46960 45478 48710 50576 47406 40184 36954 41598 45459 49739 52197 50701 43172 42492 48347
11083 48347 54436 49590 46837 47683 44958 45972 46930 50303 52556 50006 47791 42691 42843 42141 43273
11068 43273 48713 43046 43329 48161 54570 56298 60460 59506 58840 63944 70480 72163 64313 61779 62668
11053 62668 60527 53213 54855 56483 54582 52154 52001 52136 54728 55528 54780 51575 43268 47063 44205
11038 44205 45040 49112 50950 48557 45782 43199 39590 41612 40258 41701 48869 53743 51836 46329 44968
11023 44968 53323 59048 62603 65287 66941 71104 80025 89640 94992 105728 119099 127044 137122 151696
11009 151696 166253 185011 213938 252733 299540 365510 453624 564031 712909 925406 1201145
10998 1201145 1510100 1818061 2078074 2175949 2041549 1682085 1351140 1169802 1078957 1015842
10988 1015842 939572 819166 678489 536661 427305 356921 317941 292379 274588 263872
10978 263872 252686 240202 231504 220217 208771 201282 198765 198752 194841 190538 183913 175042 169122 156680
10964 156680 142512 136954 128013 112961 111439 109748 105151 95219 83712 85062 85046 73022 65749 66074
10950 66074 62769 64091 63577 56139 53340 59229 66216 69288 65731 52998 43333 35142 32331 34567
10936 34567 35126 39784 35167 32343 39008 42287 38513 35162 29275 22080 22582 27514 29867 22309 15120
10921 15120 12250 10204 9804 12465 16738 21450 17787 14974 13073 10495 10156 12118 6337 3006 4373
10906 4373 9663 9617 16449 21329 20136 17647 11058 10255 8550 9784 11641 14033 21994 23933 28749
10891 28749 31878 30019 29319 36881 52175 70250 83760 108767 142341 179441 211208 248118 274911
10878 274911 278885 256122 212301 169854 133605 104060 83487 68580 56980 44815 41513 34482
10866 34482 26822 23133 22542 18166 16835 18826 21803 26935 28993 24578 23237 14056 9417 12945 14271
10851 14271 17299 12549 6293 4744 -1788 -1211 5508 5459 2899 5605 2634 -1360 -7188 -6396 -5812 -6669
10835 -6669 -11298 -10750 -9936 -8754 -4788 -1397 -164 -5956 -3061 -2762 -8801 -6794 -5423 -6672 -8547
10820 -8547 -9126 -8678 -7009 -6757 -8865 -8390 -6048 -8668 -12573 -12472 -12444 -6526 -7925 -11354 -14652 -16348
10804 -16348 -10631 -9798 -12074 -18008 -18856 -21101 -25608 -25367 -26720 -30310 -30043 -32769 -28257 -26604 -22926
10789 -22926 -19976 -26088 -25997 -23371 -20550 -17823 -15744 -15695 -20908 -28872 -32765 -26614 -26088 -20216 -14058 -14045
10773 -14045 -13434 -13183 -19216 -27447 -25490 -22134 -25680 -28706 -31850 -33547 -29614 -26171 -24736 -23896 -16643
10758 -16643 -21642 -28707 -37488 -36279 -32924 -37355 -36176 -25806 -25623 -26612 -24187 -27953 -25459 -23273 -29237
10743 -29237 -32402 -32037 -37232 -36385 -35369 -37687 -42378 -46695 -43957 -44687 -42228 -36855 -32625 -31306 -28489
10728 -28489 -26363 -24979 -22102 -21928 -17512 -16259 -18665 -21624 -22449 -33143 -35618 -32899 -35163 -41817 -42499
10713 -42499 -44272 -44100 -47070 -43999 -40088 -38164 -39751 -39398 -35914 -34877 -33473 -28208 -23900 -23571 -20493
10698 -20493 -17014 -8943 -1910 -3722 -2771 2023 7996 6695 4308 4076 849 -8911 -17757 -21172 -25886
10683 -25886 -19303 -9802 -7916 -13992 -23971 -29711 -24795 -10730 -7573 -7065 -5130 1405 11787 17584
10669 17584 19344 11276 3417 1791 3351 3503 2851 3654 -5382 -12842 -13098 -20343 -25060 -24465 -19037 -16951
10653 -16951 -12802 -8016 -2002 4917 11459 19463 27676 34511 46404 62921 84033 119820 157567
10640 157567 198360 262381 360997 475707 621143 791056 965576 1124049 1212818 1194753
10630 1194753 1098483 953383 772113 579997 408021 282875 208345 162747 135952 120828
10620 120828 108589 97670 86083 76574 60761 44982 40246 40949 39703 40144 40138 28753 24068 28299
10606 28299 35022 30221 21026 16749 13351 10411 7145 5682 -116 -3779 -10684 -17217 -18642 -15876
10592 -15876 -18513 -23684 -30495 -26182 -30035 -28469 -32967 -29636 -29828 -28189 -33976 -38674 -32900 -36314 -45564
10577 -45564 -48009 -45620 -42177 -42924 -44473 -49055 -53911 -56038 -49078 -42780 -38500 -40440 -39013 -41333 -50793
10562 -50793 -52718 -50556 -48746 -44417 -44952 -45034 -40219 -35465 -39783 -37396 -26871 -16399 -2081 16285
10548 16285 39124 62744 90693 129293 186881 247170 306081 356638 386629 389189 360760 313373
10536 313373 245194 168858 114740 79263 49186 36748 21953 13189 1175 -12155 -16738 -27039
10524 -27039 -27538 -26633 -28236 -29714 -30407 -34656 -35785 -27746 -26635 -27079 -34535 -38121 -39795 -52208 -56338
10509 -56338 -57605 -53195 -55792 -57152 -62251 -68877 -74792 -79510 -83921 -87037 -82584 -77469 -81213 -78287
10495 -78287 -76593 -79289 -88973 -91218 -89793 -88680 -92205 -92198 -93911 -95881 -93140 -90690 -92061 -86175 -85578
10480 -85578 -95313 -91984 -92149 -95573 -97075 -103711 -110949 -103677 -104493 -114121 -117727 -111926 -104847 -98327 -92505
10465 -92505 -86752 -90915 -97141 -92585 -79974 -61932 -54467 -43860 -33764 -26952 -4734 13869 31570
10452 31570 48165 71384 103360 142506 202824 283884 399772 559555 751309 960942 1183259
10441 1183259 1362945 1439194 1402719 1327531 1243735 1122229 917954 660402 463321 337493
10431 337493 256316 197422 162592 140693 126823 107545 91154 79063 66324 49991 48749 53948
10419 53948 51182 44041 42170 46214 38876 30723 26433 21964 21439 17603 10722 -2490 -15064 -25399
10405 -25399 -26095 -33727 -45151 -52333 -60836 -65339 -62894 -63100 -67933 -71486 -79945 -91484 -90671 -87190 -91255
10390 -91255 -99507 -99587 -97054 -88590 -89354 -91761 -95815 -95472 -100869 -102782 -103627 -109491 -109611 -111465 -117169 -115956
10374 -115956 -119303 -119307 -118887 -120422 -126345 -126375 -122050 -114597 -112839 -107761 -100700 -94342 -85819 -79628 -69954 -58578
10358 -58578 -34675 -7039 25832 76098 134328 187753 231043 245508 218563 150910 79698 23826
10346 23826 -16592 -50738 -77399 -94753 -108106 -120598 -131535 -135108 -129671 -125684 -122505 -116788 -121265
10333 -121265 -127178 -126961 -122258 -121385 -120930 -119471 -117545 -114632 -110872 -107037 -100762 -85564 -60302 -28304
10319 -28304 6054 55749 113052 169153 232442 288760 302932 246227 143017 62988 18514
10308 18514 -3522 -17557 -23459 -19163 -13309 1867 26389 63625 108144 166217 249240 349651
10296 349651 472529 627551 793044 936933 1035775 1098657 1128889 1109677 1035371 938508 843612
10285 843612 729762 567508 392208 253329 156522 90809 51497 30514 13999 -9089 -22482
10274 -22482 -27250 -36976 -51079 -58812 -67611 -67956 -65928 -66461 -72015 -78056 -74749 -72577 -78267 -79567 -81124
10259 -81124 -87083 -83864 -88274 -95069 -96209 -105718 -106524 -107255 -108276 -110548 -120537 -124075 -123330 -125870 -123904
10244 -123904 -116881 -114187 -106351 -95741 -74916 -47746 -16974 13242 50397 93387 144443 211947
10232 211947 278260 337277 374476 368212 310939 234057 167673 87486 -23253 -144406 -226157
10221 -226157 -262753 -278731 -285417 -286161 -280234 -278790 -280856 -285675 -283798 -278899 -279800 -279786 -276586 -271180 -265947
10206 -265947 -265661 -265724 -262766 -261259 -257711 -251221 -241136 -227440 -210184 -191893 -176811 -185493 -205362
10193 -205362 -228705 -271122 -319902 -350956 -365760 -381798 -400975 -406013 -389769 -362183 -348598 -339059
10181 -339059 -322520 -314677 -298771 -287298 -272881 -249870 -231849 -217530 -204621 -192441 -168996 -126877
10169 -126877 -77089 -31519 -28754 -44082 -33434 -21005 -67255 -147440 -181305 -198309 -240469 -295043
10157 -295043 -317855 -318076 -328436 -341521 -334765 -324881 -319653 -315217 -308973 -306492 -308714 -306044 -302853 -301424
10143 -301424 -300370 -291491 -287718 -284976 -283342 -281000 -271243 -260367 -246132 -232951 -226528 -217836 -212782
10130 -212782 -201968 -186754 -172809 -154553 -136438 -117407 -100064 -92725 -84443 -73085 -75260 -78233
10118 -78233 -79727 -81827 -86171 -81460 -74492 -69962 -69634 -69449 -71254 -81718 -92651 -102567 -101612 -91211
10104 -91211 -86480 -87904 -82764 -76618 -66403 -64505 -73140 -78169 -80236 -76079 -67045 -61915 -59391 -46526
10090 -46526 -32254 -22327 -10486 2074 31596 69054 96438 122071 142036 158985 183133 215833
10078 215833 254243 300633 348219 411026 486047 557612 640572 737991 858484 999376 1150014
10067 1150014 1322351 1538615 1807849 2155969 2587158 3110411 3728182 4445121 5260794
10058 5260794 6147977 7065509 8040231 9223859 10677870 12418600 14487616 17071655 20392655
10049 20392655 24669581 30195105 37345967 46781265 59494108 76955919 100860152 131388519
10041 131388519 166772144 205078087 241000327 266288671 273473261 262504659 250309495
10034 250309495 237106597 213426504 172084362 127463787 95263047 74696445 61480650
10027 61480650 52673722 46511293 41936053 38411411 35631530 33363325 31438601 29826128
10019 29826128 28593307 27702420 27047432 26563190 26193900 25913844 25647265 25162893 24480831
10010 24480831 23690944 22874222 21905831 20763895 19572594 18403087 17297988 16284299
10002 16284299 15352127 14483882 13677218 12922720 12215618 11555361 10945203 10381332 9856914
9993 9856914 9367082 8914629 8501134 8110907 7743914 7396299 7064492 6768351 6491354 6219978
9983 6219978 5958128 5708245 5474697 5255468 5040447 4826636 4629099 4450096 4275970 4106438
9973 4106438 3951816 3810915 3673107 3541623 3423176 3305728 3196936 3084532 2972668 2861218
9963 2861218 2756027 2660826 2569443 2491792 2409979 2331472 2262401 2196791 2123641 2055987 1998427
9952 1998427 1940342 1878354 1818424 1764675 1712056 1672136 1624303 1583911 1549561 1523150 1497263
9941 1497263 1465698 1432119 1388657 1352983 1311538 1276668 1248179 1217513 1190812 1156297 1129256
9930 1129256 1106683 1082644 1066428 1056179 1057472 1071018 1092371 1111029 1122971 1142735 1165365 1187963
9918 1187963 1205608 1207371 1197516 1195006 1208610 1202908 1181219 1178168 1140723 1094133 1054337 1038010
9906 1038010 1015731 961649 921891 887173 856482 832398 813450 799433 794558 789074 775826 776644
9894 776644 779688 786427 802812 823007 841584 870643 910409 955345 1002237 1039731 1050475 1042115
9882 1042115 1017118 964955 900939 857321 834916 808062 792385 794243 799894 808321 817687 819879
9870 819879 821115 824155 826050 829109 834734 834737 831840 832188 836419 837096 839257 846138 847687 854838 864187 869167
9854 869167 876273 887791 892101 893597 887217 862036 808426 727117 639283 578416 533772 489347
9842 489347 453917 444244 455025 479202 504328 511714 519731 527693 535339 538962 540645 539604 541941
9829 541941 537164 524867 513286 502828 496171 493817 496400 489093 479159 469248 463770 454291 445393 437947
9815 437947 432456 417233 405582 397582 392742 399682 404237 394706 391279 394644 400278 402205 394433 391047
9801 391047 394400 396651 392652 391832 383073 379348 374164 375258 385221 395697 398202 403293 405651 404961 407255
9786 407255 411058 419999 417252 397286 376164 372371 380104 380723 362808 348810 340998 336359 333393 336977
9772 336977 331566 323077 319822 316195 313126 306859 297503 295476 294255 293337 294884 297721 293878 292217 293276
9757 293276 295432 297464 299287 300830 301539 294819 289364 288758 297177 293984 286933 286381 286484 287400 285671 287687
9741 287687 285090 289567 292493 306148 313034 316420 321057 326513 326751 324806 321694 314652 315995 314536
9727 314536 302615 285741 268922 266441 275100 277866 271254 266379 265891 272354 268829 263417 266265 272943
9713 272943 270713 275216 268195 257491 260727 263272 262750 258276 258602 260792 262659 264041 258479 256816 260096
9698 260096 260145 263621 262623 252408 252969 253088 248418 245924 247925 251087 253243 253330 250104 246703 241241 237129
9682 237129 235543 238967 237072 237005 230725 223420 219689 215445 215502 211914 213783 213335 211565 209268 206383 209510
9666 209510 210599 212317 207037 198670 206373 204455 205868 208013 206312 202560 196071 187984 187444 195434 204791
9651 204791 212831 215517 215141 218106 223741 234823 243153 258856 273922 296987 316517 334024 368194
9638 368194 415282 481376 569492 686053 844396 1050812 1280147 1519320 1732643 1878652
9628 1878652 1920958 1943542 1981853 1979288 1868997 1658677 1420126 1173381 984420 862097
9618 862097 769693 688967 608369 543904 497145 461724 432918 411114 406116 398945 392696 385257
9606 385257 374095 365439 360541 359273 358828 356452 355285 358070 354313 344280 338495 329651 319144 311905
9592 311905 303339 295821 282512 281252 274291 276140 286696 300022 310832 317083 325800 335913 344393
9579 344393 350884 344819 323400 294855 285423 275760 261062 242671 231955 226118 225791 224748 217886
9566 217886 215163 209759 202401 197912 203681 197750 187454 185377 186687 188492 180399 169324 167363 168842
9552 168842 167943 174444 177324 184106 175676 162440 164070 161753 161977 160006 154506 156853 153543 149316 146704
9537 146704 141038 140609 136639 141624 143134 139341 139724 136292 131186 128539 132617 130786 126805 132660 128810
9522 128810 128636 128057 124819 124916 126702 132312 133344 135509 134545 135168 137950 133829 124150 119173 121802 123867
9506 123867 126546 127325 127008 124720 124234 128664 128090 124253 124462 127803 124538 118906 118984 120225 117197 113572
9490 113572 111536 113838 115607 119206 122134 113606 112279 116583 125314 127723 131412 125732 123209 123283 125764
9475 125764 120809 114889 114165 113017 112587 108402 103252 102484 104183 111263 118269 119895 121347 117162 110421
9460 110421 114142 119965 119940 121188 116492 110263 110047 111413 109543 98998 97144 97151 101630 103448 109452 110675
9444 110675 111391 107689 111766 119498 119070 112823 110206 106469 99552 99723 104712 110550 113042 108019 109251
9429 109251 107047 104240 101858 96031 95866 102831 106128 102643 98263 96754 98415 98799 102522 102731 104518
9414 104518 103751 110707 112687 105423 97366 94353 89896 89092 86628 88013 96635 97753 96795 99452 100125
9399 100125 101191 98945 90689 89981 96903 97054 94460 92674 94777 99603 102988 105218 107326 96681 92872
9384 92872 89668 90388 93139 94431 91725 87802 91541 82350 82687 85526 80369 77973 80565 88265 89938
9369 89938 85034 81728 83132 82675 84419 80804 80739 89733 91718 87069 79110 74110 76257 78338 74815
9354 74815 74472 77402 81042 76910 75238 78340 80563 78182 83344 81204 74627 73370 77250 81851 77613
9339 77613 74556 73436 75079 82800 82870 79424 79476 81566 81356 80239 81999 80910 77179 75078 82017 80709
9323 80709 79333 82304 81689 83455 86349 82597 82305 82594 80284 86984 87509 84331 83612 77614 74568 76722
9307 76722 82609 85058 80904 72458 75979 84056 83443 71966 78695 83204 76363 68406 67312 67127 66888
9292 66888 74009 77324 79998 85448 80043 76939 71960 66672 65590 62493 67349 69736 70425 73066 74609
9277 74609 68021 57589 59457 59198 61820 66157 67069 65496 65951 71429 71550 64867 66892 72824 66067
9262 66067 65186 66617 61781 60773 59361 59459 54177 47723 44129 42755 41725 45782 49152 51254 53986
9247 53986 51673 52990 53701 55003 59363 56959 52996 55917 60849 61214 60770 58415 59721 59593 65626 73554
9231 73554 74122 70481 70776 71365 69384 66945 62967 57531 55063 59834 67339 72289 73446 63482 61085
9216 61085 63648 66843 64023 66137 67468 62134 57798 64036 63189 64532 65616 62907 71990 71957 68079
9201 68079 63876 60466 56156 57181 58590 56893 60745 64194 56493 49307 50244 55553 56691 61520 61921
9186 61921 67248 70064 68982 71272 69466 60510 55092 60692 64116 62247 52109 53162 56694 56146 53858
9171 53858 53226 59427 68832 66744 61597 58669 63837 62429 61999 58233 57318 61770 58809 59344 57722 61369
9155 61369 63609 62081 61599 61191 56358 52339 47421 49134 59947 66627 63205 55171 49935 49959 49064 50561
9139 50561 57627 63335 57565 43623 36609 35988 41831 49266 44594 36651 34032 33445 36951 43744 47004
9124 47004 44742 47195 53992 46494 43825 41716 39819 44332 45290 50085 51585 52873 57977 56390 49805
9109 49805 46419 44812 45606 41990 43776 44862 42919 41912 45327 46333 52527 53119 49375 40947 41060
9094 41060 39083 39320 40908 41891 45850 49420 52373 50352 47019 44408 44150 43257 43997 47311 45015 43177
9078 43177 40388 39485 44981 40842 37305 40051 40026 40880 46588 49427 46495 38094 38397 40804 44611 44460
9062 44460 42433 34969 44060 52189 47818 44094 45524 42232 47683 53004 48882 44310 39823 35164 34159
9047 34159 34808 39062 44389 46365 48098 47742 44300 38294 35700 39218 43448 41959 43433 42793 38163
9032 38163 36267 38597 35447 33260 36004 41072 42233 36687 34885 30789 31358 36237 33912 36590 33284
9017 33284 32136 32003 35939 38617 41524 37531 39092 37392 40728 45010 36621 30135 34387 37522 41006
9002 41006 47134 49897 44267 36764 33736 38705 42634 41154 42727 40786 36156 39207 42048 39715 44233
8987 44233 44540 33630 27527 34244 34163 30000 38571 39219 37462 34418 35036 31041 31449 35009 40319 45344
8971 45344 40895 37366 30758 26948 29213 27317 32338 41007 45654 36681 31035 29046 27416 31528 30145
8956 30145 24833 19613 18669 19121 20840 31220 40862 37035 28443 23899 27021 25489 29695 31628 30471
8941 30471 32322 34161 36295 35150 34958 30404 32757 33123 28711 28741 30022 30007 29851 26723 24897 19401
8925 19401 21270 32243 34080 34544 33821 35326 36563 33893 30665 32476 32862 28461 22908 23809 23064 21667
8909 21667 26579 31081 30675 27361 25059 24027 23846 28024 37671 39878 36470 35823 34347 26734 23302
8894 23302 32719 35622 32922 28948 30103 25678 25931 27082 25824 24387 30268 33954 33855 30511 25294
8879 25294 23467 21017 19906 25104 26692 26639 26952 24409 23142 24866 28957 37056 35774 29910 27847
8864 27847 23581 24633 31182 22629 17248 21286 22872 21935 29228 33467 30317 21667 21505 28991 29511
8849 29511 28790 26730 23545 24060 27008 28052 23268 24665 24489 20500 23343 24493 33209 33086 35594 29509
8833 29509 25922 28780 25688 28241 27724 20126 21233 23213 27930 23090 24113 23103 20297 25473 26454
8818 26454 24741 24397 27952 25818 27184 30543 29238 34957 34890 37016 42817 43213 34231 34242 35442 31078
8802 31078 21852 18272 15444 20611 28737 24172 18252 17461 18641 21134 23610 23642 15713 15408 18695 16941
8786 16941 21092 23795 25574 29302 26723 25573 25068 27311 31998 34927 32356 30143 36224 32960 32725
8771 32725 36825 31699 28894 24710 22663 26923 26007 24247 23150 19819 25506 33578 39592 37567 31519
8756 31519 30953 23739 19537 19605 11770 9538 9197 13974 19843 22044 13263 16819 24235 24981 23270 21162
8740 21162 16362 15399 17363 16239 18500 23800 28559 28332 24409 26863 29524 23078 23700 30273 30430 34916
8724 34916 32999 30784 23833 21399 22814 25457 16734 17009 14680 14795 22378 30886 24508 21761 29987
8709 29987 25826 18804 18770 24237 24061 23615 20623 18048 14952 13880 18202 20584 20023 20213 19251 18414 18079
8692 18079 21104 15551 16371 16078 16006 15211 12446 17436 14660 16830 19302 16552 16073 19845 23638 26021
8676 26021 28047 23579 25510 27098 22253 20247 27051 32744 32444 30053 26615 23428 28074 28849 26964
8661 26964 21482 13518 7279 8977 10065 15875 18783 18991 18705 20786 24112 28077 26672 27813 34000
8646 34000 36361 39371 39107 29018 26991 32634 43822 43564 35257 40607 40714 40247 33063 29333 31809
8631 31809 34032 39159 36964 39240 44258 42356 39943 42534 45029 51534 51918 52676 53075 51749 46675
8616 46675 50855 55376 60097 68200 66365 71600 69188 55708 44987 38959 40963 41390 36163 34553
8602 34553 37569 35089 42265 43861 42797 40091 39533 39884 39550 41356 44831 44718 46613 48150 39793 40295
8586 40295 45561 48062 53646 55322 46890 38602 38451 38530 41828 48525 51388 51869 52396 49613 51513 45289
8570 45289 42309 44292 37935 32329 31110 30227 30066 31860 37974 36529 29810 24742 23273 20451 17720
8555 17720 20449 19487 19158 21767 17325 12600 11406 13228 12804 21211 23623 25546 28569 26068 27337
8540 27337 25349 21853 23636 23627 24184 20674 18258 15825 11009 6284 7535 13505 11440 15712 17391 14121
8524 14121 7723 13210 14492 16917 15899 11998 17277 19777 19346 22968 28525 28501 24125 19021 19275 23764
8508 23764 21915 18774 21785 22841 21113 22310 25816 26832 25700 23632 17985 12797 12499 17653 15131
8493 15131 14258 12924 15695 15401 17772 18520 17609 14329 16150 12540 9147 3837 643 4206 15237
8478 15237 15558 14625 18941 23000 24830 28478 27468 26669 25487 30391 26646 17261 16542 13781 7785 10170
8462 10170 14195 12639 17969 17966 17256 21065 23231 17814 16493 17507 25210 27005 20599 13852 12164 14085
8446 14085 12037 2552 1138 6628 13668 23393 25849 21115 19680 26029 29549 25989 26394 29798 22803
8431 22803 21658 20631 18462 11858 8733 9918 11682 13062 8546 11122 15742 17379 16938 12337 9990
8416 9990 10071 10676 8224 10868 16719 14714 13795 18708 21361 28949 36197 44186 41286 36388 24061 15686
8400 15686 13166 13471 9121 4840 6242 17933 21028 24434 30014 27517 19209 13297 10977 8222 9263
8385 9263 10151 9662 5545 4367 -637 5282 2424 -2429 3597 10565 17067 12540 8920 4921 4884 6351
8369 6351 9135 7831 15066 16865 18793 17985 16212 20010 14786 4735 5870 13302 18922 22996 23661
8354 23661 21457 15457 10956 6393 3018 755 7144 16436 24169 21291 28097 27047 24708 20186 12943
8339 12943 7676 6072 2449 176 5993 10842 4843 2125 4067 1543 4777 7643 18351 17437 12277
8324 12277 10708 10668 16755 21756 24670 21314 18658 15473 11173 4853 -823 3013 5330 10263 7839
8309 7839 6052 7616 4933 4202 11998 17555 24561 12917 -5197 -6567 1073 2032 -2429 -2544 2912
8294 2912 8177 8089 5185 6637 5840 6923 9131 12484 7741 5104 13614 16742 18176 10532 3263 8129
8278 8129 8594 5775 2656 5978 5218 -3166 -561 5247 10783 10513 5017 -1253 -4241 747 -1380 1592
8262 1592 6474 2921 -62 2984 6279 5683 3026 4195 -1088 -5040 -5321 -12949 -12388 -7993 -6291 -2499
8246 -2499 -3139 -86 -448 4136 -164 -3918 1175 7572 3969 3793 7151 3614 1163 -1364 2419 6989
8230 6989 12044 13664 9644 8056 12572 15576 12744 7325 8904 12068 12869 6611 -619 -5323 -5515
8215 -5515 -3870 253 133 7656 12810 11450 6222 4013 3064 4190 3730 3350 4514 -3 2165 1948
8199 1948 1875 5318 3705 3312 13002 12074 3969 -7 -2213 -158 375 5456 9787 8348 12027 8125
8183 8125 5894 6626 7561 3988 -99 5144 14216 16285 10705 371 4144 4136 742 4823 6607 5880
8167 5880 9151 5325 8089 6025 1072 -2905 -678 4079 9696 6251 -7982 -1951 4611 5855 7446
8152 7446 12461 11778 6087 5429 2450 2133 -1291 -2788 -3855 -4610 -4459 -733 1690 -144 -515 1264
8136 1264 2724 3545 4122 5336 5492 6353 4370 1413 2247 7946 5215 3401 2685 2750 7876 9751 7597
8119 7597 5728 2201 7890 7546 7652 9037 2583 3608 -4113 -6115 -4685 -216 -511 1993 4258 -616
8103 -616 -692 1631 -607 -3168 1118 2675 8699 11444 9400 9856 9069 4757 -182 942 -3043 -2600
8087 -2600 -1762 -699 3538 3749 8045 9004 5624 7300 12303 12814 6302 3937 -1291 314 4939 -527
8071 -527 -2901 -2317 -2209 3630 -415 -1662 3035 308 969 -4135 -10047 -8157 -3041 -3180 -659 410
8055 410 2464 6775 4099 9326 4615 -3314 1816 7258 5721 8641 4137 3531 6715 15669 13698
8040 13698 5473 -2509 -5916 -11290 -9763 -5596 -3358 280 6791 8223 5753 8832 6752 6031 7422
8025 7422 7686 7480 9680 6622 -1200 -749 31 858 -4468 -10439 -13521 -6978 -1885 2825 3996 3484
8009 3484 1533 -198 1219 6392 5170 6802 9772 12013 11197 9394 11501 5422 2017 -5431 -7227
7994 -7227 -11606 -9509 -5061 -4996 -2989 -1126 -2118 -6120 -8206 -8419 -4596 190 -1651 -5330 835 1861
7978 1861 4929 3855 6698 10969 8116 6146 -497 -3677 -6987 -3618 3257 2725 1139 -2071 3260
7963 3260 4743 4192 5270 2650 3400 2635 4608 3086 2120 6331 8751 7933 3412 698 -445 -2540
7947 -2540 -932 -4031 -7299 -3100 5228 10314 8983 -1592 2868 5420 -1697 667 3971 4681 10706
7932 10706 15406 9085 3296 6606 5065 6918 10124 5312 3204 6385 14705 11036 9223 9249 9963
7917 9963 4763 3086 8051 4581 -818 5014 9941 5789 11 1492 3996 7062 5812 8113 9367
7902 9367 12714 7375 6721 5720 12130 6769 3698 4917 -596 3527 5208 6436 11388 10602 16191
7887 16191 14105 9291 6461 5258 8919 15550 22479 20147 11920 10466 6830 6182 3996 -921 2252
7872 2252 5552 9797 11532 5981 -91 1314 6451 7300 4682 8796 13162 12796 7554 7628 14165 11456
7856 11456 2611 802 -448 -3332 -3903 -1183 1426 -4063 -7766 -9675 -7499 -4917 -1246 4041 14617
7841 14617 19898 12122 11643 17628 20185 14062 7607 8910 5582 384 1561 6756 3875 2961 10067
7826 10067 13545 9028 10829 17669 11709 2849 -1127 -1810 239 -475 -5891 590 6103 6269 7358
7811 7358 5865 8307 13878 9994 6154 7652 5484 3241 2591 6044 8027 9402 7440 8279 8845 6609
7795 6609 3342 5604 6134 21 -5048 -5395 -1826 694 -6855 -14452 -11928 -7249 -6582 -966 -3326 -10982
7779 -10982 -15973 -18770 -14867 -7017 -3275 -2934 -4597 -1611 -4071 -9953 -7251 -6286 -4955 -8567 -11760
7764 -11760 -8424 -5317 3263 6435 3811 9960 9130 6063 4963 5658 -1990 -3244 -4517 -3409 -3086
7749 -3086 -1721 -2158 -717 3198 3093 8481 9532 6904 9849 10440 313 -4212 -349 -1536 -2919
7734 -2919 -7989 -12908 -12659 -8437 -1821 2013 -4043 -7482 -7848 -8858 -13128 -13756 -8504 -10640 -11280 -8557
7718 -8557 -10890 -16926 -11421 -6229 -216 3588 860 -2467 -7205 -4267 -6903 -10321 -10889 -10728 -14438
7703 -14438 -7325 841 1551 2911 3458 -4230 -7558 -9212 -7743 -3273 -1704 -5744 -3651 3163 6608
7688 6608 7447 7050 3570 655 -1781 -8128 -7764 -4442 1923 819 -5449 -4358 -4954 -8513 -9989 -9631
7672 -9631 -10910 -10090 -5730 -5701 -6880 -9716 -6523 -9204 -8623 13 2635 -1327 -937 -667 -2006 -505
7656 -505 1258 20 2129 4397 4872 3093 5001 8116 8950 8092 2140 -2761 -3857 -1782 853 -130
7640 -130 3037 3637 -2559 -7944 -4828 -1587 2306 5235 4046 1926 -1933 -5993 -7883 -1722 1407
7625 1407 -4839 -7617 -15510 -17062 -12360 -9420 -6163 -6961 -1575 -7884 -8997 -5698 -3165 1870 1437
7610 1437 -952 -6583 -7325 186 -3281 -11639 -12627 -10826 -5742 -6264 -4312 -1339 -4122 -8818 -9074 -4652
7594 -4652 1073 1977 1653 -1385 1106 7691 8803 1285 -4480 -6469 -8939 -7110 -5830 -753 2716
7579 2716 739 4919 6491 8488 11412 16358 14932 6745 1059 -680 5158 7449 -3983 -5390 -8466
7564 -8466 -7663 -11560 -8783 -10207 -13182 -15184 -12609 -9104 -9225 -11074 -4185 3797 1204 -3021 -3322 -5080
7548 -5080 -9168 -12668 -14726 -10190 -3612 1274 -814 -556 -6114 -8809 -11816 -11208 -9855 -11555 -13412
7533 -13412 -8535 1159 7266 10430 9447 8553 7060 -1405 -4742 -7809 -12125 -15217 -14533 -7646 -9430
7518 -9430 -13255 -13708 -15071 -19734 -15627 -7112 -6604 -7884 -7810 -4540 -5307 -10079 -7314 -6626 -3824 -1725
7502 -1725 -2848 -2206 1222 2718 -3221 -11252 -17013 -15742 -10637 -13974 -23047 -22642 -20891 -12606 -11587
7487 -11587 -8084 -2602 1439 -1689 -7036 -4241 -9110 -6621 -861 -1839 -3622 -5452 -5044 -5046 -2644 748
7471 748 -1154 -8018 -9738 -6440 -5174 578 5700 5494 -16 -1065 -1939 -4041 1090 4713 3289 4357
7455 4357 8419 9642 9568 3807 -6237 -5783 -1406 -3237 -4736 -2598 1340 34 -9210 -13889 -12244
7440 -12244 -11793 -14024 -14004 -17878 -12074 -7883 -3328 -914 -846 -3646 -10219 -10855 -8883 -15722 -16793 -11347
7424 -11347 -13640 -12896 -16591 -21764 -22220 -20846 -9793 -5675 -7206 1533 -3475 -6088 -3972 -4047 -7171
7409 -7171 -7907 -6396 -4901 -6828 -5471 -1332 -3397 -4553 -3686 -3908 -8762 -12097 -11829 -4725 -7194 -6937
7393 -6937 -524 1130 -2862 -6394 -6320 -7958 -4637 -5174 -5576 -3849 -6136 -4528 -3796 -1606 -2120 -853
7377 -853 1008 1248 -5368 -8333 -6329 -6813 -7150 -2202 -5332 -4375 -11088 -10538 -11025 -13217 -16076 -19519 -15373
7360 -15373 -12710 -11163 -7586 -7915 -10613 -5286 -2191 -477 2497 5647 -3447 -13985 -20761 -18625 -17507
7345 -17507 -16842 -12103 -4983 -401 -8612 -10036 -7415 -8515 -16568 -16111 -9525 -12725 -15551 -9511 -9934
7330 -9934 -13968 -18478 -17899 -6046 -3059 -6967 -8522 -8787 -4802 -291 -2607 -4523 -8901 -5321 -6665
7315 -6665 -5774 -4158 -3301 -1804 -8130 -11334 -9924 -9397 -13760 -18426 -12007 -4368 -940 94 -2755 2811
7299 2811 2408 830 -1583 225 -6304 -10913 -14347 -20317 -12616 -7621 -10305 -14481 -14718 -16942 -14066
7284 -14066 -14378 -21813 -20645 -17110 -8147 -3866 -1682 -4969 -7065 -8095 -2987 -1887 -1360 2819 4507
7269 4507 2492 -138 5287 -2634 -11459 -12095 -11148 -14066 -15994 -17785 -15846 -8664 -10946 -6712 -11519
7254 -11519 -17057 -16328 -12508 -15310 -11880 -5431 -2318 -6012 -14119 -21495 -20588 -18773 -11462 -1074 3020
7239 3020 -2655 -13333 -19751 -17484 -16608 -17406 -9944 -3320 -5627 -3201 -2542 -8810 -4152 -6849 -7734 -6156
7223 -6156 -11592 -8320 -6265 -1574 -3546 -3893 -205 3813 9256 4818 -2804 -4548 -10199 -14313 -12133
7208 -12133 -1567 3529 -1131 -2821 1601 792 -2139 -9498 -11574 -3844 -3998 -2341 -2703 -3354 1494
7193 1494 4726 6350 9021 -660 -5471 -2290 -2206 5684 2832 -3992 -5084 -7494 -5714 -7722 -10126
7178 -10126 -15028 -14788 -5629 -6763 -4877 857 1055 -4778 -8998 -3578 -1919 -8264 -6395 -2388 -2766
7163 -2766 172 2874 3635 -6361 -8767 -9896 -9163 -12260 -17535 -22798 -20058 -20859 -17064 -14709 -11896 -19029
7147 -19029 -19331 -15699 -19148 -9914 -9602 -8932 -8676 -8840 -9651 -10915 -4330 -793 -3173 -1741 -1384 -4329
7131 -4329 -7683 -10894 -13170 -14501 -11889 -8966 -6230 559 -693 -1716 -6669 1656 1383 -5986 -8806
7116 -8806 -4630 -5650 -5979 -12864 -13951 -14021 -19972 -20207 -16036 -7788 -3110 -5332 -11079 -3442 -4617 -5867
7100 -5867 -10277 -17645 -22836 -15452 -19183 -17925 -11542 -8434 -5480 -1008 425 -37 1082 2032 2097 3734
7084 3734 -964 -2407 -8866 -15713 -18610 -12703 -15639 -20196 -17945 -16056 -7048 -1653 -5176 -6296 -5823
7069 -5823 -8578 -7681 -3365 -3490 -12393 -18557 -18015 -10834 -6454 -8308 -8616 -13540 -10369 -9482 -14070 -11511
7053 -11511 -15058 -10484 -7615 -14270 -18656 -15176 -14719 -7470 1786 2683 -2173 -5711 -10383 -12582 -10700
7038 -10700 -2990 680 1324 6650 5586 3445 -4155 -11893 -12512 -5416 2010 2003 -1595 -2275 -60 -2028
7022 -2028 -4376 -6779 -15169 -20930 -25911 -27961 -19982 -18965 -13081 -11253 -14569 -13010 -12368 -10150 -17615
7007 -17615 -20810 -13209 -14436 -17513 -22399 -24866 -18864 -12278 -16248 -17650 -15845 -14450 -17318 -22357 -21304
6992 -21304 -12869 -8536 -10871 -3650 1266 3948 4374 -407 446 2276 -352 -1411 -1665 -6564 -13646
6977 -13646 -15052 -16957 -16009 -15525 -10457 -2494 -3310 -8971 -10049 -11056 -12548 -9355 -2277 -4305 2139
6962 2139 7638 9786 10589 1404 -1568 -4667 -4564 -1885 -2198 -1239 -1914 -6527 -8563 -2613 1636 -1156
6946 -1156 2124 1435 1765 381 -10614 -14725 -16814 -13955 -17355 -16596 -12524 -11022 -10417 -15843 -16409 -10861
6930 -10861 -8910 -6262 -6657 -5247 -3573 -5382 -8323 -2631 1514 -989 -639 -3066 -2565 -895 4892
6915 4892 5143 6005 837 -6034 -15739 -14502 -7828 -7024 -6738 -7269 -4497 -8132 -10860 -10177 -11658 -15419
6899 -15419 -23283 -24525 -14409 -5578 -1769 -4454 1606 5452 -1149 5005 4356 -3426 -6956 -4878 -3468
6884 -3468 -12243 -11449 -14395 -15411 -6325 -8755 -8266 -10882 -13115 -15983 -16015 -19594 -21914 -19626 -19803 -14266
6868 -14266 -11780 -15445 -12461 -9382 -14692 -12501 -13184 -12352 -10547 -15625 -16140 -6495 159 -1484 1018
6853 1018 -2112 -8155 -10115 -12645 -14745 -12305 -5125 793 -1240 -4776 -7438 -10076 -13049 -16807 -22176
6838 -22176 -19773 -19191 -21135 -21496 -17629 -13495 -19730 -17776 -16137 -15058 -11624 -11363 -10760 -12764 -21565 -19204
6822 -19204 -12164 -13669 -11348 -14941 -15007 -9469 -4910 -10771 -14630 -8320 468 -2572 -12104 -15978 -14236
6807 -14236 -11131 -16321 -18515 -16882 -17678 -21868 -20617 -13633 -10342 -17376 -17607 -14361 -7396 -8092 -15583
6792 -15583 -9794 -12231 -15981 -16672 -14045 -3738 5623 8308 3555 1465 -446 -3770 -5672 -5593 -9271
6777 -9271 -13559 -12118 -11714 -13173 -13416 -12103 -9621 -7553 -7050 -5624 -5548 -7986 -9453 -11519 -14162 -12023
6761 -12023 -7369 -10434 -14752 -11073 -13810 -13918 -12185 -11404 -12930 -13371 -8223 -5604 -7056 -9980 -7651
6746 -7651 -5930 -4390 -6783 -8545 -11460 -7837 -9443 -7380 -1063 -1585 -6336 -6453 -6123 -8894 -7357 -9790
6730 -9790 -13307 -15952 -12531 -11294 -10711 -10351 -9644 -10537 -14065 -15060 -13015 -15295 -16463 -21348 -18928 -7642
6714 -7642 -2032 -3572 -5922 -9980 -6203 1862 2724 5033 -26 2727 3848 14036 20165 18371 25746
6699 25746 26007 15790 3803 -986 2549 -1516 -2123 -2879 -1777 -2892 -1721 6231 10842 1989 -2649
6684 -2649 -12418 -14610 -8558 -3632 -2721 -7491 -12027 -6612 -12195 -15135 -8331 -7435 -404 -5870 -11573
6669 -11573 -10845 -10511 -9987 -16848 -16593 -11978 -10372 -9897 -8535 -3205 -1865 -3775 -2205 -5729 -3731 -3538
6653 -3538 -1224 -281 -2824 -8511 -7105 -8446 -10451 -8125 -8784 -11663 -13426 -10613 -9732 -4323 118 -10249
6637 -10249 -15254 -15990 -14566 -14551 -13041 -15160 -14568 -13566 -10341 -12393 -14403 -15931 -17247 -14311 -6904 156
6621 156 1564 -3672 -12514 -16427 -15438 -9757 -6347 -4658 -4773 -6078 -4703 3624 5072 126 -8377 -17165
6605 -17165 -16790 -7353 -4424 -2337 -3383 -11318 -14716 -8945 -3530 -7839 -6994 -15023 -17297 -15031 -11071
6590 -11071 -7213 -5386 -4875 -7647 -6288 -5683 -2584 2231 -1712 -3242 -9211 -18318 -15466 -17652 -16065
6575 -16065 -11398 -8673 -7041 -7265 -3656 -8858 -13513 -12184 -14246 -19902 -23976 -22101 -18996 -12157 -4310
6560 -4310 -7213 -9790 -16743 -17675 -15582 -17490 -13019 -10188 -12633 -10515 -12156 -17027 -18680 -12078 -4328
6545 -4328 -2304 -3645 -10540 -7700 -9488 -12998 -9594 -8642 -2702 2249 2238 -520 787 5081 5337 -4176
6529 -4176 -13797 -14846 -13667 -13339 -23783 -24358 -22373 -12280 -4738 1865 7752 4951 4733 -7 388
6514 388 -386 604 1923 -3081 -1898 -2290 1234 458 -1741 3263 3492 1963 3847 2589 2118 2566 2042
6497 2042 7573 10575 14599 4429 -8068 -13350 -12374 -10907 -12443 -13023 -12669 -13183 -16202 -8483 1175
6482 1175 1360 -5029 -11646 -7980 -2917 628 1951 241 -1487 841 -2359 -11998 -13631 -17226 -13817
6467 -13817 -4494 -2646 -6743 -12195 -15655 -12528 -9257 81 -3188 -9840 -16163 -16216 -15175 -19264 -16712
6452 -16712 -21863 -26385 -23525 -18856 -15574 -11378 -10727 -16572 -20145 -17427 -17980 -14808 -12466 -13456 -8767
6437 -8767 -10367 -12160 -11159 -9058 -8557 107 918 -2421 -7542 -14502 -8099 -6947 143 -1716 -3067
6422 -3067 -2838 -7826 -11197 -16058 -15708 -14799 -5867 3990 1271 -9379 -16990 -18781 -18707 -18733 -12857 -7129
6406 -7129 -12521 -19798 -13175 -8888 -14370 -9904 -12732 -11907 -8336 -13028 -15774 -10067 -5859 -5083 -1812
6391 -1812 5751 2247 -3832 -7373 -7292 -7519 -6078 -5984 -4027 -5726 -10538 -6481 -7965 -14855 -18522 -11373
6375 -11373 -4164 -590 -7340 -7121 -4333 -5089 -4756 -8868 -11148 -14619 -17402 -7334 -5836 -6094 -12954
6360 -12954 -16920 -13978 -9026 -10341 -13417 -7101 -8748 -5485 -3766 -8269 -15382 -16974 -19317 -22939 -19238
6345 -19238 -16494 -15954 -16889 -13037 -12967 -18267 -7563 -5191 -6428 -8562 -12242 -18247 -16393 -13579 -14148 -15043
6329 -15043 -14625 -18050 -15085 -12663 -13401 -15990 -17651 -17093 -16648 -12538 -7129 -5798 -4712 -2542 -2653 1843
6313 1843 -1768 -237 -6388 -6074 -7607 -9868 -14202 -12723 -7693 -6706 -3554 -10750 -15001 -18127 -12863
6298 -12863 -8540 -13200 -18208 -14798 -9614 -9937 -8863 -17050 -14345 -11713 -8663 -8916 -13925 -10766 -10675 -3837
6282 -3837 3256 -2205 -8038 -6467 -4616 187 -101 1565 5490 1846 -4876 -4333 -8642 -9510 -8004 -6747
6266 -6747 -9179 -11223 -3721 -3024 -9668 -8387 -4097 -5537 -1854 -6472 -9674 -7836 -11823 -15329 -15101
6251 -15101 -10826 -8298 -9652 -18651 -18654 -19505 -17890 -13779 -13657 -19812 -16735 -8948 -4765 -6417 -1983 -3327
6235 -3327 -7765 -11454 -6477 -5700 -12930 -15679 -14244 -18780 -17285 -18399 -18521 -10793 -13797 -15493 -15071 -15702
6219 -15702 -17860 -26378 -30075 -25162 -18512 -11211 -9117 -7687 -9760 -9483 -2046 5777 5309 2505 -7059
6204 -7059 -12203 -13400 -10001 -8377 -5771 -10118 -16065 -21009 -19111 -11827 -8794 -13233 -13713 -17896 -12905
6189 -12905 -8704 -6330 -8288 -10215 -14489 -14781 -12969 -11608 -8391 -10991 -11923 -6862 -4251 -6511 -13744
6174 -13744 -15119 -13212 -8998 -13490 -22306 -19459 -17154 -17131 -19367 -18558 -10519 -3555 -4563 -11039 -11013 -11546
6158 -11546 -8729 -11151 -15295 -13673 -9462 -9076 -8992 -5492 -6743 -5799 -10881 -20646 -19896 -16133 -14774 -13519
6142 -13519 -9099 -10030 -5298 -4683 -7879 -8199 -6223 -11850 -10809 -9744 -4178 -4021 -5018 -10463 -17373 -23702
6126 -23702 -21324 -16285 -10090 -6195 -4214 -3510 -8385 -9012 -12808 -7205 -10014 -11298 -14062 -15502 -11137
6111 -11137 -4170 -2322 -9028 -18138 -23780 -22174 -15825 -8804 -9963 -8517 -2116 -237 -6520 -14853 -10782
6096 -10782 -11816 -17896 -22912 -16987 -13191 -10026 -7270 -8386 -9806 -4197 -3309 -8649 -12060 -5319 -6645
6081 -6645 -5454 -962 -11155 -9599 -9373 -12404 -8394 -12585 -8419 -6939 -7687 -2279 -462 -86 -8577
6066 -8577 -16428 -18702 -14980 -4098 -5243 -12020 -10653 -6675 -4227 -990 -9105 -13623 -11839 -12024 -9436
6051 -9436 -7445 -9097 -6822 -4622 -1879 -8930 -12786 -15458 -11915 -5554 -10034 -11643 -5111 -5638 -13773
6036 -13773 -17989 -16011 -6789 -5258 -7753 -11348 -9702 -8821 -592 -1173 -6916 -7118 -4453 -7587 -7940 -7299
6020 -7299 -3968 -1051 -2860 -12770 -19821 -18987 -13923 -9441 -13087 -14063 -11966 -13798 -16076 -21126 -22466
6005 -22466 -17992 -21656 -22598 -29380 -25475 -24459 -20255 -14778 -16184 -14385 -14898 -17358 -9011 -4597 -2572
5990 -2572 -4515 -8501 -13072 -9962 -4382 -5930 -3868 -3827 -3326 -8316 -10590 -14331 -13725 -9942 -13052 -12590
5974 -12590 -11057 -12720 -16452 -20219 -15982 -15752 -10779 -6429 -9965 -14333 -5057 -5208 -10110 -15178 -12522
5959 -12522 -19337 -17236 -4006 -1068 -3619 -9016 -14384 -14316 -15110 -15143 -10367 -8330 -9404 -7945 -3982 -1558
5943 -1558 -2829 -1609 -5418 -6291 -4575 -3349 -12229 -15660 -15212 -8875 -3386 -6976 -5187 -12565 -14156
5928 -14156 -5961 -4675 -5210 -2694 -4470 -5621 -3654 -1780 -8811 -13588 -11833 -10639 -12397 -11254 -12766
5913 -12766 -17001 -20732 -22743 -18150 -14987 -9495 -5309 -5962 -8664 -6552 -6688 -8788 -10086 -7302 -4760
5898 -4760 -6743 -9173 -7732 -10118 -10759 -10858 -12830 -12966 -13761 -14191 -10237 -9350 -12323 -15312 -16982 -21692 -19169
5881 -19169 -9856 -6612 -7655 -8522 -8373 -10011 -8484 -10328 -8783 -10668 -10128 -7363 -7014 -8227 -8933 -17006
5865 -17006 -15990 -14503 -11892 -7640 -9426 -7489 -8009 -9821 -10173 -4495 -6031 -11450 -15445 -4701 -7419
5850 -7419 -12487 -7979 -6607 -10709 -10998 -6332 -9849 -12438 -11456 -7693 -11949 -12495 -8720 -8644 -10108 -7812
5834 -7812 -5689 -5966 -10900 -13659 -19225 -18036 -21847 -23815 -21748 -12440 -8684 -8306 -3816 -3359 -6698 -11138
5818 -11138 -10293 -9390 -12721 -15474 -12168 -1135 531 -318 -2245 -2158 -418 -2790 -6231 -4650 -8903 -16478
5802 -16478 -16659 -18183 -14255 -10274 -10170 -12361 -14013 -15101 -11338 -11751 -11348 -13539 -14751 -4855 -987 -1752
5786 -1752 -1270 -2087 -4844 -5197 -12240 -12128 -13345 -9220 -5606 -5738 -5566 -6851 -10847 -11307 -8067 -7440 -7423
5769 -7423 -3622 -4280 -8766 -12758 -11547 -8337 -7223 -11817 -13676 -15185 -11442 -11327 -7363 -4748 -7425
5754 -7425 -9037 -9190 -6418 915 3460 -782 660 -141 -128 6569 -72 -3370 -4709 -2311 -6576 -12102
5738 -12102 -13226 -9012 -5119 -9442 -15322 -16465 -16204 -17917 -13034 -1431 -8277 -14730 -9516 -5773 -10296
5723 -10296 -7799 -3211 -2440 -5647 -6787 -4998 -6398 -3476 -912 3042 3377 5958 1530 -873 -5134
5708 -5134 -7536 -5140 -4094 -56 5527 6987 3310 -3764 -12691 -13967 -16357 -19892 -13006 -6495 -2862
5693 -2862 -282 330 3028 2143 -3034 -6437 -7156 -6133 -7603 -12073 -14024 -10272 -7371 -14658 -13163 -7735
5677 -7735 -9464 -9669 -9613 -10927 -5384 -3315 -6677 -7426 -5099 -8262 -13518 -12923 -3954 2195 707 -3063
5661 -3063 -1017 -1719 -7666 -11877 -12770 -15755 -16770 -10202 -7968 -7474 -13477 -16569 -15651 -19036 -23838 -29057
5645 -29057 -27281 -21523 -21445 -19247 -12600 -8713 -11945 -14807 -8482 -379 728 -2080 -5230 -8812 -6586
5630 -6586 -10045 -6531 -1601 -4500 -11541 -12693 -9022 -12616 -17870 -17250 -13793 -14556 -16094 -23929 -17262
5615 -17262 -15155 -9898 -1504 -998 -5412 -1041 459 1632 -1779 -7392 -6235 -3685 -3079 -173 -1253
5600 -1253 -3482 -6727 -8838 -13379 -14304 -7930 -5662 -13241 -18861 -21066 -14000 -11797 -7474 -729 -2487
5585 -2487 -7175 -12388 -11873 -7275 -4112 -627 -296 -4923 -5702 -11355 -9317 -10980 -11966 -9947 -7830 -12207
5569 -12207 -7895 -9734 -13485 -6858 -2431 -4054 -6688 -10426 -8624 -2290 1172 2809 -3660 -2875 -1420
5554 -1420 -2842 -3377 -1782 4003 2127 -4679 -2784 229 -161 -3048 220 3579 2483 -2174 -3603
5539 -3603 1368 1733 -3227 -2347 -1728 -2811 -6220 -10482 -10037 -10485 -9831 -12106 -6587 -7702 -9060 -10610
5523 -10610 -14705 -13587 -8448 -4851 -6987 -1865 -2813 -5882 -3283 -3648 -5940 -5294 -10888 -18565 -22984
5508 -22984 -20163 -16722 -13960 -15644 -17460 -12181 -6699 -5528 -6596 -13226 -12671 -7364 -4358 -3856 -5507
5493 -5507 -9978 -9663 -9484 -4797 -3151 -5482 -11854 -10066 -3703 -503 3251 5901 6901 -2779 -6796
5478 -6796 -8272 -7031 -4447 -5099 -3175 3266 241 -9555 -11556 -4919 -4001 -5472 -1970 6302 1979
5463 1979 -10826 -10621 -9870 -11396 -14883 -22235 -22773 -16015 -8901 -8319 -14254 -20187 -18934 -18470 -19808 -20415
5447 -20415 -18034 -16933 -19600 -16478 -15648 -21807 -12205 -11473 -7190 -633 2091 3971 847 965 5876
5432 5876 6869 1211 -3015 -1916 44 -5879 -7243 -4826 -4441 -9832 -8060 -708 257 -12985 -14906
5417 -14906 -12233 -11468 -9282 -5602 -6547 -11813 -11808 -7433 -4298 3408 3720 -4447 -172 6033 3906 4690
5401 4690 -1066 -7501 -8960 -12924 -12185 -14252 -15412 -17246 -14082 -15103 -5529 1026 -4333 -12526 -8129
5386 -8129 2386 -2906 -7469 -7671 -4882 -6943 -8506 -11752 -13865 -10012 -6341 -10945 -8649 -5595 -6933
5371 -6933 -10668 -11509 -6183 -9466 -15723 -19863 -13938 -5854 -3244 -1335 -10568 -11578 -8757 -6537 -5919
5356 -5919 -6844 -6604 -5643 -7407 -11702 -8152 -249 -1662 -9788 -18693 -17209 -11296 -9051 -8768 -7355 -6094
5340 -6094 -1899 -1449 1055 -3580 -6758 -8396 -12375 -16085 -10896 -6204 -7698 -6885 -9750 -16781 -13817
5325 -13817 -16903 -12348 -13899 -11488 -9407 -5198 -17 -4517 -15586 -16507 -5904 -1519 -9212 -9416 -6188
5310 -6188 -6144 -12014 -15197 -18092 -21413 -19389 -18190 -14441 -17270 -22463 -19235 -15009 -11401 -13135 -13430 -9109
5294 -9109 -5333 -4783 -5326 -7531 -11929 -13558 -7200 -3544 -5150 -9169 -11775 -9861 -9415 -8543 -12115 -7255
5278 -7255 -3012 -427 198 -5016 -9144 -12341 -13016 -10056 -2723 1085 -6303 -6393 -6054 -11257 -16770 -15658
5262 -15658 -9358 -3769 3000 1844 3021 7948 8364 1528 1118 3902 676 203 4491 4672 -1212 -806
5246 -806 2264 2112 -2261 -5935 -7765 -6557 -2250 -2416 -5634 1656 1262 -2990 -7895 1326 8068 4118
5230 4118 -778 -3664 -7534 -4071 17 1164 -1203 3345 -3338 -3663 -10565 -10249 -9784 -11028 -6799 325
5214 325 -2658 -2431 1164 -902 -5236 -7212 -9241 -16913 -19762 -14963 -15949 -24265 -23239 -25238 -22471 -20599
5198 -20599 -16154 -11339 -14329 -17798 -8812 -5610 -10091 -7505 1319 -5579 -16174 -17886 -10906 -4288
5184 -4288 -56 -1380 -6064 -6089 -6132 -3115 -1459 -3355 -5816 -12279 -10616 -7033 -6932 -4767 -5731 -10696
5168 -10696 -15784 -10191 -5790 -90 3785 -4667 -9639 -8739 -11728 -13251 -9905 -3983 -10353 -9962 -7568
5153 -7568 -5884 -7909 -12576 -14045 -17280 -12891 -10655 -13113 -13059 -14223 -14364 -13326 -5804 -7514 -15084 -12027
5137 -12027 -4841 -2548 -3907 -3885 4515 4851 2876 752 1043 -2808 -1295 -4551 -15920 -23921 -15643
5122 -15643 -8138 -4650 -7237 -8027 -6845 -2878 -1401 -3482 65 1609 292 -2910 -9790 -12491 -7035
5107 -7035 -2444 -7457 -13715 -3691 -3565 -787 -4954 -13445 -15914 -14296 -14867 -17417 -18887 -16294 -15836
5092 -15836 -15648 -16403 -13563 -13223 -9680 -10432 -7841 -1243 -2291 -8523 -14635 -10160 -9813 -13371 -9771 -11022
5076 -11022 -8699 -9356 -11390 -20876 -30245 -26823 -10423 -11153 -13762 -12111 -10614 -8542 -2504 -6532 -7591
5061 -7591 -9101 -10208 -8044 -6772 -9029 -8960 -15556 -12232 -6416 -4744 -6411 -3639 241 -2762 -4256
5046 -4256 -5241 -6032 -9858 -3394 -1328 -157 -1343 202 4109 -585 2340 -211 -4699 -7002 -4896
5031 -4896 -5409 -11333 -10572 -8853 -6287 -6513 -4335 -10148 -7963 -5272 -6095 -5757 -4088 -1402 -739 -3135
5015 -3135 3460 1176 771 771 -2244 -1246 734 1588 -3747 -11595 -14490 -15300 -9888 -2995 -743 2407 3795
4998 3795 838 234 3616 4791 6182 6670 3840 3170 941 130 -2209 -2118 -8954 -12614 -11502 -7293
4982 -7293 -4816 -5923 -4124 -5029 -4758 -5320 -7699 -11845 -12307 -9950 -5166 -3336 -1952 -6936 -6950 -4994
4966 -4994 -2677 -2662 -6015 -6329 -7777 -10680 -12818 -6481 -3712 -6535 -17416 -21442 -23323 -11831 -5673
4951 -5673 -8221 -6080 -1827 -3839 -5809 138 10526 18390 16945 9733 16190 12032 3481 -3212 -6964
4936 -6964 -1313 -6136 -9182 -6846 -6605 -6286 -9679 -5556 -7754 -7827 -5665 -6349 -14940 -16298 -12215 -12518
4920 -12518 -14979 -15793 -15103 -11197 -9940 -11954 -14646 -10860 -3774 -3355 -5242 -9822 -14756 -13585 -6557
4905 -6557 -2126 -6057 -5672 -2320 -2818 -4973 -1824 2734 316 -3628 -4182 -10254 -15343 -20999 -16518 -9227
4889 -9227 -5801 -4244 -8461 -6134 -2470 -5353 -7382 -3403 1217 8967 7597 2265 -611 -2523 -3676
4874 -3676 -4797 -4515 -8151 -9586 -6041 1935 7121 7726 61 -5420 -4655 -834 -754 -3006 -2522 148
4858 148 -3751 -2722 -9781 -11614 -15461 -11285 -8307 -9905 -7814 -3294 -1779 235 3284 -1058 -11789
4843 -11789 -5582 502 2454 2601 -2956 -10094 -4336 467 -2149 -9771 -9347 -7451 -9950 -6686 -4157
4828 -4157 -5561 -9095 -3410 -874 -2117 -7714 -11061 -8419 -4948 -2650 -6967 -11659 -18797 -12606 -8583
4813 -8583 -1971 -1751 -8899 -8903 -411 3733 -3452 -3526 5157 1220 -1838 977 -7049 -14640 -15857 -15429 -16015
4796 -16015 -15770 -12567 -9443 -10532 -11217 -16071 -13365 -8122 -13813 -17513 -14848 -9813 -8634 -13585 -13294
4781 -13294 -11001 -11783 -3603 -1916 -6991 -13834 -10870 -9438 -10521 -9442 -6714 -8833 -10120 -7848 -10693
4766 -10693 -8582 -3611 6750 6055 3454 353 -7060 -8978 -6641 -7731 -774 1882 557 -5 6532
4751 6532 9885 6958 7839 2404 13612 20547 10897 2432 -4293 -7090 -4236 -3245 -216 4261 -2133
4736 -2133 -6957 -361 3741 5019 664 -5587 3952 3527 1883 -1118 -7229 -12604 -8284 -2755 -6881
4721 -6881 -5186 -8900 -9592 -5461 -1002 -3468 -5773 -5067 -13489 -14194 -8308 676 -2544 -8106 -15291 -14922
4705 -14922 -9297 -10190 -9592 -9922 -8706 -7633 -6805 -7298 -12129 -7385 -5751 -3754 -3748 -8425 -9992 -5613 -6776
4688 -6776 -5342 13 4264 4341 2011 -3239 -4010 -4805 -376 2514 -1222 4762 5861 -2191 -9077 -15162
4672 -15162 -10199 -1641 -208 -1491 -8710 -12544 -9611 -14786 -19815 -14562 -9921 -10994 -12322 -15961 -16218
4657 -16218 -13865 -12933 -8380 -8806 -6152 -5295 -8315 -3516 -5473 -5292 -4714 -5560 852 3584 6425 -820
4641 -820 -8279 -9481 -8841 -13807 -19664 -21722 -11814 -8499 -8485 -11300 -12318 -11763 -8182 -13398 -18692 -14978
4625 -14978 -10510 -14300 -14210 -6861 -4984 -2876 567 -7014 -8868 -2805 5491 6501 7329 5723 -3148
4610 -3148 -1852 -4860 -12369 -19291 -14366 -12278 -8782 -2742 -9155 -9093 -3991 -4087 -7584 -6046 -9613 -9766
4594 -9766 -10946 -12713 -10918 -10315 -7767 -6846 -1419 -5128 -10180 -12631 -11024 -6335 -8930 -8756 -5242 -6820
4578 -6820 -14282 -16926 -11422 -3896 -3285 -7714 -11286 -11488 -12548 -18828 -22195 -15655 -9692 -5692 -3425
4563 -3425 -5796 -4656 -3607 -3541 -5847 -10799 -5457 -7346 -6548 -7524 -13825 -19432 -15468 -10109 -4755 -3551
4547 -3551 -9259 -12272 -12029 -15650 -16691 -15060 -7178 -3736 -1957 -8100 -12163 -10724 -5093 -2946 -4115
4532 -4115 -4959 -7320 -5189 -4789 -7162 -3454 -9057 -10935 -10277 -10287 -4590 -4051 -1258 3104 3844 6030 3073
4515 3073 6217 -567 -6092 -3935 -1002 -241 -4590 -8625 -7888 -6122 -6677 -11790 -14739 -17019 -21963 -12916
4499 -12916 -5359 -5723 -2344 -4435 -4321 -3213 -4521 -6526 -8070 -9810 -11806 -10813 -9118 -11560 -10826 -9376
4483 -9376 -6540 -4194 -2901 -4101 -10047 -9059 3658 6325 9598 12717 5430 -3357 -1567 -5825 -14667
4468 -14667 -11931 -9030 -13154 -10848 -3347 -1558 -1439 -915 708 -7240 -13425 -9109 -5575 -4469 -8253
4453 -8253 -8090 -8328 -4943 -2672 -7239 -15045 -18103 -13296 -10315 -13668 -13844 -13844 -10510 -12366 -5062 -4751 -9714
4436 -9714 -11073 -12573 -9378 -2285 510 428 8490 10455 277 -3842 3471 2496 1550 1178 -5046 -7206
4420 -7206 -6207 -6765 -4529 -1099 1113 767 -4795 -5699 -1587 5668 12870 5593 7509 8234 3668 2675
4404 2675 -3041 -6990 -3464 -7403 -12308 -16934 -19846 -17562 -14605 -12694 -11441 -7368 -8241 -8679 -5028
4389 -5028 -1564 348 -1405 -906 -147 1077 2532 -1249 -73 4305 3030 -297 -4978 -6498 -2275
4374 -2275 -1592 -3899 -11057 -16981 -5613 -1661 -13536 -20375 -12990 -4128 97 362 -808 3186 743
4359 743 -3000 -5591 -1267 2057 2328 7911 3098 2886 1520 -10924 -15017 -12643 -13303 -12364 -10832 -13531
4343 -13531 -11268 -9635 -8124 -7777 -7806 -9365 -11615 -4387 -5075 -11592 -8578 -1905 -2316 -5345 -3589 -3870
4327 -3870 -9514 -4297 -7534 -8623 -10879 -12257 -13018 -11887 -11377 -14675 -3075 5295 5307 8818 13114 9866
4311 9866 -1002 -9246 -3027 1282 830 -4009 -2990 1896 7389 4085 -4703 -6100 -1182 3534 5698
4296 5698 -388 -1397 2560 -146 -4475 -5251 -11608 -8874 -8382 -13803 -13312 -16779 -12035 -10954 -11343 -10745
4280 -10745 -10017 -7671 -9089 -6666 -2960 -3840 -558 1958 -75 -547 -1429 -2989 -1301 -2944 -4483 -6417
4264 -6417 -8835 -5538 -6806 -7732 -6362 -2163 -1779 -7311 -8905 -5729 -2768 3117 5405 2672 1557
4249 1557 -252 -3248 -3467 -4397 -4793 -8960 -13498 -13600 -9797 -8966 -9846 -4896 -6060 -6955 -10421 -13992 -11822
4232 -11822 -5609 -7670 -14321 -20773 -22553 -19550 -17286 -8216 -5047 61 5315 519 -10707 -7192
4218 -7192 1409 6493 126 -3159 -4156 -8338 -7934 -4938 -7101 -1715 -4079 -4517 -634 -4663 1895 906
4202 906 -5068 -8443 -7330 -10508 -11900 -11872 -2902 3017 -1382 -4999 -1106 -1554 -5918 -6638 -5249 -5411
4186 -5411 -4139 -2026 -774 -4488 -9441 -12425 -13433 -12745 -14083 -16473 -14599 -8869 -7384 -10864 -15957
4171 -15957 -13736 -11691 -10303 -6272 -5760 -7579 -3574 -862 -564 -2910 -4411 -11308 -15066 -15898 -13866
4156 -13866 -12366 -9596 -2904 3927 9172 9775 7066 922 -9444 -14842 -12644 -10626 -12411 -9282 -10617
4141 -10617 -9678 -9186 -1789 -3629 2792 1286 -3516 -5938 -7311 -11207 -12745 -6239 -7364 -10439 -5509
4126 -5509 -3198 -4803 -6025 -2821 2384 -305 -1704 -8956 -11037 313 207 -10895 -11371 -8797 -3258
4111 -3258 -8759 -6475 2874 4088 -3151 -6281 -7546 -1332 1645 1054 2684 2223 -2407 -507 1956
4096 1956 -6054 -11705 -10808 -5243 -5049 -6736 -611 -1333 2398 7861 12511 13536 7058 2042 386 -923
4080 -923 -618 2937 1775 3607 2454 -7209 -9191 -7752 -8655 -12348 -5131 2895 6058 -5749 -9062
4065 -9062 -7106 -15445 -15777 -15957 -16642 -10532 -5483 -1867 -5125 -6357 -5941 -6869 -8641 -12993 -13443 -7326
4049 -7326 1156 -540 -1229 1977 5050 4645 1266 -812 1341 4439 6864 4399 2927 -10 171 1280
4033 1280 -1927 -5170 -3269 3723 -68 -10947 -10196 -7212 -8025 -10095 -10390 -9407 -4767 1320 6619 4550
4017 4550 746 -2795 -3512 -4832 -1705 -1114 -2598 -5281 -2825 806 2211 5003 5364 1917 1882 1775
4001 1775 -3879 -4711 -1926 2653 -4415 -8560 -1151 -2977 -7606 -7120 -6504 -6113 -3100 -4274 -5549 -1247
3985 -1247 149 -8310 -10275 -11132 -12057 -4086 -6037 -6376 -3362 -606 156 -2337 -1620 4624 2727 1982
3969 1982 -635 -3745 -10551 -9764 -10547 -11488 -10867 -8503 -6902 -10414 -12704 -4833 -1687 -4567 -4638 -4999 -6698
3952 -6698 -8514 -6281 -3279 -6271 -6919 -4025 2877 235 758 -259 -8034 -9701 -7578 -9728 -12367
3937 -12367 -9059 -11428 -14495 -15287 -16118 -12437 -13213 -5316 5494 9708 8489 5740 348 -3215 2445
3922 2445 -2846 -9069 -8182 -3796 -5360 -7289 -6015 -1867 -1633 -4956 -5528 -9904 -8953 -1753 2740 -2904
3906 -2904 -8332 -2165 1771 -2069 -2181 150 3038 -5710 -11323 -10599 -7256 820 -5004 -10833 -2602
3891 -2602 2343 4182 3021 -1758 179 -894 -2613 -1105 -4481 -5042 -4344 -7920 -2562 -787 -1598 -7134
3875 -7134 -8534 -3397 -3071 -2469 5717 7001 4495 -3422 -10154 -2231 408 4187 -2973 123 -2836
3860 -2836 -10848 -5937 -463 -6140 -5234 -648 -1738 -5410 -5301 -3395 -4850 -3668 -5177 -13200 -17029
3845 -17029 -11396 -12119 -5875 -3540 -9511 -5825 337 1838 2958 3723 8942 5996 4734 8081 8301
3830 8301 3452 -1320 -9170 -13911 -12799 -6786 -3729 -7048 -5920 -1999 -5674 -11992 -3435 -121 2195
3815 2195 659 3738 5039 2799 1450 -1272 -5082 -7533 -10834 -14687 -12934 -5207 -402 7119 6920
3800 6920 4667 3681 256 4991 7851 6173 4136 -3423 -947 -3347 -5339 -2439 4808 8837 13271
3785 13271 4711 -5131 -3344 -3295 -3319 -6934 -5004 -2011 -3992 -9980 -11186 -8308 -4016 -2144 -3465 -6316
3769 -6316 -5865 -4097 -4159 -4323 -2466 -9391 -11455 -11950 -16823 -9783 -3558 -8024 -12692 -8330 -3376 -3935
3753 -3935 -5098 -4251 -1313 -2679 -5938 -3959 -3123 -4794 -2333 435 -1259 2048 3597 5140 5378 -1648
3737 -1648 -11006 -16249 -15273 -15125 -7679 -8641 -9351 -9666 -2649 1311 4775 2344 1984 1571 -609 1872 -5864
3720 -5864 -5411 -2563 -13178 -15109 -14017 -9661 -7294 -6789 -8918 -7638 -1429 37 -2837 1562 8067
3705 8067 11389 14106 1012 -11135 -9873 -7393 -6207 -6686 -3935 -3951 -6029 -9079 -10233 -7056 -4463
3690 -4463 577 8625 11777 4014 -2271 -391 797 3764 149 3836 2976 -4831 -15049 -11103 -4320
3675 -4320 -3175 1145 7214 14287 9974 7326 8630 5729 3560 2575 4391 4049 -3010 -4367 -2620
3660 -2620 -4724 -5434 -8060 -5003 -9384 -14164 -9048 -9251 -4268 -3660 -5859 -5494 -7438 -13911 -13346 -5551
3644 -5551 -6518 -10580 -7413 -8781 -10991 -6673 -1334 2178 -2951 -5610 -7854 -9748 -3707 7476 5887
3629 5887 6057 8677 6585 -432 -2890 -4282 -6972 -6161 -4042 -2356 -7785 -7775 -3003 -914 -373 -5793
3613 -5793 -3730 -6698 -9285 -10041 -4679 388 2713 1135 1107 -3313 794 -1244 1966 -2399 -4804 424
3597 424 -1621 -4852 -13795 -17802 -12357 -11108 -10995 -7512 -368 -4861 -5964 -3699 -1651 -4465 -7884
3582 -7884 -4093 271 2058 937 -1965 -9006 -8189 -9114 -2973 102 5670 977 -11550 -14913 -17095
3567 -17095 -17468 -13237 -4432 -5312 -10052 -9927 -6352 -3760 -6204 -1349 -3319 -10715 -12713 -10230 -8798
3552 -8798 -8730 -10210 -8572 -9848 -13993 -15071 -8585 -6714 -4405 -4888 -6479 -11794 -11780 -12150 -8769 -429
3536 -429 -3113 -3002 97 -1313 1462 575 -8255 -10222 -3380 -672 -2439 -4266 -1857 -4251 -4071 -7958
3520 -7958 -7213 -56 -589 -8514 -13237 -12486 -9221 -2758 -1831 -753 2062 -603 -2120 -3394 -2671 -6187
3504 -6187 -6864 -4858 -7176 -7296 -2639 -2226 -5720 -8248 -6418 -11627 -12799 -7451 -1100 -6574 -11182 -8535
3488 -8535 -6024 -8577 -6489 -5409 -9601 -4628 -2998 -3729 -2125 4632 4620 5661 9790 8802 10111 8174
3472 8174 7953 2998 -2140 -3871 -2190 -3789 -6729 -3022 3447 4508 -597 3047 -2078 -3285 -1488
3457 -1488 143 -11020 -13153 -7588 421 -3618 -9427 -15959 -14587 -13965 -9538 -5115 -2310 1267 -361
3442 -361 -4892 -2458 -1248 -7396 -5305 -6748 -9857 -9800 -5592 -2914 -9521 -8299 -8463 -5821 -478 2777
3426 2777 58 5121 8392 10546 1308 -5110 -7118 -3651 -4347 -4131 -5597 -6612 -4019 -5511 -6000 -8386
3410 -8386 -11345 -9491 -9982 -10820 -8478 -6794 -10693 -11476 -9426 -4810 -105 -5063 -8251 -6742 -7966 -12524
3394 -12524 -15276 -15244 -17703 -18146 -17448 -18317 -15112 -10991 -4194 -3624 -6389 -3022 -1457 -1844 -4475 -11800
3378 -11800 -9125 -5915 1537 3050 2664 83 -2677 -4864 -4623 -8723 -9237 -8542 -5602 -3566 -5661 -4320
3362 -4320 -2643 -2613 -8552 -12056 -6256 -4980 -5640 -2801 1879 393 4600 610 -5763 -9049 -4809 5732
3346 5732 8088 4981 -397 -8807 -7327 -3360 -1044 -1865 -1467 -4405 -4014 -2337 -323 -2663 -1182 -25
3330 -25 719 -1671 -8320 -12269 -9364 -7591 -4629 -3500 -4216 -6113 -7531 -6352 -7714 -6376 -4908 -1933
3314 -1933 2912 -490 -4870 -2694 -1322 -4462 97 -3754 -5586 -1780 3182 9375 8172 520 -1555
3299 -1555 2891 5401 5216 4214 8084 13005 4853 372 1479 -267 -4563 -3117 -6573 -12735 -12829 -11480
3283 -11480 -4800 -4831 -8219 -5183 -3536 -2676 -5036 -10495 -7443 -5461 -8936 -13825 -10903 -4390 -4450 -4601
3267 -4601 -486 -3229 -14026 -18431 -10771 1573 7118 9043 2672 -3765 -9178 -10330 -5606 -505
3253 -505 -4118 -2297 -2277 -3340 3459 1469 573 -10110 -16866 -12606 -845 4547 7463 6838 -2395 -7748
3237 -7748 -8882 -5051 4 2892 -3767 -8178 -8913 -12698 -10072 -7884 -8089 -8316 -7160 -7493 -11223 -15620
3221 -15620 -15981 -9299 -5178 318 5173 4247 7443 12088 7542 9314 12262 -1096 -9248 -10001 -9999 -8026
3205 -8026 -10522 -16823 -24114 -23034 -9476 1473 1227 1772 -491 -7071 -14444 -6266 -1676 -3836 -10225
3190 -10225 -8695 -8098 -9207 -11921 -12089 -11149 -5666 -3517 110 843 5700 10364 11582 8327 1940 -8209
3174 -8209 -13371 -11583 -6719 3340 2219 -344 -3953 2039 6171 2124 -1372 -409 -53 -5450 -13007
3159 -13007 -6731 -2593 -5092 -11664 -11154 -6255 -4111 593 537 -2715 -4787 -3951 -3248 -6712 -9214 -2800
3143 -2800 -2500 -3090 -4190 -5943 -1652 3848 6436 8886 10825 11259 16470 14990 10019 5907 10979 9424
3127 9424 4042 1088 -1990 -259 2660 1500 3211 -2991 -11192 -3363 8969 8892 3564 -2853 -4094
3112 -4094 -3974 3330 9155 14492 9803 2356 -1499 -2320 -3010 4408 2532 4734 5378 767 -4345 -7075
3096 -7075 -4091 911 753 2829 1208 -1539 -599 -3751 -7312 -3455 1353 2358 3224 1829 -843 -6689
3080 -6689 -10640 -8360 -9993 -14418 -11354 -10453 -2185 116 1357 5290 5108 5736 7155 1663 -2459 246
3064 246 713 4712 8107 1493 -3276 4544 7505 6943 4136 -1949 -1500 366 7035 10150 5690 1774
3048 1774 -1787 -2255 -5041 -5379 -9591 -9345 -6915 -1312 -687 5926 7729 5198 -1550 -5022 -7119 -9721
3032 -9721 499 1356 341 -3603 -1895 -426 -4859 -4680 -4012 -2749 5304 2548 -1247 1358 -2428
3017 -2428 -2204 -381 -538 880 -681 635 9167 11955 7768 -1140 -9545 -16182 -14753 -5929 -3475
3002 -3475 -7347 -11108 -278 3685 8313 7186 4281 7556 11457 6096 -358 -997 4713 3063 4629
2987 4629 1324 977 -2774 -9195 -8152 -7324 -5343 -2953 -2775 -4795 -6998 -7707 -5530 -4276 -4687 -3634
2971 -3634 2905 5167 2447 2277 -2693 -7199 -6777 -8607 -6469 -4174 -436 -876 -1437 -2950 2096 818
2955 818 -3529 -8743 -14482 -10018 -5972 -5075 -5395 -3613 358 2311 -3715 -10259 -12230 -9009 -7718 -746
2939 -746 1446 -3398 -1290 -1300 620 5800 4063 3022 3283 4537 -134 -5212 -6846 -2537 2315 1611
2923 1611 3407 2557 -2500 -2030 -1961 -225 1184 509 -2893 1038 -3228 -835 1852 6028 7668 12968
2907 12968 11298 6563 -401 467 -5190 -8539 -1332 7031 8141 14 -2954 3915 429 -4770 800
2892 800 344 -2815 -3309 -3774 2776 2946 3317 2386 -4080 -4589 1284 2705 -4982 -6918 -8326 -7946 -974
2875 -974 4016 3987 6825 7452 3915 912 3763 6 -4921 -3501 244 -6069 -8395 -13097 -5755 -5183
2859 -5183 -2869 -5308 -5143 -8043 -7529 -2339 -2395 4652 1381 417 -1816 1940 -4332 1728 3955 -3098
2843 -3098 -2719 3792 6188 9575 6478 3346 2133 -1707 -824 497 6700 7725 4894 -2542 -5749
2828 -5749 -8213 -10391 -12457 -9690 -8272 -2084 4801 4686 -568 1638 3581 13 768 -1060 -4910
2813 -4910 -6707 -9389 -6213 -7813 -8129 -902 4190 5614 1880 1310 4213 2704 -206 -4587 -6406
2798 -6406 -7679 -9729 -5906 -6890 -5828 1398 7550 8513 5582 5680 2891 4193 3621 -1073 -6132 -4834
2782 -4834 -7281 -1790 -2213 -5248 1518 984 -719 -2147 322 2774 1528 -8545 -8908 -6995 -6947 -5878
2766 -5878 3312 5037 4105 8293 772 -3097 -7550 -6674 -3735 -3840 -3981 -4974 -3090 -4277 -7366 -7759
2750 -7759 -4739 1813 3711 -1110 -5544 -4836 2066 -687 -2049 1376 2382 1674 -3198 -4962 -1513
2735 -1513 6668 12530 9444 4711 1796 2705 1262 -6211 -4796 -1256 -2687 -1885 -3336 -2024 -3232
2720 -3232 -10235 -12486 -14082 -11378 -6738 -994 -3557 -4619 -9505 -8351 -3709 -199 -478 -4631 -6826
2705 -6826 -8994 -5236 -3232 -8115 -14230 -15857 -6923 1518 3459 2074 -2700 -1294 -678 -459 4637
2690 4637 7604 10413 5534 2675 -3720 -11583 -12470 -2995 1558 -1679 -1765 -1035 -7057 -9412 -1713 1947
2674 1947 1652 -5023 -3730 1645 7122 2791 -5749 -3898 -124 -2616 -2114 -1349 -8705 -15919 -11978 -4260
2658 -4260 463 -804 5587 8567 6236 3787 6589 2701 -529 372 2183 2719 2263 2670 3378 3687
2642 3687 5042 9354 7070 9100 2966 -728 4569 1842 435 4266 3351 2878 2826 2539 -2107 -8724
2626 -8724 -11213 -1794 225 -1359 -1814 -3259 3766 8146 3092 947 -2006 -6690 -3450 -801 -3463
2611 -3463 -2826 -821 1537 6301 14387 17587 17141 13612 -1602 -9318 -7422 -7014 -3020 939 -2986
2596 -2986 -3606 -301 -1027 2762 8024 132 -2362 4229 12258 3233 -2302 233 1769 7485 7839 1965
2580 1965 -7234 -6322 -4239 -4056 -4260 -4455 -3108 -4059 -8240 -5995 -6463 -39 1697 -1936 -4257 -607
2564 -607 1032 -1281 2843 3419 -2026 326 -761 -3 -1494 -537 5072 7309 -896 -1874 1625 -1839
2548 -1839 -4296 2998 9244 8990 11966 7010 684 561 6280 11624 2901 -5468 -9472 -7966 -9805
2533 -9805 -10913 -3320 278 5470 2740 900 -693 2651 400 925 9616 13564 6428 5468 2880
2518 2880 146 -2788 -3312 1118 3216 3850 3512 4845 1441 2581 3854 -4105 -6621 -2602 -6443 -12480
2502 -12480 -4552 1214 -1106 -5362 -1566 681 104 10737 18256 16964 15494 10374 5977 413 1533
2487 1533 8364 10821 10763 9368 5250 1960 5386 8435 9974 7660 4219 2406 4454 -998 -341 344
2471 344 293 -971 -937 -1795 -1870 44 2347 -2032 -6019 -2502 -856 -38 670 -4218 -4352 -3456 -852 -3245
2453 -3245 -756 317 -6418 -7373 519 5666 2125 -1082 -2787 -5657 -9418 -6153 -3437 -3547 -6221
2438 -6221 -230 1316 568 6143 7344 3827 -2107 341 -4931 -2839 -5579 -12593 -11190 -4513 620
2423 620 1628 3472 3563 5254 4585 2053 -1550 -4396 -6328 -3715 -4078 -3144 -1191 236 -170 161 193
2406 193 -375 -4369 -2062 -7130 -5257 -243 -2883 -6296 2719 -1162 -6595 -10507 -11022 -6178 -6468 -11334
2390 -11334 -5553 -9671 -10947 1255 1949 1622 471 -5762 -4916 -1873 -7240 -10839 -12729 -3616 296
2375 296 -3200 -7184 -9625 -3819 1297 2486 -599 -3250 -6124 -7187 -1054 -6732 -14150 -15389 -15865
2360 -15865 -14471 -8246 -3780 -2178 -5680 -7712 -5277 -7067 -5512 -205 2541 -1746 -3161 -5975 -4806
2345 -4806 -3964 -4651 -3857 -4983 -2053 3015 2589 4682 -1964 -2904 -2606 -1609 3735 7639 4034 -2740 -2108
2328 -2108 887 153 -4652 -1654 -623 189 2468 3606 -3203 -671 5756 8415 7667 5067 2890 1720
2312 1720 -1645 463 2631 2322 -4251 -15939 -19219 -10721 -8223 -7323 -5609 -9329 -5610 -6763 -3714
2297 -3714 -8246 -10773 -1975 4905 7507 3386 4267 3714 2579 -2448 -3642 -3692 -7688 -7015 -4956 -5673
2281 -5673 -5992 -5541 -10666 -10036 -1662 83 -1248 -4875 969 7973 10884 9528 4844 2339 2252 -5818
2265 -5818 -2380 -3553 -4254 -1625 674 -2382 -2635 -6381 -12151 -2806 2867 -1848 -3496 -3830 -3572 -2393
2249 -2393 587 597 -844 -4217 -9045 -11424 -11936 -12835 -8843 -10760 -17346 -15385 -7352 -5223 -10623 -10888
2233 -10888 -2014 -1727 -6699 -4301 3300 5216 1983 -2805 -6697 -4841 -5072 -2978 6211 14470 17020
2218 17020 6165 -6821 -10536 -4056 1920 5273 9355 10073 5533 -94 1949 1099 -2726 5497 8787
2203 8787 7684 10929 9907 3949 3081 4893 3096 6785 10214 6959 7297 5265 -2003 -8157 -6223
2188 -6223 773 3624 1016 176 572 -795 -6685 -5241 -7886 -8372 -3919 -7642 -2993 1422 6187 8931
2172 8931 9392 7660 11825 5420 -3852 -2301 3244 3824 5619 7511 -2264 -6977 -3968 -4281 -2516 271
2156 271 2872 10647 13337 11782 4958 2639 -1571 -4417 -1854 424 1815 3367 3629 2111 -664
2141 -664 2381 8567 15532 15087 11761 16682 17668 9665 3319 5410 12097 16155 8743 8949 9815 11070
2125 11070 16176 21540 16760 8723 4078 4560 -705 55 -2795 2628 7678 9124 7565 6252 6979
2110 6979 6281 4149 3215 658 -4071 -2063 -2358 -5488 -7955 -5295 -2792 -2122 3621 6829 5492 7462
2094 7462 1256 -1413 3119 -631 -1158 2333 965 -2833 -1183 -3947 -11459 -13419 -3308 -3085 -1198
2079 -1198 3166 3758 1239 -6177 -7189 878 -2237 -340 -2970 -4735 -5571 -6065 -9215 -2012 -1742 -6195
2063 -6195 -1993 635 981 2761 552 1575 258 1826 4217 5812 9894 12263 12661 8766 4338
2048 4338 7408 1524 565 6447 7482 6820 11795 6549 1386 2619 950 8 5836 7123 1219 -816
2032 -816 -5007 -1693 -4411 -7541 -7979 -9980 -9849 964 2985 1424 2359 3048 4028 1102 -1417 -7765
2016 -7765 -6465 -4635 -5438 -2788 -404 9380 11023 5865 -1486 -5681 -7335 -9771 -7261 216 6021
2001 6021 9266 1405 -1624 -1500 745 2823 3129 3406 -3814 -2414 1784 1788 -2934 1687 9476 8927 6142
1984 6142 4293 3563 5217 4525 9876 10014 6053 -3753 -2897 -763 -684 4341 11909 4483 277 8880
1968 8880 7406 6040 876 3312 4730 3755 948 3381 3610 -473 -5724 -7045 -6695 -3307 -4620 -4330
1952 -4330 -11135 -16113 -9490 -889 1341 -1268 -5869 -3785 -2429 550 -1407 6404 8119 2553 -2326
1937 -2326 -10325 -18235 -17725 -9804 -5048 2216 -1873 -557 960 4663 6351 8622 13425 14974 8921
1922 8921 6308 7039 5324 -1268 -5709 -10303 -5529 3284 5450 7280 4840 6877 6920 4980 525 416
1906 416 4527 314 3929 9134 13466 14044 15728 10021 2131 -2516 -5896 -2307 2105 6207 534
1891 534 -3747 -2527 -3899 -1949 7522 9157 6435 -932 -1472 1983 3172 6590 -3517 -5843 2640
1876 2640 3386 637 4870 5044 -1174 -3356 3864 9418 1811 1652 5291 11409 7660 2128 2960 637
1860 637 532 5424 8954 7904 3181 1254 2488 5390 -335 -4207 -2228 -175 -4055 -3801 -1687 -6316
1844 -6316 -9951 -10003 -2035 2437 -3195 -4581 3092 9441 13111 19634 23026 18834 10363 9460 8449 4559
1828 4559 1798 2511 5048 4432 422 8811 16516 15967 6010 2833 6738 8937 -352 -3190 -4340 -2226
1812 -2226 -3400 -4436 -8824 -7936 -1786 6740 8443 3941 5338 8041 5481 2715 511 -1789 4267
1797 4267 10459 8002 14633 19645 21767 19593 16088 9562 2494 2310 3446 12749 14543 9301 4061
1782 4061 306 -837 2727 3490 181 -189 1864 2949 365 -338 5038 6788 8161 7428 -1069 -4425
1766 -4425 2190 10240 9244 9190 6597 5386 8297 8188 8687 8219 7397 8486 8582 10688 7189 3490 7873
1749 7873 13653 13350 8642 7020 10288 15664 18014 14789 11055 12206 10928 7766 8149 5630 5689 2134
1733 2134 3621 10013 12148 13943 16093 18840 14320 14908 13721 7990 2555 1731 682 6456 7992
1718 7992 9535 11707 6242 6925 9215 4863 4222 10437 10164 10009 11748 6959 2129 -3443 -5248 620
1702 620 690 -1867 3342 6254 6325 -1658 -6619 -6230 -2161 -194 4304 4837 2206 2343 4854 10764 -64
1685 -64 -8229 -7618 -4178 -2984 -3507 -4013 -4462 1751 1705 -3296 2570 7926 3497 5389 6048 2864 -391
1668 -391 -1175 -2285 -1300 -1980 -6312 -9740 -6996 429 9393 6625 9362 9416 7940 7827 4082 7519 10846
1651 10846 9640 8835 5374 380 -4613 2595 3264 2658 3564 3728 447 4312 3996 142 5815 7794
1635 7794 8284 9435 9496 7551 3806 4020 6839 6644 8784 7933 8482 8590 4410 6478 9295 13515 13370
1618 13370 8043 6697 827 -2227 -2156 -3627 -4620 -7863 -9242 -1467 -549 -2023 4051 13833 20048 22017
1602 22017 10567 6389 7868 1901 4381 7202 9851 12558 13739 14702 10584 11478 11666 18201 18378
1587 18378 16390 11806 2731 1099 4751 11135 11704 8060 3132 5839 16806 21253 22687 17033 8610
1572 8610 -3196 -5241 -2771 -2490 6366 5547 -47 -3828 -2467 -2755 -2527 -1837 -3680 -6836 -1345 6899
1556 6899 -241 -5193 4872 4325 650 2276 4211 2924 1099 836 1492 1432 -1112 -2039 1280 4165
1540 4165 3462 -1376 -2209 5103 4672 2904 7623 9365 9822 7802 7184 15274 10908 5495 3808 6009
1524 6009 9098 8437 7104 3897 6298 11231 10303 14729 12374 6742 4615 -2775 -5457 -5654 1670 11169
1508 11169 14012 7515 6190 831 656 176 5158 8364 6706 6716 8825 7577 1500 -3091 -1757 -52
1492 -52 -1735 3391 2232 5341 4539 6467 9854 7889 3631 7370 11172 14159 12072 1269 1696 12524
1476 12524 21197 15147 10560 9171 10543 1660 3995 10626 16044 14587 8278 10704 13171 10819 16461
1461 16461 20244 18307 21963 18275 11018 15581 17347 13880 10634 6936 10682 6478 -3251 -1203 2455
1446 2455 7197 7727 4669 -2836 3355 9096 2993 -1366 3088 3739 4178 2503 2653 4584 3388 -9197
1430 -9197 -6450 2412 -713 -6183 -7997 -5402 280 10353 10337 6671 10602 14378 13843 7155 597
1415 597 294 1629 5010 -123 -2807 3198 11188 5432 707 5955 10609 5747 3204 226 -1973
1400 -1973 -4106 -6225 -5468 -2516 -222 5782 10099 12284 16700 15351 12380 17642 12804 6861 5675
1385 5675 6848 5968 4927 3466 7298 10421 7219 2108 2646 -3959 -6385 -11218 -12671 -4940 -7595
1370 -7595 -8420 -9661 -838 6024 8167 16239 18403 20998 18259 13209 8160 12939 15791 11254 7283
1355 7283 5414 3764 7334 5166 3918 7877 5049 11587 4238 2230 8482 12009 10717 9650 6273
1340 6273 5865 9859 16097 11202 8774 9073 14724 18665 11743 4080 6535 10233 7628 11897 14070
1325 14070 13195 5759 5270 5569 10788 12807 9650 11432 6180 8345 8410 2955 -1897 2606 -3952 -2035
1309 -2035 5499 7999 6356 198 -1121 3953 6645 5882 9563 16681 18175 19438 10595 8891 15619
1294 15619 20376 16781 11158 7472 5513 6204 3763 5588 4396 10715 8270 -555 -7339 -1187 1358
1279 1358 7705 10025 7539 -122 -1926 -31 -1268 -3583 -3061 -1962 -3769 -3361 -1233 -2055 -4062 1642
1263 1642 8071 5684 -350 4184 10240 4641 2300 3075 13996 17056 11830 3039 6360 13742 16788
1248 16788 20797 17354 13324 7131 -6566 -7047 -4404 -4109 202 388 567 3409 2204 5269 6522
1233 6522 7351 7028 6380 9401 17975 17414 14290 15553 13382 5772 1228 -808 1805 -226 -969 2393
1217 2393 5236 902 -6151 -8167 -2738 1645 2361 4061 1832 237 2261 -3796 -7644 -4195 2494
1202 2494 7343 1591 -2714 2731 12088 15967 16093 12296 3162 2661 8319 11263 12521 10171 10945 10235
1186 10235 3462 3469 5248 3411 3649 10375 10452 5172 5672 5185 6036 4742 2353 9236 12682 13740 14606
1169 14606 6259 7786 12491 5548 4977 1487 2767 6017 4543 2014 10026 6381 -932 1318 11219
1154 11219 12351 7325 1940 1901 5533 6970 9570 13525 10172 891 345 5196 9347 7487 3137
1139 3137 1265 2726 7241 10099 12247 8471 12325 15039 8055 7848 3841 5354 6090 7139 7001 2412
1123 2412 2256 6048 7505 5103 6261 11254 9993 5382 1860 6769 8727 6800 7532 7984 7807 1022
1107 1022 7876 8493 13494 12171 2385 852 -1611 -8127 -4375 -1616 3040 -1658 4687 12466 8059
1092 8059 7491 11051 8203 929 -2757 -1546 1199 2909 2372 2068 9743 11615 15763 14910 12599 11698
1076 11698 12486 16186 10893 9934 10294 13232 15652 12425 15208 14889 12568 11502 10518 9514 11388 9347
1060 9347 8180 4825 4188 6057 4625 7837 10507 10070 12814 12895 12231 9319 4529 2418 8486 10737
1044 10737 10089 13971 14386 8209 10048 18782 14994 12183 11304 7113 5201 3932 8185 8793 8453 6610
1028 6610 7164 3388 -1638 -1556 -1199 -1369 -2634 -29 6075 8668 5735 1072 -4574 800 6108 4793
1012 4793 -2910 -7451 223 4153 4452 5762 7563 11368 14064 14890 11735 7646 5077 412 -1957
997 -1957 2340 5218 2188 1236 2692 9406 11949 15303 11829 3272 107 1236 4478 5117 11272 15457
981 15457 18059 22548 19052 12178 10091 8428 15020 15464 13171 8129 4906 6982 7974 8770 12629 15316
965 15316 17186 16099 13559 14346 13319 11098 6084 7142 9151 16481 17374 17470 11893 1951 3514 4025
949 4025 3105 6381 10116 11015 5210 2985 -2090 -2193 3062 8011 11324 9689 1859 546 2675 -1091
933 -1091 -5219 -6854 -3929 -7504 -5611 -1278 3223 3620 493 4358 5076 7110 8032 11848 14583 13063
917 13063 11529 10216 13816 9862 9427 10514 10965 12525 8757 2372 8368 9997 9391 5890 3480 9427
901 9427 14964 16512 16552 11379 11421 4300 1907 2863 1991 5447 9221 11248 9117 6393 5213 6761 11121
884 11121 11045 9085 6371 9750 14302 13674 8363 4966 2737 5899 5933 1973 -2644 -3674 -7421 -4511
868 -4511 1210 1351 -76 -140 -5131 -4565 7263 12018 13034 11181 11789 13970 15097 11898 10844 8001
852 8001 -2245 -6834 -2610 2856 5016 368 5791 8542 8897 15501 17979 16072 12267 13191 14462
837 14462 12772 13833 10877 12477 14255 16376 12694 7745 3654 3092 4966 2330 -1892 -1369 -4569
822 -4569 -6926 -6093 -1932 -829 1157 3994 3909 3932 5082 5614 6060 12026 17858 9765 7733 17915 23031
805 23031 19409 16659 18687 20536 18840 15053 14560 13204 14790 20604 23924 21573 13813 11022 12737
790 12737 9283 7048 12620 14406 9423 3913 7193 13015 12676 14099 11964 12971 9405 9335 12730 5946
774 5946 475 2405 8059 20296 22348 15162 10590 6877 12784 17205 14504 11974 9448 5900 8086
759 8086 10972 14617 8641 2770 8348 12478 7297 434 1534 5987 5532 3943 4150 2061 3756 6037
743 6037 4328 9935 7538 2051 2918 5191 8870 9420 8672 8922 11116 13192 12612 15906 15212 12424 9061
726 9061 6758 5428 4260 6408 2682 6713 8945 2737 2540 3452 12257 10883 3279 4791 4493 4497 3025
709 3025 8773 9207 9646 8534 11628 15477 18122 22586 18695 16841 11772 6112 11880 9875 8970 17726
693 17726 20894 18542 22939 19915 15949 12457 11661 11389 12803 14343 14321 6507 4691 8018 13034 18101
677 18101 20548 17669 12539 8846 7939 9033 17783 21588 20803 18515 20900 20687 16904 14555 16365 14973
661 14973 16318 16800 13852 13271 10191 14578 16237 15474 12951 3715 833 1067 3962 3780 4139 8089
645 8089 12596 13519 8882 9597 4437 1017 5197 3426 3860 9282 8606 -763 -5121 -811 3076 -814
629 -814 -779 4335 12467 15078 13223 14980 18440 18352 18338 15600 11852 9013 2499 4525 -1122 955 5591
612 5591 9718 6271 -31 1263 7387 15930 22018 27035 23398 17670 11008 3637 5713 12738 16661
597 16661 16192 17202 15729 16226 13153 16354 14254 11396 14741 16546 7893 6034 8467 11500 13931
582 13931 15264 14751 11285 9797 11712 15429 17097 17984 20545 18770 21995 20070 22481 25526 17773
567 17773 13316 9504 9945 11111 11219 11490 11427 10210 12331 15675 11451 11414 9714 7076 6035 4377 8289
550 8289 8144 3190 5190 5387 6862 4330 -3623 -2382 9660 14445 10685 10176 12696 10486 8501 6965
534 6965 11244 11696 7512 2835 5169 13022 13025 18231 13201 5414 7657 11741 5951 4464 3340 5920
518 5920 1906 836 4042 6618 3612 11995 16876 17864 18006 11280 4528 -496 2516 11300 9791 7372
502 7372 19447 23970 19367 13599 14433 13986 18125 23591 20698 13247 6586 8481 13899 18880 18655 16091
486 16091 16072 9831 11464 13382 9906 7190 3641 289 4438 6323 12933 21221 20951 19164 18661 16637
470 16637 14079 12378 15550 19325 16587 19183 17452 17347 20414 18804 23155 28731 24316 12041 11175
455 11175 9394 8053 9989 10025 12246 17352 18047 14495 10135 3360 1790 4628 3231 7829 8719 4201
439 4201 5957 7732 11060 12356 9594 7236 5707 6822 8591 15444 15962 9738 7041 14505 21272
424 21272 21205 18486 13845 12306 8607 7473 5052 6404 5992 14048 21530 14938 12647 10684 6032 5329
408 5329 7534 10937 13203 13355 15958 16183 15666 14287 17003 9269 1728 188 2191 7345 4461 2412
392 2412 4942 8211 11800 11953 17614 19916 19981 17566 14221 10648 7146 7465 5927 10079 13380 5873
376 5873 5098 13083 16036 6823 2910 7910 8778 3724 5984 9542 10915 8496 4362 4783 9315 13972
360 13972 16928 18985 17279 17112 9847 8976 13130 6325 118 3835 5946 4218 4080 5385 8958 9749
344 9749 13542 17434 14777 13108 11576 8264 5413 683 2217 6506 7582 11083 14868 10123 6499
329 6499 579 1116 6917 9016 9958 9049 12788 14343 21351 21046 20299 17408 19175 14139 5755 -527
313 -527 -610 6300 11224 9398 7970 2831 9088 16377 18631 19351 14016 10287 12805 16395 15303 18917
297 18917 20187 16623 19039 19938 20333 15919 9387 13235 21451 25994 19629 16254 17889 15029 10166
282 10166 453 1109 10551 18963 24338 23545 26241 22175 18400 10819 3274 967 977 7248 15840 14927
266 14927 9793 10145 11885 11769 11417 13865 9605 14434 19184 22808 20596 16007 20700 19523 14860 11722
250 11722 5560 4590 8618 5650 3335 6348 4739 1003 -2792 3311 8642 13225 11085 12344 15802
235 15802 15862 12294 14036 10654 10742 9553 7491 8020 6244 9797 15059 10487 13314 16227 13525 3744
219 3744 4291 2316 2016 4975 9079 12787 15356 12943 8611 6158 6931 7160 7690 6312 8710 9275 9056
202 9056 6272 9325 11363 10506 12662 12883 13850 15724 14762 10394 9290 5132 6400 7473 9582 12372
186 12372 7756 5389 10767 11385 18248 24286 19517 12598 11381 11541 6623 6853 11155 18711 18500 15813
170 15813 13722 7415 7754 11875 15559 16894 18349 16896 10119 8121 3702 2267 3016 3509 6341 10901
154 10901 14597 16631 19753 18716 17277 14716 15707 19315 20917 16496 16474 17496 18217 19914 18976 16302
138 16302 19462 17437 17403 16527 19221 23548 22529 16967 14469 9607 13406 14708 15394 16229 17450 16084
122 16084 13248 14562 13553 10046 6737 4187 3011 10818 13559 11721 9163 10099 13939 13636 15775
107 15775 17007 13097 5913 5049 11967 9712 7875 9648 11638 13449 11262 14509 19070 19019 14646 7225
91 7225 3583 3665 3228 6116 5061 7756 8336 6220 2962 3372 3873 7835 10648 10441 13570 19051 17233
74 17233 17361 16528 14057 10431 10713 13560 11929 5784 9246 7488 6612 11843 12294 10300 6931 5053
58 5053 10294 8802 12390 15878 14271 15617 13663 12810 12838 14671 16758 10141 4058 8478 11135 13957
42 13957 16225 14238 11295 11897 11681 4211 4429 6306 7960 8014 11139 13214 14588 15504 13006 11933 12975
25 12975 18722 21508 20271 17086 16581 15101 15050 15471 12050 13088 10497 3628 4360 10033 9423 13511 12815
8 12815 5922 13159 17421 17560 13808 12805 11550 7908
0 7908
$$ Imaginary data points
##PAGE= N=2
##DATA TABLE= (X++(I..I)), XYDATA
32767 107602 106758 107729 105186 100955 102699 108141 115151 116960 113232 108510 108133 108838 108096 110134 114096
32752 114096 117576 114400 109427 106137 105911 106609 110934 111861 113289 114713 111555 112508 110194 110654 111603 108207
32736 108207 108364 111200 111650 112483 116501 118331 115602 117282 121510 123889 121603 118658 115797 117357 118976
32721 118976 121768 120331 119001 122475 123559 121760 121171 119814 116852 116935 123439 123181 125082 124231 124398 126260
32705 126260 128605 129045 129202 129675 121996 118149 118455 120549 117534 117688 119471 119919 122592 127460 135379 137147
32689 137147 133596 130779 125225 125450 127500 127903 124302 126085 129974 123741 118567 117459 116823 117301 120723
32674 120723 124457 128313 127456 125918 125208 128708 131232 130290 128939 127674 131715 129845 126749 127751 126853
32659 126853 125812 129028 130263 130221 131385 132342 136475 133170 134208 135001 135246 133295 134970 135598 137658 143219
32643 143219 140920 138676 141696 137468 132768 134890 136666 133324 133630 135810 139314 140335 141766 142313 143164
32628 143164 140198 133953 136274 140195 140728 138828 141225 146046 144611 143141 148131 147185 149088 148035 141578
32613 141578 137839 140426 146748 147608 147634 146472 144081 142875 142163 143951 146344 145123 142807 138167 140572
32598 140572 144653 149310 152867 151874 149964 151559 154890 152892 147615 145053 146981 144531 139831 140614 144527
32583 144527 143118 145704 148220 151572 149929 150045 151586 155041 154777 153652 153780 146306 143162 150348 155495
32568 155495 160716 159799 159077 151510 150555 157369 160087 160799 159474 153408 153690 155474 155906 155361 152727 152476
32552 152476 155017 156495 152608 152504 155527 156883 156825 155686 150701 151807 156046 158508 156078 151122 152561
32537 152561 147630 146667 147661 152094 156912 157156 154865 153044 151132 150415 155176 159258 157253 157044 161757
32522 161757 169566 172090 169641 164348 160628 153294 154781 164590 166524 168567 164569 162342 165254 171360
32508 171360 173549 168013 167924 165062 160404 157688 159507 161259 163442 162812 160133 163959 173312 170681 174314
32493 174314 178322 172301 171196 169654 166758 164089 158734 155911 160616 165566 165007 169956 174878 171294
32479 171294 165101 165699 163831 160590 160995 164921 162992 160791 163976 166035 174562 177327 173541 173238 176974
32464 176974 175401 176091 175425 169832 165790 167012 160604 154512 159675 166052 168259 165786 166035 169306 170475
32449 170475 171708 171220 175273 175713 179821 178540 173922 172790 170047 169402 164949 163637 169894 178034 181456
32434 181456 174645 173543 172975 170758 178818 180863 182320 186631 182418 174126 167574 173195 173959 172961 174388
32419 174388 167727 164213 169799 170182 172862 174005 175345 180533 180704 178066 177580 183064 184404 185040 187900
32404 187900 186435 184734 186356 182212 178669 177221 181536 184107 182235 170922 172059 181700 185057 183881
32390 183881 184519 182209 178395 180921 191527 191190 187249 192882 191070 187142 178067 172067 169180 170768
32376 170768 175915 175665 176259 178144 183794 186956 184208 179243 180323 178505 176215 174584 178042 175250 181327
32361 181327 182833 178148 174896 172508 175466 176261 175359 181216 182816 181231 181335 181450 179813 184803 181389
32346 181389 181389 179825 185903 195719 196106 194852 194501 186980 185610 183048 180828 182615 186084 191104 190381 184727
32330 184727 179604 179363 177605 177415 179555 182363 180356 180687 178669 177753 174900 177179 179624 181282 182664
32315 182664 182907 184082 185184 186221 186076 185901 183208 183775 188732 185287 176995 187051 189519 184491 187188
32300 187188 186705 185703 184879 181528 184198 185866 182489 180795 181606 174330 176599 184886 185409 191272 190740
32285 190740 183260 178592 185896 190170 192132 190984 183852 183328 192406 191374 189902 192809 192530 186228 189141
32270 189141 191174 185703 185034 190109 194917 192470 191968 187544 186240 189161 188471 192534 195752 192101 187049
32255 187049 184516 184295 184672 184970 185493 189539 197488 194275 188876 184745 184274 190692 195876 194065 195644
32240 195644 192594 190501 191154 188923 192270 196523 198244 192450 189221 195884 196335 184842 182310 186085
32226 186085 188514 186726 186903 192779 195135 190832 191229 190095 181213 182340 181136 181297 180681 189874 197189
32211 197189 201680 200669 199656 196938 191930 190860 184461 185868 186627 187178 190339 187756 183107 180922 186688
32196 186688 189735 192714 190465 183696 189238 187376 192205 197672 194515 191636 194774 188291 190659 193623
32182 193623 199400 204505 194654 190865 188070 186352 183819 184908 186831 188753 196320 203097 202506 193876
32168 193876 186394 187910 193853 196251 192704 183020 181900 181772 182462 182634 182590 182192 177769 177047 182885 192508
32152 192508 194846 195811 192118 186492 187375 186549 188401 189903 193512 187954 187347 190212 195712 192354 184087
32137 184087 179647 185064 189241 191496 190135 189790 188574 184461 183047 183843 189561 186201 186812 194470 193879
32122 193879 191722 190957 192279 196150 198319 201841 203824 198760 191099 185057 187630 191853 193992 195805
32108 195805 195538 194414 193189 195422 201824 205048 202360 198812 197507 203170 205871 206291 209220 212714 206775
32093 206775 201218 194898 190365 189482 190917 185658 185973 183822 185283 191488 195503 196157 193881 189245 184920
32078 184920 187248 190222 190229 190712 190018 190004 192454 188835 190962 194619 191671 189768 189427 188014 190981 196968
32062 196968 202164 202619 198270 196396 199575 200356 198602 196743 190754 185251 183335 188187 192221 198186 191558
32047 191558 192817 196509 194331 199469 200993 200453 200120 200291 201476 194504 191368 193756 194675 196233 194638
32032 194638 193071 192944 196557 195679 199126 204060 203468 203180 200221 200189 200696 203647 202798 192849 190206 192780
32016 192780 196061 200860 205047 206113 200121 191178 193397 190408 186104 186702 187644 191940 195670 201509 196733
32001 196733 190774 191279 195293 195581 193257 188361 190548 192022 193496 190385 191548 192403 188099 192460 198567
31986 198567 196406 197919 198392 197935 201458 194968 193970 194010 191736 195435 203199 208273 203520 198642 192860
31971 192860 192342 190949 190720 197638 204260 200115 202823 201129 196386 197107 202070 198100 198058 196026 193085
31956 193085 191112 190650 196330 196904 188468 180748 177029 179294 184877 190890 189537 184733 185512 187910 188376
31941 188376 188340 191190 190362 185867 183185 187400 195345 198516 195318 195354 199325 197974 197466 203121 200811 198748
31925 198748 195990 192954 190206 194852 195633 193317 189777 186691 194998 201603 201275 198845 196024 198502 196001
31910 196001 199125 200753 199639 196366 192513 191460 188276 183101 188240 187829 183895 181627 186709 191509
31896 191509 191330 189223 184764 185708 187842 186868 189143 192751 196499 192727 189972 189967 193581 201659 210392 208869
31880 208869 207365 200976 196579 194085 192877 188462 182318 183863 186567 190461 197566 195533 193546 198895
31866 198895 202531 206763 204872 198342 198780 202559 196999 186392 186077 185939 182729 186343 192239 196769 199916
31851 199916 199844 203966 205527 207678 196632 198733 204793 204906 198173 195036 197859 202129 198449 194669 197769
31836 197769 200232 199382 197063 193677 194214 201970 200238 197703 197921 197333 196113 196992 194950 194585 190399 191650
$$ [...]
##END NTUPLES=NMR SPECTRUM
##END=
