##TITLE=Analysis number 311691
Compound Code km 02515
Book Reference 443/28
Project Code qc-cat 
Chemist Name emmab
##JCAMPDX= 6.0         $$ Bruker NMR JCAMP-DX V2.0
##DATA TYPE= NMR SPECTRUM
##DATA CLASS= NTUPLES
##ORIGIN= Bruker BioSpin GmbH
##OWNER= NMR
$$ XWIN-NMR		Version 3.5
$$ Thu Jul 14 15:42:40 2005 GMT Daylight Time (UT+1h)  MAYBRIDGE\NMR@NMR_250MHZ
##.OBSERVE FREQUENCY= 250.131544655141
##.OBSERVE NUCLEUS= ^1H
##.ACQUISITION MODE= SIMULTANEOUS (DQD)
##.ACQUISITION SCHEME= undefined
##.AVERAGES= 16
##.DIGITISER RES= 18
##SPECTROMETER/DATA SYSTEM= dpx250
##.PULSE SEQUENCE= zg30
##.SOLVENT NAME= CDCl3
##.SHIFT REFERENCE= (INTERNAL, CDCl3, 0, 16.4425)
##AUDIT TRAIL= $$ (NUMBER, WHEN, WHO, WHERE, WHAT)
$$ ##TITLE= Audit trail, XWIN-NMR		Version 3.5
$$ ##JCAMPDX= 5.01
$$ ##ORIGIN= Bruker BioSpin GmbH
$$ ##OWNER= NMR
$$ C:\u/data/dgb/nmr/ADRS/5850/pdata/1/auditp.txt
$$ ##AUDIT TRAIL=  $$ (NUMBER, WHEN, WHO, WHERE, WHAT)
(   1,<2005-07-14 15:42:00.77 +100>,<MAYBRIDGE\NMR>,<NMR_250MHZ>,
      <created by zg, POWCHK disabled, PULCHK disabled
       configuration hash MD5:
       62 19 C7 07 E1 42 D1 B7 37 6C 3D D0 77 39 F9 E6
       data hash MD5: 64K
       91 B9 89 3A D1 0F 26 D9 DE 6E 4B 7A A1 C1 53 34>)
(   2,<2005-07-14 15:42:19.82 +100>,<MAYBRIDGE\NMR>,<NMR_250MHZ>,
      <Start of raw data processing
       ef LB = 0.3 FT_mod = 6 PKNL = 1 SI = 32K 
       data hash MD5: 32K
       AC 33 CD EA 9C D6 37 18 33 A1 C4 1B EA 3C 58 26>)
(   3,<2005-07-14 15:42:24.85 +100>,<MAYBRIDGE\NMR>,<NMR_250MHZ>,
      <apk 
       data hash MD5: 32K
       02 6B 14 82 49 01 D6 4C 0C AD 65 1C EB 49 A1 C4>)
(   4,<2005-07-14 15:42:26.58 +100>,<MAYBRIDGE\NMR>,<NMR_250MHZ>,
      <abs ABSG = 5 
       data hash MD5: 32K
       43 AA 47 B9 B8 9F EC 87 2C BB 21 C5 3A A0 B3 42>)
$$ ##END=
$$ 
$$ hash MD5
$$ 55 0E EE EC 80 C4 1B E6 FF F8 2E 39 36 23 6B E4
##$RELAX= 
##$RELAX= 
##$RELAX= 
##$RELAX= 
##$RELAX= 
##$RELAX= 
##$RELAX= 
$$ Bruker specific parameters
$$ --------------------------
##$DU= <C:\u>
##$EXPNO= 5850
##$NAME= <ADRS>
##$PROCNO= 1
##$TYPE= <nmr>
##$USER= <dgb>
##$AMP= (0..31)
100 100 100 100 100 100 100 100 100 100 100 100 100 100 100 100 100 100 
100 100 100 100 100 100 100 100 100 100 100 100 100 100 
##$AQSEQ= 0
##$AQ_mod= 3
##$AUNM= <au_zg>
##$AUTOPOS= <42 >
##$BF1= 250.13
##$BF2= 250.13
##$BF3= 250.13
##$BF4= 250.13
##$BF5= 500.13
##$BF6= 500.13
##$BF7= 500.13
##$BF8= 500.13
##$BYTORDA= 1
##$CFDGTYP= 0
##$CFRGTYP= 5
##$CHEMSTR= <none>
##$CNST= (0..31)
1 1 145 1 1 1 1 1 1 1 1 1 1 1 1 1 1 1 1 1 1 1 1 1 1 1 1 1 1 1 1 1 
##$CPDPRG= <>
##$CPDPRG1= <>
##$CPDPRG2= <>
##$CPDPRG3= <>
##$CPDPRG4= <mlev>
##$CPDPRG5= <mlev>
##$CPDPRG6= <mlev>
##$CPDPRG7= <mlev>
##$CPDPRG8= <mlev>
##$CPDPRGB= <>
##$CPDPRGT= <>
##$D= (0..31)
0 1 0 0 0 0 0 0 0 0.06 0 0 0 0 0 0 0.0002 0 0 0 0 0 0 0 0 0 0 0 0 0 0 
0 
##$DATE= 1121352117
##$DBL= (0..7)
120 120 120 120 120 120 120 120 
##$DBP= (0..7)
150 150 150 150 150 150 150 150 
##$DBP07= 0
##$DBPNAM0= <>
##$DBPNAM1= <>
$$ [...]
##$SUBNAM7= <"">
##$SUBNAM8= <"">
##$SUBNAM9= <"">
##$SW= 20.6930455092707
##$SWIBOX= (0..15)
0 0 3 0 0 0 0 0 0 0 0 0 0 0 0 0 
##$SW_h= 5175.983436853
##$TD= 65536
##$TD0= 1
##$TE= 296.16
##$TE2= 300
##$TE3= 300
##$TEG= 300
##$TL= (0..7)
0 120 120 120 120 120 120 120 
##$TP= (0..7)
150 150 150 150 150 150 150 150 
##$TP07= 0
##$TPNAME0= <>
##$TPNAME1= <>
##$TPNAME2= <>
##$TPNAME3= <>
##$TPNAME4= <>
##$TPNAME5= <>
##$TPNAME6= <>
##$TPNAME7= <>
##$TPOAL= (0..7)
0.5 0.5 0.5 0.5 0.5 0.5 0.5 0.5 
##$TPOFFS= (0..7)
0 0 0 0 0 0 0 0 
##$TUNHIN= 0
##$TUNHOUT= 0
##$TUNXOUT= 0
##$USERA1= <user>
##$USERA2= <user>
##$USERA3= <user>
##$USERA4= <user>
##$USERA5= <user>
##$V9= 5
##$VALIST= <valist>
##$VCLIST= <CCCCCCCCCCCCCCC>
##$VD= 0
##$VDLIST= <DDDDDDDDDDDDDDD>
##$VPLIST= <PPPPPPPPPPPPPPP>
##$VTLIST= <TTTTTTTTTTTTTTT>
##$WBST= 1024
##$WBSW= 4
##$XGAIN= (0..3)
0 0 0 0 
##$XL= 0
##$YL= 0
##$YMAX_a= 500226
##$YMIN_a= -523293
##$ZGOPTNS= <>
##$ZL1= 120
##$ZL2= 120
##$ZL3= 120
##$ZL4= 120
##$ABSF1= 16.4425
##$ABSF2= -4.250673
##$ABSG= 5
##$ABSL= 3
##$ALPHA= 0
##$AQORDER= 0
##$ASSFAC= 0
##$ASSFACI= 0
##$ASSFACX= 0
##$ASSWID= 0
##$AUNMP= <proc_1d>
##$AZFE= 0.1
##$AZFW= 0.1
##$BCFW= 0
##$BC_mod= 0
##$BYTORDP= 0
##$COROFFS= 0
##$CY= 12.5
##$DATMOD= 1
##$DC= 0
##$DFILT= <>
##$DTYPP= 0
##$F1P= 14.0000005364418
##$F2P= -0.99999901652339
##$FCOR= 0.5
##$FTSIZE= 32768
##$FT_mod= 6
##$GAMMA= 0
##$GB= 0
##$INTBC= 1
##$INTSCL= 1
##$ISEN= 128
##$LB= 0.3
##$LEV0= 0
##$LPBIN= 0
##$MAXI= 10000
##$MC2= 0
##$MEAN= 0
##$ME_mod= 0
##$MI= 0
##$NCOEF= 0
##$NC_proc= -2
##$NLEV= 6
##$NOISF1= 0
##$NOISF2= 0
##$NSP= 0
##$NTH_PI= 0
##$NZP= 0
##$OFFSET= 16.4425
##$PC= 1
##$PHC0= -81.41058
##$PHC1= 6.201424
##$PH_mod= 1
##$PKNL= yes
##$PPARMOD= 0
##$PSCAL= 4
##$PSIGN= 0
##$REVERSE= no
##$SF= 250.130019883681
##$SI= 32768
##$SIGF1= 0
##$SIGF2= 0
##$SINO= 400
##$SIOLD= 32768
##$SREGLST= <1H.CDCl3>
##$SSB= 0
##$STSI= 32768
##$STSR= 0
##$SW_p= 5175.98343685301
##$SYMM= 0
##$S_DEV= 0
##$TDeff= 65536
##$TDoff= 0
##$TI= <Analysis number 999999
Compound Code 99
Book Reference 9
Project Code 9>
##$TILT= no
##$TM1= 0
##$TM2= 0
##$TOPLEV= 0
##$USERP1= <user>
##$USERP2= <user>
##$USERP3= <user>
##$USERP4= <user>
##$USERP5= <user>
##$WDW= 1
##$XDIM= 32768
##$YMAX_p= 289951357
##$YMIN_p= -44147
$$ End of Bruker specific parameters
$$ ---------------------------------
##NTUPLES= NMR SPECTRUM
##VAR_NAME=  FREQUENCY,     SPECTRUM/REAL,   SPECTRUM/IMAG
##SYMBOL=    X,             R,               I
##VAR_TYPE=  INDEPENDENT,   DEPENDENT,       DEPENDENT
##VAR_FORM=  AFFN,          ASDF,            ASDF
##VAR_DIM=   32768,         32768,           32768
##UNITS=     HZ,            ARBITRARY UNITS, ARBITRARY UNITS
##FACTOR=    0.157963299565203, 1,           1
##FIRST=     4112.76264201996, 0,            0
##LAST=      -1063.22079483305, 0,           0
##MIN=       -1063.22079483305, -44147,      0
##MAX=       4112.76264201996, 289951357,    0
$$ Real data points
##PAGE= N=1
##DATA TABLE= (X++(R..R)), XYDATA
$$ [...]
$$ plain form
17680 -9813 -5186 5791 13639 15754 10083 5723 -1180 505 -815 772 13479 16424 17568 15252
17666 15252 2361 -4079 3443 3207 -5569 -9994 -8649 -13356 -1487 2876 -4111 -4255 -1352 -4774
17652 -4774 -10688 -10972 -8428 -6174 -8564 3403 11573 4221 -2365 1817 2254 -418 -8151 -3611 -1570
17637 -1570 -9766 -12620 -17109 -30234 -33523 -31463 -18435 -1270 5693 -6557 -12851 -13161 -16180 -12687
17623 -12687 -17081 -10719 -1263 -4782 -4368 -3594 9117 14140 11783 5099 2977 7508 18764 22411
17609 22411 14814 16960 10468 12000 9431 4945 -2221 -555 2831 12325 -431 -4814 7945 16457
17595 16457 19623 26615 37400 29900 15902 13971 26289 30473 47047 72648 86518 98255 111331
17582 111331 146688 198519 267977 357171 457527 510443 521089 499869 417656 317463 231471
$$ packed form
17680i813M627J0977P848K115n671m360o903J685j320J587J2707K945J144k316
17666A5252j2891o440P522k36q776m425J345m707J1869M363o987j44K903l422
17652d774n914k84K544K254k390J1967Q170p352o586M182M37k672p733M540K041
17637a570q196k854m489j3125l289K060J3028J7165O963j2250o294l10l019L493
17623a2687m394O362R456l519M14P74J2711N023k357o684k122M531J1256L647
17609B2411p597K146o492J532k569m486p166J666L386R494j2756m383J2759Q512
17595A6457L166O992J0785p500j3998j931J2318M184J6574K5601J3870J1737J3076
17582A11331L5357N1831O9458Q9194J00356N2916J0646k1220q2213j00193q5992
$$ plain form
17571 231471 165554 114240 85752 64776 56293 57328 52279 45965 46041 48807 41058 36303 41213 42772
17557 42772 46970 42196 52387 55521 62117 49315 39257 42363 36387 29625 22435 15467 19750 20506
17543 20506 26665 22366 19773 24507 19187 10564 2506 9519 10547 7577 7746 -7793 -11333 -13668
17529 -13668 -17433 -9099 -9280 -5200 -2868 -1841 40 -144 6586 1326 5807 10254 6440 1761 3670
17514 3670 174 -4334 395 4659 7748 11012 5074 -4015 3220 5346 3998 2772 -2648 -10575 -17230
17499 -17230 -5623 -2485 -6254 -4529 -5918 -14123 -16977 -22730 -10483 4101 715 -736 -2333 -8026
17485 -8026 -7732 -4535 -5110 -12559 -12829 -9778 5919 14602 5576 1255 6318 -551 -14555 -18609 -16725
17470 -16725 -8299 -383 -1159 -10313 -23867 -30131 -21973 -16734 -18030 -20637 -5208 4688 3641 -2281
$$ packed form
17571B31471o5917n1314k8488k0976q483J035n049o314P6K766p749m755M910J559
17557D2772M198m774J0191L134O596j2802j0058L106n976o762p190o968M283P56
17543B0506O159m299k593M734n320q623q058P013J028k970J69j5539l540k335
17529a3668l765Q334j81M080K332J027J881j84O730n260M481M447l814m679J909
17514C670l496m508M729M264L089L264n938r089P235K126j348j226n420p927o655
17499a7230J1607L138l769J725j389q205k854n753J2247J4584l386j451j597n693
17485h026K94L197n75p449k70L051J5697Q683r026m321N063o869j4004m054J884
17470a6725Q426P916p76r154j3554o264Q158N239j296k607J5429R896j047n922
$$ plain form
17456 -2281 -1386 -1542 -2049 1937 -11866 -15387 -1852 9417 13240 19268 32850 52460 68589 76912
17442 76912 77244 83295 88945 70803 40057 21355 14060 13790 19423 25394 20715 15311 18591 21839
17428 21839 10997 8858 -3979 -2969 4109 3964 3083 -3753 -12220 -7796 -5981 -5093 -2562 3898 2025
17413 2025 11831 19441 14347 8631 8663 7873 7730 4100 4441 4301 -6743 -14355 -8591 -3628 11099 1459
17397 1459 -4438 -8245 4097 12102 7344 -14006 -25279 -12055 6568 6636 10105 -3102 -9452 -3839
17383 -3839 -2129 -16961 -20014 -11094 -2788 -4141 -15101 -20969 -11049 1654 -8050 -7500 -8009 -13591
17369 -13591 -25264 -20089 -20304 -25400 -15673 -4988 -14056 -15411 -9129 -7007 -6 59 3155 -3828 -11622
17354 -11622 -6961 -9179 -6401 8456 17595 16658 12646 11223 8777 -1079 976 6064 8600 -4943
$$ packed form
17456b281Q95j56n07L986j3803l521J3535J1269L823O028J3582J9610J6129Q323
17442G6912L32O051N650j8142l0746j8702p295k70N633N971m679n404L280L248
17428B1839j0842k139j2837J010P078j45q81o836q467M424J815Q88K531O460j873
17413B025R806P610n094n716L2p90j43l630L41j40j1044p612N764M963J4727r640
17397A459n897l807J2342Q005m758k1350j1273J3224J8623O8L469j3207o350N613
17383c839J710j4832l053Q920Q306j353j0960n868R920J2703r704N50n09n582
17369a3591j1673N175k15n096R727J0685r068j355O282K122P001O5L096o983p794
17354a1622M661k218K778J4857R139r37m012j423k446r856K055N088K536j3543
$$ plain form
17340 -4943 -7337 -109 -1307 4058 9139 3586 1027 -2441 -619 -4247 -8881 3060 -82 -2500
17326 -2500 4323 -6387 -17539 -14476 -13343 -14071 -5400 2314 2106 541 -8704 -12196 -12448 -3740 12067
17311 12067 13552 3618 4680 1854 -260 6121 4949 3569 -350 -7858 -4402 -2192 -13316 -24364
17297 -24364 -27208 -20653 -11612 -8546 8063 10788 55 -7149 -12460 -8583 226 3052 -1101 -2162
17283 -2162 -11072 -10554 -10753 -8512 -9727 -6180 -638 208 -3430 -5857 -2750 -15032 -12994 -3649 -1933
17268 -1933 1471 6651 6281 11694 18255 12840 -248 12861 20579 15443 6993 -4377 -7924 7587
17254 7587 9485 9609 11975 1114 -12350 -13996 -8906 -2007 2525 -3085 -16708 -16940 -8939 -8672 -4220
17239 -4220 2823 -4016 -14849 -17291 -19629 -14697 3135 -1839 -8219 -1573 1930 4955 1987 -1415
$$ packed form
17340d943k394P228j198N365N081n553k559l468J822l628m634J1941l142k418
17326b500O823j0710j1152L063J133p28Q671P714k08j565r245l492k52Q708J5807
17311A2067J485r934J062k826k114O381j172j380l919p508L456K210j1124j1048
17297b4364k844O555R041L066J6609K725j0733p204n311L877Q809K826m153j061
17283b162q910N18j99K241j215L547N542Q46l638k427L107j2282K038R345J716
17268a933L404N180l70N413O561n415j3088J3109P718n136q450j1370l547J5511
17254G587J898J24K366j0861j3464j646N090O899M532n610j3623k32Q001K67M452
17239d220P043o839j0833k442k338M932J7832m974o380O646L503L025k968l402
$$ plain form
17225 -1415 883 -3470 5490 3506 -885 -4096 142 2394 7464 13036 -3267 -5104 2208 8557
17211 8557 1619 -6215 1460 5165 -6908 -7616 -11922 -14533 -17191 -19426 -18794 -13251 -9297 -718 2779
17196 2779 5254 10686 18881 19273 7569 -1537 -2136 -23 6464 -1254 -7904 -3243 -5295 -3879 -13960
17181 -13960 -9574 -94 -5324 -7236 -4542 2181 12445 958 524 -181 -10027 -14556 -23614 -18591
17167 -18591 -12045 -3455 1094 3558 -6699 -5048 6324 20119 3014 -244 -4941 -7691 591
17154 591 11082 2948 83 -1527 -4923 1397 854 -13811 -20047 -13072 -14419 -17048 -18950 -21454 -9798
17139 -9798 2004 14614 20552 18375 19685 11221 -3082 944 5285 11352 10901 21922 24823 19446
17125 19446 9804 2300 5149 -5304 -8476 -2618 -6109 5101 10264 289 -6517 -4720 -5059 -9073
$$ packed form
17225a415K298m353Q960j984m391l211M238K252N070N572j6303j837P312O349
17211H557o938p834P675L705j2073p08m306k611k658k235O32N543L954Q579L497
17196B779K475N432Q195L92j1704r106n99K113O487p718o650M661k052J416j0081
17181a3960M386R480n230j912K694O723J0264j1487m34p05r846m529r058N023
17167a8591O546Q590M549K464j0257J651J1372J3795j7105l258m697k750Q282
17154E91J0491q134k865j610l396O320n43j4665o236O975j347k629j902k504J1656
17139i798J1802J2610N938k177J310q464j4303M026M341O067m51J1021K901n377
17125A9446r642p504K849j0453l172N858l491J1210N163r975o806J797l39m014
$$ plain form
17111 -9073 -2037 -3637 107 10665 3468 -9989 -9306 -16355 -13170 2495 -4105 -19017 -13937 -14479
17097 -14479 -5960 70 -1762 5453 -2044 -16790 -24103 -23471 -24492 -21604 -17888 -16029 -13219 -9426
17083 -9426 -10326 -12193 -11888 -5054 -1253 -3458 -3703 3876 15092 21619 9586 5550 19348 18395 15500
17068 15500 17656 18728 21532 14100 5474 3819 7393 3556 -1775 -10829 -18542 -24277 -22297 -16702
17054 -16702 -12960 -18286 -11250 -1143 2534 -5772 -6699 467 -455 -2678 -5735 -2373 -4513 -4864 -12407
17039 -12407 -10791 -9057 4353 942 -5962 -5999 -9795 -14386 -11135 -5078 -1927 -10668 -7620 -5367 -13419
17024 -13419 -6005 -7177 -12687 -8518 -11998 -12519 5986 15060 10402 6536 -7085 -15862 -16844 -16727 -13050
17009 -13050 -276 4609 697 746 1725 8229 7572 -6060 -5066 -12070 -23634 -28970 -26047 -3144 6086
$$ packed form
17111i073P036j600L744J0558p197j3457O83p049L185J5665o600j4912N080n42
17097a4479Q519O030j832P215p497j4746p313O32j021K888L716J859K810L793
17083i426r00j867L05O834L801k205k45P579J1216O527j2033m036J3798r53k895
17068A5500K156J072K804p432q626j655L574l837n331r054p713n735J980N595
17054a6702L742n326P036J0107L677q306r27P166r22k223l057L362k140l51p543
17039a2407J616J734J3410l411o904l7l796m591L251O057L151q741L048K253q052
17024a3419P414j172n510M169l480n21J8505R074m658l866j3621q777r82J17L677
17009a3050J2774M885l912M9R79O504o57j3632R94p004j1564n336K923K2903R230
$$ plain form
16994 6086 1733 3121 9910 -1792 -14491 -7537 -1181 3344 10221 3529 -11173 -10829 -2281 3243
16980 3243 -4486 -9071 -4702 -7055 -15517 4800 10094 20122 23613 3285 -3388 4332 9845 9832
16966 9832 2164 5433 9241 6713 3890 3681 270 -4242 3088 1535 541 2191 -5522 -8317 -2912
16951 -2912 -4749 -11618 -12014 -6098 -3040 7552 18678 7638 -3068 -1237 -1767 -6547 1744 5710
16937 5710 6472 5171 8776 2193 -5152 -5871 -16569 -10407 -1405 -1776 -5691 -7076 -11144 -4028 998
16922 998 1471 2033 11336 -2153 -11176 -18016 -10422 -8125 -9431 984 4902 5639 2532 -3588 -3155
16907 -3155 -11278 -10411 -3894 6174 6587 13000 10670 4853 3201 15720 17073 12579 -1196 4442
16893 4442 -3854 1802 2677 -6513 -10671 -10496 -14880 -12379 -2515 -492 85 -2487 -9409 -7967 -4230
$$ packed form
16994F086m353J388O789j1702j2699O954O356M525O877o692j4702L44Q548N524
16980C243p729m585M369k353q462K0317N294J0028L491k0328o673P720N513j3
16966I832p668L269L808k528k823k09l411m512P330j553r94J650p713k795N405
16951b912j837o869l96N916L058J0592J1126j1040j0706J831n30m780Q291L966
16937E710P62j301L605o583p345p19j0698O162R002l71l915j385m068P116N026
16922I98M73N62R303j3489r023o840P594K297j306J0415L918P37l107o120M33
16907c155q123Q67O517J0068M13O413k330n817j652J2519J353m494j3775N638
16893D442q296N656Q75r190m158J75m384K501R864K023N77k572o922J442L737
$$ plain form
16878 -4230 -5709 -6846 -12111 2629 8163 7660 6295 2946 -1051 -1390 712 9627 7042 -502 -7808
16863 -7808 -14910 -14423 -1923 -7075 -23153 -11959 2269 315 -459 -407 215 5540 3693 -82 2548
16848 2548 1804 -782 -2184 -5073 -14268 -19422 -17491 -6929 -7935 -18381 -15808 -9236 7754 7570
16834 7570 4395 1544 2801 12196 12872 11624 2140 -11471 -12406 -12165 -6965 368 2969 6597 4749
16819 4749 2662 952 15077 -395 -10039 -10545 -4395 10914 9744 1611 -128 12236 14738 10546
16805 10546 687 -3037 2287 8171 9101 6994 2867 273 -1883 -3566 617 -8095 -12764 -11366 -12435
16790 -12435 -10667 -15195 -5604 -8351 -5557 -2479 -5231 -5345 -7457 -21363 -22020 -12058 -8580 -1327 5422
16775 5422 8213 -7782 -14049 -13666 -6671 -5670 -10310 -10357 -12408 -13751 -10955 -12381 -11508 -23367 -24162
$$ packed form
16878d230j479j137n265J4740N534n03j365l349l997l39K102Q915k585p544p306
16863g808p102M87J2500n152j6078J1194J4228j954p74N2O22N325j847l775K630
16848B548p44k586j402k889r195n154J931J0562j006j0446K573O572J6990j84
16834G570l175k851J257R395O76j248r484j3611r35K41N200P333K601L628j848
16819D749k087j710J4125j5472r644n06O150J5309j170q133j739J2364K502m192
16805A0546r859l724N324N884R30k107m127k594k156j683M183q712m669J398j069
16790a2435J768m528R591k747K794L078k752j14k112j3906o57R962L478P253O749
16775E422K791j5995o267L83O995J001m640m7k051j343K796j426Q73j1859p95
$$ plain form
16760 -24162 -14953 -11672 7062 20447 5607 -9315 -9004 -774 6695 2329 1726 -6988 -13145 -9446
16746 -9446 118 9551 1283 -12750 -17338 -12084 -4329 1497 5277 -4088 -2021 -7291 -13674 -21225
16732 -21225 -9435 -1328 3863 -3081 -6865 -6108 -9256 -16228 -15385 -8251 -11390 -2597 -3610 -12558 -25818
16717 -25818 -37888 -35475 -30167 -23515 -23734 -12802 -6716 -17006 -12717 6475 24256 39419 32331
16704 32331 13226 11783 10576 1457 110 -2518 3405 1437 2209 8916 13007 13844 15852 14295 18386
16689 18386 13014 -2665 -7468 -5424 5816 12674 -1042 -20678 -15847 -5247 2220 -1312 -9130
16676 -9130 -17733 -11686 -2350 7565 5973 -7696 -1042 859 -6604 -7993 -1446 2799 7795 -1139
16662 -1139 -12170 -8090 619 8539 4034 1273 6980 16364 6805 6321 -4251 -10136 -12717 -9104
$$ packed form
16760b4162R209L281J8734J3385j4840j4922L11Q230P469m366o03q714o157L699
16746i446R564R433q268j4033m588N254P755N826L780r365K067n270o383p551
16732b1225J1790Q107N191o944l784P57l148o972Q43P134l139Q793j013q948j3260
16717b5818j2070K413N308O652k19J0932O086j0290M289J9192J7781J5163p088
16704C2331j9105j443j207r119j347k628N923j968P72O707M091Q37K008j557M091
16689A8386n372j5679m803K044J1240O858j3716j9636M831J0600P467l532p818
16676i130q603O047R336R915j592j3669O654J901p463j389O547M245M996q934
16662a139j1031M080Q709P920m505k761N707R384r559m84j0572n885k581L613
$$ plain form
16648 -9104 -2514 -5024 -1462 -7644 -3344 -5838 -8989 -4706 4171 -1176 -9145 -5798 504 -2083 3280
16633 3280 9382 -4374 -27024 -30258 -15797 -6346 -5587 -8925 -15180 -16647 -12747 -12187 -6208 9750
16619 9750 14422 8602 13806 19262 8012 -6076 -17647 -19065 -16240 -14991 -14422 -23736 -20762 -13770
16605 -13770 -12273 -17083 -13462 -16881 -7711 -13428 -10608 5077 8907 10357 10304 7285 -11396 -7611
16591 -7611 -11888 -10651 -667 7403 21108 13386 -5467 -13837 7656 11257 2487 7364 4687 5079
16577 5079 8889 212 -8396 -9668 2348 -7207 -5103 1497 3323 2804 -11002 -13483 -8094 -3398
16563 -3398 2918 14326 15239 15206 15151 7714 1401 1008 -4717 -6011 -8464 -10185 -15564 -18034 -21041 -34450
16547 -34450 -29334 -24071 -25856 -20791 -7619 5379 14026 18316 23321 3071 -4359 -9465 -12650 -4421
$$ packed form
16648i104O590k510L562o182M300k494l151M283Q877n347p969L347O302k587N363
16633C280O102j3756k2650l234J4461R451P59l338o255j467L900N60N979J5958
16619I750M672n820N204N456j1250j4088j1571j418K825J249N69r314K974O992
16605a3770J497m810L621l419R170n717K820J5685L830J450n3l019j8681L785
16591g611m277J237R984Q070J3705p722j8853q370K1493L601q770M877k677L92
16577E079L810q677q608j272J2016r555K104O600J826n19j3806k481N389M696
16563c398O316J1408R13l3n5p437o313l93n725j294k453j721n379k470l007j3409
16547c4450N116N263j785N065J3172J2998Q647M290N005k0250p430n106l185Q229
$$ plain form
16533 -4421 10418 9015 -804 -6450 -1467 -70 -52 401 -3064 -977 -1484 -2324 -8520 -10980 -9651 1606
16517 1606 1188 -24650 -24197 -22291 -13023 -9181 -10989 -9444 -4504 330 -4665 -7859 -4128 -9481 -22426
16502 -22426 -10939 -17077 -26247 -18944 -9558 5135 6011 13927 7511 5403 -7908 -3140 -15221 -22952
16488 -22952 -27509 -13230 -6194 -11423 -2467 10609 4571 11478 14271 11642 377 -3435 -4677 -4895
16474 -4895 -14379 -12137 2254 8945 10790 6550 9755 12313 2013 -2383 -4084 -2263 2959 -1970
16460 -1970 -14154 -13653 -1532 7966 5204 4553 4836 2921 5637 6285 21446 24213 17463 14421 17326
16445 17326 5832 -2497 10116 18500 14200 -2983 -6037 2726 8114 3822 -10040 -7949 -242
16432 -242 3430 2638 -13275 -12020 -1570 -627 2595 11172 1796 -5380 1944 1563 -1111 -2979 -8513
$$ packed form
16533d421J4839j403r819n646M983J397J8M53l465K087n07q40o196k460J329J1257
16517A606m18k5838M53J906R268L842j808J545M940M834m995l194L731n353j2945
16502b2426J1487o138r170P303R386J4693Q76P916o416k108j3311M768j2081p731
16488b2952m557J4279P036n229Q956J3076o038O907K793k629j1265l812j242k18
16474d895r484K242J4391O691J845m240L205K558j0300m396j701J821N222m929
16460a970j2184N01J2121R498k762o51K83j915K716O48J5161K767o750l042K905
16445A7326j1494q329J2613Q384m300j7183l054Q763N388m292j3862K091P707
16432b42L672p92j5913J255J0450R43L222Q577r376p176P324l81k674j868n534
$$ plain form
16417 -8513 -7294 -4193 5772 436 -4483 -1715 2965 -13423 -14541 -17720 -15997 -7746 -10242 -11566
16403 -11566 -9472 1984 7645 7981 11597 1995 3531 10602 7390 7685 8322 -915 -6674 519 -30
16388 -30 -2405 2269 13188 1730 -11176 -14320 -16300 -15796 -8544 -1695 -6815 -9758 -1863 1598 6412
16373 6412 4979 4915 1918 -11724 -5389 2321 1004 6906 13288 -652 -9535 -10759 -10637 -11217 -12953
16358 -12953 -3704 -3209 -7433 -9036 -7942 -5137 -5028 -17224 -14365 -545 2001 -7050 -12053 -18624
16344 -18624 -14041 -6976 -68 844 -2496 -7451 -424 5710 -1474 -5795 -10072 -19487 -14610 -11454 -17219
16329 -17219 -8620 -5000 -4665 -5679 -11927 220 6836 8268 1004 -1837 2495 13083 5022 -125
16315 -125 -8301 -10246 -11001 -7525 -5080 -11007 -15020 -1767 -2685 105 13437 23961 31977 14839
$$ packed form
16417h513J219L101R965n336m919K768M680j6388j118l179J723Q251k496j324
16403a1566K094J1456N661L36L616r602J536P071l212K95O37r237n759P193n49
16388c0k375M674J0919j1458j2906l144j980N04P252O849n120k943P895L461M814
16373F412j433o4k997j3642O335P710j317N902O382j3940q883j224J22n80j736
16358a2953R249M95m224j603J094K805J09j2196K859J3820K546r051n003o571
16344a8624M583P065O908R12l340m955P027O134p184m321m277r415M877L156n765
16329a7219Q599L620L35j014o248J2147O616J432p264k841M332J0588q061n147
16315a25q176j945p55L476K445n927m013J3253r18K790J3332J0524Q016j7138
$$ plain form
16301 14839 7147 -6079 -9511 -13513 -12638 -3083 4173 2986 405 6002 -726 -7478 -476 1333
16287 1333 9770 1547 -3307 -313 741 2761 -2909 -3644 2479 5067 7817 1381 -2964 2773 12916
16272 12916 18082 19910 35887 34318 24226 17043 6486 -4329 -7216 -6168 -11511 -8819 -6316
16259 -6316 -6946 -10165 -14310 -15686 -10480 -1642 3449 -91 -292 5996 10019 -13291 -17131 -9652 -5692
16244 -5692 -2651 -6625 -7415 6433 6954 4909 10987 14810 7509 4371 -7186 -6688 7092 6770 15043
16229 15043 19462 21228 11097 12188 22022 18370 14424 -3439 -19855 -13858 -2612 4532 6216
16216 6216 9457 5591 8745 12131 8034 9994 9251 4145 7137 4360 -2683 4624 10771 -931 -7435
16201 -7435 55 5112 8241 -3659 -12515 -14339 -13711 -20679 -18394 212 -2953 -5060 -7963 -6421
$$ packed form
16301A4839p692j3226l432m002Q75R555P256j187k581N597o728o752P002J809
16287A333Q437q223m854K994J054K020n670p35O123K588K750o436m345N737J0143
16272A2916N166J828J5977j569j0092p183j0557j0815k887J048n343K692K503
16259f316o30l219m145j376N206Q838N091l540k01O288M023k3310l840P479L960
16244e692L041l974p90J3848N21k045O078L823p301l138j1557M98J3780l22Q273
16229A5043M419J766j0131J091R834l652l946j7863j6416N997J1246P144J684
16216F216L241l866L154L386m097J960p43n106K992k777p043P307O147j1702o504
16201g435P490N057L129j1900q856j824O28o968K285J8606l165k107k903J542
$$ plain form
16187 -6421 6077 9293 4858 -2295 -4084 -7585 852 10586 13339 196 -4247 -5861 -3478 -1623
16173 -1623 -1356 -14269 -13863 -5768 13904 6601 -6122 -11392 -12239 -8741 -2027 -4981 -7231 -4959 6648
16158 6648 12000 17615 8928 -691 -6330 -82 -4976 -211 10403 14440 20089 9012 3991 18121
16144 18121 15573 5026 -4672 -7629 -6070 3074 5553 4416 -1085 -4193 -6767 -5309 -16581 -7821
16130 -7821 -2662 -1407 -8246 -11155 -2115 -2294 -1253 -3251 -7677 6189 6693 -1125 -2602 -14540 -979
16115 -979 18616 33873 30566 11047 -11151 -17325 -22919 -22316 -16613 -1106 4566 3406 1283 -5315
16101 -5315 -13053 -12752 -12210 -5878 5093 7133 -1743 778 9705 13586 27480 26421 13140 -3804
16087 -3804 -2983 -11939 -20171 -23827 -24832 -21329 -7732 3298 5913 5941 14287 10982 4626 -8973 -15745
$$ packed form
16187f421J2498L216m435p153j789l501Q437R734K753j3143m443j614K383J855
16173a623K67j2913M06Q095J9672p303j2723n270q47L498O714k954k250K272J1607
16158F648N352N615q687r619n639O248m894M765J0614M037N649j1077n021J4130
16144A8121k548j0547r698k957J559R144K479j137n501l108k574J458j1272Q760
16130g821N159J255o839k909R040j79J041j998m426J3866N04p818j477j1938J3561
16115i79J9595J5257l307j9519k2198o174n594O03N703J5507N672j160k123o598
16101e315p738L01N42O332J0971K040q876K521Q927L881J3894j059j3281j6944
16087c804Q21q956q232l656j005L503J3597J1030K615K8Q346l305o356j3599o772
$$ plain form
16072 -15745 -5307 -676 -2223 -13880 -17538 -11388 -446 4072 6557 -1128 -13361 -15993 -11224
16059 -11224 -3325 3868 -1417 -1399 6005 2914 -6486 -3749 -18047 -22356 -22067 -18887 -20185 -21282 -22165
16044 -22165 -14261 -8952 -992 -935 1745 12800 21694 21146 241 -7408 -4449 -7041 -11694 -9195 -19841
16029 -19841 -21551 -14525 -11033 -12158 -15217 -13264 -7300 -3550 -4580 -15468 -14575 -5604 6334 7115
16015 7115 -2477 -2717 2101 5213 697 -3156 3252 4305 -2193 -14884 -23150 -6608 -1555 -15215
16001 -15215 -21994 -16138 -3422 5150 7866 5740 -545 -1302 7583 4310 -4058 826 -2093 4231
15987 4231 12561 8077 -4083 -7263 -7207 -1253 8764 4068 -7895 -4587 -425 -1537 4553 14300
15973 14300 9522 4415 -2271 -10642 -16930 -10964 -4650 -4833 -9585 -4980 3718 5616 -2476 -10569 5115
$$ packed form
16072a5745J0438M631j547j1657l658O150J0942M518K485p685j2233k632M769
16059a1224P899P193n285J8P404l091r400K737j4298m309K89L180j298j097q83
16044b2165P904N309P960N7K680J1055Q894n48k0905p649K959k592m653K499j0646
16029a9841j710P026L492j125l059J953N964L750j030j0888Q93Q971J1938P81
16015G115r592k40M818L112m516l853O408J053o498j2691q266J6542N053j3660
16001a5215o779N856J2716Q572K716k126o285p57Q885l273q368M884k919O324
15987D231Q330m484j2160l180N6N954J0017m696j1963L308M162j112O090R747
15973A4300m778n107o686q371o288N966O314j83m752M605Q698J898q092q093J5684
$$ plain form
15958 5115 12729 7870 2663 19 863 3353 -199 -10925 -3008 3379 6515 11686 19287 12368 -365
15943 -365 710 -2597 -3780 -8885 -6655 2158 -4049 -7629 -4480 3312 15961 13983 19163 17227 18943
15928 18943 10951 20412 30840 20461 13720 12808 22854 14303 4132 13284 15492 -1384 -10172
15915 -10172 -5556 314 -14457 -20757 -13218 -1298 7806 10556 4466 4331 3436 -4079 -4763 -10033 -2702
15900 -2702 -8355 -7829 10165 20100 11837 14244 13563 -2291 -4111 -4179 -568 7550 -8915 -17131 -18180
15885 -18180 -11305 -7124 -11495 8179 15475 18036 16594 11685 8468 7902 13611 3304 -4267 -1122
15871 -1122 -2105 -8586 -2008 4720 5729 -233 -41 10135 14374 7561 -8449 -12482 -3919 -5434 -4435
15856 -4435 9534 8337 6686 16939 17700 7194 -8792 -11379 -6582 -10004 -7409 -8052 -16904 -14131
$$ packed form
15958E115P614m859n207k644Q44K490l552j0726P917O387L136N171P601o919j2733
15943c65J075l307j183n105K230Q813o207l580L149P792J2649j978N180j936J716
15928A8943p992R461J0428j0379o741r12J0046q551j0171R152K208j6876q788
15915a0172M616N870j4771o300P539J1920R104K750o090j35q95p515o84n270P331
15900b702n653N26J7994R935q263K407o81j5854j820o8L611Q118j6465q216j049
15885a8180O875M181m371J9674P296K561j442m909l217n66N709j0307p571L145
15871a122r83o481O578O728J009n962J92J0176M239o813j6010m033Q563j515R99
15856d435J3969j197j651J0253P61j0506j5986k587M797l422K595o43q852K773
$$ plain form
15842 -14131 -9482 -2661 -5595 -15444 -16510 -13957 -6632 -16806 -21705 -14546 -7838 -4429 -5152 -7343
15828 -7343 -8153 -1505 10711 11632 912 -6099 -5649 -4558 -11294 -15881 -15794 -10606 -2189 -12495 -30413
15813 -30413 -23243 -15013 -12439 -12267 7459 9460 4867 14364 20854 13049 -8777 -21652 -12652 -12738
15799 -12738 -20826 -19234 -8846 2200 -4656 -4930 3766 6294 -295 -8855 -3943 -6061 279 10897
15785 10897 13432 8110 6413 4124 -3597 -9843 -7863 -7428 -5870 10155 3583 -11617 -17330 -10574
15771 -10574 -8284 3285 3228 1929 -3721 98 6481 3254 -256 -6533 -2112 -1719 -8378 -15055 -9840
15756 -9840 -9062 -2710 -1812 -1477 7572 -294 -551 -1173 -12188 -21733 -26297 -25349 -15566 -22788 -32647 -31961
15740 -31961 -31507 -26107 -24131 -18144 -5261 590 -7644 -8434 8745 13186 11476 2434 3336 7970 5683
$$ packed form
15842a4131M649O821k934r849j066K553P325j0174m899P159O708L409p23k191
15828g343q10O648J2216R21j0720p011M50J091o736m587Q7N188Q417j0306j7918
15813c0413P170Q230K574J72J9726K001m593R497O490p805k1826j2875R000q6
15799a2738q088J592J0388J1046o856k74Q696K528o589q560M912k118O340J0618
15785A0897K535n322j697k289p721o246J980M35J558J6025o572j5200n713O756
15771a0574K290J1569n7j299n650L819O383l227l510o277M421L93o659o677N215
15756i840P78O352Q98L35R049p866k57o22j1015r545m564R48R783p222r859O86
15740c1961M54N400J976N987J2883N851q234p90J7179M441j710r042R02M634k287
$$ plain form
15725 5683 -220 -1697 -1834 -397 -1819 -10850 -11844 -9712 -9335 -25669 -31220 -26543 -15408 -3731 -4989
15710 -4989 3073 7206 2246 1481 -4850 -4527 -7049 -20678 -13092 -10291 -13975 -1575 -125 -8995 -8952
15695 -8952 2187 13009 9424 9771 16178 11345 6831 10761 5025 -1770 2245 4478 3053 2345 1233
15680 1233 2746 12118 15206 19286 13482 770 -1590 5424 7942 -7015 -11727 -11500 4080 12348
15666 12348 1738 -4293 1648 5027 11284 3711 2637 -2460 -14215 -18607 -14083 -13897 -12353 -19161
15652 -19161 -18333 -9024 -6399 -4062 -189 -6787 -5229 -4402 -4884 5655 6117 -8420 -17430 -16200 -6791
15637 -6791 -1646 -2787 3068 6728 -4518 -4045 2041 827 -3222 -16390 -11295 -11871 -5127 -580 6026
15622 6026 13646 8311 5068 8012 4752 6989 8921 1192 865 649 7602 5882 -2925 -9984 -22633
$$ packed form
15725E683n903j477j37J437j422r031r94K132L77j6334n551M677J1135J1677j258
15710d989Q062M133m960p65o331L23k522j3629P586K801l684J2400J450q870M3
15695h952J1139J0822l585L47O407m833m514L930n736o795M015K233j425p08j112
15680A233J513R372L088M080n804j2712k360P014K518j4957m712K27J5580Q268
15666A2348j0610o031N941L379O257p573j074n097j1755m392M524J86J544o808
15652a9161Q28R309K625K337L873o598J558Q27m82J0539M62j4537r010J230R409
15637f791N145j141N855L660j1246M73O086j214m049j3168N095n76O744M547O606
15622F026P620n335l243K944l260K237J932p729l27k16O953j720q807p059j2649
$$ plain form
15607 -22633 -20459 -13262 -15778 -5132 -4785 -10611 -10874 4465 8905 -3954 -13518 1350 9292 -5895
15593 -5895 -19420 -14860 -4587 599 -1078 2586 9278 8100 9102 1900 -6145 -10628 -2974 -5369
15579 -5369 -9021 -4085 940 -1223 4067 14812 8608 3994 4823 156 2006 13529 14792 10458
15565 10458 17843 20072 6822 1566 2300 2275 2178 10861 -8475 -34598 -44147 -32403 -15344 6949
15551 6949 15833 6648 -379 -2025 -5627 -11569 -6566 -13338 -19379 -12235 -2234 5510 2276 3547
15537 3547 7389 -4648 -10815 347 5606 5435 6210 2767 -7494 1795 7694 6688 3544 -8232
15523 -8232 -13575 -12092 -6214 4088 3414 7628 10948 6984 -5288 -4304 -2163 -588 4607 2736 -3577
15508 -3577 -10269 -2594 8215 5821 1455 -8079 -12027 -14585 -11128 -2065 -556 -3979 -7784 -5420
$$ packed form
15607b2633K174P197k516J0646L47n826k63J5339M440j2859r564J4868P942j5187
15593e895j3525M560J0273N186j677L664O692j178J002p202q045m483P654k395
15579e369l652M936N025k163N290J0745o204m614Q29m667J850J1523J263m334
15565A0458P385K229j3250n256P34k5r7Q683j9336k6123r549J1744J7059K2293
15551F949Q884r185p027j646l602n942N003o772o041P144J0001P744l234J271
15537C547L842j2037o167J1162N259j71P75l443j0261R289N899j006l144j1776
15523h232n343J483N878J0302o74M214L320l964j2272R84K141J575N195j871o313
15508c577o692P675J0809k394m366r534l948k558L457R063J509l423l805K364
$$ plain form
15494 -5420 -10883 -5022 3348 8564 5048 -812 -9102 -13140 -18540 -20704 -21587 -14324 -10034 -8921 -13713
15479 -13713 -8318 -1215 5731 -3907 2417 7673 14283 7952 4098 8310 -7096 -11328 -3350 414
15465 414 1671 1377 14807 12943 -287 -10866 -6015 10249 12913 5751 -1992 -6478 -7417 -4984
15451 -4984 -15825 -14095 -14974 -9859 1554 8831 23020 32336 32928 16773 10376 9497 13812 20189
15437 20189 23503 13580 -1081 -9055 -5547 -9641 -31183 -40717 -24453 -17413 -18876 -16208 -19561 -15426
15423 -15426 -26636 -22521 -12403 -7330 -10492 -12073 -13858 -6910 4714 6634 3739 -1229 -3761 -4173
15409 -4173 -10067 -13391 -16037 -23149 -20556 -19084 -18562 -19324 -15534 -12446 -8097 -5781 101 3112 3725
15394 3725 -6670 -5863 8693 22857 11989 -1108 -5112 -17365 -20188 -16085 -11697 -14791 -26802
$$ packed form
15494e420n463N861Q370N216l516n860q290m038n400k164q83P263M290J113m792
15479a3713N395P103O946r638O324N256O610o331l854M212j5406m232P978L764
15465D14J257k94J3430j864j3230j0579M851J6264K664p162p743m486r39K433
15451d984j0841J730q79N115J1413P277J4189R316N92j6155o397q79M315O377
15437B0189L314r923j4661p974L508m094k1542r534J6264P040j463K668l353M135
15423a5426j1210M115J0118N073l162j581j785O948J1624J920k895m968k532m12
15409d173n894l324k646p112K593J472N22p62L790L088M349K316N882L011O13
15394C725j0395Q07J4556J4164j0868j3097m004j2253k823M103M388l094j2011
$$ plain form
15381 -26802 -26340 -18830 -9354 4741 1938 4423 7099 3451 3056 3885 9248 14338 7176 -3248 -2064
15366 -2064 757 7589 14415 21970 11557 7144 4593 7476 -567 -12521 -14259 -22718 -21570 -25893
15352 -25893 -9047 6496 525 -5133 811 -8220 -8239 -2588 -4032 -6613 -13441 -13171 -2524 -12414
15338 -12414 -11942 -8676 -4707 -2966 -9386 -8646 -5226 -7254 -7574 -9744 -6120 -5062 -13385 -7509 -3660
15323 -3660 -3819 277 2563 -3858 5688 5414 -11100 -8862 -654 -11848 -21780 -29844 -36843 -26458
15309 -26458 -7071 -2082 436 1373 -10450 -27234 -25094 -16758 -2980 2520 17352 19973 4323
15296 4323 -4834 -15028 -8011 2257 -1867 2178 7582 9024 10385 -1610 -13706 -17023 -13500 -275
15282 -275 9658 1670 916 3938 1631 -5096 -13667 2788 9309 8510 10213 6127 -3240 -15072 -11733
$$ packed form
15381b6802M62P510R476J4095k803K485K676l648l95Q29N363N090p162j0424J184
15366b064K821O832O826P555j0413m413k551K883q043j1954j738q459J148m323
15352b5893J6846J5543n971n658N944r031j9N651j444k581o828K70J0647r890
15338a2414M72L266L969J741o420P40L420k028l20k170L624J058q323N876L849
15323c660j59M096K286o421R546k74j6514K238Q208j1194r932q064o999J0385
15309b6458J9387M989K518R37j1823j6784K140Q336J3778N500J4832K621j5650
15296D323r157j0194P017J0268m124M045N404J442J361j1995j2096l317L523J3225
15282b75R933p988p54L022k307o727q571J6455O521p99J703m086r367j1832L339
$$ plain form
15267 -11733 -16152 -10378 -3536 8195 19872 11649 5413 2276 1458 309 4519 4800 -165 -613 2990
15252 2990 10229 16634 9464 -1521 -6392 1061 7815 3281 -2966 -10757 -12970 -11161 -17055 -14502
15238 -14502 -8106 -15683 -13981 -15694 -19557 -27776 -22653 -13499 -3471 -17378 -24184 -14436 -3378 -4548
15224 -4548 -5257 -13626 -15749 -6851 -8427 -15172 -13552 -3491 -34 764 5160 3899 -7214 -9972 -1295
15209 -1295 -3511 1430 3093 -3986 -4628 5004 -1770 -13599 -6125 8670 17581 4082 4648 4315 -3072
15194 -3072 -4271 6032 10073 8165 5428 -4564 -6566 -2254 -93 1924 2932 190 -4243 -9018
15180 -9018 -9537 -12980 -15479 -6609 1542 6232 2412 401 2383 5144 17523 19916 8595 12625
15166 12625 11091 7105 340 -8721 -19375 -16314 -14259 -18321 -9739 2800 8120 5302 8770 13784
$$ packed form
15267a1733m419N774O842J1731J1677q223o236l137q18j149M210K81m965m48L603
15252B990P239O405p170j0985m871P453O754m534o247p791k213J809n894K553
15238a4502O396p577J702j713l863q219N123R154J0028j3907o806R748J1058j170
15224d548p09q369k123Q898j576o745J620J0061L457P98M396j261j1113k758Q677
15209a295k216M941J663p079o42R632o774j1829P474J4795Q911j3499N66l33p387
15194c072j199J0303M041j908k737r992k002M312K161K017J008k742m433m775
15180i018n19l443k499Q870Q151M690l820k011J982K761J2379K393j1321M030
15166A2625j534l986o765r061j0654L061K055m062Q582J2539N320k818L468N014
$$ plain form
15152 13784 12186 9309 59 -21918 -18604 -2423 -6644 -6266 -3673 -6502 6248 -4641 -10520 2078
15138 2078 5963 -9116 -9121 -7560 -1044 -1890 809 2486 5139 17752 23932 17449 5070 2525 -2507
15123 -2507 9346 20327 24923 30949 33415 37093 25590 22994 7516 -191 -6822 -9032 -17326 -24258
15109 -24258 -7612 -8576 -8883 -7733 -9304 -14768 -22636 -24470 -15114 -17945 -17623 -15032 -15008 -1630 3007
15094 3007 -2988 -4693 -4112 -4729 -106 57 -4818 -723 2713 -4954 2483 12745 10889 11435 2746
15079 2746 -4262 10840 10588 8948 10727 9541 6728 5729 1323 -920 -3061 -603 -5376 -9142 -9209
15064 -9209 -7980 -6240 -6039 -4937 -4774 -436 -1056 4195 5811 5024 9836 19893 15000 6518 -9995
15049 -9995 -1712 -1131 -6563 10697 9775 898 8841 8531 -3252 -9103 -7634 -2336 -2021 1989 -5395
$$ packed form
15152A3784j598k877r250k1977L314J6181m221L78K593k829J2750j0889n879J2598
15138B078L885j5079nJ561O516q46K699J677K653J2613O180o483j2379k545n032
15123b507J1853J0981M596O026K466L678j1503k596j5478p707o631k210q294o932
15109b4258J6646r64l07J150j571n464p868j834R356k831L22K591K4J3378M637
15094C007n995j705N81o17M623J63m875M095L436p667P437J0262j856N46q689
15079B746p008J5102k52j640J779j186k813r99m406k243k141K458m773l766o7
15064i209J229J740K01J102J63M338o20N251J616p87M812J0057m893q482j6513
15049i995Q283N81n432J7260r22q877P943l10j1783n851J469N298L15M010p384
$$ plain form
15034 -5395 -20550 -23098 -22724 -15743 -9532 -3184 5702 6391 9875 15877 9044 -6488 -1999 11367
15020 11367 8310 2144 -2291 1139 -1087 1200 413 -3322 -4387 -4973 -7761 -7992 -4047 -838 -78
15005 -78 -269 -9707 4197 16672 -3856 -13615 -6560 5892 10889 7157 10313 7282 -8723 -28632
14991 -28632 -25950 -23940 -25345 -20307 -13126 -8381 -8645 -1479 1588 2839 9480 -1420 -1017 -2025 -13745
14976 -13745 -18159 -17811 -12693 -5763 -6826 -14309 -4980 3443 6607 8112 -791 -12154 -13217 -17527
14962 -17527 -17878 -1557 2967 15438 12558 18882 16494 4457 516 2504 1910 2887 6544 2598
14948 2598 -10065 -1019 -844 -12982 -14257 -17278 -12771 -13787 -8589 -5479 -9546 -2735 -2349 -6321 -3499
14933 -3499 3172 -5143 -9976 -6564 -10474 -11137 9762 15751 15881 15655 8067 840 14971 17778 24087
$$ packed form
15034e395j5155k548L74O981O211O348Q886O89L484O002o833j5532M489J3366
15020A1367l057o166m435L430k226K287p87l735j065n86k788k31L945L209P60
15005g8j91r438J3904J2475k0528r759P055J2452M997l732L156l031j6005j9909
14991b8632K682K010j405N038P181M745k64P166L067J251O641j0900M03j008j1720
14976a3745m414L48N118O930j063p483R329Q423L164J505q903j1363j063m310
14962a7527l51J6321M524J2471k880O324k388j2037l941J988n94R77L657l946
14948B598j2663R046J75j2138j275l021M507j016N198L110m067O811L86l972K822
14933c499O671q315m833L412l910o63K0899N989J30k26p588p227J4131K807O309
$$ plain form
14918 24087 22122 13339 12859 3442 -9951 -5281 -3710 -12834 -13647 -20578 -23654 -10733 5438 16523
14904 16523 15751 -1034 -10755 -5460 6506 8680 1596 -5849 -3021 4869 2292 -1936 -7644 -17210
14890 -17210 -26621 -20114 -8307 -5325 -14607 -11728 6677 14897 11292 1550 -2303 -4845 -8069 -16545
14876 -16545 -28271 -15873 3917 11043 2493 -9959 -19209 -22839 -23439 -20100 -19258 -18164 -15197 -11801
14862 -11801 -10265 -345 -969 -1002 -7242 -13913 -12987 -12759 -12830 -1902 5133 9254 13097 6312 10372 12855
14846 12855 -5236 -14497 -5984 -4363 449 -2549 -8337 -3106 -7359 -4987 368 -6539 -13495 -3890
14832 -3890 -7133 -23246 -18859 -6334 5321 -4156 -5084 2745 -4935 -7331 -4608 -7289 -6762 -2452
14818 -2452 5929 2448 -2425 -6076 554 8990 9343 5433 5910 -12241 -17674 -20563 -19952 -15617 -17582
$$ packed form
14918B4087j965q783m80r417j3393M670J571r124q13o931l076J2921J6171J1085
14904A6523p72j6785r721N295J1966K174p084p445K828P890k577m228n708r566
14890a7210r411O507J1807K982r282K879J8405Q220l605r742l853k542l224q476
14876a6545j1726J2398J9790P126q550j2452r250l630o00L339Q42J094K967L396
14862a1801J536R920o24l3o240o671R26K28p1J0928P035M121L843o785M060K483
14846A2855j8091r261Q513J621M812k998n788N231m253K372N355o907o956R605
14832c890l243j6113M387J2525J1655r477r28P829p680k396K723k681N27M310
14818b452Q381l481m873l651O630Q436L53l910M77j8151n433k889O11M335j965
$$ plain form
14803 -17582 -22110 -14665 853 372 -6498 -13010 -10955 -9820 -5752 -6849 -10666 -4162 6960 11771
14789 11771 16619 11988 -1655 -7758 -7191 -1698 8265 1788 3830 -4552 -14860 -19280 -14998 -7810
14775 -7810 -6747 -7235 -7600 -11533 -9554 -7203 -5582 -10211 -9297 -504 -8581 -14553 -13484 -8548 -2862
14760 -2862 5968 1414 -5916 -5623 -1619 2346 1261 -8867 -19348 -12019 2500 8488 3019 1668
14746 1668 3713 -1580 -15390 -16913 -5430 14082 13152 7261 46 2378 659 -5419 -22933 -36407
14732 -36407 -27938 -23670 -24974 -18803 -11502 -13743 -10890 -14739 -12555 694 6475 1883 -10256 -17949
14718 -17949 -11738 -17198 -15184 -6498 -3760 4780 -2998 -7033 -6640 -103 15836 20143 15904 10377
14704 10377 -5516 -15375 -8761 974 -1458 -4656 -14893 -20938 -13784 1400 -3018 -8084 -16 2493
$$ packed form
14803a7582m528P445J5518m81o870o512K055J135M068j097l817O504J1122M811
14789A1771M848m631j3643o103N67N493R963o477K042q382j0308m420M282P188
14775g810J063m88l65l933J979K351J621m629R14Q793q077n972J069M936N686
14760b862Q830m554p330K93M004L965j085j0128j0481P329J4519N988n469j351
14746A668K045n293j3810j523J1483J9512r30n891p215K332j719o078j7514j3474
14732c6407Q469M268j304O171P301k241K853l849K184J3249N781m592j2139p693
14718a7949O211n460K014Q686K738Q540p778m035L93O537J5939M307m239n527
14704A0377j5893r859O614R735k432l198j0237o045P154J5184m418n066Q068K509
$$ plain form
14690 2493 3334 8392 14705 21257 14753 1143 -2329 4151 1930 5354 3067 -11484 -28405 -25365
14676 -25365 -9357 -12268 -21545 -20508 -11347 1436 5313 -3303 -17491 -2475 -1649 -7097 -8109 -15870
14662 -15870 -14814 -10492 -7545 6765 3919 7581 6255 1318 4398 12270 6434 -7698 -6136 -5808
14648 -5808 -20337 -25950 -6131 2016 -4824 -17501 -28645 -25749 -28241 -31089 -25218 -24689 -23327 -24417
14634 -24417 -28961 -20868 -18592 -5272 11401 22045 15249 -662 -19231 -25179 -14173 657 -2299
14621 -2299 -6308 371 13584 12139 5383 2642 -10093 -7325 -518 -8296 -8111 -12304 -17727 -15902
14607 -15902 -2426 6087 6023 -187 10035 15497 10616 10669 14662 10461 7177 6125 6019 -5912 -5753
14592 -5753 -4522 2012 6046 178 -13707 -16796 -11885 -9217 -2758 -6855 -10177 -7249 -1033 610
$$ packed form
14690B493Q41N058O313O552o504j3610l472O480k221L424k287j4551j6921L040
14676b5365J6008k911r277J037R161J2783L877q616j4188J5016Q26n448j012p761
14662a5870J056M322K947J4310k846L662j326m937L080P872n836j4132J562L28
14648e808j4529n613J9819Q147o840j2677j1144K896k492k848N871N29J362j090
14634b4417m544Q093K276J3320J6673J0644o796j5911j8569n948J1006J4830k956
14621b299m009O679J3213j445o756k741j2735K768O807p778J85m193n423J825
14607a5902J3476Q513o4o210J0222N462m881N3L993m201l284j052j06j1931J59
14592e753J231O534M034n868j3885l089M911K668O459m097l322K928O216J643
$$ plain form
14578 610 11843 4461 1120 -5516 -13701 -17483 -17750 -6751 1535 7395 -1064 -5646 -5232 -3221 6633
14563 6633 5694 -2790 -11852 -11379 -5187 -2272 1771 7974 27484 30253 14287 10640 19052 19299 12538
14548 12538 4488 3295 6492 8378 -292 -4696 3329 1213 7477 3365 -3257 -16239 -12915 4670
14534 4670 9587 14761 1498 481 3168 -3354 2188 3022 11794 22177 21482 13192 8722 5929 5583
14519 5583 860 876 -592 -9703 -17294 -5463 6816 -2070 -6806 -5958 -8865 -13421 -6326 -295 -12608
14504 -12608 -14813 311 13511 9403 6321 6447 12188 12320 6580 5199 2725 -5118 -5402 -3022 -1308
14489 -1308 -4591 -4118 -3349 -3570 -7285 -2600 -2225 8056 6534 4607 8369 9861 8589 2136 3163
14474 3163 6686 4843 -2046 -3976 -2261 -6919 -4228 -2530 7579 -4801 -4926 -11842 -2944 -1092
$$ packed form
14578F10J1233p382l341o636q185l782k67J0999Q286N860q459m582M14K011R854
14563F633r39q484r062M73O192K915M043O203J9510K769j5966l647Q412K47o761
14548A2538q050j193L197J886q670m404Q025k116O264m112o622j2982L324J7585
14534D670M917N174j3263j017K687o522N542Q34Q772J0383o95q290m470k793l46
14519E583m723J6j468r111p591J1831J2279q886m736Q48k907m556P095O031j2313
14504a2608k205J5124J3200m108l082J26N741J32n740j381k474p843k84K380J714
14489a308l283M73P69k21l715M685L75J0281j522j927L762J492j272o453J027
14474C163L523j843o889j930J715m658K691J698J0109j2380j25o916Q898J852
$$ plain form
14460 -1092 1117 -3362 -7727 808 10963 12593 8646 4456 10315 15687 6264 -4534 -15595 -5637
14446 -5637 10486 12129 11555 6000 5651 3696 5788 9022 12071 8836 9451 -971 -8126 1078 2442
14431 2442 -8415 -19374 -15903 -11955 -11819 -7769 -8487 -11422 2698 3894 -10693 -3562 50 -732
14417 -732 -5277 -8180 -4438 2969 11182 8499 12491 12473 7741 11529 14063 14762 19858 21217 16640 -288
14401 -288 -9677 -7142 -13439 -17843 -11381 -12619 -10130 -15826 -20965 -19110 -20168 -15424 -17728 -20262 -13874
14386 -13874 331 -7247 -5166 2158 -8220 -16772 -13195 1334 4904 -1127 1271 92 -534 4688
14372 4688 8561 -561 -6087 -17431 -17326 -13366 -3850 -950 5232 9120 10505 5084 -2614 -3336 2827
14357 2827 4022 -2552 -2743 437 -4291 -695 13016 19576 10581 10368 7967 52 6800 10622 12438
$$ packed form
14460a092K209m479m365Q535J0155J630l947m190N859N372r423j0798j1061R958
14446e637J6123J643n74n555l49j955K092L234L049l235O15j0422p155R204J364
14431B442j0857j0959L471L948J36M050p18k935J4120J196j4587P131L612p82
14417g32m545k903L742P407Q213k683L992j8m732L788K534O99N096J359m577j6928
14401b88r389K535o297m404O462j238K489n696n139J855j058M744k304k534O388
14386a3874J4205p578K081P324j0378q552L577J4529L570o031K398j179o26N222
14372D688L873r122n526j1344J05L960R516K900O182L888J385n421p698p22O163
14357B827J195o574j91L180m728L596J3711O560q995k13k401p915O748L822J816
$$ plain form
14342 12438 21147 24383 29384 28438 16429 -2299 -15824 -12409 3450 19356 7764 -350 -4491
14329 -4491 -3480 -5276 -14473 -10834 4126 4580 -3302 9779 12850 8904 2991 11828 8990 964
14315 964 -15424 -13239 -8318 1590 11930 5608 803 -6280 -7920 -7214 8242 18259 5806 -8687
14301 -8687 -15837 -5538 -2367 -4836 -2495 -397 -6369 3003 11523 19220 15930 13324 21302 22372
14287 22372 12768 621 6052 11819 5720 5348 2937 -3993 2395 5373 3712 -3276 -6880 4068
14273 4068 9499 22 -16984 -21016 -15330 -13957 -9076 -1347 -5218 -4428 -174 -2681 -6390 -8258 -1641
14258 -1641 8540 10962 13398 6654 3121 3872 -3825 -5224 -13969 -13123 -13698 -19241 -18770 -5584 3063
14243 3063 12346 22636 16263 11237 16853 8927 1826 2982 -4098 -13599 -17464 -23587 -10923 -936
$$ packed form
14342A2438Q709L236N001r46j2009j8728j3525L415J5859J5906j1592q114m141
14329d491J011j796r197L639J4960M54p882J3081L071l946n913Q837k838q026
14315I64j6388K185M921R908J0340o322m805p083j640P06J5456J0017j2453j4493
14301h687p150J0299L171k469K341K098n972R372Q520P697l290k606P978J070
14287B2372r604j2147N431N767o099l72k411o930O388K978j661o988l604J0948
14273D068N431r477j7006m032N686J373M881P729l871P90M254k507l709j868O617
14258a641J0181K422K436o744l533P51p697j399q745Q46n75n543M71J3186Q647
14243C063R283J0290o373n026N616p926p101J156p080r501l865o123J2664R987
$$ plain form
14229 -936 -4598 -4242 -2202 385 -2409 -2981 -7666 3553 6094 5222 1483 5799 8220 8637 5643 -4671
14213 -4671 -16462 -10262 -11384 -7434 -6347 -9090 3701 8571 16920 13010 9805 12117 7363 953
14199 953 5312 -346 -9323 296 13407 13114 19586 10335 -7435 -16527 -11001 -13968 -12670 -13933 -19151
14184 -19151 -14268 -10376 -10173 4213 -1377 -16211 -17241 -6537 -7786 -8932 -3601 -1037 -8751 -1832
14170 -1832 1947 -2443 -6678 -7740 -8569 329 8137 -2447 -6783 -13902 -15280 -12655 -2044 13048
14156 13048 12621 14518 17558 12709 4340 1915 -1348 5216 3292 -632 -7905 -8981 -6442 -9763 -18225
14141 -18225 -12498 -2989 2960 8507 4209 -1183 -2041 7189 6070 9415 21022 14572 14180 6834 12110
14126 12110 14014 4295 4027 3207 9164 9284 -1332 -5143 -1947 -7121 -10005 6675 11932 11037 7539
$$ packed form
14229i36l662L56K040K587k794n72m685J1219K541q72l739M316K421M17k994j0314
14213d671j1791O200j122L950J087k743J2791M870Q349l910l205K312m754o410
14199I53M359n658q977R619J3111k93O472r251j7770r092N526k967J298j263n218
14184a9151M883L892K03J4386n590j4834j030J0704j249j146N331K564p714O919
14170a832L779m390m235j062q29Q898P808j0584m336p119j378K625J0611J5092
14156A3048m27J897L040m849q369k425l263O564j924l924p273j076K539l321q462
14141a8225N727R509N949N547m298n392q58R230j119L345J1607o450l92p346N276
14126A2110J904r719k68q20N957J20j0616l811L196n174k884J6680N257q95l498
$$ plain form
14111 7539 9282 8818 15272 3831 -6205 -19002 -10175 -1511 -2478 -3840 -2162 1929 -7548 4380
14097 4380 13707 5212 8260 4647 -3132 -2019 734 3421 4425 155 2711 3657 -3187 -18288 -21339
14082 -21339 -25693 -17998 -550 13262 10362 2263 -6635 -5761 1564 3172 -6929 -5316 -2922 -3448
14068 -3448 2053 8477 10471 7232 6704 12515 7255 3324 -5914 -12390 -14859 -12165 -2655 -5095 -11106
14053 -11106 -7015 -12942 -22905 -17283 -16306 -16033 -11704 -13230 -16819 -14199 -9553 4052 3969 13204 23341
14038 23341 13428 9353 3272 1565 2142 3976 1251 2369 12702 10778 6007 8386 9490 1107
14024 1107 -340 2675 12084 17550 14281 6130 4542 6103 4375 6140 6230 9006 26854 23380 11731
14009 11731 12342 18625 14663 14207 17795 15005 11735 6423 1271 -407 -10043 -9417 -7409 -11285 -20275
$$ packed form
14111G539J743m64O454j1441j0036j2797Q827Q664r67j362J678M091r477J1928
14097D380R327q495L048l613p779J113K753K687J004m270K556R46o844j5101l051
14082b1339m354P695J7448J3812k900q099q898Q74P325J608j0101J613K394n26
14068c448N501O424J994l239n28N811n260l931r238o476k469K694R510k440o011
14053a1106M091n927r963N622R77K73M329j526l589K620M646J3605q3R235J0137
14038B3341r913m075o081j707N77J834k725J118J0333j924m771K379J104q383
14024A107j447L015R409N466l269q151j588J561j728J765R0K776J7848l474j1649
14009A1731O11O283l962m56L588k790l270n312n152j678r636O26K008l876q990
$$ plain form
13994 -20275 -29514 -30043 -26518 -32142 -22803 -12520 -7719 -6823 -11082 -2883 5685 -2895 -12326 -7897 -4070
13979 -4070 -6966 -7556 3613 7293 981 -6703 -9296 -9188 -5053 -7661 1717 2087 797 811 5792 4803
13963 4803 7937 -1003 726 8034 -184 -3653 124 5538 -8892 -15241 -6370 6646 1892 -3679
13949 -3679 -2795 8335 13829 16178 3670 5007 -2305 -3046 -9271 -17487 -3938 13008 10825 -2732
13935 -2732 -5549 -8238 -9967 -6421 -11241 -13440 -15098 407 7347 1686 6467 11573 -1618 -2244
13921 -2244 -773 -10427 -8936 -4068 -10896 -11037 -8000 -12575 -11672 -7165 -17184 -19695 -5149 -12662 -25740
13906 -25740 -29068 -27481 -16694 -4236 -11479 -8559 -636 -7488 -10113 -16398 -8097 -282 -156 -2391
13892 -2391 -5779 -12075 -12029 -11915 -8629 -261 -1412 -4656 -6232 -7076 -6331 -17970 -22992 -16365 -9466 -2487
$$ packed form
13994b0275r239n29L525n624R339J0283M801Q96m259Q199Q568q580r431M429L827
13979d070k896n90J1169L680o312p684k593J08M135k608R378L70j290J4M981r89
13963D803L134q940J729P308q218l469L777N414j4430o349Q871J3016m754n571
13949c679Q84J1130N494K349j2508J337p312p41o225q216J3549J6946k183j3557
13935b732k817k689j729L546m820k199j658J5505O940n661M781N106j3191o26
13921b244J471r654J491M868o828j41L037m575R03M507j0019k511J4546p513j3078
13906b5740l328J587J0787J2458p243K920P923o852k625o285Q301P815J26k235
13892b391l388o296M6J14L286Q368j151l244j576q44P45j1639n022O627O899O979
$$ plain form
13876 -2487 -2361 -1520 -4535 -4785 -3918 2986 16523 13606 858 -319 3890 5488 15251 10489 -5790
13861 -5790 -9994 -10291 -8651 2576 5795 14482 7937 17657 23821 19271 16379 12879 19713 17997 6413
13846 6413 -2009 -5275 -99 3784 9316 15524 14510 5907 -8370 -20908 -11006 -6299 -4400 -785
13832 -785 -2356 5343 10044 12942 8453 2328 13783 21150 21775 3003 -14114 -6294 -2172 -2757 -13604
13817 -13604 -24525 -17504 -7828 -2507 -2522 -5506 327 -131 9066 8998 5754 665 -5429 3249 10289
13802 10289 -2165 -18266 -18684 -16804 -12764 -10345 -17026 -3847 4421 4966 461 -3338 4067 12192
13788 12192 9352 343 -4026 -5336 -14961 -18246 -18126 -11935 -9867 -6940 -8886 -16160 -18767 -16354 -9291
13773 -9291 1001 -1852 5954 14246 12295 5207 12334 19141 9170 11170 8288 7860 10439 8647 9919
$$ packed form
13876b487J26Q41l015k50Q67O904J3537k917j2748j177M209J598R763m762j6279
13861e790m204k97J640J1227L219Q687o545R720O164m550k892l500O834j716j1584
13846F413q422l266N176L883N532O208j014q603j4277j2538R902M707J899L615
13832g85j571P699M701K898m489o125J1455P367O25j8772j7117P820M122n85j0847
13817a3604j0921P021R676N321j5k984N833m58R197o8l244n089o094Q678P040
13802A0289j2454j6101m18J880M040K419o681J3179Q268N45m505l799P405Q125
13788A2192k840r009m369j310r625l285J20O191K068K927j946p274k607K413P063
13773i291J0292k853P806Q292j951p088P127O807r971K000k882m28K579j792J272
$$ plain form
13758 9919 6275 5478 12518 9003 7725 6956 2974 5090 671 -4628 -3498 -10376 -7416 -8823 -8637
13743 -8637 -6923 6096 14645 18888 13050 1057 5454 7547 10449 1244 4239 833 5643 20138
13729 20138 16173 16073 10981 8722 2238 -6046 -1732 2500 7880 8605 4295 7356 9280 10663 7691
13714 7691 390 3766 742 4039 1591 -15265 -4103 -8992 -15299 -27586 -26632 -17779 -14531 -20
13700 -20 260 2974 2449 13764 14203 10970 6741 10363 6581 3548 -6133 -1101 -6550 -14999 -16137 -8974
13684 -8974 -9968 -6695 -1170 964 6696 -258 4682 -5763 -10134 551 1177 2510 1001 -8825 -548
13669 -548 2204 5469 -5831 -5767 -8275 -10053 -3417 -3969 -1681 -3199 1012 3510 3775 11942 11498 -3578
13653 -3578 -12190 -47 8339 3421 1282 -3514 -4694 135 487 -3721 -711 7595 2081 -238 -3948
$$ packed form
13758I919l644p97P040l515j278p69l982K116m419n299J130o878K960j407J86
13743h637J714J3019Q549M243n838j1993M397K093K902r205K995l406M810J4495
13729B0138l965j00n092k259o484q284M314M232N380P25m310L061J924J383k972
13714G691p301L376l024L297k448j6856J1162m889o307j2287R54Q853L248J4511
13700b0K80K714n25J1315M39l233m229L622l782l033r681N032n449q449j138P163
13684h974r94L273N525K134N732o954M940j0445m371J0685O26J333j509r826Q277
13669e48K752L265j1300O4k508j778O636n52K288j518M211K498K65Q167m44j5076
13653c578q612J2143Q386m918k139m796j180M829L52m208L010Q306n514k319l710
$$ plain form
13638 -3948 -8866 -10481 -3949 -1125 -2470 -5387 -13236 -4218 -2042 -3384 -13037 1511 15739 9005
13624 9005 -8585 -12958 -8635 -15131 -23558 -27661 -11506 -12608 -10483 -3515 -805 -15195 -22560 -15976
13610 -15976 -14315 -2154 10795 5942 -1671 -10573 -13138 -11805 4453 11407 15634 19856 16985 26406
13596 26406 33097 32243 23258 12181 -1066 -5373 -11374 -16444 -16768 -16185 -9341 -1773 3914 7560 7704
13581 7704 9708 17251 23719 12855 3756 8702 14346 14575 12544 -5337 -19252 -7535 11997 12245
13567 12245 880 445 8796 7248 -6186 -6448 3260 5374 13223 9051 4893 1266 6826 12274
13553 12274 10255 10722 7901 2288 1698 -1553 -14138 -13038 -2174 -7452 -9947 -6554 68 312 -3238
13538 -3238 3438 -5331 -10958 -20399 -18453 -13131 -8315 -10361 -159 6304 9946 10951 4832 -51
$$ packed form
13638c948m918j615O532K824j345k917p849R018K176j342r653J4548J4228o734
13624I005j7590m373M323o496q427m103J6155j102K125O968K710j4390p365O584
13610a5976J661J2161J2949m853p613q902k565J333J6258O954M227M222k871R421
13596B6406O691q54q985j1077j3247m307o001n070l24N83O844P568N687L646J44
13581G704K004P543O468j0864r099M946N644K29k031j7881j3915J1717J9532K48
13567A2245j1365m35Q351j548j3434k62R708K114P849m172m158l627N560N448
13553A2274k019M67k821n613n90l251j2585J100J0864n278k495L393O622K44l550
13538c238O676q769n627r441J946N322M816k046J0202O463L642J005o119m883
$$ plain form
13524 -51 -12442 -16973 -15483 -11732 -13231 -1476 320 -8881 -8188 1195 11437 14010 8742 9552 8253
13509 8253 14408 19224 15424 16773 20970 13887 3119 -221 -4827 -3697 -4217 -2843 -2081 -11113 -9912
13494 -9912 -2929 -12108 -16787 -7977 5973 3574 -5523 -10337 -10347 -7708 -1526 -8140 -7657 -6834 -8206
13479 -8206 -7591 -9425 -3298 -4943 -6057 8797 9904 8869 5004 -8579 -17155 -13528 -10851 -13279
13465 -13279 6686 11805 2000 5123 9892 16587 7099 7740 11689 7498 1293 16177 23958 13873
13451 13873 15505 11751 9783 10834 7141 4794 4337 7927 15328 19051 13837 10843 13417 14533 15356
13436 15356 12813 6186 -3807 -279 -1660 -8103 584 7415 7013 2444 -5744 -17694 -24031 -9425
13422 -9425 5234 15891 16752 12811 5756 2412 2216 -1724 -527 6878 4869 2482 -1410 -5308 -3431
$$ packed form
13524e1j2391m531J490L751j499J1755J796r201O93R383J0242K573n268Q10j299
13509H253O155M816l800J349M197p083j0768l340m606J130n20J374P62r032J201
13494i912O983r179m679Q810J3950k399r097m814j0K639O182o614M83Q23j372
13479h206O15j834O127j645j114J4854J107j035l865j3583q576L627K677k428
13465a3279J9965N119r805L123M769O695r488O41L949m191o205J4884P781j0085
13451A3873J632l754j968J051l693k347m57L590P401L723n214k994K574J116Q23
13436A5356k543o627r993L528j381o443Q687O831m02m569q188j1950o337J4606
13422i425J4659J0657Q61l941p055l344j96l940J197P405k009k387l892l898J877
$$ plain form
13407 -3431 -7005 -12542 -13654 -5038 -1679 5848 15740 7892 7159 7589 -1769 -9137 -4297 -5337 1597
13392 1597 3474 6113 5855 7424 -8260 -24317 -18008 -1736 3544 804 6578 2233 1471 6042
13378 6042 -3388 -10041 -8867 -9501 153 9423 16593 16656 9057 3821 11394 10865 14280 10865 8265 8562
13362 8562 519 3419 5847 4632 501 3401 6431 7123 7550 4499 3387 2171 10595 14188 13739
13347 13739 18056 14881 3073 -3867 -13217 -4531 -797 -6148 4061 11689 15974 16125 6385 5597
13333 5597 8921 -1261 -3323 -316 -2720 2460 5180 11160 13378 9157 -4855 -9585 -14716 -5244
13319 -5244 -4637 -3951 6376 5131 9649 11541 6726 -4435 -7356 1016 4251 18482 21087 14444
13305 14444 7540 -4904 -6524 -6193 -2303 -2625 -12441 -5346 -2835 -10948 -9019 -2938 685 -12864
$$ packed form
13407c431l574n537j112Q616L359P527R892p848p33M30r358p368M840j040O934
13392A597J877K639k58J569j5684j6057O309J6272N280k740N774m345p62M571
13378F042r430o653J174o34R654R270P170O3p599n236P573n29L415l415k600K97
13362H562q043K900K428j215m131K900L030O92M27l051j112j216Q424L593m49
13347A3739M317l175j1808o940r350Q686L734n351J0209P628M285J51r740p88
13333E597L324j0182k062L007k404N180K720N980K218m221j4012m730n131R472
13319e244O07O86J0327j245M518J892m815j1161k921Q372L235J4231K605o643
13305A4444o904j2444j620L31L890l22r816P095K511q113J929O081L623j3549
$$ plain form
13291 -12864 -10255 764 -1486 -29 2431 9225 6994 15107 15892 2960 -14623 -15991 -2915 2604
13277 2604 4671 15277 20993 19655 17745 12108 1735 -2802 -133 -7580 -4791 652 -285 -11740
13263 -11740 -11803 -8121 1928 4122 2766 1664 7332 3531 -6587 -3037 6001 -5459 -4209 -3564
13249 -3564 280 -3726 -4857 -11142 -5903 -1543 6650 14422 14914 10675 10940 14884 15773 25448 19281
13234 19281 15851 10515 8044 12012 12073 11209 2036 -4602 -1497 3388 4636 10628 8547 10181 11105
13219 11105 -1116 -5649 6132 951 -8142 -4710 4750 4027 -2210 5522 16109 27445 27350 34771
13205 34771 53693 68063 80702 75995 64386 61817 56740 38156 24859 20929 6515 3112 16044
13192 16044 15850 4001 6399 191 4036 3178 5395 11157 3164 -609 -1062 -13383 -17321 -18141 -14243
$$ packed form
13291a2864K609J1019k250J457K460O794k231Q113P85j2932j7583j368J3076N519
13277B604K067J0606N716j338j910n637j0373m537K669p447K789N443r37j1455
13263a1740o3L682J0049K194j356j102N668l801j0118L550R038j1460J250O45
13249c564L844m006j131o285N239M360Q193P772M92m239K65L944Q89R675o167
13234A9281l430n336k471L968O1q64r173o638L105M885J248N992k081J634R24
13219A1105j2221m533J1781n181r093L432R460p23o237P732J0587J1336r5P421
13205C4771J8922J4370J2639m707j1609k569n077j8584j3297l930j4414l403J2932
13192A6044j94j1849K398o208L845q58K217N762p993l773m53j2321l938q20L898
$$ plain form
13177 -14243 -7059 -2212 -867 8915 23332 24224 16875 12889 14937 28229 40966 50859 46184 55029
13163 55029 69964 93785 125470 159066 184208 213745 231804 204753 175313 152764 112478 85745
13151 85745 70923 57689 43669 24100 14246 22203 32528 23895 12540 12767 21535 14345 13886
13138 13886 23093 27363 28127 19789 13988 12991 8673 15066 23140 29301 23663 22979 22786 23227 26682 31899
13122 31899 44664 57061 60756 74982 91563 113126 129979 158415 194762 227249 239587 231979
13110 231979 209992 179916 135332 95777 65601 39092 37797 41528 42834 35979 25606 8775
13098 8775 8336 21683 24805 20306 19250 21054 23608 34700 33693 19835 24652 31703 25427 16192
13084 16192 13650 18691 21369 18873 19492 20578 18195 14134 7523 21652 41263 40630 42817 51946
$$ packed form
13177a4243P184M847J345R782J4417Q92p349l986K048J3292J2737R893m675Q845
13163E5029J4935K3821L1685L3596K5142K9537J8059k7051k9440k2549m0286k6733
13151H5745j4822j3234j4020j9569r854P957J0325q633j1355K27Q768p190m59
13138A3886R207M270P64q338n801r97m318O393Q074O161n638o84j93M41L455N217
13122C1899J2765J2397L695J4226J6581K1563J6853K8436L6347L2487J2338p608
13110B31979k1987l0076m4584l9555l0176k6509j295L731J306o855j0373j6831
13098H775m39J3347L122m499j056J804K554J1092j007j3858M817P051o276r235
13084A6192k542N041K678k496O19J086k383m061o611J4129J9611o33K187R129
$$ plain form
13070 51946 62428 79084 90646 96492 95136 83330 69299 52588 41077 38190 23516 20561
13058 20561 24967 26883 30256 28884 19532 13173 7245 3162 2906 5653 3169 -2541 -4028 -11152 -7044
13043 -7044 735 4655 16294 20870 18922 19860 14742 11214 -2733 -2802 2370 -5275 -5822 4609 11434
13028 11434 4476 11407 16664 10449 10489 5915 -1272 2247 4307 -1850 -11112 -11078 -9524 -5316 -5197 -12382
13012 -12382 -4082 2519 2171 12791 14864 9665 4285 5882 8890 10146 -2617 -6341 -5745 -3057
12998 -3057 -1616 -999 -1877 4341 3166 3073 12643 5594 1151 247 8229 6933 7095 -1242 -3880 923
12982 923 461 -3824 -1904 -12978 -2889 4878 -243 -1558 -1073 -19518 -15656 -4620 -2924 -1936 214
12967 214 1643 3455 5407 4953 286 849 2223 -1914 -5865 -9415 -11107 -11384 -9879 -6449 -7246 -8048
$$ packed form
13070E1946J0482J6656J1562N846j356j1806j4031j6711j1511k887j4674k955
13058B0561M406J916L373j372r352o359n928m083k56K747k484n710j487p124M108
13043g044P779L920J1639M576j948R38n118l528j3947o9N172p645n47J0431O825
13028A1434o958O931N257o215M0m574p187L519K060o157r262L4J554M208J19p185
13012a2382Q300O601l48J0620K073n199n380J597L008J256j2763l724N96K688
12998c057J441O17q78O218j175r3R570p049m443r04P982j296J62q337k638M803
12982I23m62m285J920j1074J0089P767n121j315M85j8445L862J1036J696R88K150
12967B14J429J812J952m54m667N63J374m137l951l550j692k77J505L430p97q02
$$ plain form
12951 -8048 -16607 -6502 -374 -8281 -12266 -9199 327 8175 5785 4734 -1129 -8721 -4624 -11551
12937 -11551 -17065 -18443 -14618 3062 3563 -7648 -5660 -3603 5403 5757 -4313 -3260 -3805 -4911
12923 -4911 1973 -3339 4286 8253 -767 5200 6543 1773 -862 -3311 -12174 -13881 -20638 -15600 5240
12908 5240 8041 1117 353 2736 -3129 8953 11825 9437 13062 13307 4977 -2155 -4512 -10648 -12349
12893 -12349 -5699 -157 5394 10377 3033 1407 -5096 -15956 -13227 -7261 -6208 -1585 -7883 -9157
12879 -9157 -5831 -5124 -10168 -12736 -15632 -11670 -6144 -12517 -23487 -19359 -20534 -15894 -11044 -17452 -23135
12864 -23135 -18691 -10512 -2168 10484 4882 -4797 6682 13568 15171 5526 3165 17669 12945 3148
12850 3148 4062 4109 -5323 -993 2278 1673 4627 11238 10077 1826 4080 10299 6439 4024 911 -1039
$$ packed form
12951h048q559J0105O128p907l985L067R526P848k390j051n863p592M097o927
12937a1551n514j378L825J7680N01j1211J988K057R006L54j0070J053n45j106
12923d911O884n312P625L967r020N967J343m770k635k449q863j707o757N038K0840
12908E240K801o924p64K383n865J2082K872k388L625K45q330p132k357o136j701
12893a2349O650N542N551M983p344j626o503j0860K729N966J053M623o298j274
12879i157L326P07n044k568k896L962N526o373j0970M128j175M640M850o408n683
12864b3135M444Q179Q344J2652n602r679J1479O886J603r645k361J4504m724r797
12850C148R14M7r432M330L271o05K954O611j161q251K254O219l860k415l113j950
$$ plain form
12834 -1039 -2008 517 5295 3385 8591 2418 -6042 -4278 6909 -2990 -9440 -3054 -5615 -3964 -6392
12819 -6392 -11606 -12728 -12930 -8906 -11086 -21390 -16978 -13822 -22249 -21810 -16696 -10504 7377 11198 6715
12804 6715 1794 -2052 -12900 -10241 -5709 -14684 -19824 -26898 -26881 -9717 -11798 -21842 -10726 -7534
12790 -7534 -1604 6194 2367 7377 1899 11925 2550 2763 8772 652 -4850 -7786 733 471 3635
12775 3635 12528 3127 3842 8846 1556 187 -3332 6395 8968 12801 8953 6264 13960 11152 8946
12760 8946 9528 4414 10598 3373 -5297 -4661 -5208 -1753 3286 2304 -2869 -8600 3132 10560 17848
12745 17848 13239 10272 13080 14058 9621 10698 6769 4714 19015 18311 13930 15588 6440 -9641
12731 -9641 -3099 125 4571 5589 2242 2965 3735 -412 -4787 -6022 317 7326 8795 -1535 -1086
$$ packed form
12834a039r69K525M778j910N206o173q460J764J1187r899o450O386k561J651k428
12819f392n214j122k02M024k180j0304M412L156q427M39N114O192J7881L821m483
12804F715m921l846j0848K659M532q975n140p074J7J7164k081j0044J1116L192
12790g534N930P798l827N010n478J0026r375K13O009q120n502k936Q519k62L164
12775C635Q893r401P15N004p290j369l519R727K573L833l848k689P696k808k206
12760H946N82n114O184p225q670O36n47L455N039r82n173n731J1732P428P288
12745A7848m609k967K808R78m437J077l929k055J4301p04m381J658r148j6081
12731i641O542L224M446J018l347P23P70m147m375j235O339P009J469j0330M49
$$ plain form
12716 -1086 -112 3994 3429 -194 -1015 -1475 462 -5543 -7233 1342 17190 16167 11989 8765 -9666
12701 -9666 -6916 -2402 4224 -5674 -7278 -11270 -16927 -21244 -13263 -8739 -4135 4099 772 -7629 -15299
12686 -15299 -10675 -2561 1410 1316 -7198 -17001 -16102 -10848 -2009 6015 5360 3580 3739 3051 11527 20686
12670 20686 9761 2165 6940 10037 19714 16835 8559 6322 10689 12983 20050 16597 -2360 -8275
12656 -8275 3241 9693 9794 13618 15006 3756 3235 2154 -8410 -12676 -9262 2207 745 6071
12642 6071 12385 25789 17066 1232 13017 11561 -607 3794 13264 7646 -60 -565 -8219 151
12628 151 2139 -2474 -4182 -9508 -16864 -14378 -11550 -60 23745 31390 27193 17092 9155 3793
12614 3793 10249 11387 9614 -7077 -9036 -2998 2221 -4981 -9665 1680 7782 13105 10955 5384
$$ packed form
12716a086R74M106n65l623q21m60J937o005j690Q575J5848j023m178l224j8431
12701i666K750M514O626r898j604l992n657m317P981M524M604Q234l327q401p670
12686a5299M624Q114L971r4q514r803Q99N254Q839Q024o55j780J59o88Q476R159
12670B0686j0925p596M775L097R677k879q276k237M367K294P067l453j8957n915
12656h275J1516O452J01L824J388j1250n21j081j0564m266L414J1469j462N326
12642F071O314J3404q723j5834J1785j456j2168M401R470n618p706n05p654Q370
12628A51J988m613j708n326p356K486K828J1490K3805P645m197j0101p937n362
12614C793O456J138j773j6691j959O038N219p202m684J1345O102N323k150n571
$$ plain form
12600 5384 -4131 -6977 -10196 -6412 -2254 1441 1487 3319 -210 448 -7199 1899 8240 5729 2772
12585 2772 9858 13792 14115 850 286 88 -11839 -19706 -7539 -21847 -15692 633 15574 14250
12571 14250 16420 16669 20726 18437 16276 14098 2688 -12704 -15336 -13509 -12770 -794 16813 16872
12557 16872 16496 12105 14522 16824 481 -5677 -4160 -1601 792 2770 4663 -2162 -2608 8580
12543 8580 14571 26351 25066 22084 25909 18940 17180 9640 14327 13102 6239 7847 7670 6779 1830
12528 1830 5634 430 -10041 -9274 -11895 -7275 -3342 -6193 -9444 -5149 -8618 -6455 -8549 -7105 -6274
12513 -6274 -14780 -15620 -4250 7445 4304 -5116 -12771 -2260 5769 -3333 -9785 -3378 -14178 -12154
12499 -12154 -5451 -5322 -1426 -2492 -9426 -11304 -2744 7657 4371 -603 -8024 -6501 -8069 -8587 -2329
$$ packed form
12600E384r515k846l219L784M158L695M6J832l529O58p647R098O341k511k957
12585B772P086L934L23j3265n64j98j1927p867J2167j4308O155J6325J4941j324
12571A4250K170K49M057k289k161k178j1410j5392k632J827P39J1976J7607N9
12557A6872l76m391K417K302j6343o158J517K559K393J978J893o825m46J1188
12543H580N991J1780j285k982L825o969j760p540M687j225o863J608j77q91m949
12528A830L804n204j0471P67k621M620L933k851l251M295l469K163k094J444Q31
12513f274q506q40J1370J1695l141r420p655J0511Q029r102o452O407j0800K024
12499a2154O703J29L896j066o934j878Q560J0401l286m974p421J523j568n18O258
$$ plain form
12484 -2329 -2192 289 -1475 -482 -2423 -2128 -3453 -528 4014 5 -2907 -2667 -3465 542 4483 -441
12468 -441 -5774 -633 1080 -4232 -11878 -8302 -3511 2805 5666 12638 14027 12598 3635 7491 2313
12453 2313 1879 11201 12398 1365 1941 1598 -2972 -1032 -9857 -10036 -937 1985 8548 13733 -395
12438 -395 -6191 -1846 5681 -3475 6421 9838 16985 11768 17348 17984 10172 11731 17742 23082 29287
12423 29287 25256 15742 16934 21761 24295 4154 -16350 -16539 -16036 -6731 -5857 -11929 -12717 -7204 -6148
12408 -6148 -4448 6987 5214 2036 -6090 -3185 -8693 -6197 1892 7996 1641 3199 12811 14472
12394 14472 12512 16704 18040 8605 1979 -5109 -1733 1771 14925 19618 25960 21599 7158 1595
12380 1595 4353 1176 3945 9859 9754 5922 3952 -9222 -5709 -9472 -8914 -8448 -5386 -8478 -3292
$$ packed form
12484b329J37K481j764R93j941K95j325K925M542m009k912K40p98M007L941m924
12468d41n333N141J713n312p646L576M791O316K861O972J389j429q963L856n178
12453B313m34R322J197j1033N76l43m570J940q825j79R099K922O563N185j4128
12438c95n796M345P527r156R896L417P147n217N580O36p812J559O011N340O205
12423B9287m031r514J192M827K534k0141k0504j89N03R305Q74o072p88N513J056
12408f148J700J1435j773l178q126K905n508K496Q089O104o355J558R612J661
12394A4472j960M192J336r435o626p088L376L504J3154M693O342m361j4441n563
12380A595K758l177K769N914j05l832j970j3174L513l763N58M66L062l092N186
$$ plain form
12365 -3292 1305 2537 3202 4148 -43 135 -2202 -5275 -7268 -2673 7369 7080 -4145 -8485 -14425
12350 -14425 -10236 -10141 -15899 -6612 560 1145 5138 2522 -9372 -3063 9580 11119 10226 1068 4253
12335 4253 6740 -900 -14577 -12830 -6087 -4873 -6452 -2286 -4165 1147 -3556 -8089 -18619 -25627
12321 -25627 -25493 -22243 -10228 6006 1467 -867 2973 3241 -2566 -7744 -6141 -7655 -6410 -7379 -17553
12306 -17553 -20714 -8342 -2672 -6347 -4818 5664 15563 19981 10453 17521 22296 15045 14519 20816
12292 20816 20561 19590 10193 12954 18117 14571 12559 10374 800 -14496 -10365 -4591 -12676 -167
12278 -167 13838 9687 2838 8761 12884 3106 -7918 -5178 982 1407 -710 -873 6900 12473 11698
12263 11698 8769 4613 9759 14242 12634 19163 27179 14757 8073 15187 15268 12997 9952 7026 7115
$$ packed form
12365c292M597J232O65R46m191J78k337l073j993M595J0042k89j1225m340n940
12350a4425M189R5n758R287P172N85L993k616j1894O309J2643J539q93r158L185
12335D253K487p640j3677J747O743J214j579M166j879N312m703m533j0530p008
12321b5627J34L250J2015J6234m539k334L840K68n807n178J603j514J245r69j0174
12306a7553l161J2372N670l675J529J0482R899M418r528P068M775p251n26O297
12292B0816k55r71r397K761N163l546k012k185r574j5296M131N774q085J2509
12278a67J4005m151o849N923M123r778j1024K740O160M25k117j63P773N573p75
12263A1698k929m156N146M483j608O529Q016j2422o684P114Q1k271l045k926Q9
$$ plain form
12248 7115 9265 1693 -4654 -5803 -5102 -11551 -11216 -10382 -3158 -3800 -19071 -16927 -17783 -6391 7888
12233 7888 10220 8081 -143 2564 -449 -319 8272 10912 10234 4167 8152 14409 13310 7641 4122
12218 4122 -4117 2244 6255 2185 -61 -1946 7311 7230 8435 9283 11122 1492 -16383 -15004 -10707
12203 -10707 -7114 -12407 -6946 -8963 -11743 -12865 -6914 -4492 -2270 5654 18365 15283 17692 16512
12189 16512 7518 -2381 -9441 -3646 6145 10973 15268 15869 15487 16596 7281 5150 -3227 -7103 -1770
12174 -1770 9928 8440 1543 12731 10975 6773 15462 15920 6256 1759 821 5826 4990 -6300 -7374
12159 -7374 -15948 -19240 -12259 -14221 -11928 -12806 -9553 -6623 -8144 -1296 9421 6133 -4556 -7882
12145 -7882 -10222 -15524 -14242 -7193 1018 7049 15531 20916 20206 28477 19786 5493 -16144 -9644
$$ packed form
12248G115K150p572o347j149P01o449L35Q34P224o42j5271K144q56J1392J4279
12233G888K332k139q224K707l013J30Q591K640o78o067L985O257j099n669l519
12218D122q239O361M011m070k246j885R257q1J205Q48J839r630j7875J379M297
12203a0707L593n293N461k017k780j122N951K422K222P924J2711l082K409j180
12189A6512q994r899p060N795R791M828M295O01l82J109r315k131q377l876N333
12174a770J1698j488o897J1188j756m202Q689M58r664m497r38N005q36j1290j074
12159g374q574l292O981j962K293q78L253K930j521O848J0717l288j0689l326
12145g882k340n302J282P049Q211O031Q482N385p10Q271q691j4293k1637O500
$$ plain form
12131 -9644 -4761 -2852 7801 19244 10507 9149 8317 -142 -4669 -1203 8686 5219 -9461 -11598
12117 -11598 -10696 -15696 -6384 5388 19945 32105 31838 19222 11250 13772 13775 2693 -4160 1391
12103 1391 9491 11930 2143 -475 4832 -1769 -2055 68 2781 4461 -3195 -6829 -2759 10965 5834
12088 5834 7802 11390 12523 3462 -938 5665 10694 5535 3096 8891 7524 2829 4971 -8383
12074 -8383 -13201 -6074 -1443 2932 8105 2935 2774 1537 -9652 -8619 -10107 -11416 -10611 -375 3010
12059 3010 5964 -1725 -12264 -13438 1299 17704 13863 11178 3848 -10456 -8121 -1559 -4837 -7236
12045 -7236 -6332 3517 13911 12007 10941 -577 -14442 -12095 -6649 -8749 -11285 -9799 -9784 -14029 -9369
12030 -9369 -1043 10454 8440 9786 12473 12068 5969 -8493 -27459 -12830 5392 10010 13196 14388
$$ packed form
12131i644M883J909J0653J1443q737j358q32q459m527L466R889l467j4680k137
12117a1598R02n000R312J1772J4557J2160k67j2616p972K522Lj1082o853N551
12103A391Q100K439r787k618N307o601k86K123K713J680p656l634M070J3724n131
12088E834J968L588J133r061m400O603N029n159k439N795j367m695K142j3354
12074h383m818P127M631M375N173n170j61j237j1189J033j488j309Q05J0236L385
12059C010K954p689j0539j174J4737J6405l841k685p330j4304K335O562l278k399
12045g236R04R849J0394j904j066j1518j3865K347N446k100k536J486J5m245M660
12030i369Q326J1497k014J346K687m05o099j4462j8966J4629J8222M618L186J192
$$ plain form
12016 14388 10016 9082 10489 1972 2893 -3305 -12449 -8801 -10110 -17464 -5095 6474 17010 7780
12002 7780 8371 15694 15344 11120 9272 6370 5946 7546 -3408 -11696 -3909 16076 11637 7934 3650
11987 3650 4174 -6374 -3790 -1521 -7846 1420 10400 14128 13475 15029 19336 18692 16232 10448 11903
11972 11903 11223 7742 -1980 -2415 -10813 -19197 -19916 -26983 -17371 -4814 11961 19651 21334 11453 11220
11957 11220 9636 1102 3577 2296 -6647 -12193 -4858 4028 13083 11231 8948 7079 3432 8381
11943 8381 2980 926 1184 -7384 -16320 -12920 -10667 -18314 -14266 5017 16713 22801 21798 8471
11929 8471 5973 13145 10661 589 -6764 -6700 3448 12385 20896 23859 30869 32762 30702 25259 14581
11914 14581 80 224 467 3745 4761 -379 11222 15958 6648 8963 7958 11473 10113 3532
$$ packed form
12016A4388m372r34J407q517R21o198r144L648j309p354J2369J1569J0536r230
12002G780N91P323l50m224j848k902m24J600j0954q288P787J9985m439l703m284
11987C650N24j0548K584K269o325R266Q980L728o53J554M307o44k460n784J455
11972A1903o80l481r722m35q398q384p19p067R612J2557J6775P690J683r881k33
11957A1220j584q534K475j281q943n546P335Q886R055j852k283j869l647M949
11943H381n401k054K58q568q936L400K253p647M048J9283J1696O088j003j3327
11929H471k498P172k484j0072p353O4J0148Q937Q511K963P010J893k060n443j0678
11914A4581j4501J44K43L278J016n140J1601M736r310K315j005L515j360o581
$$ plain form
11900 3532 959 10188 12321 16661 15735 12744 12349 -414 -7867 -10266 -7706 -12481 -10935 -16349 -1591
11885 -1591 6391 6102 14247 3407 1157 -2938 110 -6429 -2501 -1364 5639 9932 13825 7696 1492
11870 1492 5015 9192 191 7070 9110 501 2092 3970 -6628 -14092 1020 2714 11068 16925
11856 16925 9208 5334 13783 15693 2989 -4051 -5169 -7563 14258 17856 13232 10999 -1650 1891
11842 1891 -95 -2 -1334 6550 17167 17485 13879 1956 -6623 6509 14570 13517 13156 9096 8559
11827 8559 8208 10840 8747 4122 -5001 -3905 513 -1110 1804 1760 -50 -13260 -20804 -8268 3157
11812 3157 2262 -233 7478 10055 6649 9729 10651 12731 3148 -9812 -15290 -15829 -1051 5456 6070
11797 6070 5751 10856 13021 6164 3079 5385 12935 7368 126 10568 24581 12722 12867 12151 6187
$$ packed form
11900C532k573R229K133M340r26k991l95j2763p453k399K560m775J546n414J4758
11885a591P982k89Q145j0840k250m095L048o539L928J137P003M293L893o129o204
11870A492L523M177r001O879K040q609J591J878j0598p464J5112J694Q354N857
11856A6925p717l874Q449J910j2704p040j118k394K1821L598m624k233j2649L541
11842A891j986R3j332P884J0617L18l606j1923q579J3132Q061j053l61m060n37
11827H559l51K632k093m625r123J096M418j623K914m4j810j3210p544J2536J1425
11812C157q95k495P711K577l406L080R22K080r583j2960n478n39J4778O507O14
11797F070l19N105K165o857l085K306P550n567p242J0442J4013j1859J45p16n964
$$ plain form
11782 6187 5378 8862 10889 18294 16222 12151 10735 -4061 -7942 7149 17394 16952 10773 4801
11768 4801 6007 12912 188 1118 452 4962 7329 8972 2223 881 12228 17332 10835 6395 9804
11753 9804 6726 -1173 -5164 -5347 4221 5347 14252 16661 8294 4695 785 8162 12955 5715 5881
11738 5881 13650 8554 -239 -3001 147 -8144 -7884 -9038 157 11270 13077 22079 19081 11943 -8487
11723 -8487 -12743 -10569 -842 -2765 3874 -77 -1383 19612 23827 19612 19959 17402 9082 -3042
11709 -3042 -7939 -15947 -18947 -8429 -1247 1338 9991 16828 4605 3500 2644 -1203 6489 15219
11695 15219 10286 2069 3544 -1764 -11261 -13141 -829 555 -2907 -4790 -16981 -12080 -2003 -2538
11681 -2538 3729 1688 5793 16142 23250 21985 18322 18392 9475 5545 5595 -7982 -10968 -4380 4946
$$ packed form
11782F187q09L484K027P405k072m071j416j4796l881J5091J0245m42o179n972
11768D801J206O905j2724R30o66M510K367J643o749j342J1347N104o497m440L409
11753I804l078p899l991j83R568J126Q905K409q367l599l910P377M793p240J66
11738E881P769n096q793k762L148q291K60j154R195J1113J807R002k998p138k0430
11723h487m256K174R727j923O639l951j306K0995M215m215L47k557q320j2124
11709c042m897q008l000J0518P182K585Q653O837j2223j105q56l847P692Q730
11695A5219m933q217J475n308r497j880J2312J384l462j883j2191M901J0077n35
11681b538O267k041M105J0349P108j265l663P0q917l930N0j3577k986O588R326
$$ plain form
11666 4946 8129 9249 21922 23723 9913 -1300 -7526 -9941 -5042 -11824 -15091 -13220 4240 18928
11652 18928 12918 18867 28153 16008 11377 7712 9491 21733 24032 19349 10942 -1177 1247 11244
11638 11244 6895 -2673 -4745 7533 8314 11746 8024 1703 -319 12099 11792 14281 14633 6052 -4803
11623 -4803 510 4915 8041 5992 5089 10315 6277 3134 3424 8409 182 1980 8559 9608 6559
11608 6559 4295 3196 -406 412 1488 -1757 -2206 2962 14099 15990 792 -10559 1854 5202
11594 5202 5013 1851 13452 19724 17296 12651 12814 -2195 -8413 -5920 3545 -7426 -13619 -5248
11580 -5248 5286 10272 17930 6432 9534 13115 12320 13826 14924 21943 20736 11177 -607 -574 7782
11565 7782 8910 5237 14447 20003 29154 30986 24510 23792 14549 3839 6082 22597 20910 11729
$$ packed form
11666D946L183J120J2673J801j3810j1213o226k415M899o782l267J871J7460J4688
11652A8928o010N949R286j2145m631l665J779J2242K299m683q407j2119K424R997
11638A1244m349r568k072J2278P81L432l722o321k022J2418l07K489L52q581j0855
11623d803N313M405L126k049r03N226m038l143K90M985q227J798O579J049l049
11608F559k264j099l602Q18J076l245m49N168J1137J891j5198j1351J2413L348
11594E202j89l162J1601O272k428m645J63j5009o218K493R465j0971o193Q371
11580e248J0534M986P658j1498L102L581p95J506J098P019j207r559j1784L3Q356
11565G782J128l673R210N556R151J832o476p18r243j0710K243J6515j687r181
$$ plain form
11551 11729 6588 11308 22056 17199 4897 2745 9772 3273 8911 12668 8498 4506 3246 -4872
11537 -4872 589 7940 18783 24856 21953 20747 35737 40781 31289 33385 27843 21957 26374 26727
11523 26727 31511 42929 39244 32113 40634 30200 18429 18474 9022 3358 17193 25169 28451 23585
11509 23585 25772 12265 9559 12014 11337 22547 16761 20971 23147 28187 18314 18539 30284 30589
11495 30589 26501 17306 17802 21308 22297 26002 25741 28813 14577 10302 15041 20891 23881 24065 24282
11480 24282 25522 18898 16874 8336 8032 14787 19200 15804 6725 8941 16924 30193 34223 30727
11466 30727 30007 40889 38513 44695 38625 28565 34955 49145 51911 50144 40835 44754 62076 68476
11452 68476 64093 49998 48267 45668 39688 36352 29739 31685 23939 12547 7381 8569 4610 -7487
$$ packed form
11551A1729n141M720J0748m857j2302k152P027o499N638L757m170l992j260q118
11537d872N461P351J0843O073k903j206J4990N044r492K096n542n886M417L53
11523B6727M784J1418l685p131Q521j0434j1771M5r452n664J3835P976L282m866
11509B3585K187j3507k706K455o77J1210n786M210K176N040r873K25J1745L05
11495C0589m088r195M96L506R89L705k61L072j4236m275M739N850K990J84K17
11480B4282J240o624k024q538l04O755M413l396r079K216P983J3269M030l496
11466C0727p20J0882k376O182o070j0060O390J4190K766j767r309L919J7322O400
11452F8476m383j4095j731k599n980l336o613J946p746j1392n166J188l959j2097
$$ plain form
11438 -7487 -21217 -26331 -25139 -26157 -17958 -5247 -1761 5934 10119 10808 13989 14359 15552 9655 4236
11423 4236 2171 6672 19908 21812 20680 22987 36500 46742 45917 45687 46741 58703 66958 67525
11409 67525 71126 87257 110041 116780 129142 146059 185624 233773 276788 330396 412950 534002
11397 534002 686332 878028 1115017 1363021 1542232 1615861 1557253 1296852 946183 684920
11387 684920 505618 372454 294183 250835 227153 207091 186318 166770 146239 141952 140278
11376 140278 145654 144197 146250 140693 128936 128023 132228 145281 138560 126582 130625 124752 114077
11363 114077 99934 102111 96363 93559 99063 95332 78561 70805 78550 85284 76284 68171 67052 62506
11349 62506 53298 53040 57962 59830 55259 53766 42363 38855 41891 38836 23867 15058 25943 35930
$$ packed form
11438g487j3730n114J192j018Q199J2711L486P695M185O89L181L70J193n897n419
11423D236k065M501J3236J904j132K307J3513J0242q25k30J054J1962Q255N67
11409F7525L601J6131K2784O739J2362J6917L9565M8149M3015N3608Q2554J21052
11397E34002J52330J91696K36989K48004J79211P3629n8608k60401l50669k61263
11387F84920j79302j33164p8271m3348k3682k0062k0773j9548k0531m287j674
11376A40278N376j457K053n557j1757r13M205J3053o721j1978M043n873j0675
11363A14077j4143K177n748k804N504l731j6771p756P745O734r000q113j119m546
11349F2506r208k58M922J868m571j493j1403l508L036l055j4969q809J0885R987
$$ plain form
11335 35930 47110 36567 18034 2948 866 2884 10669 27099 20038 18051 29317 35871 24577
11322 24577 18564 14757 8477 18958 21862 18745 22258 23234 20782 21023 22313 30359 25179 33342 41259
11307 41259 43012 44954 45211 34337 31686 25471 32246 34147 45873 56348 58465 53286 54277 51550
11293 51550 47649 30196 18400 4951 -8437 -1974 -5766 -10531 697 14355 19866 24721 26530
11280 26530 28029 25670 28083 23766 17971 24044 25637 20758 22612 27524 27335 17157 22252 27977
11266 27977 35761 39999 46053 35330 32263 38485 45708 53568 53524 44727 38683 51030 58958 48979
11252 48979 53807 46351 40261 37193 53566 64436 71172 85194 87830 100822 124601 153326 190746
11239 190746 203764 188462 178458 162769 138293 108734 91384 82769 41977 27645 31975 25419
$$ packed form
11335C5930J1180j0543j8533j5086k082K018P785J6430p061j987J1266O554j1294
11322B4577o013l807o280J0481K904l117L513R76k452K41J290Q046n180Q163P917
11307D1259J753J942K57j0874k651o215O775J901J1726J0475K117n179R91k727
11293E1550l901j7453j1796j3449j3388O463l792m765J1228J3658N511M855J809
11280B6530J499k359K413m317n795O073J593m879J854M912j89j0178N095N725
11266B7977P784M238O054j0723l067O222P223P860m4q797o044J2347P928r979
11252D8979M828p456o090l068J6373J0870O736J4022K636J2992K3779K8725L7420
11239A90746J3018j5302j0004j5689k4476k9559j7350q615m0792j4332M330o556
$$ plain form
11227 25419 25729 30732 42813 57067 59092 63130 54840 44375 47405 61085 61857 53118 58526 56188
11213 56188 46720 46143 42530 49134 51338 46386 53611 60733 69289 76091 88452 92497 107274 106941
11199 106941 107641 103544 113790 120263 110128 97495 81742 63794 65407 67141 64691 54377 63194
11186 63194 78459 68745 63340 52388 57043 56387 46837 38230 20532 25049 30472 24985 31329 26025
11172 26025 20435 18519 32270 47996 58393 53764 56550 54867 44806 47595 41389 38517 34291
11159 34291 46020 58433 57363 52946 57663 58808 63276 84300 92709 94610 97016 92343 97602 104518
11145 104518 94314 74896 68331 58874 57084 57732 51595 36224 42332 37557 37352 44017 43520 52643
11131 52643 60692 68433 68836 74653 79383 85812 101433 119441 122419 141683 174092 196837 226125
$$ packed form
11227B5419L10N003J2081J4254K025M038q290j0465L030J3680P72q739N408k338
11213E6188r468n77l613O604K204m952P225P122Q556O802J2361M045J4777l33
11199A06941P00m097J0246O473j0135j2633j5753j7948J613J734k450j0314Q817
11186F3194J5265r714n405j0952M655o56r550q607j7698M517N423n487O344n304
11172B6025n590j916J3751J5726J0397m629K786j683j0061K789o206k872m226
11159C4291J1729J2413j070m417M717J145M468K1024Q409J901K406m673N259O916
11145A04518j0204j9418o565r457j790O48o137j5371O108m775k05O665m97R123
11131E2643Q049P741M03N817M730O429J5621J8008K978J9264L2409K2745K9288
$$ plain form
11118 226125 254873 276587 315120 366890 460398 617844 778942 907679 1008396 1022283 917567
11107 917567 714058 535933 435298 376173 342299 333228 327449 314712 311480 309973 305690 304802
11095 304802 302995 305860 316118 340406 352555 354577 354489 346971 343335 356472 374135 380684 380020 387404
11081 387404 401391 418163 429879 445708 465983 493950 521425 534073 541510 548357 553848 555919
11069 555919 548385 561837 584435 605628 609498 615927 627765 636791 635374 636047 650828 659838 659529
11056 659529 661406 664747 673909 689806 698457 704590 710288 714361 731729 743704 768413 804886 832859
11043 832859 876053 916155 960551 1012536 1038557 1048649 1047051 1041769 1055340 1084063 1112298 1129545
11031 1129545 1140568 1153990 1180021 1197229 1223032 1242437 1259556 1291091 1330118 1377622 1438895
$$ packed form
11118B26125K8748K1714L8533N1770R3508J57446J61098J28737J00717J3887j04716
11107I17567k03509j78125j00635n9125l3874r071n779j2737l232j507m283q88
11095C04802j807K865J0258K4288J2149K022q8p518l636J3137J7663O549o64P384
11081C87404J3987J6772J1716J5829K0275K7967K7475J2648P437O847N491K071
11069E55919p534J3452K2598K1193L870O429J1838R026j417O73J4781R010l09
11056F59529J877L341R162J5897Q651O133N698M073J7368J1975K4709L6473K7973
11043H32859M3194M0102M4396N1985K6021J0092j598n282J3571K8723K8235J7247
11031A129545J1023J3422K6031J7208K5803J9405J7119L1535L9027M7504O1273
$$ plain form
11020 1438895 1507984 1582076 1683360 1816647 1978627 2171307 2401191 2683405 2993830 3366180
11010 3366180 3808518 4317855 4875307 5413729 5912519 6358307 6715555 7134308 7812441
11001 7812441 8874588 10423752 12599967 15561411 19415395 24136124 29543087 35850817
10993 35850817 43699015 53729738 66928288 84975557 109602070 142192775 184224538
10986 184224538 231135441 270089449 289951357 289427748 255693878 191819321 133982349
10979 133982349 95313218 71134143 56070446 46384872 39894334 35279817 31762826
10972 31762826 29003889 26868555 25148154 23714080 22498978 21492326 20733316 20265019
10964 20265019 20065386 20115954 20382682 20651395 20489474 19685056 18406438 16872226 15405118
$$ packed form
11020A438895O9089P4092J01284J33287J61980J92680K29884K82214L10425L72350
11010C366180M42338N09337N57452N38422M98790M45788L57248M18753O78133
11001G812441J062147J549164K176215K961444L853984M720729N406963O307730
10993C5850817P848198J0030723J3198550J8047269K4626513L2590705M2031763
10986A84224538M6910903L8954008J9861908n23609l3733870o3874557n7836972
10979A33982349l8669131k4179075j5063697r685574o490538m614517l516991
10972C1762826k758937k135334j720401j434074j215102j006652p59010m68297
10964B0265019j99633N0568K66728K68713j61921q04418j278618j534212j467108
$$ plain form
10955 15405118 14147241 13062123 12093028 11214316 10426944 9719630 9050676 8416315 7868333
10946 7868333 7371089 6896751 6447453 6022275 5617921 5257640 4922524 4618703 4329562
10937 4329562 4079481 3857500 3650332 3448386 3268060 3105628 2933523 2764247 2607744
10928 2607744 2459811 2349990 2238209 2159536 2084734 1997239 1912861 1841671 1760831 1665235 1584242
10917 1584242 1500069 1423605 1370683 1306402 1235694 1176810 1118575 1072903 1021807 967832 924549
10906 924549 888077 848111 800853 759889 727208 701886 679087 644372 619020 597289 575432
10895 575432 529587 482255 455903 435537 438491 439550 430905 412206 394874 387432 374473 364056
10883 364056 355133 330907 306614 281659 250840 236322 229553 232101 233270 234101 237424 260309 289882
$$ packed form
10955A5405118j257877j085118r69095q78712p87372p07314o68954o34361n47982
10946G868333m97244m74338m49298m25178m04354l60281l35116l03821k89141
10937D329562k50081k21981k07168k01946j80326j62432j72105j69276j56503
10928B607744j47933j09821j11781p8673p4802q7495q4378p1190q0840r5596q0993
10917A584242q4173p6464n2922o4281p0708n8884n8235m5672n1096n3975m3283
10906I24549l6472l9966m7258m0964l2681k5322k2799l4715k5352k1731k1857
10895E75432m5845m7332k6352k0366K954J059q645j8699j7332p442j2959j0417
10883C64056q923k4226k4293k4955l0819j4518o769K548J169Q31L323K2885K9573
$$ plain form
10870 289882 317022 344383 364805 370962 371396 380234 373181 380350 410975 434541 424287 369307 317455
10857 317455 289288 253297 265131 287008 275813 257428 232853 216266 215367 223916 212913 188248
10845 188248 184167 184613 189048 187380 168098 146574 139386 144291 138877 143887 167351 176350 191884
10832 191884 215693 230514 231680 227834 219499 222990 234961 242111 234679 218607 224998 225474 223437
10819 223437 222862 232227 251784 257729 267243 270773 264532 255764 253545 261262 276203 274707 256596 245818
10805 245818 249903 254920 239834 224643 221182 224327 225515 231145 247153 243933 231942 233311 232457
10792 232457 233446 218601 206133 204792 192742 174492 168625 174709 166941 162705 167258 165781 164639
10779 164639 162425 156065 131988 127845 117323 103783 90639 92723 96956 99873 97404 90318 84431
$$ packed form
10870B89882K7140K7361K0422O157M34Q838p053P169L0625K3566j0254n4980n1852
10857C17455k8167l5991J1834K1877j1195j8385k4575j6587q99Q549j1003k4665
10845A88248m081M46M435j668j9282k1524p188M905n414N010K3464Q999J5534
10832A91884K3809J4821J166l846q335L491J1971P150p432j6072O391M76k037
10819B23437n75R365J9557N945R514L530o241q768k219P717J4941j496j8111j0778
10805B45818M085N017j5086j5191l461L145J188N630J6008l220j1991J369q54
10792B32457R89j4845j2468j341j2050j8250n867O084p768m236M553j477j142
10779A64639k214o360k4077m143j0522j3540j3144K084M233K917k469p086n887
$$ plain form
10766 84431 76797 78012 88634 85358 81481 78802 77288 65382 62288 66695 67517 65243 71655 68510
10752 68510 69943 69378 60899 66798 71174 62196 66735 73503 66939 66145 80336 85628 84773 84581 87058
10737 87058 93913 98596 88710 87735 86615 82118 62330 49138 60240 62228 63877 66956 67227 63469
10723 63469 44858 37908 46211 64509 66465 66452 71438 69639 58454 41855 31847 24044 35552
10710 35552 43945 35305 31128 30951 28883 29783 38257 38398 28309 35038 46173 54178 63415 62820 58872
10695 58872 72120 80669 81444 70555 58683 54480 60204 65947 60656 63798 53653 50313 68199
10682 68199 85865 90797 83324 82222 99511 99090 89201 69633 64896 58930 51012 41594 48951 55682
10668 55682 63950 73843 74453 68919 62175 61279 65726 61877 55668 56057 67024 75160 75502 72019 64620
$$ packed form
10766H4431p634J215J0622l276l877k679j514j1906l094M407Q22k274O412l145
10752F8510J433n65q479N899M376q978M539O768o564p94J4191N292q55j92K477
10737H7058O855M683r886r75j120m497j9788j3192J1102J988J649L079K71l758
10723F3469j8611o950Q303J8298J956j3M986j799j1185j6599j0008p803J1508
10710C5552Q393q640m177j77k068R00Q474J41j0089O729J1135Q005R237n95l948
10695E8872J3248Q549P75j0889j1872m203N724N743n291L142j0145l340J7886
10682F8199J7666M932p473j102J7289m21r889j9568m737n966p918r418P357O731
10668E5682Q268R893O10n534o744q96M447l849o209L89J0967Q136L42l483p399
$$ plain form
10653 64620 59136 60781 71141 74211 66259 52786 54877 63968 68121 53131 35637 31549 29589
10640 29589 32517 28441 27303 24136 26573 28259 31176 33042 24068 17373 17476 35741 33906 30056
10626 30056 20204 11864 11999 16422 11837 14458 7035 6304 18800 20218 25169 25755 25541 25596 28606 31048
10610 31048 22894 17953 2550 3174 10851 7375 14887 28136 34998 34992 32460 36824 41103 36175 37528
10595 37528 45733 51528 49733 51116 52025 45866 36348 41458 49951 66722 85546 92518 100269 132383
10581 132383 168477 207135 236507 279843 360468 463939 609152 798876 1023857 1277896
10571 1277896 1490436 1597014 1589027 1388120 1043082 734876 522641 387755 314971 268565
10561 268565 237892 215944 194970 178729 176165 168854 160770 152557 138374 123674 118684 125927 121375
$$ packed form
10653F4620n484J645J0360L070p952j3473K091R091M153j4990j7494m088j960
10640B9589K928m076j138l167K437J686K917J866q974o695J03J8265j835l850
10626C0056r852q340J35M423m585K621p423p31J2496J418M951N86k14N5L010K442
10610C1048q154m941j5403O24P677l476P512J3249O862ok532M364M279m928J353
10595C7528Q205N795j795J383R09o159r518N110Q493J6771J8824O972P751L2114
10581A32383L6094L8658K9372M3336Q0625J03471J45213J89724K24981K54039
10571A277896K12540J06578p987k00907l45038l08206k12235j34886p2784m6406
10561B68565l0673k1948k0974j6241k564p311q084q213j4183j4700m990P243m552
$$ plain form
10548 121375 113323 121057 128914 123579 112689 98526 99176 110784 99904 86183 77392 71968 77988
10535 77988 84711 77186 81565 96079 110070 94124 76996 64973 54825 48853 40686 35479 20215
10522 20215 14513 16593 18790 7206 -5672 -12801 -29264 -43322 -33887 -18272 -15743 -1796 7825
10509 7825 13305 10576 4483 12251 1650 1981 16678 30130 33528 37465 31179 28429 28109 25362
10495 25362 29976 29703 20755 12517 5657 9958 17652 12125 4348 11725 20204 17250 4885 4170 4225
10480 4225 5081 7640 -2861 -8399 -1151 -7200 593 2592 -1326 6212 9851 2430 6245 10913 4047
10465 4047 3526 8901 19533 16111 4825 5816 -4142 -12682 -11649 -16754 -21553 -12289 -3209 -1982 -14797
10450 -14797 -26255 -25983 -26191 -24566 -13093 -10130 -12151 -23357 -25687 -17243 -20913 -14907 -10293 1451
$$ packed form
10548A21375q052P734P857n335j0890j4163O50J1608j0880j3721q791n424O020
10535G7988O723p525M379J4514J3991j5946j7128j2023j0148n972q167n207j5264
10522B0215n702K080K197j1584j2878p129j6463j4058R435J5615K529J3947R621
10509G825N480k729o093P768j0601L31J4697J3452L398L937o286k750l20k747
10495B5362M614k73q948q238o860M301P694n527p777P377Q479k954j2365p15N5
10480D225Q56K559j0501n538P248o049P793J999l918P538L639p421L815M668o866
10465D047n21N375J0632l422j1286R91r958q540J033n105m799R264R080J227j2815
10450a4797j1458K72k08J625J1473K963k021j1206k330Q444l670O006M614J1744
$$ plain form
10436 1451 4230 9303 4872 -7855 -9679 -11101 -13618 -6964 -3049 -1358 12232 20535 12058 10442
10422 10442 7589 -8297 -9724 5547 8085 11550 11451 15180 8693 10474 14549 5404 737 7166
10408 7166 16075 29993 26448 16178 12815 12117 18176 16924 19816 35215 30024 15139 -2579 -8787
10394 -8787 -5417 -3462 -259 4741 2558 -4562 8513 13290 23432 23632 22804 21661 6845 3462
10380 3462 6382 12501 3887 502 5836 291 -13948 -21057 -6908 7508 14183 4896 -2873 -2923
10366 -2923 795 17903 30589 28891 22850 31191 32529 28290 21551 23568 16339 5949 12024 13201
10352 13201 161 2319 803 -1811 104 4494 1498 -6498 -10428 -5296 -9683 -18113 -19278 -7883
10338 -7883 -1794 3290 8554 5550 2825 987 7496 1589 -4155 -2914 -14524 -28864 -28114 -22140
$$ packed form
10436A451K779N073m431j2727j824j422k517O654L915J691J3590Q303q477j616
10422A0442k853j5886j427J5271K538L465r9L729o487J781M075r145m667O429
10408G166Q909J3918l545j0270l363o98O059j252K892J5399n191j4885j7718o208
10394h787L370J955L203N000k183p120J3075M777J0142K00q28j143j4816l383
10380C462K920O119q614l385N334n545j4239p109J4149J4416O675r287p769n0
10366b923L718J7108J2686j698o041Q341J338m239o739K017p229j0390O075J177
10352A3201j3040K158j516k614J915M390k996p996l930N132m387q430j165J1395
10338g883O089N084N264l004k725j838O509n907n744J241j1610j4340P50N974
$$ plain form
10324 -22140 -19179 -18492 -12826 -11688 -1606 3394 13155 11961 16788 26603 10788 3432 5609 7140
10310 7140 6534 7999 6988 5743 2681 7971 922 4248 13151 16156 17627 8285 5898 -5756 -18647
10295 -18647 -16260 -7639 -3843 -4763 -4513 -4971 -5754 -9851 -2524 30 -7533 -12760 -20496 -14672 -20410
10280 -20410 -17816 -37 2347 289 31 -6364 -11395 -10444 -5665 3494 -617 9418 3921 -1287
10266 -1287 5131 11441 9385 15158 9249 647 -1519 -4434 -1683 -2096 -8583 -8676 -5825 3460 2284
10251 2284 10542 8254 1125 -2889 1129 9387 5620 -2895 -4704 -5427 1310 3254 6662 -2694 -13922
10236 -13922 -9540 -153 -773 -8420 2377 11315 10222 -4973 -12529 -4586 -3558 -8565 -8994 -1048
10222 -1048 4115 -10749 -21291 -24605 -17401 -10386 -7686 -1697 -4106 -9547 -6434 -6163 -14934 -8246
$$ packed form
10324b2140K961O87N666J138J0082N000R761j194M827R815j5815p356K177J531
10310G140o06J465j011j245l062N290p049L326Q903L005J471r342k387j1654j2891
10295a8647K387Q621L796r20K50m58p83m097P327K554p563n227p736N824n738
10280b0410K594J7779K384k058k58o395n031R51M779R159m111J0035n497n208
10266a287O418O310k056N773n909q602k166k915K751m13o487r3K851R285j176
10251B284Q258k288p129m014M018Q258l767q515j809p23O737J944L408r356j1228
10236a3922M382R387o20p647J0797Q938j093j5195p556P943J028n007m29P946
10222a048N163j4864j0542l314P204P015K700N989k409n441L113K71q771O688
$$ plain form
10208 -8246 2620 13251 20228 25715 20563 15260 20672 13640 6859 9584 8120 13175 4831 -3357
10194 -3357 -2362 -10180 -23430 -21053 -17432 -18663 -19762 -14767 -4774 -8112 -17588 -19155 -9553 -9293 -4470
10179 -4470 -14903 -7468 -14942 -13637 -8679 2835 9291 1658 -6025 -3027 -14951 -22411 -19329 -15573
10165 -15573 -14098 -10445 -1792 -5214 -11403 -10891 -13813 -7360 -1871 -9180 -11993 -4308 4420 -2474 -2174
10150 -2174 1080 -1912 139 5924 -1039 -405 3547 929 -2059 -10391 -4076 173 96 -3612 -1726
10135 -1726 -2317 -10280 -11486 -7277 -7665 -6738 -1600 -4232 -7611 -4409 -6121 -10242 -819 4465 4999 -6714
10119 -6714 -3610 -6803 -4999 -6204 -2896 3779 6220 -7652 -11513 -14327 -3410 -4122 -13820 -8812
10105 -8812 -2700 7207 12138 3180 -6991 -13585 -11149 -8922 -14649 1542 3380 -1758 -2560 3895
$$ packed form
10208h246J0866J0631O977N487n152n303N412p032o781K725j464N055q344q188
10194c357R95p818j3250K377L621j231j099M995R993l338r476j567R602K60M823
10179d470j0433P435p474J305M958J1514O456p633p683K998j1924p460L082L756
10165a5573J475L653Q653l422o189N12k922O453N489p309k813P685Q728o894L00
10150b174L254k992K051N785o963O34L952k618k988q332O315M249p7l708J886
10135a726n91p963j206M209l88R27N138k632l379L202j712m121R423N284N34j1713
10119f714L104l193J804j205L308O675K441j3872l861k814J0917p12r698N008
10105h812O112R907M931q958j0171o594K436K227n727J6191J838n138q02O455
$$ plain form
10091 3895 10423 19217 557 -7214 231 2093 -1524 -9341 -20226 -20035 -10867 1721 6464 525
10077 525 -7537 -8374 -10182 -16610 -10473 -3703 -5182 -11205 -7567 -15589 -7807 -1867 1734 1637 -4322 -1715
10061 -1715 -2529 -6713 -17797 -17368 -15672 -12298 -7680 -8659 -6121 2972 3407 -1926 -11029 1396 2484
10046 2484 7797 7307 9015 17321 19112 19099 12775 -1993 -9097 -3746 -3337 -9022 161 -882 -11482
10031 -11482 -23998 -18272 -3812 -4275 -1115 -4649 -7752 3935 -3996 -1806 2995 1061 -2062 -700
10017 -700 -7963 -19279 -5503 -4621 -8101 -4131 10945 12420 10319 24458 32213 23645 16169 1460
10003 1460 -6661 -12094 -11158 -4929 2128 924 238 3836 -2823 -16058 -24022 -12638 -5882 -11201 -13670
9988 -13670 -13691 -15236 -1355 6064 1348 6973 4838 -1878 967 -1034 -12678 -11910 -16567 -14528 -10454
$$ packed form
10091C895O528Q794j8660p771P445J862l617p817j0885J91R168J2588M743n939
10077E25q062q37j808o428O137O770j479o023L638q022P782N940L601r7n959K607
10061a715q14m184j1084M29J696L374M618r79K538R093M35n333r103J2425J088
10046B484N313m90J708Q306J791j3o324j4768p104N351M09n685R183j043j0600
10031a1482j2516N726J4460m63L160l534l103J1687p931K190M801j934l123J362
10017g00p263j1316J3776Q82l480L970J5076J475k101J4139P755q568p476j4709
10003A460q121n433R36O229P057j204o86L598o659j3235p964J1384O756n319k469
9988a3670k1j545J3881P419m716N625k135o716K845k001j1644P68m657K039M074
$$ plain form
9973 -10454 -9298 -12897 -8484 1402 -888 -8145 -10255 -7795 -10963 -10134 -7033 -13029 -22860 -26668 -28263
9958 -28263 -26378 -28045 -21748 -17016 -5608 117 -2678 -106 -1216 -21101 -19379 -9473 -11229 -14222
9944 -14222 -15854 -840 9229 24006 24820 19463 14763 13177 12094 12681 15172 25971 16098 -341
9930 -341 -1344 11245 16252 11608 9018 5171 4934 17789 18180 11485 15018 7132 2384 -5344 -13170
9915 -13170 -9368 -4796 6107 3565 7219 2455 1878 7284 8457 4788 9290 18068 21746 29830 19680
9900 19680 2567 7336 9552 20258 8013 -4682 -21454 -27250 -12128 5708 -4850 -2140 13605
9887 13605 19190 4929 2671 3643 6316 1301 4135 18409 17306 -800 -4792 5692 20814 25024
9873 25024 11564 -2425 2320 13288 20682 31315 29586 27590 31054 22167 30328 36860 52043
$$ packed form
9973a0454J156l599M413R886k290p257k110K460l168Q29L101n996r831l808j595
9958b8263J885j667O297M732J1408N725k795K572j110j9885J722R906j756k993
9944a4222j632J5014J0069J4777Q14n357m700j586j083N87K491J0799r873j6439
9930c41j003J2589N007m644k590l847k37J2855L91o695L533p886m748p728p826
9915a3170L802M572J0903k542L654m764n77N406J173l669M502Q778L678Q084j0150
9900A9680j7113M769K216J0706j2245j2695j6772n796J5122J7836j0558K710J5745
9887A3605N585j4261k258R72K673n015K834J4274j103j8106l992J0484J5122M210
9873B5024j3460j3989M745J0968P394J0633j729j996L464q887Q161O532J5183
$$ plain form
9860 52043 70309 74400 77643 99897 122625 150435 189973 256019 335463 434739 578037 742716
9848 742716 897174 996807 1009082 912822 723145 514841 360767 261800 204766 165756 129709
9837 129709 107136 112002 111304 94251 87062 75327 63671 63573 70346 70064 68363 63060 54257 56445
9823 56445 54924 51362 55837 55582 50233 41315 32486 29184 34356 37003 38056 38581 40148 28660 34261
9808 34261 36399 35449 34326 30008 30215 25424 17316 14408 21680 36304 39280 35904 28206 20283 14525
9793 14525 12036 -745 -8453 -7463 -6235 -5843 -279 -5061 -1719 520 4350 4963 -360 3863 13733
9778 13733 18229 14527 5501 1604 -2229 8311 13922 16978 24254 13663 6333 -3841 -4725 109
9764 109 2544 12962 14194 -219 1069 7254 606 13466 21701 20789 17993 8603 4343 -13288
$$ packed form
9860E2043J8266M091L243K2254K2728K7810L9538O6046P9444R9276J43298J64679
9848G42716J54458R9633J2275r6260j89677k08304j54074r8967n7034l9010l6047
9837A29709k2573M866o98j7053p189j1735j1656r8O773k82j701n303q803K188
9823E6445j521l562M475k55n349q918q829l302N172K647J053N25J567j1488N601
9808C4261K138r50j123m318K07m791q108k908P272J4624K976l376p698p923n758
9793A4525k489j2781p708R90J228L92N564m782L342K239L830O13n323M223R870
9778A3733M496l702r026l897l833J0540N611L056P276j0591p330j0174q84M834
9764A09K435J0418J232j4413J288O185o648J2860Q235r12k796r390m260j7631
$$ plain form
9750 -13288 -5170 3693 6673 5883 3528 -5968 -13234 -10163 -6568 -14040 -7912 -1634 4125 434 4064
9735 4064 3026 10767 8371 6891 -2905 -4840 -14708 -12556 -7341 8281 5859 2459 7039 5895 6129
9720 6129 -7304 -10860 1744 4409 -3911 -20838 -6957 12106 23274 17972 308 -9539 -13989
9707 -13989 -12638 -12962 -6716 1224 2485 2906 -5798 -8605 -8790 10790 13204 -1411 -8128 -1032 8125
9692 8125 4718 -3686 -11473 -15735 -26951 -30703 -32017 -28334 -21551 -15969 -5259 11773 16598 15304
9678 15304 18406 24631 29979 26333 14389 1231 -8872 -8349 -6190 -99 9030 13923 15711 15803 15386
9663 15386 13296 13280 5286 -4172 -15121 -10512 -3369 1398 6101 -5854 -16540 -2999 -6710 -14646
9649 -14646 -23720 -25641 -25078 -11746 -11140 -7785 -4654 -3275 -2408 -1719 -6847 -2635 -1729 -9115 -1541 12688
$$ packed form
9750a3288Q118Q863K980p90k355r496p266L071L595p472O128O278N759l691L630
9735D064j038P741k396j480r796j935r868K152N215J5622k422l400M580j144K34
9720F129j3433l556J2604K665q320j6927J3881J9063J1168n302j7664r847m450
9707a3989J351l24O246P940J261M21q704k807j85J9580K414j4615o717P096R157
9692H125l407q404p787m262j1216l752j314L683O783N582J0710J7032M825j294
9678A5304L102O225N348l646j1944j3158j0103N23K159O091R129M893J788R2m17
9663A5386k090j6p994r458j0949M609P143M767M703j1955j0686J3541l711p936
9649a4646r074j921N63J3332O06L355L131J379Q67O89n128M212R06p386P574J4229
$$ plain form
9633 12688 13011 7118 7231 10490 667 -11908 -13187 -3571 1135 -2068 2300 2632 7998 1637 -12414
9618 -12414 -22221 -18919 -7491 5394 5282 4855 -13535 -22487 -22017 -16467 -10282 -8673 7093 11770
9604 11770 16178 14415 4430 -6996 -10826 -5570 -3133 -4608 -20723 -12433 1017 7997 3263 -2081
9590 -2081 -4340 735 11649 12778 2718 -1847 -9596 -8957 570 -3665 -13281 -16493 -11748 -13491 -5758
9575 -5758 4900 8809 -507 -5220 3266 12880 24974 9955 -5911 -12413 -11986 -10451 -494 771
9561 771 -3256 4018 3676 894 231 -956 -3458 103 -8697 -14008 -2008 6935 -5140 -23188 -27391
9546 -27391 -24530 -15375 -12991 -9759 -13958 -13449 -16953 -16603 -12631 -13033 -10634 -130 2456 -1596 4975
9531 4975 -4115 -13681 -17584 -1879 14358 17721 25075 19488 6161 -383 -7340 -2232 12884 14613
$$ packed form
9633A2688L23n893J13L259r823j2575j279R616M706l203M368L32N366o361j4051
9618a2414r807L302J1428J2885j12m27j8390q952M70N550O185J609J5766M677
9604A1770M408j763r985j1426l830N256K437j475j6115Q290J3450O980m734n344
9590b081k259N075J0914J129j0060m565p749O39R527m235r616l212M745j743P733
9575e758J0658L909r316m713Q486R614J2094j5019j5866o502M27J535R957J265
9561G71m027P274l42k782o63j187k502L561q800n311J2000Q943j2075j8048m203
9546b7391K861R155K384L232m199N09l504L50L972m02K399J0504K586m052O571
9531D975r090r566l903J5705J6237L363P354n587j3327o544o957N108J5116J729
$$ plain form
9517 14613 10652 -2690 2826 12495 18543 9025 2418 -1747 -1421 7 -4787 -18504 -14820 -9849
9503 -9849 -826 14737 17467 13547 4264 -3929 -8856 -13003 -4800 -1057 2791 20845 26954 12311
9489 12311 2287 -10594 -15324 -25738 -18296 -18001 -12934 -5794 -4794 3773 16476 14741 9635 3127
9475 3127 -538 -7330 -2694 13180 17475 15838 9495 -1862 -2972 -7407 -18167 -20402 -15821 -13369
9461 -13369 -7227 2185 -6291 -13537 -23881 -22993 -16374 -4589 486 6065 6797 4359 4301 8185 -1425
9446 -1425 -2713 12983 15590 11405 6400 12336 16586 5006 -999 -5896 2378 6351 12057 20568
9432 20568 17356 8820 17990 29796 29060 24991 18537 22219 23766 21927 28960 32244 24435 6525
9418 6525 1737 5093 3586 -1277 -5945 6423 17086 16564 7528 2195 6697 9823 11067 7849 8507
$$ packed form
9517A4613l961j3342N516R669O048r518o607m165L26J428m794j3717L684M971
9503i849R023J5563K730l920r283q193m927m147Q203L743L848J8054O109j4643
9489A2311j0024j2881m730j0414P442K95N067P140J000Q567J2703j735n106o508
9475C127l665o792M636J5874M295j637o343j1357j110m435j0760k235M581K452
9461a3369O142R412q476p246j0344Q88O619J1785N075N579P32k438n8L884r610
9446a425j288J5696K607m185n005N936M250j1580o005m897Q274L973N706Q511
9432B0568l212q536R170J1806p36m069o454L682J547j839P033L284p809j7910
9418F525m788L356j507m863m668J2368J0663n22r036n333M502L126J244l218O58
$$ plain form
9403 8507 7901 6812 3998 5482 17726 14818 6296 1981 -1470 -5756 87 11698 17363 18779 14348
9388 14348 10656 3108 6527 13293 15666 23809 27478 21408 18352 31517 37306 32472 35600 42747
9374 42747 38466 21595 20848 35763 44412 45930 29903 31801 36099 33411 21553 12251 27898 45415
9360 45415 49275 60253 61806 57648 50383 48744 50608 53945 53647 63439 72446 72847 81098 78909 86418
9345 86418 98593 96424 99618 118664 128360 146110 142827 145368 169708 193967 212788 224362 235650
9332 235650 256544 297764 357853 420485 485359 580382 698181 834450 1001096 1193034 1432691
9321 1432691 1729276 2098266 2565233 3119095 3736883 4360417 4864431 5141270 5095747 4681002
9311 4681002 3985065 3224315 2565319 2046164 1672306 1414688 1220908 1066395 948127 847056
$$ packed form
9403H507o06j089k814J484J2244k908q522m315l451m286N843J1611N665J416m431
9388A4348l692p548L419O766K373Q143L669o070l056J3165N789m834L128P147
9374D2747m281j6871p47J4915Q649J518j6027J898M298k688j1858r302J5647J7517
9360D5415L860J0978J553m158p265j639J864L337k98R792R007M01Q251k189P509
9345H6418J2175k169L194J9046R696J7750l283K541K4340K4259J8821J1574J1288
9332B35650K0894M1220O0089O2632O4874R5023J17799J36269J66646J91938K39657
9321A432691K96585L68990M66967N53862O17788O23534N04014K76839m5523m14745
9311D681002o95937p60750o58996n19155l73858k57618j93780j54513j18268j01071
$$ plain form
9301 847056 775406 713718 667950 632292 596652 561811 523699 499189 492629 493462 476491 469822
9289 469822 458216 432811 404791 372346 346722 319058 301413 293305 287440 265930 243874 226845
9277 226845 209136 185868 162858 142914 135061 141081 143263 129556 129903 131085 122242 114616 105324
9264 105324 99226 85916 80369 81430 80058 75462 62936 56334 56526 65242 70912 57662 55185 52268
9250 52268 49847 41543 36061 53898 60227 46923 43332 34678 37362 33336 23687 15285 18309 21123
9236 21123 20198 21781 16291 12722 17597 25715 19108 16838 13797 12677 13082 9322 12855 23400 18181
9221 18181 15274 9628 16426 3783 -13471 -962 10148 12803 11221 4128 6368 -2043 -4514 -4458
9207 -4458 -4350 -2556 15901 14150 6226 -5249 -4993 10150 16060 20758 25362 28798 32876 43934
$$ packed form
9301H47056p1650o1688m5768l5658l5640l4841l8112k4510o560Q33j6971o669
9289D69822j1606k5405k8020l2445k5624k7664j7645q108n865k1510k2056j7029
9277B26845j7709k3268k3010j9944p853O020K182j3707L47J182q843p626r292
9264A05324o098j3310n547J061j372m596j2526o602J92Q716N670j3250k477k917
9250E2268k421q304n482J7837O329j3304l591q654K684m026r649q402L024K814
9236B1123r25J583n490l569M875Q118o607k270l041j120M05l760L533J0545n219
9221A8181k907n646O798j2643j7254J2509J1110K655j582p093K240q411k471N6
9207d458J08J794J8457j751p924j1475K56J5143N910M698M604L436M078J1058
$$ plain form
9193 43934 37070 20892 5016 -2770 -485 7410 8818 16262 15940 381 1116 7391 14938 15209 9582
9178 9582 13807 16775 15392 9832 17810 19042 17747 19822 26757 22691 13227 8235 10042 17053 12994
9163 12994 7614 -3399 -7760 -6006 -7672 1637 3123 10509 13720 2026 1100 -462 3525 861
9149 861 12808 15473 8103 -4755 -13997 -11462 82 3648 4461 1891 7061 14237 11643 8362 -8545
9134 -8545 -6915 2653 3571 5561 7537 6758 4504 4864 15332 9750 4866 8554 4282 -1621 9306
9119 9306 12080 12398 4508 1713 5340 -560 -1922 8013 9962 9947 2900 -3041 -629 -4815 -5995 -3465
9103 -3465 10374 10417 -974 3304 3450 5654 3098 2640 7462 -2490 -10073 -5631 15884 11138 -1188
9088 -1188 -5342 -743 2392 4248 -1360 3367 -411 -8914 -10226 -10994 -17048 -21907 -6921 1093 1108
$$ packed form
9193D3934o864j6178j5876p786K285P895J408P444l22j5559P35O275P547K71n627
9178I582M225K968j383n560P978J232j295K075O935m066r464m992J807P011m059
9163A2994n380j1013m361J754j666R309J486P386L211j1694r26j562L987k664
9149H61J1947K665p370j2858r242K535J1544L566Q13k570N170P176k594l281j6907
9134h545J630R568R18J990J976p79k254L60J0468n582m884L688m272n903J0927
9119I306K774L18p890k795L627n900j362R935J949j5p047n941K412m186j180K530
9103c465J3839M3j1391M278J46K204k556m58M822r952p583M442K1515m746j2326
9088a188m154M599L135J856n608M727l778q503j312p68o054m859J4986Q014J5
$$ plain form
9073 1108 -4855 -4637 -1584 8699 18205 17029 7212 11947 5135 -8615 -4058 -1488 -9185 -13230 -10577
9058 -10577 -2776 4986 1487 -1046 -3157 -7981 104 -8900 -14961 -8110 -11709 -6506 -3295 -3314 -1156
9043 -1156 -2806 -5544 -9144 -9405 7708 16198 11521 -3346 -6987 -2874 789 -6126 -9559 -9649 -1092
9028 -1092 17039 16511 11876 15438 21773 31525 32079 28764 22942 12189 3199 11600 20743 12067 2458
9013 2458 10054 21172 23201 22591 19351 2452 764 6187 17569 28945 30018 14715 749 3634
8999 3634 6559 299 -3125 13033 24301 36498 12670 -4428 615 -6309 -8372 -710 -2262 -11352
8985 -11352 -9457 -10606 -810 5779 14041 22327 14568 8845 3817 1618 8580 15251 17702 31053
8971 31053 20459 7315 -1070 -8136 -8508 -10070 -11777 -10524 -7067 -10579 -13315 -13145 -17815 -10764 -8696
$$ packed form
9073A108n963K18L053J0283R506j176r817M735o812j3750M557K570p697m045K653
9058a0577P801P762l499k533k111m824Q085r004o061O851l599N203L211j9K158
9043a156j650k738l600k61J7113Q490m677j4867l641M113L663o915l433r0Q557
9028a092J8131n28m635L562O335R752N54l315n822j0753q990Q401R143q676r609
9013B458P596J1118K029o10l240j6899j688N423J1382J1376J073j5303j3966K885
8999C634K925o260l424J6158J1268J2197k3828j7098N043o924k063P662j552r090
8985a1352J895j149R796O589Q262Q286p759n723n028k199O962O671K451J3351
8971C1053j0594j3144q385p066l72j562j707J253L457l512k736J70m670P051K068
$$ plain form
8956 -8696 -1290 4721 9771 3857 7373 3873 -3864 -8552 -7691 6135 19924 25007 16889 -2319
8942 -2319 -9703 -2398 4012 -840 -2180 -8918 -24270 -39089 -37488 -18156 15254 15471 6143 16748
8928 16748 13735 16448 21018 11744 7075 2747 4521 -3979 -13436 -7786 2328 17290 31160 36219
8914 36219 32255 25194 6875 -1190 -8814 -17011 -29065 -30017 -31250 -29976 -17981 -555 11915 5789
8900 5789 -4138 2019 -3562 -19080 -27190 -17357 -8586 253 13453 7637 387 -7642 -10394 -1198
8886 -1198 12923 16133 8676 6668 6655 17362 16040 10702 12565 23766 32664 26452 14381 -5132
8872 -5132 -18679 -18880 -14824 -9849 -9848 -8220 -11133 -10188 -6134 1377 2881 4063 -3420 -10817 -5697 16884
8856 16884 8321 3912 -4606 10757 20059 15107 14915 6873 3750 5084 -2447 -5938 -7287 -15062 -19564
$$ packed form
8956h696P406O011N050n914L516l500p737m688Q61J3826J3789N083q118j9208
8942b319p384P305O410m852j340o738j5352j4819J601J9332L3410K17r328J0605
8928A6748l013K713M570r274m669m328J774q500r457N650J0114J4962J3870N059
8914C6219l964p061j8319q065p624q197j2054r52j233J274J1995J7426J2470o126
8900E789r927O157n581j5518q110R833Q771Q839J3200n816p250q029k752R196
8886a198J4121L210p457k008j3J0707j322n338J863J1201Q898o212j2071j9513
8872e132j3547k01M056M975JJ628k913R45M054P511J504J182p483p397N120K2581
8856A6884q563m409q518J5363R302m952j92q042l123J334p531l491j349p775m502
$$ plain form
8841 -19564 -15903 3476 9685 529 -8981 -9493 -5854 1621 11141 11838 3847 3905 9259 13514 8304
8826 8304 4128 4247 9125 6561 -2770 -6429 -2918 1745 3401 -5554 -4124 9723 20327 10463 9286
8811 9286 13090 11531 23769 29896 23838 13094 3810 12105 18557 9790 10421 9118 11206 20004 17378
8796 17378 9535 16550 16142 7280 10216 11196 2317 9953 15556 13895 7218 3969 -599 1425 752
8781 752 -10025 -7684 9391 17494 5150 -1691 858 -8399 -10044 7829 16578 8402 -2063 -3002
8767 -3002 -4113 -1459 871 -536 -6098 2754 12623 9989 14715 16138 5682 4661 6892 2636 4594
8752 4594 13129 11326 7082 11777 9615 13164 6607 8024 12271 2864 -3780 2801 15496 11729 1921
8737 1921 -6023 827 17304 18550 8618 3003 -4519 -9952 -13466 -20346 -13077 554 4708 4867 -1562
$$ packed form
8841a9564L661J9379O209r156r510n12L639P475R520O97p991N8N354M255n210
8826H304m176J19M878k564r331l659L511M663J656q955J430J3847J0604r864j177
8811I286L804j559J2238O127o058j0744r284Q295O452q767O31j303K088Q798k626
8796A7378p843P015m08q862K936R80q879P636N603j661o677l249m568K024o73
8781G52j0777K341J7075Q103j2344o841K549r257j645J7873Q749q176j0465r39
8767c002j111K654K330j407n562Q852R869k634M726J423j0456j021K231m256J958
8752D594Q535j803m244M695k162L549o557J417M247r407o644O581J2695l767r808
8737A921p944O850J6477J246r932n615p522n433l514o880P269J3631M154J59o429
$$ plain form
8722 -1562 -2739 -3391 460 -327 -5058 123 -4021 -10123 -10149 -3861 -216 -3435 6718 4384 2977 7867
8706 7867 14602 11346 16942 8736 375 5467 10019 9931 -290 123 2081 -5747 1394 13720 18392
8691 18392 11929 5330 7993 2336 2542 7729 15735 18152 7325 -7488 -6468 7078 13959 14609
8677 14609 12600 11233 8513 11988 20862 21188 22698 22341 15164 7813 15280 25624 26257 24271 15045
8662 15045 24127 33927 37030 38855 30750 22318 26278 34883 47591 65143 66080 91153 128905 160137
8648 160137 212445 256798 282056 291764 269976 214393 147925 98563 68026 55789 53153 50539
8636 50539 37658 30033 40699 48826 33494 13302 20014 31760 48524 46765 44240 29174 29561
8623 29561 33636 27962 30513 32252 46549 49522 51093 50772 54388 60700 62182 71869 77478 98133
$$ packed form
8722a562j177o52L851p87m731N181m144o102k6O288L645l219J0153k334j407M890
8706G867O735l256N596q206q361N092M552q8j0221M13J958p828P141J2326M672
8691A8392o463o599K663n657K06N187Q006K417j0827j4813J020J3546O881O50
8677A4609k009j367k720L475Q874L26J510l57p177p351P467J0344O33j986r226
8662A5045R082R800L103J825q105q432L960Q605J2708J7552R37K5073L7752L1232
8648A60137N2308M4353K5258R708k1788n5583o6468m9362l0537j2237k636k614
8636E0539j2881p625J0666Q127j5332k0192O712J1746J6764j759k525j5066L87
8623B9561M075n674K551J739J4297K973J571l21L616O312J482R687N609K0655
$$ plain form
8609 98133 110465 126782 150956 192607 250048 320111 392662 466110 521326 549037 515448 410816
8597 410816 304495 218876 171171 142743 120425 98827 96171 92389 85060 72051 61297 61638
8585 61638 61243 67201 63482 61278 57390 52217 50250 48203 48322 51842 47461 47638 46018 50390 59400
8570 59400 51124 49307 52044 43735 57073 62534 63223 64585 76048 87901 116536 144206 178220
8557 178220 216839 245665 245555 236160 207853 162623 120407 96287 70755 46331 40989 29008
8545 29008 22464 16422 11045 5708 11503 14431 21324 23698 19032 23103 19692 25253 33222 30485 20250
8530 20250 11224 1918 1902 -2436 7236 15474 16031 13991 11669 12900 11332 6578 4518 13062 17295
8515 17295 19258 22877 27378 16985 3797 3735 -3422 -3250 -1178 -2456 -236 3609 10895 13682 12925
$$ packed form
8609I8133J2332J6317K4174M1651N7441P0063P2551P3448N5216K7711l3589j04632
8597D10816j06321q5619m7705k8428k2318k1598k656l782p329j3009j0754L41
8585F1638l95N958l719k204l888n173j967k047J19L520m381J77j620M372R010
8570E9400q276j817K737q309J3338N461O89J362J1463J1853K8635K7670L4014
8557A78220L8619K8826j10r395k8307m5230m2216k4120k5532k4424n342j1981
8545B9008o544o042n377n337N795K928O893K374m666M071l411N561P969k737j0235
8530B0250r026r306j6m338R672Q238N57k040k322J231j568m754k060Q544M233
8515A7295J963L619M501j0393j3188o2p157J72K072j278K220L845P286K787p57
$$ plain form
8500 12925 9778 -232 2471 11391 15109 7874 15160 13396 16190 7943 10661 18632 18113 25035 29496
8485 29496 29032 20388 21185 9758 -1671 -1103 -445 5291 15624 9661 5190 -7113 -7643 6813 27691
8470 27691 32297 29810 25299 12950 4332 8847 -2474 -19481 -25133 -30030 -25178 -24110 -12627 -6589
8456 -6589 -7032 -11292 -9548 -18447 -20389 -7803 -5557 -10875 -4212 -172 14639 14115 3848 -8443
8442 -8443 -17501 -17832 -14444 -22327 -14275 345 12088 6486 -2827 -7869 -601 8661 10307 1079 -5185
8427 -5185 4044 13200 7474 -10450 -19617 -13513 -10594 -10744 -6739 -11243 -17589 -11678 -14569 -8107 -12314
8412 -12314 -4820 3940 697 5560 8650 3810 -1765 -10691 -14948 -12385 -17760 -17569 -9633 3725 7991
8397 7991 13855 11029 666 -179 8831 8769 5482 -2231 2057 2862 -6575 -18171 -15313 -10587 -3308
$$ packed form
8500A2925l147j0010K703Q920L718p235P286j764K794q247K718P971n19O922M461
8485B9496m64q644P97j1427j1429N68O58N736J0333n963m471j2303n30J4456K0878
8470B7691M606k487m511j2349q618M515j1321j7007n652m897M852J068J1483O038
8456f589m43m260J744q899j942J2586K246n318O663M040J4811n24j0267j2291
8442h443r058l31L388p883Q052J4620J1743n602r313n042P268R262J646r228o264
8427e185R229R156n726j7924r167O104K919j50M005m504o346N911k891O462m207
8412a2314P494Q760l243M863L090m840n575q926m257K563n375J91P936J3358M266
8397G991N864k826j0363q45R010o2l287p713M288Q05r437j1596K858M726P279
$$ plain form
8382 -3308 -2231 -4919 -1315 3385 9259 6416 -6791 -15291 -15505 -18653 -20271 -6642 736 -4551 -3665
8367 -3665 -5076 -7611 -11319 -17430 -17793 -7339 6195 13472 24410 26084 26414 28675 29668 29542 17450
8352 17450 5481 -39 -1818 -13269 -17586 -26938 -22029 -17688 -14684 -15465 -6907 412 -10531 -7349
8338 -7349 -4263 -1868 6939 6488 -5557 -15402 -10149 -8089 -4673 -5769 -7053 -12513 -19820 -7791 12752
8323 12752 12491 -8780 -8815 4742 13754 16231 12604 6789 2174 -3976 2659 14956 16039 16762 9901
8308 9901 10013 9786 8963 5217 3330 -83 181 -9618 -19264 -22656 -13429 -6730 3088 7172 5374 3013
8292 3013 -3550 -10979 -14117 -14545 -4907 2242 3170 -78 2905 8698 -4447 -8108 -5672 -10946 -10378
8277 -10378 -6901 1701 803 9936 22810 8806 -2883 2966 1283 -2312 -13858 -20201 -15531 -3058
$$ packed form
8382c308J077k688L604M700N874k843j3207q500k14l148j618J3629P378n287Q86
8367c665j411k535l708o111l63J0454J3534P277J0938J674L30K261R93j26j2092
8352A7450j1969n520j779j1451m317r352M909M341L004p81Q558P319j0943L182
8338g349L086K395Q807m51j2045r845N253K060L416j096j284n460p307J2029K0543
8323A2752k61k1271l5J3557R012K477l627n815m615o150O635J2297J083P23o861
8308I901J12k27q23l746j887l413K64r799r646l392R227O699R818M084j798k361
8292C013o563p429l138m28R638P149R28l248K983N793j3145l661K436n274N68
8277a0378L477Q602q98R133J2874j4004j1689N849j683l595j1546o343M670J2473
$$ plain form
8263 -3058 8316 17541 16146 5114 7239 7976 5480 9636 -876 -7048 -10103 -12517 -17841 -3527
8249 -3527 7935 15727 6096 915 3611 480 2972 140 -7287 -2587 -955 5030 3119 -98 -960
8234 -960 5023 781 671 2515 -1770 -12773 -19956 -13546 -8660 -2655 6242 9898 2756 -5310 -12256
8219 -12256 -15223 -21109 -15336 -9021 -5390 -6670 -4550 -3645 -11594 -7591 -2703 -15769 -16573 -4865 -2484
8204 -2484 -6270 -1118 10903 19363 10640 6002 7085 9823 8313 10219 4955 1085 -6760 -13716 -18209
8189 -18209 -17836 -14233 -12075 -12549 -15635 -18322 -8116 -1035 -10165 -7071 2950 5583 5303 -2970 -636
8174 -636 10784 20152 16803 5220 3691 8196 5959 -4143 -13188 -14802 -9471 -7978 -3069 -4742
8160 -4742 -1125 160 -4257 -7468 -9681 1394 10889 13361 5199 2722 -8546 -11155 -7059 1436
$$ packed form
8263c058J1374R225j395j1032K125P37k496M156j0512o172l055k414n324J4314
8249c527J1462P792r631n181K696l131K492k832p427M700J632N985j911l217q62
8234i60N983m242j10J844m285j1003p183O410M886O005Q897L656p142q066o946
8219a2256k967n886N773O315L631j280K120R05p949M003M888j3066q04J1708K381
8204b484l786N152J2021Q460q723m638J083K738j510J906n264l870p845o956m493
8189a8209L73L603K158m74l086k687J0206P081r130L094J0021K633k80q273K334
8174f36J1420R368l349j1583j529M505k237j0102r045j614N331J493M909j673
8160d742L617J285m417l211k213J1075R495K472q162k477j1268k609M096Q495
$$ plain form
8146 1436 10808 9629 10661 9081 12384 15863 8457 -1407 -16554 -18604 -14110 -15006 -12014 -16554 -16057
8131 -16057 -13546 155 10833 19130 22078 13345 2491 54 -5805 -14354 -22962 -19435 -6377 -8272
8117 -8272 -593 -3699 -2228 4790 6837 3190 1550 4089 983 -4727 -6541 358 1749 2271 -502
8102 -502 -401 -22 -2270 2689 11361 23888 39430 24991 16357 14833 14596 8795 5430 4423 10408
8087 10408 14085 10191 15571 11581 4516 -1741 -2252 -4949 -11958 5980 14849 4819 5128 8369 16574
8072 16574 14369 11984 22170 16635 3608 2602 11646 13851 6219 -995 -4365 -5566 -3409 8829
8058 8829 15660 5457 -3560 -995 -2569 149 5414 17013 19987 15860 3916 1482 -3491 1438
8044 1438 2139 5774 8708 14414 18464 14277 6576 -1706 3382 7427 -4745 -8411 3724 -400 -9564
$$ packed form
8146A436R372j179J032j580L303L479p406r864j5147k050M494q96K992m540M97
8131a6057K511J3701J0678Q297K948q733j0854k437n859q549q608L527J3058j895
8117h272P679l106J471P018K047l647j640K539l106n710j814O899J391N22k773
8102e02J01L79k248M959Q672J2527J5542j4439q634j524k37n801l365j007N985
8087A0408L677l894N380l990p065o257n11k697p009J7938Q869j0030L09L241Q205
8072A6574k205k385J0186n535j3027j006R044K205p632p214l370j201K157J2238
8058H829O831j0203r017K565j574K718N265J1599K974m127j1944k434m973M929
8044A438P01L635K934N706M050m187p701q282N088M045j2172l666J2135m124r164
$$ plain form
8029 -9564 -20649 -15134 1493 3921 2425 7993 -5465 1500 3244 -1566 7843 15915 6399 4445
8015 4445 6130 6664 10050 18678 22109 15308 127 -6473 -13300 -4171 7135 8236 10312 6435 7077
8000 7077 8373 4464 -3571 -5001 1707 1759 -4070 -5944 -15513 -24972 -36982 -34477 -34394 -25082 -9578
7985 -9578 948 789 3089 9449 7471 15546 7585 -5146 -4881 12388 5962 1573 9089 17985 14379
7970 14379 16561 26631 20522 15287 10452 11357 246 -1488 -819 768 8254 1195 5472 17026
7956 17026 27221 18397 15509 13840 4236 5077 10442 11786 12383 21010 21601 16237 -5072 -13132 -12477
7941 -12477 -3078 12687 16819 20994 15524 15869 21813 11049 5050 6107 -2461 -9312 -18908 -15343
7927 -15343 -1737 -2335 -14273 -14900 -3333 1663 7225 5153 1818 -3881 -10426 216 14090 18130
$$ packed form
8029i564j1085N515J6627K428j496N568j3458O965J744m810R409Q072r516j954
8015D445J685N34L386Q628L431o801j5181o600o827R129J1306J101K076l877O42
8000G077J296l909q035j430O708N2n829j874r569r459j2010K505Q3R312J5504
7985i578J0526j59K300O360j978Q075p961j2731K65J7269o426m389P516Q896l606
7970A4379K182J0070o109n235m835R05j1111j734O69J587P486p059M277J1554
7956A7026J0195q824k888j669r604Q41N365J344N97Q627N91n364k1309q060O55
7941a2477R399J5765M132M175n470L45N944j0764n999J057q568o851r596L565
7927a5343J3606n98j1938o27J1567M996N562k072l335n699o545J0642J3874M040
$$ plain form
7913 18130 23226 4382 -7286 1059 6739 13581 1773 1083 -1788 -7683 -7424 -5992 -2104 1751
7899 1751 262 16598 30972 33835 22780 16440 25302 29084 19738 18104 22802 19365 2918 7104
7885 7104 19490 13273 3155 4402 8660 14993 13095 7034 -259 6028 14777 23468 23389 11556 10779
7870 10779 18727 21975 28064 15115 6623 -1692 -7905 -9609 -17776 -25547 -17271 -9376 -7573 -2937
7856 -2937 3259 1560 -12926 -22173 -17077 -6492 6064 10416 4928 4617 4506 -3827 -15730 -26457
7842 -26457 -14209 -8072 -5420 4460 11377 4530 3773 -9112 -14108 -10637 -9527 1563 5340 3919
7828 3919 9509 10698 -4736 -17660 -20818 -18969 -7548 -823 2005 -2979 -3616 -2263 -14302 -15274
7814 -15274 -5637 2813 11491 7887 3218 -772 -4387 1481 3885 -1896 1120 -4392 -4498 -4703 -11819
$$ packed form
7913A8130N096j8844j1668Q345N680O842j1808o90k871n895K59J432L888L855
7899A751j489J6336J4374K863j1055o340Q862L782r346j634M698l437j6447M186
7885G104J2386o217j0118J247M258O333j898o061p293O287Q749Q691p9j1833p77
7870A0779P948L248O089j2949q492q315o213j704q167p771Q276P895J803M636
7856b937O196j699j4486r247N096J0585J2556M352n488l11j11q333j1903j0727
7842b6457J2248O137K652R880O917o847p57j2885m996L471J110J1090L777j421
7828C919N590J189j5434j2924l158J849J1421O725K828m984o37J353j2039r72
7814a5274R637Q450Q678l604m669l990l615N868K404n781L016n512j06k05p116
$$ plain form
7799 -11819 -4482 -3150 -9067 -8722 -9649 -5113 -2460 7444 16266 -336 1518 8581 15637 20517 23340
7784 23340 17569 12756 9353 11995 10715 12053 8399 -3726 -9694 -8123 -7919 -742 -7 -4763 936
7769 936 16160 4742 -4112 284 -5020 -4769 -919 1917 7177 1021 -6483 -12724 -8515 -10637 -15673
7754 -15673 -9563 -3475 -7377 -8176 2042 10196 12609 8266 2276 -3454 1507 4395 18676 14206
7740 14206 1696 -2264 2210 857 -12452 -19384 -28053 -25410 -15312 -4849 -2976 -5226 -4699 2498
7726 2498 -493 -11063 -10389 -6887 -8232 -7743 -11838 -18648 -13638 272 3334 1005 3407 -942 1334
7711 1334 9419 8832 -7299 -13727 -388 2643 -2743 -1441 4 2099 1337 5955 1199 -7899 -15248
7696 -15248 -17805 -7674 -7414 -10407 1242 8333 6576 6481 5473 3518 7698 11720 10897 2792 -8325
$$ packed form
7799a1819P337J332n917L45r27M536K653R904Q822j6602J854P063P056M880K823
7784B3340n771m813l403K642j280J338l654j2125n968J571K04P177P35m756N699
7769I36J5224j1418q854M396n304K51L850K836N260o156p504o241M209k122n036
7754a5673O110O088l902p99J0218Q154K413m343n990n730M961K888J4281m470
7740A4206j2510l960M474j353j3309o932q669K643J0098J0463J873k250N27P197
7726B498k991j0570O74L502j345M89m095o810N010J3910L062k329K402m349K276
7711A334Q085n87j6131o428J3339L031n386J302J445K095p62M618m756r098p349
7696a5248k557J0131K60k993J1649P091j757r5j008j955M180M022q23q105j1117
$$ plain form
7681 -8325 -15238 -15886 -2183 12387 7559 6804 -5933 -11563 -11601 -5160 -3463 -2688 -3216 2572 12573
7666 12573 11355 10966 6212 -2419 -7088 -7690 3205 3904 1183 -11955 -8530 -7399 -12056 -1709 775
7651 775 -1172 -7454 -398 10723 15262 12675 -9371 -17206 -16194 -9521 -7884 522 6247 5925 -1014
7636 -1014 4200 -1018 1274 -7187 -4033 8980 11126 10643 3205 183 -39 3406 -453 -3364 -373
7621 -373 7812 7701 -1989 -3146 -6210 -18863 -23451 -9097 2752 16883 6283 345 5109 5791
7607 5791 2889 -5743 2970 11703 1665 -6814 -9767 -5093 -2362 -2287 -10646 -8678 -4326 -897 -6342
7592 -6342 -12999 -10051 5103 7266 -3785 -14110 -11148 -15256 -16027 -4138 8789 10261 452 -5499
7578 -5499 -11023 -9574 -8671 -7439 -9605 -4748 -5853 -14317 -16278 -6725 -1236 -176 -10691 -539 9006
$$ packed form
7681h325o913o48J3703J4570m828p55j2737n630l8O441J697P75n28N788J0001
7666A2573j218l89m754q631m669o02J0895O99k721j3138L425J131m657J0347K484
7651G75j947o282P056J1121M539k587k2046p835J012O673J637Q406N725l22o939
7636a014N214n218K292q461L154J3013K146m83p438l022k22L445l859k911K991
7621c73Q185j11r690j157l064j2653m588J4354J1849J4131j0600n938M764O82
7607E791k902q632Q713Q733j0038q479k953M674K731P5q359J968M352L429n445
7592f342o657K948J5154K163j1051j0325K962m108p71J1889J2927J472r809n951
7578e499n524J449R03J232k166M857j105q464j961R553N489J060j0515J0152R545
$$ plain form
7563 9006 -1205 2755 10918 13509 11352 3373 -27 9269 7128 -4676 -6896 -12259 -11734 -10048 -2429
7548 -2429 9182 9419 -5208 6545 7449 4603 5302 3121 -1524 6445 -617 -15094 -18196 -3490
7534 -3490 9961 10934 13310 14980 21895 7963 -5341 4855 536 -12118 -19586 -17330 -19186 -17883
7520 -17883 -23214 -21938 -8621 -5556 -4317 -4226 -15258 -10190 -1572 -7551 -16808 -15970 -5178 -6426 -7916
7505 -7916 -10176 -9234 -14600 -9393 -3225 8115 14159 13391 9824 3392 14040 23617 14303 14457 9585
7490 9585 2643 7347 6867 -807 -3752 -14136 -13733 -10447 -8067 -227 9425 3522 6545 10445 4228
7475 4228 1765 -4653 -10931 -3051 -3162 -4626 -14015 -9939 -7618 -3559 7585 -609 -10971 -8997 -413
7460 -413 6016 57 1649 -4482 -8001 -15049 -15259 -8266 -8660 -18336 -23155 -14888 -14069 -18785 -12046 3760
$$ packed form
7563I006j0211L960Q163K591k157p979l400R296k141j1804k220n363N25J686P619
7548b429J1611K37j4627J1753R04k846O99k181m645P969p062j4477l102J4706
7534c490J3451R73K376J670O915j3932j3304J0196m319j2654p468K256j856J303
7520a7883n331J276J3317L065J239R1j1032N068Q618n979r257Q38J0792j248j490
7505g916k260R42n366N207O168J1340O044p68l567o432J0648R577r314J54m872
7490I585o942M704m80p674k945j0384M03L286K380P840R652n903L023L900o217
7475D228k463o418o278P880j11j464r389M076K321M059J1144q194j0362J974Q584
7460d13O429n959J592o131l519p048k10O993l94r676m819Q267Q19m716O739J5806
$$ plain form
7444 3760 5890 -5906 -12915 -15039 -6210 -3754 -3248 1998 1079 5700 8312 -3349 29 1362 6643
7429 6643 5936 -6076 -7002 -11080 -4532 4810 2428 -2164 4539 8292 9350 14950 15588 16112 4661
7414 4661 -6927 -15816 -15601 -20725 -15661 -8354 -8562 -14498 -19792 -12388 -4717 -5215 -9137 -14696 -10915
7399 -10915 -14135 -9473 5995 8593 -864 -4679 -4817 -6553 -10707 -6709 4470 4293 2483 1518 9435
7384 9435 11784 9706 6786 6935 -3302 1513 445 -3773 6105 14526 12700 359 -5470 -2332 3252
7369 3252 1720 -1784 -16938 -11293 6447 16419 6173 566 -2043 -11596 -16985 -20619 -16696 -8158
7355 -8158 7364 11002 11108 -308 -7232 -10019 -5555 -7444 -6586 -12289 -13447 -7474 -5416 -17781 -26539
7340 -26539 -25304 -13285 11643 20991 13100 8185 -2078 -7647 -10760 -20003 -2908 3550 -2186 -718
$$ packed form
7444C760K130j1796p009k124Q829K456N06N246r19M621K612j1661L378J333N281
7429F643p07j2012r26m078O548R342k382m592O703L753J058N600O38N24j1451
7414D661j1588q889K15n124N064P307k08n936n294P404P671m98l922n559L781
7399a0915l220M662J5468K598r457l815j38j736m154L998J1179j77j810r65P917
7384I435K349k078k920J49j0237M815j068m218R878Q421j826j2341n829L138N584
7369C252j532l504j5154N645J7740R972j0246n607k609r553n389l634L923Q538
7355h158J5522L638J06j1416o924k787M464j889Q58n703j158N973K058j2365q758
7340b6539J235J2019K4928R348p891m915j0263n569l113r243J7095O458n736J468
$$ plain form
7326 -718 -8064 -11873 -10524 -3843 1185 -6564 -10543 -4826 -2162 -3131 1612 3521 5305 8974 15861
7311 15861 9949 12727 9092 3195 4450 -4939 176 -2778 -11454 -3676 10434 2501 469 -58 -836
7296 -836 -618 -1481 -6833 -14079 -13861 -9116 -1210 3368 7463 6569 -7325 -6628 814 6637 -2200 685
7280 685 2243 753 5252 3871 2364 7655 7863 11639 19225 19917 13776 6799 5901 15961 8852 6525
7264 6525 13303 18849 20197 16569 12996 10399 8481 11200 14403 8991 8769 -622 -8027 -7502 -3269
7249 -3269 -8908 -13577 -6817 2858 173 1896 6570 16338 13867 14431 10868 13170 13792 16052 16150 7536
7233 7536 9219 14584 10148 6451 -2327 -4116 -7615 -9030 -11509 -16326 -11973 -3720 -7412 2667 135
7218 135 -2682 -5894 -3641 3974 6086 9870 5809 -650 3136 2093 1428 14055 16112 12522 6624
$$ packed form
7326g18p346l809J349O681N028p749l979N717K664r69M743J909J784L669O887
7311A5861n912K778l635n897J255r389N115k954q676P778J4110p933k032n27p78
7296h36K18q63n352p246K18M745P906M578M095q94j3894O97P442N823q837K885
7280F85J558j490M499j381j507N291K08L776P586O92o141o977q98J0060p109k327
7264F525O778N546J348l628l573k597j918K719L203n412k22r391p405N25M233
7249c269n639m669O760R675k685J723M674R768k471N64l563K302O22K260R8q614
7233G536J683N365m436l697q778j789l499j415k479m817M353Q253l692J0079k532
7218A35k817l212K253P615K112L784m061o459L786j043o65J2627K057l590n898
$$ plain form
7203 6624 6663 9285 5601 -9140 -709 11513 15256 3552 2786 18581 14587 4384 9792 17272
7189 17272 15269 12720 6434 7745 3965 -4426 -12147 -10719 -11418 531 4516 9761 4884 13910 8901
7174 8901 4691 -12104 -13165 -8519 -7678 -7118 -363 641 -2302 -6370 -8232 -17406 -7241 5671 11445
7159 11445 8777 3507 -3227 -3297 -2290 -16204 -7151 -4341 -7920 -9300 -6557 -12142 -11867 -3721 2601
7144 2601 -6723 -21366 -24386 -15052 -1045 8339 4705 -1757 7841 -3190 -1691 5765 5706 10261 8445
7129 8445 559 -7808 -16031 -12144 -11467 -4689 -1823 -9005 -10216 159 9378 6200 -1495 -1349 1827
7114 1827 -6955 -13665 -13442 -11421 -13384 -12140 -14439 -18987 -19880 -17985 -10870 -4856 -5432 -8004 -11441 -17864
7098 -17864 -4231 1387 5901 3916 4042 -6524 -21386 -30009 -35320 -27525 -15863 -10634 767 2782
$$ packed form
7203F624L9K622l684j4741Q431J2222L743j1704p66J5795l994j0203N408P480
7189A7272k003k549o286J311l780q391p721J428o99J1949L985N245m877R026n009
7174H901m210j6795j061M646Q41N60O755J004k943m068j862r174J0165J2912N774
7159A1445k668n270o734p0J007j3914R053K810l579j380K743n585K75Q146O322
7144B601r324j4643l020R334J4007R384l634o462R598j1031J499P456n9M555j816
7129H445p886q367q223L887O77O778K866p182j211J0375R219l178p695J46L176
7114A827q782o710K23K021j963J244k299m548q93J895P115O014n76k572l437o423
7098a7864J3633N618M514j985J26j0566j4862q623n311P795J1662N229J1401K015
$$ plain form
7084 2782 3576 -6743 -1864 3960 2493 4302 17482 21271 14500 1360 -8292 -18520 -16233 -490
7070 -490 13395 3981 -6845 -14563 -12148 -6777 -5671 -1674 -6112 -12738 -17986 -16763 -4998 -7976
7056 -7976 -12348 -5951 -2077 2508 2368 -8599 -14981 -19373 -18448 -14352 -11708 -12374 -17441 -17203 -9353 -2638
7040 -2638 3454 9301 9292 849 -10438 4917 813 -12306 -12688 -8350 -12871 -23181 -23209 -12677 -14394
7025 -14394 -9142 -5892 -11837 -11381 -16364 -13807 -12255 -7477 -3387 1127 -1448 -8938 -12820 -17037 -18569
7010 -18569 -5338 3712 -2249 -1823 6302 10871 11790 21467 18699 10767 15278 524 -6748 -6419 1752
6995 1752 2706 -4174 -7521 -11215 -20629 -16969 2063 3129 -6012 -14900 -11326 -15724 -3239 -230 -386
6980 -386 8350 -1585 -15033 -14479 -11049 -7856 -5436 2078 1952 6893 278 2259 10120 15757 4556
$$ packed form
7084B782P94j0319M879N824j467J809J3180L789o771j3140r652j0228K287J5743
7070d90J3885r414j0826p718K415N371J106L997m438o626n248J223J1765k978
7056g976m372O397L874M585j40j0967o382m392R25M096K644o66n067K38P850O715
7040b638O092N847rq443j1287J5355m104j3119l82M338m521j0310k8J0532j717
7025a4394N252L250n945M56m983K557J552M778M090M514k575p490l882m217j532
7010a8569J3231R050n961M26Q125M569R19R677k768p932M511j4754p272L29Q171
6995A752R54o880l347l694r414L660J9032J066r141q888L574m398J2485L009j56
6980c86Q736r935j3448N54L430L193K420P514j26M941o615J981P861N637j1201
$$ plain form
6965 4556 58 978 -5889 -4413 -11869 -15867 -5654 -4605 -4080 -14435 -15738 -15240 -6603 -8341 -6785
6950 -6785 -15365 -18259 -12355 -6366 555 6869 929 -9831 -14838 -17434 -19910 -5981 -4181 -6671
6936 -6671 -2073 5256 19602 10016 -7164 -13132 -9289 -10229 -4681 -5488 -6810 -6381 1495 4738 6304
6921 6304 -5607 -12194 -10023 -284 9139 5684 -125 -1543 -8858 -19674 -14343 -13436 -6882 -1233 -2938
6906 -2938 -4179 2484 -359 -2042 -4231 -2683 948 3309 9378 12301 -1668 -18440 -9711 9446
6892 9446 12502 9911 10870 12098 14135 9571 78 -9757 -4137 -1249 -11167 -14996 -14843 -17187 -9487
6877 -9487 -1035 -8161 -7803 -2473 4091 6633 1816 -1887 -5261 -9732 -1461 -7822 -12619 -2559 10117
6862 10117 27542 29642 15236 5839 8325 2696 -5126 105 -318 -2689 7945 3375 488 -6210
$$ packed form
6965D556m498R20o867J476p456l998J0213J049N25j0355j303M98Q637j738J556
6950f785q580k894N904N989O921O314n940j0760n007k596k476J3929J800k490
6936f671M598P329J4346r586j7180n968L843r40N548q07j322M29P876L243J566
6921F304j1911o587K171R739R423l455n809j418p315j0816N331R07O554N649j705
6906b938j241O663k843j683k189J548L631K361O069K923j3969j6772Q729J9157
6892I446L056k591R59J228K037m564r493r835N620K888r918l829J53k344P700
6877i487Q452p126L58N330O564K542m817l703l374m471Q271o361m797J0060J2676
6862A0117J7425K100j4406r397K486n629p822N231m23k371J0634m570k887o698
$$ plain form
6848 -6210 -16512 -20898 -17580 -15605 -8006 5340 15890 17195 11689 8179 1973 -6772 193 8875
6834 8875 -3228 -11176 -4702 -651 -6466 -12851 -9335 9624 20330 15356 9435 6275 10046 14788
6820 14788 22652 22801 28423 16735 3926 8129 16746 4329 -3008 -2081 -2158 -5268 -6012 -2377 6076
6805 6076 7358 5630 10979 4715 -7766 -6323 4576 4928 1724 -9909 -10143 -4004 2790 4157 -2222
6790 -2222 -20654 -27855 -26238 -23802 -19045 -20161 -18608 -8494 1906 -4412 -3764 3546 -5560 3135
6776 3135 6040 6261 10988 8364 3787 -2253 -1478 3576 10300 16685 25451 33821 30811 18943 14161
6761 14161 4922 4862 8303 8524 16916 9739 -823 -5559 -7912 -4574 -9657 -6578 3046 13442 8665
6746 8665 8502 11956 16209 15278 25979 36672 62846 69521 60318 72151 94264 115887 141957 170314
$$ packed form
6848f210j0302m386L318J975P599J3346J0550J305n506l510o206q745O965Q682
6834H875j2103p948O474M051n815o385L516J8959J0706m974n921l160L771M742
6820A4788P864J49N622j1688j2809M203Q617j2417p337R27p7l110p44L635Q453
6805F076J282j728N349o264j2481J443J0899L52l204j1633k34O139O794J367o379
6790b222j8432p201J617K436M757j116J553J0114J0400o318O48P310r106Q695
6776C135K905K21M727k624m577o040P75N054O724O385Q766Q370l010j1868m782
6761A4161r239o0L441K21Q392p177j0562m736k353L338n083L079R624J0396m777
6746H665j63L454M253r31J0701J0693K6174O675r203J1833K2113K1623K6070K8357
$$ plain form
6732 170314 204484 223039 203552 171755 136188 101913 64132 42660 26957 18039 25290 23277
6720 23277 7187 3326 7582 16908 26313 21504 17079 14240 3579 11857 12065 14167 12489 3800
6706 3800 1423 -4363 -4242 5439 15999 15367 9559 8528 6399 7283 3639 226 -8869 -10403 -1679
6691 -1679 8187 11907 5814 -2928 1367 440 1018 -7663 -9046 2865 1136 4961 8582 13824 22164
6676 22164 19579 6324 -4380 -3383 8754 8856 -3216 -4342 -4648 -11264 -16174 -17034 -27204 -29352
6662 -29352 -30173 -31999 -35803 -30455 -26295 -23326 -6069 8904 10609 7009 -3575 -96 -5016 -7014
6648 -7014 -11630 -12457 -12026 -17837 -19519 -18234 -24003 -28525 -27804 -19374 -7376 137 -3756 -2603 4248
6633 4248 3942 -1634 -2189 1435 -14455 -22516 -21914 -12618 -9098 501 2187 -1538 32 1606 3853
$$ packed form
6732A70314L4170J8555j9487l1797l5567l4275l7781k1472j5703q918P251k013
6720B3277j6090l861M256R326R405m809m425k839j0661Q278K08K102j678q689
6706C800k377n786J21R681J0560o32n808j031k129Q84l644l413r095j534Q724
6691a679R866L720o093q742M295r27N78q681j383J1911j729L825L621N242Q340
6676B2164k585j3255j0704R97J2137J02j2072j126l06o616m910q60j0170k148
6662b9352q21j826l804N348M160K969J7257J4973J705l600j0584L479m920j998
6648g014m616q27M31n811j682J285n769m522P21Q430J1998P513l893J153O851
6633D248l06n576n55L624j5890q061O02R296L520R599J686l725J570J574K247
$$ plain form
6618 3853 7741 -3477 -13456 -13059 -10493 -1787 3434 3318 9749 6411 -763 -1650 -9722 -12600 -11574
6603 -11574 -4772 -7574 -6326 3438 16620 18041 4844 -3054 -6700 -327 -12469 -24445 -15125 -5983
6589 -5983 -6112 -5438 -1588 -7168 -10397 -9010 -6298 -2669 -3754 -5664 -4164 993 3689 -3753 -2114
6574 -2114 -1687 -17 -9313 -12319 -583 -7542 -5275 1118 -2397 -8977 -18254 -17358 -861 -3573 -1239
6559 -1239 2784 12572 20959 17571 4226 3716 12723 18797 26071 18610 19262 16822 23252 15810 4875
6544 4875 13557 20557 18776 224 5429 9070 -5143 -15950 -5163 2264 -1016 4646 -712 -8744
6530 -8744 -11206 -12971 -19426 -13475 -13865 -3454 511 60 4372 12669 2327 -19253 -17620 -19523 -19467
6515 -19467 -8930 3751 17026 12194 -189 -7839 -7423 -8099 -2912 227 -3343 144 1366 3726
$$ packed form
6618C853L888j1218r979L97K566Q706N221j16O431l338p174q87q072k878J026
6603a1574O802k802J248R764J3182J421j3197p898l646O373j2142j1976R320R142
6589e983j29O74L850n580l229J387K712L629j085j910J500N157K696p442J639
6574b114M27J670r296l006J1736o959K267O393l515o580r277Q96J6497k712K334
6559a239M023R788Q387l388j3345n10R007O074P274p461O52k440O430p442j0935
6544D875Q682P000j781j8552N205L641j4213j0807J0787P427l280N662n358q032
6530h744k462j765o455N951l90J0411L965m51M312Q297j0342k1580J633j903N6
6515a9467J0537J2681J3275m832j2383p650M16o76N187L139l570L487J222K360
$$ plain form
6501 3726 6367 12074 8745 -8243 -10982 -9168 -2941 -7183 -6256 2602 898 391 3652 2154 -6566
6486 -6566 -14595 -18236 -15981 -4904 3957 11137 7390 10946 20163 25167 19685 5672 -1175 -743 869
6471 869 2384 4378 8007 7992 7038 3769 7498 11434 8403 826 262 -116 -121 14350 17682 7366 -162
6454 -162 -2229 1551 1182 4130 9352 7970 4911 779 14712 24563 11522 2889 -9608 -25472
6440 -25472 -21071 -13398 -5552 4961 7868 16582 20995 20973 11465 587 -2202 203 2000 -3325 -14757
6425 -14757 -30476 -32519 -14397 -12484 -6902 -2458 -505 3181 -5174 -9781 -7507 -5192 -7121 -14608
6411 -14608 -12487 332 6011 11165 3256 3684 4308 5034 1282 -1271 2753 -1069 -15428 -13135 -6387
6396 -6387 14109 11983 2050 5295 4441 -4068 -11504 -21710 -9883 8259 2410 -6081 12 -11122
$$ packed form
6501C726K641N707l329j6988k739J814O227m242R27Q858j704n07L261j498q720
6486f566q029l641K255J1077Q861P180l747L556R217N004n482j4013o847M32J612
6471H69J515J994L629j5r54l269L729L936l031p577n64l78nJ4471L332j0316p528
6454a62k067L780l69K948N222j382l059m132J3933R851j3041q633j2497j5864
6440b5472M401P673P846J0513K907Q714M413k2r508j0878k789K405J797n325j1432
6425a4757j5719k043J8122J913N582M444J953L686q355m607K274K315j929p487
6411a4608K121J2819N679N154p909M28O24P26l752k553M024l822j4359K293O748
6396f387K0496k126r933L245q54q509p436j0206J1827J8142n849q491O093j1134
$$ plain form
6382 -11122 6279 13838 12131 7852 7474 2574 8636 18515 3225 -12204 -10298 3319 7746 251
6368 251 -10027 -15087 -9508 -6817 -8297 -11137 -3969 -2567 -14391 -17192 -23170 -11561 -839 -4077
6354 -4077 -7651 -7345 -17656 -12203 2298 16384 17025 14914 8658 -6671 -15403 -5220 -4672 -13135
6340 -13135 -8488 -9507 -5925 6334 6350 4389 -4942 -10116 -9700 -6723 -1799 -7494 -10340 -16817 -12685
6325 -12685 14827 20336 15535 10995 15243 7054 -1919 -4200 -7464 -9681 -4582 -6794 -10284 -16488
6311 -16488 -19890 -10230 -3687 -2551 -1613 -6142 -8452 -6987 2832 10717 6867 8632 5088 5547 -5924
6296 -5924 -11179 -11436 -8009 -24173 -30975 -25644 -15106 7911 14638 12468 8395 -1653 -7711 -10546
6282 -10546 -4149 993 7636 1753 1264 6418 7240 2067 2185 7386 8872 2236 -7946 -5783 -8587
$$ packed form
6382a1122J7401P559j707m279l78m900O062R879j5290j5429J906J3617M427p495
6368B51j0278n060N579K691j480k840P168J402j1824k801n978J1609J0722l238
6354d077l574L06j0311N453J4501J4086O41k111o256j5329q732J0183N48q463
6340a3135M647j019L582J2259J6j961r331n174M16K977M924n695k846o477M132
6325a2685K7512N509m801m540M248q189q973k281l264k217N099k212l490o204
6311a6488l402R660O543J136R38m529k310J465R819P885l850J765l544M59j1471
6296e924n255k57L427j6164o802N331J0538K3017O727k170m073j0048o058k835
6282a0546O397N142O643n883m89N154Q22n173J18N201J486o636j0182K163k804
$$ plain form
6267 -8587 -7419 -11423 -5986 -9995 -24455 -19826 -2294 2282 1571 -6177 -11216 1472 10272 11300
6253 11300 6095 6383 4608 6729 10144 3254 5493 15135 14519 12759 28521 33004 20525 11861 11185
6238 11185 9442 15262 15104 16047 17587 8484 -1426 -11794 -22698 -28073 -27031 -22421 -19707 -3787
6224 -3787 6587 -374 -852 -4071 -9188 -17682 -8264 1780 1361 -1743 -8050 -17241 -17222 -16644 -16929 -13678
6208 -13678 -12795 -2788 -15438 -15794 -15033 -15848 -5682 -9067 -2590 -13452 -17484 -5000 -10984 -4848
6194 -4848 -1590 -2280 8652 10104 20572 22292 14006 8363 -638 -2266 3135 7822 10949 14043 16984
6179 16984 3620 6786 13463 17986 15011 9438 14476 6624 -1737 6077 18372 17084 8624 9531
6165 9531 13884 9825 2870 6376 12766 8854 10993 -847 -5967 -2011 -2422 -13169 -28243 -11869
$$ packed form
6267h587J168m004N437m009j4460M629J7532M576p11p748n039J2688Q800J028
6253A1300n205K88j775K121L415o890K239R642o16j760J5762M483j2479q664o76
6238A1185j743N820j58R43J540r103r910j0368j0904n375J042M610K714J5920
6224c787J0374o961m78l219n117q494R418J0044m19l104o307r191J9N78k85L251
6208a3678Q83J0007j2650l56P61q15J0166l385O477j0862m032J2484n984O136
6194d848L258o90J0932J452J0468J720q286n643r001j628N401M687L127L094K941
6179A6984j3364L166O677M523k975n573N038p852q361P814J2295j288q460R07
6165I531M353m059o955L506O390l912K139j1840n120L956m11j0747j5074J6374
$$ plain form
6151 -11869 4152 1319 -7496 -18737 -17978 -2642 6443 1857 -2096 -15495 -18605 -12254 -17784 -20655
6137 -20655 -18668 -9546 -9638 -20590 -17096 -8136 -12040 -667 11999 5753 -15574 -12879 955 7806
6123 7806 17754 13501 18835 19327 14341 12313 -1958 -6290 -6529 -6820 1390 798 10166 13810 -5906
6108 -5906 -2956 -3966 -1290 10639 16064 7868 544 -1455 -4219 -9676 -4945 2894 14059 16600
6094 16600 12767 5858 2098 -2375 -4534 6149 16769 6549 -4909 -11161 -23698 -27442 -18160
6081 -18160 -16958 -11574 -4702 -688 2785 1993 -530 402 6604 12138 13277 10739 12300 2428 -6581
6066 -6581 -2226 1789 -2531 4130 8310 3614 -2757 -7844 -21182 -21530 5049 23321 19643 20122 20583
6051 20583 11752 7501 -8908 -8951 -2532 -3333 -10301 -16662 -17166 -1915 13615 9506 -3266 -5346 2396
$$ packed form
6151a1869J6021k833q815j1241P59J5336R085m586l953j3399l110O351n530k871
6137b0655J987R122r2j0952L494Q960l904J1373J2666o246k1327K695J3834O851
6123G806R948m253N334M92m986k028j4271m332k39k91Q210n92R368L644j9716
6108e906K950j010K676J1929N425q196p324j999k764n457M731P839J1165K541
6094A6600l833o909l760m473k159J0683J0620j0220j1458o252j2537l744R282
6081a8160J202N384O872M014L473p92k523R32O202N534J139k538J561r872r009
6066f581M355M015m320O661M180m696o371n087j3338l48K6579J8272l678M79M61
6051B0583q831m251j6409m3O419q01o968o361n04J5251J5530m109j2772k080P742
$$ plain form
6036 2396 7201 -3461 -3197 1943 -6204 -3477 -8574 -3336 -2919 -10010 -9000 -3159 641 5781 -4766
6021 -4766 -17851 -11593 -10554 -2203 54 4125 3591 -9943 -19350 -14358 -4815 -836 -7024 -6474 -6577
6006 -6577 -4480 4118 6670 17511 24898 22741 17664 8035 6566 8874 3862 -9391 -19183 -11044
5992 -11044 -11135 -1836 5225 294 -3136 12413 9105 -864 -5924 2978 4148 -8703 -21573 -28876
5978 -28876 -18574 -14694 -16652 -5599 9365 10794 -2831 -14753 -9165 6150 7650 5924 11780
5965 11780 12547 13507 8162 24 -3165 1750 -10243 -5322 3913 3470 4785 15 -2837 -13723 -5397
5950 -5397 3403 5212 -4468 -4392 -1893 -1180 -2739 3991 4860 5667 8359 685 7289 13937 21924 25572
5934 25572 25947 19896 1052 -7210 1774 -887 984 6383 2006 8317 4496 5297 19962 31895
$$ packed form
6036B396M805j0662K64N140q147K727n097N238M17p091J010N841L800N140j0547
6021d766j3085O258J039Q351K257M071n34j3534r407M992R543L979o188N50j03
6006f577K097Q598K552J0841P387k157n077r629j469K308n012j3253r792Q139
5992a1044r1R299P061m931l430J5549l308r969n060Q902J170j2851j2870p303
5978b8876J0302L880j958J1053J4964J429j3625j1922N588J5315J500j726N856
5965A1780P67R60n345q138l189M915j1993M921R235m43J315m770k852j0886Q326
5950e397Q800J809r680P6K499P13j559O730Q69Q07K692p674O604O648P987L648
5934B5572L75o051j8844q262Q984k661J871N399m377O311l821Q01J4665J1933
$$ plain form
5920 31895 24576 19369 15407 20738 21966 14739 4722 2945 1559 1397 1254 -15622 -32355 -21279
5906 -21279 -8256 -4412 -5368 13813 23901 34521 39096 17400 5865 9442 11645 17871 26502
5893 26502 26824 20345 9637 10670 10684 -1566 -14276 -19876 276 7908 -11167 -4758 2027 465
5879 465 -8476 -672 6117 6398 1686 -2749 -13274 -7366 -6270 -13496 -7555 -2481 -1460 -9290 -21885
5864 -21885 -9303 -6814 -9726 -1634 5268 16016 16552 7862 -9984 -10238 -7839 -8633 -2431 -7118 -16321
5849 -16321 -5722 -3897 -12855 -18096 -28985 -36502 -26945 -19871 -14538 4351 21920 15962 7481 344
5835 344 -11379 -12460 -13632 -10025 29 9178 8078 4808 -2826 -15830 -24088 -30145 -32313 -20090
5821 -20090 -16611 -12846 7892 5606 -1769 -7493 -13161 -433 -6371 -7207 3909 10807 17605 10479
$$ packed form
5920C1895p319n207l962N331J228p227j0017j777j386j62j43j6876j6733J1076
5906b1279J3023L844r56J9181J0088J0620M575k1696j1535L577K203O226Q631
5893B6502L22o479j0708J033J4j2250j2710n600K0152P632j9075O409O785j562
5879D65q941P804O789K81m712m435j0525N908J096p226N941N074J021p830j2595
5864b1885J2582K489k912Q092O902J0748N36q690j7846k54K399p94O202m687r203
5849a6321J0599J825q958n241j0889p517R557P074N333J8889J7569n958q481p137
5835C44j1723j081j172L607J0054R149j100l270p634j3004q258o057k168J2223
5821b0090L479L765K0738k286p375n724n668J2728n938q36J1116O898O798p126
$$ plain form
5807 10479 8807 9108 2307 7268 13027 6274 -726 1204 2319 5646 8460 10315 -5505 -8481 -357
5792 -357 7785 6678 -1823 -3196 5128 78 -5652 -4065 -3244 5622 -3256 -6069 -1838 -479 -4685
5777 -4685 185 8465 11165 9070 -4853 -12819 -15731 -442 9436 16342 12400 4907 -3885 -2498
5763 -2498 -6301 -6576 -10493 -26450 -24179 -14410 -12726 -18807 -24623 -19278 -1674 3051 3887 -2696 -17769
5748 -17769 -17171 -3339 16547 6102 -1487 6646 6985 11934 9746 7756 6232 468 11063 33051
5734 33051 26160 8647 -2814 -939 12113 15808 13238 11814 11413 7871 2378 2380 -9212 -3975 -2008
5719 -2008 -2935 -7126 2991 11384 3415 -5933 -2134 983 12443 24015 20662 19856 7396 8993
5705 8993 18743 27320 32634 24014 922 -4679 3482 -10844 -29826 -28038 -12398 -14322 -29335 -19805
$$ packed form
5807A0479j672L01o801M961N759o753p000J930J115L327K814J855j5820k976Q124
5792c57Q142j107q501j373Q324n050n730J587Q21Q866q878k813M231J359m206
5777d685M870Q280K700k095j3923p966k912J5289R878O906l942p493q792J387
5763b498l803k75l917j5957K271R769J684o081n816N345J7604M725Q36o583j5073
5748a7769N98J3832J9886j0445p589Q133L39M949k188j990j524n764J0595K1988
5734C3051o891j7513j1461J875J3052L695k570j424m01l542n493Kj1592N237J967
5719b008r27m191J0117Q393p969r348L799L117J1460J1572l353q06j2460J597
5705H993R750Q577N314q620k3092n601Q161j4326j8982J788J5640j924j5013R530
$$ plain form
5691 -19805 -5694 -6679 -19977 -24245 -11116 -4272 -9314 -17971 -8466 -2677 -8489 -6708 -3598 -8299
5677 -8299 -17169 -14458 -7186 -10341 -15557 -18735 -14897 -24661 -35758 -32897 -25268 -22983 -16982 -9492 -11178
5662 -11178 -19920 -26374 -20880 -22630 -29313 -29572 -33665 -25796 -18225 -1613 11235 -102 2588 2782
5648 2782 5390 3812 3321 9252 11378 4912 9604 269 -1077 -720 -1207 -1250 1525 14303 7461 -5894
5632 -5894 -16060 -18036 3061 19025 18676 9122 3572 1272 2616 5953 2081 1089 -3571 -5739 -4857
5617 -4857 -4244 719 2238 -3246 850 5417 569 12382 31436 27485 12809 5757 -2265 -3269
5603 -3269 7430 1553 -7189 663 -272 8614 22354 30025 17685 16160 9860 -787 6509 1512
5589 1512 2216 2803 -7321 -17400 -15325 -12313 -8147 -6449 -8474 -11105 -8826 -14494 -16305 -10691 -22614
$$ packed form
5691a9805J4111r85j3298m268J3129O844n042q657R505N789n812J781L110m701
5677h299q870K711P272l155n216l178L838r764j1097K861P629K285O001P490j686
5662a1178q742o454N494j750o683k59m093P869P571J6612J2848j1337K690J94
5648B782K608j578m91N931K126o466M692r335j346L57m87m3K775J2778o842j3355
5632e894j0166j976K1097J5964l49r554n550k300J344L337l872r92m660k168Q82
5617d857O13M963J519n484M096M567m848J1813J9054l951j4676p052q022j004
5603c269J0699n877q742P852r35Q886J3740P671j2340j525o300j0647P296m997
5589A512P04N87j0124j0079K075L012M166J698k025k631K279n668j811N614j1923
$$ plain form
5574 -22614 -21765 -7854 977 384 -6109 -8213 -12357 -17829 -18961 -16892 -5967 -4131 -17719 -32998
5560 -32998 -35331 -24620 -17987 -7882 -10766 -17449 -27938 -29345 -22424 -11612 -5910 3713 8605 13279
5546 13279 13258 4137 -3219 5456 19739 24840 15659 6459 10811 14460 1084 -5527 8160 11355
5532 11355 -689 -4541 14260 16540 11580 14768 16799 14269 7228 6488 8459 6794 3420 -4539
5518 -4539 -8503 -8818 -19273 -18271 -21153 -23303 -13052 -14962 -23174 -15793 -14992 -15714 -18807 -3513 5430
5503 5430 5476 -5512 -13399 -14385 -7570 5222 6668 17232 21456 22459 27078 11892 -5754 -6876
5489 -6876 2480 12630 1571 -13679 -6467 -1135 -3530 -3824 -6420 -5955 -199 -7624 -8434 -11662 -3140
5474 -3140 1091 4196 12806 18796 15691 13653 19305 6192 -2618 -4154 -6433 -11357 -4011 11872
$$ packed form
5574b2614Q49J3911Q831n93o493k104m144n472j132K069J0925J836j3588j5279
5560c2998k333J0711O633J0105k884o683j0489j407O921J0812N702R623M892M674
5546A3279k1r121p356Q675J4283N101r181r200M352L649j3376o611J3687L195
5532A1355j2044l852J8801K280m960L188K031k530p041p40J971j665l374p959
5518d539l964l15j0455J002k882k150J0251j910q212P381Q01p22l093J5294Q943
5503E430M6j0988p887r86O815J2792J446J0564M224J003M619j5186j7646j122
5489f876R356J0150j1059j5250P212N332k395k94k596M65N756p425q10l228Q522
5474c140M231L105Q610N990l105k038N652j3113q810j536k279m924P346J5883
$$ plain form
5460 11872 10560 2450 -6124 -4466 -8487 -674 3658 -6194 4198 12147 -3995 -11572 -7322 -3643
5446 -3643 4011 4601 -1577 -396 2749 7490 3294 -4322 -754 3188 10258 6712 9910 3617 -1089
5431 -1089 -2402 201 -4892 -3097 -5467 -7512 -3222 5765 -4411 -8242 -11070 -70 3354 7049
5417 7049 9086 -1881 -14113 -17782 -19513 -3844 11276 8667 4442 7738 2441 -11391 -8023 -742
5403 -742 -2274 5516 7793 -1952 -4106 309 -5161 -5741 3537 14159 13419 15811 12262 9093 7607
5388 7607 11095 11873 2931 2781 -2208 2198 -2387 -2258 1484 5760 8528 5026 3997 -1920 -7301 4370
5372 4370 16977 23036 18264 17209 13180 1598 5309 7576 -8922 -6572 -17571 -21923 -15112 -12367
5358 -12367 -13844 -10538 2607 2284 -2673 2000 14673 5951 -7733 -11521 -14499 -12347 -13207 -13793 -11222
$$ packed form
5460A1872j312q110q574J658m021P813M332r852J0392P949j6142p577M250L679
5446c643P654N90o178J181L145M741m196p616L568L942P070l546L198o293m706
5431a089j313K603n093J795k370k045M290Q987j0176l831k828J1000L424L695
5417G049K037j0967j2232l669j731J5669J5120k609m225L296n297j3832L368P281
5403g42j532P790K277r745k154M415n470n80R278J0622p40K392l549l169j486
5388G607L488P78q942j50m989M406m585J29L742M276K768l502j029n917n381J1671
5372D370J2607O059m772j055m029j1582L711K267j6498K350j0999m352O811K745
5358a2367j477L306J3145l23m957M673J2673q722j3684l788k978K152q60n86K571
$$ plain form
5343 -11222 -2281 -3353 -13 -9603 -10818 4918 8201 3367 8579 3902 5668 10443 17977 21142
5329 21142 15536 10068 1481 12248 18396 13330 2066 -2178 2508 3635 -14808 -25926 -18217 -8544
5315 -8544 -15473 -27885 -20973 -14822 -7467 4050 11904 -5053 -20762 -25766 -19872 -14930 -7726 -8190
5301 -8190 -13794 -11525 -20671 -21571 -19998 -7368 8922 7550 -1638 -2849 2579 2445 -1085 3264 -432
5286 -432 -1297 -918 -11455 -4452 271 869 7321 2661 -6058 -2269 4844 9469 15515 7374 3914 10382
5270 10382 18157 6530 -11104 -8663 1373 -4040 -4679 -9168 -5561 -3952 -12499 -18000 -24234 -33634
5256 -33634 -29072 -11625 -7592 -5049 -4094 -10271 -10262 -2953 -4150 -8773 8158 11560 19889 13180 12135
5241 12135 10252 -599 12829 14776 14751 17760 14130 9095 1499 -11041 -11148 -2135 8618 -2082
$$ packed form
5343a1222Q941j072L340r590j215J5736L283m834N212m677J766M775P534L165
5329B1142n606n468q587J0767O148n066j1264m244M686J127j8443j1118P709R673
5315h544o929j2412O912O151P355J1517P854j6957j5709n004N894M942P204m64
5301h190n604K269r146r00J573J2630J6290j372r188j211N428j34l530M349l696
5286d32q65L79j0537P003M723N98O452m660q719L789P113M625O046q141l460O468
5270A0382P775j1627j7634K441J0036n413o39m489L607J609q547n501o234r400
5256c3634M562J7447M033K543R55o177RP309j197m623J6931L402Q329o709j045
5241A2135j883j0851J3428J947k5L009l630n035p596j2540j07R013J0753j0700
$$ plain form
5227 -2082 -3699 7134 9065 -11041 -19994 -13571 -10675 -14486 -12380 -3081 -2717 15 -3771 -13365 -26274
5212 -26274 -23830 -10254 2954 -7171 -19202 -14895 -19466 -21779 -1570 3332 823 -1298 -4271
5199 -4271 1715 4456 4096 15198 10843 -465 -5779 2013 20990 13927 4512 6955 6735 -8281
5185 -8281 -17201 -14846 -5887 2952 3013 5730 1473 -14975 -20303 -14139 -3593 -8550 -21373 -22174 -13350
5170 -13350 -11596 -8832 -3099 3253 4258 5144 10868 843 -1394 -8016 -9066 -4047 1011 -8605 -15420
5155 -15420 -7250 -1223 -10010 -7900 -3450 254 -5303 -14303 -7725 -12152 -2842 -1487 -6861 -13377 -4946
5140 -4946 258 7873 16567 11413 2587 -4370 -11317 -9828 -2555 8652 17854 13572 10635 4596 -9531
5125 -9531 -23729 -13784 -4986 -5168 -3237 1832 -11638 -19964 -20573 -12928 -15120 -4747 1750 -1702 6313
$$ packed form
5227b082j617J0833J931k0106q953O423K896l811K106R299L64K732l786r594j2909
5212b6274K444J3576J3208j0125j2031M307m571k313K0209M902k509k121k973
5199d271N986K741l60J1102m355j1308n314P792J8977p063r415K443k20j5016
5185h281q920K355Q959Q839O1K717m257j6448n328O164J0546m957j2823q01Q824
5170a3350J754K764N733O352J005Q86N724j0025k237o622j050N019N058r616o815
5155a5420Q170O027q787K110M450L704n557r000O578m427R310J355n374o516Q431
5140d946N204P615Q694n154q826o957o947J489P273J1207R202m282k937o039j4127
5125i531j4198R945Q798j82J931N069j3470q326o09P645k192J0373O497l452Q015
$$ plain form
5110 6313 2528 4841 2730 12244 6161 -921 -973 -5815 4160 9615 3359 2210 -4918 -5169 -1392 -1451
5094 -1451 -537 3534 4079 8548 2732 -1667 4922 987 2032 -3986 -9975 -11583 -13411 3961 -1337
5079 -1337 -7783 -9309 -25661 -28759 -25668 -21518 -5592 -7961 -13583 -7656 -1297 -18069 -24811 -10151
5065 -10151 4252 9623 16909 23346 8266 -1829 -5544 -17072 -24736 -17691 -5553 -12834 -11974 -1236
5051 -1236 3726 -7581 -5774 -2965 3650 762 -348 -4292 -8951 -2887 -6155 -11674 -13485 -3230
5037 -3230 694 7752 126 -2190 -340 -1195 432 -94 5719 15950 11453 5815 3 -5984 -16397
5022 -16397 -22515 -19318 -1467 -7423 5539 10062 -5993 -4996 -424 -971 -8141 -9376 -7683 -8706
5008 -8706 -18978 -12030 6634 10185 -1809 -11061 -8092 855 4099 -2076 -6747 -10302 -13333 -13969
$$ packed form
5110F313l785K313k111R514o083p082n2m842R975N455o256j149p128k51L777n9
5094a451R14M071N45M469n816m399O589l935J045o018n989j608j828J7372n298
5079a337o446j526j6352l098L091M150J5926k369n622N927O359j6772o742J4660
5065a0151J4403N371P286O437j5080j0095l715j1528p664P045J2138p281Q60J0738
5051a236M962j1307J807K809O615k888j110l944m659O064l268n519j811J0255
5037c230L924P058p626k316J850q55J627n26N813J0231m497n638n812n987j0413
5022a6397o118L197J7851n956J2962M523j6055R97M572n47p170j235J693j023
5008h706j0272O948J8664L551j1994r252K969Q947L244o175m671l555l031o36
$$ plain form
4994 -13969 -11530 -12214 -8516 -5741 4294 1689 233 1836 1637 4729 9621 9239 15372 21208 22181
4979 22181 12296 -1245 -7976 -14863 -11391 720 4651 1881 -6111 -14412 -4684 1687 7982 11919
4965 11919 6624 -12256 -13888 -466 -14864 -20798 -19058 -23653 -21093 -12789 -2190 -501 -5982 -5703
4951 -5703 -2327 4600 9740 12266 7962 4681 -2132 5058 9017 -516 -6658 3701 16856 13184
4937 13184 8287 9296 5722 -2362 -9380 6647 13879 13674 8356 4159 989 -2725 -15063 -18765
4923 -18765 -9109 -11474 -11414 -1988 -3439 -12014 -19621 -26242 -21312 -12125 -9760 -4807 741 4959 6465
4908 6465 911 69 -7103 -1076 -1770 9663 17897 15052 889 693 -15236 -20257 -4481 3884 2929
4893 2929 -15 -1440 -1747 -4635 -5163 -15123 -21194 -22291 -31770 -34298 -27815 -8310 -1864 -1647 730
$$ packed form
4994a3969K439o84L698K775J0035k605j456J603j99L092M892l82O133N836R73
4979B2181r885j3541o731o887L472J2111L931k770p992q301R728O371O295L937
4965A1919n295j8880j632J3422j4398n934J740m595K560Q304J0599J689n481K79
4951e703L376O927N140K526m304l281o813P190L959r533o142J0359J3155l672
4937A3184m897J009l574q084p018J6027P232k05n318m197l170l714j2338l702
4923a8765R656k365O0R426j451q575p607o621M930R187K365M953N548M218J506
4908F465n554q42p172O027o94J1433Q234k845j4163j96j5929n021J5776Q365r55
4893B929k944j425l07k888n28r960o071j097r479k528O483J9505O446K17K377
$$ plain form
4878 730 11844 10930 1428 1310 1578 -1609 -10319 -18188 -18052 -15987 -6550 -5055 -19937 -21939 -17126 -3374
4862 -3374 7061 13844 9018 3111 -2405 -295 14713 21377 16460 5592 5042 13167 23990 20017
4848 20017 11052 10851 22933 20109 12510 6732 238 5607 14528 12401 4426 2226 13035 17396
4834 17396 15764 9058 -477 -1980 5882 39 -3220 -5521 -7015 3088 -2602 -6055 -4369 -16294
4820 -16294 -15402 -15570 -4809 -3898 2766 -3485 -6238 2966 10287 20754 17789 11722 15381 14346 18310
4805 18310 14629 23383 14299 5277 2460 -8390 -8734 -4602 -4316 -7699 329 -3257 -5957 -4032 -9773
4790 -9773 -4635 -3298 -9812 -10283 -5551 1242 119 -12884 -15638 -14243 6631 -3452 -4063 -10823 2637
4775 2637 10466 4747 -2590 -14192 -13041 -8520 -9838 -10664 -12070 -15406 -16609 -17965 -17252 -24797 -9646
$$ packed form
4878G30J1114r14r502j18K68l187q710p869J36K065R437J495j4882k002M813J3752
4862c374J0435O783m826n907n516K110J5008O664m917j0868n50Q125J0823l973
4848B0017q965k01J2082k824p599n778o494N369Q921k127p975k200J0809M361
4834A7396j632o706r535j503P862n843l259k301j494J0103n690l453J686j1925
4820a6294Q92j68J0761R11O664o251k753R204P321J0467k965o067L659j035L964
4805A8310l681Q754r084r022k817j0850l44M132K86l383Q028l586k700J925n741
4790i773N138J337o514m71M732O793j123j3003k754J395K0874j0083o11o760J3460
4775B637P829n719p337j1602J151M521j318q26j406l336j203j356P13p545J5151
$$ plain form
4760 -9646 1916 3322 -1726 -976 -4029 -11579 -7359 -19718 -10518 -1195 1839 1153 3912 2210 2628
4745 2628 4529 9805 20370 28385 31493 21191 2719 2714 9778 14907 13651 7612 -12077 -26950
4731 -26950 -26019 -12807 -8606 -5025 -5567 -5583 -6057 2333 10986 7695 -4242 -6327 -662 6578 19830
4716 19830 18622 5190 -164 7276 11447 9773 4138 -7027 -11555 -11219 -13947 -90 2471 3033
4702 3033 -3622 -4527 1252 797 7979 9948 11306 3297 -8246 -10682 -8321 2887 11109 7544 3674
4687 3674 -1010 -5382 -3253 10916 16404 5912 -270 454 496 4635 7143 16269 27146 13617 8727
4672 8727 4114 -382 8371 12550 9077 2625 -3637 -3809 -13033 -14596 -4769 -7015 -9967 -2110 -1830
4657 -1830 8709 9536 7591 12518 15875 -2850 -7073 -1602 -15159 -20054 -3348 833 290 -350 3344
$$ packed form
4760i646J1562J406n048P50l053p550M220j2359R200R323L034o86K759j702M18
4745B628J901N276J0565Q015L108j0302j8472nP064N129j256o039j9689j4873
4731b6950R31J3212M201L581n42j6m74Q390Q653l291j1937k085N665P240J3252
4716A9830j208j3432n354P440M171j674n635j1165m528L36k728J3857K561N62
4702C033o655r05N779m55P182J969J358q009j1543k436K361J1208Q222l565l870
4687C674m684m372K129J4169N488j0492o182P24M2M139K508R126J0877j3529m890
4672H727m613m496Q753M179l473o452o262j72r224j563R827k246k952P857K80
4657a830J0539Q27j945M927L357j8725m223N471j3557m895J6706M181n43o40L694
$$ plain form
4642 3344 9592 12964 4890 5275 1381 917 1007 5356 11577 10041 4631 2719 4353 4503 392 -1365
4626 -1365 -14011 -17979 -7903 7557 11154 14597 14950 8987 2161 -6210 -6318 -17877 -17335 2008
4612 2008 14547 -5094 -12520 1867 5631 6551 5917 -189 -1591 -3717 2433 8606 3477 -6122 -12963
4597 -12963 -15553 -5828 4062 15941 4106 6235 6548 11680 16138 16902 7383 5608 6106 4177 6649
4582 6649 3479 -1442 -6677 2296 14887 4820 -10745 -6224 379 9692 5136 5576 5905 3388 3019
4567 3019 18987 26277 8175 -5113 -9681 -3206 4452 7589 13187 11222 319 -12272 -17690 -26694
4553 -26694 -20158 3310 5310 -4785 -5386 4454 2788 6822 2828 14439 19963 3409 -5442 -7980
4539 -7980 -2853 3083 17287 29633 31402 19595 4473 -3945 -8069 -4471 -1887 6129 7742 2224
$$ packed form
4642C344O248L372q074L85l894m64R0M349O221j536n410j912J634J50m111j757
4626a365j2646l968J0076J5460L597L443L53n963o826q371j08j1559N42J9343
4612B008J2539j9641p426J4387L764R20o34o106j402k126O150O173n129r599o841
4597a2963k590R725R890J1879j1835K129L13N132M458P64r519j775M98j929K472
4582F649l170m921n235Q973J2591j0067j5565M521O603R313m556M40L29k517l69
4567C019J5968P290j8102j3288m568O475P658L137N598j965j0903j2591n418r004
4553b6694O536K3468K000j0095o01R840j666M034l994J1611N524j6554q851k538
4539g980N127N936J4204J2346J769j1807j5122q418m124L598K584Q016J613n518
$$ plain form
4525 2224 -634 -12617 -23371 -13174 2554 7299 13335 8835 -3670 -944 12808 31569 22917
4512 22917 5023 -1462 -1734 125 -1579 -3693 -6882 -19816 -28697 -27300 -16231 -1711 13137 19733
4498 19733 25497 15675 4539 -6342 -17203 -6318 640 4640 5769 16454 21550 21974 29056 32803
4484 32803 5515 2026 9805 13019 2484 -2830 -8266 -362 3416 -695 777 -542 -10233 -3343
4470 -3343 8010 12383 13074 -2387 -9304 -7921 -810 2351 8179 6537 3348 -135 886 -2076 -11839
4455 -11839 -16678 -6037 -4663 -3853 -10151 -9517 -9384 -10592 -12567 -4964 6037 5514 5320 8020 10502
4440 10502 20569 33402 39594 26217 12948 -6010 -3235 1001 -7830 -15338 -10090 -9951 -5764 -5135
4426 -5135 -8732 4285 6044 -18673 -26793 -19301 -10276 -9687 -3667 418 4486 11688 11678 2242 6865
$$ packed form
4525B224k858j1983j0754J0197J5728M745O036m500j2505K726J3752J8761q652
4512B2917j7894o485k72J859j704k114l189j2934q881J397J1069J4520J4848O596
4498A9733N764r822j1136j0881j0861J0885O958M000J129J0685N096M24P082L747
4484C2803k7288l489P779L214j0535n314n436P904L778m111J472j319r691O890
4470c343J1353M373O91j5461o917J383P111L161N828j642l189l483J021k962r763
4455a1839m839J0641J374Q10o298O34J33j208j975P603J1001n23j94K700K482
4440A0502J0067J2833O192j3377j3269j8958K775M236q831p508N248J39M187O29
4426e135l597J3017J759k4717q120P492R025N89O020M085M068P202j0r436M623
$$ plain form
4411 6865 -2830 -7312 -6065 -11171 -14254 -2564 621 3076 1286 -2440 2045 7413 -6203 -767
4397 -767 -1134 11846 21961 11573 -4805 -9843 4357 5598 3475 4210 -4837 -5926 -2432 1309
4383 1309 2490 -5371 -16492 -26377 -24862 -13834 -13276 -11752 -12710 -4183 5562 -1301 4553 5294 9843
4368 9843 14563 3336 -8342 -877 6268 -817 -11017 -7442 755 42 7406 2304 -4013 -6546
4354 -6546 -11718 -25099 -16216 -3618 -7266 -10158 -20674 -15926 -15864 -17319 -12936 1882 10453 6955
4340 6955 3469 2745 13344 13614 15358 20704 11131 -3509 -9659 -2797 -9336 4332 5220 -4769 4706
4325 4706 8482 -415 -5782 -15000 -5049 -8432 -5255 -8370 10055 15065 7953 -738 6023 11428 15999
4310 15999 5384 2992 9884 9334 2907 -8476 -5591 3804 3050 6639 3098 -10085 -16274 -13148
$$ packed form
4411F865r695m482J247n106l083J1690L185K455j790l726M485N368j3616N436
4397g67l67J2980J0115j0388j6378n038J4200J241k123P35r047j089L494L741
4383A309J181p861j1121r885J515J1028N58J524r58Q527R745o863N854P41M549
4368I843M720j1227j1678P465P145p085j0200L575Q197p13P364n102o317k533
4354f546n172j3381Q883J2598l648k892j0516M748O2j455M383J4818Q571l498
4340F955l486p24J0599K70J744N346r573j4640o150O862o539J3668Q88r989R475
4325D706L776q897n367r218R951l383L177l115J8425N010p112q691O761N405M571
4310A5999j0615k392O892n50o427j1383K885R395p54L589l541j3183o189L126
$$ plain form
4296 -13148 -14935 -19297 -10495 -2894 -1569 -2285 4617 2220 4197 16147 19119 14289 11162 10031 12036
4281 12036 -1899 -1421 10912 23109 25559 11527 6279 2324 7450 6203 7326 8774 -1760 6426
$$ packed form
4296a3148j787m362Q802P601J325p16O902k397J977J1950K972m830l127j131K005
4281A2036j3935M78J2333J2197K450j4032n248l955N126j247J123J448j0534Q186
$$ [...]
##END NTUPLES=NMR SPECTRUM
##END=
