##TITLE=Analysis number 311668
Compound Code km 02682
Project Code qc-cat
Chemist Name andrews
##JCAMPDX= 6.0         $$ Bruker NMR JCAMP-DX V2.0
##DATA TYPE= NMR SPECTRUM
##DATA CLASS= NTUPLES
##ORIGIN= Bruker BioSpin GmbH
##OWNER= NMR
$$ XWIN-NMR		Version 3.5
$$ Thu Jul 14 10:08:56 2005 GMT Daylight Time (UT+1h)  MAYBRIDGE\NMR@NMR_250MHZ
##.OBSERVE FREQUENCY= 250.131544655141
##.OBSERVE NUCLEUS= ^1H
##.ACQUISITION MODE= SIMULTANEOUS (DQD)
##.ACQUISITION SCHEME= undefined
##.AVERAGES= 16
##.DIGITISER RES= 18
##SPECTROMETER/DATA SYSTEM= dpx250
##.PULSE SEQUENCE= zg30
##.SOLVENT NAME= CDCl3
##.SHIFT REFERENCE= (INTERNAL, CDCl3, 0, 16.522)
##AUDIT TRAIL= $$ (NUMBER, WHEN, WHO, WHERE, WHAT)
$$ ##TITLE= Audit trail, XWIN-NMR		Version 3.5
$$ ##JCAMPDX= 5.01
$$ ##ORIGIN= Bruker BioSpin GmbH
$$ ##OWNER= NMR
$$ C:\u/data/dgb/nmr/ADRS/5820/pdata/1/auditp.txt
$$ ##AUDIT TRAIL=  $$ (NUMBER, WHEN, WHO, WHERE, WHAT)
(   1,<2005-07-14 10:08:34.52 +100>,<MAYBRIDGE\NMR>,<NMR_250MHZ>,
      <created by zg, POWCHK disabled, PULCHK disabled
       configuration hash MD5:
       62 19 C7 07 E1 42 D1 B7 37 6C 3D D0 77 39 F9 E6
       data hash MD5: 64K
       23 80 F5 BF DA 2F 60 6E 39 4F 03 3F DE D2 5E 10>)
(   2,<2005-07-14 10:08:47.89 +100>,<MAYBRIDGE\NMR>,<NMR_250MHZ>,
      <Start of raw data processing
       ef LB = 0.3 FT_mod = 6 PKNL = 1 SI = 32K 
       data hash MD5: 32K
       97 52 12 1E C3 CC 15 EF E3 D5 AC 5A A6 FF C8 15>)
(   3,<2005-07-14 10:08:49.80 +100>,<MAYBRIDGE\NMR>,<NMR_250MHZ>,
      <apk 
       data hash MD5: 32K
       EA 75 22 BC A3 DF 9E F4 A6 1B 85 35 DF 7E 1F 01>)
(   4,<2005-07-14 10:08:50.58 +100>,<MAYBRIDGE\NMR>,<NMR_250MHZ>,
      <abs ABSG = 5 
       data hash MD5: 32K
       FD 3B D8 D1 84 83 2E 1A DF 2B AA AE A8 77 64 77>)
$$ ##END=
$$ 
$$ hash MD5
$$ 66 85 EB 6E B7 90 B9 57 43 8A EE DE B1 45 FA FF
##$RELAX= 
##$RELAX= 
##$RELAX= 
##$RELAX= 
##$RELAX= 
##$RELAX= 
##$RELAX= 
$$ Bruker specific parameters
$$ --------------------------
##$DU= <C:\u>
##$EXPNO= 5820
##$NAME= <ADRS>
##$PROCNO= 1
##$TYPE= <nmr>
##$USER= <dgb>
##$AMP= (0..31)
100 100 100 100 100 100 100 100 100 100 100 100 100 100 100 100 100 100 
100 100 100 100 100 100 100 100 100 100 100 100 100 100 
##$AQSEQ= 0
##$AQ_mod= 3
##$AUNM= <au_zg>
##$AUTOPOS= <7 >
##$BF1= 250.13
##$BF2= 250.13
##$BF3= 250.13
##$BF4= 250.13
##$BF5= 500.13
##$BF6= 500.13
##$BF7= 500.13
##$BF8= 500.13
##$BYTORDA= 1
##$CFDGTYP= 0
##$CFRGTYP= 5
##$CHEMSTR= <none>
##$CNST= (0..31)
1 1 145 1 1 1 1 1 1 1 1 1 1 1 1 1 1 1 1 1 1 1 1 1 1 1 1 1 1 1 1 1 
##$CPDPRG= <>
##$CPDPRG1= <>
##$CPDPRG2= <>
##$CPDPRG3= <>
##$CPDPRG4= <mlev>
##$CPDPRG5= <mlev>
##$CPDPRG6= <mlev>
##$CPDPRG7= <mlev>
##$CPDPRG8= <mlev>
##$CPDPRGB= <>
##$CPDPRGT= <>
##$D= (0..31)
0 1 0 0 0 0 0 0 0 0.06 0 0 0 0 0 0 0.0002 0 0 0 0 0 0 0 0 0 0 0 0 0 0 
0 
##$DATE= 1121332113
##$DBL= (0..7)
120 120 120 120 120 120 120 120 
##$DBP= (0..7)
150 150 150 150 150 150 150 150 
##$DBP07= 0
##$DBPNAM0= <>
##$DBPNAM1= <>
##$DBPNAM2= <>
$$ [...]
##$SUBNAM7= <"">
##$SUBNAM8= <"">
##$SUBNAM9= <"">
##$SW= 20.6930455092707
##$SWIBOX= (0..15)
0 0 3 0 0 0 0 0 0 0 0 0 0 0 0 0 
##$SW_h= 5175.983436853
##$TD= 65536
##$TD0= 1
##$TE= 295.16
##$TE2= 300
##$TE3= 300
##$TEG= 300
##$TL= (0..7)
0 120 120 120 120 120 120 120 
##$TP= (0..7)
150 150 150 150 150 150 150 150 
##$TP07= 0
##$TPNAME0= <>
##$TPNAME1= <>
##$TPNAME2= <>
##$TPNAME3= <>
##$TPNAME4= <>
##$TPNAME5= <>
##$TPNAME6= <>
##$TPNAME7= <>
##$TPOAL= (0..7)
0.5 0.5 0.5 0.5 0.5 0.5 0.5 0.5 
##$TPOFFS= (0..7)
0 0 0 0 0 0 0 0 
##$TUNHIN= 0
##$TUNHOUT= 0
##$TUNXOUT= 0
##$USERA1= <user>
##$USERA2= <user>
##$USERA3= <user>
##$USERA4= <user>
##$USERA5= <user>
##$V9= 5
##$VALIST= <valist>
##$VCLIST= <CCCCCCCCCCCCCCC>
##$VD= 0
##$VDLIST= <DDDDDDDDDDDDDDD>
##$VPLIST= <PPPPPPPPPPPPPPP>
##$VTLIST= <TTTTTTTTTTTTTTT>
##$WBST= 1024
##$WBSW= 4
##$XGAIN= (0..3)
0 0 0 0 
##$XL= 0
##$YL= 0
##$YMAX_a= 354363
##$YMIN_a= -303940
##$ZGOPTNS= <>
##$ZL1= 120
##$ZL2= 120
##$ZL3= 120
##$ZL4= 120
##$ABSF1= 16.522
##$ABSF2= -4.171173
##$ABSG= 5
##$ABSL= 3
##$ALPHA= 0
##$AQORDER= 0
##$ASSFAC= 0
##$ASSFACI= 0
##$ASSFACX= 0
##$ASSWID= 0
##$AUNMP= <proc_1d>
##$AZFE= 0.1
##$AZFW= 0.1
##$BCFW= 0
##$BC_mod= 0
##$BYTORDP= 0
##$COROFFS= 0
##$CY= 12.5
##$DATMOD= 1
##$DC= 0
##$DFILT= <>
##$DTYPP= 0
##$F1P= 14.0000005364418
##$F2P= -0.99999901652339
##$FCOR= 0.5
##$FTSIZE= 32768
##$FT_mod= 6
##$GAMMA= 0
##$GB= 0
##$INTBC= 1
##$INTSCL= 1
##$ISEN= 128
##$LB= 0.3
##$LEV0= 0
##$LPBIN= 0
##$MAXI= 10000
##$MC2= 0
##$MEAN= 0
##$ME_mod= 0
##$MI= 0
##$NCOEF= 0
##$NC_proc= -4
##$NLEV= 6
##$NOISF1= 0
##$NOISF2= 0
##$NSP= 0
##$NTH_PI= 0
##$NZP= 0
##$OFFSET= 16.522
##$PC= 1
##$PHC0= -73.61063
##$PHC1= 2.083894
##$PH_mod= 1
##$PKNL= yes
##$PPARMOD= 0
##$PSCAL= 4
##$PSIGN= 0
##$REVERSE= no
##$SF= 250.13
##$SI= 32768
##$SIGF1= 0
##$SIGF2= 0
##$SINO= 400
##$SIOLD= 32768
##$SREGLST= <1H.CDCl3>
##$SSB= 0
##$STSI= 32768
##$STSR= 0
##$SW_p= 5175.98343685301
##$SYMM= 0
##$S_DEV= 0
##$TDeff= 65536
##$TDoff= 0
##$TI= <Analysis number 999999
Compound Code 99
Book Reference 9
Project Code 9>
##$TILT= no
##$TM1= 0
##$TM2= 0
##$TOPLEV= 0
##$USERP1= <user>
##$USERP2= <user>
##$USERP3= <user>
##$USERP4= <user>
##$USERP5= <user>
##$WDW= 1
##$XDIM= 32768
##$YMAX_p= 394704986
##$YMIN_p= -731455
$$ End of Bruker specific parameters
$$ ---------------------------------
##NTUPLES= NMR SPECTRUM
##VAR_NAME=  FREQUENCY,     SPECTRUM/REAL,   SPECTRUM/IMAG
##SYMBOL=    X,             R,               I
##VAR_TYPE=  INDEPENDENT,   DEPENDENT,       DEPENDENT
##VAR_FORM=  AFFN,          ASDF,            ASDF
##VAR_DIM=   32768,         32768,           32768
##UNITS=     HZ,            ARBITRARY UNITS, ARBITRARY UNITS
##FACTOR=    0.157963299565203, 1,           1
##FIRST=     4132.6476996994, 0,             0
##LAST=      -1043.33573715361, 0,           0
##MIN=       -1043.33573715361, -731455,     0
##MAX=       4132.6476996994, 394704986,     0
$$ Real data points
##PAGE= N=1
##DATA TABLE= (X++(R..R)), XYDATA
$$ [...]
22748 -81453 59552 93324 -24844 -74707 -113482 -116742 -37899 78 -41131 -101933 -39614
22737 -39614 57312 101507 36562 -6176 -29987 12975 3120 51514 74348 -2835 -68609 -60752
22725 -60752 -30569 2739 -14540 40434 93056 253 -176 11535 -979 -55718 15937 30308
22713 30308 43901 -57757 -135885 -132423 -110957 -98839 -105186 -127979 -114208 -59434 -3433 13272
22701 13272 28684 7124 22522 39312 44123 106029 57850 22581 6272 -51676 48571 66348
22689 66348 12178 -47639 -82252 -122748 -100635 -27533 -41225 -52753 21274 58401 56947 -6092
22677 -6092 -20450 -35785 -91642 -48376 1764 29580 37902 -56861 -107315 -182094 -174879 -150562
22665 -150562 -114133 -70984 19960 41726 29564 -32366 -51117 -57582 -48520 -67250 -21418 -33196
22653 -33196 -111395 -112256 -119937 -102089 -26914 -63423 -142193 -23917 -4717 -12537 -104976 -89285
22641 -89285 -111443 -86566 -119244 -125401 -125824 -60064 -68436 -71307 -162715 -160492 -42787 12177 26265
22628 26265 -69277 -91318 -89206 -30221 -4202 54980 114053 145038 51637 -4497 59944 51168
22616 51168 14361 23148 60666 47320 58282 39145 8660 72555 106731 56074 9117 -42441
22604 -42441 -5471 -68413 -43579 53832 27878 23898 33436 -58317 4268 -12547 -67963 -64165
22592 -64165 -10286 24954 85524 45037 -12068 -81200 -18742 -29754 -36104 93409 139572 106776
22580 106776 140726 96968 52060 65932 77916 41713 -35601 -534 68520 5065 -29190
22569 -29190 9291 -20457 -38995 -24852 -26183 -58845 -76536 -63826 -55114 -37971 -18962 -43258
22557 -43258 -141519 -221701 -181128 -128820 -40668 86501 103416 108697 76370 -2350 -141469
22546 -141469 -163747 -99133 -25455 -64794 -70300 44335 35485 46058 31593 -22089 -75794 -28606
22534 -28606 -46857 -64283 -67815 -52651 -31277 23817 -15846 -54483 -102774 -42442 26416 7302
22522 7302 -24469 -56206 -42838 -48993 -90816 -51845 -51170 -31011 -410 83378 134294 71913
22510 71913 65298 144822 39587 -6041 8680 64753 58220 -72412 -126898 -48363 75121
22499 75121 139349 56662 -53793 -75589 -83660 -139749 -73384 -18556 -22975 -67037 -69354 -5948
22487 -5948 17999 95243 106305 46952 56366 109771 143504 160173 93933 15212 -38143 -113321
22475 -113321 -131389 -147340 -145175 -110878 -130441 -48983 -60659 -64115 -76525 -34737 -73503 -11361
22463 -11361 22794 -37059 -55620 -37970 20564 72659 35181 -25332 -123709 -90913 -91265 -119274
22451 -119274 -119607 -41978 16271 27804 71919 62356 -713 69274 10767 -13860 54390 141545
22439 141545 87382 -69590 -92114 9087 30567 -40368 -109044 -77496 -61598 -48075 -40696
22428 -40696 32528 16453 -10868 79239 196929 162043 156532 107697 34029 -23332 -36291 -595
22416 -595 16919 -75346 -146170 -127414 -165889 -93901 -93655 -71579 19736 86708 160640 96929
22404 96929 42948 32168 -30132 -24372 44075 50375 637 -35566 18384 -25451 -66188 -40311
22392 -40311 10856 20647 49232 -2290 -75803 -30747 30754 61882 73616 20849 65279 22202
22380 22202 16127 -29198 -56849 30677 34021 -23494 7658 -14155 -85384 -104071 -69044 7395
22368 7395 -8176 -98782 -19277 -16801 8169 41066 -24612 -111204 -53656 -72414 -179717 -152574
22356 -152574 -27778 -2432 -57375 -34496 -58943 -51518 -36146 -131386 -173494 -84583 -4174
22345 -4174 60000 58313 102440 64819 25452 7143 -6159 24863 -5868 25355 40026 33218
22333 33218 59877 9302 9911 2528 29793 43799 -57581 -169046 -119188 -26557 -3130 -21463
22321 -21463 -46246 -70632 -10376 -67715 -23613 132521 128236 35967 -26036 -34387 -10978 -17717
22309 -17717 -9653 76905 159404 177108 64170 3497 37422 45745 44462 40420 -6075 61027
22297 61027 82834 38337 67708 52940 63798 81634 -17511 -58120 -31553 25969 62021 24777
22285 24777 20033 405 -46461 1178 29791 60531 60098 40091 33309 -6333 32141 30356 -15118
22272 -15118 -17531 -41402 22668 17845 -69286 -26348 81228 159798 184895 108263 20794 5354
22260 5354 -22891 -78097 -41442 -10267 23447 11513 -19383 -25024 -81509 -145987 -100830 -24302
22248 -24302 -24946 -77028 -8712 59466 62559 -32201 -26579 -68218 -115883 -56313 48514 59775
22236 59775 52269 62596 26206 2478 33637 39090 -54816 -49864 -118532 -142266 -156200 -122318
22224 -122318 -142742 -82795 -70298 -108381 -147574 -153689 -81749 2855 7383 19636 55477 -21078
22212 -21078 -45513 -34513 33241 37882 31628 94003 131315 162048 94716 72338 41541 34641
22200 34641 72307 122034 89307 40882 -44266 -103207 -171501 -204814 -213511 -135360 -42950 -75110
22188 -75110 -78516 -42222 11348 45974 8688 -88810 -172428 -233619 -198123 -106177 -29352 -78886
22176 -78886 -80398 -13964 84449 134688 191481 94539 -38705 -59352 -40726 -74191 -111404 -66117
22164 -66117 -39995 -16329 -4224 -49708 -114171 -160429 -165193 -67009 -75103 -61442 -70426 -74701
22152 -74701 -48975 -35462 -8203 -26607 25574 -37858 29050 113341 147354 140838 115384 98175
22140 98175 -3940 -33058 53498 113793 86525 111733 81589 -65914 -96799 -62373 38851
22129 38851 24122 -17725 -19763 81908 163368 153575 115013 -30413 -97999 -55378 -18799 -51373
22117 -51373 23088 80101 142131 109696 91420 97733 35758 -2578 50434 72654 20142 -23800
22105 -23800 400 -1466 13636 6587 -55503 -75331 -68609 -61705 -47033 -140626 -110593 -45049
22093 -45049 6561 -57770 -70121 -47175 13515 100273 75743 22736 -20140 -35426 -2344 36611
22081 36611 59495 66160 67026 34298 -23870 -2460 33431 -10352 -108762 -126946 -91012 -42363
22069 -42363 22219 12880 24513 -11561 -125497 -154416 -123121 -84136 -34036 -79673 -23141 40941
22057 40941 -14907 -76878 -57582 -36147 -19495 49977 113111 128730 55336 -18929 -41895 -85760
22045 -85760 -56230 -51425 -77926 -116285 -90618 -83665 -16897 33431 -42026 -81844 -52240 -4398
22033 -4398 56915 30147 -29213 53869 3764 27361 -6860 -97438 -103660 -106589 -57398 -51242
22021 -51242 -80999 -74548 -38683 -12421 -33268 -7944 -9354 -43372 -44697 46275 28012 -3955
22009 -3955 -18564 11495 -32796 -90493 -92863 -40431 -120654 -140249 -134298 -117949 -116864 -10961
21997 -10961 51674 56181 7849 -61957 -26785 -15909 -14287 38094 -36860 -37384 -23976 -21060 -74813
21984 -74813 -87469 -39554 15133 -14386 -40826 10439 117178 178963 78375 79478 85704 128198
21972 128198 168994 158407 118805 55220 78193 69578 10620 16140 -56331 -49698 2720 84755
21960 84755 219854 121452 34753 36986 144343 112567 -48898 -80994 -51568 -59571 -53948 -13976
21948 -13976 24941 81199 18902 21513 7583 -48379 -46320 -35091 -24163 11435 46915 33813
21936 33813 40460 105428 84675 26061 3548 -2923 40693 34818 4488 84478 93957 61185
21924 61185 738 25945 49163 90338 116088 198314 217715 163439 129757 172146 186091 165232
21912 165232 229562 201212 154591 176080 196185 109436 44155 11428 -19507 -53185 -41050
21901 -41050 -2627 13117 21342 -9393 46173 22889 49246 50567 9799 35124 55807 167703
21889 167703 171445 126659 172379 131527 115906 76030 99715 106455 36127 -44448 -67743 -94813
21877 -94813 -72838 -13060 13735 -22797 24604 8386 35324 58515 -17582 -67603 -17522 -43341
21865 -43341 -72621 -60433 10592 95831 97270 28085 35358 19609 -4719 -69639 -136706 -139326
21853 -139326 -120767 -141433 -88876 -26738 35138 78688 -2977 -36806 -15483 -22106 -29972 -59909
21841 -59909 -20218 -33358 160 -43779 -31714 -90005 -159304 -50316 15853 4203 -42811
21830 -42811 -76212 -85218 -104789 -82775 -63147 -155099 -190202 -101549 -19862 -40583 -74546 -74635
21818 -74635 -13273 -10094 22821 44004 -2468 -38287 -24094 25512 5796 38300 5415 15200
21806 15200 127257 97945 -51103 -112030 -61715 -18572 62184 57214 36605 103818 107165 57019
21794 57019 50303 -13108 -7385 51843 38322 60691 29022 -61677 -48318 -69134 -84610 -120008
21782 -120008 -86420 -130771 -136915 -98687 -59397 3950 -60160 -27804 -10574 -64973 -88333 -88637
21770 -88637 -68714 -61485 -56240 -139534 -152391 -82721 -92398 -198219 -212360 -105932 -99244 -122194
21758 -122194 -173412 -222629 -190682 -27221 80964 17287 -45814 -26634 -38415 -16812 6183
21747 6183 -48543 -18573 43410 -24434 -100964 -95832 -127926 -42783 -11385 -53156 -95661 -154772
21735 -154772 -96077 1849 -52782 -121152 -71713 -103583 -184946 -183215 -143438 -42044 -46353 -51916
21723 -51916 -75991 -66104 -97831 -126574 -127263 -114618 -69906 4072 7365 42463 19335 5713
21711 5713 -11201 2910 -22969 -33600 -53431 -37896 -61034 -46919 -27749 20170 39521 61235
21699 61235 -27728 6163 7678 -32350 -78278 -54601 -58686 -30666 21715 36494 56494 71915
21687 71915 18300 -24685 -70421 -120012 -129280 -50511 -30015 -148480 -154897 -127576 -9246 50903
21675 50903 78852 106712 60422 49371 72366 20075 -91484 -81862 -63892 -23159 -44762 -88980
21663 -88980 -57367 -79523 -133426 -144348 -146749 -70708 -61443 31896 20247 -35971 -46940 -56454
21651 -56454 -49863 -25925 -31887 37622 56436 -26518 21847 -1029 36258 35099 -21473 -113435
21639 -113435 -58553 -22648 -45765 -51859 -9679 -20620 -35080 -35262 -13964 20123 16048 -8130
21627 -8130 52351 91590 78034 59297 49414 -73533 -90057 -57161 -786 66500 90880 57397
21615 57397 64651 164666 173500 106448 31509 60232 83807 50040 40692 9712 18634 62847
21603 62847 73361 106550 34948 12061 -16284 -110791 -36795 5555 41365 104431 28138 4546
21591 4546 -13436 42948 59587 5688 9051 74301 53964 5678 -38338 -41211 1121 79549
21579 79549 52401 19268 555 -44834 -100549 -103920 -82951 -109457 -182311 -160967 -105467 -28360
21567 -28360 -975 -42044 -54273 -22239 -15615 -39026 -83748 -78238 6973 96827 64383 -21718
21555 -21718 12028 -29788 13705 44560 -14849 -96099 -42663 43024 43368 95728 143408 87208
21543 87208 46508 -28733 -116372 -113733 -75025 -76835 -75505 45480 -17178 -67296 31374 28215
21531 28215 5279 55249 50555 13172 -17499 -104478 -187318 -211703 -135522 -129761 -107660 -99282
21519 -99282 -61636 -71023 -107265 -59124 -28699 -54402 -83014 -43658 -83661 -135785 -77098 -30433
21507 -30433 -19500 -115824 -232208 -185288 -98222 72633 74755 17389 -13654 33253 61330
21496 61330 21780 -10006 -6874 23536 86163 97523 125903 98417 -41089 -117106 -111210 -135152
21484 -135152 -55373 -40392 -38674 -77581 -42338 -12352 -152157 -193512 -96345 -44611 12944
21473 12944 48097 31966 -18216 -62078 -32751 -1595 -449 -23884 -9139 -26943 -3272 59707
21461 59707 41459 35147 -28203 -52612 -15922 -37397 -68401 -115556 -91249 -143524 -118684 -134944
21449 -134944 -158879 -118097 -56770 -52184 -38838 -20301 -56392 -72731 -86487 -22261 1677 -19457
21437 -19457 -67239 -76019 -109033 -77640 -30891 -6111 28109 3450 -119605 -73554 -35775 -57854
21425 -57854 -193222 -134159 -140754 -168932 -62695 -36529 -33127 -61710 -91646 -10991 -33718 -17362
21413 -17362 900 26375 -10251 30181 42280 -39376 -85645 -90909 3318 -27357 -136616 -153108
21401 -153108 -85620 -2895 -9751 72225 24805 50359 21710 -62234 -64728 14811 -25564 -27534
21389 -27534 58252 88794 54969 94990 71543 82417 125626 174722 201808 103348 36268 65331
21377 65331 68050 25447 56407 50746 -11447 -44093 -61493 -107646 -161053 -102918 12710 18052
21365 18052 55266 30946 -35965 -28654 -48687 -40967 -76975 -92487 -71232 -35820 -8991 -55500
21353 -55500 -10492 -32412 -14673 -32127 -61753 -100078 -124753 -126357 -35107 -11774 -18967 -46692
21341 -46692 -37573 -106345 -175332 -173150 -99994 -28144 49595 93414 69794 7189 -17176 21501
21329 21501 10490 -2525 -30604 5450 20406 47201 -14258 -35920 -6419 -6758 -40752 -28109
21317 -28109 -24058 53964 8588 -94453 -116157 -61034 -55248 -12940 36182 28743 9651 -13310
21305 -13310 -78156 -10329 37733 38214 38361 -1500 -60801 -109129 -143614 -69085 -30560 -68089
21293 -68089 -7880 -7286 -39226 -36141 -65523 -16952 -62602 -104419 -91669 -7882 51882 76892
21281 76892 -27519 -25651 -31047 -97866 -162983 -112915 -145837 -149086 -152031 -177775 -156305 -126732
21269 -126732 -108262 -111131 -94971 -66534 -44968 3840 -26780 66276 89691 13439 2504 -11202
21257 -11202 56557 75743 45950 59664 -3937 -5693 57716 9590 8595 4249 -84346 -141015
21245 -141015 -125823 -11414 -15006 -84323 -36849 -42790 -38899 -34598 -45554 -101819 -100575 -69452
21233 -69452 -131486 -53207 12801 35128 -65005 -115185 -142987 -104401 -52315 -68698 -75974 -90001
21221 -90001 -19508 6685 17306 67858 39311 86633 116936 66240 18012 -27908 5731 127166
21209 127166 99060 -33894 -153375 -209418 -206286 -225873 -185906 -112113 -51994 -41307 -40394 -61977
21197 -61977 -2471 16645 -49843 -181948 -174343 -105460 -86516 -85802 -94134 -98289 -99239 -58323 57372
21184 57372 50350 -17546 -108699 -152466 -182358 -124522 -141177 -121823 -143004 -121621 -65632 -17264
21172 -17264 -48451 -121457 -100406 -103428 -114117 -76372 -77443 -91062 -29294 -13811 -25909 -27432
21160 -27432 -34473 9446 25424 65236 53795 4790 -15941 11299 -1343 -14770 -63929 -22960
21148 -22960 9282 3396 -43505 -121327 -130824 -55942 -15543 -6857 18168 30936 -46115 -108964
21136 -108964 -56220 -37724 -103608 -138702 -86886 -64222 -52381 11533 -32971 -46359 -79942
21125 -79942 -56949 -91459 -38875 -18379 -75652 -129249 -159282 -136853 -106664 -135602 -99759 -151331
21113 -151331 -109390 -105277 -79553 -24384 -21402 -13877 -67032 -224791 -192768 -130620 -84822 -12517
21101 -12517 -15424 -39541 55857 89622 133424 80168 47122 -33573 -90729 -73989 18076 91347
21089 91347 147652 115982 49367 53814 -27160 32281 70291 115364 126486 21348 -39653 -18028
21077 -18028 6041 31531 4070 -6579 -13808 52161 64428 6097 -54537 -73147 -26194 17367
21065 17367 -21336 -95044 -127481 -124457 -22628 -35426 -28657 24447 31149 12721 -65286 -77386
21053 -77386 -80809 -135240 -154972 -165116 -94576 -129252 -84547 -105197 -101739 -135878 -40966 76665
21041 76665 72336 71042 63963 31577 -17063 65959 96242 -11489 -42246 24198 96723 110784
21029 110784 13217 -55957 -67281 -117043 -169065 -176748 -114844 -65070 -68044 -3190 81672 165154
21017 165154 118681 55117 -9833 -61735 -69460 -26569 -9806 -10187 57921 60967 80824 73591
21005 73591 -661 1663 66325 94530 89255 65195 52403 44319 11979 25529 -62049 -71604
20993 -71604 -49889 -102027 -89167 -104868 -55257 -45350 -9932 -78463 -59904 -6321 -30020 -26149
20981 -26149 31255 75282 77996 68488 64032 106584 166708 64746 13468 -6599 -89325 -92673
20969 -92673 -82000 -5636 -58169 -133891 -119627 -143358 -126831 -129014 -57570 -17102 -25776 -81546
20957 -81546 -87056 -83069 -120222 -15505 98809 140030 69889 59183 54917 -1723 -36170 -44758
20945 -44758 31165 43135 13710 -19784 -32228 -45304 -20271 -83903 -116821 -121833 -74677 -27492
20933 -27492 -109263 -205087 -133365 -77066 -63095 -33242 -48261 -155833 -178137 -119052 -101445
20922 -101445 -145149 -203062 -244699 -219192 -208208 -79013 -30531 15802 -79686 -159503 -209538
20911 -209538 -192339 -208497 -153090 -47927 -90227 -138480 -203121 -154611 -147172 -121789 -57550
20900 -57550 -38163 -53343 -54813 -57795 -103937 -148657 -144352 -50786 23267 23866 55960 123215 121614
20887 121614 126901 133207 76968 53296 11507 73374 75528 77636 -9091 -40626 -45935 16640
20875 16640 -38509 -84588 -93982 -74779 -102242 -127190 -65965 20379 56946 45680 -1847 -36938
20863 -36938 -48121 -61001 -8335 50725 14007 -61290 -79400 -33402 -1683 25409 -44580 -124746
20851 -124746 -133164 -34241 -28444 -73769 -56410 -77826 -31646 -12400 -42311 24314 17962 -107507
20839 -107507 -158274 -101179 -61678 -89862 -66787 40724 39982 26093 77917 54990 8548 18252
20827 18252 14714 15048 -17938 -6593 42894 147777 109757 37004 -51585 -51423 78901 76099
20815 76099 53300 27517 -27786 -111956 -83565 46679 7767 -25211 -62037 -100102 -66989
20804 -66989 -33619 -25516 -9221 -37992 -1588 53471 48172 115253 116697 67419 69291 30865
20792 30865 -38195 -59986 -90424 -63792 -2373 6032 -7952 -56858 -20211 25375 -68367 -113025
20780 -113025 -32964 -22085 -17221 23428 34289 31386 50603 33804 48588 78087 128904 114299
20768 114299 68545 -12067 2002 119776 123432 143005 154592 149279 86885 57023 131227 161430
20756 161430 76991 -33439 -5016 14325 71760 12346 -91467 -101619 -108828 -137679 -54072
20745 -54072 35267 92533 123812 124171 27209 -71450 -26583 -6502 -75066 -149084 -76557 32403
20733 32403 -19314 -100515 -50203 22685 -117 13212 38012 94879 53967 13628 15565 48539
20721 48539 55453 -29915 -81328 -129769 -22574 11420 21823 -8616 -49679 20350 -18774 220
20709 220 -2704 -23564 -34020 -74201 -38975 -86274 -74089 -48050 -76771 -94204 -68130 -88734
20697 -88734 -101536 -81565 21631 31505 33809 1867 -9317 28251 29291 54775 48414 -29140
20685 -29140 -42768 10770 -18253 -53769 56425 88173 71177 83158 42643 -39050 -41465 -64388
20673 -64388 -77491 -68617 -83312 -45382 -85975 -11731 66659 32519 29983 28791 70755 78874
20661 78874 117716 68813 18266 51264 -14455 -101773 -135817 -134013 -96065 -52443 -133672 -177739
20649 -177739 -33401 93167 18250 -107219 -42156 -18862 -54656 -136963 -192989 -72821 -6641
20638 -6641 -52683 -110733 -92344 -62847 -31906 4592 -13108 -14715 -68575 -98197 -109421 -15398
20626 -15398 36210 1882 -5495 -18661 -48418 -53121 -44732 -102138 -88470 -119809 -136413 -159443
20614 -159443 -39133 24998 28893 23195 -221 -37971 -34443 -60958 -47741 28835 24119 28788
20602 28788 19171 -1761 -10227 17066 47979 10731 3236 79327 152454 177093 173838 192064
20590 192064 172970 151148 170926 97319 92540 59002 13589 -18077 -104240 -73364 -23175 -26506
20578 -26506 -35046 11632 33935 59543 -13731 -75339 -45390 25343 120120 139901 36356 -12435
20566 -12435 -97196 -131207 -109666 -85230 -64026 -9090 -42262 -24143 -38219 -29281 -15356 10880
20554 10880 56760 94711 104511 127030 157839 116434 35943 20936 28834 81353 23313 -98434
20542 -98434 -123770 -98127 -32912 -16598 -36776 -100580 -117545 -85073 -79032 -28871 -46912 -96440
20530 -96440 -66700 -6017 43760 75887 53597 -48943 -100821 -35295 12192 46057 85260
20519 85260 76683 13113 -39421 -19299 39635 39159 50960 11852 -34123 -31417 -4471 36667
20507 36667 65809 -7844 -60858 -97181 1264 98992 50488 -24537 12220 -53763 -12245 -82496
20495 -82496 -164513 -71591 -7889 68467 54261 47099 47596 75060 53366 -12589 -31736 -10367
20483 -10367 -12783 -19316 21179 -111 -40311 -26592 -9157 51792 54959 48766 76745 95995
20471 95995 91665 51591 5761 23701 8043 78872 40531 -20023 -37899 -2338 -9944 18781
20459 18781 -10315 -51184 -6576 15297 109035 141374 87084 93861 21859 -16854 -11534 -68007
20447 -68007 -66730 -87508 -83681 -50755 -43374 -5144 -21565 11984 74862 63775 30161 44099
20435 44099 31271 13964 10320 13915 82233 63510 93260 118117 115750 90254 94699 36223
20423 36223 15745 31157 637 -53275 -30103 -21494 -77602 -97293 -90373 25891 85473 131705
20411 131705 199718 167975 130209 119914 92382 77898 91948 -4742 -15902 36301 115626
20400 115626 23972 20473 55938 -46479 -110467 -85667 -21836 36910 30298 17853 -17373 -71196
20388 -71196 -167251 -164056 -184612 -71733 14149 -16027 -21369 69402 82747 100153 75838 52985
20376 52985 1327 1399 29577 98382 70441 36411 -9790 10302 107487 167804 94625 26519
20364 26519 124513 127391 77745 71459 33818 21883 9732 43026 53745 75718 26000 -80278
20352 -80278 -114944 -144894 -164903 -91852 11024 27865 70908 58265 20865 40143 33166 50807
20340 50807 83663 71824 32591 34026 112246 84329 42106 38372 82744 10373 18427 80175
20328 80175 81249 44814 -1358 -61652 -30728 10405 123863 60158 12040 2812 -2146 23060
20316 23060 64288 82664 82254 44457 58552 17707 13447 77646 107594 55921 46351 29149
20304 29149 -51448 -9407 -7152 -4190 6604 -38321 29013 -19878 -17787 -46666 -66205 -20696
20292 -20696 -28097 -3676 -22363 -45596 -16178 52371 33135 55185 79389 72517 61823 110807
20280 110807 46726 10507 49430 106509 71799 59056 45855 -24022 -39479 74164 132086
20269 132086 106603 60809 78806 47452 68143 135500 140138 71478 9167 -14 59762 153478
20257 153478 177610 157585 107387 189935 249390 218010 154558 116263 72674 85747 123387
20246 123387 106200 126463 145245 158740 190911 179765 204158 140781 115774 138339 158165
20235 158165 193487 135067 56619 49508 59277 63178 122007 163958 87550 83566 140305 231806
20223 231806 175770 131295 79751 20152 35869 -7740 41824 105854 132254 247744 193726
20212 193726 215128 175160 126841 56160 111414 95889 134398 142828 106434 73119 55497 112852
20200 112852 140426 58544 1453 38599 83538 150634 156668 87090 110599 124399 127785 96397
20188 96397 79299 145475 92832 127833 152665 163287 167533 136693 174393 146512 85287 35100
20176 35100 77648 117264 247041 254651 141518 130083 206438 171495 189636 219570 196972
20165 196972 157151 179352 205075 224966 207616 203418 248025 202243 129464 150176 177075 270256
20153 270256 208905 206529 135621 138308 167841 221589 207397 189669 176460 140399 139565 79029
20141 79029 107013 152276 164943 118618 84481 75333 83792 103213 162677 218718 176235 236722
20129 236722 236454 248964 231172 250054 210562 88870 27154 85407 207302 288950 230000
20118 230000 223586 246817 163672 149372 218514 285711 321314 321772 239026 200093 218819 228710
20106 228710 179207 169561 249434 307478 323642 280465 241379 141034 146078 170081 198983 230099
20094 230099 193704 193934 195707 118910 168869 261048 293979 236366 175112 113069 155194 171758
20082 171758 125743 124400 107071 191604 296865 319091 264636 222917 166446 130452 128185 189913
20070 189913 272481 294267 268204 284809 344126 421751 479442 446256 405817 487789 461311
20059 461311 396145 414650 392229 353643 338251 247608 250895 373396 410972 442192 414863
20048 414863 446791 439217 420636 414048 417031 326403 325406 377615 434399 433174 414081 375500 249018
20035 249018 249104 227319 265965 301925 355793 299829 233427 337999 315529 304384 301865 334847
20023 334847 385526 421423 417663 428348 397712 409238 438501 472398 417324 351653 384212 392907
20011 392907 377386 412266 516511 415139 421455 506117 530414 504591 432691 391526 385308
20000 385308 397067 421402 492870 512183 567845 541867 421385 391304 399370 487304 503099
19989 503099 497687 586990 603883 520389 490303 524379 530296 608079 613020 624869 603810 635347
19977 635347 664811 660632 662708 652766 622369 590267 607976 558741 608679 579834 523595 615343
19965 615343 668850 741023 788288 833999 850697 937988 960292 940076 956667 998785 1073461
19954 1073461 1078589 1105653 974962 847473 768667 746726 745258 734320 705381 753050 826170
19943 826170 866167 927392 906401 919745 1025425 1024814 965802 930460 798811 799719 815136 899978
19931 899978 993816 963708 899054 848830 939242 1038491 975773 941175 908849 803114 793314
19920 793314 849188 960929 973210 962895 1056641 1082408 1023300 992268 982528 927825 959684
19909 959684 1004286 1017316 1057737 1019577 961567 980958 991032 1000541 915647 898908 919270 998380
19897 998380 998930 1036440 1079242 1143860 1145015 1084971 1114980 1139058 1137114 1177948 1157353 1112678
19885 1112678 1196122 1239143 1242518 1201580 1168414 1212540 1254072 1231592 1256117 1336575 1370357
19874 1370357 1324141 1292807 1311357 1234515 1308990 1345672 1336331 1419737 1456589 1425197 1406576
19863 1406576 1401008 1422789 1497146 1553590 1580646 1599369 1599675 1531204 1507108 1571337 1620469 1669168
19851 1669168 1669065 1659192 1680686 1709032 1706349 1690683 1736972 1837894 1828582 1819972 1872710 1889862
19839 1889862 1993723 2115195 2138213 2182120 2184836 2085708 2176352 2058008 2040711 2206937 2278974
19828 2278974 2236004 2241507 2268585 2332890 2343289 2376893 2354011 2387676 2454156 2496132 2478482
19817 2478482 2554430 2639125 2669298 2730079 2715319 2729933 2704334 2738022 2779346 2725114 2741560
19806 2741560 2825246 2949418 3011853 3111656 3132286 3180068 3204456 3334818 3398955 3408499 3394718
19795 3394718 3446359 3492877 3485223 3459463 3412108 3508057 3598664 3651852 3761668 3874403 3908828
19784 3908828 3962072 3981347 4049471 4097326 4104704 4136293 4093849 4140491 4319112 4432217 4579454
19773 4579454 4620184 4702359 4798306 4963026 4960528 4976467 5024305 5093874 5228450 5420005 5484812
19762 5484812 5580305 5674906 5762636 5847038 6003404 6102089 6231309 6373877 6447061 6589298
19752 6589298 6789827 6976943 7135160 7204481 7233002 7363109 7526555 7673755 7809901 7943910
19742 7943910 8095730 8260256 8396753 8575744 8772291 8923193 9093889 9248012 9388584
19733 9388584 9527286 9663607 9848350 9959748 10126075 10427838 10624040 10803253 10968921
19724 10968921 11212030 11459510 11672290 11881324 12178813 12507294 12804683 12894219 13035671
19715 13035671 13333983 13646538 13923169 14126803 14406254 14676089 14975920 15232263 15445762
19706 15445762 15761653 16120322 16340973 16455496 16673908 16900947 17200821 17528878 17869348
19697 17869348 18196275 18421886 18657757 18943970 19141162 19324129 19616589 19843286 20053561
19688 20053561 20334511 20623634 20822405 20985748 21215320 21416127 21539034 21670099 21846664
19679 21846664 21985439 22025208 22147481 22245009 22439107 22504884 22638886 22696265 22703765 22723544
19669 22723544 22683012 22628711 22578673 22524266 22491839 22484485 22334427 22291989 22237701 22130747 21954173
19658 21954173 21778029 21658810 21546382 21413899 21367089 21272797 21033797 20683282 20380609 20177864
19648 20177864 20025129 19736311 19458988 19183809 18957944 18772226 18516672 18251971 17996467
19639 17996467 17814255 17521366 17247474 17016986 16780504 16459483 16199687 15918669 15582988
19630 15582988 15377221 15058444 14749935 14525922 14324517 14115927 13819896 13640095 13458863
19621 13458863 13272053 13066130 12818366 12583482 12370962 12156297 12003938 11755352 11538330
19612 11538330 11367270 11194618 10874456 10661978 10478317 10294444 9988153 9869080 9792237
19603 9792237 9645497 9389773 9229877 9092831 8825233 8609386 8432745 8294530 8123079
19594 8123079 7918617 7790612 7693400 7620613 7586745 7523501 7444070 7276710 7073141 7028329
19584 7028329 6948001 6828868 6669834 6503443 6376828 6316351 6186513 6070794 5972314 5827691
19574 5827691 5719308 5646186 5532421 5483230 5427541 5321671 5228942 5233405 5088466 4917277
19564 4917277 4810884 4740011 4667821 4609372 4540795 4424180 4452145 4434557 4293785 4136135
19554 4136135 4094569 4060423 4079488 4072476 4051115 3920384 3874697 3821197 3843993 3755502 3659447
19543 3659447 3588105 3507015 3530349 3558963 3570008 3488281 3425608 3354051 3297673 3249792 3095147
19532 3095147 3006737 2948367 2930602 2940987 2898471 2919302 2932010 2908678 2846635 2751047 2740216
19521 2740216 2701272 2669953 2622770 2595153 2578144 2551906 2516400 2446826 2347944 2302074 2284029
19510 2284029 2247463 2252462 2325127 2372184 2378039 2349197 2345259 2295385 2198676 2130558 2124471 2116025
19498 2116025 1972808 1940980 1898455 1911718 1979260 1926152 1858368 1731164 1730924 1803286 1805927
19487 1805927 1782985 1772329 1785051 1729035 1687640 1736925 1743753 1769745 1770003 1769520 1770955 1590129
19475 1590129 1606090 1620307 1561737 1569886 1550340 1555041 1547978 1479567 1397923 1388698 1448178 1473027
19463 1473027 1542004 1565583 1499294 1481542 1389985 1394171 1417403 1398507 1355633 1218368 1216339
19452 1216339 1176001 1207985 1178264 1155172 1156891 1274727 1380492 1329290 1262501 1327554 1320151
19441 1320151 1249199 1238693 1265818 1263559 1199114 1102917 1050260 1086776 1081802 1115228 1137371 1180402
19429 1180402 1120043 982525 896659 856651 820769 883875 979047 962010 964369 1017028 966264
19418 966264 934816 964739 980143 1036287 1056854 1008069 962066 950293 880616 863616 937510
19407 937510 974751 954887 879445 828473 791214 867386 933316 926576 901583 894359 921406 863872
19395 863872 843621 818623 777947 733401 688400 713251 731345 785858 881031 904211 915552
19384 915552 921165 843715 838925 931897 935517 856636 831603 822565 852241 825266 751487 744229
19372 744229 756100 718671 716865 676271 595250 609658 665688 618283 540147 548683 511488 460535
19360 460535 495585 476556 528163 517902 571057 570579 570187 547210 566436 558991 551003 567599 620810
19347 620810 655157 625296 627493 637296 644547 614159 546921 534805 572361 577502 567483 521802
19335 521802 465243 449211 429417 457214 472246 545581 600563 642177 664469 622281 618752 613053
19323 613053 628107 628204 641715 722469 710320 579655 505931 481801 478484 603532 681356 627653
19311 627653 637337 736238 779970 706300 756868 803318 868297 947899 950671 906589 791153 725364
19299 725364 757250 769767 863785 924012 999819 1050334 1011689 1010343 985298 955037 921857 902067
19287 902067 917287 872244 791159 805591 842333 899337 876791 767717 696304 721520 746711
19276 746711 696487 682621 573702 566574 612259 527188 497464 496678 495234 362644 244693 251430
19264 251430 369840 427880 415842 373801 409783 439479 437079 455697 365826 293971 295799 306866
19252 306866 278707 278324 297746 444678 504009 489603 528465 590321 502102 419552 380715 415230
19240 415230 423509 412227 404262 449322 503544 435761 355709 305746 319512 368438 377416 367189
19228 367189 396193 401398 463966 470316 420650 311648 214700 169056 197375 272928 358107 353625
19216 353625 311100 368380 441332 431421 369015 264292 229559 263969 292737 244561 287855
19205 287855 405883 382001 326150 253823 229941 193005 239233 244540 333867 377866 308696
19194 308696 309767 281067 292255 298759 283060 263520 298563 296308 230236 240319 264837 333571
19182 333571 263701 214799 235228 290406 367211 445523 415352 359571 307875 280074 305220
19171 305220 274134 190047 159006 178549 235070 283253 251187 213448 260526 255269 210202 234615
19159 234615 291718 299958 294069 222606 54786 70557 154303 155007 195396 200838 174934 210045
19147 210045 210511 222160 136097 19139 19549 116427 218111 272884 218018 202496 119949 202327
19135 202327 214940 94317 72398 125377 60611 61390 115166 177371 259369 285899 278553 204358
19123 204358 145354 157802 150278 161088 197419 280864 192629 154633 175969 193781 169502 91773
19111 91773 65693 -33674 -42414 3714 -11249 -13864 56213 86808 134506 176962 239364 232320
19099 232320 195734 176888 133145 120365 84186 68668 53023 155018 156749 173689 92660
19088 92660 3685 19438 36226 52566 100410 91290 23800 133374 241134 283465 326075
19077 326075 340114 314189 302438 318564 232176 146074 120632 200098 193960 195380 194203 232682
19065 232682 362490 393467 335002 265585 309458 276244 291592 314985 330071 265734 322412
19054 322412 329721 327754 392134 433845 457790 417369 366571 365141 391357 398557 392289 293561
19042 293561 267697 255226 198104 177436 251553 261346 206706 214269 226487 254602 219515 189429
19030 189429 224647 212110 233169 207933 215481 322362 341055 321741 290063 255343 280262
19019 280262 253958 253013 240137 201881 103039 77985 94220 117286 139503 231508 281097 267648
19007 267648 263164 182255 148757 226157 251306 240628 228229 205947 299446 365440 308403 225811
18995 225811 190407 199614 193576 200472 210661 238299 291201 297785 292610 293044 303875 257206 286148
18982 286148 301179 289228 175525 109935 148881 181849 304148 269562 309265 291244 188964
18971 188964 226104 238209 211060 208435 238034 213228 225860 297616 282231 195506 165307 176919
18959 176919 247861 262455 218110 288688 315874 319916 326921 298154 323508 320547 311330 361420
18947 361420 404287 409710 447117 490422 481276 423632 403701 404091 421381 424755 407876 429093
18935 429093 376171 341361 316331 359885 427451 470430 414849 400365 392885 352450 386923 446969
18923 446969 392405 325376 356887 469904 574421 585765 534961 511416 490502 482325 528999
18912 528999 501595 451535 458137 374142 297919 375933 488148 490030 473252 547571 522180 462600
18900 462600 475181 470307 434012 407074 458919 519473 572655 645376 700253 702159 670360 614330
18888 614330 528687 561817 542643 482750 459493 424498 408724 414261 454083 475351 553194 591836
18876 591836 695684 676969 546229 514203 580949 752289 742068 628090 566714 586876 760577
18865 760577 808954 783203 728158 749245 730110 699812 697846 737683 762148 795703 775358 821976
18853 821976 854151 778096 656906 649769 677765 783121 778483 698359 750649 845486 876221
18842 876221 889522 960765 969793 963452 993279 996834 1119654 1209084 1152505 1209635 1352546 1525491
18830 1525491 1656976 1905593 2069986 2097818 2203682 2293971 2379307 2568108 2736034 2929032
18820 2929032 3194883 3408707 3679853 3993143 4286896 4573713 4920608 5199931 5434334
18811 5434334 5729182 6002693 6297722 6563956 6867289 7291966 7722108 8116677 8508105
18802 8508105 9093291 9733598 10352545 10999532 11745224 12530213 13326071 14082898 14825699
18793 14825699 15608576 16485181 17475764 18632337 20038976 21693329 23718219 26273599
18785 26273599 29538081 33617100 38404635 43622174 48922790 54100187 58546958 61809986
18777 61809986 63635280 64005192 63201357 62100892 61587868 62443371 65591526 71213411 78483314
18768 78483314 86420224 93918507 99853302 102966547 102622228 98880480 92177067 83882391
18760 83882391 75672720 68675248 64254991 62563588 62798866 64103968 65703146 66737564
18752 66737564 66531574 64675568 61133174 55968139 49966983 43802614 38003727 33293003
18744 33293003 29721907 26897035 24765869 23186372 21891780 20817422 19891317 19156857
18736 19156857 18387929 17632162 16849604 16001198 15214890 14420245 13653999 12840986 12122665
18727 12122665 11617864 11179750 10753034 10291563 9841496 9419730 9028902 8605814 8134594
18718 8134594 7719536 7257723 6772583 6369808 6106462 5786621 5537576 5252047 4935783
18709 4935783 4706429 4473118 4186322 3928148 3706052 3482850 3277609 3163623 3083736 2924654
18699 2924654 2702224 2645590 2516170 2335462 2201116 2179782 2205320 2119651 2042348 1918873
18689 1918873 1781034 1688329 1591281 1537524 1515506 1434256 1356574 1204354 1116423 1146847 1189945
18678 1189945 1169531 1079119 1105866 1120086 1180979 1186989 1201819 1116827 1026686 901879 823613
18667 823613 889927 947365 983111 991270 954330 946114 870405 867495 974667 1026334 1103442 1122222
18655 1122222 1120708 1058588 986134 912790 887719 918233 813479 782595 705953 579065 537567
18644 537567 531107 530888 502004 544014 625078 586036 519708 481859 520203 496945 475282 468733
18632 468733 458790 513354 595814 584340 544866 613920 592305 521356 475989 412597 394955 439894
18620 439894 403757 337352 359170 329329 330574 444435 428228 462636 517492 547001 497365
18609 497365 545726 623736 635235 577183 573752 689757 768523 801927 713606 648022 616472
18598 616472 621381 571217 525139 511530 483430 526274 536439 492142 501728 511890 517109 510240
18586 510240 525925 567258 580466 596026 643846 759370 769962 593343 604821 606551 611049
18575 611049 603568 620348 621961 679180 653878 619864 557717 545951 657683 691805 709805 694091
18563 694091 727290 684318 609388 590802 651066 634632 701907 731491 624025 599255 588265
18552 588265 556716 457404 424455 415380 322158 311281 292090 315042 361293 328477 393826 365827
18540 365827 344161 434637 481953 588731 683685 791724 810818 823699 840020 889517 798457
18529 798457 645886 605356 548986 548338 524139 520739 538886 524127 557994 560199 524924 488197
18517 488197 533315 632173 567618 502821 471903 454596 483374 484952 491632 464296 482083 444443
18505 444443 486872 567849 628122 579237 554346 537446 509654 497996 534730 550739 480809
18494 480809 556503 631633 698468 768222 834944 927049 985804 958951 842400 816672 896773
18483 896773 888322 781707 783301 846703 968595 992778 992026 1086969 1151279 1165592 1121711 1002937
18471 1002937 798580 654362 582732 533641 563074 727147 798548 788595 733338 671298 685626
18460 685626 745331 687708 647147 652759 716819 683301 630256 681539 795604 802244 856940 823543
18448 823543 800903 913714 879134 929675 1034121 1046099 1066138 1113407 1158433 1166813 1153007
18437 1153007 1072225 1033946 1101919 1173642 1121099 1085981 1002830 924303 903930 897445 877861
18426 877861 883298 892047 911927 1012264 1038137 1044569 992056 1071833 1151263 1211839 1236851 1346125
18414 1346125 1380854 1460929 1557891 1506697 1456421 1571939 1770393 2017278 2132767 2311587
18404 2311587 2472917 2517549 2526808 2682080 2812256 2964806 3095832 3316179 3485083 3646085
18394 3646085 3790586 3899450 4159394 4398242 4625474 4864196 5243156 5534492 5699159
18385 5699159 5987080 6421447 6799036 7115149 7439198 7809820 8270829 8902349 9661927
18376 9661927 10482409 11388718 12514466 13946674 15810805 18244067 21123711 23852993
18368 23852993 26261584 28355622 30278958 31911953 33088748 33914482 34444524 35046812
18360 35046812 35859288 36828372 37889685 38449607 38244757 37392753 36387375 35852319 35534440
18351 35534440 35147487 34597373 33886223 33298852 32840105 32292885 31472803 29938457 27683246
18342 27683246 24996057 22596295 20792025 19593351 18850778 18363565 18106042 18068954 18059431
18333 18059431 18146858 18424225 18687631 18985147 19383742 19942429 20635516 21467254 22498573
18324 22498573 23801744 25409098 27499495 30290674 33929573 38315873 42865205 46914719
18316 46914719 50266763 53133742 55413533 56968734 57864555 58265299 58647553 59486937 60780240
18307 60780240 62207018 63241190 63334645 62115916 60345441 59124722 58284237 57243325
18299 57243325 55699309 53747481 51887696 50317899 48768283 46942301 44208503 40148051
18291 40148051 35209683 30287509 26252303 23300150 21070658 19419972 18078325 16965063
18283 16965063 16029034 15271034 14627563 13993539 13402584 12847761 12360630 11840786 11406609
18274 11406609 10940555 10488043 10116971 9736381 9440373 9199820 8940397 8645567 8301827
18265 8301827 7984141 7650506 7288877 6862806 6491626 6188151 5863653 5583056 5318352
18256 5318352 5065967 4852439 4686074 4602401 4463054 4337665 4200368 4085206 4026420 4028546
18246 4028546 4013842 4041909 4027788 4003009 3979387 4035141 4165393 4307287 4387126 4542469 4756419
18235 4756419 4858316 4934142 5044067 5031768 5012189 4935040 4910463 4928572 5079026 5170143 5229551
18224 5229551 5343576 5353624 5341913 5414181 5520839 5596218 5758676 5879931 5989677 6137975
18214 6137975 6408884 6706701 7045438 7476664 7915996 8271552 8712437 9119102 9445237
18205 9445237 9882877 10532439 11362232 12474729 13854795 15693516 18186600 21536689 25955282
18196 25955282 31318100 37038163 42397549 47101449 50576836 51633568 49959855 46206518
18188 46206518 41095752 35040032 29028916 24304941 20993068 18740851 17192671 16107047
18180 16107047 15323749 14754249 14255044 13807008 13639077 13574984 13362708 13115177 13000058
18171 13000058 12940071 12917152 12844534 12964026 13211171 13592156 14087326 14689364 15397722 16142475
18161 16142475 16886723 17625236 18434610 19186137 19897481 20591588 21461682 22344522 23468839
18152 23468839 25116409 27432724 30331005 34104307 39253842 46228554 55343772 65703695
18144 65703695 75994162 85279544 92635884 96619961 95705374 90214273 81406840 70406970
18136 70406970 58668537 48580075 41119631 35841732 32180262 29631046 27780401 26431335
18128 26431335 25478509 24801805 24473377 24410941 24532017 24609305 24648786 24623080 24683897 24967563
18118 24967563 25707523 26922961 28566132 30715603 33484548 37033668 42208655 49869060
18110 49869060 61018252 73990875 82188237 83406130 84922299 89216385 85161838 68967508
18102 68967508 53961779 44671587 39466162 36778796 35816402 36354227 38241328 41498403
18094 41498403 45538440 49666827 53445979 56300735 57421901 55983359 52508772 47411792
18086 47411792 41235749 34791028 29120326 24999818 22178950 20158063 18622425 17511890
18078 17511890 16654998 15924788 15131727 14245194 13426985 12662415 11913637 11284691 10720733
18069 10720733 10244477 9836367 9497616 9137261 8823336 8645400 8489739 8406536 8328099 8169928
18059 8169928 7881444 7529516 7224474 6932693 6589450 6219891 5884847 5527054 5190513
18050 5190513 4853308 4654608 4501859 4203347 4010174 3782406 3615374 3477546 3343429
18041 3343429 3229992 3137723 3003708 2919273 2805743 2644876 2547379 2559961 2487161 2466977
18031 2466977 2402230 2331713 2349430 2342089 2376167 2428636 2401257 2383320 2445268 2420656 2405674
18020 2405674 2461977 2540174 2580365 2656286 2771368 2922643 3028498 3111668 3234297 3382247
18010 3382247 3522191 3676377 3868721 4016457 4102990 4274384 4501693 4636074 4900472 5179964
18000 5179964 5489182 5657187 5802003 5984220 6263903 6599576 6920283 7233587 7601766
17991 7601766 7990236 8447690 8928192 9382460 9935733 10469528 11040032 11571793 12170203
17982 12170203 12868470 13626246 14462499 15528073 16858317 18286914 19946455 21983018
17974 21983018 24634990 28111939 32822926 38236889 43050305 46321349 49146588 52505329
17966 52505329 55080729 55521268 55682264 56761821 57848778 59043670 61843993 65093315
17958 65093315 65686942 63363985 60497536 59102898 58956434 57731571 55242724 53483614
17950 53483614 52389826 50696196 49132755 48121009 45778387 40605851 34734579 30264855
17942 30264855 27182305 25089086 23641374 22578337 21730702 21049942 20677980 20284979 19976582
17933 19976582 19771754 19660226 19653884 19739404 19941461 20230486 20661775 21168460 21965245 23143920
17923 23143920 24773048 27068508 30048667 32919899 34848641 36225940 37871116 39366055
17915 39366055 39481826 38936052 38911089 39100023 39418588 40602409 42506159 43356085 42124491
17906 42124491 40119661 38880313 38435462 37576789 35894018 34386319 33256100 31875916
17898 31875916 30599410 29702452 28277885 25178260 21281035 18083570 15849930 14261418
17890 14261418 13175077 12274299 11439316 10844106 10350352 9902385 9517716 9095920 8757449
17881 8757449 8440207 8087928 7729572 7438154 7151372 6882983 6495412 6150988 5924985
17872 5924985 5788905 5514573 5198707 5004274 4776044 4498863 4226765 4057802 3897902
17863 3897902 3629816 3427017 3236222 3038841 2884057 2780256 2702416 2585642 2513340 2510685
17853 2510685 2446448 2257434 2123146 2070022 1969661 1836112 1835388 1798339 1758609 1733366 1650162
17842 1650162 1677679 1696413 1713704 1708030 1629995 1652024 1680137 1669451 1679231 1647258 1607872 1545630
17830 1545630 1457414 1496895 1432045 1336652 1347018 1382598 1287949 1165517 1123769 1122208 1030536
17819 1030536 870357 867953 786600 711329 720288 669712 617719 598641 600378 582924 546766 591048
17807 591048 598783 595354 619471 713362 760609 721526 716693 782560 858141 938891 832287 799933
17795 799933 764556 769122 795122 681571 728841 738646 758743 809401 851848 948092 1054085
17784 1054085 1076751 1018333 1029689 1064702 1045454 1070311 1048063 1118718 1017534 973991 997161
17773 997161 992059 908151 858667 860332 845169 834955 828281 898648 885083 768688 699738 638440
17761 638440 597814 600269 661118 642448 611273 631559 646812 626524 628954 666044 665762 626540
17749 626540 538904 519066 563647 602076 692169 675857 599270 559809 638565 682342 622435
17738 622435 524387 477534 468181 507665 489214 489884 469605 451379 451684 435234 460671 485874
17726 485874 455910 369742 314719 322235 389767 482537 489665 502722 492109 444470 482632 519089
17714 519089 550424 542432 477560 444032 493814 547301 412079 308670 325615 368194 461924
17703 461924 450227 421032 421423 395042 391193 376309 417761 453234 434054 427621 428297 385105 255986
17690 255986 243152 248787 224243 183274 286621 304838 288139 275487 293656 285415 284359 272570
17678 272570 242822 289026 303003 349184 310859 313592 320394 364804 458552 491501 462154 354603
17666 354603 319120 323204 262326 191187 221762 280241 232997 178810 231336 262706 280720 240574
17654 240574 174321 122397 93260 64010 78116 101069 167036 226311 253065 250385 171473 198056
17642 198056 240966 173464 114940 218669 272827 262884 242233 243051 253114 267262 254460 162262
17630 162262 173663 242995 344859 384814 318540 353690 395465 440325 535628 619665 671707
17619 671707 608657 512423 434310 375406 327184 269659 161719 79486 157200 209609 254346
17608 254346 239389 180036 187048 179986 140537 150017 117727 68137 43198 65211 124379 101905
17596 101905 131374 240260 182685 116761 151682 152879 77290 68237 130444 153373 168680 214685
17584 214685 198245 175926 109278 88450 39107 40564 20462 16356 49401 179877 318634
17573 318634 298869 378377 340267 318631 262791 74129 62900 134026 198258 165011 171400
17562 171400 187368 152600 168256 185317 187908 205637 130413 173564 210741 195165 173569 117640
17550 117640 105305 123619 161363 155876 124977 142165 182119 143395 111700 106420 178213 187428
17538 187428 222418 250816 222915 65083 46636 111264 216690 248676 229341 211408 157362
17527 157362 171603 202991 118593 147161 132781 88864 104719 48162 79271 178176 147676
17516 147676 112131 147050 90279 3801 -23056 56323 106740 75419 27485 60150 83804
17505 83804 87901 81659 111040 111430 108479 39366 22096 108979 161759 186533 183021 106247 43928
17492 43928 25929 154649 194062 183383 174400 115914 101600 102768 41669 96456 93472 78018
17480 78018 102715 81643 129304 236528 259309 159683 127446 113264 86787 52840 42599
17469 42599 47539 -10299 -41532 89336 122913 143802 164559 144934 138233 135157 202390 142310
17457 142310 106340 122044 169472 192087 206701 267786 269453 335802 342573 372341 438456 464116
17445 464116 456539 430715 480086 556554 632906 679799 780066 814515 701976 596936 532302
17434 532302 383766 392343 433064 423398 408418 363600 373126 440606 473300 417930 499886 590502
17422 590502 417949 375773 341101 280401 306921 344422 409082 387763 291017 248480 286146
17411 286146 328146 329224 307047 244899 218615 244567 270697 264452 244529 263327 288796 268459
17399 268459 136373 15914 34698 105922 231539 263134 297782 294873 247517 162975 197944
17388 197944 248255 310246 333294 340643 291748 209529 278295 375402 399212 292198 224208
17377 224208 210251 200216 217488 338387 424755 357122 207881 109374 222448 311028 410710
17366 410710 341457 228739 207367 191308 120664 138676 158986 148306 244836 241884 232986 139321
17354 139321 99028 183399 221714 120263 150908 194873 208852 227285 153374 101903 92453
17343 92453 45826 146040 232060 243199 230762 153042 91327 3286 20993 52697 134546
17332 134546 65537 -92617 -100240 -42690 6453 31448 59253 102965 161035 180206 186052 225618
17320 225618 189588 105800 81728 27491 -7696 23868 38753 65850 118683 92634 65731
17309 65731 9287 12196 15818 -27719 29704 112786 175296 141325 14169 -48725 -20024 11805
17297 11805 -10271 -25422 52825 96679 18805 25894 29870 -63724 -33220 3083 115839 154355
17285 154355 80009 -33329 1135 7523 24572 30239 -469 43279 21594 3342 71920 45496
17273 45496 25845 -2818 -37964 -32770 51764 42094 -20494 50424 117962 70746 37996 56630
17261 56630 133261 137867 100564 49617 37143 6372 53388 70951 92454 137701 136560 61225
17249 61225 51539 88404 101599 91071 110329 42110 -19276 26796 -946 -14906 -695 -13357
17237 -13357 -32935 -49090 -11073 42742 -37100 -124756 -69076 -13129 -60482 -111132 -124255 -96497
17225 -96497 -87551 -47595 -4867 67306 22493 -7762 56741 155775 164288 78591 -11638 61370
17213 61370 194760 116125 5839 -51008 41295 -12580 -76137 -71967 -59254 -19400 34276
17202 34276 -5202 -19309 -2719 -6146 24296 21770 15223 -12697 -80544 -111647 -31056 21361
17190 21361 12861 46221 87022 47272 22812 -9647 -45599 13952 103253 31770 3210 -59736
17178 -59736 -42890 7575 -34726 -48733 824 15730 25568 72805 86906 48790 56349 59800
17166 59800 47898 83970 93897 35109 -23989 24464 46362 -5387 -30753 20499 16048 28916
17154 28916 7529 62819 61829 153446 216247 174810 123463 118535 151996 92541 50182 67710
17142 67710 65223 62540 69612 72855 67114 52141 64396 88438 40201 95355 155432 167322 159938
17129 159938 124334 84135 15920 -31509 5681 68304 42320 -32597 -36351 -5852 -2299 -23300
17117 -23300 -99511 -118868 -110605 -97087 -13403 71228 95873 99441 74157 61709 98420 94243
17105 94243 -27079 -85094 -67944 77838 148114 138353 113967 59408 -1504 -59732 -128208
17094 -128208 -129007 -95405 -78463 -92714 -104850 -128313 -108786 -50538 -23221 -84467 -118183 -69225
17082 -69225 -63920 -85823 -41092 3029 61343 45252 -34067 -17585 98704 153714 121853 74426
17070 74426 -3263 58494 114520 86030 75928 53311 -23448 -17827 24476 5981 -19981 -31258
17058 -31258 -83962 -83013 18836 30054 -89310 -114874 -89945 -51639 -4047 -40623 10036 -79910
17046 -79910 -78155 47650 125990 64479 35978 66435 24686 26073 28407 76572 106158 45757
17034 45757 71153 101349 204843 163105 57700 46236 42428 137385 122802 53609 15225
17023 15225 3130 75926 150812 192861 117104 167272 181286 213800 239364 179018 207755 218601
17011 218601 272681 281407 232987 197200 193636 252281 245045 178399 138083 123301 147005 132964
16999 132964 110600 7375 22342 86727 157872 154601 64273 110052 190667 153526 107873
16988 107873 91827 155753 167362 86178 57131 86272 139696 105380 20189 12344 -19385 44681
16976 44681 99892 50568 112199 95766 28948 -47654 -16117 31328 -4909 25409 24842 -1252
16964 -1252 39600 45366 62410 23684 48187 36922 6356 -23609 -32387 12409 26319 -28672
16952 -28672 -51163 31016 66313 50965 23956 18694 -24059 -83484 -74258 -31720 -60106 -50833
16940 -50833 25593 -69358 -135319 -132715 -144365 -62057 -28545 6470 56254 95272 131571 76752
16928 76752 83909 85083 49013 2754 38358 112380 72185 116530 108416 154637 159958 162719 171525
16915 171525 87011 4179 -61943 -109499 -134570 -109260 -47378 -20704 -37055 -34066 -52165 11982
16903 11982 35015 -34609 -83468 -2380 -10026 -36422 22522 37074 14681 -35121 -56196 40618
16891 40618 103197 12148 -67454 -16702 131712 100783 33775 21038 24004 -13047 -18307 1773
16879 1773 -27728 -25552 -10420 -28079 -18880 -19527 34212 137001 144919 167488 106371 88185 166033
16866 166033 139574 113428 98796 92303 83122 44381 15263 -7412 -111115 -89440 -45438 20604
16854 20604 97047 115868 86900 45515 98086 130851 137128 106015 11097 -46391 -35281 -26541
16842 -26541 -53763 -49604 -44063 -39251 -64508 -64831 -133578 -145980 -57416 -59147 -98806 -135410 -65946
16829 -65946 28703 74768 86783 86429 -10911 -63094 -73967 -49419 7849 71270 141043 57870
16817 57870 -77391 -113933 -71720 444 14736 -19569 -17486 -35407 -62071 -36865 85316
16806 85316 108172 14568 -8744 13808 -22225 -40503 -12860 -72673 -13166 98555 219229
16795 219229 194823 90151 103020 96997 99320 65589 16033 -43009 -83480 -71404 53987
16784 53987 81999 100711 141834 84623 -4018 -19123 67622 85939 57269 6837 -25090 -16047
16772 -16047 1085 31035 -50866 -54261 -34212 -44110 -60676 -79910 22208 78489 92324 59176
16760 59176 44278 50767 -1549 43314 47671 -23637 11889 71570 7625 -75311 -69940 -78927
16748 -78927 -138041 -109959 -105480 -10047 -57863 -143634 -138039 -57929 -28656 7589 -43773 -11718
16736 -11718 8918 19770 33659 125869 37100 -64254 -111502 -48244 69394 36802 4111
16725 4111 11973 27690 14559 49882 126374 79947 20696 3059 -34699 -55714 -44932 -75303
16713 -75303 -130872 -97450 -47160 -20797 6876 2619 29010 52288 11747 44047 61536 85385
16701 85385 10525 32432 41419 36050 30516 -5720 11692 1417 32226 68259 50636 37317
16689 37317 63699 84027 104217 97829 129452 71554 60484 34129 56168 25418 70616 36084
16677 36084 39971 -25104 -23394 60184 56851 42854 60961 55939 11491 -20685 -33035 -21477
16665 -21477 -53042 -60449 10344 -35781 -78376 -19477 -61843 -29969 -23832 -86966 -61215 -113671
16653 -113671 -143478 -89845 -24770 -52191 -47224 6330 -49317 -33816 862 -82242 -147736 -119404
16641 -119404 -77218 -35345 -38873 -65039 -104270 -140179 -95619 -117533 -25924 -24952 8276 28698
16629 28698 12986 -43178 -20257 14153 14015 -35904 -61450 -57979 -58181 -95023 -83533 -48499 -121490
16616 -121490 -65143 -10947 -8244 50877 79435 57839 -18835 -16132 -54014 -99803 -105904 -161112
16604 -161112 -229498 -237972 -158284 -112512 -123791 -133208 -178107 -92410 -81419 -133114 -143230 -118879
16592 -118879 -123795 -134879 -120319 -61576 -98189 -160214 -140017 -180727 -193820 -244084 -202066 -162516
16580 -162516 -94013 34997 94408 43861 -16257 19471 -11641 -53386 -112749 -113984 -82968
16569 -82968 15966 40800 -41849 -126665 -165172 -132324 -80797 -90348 -110895 -140546 -118848 -94926
16557 -94926 -31570 36669 61205 58401 57632 38341 53705 142465 137098 -15997 -133665 -125740
16545 -125740 -80195 -88522 -134877 -36943 -11354 -77513 -129681 -78159 -2616 26754 66235 12057
16533 12057 27102 11411 -69111 -78762 -32800 -18060 -2011 -27654 991 -39079 -74803 -55912
16521 -55912 -45318 -32849 -40056 3704 2576 17775 21845 -41026 -58513 -58983 -53295 -29126 -16004
16508 -16004 -65323 -87708 -116608 -145604 -92318 -50680 48517 152843 163861 69805 72746 88594
16496 88594 27211 23069 50458 -25649 -37785 -31149 -32908 1165 19228 -90944 -187020 -223329
16484 -223329 -167507 -52602 16899 89334 134265 181607 149097 104525 37959 29063 22400 51658
16472 51658 -1098 -85887 -25192 62525 45146 -69530 -76331 -30187 -38793 69792 70571 -8585
16460 -8585 -23339 7616 17148 5494 79581 83799 94572 -12712 -51214 5685 79445 57425
16448 57425 -22239 -143964 -130869 -69962 4779 90865 56445 -52779 9424 87799 56467
16437 56467 18001 34506 71238 113992 121887 192906 216203 169606 77193 24560 27579 9804
16425 9804 -23817 -54307 -48473 -114278 -94953 -20417 -40803 -86997 -96177 -111880 -55179 -39329
16413 -39329 -25414 -85203 -132618 -87360 -49654 -17015 -51099 -4418 86015 130743 40985 -37717
16401 -37717 -65794 -29514 -26311 -28451 -26701 -4737 88970 66595 -3101 -58927 -100994 -112688
16389 -112688 -71691 -49927 20068 40166 -58500 -70102 -3593 5860 -32111 -73220 -31310 -56220
16377 -56220 -51401 -8433 45647 95134 32577 -37089 -78232 -63324 12593 16045 -76717 -143768
16365 -143768 -86903 25186 98128 74382 44298 -35849 -34944 -137759 -166176 -95254 -38398
16354 -38398 -18652 -40088 -46573 -17794 33820 46209 42481 11533 -67754 -101425 -89187 -68075
16342 -68075 -101539 -26282 -39484 -28470 6086 1045 -33322 -19387 12642 59885 1176 -1103
16330 -1103 14294 -21454 57580 -58993 -79667 15490 77637 174853 173235 174257 145022 134159
16318 134159 105876 75457 68797 104401 68485 54567 -4331 -9116 -1515 102983 143157 71363
16306 71363 62511 30104 35224 57181 -57172 -218819 -113495 -29152 69453 59823 57808 94751
16294 94751 78648 -38748 -39692 -21163 26896 93553 34258 34728 55960 66871 -15999 -94103
16282 -94103 -139570 -116536 -57284 -102225 -116861 -193177 -160652 -43404 -35085 -107002 -139596 10016
16270 10016 64038 39117 -4449 -80160 -156883 -203101 -83682 -29956 -48562 -36920 51986
16259 51986 82438 118569 47336 -36839 -77467 -36598 -100405 -115771 -53372 -44265 -66871 -142762
16247 -142762 -131566 -29771 -6885 7293 -30217 -2840 51432 89819 64306 98212 151887
16236 151887 140603 112809 131154 129025 105592 51837 21843 -26356 5746 -63405 -177510
16225 -177510 -182572 -82679 -202561 -233587 -129859 -106118 -48875 -108413 -106445 -140814 -150701 -83853
16213 -83853 -86 59639 25111 -11688 3815 87219 59303 54551 113924 184535 170064 154518
16201 154518 158109 108514 28219 4976 38185 78311 61164 85003 188880 244547 139739
16190 139739 118294 100103 -6244 -9683 42317 145452 117539 -18096 -53023 -62305 -134591
16179 -134591 -73870 25983 31336 47633 110612 120274 75801 44722 62409 12511 -85314 -130053
16167 -130053 -71480 -43667 -48674 -37830 -62379 -102233 -2340 -66544 -15256 35352 38146 -38096
16155 -38096 -24313 13645 52224 58597 -64898 -141166 -169354 -53548 -76120 -129113 -67102
16144 -67102 -41702 -56229 -99370 -59353 31476 -41200 -69498 -86257 -38359 32870 -23213 -48225
16132 -48225 -22618 -44691 -9486 -51987 -33542 -44506 -123924 -102400 -41575 -65788 -43289 -36200
16120 -36200 41448 41768 38508 8262 31360 104021 90831 9676 -7020 -6171 -44132 -21873 30198
16107 30198 -27449 -95955 -105583 -65998 41730 27736 -11507 38940 37210 -32659 -400 -37519
16095 -37519 -72943 10589 42569 -25091 -52164 20270 88187 37835 14645 12745 -4102 -26532
16083 -26532 -74257 -48582 -55705 -9077 -22620 -132792 -182027 -157295 -124234 -67354 -77215 -186786
16071 -186786 -193958 -67208 10908 17545 86436 113881 137102 132641 36435 -28572 -5247 -57819
16059 -57819 -96101 -81533 -40450 16789 -40851 -19702 62241 11533 -2363 -1565 -89137 -132377
16047 -132377 -128074 -70314 2008 46552 57149 72517 -16934 -90937 -195413 -188925 -99785 -181660
16035 -181660 -256948 -285560 -229419 -236108 -246704 -198701 -195163 -142320 -112631 -107720 -28244 66608
16023 66608 84902 35260 -59840 -105498 -80158 -62327 -46904 -48100 -53545 -61751 -97803 -59195
16011 -59195 -87702 -118376 -175739 -138595 -76805 -101020 -127222 -91626 -93156 -170150 -123823 -55429
15999 -55429 -72631 -37960 36113 67289 39907 98879 155113 147586 112751 114808 70630 7610
15987 7610 -54392 -75421 -73935 -43959 -46806 -46075 3103 -79714 -105660 -30176 -64562 -77807 -100996
15974 -100996 -58839 -3467 18285 -13892 -70060 -68599 -59535 -81626 -1539 41031 1384 12251
15962 12251 -65404 -211431 -181357 -142680 -85630 -159579 -191249 -139219 -102803 -145794 -86054
15951 -86054 -65742 -73801 -82895 -91082 -112305 -107790 -78352 -13781 -15418 -6256 17771 11412 -1206
15938 -1206 -3698 -31500 3297 -17764 -65979 -46233 -3376 -8499 -10095 -5107 4435 2356 -77657
15925 -77657 -78476 -37021 29475 -26760 -77095 -52903 30181 5201 33795 170195 147115 115877
15913 115877 75898 30388 -84602 -38372 28289 -33573 -28784 -3331 24784 -2793 25575
15902 25575 48185 45540 39150 -85240 -116635 -74762 -60874 -75268 -83386 -92711 -91898 -136551 -122772
15889 -122772 -144497 -122358 -115251 -66262 -113683 -90261 -37922 -23976 -28341 21078 24677 15798
15877 15798 -40842 -47563 -72203 28669 54878 -3736 -37651 -7066 -11697 -36545 -76507 -101484
15865 -101484 -132775 -104829 -89945 -105622 -82388 -29073 76547 127983 -25962 -72612 -78159
15854 -78159 -117310 -66227 -52161 -25594 -18792 -11400 -5274 -27974 -73162 -85901 -120152 -75347
15842 -75347 -15579 -56026 -20894 22883 -26442 -29401 50993 127712 144936 -5085 -140898
15831 -140898 -88451 -32827 -3021 56991 71111 76046 64428 2449 -27510 -20008 -88155 -124170
15819 -124170 -128799 -129158 -175680 -208027 -175892 -92951 -75690 -37213 -73148 -91123 -53791 -29207
15807 -29207 33164 -44759 -75102 -87745 -92843 -63431 -49966 570 -22974 63712 62737 467
15795 467 25828 25401 -32470 -57317 -13697 -32207 -13797 8224 2831 -50427 2875 19187 73371
15782 73371 121987 88402 59747 -21044 -12243 -9486 51425 97179 100477 -8363 18334 94964
15770 94964 105266 96754 65206 53123 53079 -20519 -60074 -47694 -21873 -107728 -129343 -145749
15758 -145749 -107683 -125718 -124430 -100090 -15925 55664 38265 -27298 4168 76715 3182 -18733
15746 -18733 19436 32751 40116 79009 72004 52024 11889 1369 -28286 -4091 23149 102399
15734 102399 136911 79588 65385 -3174 29341 133891 63859 -54262 -79167 -62132 -14471
15723 -14471 -16665 -150275 -199423 -128848 -17068 -34706 -77406 -21559 -49003 -39791 -50515 -25308
15711 -25308 -76312 -40852 -52923 -113727 -83597 -64181 -68860 -60780 -26571 2070 13093 -11545
15699 -11545 13003 25191 41527 62619 12382 -88694 -102041 -106653 -106099 -129822 -145349 1910
15687 1910 -58769 -70546 -76559 -97318 -146661 -176715 -143091 -103047 -95857 -113014 -107262 -119662
15675 -119662 -96532 -97567 -66170 -42210 66475 95387 35931 28994 79194 9210 -23170 -11609
15663 -11609 14941 54470 18259 -16431 -70915 -145693 -70481 -90192 -142648 -84099 -40107 27003
15651 27003 17281 44841 103871 75132 67231 9422 42692 85204 62134 -9022 -50975 11612
15639 11612 21555 -3112 17679 34022 21423 50523 114137 98627 24121 -71590 -67519 -46433
15627 -46433 38841 50052 28598 97437 109737 48007 53781 18717 -15103 37670 -10431 -61198
15615 -61198 -44568 -31648 42842 30385 -30335 -42330 -44724 -61660 -62816 -48216 -67042 -134324
15603 -134324 -139554 -45623 12317 -26102 -66321 -95637 -51717 -28493 86843 95051 107704 76769
15591 76769 45531 15058 12071 -96177 -177771 -118202 -34957 -69945 -74646 -149162 -152056 -134169
15579 -134169 -135012 -131981 -89816 -49158 -93810 -66940 23824 28578 -37264 59537 49375 -14733
15567 -14733 17384 47816 46007 46465 3014 -10249 16802 61055 5861 -38501 6071 -54705
15555 -54705 -130409 -147636 -121681 -48961 -11546 -49569 -48786 -75260 -61481 -122743 -118643 -102249
15543 -102249 -152093 -138607 -72618 -7226 13022 40568 42097 -54676 -10712 20076 -5549 -46194
15531 -46194 9627 -35914 -73650 38242 58625 -27741 -9701 22426 -38273 -127380 -145192
15520 -145192 -98699 -46692 -36250 -11271 30 -16477 -27296 -57317 -90177 -12797 89193
15509 89193 129164 119342 59394 -15655 -57979 702 -12577 -20153 52575 114664 95229 16464
15497 16464 -28486 -60234 -12012 -48669 -90444 -57322 -71957 1150 36022 84253 68783 16342
15485 16342 -4343 14293 -15852 -58828 -59493 -5472 52032 60830 21490 -120967 -188235 -186178
15473 -186178 -89437 -168002 -250163 -207238 -215372 -166111 -24429 -5560 8801 -24714 -9235
15462 -9235 -76300 -213255 -265842 -246351 -157635 -111317 -37361 1361 63296 28349 -10292 -21008
15450 -21008 -55044 -106664 -116461 -60818 -24626 -22718 1309 10289 15198 4089 23391 -32442
15438 -32442 -116052 -162805 -189686 -222282 -270594 -238936 -201714 -128686 -43052 -33138 -80969 -44631
15426 -44631 59572 37768 -53611 -49118 -67376 -55642 -90937 -17883 50301 3614 12073 6208
15414 6208 -59677 -123026 -175313 -97121 11912 55084 45071 -29440 -114301 -79495 -7684 -63662
15402 -63662 -134438 -144757 -60373 4791 -30008 -50479 26860 79358 145151 161387 77267 45942
15390 45942 6839 20350 38078 47684 -2335 -111945 -153676 -72341 -59794 -40139 -25903 -55191
15378 -55191 -60077 -23024 62283 93119 122076 95745 -6399 -5923 63425 113070 90767 50998
15366 50998 39762 2789 -63300 -29311 46233 -32306 -26590 20352 12160 42281 59927 4057
15354 4057 -76574 -92781 -58116 -49503 -101117 -83693 -26216 -22037 46679 51482 82104 74669 66018
15341 66018 46645 1978 28433 -19149 -126787 -145654 -18219 -25204 -17741 -97034 -123750 -70845
15329 -70845 -88095 -54930 -33233 -12578 -15005 -46854 -20360 -76608 -159128 -180613 -247121 -239106
15317 -239106 -130213 -509 70819 67878 26819 -26048 19055 123177 72399 21913 -220
15306 -220 -17 -12645 -15645 -27785 -66683 -48035 -35343 -68735 -68226 -83739 -51281 66115 65480
15293 65480 58658 96681 27849 13373 82199 74044 91895 53471 -22757 -31512 3751 -89777
15281 -89777 -153150 -82037 32417 30711 8414 -51941 -59072 -3099 80070 138838 72890 6082
15269 6082 -54634 -85115 -66639 -88936 -127760 -137452 -172330 -167317 -89863 -104532 -191262 -210382
15257 -210382 -134350 -61590 17465 23824 10230 16090 -8951 11110 62807 31111 -10051 1458
15245 1458 -20704 -61041 -4768 37373 -27160 -67135 -42748 -52993 -71109 6752 51970 29162
15233 29162 5455 115007 97993 112915 83623 36914 108683 116875 172374 101458 -35851
15222 -35851 -28546 -7804 -25730 480 64647 123971 148433 151411 123097 46973 15053 -7395
15210 -7395 24036 43035 -25757 -88286 -95808 -64961 -114747 -135886 -208464 -156526 -207082 -223217
15198 -223217 -151413 -86821 -83793 -116694 -77828 -26987 -25005 1202 -42981 -14803 -966 -78402
15186 -78402 -44537 -40308 -29680 45946 47797 36617 64310 28701 107143 159354 86140 -62594
15174 -62594 -97682 -102701 -44632 -8841 -5350 -15414 12579 72423 40876 23794 38795 44930
15162 44930 1338 -83682 -170506 -200473 -171598 -109756 -23313 38226 28866 -22036 -16395 12509
15150 12509 -71398 -76906 -11628 -62122 -6733 78018 32647 60857 -14551 -126660 -72565 -118703
15138 -118703 -103060 -64699 -52515 -122269 -116249 -62633 -46356 -120756 -97900 -68427 -129487 -107355
15126 -107355 -145837 -112315 -42139 -84474 -31937 32849 -1078 -37110 -65688 13515 121849
15115 121849 79519 38033 52615 32069 -46822 -68625 27116 20716 -33329 -113859 -84030 -40314
15103 -40314 -28991 -25233 13018 -46023 -113828 -113625 -145921 -165661 -203780 -163894 -114971 -81531
15091 -81531 -41718 -32642 -9784 -31227 -66989 -79750 -72431 -79041 -111172 -116172 -156214 -171312
15079 -171312 -128633 -35745 28081 31653 -4472 -49657 -136214 -78017 119365 147216 97829
15068 97829 24588 -6902 33419 16897 -32693 -45896 -124121 -121927 -120114 -28233 17055 -24126
15056 -24126 -89895 -87978 -100649 -27162 -3323 -72385 -107898 -141814 -186040 -117525 -75976 -9685
15044 -9685 -58599 -105696 -67657 2728 -42534 -82195 51534 54567 2987 9688 -30783 4065
15032 4065 -43157 -37051 -6983 13895 34380 -77760 -116807 -120866 -57348 -20719 -88562 -73363
15020 -73363 -4531 -16080 -43537 -91562 -95632 -16260 57394 14052 -19170 -39624 -70011 -150690
15008 -150690 -165568 -97100 -104447 -99849 -843 69056 36493 24211 71115 39765 -25674 -64235
14996 -64235 61125 -19883 -69651 -34337 -35449 -13206 -31579 -90222 -115341 -17604 47898 42573
14984 42573 71226 91999 36686 -16552 -55782 -120414 -145015 -102621 -29240 2834 12531 -8339
14972 -8339 -56263 -163799 -206469 -209038 -155736 -128005 -128272 -147539 -211165 -126112 -92762 -32179
14960 -32179 -14010 -4422 -13716 -27951 -41775 -78744 -138482 -200105 -211399 -172184 -50078 -23046
14948 -23046 -92540 -52383 -23544 -36289 -35905 11328 -4714 17628 10702 -5607 -90487 -30065
14936 -30065 80718 84829 73750 -21369 -103603 -46274 -4540 -23841 -106444 -204218 -171008 -153228
14924 -153228 -96539 -56900 18358 17396 40986 67240 -6563 -61658 -83203 -87542 -87848 -32919
14912 -32919 24670 88064 46206 -58704 -14162 23528 9338 35757 352 -46567 -112878
14901 -112878 -185948 -102951 -14863 -19309 -71368 -93197 -49137 10147 25897 -8388 -91014 -135474
14889 -135474 -99538 -7521 -54604 -167521 -84338 -26004 -74075 -89691 -42281 -102801 -95230
14878 -95230 -64129 -42236 -154 -16900 -40487 14731 8335 -122126 -100189 -21995 61862 66497
14866 66497 126106 103054 48372 27506 97902 88228 6431 -92938 -82473 -42677 -36316 -43040
14854 -43040 -47333 -34298 49464 -13625 46824 -9206 -44690 -30400 -6474 -65263 -136610 -146327
14842 -146327 -115511 -128218 -124372 -67677 -42209 -2313 7465 25370 43373 44040 96217 167406
14830 167406 70098 -46091 -32691 19959 -47248 -37351 376 48980 -2879 20276 -10716
14819 -10716 -26229 -13250 -3774 -30037 -112268 -122053 -83777 -62905 35533 31772 -534 59813
14807 59813 56159 88433 25735 -11348 20288 65615 88118 53371 30435 35158 32011 -3577
14795 -3577 -31135 -27116 -17012 848 -1365 4317 5323 22540 58584 81213 78731 -10129 -23741
14782 -23741 -65058 -39270 17207 10432 -53370 -21915 -41101 -48811 -31230 -26791 -18598 -1925
14770 -1925 -63326 -60925 -40544 -98960 -51198 -1035 -1051 10834 -50879 -120750 -139067 -122506 -53328
14757 -53328 51334 29667 3905 -26157 -103937 -139233 -115378 -27398 -15711 -14656 -12785 46470
14745 46470 33199 -67965 -81640 -37886 -29327 68842 101013 88011 10311 -11920 16448 -33186
14733 -33186 -67209 -96148 -48988 -36523 39110 24275 -41639 -95771 -131076 -107246 -55390 -25306
14721 -25306 -20040 44469 120869 150079 57585 -17965 10858 -73254 -150107 -149046 -120035 -54675
14709 -54675 -62349 -10524 26452 -35078 -136086 -195652 -172647 -112891 -41147 -19591 117326
14698 117326 185172 141511 131186 115952 42621 -20379 -106452 -173317 -108418 -13319 42501
14687 42501 70112 43832 8227 -25280 48518 63064 1947 -63515 -6194 34067 54169 47739
14675 47739 -39744 -72824 89172 174644 104664 93468 644 2065 87529 130067 86509 79985
14663 79985 110268 108430 83938 40252 84103 72106 -48549 -104076 -33923 -71720 -77152 14587
14651 14587 30292 -21007 -1726 132478 99315 36812 -15816 37274 38773 -4381 -14429 26490
14639 26490 32526 -34240 -28898 39913 61518 96863 6122 31840 -59595 -92379 15754 46236
14627 46236 -52514 -147910 -168599 -123095 -105245 -32791 -7229 -87776 8954 -1771 -28626 -27453
14615 -27453 -36229 -55727 -41018 -84906 -158940 -73304 -34198 -70640 -116387 -87422 -24418 -12116
14603 -12116 -53433 -27259 -23364 -87366 -57576 -161 -22060 -43037 -62266 -55460 -35510 21113
14591 21113 27533 -12178 -89987 -162192 -86982 -23932 -24463 43178 113509 86216 -64992 -99612
14579 -99612 -82087 -42359 -4436 4865 -28388 -31306 -48300 7066 -34776 -111514 4559 134728
14567 134728 122900 5443 -32247 1279 -79571 -103689 55689 42339 -29336 -92909 -176209
14556 -176209 -138444 -150200 -208997 -128520 -123398 -117947 -144797 -130213 -120469 -21260 67967 10079
14544 10079 -52599 -102568 -100292 -87228 -109128 20731 119955 114381 98681 76929 110155 126436
14532 126436 168933 160861 104702 5797 -63487 -119529 -121032 -76236 -33693 1598 31483 60087
14520 60087 -4741 -19348 11962 47490 87143 26165 -67989 -37993 53729 67137 54640 47562
14508 47562 25283 -3131 -67461 -62478 -70705 -90636 -95999 -76158 5511 101704 100654 92817 114665
14495 114665 -3143 -53683 5281 83793 82745 53958 45177 33901 71873 78794 57736 -9826
14483 -9826 -15307 77760 48315 -56104 -70014 2518 58755 62810 12622 -72 -11849 -25842
14471 -25842 -15910 -83241 -152627 -106807 -59941 -41994 -28876 3089 -13356 -121348 -104509 -63036
14459 -63036 -28261 -29268 -113801 -77736 -40668 -61517 9188 72343 104950 121837 128448 72592
14447 72592 72435 34721 90798 84627 27189 -10964 -18618 4407 50484 31758 -27325 -55854
14435 -55854 -44398 -21146 25742 -17770 33383 -7868 -38412 21337 27016 1631 34146 116415
14423 116415 160080 38676 -27308 -60871 -35582 -62378 -35198 63069 53170 -5840 -18048
14412 -18048 34703 51065 27575 -22179 -137829 -188771 -126807 -55327 -11700 -6511 -25458 -57314
14400 -57314 -103306 -98759 -49224 1393 -46630 -91718 -137209 -153293 -83221 -38972 62275 39861
14388 39861 1380 -60919 -64938 -59670 4370 32297 55511 50457 44034 7934 -21386 -2555
14376 -2555 54687 52459 7626 -4268 -6364 -72938 -114113 -139314 -123975 -155959 -87094 4003
14364 4003 59590 34327 -15748 -97259 -89763 6881 55112 53597 -39111 -116796 -134831 -82585
14352 -82585 -28669 -32364 12431 -20113 -8547 51341 61440 -6317 -40600 -47697 12019 43177
14340 43177 1544 68677 38224 1101 6435 -48255 -74351 -5340 -58728 -56472 29876 49782
14328 49782 57705 84545 80015 43088 511 22306 26632 4903 13198 83983 91146 15037 29696
14315 29696 63489 47914 -5803 -19104 -25212 -96771 -120830 -74690 -87569 -65501 -60642 -66800
14303 -66800 -116682 -135189 -94054 -36286 -180 -20800 -23802 -11363 56335 57944 16944 -101122
14291 -101122 -101575 -372 41843 55542 94917 6653 -47708 -27499 -45314 -52912 58434 121924
14279 121924 74192 42694 79715 13237 -104660 -124283 -99116 -115843 -61622 -89549 -146325
14268 -146325 -147681 -144532 -186501 -182750 -146665 -105007 -58881 -110555 -118852 -100023 -68766 7227
14256 7227 71858 81129 7399 -108837 -65049 -35631 9773 -21712 -65204 -20376 63704 96448
14244 96448 94049 141598 83756 49892 49222 -20590 -120795 -40905 -7081 -71324 -58597 -76461
14232 -76461 -132553 -151646 -187250 -141967 -146403 -80781 36758 49611 102364 63055 29928 36360
14220 36360 31595 43183 47424 -60616 -81128 -20550 98374 106534 89084 41003 34357 -32061
14208 -32061 -110248 -104546 44645 54172 17079 -49026 -21987 -30763 -79275 -25783 55019 121089
14196 121089 103996 19652 7314 -36595 18967 -2124 49346 121670 170527 184179 123813
14185 123813 74048 -58400 -55243 69120 158632 120206 34140 5039 -446 44569 81621
14174 81621 135262 194535 114099 3465 -68619 -109418 -76320 -95763 -63718 -71923 -55468 -30863
14162 -30863 -26380 -33072 -61764 -36873 21297 -13668 -27603 -41421 -27289 68657 136382 105416
14150 105416 13124 -73216 11167 132121 148246 128553 70127 -442 19567 77363 21184
14139 21184 -17135 -72703 -44967 1417 51559 -21921 -62267 -21326 10311 -4245 6154 241
14127 241 1110 79598 44128 -38886 -25473 44684 41291 65856 84457 23962 -116465 -128090
14115 -128090 -155774 -178053 -57539 -20199 -29251 -91697 -99670 -30941 54122 69205 28276 19148
14103 19148 -50193 -3737 19659 15394 -13800 37365 -21907 -101024 -11415 10332 12433 -9236
14091 -9236 -135702 -133500 -7588 -29942 -133510 -157290 -155843 -194028 -120211 17791 -75971
14080 -75971 -151526 -133159 -101195 -2099 39875 5714 -59850 -70528 -87298 -63956 13120 31701
14068 31701 8680 31628 43740 6489 -36055 -91857 -81295 -106940 -3293 954 -31096 -53359
14056 -53359 -39347 7737 3240 -50398 -90861 -101607 -96275 -78783 -11644 72270 76800 16870
14044 16870 21000 29089 -57568 -146135 -118917 -123375 -152472 -68012 -27046 -99473 -86841 -20223
14032 -20223 2125 -61551 -30915 -43010 -37164 -111002 -72098 -8488 -28199 -34882 3229 70398
14020 70398 116614 132545 134637 80488 31489 -53652 -54499 17037 13899 -51909 -38137 -53139
14008 -53139 -71 105435 131535 75454 34809 -7974 88368 26899 -41521 -100317 -109858 -93180
13996 -93180 28351 70215 50245 57723 60045 60611 75735 -9949 -77879 -36289 -46351 -104219
13984 -104219 -130675 -119752 -83355 -50330 -75107 -94249 -69055 -36266 -71985 -107203 -66008
13973 -66008 -14835 1036 30033 77164 358 -33977 -13505 -77291 -116378 -55615 43299 61309
13961 61309 60298 29177 20615 8996 94851 126184 130764 121294 147498 146625 135490 158384 149840
13948 149840 77805 35009 29017 -31395 -52239 -7913 58534 12429 17642 66026 65385 -13873
13936 -13873 12531 -59054 -33376 7673 -8046 -48983 -100294 -33110 -42370 43085 25761 -40650
13924 -40650 -54621 26160 31207 34064 35320 -19494 -17809 -23077 -88090 -46604 49404 78047 -49913
13911 -49913 -123147 -48750 -26687 -30973 -76633 -122253 -97370 53298 113892 129655 112795 60272
13899 60272 12133 -9791 -18243 22392 -61124 -70698 -35537 -32844 -55284 -86125 -31489 -33633
13887 -33633 -61439 -15878 -15902 19720 -51867 -130408 -137113 -26918 37525 -2580 2546 109329
13875 109329 149142 145684 106271 72216 84492 57926 -11734 -3053 89398 41530 10113 46622
13863 46622 50049 50922 27226 45370 78652 92455 70968 56819 27742 27654 62156 101926 70477
13850 70477 12987 -57505 -28179 -31310 36385 83944 58138 71888 142386 115551 28843 -33001
13838 -33001 23492 2292 -77659 -104344 -13360 28560 7376 29101 65203 75499 145224 145945
13826 145945 146659 158120 215380 160397 57257 -1570 -29178 38020 22383 31649 -10890 21291
13814 21291 16255 -52624 -80085 -41936 -73747 -8615 52843 126620 106732 23624 -40057 -70656
13802 -70656 -82277 -54948 -57591 6278 24053 -44451 -35121 18670 172403 245052 268557 224875
13790 224875 168687 83764 11449 98725 158231 207896 258992 242107 237541 233504 110613 126677
13778 126677 206770 115493 111837 136760 135797 79750 47282 150013 209900 193340 153729 155679
13766 155679 224507 220680 301597 269419 284868 318746 304540 328772 261624 282723 262144 242308
13754 242308 267393 297422 316812 345618 411835 453367 503277 600562 646311 661570 682169
13743 682169 741451 916681 1061053 1260334 1542125 1858370 2037077 2074006 2022126 1974405
13733 1974405 1724394 1360665 1022803 816746 666303 624742 575704 573629 579279 444166
13723 444166 365208 367582 328343 298663 249935 189753 118172 159383 183607 194118 277514 241656
13711 241656 229398 191902 192268 244380 257744 164610 152478 199825 172276 170667 237478 182351
13699 182351 74193 7116 40397 64979 21031 73581 76701 87276 31810 -8965 -23213
13688 -23213 21285 -69286 -74126 -61926 -18354 3520 -37235 -103528 -111337 -87904 -75832 -94330
13676 -94330 -33468 11971 -23980 -20366 47200 104903 150987 101907 28002 41358 -17526 -91171
13664 -91171 -85695 -38156 3456 -85350 -82607 -2512 69055 71300 10621 -59643 -36042 -47037
13652 -47037 24242 63290 53519 2329 -6255 32155 47865 83313 107345 174114 138370 83192
13640 83192 81497 34815 -49051 -141108 -139730 -72056 -70761 -112300 -40056 66164 135088 152420
13628 152420 208247 194352 100468 -18258 -19126 -38711 -42687 19547 124341 39589 13919 36406
13616 36406 27460 -6271 -24777 -6786 45434 42923 -21663 -42686 -111950 -183918 -142698 -10605
13604 -10605 19575 80129 -16260 -94405 -28824 -5957 -30269 -8147 -56962 -66826 27622 113977
13592 113977 143295 63227 48789 51280 85032 41495 25184 -27534 -63295 -27752 -24807 -62348
13580 -62348 -35825 -1905 -48031 19788 65554 6674 2652 -10164 60444 40760 126501 219464
13568 219464 195663 183713 155256 137953 114388 66452 74331 121191 65164 -2995 -34466 -48523
13556 -48523 41142 179737 358032 487415 645348 796901 898618 955232 902089 721857
13546 721857 663580 527369 452009 493628 496714 437107 334354 302756 318906 386791 359077
13535 359077 284866 225262 165907 183151 237551 237810 194258 225193 224377 212623 190076 136016
13523 136016 132877 173267 324478 349911 299220 369577 426043 405831 332783 343898 361507
13512 361507 453300 405357 421501 424267 477678 463743 431346 426974 392142 343405 425655 460669
13500 460669 425669 323630 292064 339259 291063 283903 216547 197010 200173 244709 278557 177928
13488 177928 188358 236451 213366 266830 334717 404701 349537 317128 323159 356671 382990 396400
13476 396400 373900 323285 246871 260134 350769 406774 465914 406116 342844 343057 187594 173630
13464 173630 173798 227800 232971 200212 241776 265474 231843 146122 146805 215720 204930 175773
13452 175773 125317 122350 149784 60034 -35437 21542 33472 19304 -24211 -70692 -87897 -140541
13440 -140541 -189277 -193440 -116348 18987 105100 82632 100510 274686 349382 372914 360071
13429 360071 355616 412216 482946 503545 441744 391680 331762 303222 336213 455145 463589 460027
13417 460027 434029 407008 515641 598977 671333 678189 662870 649034 630179 682410 740342
13406 740342 671859 668112 655497 580539 545172 495460 435869 476463 540019 554814 542969 553660
13394 553660 561479 600888 600541 616449 626764 728613 845284 850929 918336 971059 1027191 1151093
13382 1151093 1286915 1371298 1412448 1373784 1342203 1348607 1194137 1042052 954479 918191 912518
13371 912518 836133 803344 758636 701684 616697 497153 485373 518150 591919 600304 549436
13360 549436 582225 634539 655824 719814 700364 735298 740571 785629 775530 841315 861866 804124
13348 804124 882710 911400 952808 980464 1145987 1316293 1299169 1247630 1293299 1408984 1495367
13337 1495367 1507005 1558849 1556207 1585761 1606406 1544077 1553763 1574050 1547145 1644202 1833319
13326 1833319 1923835 1976250 1998793 2072158 2284531 2394656 2416554 2464912 2529166 2656049 2737999
13315 2737999 2800038 2984364 3202321 3333638 3602017 3870652 4226944 4692251 5318919 5978458
13305 5978458 6717324 7474209 8338192 9190547 9863245 10509679 11039718 11591967 12197543
13296 12197543 12775658 13252574 13805130 14405904 15092781 15879191 16717356 17656853 18644591
13287 18644591 19501046 20367452 21372579 22391455 23348830 24329930 25388709 26673259 28153126
13278 28153126 29805705 31745794 33853494 36163519 38773836 41819135 45591445 49879070
13270 49879070 54192898 57862585 60977250 63891332 66873736 70602721 75688646 82611219
13262 82611219 91983871 104017716 119272847 139315354 167269903 206977622 259787927
13255 259787927 316826434 358521950 377183912 387873602 394704986 371320947 308410534
13248 308410534 237750905 183509990 146938503 122471375 105355080 92700520 82760163
13241 82760163 74784975 68520958 63602207 59488615 55778543 52467866 49572354 47081185
13233 47081185 44816505 42673299 40670358 39160736 38014113 37168875 36630294 36396206
13225 36396206 36419430 36468868 36197480 35236893 33607220 31748923 29797136 27780681 25945484
13216 25945484 24232893 22585129 21014867 19595643 18183257 16927358 15834862 14777680
13208 14777680 13921795 13143808 12409980 11662958 11054651 10509048 9845092 9226011 8719339
13199 8719339 8206302 7635696 7216076 6877671 6475000 6112534 5771809 5425464 5167492
13190 5167492 5050395 4872349 4667529 4496174 4319956 4059051 3873724 3668280 3444463
13181 3444463 3297288 3204824 3089957 3043291 3052101 2976786 2836129 2749040 2652469 2501483 2432468
13170 2432468 2381230 2340730 2286780 2324009 2254569 2273194 2261447 2274991 2192612 2197404 2209273
13159 2209273 2176993 2124397 2103116 2120885 2115734 2073238 2117985 2191652 2325125 2325550 2378625 2620497
13147 2620497 2857851 3037347 3331366 3806828 4476955 5318539 6084186 6554477 6884424
13138 6884424 7041871 6810904 6181989 5235606 4349785 3597625 3142916 2811532 2483233
13129 2483233 2334031 2328292 2292774 2162872 2051630 1970482 1869085 1766914 1679680 1546488
13119 1546488 1521531 1411681 1230124 1108442 1070430 1047545 1012483 931920 964937 917528 780427
13108 780427 721328 691750 747496 751965 775113 789649 690798 611887 533111 431613 286563
13097 286563 274072 145925 118413 186905 318996 277958 246844 285451 305787 442760 439292
13086 439292 441201 476700 492700 460761 382799 356963 308330 260369 343048 477396 567158
13075 567158 582760 590656 548434 599652 673288 699861 688103 643483 664411 714779 790769 711967
13063 711967 718438 675222 620816 607955 692358 700409 554583 443947 426488 320399 260090
13052 260090 284612 332168 325941 322654 290718 212081 178920 157793 184147 223397 263294 358597
13040 358597 370601 388761 332021 194940 114726 121342 118430 27273 10170 -31455 16840 20747
13028 20747 116224 193772 194990 196805 143716 96238 65628 75019 120397 147318 113520 72452
13016 72452 5708 -17338 62409 54369 -100920 -150067 -108837 -80592 -73706 -50806 -56093 -61670
13004 -61670 -82792 -121660 -111815 -150381 -172312 -168836 -111613 -96829 -151628 -76438 -104764 -116423
12992 -116423 -51018 2173 -1318 -48518 -36885 1718 -51177 -40161 490 -101090 -207076
12981 -207076 -252478 -208280 -201016 -259658 -239426 -205839 -181240 -193232 -210854 -139659 -108490 -132133
12969 -132133 -246125 -328990 -295428 -226481 -241499 -292709 -368106 -417729 -447521 -430561 -433893
12958 -433893 -531062 -676763 -731455 -690495 -606500 -531777 -421632 -327034 -252226 -56630 111481
12947 111481 204484 250516 234340 196926 195449 163502 129451 150512 223048 189051 136662 204463
12935 204463 271367 199542 186261 251654 174990 67480 66945 121208 76166 22162 9222 35395
12923 35395 -19627 -68636 -25286 2876 2433 68438 58305 27308 62578 85994 133554 157888
12911 157888 184680 83248 24857 16631 111475 110862 167306 154159 54122 158 9966 11123
12899 11123 -74926 -43699 10468 32821 115750 153069 87434 117736 208558 205229 183830 145435
12887 145435 183660 234460 224327 206793 249614 239041 112209 85667 63276 21597 63012
12876 63012 175913 221985 217590 142228 161649 106660 123156 68262 97036 106621 124723 143180
12864 143180 118510 170570 167714 187895 153741 101558 48493 -2502 -61467 46795 90422
12853 90422 41355 -9120 9458 51446 132617 58831 8609 102206 131825 130672 130305 120845
12841 120845 54026 40631 77959 14700 33717 135333 208270 173363 132385 94467 71722
12830 71722 47330 65345 68842 88296 65855 -854 -22176 18160 67026 112580 112738 53722
12818 53722 80100 120824 139341 145007 118963 142047 161380 196347 278804 313187 263304 193663
12806 193663 163961 232359 196060 15749 -13070 52960 163830 130852 102974 42059 36162
12795 36162 90625 87087 45032 98809 218832 280979 242906 182083 129585 173658 212593 278706
12783 278706 314355 288975 231726 167337 207936 334450 365644 379052 469846 471495 509276
12772 509276 549447 617872 717504 857841 965717 1089219 1400190 1722777 1923328 2042101
12762 2042101 2129625 2181083 1964270 1553055 1194522 1003368 821463 700513 654499 586892
12752 586892 488221 383508 298510 365175 418438 356134 285112 283532 301471 319825 291306
12741 291306 227160 185368 197396 185072 143382 136243 127171 195462 239760 201767 91002 84951
12729 84951 101660 99704 77862 8116 18702 66496 67680 -11664 -46994 2945 21492 14971
12717 14971 79976 153873 128061 67564 -55379 -76691 -47313 29060 4860 32325 40237 15133
12705 15133 74731 91149 35520 27090 10884 13357 -15441 -39283 8316 -13690 -74471 -59945
12693 -59945 -31963 -68527 -95351 -94066 -34139 31405 36213 35097 40661 -8646 33765 46980
12681 46980 85109 57500 64949 54413 58560 -3486 -15561 14549 18279 -39416 -57061 -65474
12669 -65474 -58129 -46177 23817 76654 137470 109328 -22629 77293 117601 128490 120059 62579
12657 62579 -2758 39497 13547 46931 8925 -36514 -9138 20788 -28460 -16843 -75400 -80203
12645 -80203 -14724 -1733 -41661 -85475 -101708 -127345 -111303 -106458 -28214 23663 37594 59879
12633 59879 79356 56740 58192 58019 17838 71687 35980 -29161 -22353 -13112 51730 33868 -68821
12620 -68821 -87906 9114 -15759 -49435 -89995 -107208 -77240 -71698 -48670 -32825 -91094 -54472
12608 -54472 -50579 -135134 -178566 -85735 -78661 -21185 -53353 -154685 -105506 -66123 -124367 -154528
12596 -154528 -99741 -19667 14777 13921 7513 56850 56757 66647 140678 142752 149945 140990 36856
12583 36856 -35952 58216 62270 -18593 38782 -33715 -123982 -133801 -123882 -27741 -45301 10505
12571 10505 104718 188700 122317 127733 129353 170834 109047 42593 37342 -56946 -77212 55046
12559 55046 77692 35453 116910 26038 -4208 29595 34813 -2247 33321 94931 5710 31490
12547 31490 20729 -569 -42391 -22114 -47358 12129 8653 49141 58796 62506 6304 17363
12535 17363 72648 35465 50053 28437 17362 -27541 -17462 -28227 -132721 -76564 32941
12524 32941 11089 -14558 -29525 -86292 -116612 -154124 -130583 -94534 -105346 -80030 23181
12513 23181 38265 -42701 -19504 -80603 -60867 -112768 -79009 -31013 13267 52686 47277 26276
12501 26276 56131 16753 -73743 -36793 -58288 -59145 -36959 -80989 -72501 -70604 -134511 -133555 -165298
12488 -165298 -148239 -112088 -83955 -48884 -64466 -74763 -64986 -160019 -205896 -190231 -78671
12477 -78671 3674 119340 123713 140140 34736 1240 -19933 -64243 -84378 -96327 -80057
12466 -80057 -69590 -128442 -71979 -10680 -50413 21387 28225 -59040 -124731 -122183 -90773 -93051
12454 -93051 -69715 -75262 -48050 16322 68452 27223 38176 73446 77688 43441 -6149 -48551
12442 -48551 17693 24643 48050 98981 90022 56058 -31567 -30340 -21846 -50153 -37066 -71371
12430 -71371 -178490 -126007 -31751 -12209 -1839 -10741 -8405 -68740 -119251 -145755 -146369 -83683
12418 -83683 28209 114696 73289 -15468 -22961 -27330 -62043 -29630 64370 88715 83960 57683
12406 57683 31008 79593 51544 87147 107361 54123 38845 5180 -2036 -59088 -54635 -48953
12394 -48953 -4024 -24751 18449 93926 134254 100022 28082 -60045 -67058 10608 -66535 -133015
12382 -133015 -186806 -231098 -199079 -64533 -40820 -6107 53873 78217 77171 -41961 -97445
12371 -97445 -30451 -28743 -39212 20767 11432 3284 39366 117 -39522 -35388 -24596 5026
12359 5026 10227 -58633 -99464 -69487 -37197 -69196 14451 64183 108838 71814 37843 -13985
12347 -13985 -5096 -33613 -72661 -49882 -1753 -46252 -65761 -22147 -41692 -23685 -13483 -53339
12335 -53339 -46709 -21805 40147 30274 41668 6505 -40622 -34674 -26577 31067 141514 143642
12323 143642 65847 45524 33924 41497 32029 28995 85749 90441 86146 39104 65918 173881
12311 173881 181475 64900 7718 -33342 -43759 369 -7196 17866 51848 77560 121382 170520
12299 170520 112989 111000 59964 -25560 39264 74471 4773 -1261 -20180 -47803 320 -26200
12287 -26200 14206 67394 37643 15592 77427 43604 -51708 -56364 -38702 -11317 -29132 -26195
12275 -26195 24810 43615 9304 -21865 -45613 -56375 100945 99409 64023 66078 129471 161349
12263 161349 212081 173546 149790 138516 162685 159636 133873 131005 41766 44034 47350 98655
12251 98655 80867 87298 72690 153617 160808 185216 138846 68764 66751 57858 76939 -1725
12239 -1725 3065 -20007 10708 93314 62523 -19231 -96595 -124261 -119971 -87678 10892 25843
12227 25843 -20356 -14977 -58739 610 3909 -100 7070 -8890 -403 11281 79898 28381 -60097
12214 -60097 -69788 -58411 -45359 -45794 -919 -19812 -75950 -105571 -81033 -6504 72889 68990
12202 68990 72279 52953 -20550 -22670 12148 -22818 -40136 -18080 38893 44375 32714 -19599
12190 -19599 -157050 -142457 -90175 -72527 45031 92868 67014 -9748 -15145 12293 18098 8609
12178 8609 34006 -2256 33554 18431 33972 101350 33121 -54375 -138714 -128911 -166920 -192225
12166 -192225 -144669 -80739 -15441 -31896 -78435 -34588 -78325 -58732 -35966 -27688 -86740 -78763
12154 -78763 -63761 -87430 -46391 -95654 -114150 -39220 23893 -10641 73944 10842 -15980 -5818
12142 -5818 13149 10668 15608 90453 66140 -1159 -16307 -16633 -11892 -62186 -106441 -13044 28797
12129 28797 -34459 1818 26916 -18694 5924 16947 2471 90875 84279 62694 -24253 -8841
12117 -8841 36992 153360 131010 594 -61935 -34105 5603 -2183 -61317 -57643 -21362 27039
12105 27039 90952 84184 84199 54274 98683 165076 103628 -44739 -13490 -13295 5340 84821 127277
12092 127277 17099 322 -12873 -60387 -41598 2193 15492 84591 24614 -49431 20190
12081 20190 52218 12904 18384 -16862 21161 102608 154444 100512 48535 83701 8987 -77711
12069 -77711 -48959 17024 88307 96300 21212 -32660 -18476 -77160 -88331 -27439 -41922 -91502
12057 -91502 -99402 -101788 -21132 -326 1266 100 11270 -10746 1000 -51681 -51069 14405 21150
12044 21150 -76666 -110644 -98966 -138490 -75252 -73414 -50027 -21166 -69764 -90398 -99810 -45671
12032 -45671 36275 -5483 -49473 -83236 -53086 -93952 -116941 -65329 -112481 -56125 87022
12021 87022 94310 74674 -3203 -34425 18713 -25974 -21461 15827 -43638 -140004 -124790 -50402
12009 -50402 -39548 -111033 -215056 -188718 -61147 3792 35996 18374 47812 14794 -82337
11998 -82337 -87116 -37633 23015 -14860 16197 42297 -15517 -18723 42772 80513 49122 -12233
11986 -12233 8187 18556 53051 -14233 13361 47018 15511 38097 96036 44714 77493 129695
11974 129695 -3487 -17761 5986 23131 64785 51526 -20696 -67529 -60163 -34810 -54586
11963 -54586 -37590 -87940 -87699 -63161 -45607 -12638 17351 74504 30944 -9349 -11170 -52458
11951 -52458 -165833 -146530 -82917 3363 -6055 -15889 -14784 -15199 64219 53179 -32505 -36228 55495
11938 55495 15711 -46851 -37867 -60440 -2787 -38697 -60401 -8271 59835 88469 8560 -46778
11926 -46778 -65187 -110950 -131353 -82198 10475 70226 65011 102831 40679 18570 -8470 -31232
11914 -31232 -10141 -3768 -3020 -6824 -17351 -76013 -42807 18251 -4753 -31232 -72524 -106878
11902 -106878 -117352 -74541 -11012 63385 162623 159928 100643 51500 27256 -53096 13211 46365
11890 46365 41835 81960 63084 -25609 -58903 2597 34315 31286 3537 40386 65988 86872
11878 86872 77625 93288 56416 7141 -17725 -14698 -116012 -146641 -59686 -26915 -62514 -96928
11866 -96928 -37287 7123 -53991 -68972 -95227 -103975 -76208 -67551 -68473 -131565 -93304 -27794
11854 -27794 70713 109019 57422 33383 31032 30812 16141 -5724 2121 -14556 15254 10200 54806
11841 54806 10303 -3287 39994 98237 107512 69083 15049 -35273 -70351 -21594 5039 23106
11829 23106 -17471 -47247 28091 119962 69019 91464 130654 46919 -51933 49549 100277
11818 100277 57055 82244 -15183 -39368 -3081 16018 72471 136301 65130 -72281 -141723
11807 -141723 -136317 -163667 -171728 -108408 4939 71833 73823 -19989 -5452 -52541 -94574 -76248
11795 -76248 -62901 -70595 -127210 -135774 -98806 872 4412 -31016 -31216 635 91575 107711 107443
11782 107443 119019 58570 -20041 -73859 -52932 -49809 46868 60132 124417 139398 120478 16132
11770 16132 18542 59440 35785 -16978 -34597 32316 -8415 46150 26348 -70602 -29883 46446
11758 46446 150591 133054 68455 54629 76727 96262 113049 114043 73481 23258 -15780 -30532
11746 -30532 -2613 4664 -36530 -114931 -145833 -104211 -89729 -5072 78084 85305 32698 12491
11734 12491 67114 28470 -35342 -62145 -80351 10360 -5040 -61582 571 54230 96660 14958
11722 14958 18531 12252 -9133 -2790 82 34569 51209 81180 84950 40828 29034 57497 36638
11709 36638 19689 82771 21206 -80075 -75795 -31083 -14320 -35731 -58920 -25938 -23411 -27314
11697 -27314 -75547 -5947 105192 -21709 -133521 -138987 -159630 -186179 -154597 -33394 29565
11686 29565 75381 173220 305376 293024 211696 89123 -3881 34429 35299 48873 116354 153738
11674 153738 165930 201287 154158 141770 173656 262209 255474 169609 68241 -6738 512 45575
11662 45575 68484 21668 24473 55961 28133 -21109 -9321 23815 25910 921 39906 48494
11650 48494 30564 51925 45089 -374 11288 35440 97917 87433 59404 37218 46564 20103
11638 20103 60767 174753 193854 197191 204846 204697 240045 257713 187190 153431 174615 224590
11626 224590 304931 355571 426832 462105 401733 281748 194732 187475 278659 406800 448042
11615 448042 549221 599508 637653 623695 573563 604191 510500 530610 644760 636967 490029
11604 490029 373396 377028 436202 532689 646802 705073 592502 540746 618047 649330 679157
11593 679157 668977 631779 653127 609187 667317 696653 728179 761625 746852 775077 859308
11582 859308 888413 1006919 1145124 1171875 1158528 1287796 1418457 1449840 1414294 1423684 1475648
11571 1475648 1512817 1605077 1720345 1818518 1869027 1915834 1895750 1938355 2029034 1923026 1824007
11560 1824007 1764227 1697980 1620281 1680789 1666712 1592131 1615586 1629278 1519609 1511438 1528596
11549 1528596 1601762 1575926 1615475 1663235 1655432 1657127 1774903 1832367 1871386 1946457 2074814
11538 2074814 2142353 2173555 2130340 2059545 2109429 2118930 2118057 2131405 2092740 2098432 2132425 2159113
11526 2159113 2131705 2168257 2168133 2169190 2100048 2095316 2134810 2283483 2338487 2300207 2291001 2298003
11514 2298003 2256867 2107280 1985312 1869668 1851831 1852421 1739682 1657306 1568393 1530808 1495523
11503 1495523 1535162 1597334 1675736 1744808 1783007 1721057 1640939 1683976 1859335 1926918 1978066
11492 1978066 1981405 1976077 2037055 2148034 2153889 2040712 1936633 1868641 1751797 1728196 1579068
11481 1579068 1581768 1592440 1451383 1419513 1407266 1397401 1350376 1302844 1283596 1322541 1273061
11470 1273061 1250633 1261519 1168436 1054164 1022362 1034371 995345 901098 808669 768890 696346
11459 696346 699513 741976 733886 676832 686429 635170 638638 616971 711634 768923 718945 639318
11447 639318 692328 678465 650890 654537 607948 567359 548525 586570 624113 555085 489492 431139
11435 431139 408799 396559 376293 397632 424572 347663 274221 284580 273479 269717 259355 274238
11423 274238 254230 271828 306311 284714 322103 354777 292782 214015 224765 262275 214793
11412 214793 194789 202163 248881 320182 185998 77632 116630 163490 226110 192810 145947
11401 145947 134225 80507 143914 178405 161330 43747 8746 50707 162161 218987 189382
11390 189382 126882 59421 62616 13739 -98225 -131354 -46611 -58213 -41097 -47713 -90774 -75132
11378 -75132 -54805 -108868 -58708 8211 52796 45734 37459 18849 46767 23868 27190 -22962
11366 -22962 -67908 -76191 -50504 20994 44603 21480 41532 88487 74777 -3700 -9466 30518
11354 30518 73032 72289 106070 100394 18775 -597 -52676 -19916 -35366 -15815 -64358 22138
11342 22138 49026 -30043 33573 22655 27885 -58416 -126477 -71864 -48642 -102546 -54482 26287
11330 26287 96602 78135 15201 -42706 -91587 -41746 5896 42864 -20554 -115579 -152965 -120194
11318 -120194 -25661 -2796 -21138 1369 -76553 -147030 -82781 -35106 26854 76554 39896
11307 39896 -1135 -58352 -130346 -138891 -103072 -94304 -111940 -53975 -23511 8965 37833 25178
11295 25178 20062 1190 -100468 -141015 -28942 129774 177659 136112 13658 19380 57437
11284 57437 19439 -54636 -68538 6179 -15168 -30722 -9566 -8251 51310 34743 -64661 -148757
11272 -148757 -234751 -164060 -120354 -181695 -103197 -45717 -20102 73363 89676 16222 -36784
11261 -36784 -69127 -76443 -51743 -63348 -98546 -112236 -76545 -23530 1684 -23479 -18032 19105
11249 19105 80965 114601 52038 -19134 16531 73621 77122 52937 87863 44971 43977 81878
11237 81878 53404 9796 57857 121549 51273 19492 21304 63016 136038 150899 139217 36114
11225 36114 9856 -7662 -49809 -12686 52607 29350 -22485 -51877 -25049 9765 -24577 -95095
11213 -95095 -88381 -66427 -68920 -31494 -41818 -59005 -29816 29010 62357 52046 42200 43788
11201 43788 42778 55161 -50589 -126771 -52887 -1034 6319 -706 -19897 10345 -36370 -129640
11189 -129640 -90001 -24939 50719 70158 3727 -53673 -81761 -99601 -23960 -49277 -60091
11178 -60091 -68726 -48231 -30200 -39911 -22068 -38833 -124010 -89468 -33926 -32031 34659 28155
11166 28155 22500 91637 25246 -104401 -114556 -128588 -89102 -29532 -18526 -14811 -7524 4696
11154 4696 -23957 -35636 -14205 -41863 -48710 21463 17495 54302 115987 68555 68672 101349 109294
11141 109294 86747 55728 27045 7614 -70465 -235855 -200119 -226364 -252324 -135436 -65618
11130 -65618 -84320 -131055 -137246 -110860 -118992 -95771 -101608 -158055 -147937 -80366 -25074 25014
11118 25014 41416 -5465 -44150 -59250 93397 150476 84865 54367 -1419 34298 -12666
11107 -12666 17996 -7514 15437 14600 28903 75339 25200 -58929 -23127 30404 62093 24954
11095 24954 -26955 -68699 -88356 -117388 -78728 -73823 -44378 -52696 -42977 69956 130666 115270
11083 115270 141933 172579 152986 73770 27441 128986 196480 164521 149048 105722 52031
11072 52031 47749 82403 99501 54472 38069 -5137 -22777 -34088 -5810 50933 47420 41091
11060 41091 -30558 -39590 11232 24390 -15272 -1072 17648 44970 56654 75936 118699 41675
11048 41675 -85119 -141487 -92079 -91987 -26218 29196 3342 -19416 9930 -24438 -120176 -118994
11036 -118994 -48134 -42158 -72748 -73734 -101822 -106371 11512 74401 167521 227013 160549 104915
11024 104915 103022 141762 125685 89479 156713 125159 20796 -19668 -18903 -70504 -47427 -151519
11012 -151519 -96833 -43107 -5357 132628 50408 51605 83007 105334 12233 6694 59614 76032
11000 76032 55671 59088 60397 97095 124728 196440 167603 41214 12564 15363 -10080 -3441
10988 -3441 -14167 -48626 -6619 2828 -4320 -41947 -53817 -47984 -23349 -41499 31639 65224
10976 65224 103234 215307 218234 186952 87941 -5373 -46064 -26867 3214 -25136 -42395 -37839
10964 -37839 -61700 -24250 4731 9162 -28089 55089 80404 87915 6063 -111845 -149303 -40701
10952 -40701 29731 40231 -10580 -27162 -12339 -17459 -21145 -35881 -54372 -41417 16251 55347
10940 55347 61106 106187 119636 86214 56533 48876 89235 84910 50222 -13973 5466 -16706
10928 -16706 -12474 73498 136136 169686 134405 139649 78110 117103 90303 60629 92109 36979
10916 36979 27691 22945 -1928 -33199 14531 77046 49001 20587 57829 44215 -27582 -104898
10904 -104898 -136246 -60267 -66939 -103773 -108683 -117409 -139505 -102258 -114951 -138822 -127351 -153727
10892 -153727 -124951 -84480 4961 50036 62622 110318 86816 15631 27124 34318 60447 90427
10880 90427 98290 52217 21863 82145 111756 129820 152702 155806 153092 132572 144586 121684
10868 121684 -10485 -69518 -89842 -28139 9787 34207 -4227 -72768 -28472 73427 18445
10857 18445 39523 16792 -9555 -64245 -11262 1849 -32154 -9714 22027 6341 -30043 37870
10845 37870 100011 84785 83312 88950 91670 74713 99047 112781 118249 111341 102279 119509 127789
10832 127789 30286 -48868 -28440 16568 -4344 -42457 -21583 -38633 -48721 -45092 -26212 -14346
10820 -14346 25404 13672 -21378 29910 41786 22631 60922 55015 95451 79257 40602 79290
10808 79290 90891 56925 39600 25859 2352 -16393 -46916 -14848 -32627 -89496 -29798 18727
10796 18727 -37672 -77665 -56714 -20050 35128 45188 78645 21708 44675 175772 214505
10785 214505 183157 127053 54855 15814 88953 185213 165681 123706 6577 -25552 -39344
10774 -39344 -64922 -17186 -11841 -45619 -20174 878 36180 33916 40594 47268 49562 56229 34253
10761 34253 27335 -29857 -27005 23153 52386 28322 -22951 2537 1570 10578 33094 75042 -25342
10748 -25342 -87553 -65908 -12439 13630 -16260 -53662 -32522 32527 64102 15559 38603 72761
10736 72761 102149 61342 76809 93286 62934 57189 68280 121077 179934 144914 74790 136140
10724 136140 142329 105683 131650 154122 98049 65127 30473 -19746 -1177 -4624 37594 29642
10712 29642 -19124 14391 117210 156121 188322 95717 -13680 -32964 102323 191111 142358
10701 142358 51226 -6414 4615 31514 -7148 128899 201326 226436 167128 128810 104321
10690 104321 44085 70812 124820 158172 190254 151882 175812 153756 122688 96857 120967
10679 120967 212940 170701 39320 92048 155937 101322 135407 107372 62672 80538 55313
10668 55313 14407 28001 30563 -15015 -35754 16967 76676 75557 80831 40418 33934 97568
10656 97568 67013 71722 22165 -33420 -41110 -20307 -31376 -56854 1941 128276 194712 72248
10644 72248 -92867 -170218 -117914 -138682 -52645 40329 62552 42712 43434 59934 89256 25945
10632 25945 48902 68340 71686 132803 152310 89888 46305 14854 -11739 26886 60317 125412
10620 125412 115328 141852 184886 150870 49713 13397 45606 3996 -17175 35014 89523
10609 89523 146168 119046 131951 119147 34051 -55237 2078 82701 73557 130847 188167 175936
10597 175936 224079 209080 144778 85196 146230 93645 97725 137975 163720 136189 106183 56930
10585 56930 55946 8769 -54767 -13890 23432 -35130 -51784 22244 4671 -88870 -87807 -29368
10573 -29368 -66920 -25930 72417 110137 121993 122093 40387 -29880 -61591 -100128 -48722 -48958
10561 -48958 30448 77861 47190 90075 171328 212487 193216 235774 261241 131285 70674
10550 70674 45475 59042 104286 109672 73021 -5425 8816 27982 -38895 1886 15804 -29979
10538 -29979 -7566 79996 97801 70471 45612 -19573 -82677 -115754 -67951 -55177 -86713 -115572
10526 -115572 -78614 -10580 107051 165099 181466 120327 124459 182708 96921 19294 -27402
10515 -27402 14295 86456 95737 83763 67781 13098 -97878 -109600 90367 140415 29243
10504 29243 83734 54628 30363 26654 10155 45964 60282 83541 114061 106385 88404 92203
10492 92203 101332 49464 70922 52154 31043 19794 55700 -5413 803 110058 200917 139177
10480 139177 174842 224692 209454 122633 57573 82084 131057 150353 127171 100834 169990
10469 169990 213993 143858 103052 48711 21623 66256 149296 144865 97720 86805 63867 75361
10457 75361 74191 87270 103267 93640 56911 98408 72866 4810 46065 10302 22920 128641
10445 128641 95700 14008 -29630 57037 83591 49758 -4059 -49775 -69137 -108915 -101893 -30634
10433 -30634 -4365 9656 27239 20149 41650 57605 62874 67838 35303 48397 52926 92558
10421 92558 142014 86545 88892 51299 41893 51933 60627 9806 13977 -28928 23014 71929
10409 71929 94472 170446 149407 71359 156662 152920 112054 89153 153512 173336 92848 52061
10397 52061 78010 81245 114785 85178 45853 148856 169225 183617 192643 235052 165367 143836
10385 143836 148216 146580 145997 91888 161499 158765 92690 129077 206764 174724 118704 140913
10373 140913 153126 116778 71832 48261 91404 50642 40046 59321 28959 85516 86925 133730
10361 133730 173786 152097 163172 153909 147186 195360 199202 210651 272963 335030 310036 356062
10349 356062 342464 236957 190511 229845 278266 367311 412330 435339 531583 609348 599151
10338 599151 633945 685068 663973 615808 553834 533352 469802 443254 461757 439786 446352 359683
10326 359683 372663 412539 375362 481347 490733 470160 402780 372191 353526 352333 343692 305517
10314 305517 342151 338930 257252 178172 181689 238305 233396 228386 296980 353902 282399 224824
10302 224824 182417 246086 223918 157419 183763 156260 150080 192085 181617 196162 162644 149635
10290 149635 180666 193412 214192 97619 -66818 -93173 -69490 45746 80197 233088 292635
10279 292635 330257 300984 224654 165687 147193 160984 201633 266014 249991 158576 54239
10268 54239 104559 148552 99617 47328 57722 115240 109847 121135 157547 143015 140000 117271
10256 117271 127942 110144 121298 142797 132459 99980 104876 185154 173256 178958 251076 248712
10244 248712 159191 139571 130261 126004 141967 199434 291863 275959 241681 166246 137842 188815
10232 188815 186479 131914 94513 111352 68979 -13061 115501 151903 88588 62845 160473
10221 160473 153547 151428 114537 78322 56259 -28018 -17206 72151 91893 114317 200640 165800
10209 165800 160945 69918 -35352 -15507 14958 71937 126842 149097 135066 110708 163525
10198 163525 255109 256987 186516 189401 181963 191465 65195 4385 79559 167873 198381 101309
10186 101309 59741 48849 81871 135855 180446 163285 141479 153998 194097 161827 74312
10175 74312 70847 40022 52001 142234 217637 149558 91389 82627 77259 119045 224014 231932
10163 231932 181223 96617 45840 92311 107030 41575 14007 -4116 33500 43406 60675 96069
10151 96069 150004 106132 120487 207534 209152 145352 102980 111790 119869 108292 85148 86525
10139 86525 115878 68906 48460 71319 36769 93941 129320 196065 169097 45758 53519 134280
10127 134280 229531 262356 223635 133954 196840 286856 247423 240813 268908 218779 117511
10116 117511 71127 98887 111264 170970 216701 254673 213267 207050 138828 153547 199859 175965
10104 175965 134827 168602 121840 133654 119352 118410 102877 162820 141801 149001 178435 164385
10092 164385 199639 208471 213511 229182 241247 263272 259182 253207 190310 172893 191840 109751
10080 109751 172932 246255 196458 68571 76096 137046 239147 243645 149291 206286 191885
10069 191885 173305 251155 285392 248252 244282 211277 318529 423886 418080 301236 250099
10058 250099 290424 331040 325638 362995 361730 375184 321052 290395 251195 289559 216409 240737
10046 240737 292875 244922 220955 223793 208119 198256 108564 49730 29030 13292 4318 86606
10034 86606 213874 244521 241443 129063 103800 133167 175586 164215 102172 88577 182233
10023 182233 243497 293795 341108 327534 323348 247090 317707 395002 306239 219138 212035 178072
10011 178072 166220 195375 167978 226135 299609 279596 205778 139778 156059 126115 83763
10000 83763 545 77872 189447 229581 233749 187913 181371 154924 128753 150535 234988 257928
9988 257928 248879 221601 191492 86507 32124 39770 139836 114544 100556 97401 120968 84286
9976 84286 41393 75035 157585 267513 244044 262775 313493 277091 242936 217982 226040 227294
9964 227294 151742 172674 185742 182380 211363 191207 219006 284145 348095 390342 357038 355417
9952 355417 324619 279877 295916 405073 383905 338291 296736 226630 335762 393981 346925
9941 346925 364680 410918 288617 232090 255518 323844 362467 393309 411120 360147 370355
9930 370355 366809 319699 304176 359286 234258 226923 239393 284738 228125 147491 153798 280315
9918 280315 312184 256811 255312 284201 208714 116477 141854 224928 193712 203915 190271 119894
9906 119894 97933 135953 115253 73398 180084 280620 307563 266328 266452 242040 294789 322442
9894 322442 280894 236117 293543 292335 225378 238550 217439 168050 207462 252004 255213 274437
9882 274437 217939 222224 230077 272691 228507 211238 254923 205060 204169 247730 290152 349898
9870 349898 287394 275908 273211 410401 415599 315394 365798 409447 328689 271122 215960 233389
9858 233389 273638 310269 342720 363700 329369 324066 317140 340346 295540 189607 118318 157289
9846 157289 161901 235626 281075 310591 392123 339592 270364 246865 219405 249851 279613 265134
9834 265134 230821 140568 162880 153662 138950 199761 254776 252552 261494 310417 325973 407228
9822 407228 401357 336490 273663 305576 419383 441051 372149 280731 236346 220649 246285 274722
9810 274722 266331 216074 239277 284547 229048 177353 178383 162597 161748 134077 144642 151259 263999
9797 263999 183813 146986 240862 213632 240592 279269 314009 369232 424055 308126 269123
9786 269123 333432 351546 322071 312399 347370 364396 438644 422827 346623 363906 309699 353189
9774 353189 460820 497027 495352 463952 397648 477713 462522 389808 336744 320361 362129 359062
9762 359062 404989 492127 465946 379197 369988 314715 254841 298823 229369 235291 228043 282915
9750 282915 389022 344488 414568 411019 344590 256577 218910 194690 260932 246692 276158 257653
9738 257653 184481 191325 294496 365642 327368 322938 274268 228827 274548 281128 280800 335601
9726 335601 377865 343526 339901 261788 179764 231024 206928 260656 326689 266077 187984 159833
9714 159833 200239 234366 270268 369636 398708 382735 394668 396003 426329 403225 316520 223299
9702 223299 151884 178667 252272 238916 243655 305680 344755 360297 353141 353982 341014 356634
9690 356634 398289 312578 218590 222004 197906 281181 313913 274362 288347 322303 316968 307841
9678 307841 322982 301472 247296 281781 283150 280288 284786 313522 423646 429749 435966 363475
9666 363475 305368 340051 357291 308186 253895 293407 346944 362868 314340 321722 243852 216414
9654 216414 307661 407774 449532 399584 352318 364858 377419 525610 507184 408622 333587
9643 333587 351524 395626 291212 282572 302498 298506 294144 310169 346676 368788 332110 181483
9631 181483 103108 166087 337553 367392 334914 372303 374042 408039 415639 409232 355926 264094
9619 264094 262684 325715 319462 296121 357954 379421 385030 364373 395792 411244 413087 335664
9607 335664 285674 338757 383528 352188 316140 343446 323994 412894 463144 380173 353815 291676
9595 291676 304780 318717 300962 313731 317177 250544 258494 256592 300238 370841 278944 248613
9583 248613 291837 284897 267036 315339 372482 303660 290271 407601 441648 416008 435806 444607
9571 444607 424732 444805 385815 328796 341201 337326 284365 250151 291872 308671 292341 277801
9559 277801 361003 442316 416442 388553 493382 477462 475854 470965 450091 420791 445663 406012
9547 406012 385033 373234 239572 218698 246731 361178 454633 432186 360310 306786 310930
9536 310930 388814 511622 557257 496933 389451 335748 225647 197219 184419 206849 288535
9525 288535 348825 332512 365139 389089 410135 328070 275688 229400 268553 277272 254723 267280
9513 267280 212932 190926 272110 261520 290847 340893 314290 269314 254060 275322 299976 364666
9501 364666 426724 370091 346244 300341 330219 355243 313712 305890 291984 415902 475820 413343
9489 413343 431091 410982 312938 366603 401400 416870 399860 387172 309798 343671 414518 404776
9477 404776 361469 417487 396893 396746 370564 437472 426738 421592 391051 401216 453022 398839
9465 398839 361704 402662 370955 413394 435649 357223 270999 335914 398343 429584 427064 415985
9453 415985 328090 329125 366063 397801 413339 357538 375683 324100 269437 292980 375496 386806
9441 386806 404328 405753 410248 370729 360904 447133 447637 360240 226128 190200 292689 353306
9429 353306 336266 250817 246422 310549 295647 373548 348037 374715 445892 446679 353571 238436
9417 238436 310166 383458 328740 281333 322751 350500 358134 357781 313954 316553 345450 340913 334687
9404 334687 328918 280780 299468 353995 398572 467854 434815 441076 381020 395532 383767 324629
9392 324629 361822 358530 308180 342597 356195 391876 390900 456050 502775 381168 332010 306872
9380 306872 313257 272456 292941 237999 219082 207635 216015 311083 405144 397156 420464 377437
9368 377437 308786 412768 446710 314402 264168 348701 402477 383447 391867 365353 355498 305542
9356 305542 294315 359627 361976 396442 464709 445501 362858 322523 376527 362252 323931 281250
9344 281250 258802 245181 254832 296588 312778 253712 278083 353127 359915 406742 406508 277253
9332 277253 298182 361982 347719 342443 400125 399971 309459 207396 246276 370187 425760 384543
9320 384543 395535 441202 430520 334574 325165 328942 367888 401897 391841 367085 287658 345531
9308 345531 297374 239124 251547 246266 254078 309910 392468 313979 251719 199512 271190 303091
9296 303091 284266 261200 276815 299900 370489 451510 427866 381363 415146 467418 451389 450597
9284 450597 402921 391913 415494 314577 273390 316858 373265 324320 240017 307348 290376
9273 290376 231687 268931 269785 298986 327889 220486 183842 208578 192931 171499 238847 307011
9261 307011 295896 319157 315773 296673 311230 352278 326956 193839 129525 163220 239493 305419
9249 305419 320668 333090 234541 243044 237522 227068 271735 247890 320529 381137 383425 380291
9237 380291 431018 447196 398196 302688 229938 249827 303079 249471 243749 311820 306746 313137
9225 313137 313635 371650 332834 312481 321623 321261 270317 294197 290162 355671 359404 306885 256763
9212 256763 206315 225861 283188 244865 256284 245055 242442 370974 369708 348597 303955 214217
9200 214217 285261 354210 373101 372197 376906 334295 351153 325138 331175 344844 310077 308363 406588
9187 406588 396591 322736 314874 285391 211594 146485 231274 298753 377854 343719 273029 336174
9175 336174 360874 416568 489821 455725 327383 263599 277621 312285 331887 272964 262432
9164 262432 271099 318038 337717 338850 342928 336096 276014 272239 258841 298353 311157 224189 224183
9151 224183 304650 252236 206846 185647 181156 234898 249688 299776 310236 363586 382794 325061
9139 325061 229696 181592 129494 77255 165671 219124 322706 332600 336053 363443 381446 319503
9127 319503 299019 329305 222753 135212 126779 187506 258364 209320 199679 210596 204015 189633
9115 189633 155472 98772 95856 30654 84029 205123 229037 213867 213552 172446 160012 229768
9103 229768 287985 258412 200438 164797 157581 244123 261597 290264 333188 359511 332942 347606
9091 347606 356166 343560 353073 374551 297129 348608 329303 336571 320334 333327 273214 191197
9079 191197 216329 217828 213321 245052 310345 348077 345319 291908 271611 294640 308221 333802
9067 333802 340863 314931 390313 343096 180318 144364 194714 251399 254670 171652 156597 152855
9055 152855 180512 165199 113277 143958 192038 195668 244622 205090 225185 264236 218596 219228
9043 219228 302868 323159 352026 356123 355316 282259 184110 256748 326301 280367 293693 245777
9031 245777 211286 141874 129860 199628 172814 126001 156917 251701 184261 189863 214223 207481
9019 207481 199542 222104 232664 138676 130349 191879 265920 207869 252868 256453 216833 208380
9007 208380 165462 177287 192112 249170 267819 208148 198049 184311 198573 208924 232632 263865
8995 263865 324864 261781 146651 129231 135261 178877 255160 252091 239771 253763 183973 92597
8983 92597 100979 163096 105313 91490 137870 167861 225532 234156 197256 164422 193424 252603
8971 252603 248622 268985 346585 410409 372821 298519 298514 283472 168269 185404 215929 277863
8959 277863 249171 328955 335146 270742 333726 411187 385839 358648 339896 396650 419569 404414
8947 404414 320046 221676 232251 332913 406470 435767 333269 306607 349942 313504 339541
8936 339541 374787 454359 468433 508621 562246 508989 462117 463985 462172 455132 471592 484233
8924 484233 559607 681964 696048 615684 597600 658171 691018 662041 603791 597301 623784 614350
8912 614350 614239 647124 716186 819359 947336 933483 938259 996440 1153597 1150521 1152463 1088839
8900 1088839 1115038 1216539 1319843 1424711 1480134 1604159 1640830 1708811 1736730 1856525
8890 1856525 2065416 2210593 2373286 2559598 2795407 3082711 3382970 3734297 3995872 4167777
8880 4167777 4279566 4334022 4246588 4061916 3787109 3523484 3248082 3047830 2906529 2733044
8870 2733044 2567230 2398476 2261052 2117032 2118017 2109694 2078755 2089156 2106560 2137295 2084493
8859 2084493 2110490 2124617 2158175 2168868 2167355 2347970 2461592 2534634 2562775 2747733 2963893
8848 2963893 3062430 3110564 3314150 3475843 3632008 3874663 4233442 4650627 5100844 5575504
8838 5575504 6220722 6823487 7309311 7649770 7837610 7769925 7413062 6954174 6355987 5691950
8828 5691950 5162896 4710496 4288518 3962464 3654894 3346108 3087401 2965371 2786626 2653132
8818 2653132 2553923 2468032 2433912 2309168 2192698 2051124 2078216 2181919 2203394 2189378 2241751
8807 2241751 2205951 2205755 2222619 2293813 2247557 2207813 2217627 2261900 2285231 2391939 2493594 2597878
8795 2597878 2665502 2741481 2997471 3160313 3344193 3645375 3858305 3934239 3881165 3784574
8785 3784574 3522894 3230402 2982224 2769611 2536546 2254720 1995653 1735136 1602560 1481573
8775 1481573 1292903 1226142 1139831 1086958 1015351 970678 1008559 1024475 899632 847347 780925
8764 780925 840340 893414 915655 833421 757835 712018 632623 536445 517208 629221 664982
8753 664982 648348 505001 426370 457045 378379 335423 351488 350037 284472 206405 266858 383436
8741 383436 423738 357079 317070 297424 284407 274238 259662 253507 187514 169433 246283 253939
8729 253939 274698 267064 269745 298107 293491 254207 171471 163496 249738 266587 232500 181898
8717 181898 149075 115011 161961 138306 147243 201957 175623 107349 66823 86587 118925 175912
8705 175912 225400 119046 9495 25134 105041 145236 104817 24518 -20016 75492 137437
8694 137437 145864 132756 114943 110910 177501 205144 161019 74286 66225 107520 130429 152733
8682 152733 158487 126614 81713 151734 60402 18798 41889 92573 126615 179651 139428 66713
8670 66713 29127 42005 21412 78523 123646 151415 159398 181365 136480 94561 96791 148058
8658 148058 200124 131081 65026 18582 -37486 -31636 98861 148762 160473 97169 55266 71688
8646 71688 96898 127271 213135 242824 209701 185183 191839 171666 71525 44348 41106 -5052
8634 -5052 -4740 56514 101324 133624 113827 110748 158313 188445 147501 116551 113324 161720 160761
8621 160761 156150 242682 292441 306729 291050 201709 173787 292371 280435 244087 138243
8610 138243 123290 94956 139023 204855 223949 253661 216865 226666 146262 125512 92275 107340
8598 107340 48731 137243 182648 106221 41415 40143 36516 55438 114539 92131 77982 88371
8586 88371 26773 46771 66071 27008 57401 89719 53755 62302 40936 -24201 -58431 -26569
8574 -26569 -10274 -7575 23923 50663 35885 168071 218391 193119 168771 98966 75104 62459
8562 62459 -26443 24832 118082 70726 99343 138214 83225 77661 34803 132068 194663 263753
8550 263753 324825 354791 280428 249744 219200 191492 202921 178096 71122 78825 88601 95692
8538 95692 133377 128253 104333 138385 136906 94245 9820 8437 40133 36159 102204 150752 121587
8525 121587 149291 149030 86450 -10651 -40566 3557 10304 -6253 7857 71955 61664 13136
8513 13136 -14143 10149 71243 15392 24251 -8589 -52120 34466 -15922 -54751 -101154 -96448
8501 -96448 15565 -5716 -53334 -72430 -55138 12575 74430 30610 -6180 -19878 -17878 18476
8489 18476 139219 97707 52912 31897 65106 114447 43271 26607 72671 14747 85633 60014
8477 60014 46933 50646 79213 62937 2004 -60973 -32114 -41955 -59299 -1440 -5633 -67302
8465 -67302 -70776 -38360 9959 -61899 -86374 -52883 -42166 66127 80417 42637 51143 121476
8453 121476 122585 131238 123094 99769 138321 160477 92362 83125 77227 163148 183182 152434 105864
8440 105864 111929 30380 31527 -5415 -22669 9213 60021 114432 50825 -401 29033 67257
8428 67257 112832 100131 65858 49072 103495 89942 112093 118802 127450 113921 57271 28696
8416 28696 58104 58139 24765 75594 105210 115584 129563 161152 128557 81257 17060 23779 93560
8403 93560 79363 42393 5969 38598 135919 133303 195136 247321 212712 167499 133636 66052
8391 66052 45449 55806 -22108 -69343 -67677 -10683 63380 143314 159325 109314 69402 23810
8379 23810 16000 -7656 51395 90109 91467 53932 -27500 35937 105049 88945 78202 154815
8367 154815 109748 142657 239319 193200 93592 -3293 3170 -16425 -83943 -64577 -64088 -61068
8355 -61068 -120790 -138725 -84276 -21971 -31059 32005 82936 34803 74636 147890 147621 168701
8343 168701 146241 89736 66975 65237 13515 18350 22616 -17691 -11761 -17363 -58289 -91321 -26620
8330 -26620 -31338 -69660 628 116334 108998 29289 42910 46244 31419 45771 82748 162635
8318 162635 230680 191710 135103 70322 5989 37805 109887 128873 48031 -23908 -2680 104426
8306 104426 102069 -113 7783 -1002 1306 -13032 -14293 43841 110906 90107 63175 46311
8294 46311 84077 123236 94958 2222 -19296 -26945 9391 104052 45102 16191 -27341 53557
8282 53557 141894 104952 92809 93128 40585 65488 128715 150887 198473 155742 98773 47285
8270 47285 52562 -21460 -46761 6417 56434 59639 60560 7897 4104 25118 77295 24774 -1320
8257 -1320 -86705 -87262 16090 121380 173298 167517 75989 26461 82266 53627 6423 5304
8245 5304 3387 46115 84582 71143 73478 83231 81616 48815 -8611 75152 99619 149196 130029
8232 130029 61890 -18421 -13863 27183 35929 19398 13994 37560 20760 -2500 28791 114959
8220 114959 134671 111678 118413 90470 75234 138160 112092 57402 10763 -16540 70681 193222
8208 193222 219149 175900 169893 167263 200241 191829 94414 74762 38032 -32522 -22459 41297
8196 41297 143515 94855 -11823 -34883 -17340 -10802 -30246 39604 71367 62877 121215 44290
8184 44290 21065 18774 34968 45845 59990 -18232 -11769 1106 -62162 -96997 -182170 -159917
8172 -159917 -91946 -75948 -60276 -102933 -152943 -163060 -136232 -121361 -46783 109014 93654
8161 93654 36772 37203 66514 109102 58846 -7189 -29400 -26104 -49038 -63825 -46136 -54689 -61910
8148 -61910 -91303 -72924 32001 84239 83918 86959 43224 -26513 -58154 17395 66034 123484
8136 123484 133335 94083 37808 3997 20028 51295 -10795 -23110 56275 80014 26268 -51845
8124 -51845 18791 123289 184372 169330 94291 24282 37799 46905 32137 100696 102866 60005
8112 60005 -17407 -62667 46775 140197 163323 113362 31289 -33013 -8897 76970 115018 81391
8100 81391 103169 131667 106312 -29602 -100774 -98948 -49640 -19099 27062 -22257 -10525 37
8088 37 -23761 -53175 16935 15901 8157 71672 1619 -40509 -2426 -34654 -46387 -43070 -815
8075 -815 77769 95282 59131 43031 57241 12688 -63974 -5970 -8958 -54213 -68427 -65697 -25417
8062 -25417 -19979 28840 100430 66327 -42516 6628 39049 -3089 13287 16709 55412 170076
8050 170076 229415 257237 166960 24243 -89669 -70507 -16767 17684 -98932 -57031 12832
8039 12832 37029 59491 22606 28287 35104 -16784 30327 30938 70660 37975 55595 47420 42945
8026 42945 117936 120332 111527 81063 17391 -23285 -4007 9341 23192 27483 69539 127805
8014 127805 55018 -23800 -2342 -3798 -82 6956 22520 5960 -42070 -7807 63174 53292
8002 53292 70820 176433 214258 113794 63069 38344 -13524 -24 -20672 -27707 -70877 -87182
7990 -87182 -161761 -158820 -31280 -40485 -53745 97478 82583 -5192 14623 79866 100251 42509
7978 42509 56170 26861 -62770 -102810 -121021 -66906 -44280 -126212 -116758 -149541 -179124 -182489
7966 -182489 -109612 -80029 -151694 -244108 -203560 -82244 -27198 -52663 -115362 -144182 -87000
7955 -87000 -23997 34696 41164 49085 17435 38759 90246 27158 24504 38629 137674 116556
7943 116556 11140 -14064 -31349 -19207 37494 58309 34905 20219 -43712 13482 -22758
7932 -22758 -111201 -122719 -90874 -25041 76485 17012 55696 63877 87518 153690 137998 87006
7920 87006 121944 206424 191774 139132 92799 129053 142115 104950 42154 -21209 -37421 66074
7908 66074 127951 80720 70528 -20291 -85369 -74870 -90679 -130594 -155276 -95233 -58611 29187
7896 29187 25549 15420 23837 20391 9376 -24158 39342 -6035 -47962 17855 -91396 -88120
7884 -88120 -24294 -3846 -4228 34615 112934 122878 130859 137156 154979 115524 -33311 -62419 -66374
7871 -66374 -78377 28260 81787 46032 -40857 25951 74953 80166 113884 71511 18426 -23066
7859 -23066 -5706 -63812 -165836 -160077 -49126 50900 36694 224 18116 115776 134846
7848 134846 82135 25207 10648 51672 -13187 -98595 -95203 -23110 -14487 -14824 -23672 -59068 14979
7835 14979 48038 57242 -73355 -63508 -19924 -51837 -3261 61760 32148 105353 91783 18266
7823 18266 -1417 7126 -2544 -7332 -76397 -113743 -95371 -17063 -35164 -57396 -59493 -57387 -97650
7810 -97650 -21623 26029 55924 42184 -12574 14553 42430 12907 -68043 -132089 -148988 -21195
7798 -21195 25023 -9075 5136 7004 6901 -31258 48656 59398 62696 11979 1088 79918 28455
7785 28455 -61134 -43270 71652 97341 47734 56924 -10254 33959 42540 19462 137610 141013
7773 141013 62123 63492 90781 139044 114199 23889 4724 61922 69275 66337 6325 -18098
7761 -18098 11965 51779 83811 -9527 -53645 -6319 26183 -23978 -56244 -49621 -50530 -78036
7749 -78036 -174437 -170710 -71013 -12582 -110764 -44638 37552 63925 24803 25963 12600 26079
7737 26079 28682 -4317 60616 62193 46905 36620 46914 -1808 -48519 -62522 -54602 16794
7725 16794 -16334 -36058 -54758 -30466 -42117 45903 82030 76498 39035 -35460 -62990 -61095
7713 -61095 -51993 -42206 -41496 -78066 -76348 -70513 -93662 -89333 -24263 26553 81396 90947 117206
7700 117206 36150 9052 -50553 -46690 -36294 5643 59472 24322 -39938 9099 80445 18683
7688 18683 -34224 32254 46589 20539 51582 65234 5999 -13688 -76512 -135663 -132534 -93300
7676 -93300 -137031 -178915 -164120 -116569 -52843 -37562 -68538 -110837 -162117 -103658 -86179 -111241
7664 -111241 -75185 -85571 -61300 -98689 -37819 -10830 -101278 -88501 -38632 -21090 28797 7889
7652 7889 -2783 85192 114197 98427 47058 2688 -57665 -63294 4380 96403 63540 -96904
7640 -96904 -172561 -97688 -68735 -71753 -106387 -130563 -147470 -170251 -166499 -131441 -132771 -104487
7628 -104487 17907 15746 -13887 12172 86931 73134 29896 -20182 -74174 -82044 -80890 -27748
7616 -27748 4217 -56696 -86221 -81971 -60681 -45401 -50834 -126481 -102988 -59301 -65141 -121354
7604 -121354 -81350 -20229 -59 -10099 98438 62485 15866 -71084 -94520 -100229 -96560 -35574
7592 -35574 -53982 -96150 -124009 -152785 -148155 -138898 -48716 40481 104630 160764 131707 58864
7580 58864 -6913 -4461 -773 -73462 -37657 -30790 -91365 -56864 -95390 -121105 -191174 -263791
7568 -263791 -238957 -238072 -180887 -140170 -22754 47198 67426 62062 -4991 -152485 -196024 -144914
7556 -144914 -148275 -161834 -63072 81150 96377 -41435 -69131 -71614 -75573 -77833 -47966 117
7544 117 -36278 -32924 -4683 -23284 17241 112020 126826 101179 129444 108299 3783 9626
7532 9626 9234 -36474 20089 55813 5409 -18462 -3487 2696 -2272 16055 20071 5594 86748
7519 86748 71752 19248 40046 44637 60400 18544 -24885 -76265 -109208 -117622 -126132 -100589
7507 -100589 32830 95281 29933 -41769 -50744 7284 59534 6838 -19416 -25844 -21674 -25720
7495 -25720 -10998 23413 45064 26526 35408 23259 27149 28806 65028 61785 6548 -18113 13672
7482 13672 59891 -10059 -19809 -25559 -148264 -160577 -152974 -82848 -40520 -55178 -108521 -144782
7470 -144782 -96125 -72473 -84426 -77495 -81905 -41041 1196 18212 -75058 -63653 -23554 -30822
7458 -30822 -27619 -53899 -22536 -10609 -47780 -9594 32417 47942 4462 -19547 -114063 -43085
7446 -43085 48861 62034 50779 15371 -136895 -212760 -160808 24482 132568 98757 32118
7435 32118 28950 -17498 -10495 -13720 -12263 14445 -20462 -86373 -56786 -34610 26107 -13990 -58581
7422 -58581 -1976 21121 25211 4772 -21793 -3545 22247 23524 44065 1944 25442 -4797
7410 -4797 7004 -29050 -27331 -22984 -97837 -116392 -23680 14851 4341 29587 44894 65703
7398 65703 60566 19210 -27337 -20043 16961 -98024 -84712 19391 -30007 -116448 -101276 -35657
7386 -35657 11051 733 37712 -5309 -72860 -55603 -33139 -87787 -164410 -140078 -95299 -58507
7374 -58507 -55225 -43822 35532 16680 -97538 -155212 -76975 43202 51734 124461 147404 47649
7362 47649 35099 82491 52767 83838 33605 32689 -19037 -84396 -13544 29869 48279 67974
7350 67974 65467 91159 66661 69900 62436 28135 -27963 -30177 128000 217032 137465 63999
7338 63999 105463 133916 120825 107157 121146 57740 68573 117187 60877 -41868 -142648
7327 -142648 -131278 -116474 -79171 -97871 -120775 -79758 -126356 -99527 -20435 3404 29676 143780
7315 143780 145047 129878 211749 128673 689 -58217 -93598 -116494 -140337 -158753 -117540 -128237
7303 -128237 -19196 51731 69065 66241 102577 203397 187020 59851 -20261 -43215 11048
7292 11048 92328 79932 55403 566 29892 33331 11339 48666 58576 21031 -32180 -33268
7280 -33268 22195 87597 115525 102751 51910 12146 35269 73213 77325 74521 30660 37088
7268 37088 -13782 -86684 -68172 -43231 -1158 85888 108403 -64663 -172208 -95512 -30584
7257 -30584 12388 74168 69940 18963 16969 23010 48106 67468 100768 130087 125221 76486 115893
7244 115893 103200 11517 -27082 -1657 33319 -43115 -80217 -32821 16221 35745 37858 41679
7232 41679 74618 34581 -65470 -43129 38014 -48666 -40746 -56946 -98268 -114819 -86599 1639
7220 1639 -2233 -43729 -113047 -118939 -109268 -102120 -90047 -79623 -92501 -45054 27718 35219 59975
7207 59975 16201 -18493 -53222 -55476 -22450 -16125 -4156 -19505 -98703 -89639 -73135 12970
7195 12970 99663 16364 -10379 51647 46073 -62287 -97877 -160781 -132635 -42743 -457 -2283
7183 -2283 -25729 -66885 -38820 9464 -23710 -31906 -82712 -85337 -24715 -32405 -72229 -59516 -87121
7170 -87121 -40722 61031 63495 68683 -6317 -31569 11318 -15065 -31135 -10272 -9668 -37846
7158 -37846 -31534 13346 -33060 -58126 -42823 -67886 -27763 -29850 -62766 -56603 -68719 -124114
7146 -124114 -185265 -167534 -91810 -126970 -140780 -137173 -100395 -60336 -7659 24484 -32044 -49281
7134 -49281 -13607 34403 -46765 -116012 -175849 -160894 -73434 -71453 -84545 -38742 8939 68826
7122 68826 69993 54026 34756 41046 69357 19819 1512 -54894 -83483 -53266 -9551 -28380
7110 -28380 -18247 -2 19035 -30366 2385 -18814 -86501 -62441 -90771 -92268 -13662 9192
7098 9192 -8332 -22939 -101993 -106275 -32470 -58567 -824 67184 81606 -55451 -145880 -106002
7086 -106002 -84332 -102690 -96638 -74122 -101919 -130328 -64851 -83727 -56417 -9309 63422 18737
7074 18737 -109061 -121089 -76077 -14254 68588 46929 -42383 -48536 -21525 -46170 -80163 -92497
7062 -92497 -146808 -132855 -41007 -10057 -23332 -113965 -109166 -31348 -41243 -37424 -19291 32238
7050 32238 -13228 -101352 -173325 -107951 -50689 4068 -13351 -41543 -103461 -220857 -174654 -113398
7038 -113398 -185580 -227860 -197861 -141316 -84030 40045 52511 3315 -29314 -93229 -148750
7027 -148750 -37073 47306 -11567 -122238 -43737 -40879 -82944 -90915 -64571 -17830 22526 -4323
7015 -4323 -40054 -46588 31608 130089 161067 176362 110160 89797 70921 47878 -36731 -60273
7003 -60273 -68879 -33237 26036 37868 82567 180393 170154 151949 103599 91723 51592 8901
6991 8901 -46364 -43485 -25183 -146070 -130826 -87722 -60454 -61258 -131922 -119346 -91988 -90275 -92616
6978 -92616 -86108 -54905 -80506 -129846 -166541 -270950 -260456 -177631 -152957 -133943 -120189 -41203
6966 -41203 -11291 -33471 -56838 -64006 -7567 29873 87132 47921 66603 46244 41062 2334
6954 2334 -6446 99233 86973 -96448 -131630 -38110 71679 64904 35532 -18485 14048 962
6942 962 -2478 -45112 -62625 -17157 49727 69653 -14279 -71835 -103337 -138464 -140752 -97516 -74520
6929 -74520 -110606 -66041 8627 114724 164210 179240 95623 34033 43196 6440 10320 35637
6917 35637 56310 12038 71517 119285 35904 -24900 -8490 -14069 -32540 10050 85261 111928
6905 111928 21509 -4141 -70875 -91361 -68556 -144294 -136158 -156901 -98785 -157651 -139621 -36495
6893 -36495 -106298 -106201 -113925 -74253 -80195 -147813 -143864 -155289 -52221 44166 84787 70078 66441
6880 66441 89272 34805 28202 197 -66334 -56477 -34935 -5619 7616 10203 -3559 41032
6868 41032 63893 98118 172023 191553 142381 66212 66685 21148 -53883 -105077 -128903 -93857
6856 -93857 -46067 8972 -18199 -32837 -39207 -15276 31777 -21660 -606 45801 29070 3942
6844 3942 -11957 39926 43898 -2300 -15041 -57322 -177086 -162060 -219992 -295817 -259769 -260849
6832 -260849 -191491 -128698 -112460 -75222 -149433 -150908 -152037 -131081 -40341 -109342 -154310 -98532
6820 -98532 -48193 -14429 32706 62944 8707 -9741 24251 24501 -58069 -124668 -83782 -5691
6808 -5691 -78067 -114067 -91146 -91559 -127858 -156933 -209413 -145194 -48868 -16388 -96469 -164616
6796 -164616 -127908 -56946 -18015 16535 -17449 -57961 -11891 52179 38767 -3323 8734 -21188
6784 -21188 -52339 -113414 -149420 -113988 -53820 -81025 -108298 -64437 29768 12600 22683 50414
6772 50414 26184 3450 -17127 -17284 -4864 53030 201134 202502 185997 230939 213620 165336
6760 165336 116150 50341 -31054 -17958 -89581 21965 9103 -90295 -148966 -163315 -101135
6749 -101135 -11115 -16160 -102993 -138777 4487 110399 148555 77285 18234 15921 -22100 -29298
6737 -29298 -19300 -18972 -72518 -66092 -40106 -27555 -9125 -52490 -30951 83582 104866 36192
6725 36192 -14171 20374 -62610 -106547 -57758 -48376 -39587 -24587 -44512 -43122 -14759 -18663 6467
6712 6467 -11004 15041 9963 -33911 -23681 -52750 -76223 -81339 32972 24109 -10950 11073
6700 11073 -15352 -19633 -8808 44157 47470 1909 -44929 -29115 23324 11010 -17043 -8617
6688 -8617 -28621 -53656 4976 35633 -1258 1585 2174 -12679 -1187 20913 27314 -3858 -47099
6675 -47099 -82740 -93347 -86488 -79200 -18181 -90501 -21929 -63642 -81669 -159632 -155766 -91987
6663 -91987 -76280 -63729 -126715 -118405 -56140 28252 5084 15301 10819 -70738 -122617 -121335
6651 -121335 -113985 -138636 -79857 -97941 -88158 3002 11131 -19468 -40445 -83167 -96219 -54059
6639 -54059 -29320 18624 -26869 -22169 2313 -20463 32415 48029 53911 48358 45598 16062 8541
6626 8541 -65429 -80981 9043 70775 43495 7948 -44831 -80928 -23655 -8769 -17609 -11701
6614 -11701 24297 -26257 -21191 -479 5776 -50736 -40928 -42121 -47928 -122321 -57409 124831 169508
6601 169508 134892 51765 3075 2220 36557 13962 -44657 -70760 -57828 35210 36086 -18408
6589 -18408 -49725 -84486 -49099 -6286 -30077 -167707 -222539 -144598 -152181 -76145 -22639 -16842
6577 -16842 -15150 7368 2170 -35338 -88540 -75583 -1904 12030 15691 90368 103283 63077
6565 63077 33700 44713 41498 36464 -1370 -58916 -37124 -49694 -104001 -169179 -123225 -131728
6553 -131728 -182184 -57341 5622 27482 43716 22206 43566 64265 26033 -41088 -116159
6542 -116159 -129889 -141627 -103529 -34466 40792 53278 28857 25216 -8320 -42787 7075 22382
6530 22382 -7827 -10464 -41202 -6757 38286 51895 51505 -56938 -40193 14566 27855 -58291
6518 -58291 -26428 -34979 11505 -49689 -101774 -92929 -102833 -126196 -98055 -112840 -200265 -170311
6506 -170311 -171131 -124644 -18680 -58641 -77590 20137 55929 114912 106632 28599 -3217 -24211
6494 -24211 3759 -60214 -58430 13082 48174 25266 -47474 -95173 -58527 -125331 -135864 -60473
6482 -60473 -36773 -9572 6988 14150 40867 42383 36753 -14487 -60888 -8155 42770 41058 126420
6469 126420 198144 115297 54666 87300 121968 127885 118947 88594 90143 75862 44639 56010
6457 56010 26358 -66140 -95092 -65412 -67985 -82567 -53412 -89695 -75587 -38612 -27130 -28738
6445 -28738 -18635 -52824 -76721 -84518 -66858 -106287 6381 62318 22948 -36001 -80686 -116589
6433 -116589 -101713 -88446 -84005 -125987 -210259 -193565 -191638 -189894 -80606 -29381 -44206 -19809
6421 -19809 -47526 -53826 -149623 -164938 -93647 -58186 -4473 21029 60102 167276 172326 147771
6409 147771 114352 88837 67486 21335 28359 -35920 -46682 -25571 12814 -18998 -29388 21010
6397 21010 -14675 6402 41492 23817 6914 -14390 -80359 -109103 -116509 -79627 -46027 -44091
6385 -44091 -56220 57447 109568 66261 45271 -20774 -30552 -3985 11693 28965 80534 55284
6373 55284 -18697 25385 9169 -13781 -34441 -35176 -26416 -61208 -71979 -8362 18170 -66717
6361 -66717 -104357 -68308 -40013 -73765 -14671 73266 104574 95307 88389 1596 -65022 -8076
6349 -8076 21091 80838 60595 4881 47355 92133 47052 -17523 6630 -29228 -22512 44125
6337 44125 102423 140677 116035 63035 -13137 52710 86442 -42612 -153944 -185562 -91593
6326 -91593 -89195 -151271 -120577 -62735 23232 94188 108693 73591 -42278 -50229 -46943 16657
6314 16657 41092 45443 116537 70345 72630 30790 56060 46929 30349 12078 -32830 -115891
6302 -115891 -106077 -62937 -43787 -127600 -133809 -169133 -121189 -52444 -91311 -146972 -176560 -158138
6290 -158138 -69097 -40521 6388 85345 101771 108171 83585 -25695 -61182 -65852 -41700 -93228
6278 -93228 -95494 -50838 -70823 -29052 10731 -32450 -60709 -29794 -48476 -56171 -15758 2719
6266 2719 52590 -2091 -65986 -12004 -20938 -51492 39372 86594 47960 22974 68348 148975
6254 148975 157090 145556 50871 112654 53255 57111 58886 64832 70683 -16822 -24549 2734 55558
6241 55558 54415 55594 28302 26968 -49323 -54088 1095 -12117 -64524 -21316 -5397 -915 -61274
6228 -61274 -116278 -112392 -157150 -140552 -165940 -175794 -180866 -111086 -90730 -62093 -64424 -48873 -43320
6215 -43320 -79820 -102800 -95448 -122628 -43639 50060 50039 68129 80728 83864 66296 33046 6257
6202 6257 -77290 -108835 -128072 -117836 -116178 -35603 -2227 29121 15034 -36473 -75639 -75885 -119711
6189 -119711 -122145 -156381 -154908 -117875 -83894 -106623 -91243 -63000 -22585 -49593 7018 32938
6177 32938 41264 57765 31521 -78737 -108110 -98981 -41881 16018 57261 -7045 -83521 -39501
6165 -39501 -36162 -47491 -49821 -46644 -65140 -34895 -1571 -52569 13728 -13168 -75491 -95010
6153 -95010 -59415 -54957 -69558 -84557 -64363 -34937 -83858 -110870 -96909 -199747 -202931 -87588
6141 -87588 -53411 -47846 -34846 -35440 -22087 -27954 -33510 -7327 128206 183594 78052 70051 52272
6128 52272 -17788 -73729 -37402 -40076 35806 126801 85444 9008 -55911 -53729 18217 125414
6116 125414 130080 139162 123148 105871 95239 44545 27346 29697 8022 -29644 -8513 -57306
6104 -57306 -180072 -189019 -47739 -54131 -57662 -30150 -57565 -73813 78389 93119 -24517 -95042
6092 -95042 -15430 30064 1407 -98385 -133112 -123553 -67653 -81408 -54425 -38208 -52468 -66182
6080 -66182 -105165 -128974 -156250 -174660 -128926 -79330 11742 114359 106461 63348 21540 37070
6068 37070 19775 -55883 14030 38847 -42865 -123375 -52113 -9426 -14377 -36440 -909 92669
6056 92669 58246 -29844 -80186 -85236 -53256 -54171 -78239 -90488 -74202 -25892 -17029 -58651 -93018
6043 -93018 -125603 -141283 -71517 -47026 3527 5649 -65805 -112707 -92075 -120935 -126835 -84451
6031 -84451 -147111 -177929 -39562 -7182 -36850 -43020 -62267 -30571 21756 97307 82496 77392
6019 77392 12308 18540 15889 58192 72739 41696 48059 88838 92590 110760 94063 115410 196041
6006 196041 151168 159315 108354 -20722 41428 113899 131304 55933 -13552 -53538 -16022 -49764
5994 -49764 -64060 -122989 -110990 -107809 -84604 -70645 -33085 -22175 22712 25087 48918 -2056
5982 -2056 -15174 -62791 -64677 -47941 -21796 -917 -5509 53714 17513 -18436 -45935 -17869
5970 -17869 32725 -19639 -44632 -66852 -135404 -149115 -127556 -100025 -72134 -145601 -170276 -45777
5958 -45777 -12975 -50368 43785 124617 35745 -22530 3919 -41275 -66147 183 34597 9239
5946 9239 39559 -39080 -129886 -73216 -53279 -77521 -43651 -35332 -60731 -72984 -61448 -35470
5934 -35470 -76126 -136185 -171714 -91929 -40317 -24053 -21514 73925 45988 -19145 -45524 43611
5922 43611 83855 27858 -28614 -44778 -103809 -107850 -141599 -79650 -23735 10554 53401 40595
5910 40595 19546 -4907 -1941 -9517 -23484 -50910 -64233 24230 -9111 -41190 -38124 -16294
5898 -16294 -18875 25681 32098 2451 5240 74882 40565 32400 63807 90039 41200 27060 26170
5885 26170 68514 -12314 -41595 -55549 -29995 -87815 -158507 -86727 -76507 -114996 -85594 -69887
5873 -69887 -44195 -44710 -81944 -53871 59243 49401 28842 3053 12013 87793 74507 10438
5861 10438 -21927 -38903 -28973 -46077 -38029 -21509 -65571 -132666 -93169 -5093 20584 -22535
5849 -22535 -16975 -87798 -37318 56974 118137 94298 42731 12731 -6651 -98363 -92689 -21735
5837 -21735 56684 -13603 -56333 -95815 -23031 7890 -19458 -16366 -76139 -147876 -148307 -124401
5825 -124401 -76038 -72647 -81706 -18173 53124 -5932 19871 -14905 -94624 -107101 -95805 -134489
5813 -134489 -66398 -2211 35238 -59324 -86981 -88780 -129401 -115168 -105881 -192117 -156903 -173706
5801 -173706 -192257 -134995 -47748 24028 75718 94758 218433 251119 137106 36777 -90778
5790 -90778 -127386 -78790 -96042 -66707 13959 31921 29710 -38824 -53588 -24153 -69851 -98718
5778 -98718 -114393 -177701 -146392 -113733 -113108 -149871 -142920 -132437 -124145 -148230 -104867 -89531 -115209
5765 -115209 -141490 -77418 -40639 -69488 -68782 3723 84564 12726 -52790 -30550 13215 111253
5753 111253 156513 47311 -77451 -45488 -20151 -12861 -91904 -73573 -72669 32220 44233 -17157
5741 -17157 -74453 -29424 -31455 -1104 31509 -32686 -60230 -52415 -68329 -1020 -47432 -105022
5729 -105022 -65042 37202 112463 81882 22761 26120 26235 -34247 -69366 -97328 -53810 -14594
5717 -14594 21726 137810 207913 87700 -7994 -33961 -86458 -23557 34623 17935 1293
5706 1293 -23834 -43801 -17831 56783 68797 54129 34533 -51671 -110249 -16652 9280 14518
5694 14518 102643 153815 153773 53165 31003 33963 15068 -30736 -107583 -55541 -37711 -80069
5682 -80069 -96732 -96073 -95158 -5838 75973 33248 -67940 -162843 -207030 -144445 -92509 -82530 -11731
5669 -11731 -31472 -130559 -198818 -162497 -193840 -169576 -82536 -119862 -80043 36026 -20396 -105020
5657 -105020 -221158 -149517 -99371 -68258 -36136 -32070 18905 -28668 -132424 -132337 -133443 -157011
5645 -157011 -189387 -180854 -193775 -153883 -99644 -114843 -77315 -14394 6768 -105990 -175657 -157338
5633 -157338 -54557 22312 43342 20271 -7287 44703 55922 65565 33463 -43458 -90483 -68801
5621 -68801 -75236 -32068 7304 -31590 -24248 65749 54429 88572 43122 71890 50612 28959
5609 28959 63428 62431 17814 19763 40523 16277 -3094 6545 810 -68857 -163162 -169340 -216263
5596 -216263 -174217 -128560 -60198 -26330 -51322 -83858 -108550 -97278 -103257 -107517 -89070 -31143
5584 -31143 -26544 -46059 -64923 -160786 -152261 -7824 -8636 -56344 -70445 -16601 12005 95957
5572 95957 71501 42131 -32634 -60429 -113321 -69112 -48217 40914 74310 51936 51271 8743
5560 8743 -43955 -48238 -63020 10174 50315 24082 47071 78523 133220 55346 60932 -8780
5548 -8780 -10486 -28977 -43073 -75839 -45359 -24056 -14766 -38355 -15566 42729 37938 -66193
5536 -66193 57504 154536 90505 24901 -26127 50643 51065 -603 63424 96608 119086 78024
5524 78024 28480 69869 41463 11645 30066 19724 10302 124968 104066 52972 -6906 -21930
5512 -21930 -29041 -23446 -12513 -6917 -37903 -485 25545 40762 9526 23768 -10374 -22166
5500 -22166 -487 -20793 54488 88249 43729 11122 -8317 -56162 -37807 -16436 -4737 34238
5488 34238 -16641 -68023 -66191 -98259 -181007 -188919 -185654 -144640 -71468 30918 13267 -23727
5476 -23727 -915 70271 29839 -53165 -67854 -25247 -53769 -78820 -113028 -120535 -167797 -56795
5464 -56795 -37615 -72779 -72885 -107700 -101794 -94970 -60269 -24378 51381 117961 25036 -148596
5452 -148596 -116619 -20966 7727 -1297 -43277 -35710 12160 18243 52262 -31 -30741 -19203
5440 -19203 11214 -22770 -78551 -56724 -71021 -55617 -8071 52862 47918 21606 -76052 -60594
5428 -60594 -39886 -60372 -81625 -62358 29353 172467 142386 86588 102263 22580 -11692 -30174
5416 -30174 -112482 -169039 -142309 -70690 -61753 -61384 -17643 -59483 -97736 -27868 41891 752
5404 752 47429 70256 18038 31628 119464 62758 -54346 -95623 -120729 -146830 -126794 -177704
5392 -177704 -160191 -47850 34595 44236 38861 74228 79261 22584 -76502 -130905 -103957 -77582
5380 -77582 -88195 -152640 -98752 21195 -48175 -81660 -51518 -31071 20394 25954 23580 36108
5368 36108 61258 73268 73919 143328 67288 10835 -80620 -67156 -77364 -63396 -154792 -218433
5356 -218433 -140773 -18218 63940 -4249 -72126 -124241 -130751 -103151 -43088 -8696 -34496 -119591
5344 -119591 -124061 -40842 -59074 -36054 -70215 -82550 -4860 65830 83048 9224 -88732 -54695
5332 -54695 -7770 4964 -82172 -1370 60300 30595 10335 17645 -1323 -12354 -59505 -86316
5320 -86316 -151667 -144320 -100285 -128953 -77135 -126898 -133431 -107178 -128432 -148218 -109557 -103198
5308 -103198 -93649 -18798 31532 13715 -59667 -119194 -105165 -41598 -44847 -59770 -73669 -9761
5296 -9761 28859 -1552 -9695 -15344 52076 80389 66094 -16569 -35222 3005 -86 7764 -38960
5283 -38960 -25356 -12718 37839 101343 127376 104665 27166 -30707 -40552 84300 89243 73126
5271 73126 59895 -13467 -42642 -34885 -49308 25064 21843 -71090 -117445 -14492 81532 110122
5259 110122 53612 -32641 -80124 -60804 24817 9645 -36782 -59997 9372 5826 8301 34284
5247 34284 21941 -12623 -25511 46575 14831 47743 166275 160031 120485 4839 -136121
5236 -136121 -168027 -153898 -187358 -170410 -158543 -208939 -151193 -77066 -100980 -85231 -24184 -8961
5224 -8961 -64714 -101266 -40164 -25166 -8898 1535 -3436 -27379 -55199 -66339 -71442 -41175
5212 -41175 -3184 -1489 -64414 -158471 -39901 20354 5092 3284 -43593 -85937 -92386 -130115
5200 -130115 -62584 -29107 45993 54872 26659 68020 97015 77210 40726 19195 3810 36396
5188 36396 33281 26239 28700 24657 -50155 -52903 -15409 -20845 -23713 -42378 -73463 -83916 -10531
5175 -10531 19728 17977 52313 17384 5203 60807 82470 58773 34109 -19547 87662 60607
5163 60607 -24462 9438 39294 61029 22760 -59167 -84227 -53127 -32592 80943 111305 163837
5151 163837 73236 8721 18616 7889 42922 21605 23575 -26732 -36331 -44068 -52210 32638 61091
5138 61091 47759 -1874 -37917 -59987 -99657 -114680 -84373 -44001 -14186 28303 -8934 -120356
5126 -120356 -85240 45059 1391 -79664 -810 12993 -34804 -36047 -14252 -43305 -62566 -57640
5114 -57640 -40417 19890 32417 18595 33492 100918 91396 38272 16872 20532 13525 56171
5102 56171 67083 -7698 22846 12588 -45903 -19177 -4006 -76081 -159282 -192784 -146233 -158022
5090 -158022 -152055 -143454 -128289 -104474 -44637 -31437 -36915 -20331 -3729 -25511 75831 81278
5078 81278 35725 79004 117687 -29979 -104142 -136241 -216870 -209336 -122861 -87416 -67321 -51826
5066 -51826 -26001 -85310 -103104 -125988 -113461 -90633 -65008 -85583 -85450 -91829 -72863 -73821 -75344
5053 -75344 -17692 -30845 -34547 -11139 3115 31082 14024 4023 51119 57751 -21602 -13292
5041 -13292 99845 170771 161507 27931 -24984 -14717 -30018 29175 149807 161797 64627
5030 64627 28214 -57916 -157989 -128054 -80261 14686 -65693 -53770 -86325 -67106 64677
5019 64677 52204 -27203 -70453 -31614 -27910 -62329 -35701 -13086 14511 -66845 -148324 -152964
5007 -152964 -126510 -183195 -122159 -110073 -99805 -18350 24541 14082 12985 23913 -70845 -37501
4995 -37501 -21721 -45154 -70989 -71107 -50755 -53948 -72442 -66181 -91143 -157839 -150180 -148169 -147224
4982 -147224 -154607 -154630 -160164 -98717 -7663 61186 134097 161750 109147 44986 -24662 -1371 50278
4969 50278 19227 -62807 -137786 -8009 15528 47807 33333 -32506 -73575 -129231 -80966 -44430
4957 -44430 -3697 -75234 -52772 -48355 -12515 -35085 -66960 -69108 -77373 -43916 13748 44887
4945 44887 -19153 -92637 -58052 -7610 31229 10297 34166 105196 70387 1913 -66435 -90100
4933 -90100 -104927 -145377 -41448 59601 34998 -22080 -37824 48036 41653 -39443 -55362 -13900
4921 -13900 -3289 12323 -87950 -142508 -164085 -164849 -101519 -81428 -79812 -55589 -115267 -77354
4909 -77354 -52837 -106713 17023 14076 -58142 -62834 20125 31581 46052 -38171 -164568 -161063
4897 -161063 -146183 -166270 -169456 -115858 -71876 -122922 -111865 24598 81135 4810 -7782 -21653
4885 -21653 15356 101191 84279 -36076 -71780 -44459 -13058 -18609 25294 56986 65611 59164
4873 59164 36675 30223 100292 89464 15016 6968 1621 58985 48380 26393 32213 -40903 25939
4860 25939 43017 -18709 -80144 -155142 -170841 -76800 -98219 -54136 6427 -57339 -63444 20958
4848 20958 34712 57906 162927 182528 75715 136446 127582 83925 -26811 -110043 -121252
4837 -121252 -69146 -71301 -38450 -8464 -2287 -58292 -85438 -38031 87424 83075 50736 30870
4825 30870 2499 -48036 -52928 -29641 21562 100563 180777 104755 17111 73587 62572 28636
4813 28636 28946 31319 65441 81562 162748 193602 148018 88297 56947 91643 22650 -38585
4801 -38585 -73721 -106751 -134431 -120253 -101584 -111442 -53618 -10344 62873 33304 -42072 -25774
4789 -25774 -5166 131 -64166 -93106 -88114 -58834 -16984 -38562 -65045 -47476 -73321 -13472
4777 -13472 82907 92437 62841 7597 -21354 11787 -30929 -76563 -58666 -26637 -66427 -27354
4765 -27354 19594 -10712 -28512 -24144 5812 -10659 -104700 -91078 -34504 -8652 8693 -44887
4753 -44887 -57659 -89986 -114409 -155702 -42199 22348 19111 28478 51269 39746 78393 72759
4741 72759 4469 -133585 -223500 -172127 -70826 27724 30948 -34868 -71333 -73441 -100087 -166393
4729 -166393 -170340 -119696 -104615 -71441 -23347 22364 -49336 -101016 -86741 -85163 -127394 -70674
4717 -70674 36475 60204 -21332 -172720 -139969 -64836 -72384 -27662 51419 40472 36436 50531
4705 50531 51908 49262 33070 -38978 -81112 582 2599 -8046 36149 37205 10853 -470 36007
4692 36007 97022 109539 65288 93270 97332 125205 104728 78140 83303 151491 100396 82327
4680 82327 80751 14883 -8725 74860 33424 -73190 -11974 37354 62967 20038 -29239 63403
4668 63403 153208 218030 158574 -27710 -51494 38733 95643 131049 63149 10303 -131981
4657 -131981 -66492 23416 127111 117819 110905 10201 -24334 -18791 35441 112897 208728 190300
4645 190300 157792 105971 4583 -62826 -127244 -168375 -108253 -64784 -119298 -33865 -5297
4634 -5297 -40197 27216 17629 19973 33894 -3981 -20086 21793 6097 54267 130374 155502
4622 155502 157026 53180 -38189 -52567 -47967 -23518 -2013 -17245 47058 131188 35135 -22040
4610 -22040 23892 77034 14877 -32882 -104743 -136457 7124 181235 109969 46372 75378
4599 75378 93425 53562 -15692 -79521 -10016 39456 -5210 -54074 -47401 -59813 -30088 -4362
4587 -4362 22812 16964 76503 49285 59202 23531 15419 21764 52551 114050 83533 38417 41464
4574 41464 -42456 -18062 62193 178820 203659 202408 125937 64046 44538 -44092 -110385 -45007
4562 -45007 -246 -20352 -76601 -90890 -66594 -59121 34066 -4144 -75967 -60505 -110948 -199408
4550 -199408 -221775 -147884 -110098 -35044 -65737 -77423 -24653 10235 -55360 -106597 -57311 -71768
4538 -71768 -42895 -62706 -67101 -41963 -9500 5564 -25264 -33923 -5715 -56950 -76231 -25596
4526 -25596 11085 -16113 -90285 -102205 6633 75760 106807 -6616 -111658 -71177 52306
4515 52306 73438 13472 10725 61426 42992 -8706 -53096 -95222 -83814 -117595 -100107 -85950
4503 -85950 -68934 11410 4376 7556 -10171 -66967 14057 84955 118412 51916 -46361 18834
4491 18834 134928 108902 56799 -14247 -70150 -107178 -85065 -66580 -76645 -42761 1518 -44341
4479 -44341 -57507 9903 94093 59496 116960 94774 20516 -41066 25386 26687 -112850 -160280
4467 -160280 -98985 -54083 -75255 -18824 33244 41598 -57821 -110185 -55898 26346 11739 8909
4455 8909 23112 -12128 -18717 -32039 4774 87285 47944 -54229 -110431 -71643 29255 113783
4443 113783 189642 152815 76185 -91757 -230315 -313119 -220805 -107826 -97003 -111402 21038
4432 21038 106800 119190 114926 87197 26722 -38702 -1068 44296 -28649 -17850 -8822 -82173
4420 -82173 -150488 -93491 -36861 -5600 15834 35287 77224 35790 47268 2239 35031 95853
4408 95853 34052 58358 121009 67358 23813 54610 82546 6470 -38008 -52142 -21445 -33311
4396 -33311 -92292 -30806 -20274 -36454 29562 12691 -45152 -53581 -47279 -105891 -74695 -99865
4384 -99865 -111207 -11631 38986 -29750 -26163 -16315 -23150 -39504 21045 16422 -28318 -28728 -57835
4371 -57835 -132599 -118908 -63388 -9587 -24518 22234 51341 11034 50375 23554 -43339 -132637
4359 -132637 -100555 -57419 -41690 38556 27556 -21053 -92988 -41856 9656 20079 22106 -23378
4347 -23378 -94889 -83357 -90341 -132560 -154241 -31253 -13846 -34597 -54692 -28404 -9113 36845
4335 36845 43935 17725 6214 -6336 -27424 11127 41737 12231 37682 108342 84921 46945
4323 46945 -7841 119391 182705 166270 175465 192784 143738 78263 51168 66233 138044 56920
4311 56920 62980 110006 133036 70474 -15419 -113425 -51191 -32352 -94385 -112630 -93894 -43839
4299 -43839 -3534 -30669 -112530 -109372 -100915 -117018 -70763 -13959 112737 103018 775 -47213
4287 -47213 9813 31892 -42441 -39748 -26197 -42450 -67809 -17539 -77964 -133506 -159477 -82737
4275 -82737 -42622 -62671 -77682 -107439 -96822 -173807 -195604 -53837 3693 8727 24420 -12702
4263 -12702 -5706 11285 78294 1687 -13823 -9450 9687 42457 24873 19407 108384 29029
4251 29029 -11345 64832 5398 -29684 3568 -1312 57640 -354 -96102 -147897 -139365 -65226
4239 -65226 -57764 -123500 -126335 -153840 -106494 -54170 -50543 -24783 -9517 -77744 -107056 -107868 -100784
4226 -100784 -49333 27495 24985 1644 8819 -49171 -73094 19040 34821 -12713 -7716 -2010
4214 -2010 28172 -66311 -38069 6025 24376 53567 -38613 -74885 -64561 -42212 -3341 43076
4202 43076 23257 -15517 -36592 -95397 -109779 -135862 -70780 78733 37471 -26261 -4124 -18236
4190 -18236 28049 30951 -48543 -45794 -7156 73666 122838 95588 38184 -54206 -62788 -44673
4178 -44673 -55512 -100992 -96234 -173075 -178772 -140365 -88651 28137 122159 144117 149744 66785
4166 66785 24666 43426 95426 77272 43997 72241 133742 156926 59686 -35590 -44370 87500
4154 87500 80720 2436 -34315 -88914 -126588 -92770 34165 47981 37889 41676 -26561 23694
4142 23694 -6827 -70337 -12135 38846 37351 28970 45275 34743 37038 45797 4828 75089 97240
4129 97240 93825 86501 138470 118508 56473 -61547 -52987 -20443 -34435 -83138 -103206 -93002
4117 -93002 27236 84646 36711 29858 10652 6871 -13317 -15558 -83516 -88163 -10714 -19388 39952
4104 39952 53657 -28129 -27642 11569 -50516 -64816 10031 -3096 -57466 -13826 -2661 72773
4092 72773 82288 48613 75454 43433 40767 57483 -57062 -55271 21940 34745 15961 23968
4080 23968 -17935 -30843 -38742 11710 32237 20720 67806 108181 104622 58867 102981 21105
4068 21105 -102936 -101354 -60639 12311 58696 48867 55410 80928 73377 -18484 -25469 25957 78513
4055 78513 25787 90060 86991 175995 180489 176461 92462 73432 97006 36389 19809 54483
4043 54483 66007 42081 11214 665 70436 100166 12635 -7002 40321 43414 47755 29710
4031 29710 55097 5829 8115 28132 -11631 -69326 -66150 -62167 -27130 -86953 -56349 17651
4019 17651 50695 -15953 -67922 -63492 -72697 -134770 -73401 -13611 40093 59426 60342 -19601 -20091
4006 -20091 14090 6540 21437 26969 -16315 -113641 -135569 -125581 -171529 -148775 -119238 -100095
3994 -100095 -77709 -72915 283 -27519 -2001 -246 -51507 -95834 -135724 -152264 -85781 9212
3982 9212 33826 40885 19690 -6 29875 16981 37205 14198 892 -7737 -52552 -57408 -41621
3969 -41621 -67315 -83026 -290 30031 69325 4677 -24476 -1642 25559 -35615 -82988 11188
3957 11188 62974 102020 88401 68369 21330 10274 8235 81294 116731 127006 124994 88670
3945 88670 -32612 -4985 24730 29418 2890 -49205 -33427 -14705 84434 -1906 -12689 42922
3933 42922 88643 87174 92334 89018 38662 115401 152617 189494 135101 142359 81240 -24433
3921 -24433 -51347 -88408 -48141 -5805 -59661 -89401 -88541 -24607 -4676 -5264 -7941 1842 24672
3908 24672 78105 80732 -6196 -81594 -108736 -79987 -28127 -132398 -157073 -94896 -69445 -114671
3896 -114671 -130893 -60056 -70544 -105708 -95915 -47676 -12709 -1489 34005 59605 -1235 -58575
3884 -58575 -16177 -31707 -54264 -21575 -107820 -158627 -106394 -20956 26520 -38720 -54777 -76735
3872 -76735 -44603 -37786 70396 87270 75908 93985 55915 4567 15443 144771 171231 114069
3860 114069 52885 46805 -4561 -64253 -89128 -169165 -200615 -149211 -149855 -96170 -45697 35719
3848 35719 96618 11790 -14091 11961 -16750 -51479 -69741 -117573 -41729 -2634 -35857 -98523
3836 -98523 -140222 -128088 -167909 -171253 -86483 46339 34605 -34600 -50338 -2705 59409 -23844
3824 -23844 -117321 -143784 -137093 -77609 -22407 12151 -31117 25770 25267 -19472 -59280 -74276
3812 -74276 -59025 -84004 -24736 -16263 -44750 -100753 -121078 -77103 -74055 -42978 -10539 11283
3800 11283 -10356 64485 114486 99291 110859 137113 102796 106216 158420 85308 41287 -8424
3788 -8424 -37388 -18936 32578 46620 52135 -20696 -58469 -31204 28907 109870 146956 77061
3776 77061 19300 -62151 -29862 711 -18917 -83713 -147517 -123611 -53378 31524 151105 86146
3764 86146 56300 44403 -7437 -110014 -127917 4702 -25177 -135680 -76893 -31253 49159
3753 49159 108686 69404 61358 90730 -8439 -67430 -25313 98414 176508 163721 77730 -38122
3741 -38122 -74265 -105894 -179490 -198455 -99705 42385 83866 78551 -1612 -30021 -111149 -130991
3729 -130991 -51580 -68548 -99880 -25989 52941 10531 19310 7124 -44564 -44342 38836 41498
3717 41498 -35170 -23347 17099 1042 20200 61003 90065 32617 -32318 -23222 -6449 -1583
3705 -1583 -46884 -34638 39297 -31 10193 -28652 -91242 -120498 -94183 -62172 -11237 -23286
3693 -23286 -83352 -63335 -7163 68307 58002 32006 -13930 -47403 -43254 -5631 9257 46282
3681 46282 -21193 -110957 -119407 -89879 -116243 -35552 931 -57843 -110070 -111004 -78041 -23878
3669 -23878 27315 43224 -29239 -94005 7563 74238 -32140 -73202 -101839 -36186 37903
3658 37903 38731 -21408 30694 -2642 -37835 -101359 -72504 -86438 -71367 12664 42933 55610
3646 55610 71692 68575 108774 18213 -42974 -25442 7606 11086 25756 9890 4713 45771
3634 45771 32923 69170 96863 95299 93538 102442 186115 192071 84845 -53255 -94498 -124240
3622 -124240 -137755 -88250 -50552 10969 -912 33627 105206 70624 90780 75808 28545 24715
3610 24715 52432 45539 -54521 -100505 -14010 7770 35401 32470 -23711 -67635 -17334 133246
3598 133246 125128 138171 146393 74419 -715 9555 -33112 -44154 -28785 -11905 -21831 -21543 -26219
3585 -26219 47051 73374 1242 -16146 57526 118520 101958 -7054 -56942 -14464 67001 78674
3573 78674 106118 149525 143460 97891 56061 -15656 -20893 -20159 -88697 -41585 -13048 18841 10096
3560 10096 -78256 -220276 -119896 -27689 -31206 -11146 -21269 41641 119093 107625 18635 -43149
3548 -43149 -61920 -62435 -65485 -26908 -80828 -59690 -48430 45437 62952 20906 -25704 14741
3536 14741 -9081 14028 18431 17047 84006 75354 21450 -37220 -81734 -14974 28706 31343 86335
3523 86335 46337 -8164 -125732 -86367 -148 -3568 -4395 -27976 -68876 -64328 21525 40058
3511 40058 27852 -55537 -65946 -92579 -106280 -162079 -208090 -218247 -193203 -154935 -65517 42924
3499 42924 87179 102061 65100 15951 15924 -2798 -30796 -77665 -67296 -24546 42413 -18981
3487 -18981 -174092 -258942 -275814 -99331 -52026 -7883 -6880 -56166 -126674 -84638 -21453 -114742
3475 -114742 -168778 -102129 -80453 22725 82303 121607 77572 4164 -53859 -68866 -58015
3464 -58015 -89191 -101108 -55631 -78049 -113296 -56694 -64263 -93672 -35988 10175 -13992 -115069
3452 -115069 -48516 -28631 -151748 -173702 -128499 -111491 -36642 -31492 -99412 -130594 -116555 -42750
3440 -42750 48462 12100 3341 59638 89455 130159 50273 -5267 3222 3433 55812 75642 37494
3427 37494 -57112 -60698 -56608 -55185 -14083 -12020 -6229 -16930 -25196 -39688 -4238 -25217 -62336
3414 -62336 27156 104928 68273 6961 9506 7060 -21296 -74589 -102320 -127449 -76691 -92101
3402 -92101 -109824 -97697 -82572 -20012 14007 23527 -14635 35979 -4864 -101915 -146564 -144003
3390 -144003 -97100 -35208 44278 -7169 -90041 -29570 -46229 -79575 -94696 -68378 -45121 -90516
3378 -90516 -116732 -79779 -16018 25936 59420 -10682 -30415 14086 10231 48616 57619 -27174
3366 -27174 8974 27120 56071 74446 -22851 -149973 -176056 -82030 -42264 9292 -32844 -158455
$$ [...]
##END NTUPLES=NMR SPECTRUM
##END=
