##TITLE=Analysis number 312398
Compound Code km 02997
Project Code adrs
Chemist Name stores
##JCAMPDX= 6.0         $$ Bruker NMR JCAMP-DX V2.0
##DATA TYPE= NMR SPECTRUM
##DATA CLASS= NTUPLES
##ORIGIN= Bruker BioSpin GmbH
##OWNER= NMR
$$ XWIN-NMR		Version 3.5
$$ Wed Aug  3 12:14:03 2005 GMT Daylight Time (UT+1h)  MAYBRIDGE\NMR@NMR_250MHZ
##.OBSERVE FREQUENCY= 250.131544655141
##.OBSERVE NUCLEUS= ^1H
##.ACQUISITION MODE= SIMULTANEOUS (DQD)
##.ACQUISITION SCHEME= undefined
##.AVERAGES= 16
##.DIGITISER RES= 18
##SPECTROMETER/DATA SYSTEM= dpx250
##.PULSE SEQUENCE= zg30
##.SOLVENT NAME= CDCl3
##.SHIFT REFERENCE= (INTERNAL, CDCl3, 0, 16.522)
##AUDIT TRAIL= $$ (NUMBER, WHEN, WHO, WHERE, WHAT)
$$ ##TITLE= Audit trail, XWIN-NMR		Version 3.5
$$ ##JCAMPDX= 5.01
$$ ##ORIGIN= Bruker BioSpin GmbH
$$ ##OWNER= NMR
$$ C:\u/data/dgb/nmr/ADRS/7080/pdata/1/auditp.txt
$$ ##AUDIT TRAIL=  $$ (NUMBER, WHEN, WHO, WHERE, WHAT)
(   1,<2005-08-03 12:13:44.89 +100>,<MAYBRIDGE\NMR>,<NMR_250MHZ>,
      <created by zg, POWCHK disabled, PULCHK disabled
       configuration hash MD5:
       62 19 C7 07 E1 42 D1 B7 37 6C 3D D0 77 39 F9 E6
       data hash MD5: 64K
       B4 BA 56 4F 48 34 9E 6C A9 9F E6 E1 7A 2D 05 DF>)
(   2,<2005-08-03 12:13:56.01 +100>,<MAYBRIDGE\NMR>,<NMR_250MHZ>,
      <Start of raw data processing
       ef LB = 0.3 FT_mod = 6 PKNL = 1 SI = 32K 
       data hash MD5: 32K
       31 4E 1A F4 72 57 40 BC D6 0F F0 6E 5E A3 55 54>)
(   3,<2005-08-03 12:13:57.65 +100>,<MAYBRIDGE\NMR>,<NMR_250MHZ>,
      <apk 
       data hash MD5: 32K
       75 87 4B 15 9C BD 46 60 91 5F 3D E1 3E 85 A7 5A>)
(   4,<2005-08-03 12:13:58.37 +100>,<MAYBRIDGE\NMR>,<NMR_250MHZ>,
      <abs ABSG = 5 
       data hash MD5: 32K
       26 7F 5D DC 59 7C F5 1D 5D B7 16 F0 46 E0 46 EB>)
$$ ##END=
$$ 
$$ hash MD5
$$ DC A6 E8 9E AD E6 5D 86 F7 39 9D 73 76 DC 49 90
##$RELAX= 
##$RELAX= 
##$RELAX= 
##$RELAX= 
##$RELAX= 
##$RELAX= 
##$RELAX= 
$$ Bruker specific parameters
$$ --------------------------
##$DU= <C:\u>
##$EXPNO= 7080
##$NAME= <ADRS>
##$PROCNO= 1
##$TYPE= <nmr>
##$USER= <dgb>
##$AMP= (0..31)
100 100 100 100 100 100 100 100 100 100 100 100 100 100 100 100 100 100 
100 100 100 100 100 100 100 100 100 100 100 100 100 100 
##$AQSEQ= 0
##$AQ_mod= 3
##$AUNM= <au_zg>
##$AUTOPOS= <14 >
##$BF1= 250.13
##$BF2= 250.13
##$BF3= 250.13
##$BF4= 250.13
##$BF5= 500.13
##$BF6= 500.13
##$BF7= 500.13
##$BF8= 500.13
##$BYTORDA= 1
##$CFDGTYP= 0
##$CFRGTYP= 5
##$CHEMSTR= <none>
##$CNST= (0..31)
1 1 145 1 1 1 1 1 1 1 1 1 1 1 1 1 1 1 1 1 1 1 1 1 1 1 1 1 1 1 1 1 
##$CPDPRG= <>
##$CPDPRG1= <>
##$CPDPRG2= <>
##$CPDPRG3= <>
##$CPDPRG4= <mlev>
##$CPDPRG5= <mlev>
##$CPDPRG6= <mlev>
##$CPDPRG7= <mlev>
##$CPDPRG8= <mlev>
##$CPDPRGB= <>
##$CPDPRGT= <>
##$D= (0..31)
0 1 0 0 0 0 0 0 0 0.06 0 0 0 0 0 0 0.0002 0 0 0 0 0 0 0 0 0 0 0 0 0 0 
0 
##$DATE= 1123067624
##$DBL= (0..7)
120 120 120 120 120 120 120 120 
##$DBP= (0..7)
150 150 150 150 150 150 150 150 
##$DBP07= 0
##$DBPNAM0= <>
##$DBPNAM1= <>
##$DBPNAM2= <>
$$ [...]
##$SUBNAM7= <"">
##$SUBNAM8= <"">
##$SUBNAM9= <"">
##$SW= 20.6930455092707
##$SWIBOX= (0..15)
0 0 3 0 0 0 0 0 0 0 0 0 0 0 0 0 
##$SW_h= 5175.983436853
##$TD= 65536
##$TD0= 1
##$TE= 295.16
##$TE2= 300
##$TE3= 300
##$TEG= 300
##$TL= (0..7)
0 120 120 120 120 120 120 120 
##$TP= (0..7)
150 150 150 150 150 150 150 150 
##$TP07= 0
##$TPNAME0= <>
##$TPNAME1= <>
##$TPNAME2= <>
##$TPNAME3= <>
##$TPNAME4= <>
##$TPNAME5= <>
##$TPNAME6= <>
##$TPNAME7= <>
##$TPOAL= (0..7)
0.5 0.5 0.5 0.5 0.5 0.5 0.5 0.5 
##$TPOFFS= (0..7)
0 0 0 0 0 0 0 0 
##$TUNHIN= 0
##$TUNHOUT= 0
##$TUNXOUT= 0
##$USERA1= <user>
##$USERA2= <user>
##$USERA3= <user>
##$USERA4= <user>
##$USERA5= <user>
##$V9= 5
##$VALIST= <valist>
##$VCLIST= <CCCCCCCCCCCCCCC>
##$VD= 0
##$VDLIST= <DDDDDDDDDDDDDDD>
##$VPLIST= <PPPPPPPPPPPPPPP>
##$VTLIST= <TTTTTTTTTTTTTTT>
##$WBST= 1024
##$WBSW= 4
##$XGAIN= (0..3)
0 0 0 0 
##$XL= 0
##$YL= 0
##$YMAX_a= 157427
##$YMIN_a= -128877
##$ZGOPTNS= <>
##$ZL1= 120
##$ZL2= 120
##$ZL3= 120
##$ZL4= 120
##$ABSF1= 16.522
##$ABSF2= -4.171173
##$ABSG= 5
##$ABSL= 3
##$ALPHA= 0
##$AQORDER= 0
##$ASSFAC= 0
##$ASSFACI= 0
##$ASSFACX= 0
##$ASSWID= 0
##$AUNMP= <proc_1d>
##$AZFE= 0.1
##$AZFW= 0.1
##$BCFW= 0
##$BC_mod= 0
##$BYTORDP= 0
##$COROFFS= 0
##$CY= 12.5
##$DATMOD= 1
##$DC= 0
##$DFILT= <>
##$DTYPP= 0
##$F1P= 14.0000005364418
##$F2P= -0.99999901652339
##$FCOR= 0.5
##$FTSIZE= 32768
##$FT_mod= 6
##$GAMMA= 0
##$GB= 0
##$INTBC= 1
##$INTSCL= 1
##$ISEN= 128
##$LB= 0.3
##$LEV0= 0
##$LPBIN= 0
##$MAXI= 10000
##$MC2= 0
##$MEAN= 0
##$ME_mod= 0
##$MI= 0
##$NCOEF= 0
##$NC_proc= -4
##$NLEV= 6
##$NOISF1= 0
##$NOISF2= 0
##$NSP= 0
##$NTH_PI= 0
##$NZP= 0
##$OFFSET= 16.522
##$PC= 1
##$PHC0= -71.3408
##$PHC1= 0.4377533
##$PH_mod= 1
##$PKNL= yes
##$PPARMOD= 0
##$PSCAL= 4
##$PSIGN= 0
##$REVERSE= no
##$SF= 250.13
##$SI= 32768
##$SIGF1= 0
##$SIGF2= 0
##$SINO= 400
##$SIOLD= 32768
##$SREGLST= <1H.CDCl3>
##$SSB= 0
##$STSI= 32768
##$STSR= 0
##$SW_p= 5175.98343685301
##$SYMM= 0
##$S_DEV= 0
##$TDeff= 65536
##$TDoff= 0
##$TI= <Analysis number 999999
Compound Code 99
Book Reference 9
Project Code 9>
##$TILT= no
##$TM1= 0
##$TM2= 0
##$TOPLEV= 0
##$USERP1= <user>
##$USERP2= <user>
##$USERP3= <user>
##$USERP4= <user>
##$USERP5= <user>
##$WDW= 1
##$XDIM= 32768
##$YMAX_p= 274978607
##$YMIN_p= -745150
$$ End of Bruker specific parameters
$$ ---------------------------------
##NTUPLES= NMR SPECTRUM
##VAR_NAME=  FREQUENCY,     SPECTRUM/REAL,   SPECTRUM/IMAG
##SYMBOL=    X,             R,               I
##VAR_TYPE=  INDEPENDENT,   DEPENDENT,       DEPENDENT
##VAR_FORM=  AFFN,          ASDF,            ASDF
##VAR_DIM=   32768,         32768,           32768
##UNITS=     HZ,            ARBITRARY UNITS, ARBITRARY UNITS
##FACTOR=    0.157963299565203, 1,           1
##FIRST=     4132.6476996994, 0,             0
##LAST=      -1043.33573715361, 0,           0
##MIN=       -1043.33573715361, -745150,     0
##MAX=       4132.6476996994, 274978607,     0
$$ Real data points
##PAGE= N=1
##DATA TABLE= (X++(R..R)), XYDATA
$$ [...]
$$ plain form
23334 -238056 -122126 3276 -104764 -129578 -121168 -228045 -194588 -164014 -260527 -233600 -181696
23323 -181696 -310281 -232193 -279112 -271801 -196832 -183196 -159925 -199641 -171725 -89108 -17680
23312 -17680 -141269 -184060 -123331 -55202 -51706 -145697 -183380 -136630 -223408 -174533 -72149
23301 -72149 -115699 -174785 43868 71832 -35073 112764 121991 -22409 -20212 -72234 -202328
23290 -202328 -212795 -40861 -104747 -35669 64566 -68449 -233478 -175665 -26525 -45686
23280 -45686 -104585 -79270 93413 125181 70782 -27410 -62077 -5184 -121278 -202705 13226
23269 13226 48809 -69443 -108537 -137475 -65941 -53301 -95515 89915 209774 164889 322608
23258 322608 360686 106062 -61034 -129029 -224313 -66376 78717 84284 117022 106464 -125259
$$ packed form
23334b38056J15930J25402j08040k4814Q410j06877L3457L0574r6513K6927N1904
23323a81696j28585P8088m6919P311P4969J3636K3271l9716K7916Q2617P1428
23312a7680j23589m2791O0729O8129L496r3991l7683M6750q6778M8875J02384
23301g2149m3550n9086K18653K7964j06905J47837R227j44400K197n2022j30094
23290b02328j0467J71934o3886O9078J00235j33015j65029N7813J49140j9161
23280d5686n8899K5315J72683L1768n4399r8192l4667N6893j16094q1427K15931
23269A3226L5583j18252l9094k8938P1534J2640m2214J85430J19859m4885J57719
23258C22608L8078k54624j67096o7995r5284J57937J45093N567L2738j0558k31723
$$ plain form
23247 -125259 -189328 -229134 -91972 -822 -137818 -98243 7756 -194638 -295051 -161850
23237 -161850 -107317 41122 -5418 -92441 -74392 4135 61509 101549 38918 -156182 -256390
23226 -256390 -243345 -224730 -85167 60838 -23882 -67350 -30594 19678 -156327 -222370 -216942
23215 -216942 -152059 -105441 -24389 116305 218845 172444 310560 298673 187935 190244 262004
23204 262004 162068 -14861 -78536 -252212 -242810 -223408 -290685 -99097 -161365 -205747 -161105
23193 -161105 -18916 84190 35321 -137800 -234724 -195956 -166203 -219298 -231110 -91242 -100821
23182 -100821 -32469 -23858 -130682 -149129 -68196 -103384 -72368 99422 233455 132713 86953
23171 86953 -14388 -120868 -184547 67842 59482 -35102 33090 158147 194603 12383 -81165
$$ packed form
23247a25259o4069l9806J37162R1150j36996L9575J05999k02394j00413J33201
23237a61850N4533J48439m6540q7023J8049P8527N7374M0040o2631j95100j00208
23226b56390J3045J8615J39563J46005q4720m3468L6756N0272j76005o6043N428
23215b16942O4883M6618Q1052J40694J02540m6401J38116j1887j10738K309P1760
23204B62004r9936j76929o3675j73676R402J9402o7277J91588o2268m4382M4642
23193a61105J42189J03106m8869j73121r6924L8768K9753n3095j1812J39868r579
23182a00821O8352Q611j06824j8447Q0933l5188L1016J71790J34033j00742m5760
23171H6953j01341j06480o3679K52389q360r4584O8192J25057L6456j82220r3548
$$ plain form
23160 -81165 53747 -25606 -11757 -30066 -40821 58636 17364 -141434 -162574 -73952 77298
23149 77298 204683 172721 6356 -223989 -364866 -251502 -100889 -118295 -82437 -112390
23139 -112390 -325265 -381487 -364577 -297965 -222688 -66355 17545 -17631 13435 117728 -7430
23128 -7430 -145145 -208688 -148738 -303832 -276405 -27644 -75714 -235274 -89361 56765 103661
23117 103661 197813 166143 151203 133802 9196 -171402 -144573 -50072 98704 -117970 -378782
23106 -378782 -266876 -113611 112390 146002 -108276 -78721 16609 68423 45952 27607 -40172
23095 -40172 56239 125440 114270 27847 20184 87996 117746 147224 62601 137816 163768 245297
23083 245297 363101 368202 299149 343064 343733 196045 131222 119769 152210 164466 91763 9326
$$ packed form
23160h1165J34912p9353J3849j8309j0755R9457m1272j58798k1140Q8622J51250
23149G7298J27385l1962j66365k30345j40877J13364J50613j7406L5858k9953
23139a12390k12875n6222J6910O6612P5277J56333Q3900l5176L1066J04293j25158
23128g430j37715o3543N9950j55094K7427K48761m8070j59560J45913J46126M6896
23117A03661R4152l1670j4940j7401j24606j80598K6829R4501J48776k16674k60812
23106c78782J11906J53265K26001L3612k54278K9555R5330N1814k2471j8345o7779
23095d0172R6411O9201j1170q6423p663O7812K9750K9478q4623P5215K5952Q1529
23083B45297J17804N101o9053M3915O69j47688o4823j1453L2441J2256p2703q2437
$$ plain form
23071 9326 27590 -21043 -148734 -92716 -281132 -268820 -283525 -206271 -111441 -221346 -268687
23060 -268687 -231858 -167006 -104212 -34602 26927 91017 194095 212930 171177 187859 137218
23049 137218 -112895 -168236 -113866 93843 251625 317401 245930 370221 337833 146078
23039 146078 47325 90853 200582 203594 98450 75030 54346 5673 -35007 31627 159650
23028 159650 145387 77871 49553 89 42950 -43764 -83865 27332 33379 168130 288325
23017 288325 279496 176442 71011 14060 17988 30346 -72017 -136299 -30501 -14691 -130494
23006 -130494 -142882 7742 97548 -48774 -33774 -107890 -58570 14610 -51589 -20800 -347
22995 -347 -184 47345 3418 -20118 -171263 -268944 -130795 -149218 -89816 88103 271894 326986
$$ packed form
23071I326J8264m8633j27691N6018j88416J2312j4705P7254R4830j09905m7341
23060b68687L6829O4852O2794O9610O1529O4090J03078J8835m1753J6682n0641
23049A37218k50113n5341N4370K07709J57782O5776p1471J24291l2388j91755
23039A46078r8753M3528J09729L012j05144k3420k0684m8673m0680O6634J28023
23028A59650j4263o7516k8318m9464M2861q6714m0101J11197O047J34751J20195
23017B88325q829j03054j05431n6951L928J2358j02363o4282J05798J5810j15803
23006a30494j2388J50624Q9806j46322J5000p4116M9320P3180o6199L0789K0453
22995c47J63M7529m3927k3536j51145r7681J38149j8423N9402J77919J83791N5092
$$ plain form
22983 326986 146787 22429 104654 189428 208951 172592 229510 124495 102019 64423 -136211
22972 -136211 -138961 -85957 -67988 54368 100939 48126 -260890 -493447 -260982 174359 312258
22961 312258 187848 297881 343079 359365 255648 135083 53089 32344 31575 94856 175328
22950 175328 180661 225975 131760 150288 38689 -22599 -64228 -169352 92790 501623 484935
22939 484935 294898 100728 157583 -80439 -316414 -285869 -109819 -59243 -61761 -104411 -101903
22928 -101903 99076 223866 133291 6701 -7783 -16449 -83989 -54937 -25377 -45812 13622
22917 13622 3547 -50754 3891 26271 -9705 -159497 2543 117925 45098 -61252 106372
22906 106372 80181 -45319 2244 -113624 -106114 -141520 -35043 -26170 -138502 -134668 -91524
$$ packed form
22983C26986j80199j24358Q2225Q4774J9523l6359N6918j05015k2476l7596k00634
22972a36211k750N3004J7969J22356M6571n2813l09016k32557K32465M35341J37899
22961C12258j24410J10033M5198J6286j03717j20565q1994k0745p69O3281Q0472
22950A75328N333M5314r4215J8528j11599o1288m1629j05124K62142M08833j6688
22939D84935j90037j94170N6855k38022k35975L0545J76050N0576k518m2650K508
22928a01903K00979J24790r0575j26590j4484q666o7540K9052K9560k0435N9434
22917A3622j0075n4301N4645K2380l5976j49792J62040J15382p2827j06350J67624
22906A06372k6191j25500M7563j15868P510l5406J06477Q873j12332L834M3144
$$ plain form
22895 -91524 -27896 -35 -39497 -58259 86618 104416 278378 341734 239836 -1542 29835
22884 29835 33995 -50506 -153764 -71286 46800 85745 -52545 -75524 113721 3910 -239812
22873 -239812 -303583 -147172 -44402 12975 10852 66608 73627 104366 1539 -180819 -171342
22862 -171342 -165800 -108959 -56441 -127215 -180550 -59347 -95298 -11558 43021 26509 -99409
22851 -99409 -17944 187943 206337 66371 -650 175585 -28143 -101046 129150 174827 104116
22840 104116 267616 306522 235654 219079 170304 152196 91760 -76923 84878 21344 -79215
22829 -79215 23708 54344 -44402 -39290 -28342 -48786 -6938 328150 406895 261006 263327
22818 263327 105650 80553 -37923 -104223 -175658 -58217 49477 140753 17848 -132949
$$ packed form
22895i1524O3628K7861l9462j8762J44877J7798J73962O3356j01898k41378L1377
22884B9835M160q4501j03258Q2478J18086L8945j38290k2979J89245j09811k43722
22873b39812o3771J56411J02770N7377k123N5756P019L0739j02827j82358R477
22862a71342N542N6841N2518p0774n3335J21203l5951Q3740N4579j6512j25918
22851i9409Q1465K05887J8394j39966o7021J76235k03728p2903K30196M5677p0711
22840A04116J63500L8906p0868j6575m8775j8108o0436j68683J61801o3534j00559
22829g9215J02923L0636r8746N112J0948k0444M1848L35088P8745j45889K321
22818B63327j57677k5097j18476o6300p1435J17441J07694R1276j22905j50797
$$ plain form
22808 -132949 -178083 -28640 7990 -52521 88217 131369 122205 158369 -4320 -120733 -44123
22797 -44123 94824 -61579 -11471 40718 58837 100923 178324 173083 62411 -18460 156399
22786 156399 182500 201182 98619 110471 22677 -7005 16812 -20846 -14706 60967 52646 -63818
22774 -63818 -253310 -77627 134301 105535 234272 176007 12294 -91572 11467 178547
22764 178547 404782 402853 231335 187223 195202 212610 167140 54532 44875 110770 181910
22753 181910 251002 240152 83810 -61416 -56256 -90593 -49456 1774 -64925 -125281 -146334
22742 -146334 -160365 29814 176679 59401 68214 18962 43880 -32400 -182479 -68530 131709
22731 131709 225819 32153 -176615 -98596 -117075 -118856 -116387 -300953 -404951 -282616 -248156
$$ packed form
22808a32949m5134J49443L6630o0511J40738M3152r164L6164j62689j16413P6610
22797d4123J38947j56403N0108N2189J8119M2086P7401n241j10672q0871J74859
22786A56399K6101J8682j02563J1852q7794k9682K3817l7658O140P5673q321j16464
22774f3818j89492J75683K11928k8766J28737n8265j63713j03866J03039J67080
22764A78547K26235j929j71518m4112P979J7408m5470j12608r657O5895P1140
22753A81910O9092j0850j56342j45226N160l4337M1137N1230o6699o0356k1053
22742a46334j4031J90179J46865j17278Q813m9252K4918p6280j50079J13949K00239
22731A31709R4110j93666k08768P8019j8479j781K469j84566j03998J22335L4460
$$ plain form
22720 -248156 -236130 -281604 -210693 -9404 -62592 -56011 154870 185156 -16370 -123104 5471
22709 5471 42576 128375 198273 81164 92702 -119630 -51712 33370 46449 -107344 -192358
22698 -192358 -184181 -202531 -252792 -200252 -87802 68080 256085 155445 -39141 -18837 86308
22687 86308 106365 165678 286911 238797 272163 285546 289758 176736 315916 375294 326900
22676 326900 190388 -14259 -48420 9768 -117471 -143810 -183106 -76744 -26457 -151386
22666 -151386 -258514 -105250 -226817 -241910 -200676 -74384 -73200 -24137 33885 34624 41564
22655 41564 84145 -30091 -73160 -21850 -19331 -79873 -275169 -376327 -118373 -156554 -89178
22644 -89178 -36426 42522 175351 167419 68763 187484 334657 219586 191588 168147 138962
$$ packed form
22720b48156J2026m5474P0911K01289n3188O581K10881L0286k01526j06734J28575
22709E471L7105Q5799O9898j17109J1538k12332O7918Q5082J3079j53793q5014
22698a92358Q177j8350n0261N2540J12450J55882J88005j00640j94586K0304J05145
22687H6308K0057N9313J21233m8114L3366J3383M212j13022J39180N9378m8394
22676C26900j36512k04647l4161N8188j27239k6339l9296J06362N0287j24929
22666a51386j07128J53264j21567j5093M1234J26292J184M9063N8022P39O940
22655D1564M2581j14236m3069N1310K519o0542j95296j01158K57954l8181O7376
22644h9178N2752P8948J32829p932r8656J18721J47173j15071k7998k3441k9185
$$ plain form
22633 138962 170157 425922 239822 -76732 -158962 -94456 112002 275802 102299 -83365
22623 -83365 -208991 -229717 -119431 -98254 -119912 -132800 -25470 22664 92985 -72331 -89976
22612 -89976 -81682 122110 102655 4150 -51862 -117763 -304711 -339304 -362932 -300909 -280211
22601 -280211 -254446 -390507 -266202 -265376 -245946 -282710 -420942 -399902 -351377 -280710 -282923
22590 -282923 -253714 -244569 -365355 -383644 -423921 -314804 -112914 -120099 -135981 -133222 30980
22579 30980 129310 135729 199428 265596 241835 293839 147325 6662 116546 -13246 -131085
22568 -131085 15324 37063 -22800 93956 214032 319034 378021 362412 161067 102697
22558 102697 36653 129733 182314 117740 -51994 -281427 -428590 -332023 -90104 133498
$$ packed form
22633A38962L1195K55765j86100l16554q2230O4506K06458J63800j73503j85664
22623h3365j25626k0726J10286K1177k1658j2888J07330M8134P0321j65316j7645
22612h9976Q294K03792j9455r8505n6012o5901j86948l4593k3628O2023K0698
22601b80211K5765j36061J24305Q26J9430l6764j38232K1040M8525P0667k213
22590b82923K9209R145j20786j8289m0277J09117K01890p185j5882K759J64202
22579C0980R8330O419O3699O6168k3761N2004j46514j40663J09884j29792j17839
22568a31085J46409K1739n9863J16756J20076J05002N8987j5609k01345n8370
22558A02697o6044R3080N2581o4574j69734k29433j47163R6567K41919K23602
$$ plain form
22548 133498 220347 78152 -84004 25609 -137572 -155866 -139007 84717 -33472 -11232
22538 -11232 19533 -40608 141269 60806 1472 109971 129834 165639 61493 152660 125634
22527 125634 -58484 24801 63595 190664 72758 -48300 -51539 10173 111243 -219
22517 -219 -132680 1314 100235 41592 -43608 -4079 99046 -23387 -5414 21840 10631
22506 10631 -37919 -135961 -242918 40823 123710 22347 -78346 -269495 -231819 -135781 -11627
22495 -11627 -62084 -27286 -5642 -135767 -104364 -141838 -154680 -112667 -49289 -131022 -196442
22484 -196442 105140 225843 78474 187392 125328 -52379 -110861 -135259 -47366 -132781
22474 -132781 -261778 -317640 -190117 -144136 -87094 -16869 -15225 -143777 -223549 -348688 -311540
$$ packed form
22548A33498Q6849j42195j62156J09613j63181j8294J6859K23724j18189K2240
22538a1232L0765o0141J81877q0463n9334J08499J9863L5805j04146R1167k7026
22527A25634j84118Q3285L8794J27069j17906j21058l239O1712J01070j11462
22517b19j32461J33994R8921n8643q5200L9529J03125j22433J7973K7254j1209
22506A0631m8550r8042j06957K83741Q2887j01363j00693j91149L7676R6038J24154
22495a1627n0457L4798K1644j30125L1403l7474j2842M2013O3378q1733o5420
22484a96442L01582J20703j47369J08918o2064j77707n8482k4398Q7893q5415
22474a32781j28997n5862J27523M5981N7042P0225J644j28552p9772j25139L7148
$$ plain form
22463 -311540 -268995 -136523 -191961 -345812 -397461 -269529 -74498 109300 105656 151903 45806
22452 45806 295 -77177 -93288 -8075 90163 169568 147788 212417 351834 307901 177432
22441 177432 121611 -3969 42438 66823 43184 75078 149938 140083 32107 43861 32611
22430 32611 67271 -42380 -85195 24440 -83478 -34659 81152 106902 193065 136960 129837
22419 129837 212967 281902 141889 -150289 -284286 -67894 98740 87732 -7500 -67481
22409 -67481 3697 -60012 67468 188017 203242 198911 171616 -41711 -324877 -132453 -26661
22398 -26661 52844 107197 79319 -48527 -229780 -239178 64469 130295 119153 103926 -91997
22387 -91997 -211889 -185565 -169511 -141194 -180566 -86181 106228 264398 151321 167516 259139
$$ packed form
22463c11540M2545J32472n5438j53851n1649J27932J95031J83798l644M6247j06097
22452D5806m5511p7472j6111Q5213R8238P9405k1780O4629J39417m3933j30469
22441A77432n5821j25580M6407K4385k3639L1894P4860r855j07976J1754j1250
22430C2611L4660j09651m2815J09635j07918M8819J15811K5750Q6163n6105p123
22419A29837Q3130O8935j40013k92178j33997K16392J66634j1008r5232n9981
22409f7481P1178o3709J27480J20549J5225m331k7295k13327k83166J92424J05792
22398b6661P9505N4353k7878j27846j81253r398L03647O5826j1142j5227j95923
22387i1997j19892K6324J6054K8317l9372R4385J92409J58170j13077J6195R1623
$$ plain form
22376 259139 296265 329796 305253 69958 -36702 -8066 45574 -18872 -92331 -192207 -319512
22365 -319512 -176323 -3473 113882 137307 128364 180977 133139 33315 -80870 -142060 -85164
22354 -85164 -52546 -64279 1995 -34755 12774 32956 -3986 169927 341585 413288 338300
22343 338300 213777 229428 301946 333405 265772 31003 -8520 -154226 -83094 -73728 -76173
22332 -76173 -23702 -111024 -311445 -341702 -180490 -20381 105230 107926 159338 138394 226332
22321 226332 84481 36997 -180660 -125784 25525 -17796 -21666 83802 182033 326295 256419
22310 256419 116470 141928 87190 186228 218511 271961 127766 106867 165512 187819 205512
22299 205512 201258 121693 26420 -29797 -165698 -239429 -167444 -131725 -214094 -238556 -261417
$$ packed form
22376B59139L7126L3531k4543k35295j06660K8636N3640o4446p3459r9876j27305
22365c19512J43189J72850J17355K3425q943N2613m7838r9824j14185o1190N6896
22354h5164L2618j1733O6274l6750M7529K0182l6942J73913J71658P1703p4988
22343C38300j24523J5651P2518L1459o7633k34769l9523j45706P1132R366k445
22332g6173N2471q7322k00421l0257J61212J60109J25611K696N1412k0944Q7938
22321B26332j41851m7484k17657N4876J51309m3321l870J05468R8231J44262o9876
22310B56419j39949K5458n4738R9038L2283N3450j44195k0899N8645K2307J7693
22299B05512m254p9565r5273n6217j35901p3731P1985L5719q2369k4462k2861
$$ plain form
22288 -261417 -90965 17108 16521 -9776 60663 217214 205482 280564 109957 22217 102653
22277 102653 128640 103137 64884 139035 121977 -62692 -58167 -112850 -152319 -28221 58799
22266 58799 89015 82234 81074 105101 76281 82303 -17878 -86742 -94992 -70152 57839 127540
22254 127540 224894 268074 195848 122842 -9028 -267374 -222307 -211682 -167094 -306911 -391387
22243 -391387 -325451 -237277 -64422 -1124 -83701 -106969 -113429 -170965 -267038 -252786 -201902
22232 -201902 -114558 -19423 -153990 -233152 -183731 -187589 -110956 64395 -34610 -32916 -63230
22221 -63230 -36624 -84614 20975 116221 15428 78632 41822 -132427 -131243 -127372 -56284
22210 -56284 910 24896 210155 252274 165926 72433 -21446 156280 278127 256976 219918
$$ packed form
22288b61417J70452J08073n87k6297P0439J56551j1732P5082j70607q7740Q0436
22277A02653K5987k5503l8253P4151j7058j84669M525n4683l9469J24098Q7020
22266E8799L0216o781j160K4027k8820O022j00181o8864q250K4840J27991O9701
22254A27540R7354M3180p2226p3006j31870k58346M5067J0625M4588j39817q4476
22243c91387O5936Q8174J72855O3298q2577k3268o460n7536r6073J4252N0884
22232b01902Q7344R5135j34567p9162M9421l858P6633J75351r9005J694l0314
22221f3230K6606m7990J05589R5246j00793O3204l6810j74249J184L871P1088
22210e6284N7194K3986J85259M2119q6348r3493r3879J77726J21847k1151l7058
$$ plain form
22199 219918 243533 140108 70944 77612 60464 154549 166781 102592 -69466 -223229 -249769
22188 -249769 -275999 -265230 -254767 -237167 -228341 -200937 -220679 -182905 -258829 -229636 -225807 44225
22176 44225 154693 -55911 -34712 104666 -29117 -103168 -58606 21646 -45145 -40024 4836
22165 4836 -45935 -51247 -5026 -58643 -157646 -93336 18695 -47139 -143278 -79678 71352 145080
22153 145080 80529 48274 175835 205555 20554 -92562 -106009 -125439 -212760 -165148 -64209
22142 -64209 -44985 96978 208202 189491 166846 216999 207339 113423 92743 147428 144411 -51474
22130 -51474 -194886 -217582 -24932 69641 54191 33090 -114398 -186604 -107519 -184053 -284795
22119 -284795 -154375 -86981 -196807 -271575 -228576 -248780 -221871 -198654 -90893 -49253 -173142
$$ packed form
22199B19918K3615j03425o9164O668j7148R4085J2232o4189j72058j53763k6540
22188b49769k6230J0769J0463J7600Q826K7404j9742L7774p5924K9193L829K70032
22176D4225J10468k10604K1199J39378j33783p4051M4562Q0252o6791N121M4860
22165D836n0771n312M6221n3617r9003O4310J12031o5834r6139O3600J51030P3728
22153A45080o4551l2255J27561K9720j85001j13116j3447j9430q7321M7612J00939
22142f4209J9224J41963J11224j8711k2645N0153r660r3916k0680N4685l017j95885
22130e1474j43412k2696J92650R4573j5450k1101j47488p2206P9085p6534j00742
22119b84795J30420O7394j09826p4768M2999k0204K6909K3217J07761M1640j23889
$$ plain form
22108 -173142 -107708 -30360 -121178 -199060 -79377 59020 84881 -39906 23604 126274 68438
22097 68438 -26685 -146229 -411549 -462481 -163751 139030 109318 -1369 -119242 -86645
22087 -86645 -34997 -141110 -226821 -135276 -194498 -118073 -128341 -149713 59209 205321 102104
22076 102104 30230 -70015 8332 -32877 13733 49789 1596 104697 282803 232739 124068
22065 124068 85921 194572 142488 -93118 -103460 -129541 -203974 -122441 33026 3904 111125
22054 111125 58675 -100250 -202330 -145408 -6078 77869 55801 -64914 -234642 -183238
22044 -183238 -104699 -84543 -25266 77886 182824 72145 135919 207281 151907 91751 9950
22033 9950 61788 -93722 -131677 -48344 13212 43649 -46033 -30570 81479 112899 124748
$$ packed form
22108a73142O5434P7348r0818p7882J19683J38397K5861j24787O3510J02670n7836
22097F8438r5123j19544k65320n0932K98730L02781k9712j10687j17873L2597
22087h6645N1648j06113q5711R1545n9222P6425j0268k1372K08922J46112j03217
22076A02104p1874j00245P8347m1209M6610L6056m8193J03101J78106n0064j08671
22065A24068l8147J08651n2084k35606j0342k6081p4433Q1533J55467k9122J07221
22054A11125n2450j58925j02080N6922J39330Q3947k2068j20715j69728N1404
22044a83238P8539K0156N9277J03152J04938j10679O3774P1362n5374o0156q1801
22033I950N1838j55510l7955Q3333O1556L0437q9682J5463J12049L1420J1849
$$ plain form
22022 124748 -187677 -260734 -214374 -187517 -108294 -166203 85285 54113 -21288 122314 -3190
22011 -3190 -46488 6352 34588 18216 -108752 -115108 -13308 -25409 -2769 -43216 -130939 -216120
21999 -216120 -137547 4511 127158 17704 -57789 106669 94315 4561 46001 124880 156515
21988 156515 197062 124985 -43117 -73034 -54253 177077 166109 56815 162016 240901 170622
21977 170622 121241 156985 84788 41147 59022 100784 -89112 -300679 -250251 -217700 7660
21966 7660 207883 341629 419313 245051 -41218 -78519 32858 164300 34580 11834
21956 11834 6854 -42163 -80681 -148955 -131199 -35364 76937 99250 141103 176979 104986 28923
21944 28923 236629 107635 -88123 -30073 -39415 1340 -13879 33294 97351 255484 295036
$$ packed form
22022A24748l12425p3057M6360K6857P9223n7909K51488l1172p5401J43602j25504
22011c190m3298N2840K8236j6372j26968o356J01800j2101K2640m0447q7723q5181
21999b16120P8573J42058J22647j09454p5493J64458j2354q9754M1440P8879L1635
21988A56515M0547p2077j68102k9917J8781K31330j0968j09294J05201P8885p0279
21977A70622m9381L5744p2197m3641J7875M1762j89896k11567N0428L2551K25360
21966G660K00223J33746P7684j74262k86269l7301J11377J31442j29720k2746
21956A1834m980m9017l8518o8274J7756R5835J12301K2313M1853L5876p1993p6063
21944B8923K07706j28994j95758N8050r342M0755j5219M7173O4057J58133L9552
$$ plain form
21933 295036 142546 30219 62614 192084 166330 90925 75728 -137113 -137666 -200171 -206992
21922 -206992 -88131 29830 122102 137861 178276 165559 66066 -110 28118 -27248 -6902
21911 -6902 -18026 -115174 -190458 -209110 -149119 -218427 -88283 -141505 -171065 -78251 79769
21900 79769 33962 -75596 -74195 132935 153836 242818 336080 370828 347230 351606 156631
21889 156631 82085 118483 82738 21970 114712 77704 37141 -41805 68364 54210 -111219
21878 -111219 22821 119376 7992 -37664 52681 98826 -21824 -81843 -139712 1190 14284
21867 14284 -32326 -233345 -193424 -66828 82428 83667 17652 6682 49606 -18825 43888
21856 43888 43228 49588 115180 85924 130949 135814 -33925 -51599 -162052 -218111 -438690 -307690
$$ packed form
21933B95036j52490j12327L2395J29470k5754p5405j5197k12841n53o2505o821
21922b06992J18861J17961R2272J5759M0415j2717r9493o6176K8228n5366K0346
21911f902j1124r7148p5284j8652N9991o9308J30144n3222k9560R2814J58020
21900G9769m5807j09558J401K07130K0901Q8982R3262L4748k3598M376j94975
21889A56631p4546L6398l5745o0768R2742l7008m0563p8946J10169j4154j65429
21878a11219J34040R6555j11384m5656R0345M6145j20650o0019n7869J40902J3094
21867A4284m6610k01019L9921J26596J49256J239o6015j0970M2924o8431O2713
21856D3888o60O360O5592k9256M5025M865j69739j7674j10453n6059k20579J31000
$$ plain form
21844 -307690 -128321 -238718 -356236 -248497 -9649 -54906 -285429 -316856 -262972 -282517
21834 -282517 -299201 -400045 -404153 -296013 -288607 -227719 -184456 -285290 -301076 -198517 -116030
21823 -116030 -91448 49480 251623 373705 269310 210309 154968 24649 -81880 -217965
21813 -217965 -223971 -175429 -71338 -5657 93875 320169 248733 -33211 -67801 -325688 -334090
21802 -334090 -258678 -184958 -16072 73313 29999 -179187 -329860 -336967 -85967 -184889 -264146
21791 -264146 -160189 131537 297933 133857 -157444 -201891 135170 387394 242027 65521
21781 65521 -59390 25673 137858 148610 218746 187009 295631 350717 390299 322095 361425
21770 361425 307718 295998 268371 257479 205726 114574 127051 -55429 29165 242726 151947
$$ packed form
21844c07690J79369j10397j17518J07739K38848m5257k30523l1427N3884j9545
21834b82517j6684j00844m108J08140P406O0888M3263j00834j5786J02559Q2487
21823a16030K4582J40928K02143J22082j04395n9001n5341j30319j06529j36085
21813b17965o006M8542J04091O5681R9532K26294p1436k81944l4590k57887q402
21802c34090P5412P3720J68886Q9385m3314k09186j50673p107K51000r8922p9257
21791b64146J03957K91726J66396j64076k91301m4447L37061K52224j45367j76506
21781F5521j24911Q5063J12185J0752P0136l1737J08622N5086L9582o8204L9330
21770C61425n3707j1720k7627j0892n1753r1152J2477j82480Q4594K13561r0779
$$ plain form
21759 151947 14962 -46028 -107037 9742 124720 69143 -106974 -246850 -291459 -466264
21749 -466264 -385028 -128269 160202 127748 151396 97360 -4427 75379 7334 -120010 -198571
21738 -198571 -137543 -305153 -335765 -127067 -36881 56463 52338 -77073 -31147 -91400 -35338
21727 -35338 -81620 -287177 -343955 -392983 -243365 -30366 -23607 -107606 -357 27958 7141
21716 7141 1932 820 -12903 -82756 -16606 -93724 -196275 31131 129613 -36034 -215790
21705 -215790 -180575 -56064 11539 -21512 105169 25147 -146203 -172962 -177375 -185897 -136942
21694 -136942 -126744 -140489 -71836 -17797 -57136 -12713 -31642 91978 -49839 -51969 -105883
21683 -105883 -7183 -209744 -105939 83806 317234 316890 186122 -30397 27390 218285
$$ packed form
21759A51947j36985o0990o1009J16779J14978n5577j76117j39876m4609j74805
21749d66264Q1236K56759K88471l2454K3648n4036j01787P9806o8045j27344p8561
21738a98571O1028j67610l0612K08698R0186R3344m125j29411M5926o0253N6062
21727c5338m6282k05557n6778m9028J49618K12999O759q3999J07249K8315k0817
21716G141n209j112j3723o9853O6150p7118j02551K27406R8482j65647j79756
21705b15790L5215J24511O7603l3051J26681q0022j71350k6759m413q522M8955
21694a36942J0198j3745O8653N4039l9339M4423j8929J23620j41817k130n3914
21683a05883R8700k02561J03805J89745K33428l44j30768k16519N7787J90895
$$ plain form
21673 218285 177726 120301 114965 206056 167137 -6172 -60774 -92281 -15804 76132 139044
21662 139044 -23263 -250149 -244167 -253231 -272208 -173441 -185708 -110979 -73368 25516 23876 -26444
21650 -26444 -227595 -314850 -243453 -102402 -220736 -314296 -279703 -89695 103962 215531
21640 215531 178502 189108 160712 186586 229163 101057 62884 103765 82305 47194 -114991
21629 -114991 -185388 -853 89788 -21350 60410 143333 -78763 -174616 -102795 -124936 -216321
21618 -216321 -188784 -140326 -105244 -54905 18737 -44572 177052 253766 173476 134087 28012
21607 28012 33630 252877 361372 287432 316127 171382 -38964 -33569 -50371 70802 169131
21596 169131 117378 4370 -59692 -107748 -159511 -83686 12180 -101668 -166186 -257842 -85606
$$ packed form
21673B18285m0559n7425n336R1091l8919j73309n4602l1507P6477R1936O2912
21662A39044j62307k26886N982r064j8977R8767j2267P4729L7611R8884j640n0320
21650b6444k01151q7255P1397J41051j18334r3560L4593J90008J93657J11569
21640B15531l7029J0606k8396K5874M2577j28106l8173M0881k1460l5111j62185
21629a14991p0397J84535R0641j11138Q1760Q2923k22096r5853P1821k2141r1385
21618b16321K7537M8458L5082N0339P3642o3309K21624P6714q0290l9389j06075
21607B8012N618K19247J08495p3940K8695j44745k10346N395j6802J21173R8329
21596A69131n1753j13008o4062m8056n1763P5825R5866j13848o4518r1656J72236
$$ plain form
21585 -85606 -86258 -86760 128076 90227 57198 21098 -91932 -121764 -92911 -174403 -114240 -28718
21573 -28718 -205006 -242826 -142672 -233990 -310100 -271320 -103700 -28403 90852 133435 164143
21562 164143 382611 398685 356519 347768 87179 73325 33854 -114235 -125688 -159661 -157198
21551 -157198 -192942 -43887 91406 58913 -13924 -149569 -192988 -100048 71800 343524
21541 343524 449108 326632 216471 -2755 -118650 -158200 -14223 55230 15701 -80106
21531 -80106 43930 73814 -7880 -23834 -95013 -18702 -66064 -47397 26981 31266 163261
21520 163261 90663 -57726 45422 238048 187099 144316 177424 215626 194026 104126 89917
21509 89917 81272 -4123 -24969 74491 132166 106812 -10984 -145294 -94354 83778 59665
$$ packed form
21585h5606o52n02K14836l7849l3029l6100j13030k9832K8853q1492O0163Q5522
21573b8718j76288l7820J00154r1318p6110L8780J67620P5297J19255M2583L0708
21562A64143K18468J6074m2166q751k60589j3854l9471j48089j1453l3973K463
21551a57198l5744J49055J35293l2493p2837j35645m3419R2940J71848K71724
21541C43524J05584j22476j10161k19226j15895l9550J43977O9453l9529r5807
21531h0106J24036K9884q1694j5954p1179P6311m7362J8667P4378M285J31995
21520A63261p2598j48389J03148J92626n0949m2783L3108L8202k1600q9900j4209
21509H9917q645q5395k0846R9460N7675k5354j17796j34310N0940J78132k4113
$$ plain form
21498 59665 56969 58772 181598 279765 192908 91599 130644 116841 132772 212250 182020 77628
21486 77628 82347 -47463 -219255 -105200 65666 151848 -56922 -89557 -60242 -48377 -38964
21475 -38964 -233778 -168471 -93563 22468 92249 5326 -32742 -1362 -22534 -162456 -221513
21464 -221513 -184648 -90210 63816 -23073 -81573 -110722 18791 74168 62129 61724 -16501
21453 -16501 -143675 -297677 -206244 -223046 -431670 -86003 94748 -56179 -135590 32910
21443 32910 2747 6056 31704 23833 -43760 -231053 -259118 -137646 -282113 -328510 -200520
21432 -200520 -93179 -1040 129034 130418 -64835 -74455 -185453 -156593 -67283 -29433 -91575
21421 -91575 -167679 -214668 -202395 -253345 -331469 -248224 -72582 54805 171117 129797 165643
$$ packed form
21498E9665k696J803J22826R8167q6857j01309L9045j3803J5931P9478l0230j04392
21486G7628M719j29810j71792J14055J70866Q6182k08770l2635K9315J1865R413
21475c8964j94814O5307P4908J16031O9781q6923l8068L1380k1172j39922n9057
21464b21513L6865R4438J54026q6889n8500k9149J29513N5377j2039m05p8225
21453a6501j27174j54002R1433j6802k08624L45667J80751j50927p9411J68500
21443C2910l0163L309K5648p871o7593j87293k8065J21472j44467m6397J27990
21432b00520J07341R2139J30074J384j95253r620j10998K8860Q9310L7850o2142
21421i1575p6104m6989J2273n0950p8124Q3245J75642J27387J16312m1320L5846
$$ plain form
21410 165643 224901 93094 -70272 -47396 -65196 -26649 43001 -3914 -125571 -183051 54805
21399 54805 50469 -138161 -32726 4040 72186 38329 -31141 -63001 25952 -35849 -124803
21388 -124803 -96050 -74230 -176625 -240804 -159945 -96528 23642 89101 -15667 -133069 -121856
21377 -121856 -77665 74929 291876 430654 219323 -98074 -134948 -123570 -78070 -69352 -6006
21366 -6006 -64455 -195549 5841 78506 -148004 -343557 -383863 -340866 -255792 -202428 -90859
21355 -90859 -36885 -14878 -171093 -404352 -483292 -454153 -152455 135366 205105 151632 -5380
21344 -5380 -87913 -136847 -148126 -97291 -153180 -221909 -254156 -334133 -360730 -123532 -9888
21333 -9888 54210 158931 132649 75011 81279 -31775 -137674 -33172 25877 54954 54986 90044
$$ packed form
21410A65643N9258j31807j63366K2876j7800L8547O9650m6915j21657n7480K37856
21399E4805m336j88630J05435L6766O8146l3857o9470l1860Q8953o1801q8954
21388a24803K8753K1820j02395o4179Q0859O3417J20170O5459j04768j17402J1213
21377a21856M4191J52594K16947J38778k11331l17397l6874J1378M5500Q718O3346
21366f006n8449j31094K01390P2665k26510j95553m0306M2997Q5074N3364J11569
21355i0859N3974K2007j56215k33259p8940K9139L01698K87821O9739n3473j57012
21344e380q2533m8934j1279N0835n5889o8729l2247p9977k6597K37198J13644
21333i888O4098J04721k6282n7638O268j13054j05899J04502N9049K9077L2L5058
$$ plain form
21321 90044 31904 -77472 -47186 85101 154296 174769 206610 -3566 -48139 -23195 -81062
21310 -81062 -8525 100745 115069 129475 37700 -86634 -121421 -279923 -170812 -93687 -119207
21299 -119207 -20248 -149482 -128199 -29496 -29482 11689 12752 -50445 94805 131080 -19241 -185997
21287 -185997 -106557 471 117298 58027 28706 -41220 -23742 -95171 -36975 109987 3487
21276 3487 10289 94094 53538 -59216 -54361 -55095 33315 132534 121423 83506 34940 -94201
21264 -94201 -79364 -76483 -70460 -4083 139340 145128 125305 146223 -86856 -195062 -233646 -240559
21252 -240559 -229262 -116723 -115367 -177644 -132550 -75728 -129243 -151678 18641 143633 123683
21241 123683 306043 257435 228720 82728 100232 39478 -23559 -5178 169971 138030 161801
$$ packed form
21321I0044n8140j09376L0286J32287O9195K0473L1841k10176m4573K4944n7867
21310h1062P2537J09270J4324J4406r1775j24334l4787j58502J09111P7125k5520
21299a19207R8959j29234K1283R8703J4M1171J063o3197J45250L6275j50321j66756
21287a85997P9440J07028J16827n9271k9321o9926J7478p1429N8196J46962j06500
21276C487O802Q3805m0556j12754M855p34Q8410R9219j1111l7917m8566j29141
21264i4201J4837K881O023O6377J43423N788j9823K0918k33079j08206l8584o913
21252b40559J1297J12539J356o2277M5094N6822n3515k2435J70319J24992j9950
21241A23683J82360m8608k8715j45992J7504o0754o3037J8381J75149l1941K3771
$$ plain form
21230 161801 133812 177297 49465 -143901 -199613 -109947 -49862 -77337 -9996 151299 245913
21219 245913 196881 98246 -58557 -116336 -101874 126578 272613 449238 203550 -72053
21209 -72053 -69025 29862 33402 -51907 -80692 -38191 -131747 -88145 -78833 -66230 -89155 -63834
21197 -63834 -24249 -96198 -255052 -254563 -26955 87711 57919 -87482 -124346 -15773 24391
21186 24391 6735 -203985 -165742 -6353 22463 223806 285452 346826 303669 286678 238660
21175 238660 16043 -261946 -320754 -172818 -16770 -35415 147786 280659 187199 243308
21165 243308 307995 238310 383145 297141 249843 326266 158420 -24918 -56695 -102234 -116717
21154 -116717 -9186 1014 63137 95940 218877 209206 22896 -181590 -195808 -57758 -125687
$$ packed form
21230A61801k7989M3485j27832j93366n5712Q9666O0085k7475O7341J61295R4614
21219B45913m9032r8635j56803n7779J4462K28452J46035J76625k45688k75603
21209g2053L028R8887L540q5309k8785M2501r3556M3602R312J2603k2925K5321
21197f3834L9585p1949j58854M89K27608J14666k9792j45401l6864J08573M0164
21186B4391j7656k10720L8243J59389K8816K01343O1646O1374m3157j6991m8018
21175B38660k22617k77989n8808J47936J56048j8645J83201J32873r3460N6109
21165B43308O4687o9685J44835q6004m7298P6423j67846j83338l1777m5539j4483
21154a16717J07531J0200O2123L2803J22937r671j86310k04486j4218J38050o7929
$$ plain form
21143 -125687 -51530 35147 134735 52199 123372 141728 31215 15827 -13347 -173860 -121589
21132 -121589 8862 113929 96330 -89619 -145819 65793 114403 -106562 2189 -86223
21122 -86223 -106700 -179002 -108826 6781 -57701 -71275 -61974 -149009 -287156 -255347 -93531
21111 -93531 -93977 -206731 -122220 -108218 -51548 -175381 -265249 -280384 -159055 -87418 18676
21100 18676 18661 -6731 173352 95063 2148 -65333 54458 57573 -242971 -238100 49964 116753
21088 116753 -14317 -2459 -64752 40852 35571 30306 156417 106170 -60411 -35148 -22361
21077 -22361 -148986 -126158 -40861 15739 -51268 -41943 30793 40725 32267 71243 24667 -1101
21065 -1101 -28029 73036 59930 87344 148870 20504 -196898 -218180 -177588 -179183 -65508
$$ packed form
21143a25687P4157Q6677R9588q2536P1173J8356j10513j5388k9174j60513N2271
21132a21589J30451J05067j7599j85949n6200K11612M8610k20965J08751q8412
21122h6223k0477p2302P0176J15607o4482j3574R301q7035j38147L1809J61816
21111i3531m46j12754Q4511J4002N6670j23833q9868j5135J21329P1637J06094
21100A8676j5k5392J80083p8289r2915o7481J19791L115l00544M871K88064O6789
21088A16753j31070J1858o2293J05604n281n265J26111n0247j66581K5263J2787
21077b2361j26625K2828Q5297N6600o7007R325P2736R932q458L8976m6576k5768
21065a101k6928J01065j3106K7414O1526j28366k17402k1282M0592j595J13675
$$ plain form
21054 -65508 -71586 -145421 -149794 13697 68835 106678 128451 184882 106353 -255508 -233062 57708
21042 57708 188841 92543 -16533 -24098 97894 118120 58102 55344 234641 410517 325290
21031 325290 155920 236697 322053 431508 355805 184822 283912 279382 124506 -17896 -63864
21020 -63864 -196759 -300399 -69631 258710 208136 174316 205754 318359 304348 406371
21010 406371 625258 783518 699312 589576 549170 594262 721885 809074 965276 1302301
21000 1302301 1285231 1132112 934420 720965 765629 725041 755369 632020 421710 322262
20990 322262 191245 288665 207797 61442 70071 111007 126 165426 355596 346616 10462
20979 10462 -28490 -32570 -160139 -402100 -304398 -92422 -83493 41421 53010 117037 96346
$$ packed form
21054f5508o078p3835m373J63491N5138L7843K1773N6431p8529l61861K2446K90770
21042E7708J31133r6298j09076p565J21992K0226o0018k758J79297J75876q5227
21031C25290j69370Q0777Q5356J09455p5703j70983R9090m530j54876j42402m5968
21020f3864j32895j03640K30768L28341n0574l3820L1438J12605j4011J02023
21010D06371K18887J58260q4206j09736m0406M5092J27623Q7189J56202L37025
21000A302301j7070j53119j97692k13455M4664m0588L0328j23349k10310r9448
20990C22262j31017R7420q0868j46355Q629M0936j10881J65300J90170q980l36154
20979A0462l8952m080j27569k41961R7702K11976Q929J24914J1589O4027k0691
$$ plain form
20968 96346 116373 52413 5189 33184 3371 142764 177667 52254 -203670 -130882 -112887
20957 -112887 -78952 -67265 -176944 -222760 -111552 -39329 8803 22942 111458 88850 143446
20946 143446 188717 -100387 -137807 -88590 -80247 -10776 -57165 -87187 -30827 -74270 -127005
20935 -127005 -90176 -104453 -6161 123413 212803 100812 113325 221869 191283 -58736 -144156
20924 -144156 -5093 32507 51792 190351 104312 -153334 -215300 -106481 -137244 -173937 -144751
20913 -144751 -7813 160748 96688 -133039 -82370 217448 158660 -52642 -120165 -45948
20903 -45948 -217045 -317139 -232739 -60190 49868 3415 57088 130806 191054 285387 233480
20892 233480 148511 217727 292736 243514 210163 148506 -15965 -25473 17214 -32713 -87131
$$ packed form
20968I6346K0027o3960m7224K7995k9813J39393L4903j25413k55924P2788J7995
20957a12887L3935J1687j09679m5816J11208P2223M8132J4139Q8516k2608N4596
20946A43446M5271k89104l7420M9217Q343O9471m6389l0022N6360m3443n2735
20935a27005L6829j4277R8292J29574Q9390j11991J2513J08544l0586k50019q5420
20924a44156J39063L7600J9285J38559q6039k57646o1966J08819l0763l6693K9186
20913a44751J36938J68561o4060k29727N0669K99818n8788k11302o7523P4217
20903d5948j71097j00094Q4400J72549J10058m6453N3673P3718O0248R4333n1907
20892B33480q4969O9216P5009m9222l3351o1657j64471r508M2687m9927n4418
$$ plain form
20881 -87131 -27262 80554 202051 199339 254168 125913 99039 117711 9764 106627 70635
20870 70635 107871 157257 158751 132766 117339 73136 10918 47670 80717 84017 86717 82557
20858 82557 -120428 -81703 167930 202241 100457 7691 -212781 -161263 -103626 -260772 -265562
20847 -265562 -186688 -190441 -111014 -59143 -32126 94397 232390 269714 335343 450617 475149
20836 475149 293475 202409 147664 48498 64572 103542 44006 62769 -31730 19462 95708
20825 95708 -108407 -52930 129380 134543 39143 -4014 -14555 -22112 46578 109410 157047 74275
20813 74275 43882 106364 184047 123380 100474 -54674 65132 40901 -4314 13108 -2676
20802 -2676 44875 97706 -84130 -8199 32517 -31064 60161 -66289 -188105 -123416 -59096
$$ packed form
20881h7131N9869J07816J21497k712N4829j28255k6874J8672j07947R6863l5992
20870G0635L7236M9386J494k5985j5427m4203o2218L6752L3047L300K700m160
20858H2557k02985L8725K49633L4311j01784r2766k20472N1518N7637j57146m790
20847b65562P8874l753P9427N1871K7017J26523J37993L7324O5629J15274K4532
20836D75149j81674r1066n4745r9166J6074L8970n9536J8763r4499N1192P6246
20825I5708k04115N5477J82310N163r5400m3157j0541p557O8690O2832M7637q2772
20813G4275l0393O2482P7683o0667k2906j55148J19806k4231m5215J7422j5784
20802b676M7551N2831j81836P5931M0716o3581R1225j26450j21816O4689O4320
$$ plain form
20791 -59096 -144307 -315175 -244695 -155342 -134215 -152167 -110297 7661 28634 -142412 -206166
20780 -206166 -47159 121375 127551 -70482 -57138 20590 -51059 32957 239258 291263 160005
20769 160005 210466 52425 22691 53072 32665 -29226 125475 312600 153129 4989
20759 4989 59947 178290 37430 43128 -74184 80845 221310 278422 327401 285683 159417
20748 159417 125092 118004 94657 154868 76649 -28684 -19091 126443 238171 226313 81388
20737 81388 60569 -48487 -40755 210325 294442 87493 -149347 -139377 -172353 -92832 -163038
20726 -163038 -39143 211178 198267 137152 44228 -172416 -224467 -241588 -178080 -32657 -60655
20715 -60655 -166692 44192 26834 -139348 -187136 -62802 -115712 -66200 64809 77214 132216
$$ packed form
20791e9096q5211j70868P0480Q9353K1127j7952M1870J17958K0973j71046o3754
20780b06166J59007J68534O176j98033J3344P7728p1649Q4016K06301N2005j31258
20769A60005N0461j58041k9734L0381k0407o1891J54701J87125j59471j48140
20759D989N4958J18343j40860N698j17312J55029J40465N7112M8979m1718j26266
20748A59417l4325p088k3347O0211p8219j05333R593J45534J11728j1858j44925
20737H1388k0819j09056P732K51080Q4117k06949k36840R970l2976P9521p0206
20726a63038J23895K50321j2911o1115r2924k16644n2051j7121O3508J45423k7998
20715f0655j06037K10884j7358j66182m7788J24334n2910M9512J31009J2405N5002
$$ plain form
20704 132216 74783 -37486 -37905 241621 173123 53386 79759 -6843 -109463 -150982 -95705
20693 -95705 -21655 -125020 -153337 -45280 111568 129215 22486 132622 221845 87374
20683 87374 58686 155267 238412 163100 160091 54258 9003 -47898 -1324 108477 185812
20672 185812 147217 226542 213961 232498 -105777 -323694 -163666 32087 -113075 -296476
20662 -296476 32374 221479 92691 -64036 -152510 -87038 89954 175545 36786 133990
20652 133990 138317 166934 121377 17243 4212 174734 229905 266971 319180 445269 335388
20641 335388 285402 144882 158734 215413 251888 93894 -7936 64966 166460 176364 213554
20630 213554 195724 100099 220671 143219 142761 291567 283619 272125 271151 331285 258134 128127
$$ packed form
20704A32216n7433j12269m19K79526o8498j19737K6373q6602j02620m1519N5277
20693i5705P4050j03365k8317J08057J56848J7647j06729J10136Q9223j34471
20683H7374k8688R6581Q3145p5312l009j05833m5255n6901M6574J09801P7335
20672A85812l8595P9325j2581J8537l38275k17917J60028J95753j45162j83401
20662b96476L28850J89105j28788j56727q8474O5472J76992Q5591j38759R7204
20652A33990M327K8617m5557j04134j3031J70522N5171L7066N2209J26089j09881
20641C35388m9986j40520J3852N6679L6475j57994j01830P2902J01494R904L7190
20630B13554j7830r5625J20572p7452m58J48806p948j1494r74O0134p3151j30007
$$ plain form
20618 128127 100385 277684 289194 336350 237079 226593 244908 261193 231544 353187 235676
20607 235676 153470 194015 230 46335 162760 117614 -13224 -171432 -102855 -99336 -128072
20596 -128072 -43730 127419 114904 -111647 -320054 -289266 -349589 -237363 -303658 -333382 -305354
20585 -305354 -228627 109952 184812 -62648 -101327 -150238 -256577 -308083 -240705 -192036 -223712
20574 -223712 -237131 -129230 143569 571938 720343 720174 632017 458986 498100 742963 773915
20563 773915 584385 343618 307155 514955 662604 638392 523382 469276 523337 522773 463295
20552 463295 383163 341062 587142 624663 450585 331188 187572 213756 272308 290177 279507
20541 279507 312745 349088 413707 335513 259048 326297 253508 105694 152821 510265 530951
$$ packed form
20618A28127k7742J77299J1510M7156r9271j0486J8315J6285k9649J21643j17511
20607B35676q2206M0545j93785M6105J16425m5146j30838j58208O8577L519k8736
20596a28072Q4342J71149j2515k26551k08407L0788o0323J12226o6295k9724K8028
20585c05354P6727L38579P4860k47460l8679m8911j06339n1506O7378M8669l1676
20574b23712j3419J07901K72799M28369J48405j69q8157j73031L9114K44863L0952
20563G73915j89530k40767l6463K07800J47649k4212j15010n4106N4061n64n9478
20552D63295q0132m2101K46080L7521j74078j19397j43616K6184N8552J7869j0670
20541B79507L3238L6343O4619p8194p6465O7249p2789j47814M7127L57444K0686
$$ plain form
20530 530951 429411 245235 142942 187254 223888 356479 411237 467745 503906 452395 473629
20519 473629 427759 489799 482422 301424 408596 343465 391287 439834 402675 391939 483028
20508 483028 551750 637069 571804 476260 359022 329850 404568 310758 284992 474754 505470
20497 505470 494454 246740 55922 184856 270401 180003 222576 268895 370679 537003
20487 537003 538264 697455 769290 527641 528746 603511 630447 750203 815750 661490 654736
20476 654736 587459 689699 841840 614886 331759 245723 231613 254725 280202 441429
20466 441429 611983 635924 491952 620021 630953 752076 800422 731356 602370 569419
20456 569419 695152 741397 795814 714484 833617 977023 1156639 1115349 1044686 1005524 1064698
$$ packed form
20530E30951j01540j84176j02293M4312L6634J32591N4758N6508L6161n1511K1234
20519D73629m5870O2040p377j80998J07172o5131M7822M8547l7159j0736R1089
20508D83028O8722Q5319o5265r5544j17238k9172P4718r3810k5766J89762L0716
20497E05470j1016k47714j90818J28934Q5545r0398M2573M6319J01784J66324
20487E37003J261J59191P1835k41649J105P4765K6936J19756O5547j54260o754
20476F54736o7277J02240J52141k26954k83127q6036j4110K3112K5477J61227
20466D41429J70554K3941j43972J28069J0932J21123M8346o9066j28986l2951
20456E69419J25733M6245N4417q1330J19133J43406J79616m1290p0663l9162N9174
$$ plain form
20445 1064698 1093072 1121610 896325 957673 1167791 1240841 1393225 1503296 1571205 1681178
20435 1681178 1690421 1565928 1643262 1773202 1910660 1910184 1949747 2083787 2109759 2236714 2535394
20424 2535394 2696653 3044006 3285158 3331382 3337341 3512308 3677969 4020170 4280556 4593977
20414 4593977 4979748 5302543 5799841 6395852 7014393 7541515 7945026 8459162 9159781
20405 9159781 9887801 10508242 11114650 11948994 13058714 14276461 15793873 17311831 18883541
20396 18883541 20767844 23230868 26081161 29417468 33397574 38155923 43726538 50523996
20388 50523996 59501440 71098596 86348482 106865405 133117092 162406844 188200479
20381 188200479 203136128 202836690 188556995 165933371 140425018 115377761 92663713
$$ packed form
20445A064698K8374K8538k25285O1348K10118P3050J52384J10071O7909J09973
20435A681178R243j24493P7334J29940J37458m76L9563J34040K5972J26955K98680
20424B535394J61259L47353K41152M6224N959J74967J65661L42201K60386L13421
20414D593977L85771L22795M97298N96011O18541N27122M03511N14136P00619
20405I159781P28020O20441O06408Q34344J109720J217747J517412J517958J571710
20396A8883541J884303K463024K850293L336307L980106M758349N570615O797458
20388E0523996Q977444J1597156J5249886K0516923K6251687K9289752K5793635
20381A88200479J4935649k99438j4279695k2623624k5508353k5047257k2714048
$$ plain form
20374 92663713 73314731 57940947 46008638 37047258 30119761 24568463 20286539 17199861
20366 17199861 14520001 12681648 11292157 9880599 8647071 7822498 7054007 6336547
20358 6336547 5745948 5363599 5100746 4903638 4795181 4749184 4537218 4296050 3950332 3518681
20348 3518681 3342526 2895291 2475137 2344540 2338158 2287705 2163284 1891184 1757025 1636872
20338 1636872 1501610 1486886 1298578 1131350 1001173 958919 1101274 1028119 796538 858377
20328 858377 907506 854782 727140 597664 446592 357704 212538 8434 -141485 44570
20318 44570 292532 361379 281524 261939 288731 178148 153009 195165 163191 176007 321402
20307 321402 260942 201990 301295 161924 135716 219346 260510 308981 379430 460742 399620
$$ packed form
20374I2663713j9348982j5373784j1932309q961380o927497n551298m281924l086678
20366A7199861k679860j838353j389491j411558j233528q24573p68491p17460
20358F336547n90599l82349k62853j97108j08457m5997k11966k41168l45718m31651
20348C518681j76155m47235m20154j30597o382n0453j24421k72100j34159j20153
20338A636872j35262j4724j88308j67228j30177m2254J42355p3155k31581O1839
20328H58377M9129n2724j27642j29476j51072q8888j45166k04104j49919J86055
20318D4570K47962O8847p9855j9585K6792j10583k5139M2156l1974J2816J45395
20307C21402o0460n8952R9305j39371k6208Q3630M1164M8471P0449Q1312o1122
$$ plain form
20296 399620 299690 260046 371361 243143 87559 -100811 -113658 -48029 77172 179789
20286 179789 176901 272736 254995 63726 35310 128735 214588 156817 -10413 73293 43146
20275 43146 10671 102045 247778 278398 311186 270885 422784 412897 402903 361986 443158 376783
20263 376783 363648 121514 233652 199943 67924 -52531 -3787 66201 -14093 -99798 -7304
20252 -7304 12605 -8942 63898 -15171 52555 82648 57126 121512 233630 259641 283208 364319
20240 364319 251734 157278 41711 -171923 -213679 -33690 -75897 -96761 -14192 36973 169095
20229 169095 187266 154681 89704 65319 60015 -34716 -10151 -20399 8898 84907 110081 95804
20217 95804 -13538 26005 81095 -11674 -244134 -350086 -301435 -239683 -122639 -34818 -178740
$$ packed form
20296C99620r9930l9644J11315j28218j55584j88370j2847O5629J25201J02617
20286A79789k888R5835j7741j91269k8416R3425Q5853n7771j67230Q3706l0147
20275D3146l2475R1374J45733L0620L2788m0301J51899r887r994m0917Q1172o6375
20263C76783j3135k42134J12138l3709j32019j20455M8744O9988q0294q5705R2494
20252g304J9909k1547P2840p9069O7726L0093k5522O4386J12118K6011K3567Q1111
20240C64319j12585r4456j15567k13634m1756J79989m2207k0864Q2569N1165J32122
20229A69095J8171l2585o4977k4385n304r4731K4565j0248K9297P6009K5174j4277
20217I5804j09342L9543N5090r2769k32460j05952M8651O1752J17044Q7821j43922
$$ plain form
20206 -178740 -286983 -510462 -599410 -563202 -485405 -470180 -334682 -338816 -328623 -407062 -381270
20195 -381270 -381512 -342033 -415018 -555220 -262733 98488 148215 155148 79404 28586 236129
20184 236129 350211 404554 305832 348068 256524 232907 247089 62187 122146 184594 193988
20173 193988 197757 215725 111329 95593 61344 183275 275254 317529 404126 466535 436212
20162 436212 377970 339611 255383 277910 424703 429816 396167 147174 -67258 -145523 -139746
20151 -139746 -136516 90119 262244 363991 325456 240282 -177890 -302323 -77723 263354
20141 263354 410116 425811 383844 296174 420387 208422 18341 -3559 58811 284126
20131 284126 382911 411328 498668 428647 357763 300762 348396 376064 156595 87393 266826
$$ packed form
20206a78740j08243k23479q8948L6208P7797J5225J35498m134J0193p8439K5792
20195c81270k42L9479p2985j40202K92487L61221M9727O933p5744n0818K07543
20184B36129J14082N4343r8722M2236r1544k3617J4182j84902N9959O2448R394
20173A93988L769J7968j04396j5736l4249J21931R1979M2275Q6597O2409l0323
20162D36212n8242l8359q4228K2527J46793N113l3649k48993k14432p8265N777
20151a39746L230K26635J72125J01747l8535q5174m18172j24433K24600L41077
20141B63354J46762J5695m1967q7670J24213k11965j90081k1900O2370K25315
20131B84126R8785K8417Q7340p0021p0884n7001M7634K7668k19469o9202J79433
$$ plain form
20120 266826 337796 169681 163334 67527 21144 67999 -31211 -66918 -3034 -126155 -122494
20109 -122494 -90144 -99591 -126155 -49200 -64292 -108486 -108905 -175607 -119355 60565 264577 391816
20097 391816 140933 18846 154174 252807 340975 333133 318411 301361 188031 -43766 -236201
20086 -236201 -65422 130013 245052 311319 350196 233234 130536 181588 103264 -72764
20076 -72764 -56193 -139889 -61831 27590 91722 61204 -94196 -194808 -176132 -165527 90418
20065 90418 232028 136134 164086 186460 174695 -39363 -4219 207941 110437 86175 139496
20054 139496 186497 156663 -30725 -66491 36915 229289 228785 157060 104275 203870 202052
20043 202052 80382 114943 220195 284019 191278 114243 61953 113799 212906 283485 304719
$$ packed form
20120B66826P0970j68115o347r5807m6383M6855r9210l5707O3884j23121L661
20109a22494L2350r447k6564P6955j5092m4194m19o6702N6252J79920K04012J27239
20097C91816k50883j22087J35328R8633Q8168p842j4722j7050j13330k31797j92435
20086b36201J70779J95435J15039O6267L8877j16962j02698N1052p8324j76028
20076g2764J6571q3696P8058Q9421O4132l0518j55400j00612J8676J0605K55945
20065I0418J41610r5894K7952K2374j1765k14058L5144K12160r7504k4262N3321
20054A39496M7001k9834j87388l5766J03406J92374n04p1725n2785R9595j818
20043B02052j21670L4561J05252O3824r2741p7035n2290N1846R9107P0579K1234
$$ plain form
20032 304719 327385 293957 92876 -152479 -196948 -65482 135975 224429 197881 113178 6452
20021 6452 -172289 -108802 -67616 -22456 56258 15421 94559 65913 34501 52926 36865 2837
20009 2837 -36890 -20376 84565 68819 -128267 -142389 15072 -4274 22562 94567 80065
19998 80065 160548 120317 81198 103429 -80270 -139893 30301 135054 154891 203361 314099
19987 314099 164500 46246 -28320 -34275 -104409 -110290 -89257 46990 181953 133537 65206
19976 65206 88604 11188 21107 212670 136403 -101750 -148459 -69594 -53916 -140042 -98069
19965 -98069 -21338 179401 203091 123143 254013 304523 132549 22564 -26233 -24460 1424
19954 1424 50027 16110 -26082 14555 118242 371202 443064 343000 174692 -68021 -191377
$$ packed form
20032C04719K2666l3428k01081k45355m4469J31466K01457Q8454k6548q4703j06726
20021F452j78741O3487M1186M5160P8714m0837P9138k8646l1412J8425j6061l4028
20009B837l9727J6514J04941j5746j97086j4122J57461j9346K6836P2005j4502
19998H0065Q0483m0231l9119K2231j83699n9623J70194J04753J9837M8470J10738
19987C14099j49599j18254p4566n955p0134n881K1033J36247J34963m8416o8331
19976F5206K3398p7416R919J91563p6267k38153m6709P8865J5678q6126M1973
19965i8069P6731K00739K3690p9948J30870N0510j71974j09985m8797J773K5884
19954A424M8603l3917m2192M0637J03687K52960P1862j00064j68308k42713j23356
$$ plain form
19943 -191377 -11952 217573 300610 172568 182405 102144 65244 166366 121795 -800 42744
19932 42744 280780 289392 268773 95702 -10487 3622 37981 78109 164677 290887 345782
19921 345782 225718 113969 26698 -165028 -187081 -89355 3739 11430 -57780 -2815 5245
19910 5245 7122 -27421 -64844 -99792 -95277 -233001 -395456 -235402 -129112 -221397 -130459
19899 -130459 29309 -109949 -87130 -76893 -120810 -105300 -144059 -283655 -379329 -256422 108655
19888 108655 234875 91025 102739 55468 9913 63596 84327 209112 144932 -6261 23479
19877 23479 -53227 -48044 -50386 90867 103269 40922 -63754 -114424 -87144 -76271 134019
19866 134019 206229 144026 6055 -114088 -65617 -33034 81191 105664 66202 124537 143370
$$ packed form
19943a91377J79425K29525Q3037j28042R837q0261l6900J01122m4571j22595M3544
19932D2744K38036Q612k0619j73071j06189J4109L4359M0128Q6568J26210N4895
19921C45782j20064j11749q7271j91726k2053R7726R3094P691o9210N4965Q060
19910E245J877l4543l7423l4948M515j37724j62455J60054J06290r2285R0938
19899a30459J59768j39258K2819J0237m3917J5510l8759j39596r5674J22907L65077
19888A08655J26220j43850J1714m7271m5555N3683K0731J24785o4180j51193K9740
19877B3479p6706N183k342J41253J2402o2347j04676n0670K7280J0873K10290
19866A34019P2210o2203j37971j20143M8471L2583J14225K4473l9462N8335J8833
$$ plain form
19855 143370 151011 23175 -51056 -37428 -42462 52062 15416 154936 189920 49666 -88791
19844 -88791 -1699 145819 215461 178820 -44581 -161132 -307056 -69227 153548 -13311
19834 -13311 -174838 -13319 -7545 -219030 -271757 -72282 14141 -135272 -116614 -108440 -140559
19823 -140559 -223694 -59638 78990 117861 94100 60494 43414 109215 116283 -21147 -6861
19812 -6861 -9474 9762 4439 -146266 -83236 -33915 -8802 -127766 -160595 -208417 -101920 -102194
19800 -102194 140056 121133 -29348 -153118 -185819 -121096 -15971 -76590 -69862 17072 177312
19789 177312 216064 261904 413211 221032 -8172 -50447 -185290 -168074 40363 79191
19779 79191 117843 240196 106954 -27524 -93707 -57683 9385 81549 215019 210871 25487
$$ packed form
19855A43370P641j27836p4231J3628n034R4524l6646J39520L4984j40254j38457
19844h8791Q7092J47518O9642l6641k23401j16551j45924K37829K22775j66859
19834a3311j61527J61519N774k11485n2727J99475Q6423j49413J8658Q174l2119
19823a40559q3135J64056J38628L8871k3761l3606j7080O5801P068j37430J4286
19812f861k613J9236n323j50705O3030M9321K5113j18964l2829m7822J06497k74
19800a02194K42250j8923j50481j23770l2701O4723J05125o0619O728Q6934J60240
19789A77312L8752M5840J51307j92179k29204m2275j34843J7216K08437L8828
19779G9191L8652J22353j33242j34478o6183L6024O7068P2164J33470m148j85384
$$ plain form
19768 25487 -27482 -57515 52772 168174 53097 -27143 89473 102971 134714 198646 402411
19757 402411 457158 409696 712375 963279 1112625 1178359 1158717 998320 690953 770798
19747 770798 821352 644611 469861 354252 252029 177732 -97972 -109963 -84054 -141730
19737 -141730 -172224 82021 259892 266014 248244 302174 307918 223882 168383 200040 319042
19726 319042 268652 68701 79311 287918 101339 -30564 -93766 -56442 -49156 -4771 -90097
19715 -90097 19589 77741 -83471 -28469 13704 31904 24024 -128441 -303204 -231418 -194573
19704 -194573 -93400 -147120 -237964 -207520 -108034 -53153 -19140 -68926 -214938 -223648 -108435
19693 -108435 -57701 -187913 -281291 -133162 -209599 -30056 -18140 -68327 -92254 1254 94842
$$ packed form
19768B5487n2969l0033J10287J15402j15077q0240J16616J3498L1743O3932K03765
19757D02411N4747m7462L02679K50904J49346O5734j9642j60397l07367P9845
19747G70798N0554j76741j74750j15609j02223p4297k75704j1991K5909n7676
19737a41730l0494K54245J77871O122j7770N3930N744q4036n5499L1657J19002
19726C19042n0390j99951J0610K08607j86579j31903o3202L7324P286M4385q5326
19715i0097J09686N8152j61212N5002M2173J8200p880j52465j74763P1786L6845
19704a94573J01173n3720r0844L0444R9486N4881L4013m9786j46012q710J15213
19693a08435N0734j30212r3378J48129p6437J79543J1916n0187k3927R3508R3588
$$ plain form
19682 94842 69886 85743 113224 51026 20024 102799 119368 72764 149858 200997 246920 58135
19670 58135 -60420 -110949 -172385 -200252 -146437 -280724 -446632 -458239 -317145 -23779 154452
19659 154452 213550 315298 302666 226438 254089 206320 134951 54597 -62347 -57233 -158130
19648 -158130 -277000 -128640 -9359 10417 130539 70552 152970 170905 26488 -98983
19638 -98983 -135823 -78973 -114182 26019 98013 166032 180444 264315 238416 177494 235001
19627 235001 250836 210416 163544 -266 93190 308104 247942 19963 -11647 -61208 -10025
19616 -10025 -50354 -100993 -178979 -255999 -313149 -181399 -226242 -404287 -370479 -320684 -347714
19605 -347714 -259095 -191854 -268787 -198673 49200 178145 75943 -26010 56582 97130 49756
$$ packed form
19682I4842k4956J5857K7481o2198l1002Q2775J6569m6604P7094N1139M5923j88785
19670E8135j18555n0529o1436k7867N3815j34287j65908j1607J41094K93366J78231
19659A54452N9098J01748j2632p6228K7651m7769p1369q0354j16944N114j00897
19648a58130j18870J48360J19281J9776J20122n9987Q2418J7935j44417j25471
19638i8983l6840N6850l5209J40201P1994O8019J4412Q3871k5899o0922N7507
19627B35001J5835m0420m6872j63810R3456K14914o0162k27979l1610m9561N1183
19616a0025m0329n0639p7986p7020n7150J31750m4843j78045L3808M9795k7030
19605c47714Q8619O7241p6933P0114K47873J28945j02202j01953Q2592M0548m7374
$$ plain form
19594 49756 96635 85624 -7411 -31842 32261 -82193 -53104 -28876 -41488 23642 145681
19583 145681 51789 9472 152026 174166 -20464 -86343 -76761 -32917 20108 -95958 -104870
19572 -104870 -41543 -23640 -154070 -141634 43006 265415 242064 -105261 -136449 53486
19562 53486 151560 149616 133135 140135 56536 -68580 -67572 -111698 -99652 -35734 96722 143543
19550 143543 64915 -16553 81482 135040 84829 88170 83934 88323 -27854 -199516 -254761 -120413
19538 -120413 -65967 -167328 -97621 -131289 -164170 -113211 -107528 -209588 -81605 19358 97276
19527 97276 42590 -125424 -127884 -84596 -133127 -186158 -251342 -140828 -156830 33410 41616
19516 41616 -8418 -120953 -184544 -223461 -307510 -452484 -380252 -179181 -114564 -30267 25294
$$ packed form
19594D9756M6879j1011r3035k4431O4103j14454K9089K4228j2612O5130J22039
19583A45681r3892m2317J42554K2140j94630o5879R582M3844N3025j16066q912
19572a04870O3327J7903j30430J2436J84640K22409k3351l47325l1188J89935
19562E3486R8074j944j6481P000q3599j25116J008m4126J2046O3918J32456M6821
19550A43543p8628q1468R8035N3558n0211L341m236M389j16177j71662n5245J34348
19538a20413N4446j01361O9707l3668l2881N0959N683j02060J27983J00963P7918
19527I7276n4686j68014k460M3288m8531n3031o5184J10514j6002J90240Q206
19516D1616n0034j12535o3591l8917q4049j44974P2232K01071O4617Q4297N5561
$$ plain form
19505 25294 130124 62703 103718 148308 -24237 -15397 49431 214494 254722 71425 34813
19494 34813 266013 438843 353385 219600 118344 -43637 57266 157209 135394 91790
19484 91790 10112 -13999 6616 -73874 -120353 -114550 -66972 -267000 -334677 -92597 16873
19473 16873 153547 190980 108221 21208 -64155 -39751 113717 172234 168073 -28041 -214284
19462 -214284 -282151 -287599 -279842 -298686 -102830 27475 51285 -90170 -126585 -101104 413
19451 413 146564 190746 21871 -76400 98262 47727 -49999 -46157 -74808 -69621 80667 9146
19439 9146 -33147 -176727 -165103 49987 116463 4707 -55967 -98184 -53708 -70665 -150383
19428 -150383 -146296 2313 173127 147112 -94711 -133432 -194903 -218213 -178995 -106195 12416
$$ packed form
19505B5294J04830o7421M1015M4590j72545Q840O4828J65063M0228j83297l6612
19494C4813K31200J72830q5458j33785j01256j61981J00903R9943k1815m3604
19484I1790q1678k4111K0615q0490m6479N803M7578k00028o7677K42080J09470
19473A6873J36674L7433q2759q7013q5363K4404J53468N8517m161j96114j86243
19462b14284o7867n448P757j8844J95856J30305K3810j41455l6415K5481J01517
19451D13J46151M4182j68875r8271J74662n0535r7726L842k8651N187J50288p1521
19439I146m2293j43580J1624K15090O6476j11756o0674m2217M4476j6957p9718
19428a50383M087J48609J70814k6015k41823l8721o1471k3310L9218P2800J18611
$$ plain form
19417 12416 117220 179494 -43355 -40890 -55859 -8418 122343 309911 355000 187815 118897
19406 118897 46672 219857 235560 196868 241599 344976 508324 596284 802380 876884 782640
19395 782640 896647 1053507 1112253 1097417 1032447 1026847 973919 635968 517649 650259 368031
19384 368031 200474 89588 -21536 -71275 100571 165950 168182 175155 178675 167891 152523
19373 152523 -6149 -54506 -92477 -121013 -85341 25404 184965 142912 198811 247375 315594
19362 315594 241304 109454 109081 224167 335650 204210 75230 -30364 -330117 -252328
19352 -252328 -15489 -17754 -84507 -165844 8448 235617 295505 305182 351102 371045 306136
19341 306136 233809 203303 208391 209806 55058 83202 114770 200532 32056 -90479 -50834
$$ packed form
19417A2416J04804O2274k22849K465j4969M7441J30761J87568M5089j67185o8918
19406A18897p2225J73185J5703l8692M4731J03377J63348Q7960K06096P4504r4244
19395G82640J14007J56860N8746j4836o4970n600n2928l37951j18319J32610k82228
19384C68031j67557j10886j11124m9739J71846O5379K232O973L520j0784j5368
19373A52523j58672m8357l7971k8536L5672J10745J59561m2053N5899M8564O8219
19362C15594p4290j31850l73J15086J11483j31440j28980j05594k99753P7789
19352b52328K36839k265o6753q1337J74292K27169N9888R677M5920J9943o4909
19341C06136p2327l0506N088J415j54748K8144L1568Q5762j68476j22535L9645
$$ plain form
19330 -50834 42037 30386 139740 226116 -1822 -213614 -362622 -394358 -205231 -99903
19320 -99903 -57410 77038 102241 141455 200819 320334 311964 313814 240784 7006 -74584
19309 -74584 -3408 82620 -48742 -68720 112102 64442 19832 -253832 -258609 -264855 -256358 -385783
19297 -385783 -201839 -74588 76492 168676 -29967 -151610 -214509 -295868 -292816 -256873 -317441
19286 -317441 -205071 -86097 -96210 -94038 -131838 -184843 -90399 17794 -100565 -184037 -201532
19275 -201532 -187026 -97985 74811 161938 3288 -76411 8302 17817 20086 79756 93924
19264 93924 53 -103378 -81662 167537 199102 335283 491568 311925 193078 111838
19254 111838 125241 -48539 60733 164613 134027 164425 146069 -133767 -295190 -176985
$$ packed form
19330e0834R2871j1651J09354Q6376k27938k11792j49008l1736J89127J05328
19320i9903M2493J34448K5203L9214N9364J19515q370J850p3030k33778q1590
19309g4584P1176Q6028j31362j9978J80822m7660m4610k73664m777o246Q497j29425
19297c85783J83944J27251J51080R2184j98643j21643o2899q1359L052L5943o0568
19286c17441J12370J18974j0113K172l7800n3005R4444J08193j18359q3472j7495
19275b01532J4506Q9041J72796Q7127j58650p9699Q4713R515K269N9670J4168
19264I3924r3871j03431K1716K49199L1565J36181J56285j79643j18847q1240
19254A11838J3403j73780J09272J03880l0586L0398j8356k79836j61423J18205
$$ plain form
19244 -176985 22444 199600 89591 -6437 -43725 79891 229951 120902 24454 113460
19234 113460 67517 60574 -16221 59882 -64741 12389 207803 235775 140330 241575 164110
19223 164110 94026 99170 147948 304257 141708 74378 -1844 19046 -89458 29826 28444
19212 28444 101277 206156 327369 273727 68661 62829 180966 83741 -138151 -193636 -40254
19201 -40254 38060 -495 -65978 -33245 -72232 -100696 51800 -36635 -144279 -225431 -127889
19190 -127889 -258447 -298430 -323558 -243184 -74811 3667 115821 18526 113335 152256 172326
19179 172326 88734 -48113 -22911 66468 117676 44624 469 -61699 -26090 -76927 14974
19168 14974 -71656 -286939 -350148 -128596 94474 247068 355720 230059 259799 95800
$$ packed form
19244a76985J99429J77156j10009r6028l7288J23616J50060j09049r6448Q9006
19234A13460m5943o943p6795P6103j24623P7130J95414K7972r5445J01245p7465
19223A64110p0084N144M8778J56309j62549o7330p6222K0890j08504J19284j382
19212B8444P2833J04879J21213n3642k05066n832J18137r7225k21892n5485J53382
19201d0254P8314l8555o5483L2733l8987k8464J52496q8435j07644q1152R7542
19190a27889j30558l9983k5128Q0374J68373P8478J12154r7295R4809L8921K0070
19179A72326q3592j36847K5202Q9379N1208p3052m4155o2168L5609n0837R1901
19168A4974q6630k15283o3209K21552K23070J52594J08652j25661K9740j63999
$$ plain form
19158 95800 46064 -19338 85830 141364 270812 300708 232098 59407 -55062 140791 191232
19147 191232 158842 163566 193040 392328 413413 295516 139714 -18108 -13449 145926 317406
19136 317406 246904 36905 -129622 -32021 29961 -167648 -192661 -25348 102156 53496
19126 53496 150664 210720 106154 89169 231579 257189 166168 136255 37613 -126679 -111651
19115 -111651 -15966 1543 56027 -50060 66606 14846 -191281 -247310 -112352 53778
19105 53778 -20566 -254138 -227748 -158168 -82140 -16966 -140245 -22950 197530 248626 267637
19094 267637 267600 158998 117039 131137 128075 180192 224115 213352 156447 14490 -62775 -168590
19082 -168590 -44234 19056 -112713 -58014 22427 -38539 -1832 159284 230473 191429 219237
$$ packed form
19158I5800m9736o5402J05168N5534J29448K9896o8610j72691j14469J95853N0441
19147A91232l2390M724K9474J99288K1085j17897j55802j57822M659J59375J71480
19136C17406p0502k09999j66527R7601O1982j97609k5013J67313J27504m8660
19126E3496R7168O0056j04566j6985J42410K5610r1021k9913r8642j64292J5028
19115a11651R5685J7509N4484j06087J16666n1760k06127n6029J34958J66130
19105E3778p4344k33572K6390O9580P6028O5174j23279J17295K20480N1096J9011
19094B67637l7j08602m1959J4098l062N2117M3923j0763n6905j41957p7265j05815
19082a68590J24356O3290j31769N4699Q0441o0966L6707J61116P1189l9044K7808
$$ plain form
19071 219237 97068 -17052 -148934 -253264 -189767 10052 120424 99052 60414 79528
19061 79528 115298 10717 -13687 63390 100383 45528 -10118 117746 82213 -80695 -13195
19050 -13195 13786 19251 -48844 43229 -1207 8423 -109986 -80539 -207476 -284380 -292478 -274926
19038 -274926 -248075 -155956 -61769 4662 -23348 -113958 -132551 -390935 -554889 -664733 -715395
19027 -715395 -566854 -304196 -166486 -38465 -78882 -76282 23539 39588 152148 286177
19017 286177 626167 667139 520587 606517 729953 771537 780698 687576 587109 612980 449902
19006 449902 388142 502547 263708 210254 265640 462967 610107 555084 407780 269616
18996 269616 165150 166692 111949 -52057 -96399 -2450 195031 192991 324928 503441 504539
$$ packed form
19071B19237j22169j14120j31882j04330O3497J99819J10372k1372l8638J9114
19061G9528L5770j04581k4404P7077L6993n4855n5646J27864l5533j62908O7500
19050a3195K6981N465o8095R2073m4436R630j18409K9447j26937p6904q098J7552
19038b74926K6851R2119R4187O6431k8010r0610j8593k58384j63954j09844n0662
19027g15395J48541K62658J37710J28021m0417K600R9821J6049J12560J34029
19017B86177L39990M0972j46552Q5930J23436M1584R161r3122j00467K5871j63078
19006D49902o1760J14405k38839n3454N5386J97327J47140n5023j47304j38164
18996B69616j04466J542n4743j64006m4342R3949J97481k040J31937J78513J098
$$ plain form
18985 504539 419870 409414 365381 488177 578499 510539 448087 464571 307683 184812 452004
18974 452004 466251 357891 268918 205219 191370 362900 363302 409664 573729 680686 610729
18963 610729 578660 576641 479433 415445 540961 545238 494995 442428 425612 297811 351421
18952 351421 429130 487821 449387 380490 496013 528950 482057 553525 610174 420377 396067
18941 396067 468665 594311 602421 443321 371110 303088 269513 338429 384757 377795 454702
18930 454702 472561 385342 368783 373387 381843 462776 510246 449077 407736 430494 385705 289330
18918 289330 182868 295246 515703 588665 542246 451294 437842 406856 643362 801169
18908 801169 669698 800672 713658 507642 582679 760829 795550 817230 716617 627667
$$ packed form
18985E04539q4669j0456m4033J22796R0322o7960o2452J6484j56888j22871K67192
18974D52004J4247j08360q8973o3699j3849J71530M02M6362J64065J06957o9957
18963F10729l2069k019r7208o3988J25516M277n0243n2567j6816j27801N3610
18952C51421P7709N8691l8434o8897J15523L2937m6893P1468N6649j89797k4310
18941C96067P2598J25646Q110j59100p2211o8022l3575O8916M6328o962P6907
18930D54702J7859q7219j6559M604Q456Q0933M7470o1169m1341K2758m4789r6375
18918B89330j06462J12378K20457P2962m6419r0952j3452l0986K36506J57807
18908H01169j31471J30974q7014k06016P5037J78150L4721K1680j00613q8950
$$ plain form
18898 627667 719655 1039807 1239694 1161050 1140730 1168186 1209098 1197192 997788 1139694 1296823
18887 1296823 1373809 1230421 1096157 1200303 1288196 1376496 1244939 1328433 1533888 1694530
18877 1694530 1795823 1796461 1941001 2036522 1947324 1954169 2077007 2326801 2539682 2788923 2850930
18866 2850930 3013237 3457751 3728121 3995037 4290086 4542606 4777074 5170745 5641464
18857 5641464 6117796 6698033 7335065 8135982 9015379 9942278 11009547 12153876 13464882
18848 13464882 15033703 16933066 19280825 21784440 24828793 28220800 32111968 37163373
18840 37163373 43720347 51913041 62857904 77588852 95739941 117467765 141684107
18833 141684107 165276607 185349316 199549891 204754918 200110266 187212281 167363328
$$ packed form
18898F27667R1988L20152J99887p8644k0320K7456M0912j1906j99404J41906J57129
18887A296823P6986j43388j34264J04146Q7893Q8300j31557Q3494K05455J60642
18877A694530J01293O38J44540R5521q9198O845J22838K49794K12881K49241O2007
18866B850930J62307M44514K70370K66916K95049K52520K34468L93671M70719
18857E641464M76332N80237O37032Q00917Q79397R26899J067269J144329J311006
18848A3464882J568821J899363K347759K503615L044353L392007L891168N051405
18840C7163373O556974Q192694J0944863J4730948J8151089K1727824K4216342
18833A41684107K3592500K0072709J4200575N205027m644652j2897985j9848953
$$ plain form
18826 167363328 143391168 118819359 95903908 75670523 58884618 45559937 35458699
18819 35458699 27794509 21946704 17597473 14285042 11731909 9572493 7787248 6390030
18811 6390030 5405396 4684540 4060117 3590486 3152063 2818927 2427859 2119744 1945389
18802 1945389 1599119 1354542 1348986 1310064 1256021 1179179 1120646 996930 933825 797986 619514
18791 619514 594600 625021 701630 619357 597567 535941 468495 343128 285425 271516 85187
18780 85187 95958 277795 141201 56386 393994 541853 529353 471536 425877 474322 487821
18769 487821 452351 645038 1105515 1437910 1499907 1384967 1222487 1026961 658346 413182
18759 413182 258734 282225 237672 269683 334759 366429 324335 319308 217322 -54204 -87059
$$ packed form
18826A67363328k3972160k4571809k2915451k0233385j6785905j3324681j0101238
18819C5458699p664190n847805m349231l312431k553133k159416j785245j397218
18811F390030r84634p20856o24423m69631m38423l33136l91068l08115j74355
18802A945389l46270k44577n556l8922n4043p6842n8533j23716o3105j35839j78472
18791F19514k4914L0421P6609q2273k1790o1626o7446j25367n7703j3909j86329
18780H5187J0771J81837j36594q4815L37608J47859j2500n7817m5659M8445J3499
18769D87821l5470J92687M60477L32395O1997j14940j62480j95526l68615k45164
18759D13182j54448K3491m4553L2011O5076L1670m2094n027j01986k71526l2855
$$ plain form
18748 -87059 -13968 -74364 62698 134038 24423 46060 105810 174175 299088 326048 180551
18737 180551 -744 56194 183260 92130 -98618 -123847 -107091 6954 109340 188454
18727 188454 191419 117751 60828 120593 100741 117360 118127 18613 12296 -101971 -366814 -411114
18715 -411114 -69223 113083 75306 41594 56731 69055 -17903 102166 59507 -48939 -149145
18704 -149145 -137444 60580 68226 132807 56039 -129755 -190863 -28608 -12209 -159576 -125617
18693 -125617 -286136 -277198 -354804 -374364 -379642 -312391 -146357 -32775 52528 76467 -62006
18682 -62006 -153675 -195971 -99831 -14548 -39183 -36700 -50581 106013 57240 -87731 -77035
18671 -77035 49717 8788 67671 37812 95702 76384 76165 235872 210319 110145 56373
$$ packed form
18748h7059P3091o0396J37062P1340j09615K1637N9750O8365J24913K6960j45497
18737A80551j81295N6938J27066r1130j90748k5229J6756J14045J02386P9114
18727A88454K965p3668n6923N9765j9852J6619P67r9514o317j14267k64843m4300
18715d11114L41891J82306l7777l3712J5137J2324q6958J20069m2659j08446j00206
18704a49145J1701J98024P646O4581p6768j85794o1108J62255J6399j47367L3959
18693a25617j60519Q938p7606j9560n278O7251J66034J13582Q5303K3939j38473
18682f2006r1669m2296R6140Q5283k4635K483j3881J56594m8773j44971J0696
18671g7035J26752m0929N8883k9859N7890j9318k19J59707k5553j00174n3772
$$ plain form
18660 56373 -43478 -63551 -7696 -54943 -178558 -250714 -171944 -106345 -393578 -476426 -584013
18649 -584013 -668934 -665179 -535836 -365059 -356139 -412412 -498243 -566484 -475988 -403858 -178885
18638 -178885 40239 366421 333315 322231 423562 463667 283208 285064 199525 25819 73112
18627 73112 128619 182666 -1554 -22322 19586 65126 51071 -109439 -49285 11824 25598
18616 25598 225514 197624 133487 93902 124228 182210 203187 392398 308886 236509 240777
18605 240777 144615 153955 252047 510806 431224 285470 41648 -22802 49558 -35185 -102912
18594 -102912 -80894 -146884 -51524 131720 179759 198942 269168 320592 236309 219580 129631
18583 129631 -148838 -329060 -305460 -167713 -21250 149185 145943 110743 231333 124795
$$ packed form
18660E6373r9851k0073N5855m7247j23615p2156P8770O5599k87233q2848j07587
18649e84013q4921L755J29343J70777Q920n6273q5831o8241R0496P2130K24973
18638a78885K19124L26182l3106j1084J01331M0105j80459J856q5539j73706M7293
18627G3112N5507N4047j84220k0768M1908M5540j4055j60510O0154O1109J3774
18616B5598J99916k7890o4137l9585L0326N7982K0977J89211q3512p2377M268
18605B40777r6162R340R8092K58759p9582j45754k43822o4450P2360q4743o7727
18594a02912K2018o5990R5360J83244M8039J9183P0226N1424q4283j6729q9949
18583A29631k78469j80222K3600J37747J46463J70435l242l5200J20590j06538
$$ plain form
18573 124795 -4865 -66587 -12200 11135 25967 -42845 85413 249166 367306 194350
18563 194350 79049 200022 223596 195523 145360 136069 109302 -30869 -22184 -122346 -303135
18552 -303135 -433817 -372413 -272931 -199589 -195848 -241073 -313531 -238128 -257647 -208689 -228012
18541 -228012 -197452 -27422 6421 -32739 18621 -15827 23302 -19166 93659 -26432 -310259
18530 -310259 -353761 -313255 -374573 -319592 -274892 -101615 -3402 -65890 -188045 -145626 87374
18519 87374 33194 -292522 -229684 -106012 -69585 -131184 -215487 -117557 -209101 -215361 -84786
18508 -84786 -105044 -68003 -10997 -106499 -135735 -51933 -26154 -137080 -108481 19841 69232
18497 69232 183020 182937 83124 -103767 -245105 -225003 -99201 81092 3998 -16906 106637
$$ packed form
18573A24795j29660o1722N4387K3335J4832o8812J28258J63753J18140j72956
18563A94350j15301J20973K3574k8073n0163r291k6767j40171Q685j00162j80789
18552c03135j30682O1404R9482P3342L741m5225p2458P5403j9519M8958j9323
18541b28012L0560J70030L3843l9160N1360l4448L9129m2468J12825j20091k83827
18530c10259m3502M0506o1318N4981M4700J73277R8213o2488j22155M2419K33000
18519H7374n4180l25716O2838J23672L6427o1599q4303R7930r1544o260J30575
18508h4786k0258L7041N7006r5502k9236Q3802K5779j10926K8599J28322M9391
18497F9232J13788q3r9813j86891j41338K0102J25802J80293p7094k0904J23543
$$ plain form
18486 106637 196398 -12683 -91655 -24507 91389 171709 114611 33570 -52859 -71204 -169234
18475 -169234 -44465 246048 159997 37434 47635 48405 1800 33493 66222 -84092 -226945
18464 -226945 -296245 -281489 12909 79500 31864 -28975 -64565 101709 207944 93959 4592
18453 4592 69007 267774 274742 220097 185812 137111 66101 150481 113402 85874 -73934 -104182
18441 -104182 -64499 84747 200469 216423 177016 171270 90606 70494 75323 9089 -1804
18430 -1804 -10634 44964 -249297 -247630 64532 -8563 15941 -86362 -226070 -224561 -247832 -211825
18418 -211825 -52688 -166617 -227564 -301283 -207754 11651 128679 192844 127702 234792
18408 234792 81602 -41140 -108252 -36883 51725 120302 57115 71572 159708 281649 108679
$$ packed form
18486A06637Q9761k09081p8972O7148J15896Q0320n7098q1041q6429j8345r8030
18475a69234J24769K90513q6051j22563J0201P70m6605L1693L2729j50314j42853
18464b26945o9300J4756K94398O6591m7636o0839l5590J66274J06235j13985q9367
18453D592O4415J98767O968n4645l4285m8701p1010Q4380l7079k7528j59808l0248
18441a04182L9683J49246J15722J5954l9407n746q0664k0112M829o6234j0893
18430a804q830N5598k94261J667L12162p3095K4504j02303j39708J509k3271L6007
18418b11825J59137j13929o0947p3719R3529K19405J17028O4165o5142J07090
18408B34792j53190j22742o7112P1369Q8608O8577o3187J4457Q8136J21941j72970
$$ plain form
18397 108679 35 -97061 -108113 38134 95396 185478 160882 151385 236412 292750 158910
18386 158910 31290 -15717 -34186 -53174 25476 202969 316410 251554 242401 310090 186994
18375 186994 91892 107941 36366 80646 4984 66853 23403 14765 71105 202476 96719
18364 96719 -111033 -100559 9621 25651 38330 114227 69051 -6843 -40991 92420 136032
18353 136032 120160 137517 262262 360035 209351 142245 12623 -153204 -84355 -76934 -115270
18342 -115270 -131080 -28179 65565 -42916 -156958 -244974 -244979 -108461 -92299 -153444 -299258
18331 -299258 -389909 -332459 -341776 -368726 -485388 -405881 -402306 -360646 -138700 21818 10769
18320 10769 -68795 -129441 -218850 -198369 -168615 -185634 -146471 -136384 133760 297653 213471
$$ packed form
18397A08679j08644r7096j1052J46247N7262R0082k4596r497Q5027N6338j33840
18386A58910j27620m7007j8469j8988P8650J77493J13441o4856r153O7689j23096
18375A86994r5102J6049p1575M4280p5662O1869m3450q638N6340J31371j05757
18364I6719k07752J0474J10180J6030J2679P5897m5176p5894l4148J33411M3612
18353A36032j5872J7357J24745R7773j50684o7106j29622j65827O8849P421l8336
18342a15270j5810J02901R3744j08481j14042q8016nJ36518J6162o1145j45814
18331b99258r0651N7450r317k6950j16662P9507L575M1660K21946J60518j1049
18320A0769p9564o0646q9409K0481K9754j7019L9163J0087K70144J63893q4182
$$ plain form
18309 213471 15105 -38558 -94037 -257561 -419825 -520751 -529130 -600500 -409898 -212889
18299 -212889 89915 321632 531773 716267 702085 685924 805360 772858 539650 444416
18289 444416 609231 850263 621381 443015 263315 154598 73700 303505 506698 524964
18279 524964 449057 376666 375057 383298 317397 358670 273431 283111 529398 564417 660168 703461
18267 703461 754607 742506 950392 1189371 1151607 1218101 1232989 1237392 1249285 1211837 1146728
18256 1146728 1029958 839004 548830 483549 463073 466443 446855 436617 465761 420775 444927
18245 444927 481342 360466 348054 543987 550329 547140 444958 347415 359911 425688 361301
18234 361301 388420 328430 335649 491702 551022 551985 409676 267170 198803 16000 -104089
$$ packed form
18309B13471j98366n3663n5479j63524j62264j00926q379p1370J90602J97009
18299b12889L02804K31717K10141J84494j4182j6161J19436l2502k33208r5234
18289D44416J64815K41032k28882j78366j79700j08717q0898K29805K03193J8266
18279E24964p5907p2391j609Q241o5901M1273q5239R680K46287L5019R5751M3293
18267G03461N1146j2101K07886K38979l7764O6494J4888M403J1893l7448o5109
18256A146728j16770j90954k90174o5281k0476L370j9588j0238K9144m4986K4152
18245D44927L6415j20876j2412J95933O342l189j02182r7543J2496O5777o4387
18234C61301K7119n9990P219J56053N9320R63j42309j42506o8367j82803j20089
$$ plain form
18223 -104089 -205596 -172116 -3989 71410 127712 258665 437040 671388 554332 529125
18213 529125 409988 287068 238456 180597 200588 223598 368988 558296 614937 645240 436893
18202 436893 311232 420804 349407 144574 168352 287990 528894 487884 500534 577396
18192 577396 550862 553359 693473 619926 652266 687199 621377 466747 296859 222013 302273
18181 302273 424167 483480 467825 439282 386403 470002 558412 599775 659844 722524 774899
18170 774899 879493 834586 715723 785751 782661 850748 1006646 1121258 1058154 1048076 1081362
18159 1081362 1113688 1124905 1251870 1350153 1392226 1709285 1724396 1622524 1635918 1425846
18149 1425846 1431727 1595799 1758664 1903943 2055172 2183716 2467713 2503354 2525784 2790950
$$ packed form
18223a04089j01507L3480J68127P5399N6302J30953J78375K34348j17056k5207
18213E29125j19137j22920m8612n7859J9991K3010J45390J89308N6641L0303k08347
18202D36893j25661J09572p1397k04833K3778J19638K40904m1010J2650P6862
18192E77396k6534K497J40114p3547L2340L4933o5822j54630j69888p4846Q0260
18181C02273J21894N9313j5655k8543n2879Q3599Q8410M1363O0069O2680N2375
18170G74899J04594m4907j18863P0028l090O8087J55898J14612o3104j0078L3286
18159A081362L2326J1217J26965R8283M2073L17059J5111j01872J3394k10072
18149A425846N881J64072J62865J45279J51229J28544K83997L5641K2430K65166
$$ plain form
18139 2790950 3129824 3540562 3902948 4214388 4568393 5012137 5457790 5964017 6438510
18130 6438510 7197095 7884821 8548024 9315284 10156998 11204554 12217690 13646449 15653894
18121 15653894 17890709 20236431 23256169 26691583 30710092 35398227 40849069 47939816
18113 47939816 57463078 71096184 93357553 132618274 196224007 262098446 274978607
18106 274978607 234258913 188420735 153642376 119914176 87678992 62498465 45339802
18099 45339802 33710480 25422331 19466672 15236202 11961748 9467707 7709870 6220926
18091 6220926 5171295 4200129 3496968 2837017 2236775 1833548 1786268 1875443 1740731 1490845
18081 1490845 1368490 1285542 1225387 1105651 972367 831083 591268 498348 503247 421944
$$ packed form
18139B790950L38874M10738L62386L11440L54005M43744M45653N06227M74493
18130F438510P58585O87726O63203P67260Q41714J047556J013136J428759K007445
18121A5653894K236815K345722L019738L435414M018509M688135N450842P090747
18113D7939816R523262J3633106K2261369L9260721O3605733O5874439J2880161
18106B74978607m0719694m5838178l4778359l3728200l2235184k5180527j7158663
18099D5339802j1629322q288149n955659m230470l274454k494041j757837j488944
18091F220926j049631r71166p03161o59951o00242m03227m7280Q9175j34712k49886
18081A490845j22355q2948o0155j19736j33284j41284k39815r2920M899q1303
$$ plain form
18071 421944 314396 354066 389535 399963 367114 318504 327200 398002 394235 359619 206554
18060 206554 161160 226690 327982 303538 216232 130354 106115 163542 -29378 -20032 473
18049 473 -19546 -61457 -156775 -130185 -137844 -152440 -16457 75779 -54651 -158601 -204795 -93214
18037 -93214 -37237 -32085 -95030 -73232 -74624 -38821 174405 196936 -11869 -126732 -216844
18026 -216844 -455623 -374485 -290144 -210188 -169591 -31914 2620 -31072 -78290 -154948 -155495
18015 -155495 -253008 -365643 -296916 -220301 -152756 -318080 -359686 -170802 -9253 -74597 -219280
18004 -219280 -333221 -414775 -486975 -510801 -486821 -337746 -219410 -274807 -372501 -249482 -193735
17993 -193735 -69068 -85558 74262 147851 34550 -57786 -123896 -105377 -22920 99518 79907
$$ packed form
18071D21944j07548L9670L5469J0428l2849m8610Q696P0802l767l4616j53065
18060B06554m5394O5530J01292k4444q7306q5878k4239N7427j92920R346K0505
18049D73k0019m1911r5318K6590p659j4596J35983R2236j30430j03950m6194J11581
18037i3214N5977N152o2945K1798j392L5803K13226K2531k08805j14863r0112
18026b16844k38779Q1138Q4341P9956M0597J37677L4534l3692m7218p6658n47
18015a55495r7513j12635O8727P6615O7545j65324m1606J88884J61549o5344j44683
18004b19280j13941q1554p2200k3826K3980J49075J18336n5397r7694J23019N5747
17993a93735J24667j6490J59820P3589j13301r2336o6110J8519Q2457J22438j9611
$$ plain form
17982 79907 -17856 -29171 -112405 -246291 -168459 -23327 154945 42974 89414 45192 22583
17971 22583 45483 -18339 -130801 -37358 137716 111464 60705 -122396 -195537 -354344 -413650
17960 -413650 -144252 -169958 -245069 -258887 -266580 -372557 -420732 -448266 -407754 -303919 -119138
17949 -119138 -12744 -56850 -230562 -209684 -86792 31340 109050 4982 -203742 -294315
17939 -294315 -151670 17915 4640 -87469 -126929 -230628 -332182 -313086 -271757 -309101 -326937
17928 -326937 -320875 -295769 -325004 -545858 -745150 -726571 -698264 -619541 -548358 -506551 -522358
17917 -522358 -397570 152846 730527 543323 490381 551767 539452 373751 292012 317474
17907 317474 285686 258560 200207 -18125 -139154 -111961 -116590 -141861 -253235 -171878 -85118
$$ packed form
17982G9907r7763j1315q3234j33886P7832J45132J78272j11971M6440m4222k2609
17971B2583K2900o3822j12462R3443J75074k6252n0759j83101p3141j58807n9306
17960d13650K69398k5706p5111j3818p693j05977m8175k7534M0512J03835J84781
17949a19138J06394m4106j73712K0878J22892J18132P7710j04068k08724r0573
17939b94315J42645J69585j3275r2109l9460j03699j01554J9096M1329l7344j7836
17928c26937O062K5106k9235k20854j99292J8579K8307P8723P1183M1807j5807
17917e22358J24788N50416N77681j87204n2942O1386j2315j65701q1739K5462
17907C17474l1788k7126n8353k18332j21029K7193m629k5271j11374Q1357Q6760
$$ plain form
17896 -85118 -70789 103358 20960 -196720 -389462 -297286 -142027 -48825 -44202 -27686 72547
17885 72547 236822 139596 6748 -124025 -166502 -77390 90668 63304 57691 -111384 -282658
17874 -282658 -84433 -17193 -126788 -131566 -41532 -75098 -189579 -59661 -7324 -134400 -94037
17863 -94037 -170709 -328792 -214965 7408 -70589 -104570 -214725 -246745 -151195 -195099 -174676
17852 -174676 -46760 42901 55055 211129 107351 23623 -40542 111264 195060 43169
17842 43169 -94588 -65525 -68342 -172644 -159778 140522 138646 -13153 -40517 -41310 -13845 -11297
17830 -11297 -47318 -232062 -303258 -225321 -277493 -377747 -373141 -297202 -241788 -213721 -73320
17819 -73320 -138616 -235711 -173694 -28966 138390 101585 -2250 -70759 24443 86347 16413
$$ packed form
17896h5118J4329J74147q2398k17680j92742R2176J55259R3202M623J6516J00233
17885G2547J64275r7226j32848j30773m2477Q9112J68058k7364n613j69075j71274
17874b82658J98225O7240j09595m778R0034l3566j14481J29918N2337j27076M0363
17863i4037p6672j58083J13827K22373p7997l3981j10155l2020R5550m3904K0423
17852a74676J27916Q9661J2154J56074j03778q3728o4165J51806Q3796j51891
17842D3169j37757K9063k817j04302J2866L00300j876j51799k7364p93K7465K548
17830a1297l6021j84744p1196P7937n2172j00254M606P5939N5414K8067J40401
17819g3320o5296r7095O2017J44728J67356l6805j03835o8509R5202O1904o9934
$$ plain form
17808 16413 -97037 -222875 -217678 -139342 -76706 -3447 6727 -41246 -152144 -236540 -296354
17797 -296354 -204459 -78791 79186 62133 -158361 -270093 11292 -87209 -120641 -99582
17787 -99582 -115009 -135477 -282980 -178208 -294391 -274189 -178267 -77186 -18408 22860 -80468
17776 -80468 -158279 -133068 -218855 -339280 -346526 -371917 -361408 -265403 -335244 -169175 -140817
17765 -140817 -144074 -227370 -216417 -192774 -79798 -55007 -221489 -360497 -252013 -242866 -243960
17754 -243960 -244711 -319157 -319764 -244996 -209635 -17658 80882 -144142 -163977 -124706 42305 180268
17742 180268 137529 45916 -119689 -259636 -124718 -45231 -143838 -255312 -45809 -11990
17732 -11990 -245473 -133447 38045 200070 101080 40402 202850 38220 89550 119475
$$ packed form
17808A6413j13450j25838N197P8336O2636P3259J0174m7973j10898q4396n9814
17797b96354R1895J25668J57977j7053k20494j11732K81385r8501l3432K1059
17787i9582j5427k0468j47503J04772j16183K0202R5922J01081N8778M1268j03328
17776h0468p7811K5211q5787j20425p246k5391J0509R6005o9841J66069K8358
17765a40817l257q3296J0953K3643J12976K4791j66482j39008J08484R147j094
17754b43960p51p4446o07P4768L5361J91977R8540k25024j9835L9271J67011J37963
17742A80268m2739r1613j65605j39947J34918P9487r8607j11474K09503L3819
17732a1990k33483J12026J71492J62025r8990o0678J62448j64630N1330K9925
$$ plain form
17722 119475 197 -235504 -326948 -251256 -169213 -73606 -95773 -128967 -147971 -151879 -75014
17711 -75014 -39164 -41709 16323 135156 137096 -42516 -243591 -218556 -179714 -154467 20725
17700 20725 -29667 -219384 -200151 -184124 -254284 -47393 -92873 -101623 -52127 -66468 -79350
17689 -79350 -93905 -178914 -60767 -19287 -85278 -100127 -152081 -144844 -88798 33969 95938
17678 95938 -69526 -24316 -8640 115109 189640 81904 64808 112144 209229 168814 -39121
17667 -39121 237 -55881 -12583 -67494 -208149 -124093 -45277 -15767 -68707 2627 -36141
17656 -36141 -114527 -68762 -11610 96434 46588 16291 -95544 -16413 63071 -26935 -6098
17645 -6098 84213 11024 -45184 39072 162515 175576 26974 -110823 -99189 118986 34957
$$ packed form
17722A19475j19278k35701r1444P5692Q2043R5607k2167l3194j9004l908P6865
17711g5014L5850k545N8032J18833J940j79612k01075K5035L8842K5247J75192
17700B0725n0392j89717J9233J6027p0160K06891m5480q750M9496j4341j2882
17689g9350j4555q5009J18147M1480o5991j4849n1954P237N6046J22767O1969
17678I5938j65464M5210J5676J23749P4531j07736j7096M7336R7085m0415k07935
17667c9121L9358n6118M3298n4911j40655Q4056P8816K9510n2940P1334l8768
17656c6141p8386M5765N7152J08044m9846l0297j11835P9131P9484r0006K0837
17645f098R0311p3189n6208Q4256J23443J3061j48602j37797J1634K18175q4029
$$ plain form
17634 34957 -206146 -180986 -58533 -182339 -282137 -8567 136766 72489 17536 -163818
17624 -163818 -116705 -247130 -213812 -153108 -117723 -91615 -84685 -49197 -66037 12983 98323
17613 98323 39966 -94420 -213236 -201831 -246989 -342823 -315216 -293872 -310184 -151754 -147409
17602 -147409 -171001 -180933 -254942 -115287 -37166 26369 -77629 -66857 69555 126194 -36161
17591 -36161 -70438 -70567 -49351 -66548 -107848 -243021 -479067 -512833 -482089 -374374 -302470
17580 -302470 -357385 -400078 -275010 -174142 -44709 103786 41606 -79283 -119567 -265964
17570 -265964 -227575 -14135 -58086 -246424 -187786 -64688 138012 138614 -3258 -119107 -32408
17559 -32408 -34007 -57488 -34345 81867 169331 96944 -51938 -251158 -389501 -209819 -147810
$$ packed form
17634C4957k41103K5160J22453j23806r9798K73570J45333o4277n4953j81354
17624a63818M7113j30425L3318O0704L5385K6108O930L5488j6840P9020Q5340
17613I8323n8357j34386j18816J1405m5158r5834K7607K1344j6312J58430M345
17602a47409k3592r932p4009J39655P8121O3535j03998J0772J36412N6639j62355
17591c6161l4277j29K1216j7197m1300j35173k36046l3766L0744J07715P1904
17580c02470n4915m2693J25068J00868J29433J48495o2180j20889m0284j46397
17570b65964L8389K13440m3951j88338N8638J23098K02700O02j41872j15849Q6699
17559c2408j599k3481K3143J16212Q7464p2387j48882j99220j38343J79682O2009
$$ plain form
17548 -147810 -126744 -86125 -14865 -70493 -84119 -27584 -228456 -228388 -206295 -254980 -197135 -290390
17536 -290390 -401701 -245224 -208697 -258231 -200643 -16001 275417 282922 269197 320448 234766
17525 234766 287630 221578 -78469 -204073 -36431 96581 131396 153057 133718 93715 -1194
17514 -1194 -101723 -167270 -126808 109550 245002 196396 127342 185441 203012 183360 231650
17503 231650 297087 349610 287755 262866 207568 176254 4465 -43363 22300 57105 -45579
17492 -45579 -23279 139022 157058 147503 113674 147930 104692 184489 219155 239728 208769 260694
17480 260694 207766 142554 22062 -62598 -41098 99516 114544 115406 254241 66480 -175253
17469 -175253 -116338 -75654 76088 82840 -15655 -166874 -212803 -143142 -170347 -69525 140163
$$ packed form
17548a47810K1066M0619P1260n5628j3626N6535k00872O8K2093m8685N7845r3255
17536b90390j11311J56477L6527m9534N7588J84642K91418P505j3725N1251q5682
17525B34766N2864o6052l00047j25604J67642J33012L4815K1661j9339m0003r4909
17514a194j00529o5547M0462K36358J35452m8606o9054N8099J7571j9652M8290
17503B31650O5437N2523o1855k4889n5298l1314j71789m7828O5663L4805j02684
17492d5579K2300J62301J8036r555l3829L4256m3238P9797L4666K0573l0959N1925
17480B60694n2928o5212j20492q4660K1500J40614J5028Q62J38835j87761k41733
17469a75253N8915M0684J51742O752r8495j51219m5929O9661k7205J00822K09688
$$ plain form
17458 140163 256666 228574 234498 16559 102819 172738 21425 -26270 38964 243916 285019
17447 285019 373437 525303 478795 457288 660018 994649 1248804 1105694 807275 698271
17437 698271 608267 694483 565962 444871 324316 442932 580698 366725 158462 223225
17427 223225 138539 -5938 43244 -103207 -90319 -46485 141270 150766 32896 -93895 -228149
17416 -228149 -359855 -275284 -196713 72229 115170 103676 221392 206171 9951 -32692 68617
17405 68617 -54734 -26967 19711 -29700 17335 96105 166461 29421 -180165 -206226 -129943
17394 -129943 -269421 -278784 -233429 -206304 -260674 -301601 -213910 -17774 64601 -51806 -123675
17383 -123675 -124200 -122019 -279075 -280776 -342000 -316439 -222444 -316884 -217102 -215056 -313829 -207407
$$ packed form
17458A40163J16503k8092N924k17939Q6260O9919j51313m7695O5234K04952M1103
17447B85019Q8418J51866m6508k1507K02730L34631K54155j43110k98419j09004
17437F98271r0004Q6216j28521j21091j20555J18616J37766k13973k08263O4763
17427B23225q4686j44477M9182j46451J2888M3834J87755R496j17870j26791j34254
17416b28149j31706Q4571P8571K68942M2941j1494J17716j5221j96220m2643J01309
17405F8617j23351K7767M6678m9411M7035P8770P0356j37040k09586k6061P6283
17394a29943j39478r363M5355K7125n4370m0927Q7691J96136Q2375j16407p1869
17383a23675n25K181j57056j701o1224K5561R3995r4440R9782K046r8773J06422
$$ plain form
17371 -207407 -129177 -267826 -296703 -192885 -93120 -173565 -173208 -299840 -221813 -141755 -169952
17360 -169952 -36254 127690 -69528 -187831 -149188 -74244 -70164 -62743 85843 -35664 -83869
17349 -83869 -67627 22734 137340 81448 7028 237776 170397 -191563 -78350 -89625 -280224
17338 -280224 -234061 -185759 -112192 -47070 49273 120550 -94605 -140185 -147204 -106261 -133051
17327 -133051 -66096 34685 185992 159052 2049 72889 130604 108137 13595 -15824 82813
17316 82813 122092 136724 -79006 -116880 -33942 -20686 -72263 -113956 -167500 -290633 -130154
17305 -130154 -73672 15596 -87454 35709 213093 59717 64727 14593 -52146 -103876 -96776
17294 -96776 -105973 -69735 -61950 1451 9846 -25758 165743 89464 -14720 1594 81121 32785
$$ packed form
17371b07407P8230j38649k8877J03818R9765q0445L57j26632P8027Q0058k8197
17360a69952J33698J63944j97218j18303L8643P4944M080P421J48586j21507m8205
17349h3869J6242R0361J14606n5892p4420K30748o7379l61960J13213j1275j90599
17338b80224M6163M8302P3567O5122R6343P1277k15155m5580p019M0943k6790
17327a33051O6955J00781J51307k6940j57003P0840N7715k2467r4542k9419R8637
17316H2813L9279J4632k15730l7874Q2938J3256n1577m1693n3544j23133J60479
17305a30154N6482Q9268j03050J23163J77384j53376N010n0134o6739n1730P100
17294i6776r197L6238P785O3401Q395l5604J91501p6279j04184J6314P9527m8336
$$ plain form
17282 32785 -10073 -77013 -105675 57668 118954 144963 147793 133808 83841 369579 386085
17271 386085 236312 662 -93292 -18757 -58015 -40058 -25538 -124688 -171849 -115545 148169
17260 148169 192107 42359 -142358 -157865 -115822 83981 10328 3596 82389 92603 134648
17249 134648 36667 11926 82990 3255 59527 65664 -97358 -50021 58835 67334 -66882
17238 -66882 -111961 -185925 -169301 -233172 -230756 -110136 -94393 -160149 -118097 33080 77515
17227 77515 133921 289925 199014 -87323 -65489 33045 115648 133119 45294 -2590 14988
17216 14988 99055 54253 -64874 -6726 96032 131385 214930 221131 148746 256438 148747
17205 148747 141720 144025 2836 -33534 46469 -82994 -257016 -98546 168414 293721 281194
$$ packed form
17282C2785m2858o6940k8662J63343O1286K6009K830j3985m9967K85738J6506
17271C86085j49773k35650r3954P4535l9258J7957J4520r9150m7161N6304K63714
17260A48169M3938j49748j84717j5507M2043J99803p3653o732P8793J0214M2045
17249A34648r7981k4741P1064p9735N6272O137j63022M7337J08856Q499j34216
17238f6882m5079p3964J6624o3871K416J20620J5743o5756M2052J51177M4435
17227G7515N6406J56004r0911k86337K1834R8534Q2603J7471q7825m7884J7578
17216A4988Q4067m4802j19127N8148J02758L5353Q3545O201p2385J07692j07691
17205A48747p027K305j41189l6370Q0003j29463j74022J58470K66960J25307j2527
$$ plain form
17194 281194 271650 172281 147643 70568 -3658 65510 29841 -136700 -267305 -219019 -60221
17183 -60221 11901 -281644 -234975 -53338 -66424 -109305 -136628 -23893 -29801 -40911 -112596
17172 -112596 -86543 -171237 -283143 -280169 -186863 -38501 7344 42992 -68120 -83634 -18424
17161 -18424 -38681 -169071 -156867 -114525 117695 -36223 -94865 -143309 -150759 -7979 244109
17150 244109 116257 28443 -12816 63969 34971 -109181 -110539 -174613 -254967 -89723 -88072
17139 -88072 -217477 -39063 63082 22135 16400 -36207 37310 180276 -31897 -145247 89699
17128 89699 329261 225196 20087 83378 128659 156278 86865 163010 241576 205484 85677
17117 85677 220063 252222 186697 315986 326964 173959 137159 -26428 -105802 -126928 -67986
$$ packed form
17194B81194r544r9369k4638p7075p4226O9168l5669j66541j30605M8286J58798
17183f0221P2122k93545M6669J81637j3086m2881k7323J12735n908j1110p1685
17172a12596K6053q4694j11906K974R3306J48362M5845L5648j11112j5514O5210
17161a8424k0257j30390J2204M2342K32220j53918n8642m8444p450J42780K52088
17150B44109j27852q7814m1259P6785k8998j44152j358o4074q0354J65244J651
17139h8072j29405J78414J02145m0947n735n2607P3517J42966k12173j13350K34946
17128H9699K39562j04065k05109O3291M5281K7619o9413P6145P8566l6092j19807
17117H5677J34386L2159o5525J29289J0978j53005l6800j63587p9374k1126N8942
$$ plain form
17106 -67986 12523 -39118 -56808 -91650 -181205 -104193 -65064 -146933 -45877 75059 420141
17095 420141 451229 268032 169367 109004 126911 133401 23655 -70561 -8248 -5604 -133213
17084 -133213 -20412 157268 121655 -86307 -132382 -106674 -230512 -212616 -192193 -18842
17074 -18842 36924 84745 122717 274999 246240 127712 -26577 -29889 17328 -111154 25931
17063 25931 68374 118593 22003 -143062 -70345 -6202 -76195 -266659 -232593 -122095 -104816
17052 -104816 -52404 -120823 -177562 -422398 -536439 -301806 42688 176091 213486 393881
17042 393881 389451 339964 244471 141950 190434 75695 -61821 -71760 161734 83884 -83480
17031 -83480 -90456 -96992 -249320 -344098 -243408 -203687 -218203 -55982 46155 13505 30899
$$ packed form
17106f7986Q0509n1641j7690l4842q9555P7012L9129q1869J01056J20936L45082
17095D20141L1088j83197r8665o0363J7907O490j09746r4216O2313K644j27609
17084a33213J12801J77680l5613k07962m6075K5708j23838J7896K0423J73351
17074a8842N5766M7821L7972J52282k8759j18528j54289l312M7217j28482J37085
17063B5931M2443N0219r6590j65065P2717O4143o9993j90464L4066J10498J7279
17052a04816N2412o8419n6739k44836j14041K34633L44494J33403L7395J80395
17042C93881m430m9487r5493j02521M8484j14739j37516r939K33494p7850j67364
17031h3480o976o536j52328r4778J00690L9721j4516J62221J02137l2650J7394
$$ plain form
17020 30899 -103752 -203647 -23158 141535 308485 473614 311670 80682 93046 104592
17010 104592 -100950 -80665 51703 -139186 -221676 -141507 -53000 -61148 83702 196708 253643
16999 253643 213892 -14437 31377 116104 194876 85527 -46539 -275174 -69982 213038
16989 213038 276964 189707 112413 128761 -9815 -74377 81126 -22804 -72131 -27049 67023
16978 67023 -693 -55827 -87046 -78099 -59936 -142707 -222025 -151256 -68941 -105401 -11019 41314
16966 41314 -55856 -188984 -117483 -44435 -150411 -158890 -251649 -397752 -382602 -202176 -3783
16955 -3783 71192 76682 97054 -82824 35609 259673 328624 443182 480458 510776 360516
16944 360516 113514 152580 35372 -55014 38497 149188 167895 88370 116436 241523 135754
$$ packed form
17020C0899j34651r9895J80489J64693J66950J65129j61944k30988J2364J1546
17010A04592k05542K0285J32368j90889q2490Q0169Q8507q148J44850J13006N6935
16999B53643l9751k28329M5814Q4727P8772j09349j32066k28635K05192K83020
16989B13038O3926q7257p7294J6348j38576o4562J55503j03930m9327M5082R4072
16978F7023o7716n5134l1219Q947J8163q2771p9318P0769Q2315l6460R4382N2333
16966D1314r7170j33128P1501P3048j05976q479r2759j46103J5150J80426J98393
16955c783P4975N490K0372j79878J18433K24064O8951J14558L7276L0318j50260
16944C60516k47002L9066j17208r0386R3511J10691J8707p9525K8066J25087j05769
$$ plain form
16933 135754 65052 -96015 -163839 -75798 -112624 -99152 -37327 96879 147585 64897 -13338
16922 -13338 58525 -32103 -253836 -335006 -246017 -313306 -347651 -297148 -129968 -102259 -151841
16911 -151841 -19517 -5365 -150368 -161475 -204713 -358171 -195427 52107 109244 196400
16901 196400 193410 63245 -41400 26560 -62879 -82267 19502 -41785 -128742 -123429 -148408
16890 -148408 -124068 31826 -6799 -95506 -5247 61936 -1297 -58882 11200 152302 -81036
16879 -81036 -127643 -82428 -91944 -136906 -243303 -353789 -173541 -97941 -186597 -208665 -235934
16868 -235934 -254214 -115918 -29542 83665 55434 134478 93346 46307 -48069 -180297 -277470
16857 -277470 -225972 15566 119560 -4503 -12918 19165 110098 280368 342565 253738 288765
$$ packed form
16933A35754p0702j61067o7824Q8041l6826J3472O1825J34206N0706q2688p8235
16922a3338P1863r0628k21733q1170Q8989o7289l4345N0503J67180K7709m9582
16911a51841J32324J4152j45003j1107m3238j53458J62744K47534N7137Q7156
16901A96400k990j30165j04645O7960q9439j9388J01769o1287q6957N313k4979
16890a48408K4340J55894l8625q8707R0259O7183o3233n7585P0082J41102k33338
16879h1036m6607M5215r516m4962j06397j10486J80248P5600q8656k2068k7269
16868b35934j8280J38296Q6376J13207k8231P9044m1132m7039r4376j32228r7173
16857b77470N1498K41538J03994j24063q415L2083R0933J70270O2197q8827L5027
$$ plain form
16846 288765 249673 228956 232049 52386 -75408 -150204 -145293 7427 37411 -102567 40578
16835 40578 137586 178216 71043 -82850 -77179 -210674 -193230 -150689 -242291 -328271 -246493
16824 -246493 -174848 -56018 178507 278651 290497 264391 184339 392857 356575 19608
16814 19608 -170609 -156471 -2255 94889 87190 -132715 -38281 144115 96018 115770 95163
16803 95163 157644 211728 86714 -32697 -82342 -78854 -32094 -37225 29992 -39933 -24624 -86372
16791 -86372 -88641 -67774 14685 199104 162267 153598 175450 36674 -26194 -34206 15068 -69522
16779 -69522 -213530 -143573 -53945 -97464 59387 228768 115899 84324 71543 57383 91453
16768 91453 120847 -212136 -393324 -167692 -96027 -149781 -199318 -92130 -34461 -55595 -187003
$$ packed form
16846B88765l9092k0717L093j79663j27794p4796M911J52720K9984j39978J43145
16835D0578R7008M0630j07173j53893N671j33495J7444M2541r1602q5980Q1778
16824b46493P1645J18830K34525J00144J1846k6106q0052K08518l6282l36967
16814A9608j90217J4138J54216R7144p699k19905R4434J82396m8097J9752k0607
16803I5163O2481N4084j25014j19411m9645L488M6760n131O7217o9925J5309o1748
16791h6372k269K0867Q2459J84419l6837q669K1852j38776o2868q012M9274q4590
16779f9522j44008O9957Q9628m3519J56851J69381j12869l1575j2781j4160L4070
16768I1453K9394l32983j81188K25632P1665n3754m9537J07188N7669k1134j31408
$$ plain form
16757 -187003 -211170 -166290 -156107 -257312 -286725 -327484 -423632 -268807 -235779 -175374 -79819
16746 -79819 -120096 -63384 -49822 -1836 -122506 -83706 -118690 -137124 -90854 58820 19060
16735 19060 85497 127949 131254 119351 -31977 132544 190394 192492 249417 171843 29111
16724 29111 -14570 -49086 -113793 -198012 -244640 -288319 -107979 54154 12000 53393 155881
16713 155881 98551 32484 -123236 -62410 63425 3989 -67351 61772 141431 92732 -58292
16702 -58292 -93442 24814 34273 -64812 -126197 -243461 -278504 -206022 -159327 22264 215045
16691 215045 241551 236608 164758 72617 -69725 92746 253195 331226 264076 50308 38145
16680 38145 56140 109606 77996 55358 71617 186306 294979 176235 229756 363500 268906
$$ packed form
16757a87003k4167M4880J0183j01205k9413m0759r6148J54825L3028O0405R5555
16746g9819m0277N6712J3562M7986j20670L8800l4984j8434M6270J49674l9760
16735A9060O6437M2452L305j1903j51328J64521N7850K098N6925p7574j42732
16724B9111m3681l4516o4707q4219m6628m3679J80340J62133m2154M1393J02488
16713A55881n7330o6067j55720O0826J25835n9436p1340J29123P9659m8699j51024
16702e8292l5150J18256R459r9085o1385j17264l5043P2482M6695J81591J92781
16691B15045K6506m943p1850r2141j42342J62471J60449P8031o7150k13768j2163
16680C8145J7995N3466l1610k2638J6259J14689J08673j18744N3521J33744r4594
$$ plain form
16669 268906 -4714 -25148 84576 60278 18276 75184 -16092 -55169 157528 244793 313192
16658 313192 254793 234286 135763 49612 121720 122757 54334 -93701 -48266 257226 191132
16647 191132 -110625 -169104 -87093 15086 93340 196680 80395 -69631 -145931 -136244 -80592
16636 -80592 63747 30533 -59 148616 268532 286539 162358 56821 -14771 46561 259496
16625 259496 123295 -153703 -161975 48030 81783 103025 167687 212536 133571 150495 227220
16614 227220 307723 268045 -33520 -110366 -69856 -120589 -29873 153939 162357 9608 2227
16603 2227 81220 78816 1448 4638 45246 28032 -17388 -63017 -213204 -38778 71523 22478
16591 22478 -125909 -187706 -161935 -78998 -4736 -58081 -12636 -19536 110312 97517 106679 139900
$$ packed form
16669B68906k73620k0434J09724k4298m2002N6908r1276l9077K12697Q7265O8399
16658C13192n8399k0507r8523q6151P2108J037o8423j48035M5435L05492o6094
16647A91132l01757n8479Q2011J02179P8254J03340j16285j50026p6300R687N5652
16636h0592J44339l3214l0592J48675J19916J8007j24181j05537p1592O1332K12935
16625B59496j36201k76998q272K10005L3753K1242O4662M4849p8965J6924P6725
16614B27220Q0503l9678l01565p6846M0510n0733R0716J83812Q418j52749p381
16603B227P8993k404p7368L190M0608j7214m5420m5629j50187J74426J10301m9045
16591B2478j48387o1797K5771Q2937P4262n3345M5445o900J29848j2795R162L3221
$$ plain form
16579 139900 87445 115179 8147 112791 183228 103196 -27196 102641 144515 134463 91550
16568 91550 182176 349525 363203 88380 -96922 -220262 -190476 -19199 -12078 12113 35804
16557 35804 -34293 -118772 -193297 -300561 -144187 -37984 -76230 -123444 -76027 64507 254389
16546 254389 175595 117644 90106 34768 -183163 -367325 -446561 -437978 -350809 -183175 -177042
16535 -177042 -269789 -263327 -10463 6487 -49426 -156131 -138021 -140571 -192427 -216281 -123508
16524 -123508 -92072 -230796 -158200 -210259 -283731 -177312 -254856 -313299 -363553 -372780 -249631
16513 -249631 -295494 -365811 -313830 -217496 -54042 -101250 -171422 -295725 -264582 -73505 60236
16502 60236 107460 230134 198200 -60126 -170463 6708 14364 -1094 -19362 -56685 19663
$$ packed form
16579A39900n2455K7734j07032J04644P0437q0032j30392J29837M1874j0052m2913
16568I1550R0626J67349J3678k74823j85302j23340K9786J71277P121K4191K3691
16557C5804p0097q4479p4525j07264J56374J06203l8246m7214M7417J40534J89882
16546B54389p8794n7951k7538n5338k17931j84162p9236Q583Q7169J67634O133
16535a77042r2747O462K52864J6950n5913j06705J8110k550n1856k3854R2773
16524a23508L1436j38724P2596n2059p3472J06419p7544n8443n0254r227J23149
16513b49631m5863p0317N1981R6334J63454m7208p0172j24303L1143J91077J33741
16502F0236M7224J22674l1934k58326j10337J77171P656j5458j8268l7323P6348
$$ plain form
16491 19663 188943 262911 171372 30045 -66094 -107391 28290 132500 12790 -111189
16481 -111189 -89233 -155536 -186631 40570 -45984 -86626 -12275 44978 131544 166719 76366
16470 76366 -79791 -315277 -311114 -212726 -269354 -245381 -160368 -27838 -68457 -47533 -46084
16459 -46084 -82766 87624 64814 -54813 -133590 -11465 119516 228061 215800 132239 27136
16448 27136 -190486 -203794 -43279 118065 17926 -242653 -402133 -319683 -97977 -142907
16438 -142907 -140624 45399 -42682 -175302 -33558 36140 55919 -107802 -217244 -168216 -85206
16427 -85206 -87122 -73134 -232552 -196904 -142939 -140815 -155708 -185369 -87714 -50759 -202664 -267249
16415 -267249 -213825 -290248 -209053 -64181 71434 196655 257013 216717 106072 -12045
$$ packed form
16491A9663J69280P3968r1539j41327r6139m1297J35681J04210j19710j23979
16481a11189K1956o6303l1095K27201q6554m0642P4351N7253Q6566L5175r0353
16470G6366j56157k35486M163R8388n6628K3973Q5013J32530m0619K0924J449
16459d6084l6682J70390k2810j19627p8777J22125J30981J08545j2261q3561j05103
16448B7136k17622j3308J60515J61344j00139k60579j59480Q2450K21706m4930
16438a42907K283J86023q8081j32620J41744O9698J9779j63721j09442M9028Q3010
16427h5206j916J3988j59418L5648N3965K124j4893k9661R7655L6955j51905o4585
16415b67249N3424p6423Q1195J44872J35615J25221O0358m0296j10645j18117
$$ plain form
16405 -12045 7279 105000 111651 106892 66770 52032 39498 81629 93342 -40513 -150628 23395
16393 23395 65540 -70516 -67670 -66403 -52797 -44233 -175107 -204508 -80511 -78533 -44790 83034
16381 83034 22892 -110852 -171785 -300184 -415925 -236151 -116778 -188682 -78917 63563
16371 63563 13962 -207729 -226703 -182022 57854 74046 101859 46568 -45949 -109438 -6198
16360 -6198 -21408 14652 -93062 -160706 -283688 -184474 -133610 -199522 1793 177468 176250
16349 176250 84720 -79724 -40759 -11545 5024 -113830 -168605 31942 -8606 -108038 -68640
16338 -68640 -342 -78796 -122648 -123456 -170401 -50802 89483 282053 197048 41867 -125392
16327 -125392 -187581 -113493 152566 143549 61216 -3009 75904 14447 7833 133191 134601 39156
$$ packed form
16405a2045J9324R7721O651m759m0122j4738j2534M2131J1713j33855j10115J74023
16393B3395M2145j36056K846J267J3606Q564j30874k9401J23997J978L3743J27824
16381H3034o0142j33744o0933j28399j15741J79774J19373p1904J09765J42480
16371F3563m9601k21691j8974M4681K39876J6192K7813n5291r2517o3489J03240
16360f198j5210L6060j07714o7644j22982R9214N0864o5912K01315J75675j218
16349A76250r1530j64444L8965K9214J6569j18854n4775K00547m0548r9432L9398
16338f8640O8298p8454m3852q08m6945J19599J40285J92570q5005j55181j67259
16327a25392o2189P4088K66059r017q2333o4225P8913o1457o614J25358J410r5445
$$ plain form
16315 39156 41394 178518 92799 -38969 69864 175565 395281 330321 217084 -42812
16305 -42812 -311979 -150985 35986 -56009 -179441 -169005 -221928 -173231 -148411 207710 237843
16294 237843 33575 -13121 85356 56236 166447 277373 178435 34755 4287 27464 115985
16283 115985 -15084 16788 214122 211989 15542 -78936 -111429 -2220 67321 -15631 -6708
16272 -6708 86512 56454 124421 112104 123385 134972 142339 211535 286910 254096 298771 264173
16260 264173 270375 242626 157262 141594 41943 -109443 -15638 -36980 99834 205358 28195
16249 28195 -200278 -292595 -102932 21994 -101049 -122765 -36422 273300 221498 26696
16239 26696 -2799 142640 193468 48326 51912 189519 107013 -20902 -73491 -197090 -184404
$$ packed form
16315C9156K238J37124q5719j31768J08833J05701K19716o4960j13237k59896
16305d2812k69167J60994J86971r1995j23432J0436n2923M8697K4820L56121L0133
16294B37843k04268m6696R8477k9120J10211J10926r8938j43680l0468K3177Q8521
16283A15985j31069L1872J97334k133j96447r4478l2493J09209O9541q2952Q923
16272f708R3220l0058O7967j2317J1281J1587P367O9196P5375l2814M4675l4598
16260B64173O202k7749q5364j5668r9651j51386R3805k1342J36814J05524j77163
16249B8195k28473r2317J89663J24926j23043k1716Q6343L09722n1802j94802
16239B6696k9495J45439N0828j45142L586J37607q2506j27915n2589j23599J2686
$$ plain form
16228 -184404 -15197 178056 160585 -1952 -155604 3675 113638 130250 62577 94089
16218 94089 64020 31557 210019 238188 -88514 -134575 -151663 -164483 -109513 -13850 43652
16207 43652 -119282 -223374 -212223 -56894 120334 92283 -14773 53288 61195 -98007 -127602
16196 -127602 -203447 -188990 -125928 -41160 -36584 -98947 -164299 -175420 -30313 132350 207897
16185 207897 157908 38124 171882 266815 22918 -8487 23655 35312 -47708 -36161 32393
16174 32393 12960 114390 39203 13340 -8167 50909 -24643 65543 78947 83578 56532 63026
16162 63026 15766 -7977 -146388 -71181 -93705 -124945 -52552 -6271 88118 140122 199333
16151 199333 294052 147371 -715 32024 -25599 65105 373591 286749 83205 -162851
$$ packed form
16228a84404J69207J93253j7471j62537j53652J59279J09963J6612o7673L1512
16218I4089l0069l2463J78462K8169l26702m6061j7088j2820N4970R5663N7502
16207D3652j62934j04092J1151J55329J77228k8051j07056O8061P907j59202k9595
16196a27602p5845J4457O3062Q4768M576o2363o5352j1121J45107J62663P5547
16185B07897m9989j19784J33758R4933k43897l1405L2142J1657q3020J1547O8554
16174C2393j9433J01430p5187k5863k1507N9076p5552R0186J3404M631k7046O494
16162F3026m7260k3743j38411P5207k2524l1240P2393M6281R4389N2004N9211
16151A99333R4719j46681j48086L2739n7623R0704L08486q6842k03544k46056
$$ plain form
16141 -162851 -242681 -278778 -247535 -235821 -208971 -305546 -497857 -456000 -200584 -47032 -101159
16130 -101159 -89185 -212793 -81294 -96278 -106150 32973 48004 155099 242877 185921 50064
16119 50064 -75538 -100299 -101916 -43317 -158721 -149890 -56580 -100614 -308196 18945 40933
16108 40933 -76653 39913 194268 16836 -63656 -10123 202479 154008 -37069 -65824
16098 -65824 22910 179885 222080 -16786 -133755 -33921 -127600 -179921 -70905 50795 74593
16087 74593 -22969 -221290 -258142 -260067 -36182 158753 31157 -58998 -108736 69021 -64477
16076 -64477 -274996 -188599 -95224 94291 218073 172867 198508 201653 43296 -4541 -65275
16065 -65275 -139749 -166272 7113 17138 48396 130249 43274 -25005 -203298 -276424 -211257
$$ packed form
16141a62851p9830l6097L1243J1714K6850r6575j92311M1857K55416J53552n4127
16130a01159J1974j23608J31499j4984r872J39123J5031J07095Q7778n6956j35857
16119E0064j25602k4761j617N8599j15404Q831R3310m4034k07582L27141K1988
16108D0933j17586J16566J54355j77432q0492N3533K12602m8471j91077k8755
16098f5824Q8734J56975M2195k38866j16969R9834r3679n2321J09016J21700K3798
16087G4593r7562j98321l6852j925K23885J94935j27596r0155m9738J77757j33498
16076f4477k10519Q6397R3375J89515J23782m5206K5641L145j58357m7837o0734
16065f5275p4474k6523J73385J0025L1258Q1853q6975o8279j78293p3126O5167
$$ plain form
16054 -211257 -35262 111143 8699 -126358 -130111 -131365 -143934 -250560 -300638 -138381 183838
16043 183838 395462 204693 57919 -16636 8712 97049 72461 122888 48702 1253 -37509
16032 -37509 -21828 10055 107244 46018 -146811 -169662 -37982 82344 150162 193946 36698
16021 36698 -78962 -208693 -168372 -147986 -86045 -198877 -230941 -41038 -141812 -157286 47515
16010 47515 -24116 -227253 -274994 -172090 -126394 -17273 59837 57156 72890 -36875 -188150
15999 -188150 -138537 -82875 173558 217605 195615 156401 165814 110928 124747 221365 180513
15988 180513 98403 -7350 -149844 2066 6983 -65192 59235 30439 113999 153616 136979
15977 136979 31043 34658 17772 -111802 -81880 -253170 -293011 -233360 -337435 -221471 -90621
$$ packed form
16054b11257J75995J46405j02444j35057l753j254j2569j06626n0078J62257L22219
16043A83838K11624j90769j46774p4555K5348Q8337k4588N0427p4186m7449l8762
16032c7509J5681L1883R7189o1226j92829k2851J31680J20326O7818M3784j57248
16021C6698j15660j29731M0321K0386O1941j12832l2064J89903j00774j5474K04801
16010D7515p1631k03137m7741J02904M5696J09121P7110k681J5734j09765j51275
15999a88150M9613N5662K56433M4047k1990l9214R413n4886J3819R6618m0852
15988A80513q2110j05753j42494J51910M917p2175J24427k8796Q3560L9617j6637
15977A36979j05936L615j6886j29574K9922j71290l9841N9651j04075J15964J30850
$$ plain form
15966 -90621 -16884 38650 -53771 -69607 1414 -54149 86930 119673 28155 7469 944 -25066
15954 -25066 -144784 -42825 -13342 107361 287550 227692 106496 8510 74345 231042
15944 231042 22060 -97412 -144568 -99107 -11303 76697 50403 -77887 -126607 -128951 -57690
15933 -57690 -31148 -38390 116431 99089 322118 261903 -56625 -252418 -346292 -182904 -99466
15922 -99466 -10886 69365 -53465 -146600 -61299 99760 250922 268822 225020 161416 87362
15911 87362 17400 75607 198216 327158 175950 88083 149206 297066 181286 3564
15901 3564 -26695 142337 20914 -8402 90608 -36865 -25250 -118005 -16188 125203 -62027
15890 -62027 -206143 -217780 -75470 -143003 -149652 -175180 -154422 -61575 128355 94903 46161
$$ packed form
15966i0621P3737N5534r2421j5836P1021n5563J41079L2743r1518k0686o525k6010
15954b5066j19718J01959K9483J20703J80189n9858j21196r7986O5835J56697
15944B31042k08982j19472m7156M5461Q7804Q8000k6294j28290m8720k344P1261
15933e7690K6542p242J54821j7342K23029o0215l18528j95793r3874J63388Q3438
15922i9466Q8580Q0251j22830r3135Q5301J61059J51162J7900m3802o3604p4054
15911H7362o9962N8207J22609J28942j51208q7867O1123J47860j15780j77722
15901C564l0259J69032j21423k9316R9010j27473J1615r2755J01817J41391j87230
15890f2027j44116j1637J42310o7533o649k5528K0758R2847J89930l3452m8742
$$ plain form
15879 46161 217446 193623 -58418 -336755 -327984 -76878 -22052 -113785 13182 102629 123859
15868 123859 -142387 -285043 -264671 -368088 -238777 -127379 -219718 -139010 73842 141789
15858 141789 -110486 -70070 -123537 -43390 23486 -57461 -162382 -245849 -137271 -19425 77614
15847 77614 182777 142416 155399 236020 330587 336770 306023 316684 278668 273095 354367 348361
15835 348361 209907 118912 44194 154738 207720 156845 188924 245132 148293 -5607 -75748
15824 -75748 -97637 -190758 -187278 -27442 103042 130321 7616 -24690 -31529 42953 -136364
15813 -136364 -299300 -266460 -159144 -59517 41544 -48623 -30345 -992 104041 87036 161270
15802 161270 -32340 -151516 -11393 79022 43660 59480 72326 9700 14815 29769 -31768
$$ packed form
15879D6161J71285k3823k52041k78337Q771K51106N4826r1733J26967Q9447K1230
15868A23859k66246j42656K0372j03417J29311J11398r2339Q0708K12852O7947
15858A41789k52275M0416n3467Q0147O6876q0947j04921q3467J08578J17846R7039
15847G7614J05163m0361J2983Q0621R4567O183l0747J0661l8016n573Q1272o006
15835C48361j38454r0995p4718J10544N2982n0875L2079N6208r6839j53900p0141
15824g5748k1889r3121L480J59836J30484K7279j22705l2306o839P4482j79317
15813a36364j62936L2840J07316R9627J01061r0167J8278K9353J05033j7005P4234
15802A61270j93610j19176J40123R0415l5362J5820J2846o2626N115J4954o1537
$$ plain form
15791 -31768 19244 82035 71586 93054 9944 -18124 77159 6141 49278 -9768 121418
15780 121418 83716 115605 154642 184536 43104 -137576 -115019 -67733 40510 -23993 -177707
15769 -177707 -122871 16787 120544 -27735 -25786 97771 92576 -20219 -211649 -62554
15759 -62554 120981 -20212 -92468 -15141 -40977 -84966 -90553 -159216 -245014 -312879 -334767
15748 -334767 -249346 -261929 -323306 -364626 -498432 -409659 -263545 -38730 -127322 -41966 959
15737 959 78664 69033 122129 190989 84307 -24144 5339 66946 5758 182978 382462
15726 382462 301082 318061 318737 183378 26734 -159334 -165843 -69859 -62338 15629 106022 187284
15714 187284 238281 326336 365112 360551 298859 175262 77327 -26088 -79736 -36300 -131277
$$ packed form
15791c1768N1012O2791j0449K1468q3110k8068R5283p1018M3137n9046J31186
15780A21418l7702L1889L9037K9894j41432j80680K2557M7286J08243o4503j53714
15769a77707N4836J39658J03757j48279J949J23557n195j12795j91430J49095
15759f2554J83535j41193p2256P7327k5836m3989n587o8663q5798o7865k1888
15748c34767Q5421j2583o1377m1320j33806Q8773J46114K24815q8592Q5356M2925
15737I59P7705r631N3096O8860j06682j08451K9483O1607o1188J77220J99484
15726C82462q1380J6979O76j35359j56644j86068o509R5984P521P7967R0393Q1262
15714A87284N0997Q8055L8776m561o1692j23597r7935j03415n3648M3436r4977
$$ plain form
15703 -131277 -222087 -204047 -181955 -28625 -43162 179755 334231 339250 268302 195821 198003
15692 198003 73619 -147853 -245489 -195400 -268303 -188974 -137163 -128689 -117420 -139180 -37299
15681 -37299 -68320 -167970 -75727 -6697 107842 84202 94208 21638 -154493 -283891 -323844
15670 -323844 -215719 -153648 -68387 43158 -70032 -44197 39313 31150 48042 -12940 -23661
15659 -23661 -78072 -188473 -104741 54017 126714 173764 82595 160647 3422 -147351 -175123
15648 -175123 -25574 52638 24612 2201 -37623 -46989 -169443 -188969 -57225 14640 -186763
15637 -186763 -134460 -127814 -204074 -183014 -54503 -7961 -11535 18809 43633 24793 13986 108118
15625 108118 166803 -12983 -42761 14281 -105242 -88784 131303 182193 98592 101095 110014
$$ packed form
15703a31277r0810J8040K2092J53330j4537K22917J54476N019p0948p2481K182
15692A98003j24384k21472r7636N0089p2903P9329N1811Q474J1269k1760J01881
15681c7299l1021r9650R2243O9030J14539k3640J0006p2570j76131j29398l9953
15670c23844J08125O2071Q5261J11545j13190K5835Q3510q163J6892o0982j0721
15659b3661n4411j10401Q3732J58758P2697M7050r1169P8052j57225j50773k7772
15648a75123J49549P8212k8026k2411l9824r366j22454j9526J31744P1865k01403
15637a86763N2303O646p6260K1060J28511M6542l574L0344K4824j8840j0807R4132
15625A08118N8685j79786k9778N7042j19523J6458K20087N0890q3601K503Q919
$$ plain form
15614 110014 63742 273145 271880 246244 172570 52855 -110013 -65837 142863 377640 300232
15603 300232 122397 -123160 -199430 -209348 -41460 -57580 -144517 -165967 -232924 -238555 -217404
15592 -217404 -148279 -174943 -192565 -92934 37440 35768 100592 140620 85517 114121 154692
15581 154692 131818 175194 123473 193314 192731 186035 178284 212984 191779 14385 -38011 84624
15569 84624 -43265 -192558 -224177 -141985 -73197 38091 45119 -5984 44956 163907 251848
15558 251848 211916 131007 75793 -102307 -239562 -226610 -210462 -68683 66192 135899 169534
15547 169534 61710 -63495 -158862 -82957 -125726 29936 87110 -95948 -188543 -197890 -161135
15536 -161135 -200851 -236396 -116078 14242 76534 30425 35783 48517 37047 196140 176807
$$ packed form
15614A10014m6272K09403j265k5636p3674j19715j62868M4176K08700K34777p7408
15603C00232j77835k45557p6270r918J67888j6120q6937k1450o6957n631K1151
15592b17404O9125k6664j7622R9631J30374j672O4824M0028n5103K8604M0571
15581A54692k2874M3376n1721O9841n83o696p751L4700k1205j77394n2396J22635
15569H4624j27889j49293l1619Q2192O8788J11288P028n1103N0940J18951Q7941
15558B51848l9932q0909n5214j78100j37255J2952J6148J41779J34875O9707L3635
15547A69534j07824j25205r5367P5905m2769J55662N7174j83058r2595r347L6755
15536a61135l9716l5545J20318J30320O2292m6109N358J2734j1470J59093j9333
$$ plain form
15525 176807 -129413 -222720 -258741 -288648 -361436 -338630 -209659 -278597 -389191 -323158 66118
15514 66118 172000 57220 5174 34374 -44107 91891 147338 27307 59707 119591 55123
15503 55123 40386 142237 72952 8059 30754 153453 -12366 55357 190843 134505 27967
15492 27967 -92398 -127578 -12154 7489 -185826 -31411 135337 196614 287847 208586 -25489
15481 -25489 -86549 116025 239877 248611 129271 924 -164359 -155514 111650 163547 -67076
15470 -67076 -345787 -181167 -65237 4837 29993 -87563 -64214 -16303 -116700 -52973 -1172
15459 -1172 56601 175112 182761 124341 48369 -33103 -136617 -52749 49223 41930 97410 74286
15447 74286 27156 15820 -95173 -125966 -57169 1313 -135661 -146306 -141659 -544 -34448
$$ packed form
15525A76807l06220r3307l6021k9907p2788K2806J28971o8938j10594O6033L89276
15514F6118J05882j14780n2046K9200p8481J35998N5447j20031L2400N9884o4468
15503E5123j4737J01851o9285o4893K2695J22699j65819O7723J35486n6338j06538
15492B7967j20365l5180J15424J9643j93315J54415J66748O1277R1233p9261k34075
15481b5489o1060K02574J23852Q734j19340j28347j65283Q845K67164N1897k30623
15470f7076k78711J64620J15930P0074K5156j17556K3349M7911j00397O3727N1801
15459a172N7773J18511P649n8420p5972q1472j03514Q3868J01972p293N5480k3124
15447G4286m7130j1336j10993l0793O8797N8482j36974j0645M647J41115l3904
$$ plain form
15436 -34448 -101193 -270091 -314412 -348360 -446231 -331330 -378848 -357961 -228993 -201438 -152288
15425 -152288 -124133 70109 -33630 -200202 -389095 -400663 -225568 3823 87549 125031
15415 125031 58253 77191 160215 102855 47903 81451 71744 35009 104875 48791 100483 132267
15403 132267 140375 77713 -17396 -102978 -126011 -82125 -144396 -91902 54341 228353 115329
15392 115329 -46289 -59086 -43867 -54783 -95250 -57247 -13185 69950 -137630 -367651 -312558
15381 -312558 -360427 -222302 -156776 -49010 83590 -21973 -172902 -162254 33736 -2297
15371 -2297 -4203 -81819 -238464 -345257 -294692 -302742 -198491 -100950 -20433 135771 167095
15360 167095 169049 12728 -72508 -125938 -80902 -58652 -19420 -55459 -16498 33252 -55089
$$ packed form
15436c4448o6745j68898m4321l3948r7871J14901m7518K0887J28968K7555M9150
15425a52288K8155J94242j03739j66572j88893j1568J75095K29391Q3726L7482
15415A25031o6778J8938Q3024n7360n4952L3548r707l6735O9866n6084N1692L1784
15403A32267Q108o2662r5109q5582k3033M3886o2271N2494J46243J74012j13024
15392A15329j61618j2797J5219j0916m0467L8003M4062Q3135k07580k30021N5093
15381c12558m7869J38125O5526J07766J32600j05563j50929J0648J95990l6033
15371b297j906p7616j56645j06793N0565q050J04251R7541Q0517J56204L1324
15360A67095J954j56321q5236n3430M5036K2250L9232l6039L8961M9750q8341
$$ plain form
15349 -55089 63905 94550 -158471 -208306 -178114 -111463 -137756 -282001 -170752 -211436 -195743
15338 -195743 -64905 -29878 -163523 -292187 -336318 -281715 -137887 -8942 108154 -96147
15328 -96147 -319986 -302385 -327834 -334468 -287511 -140024 -54655 -121494 -49361 -35076 -159147
15317 -159147 -107351 -86313 13074 179277 168969 -53487 -141737 -227997 -407979 -248424 -33925
15306 -33925 -57570 45472 -37718 -284453 -273126 -280754 -102974 -91196 -205183 -178916 -107845
15295 -107845 -214276 -180054 8691 -78653 -83534 -44728 -19659 30420 -73939 -71683 -20422
15284 -20422 87725 90403 107703 -10958 31398 76053 61091 110228 38219 63156 51644
15273 51644 -172031 -212545 -264717 -219457 -85953 -116753 -139973 -95525 -31429 -101636 -91185
$$ packed form
15349e5089J18994L0645k53021m9835L0192O6651k6293j44245J11249m0684J5693
15338a95743J30838L5027j33645j28664m4131N4603J43828J28945J17096k04301
15328i6147k23839J7601k5449o634M6957J47487Q5369o6839P2133J4285j24071
15317a59147N1796K1038R9387J66203j0308k22456q8250q6260j79982J59555K14499
15306c3925k3645J03042q3190k46735J1327p628J77780J1778j13987K6267P1071
15295a07845j06431L4222J88745q7344m881L8806K5069N0079j04359K256N1261
15284b0422J08147K678J7300j18661M2356M4655j4962M9137p2009K4937j1512
15273E1644k23675m0514n2172M5260J33504l0800k3220M4448O4096p0207J0451
$$ plain form
15262 -91185 -184719 -189446 -145259 -126933 104437 265266 137340 42192 25194 9920 -36601
15251 -36601 52789 171705 135271 -5766 -150419 -90515 146658 153846 188835 173582 63848
15240 63848 61503 22893 -107638 -277844 -119600 106503 255744 246223 255211 184444 109439
15229 109439 180262 103927 -102384 -126151 -13401 226 -205614 -179773 -42783 2112 47728
15218 47728 113144 146519 241043 231163 136176 133844 155755 122012 89750 122486 59062 -88258
15206 -88258 -230061 -187866 -88651 22423 67822 -23755 1093 119448 46076 15245 -44693
15195 -44693 -174590 -93542 71781 235465 158570 -26881 -179674 -42663 54071 45564 34930
15184 34930 179097 188045 -11047 -92021 -28125 36045 108446 204187 240327 89630 -27273
$$ packed form
15262i1185r3534m727M4187J8326K31370J60829j27926r5148j6998j5274m6521
15251c6601Q9390J18916l6434j41037j44653N9904K37173P188L4989j5253j09734
15240F3848k345l8610j30531j70206J58244K26103J49241r521Q988p0767p5005
15229A09439P0823p6335k06311k3767J12750J3627k05840K5841J36990M4895M5616
15218D7728O5416L3375R4524r880r4987k332K1911l3743l2262L2736o3424j47320
15206h8258j41803M2195R9215J11074M5399r1577K4848J18355p3372l0831n9938
15195d4693j29897Q1048J65323J63684p6895j85451j52793J37011R6734q507j0634
15184C4930J44167Q948j99092q0974O3896O4170P2401R5741L6140j50697j16903
$$ plain form
15173 -27273 -141296 -161779 -77602 -104945 -213460 -67728 188551 80665 219030 192899
15163 192899 97748 -227111 -403583 -438238 -351804 -238906 -143614 -163554 -56922 -83113 -93393
15152 -93393 45299 14996 -4798 -44271 -118607 -198635 -299343 -167378 -60599 -2293 8943
15141 8943 59458 1236 -24983 135772 106797 -76074 -138498 -34434 45782 35506 1312
15130 1312 56461 -11474 -45696 32304 184360 301283 236350 40471 48172 50455 6772 -54376
15118 -54376 3454 127452 283931 301180 173434 40640 -189907 -99057 -47647 -196022
15108 -196022 -173340 -78829 -205143 -217460 -272967 -104101 -5131 12176 87446 153035 -45069
15097 -45069 -155036 -124705 -151750 -89636 17175 -117276 -153442 -37791 -116823 -183579 -183252
$$ packed form
15173b7273j14023k0483Q4177k7343j08515J45732K56279j07886J38365k6131
15163A92899r5151l24859j76472l4655Q6434J12898R5292j9940J06632k6191j0280
15152i3393J38692l0303j9794l9473p4336q0028j00708J31965J06779N8306J1236
15141H943N0515n8222k6219J60755k8975j82871o2424J04064Q0216j0276l4194
15130A312N5149o7935l4222P8000J52056J16923o4933j95879P701K283m3683o1148
15118e4376N7830J23998J56479J7249j27746j32794k30547R0850N1410j48375
15108a96022K2682R4511j26314j2317n5507J68866R8970J7307P5270O5589j98104
15097d5069j09967L0331k7045O2114J06811j34451l6166J15651p9032o6756L27
$$ plain form
15086 -183252 -164345 -133325 -147620 -79583 44898 173391 252743 132685 -3278 83380 82768
15075 82768 39920 10294 -41457 -93230 -88882 -60895 -47770 -24842 21805 38078 -132600 -186713
15063 -186713 -180260 -258330 -270562 -249873 -367598 -261606 -217660 -69694 110853 149595 40427
15052 40427 -49905 -49200 -3423 -102784 -152204 -79501 5713 83320 -30761 -58238 -31721 20901
15040 20901 -94518 -147576 -160746 -30762 164020 197592 38609 61054 102451 100871 27393
15029 27393 -43014 44603 103495 252595 280825 252409 43661 -9842 -83095 -170278 -42711
15018 -42711 150930 -15095 -210633 -219030 70831 116632 127342 192450 104944 184566 287631
15007 287631 163985 44967 -41578 -58728 -64303 -67372 -83531 -100424 -3241 165720 165743 145011
$$ packed form
15086a83252J8907L1020j4295O8037J24481J28493P9352j20058j35963Q6658o12
15075H2768m2848k9626n1751n1773M348K7987J3125K2928M6647J6273j70678n4113
15063a86713O453p8070j2232K0689j17725J05992M3946J47966J80547L8742j09168
15052D0427r0332P05M5777r9361m9420P2703Q5214P7607j14081k7477K6517N2622
15040B0901j15419n3058j3170J29984J94782L3572j58983K2445M1397j580p3478
15029B7393p0407Q7617N8892J49100K8230k8416k08748n3503p3253q7183J27567
15018d2711J93641j66025j95538q397K89861M5801J0710O5108q7506P9622J03065
15007B87631j23646j19018q6545j7150n575l069j6159j6893R7183J68961K3k0732
$$ plain form
14995 145011 -49026 -12260 -48205 -195784 -78527 -66876 -122609 -94149 -126081 -20108 -71896
14984 -71896 26730 76551 -30581 93953 207505 108830 18688 -69823 -35650 -74841 -269533
14973 -269533 -175066 -108034 -140201 -156397 -34690 134163 146316 175184 21702 20757 145546
14962 145546 172254 69032 -29742 20868 157352 142576 188651 121167 105904 298053 436416
14951 436416 267811 208676 260964 295949 350510 348344 277462 147590 43657 -6839 -13214
14940 -13214 -35880 47878 63035 67115 55370 -39802 -88577 8963 -903 -99161 -221720 -250565
14928 -250565 -58172 -18900 -150888 -195129 3486 13340 -75477 11384 258423 175192 350251
14917 350251 522832 283531 114476 60059 126154 2431 -48283 -104195 -132412 -132489 -179653
$$ packed form
14995A45011j94037L6766l5945j47579J17257J1651n5733K8460l1932J05973n1788
14984g1896R8626M9821j07132J24534J13552r8675r0142q8511L4173l9191j94692
14973b69533R4467O7032l2167j6196J21707J68853J2153K8868j53482r45J24789
14962A45546K6708j03222r8774N0610J36484j4776M6075o7484j5263J92149J38363
14951D36416j68605n9135N2288L4985N4561k166p0882j29872j03933n0496o375
14940a3214k2666Q3758J5157M080j1745r5172m8775R7540r866r8258j22559k8845
14928b50565J92393L9272j31988m4241J98615R854q8817Q6861K47039q3231J75059
14917C50251J72581k39301j69055n4417O6095j23723n0714n5912k8217p7m7164
$$ plain form
14906 -179653 -117402 -173495 -97232 -61501 -92088 24290 -71721 -109850 -137924 -243692 -184968
14895 -184968 -120268 -147703 -199586 -266790 -239151 -56413 -46908 -203302 -140672 -12495 -23333
14884 -23333 -12233 113490 70629 187635 66336 -2455 -8216 16348 -128753 -37029 51222
14873 51222 73399 69874 52067 -82015 -33346 81986 120797 20855 -77406 114133 94608
14862 94608 33221 -111679 171258 350772 215625 132208 38988 -179182 -182922 51247 186977
14851 186977 165171 46792 6435 -39589 -107885 -149882 -43969 84299 55659 -7569 24029
14840 24029 114985 107014 -22612 -141102 -102892 -124222 -162395 -222909 -95126 -12899 -69172
14829 -69172 -295686 -390052 -233655 -61337 -124055 -193053 -206576 -271690 -132758 76830 146122
$$ packed form
14906a79653O2251n6093P6263L5731l0587J16378r6011l8129k8074j05768N8724
14895a84968O4700k7435n1883o7204K7639J82738R505j56394O2630J28177j0838
14884b3333J1100J25723m2861J17006j21299o8791n761K4564j45101R1724Q8251
14873E1222K2177l525j7807j34082M8669J15332L8811r9942r8261J91539j9525
14862I4608o1387j44900K82937J79514j35147q3417r3220k18170l740K34169J35730
14851A86977k1806j18379m0357m6024o8296m1997J05913J28268k8640o3228L1598
14840B4029R0956p971j29626j18490L8210k1330l8173o0514J27783Q2227n6273
14829f9172k26514r4366J56397J72318o2718o8998j3523o5114J38932K09588O9292
$$ plain form
14818 146122 166587 222912 309301 271860 53160 -130233 -242371 -285197 -88467 -92084 -86777
14807 -86777 -150000 -54301 -68320 -44634 -97370 -58210 35212 139939 233881 239832 263969 274469
14795 274469 72267 -179335 -285775 -205316 -68163 -195803 -188419 -69 172646 55230
14785 55230 25620 70866 -60748 -44470 -4770 -200604 -330662 -463007 -381652 -185403 47394
14774 47394 49163 -76965 -134863 -153060 -47704 -194784 -189899 -150582 -167479 -148021 -262222
14763 -262222 -322121 -244788 -255898 -220548 -398307 -454832 -177572 41700 75213 50510 -60229
14752 -60229 7967 82651 -3859 111051 261096 142312 148486 81981 -67163 2412 -12711
14741 -12711 18561 131 -136564 -134374 -9671 -41931 -111923 -3934 -27120 3838 -79212
$$ packed form
14818A46122K0465N6325Q6389l7441k18700j83393j12138m2826J96730l617N307
14807h6777o3223R5699j4019K3686n2736L9160R3422J04727R3942N951K4137J0500
14795B74469k02202k51602j06440Q0459J37153j27640P384J88350J72715j17416
14785E5230k9610M5246j31614J6278L9700j95834j30058j32345Q1355J96249K32797
14774D7394J769j26128n7898j8197J05356j47080M885L9317j6897J9458j14201
14763b62222n9899P7333j1110L5350j77759n6525K77260K19272L3513k4703j10739
14752f0229O8196P4684q6510J14910J50045j18784O174o6505j49144O9575j5123
14741a2711L1272j8430j36695K190J24703l2260o9992J07989k3186L0958q3050
$$ plain form
14730 -79212 -107539 -13322 36154 97323 58681 -113230 -124317 -141833 -114386 -187839 -186728 5595
14718 5595 -26180 -13663 -115671 32436 26791 47178 25968 -17732 158302 253645 224472
14707 224472 217597 101110 67709 -28923 -100209 -56634 64677 3204 -66308 -255089 -392592
14696 -392592 -331598 -171839 11514 285087 207764 107056 113223 27396 -84160 -130532 -73109
14685 -73109 65605 101210 112543 34720 59603 77995 -32174 -63694 -27090 33820 -29625
14674 -29625 -85340 84148 152529 229143 121143 209170 187039 200102 121183 37928 -30281
14663 -30281 -36313 12553 -29435 -68306 -138108 -199218 -179880 -193269 -97029 85895 71792 -54886
14651 -54886 -46488 -24996 -117642 -68000 -4181 -175837 -70491 68844 249360 135869 90540
$$ packed form
14730g9212k8327R4217M9476O1169l8642j71911j1087j7516K7447p3453J111J92323
14718E595l1775J2517j02008J48107n645K0387k1210m3700J76034R5343k9173
14707B24472o875j16487l3401r6632p1286M3575J21311o1473o9512j88781j37503
14696c92592O0994J59759J83353K73573p7323j00708O167q5827j11556m6372N7423
14685g3109J38714L5605J1333p7823K4883J8392j10169l1520L6604O0910o3445
14674b9625n5715J69488O8381P6614j08000Q8027k2131J3063p8919q3255o8209
14663c0281o032M8866m1988l8871o9802o1110J9338j3389R6240J82924j4103j26678
14651e4886Q398K1492r2646M9642O3819j71656J05346J39335J80516j13491m5329
$$ plain form
14640 90540 -33786 -106839 -177311 -245273 -374023 -446324 -172414 70482 179228 228956 305552
14629 305552 230567 51142 -183264 -336976 -320353 -286205 -235568 -338331 -202043 44710
14619 44710 145676 94476 86604 -78763 -121658 -50365 -128749 -201875 -18359 270831 220200
14608 220200 -14876 -3656 -20198 99755 74651 -25371 -210501 -359673 -257446 -97984
14598 -97984 -28273 -92585 -21063 -111834 36767 181672 86264 63826 -8728 -12246 119294
14587 119294 265434 166120 141663 89560 -19579 -7496 -165348 -386293 -315269 -148198
14577 -148198 -51679 84867 33111 -165315 -62045 158442 247117 143516 -154641 -333526
14567 -333526 -202791 49724 140845 161899 284914 89953 -211005 -274168 -83817 -86240
$$ packed form
14640I0540j24326p3053p0472o7962j28750p2301K73910K42896J08746M9728P6596
14629C05552p4985j79425k34406j53712J6623L4148N0637j02763J36288K46753
14619D4710J00966n1200p872j65367m2895P1293p8384p3126J83516K89190n0631
14608B20200k35076J1220j6542J19953k5104j00022j85130j49172J02227J59462
14598i7984O9711o4312P1522r0771J48601J44905r5408k2438p2554l518J31540
14587A19294J46140r9314k4457n2103j09139J2083j57852k20945P1024J67071
14577a48198R6519J36546n1756j98426J03270K20487Q8675j03601k98157j78885
14567c33526J30735K52515R1121K1054J23015j94961l00958o3163J90351k423
$$ plain form
14557 -86240 -199944 -141160 -38898 29366 146104 151052 -60413 20993 -80300 -78912 -86364
14546 -86364 -459 21653 -27203 -186296 -167533 46477 64190 -72232 -126928 -312006 -391419
14535 -391419 -142205 -63523 -164387 -302558 -390562 -219204 -44068 67370 -44185 -99513
14525 -99513 -97511 14183 65985 -70818 -188934 -120390 -217810 -359912 -352546 -280250 -220743
14514 -220743 -173053 -254866 -114430 22268 128390 86479 -24377 90179 71615 81545 33686
14503 33686 101442 51570 102494 45963 -24466 -105688 -50998 101818 -87855 15 57920
14492 57920 -16089 60873 163860 129364 46994 -153954 -152546 -280165 -323427 -203534 -50659
14481 -50659 102029 174745 90057 99620 132899 77012 68398 -114786 -287368 -331244 -396264
$$ packed form
14557h6240j13704N8784J02262O8264J16738M948k11465Q1406j01293J388p452
14546h6364Q5905K2112m8856j59093J8763K14010J7713j36422n4696j85078p9413
14535c91419K49214P8682j00864j38171q8004J71358J75136J11438j11555n5328
14525i9513K002J11694N1802j36803j18116O8544r7420j42102P366P2296N9507
14514b20743M7690q1813J40436J36698J06122m1911j10856J14556j8564R930m7859
14503C3686O7756m9872N0924n6531p0429q1222N4690J52816j89673Q7870N7905
14492E7920p4009P6962J02987l4496q2370k00948J408j27619m3262J19893J52875
14481e0659J52688P2716q4688R563L3279n5887q614j83184j72582m3876o5020
$$ plain form
14470 -396264 -374144 -135390 -1246 71604 9726 -112457 -138490 -108912 -134332 -144901 -27913
14459 -27913 -74535 -96897 -150629 -320197 -429404 -422989 -274095 -224786 -197902 -74017 -180001
14448 -180001 -297574 -111304 87481 43956 -40935 7983 -5108 1023 -184676 -149568 44055
14437 44055 256841 303370 64278 -117553 -165456 -27544 -52566 -205193 -288815 -302630 -311810
14426 -311810 -116301 77636 68473 13422 -12273 5753 -62056 78443 328087 406858 132621
14415 132621 -52437 29873 106583 -12317 -230594 -300016 -248689 19243 116353 129484 112099
14404 112099 170912 70763 152015 38602 -189790 -169598 -101475 -121337 -134656 -224407 -264014
14393 -264014 -207121 49968 125102 29452 102155 -21026 -16385 69443 126979 175783 222623
$$ packed form
14470c96264K2120K38754J34144P2850o1878j22183k6033K9578k5420j0569J16988
14459b7913m6622k2362n3732j69568j09207O415J48894M9309K6884J23885j05984
14448a80001j17573J86270J98785m3525q4891M8918j3091O131j85699L5108J93623
14437D4055K12786M6529k39092j81831m7903J37912k5022j52627q3622j3815r180
14426c11810J95509J93937r163n5051k5695J8026o7809J40499K49644P8771k74237
14415A32621j85058Q2310P6710j18900k18277o9422N1327K67932R7110J3131j7385
14404A12099N8813j00149Q1252j13413k28392K0192O8123j9862j3319q9751l9607
14393b64014N6893K57089P5134r5650P2703j23181M641Q5828N7536M8804M6840
$$ plain form
14382 222623 198144 135550 -46986 -166082 -111774 -162858 -143544 -105039 -143238 -44480 24263
14371 24263 -248609 -87797 130066 22937 -61725 9223 8056 -744 -61768 -42039 138354
14360 138354 157065 140203 -68478 -94521 53410 23533 -27979 157034 208740 238684 173552
14349 173552 21047 -226833 -148124 -20617 -38367 -49804 11373 127333 34678 -10150 9439
14338 9439 78236 169482 141205 260686 340905 302437 279412 258329 222548 119320 -73119
14327 -73119 -88896 -175016 -235499 -138146 -92286 26475 155308 33573 9448 -115177 -70712
14316 -70712 104348 204889 215276 104727 697 -112744 -87697 -60498 -112662 -204473 -96732
14305 -96732 -128758 -165485 -196955 -142041 -109973 -124272 -22967 34033 209558 300651 173968
$$ packed form
14382B22623k4479o2594j82536j19096N4308n1084J9314L8505l8199R8758O8743
14371B4263k72872J60812K17863j07129q4662P0948j167q800o1024J9729J80393
14360A38354J8711j6862k08681k6043J47931k9877n1512J85013N1706K9944o5132
14349A73552j52505k47880P8709J27507j7750j1437O1177J15960r2655m4828J9589
14338I439O8797R1246k8277J19481Q0219l8468k3025k1083l5781j03228j92439
14327g3119j5777q6120o0483R7353M5860J18761J28833j21735k4125j24625M4465
14316g0712J75060J00541J0387j10549j04030j13441K5047K7199n2164r1811J07741
14305i6732l2026l6727l1470N4914L2068j4299J01305N7000J75525R1093j26683
$$ plain form
14294 173968 118988 9513 -3465 64808 244404 227319 44552 53118 253405 226984 226395
14283 226395 246567 276098 312432 230604 83903 -49841 -31568 -26025 -16262 -112594 -83187
14272 -83187 -136036 -100333 87610 -7965 -201908 -217159 -105743 -75665 -106073 -15222 79909
14261 79909 -2788 -46990 -27727 -119887 -71925 -100706 -16949 42939 -99515 -296939 -395320
14250 -395320 -379660 -282938 -199425 -47231 73120 36830 -117192 -111533 -136975 -208813 -253725
14239 -253725 -157305 -28844 -80621 -222892 -369375 -400663 -99645 216657 247341 155759
14229 155759 97189 54298 175437 198706 251935 254651 256442 314072 328316 317120 184455
14218 184455 76181 61925 -79082 -175225 -146868 -220950 -102085 218267 108280 -21935
$$ packed form
14294A73968n4980j09475j2978O8273J79596j7085j82767Q566K00287k6421n89
14283B26395K0172K9531L6334q1828j46701j33744J8273N543R763r6332K9407
14272h3187n2849L5703J87943r5575j93943j5251J11416L0078l0408R0851R5131
14261G9909q2697m4202J9263r2160M7962k8781Q3757N9888j42454j97424r8381
14250c95320J5660R6722Q3513J52194J20351l6290j54022N659k5442p1838m4912
14239b53725R6420J28461n1777j42271j46483l1288L01018L16302L0684r1582
14229A55759n8570m2891J21139K3269N3229K716J791N7630J4244j1196j32665
14218A84455j08274j4256j41007r6143K8357p4082J18865L20352j09987j30215
$$ plain form
14208 -21935 -209811 -206710 -32292 129866 207532 158029 152833 59872 -29081 -74128 41115
14197 41115 219006 346968 300634 150619 86353 37656 -63280 -15588 -64532 -130488 -262567
14186 -262567 -256088 -184323 -171716 -149636 -131705 -10985 -32907 12340 109731 79929 -64545
14175 -64545 -60588 -122022 20951 180965 165796 185950 183916 -1930 25162 4799 -50729
14164 -50729 -91587 -220230 -402499 -404005 -193550 165740 359220 167023 -7486 -71689
14154 -71689 -215878 14440 221949 99952 -189697 -202949 -35262 114942 175870 8213
14144 8213 -33245 86106 286791 234703 186323 109249 11991 42959 -18849 -211288 -464357
14133 -464357 -448087 -252316 -176926 -131334 -157064 -337590 -176215 -162806 -152996 -91108 95712
$$ packed form
14208b1935j87876L101J74418J62158P7666m9503n196r2961q8953m5047J15243
14197D1115J77891J27962m6334j50015o4266m8697j00936M7692m8944o5956j32079
14186b62567O479P1765J2607K2080J7931J20720k1922M5247R7391k9802j44474
14175f4545L957o1434J42973J60014j5169K0154k034j85846K7092k0363n5528
14164e0729m0858j28643j82269j506K10455L59290J93480j92197j74509o4203
14154g1689j44189K30318K07509j21997k89649j3252J67687J50204O0928j67657
14144H213m1458J19351K00685n2088m8380p7074r7258L0968o1808j92439k53069
14133d64357J6270J95771P5390M5592k5730j80526J61375J3409R810O1888J86820
$$ plain form
14122 95712 116410 41176 14624 -52688 -150153 -183138 -35751 78193 91539 -10941 -81746
14111 -81746 -109708 -91839 -67588 -91289 -151173 -79449 10148 -159224 -351801 -198358 -39360
14100 -39360 174891 244984 231715 155747 -81096 17162 109198 186616 47136 31778 -13076
14089 -13076 76806 -62438 -43550 -79700 -198545 -209416 -224221 -162549 -47110 -66667 -617
14078 -617 121627 199261 180779 147889 -81191 -193907 -118844 -124746 -16649 -96037 -24247
14067 -24247 -22149 10132 123610 -55602 66797 228348 156650 76949 -165626 -184472 -71038
14056 -71038 -26349 93366 161584 206995 269702 202630 107555 116437 212502 165888 208133 130403
14044 130403 -2748 -172303 -15912 83078 184281 164997 151573 202381 277573 158371
$$ packed form
14122I5712K0698p5234k6552o7312r7465l2985J47387J13944J3346j02480p0805
14111h1746k7962J7869K4251k3701n9884P1724Q9597j69372j92577J53443J58998
14100c9360K14251P0093j3269p5968k36843R8258R2036P7418j39480j5358m4854
14089a3076Q9882j39244J8888l6150j18845j0871j4805O1672J15439j9557O6050
14078f17J22244P7634j8482l2890k29080j12716P5063n902J08097p9388P1790
14067b4247K098L2281J13478j79212J22399J61551p1698p9701k42575j8846J13434
14056g1038M4689J19715O8218M5411O2707o7072r5075Q882R6065m6614M2245p7730
14044A30403j33151j69555J56391R8990J01203j9284j3424N0808P5192j19202
$$ plain form
14034 158371 107249 156658 151671 136266 24430 95475 67017 67509 107689 103698 44393 177452
14022 177452 274880 346022 233362 190554 56844 -10108 32464 102811 76351 60514 133585
14011 133585 16099 29698 -67421 47718 209675 100112 66794 -62825 -130585 81837
14001 81837 249519 163457 171511 154586 45184 -25604 1873 91720 188907 125685 40009
13990 40009 -64734 -193802 -43344 21916 -190388 -289153 -224270 -55878 -5461 -22783 -118645
13979 -118645 -104092 -44442 -108673 -23286 17385 26923 -53130 -217614 -296268 -209767 -162679
13968 -162679 -172238 -118558 -16178 -21419 -36282 -92008 -181703 -56702 4984 107820 280689
13957 280689 248194 114227 -78105 -121588 -25561 -62347 47733 152031 140393 69285 36558
$$ packed form
14034A58371n1122M9409m987j5405j11836P1045k8458M92M0180l991n9305J33059
14022A77452R7428P1142j12660m2808j33710o6952M2572P0347k6460j5837P3071
14011A33585j17486J3599r7119J15139J61957j09563l3318j29619o7760K12422
14001H1837J67682q6062Q054j6925j09402p0788K7477Q9847R7187o3222q5676
13990D0009j04743j29068J50458O5260k12304r8765O4883J68392N0417j7322r5862
13979a18645J4553N9650o4231Q5387M0671R538q0053j64484p8654Q6501M7088
13968a62679r559N3680J02380n241j4863n5726q9695J25001O1686J02836J72869
13957B80689l2495j33967j92332m3483R6027l6786J10080J04298j1638p1108l2727
$$ plain form
13946 36558 43885 -167071 -199776 115051 99902 223026 196085 -154314 -204893 -57470 -75556
13935 -75556 -68902 -8437 -94252 -42756 -4972 -67160 61934 32188 -2847 -33216 100157
13924 100157 5327 -49529 -123419 -126596 -154947 -23337 86899 79383 -14254 -172217 -109060
13913 -109060 53562 88279 -11180 -132497 -143014 -71806 3697 -58377 55050 168265 48969
13902 48969 152492 145459 94976 168743 186657 38948 -103752 -23171 152247 132915 175671
13891 175671 121273 50973 47299 48381 -35740 -103308 -81148 -103593 -81355 -33144 -19714 63669
13879 63669 -29653 -30210 68133 157094 99383 -17211 -84891 -78884 26218 103238 42961 -92598
13867 -92598 -153008 -114135 -20000 -140872 -146717 -2763 -10570 17034 30034 39202 34738 -63621
$$ packed form
13946C6558P327k10956l2705L14827j5149J23124k6941l50399n0579J47423j8086
13935g5556O654O0465q5815N1496L7784o2188J29094k9746l5035l0369J33373
13924A00157r4830n4856p3890l177k8351J31610J10236p516r3637j57963O3157
13913a09060J62622L4717r9459j21317j0517P1208P5503o2074J13427J13215j19296
13902D8969J03523p033n0483P3767J7914j47709j42700Q0581J75418j9332M2756
13891A75671n4398p0300l674J082q4121o7568K2160k2445K2238M8211J3430Q3383
13879F3669r3322n57R8343Q8961n7711j16594o7680O007J05102P7020o0277j35559
13867i2598o0410L8873R4135j20872n845J43954p807K7604J3000R168m464r8359
$$ plain form
13855 -63621 -164989 -226293 -270863 -201918 -189901 -242240 -88650 -48914 -97777 -75280 -4111
13844 -4111 44964 92739 170142 92386 39249 -26099 7857 159157 308177 314117 207342
13833 207342 -118674 -307377 -272607 -82652 -79474 -62491 -131946 -49147 122256 87425 -69709
13822 -69709 -66929 171706 168660 106237 48282 137560 244116 163045 23294 95174 -54458
13811 -54458 -165257 -189988 -112659 -161933 -48999 -99910 -126285 63586 102249 212862 334926
13800 334926 322520 234451 92368 48622 78176 -81219 -293951 -165745 16807 -46602
13790 -46602 -77548 -150488 -194763 -17264 52171 121319 -14722 -134345 -89 122398 26175
13779 26175 58693 24436 29616 61056 68117 116695 87821 158911 65807 23985 120848 -3353
$$ packed form
13855f3621j01368o1304m4570O8945J2017n2339J53590L9736m8863K2497P1169
13844d111M9075M7775P7403p7756n3137o5348L3956J51300J49020N940j06775
13833B07342l26016j88703L4770J89955L178J6983o9455Q2799J71403l4831j57134
13822f9709K780K38635l046o2423n7955Q9278J06556q1071j39751P1880j49632
13811e4458j10799k4731P7329m9274J12934n0911k6375J89871L8663J10613J22064
13800C34926j2406q8069j42083m3746K9554j59395k12732J28206J82552o3409
13790d6602l0946p2940m4275J77499O9435O9148j36041j19623J34256J22487r6223
13779B6175L2518l4257N180L1440P061M8578k8874P1090r3104m1822R6863j24201
$$ plain form
13767 -3353 -90767 -51101 -109194 -178189 -178966 -89936 128377 115710 -32557 -51368 -55739 -248435
13755 -248435 -131652 52666 222851 215806 299072 247329 205176 223249 53052 51790 292827
13744 292827 392676 308744 170020 42788 39149 65118 99201 127710 57582 30255 -22280
13733 -22280 -179126 -219525 -281162 -77128 139153 155180 32631 -53245 -133758 -165257 -55242
13722 -55242 54637 140617 313208 288701 206384 264651 171488 183658 217885 176823 308554
13711 308554 299320 47549 11491 35085 79272 172295 189716 99234 37306 39044 -38758 -194798
13699 -194798 -287878 -231740 -166400 -74127 -47580 -138676 -94715 -101588 -159757 -10672 204426
13688 204426 279484 166681 121935 131266 258453 274384 210330 274411 240596 213641 117237
$$ packed form
13767c353q7414L9666n8093o8995p77Q9030K18313j2667j48267j8811m371j92696
13755b48435J16783J84318J70185p045Q3266n1743m2153J8073j70197j262K41037
13744B92827R9849q3932j38724j27232l639K5969L4083K8509p0128k7327n2535
13733b2280j56846m0399o1637K04034K16281J6027j22549q5876q0513l1499J10015
13722e5242J09879Q5980J72591k4507q2317N8267r3163J2170L4227m1062J31731
13711C08554r234k51771l6058K3594M4187R3023J7421r0482o1928J738p7802j56040
13699a94798r3080N6138O5340R2273K6547r1096M3961o873n8169J49085K15098
13688B04426P5058j12803m4746R331J27187J5931o4054O4081l3815k6955r6404
$$ plain form
13677 117237 20974 3560 -7805 23831 240854 207512 16077 -121846 -11859 24111 67593
13666 67593 98852 12611 94238 95068 139146 212504 272402 117517 205018 269399 141954 69525
13654 69525 56605 5022 98426 247591 109000 -170558 -271250 -271152 -89700 51500 41386
13643 41386 78699 5078 32292 16174 -141266 -27636 10263 -165759 -289284 -186845 -27034
13632 -27034 -54396 -84120 -153516 45334 145541 90717 130896 95119 25558 72777 1139
13621 1139 58466 106264 26661 -74017 -158303 -125608 -52946 71464 116655 45004 18513
13610 18513 86657 164384 188721 233984 231740 80483 -138474 -162243 -90023 225161 195526
13599 195526 57944 171009 164667 112727 155740 56410 -31976 30135 24517 38180 -35810
$$ packed form
13677A17237r6263j7414j1365L1636K17023l3342j91435j37923J09987L5970M3482
13666F7593L1259q6241Q1627Q30M4078P3358N9898j54885Q7501O4381j27445p2429
13654F9525j2920n1583R3404J49165j38591k79558j00692R8J81452J41200j0114
13643D1386L7313p3621K7214j6118j57440J13630L7899j76022j23525J02439J59811
13632b7034k7362k9724o9396J98850J00207n4824M0179l5777o9561M7219p1638
13621A139N7327M7798p9603j00678q4286L2695P2662J24410M5191p1651k6491
13610A8513O8144P7727K4337M5263k244j51257k18957k3769P2220L15184k9635
13599A95526j37582J13065o342n1940M3013r9330q8386O2111n618J3663p3990
$$ plain form
13588 -35810 -117426 -145744 -168997 -200195 -210391 -118348 -13137 23035 14927 18779 -41532 -182502
13576 -182502 -95293 -70296 -58294 -3238 8107 34779 135123 85847 -25422 -17527 -23429
13565 -23429 26132 40744 -65458 -225369 -285286 -330358 -197709 -101559 12280 -12896 -49448
13554 -49448 102953 134946 149706 134391 62786 98975 174072 163982 251471 261707 145730
13543 145730 122567 223670 30534 154001 308047 170207 149204 168903 192721 162047
13533 162047 157131 47846 -64641 -140011 -137348 52899 143591 32274 -156709 -200156 -299370
13522 -299370 -302236 -219809 -273408 -230445 -137936 -119773 -114944 -184421 -1910 48386 18915 114195
13510 114195 152747 -46325 -112738 -154487 -104117 -105056 44619 25839 -34952 -120529 -49503
$$ packed form
13588c5810q1616k8318k3253l1198j0196R2043J05211L6172q108L852o0311j40970
13576a82502Q7209K4997J2002N5056J1345K6672J00344m9276j11269P895n902
13565b3429M9561J4612j06202j59911n9917m5072J32649R6150J13839k5176l6552
13554d9448J52401L1993J4760j5315p1605L6189P5097j0090Q7489J0236j15977
13543A45730k3163J01103j93136J23467J54046j37840k1003J9699K3818l0674
13533A62047m916j09285j12487p5370K663J90247R0692j11317j88983m3447r9214
13522b99370k866Q2427n3599M2963R2509J8163M829o9477J82511N0296k9471R5280
13510A14195L8552j99072o6413m1749N0370r39J49675j8780o0791q5577P1026
$$ plain form
13499 -49503 98005 149799 14743 -97188 -101974 -29162 155571 182155 326725 333612 324434
13488 324434 172263 143674 218564 83697 12335 -88982 -203816 -145791 -148940 -288148 -355163
13477 -355163 -214015 -290856 -431301 -348592 -238609 -81086 -134067 -93959 -121741 -264170
13467 -264170 -307305 -285916 -126744 -35460 47376 -19463 88490 65508 58303 -99190 -227744
13456 -227744 -191258 -25532 -18905 -33296 -32682 150489 286617 152066 -46353 -4419 13861
13445 13861 -21705 32144 12503 66284 45829 16261 101243 283176 207768 81420 147141
13434 147141 135156 225373 214200 104619 -128397 -333963 -349679 -222244 -232944 -266752 -208388
13423 -208388 -85447 -257585 -156505 -17779 -44415 -57509 -137289 -193588 -201794 -288831 -354061
$$ packed form
13499d9503J47508N1794j35056j11931m786P2812J84733K6584J44570O887r178
13488C24434j52171k8589P4890j34867p1362j01317j14834N8025l149j39208o7015
13477c55163J41148p6841j40445Q2709J09983J57523n2981M0108k7782j42429
13467b64170m3135K1389J59172R1284Q2836o6839J07953k2982p205j57493j28554
13456b27744L6486J65726O627j4391O14J83171J36128j34551j98419M1934J8280
13445A3861l5566N3849j9641N3781k0455k9568Q4982J81933p5408j26348O5721
13434A47141j1985R0217j1173j09581k33016k05566j5716J27435j0700l3808N8364
13423b08388J22941j72138J01080J38726k6636j3094p9780n6299q206q7037o5230
$$ plain form
13412 -354061 -343608 -490863 -551704 -495580 -243343 -63995 -173194 -296274 -344377 -429892
13402 -429892 -340220 -181669 -187067 -95161 28558 134302 44209 -73687 -123069 -126877 -115923
13391 -115923 -75965 -135316 -39468 -1888 -92255 -111653 86874 -24082 -68023 -90925 -30170
13380 -30170 31378 -82719 -60957 86036 39339 32930 -32530 -33986 -77621 -184066 -172102
13369 -172102 -219731 -253116 -157308 -6839 145855 14691 19414 -11837 -72544 182671 214919
13358 214919 185648 65824 41580 183213 203621 189525 213123 349439 301675 181295 31131
13347 31131 -10278 8794 -80011 -203618 -4507 55126 58391 139094 205742 245885 367135
13336 367135 377678 302681 133073 2985 27852 -86558 -47882 22521 -38985 108516 145502
$$ packed form
13412c54061J0453j47255o0841N6124K52237J79348j09199j23080m8103q5515
13402d29892Q9672J58551n398R1906J23719J05744r0093j17896m9382l808J0954
13391a15923L9958n9351R5848L7580r0367j9398J98527j10956m3941k2902O0755
13380c0170O1548j14097K1762J46993m6697o409o5460j456m3635j06445J1964
13369a72102m7629l3385R5808J50469J52694j31164M723l1251o0707K55215L2248
13358B14919k9271j19824k4244J41633K0408j4096K3598J36316m7764j20380j50164
13347C1131m1409J9072q8805j23607J99111N9633L265Q0703O6648M0143J21250
13336C67135J0543p4997j69608j30088K4867j14410L8676P0403o1506J47501L6986
$$ plain form
13325 145502 -8430 -49556 -25227 -48818 105401 167543 212183 226712 218513 56078 5076
13314 5076 187765 345959 334338 463545 363142 268783 155782 -11868 -32417 -45583 64709
13303 64709 124561 218429 126903 305080 391622 114479 -175624 -193690 -213736 -85042 -15467
13292 -15467 -47417 134690 188331 265664 266075 104118 84991 112580 50668 -13190 91385
13281 91385 145385 162424 174928 223832 210683 70518 -132423 -118847 140513 298725 238516
13270 238516 35679 89200 214429 237760 238537 228059 156989 171304 72050 170435 134090
13259 134090 46990 128379 219519 241418 105414 -66733 -135218 -152532 -129786 -193640 -227296
13248 -227296 -111991 31235 44865 204672 373455 353471 201132 67036 -32049 50665
$$ packed form
13325A45502j53932m1126K4329k3591J54219O2142M4640J4529q199j62435n1002
13314E076J82689J58194j1621J29207j00403r4359j13001j67650k0549j3166J10292
13303F4709N9852R3868r1526J78177Q6542k77143k90103j8066k0046J28694O9575
13292a5467l1950J82107N3641P7333M11j61957j9127K7589o1912o3858J04575
13281I1385N4000J7039J2504M8904j3149j40165k02941J3576K59360J58212o0209
13270B38516k02837N3521J25229K3331P77j0478p1070J4315r9254R8385l6345
13259A34090q7100Q1389R1140K1899j36004j72147o8485j7314K2746o3854l3656
13248b27296J15305J43226J3630J59807J68783j9984j52339j34096r9085Q2714
$$ plain form
13238 50665 107802 176447 69015 479 -35243 145006 402532 377161 320105 330846 288949
13227 288949 203835 131833 87445 40366 -23303 -124960 -127930 -156213 -163391 -99575 -161860 -198289
13215 -198289 -283286 -210366 -43201 116205 112204 51729 129988 206617 155874 48674 145228
13204 145228 157429 174373 -13318 -43071 4975 -40715 -43130 56932 19961 -75771 4279
13193 4279 72994 53103 76128 50585 199318 182143 78991 -14914 -67322 -46926 67328
13182 67328 293948 459779 278705 105184 -92037 -62311 -26393 -242110 -222940 -181527
13172 -181527 -279451 -217806 -189432 -226994 -245414 -330949 -251640 -154719 71643 237704 169522
13161 169522 67587 193347 263563 286379 189221 136292 196382 133544 150385 169184 215162
$$ packed form
13238E0665N7137O8645j07432o8536l5722J80249K57526k5371n7056J0741m1897
13227B88949q5114p2002m4388m7079o3669j01657k970k8283p178O3816o2285l6429
13215a98289q4997P2920J67165J59406m001o0475P8259P6629n0743j07200R6554
13204A45228J2201J6944j87691k9753M8046m5690k415J00062l6971r5732Q0050
13193D279O8715j9891K3025k5543J48733j7175j03152r3905n2408K0396J14254
13182F7328K26620J65831j81074j73521j97221K9726L5918k15717J9170M1413
13172a81527r7924O1645K8374l7562j8420q5535P9309R6921K26362J66061o8182
13161A69522j01935J25760P0216K2816r7158n2929O0090o2838J6841J8799M5978
$$ plain form
13150 215162 175899 112571 -47422 47873 12413 71589 155461 54814 124533 189314 239069
13139 239069 176195 200006 202910 125844 -191291 -227521 -253240 -76740 40761 87339 62849
13128 62849 195958 354647 309155 264733 191015 228410 154624 79322 173951 262494 293181
13117 293181 148695 209741 321202 148536 211489 326071 278388 80895 -6734 -68407
13107 -68407 -63966 -48060 -26964 145595 389698 398253 172983 33402 -18849 -62029 107802
13096 107802 23746 -19021 -5146 209093 213492 211685 215900 100879 132045 169290 -37669
13085 -37669 39366 22940 -66407 171335 221236 231524 147242 26312 -101244 -187520 -212670
13074 -212670 -129787 -81579 -141450 -111867 -1823 14431 20522 43410 66549 125491 214762
$$ packed form
13150B15162l9263o3328j59993R5295l5460N9176Q3872j00647O9719O4781M9755
13139B39069o2874K3811K904p7066l17135l6230k5719J76500J17501M6578k4490
13128F2849J33109J58689m5492m4422p3718L7395p3786p5302R4629Q8543L0687
13117B93181j44486O1046J11461j72666O2953J14582m7683j97493q7629o1673
13107f8407M441J5906K1096J72559K44103Q555k25270j39581n2251m3180J69831
13096A07802q4056m2767J3875K14239M399j807M215j15021L1166L7245k06959
13085c7669P7035j6426q9347K37742M9901J0288q4282j20930j27556q6276k5150
13074b12670Q2883M8208n9871K9583J10044J6254O091K2888K3139N8942Q9271
$$ plain form
13063 214762 172008 46350 52202 85455 114596 76907 183996 153497 107742 133122 82184
13052 82184 -147810 -270929 -162507 -63143 -4062 -4220 -47003 -138485 -217382 -347231 -217211
13041 -217211 204617 217684 197637 213472 194272 110630 -57229 -15819 134391 27069 20711
13030 20711 -69053 29759 33208 141362 108883 -136522 -110404 -52855 -76467 -47259 -122082
13019 -122082 -308099 -234137 -93468 -26786 73461 16129 -90192 30859 270600 419523
13009 419523 341954 89721 2177 -2574 -54687 -174890 -255146 -240819 -310430 -270192 -84009
12998 -84009 67084 -30587 -32747 263071 201311 -48734 -239242 -165631 6584 185923 142740
12987 142740 18295 -78587 -212960 -306298 -168650 -84762 -115484 30505 133037 21302
$$ packed form
13063B14762m2754j25658N852L3253K9141l7689J07089l0499m5755K5380n0938
13052H2184k29994j23119J08422R9364N9081j58m2783r1482p8897j29849J30020
13041b17211M21828J3067k0047J5835j9200q3642j67859M1410J50210j07322o358
13030B0711q9764R8812L449J08154l2479k45405K6118N7549k3612K9208p4823
13019a22082j86017P3962J40669O6682J00247n7332j06321J21051K39741J48923
13009D19523p7569k52233q7544m751n2113j20203q0256J4327o9611M0238J86183
12998h4009J51093r7671k160K95818o1760k50045j90508P3611J72215J79339m3183
12987A42740j24445r6882j34373r3338J37648Q3888l0722J45989J02532j11735
$$ plain form
12977 21302 40505 108610 151134 126745 121794 60914 -43987 129644 57763 45780 32210
12966 32210 -74785 -157723 -183074 -240665 -254672 -188041 -17216 34881 -156659 -208940 -262767
12955 -262767 -63346 33120 -69041 -263419 -265159 -83883 25152 -142570 -308829 -308698 -191069
12944 -191069 -16669 -82618 -99465 -26520 213411 147798 -7136 -19611 -34185 -20069 129016
12933 129016 55910 -69292 -85832 -44395 10074 144087 266864 133726 82885 105388 186820
12922 186820 -56977 -222960 -136791 -138659 -81419 -23180 -16543 -117525 -55235 148793 225629
12911 225629 129689 -17263 -146933 -136975 18398 104643 52459 60794 61045 66606 103950 -41720
12899 -41720 -157793 23510 -25378 85741 150206 181789 189771 143472 245810 275084 111218
$$ packed form
12977B1302J9203O8105M2524k4389m951o0880j04901J73631p1881j1983j3570
12966C2210j06995q2938k5351n7591j4007O6631J70825N2097j91540n2281n3827
12955b62767J99421R6466j02161j94378j740J81276J09035j67722j66259J31J17629
12944a91069J74400o5949j6847P2945K39931o5613j54934j2475j4574J4116J49085
12933A29016p3106j25202j6540M1437N4469J34013J22777j33138n0841K2503Q1432
12922A86820k43797j65983Q6169j868N7240N8239O637j00982O2290K04028P6836
12911B25629r5940j46952j29670R958J55373Q6245n2184Q335K51N561L7344j45670
12899d1720j16073J81303m8888J11119O4465L1583P982m6299J02338K9274j63866
$$ plain form
12888 111218 108385 189590 193591 -42733 -126540 5934 78665 41119 -92385 -103883 -5687
12877 -5687 55392 30307 11420 112238 -16386 -114229 -56844 -134169 -105381 -250580 -251864
12866 -251864 -160116 -193582 -75950 -123327 -64402 123937 173152 7594 -232776 -216445 -217014
12855 -217014 -99004 -32624 -28592 -6502 -29621 -98479 -146750 31408 180283 93781 -22582
12844 -22582 -103631 -191718 -82598 139554 84144 2188 48837 162790 151198 108373 48293
12833 48293 -119051 -277714 -296524 -283418 -185578 -7331 -48790 -5283 35641 1781 -27620
12822 -27620 -36537 -172657 -220354 -152578 -77056 -30819 69972 -30908 -50839 198052 117060
12811 117060 162198 -64659 -15440 199753 265590 330686 229647 157555 150691 238855 232891
$$ packed form
12888A11218k833Q1205M001k36324q3807J32474P2731l7546j33504j1498R8196
12877e687O1079k5085j8887J00818j28624r7843N7385p7325K8788j45199j284
12866b51864R1748l3466J17632m7377N8925J88339M9215j65558k40370J6331n69
12855b17014J18010O6380M032K2090k3119o8858m8271J78158J48875q6502j16363
12844b2582q1049q8087J09120K22152n5410q1956M6649J13953j1592m2825o0080
12833D8293j67344j58663j8810J3106R7840J78247m1459M3507M0924l3860k9401
12822b7620q917j36120m7697O7776P5522M6237J00791j00880j9931K48891q0992
12811A17060M5138k26857M9219K15193O5837O5096j01039p2092o864Q8164n964
$$ plain form
12800 232891 221570 127132 51046 170025 294408 225541 -1637 -249634 -366858 -303334
12790 -303334 -62825 -115893 -44149 -49328 30760 175134 262453 262868 123149 149080 297138
$$ packed form
12800B32891j1321r4438p6086J18979J24383o8867k27178k47997j17224O3524
12790c03334K40509n3068P1744n179Q0088J44374Q7319M15j39719K5931J48058
$$ [...]
##END NTUPLES=NMR SPECTRUM
##END=
