##TITLE=Analysis number 307145
Compound Code km 06374
Book Reference 332/190
Chemist Name craigr
##JCAMPDX= 6.0         $$ Bruker NMR JCAMP-DX V2.0
##DATA TYPE= NMR SPECTRUM
##DATA CLASS= NTUPLES
##ORIGIN= Bruker BioSpin GmbH
##OWNER= NMR
$$ XWIN-NMR		Version 3.5
$$ Thu Apr 21 10:11:47 2005 GMT Daylight Time (UT+1h)  MAYBRIDGE\NMR@NMR_250MHZ
##.OBSERVE FREQUENCY= 250.131544655141
##.OBSERVE NUCLEUS= ^1H
##.ACQUISITION MODE= SIMULTANEOUS (DQD)
##.ACQUISITION SCHEME= undefined
##.AVERAGES= 16
##.DIGITISER RES= 18
##SPECTROMETER/DATA SYSTEM= dpx250
##.PULSE SEQUENCE= zg30
##.SOLVENT NAME= CDCl3
##.SHIFT REFERENCE= (INTERNAL, CDCl3, 0, 16.4497)
##AUDIT TRAIL= $$ (NUMBER, WHEN, WHO, WHERE, WHAT)
$$ ##TITLE= Audit trail, XWIN-NMR		Version 3.5
$$ ##JCAMPDX= 5.01
$$ ##ORIGIN= Bruker BioSpin GmbH
$$ ##OWNER= NMR
$$ C:\u/data/dgb/nmr/ADRS/2010/pdata/1/auditp.txt
$$ ##AUDIT TRAIL=  $$ (NUMBER, WHEN, WHO, WHERE, WHAT)
(   1,<2005-04-21 10:11:28.66 +100>,<MAYBRIDGE\NMR>,<NMR_250MHZ>,
      <created by zg, POWCHK disabled, PULCHK disabled
       configuration hash MD5:
       62 19 C7 07 E1 42 D1 B7 37 6C 3D D0 77 39 F9 E6
       data hash MD5: 64K
       3B F8 AF 88 C0 B3 DC E9 68 79 B5 D4 E9 6D CF 78>)
(   2,<2005-04-21 10:11:39.60 +100>,<MAYBRIDGE\NMR>,<NMR_250MHZ>,
      <Start of raw data processing
       ef LB = 0.3 FT_mod = 6 PKNL = 1 SI = 32K 
       data hash MD5: 32K
       D2 46 A0 3A C7 32 5D 71 ED 09 E6 59 36 03 08 86>)
(   3,<2005-04-21 10:11:41.26 +100>,<MAYBRIDGE\NMR>,<NMR_250MHZ>,
      <apk 
       data hash MD5: 32K
       E2 49 04 15 46 AC 96 A7 95 06 8E A9 F6 C8 15 46>)
(   4,<2005-04-21 10:11:41.93 +100>,<MAYBRIDGE\NMR>,<NMR_250MHZ>,
      <abs ABSG = 5 
       data hash MD5: 32K
       8F E3 3E 7C 9A BA 8D D8 D3 16 C0 F4 4D 36 C5 C0>)
$$ ##END=
$$ 
$$ hash MD5
$$ 1B 5F A6 B5 D2 36 38 74 FD 71 10 FB FD FA 3F F6
##$RELAX= 
##$RELAX= 
##$RELAX= 
##$RELAX= 
##$RELAX= 
##$RELAX= 
##$RELAX= 
$$ Bruker specific parameters
$$ --------------------------
##$DU= <C:\u>
##$EXPNO= 2010
##$NAME= <ADRS>
##$PROCNO= 1
##$TYPE= <nmr>
##$USER= <dgb>
##$AMP= (0..31)
100 100 100 100 100 100 100 100 100 100 100 100 100 100 100 100 100 100 
100 100 100 100 100 100 100 100 100 100 100 100 100 100 
##$AQSEQ= 0
##$AQ_mod= 3
##$AUNM= <au_zg>
##$AUTOPOS= <8 >
##$BF1= 250.13
##$BF2= 250.13
##$BF3= 250.13
##$BF4= 250.13
##$BF5= 500.13
##$BF6= 500.13
##$BF7= 500.13
##$BF8= 500.13
##$BYTORDA= 1
##$CFDGTYP= 0
##$CFRGTYP= 5
##$CHEMSTR= <none>
##$CNST= (0..31)
1 1 145 1 1 1 1 1 1 1 1 1 1 1 1 1 1 1 1 1 1 1 1 1 1 1 1 1 1 1 1 1 
##$CPDPRG= <>
##$CPDPRG1= <>
##$CPDPRG2= <>
##$CPDPRG3= <>
##$CPDPRG4= <mlev>
##$CPDPRG5= <mlev>
##$CPDPRG6= <mlev>
##$CPDPRG7= <mlev>
##$CPDPRG8= <mlev>
##$CPDPRGB= <>
##$CPDPRGT= <>
##$D= (0..31)
0 1 0 0 0 0 0 0 0 0.06 0 0 0 0 0 0 0.0002 0 0 0 0 0 0 0 0 0 0 0 0 0 0 
0 
##$DATE= 1114074687
##$DBL= (0..7)
120 120 120 120 120 120 120 120 
##$DBP= (0..7)
150 150 150 150 150 150 150 150 
##$DBP07= 0
##$DBPNAM0= <>
##$DBPNAM1= <>
##$DBPNAM2= <>
$$ [...]
##$SUBNAM7= <"">
##$SUBNAM8= <"">
##$SUBNAM9= <"">
##$SW= 20.6930455092707
##$SWIBOX= (0..15)
0 0 3 0 0 0 0 0 0 0 0 0 0 0 0 0 
##$SW_h= 5175.983436853
##$TD= 65536
##$TD0= 1
##$TE= 294.16
##$TE2= 300
##$TE3= 300
##$TEG= 300
##$TL= (0..7)
0 120 120 120 120 120 120 120 
##$TP= (0..7)
150 150 150 150 150 150 150 150 
##$TP07= 0
##$TPNAME0= <>
##$TPNAME1= <>
##$TPNAME2= <>
##$TPNAME3= <>
##$TPNAME4= <>
##$TPNAME5= <>
##$TPNAME6= <>
##$TPNAME7= <>
##$TPOAL= (0..7)
0.5 0.5 0.5 0.5 0.5 0.5 0.5 0.5 
##$TPOFFS= (0..7)
0 0 0 0 0 0 0 0 
##$TUNHIN= 0
##$TUNHOUT= 0
##$TUNXOUT= 0
##$USERA1= <user>
##$USERA2= <user>
##$USERA3= <user>
##$USERA4= <user>
##$USERA5= <user>
##$V9= 5
##$VALIST= <valist>
##$VCLIST= <CCCCCCCCCCCCCCC>
##$VD= 0
##$VDLIST= <DDDDDDDDDDDDDDD>
##$VPLIST= <PPPPPPPPPPPPPPP>
##$VTLIST= <TTTTTTTTTTTTTTT>
##$WBST= 1024
##$WBSW= 4
##$XGAIN= (0..3)
0 0 0 0 
##$XL= 0
##$YL= 0
##$YMAX_a= 305052
##$YMIN_a= -222575
##$ZGOPTNS= <>
##$ZL1= 120
##$ZL2= 120
##$ZL3= 120
##$ZL4= 120
##$ABSF1= 16.44973
##$ABSF2= -4.243443
##$ABSG= 5
##$ABSL= 3
##$ALPHA= 0
##$AQORDER= 0
##$ASSFAC= 0
##$ASSFACI= 0
##$ASSFACX= 0
##$ASSWID= 0
##$AUNMP= <proc_1d>
##$AZFE= 0.1
##$AZFW= 0.1
##$BCFW= 0
##$BC_mod= 0
##$BYTORDP= 0
##$COROFFS= 0
##$CY= 12.5
##$DATMOD= 1
##$DC= 0
##$DFILT= <>
##$DTYPP= 0
##$F1P= 14.0000005364418
##$F2P= -0.99999901652339
##$FCOR= 0.5
##$FTSIZE= 32768
##$FT_mod= 6
##$GAMMA= 0
##$GB= 0
##$INTBC= 1
##$INTSCL= 1
##$ISEN= 128
##$LB= 0.3
##$LEV0= 0
##$LPBIN= 0
##$MAXI= 10000
##$MC2= 0
##$MEAN= 0
##$ME_mod= 0
##$MI= 0
##$NCOEF= 0
##$NC_proc= -5
##$NLEV= 6
##$NOISF1= 0
##$NOISF2= 0
##$NSP= 0
##$NTH_PI= 0
##$NZP= 0
##$OFFSET= 16.44973
##$PC= 1
##$PHC0= -79.06897
##$PHC1= 33.84298
##$PH_mod= 1
##$PKNL= yes
##$PPARMOD= 0
##$PSCAL= 4
##$PSIGN= 0
##$REVERSE= no
##$SF= 250.130018075797
##$SI= 32768
##$SIGF1= 0
##$SIGF2= 0
##$SINO= 400
##$SIOLD= 32768
##$SREGLST= <1H.CDCl3>
##$SSB= 0
##$STSI= 32768
##$STSR= 0
##$SW_p= 5175.98343685301
##$SYMM= 0
##$S_DEV= 0
##$TDeff= 65536
##$TDoff= 0
##$TI= <Analysis number 999999
Compound Code 99
Book Reference 9
Project Code 9>
##$TILT= no
##$TM1= 0
##$TM2= 0
##$TOPLEV= 0
##$USERP1= <user>
##$USERP2= <user>
##$USERP3= <user>
##$USERP4= <user>
##$USERP5= <user>
##$WDW= 1
##$XDIM= 32768
##$YMAX_p= 298486987
##$YMIN_p= -652457
$$ End of Bruker specific parameters
$$ ---------------------------------
##NTUPLES= NMR SPECTRUM
##VAR_NAME=  FREQUENCY,     SPECTRUM/REAL,   SPECTRUM/IMAG
##SYMBOL=    X,             R,               I
##VAR_TYPE=  INDEPENDENT,   DEPENDENT,       DEPENDENT
##VAR_FORM=  AFFN,          ASDF,            ASDF
##VAR_DIM=   32768,         32768,           32768
##UNITS=     HZ,            ARBITRARY UNITS, ARBITRARY UNITS
##FACTOR=    0.157963299565203, 1,           1
##FIRST=     4114.5712420899, 0,             0
##LAST=      -1061.41219476311, 0,           0
##MIN=       -1061.41219476311, -652457,     0
##MAX=       4114.5712420899, 298486987,     0
$$ Real data points
##PAGE= N=1
##DATA TABLE= (X++(R..R)), XYDATA
$$ [...]
27523 26260 -46598 -108804 -116652 2717 79681 -85053 -156281 -153070 -183495 -202768 -240577 -53402
27511 -53402 88957 79803 -139381 -63500 21889 33025 66585 146107 144749 75758 -3318 88404
27499 88404 171428 188608 53364 -3727 3699 -33339 -94302 -149552 -101843 7407 -34397
27488 -34397 18722 -4930 61322 145706 151916 62353 -73799 -130465 6786 58798 111470
27477 111470 216923 127761 177398 239011 218647 151167 28777 80099 194091 229009 58541
27466 58541 -84604 -91151 -175968 -199734 -41039 -7147 -31371 77658 106804 131887 161605
27455 161605 65913 -35226 -232256 -81112 -39445 -102896 -78930 -83374 36286 -19099 -68871
27444 -68871 -28698 -80199 -328083 -274675 -44008 -4305 -43241 -158187 -113867 -19518 -93169
27433 -93169 -197986 -202998 -301852 -309008 -204752 -229660 -199765 48712 239025 401899 467903
27422 467903 353181 41942 -14115 66211 306164 275241 201421 181002 238017 191035 93737
27411 93737 143937 132110 -24274 22497 48710 68673 136483 112318 35990 4576 19713
27400 19713 -41882 19330 87643 90292 38513 -106783 -288299 -218779 -113450 -22790 -264126
27389 -264126 -227360 -68514 125721 337465 406001 469249 270178 69236 -141478 -169343
27379 -169343 -197500 -177369 -172664 -151505 -179249 -81214 -41787 168742 388593 376327 202715
27368 202715 -105778 -252064 -159204 -211802 -226670 -359191 -278620 -197366 -163512 -93017 -18010
27357 -18010 -205242 -359328 -322969 -198003 -168895 -45448 -74390 -223103 -128426 6325
27347 6325 224209 128736 -144299 -152854 -97969 -143588 -43502 -11133 177138 234408 24312
27336 24312 -70429 53348 114376 12430 -86098 67954 217125 200895 11082 -71079 -80872
27325 -80872 -36864 -183737 -166447 -12286 -97372 49368 136528 209299 177093 9254 -18965
27314 -18965 -16469 4011 122134 59486 -3055 22872 73959 -90413 -161539 -164057 -172411 -159515
27302 -159515 -70652 -11004 1313 70242 172411 107595 -7526 -163045 -106247 -26402 140868
27291 140868 114455 -26030 38038 345147 329440 191057 107667 31023 24503 -131752 -224554
27280 -224554 -139211 932 -39725 -84841 -178363 -112736 -59525 -309772 -382591 -179012 -126890
27269 -126890 -133540 -142501 -64861 -151077 -338325 -305730 -189152 -248180 -140933 196757 184045
27258 184045 16630 32416 201827 207166 71987 -6383 79135 -78950 -46145 39875 42489
27247 42489 -7878 123663 55627 -130040 -196247 -239317 -53882 92441 132530 156140 170764
27236 170764 253022 260226 234576 247739 206362 174003 154666 181618 200560 140563 -84304
27225 -84304 -194305 -72780 -264346 -282449 -104859 -37617 -27473 -103494 -132635 -36825 -97015
27214 -97015 -209123 -276165 -338587 -455223 -544381 -447530 -324186 -168249 -95134 -167306 -31925
27203 -31925 208937 51311 -83808 -210389 -87452 134525 279579 182714 41780 29234
27193 29234 -155318 -27635 85026 37715 82646 127301 243375 318776 357868 415279 494398
27182 494398 607043 378495 184067 71975 96544 248222 203343 107081 114177 88224 75611
27171 75611 -18447 24668 198300 186060 32179 42091 155266 165320 83006 162892 218040
27160 218040 106271 -25760 -69876 15354 6054 -117436 -183100 -127319 -16092 141883 132391
27149 132391 43659 50160 111344 -89373 -191456 -281215 -397714 -309691 -26118 52817 -144925
27138 -144925 -246104 -131439 -97122 -136703 -98422 21919 90184 102423 117154 76538 -88820
27127 -88820 -213429 -217838 -333016 -188338 -141224 33404 157458 244841 324973 199742 107739
27116 107739 -107407 140563 183630 23081 41399 25962 -43483 -186576 -214243 -135420 -151197
27105 -151197 92970 184305 192250 33975 118002 32059 22988 173698 208924 243449 247587
27094 247587 320149 190509 150871 223472 193053 121170 -55540 -78102 -61199 -60781 -81980
27083 -81980 45182 83503 43182 163593 275241 261550 96203 81701 183283 87429 192131
27072 192131 126064 224252 294693 369475 379172 325445 339698 333534 299387 157343 105339 32923
27060 32923 132914 274239 360976 365635 124284 -18931 94021 281874 222721 163328 139588
27049 139588 -13574 -14800 -126162 -179958 -139392 -26350 -43382 -133374 -222679 17976 81306
27038 81306 119935 103320 216106 369269 366117 250245 143274 -6293 15119 -75241 -239585
27027 -239585 -199679 -154229 -77977 -127601 -209755 -231540 -252194 -361539 -344843 -186790 -137409
27016 -137409 -261665 -322028 -90133 65345 227928 124193 1412 12886 95173 62008
27006 62008 112999 182174 114876 -1748 -236311 -382081 -150096 -19764 31832 94127 -34426
26995 -34426 -81954 -103417 57127 167942 145414 -7232 97425 243232 342104 338817 182199
26984 182199 76960 173092 18938 -103467 -155393 -227261 -154736 -7754 11542 -164518
26974 -164518 -211966 -245309 -177902 -146069 -58946 -134757 -212043 -193741 -275315 -378930 -322910
26963 -322910 -258963 -228638 -203833 -158167 -148309 -151194 -9535 42322 139986 49780 42650 22469
26951 22469 46927 55806 61917 41885 -56494 -123976 -154917 -138557 17917 143775 151317 -31741
26939 -31741 -99063 -219536 -92911 -148588 -51447 -34527 -25408 47327 -93541 -136216 -192379
26928 -192379 -140304 -88148 -145775 -179963 75471 178462 97955 -83934 -63321 -54363 -118166
26917 -118166 -140667 -147854 -115476 -151924 -155149 -256 138823 244901 267949 361759 187154
26906 187154 77027 124006 191484 216628 292612 93952 -78634 -168194 -191668 -71309 95109
26895 95109 80086 -44529 -33563 -80234 -111526 -115726 -43777 -93427 -160988 -117739 -85021 12809
26883 12809 92337 49771 -25792 -192026 -155256 -84150 107345 208366 204993 335742 228192
26872 228192 30091 -86636 -174657 -247076 -134806 -81055 -11463 -25547 -72648 -6941 -49241
26861 -49241 -4124 151964 207677 285761 277634 119574 197500 220621 238937 359212 423346
26850 423346 263886 134484 51611 52830 -61077 -180206 -235654 -80131 -24015 -43066 78398
26839 78398 18026 -144765 -44547 -40437 13143 123123 186864 264131 169086 178631 86002
26828 86002 72740 25639 -10019 7311 -49260 -114666 -237336 -149857 -90238 -7247 -91465
26817 -91465 -79553 -99284 -63131 17262 -3714 26472 81004 -6007 -105911 -48501 -102136 -102556
26805 -102556 -56052 -5176 53016 75645 8194 -121282 -64039 45601 161210 66266 33364
26794 33364 227569 353773 245167 26936 9098 -18839 -30097 62877 242584 249910 215641
26783 215641 114385 19299 -26493 -47744 -43112 -10214 43766 70945 81845 -3700 -60731
26772 -60731 13458 -49925 -22446 17934 9751 -22041 -91624 -159362 -137136 74693 53715 -51953
26760 -51953 -48256 76134 50326 -84613 -4584 134551 61357 58012 138096 87738 142549
26749 142549 248283 229771 222037 169104 224409 257362 125411 3978 -74177 -140795 -173302
26738 -173302 -264938 -117818 53338 126071 189305 230557 147442 177915 267986 344270 267819
26727 267819 -8782 -73206 -27402 -121338 -116395 -189696 -278897 -242927 -117908 -112760 -134075
26716 -134075 -88994 -106139 -201798 -169694 -103043 -197098 -334423 -198934 -277376 -413074 -358456
26705 -358456 -11401 98593 44632 96229 59716 117884 142199 164052 201422 152391 11505
26694 11505 -134616 -198095 -58480 -62166 -57496 -205915 -253181 -154181 -123652 -77012 -104189
26683 -104189 52952 39091 -34470 -40571 -36860 -54504 92462 86565 35838 -9521 -76000 138812
26671 138812 262638 182025 89569 103741 169222 48310 -102091 -44514 -62128 13070 53519
26660 53519 -113361 -82375 13313 231867 126017 40679 -19732 16166 -88760 -188034 -182245
26649 -182245 -13711 -49440 -169745 -235734 -372910 -234018 -31344 -148154 -153126 -75794
26639 -75794 8923 -230623 -348023 -314095 -255769 -48746 72945 184352 40982 -62620
26629 -62620 58803 194395 131423 -178790 -195892 102026 207883 337876 391005 345422
26619 345422 177969 11082 -72689 -122733 -219712 -120425 54657 289560 289307 182718 189002
26608 189002 230237 176474 244093 240572 273224 352831 120897 31966 24667 31493 92669 132074
26596 132074 279907 153096 145914 155311 178145 87650 198111 233246 140768 66889 36154
26585 36154 118818 221173 93383 -91404 -34476 79217 196713 88781 147824 -6812
26575 -6812 -104942 -138086 -39829 118070 160652 55174 -22144 -52639 78489 109656 176397
26564 176397 267381 398018 390828 286079 84804 -100121 -154133 -47720 -96505 12806
26554 12806 166360 237246 53163 -108720 -59093 -18803 -24753 4480 53480 92924 92784 -45539
26542 -45539 37877 204481 309768 343183 320828 266653 195580 157657 158009 141610 -14587
26531 -14587 -197704 -203973 -57493 -44550 -22933 -146255 -222618 -112724 -26762 -72297 -123150
26520 -123150 -55501 -165729 -312168 -346744 -263905 -112780 81393 50014 75787 183398
26510 183398 84907 -110047 -239656 -234949 -243916 -226078 -16113 32279 32252 -37274 -154690 -157396
26498 -157396 -65913 41001 -170223 -166560 15555 -77686 -158042 -143002 -27219 -2233 19514
26487 19514 -38699 -138121 87029 223679 333362 287958 128033 127647 166131 99867 49416
26476 49416 21888 63437 204465 281823 128880 -64420 -299139 -185673 -164324 -236073 -198980
26465 -198980 47876 193062 213554 310725 327569 228477 197809 220787 298386 345232 226907
26454 226907 127056 83732 134577 91038 65735 -53047 -67136 -34793 -44333 3240 18851
26443 18851 104295 242787 185620 120736 49046 -40234 -45490 12398 -20613 30541 86606 108427
26431 108427 176128 173786 108731 47671 68050 161504 79864 105657 247564 223131 293297
26420 293297 325808 193078 30124 -8910 99993 66110 77964 95106 104159 55815 200008
26409 200008 220711 245961 348918 313852 220677 82576 -70790 39059 124337 -21889
26399 -21889 5795 -39525 -30475 97518 258808 350598 206391 158795 46788 -138215 -91903
26388 -91903 8556 69255 140705 136744 -30410 -82874 57918 -7045 -65209 34252 71613
26377 71613 54407 -88596 -56326 -4553 -69783 -32612 -1913 67723 205164 182330 52076
26366 52076 -179356 -65124 -7005 -99124 -198012 -258911 -215518 -168607 -153677 -131535 -88515
26355 -88515 -4633 26331 -119718 -34971 148377 118923 4780 -73980 -54253 -97723 -47409
26344 -47409 -44740 -31911 -35592 -28994 38045 110258 123198 180104 157706 104578 -102670 -105119
26332 -105119 -134921 120698 247251 156817 37948 -38754 25919 -5641 -152584 -234421 -243901
26321 -243901 -155890 -8195 44166 194710 73477 10462 88071 48270 16296 -156004 -155937
26310 -155937 -95606 -154461 -347576 -127199 79667 94531 186966 122961 107406 95533 -129728
26299 -129728 -79041 -40086 -41666 -76164 57588 52443 -37797 -109170 -136678 -169648 -167164 -206978
26287 -206978 -152767 -200563 -240716 -45749 56437 85581 77027 -108405 -119791 -47687 143580
26276 143580 131016 74645 -42960 6239 12580 70439 226365 209181 270196 382818 147771
26265 147771 -77833 66161 32645 -88016 -195017 -152279 -81950 -73016 -7243 -138664 -197821
26254 -197821 -182527 -69624 80501 134842 157091 90794 106921 15991 53719 150944 296204
26243 296204 194883 -86520 -129453 -20218 -92080 -76689 -155389 -310139 -97293 75073
26233 75073 116491 -107921 -109944 -187173 -235437 -314840 -297453 -213783 -118010 -60408 -43781 -190993
26221 -190993 -156782 -1185 171789 350851 251773 180751 143640 -10514 -216998 -229834
26211 -229834 -166713 -188647 -208203 -134625 -94421 -38044 -94217 -224650 -308230 -200069 -121421
26200 -121421 140673 213803 260073 168914 28311 -96097 -183769 -293738 -211394 -292453 -103234
26189 -103234 94196 69427 114656 79164 72054 114748 -14142 11363 99416 6402 2971
26178 2971 237971 250185 138430 41630 60438 -63938 -212790 -354309 -269812 -184927 -196783
26167 -196783 -231065 -278097 -143791 -63857 -215598 -145674 207592 253130 82545 57994 131789
26156 131789 19633 -120856 -53050 25800 79802 142621 202904 156125 101929 67252 58297
26145 58297 69687 203523 131594 149123 206843 120308 3252 -71508 -109074 -95276 -108797
26134 -108797 -248188 -260619 -183015 -98845 -189525 -265917 -254328 -178972 -264088 -342654 -194558
26123 -194558 -137499 -139943 -145953 -250516 -261544 -114222 -39606 -111963 -119821 -42787 -65954 23336
26111 23336 57332 98340 175812 317319 365072 205071 135481 16621 32402 38072 44772
26100 44772 -59259 -217005 -328362 -243647 -151054 -54444 138040 -70356 -344405 -216564
26090 -216564 15819 19839 -117707 -189552 -237298 -243001 -63015 -48619 -33636 88478 -182777
26079 -182777 -185195 -132493 -208430 38033 150819 163618 121004 -28785 -103356 -155746 -42829
26068 -42829 -11889 70361 110984 131570 206221 212970 170300 79782 199586 343230 375562
26057 375562 365532 220425 137429 142074 158991 112609 -8393 -76694 49602 159089 205545
26046 205545 289319 310941 371087 202679 -6693 -131680 -79749 -246499 -381489 -279541
26036 -279541 -165314 -28674 58371 66227 -18625 -57359 -94197 -113847 40125 206977 131588
26025 131588 15723 28692 -47884 17770 189240 224538 118447 -83505 -11450 166097
26015 166097 179874 248665 251262 186352 260851 243866 187028 18306 95490 71396 62225 99104
26003 99104 51904 -35606 -285616 -412838 -391176 -221279 -273449 -259377 -342725 -413448 -421381
25992 -421381 -347872 -215106 -174976 -105607 -30071 54726 65285 26972 116855 243648 181436
25981 181436 20576 -183583 -135850 -51179 -172 -948 29523 174316 85525 31120 222486
25970 222486 343124 282932 218954 102617 154926 281380 303489 145801 -116283 -247272
25960 -247272 -295342 -227351 -37988 -37827 -77026 -69647 -135341 -191878 -179444 -45993 -41186 -33820
25948 -33820 -160113 -351005 -278627 -181275 -163587 -229999 -22976 95500 -141978 -183566 -94988
25937 -94988 -207281 -206923 -211661 -82115 -43198 -120192 -100489 -89497 -40497 75512 -12077 -186013
25925 -186013 -67671 90129 184137 95226 137534 181885 136394 227510 261707 237157 135271
25914 135271 42329 144006 29612 41245 228003 91221 -33645 68484 117715 186319
25904 186319 232175 74633 48704 -19589 130738 188099 135552 -13051 -3716 197771 26257
25893 26257 -30462 -136160 -219704 -136643 -26789 -183942 -123310 -100821 -10841 -48565 -155913
25882 -155913 -283087 -308192 -164395 -113063 -149306 -109733 -4128 -12911 -53352 -87744 -54948
25871 -54948 -43780 -163306 -99384 5528 -30344 -8543 137889 81383 -53914 -100666 -147426
25860 -147426 -212901 -136716 42321 123009 217695 249630 223007 57578 -19294 77072 231566
25849 231566 211671 121649 2753 -212906 -303686 -180254 -64334 -92545 -250035 -199410
25839 -199410 -339738 -393102 -180256 69074 216925 110555 106013 113953 58818 61556 6015
25828 6015 -27635 27812 -6898 -102099 69 -37429 -15361 93107 -62283 -212747 -134185
25817 -134185 202495 213824 148505 140182 219526 328732 314352 198452 157273 304985 376875
25806 376875 312466 196247 64033 149076 274806 166909 107881 224718 133710 -74324
25796 -74324 -197864 -199673 -161958 -146442 -113645 241634 177225 57213 166782 268471 365735
25785 365735 428796 420913 274394 161200 115289 137027 255150 231081 142450 -96970 -256826
25774 -256826 -256320 -199361 -173866 -156683 28924 95917 29470 37987 197456 281691 44054
25763 44054 -138975 -68146 -3685 -61989 10473 32431 -96254 -157171 27788 192662 219935
25752 219935 309580 274754 214444 115246 83811 49492 31441 20825 71975 76576 48115 -35777
25740 -35777 33548 101437 11300 101841 91955 11995 -61542 -127841 -233340 -255012 -229291 -140287
25728 -140287 -98767 17794 -18695 -16606 168103 99168 209187 192681 49654 50684 137495
25717 137495 130778 95550 136029 175239 133698 83438 -80358 16236 17579 -24942 -17869 -87359
25705 -87359 -130408 -195056 -215425 -361742 -395606 -144086 111338 144904 16379 31681 124666
25694 124666 253843 301556 293923 257782 131775 -24270 125891 150774 91963 -47761 72454
25683 72454 -1741 -147414 -270621 -316852 -134099 -40549 38392 81533 240484 178253 187808
25672 187808 120608 84799 96521 -77651 -346623 -411556 -317636 -234047 -276229 -258026 -44589
25661 -44589 18004 166157 218267 145316 68290 2004 36358 49727 37401 3605 -5901 35896
25649 35896 10764 10567 47898 25499 -19801 21555 -5906 9159 126200 139258 35248 13698
25637 13698 113571 -62934 -85574 40959 110268 99242 -86269 -432446 -412673 -233156 -77453
25626 -77453 -105149 -109129 -131472 -109839 -99020 100622 -47094 -134344 -173079 -147192 67585
25615 67585 153726 -34012 31894 25415 -41666 -93955 -218990 -379480 -133957 56215 -62891
25604 -62891 -240814 -404645 -358905 -200008 -162475 -253420 -39828 138631 169159 215561 56773
25593 56773 84719 117740 -12414 -23738 37654 -57872 -115520 -79931 106759 254479 306587
25582 306587 154610 -109867 10290 221959 172614 56201 157050 248922 223672 234118
25572 234118 214326 136025 52716 -191005 -431813 -271642 -102873 -103482 -57910 -119400 -65961
25561 -65961 -91672 -141573 -92011 -6551 51147 -27238 11710 -17175 -83303 -27436 80000
25550 80000 122473 9701 -83520 109497 135319 122644 73536 83107 134063 94108 30047
25539 30047 -48247 85168 105181 105813 103580 1974 33979 12042 -52182 -10072 -14681 -128394
25527 -128394 -48043 -98568 -127554 -57913 -205934 -63602 133789 37302 -14497 70514 95998
25516 95998 229856 118756 -45232 -217031 -223133 -272597 -310960 -100829 -36440 49293 98301
25505 98301 16723 -91410 -140431 -75803 -51186 -81492 -116698 -33107 -78102 -8675 113844
25494 113844 265029 237894 15343 -37511 -248947 -343108 -223324 -294320 -274933 -216117 -138727
25483 -138727 -174247 -138629 -91216 -191582 -291039 -394523 -426416 -208640 -92470 -216064
25473 -216064 -149028 -141476 53736 77935 -180133 -381545 -246325 -51170 37647 59352 44272
25462 44272 40255 -123487 -219441 -303797 -184685 -119183 27645 101210 8876 -127839 -178857
25451 -178857 -315178 -46809 190325 283516 279665 271151 432453 358603 14728 -99501 -61819
25440 -61819 -58922 -143086 -83416 -127228 -73393 4388 -40081 97966 -33840 -293708 -349566
25429 -349566 -213503 -242571 -354732 -266012 -162600 -143912 -181321 -236129 -128881 26527
25419 26527 -6839 -107392 -149102 -150198 -84661 -147715 -164546 -59998 -88720 -75634 -8760
25408 -8760 -50991 -6669 231210 193026 -91674 -198897 -154992 -111557 -88507 -78210 -221212
25397 -221212 -296152 -78999 50038 48833 306804 357169 207348 111508 20203 165150 224943
25386 224943 239301 171463 17882 -24667 75638 34931 10604 -34112 -89060 -222915 -304960
25375 -304960 -393126 -205930 -85595 -82314 -104169 -90184 -17567 -66262 -18091 -30751 -37782
25364 -37782 19546 29251 114570 -45145 -109550 11025 -1633 39941 -117309 -92667 -224563
25353 -224563 -366041 -350236 -130115 -83087 -175095 -201560 -93271 13369 77649 30132 -110091
25342 -110091 -94871 4569 -108902 -132380 -164383 -89538 14575 -32213 -211786 -253635 -175353
25331 -175353 -174468 -155712 -57592 -15160 20216 180861 208485 74651 -550 37481 50581
25320 50581 -36266 -41830 -5582 41132 83535 28356 -56715 -12271 -59099 -32280 69921 89118
25308 89118 -4071 -128460 -147875 -282280 -142944 96244 100377 -35808 -65348 -68664 -17531
25297 -17531 27417 -120604 -1521 70466 135105 192089 118472 97643 89058 37305 61909
25286 61909 101451 72355 109719 166167 179356 106013 -20843 -59386 -96671 -114714 -1841
25275 -1841 -4225 769 14291 -80760 -182554 -64870 11867 138902 200978 -85748 -295280
25264 -295280 -309677 -287319 -310812 -93874 54459 -82024 -280655 -339720 -488414 -451816
25254 -451816 -321285 -240015 -189682 -319482 -328784 -234999 -86691 -132921 -212851 -212636 -273870
25243 -273870 -273919 -269058 -310954 -238673 -128011 -147877 -20684 120681 180990 208030 730
25232 730 -134196 -150713 -18905 170721 224947 38008 -20614 58162 110683 -40910 -221251
25221 -221251 -263925 -250981 -188477 -195494 -89429 154005 186373 132288 161794 177265 140595
25210 140595 121586 40714 29087 43353 27454 44251 136144 71634 -69087 -26427 -119215
25199 -119215 -47264 125041 178176 239597 329910 256336 177947 85579 26130 1023 -4611
25188 -4611 -12249 -122752 -120612 -100586 -79973 -175419 -259352 -80900 70870 -12483 -252411
25177 -252411 -426142 -343389 -203429 -43593 26631 65486 145790 -15344 -26209 26052 204351
25166 204351 241393 199135 75184 -119681 -155230 -235056 -307563 -245413 -152848 -99627 -85412
25155 -85412 -80222 -82177 -119533 14952 13009 -19860 -82939 -251860 -143048 43030 45483 10996
25143 10996 65505 69549 144525 219621 287997 275876 184551 96738 -95263 -83920 18626
25132 18626 125536 228164 273831 92263 67836 13980 -89611 -76105 13757 33041 6328
25121 6328 131696 141892 30758 70095 -11212 -47847 -71057 -97431 -99397 -61356 69464
25110 69464 85418 -19585 -100932 -219369 -142029 25036 -99335 27430 125790 100396 108253
25099 108253 118927 303716 215213 -4023 38800 54957 60919 50687 226573 312769 249852
25088 249852 121503 126426 199429 143294 11490 -27030 133565 141731 -22674 -30766 20347
25077 20347 95954 86707 -154026 -344053 -344967 -167944 -35979 117963 16945 -17108 -180820
25066 -180820 -246503 -211896 -97272 26780 138269 158433 120991 61731 -52305 -97949 -72532
25055 -72532 -147452 -168062 -72447 -72149 -118466 -146011 -213597 -294666 -379323 -467402 -461067 -207151
25043 -207151 -56989 -104025 -101463 -81565 136173 217540 218176 300155 229946 145356 -20860
25032 -20860 -159822 -12058 85539 2042 -62936 -19962 129090 123113 151331 175543 -91238
25021 -91238 -239662 -230411 -151924 -317007 -365276 -169911 -93055 -86121 128747 195886 113137
25010 113137 -41901 -37475 -111926 -130989 -106078 -128548 -229370 -165250 -77406 -2294 41402
24999 41402 -10719 -81654 -147292 77131 221665 164853 35664 67770 167196 74960 100062
24988 100062 213264 151050 167219 94411 163205 311467 287865 412476 404491 407153 392277
24977 392277 144786 22010 23678 84440 182017 245647 236875 229298 367091 309023 234372
24966 234372 318846 313688 171067 -33528 7258 -124801 -218357 -347926 -389640 -408002 -316921
24955 -316921 -257369 -198750 -67283 -201735 -383748 -277559 -269495 -135432 -70498 -7704 75483
24944 75483 -25345 67344 217440 158435 191033 172274 147545 256647 301513 128654 272658
24933 272658 207232 68763 120775 235012 238427 217846 193668 117276 10126 -24543 -26843
24922 -26843 -53605 6618 171150 300295 368187 481599 535862 550754 452763 292735 -3588
24911 -3588 -49961 -71325 165167 243642 213151 267847 246335 116707 47358 7191 -74600
24900 -74600 -63431 -150273 -102717 -32375 -108128 -203182 101986 345993 367017 345985 155590
24889 155590 1976 29299 28827 83336 82139 26044 20032 -41679 -50745 75406 198550 240438
24877 240438 189307 267647 192871 -17698 66822 17362 -68708 -148365 -214910 -176137 -174234
24866 -174234 -62654 68874 -8714 96474 82370 48765 -7730 -64905 39017 64098 22673
24855 22673 -65817 -96356 9198 -78085 -241059 -122853 125990 141900 81779 128197 225579
24844 225579 101333 8145 -27913 -38907 41824 82537 46726 -48416 -65963 -57060 50875
24833 50875 89983 55440 -35435 -115652 -111575 -116985 -12835 10006 -2560 -80395 -190940 -86744
24821 -86744 31176 84656 -25955 -8980 -43969 -13424 7137 96074 161155 70171 -40945
24810 -40945 91586 207505 155725 -68388 -196818 -76060 -7454 -85048 -180866 -180181 -109019
24799 -109019 5835 73367 89456 21219 -28698 10611 95769 139887 71818 14742 -51052
24788 -51052 -129982 17833 116457 14549 77088 36833 45074 -74444 -162878 -279177 -268511
24777 -268511 -326267 -150644 -51776 -86970 -243756 -286539 -243203 -168408 -221271 -186476 -243675
24766 -243675 -164476 -117247 -92053 12693 20990 95306 -62884 -199357 -153649 -42282 -2490
24755 -2490 -58608 -82815 -154633 -105256 -212035 -192899 -87204 -20270 -82575 -186733 -173399
24744 -173399 -190976 -180075 -76529 -86034 -43309 -187489 -427651 -474405 -77982 49507 130935
24733 130935 167342 51184 88342 158000 59653 114294 123284 114104 9335 -97552 -83800
24722 -83800 3998 116615 249336 323214 296475 152597 -7836 -101297 -114358 -213223 -280942
24711 -280942 -33267 47089 72338 29836 17896 -34110 91432 172707 133700 195912 81555
24700 81555 85095 15488 165670 249633 -60619 -131988 -123726 -165432 -123774 -274117 -435198
24689 -435198 -417925 -179686 -141745 -29658 126588 -103751 -222636 -31558 58647 65231
24679 65231 5687 -78729 -18607 58044 -8759 15034 50659 -32851 -166158 -299727 -229317
24668 -229317 -218663 -109689 -99827 -171686 -110505 19696 -138877 -229629 -199792 -113972 -105048
24657 -105048 -67254 13946 206561 233965 58129 -106739 -185911 -194227 -153008 -167374 -96728
24646 -96728 -77468 -181299 -74628 23797 94970 38841 78489 80997 4583 90992 54681
24635 54681 -31031 -106219 17442 145524 32931 14035 -53662 -59702 -14531 73442 68703
24624 68703 -59070 -165107 -84267 484 76521 88501 44613 -42722 -62674 -66453 -192196
24613 -192196 -141407 -22254 -68080 -103205 -75248 85485 140776 14382 -3432 94017 38424
24602 38424 -79275 68981 76278 -148120 -140240 -125419 -155386 -142183 -48469 39378 -11264
24591 -11264 -76072 -83237 2711 120561 249014 249705 209544 181012 224493 137430 54159 -48694
24579 -48694 -78959 -77364 -2894 54353 52408 93019 -131582 -281742 -125304 83777 187948
24568 187948 74113 82257 -7325 -40454 91087 75896 90348 6705 -125721 -181932 -44682
24557 -44682 -72911 -158179 -184531 -43677 224905 24746 -98621 47558 62908 -57710
24547 -57710 29567 21345 -76729 -91108 -154593 -83600 -36958 -6432 3309 -54447 -99566 -111525
24535 -111525 -163690 -171423 -194110 -192897 -91289 90297 122385 140811 88997 -12737 -168811
24524 -168811 -86604 11891 -80475 -84095 -32493 -105317 -222379 -102531 -140074 -226952 -316868
24513 -316868 -139452 183046 184721 116327 -10678 59870 114361 204259 274057 312210 188813
24502 188813 29159 -101713 -134328 -131240 -111578 -89094 -91698 -70771 55882 10829 -15753
24491 -15753 -68444 -91909 -62022 -109728 -99849 -76352 -83037 61771 129499 21078 -53561 -104238
24479 -104238 -245993 -154870 -22389 17662 92389 11355 -30512 -158857 -177064 -136087 -156223
24468 -156223 -261711 -252935 -313448 -320948 -415464 -381864 -300232 -254252 -251441 -205704 -105806 -94803
24456 -94803 -24893 60391 156145 200939 235964 246094 250620 297834 252860 125672 82811 165490
24444 165490 200899 383055 327568 112768 -20058 -120034 -80098 -100375 -49261 -6996 -100553
24433 -100553 -87209 67699 145946 113758 -12454 -125995 -9227 -25775 -94845 -242914
24423 -242914 -264209 -181020 -160804 42754 286463 102775 173089 186780 90646 57352 -108942
24412 -108942 -48468 3308 159098 164819 88555 -53414 -128278 -70023 -32200 -196614 -196197
24401 -196197 -157355 -229689 -173245 -157334 -228627 -305522 -274623 -179998 -197373 -200305 2356
24390 2356 55315 -116452 -147531 -43198 44454 -2237 12247 -15081 -25420 25970 75552
24379 75552 72160 173225 188333 120925 17645 -33309 -107101 -136566 -113700 -203408 -141774
24368 -141774 -86734 29574 17230 41435 187001 -25084 -84538 2505 35598 -62724 19778
24357 19778 34847 34863 42978 45002 -6899 -76991 -182172 -220248 -217029 -248955 -229240 -217338 -137394
24344 -137394 -112768 -10685 219272 140711 7037 -61673 68551 122458 126351 271431 79504
24333 79504 -265 44798 41364 -80560 -83340 -118074 -54546 18600 29098 111173 227005 227266
24321 227266 193077 25069 86210 227647 235580 222161 248075 174693 48575 -83224 -35289
24310 -35289 51433 85749 78780 78399 -32933 -172082 -314774 -163916 -82094 -107961 -2626
24299 -2626 68161 108977 196179 161861 -35422 22028 145659 243824 153112 110197 126430
24288 126430 -52335 -32446 38849 169203 57156 114115 197986 271462 223675 178686 218356
24277 218356 184355 -18563 11311 71281 208903 241966 231253 78068 84964 163925 48890
24266 48890 -43791 49972 119822 15633 -169983 -116032 141548 127047 117983 83097 -120911
24255 -120911 -169614 -95964 -110368 -187111 -173062 -54108 87364 182515 95452 -22248 189397
24244 189397 360826 169008 118954 60506 59711 117069 157561 53309 -206825 -263451 -197172
24233 -197172 -190063 -255153 -335954 -219128 -102980 18117 -74694 -88687 -80216 -116306 -48512
24222 -48512 -100383 -155186 15097 108933 139047 157893 208749 94755 52741 199661 129470
24211 129470 -7790 -34436 -74295 162117 181914 -8303 -100286 -112315 -14599 -1141 -25921
24200 -25921 -54460 -26565 -105103 -112147 30220 161 14121 28945 -32140 12537 23480 -55557
24188 -55557 11712 100872 -9262 -49893 35647 88979 12893 5762 -64158 -78267 -157066 -188446
24176 -188446 -75948 -33669 124573 150683 43608 115976 134039 107928 -45306 36867 198242
24165 198242 67134 -32377 -82991 -46085 -3865 -84425 -113199 -129239 100470 155984 211889
24154 211889 84608 74370 100236 94882 217655 105859 20276 -11008 -5633 15824 140983
24143 140983 8978 -63623 -55953 103767 184551 147808 91137 149424 21347 -27451 -37452
24132 -37452 -12496 -117614 -348028 -283840 4464 -68428 -118124 -185705 -212543 -239295 -197527
24121 -197527 -107667 -57643 38883 51006 176544 166042 69346 -15822 -136773 -340766 -318868
24110 -318868 -290891 -278534 -262904 -36163 84733 137769 88866 -52567 -81775 -119924 -74771
24099 -74771 20383 -68981 -63274 -60551 -183582 -7808 65127 110890 54823 -46432 -71767
24088 -71767 -108215 -139633 -121798 -3266 156509 270833 451818 515289 486028 321856 66464
24077 66464 -106319 -254852 -293462 -275450 -118174 -17537 -15020 -193437 -305030 -219382 -173384
24066 -173384 -166457 -171051 -148321 18544 -57679 -205094 -363746 -361640 -188056 -215542 -309945
24055 -309945 -257891 -181603 -126825 -134162 -126356 -60695 47173 48174 -48390 52713 -6223 -25791
24043 -25791 119984 88312 -39933 -144401 -220279 -139069 -155293 -153608 -94687 -168410 -127023
24032 -127023 -61012 -39612 -193300 -134370 -20878 21831 -67715 81323 143889 97917 117469
24021 117469 180689 4555 14642 86260 142189 123289 -181295 -265604 -210861 -127079 -101041
24010 -101041 -125592 -127790 -38085 -18706 -159148 -129409 57431 200215 147992 -63065 -27061
23999 -27061 -2027 64615 207430 176080 67120 49555 36183 94050 239048 192908 90344
23988 90344 86617 -40217 -94494 21037 -13958 -203023 -240035 -176850 -77884 -22333 56883
23977 56883 -37744 -239982 -143642 11557 -20253 -94138 -227130 -257101 -245484 -227018 -181437
23966 -181437 -15400 27976 140600 41132 31555 47573 10720 152032 208218 156855 159781
23955 159781 16569 -67096 -254867 -263867 -47859 -12077 127606 180052 49292 -35028 -26316
23944 -26316 -486 3203 107729 61013 177787 32278 9275 118363 87960 182385 239202
23933 239202 232728 123789 -63945 36412 74169 -60918 148878 377231 271602 263294
23923 263294 430665 333925 333487 223265 -97499 -134514 -79096 95058 155948 21532 14126
23912 14126 158752 154354 190833 97008 170465 182084 109047 133934 125109 144414 160123 111193
23900 111193 198236 118372 78445 113918 77403 -10224 65512 90748 -81826 -77085 39006
23889 39006 64831 200425 84105 6456 -19257 16743 194637 205765 18825 1703 -8277
23878 -8277 -25555 101711 128052 145811 220448 197238 111279 20810 43494 -21253 -23516 32142
23866 32142 151212 191224 126042 -126242 -8023 101675 33775 48677 99728 60424 -119940
23855 -119940 11250 -23497 99497 51594 -30678 -127150 12760 110973 90533 26370 -7437
23844 -7437 -136217 -208540 -154555 -106535 -78658 8272 39367 79662 71796 25160 -96625 54690
23832 54690 139483 -20391 5833 19863 150492 116271 138731 129528 33484 112306 -31886
23821 -31886 -81366 -148431 -203719 -171866 -63934 29283 78154 72692 113563 45556 129670 264485
23809 264485 132169 20385 51711 -84863 11607 120992 8994 70389 103572 -22757
23799 -22757 -35339 -79857 -134723 -78009 -142772 -3140 30428 17941 -17455 51092 193536
23788 193536 259365 248216 241881 102992 106987 116583 176084 169363 344400 450247 405600 129438
23776 129438 -114033 -126040 -227876 -240189 -121054 -29500 -34953 -69259 -176844 -135621 -78603
23765 -78603 8107 -125639 -158334 -217084 -97244 -69408 30784 133481 172633 73357 -43247
23754 -43247 11735 159575 208061 160716 -284 -64452 -97534 -32080 -94615 -101331 -52873
23743 -52873 36327 -2060 -5983 76350 45515 -36845 -20148 28102 39240 87701 242382 250050
23731 250050 157920 181283 -20917 -153994 73665 277137 225055 248102 4987 -58408
23721 -58408 47348 -22401 -297277 -371446 -389906 -286093 -326261 -287399 -223906 -277428 -164053
23710 -164053 -2513 14204 -157389 -37915 61782 137602 51676 -205627 -253331 -67778
23700 -67778 -21896 73811 3972 -206724 -102935 -19734 139366 204633 268034 216780 118086
23689 118086 45761 73226 92634 -70332 -24186 17344 -212197 -283171 -156418 -23827 36442
23678 36442 6313 101515 55697 31240 -87684 -184737 -212117 -383961 -372051 -281424 -223156
23667 -223156 -74344 101398 24216 -179673 -240946 -130288 -99936 -36584 -8739 121315
23657 121315 83387 -22095 -2027 -47320 -68357 -56897 -66466 -19847 131985 151189 39038
23646 39038 -58606 -165787 -235461 -178602 -162617 -222974 -437196 -373035 -394891 -257683 -88307
23635 -88307 66621 124241 70309 112165 84519 43107 26816 -18561 -88800 -94486 -40826 444
23623 444 71389 166342 74790 -84637 -75187 36752 -118058 -117933 -45529 -88957 -144975 -10432
23611 -10432 124955 211239 158731 151046 137463 -35682 -15653 -63125 -156594 -107022 39978
23600 39978 45476 54567 181805 175016 177058 157419 52904 109468 111798 117237 93886 54716
23588 54716 68807 274082 296288 149590 188671 285802 247637 284391 259848 346586 482259
23577 482259 286995 69377 -27261 -71583 116723 109289 3572 180004 310646 337636
23567 337636 356788 201648 163285 98179 150637 259718 202627 93004 157220 203789 169759
23556 169759 120043 150100 214500 312103 311966 241829 514465 676209 511265 261247 246530
23545 246530 217481 184412 106492 19545 96462 271792 288408 118635 123311 177439 231829
23534 231829 42928 -53232 46311 83632 107902 136416 48059 -39323 62570 21328 -51805
23523 -51805 84735 296672 243863 252125 338367 213528 224515 207992 182023 116729 156652
23512 156652 169720 61501 41356 13196 65717 225166 85469 -11708 48072 -53239 83361
23501 83361 151525 96421 -6217 93100 198634 253563 195060 170120 285255 378690 336767
23490 336767 333082 250676 54619 -57178 -15407 36732 86099 124291 44259 117065 158511
23479 158511 173741 72562 -21733 -65348 24864 -73508 -133528 1381 73591 37808 -32813
23468 -32813 7261 21260 -13418 6926 114486 -43786 -180376 -76735 -11402 -10899 -212009
23457 -212009 -239337 -213152 -224546 -195340 -115464 -90806 -172381 -149193 -71256 -157261 -247529
23446 -247529 -10095 49074 -36650 -104008 -100326 -20589 3452 -39485 -142487 -367993 -419080
23435 -419080 -255713 -79956 -155000 -151505 -124339 -135737 -98643 -233623 -133482 -28826 -88743
23424 -88743 -152509 -257386 -161493 -34796 -10105 -73326 -38647 1809 -50274 -91835 -148812
23413 -148812 -62594 44455 -17053 225050 184534 167309 161521 161284 133482 138316 262388 139810
23401 139810 21136 43863 156906 215341 101352 -4674 -94489 -25202 -129043 -171789
23391 -171789 -121664 -82550 -116996 11525 -177264 -213019 -14099 15554 -272042 -346878 -51958
23380 -51958 176853 158514 126932 2902 -21103 -14032 -139243 -202156 14757 145336 40513
23369 40513 -104670 -237778 -33624 4487 -8133 6255 33549 37868 31118 85152 -85728
23358 -85728 -113499 -87108 49769 33238 15570 88823 34031 21677 77082 38439 34664 -97468
23346 -97468 -163098 -107638 -98572 -42530 64449 -3950 -223227 -190434 -93966 84122 115418
23335 115418 321326 234383 126608 47185 32469 160182 157014 -33509 -301219 -452615
23325 -452615 -489011 -425968 -396890 -268010 75464 111535 17940 -88546 -248472 -312275 -329113
23314 -329113 -306779 -183579 13307 121718 119920 128625 48093 101376 -85750 -95239 54190
23303 54190 121058 57268 37446 215994 198799 162255 -30027 -165920 -135201 -136068 -225707
23292 -225707 -354390 -459273 -401530 -327808 -252257 -275214 -224714 -263106 -249125 -167723 -53080
23281 -53080 -43297 57458 -21206 -96855 -92101 -80231 -45714 99191 25042 -94613 -125725
23270 -125725 -113170 -43028 116910 74932 -39903 -84632 -209638 -149535 -11473 -4034 -129481
23259 -129481 -168265 -192483 -107127 1861 37703 19746 -61913 -37697 123548 257007 126291
23248 126291 126127 252430 267026 97757 23094 61788 80031 181672 253263 320848 326225
23237 326225 230225 51498 172512 254465 310991 301926 351401 270191 322935 248560 199675
23226 199675 162731 157389 114966 269971 384862 385800 174977 37272 65852 99680 49738
23215 49738 60811 37286 23979 169189 -5952 -128639 -66250 151944 176466 83245 -24693
23204 -24693 29636 18482 -23545 -89392 -98938 -67060 -133313 -137302 -28750 -76996 -158798 -215369
23192 -215369 -314275 -291499 -168037 -11547 -41221 -103874 19261 -60965 -142285 -48645 83517
23181 83517 75829 -30716 -23819 83175 186375 132534 192867 158530 152699 191565 174919 220857
23169 220857 150053 -78118 -122346 -91057 -66074 100765 157814 -69957 -28465 32350 102982
23158 102982 128000 90397 -10641 -136771 -203838 -249195 -223154 -111231 -86507 -157156 -172498
23147 -172498 -210675 -279961 -265623 -134034 -46951 -1045 66848 119101 50947 96033 116132
23136 116132 171780 88061 25434 56270 236468 89425 9977 -39149 -47066 -107689 -34961
23125 -34961 16886 -111978 -20897 -4283 129688 83631 20831 71424 91991 -24963 -155809
23114 -155809 -324489 -353886 -260637 -148777 -123815 -41413 -56530 -42901 -121935 -234850 -234765
23103 -234765 -194122 -133262 -107110 -183584 17316 273359 514633 587077 383629 187195
23093 187195 123452 57237 55271 36501 244657 189255 87200 -31248 41395 113943 128722
23082 128722 142138 127405 11161 42321 57095 -1709 7171 -14086 68840 -32208 16204
23071 16204 96620 -39088 -41698 -10229 20699 -180596 -300618 -246573 -214323 -234007 -217025
23060 -217025 -292466 -344953 -327266 -198789 -159677 -316949 -296780 -163310 -234105 -323353 -179668
23049 -179668 -90274 -4814 -55839 -14750 -45569 -207529 -130906 -112508 -385570 -502972 -352614
23038 -352614 -186009 -150601 -202485 -103964 -30579 -80561 -21496 25907 108160 182788 239578
23027 239578 355013 226244 62926 19827 132069 65549 58743 15637 -64238 -124877 -72263
23016 -72263 58800 220322 197320 130755 107650 89416 107551 -42877 -74083 23136 33962
23005 33962 -24345 -111943 -154455 -50874 44763 -70354 -143649 -82801 -2219 31543 230844
22994 230844 130399 225087 347611 326812 128114 129661 284530 259147 179278 190854 108675
22983 108675 -28928 -89125 -131431 -181127 -276372 -190696 -64222 15261 71774 160492 235286
22972 235286 140655 30347 -17128 -43187 10498 54823 95951 163714 113170 60736 4367
22961 4367 -79424 -40524 -83777 -103785 -20208 41494 11162 201961 366756 233291 55723
22950 55723 82285 76569 57106 33554 -77022 -168622 -228718 -208220 -286936 -205653 -53274
22939 -53274 54728 -89883 -170040 -161419 -120553 -239498 -289245 -117397 98206 120486 -13401
22928 -13401 -28698 -17827 -41048 43324 -2872 90171 101716 49968 109822 34525 -95718
22917 -95718 -36145 -132252 3173 151502 224180 202883 34739 -38660 -13888 20343 -15911
22906 -15911 67295 16088 102031 12953 -73898 -94618 -132828 -135136 88712 209957 15943
22895 15943 -238096 -210209 -101167 36138 173906 167285 35843 -34839 -123911 -38317 28779
22884 28779 115656 -26381 -135804 21536 101904 86119 -132537 -118636 -80355 -27749 168948
22873 168948 185434 148539 63551 -167638 -122102 30201 154707 233512 280780 159829 -16375
22862 -16375 -125211 -53830 25272 83177 -65842 -172572 -123445 -51898 -8725 25496 50342
22851 50342 -25126 59024 -76201 -210211 -71406 -102550 -129964 -52674 141786 96444 -43959
22840 -43959 -156158 -213244 -12227 122466 -29326 -123161 -83562 51719 106868 -13148
22830 -13148 -72239 -53545 -126503 -94883 64986 128459 102492 20977 138595 87700 -9413
22819 -9413 -36464 -168592 -2869 103204 7262 8145 101479 173216 132088 64065 25613 -136810
22807 -136810 -207679 -177807 -59666 116955 107014 178439 265659 151956 -94211 -90430 -31867
22796 -31867 -46815 30339 -7638 -7829 81854 147856 132462 -10604 -39548 -72276 -140592 -108436
22784 -108436 -65893 254540 270820 150928 133037 14587 -59538 -115213 -158070 -198534 -172521
22773 -172521 -21281 -129531 -203814 -108509 -194631 -194450 -15776 27471 44024 85478 -32571
22762 -32571 -274978 -164300 -5624 -11904 -76632 -117286 -16316 -84413 -7578 -48956 38144
22751 38144 168263 171311 169409 166261 29133 -169498 -3190 108298 54224 97013 -20033
22740 -20033 -149070 -217463 -133266 -113002 -131238 -143384 -81498 -19445 134085 151796 75099
22729 75099 93849 50815 55568 -67678 -150255 -113171 -2044 -2889 23786 -27418 3837 39212
22717 39212 -105114 -168764 -129992 -208594 -104166 -65451 -42473 -123797 13928 -35553 2386
22706 2386 74175 48753 -42575 -69581 -81141 -68551 -55628 12019 101811 85090 -22366 -171941
22694 -171941 -40646 91259 64843 35613 28811 64784 14085 13491 86290 217872 277859
22683 277859 279256 105493 123356 248404 342718 244299 282721 207935 201651 189097 250190
22672 250190 181144 162787 28929 122367 221849 161650 125095 56287 -48337 33723 132768
22661 132768 114698 25334 38709 -59458 120198 264597 -10174 -163331 -100722 29801
22651 29801 131063 -32406 -31528 9713 499 89289 252313 294479 271310 338408 268490 350575
22639 350575 411815 330385 174004 -6888 -47848 156394 119468 31102 204455 155086 27400
22628 27400 44288 81875 53073 -25143 26847 136498 160869 30251 -20399 -168989 -267936
22617 -267936 -31360 -12513 -113726 -218834 -180846 -72704 -74432 -60588 -54838 -76063 -37782
22606 -37782 38635 56046 52666 55170 -40303 -13160 65395 313197 290307 16114 15541 -62191
22594 -62191 -189018 -192482 -290354 -292329 -157519 -126838 -95011 -93622 -167995 -128012 -95058 -64996
22582 -64996 -80996 38811 119045 10571 -162511 -108175 -331542 -246247 7590 73467 -100329
22571 -100329 -217304 -30629 94505 78222 -10052 -246213 -157624 -88055 33133 36300 65743
22560 65743 232231 279487 3993 -87260 -197646 -293997 -203899 -141636 -26486 -66444 -59231
22549 -59231 6557 98998 -25147 20357 102499 -179906 -314596 -161275 -155797 -157840 -102309
22538 -102309 -63968 -106833 2665 291801 333391 259183 155046 214864 103343 181598 191355
22527 191355 110751 112305 73098 -6840 55099 38539 -115633 43660 157975 146010 36248
22516 36248 -45018 26408 -11477 -40466 -44565 -22294 55386 17889 -72831 -137746 -172799 -28334
22504 -28334 70372 126539 114590 49204 -2792 -36740 168417 208493 249217 186316 22552
22493 22552 -168093 -115409 -78791 -32511 49033 -35702 -217166 -255687 -263659 -52136 83203
22482 83203 114474 118159 153811 115001 -61023 -195114 -146467 -149031 -208329 -331795 -392279
22471 -392279 -391711 -235064 -224246 -370714 -503844 -447362 -385240 -302268 -339395 -261933 -132866
22460 -132866 -36854 21887 97621 27458 -4112 -52829 -3490 -3180 -5000 -145819 -85924 -30534
22448 -30534 120316 60592 50181 24497 67741 -40234 -290167 -210279 -176502 -103340 -98383
22437 -98383 -166514 -225229 -220154 -84686 -36199 -162147 -99249 -91957 -72046 34465 44137 25262
22425 25262 -41731 -100420 84503 80781 118617 -72628 -114857 171839 303696 282107 132541
22414 132541 -16476 -74714 -169585 -112137 -78689 -57519 4769 115904 132249 257121 361520
22403 361520 399965 326343 128779 133559 109689 146661 222110 184786 69176 -69768 -111797
22392 -111797 -92743 -161051 -123727 -131332 -136028 -15037 -182933 -126779 -3767 -85533 -22362
22381 -22362 8377 -73419 1988 -37825 -216411 -195891 -69619 65869 -130650 -218595 -230224
22370 -230224 -204740 -143305 -79772 -168049 -27654 -68793 -12530 -207619 -260549 -138663 -100045
22359 -100045 127303 131819 132466 120150 32268 79619 95178 98884 39038 -104166 -158991 -142259
22347 -142259 -202254 -123733 -80736 -59180 -199691 -321233 -345594 -344124 -240974 -304985 -230503
22336 -230503 -238101 -246030 -230668 -387095 -333268 -214658 -409462 -556695 -251322 -59266 -33810
22325 -33810 -59620 -76744 -139123 -234597 -243267 -255655 -186761 -198100 -51346 -43681 -166440 -92776
22313 -92776 -24000 -111542 -101786 -69052 -214815 -141655 -259685 -497358 -442611 -360792 -241306
22302 -241306 -104878 -72205 131821 299273 164448 -47629 1961 26704 26646 71545 -58402
22291 -58402 -108543 -133585 -121496 94595 -52355 -107921 -86335 -14445 24539 177364 166226
22280 166226 -11407 -203941 -177981 -87517 -94296 -94989 -74689 -79131 -170438 -80707 -59145 -13102
22268 -13102 -11857 21181 112139 92593 171680 180279 93968 -98715 -129325 30659 -2144 66749
22256 66749 115432 -56601 -99541 -70078 -26502 -141066 -17264 -41431 -35677 187820 317074
22245 317074 277487 172414 34358 104212 155111 140728 126394 148689 188798 61896 8202
22234 8202 85430 140983 44032 -52096 -157582 -179598 -146238 -35873 129154 98346 -3521
22223 -3521 2723 132012 142146 -52148 -72552 -54180 -261728 -208593 -194700 -74402 148811
22212 148811 231615 235245 272756 63150 -115184 -217961 -207249 -176333 -168723 -272235 -320351
22201 -320351 -330861 -296619 -55890 100266 98159 48585 19284 -48678 -142412 -334504 -270469
22190 -270469 -113101 -36754 -44973 -93215 -156813 -121276 -87112 3838 49507 151911 204939
22179 204939 15504 -111402 -179239 -202353 -258853 -157655 -16871 6684 8062 76787 -91997
22168 -91997 -243252 -186542 -181530 -140640 -66159 -92734 -192718 -209470 -101675 132858 57733
22157 57733 39467 13594 -20106 -28053 -82440 -252850 -228533 -134988 -53764 49636 -21973
22146 -21973 -166138 -166758 -180563 -186147 -157256 103144 275259 108123 -17640 -71712 -248339
22135 -248339 -219833 -234640 -323898 -201027 -137003 -197782 -210907 -55537 1810 -12411 -23112
22124 -23112 -131264 -204825 -135528 28843 113327 108157 36505 82375 -80504 -120858 -81818
22113 -81818 -18738 24695 -53284 89821 90510 65139 -3053 186457 120819 -200128 -291075
22102 -291075 -198466 -69416 54250 42521 34516 -24721 -42276 108508 143136 91605 233063
22091 233063 178365 178103 220753 169931 3432 -11013 -17465 115738 95609 58672 -64656
22080 -64656 108171 85374 -78589 -241865 -256683 -250627 -158264 -25865 78238 70968 164200
22069 164200 175938 62964 -3004 122219 320120 259136 160646 139857 237078 428201 428255
22058 428255 332249 174853 130691 -22471 -1524 23628 5571 53747 -57975 -259070 -237095
22047 -237095 -215146 -137561 -121481 -239194 -307488 -293310 -235648 -289772 -231971 -27926 -42492
22036 -42492 -195868 -201880 -119604 4622 85662 11317 24303 58275 75591 154638 276720
22025 276720 291995 291457 172071 93343 -39655 -226145 -276522 -160635 41676 273615 180395
22014 180395 -43015 28396 139750 137647 43261 -123360 -88429 14752 58921 23713 86929
22003 86929 35216 -36757 108412 118668 56524 41428 -51654 84371 67232 3768 -49649
21992 -49649 61936 -62851 -117771 71804 140800 76134 -105155 -84277 -23744 -157240 -193188
21981 -193188 -273734 -310406 -113088 -88295 -52772 76399 113508 103818 245141 210204 200920
21970 200920 139766 170451 186255 107866 -26060 -112015 -106581 -101276 -174796 -122475 -110663 -131384
21958 -131384 -113759 -50072 54836 -79181 -62885 -91922 -60460 -97540 -119866 38016 71914
21947 71914 55053 -160569 -338620 -250278 -123969 -276398 -289052 -133561 -237152 -221694
21937 -221694 -79502 47732 102906 -30800 -122028 -122385 -177483 -196421 -280128 -409430 -328985
21926 -328985 -196358 -56316 130301 3617 50473 -34992 -74582 8677 55576 138049 22704
21915 22704 23588 85928 46377 131494 217510 256688 167625 105331 61268 164676 282433 291030
21903 291030 108172 93818 -83107 -124788 -81693 75829 -9517 -168563 -269081 -315318
21893 -315318 -256476 -94896 -15276 -98005 -195641 -50203 133257 197200 26303 -7966 -227916
21882 -227916 -207765 16936 47035 -141255 5876 75891 36726 -77418 -147798 -52735 65408
21871 65408 176449 117564 110855 83589 191530 68757 -39 131940 171554 218445 181671
21860 181671 187226 158841 129057 -54016 -76470 10523 56721 -10878 -265186 -239001 -181108
21849 -181108 -42835 -61547 -72572 3143 27318 88413 111070 113554 -572 -71329 -76665
21838 -76665 -121655 -85658 60170 -37749 90677 69912 9654 -7272 -147738 -227415 -65747
21827 -65747 -59461 -50264 76276 10468 56074 124839 674 155639 241048 222678 66374
21816 66374 -66403 -66612 -112252 -161547 -15073 -58072 -114061 -23034 55872 -26561 -152254
21805 -152254 -69696 -74509 -214822 -254182 -86304 27549 21592 32548 117053 165928 119137
21794 119137 -25837 -91548 -152615 -132020 -69327 -30385 -114411 -172277 -174570 -50364 -127330
21783 -127330 -114623 38196 201258 237313 168630 98227 227769 377903 261573 -46803
21773 -46803 -78421 -28239 -61473 10865 89754 188712 204118 194984 118127 -89529 -188267 -92083
21761 -92083 -19404 50556 -71713 -47803 47283 52333 -35689 -167436 -216255 -95251 -135281
21750 -135281 -118863 -25671 58466 30644 -114066 -157596 -266199 -323916 -314173 -56417 -60406
21739 -60406 -237377 -220035 -31634 -55755 -71361 15437 -11419 5083 48120 -37897 -93190
21728 -93190 -87633 -78769 -52882 199526 299809 240577 19773 4788 70576 41209 29010
21717 29010 38294 -66074 -115563 -63434 -34310 -171979 -190705 -33674 60993 85229 126255
21706 126255 198549 141172 222596 117744 61553 97831 33544 -88301 -175108 -150483 -69044
21695 -69044 -96126 -49003 76873 15414 23072 158459 190177 148236 27188 -15423 95738
21684 95738 27270 -46534 -178505 -150819 -68096 20963 141260 121424 83441 116071 45854
21673 45854 -31661 -64435 -48877 -55067 -128987 -76330 -160641 -199104 -171392 -31196 60025 70890
21661 70890 37099 108106 53892 19760 -18877 -134788 -241299 -239169 -395617 -316731 -195181
21650 -195181 -28682 133071 209055 298853 190967 -22753 -39656 -65074 7277 114393
21640 114393 41275 21495 128972 95967 -111215 -174834 -52910 53820 56393 41 -60201
21629 -60201 45756 79454 56646 97814 63174 66875 137092 106951 153215 71751 15536 159656
21617 159656 236186 130160 -132336 -207136 -243928 -156226 -33647 132174 275178 244293
21607 244293 36438 -157786 -202547 4714 136220 148800 90972 -33373 22645 -39909
21597 -39909 -121737 23980 18199 -47275 -135893 999 2229 -95222 35255 19794 -35431
21586 -35431 -33707 -108781 -265300 -250697 -236725 -228912 -216669 -58667 39566 -79798 -155449
21575 -155449 -98495 12731 214914 217941 76573 749 17833 -78639 -25492 200979 184564
21564 184564 162301 227459 360131 402071 281470 144850 129463 22874 119821 172474 80475
21553 80475 -42655 122454 176261 131622 80598 163617 -31925 -53898 117989 133607 34734
21542 34734 21130 -7231 -53632 43635 91374 103133 1301 187024 146442 143660 150715 -104146
21530 -104146 -256703 -198477 -168506 -201386 -53281 177245 66662 -9226 121610 91273
21520 91273 -28656 -2143 -90092 -86197 -36175 -10426 -87291 -172188 -306261 -160380 -42017
21509 -42017 68811 310017 410263 276424 152386 120413 163393 -85818 -75208 -109228
21499 -109228 -209832 -237051 -185142 -349700 -393430 -204097 -104217 -105581 -125193 -105889 13394
21488 13394 64584 -181407 -306606 -471558 -294675 -29020 61344 -18519 -111767 -104162 -101892
21477 -101892 4558 -7727 71422 120752 56245 -26400 -123597 -129581 111751 256935 242735
21466 242735 272409 112341 46525 -132366 -134250 -118762 -56201 -18000 -93490 -126170 -82669
21455 -82669 -101706 -36269 -47598 -39468 -32536 -206451 -193506 -30701 109441 55571 -2720
21444 -2720 -22414 -128733 -36117 42495 87172 144665 171215 156812 -101852 -126681 2040
21433 2040 187228 250346 206744 280380 82339 -102206 -30948 96234 164388 72917 -31676
21422 -31676 21648 48942 70993 141530 38330 -93910 -126162 -106020 -121248 -137791 -40727
21411 -40727 53674 -11884 -38007 24088 66373 75976 108674 163406 103546 211231 282597 242915
21399 242915 19323 -135238 -87799 39186 32912 108651 174007 207311 25925 -40521 41991
21388 41991 38942 57661 175622 184795 187556 23861 19448 81655 154878 88609 125923 145401
21376 145401 189332 319701 363306 245471 14631 -156765 -125134 -7518 39323 -1912
21366 -1912 -140496 -196116 -176850 -214642 -221678 -107616 -177525 -89853 -44651 -107419 55614
21355 55614 15195 26611 9383 111124 137584 -8949 -28163 81194 264242 247769 -52565
21344 -52565 -143477 -90079 -184288 -152119 -91792 -22891 17671 -4488 -22246 -10253 -89707 -113658
21332 -113658 -128857 -241595 -266249 -189223 -154728 -79904 -69584 -90156 -3898 145049 338010
21321 338010 283598 209429 143190 -75813 -45271 37097 -11887 155209 203550 248741 194030
21310 194030 163230 68734 465 8112 144050 13709 -29714 -2553 65229 32867 -128568
21299 -128568 -100963 -67395 -163014 -215312 -170781 -73644 74217 65967 76227 -61879 -153491
21288 -153491 -150540 -247129 -219397 -142237 -59474 -34507 40611 11128 -67862 -185202 -198130
21277 -198130 -218592 -277892 -201538 -139723 48414 110656 7014 10159 -92022 -110905 -163800
21266 -163800 -124651 -107128 61039 54361 -35498 -101734 -128343 -16230 8376 75634 38191
21255 38191 -57031 106916 184188 148459 108241 -8167 -180266 -241795 -289030 -269243 -156947
21244 -156947 -241989 -109340 -60488 42811 150987 257774 197919 184723 239904 217789 178888
21233 178888 78352 -121500 -230301 -292915 -103462 67184 109568 147140 123217 -28869
21223 -28869 -251859 -193587 -22432 44542 126323 150644 -1711 -111504 -190231 -19059 92103
21212 92103 175156 57801 -71904 -70112 -2347 59342 -32053 -30613 51411 145599 239269 356740
21200 356740 269449 159711 112296 102810 20880 -58619 -201414 -203496 -215277 -120920 -47132
21189 -47132 -52197 -13314 42134 109726 54991 123137 209421 200240 239236 147661 174476 226170
21177 226170 145258 43648 25010 68072 138374 227232 310693 425662 463432 345947 223760
21166 223760 4451 96676 62884 88609 -17488 -126519 39276 -17740 7799 226081
21156 226081 197641 64443 47838 38623 6033 186578 138964 69163 57254 5629 34681
21145 34681 -31466 -117117 14570 146545 91149 70193 185031 163713 103464 26851 -80517
21134 -80517 -20257 131082 105951 193907 214071 160650 200407 299929 261496 37988 14099
21123 14099 -62989 -148725 -319656 -233061 -24251 -57006 -321223 -412182 -363532 -316412 -153033
21112 -153033 10327 126242 165036 214819 249931 168930 83794 -40830 -68132 -35776 106099
21101 106099 159518 99299 33722 28495 -142170 -155736 -179288 -258060 -232501 -13876 170497
21090 170497 29083 -67434 43456 110552 86890 -6957 26845 104289 -27059 -135008 -206139
21079 -206139 -341876 -302701 -115373 -80870 -70140 -69041 -142022 -236960 -322909 -314597 -233331
21068 -233331 -209658 -358905 -501084 -473944 -400599 -220503 -82390 -140288 -30991 -128682
21058 -128682 -104296 -141953 -172996 -148156 -234872 -204317 -144815 -182824 -54180 -35846 -19823
21047 -19823 71278 64115 -14792 -117839 -141081 -35483 114096 124786 285290 95676 -49697
21036 -49697 -42268 -112169 -224676 -169201 -208150 -361186 -342675 -256096 -242945 -313077 -209070
21025 -209070 -150055 -146499 -435878 -458470 -171985 -27923 3880 -44819 -75407 -92044 48789
21014 48789 139465 43869 111486 181306 191576 119719 79779 161380 89345 47223 153773
21003 153773 83150 -31489 -21333 31799 146004 106852 -20534 -125519 -76840 -160773 -114616
20992 -114616 -80869 -40922 -44630 -95313 -164137 -350892 -268195 -152824 20317 205293 215765
20981 215765 87903 -8879 -15764 71766 131064 -44784 -95140 -132226 -209887 -77375 61495
20970 61495 265858 316937 230828 83501 -107272 -200122 -167028 -145726 -124070 -70552 -62326
20959 -62326 -77085 -50919 -25376 -8582 -116097 -62420 -71904 -202806 -84589 92348 192791
20948 192791 59850 -45679 -162266 -18823 49390 -76421 10968 172378 84805 -67583
20938 -67583 -17494 -14466 -8865 -19679 22641 -118465 -48891 172634 81359 14317 123225
20927 123225 60182 -7416 671 127401 205755 45513 -22012 13564 -81928 -224644 -180821
20916 -180821 -93220 -62434 -50177 -245923 -358520 -340701 -257578 -159741 -95094 -44934 -68752
20905 -68752 -67802 -106828 -115051 -32479 -28852 -57421 -62804 92285 96758 -55156 -66477 99950
20893 99950 -21529 116816 269196 239940 129923 40072 97207 44807 -67020 -33082 -90732
20882 -90732 48276 297045 485902 256587 138298 108671 -111895 -237522 -193492 -248672
20872 -248672 -338851 -286677 -240425 -162382 -235025 -150681 -221766 -175043 -258056 -211879 -213312 -134992
20860 -134992 -48509 -134887 -188503 -194187 -123816 13454 -26509 -91563 -118183 -238785 -91662
20849 -91662 233774 197327 -86459 -88138 -78512 99534 178828 251714 122731 64059 40113
20838 40113 83505 -97532 -127495 -99570 -850 -108045 -23056 242275 208704 174284 111019
20827 111019 49543 -46812 -36878 -65240 87038 78292 40341 -40577 -837 -92096 -245686
20816 -245686 -187179 -38176 21947 -130489 -221374 -227703 -100372 -161219 -39193 -112709 -280791
20805 -280791 -76151 11365 -15660 83714 132835 72210 114702 31975 -24674 -68840 -70916
20794 -70916 6933 96440 89160 42364 186099 247446 156322 -27247 -57428 36802 90304
20783 90304 -2864 55228 65410 -102025 -90770 -73191 -12072 191643 186420 98217 98597 259668
20771 259668 234398 143530 80336 90765 97754 65882 35764 4352 -164278 -82142 2296
20760 2296 -99457 -59007 64685 -99798 -62870 -115622 -128991 -83962 96318 193877 -49808
20749 -49808 -323329 -258941 -35852 -57431 -143608 -15062 -69282 -29551 -23958 -148844 -151845
20738 -151845 -153702 -62275 -114936 -170554 -247359 -274521 -236306 -87504 110092 59018 -45199
20727 -45199 26481 -17533 87327 95660 -8775 -21545 -124099 -207780 -135479 -59167 -100899
20716 -100899 -129085 -240682 -223376 -76427 -31657 30739 100930 -160600 -338728 -215622
20706 -215622 -36444 -108887 -196974 -87164 50019 189046 111548 224146 285239 254254
20696 254254 155975 91363 -87972 -49078 175921 252980 79080 127669 124083 254925 299368
20685 299368 219675 156047 105210 83994 186711 232740 251764 244692 247607 213657 178611 27907
20673 27907 21134 69174 5127 -32374 114897 191103 165013 163205 91242 -146025 -277810
20662 -277810 -299764 -335968 -210182 108296 213849 46245 35785 -29784 -13901 -36804 -215516
20651 -215516 -187309 -153174 -60830 48409 214995 310587 168900 45712 21699 46440 42987
20640 42987 47335 73301 -33013 -58904 -94800 -147225 -151298 -130870 -188895 -214669 -70999 -108383
20628 -108383 -69270 -76455 -100700 -75774 270475 288444 81595 -48966 10162 118230 55305
20617 55305 26381 135401 186527 128664 -18447 71908 79613 -27296 -185583 -296004 -241980
20606 -241980 -197520 -210611 -21860 114078 31612 -31687 -85438 -81863 113098 193393 146184
20595 146184 151221 46437 -167886 -215885 26242 -31959 -121046 -175586 -236732 -155473 -142260
20584 -142260 -160364 -48670 72704 224402 412280 425666 328157 254921 236246 10901
20574 10901 1887 116842 236613 231519 170024 113491 -9366 -17952 77631 -34180 -35758 83815
20562 83815 117839 19827 -22256 -50096 -31595 104276 59450 -135975 -283459 -216965 -299986
20551 -299986 -273602 -262622 -139178 -23324 50210 130879 39528 -46153 -151390 -106187 -121
20540 -121 -147920 -31164 41821 -65678 -153517 -96149 -134044 -215589 -38660 -16367 -42236
20529 -42236 49818 87303 142192 235426 164765 75989 -65789 -81265 -18562 92938 244365
20518 244365 229573 43834 93478 237082 291341 311683 220407 58941 75206 165557 74314
20507 74314 31899 16198 10072 -38645 19146 86640 2895 -12654 -83545 -18186 245517 77188
20495 77188 60885 119152 268 77188 230689 147710 145977 220716 -7853 -140071 107036
20484 107036 74856 -134921 -283683 -193960 -53935 24329 -85464 -57149 -172296 -131021
20474 -131021 -220450 -234328 -160147 -46226 73237 111339 79996 -23414 -145390 -127191 -177251
20463 -177251 -232194 -164894 -200442 -173446 -76616 23168 -35562 -8897 -79865 -155327 -182495
20452 -182495 -186150 -144156 -129060 -51642 8724 -11413 4358 -66827 -153269 -78894 -62082 -77111
20440 -77111 -182446 -121383 -83654 37897 53571 90471 72772 -146003 -238293 -101254 -88108
20429 -88108 -158065 -171193 -254389 -266686 -61892 50783 83880 57460 96740 86734 142399
20418 142399 88413 186854 271043 198220 83000 -46235 -108370 -89402 92424 164577 347865
20407 347865 222105 88342 -60385 -96079 -67804 -186500 -56297 183410 162673 84321
20397 84321 105877 10136 -128410 14347 48452 -98599 -227376 -208221 -190511 -21865 -49578
20386 -49578 2425 214265 268002 213800 70908 121375 31989 104541 107146 -69410 -126629
20375 -126629 -31032 -17477 25702 49196 -30721 12134 54662 -42815 -114180 -20847 -85184
20364 -85184 -37125 11113 79927 37671 -50121 71232 58253 -77666 -89188 -65249 109425
20353 109425 284396 323480 201271 84280 98678 116485 25939 204997 332855 307247
20343 307247 115631 41397 160386 349013 370095 365678 401816 358721 216522 218649 116233
20332 116233 134494 70886 19268 91953 22434 -10074 -23454 140500 308781 99542 -105758
20321 -105758 -16320 1574 41604 71324 75090 49791 -37749 -149861 -175984 -225302 -114306
20310 -114306 -95712 -59902 -206652 -109850 -208964 -383486 -344480 -140779 7940 -15001 -3213
20299 -3213 -147690 -224951 -187420 -115866 -71561 17677 -150023 -145654 -119373 -236242 -264719
20288 -264719 -134665 -170341 -190382 -52108 -69917 -209920 -216262 -214991 -270968 -322613 -137166
20277 -137166 -187508 -198878 -109624 -25042 6685 -80252 -259139 -237983 -86868 26720 -141194
20266 -141194 -227632 -111518 -165881 -257519 -277300 -297082 -117795 107512 34178 54622 84906
20255 84906 -62067 46062 215034 155797 -8995 -33990 175327 420407 298268 119813
20245 119813 64687 54386 45952 25903 81410 611 30395 114371 42296 71862 31621 -192825
20233 -192825 -238146 -204665 -141923 -26758 144456 157149 63163 52343 284714 272254 65787
20222 65787 -107196 -179132 -194973 -177934 -188516 -300276 -351386 -307345 -101784 20855 -37153
20211 -37153 91089 132846 97580 147700 163528 106182 45650 -126168 -141862 -75015 -53311
20200 -53311 -19719 -3762 -36069 -116675 -17409 66406 80256 -33624 60 -17229 -99647
20189 -99647 -57311 -4169 61504 -133846 -78370 16819 118300 124091 118158 154325 105165 116086
20177 116086 298958 290286 183801 226613 235644 229898 -18517 -95165 -8854 144024 140147
20166 140147 32463 -138290 -212073 -43841 101354 -17567 -67130 -17530 10359 -130911
20156 -130911 -12453 -30275 1205 -130246 -232081 -267989 -216852 -22271 -39404 12626 -72882
20145 -72882 54265 100154 57482 114624 69663 88866 187106 51324 -13592 -81113 -84078
20134 -84078 -29262 124859 182275 197576 133588 290488 306002 319644 303895 276440 187358
20123 187358 57483 49830 218295 204829 108277 -88120 -93006 -8417 50796 84018 50585
20112 50585 66341 75606 89595 218136 224811 51578 199695 255013 183572 329607 298649
20101 298649 306288 289214 173216 41180 162227 111876 44643 33838 50473 -37080 -107444
20090 -107444 -63992 53873 75551 -111410 -177749 101307 157440 3326 100006 181516 -25395
20079 -25395 -125123 -179908 -163612 -193560 -34542 -22315 -63194 -106927 -197230 -198332 -89264
20068 -89264 2085 -31722 75580 98526 137739 37047 25256 66969 -182187 -342786 -201195
20057 -201195 -93417 -195633 -330561 -285164 -147646 -54351 -36108 -14833 -34588 84970
20047 84970 97844 46769 85720 230457 366399 295163 191167 64923 -118742 -249252
20037 -249252 -114651 59713 103252 -4349 -148942 -266922 -441897 -406146 -185279 -79248
20027 -79248 -50446 -62500 -50687 -135716 -30344 -18338 107805 168703 124226 105829 14901
20016 14901 57782 -32942 11482 -35777 -36460 -804 -127243 -230131 -287556 -319007 -301713 -357735
20004 -357735 -147082 -14457 -48865 -88511 56700 176801 148397 101636 98372 154771 100412
19993 100412 -19389 -73995 -77900 -101421 33273 -8821 -104854 158843 427933 443438 404819
19982 404819 496752 449603 338171 193224 72730 -105192 -69675 38984 -44433 -73295
19972 -73295 69293 98070 52938 104640 113624 125546 54694 159740 257526 230265 93959
19961 93959 -35060 -97843 55007 -28294 11479 215089 214685 32970 701 -64463 -104096
19950 -104096 -26995 -54564 -93881 -3644 208247 234522 211583 267975 371095 214674 5932
19939 5932 -109312 -237534 -295046 -363778 -202562 -138335 -205537 -322596 -317982 -281410 -150604
19928 -150604 -267795 -137814 182128 169958 71070 62597 44247 -54736 -94779 11954 206215
19917 206215 89382 -20104 -173804 -381565 -523971 -497519 -272839 -130019 -116138 -180012
19907 -180012 -196464 -80736 -152800 -245419 -293649 -89462 7596 -14004 41360 -14652 -28594
19896 -28594 42690 -29158 -108632 30580 121947 295835 376232 268638 188015 26101 -65749
19885 -65749 -157482 -21075 146806 91363 -7602 -79612 -163038 -204832 -209722 -74701 117500
19874 117500 146847 -14487 -150053 24290 49423 -121698 -232067 -288808 -423421 -419766
19864 -419766 -255490 -213954 -188820 -194994 -139384 -99405 -92810 -147921 -88656 -138889 -51662 -177460
19852 -177460 -171428 -195920 -157635 -11794 120834 158706 24257 -135585 -99424 23623 -25801
19841 -25801 22080 9153 68065 181113 187013 174193 223665 239317 143769 144773 118536 215489
19829 215489 99039 -251478 -424487 -333726 -150116 -93116 -60054 -8850 15953 -74803 -87090
19818 -87090 64380 110471 -43351 -122298 -171143 -109339 -31287 -105971 -216642 -124237 921
19807 921 61319 -72384 -210144 -238811 -275053 -137422 26425 137359 149281 94943 121664
19796 121664 302964 350117 386773 324648 360669 305646 272713 239134 207209 252414 348691
19785 348691 233239 161128 169899 36436 124922 295799 309276 211493 196437 277413 324874
19774 324874 261634 319283 202798 111926 109166 -23240 -117471 -124557 35135 190247 259571
19763 259571 433133 526895 366451 362052 198959 -126888 -141667 -22822 -143281 -275032
19753 -275032 -93013 163405 226674 165398 283662 229405 182079 194111 195554 318215 229825
19742 229825 53886 -36973 -16662 95774 231532 220114 149885 152336 103753 233623 411681
19731 411681 283278 186615 221611 222126 334307 558090 748272 830281 861403 790979 861662
19720 861662 1095682 1224124 1064995 900089 873273 771737 622817 659779 578457 410689
19710 410689 368960 421154 347052 232734 203974 132932 87786 -53278 -21385 157524 257398
19699 257398 185101 178952 273750 205687 114138 30235 -53248 110754 195121 99937 125883
19688 125883 59968 -26680 -31254 -100217 -111712 -47362 40338 -26272 -121215 -202973 -143400 -52944
19676 -52944 -17119 6582 143916 317791 539923 576291 498257 484232 555913 716346 832407
19665 832407 906681 843710 993959 1112581 953031 988418 819236 689296 793251 757633
19655 757633 536510 492931 511597 414067 399294 447348 485729 427217 392210 287429 131846
19644 131846 194175 191085 110251 63993 -82124 146334 360758 452009 473755 260916 121694
19633 121694 170262 258386 131217 138631 81727 19092 56224 118766 60743 46860 -21374
19622 -21374 -90168 -77635 66638 106181 109098 162953 224535 113082 100478 155958 270671
19611 270671 363450 333830 286178 333743 276867 248910 251342 160827 262978 285370 190540
19600 190540 167801 203147 119805 -43975 -74015 -102307 -1958 -34148 -51861 -82108 -196316
19589 -196316 -143849 56977 276169 253054 192722 177986 70346 209557 236479 154371 59570
19578 59570 5804 121151 311403 219842 42864 -109942 -4398 -116845 -2241 115294
19568 115294 125573 48853 13499 -16471 31655 78692 34739 -38514 -65070 -21603 56976
19557 56976 85525 76970 -157341 49043 176935 165340 119960 69122 28942 -85901 -55803
19546 -55803 263800 223231 100424 44353 -229087 -257521 -113687 36169 54975 63403 94581
19535 94581 77440 112264 207530 249180 189234 273513 442153 485091 353700 165322 109682
19524 109682 212521 174314 287524 330938 272748 149616 86089 34340 90586 82652 148594
19513 148594 131871 179328 287495 237446 44659 12440 54370 182211 239655 103777 72511
19502 72511 140806 235266 293991 374739 294659 187138 103784 -27529 -86710 156775 192858
19491 192858 139789 159939 131979 242357 423896 252724 228516 348935 277796 142449
19481 142449 -29918 120 165886 301758 443132 469590 515189 694082 783256 726161
19471 726161 717526 614485 464823 417876 328588 325618 271663 166847 269822 291206 103094
19460 103094 55727 -17393 -86451 70933 272804 367379 384945 340734 213259 322810 475259
19449 475259 488386 148620 78823 251598 188516 149183 256831 349552 293837 350274 406405
19438 406405 309514 376013 227456 232540 220103 82786 -50009 135160 196127 320975 591692
19427 591692 765874 1100669 1286998 1273878 1283041 1202015 951238 864236 893092 790730 676718
19416 676718 469306 343459 252591 144766 271050 124000 -64792 121127 189880 170094
19406 170094 197072 260044 239375 133788 256303 410628 429568 242932 110467 -1749
19396 -1749 -31992 80610 41773 -47690 2017 24901 54894 14458 -55413 -64322 226137 349291
19384 349291 271765 182780 142540 154004 260217 259076 289621 150549 -59792 -89491 12585
19373 12585 190115 181570 274991 335113 91805 29113 35962 -107731 -190231 -127104 -136301 -191481
19361 -191481 -227290 -198880 -230312 -441927 -346931 -198805 60497 177670 167041 64689
19351 64689 42649 33694 2732 -86385 -197668 -194947 13463 232949 176037 124575 31799
19340 31799 -19041 124306 101978 -68232 -80558 -120538 -155778 -110832 21539 24468 50386
19329 50386 193431 360583 347420 220420 125465 238633 197287 -5233 -158017 47772
19319 47772 222261 223282 193721 109036 25950 125627 20421 11100 -116078 3587 -13919
19308 -13919 91626 172137 105080 -23629 -47343 168879 302035 107279 16374 136353
19298 136353 385142 241304 90873 250734 271185 149374 127599 274936 267714 334991
19288 334991 136112 219851 273057 190707 37636 23672 91016 330825 336785 256697 223244
19277 223244 276139 274410 345269 419767 490932 440143 426033 395738 424316 311375 399051
19266 399051 362918 171049 146921 55040 215874 334614 336722 277886 244120 108402 283040
19255 283040 316879 120122 69209 -5093 -151467 -33634 263154 363128 430438 445086 366134
19244 366134 526782 441914 142759 7529 144669 117733 -24179 -153276 -168134 -221247
19234 -221247 -154038 85970 225233 323182 204737 127245 187294 288725 339362 252674 32647
19223 32647 -112024 -130422 73364 295940 337217 284821 143711 127889 13138 -40715 87931
19212 87931 37835 127515 117458 -43981 105854 101848 49544 107640 192944 82240 96251
19201 96251 70696 124060 211661 240069 236393 224918 147399 25384 14003 -2714 37451 1603
19189 1603 -71686 -182513 -173873 793 214863 209959 178431 192101 181207 198832 -96637
19178 -96637 -191141 -133238 -88908 126102 325362 272850 202491 233562 277226 490791 522538
19167 522538 403567 372337 367842 359763 238993 147446 61687 186515 251897 213920 155214
19156 155214 470569 632272 644510 577652 355695 300663 175563 178846 181917 356285 419243
19145 419243 308819 188011 222428 367598 338846 377062 353488 305488 400281 304401 262994
19134 262994 86439 16358 128874 275472 238842 316515 170438 -12551 69026 168141
19124 168141 326121 355147 140860 137650 406124 615996 511759 430287 349689 229835
19114 229835 189575 111356 34291 67807 355264 313861 73949 51483 276577 275181 199722
19103 199722 259160 271196 476045 680724 859443 904473 841787 866150 939403 1187009 1319207
19092 1319207 1434420 1511719 1452542 1419873 1398018 997882 817720 675377 627254 609576
19082 609576 671190 469453 269791 337380 429353 383712 193758 116888 2395 72404 270145
19071 270145 295906 259646 218686 216703 308173 390866 356241 400741 518575 465968 607859
19060 607859 568221 394489 324522 199232 175312 147059 326719 470802 307816 109129
19050 109129 95540 243666 355730 339703 178070 78412 215312 496962 705272 661106
19040 661106 455771 532636 739249 926992 847810 834666 880169 848380 912288 868547 707761
19029 707761 452709 425650 509483 642452 645028 496161 401940 361266 519100 551340 556629
19018 556629 644701 694968 669598 655694 588740 594289 572044 648394 721304 660667 588826 459749
19006 459749 301300 352894 323175 237422 245558 297762 136383 12697 -106730 -45426 137552
18995 137552 206008 96577 242069 275530 307636 316455 284944 327183 214401 192682 371000
18984 371000 485031 467547 404785 280788 161550 315143 472473 470392 477765 590757 479907
18973 479907 377355 401444 377442 211715 299118 272225 317887 479075 391176 151091 40635
18962 40635 184239 280569 229451 200314 313242 342602 523931 493312 545085 779323 870728
18951 870728 762320 665103 836451 899984 933502 929797 881811 891890 656133 522458 466078
18940 466078 426983 329392 327982 420004 474746 253039 282809 421195 312864 199383 165526
18929 165526 300393 304691 220469 269804 247960 319835 369691 422249 271754 267698 267438 70175
18917 70175 95665 65352 182250 296885 207712 48300 115689 297352 384992 428682 372245
18906 372245 175405 232804 436525 426045 437292 594767 649226 569755 692387 646296 709227
18895 709227 736149 747027 802414 969256 1046286 1008900 1059961 1162813 1173995 997364 936672
18884 936672 836551 770504 599385 729911 865517 889392 949336 1022529 845729 760787
18874 760787 708905 838013 991238 908031 636371 283073 325780 464984 532306 401392
18864 401392 387215 348528 355968 430718 550727 566492 409025 195178 212233 325840 372770
18853 372770 268757 108019 110257 203549 113839 179077 212888 209471 202328 437655 468287
18842 468287 483369 534692 645803 612998 553166 465193 488107 746768 796250 787499 683839
18831 683839 579860 672678 727876 921009 1210333 1193833 1033813 952901 850781 680336
18821 680336 797793 951409 1011464 1302317 1545176 1410111 1193656 997794 981797 952118
18811 952118 950628 1006696 1006262 999486 973670 862071 971790 1125453 1217922 1164238 1113825 1171279
18799 1171279 1278332 1301244 1227919 1049094 1001856 918572 746218 714449 655229 636444 717165
18788 717165 512535 474445 581162 686900 767982 610245 599355 692267 699728 698888 674871
18777 674871 687692 799103 1157514 1406837 1500984 1807192 1977048 2017117 2006472 2014387 2129986
18766 2129986 2144598 1869256 1639938 1512625 1406614 1280358 1003427 948174 984479 1032157
18756 1032157 1023520 1004140 924075 907152 946188 1004969 1157612 1279480 1487626 1624271 1559406
18745 1559406 1662552 1697782 1472676 1490474 1447000 1469894 1364943 1245836 1257529 1250236 1128583
18734 1128583 1124391 1125329 1075586 772358 560364 596905 690001 713084 599402 352358 271056
18723 271056 224495 167917 338301 444872 399521 432158 589043 612148 599063 436473 408376
18712 408376 650276 612539 591657 477894 428909 351727 292657 386414 382464 478057 575768
18701 575768 639358 604567 571837 644300 767808 591915 494472 404903 556799 755226 735376
18690 735376 780013 995596 1069416 1229278 1329861 1275431 1165632 1248157 1217869 958362
18680 958362 691465 477510 570518 614243 659585 570440 365682 428292 492591 312888 216476
18669 216476 236433 224185 242067 157401 150600 263110 563738 707423 589056 568794 538393
18658 538393 617898 594622 737779 730346 780526 860355 702529 627805 743125 754090 746196
18647 746196 1047840 1392399 1541033 1428543 1538190 1649044 1539878 1316691 1176953 1107241
18637 1107241 1099408 965951 1017018 1178849 1483794 1653698 1949868 2166142 2262167 2243083
18627 2243083 2045187 1764228 1440403 1225855 1058635 850007 831618 925345 1106534 1129644
18617 1129644 1196296 1243904 1361589 1303778 1083047 765771 626250 708275 841391 911126
18607 911126 754096 714790 822976 831175 809988 966563 1041457 1170339 1326845 1582031
18597 1582031 1659662 1703346 1572286 1414841 1353474 1163053 1209467 1104251 858979 909022
18587 909022 859262 795975 980264 973977 916405 853839 956146 991849 945840 832714 870974
18576 870974 963757 1052327 1008354 1040675 1015285 941811 989156 1075114 1159025 1189455 1184450 1096388
18564 1096388 793475 731023 817927 1049738 1219354 1109743 1108116 1120064 1014870 1045708
18554 1045708 1107706 1102758 1052943 1023957 905739 806537 1003654 1111150 960720 975861 959391
18543 959391 937865 958056 1019862 1032323 873808 864729 1042292 1142158 1199923 1041866 1000967
18532 1000967 1049378 1049906 1167690 1318111 1338091 1261932 1275455 1283994 983556 860333 784389
18521 784389 746406 912663 1151615 1413791 1663788 1580280 1297064 1202353 1119288 1037548
18511 1037548 1142821 1330710 1369680 1271989 1249463 1200089 1126088 1107006 1187180 1407642 1295381
18500 1295381 1239515 1164318 1130582 1030890 945505 1069179 1089818 1100708 1207050 1104506 899648
18489 899648 804261 828694 987520 1080081 1035136 977206 1082299 1103670 1160853 1375765 1475101
18478 1475101 1514147 1497947 1547699 1594696 1574029 1504168 1439841 1557594 1465551 1407117 1626825
18467 1626825 1646546 1658914 1611929 1547784 1627159 1718062 1721905 1489180 1485422 1451996 1458596 1505046
18455 1505046 1681260 1966383 2043747 2044862 2107849 2359902 2780170 2869356 2831325 2622698
18445 2622698 2467508 2360220 2180589 2094142 2124036 2172663 2215415 2201950 2461676 2537180
18435 2537180 2525514 2555008 2665939 2833027 2766840 2914871 3048570 3146028 3372143 3676825
18425 3676825 3834981 3874890 3981568 4006260 3956195 3857566 3764550 3706793 3621232 3666324 3778808
18414 3778808 3992819 4161401 4194556 4191004 4116801 4254056 4461520 4552272 4595816 4739237
18404 4739237 4980971 5043195 5275319 5601972 5974500 6171145 6668907 7386477 8012676 9019144
18394 9019144 10165572 11339142 12802658 14477266 16219563 18076361 20091772 22390846
18386 22390846 25161842 28988622 34304262 41099780 49424381 58836240 68233966 75517249
18378 75517249 76998971 68356044 53654843 41168392 33046916 28062176 25071271 23190392
18370 23190392 21615700 20398050 19475575 18623447 17524384 16384251 15320718 14423817
18362 14423817 13676743 13329946 12986374 12731549 12584767 12546341 12805979 12951195 13092352
18353 13092352 13535860 14310421 15159262 15802604 16653306 17667494 18939988 20279726 22008462
18344 22008462 24290542 27480406 31704748 37191878 44885140 54505080 64901802 74824806
18336 74824806 82460505 83840451 78711672 72485552 69346251 69855860 73837966 81904728
18328 81904728 95344225 115263498 140922068 169249505 195738767 213465004 211190618
18321 211190618 181872322 141488218 108856085 87045234 72976062 63608274 57427389
18314 57427389 53131488 49578039 46308289 43308558 40392828 37545258 35005883 32895604
18306 32895604 31146408 29691496 28373550 27476906 26985540 27069049 27642351 28720377 30547810
18297 30547810 32774469 35434191 38363364 41631164 45514542 49613682 54316282 59676910
18289 59676910 66036690 73811926 84001380 98666577 120443515 149834886 184685303
18282 184685303 220757714 251368843 266194735 249897547 207045996 164832259 136383651
18275 136383651 119557333 110401119 106448175 105785568 108259026 113571390 122037940 134273172
18267 134273172 152105209 176632254 206454560 238456542 267728481 286467979 278337721
18260 278337721 244610811 215025986 205826914 214881382 235415551 261393557 285625416
18253 285625416 298486987 280504091 229136481 175486713 137817546 113062507 96314352
18246 96314352 84637086 75925556 69129406 63376719 58374804 53729221 49096235 44655532
18238 44655532 40604947 36891839 33586159 30571774 27997154 25501552 23499213 21751259
18230 21751259 20453672 19532782 18861059 18144460 17450578 17026877 16658146 16376519 16706288
18221 16706288 17118513 17598955 18428072 19465626 20721227 22453669 24659847 27270441
18213 27270441 31030199 36139322 43587162 53598435 65382285 77774600 88625701
18206 88625701 93836887 86648171 70810028 58441572 53215628 52925512 55552744 59719491
18198 59719491 63579650 65023106 59230512 47459445 36915851 29877621 25220832 22010078
18190 22010078 19557024 17481816 15942430 14647648 13572304 12601773 11645356 10820642
18182 10820642 9951102 9273215 8614932 7965452 7668626 7278774 6984505 6747036 6533730
18173 6533730 6151532 5506912 5062903 4708444 4575523 4255097 3836553 3580325 3371384
18164 3371384 3326066 3139688 2981984 2818920 2590988 2540993 2513597 2540132 2561835 2666416
18154 2666416 2727983 2675830 2727769 2643714 2468912 2388613 2221487 2244009 2483634 2705151
18144 2705151 2691980 2908601 3017970 2988038 3112040 3098302 3240102 3553705 3802249 4156066
18134 4156066 4469912 4787355 5144655 5644911 6326487 7158703 8202342 9443558 10927338
18125 10927338 12782811 15203560 17993725 21194529 24481769 27791428 31192931 34888419
18117 34888419 39212358 44726114 52165070 64135561 84713953 114848597 150414355
18110 150414355 187209349 218610422 235674723 202019350 137334084 92509814 68397567
18103 68397567 54453895 45839467 40018970 35862293 33070664 31227433 29363098 26826316
18095 26826316 23938286 21025190 18284987 15896086 14048047 12297708 10723738 9534269
18087 9534269 8725876 7977159 7309017 6556065 5860563 5347061 4944990 4398162 3793976
18078 3793976 3362075 3324944 3140407 2998335 2761708 2318383 1983686 1554095 1349664 1427010
18068 1427010 1354519 1242059 1064248 965919 714414 591381 707353 680901 524447 402527
18058 402527 131807 194399 273878 279913 310070 337412 417318 347191 142117 -64991 -252251
18047 -252251 -197871 -79144 66339 191674 372300 482299 370332 313746 241913 156967
18037 156967 72806 15 -9432 9706 125050 91079 112126 55267 -15902 113453 156138
18026 156138 264941 297756 159282 -14169 -210231 -294584 -29495 194045 15646 -16318
18016 -16318 -42420 -128022 -93771 72416 87751 118824 51019 -36848 -206145 -228672 -114813
18005 -114813 167854 50476 -32320 -157342 -244848 -330996 -404227 -386123 -469757 -260626 54701
17994 54701 138036 27080 14973 26403 95969 56518 -17743 -72117 -100205 -78239 22239
17983 22239 68727 6380 66720 -33147 -255085 -287111 -255799 -309999 -384850 -312691 -176262
17972 -176262 -187150 -246336 -100043 -81679 7311 147109 215146 273271 277602 144815 72188
17961 72188 -87322 -59473 -93301 -198581 -102689 -170464 -125482 -103644 17477 26328 -127155
17950 -127155 -95181 -61856 -92110 -121764 -269904 -209542 -133960 -67652 -140351 42901 79681
17939 79681 -209741 -453517 -566801 -522888 -327617 -330529 -430012 -309781 -322192 -230762 -128553
17928 -128553 -77329 -136423 -275665 -180674 -152409 6929 1964 64187 35590 26074 -110825
17917 -110825 -275430 -226532 -112010 -407 -87143 -159343 -150488 -97103 4792 18260 103958
17906 103958 183358 130412 -16647 63823 -51414 -148841 -108059 100001 130575 -7149 -50190
17895 -50190 145473 156337 90537 156580 223586 64786 -157268 -234417 -120009 -130616 -194944
17884 -194944 -325627 -75470 85751 71057 96067 99405 128489 200178 346881 350383 156352
17873 156352 226791 159586 107934 95656 246772 504317 558625 558694 571902 642231 632446 599138
17861 599138 521273 494338 338722 310188 320645 292859 370140 327150 42263 70197 167564
17850 167564 279821 298948 87961 25869 59903 181531 148519 249004 337546 256347 369022
17839 369022 464816 337102 270835 326044 355008 302600 313178 298741 251856 163291 147148
17828 147148 129768 88602 266815 295750 184956 229889 549737 696556 565393 617787
17818 617787 811945 719353 730198 690500 628773 606450 534304 534969 462362 340624 462656
17807 462656 548640 494442 483288 396264 224387 227090 143219 252993 193908 295693 420784
17796 420784 329614 279893 155364 259987 266931 277763 169706 72879 98075 242015 259774
17785 259774 268185 422405 513856 607210 693924 644753 568334 423276 184422 -10148 -59011
17774 -59011 -53859 -33707 -122698 -70085 69717 61564 22670 152059 212556 367008 522189
17763 522189 685662 790863 699665 542133 522644 549802 380399 228599 246969 215629
17753 215629 189850 127027 141635 192510 52385 -443 5481 56367 99523 71249 -786
17742 -786 121479 271706 275052 238435 221002 221860 242234 429777 667570 832327 1024259
17731 1024259 968556 954627 888321 962528 974519 920851 990252 958246 726877 738242 782070
17720 782070 647410 382086 337408 300169 228707 252783 51917 139830 268866 92923
17710 92923 10364 358 -4755 -16316 63568 185455 260263 334301 482381 525424 465625
17699 465625 489254 462915 527594 718237 782820 829524 938745 1015319 912305 854600 876835
17688 876835 765899 547600 479130 503899 575617 561064 879404 1005839 1170506 1380334
17678 1380334 1437007 1648360 1694274 1612276 1668110 1557658 1401129 1287663 1148582 1145242
17668 1145242 992334 793709 771994 682331 659729 592799 379438 227715 143506 103991
17658 103991 -3556 1564 112736 97578 44524 -74767 -191038 -76116 -116079 -56374 -25929
17647 -25929 -59375 -67150 -171945 -153159 -94651 97856 107045 60165 34395 -29086 -20710 -47490
17635 -47490 46912 97004 128317 165113 134813 170223 117127 83730 233315 285607 474607
17624 474607 576417 511286 534641 687754 636640 702953 590671 453766 343489 404230
17614 404230 474074 534485 653292 757964 885843 832239 725415 596252 378359 305872
17604 305872 208567 164386 82196 -29469 -33880 -69495 -33977 144822 139504 141278 264633
17593 264633 304112 246227 214067 276833 332981 300191 274620 413234 602133 713121 686301
17582 686301 627990 709628 669977 658673 524740 422781 334813 310773 212639 209702 303885
17571 303885 443527 753080 805319 725793 519785 466355 305856 77021 -54644 11083
17561 11083 81358 181282 214926 204767 -68844 -3116 -61707 -164242 -210475 -27041 -13697
17550 -13697 24530 34080 9341 -64202 -89894 29503 -57052 -125756 -182588 -227605 -219717 -151679
17538 -151679 2606 -73697 -205242 -138083 -133417 -192260 -286583 -412878 -422890 -318467 -235862
17527 -235862 -135049 -124591 -189000 -273406 -279828 -156654 -128439 -123128 100810 124531 -16229
17516 -16229 -106775 58140 147945 287833 367030 400563 295559 192644 88162 36027 -71836
17505 -71836 10457 85063 49962 -71385 -168160 -282423 -369272 -253663 -124840 -193583 -243690
17494 -243690 -144686 -45896 -140549 -242705 -305731 -238769 -236701 -170961 -132566 -171242 -63368
17483 -63368 17218 -121804 -173263 -184971 -216774 -290588 -292599 -417330 -466939 -334520 -178654
17472 -178654 -72632 -25052 19121 146306 132543 84934 -23854 20722 15839 133043 153379
17461 153379 119672 215819 197189 198562 54231 20579 35902 134345 168908 38329 -112195
17450 -112195 -39301 145559 184605 415779 556387 776742 960908 1006644 1161477 1012106
17440 1012106 741298 505669 593441 473618 228987 286453 386296 422626 376560 326450
17430 326450 500162 594275 383601 420158 707764 702914 796441 799960 761586 654393 685472
17419 685472 457490 258204 266731 230702 213814 42904 188539 223370 120692 57776 128230
17408 128230 95692 208686 50405 -63205 19328 179558 314774 261403 57851 -121430
17398 -121430 -94576 -101955 66667 213116 191474 139022 125655 96386 137215 300593 572739
17387 572739 801836 677279 597281 691830 808477 592510 586167 680034 814014 1022500
17377 1022500 1061813 1079870 1123384 978796 791910 732903 744811 664496 601756 711142 641332
17366 641332 601070 634633 640451 586660 397098 318095 579742 882533 1277679 1306908 1361226
17355 1361226 1140761 812796 792659 708563 449030 399765 291128 252372 458691 610669
17345 610669 680428 687339 609391 539229 528841 426474 488980 610613 637013 671585 483651
17334 483651 568744 556364 438375 323627 290374 207683 275042 326428 401433 407169 287459
17323 287459 478031 573521 396732 472500 672166 809883 723308 404271 316863 483531
17313 483531 419473 553961 812253 956765 1202601 1483122 1368084 1140591 783919 636583
17303 636583 595514 567092 527195 590313 583946 374683 467937 572517 610884 603061 554728
17292 554728 501363 542847 503381 402073 343525 248258 390103 454514 446996 406381 338960
17281 338960 196925 228000 267677 280840 252078 389404 415410 386999 483507 628198 526863
17270 526863 393720 466965 470735 385268 343435 459659 529837 622550 559489 454099 342447
17259 342447 474860 627144 539577 706542 829673 897355 814193 783169 878096 928151 971903
17248 971903 847322 584881 525761 503622 469459 487661 332986 322923 315018 318797 373720
17237 373720 406465 272755 304180 278599 228891 295245 409446 436289 402641 500899 510220
17226 510220 461137 465440 378327 440604 548849 537812 564640 595357 750430 875747 967635
17215 967635 886343 707701 695919 714999 698077 667303 842905 1192435 1371605 1488026
17205 1488026 1587018 1604125 1690134 1824199 2111382 2631949 2985726 3216108 3284487 3188547
17195 3188547 2695726 2222408 1794812 1549056 1472434 1407173 1341832 1111351 1223282 1318169
17185 1318169 1297010 1379247 1526638 1729462 1641507 1635994 1596642 1661496 1675397 1763256 1790289
17174 1790289 1609991 1567365 1881098 2175478 2153144 1992172 2057474 2140044 2150325 2076556
17164 2076556 2256429 2386602 2564158 2779952 3132762 3435307 3578138 3786251 4059912
17155 4059912 4218150 4644873 5011218 5325781 5846295 6116331 6403613 7022044 7666697
17146 7666697 8291860 8947456 9921552 11103107 12381769 13726515 15425475 17307687 19401529
17137 19401529 21718570 24505113 27578452 31014693 35161986 40347337 46801469 55229120
17129 55229120 66827184 82827480 103508211 126992727 150968849 171366757 181406645
17122 181406645 172522840 151046309 134317325 129582983 134906169 146785903 161321671
17115 161321671 173799470 177163633 162303947 133193894 105401956 85379135 71451211
17108 71451211 61802247 54863123 49826708 46225886 43449876 41248559 39195579 37544205
17100 37544205 36234236 35264836 34548333 34288181 34488366 35111657 36061923 37396933 39126880
17091 39126880 41605642 45039841 49562778 55452962 63662625 75372962 91154524 110871777
17083 110871777 132811016 153470995 168513650 169009295 152028277 131990870 121807398
17076 121807398 122849384 131895940 145186108 158549784 166933948 161957529 138942687
17069 138942687 109619315 86358794 70219805 59218890 51215446 45131372 40602978
17062 40602978 37157488 34284458 31413788 28581162 25875109 23389180 21325877 19663533
17054 19663533 18107498 16780369 15520200 14296061 13079990 12076928 11435191 10754493
17046 10754493 9965234 9241425 8616990 8096835 7449257 6839216 6468469 6091651 5836662
17037 5836662 5544258 5587944 5681226 5712800 5937079 6461918 7028167 7424013 7340607 6660782
17027 6660782 5683211 4621684 4001719 3552022 3114169 2765298 2708037 2623037 2397049 2256194
17017 2256194 2177237 2037929 1990027 2020196 1989627 1975793 1864617 1834868 1798913 1872066 1968013
17006 1968013 1876252 1830942 2014295 2267077 2585278 2797833 2938081 2967140 2995734 2797669
16996 2797669 2704027 2448182 2158878 1916481 1715888 1784669 1851841 1949075 2043627 2096470
16986 2096470 2186924 2451883 2933600 3372888 3880104 4496750 4870780 4999216 4598929 3701532
16976 3701532 2966714 2493250 2115917 1852223 1654621 1579556 1449311 1312315 1222073 1057042
16966 1057042 993486 1059700 1005218 859843 763849 853940 935368 991683 964091 746269 595008
16955 595008 614554 739019 838279 760300 609347 558229 420898 448469 473600 496443 662538
16944 662538 667475 530762 525442 407512 229854 330009 308777 292200 396366 371418 385203
16933 385203 314381 74549 148081 317818 380626 310181 273935 171277 28234 106690 139146
16922 139146 83182 108513 10510 -11894 54085 51611 61635 252605 285680 289101 272389 265973
16910 265973 342651 464834 462108 439797 348701 261680 222421 117668 117796 190657 179275 160288
16898 160288 299158 349486 181668 -43445 -121474 -115532 -157870 -118353 -104850 -14001 3765
16887 3765 -24763 12214 5971 -7238 -48985 -7178 -28758 -96984 -161697 -180347 -78394 171903
16875 171903 260638 212183 72489 -30745 -50935 -5013 93878 181021 196311 167889 147055
16864 147055 104769 150709 95962 93276 -4495 103681 158983 79905 115071 142769 -189102
16853 -189102 -295678 -88256 -80656 -76952 -218707 -127635 2267 92649 158355 160806 -1544
16842 -1544 -73855 28741 19605 -244528 -249837 -135745 -154701 -182145 -106736 2611 40327
16831 40327 9665 4537 77794 116428 62291 150139 15012 -191524 -231746 -116786 -122684
16820 -122684 -90183 5900 43055 157094 133548 146374 43654 3634 -66998 -233262 -179580
16809 -179580 -164459 -102438 -72039 -154473 -253068 -175144 -113441 -62196 -177777 -205539 3913
16798 3913 5428 -180120 -164893 -259353 -247298 -229075 -72664 19543 170540 321926 98003
16787 98003 12192 140308 152974 33457 -9924 -95793 -59279 -39133 -89074 -114325 -48822
16776 -48822 -34574 -17869 275243 383522 371955 229690 6898 22550 106423 144963 120295
16765 120295 27635 -73190 -138161 -129951 13811 154485 8347 54067 63934 -21091 -31589
16754 -31589 -8553 82639 793 12366 7965 -78453 -99390 71058 103073 12270 -158622
16743 -158622 -97039 -9868 20871 46327 -33161 73755 -42106 -65528 -180683 -220985 -256842
16732 -256842 -213745 -150914 -124879 3355 55364 80579 -49415 -186687 -237940 -248865 -188447
16721 -188447 -117552 -33020 -25738 478 -39027 -182970 -185111 -210597 -174300 -195748 -304813
16710 -304813 -247576 -226283 -169519 -164418 -8180 114414 -42329 -210439 -278162 -207053 -166536
16699 -166536 -196810 -305834 -262683 -265633 -290753 -282868 -276301 -71236 115833 63949 -33571
16688 -33571 -65666 985 11760 -198769 -312045 -329039 -355792 -278205 -83898 -37793 39702
16677 39702 -94330 -19575 98416 175716 97147 -29735 142111 113127 41232 37089 82181
16666 82181 30950 -44208 8021 -76345 -54627 -25899 168436 67602 -44549 -30756 -172918
16655 -172918 -113872 -6547 22134 59713 -56880 -187714 -175705 -89106 -62735 -23694 -33903
16644 -33903 -21084 82581 20323 -100215 -87086 -80797 -62324 -191584 -248717 -81289 -43103
16633 -43103 -136857 -53637 -7685 61290 287925 314970 343477 261202 558073 831518 880353
16622 880353 875533 1086477 1062523 824395 621406 461770 560204 621139 749758 661570 560061
16611 560061 447994 349006 368871 328736 261903 233975 254214 230501 190841 92663 133224
16600 133224 115852 123319 185905 242563 240275 320080 144179 37352 -11510 -34433 -82402
16589 -82402 30785 11224 124798 94394 92800 160759 136292 264769 329788 356155 679638
16578 679638 947477 921520 816723 638014 755782 764202 683724 781160 791184 916304 880682
16567 880682 639748 387261 376330 344954 233195 151131 165294 -163921 -335092 -388152
16557 -388152 -399859 -319164 -254057 -251251 -50074 168485 175210 206980 155048 87287 11427
16546 11427 174097 207949 150548 7141 -212706 -269253 -154487 -247656 -212209 -158010 27170
16535 27170 143774 -1690 -16701 -12841 -42700 54900 -31744 33860 225713 -26524 -210954
16524 -210954 -108574 -72994 -46581 -39871 -92263 -150708 -208358 -238595 -180458 -170364 -18074
16513 -18074 38186 36429 41026 80759 -48027 -107092 -253584 -286473 -113574 -253991 -263369
16502 -263369 -147316 -141298 -221950 -163244 32811 -87348 -173688 34767 100025 -50203 -26823
16491 -26823 33093 -13151 -2614 -52574 -39431 -32133 -40000 -138033 -257158 -343590 -579018 -652457
16479 -652457 -636860 -609731 -500485 -513944 -318661 -244242 -184235 -95635 -52278 -92152 -205862
16468 -205862 -138682 -53023 -111056 -196769 -285988 -248407 -173254 -227261 -214043 -34025 -126093
16457 -126093 -341210 -413869 -377554 -271806 -416596 -474763 -275538 -69462 -35025 -14534
16447 -14534 160499 164730 146767 143853 -60996 -321246 -450811 -229565 3572 241475 227938
16436 227938 164442 33569 45457 126436 109096 8789 74861 -24493 -108069 7590 66360
16425 66360 78183 39947 -20161 154327 382077 299956 172234 20243 -95639 -167512 -301318
16414 -301318 -367600 -163912 147848 180843 244179 193392 200389 -20387 -86466 -184554 -315580
16403 -315580 -376035 -336097 -208843 52606 183185 130177 84705 47446 85231 -17294 -15331
16392 -15331 64168 40176 -57990 -37470 -104051 -212860 -199565 -106224 -65850 -182116 -406381
16381 -406381 -266109 -118961 -29746 -91542 -311924 -338113 -109029 107840 111332 99169 127354
16370 127354 123978 125628 29404 -8999 -72215 -206987 -247444 -241689 -415444 -515757 -386311
16359 -386311 -148197 25094 87108 -72393 -369997 -295204 -203268 -53407 74404 -8805
16349 -8805 -131109 -30946 -70797 -215265 -316666 -205516 -400595 -488475 -340834 -132930
16339 -132930 6682 -56384 -88769 -22060 -17261 -139687 -244645 -298150 -319843 -216974 -214972
16328 -214972 -176703 -48760 27270 58588 -121148 -95147 9802 -100650 -198039 -367313
16318 -367313 -391106 -191944 -177633 -68110 25097 32718 -65190 -128154 -215154 -199869 -245488
16307 -245488 -269228 -315519 -306722 -351833 -440640 -384016 -286560 -28828 53800 223719 218921
16296 218921 -53554 -59921 -10349 -43195 -86406 -86513 -92586 -186076 -50657 52852 76908 82223
16284 82223 164115 92584 -143209 -100755 -103923 -221018 -281416 -246845 -140392 -206452 -378684
16273 -378684 -347050 -200688 -207805 -299274 -309867 -464868 -442652 -275528 -155961 -174444 -157719
16262 -157719 -71209 -124551 -3666 6830 -74820 -179066 -33395 95885 159834 16194
16252 16194 97 79641 81579 84885 -92395 -214794 -148399 -66513 -69697 32760 -11329 -86106
16240 -86106 -102586 -126480 -257702 -276474 -192659 -258565 -450749 -563601 -409509 -174650 16906
16229 16906 -159810 -290235 -180150 -98996 -286992 -282148 -251650 -347718 -328573 -267548 -314965
16218 -314965 -384300 -314741 -239583 -218292 -327370 -189846 -156558 -318429 -361359 -348844 -305686
16207 -305686 -226555 -143983 -114265 -98008 -249238 -292409 -240698 -330307 -372233 -252556 -278192
16196 -278192 -269787 -168016 -55485 -28160 -17601 -137410 -317029 -340066 -202071 -183241 11923
16185 11923 -43655 -204041 -224458 -175369 -181542 -207772 -112018 -63078 -102723 -39641 141173
16174 141173 113175 90846 131513 80103 30884 -102318 -160316 -144658 -226058 -315066 -273325
16163 -273325 -117992 -146916 -258576 -344730 -423950 -489736 -317329 -338439 -391414 -413368 -475333
16152 -475333 -405745 -205599 -217626 -108843 -67624 -39295 194581 186754 72238 86636 123006
16141 123006 6200 -96656 -205837 -155053 -55494 15705 -89568 -291758 -255200 -218123
16131 -218123 -95769 26537 30237 -147505 -51471 -84839 -199074 -39985 44249 181785
16121 181785 241701 219269 -21176 -216790 -232770 -186933 -246867 -356831 -405532 -328933 -82028
16110 -82028 -139777 -162565 -330562 -466565 -230181 9335 117166 142774 120929 -62771
16100 -62771 -164608 -139671 -164637 -237379 -361918 -249222 -172851 -80080 58490 -38315 -170098
16089 -170098 -329239 -429413 -337455 -174250 68105 266005 230277 -40878 -65979 25929
16079 25929 -16544 -90901 -69003 76380 161814 192019 -8404 -163047 -87344 -97762 -155422
16068 -155422 -156811 -57072 106171 43234 -107762 -236508 -191528 -111297 -125565 -31831 -18403
16057 -18403 -8608 112613 181917 109937 8901 59087 6940 -123444 -136734 -88061 -224954
16046 -224954 -257998 -23349 -8724 -145212 -244003 -272188 -220774 -196359 -113965 -27764 -125842
16035 -125842 -209048 -294224 -469516 -497761 -486710 -372453 -371375 -350148 -269482 -396268 -385789
16024 -385789 -225355 -163900 -235522 -255730 -224192 -84969 7205 -115315 -67088 62658 -61109
16013 -61109 -187545 -145978 -119041 -283092 -438833 -436999 -104910 137551 157574 -122848 -154669
16002 -154669 -156033 -280114 -294235 -173485 -162924 -135034 -58403 34104 -21724 -137308 -113621
15991 -113621 -103016 -80934 -68953 -47421 -98281 -210346 -189275 -221809 -349875 -329477 -172354
15980 -172354 -185572 -149822 -1588 62990 139446 37999 -1342 80177 41622 -11031 -80748
15969 -80748 -118062 -260301 -170167 -202200 -170944 -151445 -226308 -78340 -76082 -136255 -69463
15958 -69463 -109843 -114269 -165139 -277279 -211934 -136636 -30945 -112115 -308928 -327604 -304968
15947 -304968 -271887 -28130 2603 -99187 -88115 -35824 -36236 29646 -61148 -21933 -144333
15936 -144333 -229012 -268214 -77238 6977 137273 161989 137380 14204 -16398 -138564 -306290
15925 -306290 -300597 -236224 -39292 32262 41649 138039 7379 -16415 -203883 -332615 -251861
15914 -251861 -86767 7462 45317 -26084 -105286 -141405 -237962 -217835 -79595 -103323 -31438
15903 -31438 82300 38508 73860 143986 -5776 18281 201977 114198 -1361 51352 -45099
15892 -45099 -254276 -64970 168142 184954 156270 -96670 -302399 -117477 25798 38726
15882 38726 -118339 -121853 -238155 -364357 -303923 -203195 -230317 -268324 -327262 -271866 -379571
15871 -379571 -405234 -365500 -358049 -182098 -177565 -93237 -110753 -190077 -226603 -114295 -82469
15860 -82469 -82954 -246444 -317128 -219034 -152310 -99447 -98611 -46274 -98505 -84993 -13674 10559
15848 10559 -29884 -50391 -65973 -145122 -184130 -265135 -252516 -270203 -68651 -86448 -236244
15837 -236244 -258976 -329502 -168303 -125948 -225037 -183140 -165168 -103397 58440 -76711 -324434
15826 -324434 -238290 -2914 -85373 -106903 -154684 -238747 -328309 -332610 -269254 -342178 -321389
15815 -321389 -316590 -388336 -250657 -179480 -272651 -209377 105000 85429 29619 -76990 -162092
15804 -162092 -269251 -402719 -320250 -290004 -218321 -71566 -124175 -108147 -168751 -215089 -151647
15793 -151647 -41464 -78915 -131598 -3815 85041 151658 13765 5415 -21974 -116717 -218265
15782 -218265 -346636 -160766 30762 164353 100196 73054 113559 71221 30181 -148982
15772 -148982 -189848 -183714 -252090 -212509 -185431 -200306 -238041 -166381 -54023 -188461 -227854
15761 -227854 -88657 7547 -36214 -106597 93051 246005 110751 -155257 -360345 -314474
15751 -314474 -288504 -265792 -278638 -256631 -346712 -305857 -180457 -153186 -152905 -17523 -2645
15740 -2645 -138919 -239791 -113861 -88236 -138330 -255654 -335472 -317166 -275582 -318238 -237712
15729 -237712 -91931 -173935 -352621 -255301 -74297 78219 -32966 -144699 -369951 -353695
15719 -353695 -14464 203705 155134 -82240 -255188 -157099 -143764 -117159 -80850 -16161 60513
15708 60513 121420 106474 40426 -292486 -343033 -269359 -267938 -157851 -105685 24657 85071
15697 85071 -40379 -180080 -409407 -393680 -340370 -253575 -163760 -179177 -216814 -276024 -279588
15686 -279588 -218490 -282798 -347880 -488610 -499196 -215410 -72901 -138232 -134780 -128735 -209885
15675 -209885 -73451 59657 15444 -195785 -172055 -335056 -374913 -289522 -208704 -169215 -322559
15664 -322559 -416833 -304677 -145413 -101881 -46469 -71942 -120415 -153437 98414 275564 311137
15653 311137 170494 95931 112204 83775 -108923 -70620 -7422 -81009 -119721 -303112 -180891
15642 -180891 -167361 -175207 -120549 -75518 -44682 -84929 -261834 -275250 -211491 -187984 -157304
15631 -157304 -272394 -336208 -354103 -148771 -124181 -239498 -265621 -317974 -423882 -497617 -498866
15620 -498866 -258551 -11684 -142000 -29745 19039 -134185 -37233 178851 156947 149254
15610 149254 191835 286634 269132 178309 53601 -214801 -355390 -270311 -112668 31618
15600 31618 -768 103309 196786 28438 -9718 -151765 -332614 -380427 -269701 -199087 -209815
15589 -209815 -297865 -397706 -441218 -267350 -316123 -103836 -42543 -113598 -165688 -170955 -155321
15578 -155321 84240 169495 -44896 42587 5873 18167 27791 6723 59040 -147123 -277556
15567 -277556 -336233 -363896 -259346 -381619 -372950 -170715 -110730 -169046 -210263 -38966 45764
15556 45764 -183218 -190664 -76024 -246251 -230533 -59781 1733 -115766 -228875 -280365 -233703
15545 -233703 -77658 91172 197452 58516 -97691 -110138 -111845 -376060 -295212 -132981
15535 -132981 -128293 89352 60861 -18121 -81357 -67457 -60391 -226564 -335184 -291225 -234419
15524 -234419 -28374 143910 213297 18435 -45148 8932 73024 -40802 -62632 -45490 -117192
15513 -117192 -292624 -215358 -278385 -278587 -191301 -48808 -83337 -104907 -68796 16771 24829 -81784
15501 -81784 -168674 -165058 -239601 -172372 -117730 -141941 -177760 -174334 -203150 -146169 13795 -92286
15489 -92286 -214585 -122462 -61537 -307287 -335492 -219732 -331042 -393528 -108843 103092
15479 103092 99649 -4872 -75248 -180353 -240886 -258477 -374959 -376410 -418159 -359273 -130784
15468 -130784 -24700 -151483 -319774 -211001 -225594 -230128 -200215 -134734 -89190 -207160 -288403
15457 -288403 -206422 -116660 -192822 -220110 -270086 -141637 -25716 -78522 142643 285414 225968
15446 225968 75678 88381 -78435 -135910 -174017 -265536 -263194 -245018 -228105 -23038 -104084
15435 -104084 -183206 -316063 -359753 -272939 -1515 -47165 -74707 -80996 -68974 -34516 -150784
15424 -150784 -143345 -239906 -250804 -236141 -219259 -103206 -160806 -266575 -328541 -288565 -210105
15413 -210105 -165895 -194233 -97498 40597 39570 -132351 -124373 -91317 -131390 -104105 -217337
15402 -217337 -335115 -198499 -99385 -89873 -120213 -247158 -155392 -100144 -83144 -147619 12619
15391 12619 140825 188864 13694 -182293 -107101 -79986 -121845 -95533 -216612 -273808 -189033
15380 -189033 -148862 -234083 -170724 -205875 -300721 -164680 -268415 -308948 -115753 -96351 -108290
15369 -108290 -172263 -226967 -298875 -306680 -177896 -315485 -260293 -129884 -103083 -93243 -206353
15358 -206353 -329895 -279992 9095 119742 92608 -799 -176460 -208963 -43651 -25309
15348 -25309 95128 115971 23420 -26514 -113885 -180017 -176627 -112105 -13611 96426 216074
15337 216074 221028 30806 -164494 -91241 -21210 -60640 -62373 75709 101396 121929 -20533
15326 -20533 -159039 -228357 -318271 -377401 -349209 -228900 -159546 -119180 -149245 -185184 -82895
15315 -82895 -96255 -109441 -247271 -294716 -294807 -196078 -158191 -84621 -67455 -123926 -31048 39677
15303 39677 -28113 -233043 -385192 -404511 -378119 -315381 -241238 -206351 -64282 -74769 -23214
15292 -23214 -63687 67115 -87264 -37207 -62246 -27108 14980 -48561 -19232 46894 -38412
15281 -38412 -184240 -139782 -83939 -152159 -122234 -149244 -196377 -250570 -230441 -281024 -204673
15270 -204673 -120062 -101106 -174704 -197387 -122934 -33625 12986 -106313 -294457 -299786 -177249
15259 -177249 116535 266077 204813 103332 -41783 -55726 68505 38580 -184922 -93014
15249 -93014 -41639 -26061 78019 -31310 -122076 12949 83445 84621 137701 188846 147112
15238 147112 -13041 -145740 -182707 -161049 -120919 18429 221124 286498 339479 260612 36828
15227 36828 19237 13918 -47611 -24027 -85072 -144941 -189166 -3964 14819 -165811 -371977
15216 -371977 -278650 -42080 25720 -71111 -49722 -41949 -157633 -191012 -163868 84860 126251
15205 126251 97090 87039 -53024 -40072 45481 7852 93920 70050 121293 161320 205545
15194 205545 249030 247462 180300 336554 308704 157783 10814 25985 25486 69678 143093
15183 143093 51523 -89127 -3985 63542 17559 -37555 -71522 -73823 -37886 -99670 -27939
15172 -27939 39746 140204 194864 101179 130260 252925 173417 111220 -59643 -161260 10061
15161 10061 179339 157116 45230 -58335 35077 116343 42610 91384 -62218 -199322 -59336
15150 -59336 -126019 -166988 -110369 73843 254857 242739 103564 -26473 143021 233700 184250
15139 184250 14146 47309 112697 73758 74569 -32731 -206685 -382351 -436510 -347362 -295117
15128 -295117 -120479 40263 80182 11112 -203491 -202419 -172453 -1073 42090 35031 -36551
15117 -36551 -135580 -219994 -205868 -330902 -290688 -194071 -299107 -139054 89390 118899 50887
15106 50887 -127922 60767 173821 -74024 -250384 -138071 -137994 -34654 107163 66186 38141
15095 38141 76108 129648 152508 127127 236402 229432 256996 294322 117573 -102454 -139402
15084 -139402 -177206 -169873 -233156 -182757 -146083 -1704 37131 -113329 -242676 -162005 -20491
15073 -20491 52999 96901 76325 7158 -171646 -251696 -155114 -155278 -151292 -179673 -118325 -2025
15061 -2025 159 -113908 -85507 -78053 -176279 -332826 -217608 -75029 51696 -138870 -81140
15050 -81140 268 -178994 -255793 -125548 -133929 -101280 -6437 57142 34116 182365 138832
15039 138832 -24878 -39126 76459 97849 -40430 75326 124423 -1422 -158009 -317116
15029 -317116 -157666 -33572 92442 82345 -7454 -122035 -332318 -220977 -50271 -122106
15019 -122106 -197287 -113555 -108531 -288659 -382157 -352531 -245452 -232331 -86003 -127152 -152361
15008 -152361 -132693 -194924 -33368 23497 -71024 -139556 -243716 -289737 -137027 -89270 -186444
14997 -186444 -138590 17249 26879 -10434 -124202 -257331 -267102 -108368 -25172 -30975 -14508
14986 -14508 -72044 44562 -2703 -40154 -13348 -39449 83560 84158 -53518 -123452 -56888
14975 -56888 109227 44629 -26861 -25730 118305 -14064 -155309 -107918 36666 181633 233362
14964 233362 105431 -38335 -60244 -99864 -34551 114891 105070 175535 -45596 37554 97083
14953 97083 44536 -282980 -355288 -256009 -202027 -82784 -22951 878 88753 216323 201788
14942 201788 -54902 -79919 167822 261519 272191 177276 -7252 70535 60497 76549 -59231
14931 -59231 -99181 -107077 -20979 -146660 -153272 -147768 -177996 -87453 -55187 -112751 -58469 55741
14919 55741 247966 114401 -32073 15708 92420 63920 109851 -9153 -136540 -148320 20957
14908 20957 155739 180516 -13721 45207 -87059 -253518 -152876 70658 197896 287644
14898 287644 267352 144472 255761 437446 357467 82296 116280 227773 129560 201072
14888 201072 240060 228461 209280 228671 188167 234502 288564 207668 194771 285365 383682
14877 383682 197662 71899 153370 43268 88706 128558 149693 -40567 -97860 -87391 -27353
14866 -27353 -97888 -74200 -23948 28468 66047 170761 34722 -82960 12367 150583 201009
14855 201009 147878 112651 36657 74462 23228 -18733 18173 55360 30596 161886 173629
14844 173629 328756 419586 315285 301943 294134 61644 -108396 -170964 -382477 -203234
14834 -203234 275448 568768 558991 407902 407924 320123 299346 286833 240976 274797 251229 297994
14822 297994 385155 398260 439347 475563 455678 431919 360070 326564 375990 318085 393684
14811 393684 344056 252015 160271 98478 -13277 52804 -33912 -75278 -65898 55385 193668
14800 193668 92809 70353 49311 -87618 -234619 -173855 -84 35523 28773 11426 65433
14789 65433 -15289 120308 297870 252663 121943 76911 195713 242629 264278 186711 281056
14778 281056 346420 417282 471467 235962 80417 148527 161550 83735 138725 88426 -13527
14767 -13527 199123 399824 362284 269919 177816 303506 387322 250472 180715 173956 96644
14756 96644 174850 197478 76288 109266 225711 77398 81404 300799 376558 429294 476217
14745 476217 403378 368681 325307 278812 295039 427514 366258 257960 224772 248533 244747
14734 244747 311193 252749 232448 221134 248886 371144 294952 140708 47830 133342 188621
14723 188621 148195 212522 227262 195164 287968 392142 353372 385012 473254 433474 248604
14712 248604 275101 276240 263974 328723 331429 210460 107761 114002 312102 317663 352073 345662
14700 345662 366396 354867 163945 121871 131468 189605 231486 178063 106385 192548 353396
14689 353396 607252 650359 671620 507098 530677 433478 508882 507649 483633 502649 491738
14678 491738 563281 494546 508165 449610 396154 229054 198945 120668 -57325 40348 185303
14667 185303 241541 191549 26521 53476 193824 263146 222417 284086 402093 526264 527728
14656 527728 560007 505899 446518 443190 501661 481327 387533 234327 392644 441781 419411
14645 419411 451611 348928 346055 465634 490363 512349 426865 447906 422616 486656 643537
14634 643537 598290 451383 429875 515541 475527 458738 332548 224589 398578 512711
14624 512711 532892 618244 647278 696835 575497 377769 195906 407601 487164 470003 472174
14613 472174 451691 478527 707511 855673 729876 679339 665145 580965 620630 639050 559811
14602 559811 808795 796481 866336 819492 623857 516912 451137 492311 550326 671660 707576
14591 707576 816143 970326 1003408 872109 734019 662063 537116 592420 617738 721132
14581 721132 855837 691874 710799 815427 1048896 1066489 956977 846365 773156 788482
14571 788482 830324 798222 801287 858989 881397 871570 740189 806649 871248 999663 985751
14560 985751 893665 844416 936118 1168043 1245994 1273865 1320586 1163242 1068083 1053982 897146
14549 897146 997065 1204790 1081851 972574 1112839 1180628 1114480 1170777 1202232 1192360 1033198
14538 1033198 1105061 1198663 1216041 1140320 1217336 1269870 1472842 1547904 1520008 1393479 1272984
14527 1272984 1231942 1138458 1139822 1122265 1112628 1122413 1216584 1285214 1090840 1098487 1066934 1067567
14515 1067567 1123560 997436 1167863 1344297 1500762 1685474 1500000 1270735 1217766 1252580
14505 1252580 1246998 1119051 1055810 1119683 1226684 1057272 961002 1068854 1149668 1147287 1201535
14494 1201535 1111541 897604 1044667 1142444 1221198 1067618 1000922 1193098 1337751 1243463
14484 1243463 1179460 1193883 1260010 1268417 1271968 1090972 1016480 1089363 1230823 1305831 1280972
14473 1280972 1328694 1372320 1270576 1185990 1156032 1135268 1201771 1405559 1391630 1291997 1369931
14462 1369931 1318812 1182452 1032820 1027891 1102923 1187783 1103710 1171353 1325348 1442086 1429905
14451 1429905 1308679 1206861 1187440 1271022 1303554 1094085 1026014 1123505 1127972 1249170 1290534
14440 1290534 1286812 1287860 1457681 1458430 1367398 1410164 1311882 1269643 1382736 1500065 1649508
14429 1649508 1578345 1462242 1490769 1562215 1557666 1466591 1620869 1729414 1521030 1284811
14419 1284811 1315368 1415960 1506335 1639610 1757149 1900563 1861313 1899179 2086863 2061983
14409 2061983 1856762 1850302 1804813 1847207 1885229 1948333 2019279 2285313 2466216 2445527 2298955
14398 2298955 2201175 2181071 2126506 2173950 2183248 2288540 2314185 2494627 2586071 2592892 2605622
14387 2605622 2441212 2415391 2543234 2555716 2469486 2553620 2692531 2678109 2689089 2893772
14377 2893772 2989510 3026540 3104040 3010039 2892168 2699612 2732981 2850310 2772592 2723179 2646575
14366 2646575 2769721 2883578 2912179 2780644 2746969 2693691 2891341 2994417 2853866 2787292
14356 2787292 2829663 2791162 2676648 2850755 2897067 2960493 2937557 2770543 2768200 2891428 2978275
14345 2978275 2995722 2900790 3186951 3243391 3105693 3218699 3179166 3163204 3202236 3232886 3275391
14334 3275391 3245649 3198920 3039967 2968968 3037926 3227713 3201113 3283266 3345768 3227987 3291358
14323 3291358 3418000 3442503 3391112 3277352 3229745 3311416 3446934 3414414 3508387 3636308
14313 3636308 3683534 3565187 3788160 3785971 3658558 3593253 3675060 3841914 3995479 3960029
14303 3960029 3953158 4013850 4005806 4170538 4304406 4415088 4402375 4442176 4728468 4770012 4762803
14292 4762803 4703226 4817731 5066897 5257258 5427262 5410066 5464804 5487895 5522747 5447831
14282 5447831 5370882 5391881 5357357 5191353 5106724 5126186 5140226 5345821 5281791 5167454 5055444
14271 5055444 5005897 4923241 4789859 4738023 4692160 4697141 4688324 4674218 4737530 4646245 4594026
14260 4594026 4509570 4443227 4591768 4669444 4745196 4734030 4749580 4772847 4922483 4972990 4803236
14249 4803236 4707282 4751435 5082646 5279243 5193189 5244775 5391459 5211534 5059943 5040785
14239 5040785 5234438 5261980 5241310 5272670 5286029 5324205 5422725 5542286 5528537 5428487 5599800
14228 5599800 5736773 5822717 5936183 5976744 5847127 5980710 6042874 6178425 6360227 6443213
14218 6443213 6349400 6242940 6196799 6346319 6600958 6650399 6741811 6794522 6942236 7001591
14208 7001591 7057539 7174098 7258414 7341809 7368987 7380719 7644806 7900186 7974566 7906219 7960160
14197 7960160 8080206 8195494 8336825 8549812 8672476 8702336 8631632 8879043 9312302 9371027
14187 9371027 9381627 9534767 9619743 9592025 9566232 9779340 9970820 10186823 10225412 10354571
14177 10354571 10380272 10483543 10492884 10589961 10871233 11092099 11217691 11412000 11584036 11702681
14167 11702681 11810371 11786271 11956604 12122193 12345493 12519469 12719153 12732697 12883257 13271886
14157 13271886 13499973 13762770 13934313 14081762 14200657 14305384 14335354 14453392 14586487
14148 14586487 14811185 15071850 15297628 15648346 15955328 16072579 16140767 16152739 16325798 16699881
14138 16699881 16989056 17136372 17322822 17688088 18059044 18230997 18351163 18536079 18878753
14129 18878753 19271963 19482234 19804826 20063676 20278721 20571630 20918442 21316442 21772577
14120 21772577 22279764 22729776 23035779 23384292 23652162 23863727 24222118 24551794 25013394
14111 25013394 25494742 26075083 26555610 26991845 27375762 27933161 28697225 29306238 29510185
14102 29510185 30167920 30739804 31121825 31675522 32402060 33023623 33520908 34070470 34678014
14093 34678014 35329707 35936619 36578884 37179058 37844136 38587606 39338843 40240292 41105886
14084 41105886 41951554 42586984 43283354 44344109 45273088 46008348 46807751 47747094 48673121
14075 48673121 49683335 50501667 51170818 51988596 52850802 53880292 55139479 56261025 57264110
14066 57264110 58446141 59611127 60640739 61536789 62618336 63779459 64861970 65914522
14058 65914522 66960039 68153564 69204249 70106995 71203944 72363088 73372191 74485887
14050 74485887 75643436 76690135 77736207 78903795 79816236 80774410 81851078 82994454
14042 82994454 83945568 84895546 85916579 86807116 87673992 88424428 89067744 89698296 90522147
14033 90522147 91240823 91661590 92158285 92680590 93193370 93599777 93806537 94064014 94332910
14024 94332910 94441818 94507345 94373567 94196958 94233167 94238556 94091441 93925483 93592104 93400649
14014 93400649 92953479 92418376 91917015 91314499 90771753 89967386 89144982 88410012 87658363
14005 87658363 86957548 86171834 85299689 84545261 83664864 82628664 81596048 80572328 79462572
13996 79462572 78493601 77551583 76584262 75545976 74460266 73347332 72196034 71232708 70110129
13987 70110129 68958690 67845074 66704244 65653753 64886347 63937735 62958913 61882320
13979 61882320 60683699 59675330 58685891 57623015 56802025 55949688 55050356 54085425 53213081
13970 53213081 52271411 51412243 50681223 49721346 48974051 48222945 47512441 46730803 45781131
13961 45781131 45069249 44312495 43432824 42513683 41822627 41061402 40341175 39749556 39279497
13952 39279497 38731100 37987003 37479397 36859801 36003887 35447451 34894144 34270339 33762083
13943 33762083 33350212 33042606 32563345 31928477 31184670 30652897 30189574 29788461 29417064
13934 29417064 28911387 28425827 27970611 27528581 27105724 26747613 26549671 26257664 25883532
13925 25883532 25427244 24985417 24536187 24115207 23788641 23333136 22953104 22659670 22453277
13916 22453277 22296402 22092965 21777807 21431791 21054841 20698907 20539180 20413083 20154441
13907 20154441 19711436 19437553 19313106 19024813 18893502 18590161 18290733 18228343 17914202
13898 17914202 17540619 17305208 17123025 16865373 16553514 16431167 16204429 16032552 15887214
13889 15887214 15745233 15430644 15205436 15070237 14786918 14513796 14508537 14341260 14005214 13810836
13879 13810836 13748090 13755377 13702064 13401660 13229102 13165051 13021917 12906291 12760268 12454961
13869 12454961 12312095 12277117 12202111 11911120 11801275 11780411 11651794 11428275 11351192 11220724
13859 11220724 11227512 11160196 10927938 10819043 10792823 10599905 10406409 10235071 10197479 10084919
13849 10084919 10073247 10020305 9845590 9651952 9501580 9444821 9464894 9537519 9651466 9522223
13839 9522223 9320966 9160011 8887829 8744950 8794845 8873583 8749441 8816367 8859568 8725475
13829 8725475 8547313 8435540 8200688 8060201 8073884 7904655 7750554 7818728 7786686 7731142
13819 7731142 7714298 7706229 7616197 7411244 7395733 7381207 7376409 7414115 7347129 7292183 7208625
13808 7208625 7129649 7052845 6874322 6930721 6877766 6673891 6613384 6618867 6566997 6603872 6642516
13797 6642516 6736549 6704386 6658993 6475267 6289905 6225780 6269720 6370784 6296672 6338538 6228896
13786 6228896 6140139 6100422 5976598 6056197 5983007 5869383 5872456 5860452 5781103 5742979 5742933 5618941
13774 5618941 5638122 5684925 5616591 5571815 5718731 5936585 5707400 5458895 5597817 5666112
13764 5666112 5811645 6003039 6036702 6175155 6168762 5937210 5977296 6173847 6183064 6089225 6211221
13753 6211221 6048124 5806558 5680777 5579414 5285579 5175534 5213616 5193908 5023279 5046508
13743 5046508 5041144 4813214 4604599 4574860 4566540 4597609 4509904 4621306 4661797 4479805 4352555
13732 4352555 4304900 4393674 4343145 4317859 4382302 4281098 4164173 4164060 4263357 4251928 4254411
13721 4254411 4045269 3907024 3750657 3687473 3744192 3720257 3881674 3771826 3761914 3705938
13711 3705938 3667204 3696906 3796757 3746700 3741788 3762546 3622275 3422267 3372094 3338911 3369234
13700 3369234 3402818 3212564 3118007 3101415 3116033 3082284 3080204 3176147 3207311 3303251 3426176
13689 3426176 3464360 3241637 3040093 3118782 3199285 3176487 3021375 2919029 2841953 2789487
13679 2789487 2724104 2724556 2941765 3090431 3032215 3011469 3086896 3251015 3131513 2898327 2837135
13668 2837135 2708864 2583774 2603925 2629479 2710865 2758597 2671801 2740246 2866521 3075538
13658 3075538 3138646 2927802 2922437 2977071 3008356 3048610 2895084 2858583 2784218 2745411 2619152
13647 2619152 2583262 2605836 2675466 2673617 2584141 2517189 2475087 2388037 2394252 2511250 2620320
13636 2620320 2532024 2586343 2562651 2520824 2459814 2458431 2276524 2198680 2326479 2548383 2480088
13625 2480088 2339872 2509791 2555220 2411053 2343636 2291164 2181369 2072307 2028887 2076346
13615 2076346 2303295 2282324 2326285 2331234 2259570 2067678 2139078 2176083 2163871 2059247 2073680
13604 2073680 2209132 2204340 2056336 2072285 2204094 2175389 2258130 2184739 2139281 2059246 2181015
13593 2181015 2148024 1958013 1966996 2032902 2006966 2017619 1984366 1914327 1793893 1961145 1938317
13582 1938317 1747268 1625190 1765176 1968005 1989684 1770610 1697008 1898376 2039574 2110916
13572 2110916 2152934 2204423 2107436 2032247 1948063 1981018 2059858 1974541 1733016 1648750 1753265
13561 1753265 1771443 1755727 1671939 1742955 1945770 1959392 2030331 1984014 1903399 1943194 1902284
13550 1902284 1869246 1889747 1853991 1854185 1666267 1626970 1740427 1826020 1762119 1748605 1720902
13539 1720902 1644341 1642159 1599268 1499246 1461965 1586927 1711902 1690971 1558568 1569319 1583240
13528 1583240 1773564 1877719 1839697 1704475 1482749 1346641 1179710 1160732 1191506 1147024
13518 1147024 1048110 1219916 1302854 1275130 1363904 1479227 1527997 1458072 1301624 1302805 1325556
13507 1325556 1495209 1566872 1585104 1562515 1487125 1587807 1593571 1634008 1613136 1576614 1645725
13496 1645725 1647421 1684170 1657608 1481534 1319117 1433087 1495185 1553262 1649735 1597453 1496164
13485 1496164 1457792 1341114 1359743 1262201 1211047 1237112 1200546 1217057 1096250 1193964 1261578
13474 1261578 1408827 1581763 1423441 1478206 1594524 1512161 1394699 1345235 1296591 1156713
13464 1156713 1094867 1239278 1255523 1441048 1459885 1284992 986815 1004824 1070711 1104657
13454 1104657 1105117 1129218 1203177 1271069 1297907 1319428 1410840 1192147 1094663 1276038 1272278
13443 1272278 1341579 1461488 1405829 1320826 1227763 1143900 1120684 1131168 1079332 964835 955748
13432 955748 877851 864308 1105168 1299132 1255308 1195762 972794 890307 1044880 1178219
13422 1178219 1441100 1483843 1436705 1416477 1182154 1095685 955927 1133328 1235906 1091718
13412 1091718 1173291 1197662 1019668 902725 971903 1028007 1096597 1103587 1029136 918790 798045
13401 798045 712781 829093 856348 797648 843665 1001011 970147 1077778 1019408 924208 951484
13390 951484 975486 1006859 1023160 945571 1038793 1133995 1050957 900171 931261 1092770 1164276
13379 1164276 1221739 1070825 944037 1000832 1026325 954138 1063288 1120971 1154397 1189420 1051665
13368 1051665 1138292 1316210 1306605 1221155 1208327 1176239 1134344 1039901 829105 807935 838884
13357 838884 734054 760674 939550 1039499 1174880 1051873 723006 741018 866639 912069
13347 912069 976795 1074148 1089565 1133440 935832 894705 1090100 1034970 973889 942539 977222
13336 977222 887088 858470 829005 900041 872603 887935 930517 784478 855385 857513 733358
13325 733358 545946 732361 718283 625574 687105 634116 473012 424731 536739 659794
13315 659794 781332 753311 716909 767608 846914 934992 995179 977912 901148 816109 838099
13304 838099 793510 717145 694298 856039 852528 886592 859680 816132 905478 909566 934238 830547
13292 830547 750233 967846 1054597 824374 836565 681079 655207 832495 779932 670258
13282 670258 689256 777805 692748 603549 611933 609965 602267 642846 719402 767851 738119 709145
13270 709145 701079 577113 571277 688093 903375 767599 694630 678667 730712 949534 1096383
13259 1096383 893342 654097 604997 565414 674185 778332 662626 765642 719081 626230
13249 626230 726888 808143 926456 1122341 1071030 1073992 947194 809955 848618 816984 787016
13238 787016 652951 667665 640142 554862 709111 819899 900804 964589 1078254 1052395 989117
13227 989117 1002543 971411 955553 993891 939033 1038890 915150 889437 931513 841799 794260
13216 794260 710756 675829 647041 603273 740414 865457 868074 974974 987184 987781 864144
13205 864144 775625 657924 626758 807318 802627 859976 872748 908275 950992 1003812 1008205
13194 1008205 916770 786071 723183 741651 846244 919924 815618 823358 778202 835324 802847
13183 802847 732161 863579 818239 954233 1019241 943928 734944 608854 680044 939430
13173 939430 984100 969552 990570 966183 1042430 923961 776774 880592 946475 689341 786568
13162 786568 1085765 1297083 1138537 1017566 1038970 1125586 1059288 878765 615093 796402
13152 796402 924643 986972 1050982 1275286 1432679 1353834 1169836 1077886 1013128 956965 909056
13141 909056 775127 904994 989126 995802 892394 784840 553727 545238 589891 681745 647798
13130 647798 736448 801572 800894 800921 848097 753958 641826 669244 815932 982049 969094 896430
13118 896430 988407 1061936 1069127 998510 882050 878962 854431 837433 729884 714383 483967
13107 483967 411394 393926 519897 569628 553599 520605 426398 495271 511027 516034 585818
13096 585818 534270 566330 677302 754054 727804 680742 600293 561924 827155 960336 898312
13085 898312 828797 817282 759625 671791 877802 968957 973557 812046 516454 376657 303091
13074 303091 250626 340464 374872 393569 413858 461751 436028 534172 454206 359238 414012
13063 414012 540571 447469 439700 372400 326770 370509 269642 215636 282013 306744 391249
13052 391249 323747 382879 560444 597372 603146 435155 499018 678393 571699 451973 434724
13041 434724 480869 657749 868668 819513 722650 713473 561835 429842 460578 432010 456922
13030 456922 397065 370876 430053 429158 566249 557559 549113 584216 562938 659516 754508 587696
13018 587696 558078 687642 661244 691563 596618 551652 602507 610268 631404 647995 628646
13007 628646 400981 308406 396741 395971 502304 725266 767470 801441 764563 631665 582745
12996 582745 413427 553601 638935 574742 540521 487267 570392 571852 598664 658963 498800
12985 498800 470704 518495 477072 482123 513173 368280 128089 154805 315777 425550 408670
12974 408670 439484 549803 693108 736716 816800 646873 432516 418148 576294 588600
12964 588600 495477 482537 532307 639504 459465 145026 165937 394844 402328 233631 183570
12953 183570 396737 355950 293511 306811 299476 312104 382605 444045 212045 42487 -8861
12942 -8861 84934 281529 335217 474940 431299 418228 293588 333288 520694 694575 648234
12931 648234 513578 312267 415952 613341 530311 389488 446377 427055 354204 349813 519320
12920 519320 479744 366765 376620 345460 315328 221040 131535 176582 351962 514917 422175
12909 422175 272643 89157 -2630 89046 297934 247033 233797 235425 325936 478351 359465
12898 359465 319317 311619 288846 361400 272141 199016 398717 577671 642162 718486 629667
12887 629667 486977 410854 449467 430672 561447 606610 526032 345045 358866 412308 402326
12876 402326 400121 360198 392280 284140 351563 393269 414514 517316 518041 600706 616681 502874
12864 502874 181949 119125 34983 65223 157122 330678 546077 316905 90744 131993
12854 131993 55584 71525 146851 385518 388885 221560 47474 103040 367873 409534 247754
12843 247754 227639 420060 548449 631540 564745 336752 141085 46918 263064 384541
12833 384541 374800 430102 460105 464790 510061 520115 373791 257795 237091 67506 -30479
12822 -30479 98954 74240 -69401 -44347 105845 166864 235317 238547 265723 269910 242251
12811 242251 362892 490404 534310 599412 586658 454607 208114 124798 123044 248468 360210
12800 360210 356136 211168 284756 384247 368536 398827 550270 563291 440980 364709 461425
12789 461425 544388 583382 610761 542317 490865 449076 397923 167305 244882 443411 508144
12778 508144 498846 403207 299543 266455 351333 542805 581153 520054 436068 267914 257871
12767 257871 294876 287980 370960 443090 373592 264032 257759 113781 20379 105178 233204
12756 233204 422081 472637 372894 317359 224164 115500 71724 155999 223705 334256 519188
12745 519188 460821 289374 376489 508088 513480 283748 342785 440723 367969 362918 428926
12734 428926 323088 294740 341701 274422 181930 151149 173477 304137 349804 425906 335670
12723 335670 223518 72659 265903 331897 245553 305687 348770 269615 274061 100935 78161
12712 78161 -78435 72054 246271 154814 140566 139666 -91402 -103394 -13737 59921 -45731
12701 -45731 -11145 213966 418780 346024 278540 318984 380881 307097 354368 379309 135818
12690 135818 5410 1796 142300 388023 611606 583857 531032 335636 315886 478245
12680 478245 507400 496281 394898 352527 422706 348648 237728 137814 121581 102745 137248
12669 137248 91169 155031 163181 168804 179370 268258 228424 149968 91940 162169 177030 247416
12657 247416 278182 59251 198067 167168 123057 121008 192204 254798 247938 313589 310034 249042
12645 249042 266237 269810 103536 -20668 -118774 -129951 -90694 53753 200482 208595 158864
12634 158864 249875 357560 422094 469336 540977 516460 332390 168188 264845 345479 376027
12623 376027 359138 298214 185147 262529 320666 267895 234980 173718 177936 48428 -27362
12612 -27362 22328 190893 180539 169951 173616 195405 115262 -20466 -9360 122804 202549
12601 202549 204503 192186 216633 216450 228266 185941 106697 -30418 25657 203761 346331
12590 346331 450772 456267 181420 33693 139031 266996 195557 160212 192710 49147
12580 49147 91070 -17288 33820 277049 341555 227445 28306 91861 66752 -45041 163499
12569 163499 283691 280182 244935 158336 286006 328160 239209 247792 323499 458572 380018
12558 380018 334856 314995 202449 87625 252267 360132 267961 203206 272864 300518 274782
12547 274782 216514 137881 137632 266568 302866 396052 457014 277154 206919 265191 292981
12536 292981 241721 163597 84488 72672 22180 -73061 -18859 -43918 49256 243532 346025
12525 346025 373444 432487 350854 339799 340345 231541 208917 396951 445737 383418 375762 367384
12513 367384 283890 272958 252240 88081 63110 113713 363387 398630 316291 356645 199372
12502 199372 -31611 -68038 59758 -20125 154377 294099 248872 266645 282740 331068 185149
12491 185149 237418 252975 282350 318757 183761 82098 234580 446291 507228 393541
12481 393541 244388 197308 -109623 -265130 -175078 61808 207512 178817 121665 225700
12471 225700 358313 289053 281834 356961 470911 470836 432374 462568 385955 148220 118404 182790
12459 182790 156737 175743 198250 98632 90888 116595 -57177 128408 411007 489490 366801
12448 366801 185028 35347 20243 69987 98293 37371 113532 46671 2553 259938 489244
12437 489244 561791 402342 319729 268307 206017 204327 139116 190367 308713 228962 223478
12426 223478 247917 228041 263872 184128 238092 224738 178232 -30169 13313 136396 38076
12415 38076 -13905 151297 252330 151270 68202 152686 299914 255781 309222 358763 319632
12404 319632 339003 228735 205831 142947 12446 86172 162859 277086 278831 208589 310267
12393 310267 332674 297607 300375 272118 207997 291487 260768 261198 136272 246080 449111
12382 449111 463152 306771 282934 242671 180594 259115 416447 222561 202409 311743 341371
12371 341371 214774 119813 149454 285544 301748 161521 230121 -3290 103595 76501
12361 76501 -28347 -214128 -74099 68279 187410 235178 108146 103819 57732 105882 186036
12350 186036 164186 327133 191351 152647 194308 351847 574614 506437 375731 250670
12340 250670 271026 72170 -23464 149938 148076 89909 88787 69264 145464 109444 100273 300298
12328 300298 336849 267138 157600 57449 166277 259143 235907 101351 -15427 95186
12318 95186 135175 -76280 -140006 -103864 -72305 -105120 35745 39380 -23697 89447 254968
12307 254968 256226 189839 137644 13516 48444 151922 237157 212514 226186 275962 297052
12296 297052 415507 223771 115834 -60082 14390 8292 59260 199540 337751 249702
12286 249702 159062 245079 311325 278770 121911 144136 177003 240429 202175 75555 231157
12275 231157 279427 188122 183835 273901 383678 414999 339791 228999 116526 224827 151035
12264 151035 43042 131684 122879 91723 237275 201222 -8340 -7213 32345 173444 412194
12253 412194 344082 309257 327465 368451 318553 162596 114879 117116 144635 281335 305994
12242 305994 429725 493663 227384 61070 83731 294427 360128 303991 71917 -91387
12232 -91387 55314 71821 82405 78811 -21444 129422 254924 401845 283664 287113 262057
12221 262057 386058 282463 231776 379932 384070 298175 221894 104123 120960 169720 249465
12210 249465 272790 419204 486884 358965 294797 331743 368345 444930 398222 308877 284478
12199 284478 351295 310595 142517 65654 250048 258226 142441 259307 229633 92595 61571
12188 61571 17002 175680 165946 107496 120451 58901 58027 66052 67943 45691 -7492 -90362
12176 -90362 -15329 175089 173993 65356 -143356 -143457 -70178 -24676 10613 41194 -37541 -72657
12164 -72657 10278 15089 214946 363107 410813 307691 258713 279005 141919 87573 150788
12153 150788 34295 21743 97633 159164 184534 181556 318224 308461 268651 64837 105
12142 105 49559 125718 228126 168217 67661 15613 52223 219 15640 77768 272062
12131 272062 393622 413852 256673 81689 -7772 -25579 219328 259833 118481 113626 163714
12120 163714 168796 205840 72368 76578 264921 281670 181228 249525 291773 327288 291500
12109 291500 209557 35866 48964 -9871 44592 110650 159807 102204 85911 141409 178209
12098 178209 245276 433292 215022 96974 151502 284075 302140 303789 224152 170529 80911
12087 80911 30419 -41771 67647 107560 108661 -30530 -70653 16792 104074 71573 19524
12076 19524 167347 337605 371421 409074 359234 438523 436936 299747 320452 272992 203012
12065 203012 230551 255614 307941 378425 291814 313406 295416 339010 313593 46379 -124600
12054 -124600 -83998 -132962 -242362 -220258 -150853 -32447 104138 -3522 -7261 145368 222998
12043 222998 196533 126117 56829 123855 113057 162234 200056 122805 -2226 -61118 -49251
12032 -49251 34451 36976 79623 64167 -147296 -164791 -100307 -40343 -40015 -7694 40931 -110266
12020 -110266 -113711 150695 178396 105992 -43472 -185340 -97812 -112714 -227681 -341804 -158910
12009 -158910 -102990 -148121 -129868 -34140 80192 109107 72077 57254 -23052 -38846 -36687
11998 -36687 -80681 102337 -8714 -26513 -164621 -287792 -232280 -231812 -221908 -240578 -210359
11987 -210359 -10396 49892 80214 206919 170615 84624 -21076 -133304 -57947 84993
11977 84993 121322 13118 -50702 18582 88357 137578 172687 266313 182047 271940 274764 151134
11965 151134 43797 106623 62935 6061 -138584 -211020 38263 141943 70512 36069 94067
11954 94067 57126 -28176 -62336 19543 39487 -35222 -41733 70048 91655 106368 -134844
11943 -134844 -222944 -170211 7259 -46251 -13067 176376 352053 279181 60616 -1079 -118240
11932 -118240 -148798 -179276 -117068 -32464 78938 -12565 -87797 -180477 -167796 -109278 -24403
11921 -24403 54556 -46798 -57382 97408 110046 163270 126833 43524 -153635 -304507 -156725
11910 -156725 -8221 97506 137466 105984 162502 192532 100825 10087 59305 -18150 -49433
11899 -49433 -64236 -18404 119925 34225 22332 56538 56959 20608 710 -150497 -196186 -2181
11887 -2181 72347 149767 151084 79565 165026 280566 185178 106407 98715 142070 139012 242725
11875 242725 171380 -20198 -98989 -227372 -185098 35133 60740 173065 124336 93967 94813
11864 94813 219970 269263 258688 269588 225858 2979 44807 -3419 -205184 -405470 -327474
11853 -327474 -208094 26266 145670 116557 149227 79215 -9424 -6579 38114 17612 -44078
11842 -44078 -74487 127969 390340 358680 163063 26460 39309 65707 52255 55390 51884
11831 51884 -1750 -3203 31105 -36410 5268 126581 221169 247836 -22840 -121584 4101
11820 4101 71999 15510 -14302 97030 59653 563 51829 61128 14644 -7224 22897 -72746
11808 -72746 -204318 -205469 -111861 180442 198256 138460 85796 43371 -100180 -184957 -133430
11797 -133430 -167816 -31918 118429 121584 41555 -47454 -94621 -108273 -100224 -59567 -27001
11786 -27001 -123618 -171092 -88673 26753 -109101 -332132 -246385 -203217 -169237 -109214 47497
11775 47497 87467 41397 -40545 -19238 56027 4961 22971 30840 -167628 -260040 -81099
11764 -81099 -115041 -176646 -48800 -117492 -147577 -175477 -132349 -124108 -110200 -126063 81754
11753 81754 147588 149917 132542 15402 -376 20723 -104993 -158132 -229393 -228814 -141213 -66859
11741 -66859 -80362 -98045 -207212 -192646 -13338 284685 182449 21249 31181 70862 29407
11730 29407 -50721 59573 105239 44535 157943 277269 176339 134645 64157 -62296 -178994
11719 -178994 -111817 -106103 -46033 -57947 122584 164167 202698 118870 60827 20674 63259
11708 63259 32384 35768 61990 -8571 -144315 -190233 -79616 -172226 -170005 -99675 -120546 -205777
11696 -205777 -209438 -113353 22451 182236 50985 26935 29659 -21318 -67444 5184 198571
11685 198571 136734 127311 178260 220137 154192 4702 25105 114431 42300 -175854 -149454
11674 -149454 -169410 -314130 -202007 -130380 -24903 63130 214577 111031 -23003 -21286
11664 -21286 101789 135487 230900 395866 425117 227914 115732 177490 -52649 -192442
11654 -192442 100807 355619 193174 33534 -26738 -121562 -36751 -93230 -126783 38678
11644 38678 114865 92967 66052 -107996 -153439 -131384 -256790 -380549 -432436 -420894 -286066
11633 -286066 -165819 -56126 -104007 26890 27199 30059 127381 113938 154904 167921 31773
11622 31773 -3050 54596 176338 436533 465430 522087 264417 86714 20763 -10228 -21005
11611 -21005 28680 117874 180803 302792 293407 298386 289009 206432 -87309 -143270 30304 130713
11599 130713 258133 234373 18323 -128143 -156290 -27458 -179707 -142598 226643 525382
11589 525382 700280 673451 690985 487210 364275 245406 87779 -101457 -202999 -363193
11579 -363193 -383974 -91301 156895 211448 116239 -214895 -307907 -192009 -154138 -178403 -104458
11568 -104458 -161517 -182011 -84609 187877 501799 461817 284416 230754 141843 60815 49059
11557 49059 -121950 -216512 43707 228619 115259 61326 186815 197164 169475 303476
11547 303476 227067 21420 -155094 -308221 -314789 -356804 -272315 -165283 -148300 -55540 -151361
11536 -151361 -196803 -173711 -131334 -212544 -231778 -118780 7447 -37150 201862 306000 199794
11525 199794 157472 115927 8219 -5576 -2854 -13172 69643 -15254 -90011 -58984 147515
11514 147515 182642 139909 66739 -53821 -20967 -7826 85100 193177 224601 151039 196323
11503 196323 108350 -107168 -238097 -303687 -149882 -109238 -113598 -46109 -49834 -50158 -253535
11492 -253535 -221203 -37639 40286 -46535 -107701 -91916 -82987 92964 192068 231798 234985
11481 234985 151432 104325 168469 85350 -97462 -343738 -264845 61941 35108 -130093 -145965
11470 -145965 -264528 -130261 -122382 -208711 -117513 -29409 -47713 -106423 -74463 144019 26902
11459 26902 -15886 -99892 32099 81929 3447 -68650 -4063 57247 114795 193709 65874
11448 65874 -2891 118184 244655 448171 381052 378281 399798 318091 210438 180510 166848
11437 166848 288382 355087 349951 248447 175462 117577 299825 365826 327171 311737 152854
11426 152854 60521 214486 123882 -40115 -27783 162662 176326 8472 66879 183576
11416 183576 157264 223366 345297 291449 308661 271864 170894 27573 -154626 -379381
11406 -379381 -343434 -214467 -101624 -104586 -13698 -174388 -177645 -174353 -50659 30802 37381
11395 37381 292233 154028 -82631 -157314 -151972 22354 67104 55973 -34491 -32984 -97769
11384 -97769 43569 91399 153242 223218 200673 324823 299703 227630 231293 74768 -77223
11373 -77223 -84751 -94851 36491 140735 67126 62507 32928 181019 164496 40408 -193339
11362 -193339 -187410 38983 244358 376175 366015 272896 132160 60906 -15851 162231 254109
11351 254109 148496 34 121744 196582 772 -103833 -85547 -147603 -158300 -67199
11341 -67199 -14301 -86325 -40408 126859 191128 190434 90516 -75192 -199101 -281260 -243590
11330 -243590 -313339 -221757 -256746 -339724 -250702 -288924 -173840 -122102 -44565 67428 -131048
11319 -131048 -101415 9726 66174 131504 97942 102934 -105358 -81128 76138 148407 81093
11308 81093 79821 50051 -57199 -236516 -388166 -485785 -467740 -241887 -79419 -110372 -171714
11297 -171714 -129267 51984 69542 42011 44201 15144 47962 -5040 165634 356996 354204
11286 354204 162151 -16984 94529 163049 81854 75271 31096 48837 22816 139151 136755
11275 136755 152374 191276 168038 241082 89520 126560 239214 304601 295402 335597 245745
11264 245745 284831 58486 -55171 -126838 -174442 -328478 -404220 -444454 -233029 -39059
11254 -39059 6204 -79601 -32709 127076 206657 261889 162233 44966 3851 -108744 -162384
11243 -162384 -138651 -140276 -184766 -161109 -115634 -109436 64345 52800 94037 177173 208990 145789
11231 145789 -4322 -112531 -94861 -130262 -150995 -88615 -126248 -135441 -2797 142110 92531
11220 92531 63063 87693 -72859 -65082 7995 -62368 -137452 -244423 -157765 -81243 57219
11209 57219 168393 262750 129621 35831 42363 32356 77227 15631 52295 128867 177562
11198 177562 -10814 -355230 -527374 -412942 -358622 -383627 -166141 -49232 -100702 -174239
11188 -174239 15372 182829 221723 281738 371519 257100 243271 208979 83660 -56867
11178 -56867 -7122 -58641 -2268 -85753 -155472 -222277 -99546 11443 240872 341060 317589
11167 317589 278349 315803 327700 429344 321924 134129 -47739 -119646 -213931 -63801
11157 -63801 111669 42964 58195 228555 112054 71415 7687 87577 39531 135214 304095
11146 304095 237377 -34754 -147339 -69625 -8039 -77329 -73277 -190438 -260566 3197 171297
11135 171297 246567 262845 210855 4997 -100367 -198941 -148362 -51269 -28433 77761 89302
11124 89302 -17738 -50557 105457 286362 364935 207288 176891 18572 -15353 84994
11114 84994 139393 195280 222422 113055 44259 147344 179633 152244 168115 156950 216949
11103 216949 422433 326279 171154 103083 -104667 -155571 -10890 25992 142801 186479
11093 186479 130749 -101197 33747 179588 78627 -85622 8121 44073 56865 45879
11083 45879 61300 128254 174774 154354 119661 190884 191329 228457 331958 421045 331924 189209
11071 189209 54354 -103349 -6349 99072 57233 133263 170225 90884 53893 16464 2187
11060 2187 -17649 -131826 -316400 -193854 -144886 -190961 -29012 106767 5359 -69529 -58475
11049 -58475 141558 217340 144035 304122 316604 134252 100320 157843 88892 -80866 -53143
11038 -53143 -29934 88458 166963 34159 -22697 -32491 -124501 12336 38539 41623 260021
11027 260021 273163 131557 89717 15052 -209933 -262397 -142392 -120469 -149550 -76755 -167887
11016 -167887 -169296 -111308 -115573 -57183 -86565 -166015 -94194 -78011 146914 159518 213075 195165
11004 195165 71792 52291 150915 135734 84284 88980 56310 -61024 -22135 60778 -40732
10993 -40732 -217659 -388207 -326788 -225299 63497 158818 176788 90548 -102563 -165566 -216993
10982 -216993 -27519 -68633 -217316 -330289 -213635 -44823 -50886 -142816 -54182 59758
10972 59758 15383 -55312 -136175 -167421 -184676 -176854 -155278 -113225 -34260 32122 129714 42124
10960 42124 104190 80000 30624 262723 159451 102199 38058 -31230 10606 17609 118062
10949 118062 154641 -64790 -51632 155069 188005 97222 60307 119765 70282 -5731 749
10938 749 -110436 -37233 78103 175137 261355 256789 257938 120243 119650 46223 45479 50767 -8420
10925 -8420 -182183 -315727 -185391 -82941 58457 -3290 21432 -91020 -96684 -66844 102790
10914 102790 58077 22462 -56429 -54189 -131535 47974 219141 157064 -11694 -74106 -46864
10903 -46864 23779 125939 178229 104880 174687 283657 159483 -47016 -102885 -87394 -135166
10892 -135166 -168490 -182554 -186350 -132286 -65396 83413 10060 15394 -6060 71364 3141 56471
10880 56471 67220 -24635 -8117 127095 101522 17465 67295 -47387 55427 78543 -1097
10869 -1097 14815 37082 25683 132873 25264 -228775 -320693 -218790 -148058 -105821 16465
10858 16465 83614 121108 218485 173045 25764 128968 170761 173065 81057 -80651 -150806
10847 -150806 -39533 -195602 -269006 -226082 -154216 -162789 -236605 -123604 -74350 49957 191422
10836 191422 125853 -27 -167469 -258536 -225109 -175392 -216690 -122550 -115151 10581 135395
10825 135395 73378 225720 132290 117803 -69115 -120092 -8404 116484 273989 180286
10815 180286 128175 80979 103429 143556 277244 263402 153947 23302 -41112 -91340 18986
10804 18986 51215 47382 189766 163350 -12966 -7062 -93691 -161547 -93910 -10619 245688
10793 245688 253943 63211 -43735 21596 106044 -112334 -184040 46229 120993 -32543 -126819
10782 -126819 -2078 -26817 -37461 -36393 -71611 43843 157885 293079 216153 -17243 -40650
10771 -40650 128683 165017 117021 -76155 -224613 -147555 -15400 37434 -102963 -59112 97462
10760 97462 40228 107219 138840 89939 -16044 -171103 12889 138112 46521 22004 -49608
10749 -49608 -28630 25706 54387 17765 108602 49029 -120640 -71016 -42838 -150627 -122028
10738 -122028 -131120 -48120 -1932 -155338 -303681 -187382 -98881 -54561 -69175 -172233 -119335
10727 -119335 -130073 -202143 7760 213087 347852 416864 269248 -2232 -22314 78702
10717 78702 -24031 -64548 115170 98533 -101443 -191560 -193331 -195240 -33831 -875 19190
10706 19190 119276 -45263 -98054 -178200 -153288 -164662 -77903 -3276 132579 170802 48933
10695 48933 23772 -112157 -188119 -205843 -117713 -56257 -198833 -175604 -94317 48367 110426
10684 110426 -33340 -133022 -48586 64621 -16333 30282 153534 151240 -23182 115528 324411
10673 324411 275944 112117 91278 109760 -118818 -418231 -532850 -430987 -338240 -219010
10663 -219010 -100628 -102290 -97657 -123483 26861 127934 82172 -71614 -117823 -216852 -254961
10652 -254961 -309742 -222020 -65664 94869 162288 137659 281171 200263 58586 46301 66262
10641 66262 108147 14943 -212357 -35991 74328 110414 74657 -30372 -169639 -175519 -34399
10630 -34399 108084 123382 122097 -77519 -95540 16426 -67327 -69954 21940 -28896 40612
10619 40612 156579 166761 193760 258071 85351 96114 150622 10182 -159996 -251426 -202301
10608 -202301 -46123 51581 135252 78788 -15914 -89113 66835 116658 42334 91728 130579
10597 130579 114155 177771 63169 8215 12866 -54482 6448 33150 102138 -10260 56262
10586 56262 90991 145206 104689 -23796 13703 -146632 -260770 -213162 53786 199745 183436
10575 183436 62097 -98870 -137008 -132671 -61826 -206037 -242040 -185364 -176934 -59518 31844
10564 31844 201951 200591 1856 -134077 16988 54075 -59353 -34575 -81502 -108716 -248830
10553 -248830 -244798 -83840 89591 87829 -163265 -239847 -158280 -67547 5776 28380 66727
10542 66727 -19244 -128281 -204760 -62765 36692 101367 129663 51250 -5111 -4988 -78253 -157841
10530 -157841 -128472 -37780 52118 36148 104168 40623 -42749 -115393 -42830 -137237 11666
10519 11666 243 -196395 -294753 -339277 -418487 -422725 -162641 64654 146577 192576 190207
10508 190207 221338 194562 142543 154697 158167 141657 110754 182263 186245 139464 16793 14349
10496 14349 -1958 3565 -70199 -22749 -7979 -122313 -69655 -29302 -308064 -431531 -371721
10485 -371721 -331063 -251176 -221636 -192492 -179913 -165654 -212456 -235698 -39321 21294 2965
10474 2965 -13270 74934 120656 132104 175856 311354 268041 153447 238452 279509 20112
10463 20112 -8777 -90105 -193181 -189367 42760 51268 -98278 93194 156520 8678 137
10452 137 -136871 -131474 -108855 -131037 -26572 -48247 -21363 4490 -52533 -119526 -41908 7496
10440 7496 29742 48905 47250 26952 81132 100622 107308 122789 84630 31392 -69380 89504
10428 89504 44352 6556 -21299 -55332 -49444 62416 30834 -63383 -91144 -135279 -90675 4781
10416 4781 63590 33480 86045 136318 59328 30862 80651 -34951 -138218 -54234 -87937
10405 -87937 -240007 -223734 -183550 -187796 -168114 -93863 -24604 -52021 -208787 -193404 -194597 -191754
10393 -191754 -128636 67448 235681 194688 151412 32263 -179590 -254086 -235212 -190699 -55935
10382 -55935 17651 -87091 165074 254120 41965 144171 99240 139208 243313 201335 84473
10371 84473 49022 -21662 14590 79015 -16362 -138786 -221709 -309070 -343650 -180930 80154
10360 80154 95791 -53349 -170789 -77532 -164430 -240950 -137337 -66052 -183515 -115881 -209733
10349 -209733 -171577 -124593 -128822 -133612 -158934 -31312 86897 92977 107188 109390 4483 11485
10337 11485 -84022 -274012 -252001 -179435 -274422 -224988 -172396 -134305 -4853 100667 -72459
10326 -72459 -128947 -62920 -29488 -32434 32050 47425 -46758 -160015 -200648 -223838 -144275 -182333
10314 -182333 -194913 -76703 -119883 -141788 40566 89748 28543 -31286 -64768 -26582 -19456
10303 -19456 31627 35732 -51039 11863 175563 221528 135815 77024 -34245 -141594 -193636
10292 -193636 -110985 -76170 -121424 1534 -40635 -132890 -71476 2527 174585 217725 277749
10281 277749 25167 139002 333847 195827 45465 58023 28942 -2883 -115470 -69945
10271 -69945 -218518 -280071 -354255 -392069 -491091 -324539 -162192 17878 91398 -19850 -183762
10260 -183762 -129609 5278 -89142 -43654 59918 -136312 -254600 -271821 -324216 -314501 -190551
10249 -190551 -64483 -97628 -202531 -298292 -221071 -203271 -66399 57532 44556 -47757 -32798
10238 -32798 -89841 -35003 154654 193418 269664 178834 133721 33047 31177 41365 20275
10227 20275 -19326 72574 37005 -88488 -150164 -32806 24123 -76806 -120481 -32795 -126971
10216 -126971 -303006 -295292 -160772 -81188 -59658 -64280 -52071 -53721 -15256 100009 33503
10205 33503 -21811 69704 198499 312660 161062 59807 129215 -72911 -245186 -271196
10195 -271196 -233472 -255920 -163329 -79474 -2089 77431 91935 105735 -74121 -142598 -287735
10184 -287735 -321879 -107905 -88953 -144761 -220394 -151183 -48311 2345 -72438 -104299 -170857
10173 -170857 -105244 47716 254723 232970 153389 49001 17635 -26587 -115120 -28023 -70725
10162 -70725 -51820 59809 -39726 -68002 -43688 -47629 49495 62763 7198 -92677 -143910 -110177
10150 -110177 -181293 -93574 10677 -83344 -178326 12489 173091 70241 -33431 -46629
10140 -46629 -78072 -116310 -113460 -85559 -33792 -3850 103887 9555 -19148 63970 -92650
10129 -92650 -221691 -209143 -234712 -196187 -98583 -10658 49292 78814 -53252 -144760 -121732
10118 -121732 -186494 -276394 -231500 -264184 -254666 -153063 -143134 -171166 -191091 -59829 -90767
10107 -90767 -356646 -352571 -134074 -51171 -5306 -36447 -44409 -27078 -72277 -64884 52017 -11337
10095 -11337 -165729 -178033 -92879 41749 156830 123182 39354 36243 43906 8885 -15655
10084 -15655 -119251 -38601 -1130 -25550 115725 112570 -11917 -29352 -53496 32090 37625
10073 37625 50865 -210717 -243677 -221000 -319114 -227173 -86716 -54450 -173928 -218171 5165
10062 5165 165852 129873 -122994 -403287 -330713 -216569 -196269 -197674 -79166 101113 186889
10051 186889 -63659 -69250 63884 154188 131564 157358 136486 95365 134028 51883 1357
10040 1357 -32007 23296 32893 137271 214944 110481 77518 87710 50363 -1504 -66013 -136496
10028 -136496 -211546 -217914 -166039 -58365 -210364 -216122 -106014 9714 153132 151082 -3452
10017 -3452 -7852 170618 151164 80588 -3583 -86267 -182983 84032 140009 77218 -19429 -85669
10005 -85669 -111975 -226730 -180747 -97928 -138166 -21689 60419 -36462 -246517 -178330 7807
9994 7807 132187 16956 -94325 -144104 -186488 -212260 -184699 -178664 -125256 -57359 -40273 103810
9982 103810 59025 -24033 -23294 337649 496343 358941 70043 -182370 -242362 -88411 -78482
9971 -78482 -40807 -48117 -137564 -145850 32041 209051 163881 63266 -9932 -196406 -156903
9960 -156903 -154013 -249701 -367985 -405551 -424029 -350283 -300186 -287787 -266400 -177545 5764
9949 5764 41476 -17163 136922 59037 -38928 -54915 19185 -28933 -131419 -37760 17870 67357
9937 67357 -51531 -13223 67841 11641 154209 288689 91360 -41597 -40247 -64337 -30920
9926 -30920 -139543 -177169 -62591 -129937 114482 -37551 -82442 99852 66543 -46750 -175526
9915 -175526 -180333 -40856 67294 42556 -238340 -391064 -388122 -293111 -246343 -155513 -27820
9904 -27820 -68194 40083 216782 194868 239732 96356 66659 162031 179238 179270 200718 115932
9892 115932 108401 91769 71108 4932 -14580 9731 80316 113223 123794 71148 130223 246150
9880 246150 297843 294602 368054 277852 42306 179922 415735 373290 33761 -29335 -5637
9869 -5637 -6547 8306 -45580 -174693 -395287 -393625 -284829 -163852 -47166 -94602 -91418 144892
9857 144892 271788 328459 353019 328346 139833 42966 122051 188309 181799 43803 -15795
9846 -15795 -94166 -61859 -238471 -208978 -115718 -130869 -94783 -102908 -155923 -132606 -44362 -48413
9834 -48413 -152965 -180717 -103988 -319331 -298183 -269498 -312016 -418303 -339359 5703 9589
9823 9589 -160394 -147297 -134907 -121584 -116888 -223164 -176533 -213248 38110 210558 237300
9812 237300 139675 105225 177061 118320 -75132 -154852 -139058 49257 2434 -118391 -50777
9801 -50777 -137217 -172899 -234709 -247348 -319914 -240845 -332281 -351519 -153536 77160 133936
9790 133936 -25871 -229877 -238101 -229559 -100638 -121860 -359471 -318803 -65141 67698 109608
9779 109608 162591 36055 -146349 -89968 27607 93391 86030 49690 130948 109956 148109
9768 148109 90999 117456 61846 48247 52779 44618 58740 56797 6042 -112281 -165621 -225530
9756 -225530 -77711 -80007 -165547 -230223 -157509 -130772 -197753 -100849 -115762 -63572 -1965 86614
9744 86614 -31169 -164193 -77065 33189 -53647 -210153 -168515 -128881 -169106 -132730 -60556
9733 -60556 -53193 -185160 -235113 -246090 -242193 -155471 -80607 -62620 -97399 -141456 -151998 -264392
9721 -264392 -354782 -256684 7751 71669 138432 85290 60322 128455 -36679 -126676 -84326
9710 -84326 37341 -20319 142933 147247 -22341 -53969 -145819 -14820 33603 -62482 2178
9699 2178 95267 220170 71834 -189736 -152524 -5372 63785 1925 -85324 -42856 -41839
9688 -41839 -127008 -74462 119000 273332 191678 84677 4174 -40366 -51938 100924 18322
9677 18322 -149892 -209495 -252138 -183499 -80285 -167525 -222858 -200273 -224615 -292151 -208514
9666 -208514 -49588 -13790 -137816 -51039 113257 120398 -1089 -149730 -286680 -390775
9656 -390775 -177102 145412 148908 186398 198707 92999 8522 -53993 -107333 -104190 -189396
9645 -189396 -124696 -28135 -24798 109820 357274 323725 170386 91022 25087 -178259 -343466
9634 -343466 -369671 -200809 -43729 96580 57231 -114989 -183636 -224859 -359336 -250765
9624 -250765 -111442 -169579 -95563 34563 -111772 -145737 -59188 166616 245840 107882 158716
9613 158716 128578 95307 -10543 -190776 -586 81517 -48579 -174966 -204155 -77093
9603 -77093 12048 -50897 -138467 -86793 -169074 -207002 -287865 -365401 -364745 -179380 -77507 185560
9591 185560 195219 82963 52339 21136 107853 212350 269337 299134 23921 -125934 -105790
9580 -105790 -81596 -139842 -250302 -410240 -275661 -94307 -104710 -92033 16576 -39605 -7757
9569 -7757 35066 -123832 -179692 -244330 -313056 -345248 -297556 -225232 -217585 -207820 -190543 -76367
9557 -76367 -54574 -54255 22850 26761 13433 -7323 -21101 7445 13252 -169795 -309742 -289919
9545 -289919 -81280 37410 72070 7512 -6557 -28947 -178965 -155057 31974 36981 -55669
9534 -55669 -94294 -199893 -159757 -196350 -141184 -56730 -122721 -165475 -117714 -100479 8834
9523 8834 -137351 -171930 -199188 -229744 -46206 89151 128309 199288 255434 129589 -22048
9512 -22048 43758 50687 -52748 -173826 -60558 23283 2708 25980 75475 9371 -87580
9501 -87580 -127640 -92377 -44859 -46680 -247482 -264576 -132012 -125172 -247007 -184472 -151714 -128695
9489 -128695 -165095 -186386 3909 110160 52122 -68690 -151866 -106817 51999 102323 -103602
9478 -103602 -167680 -329979 -381803 -267402 -142533 -238849 -336336 -167702 -43348 -70045 -142094
9467 -142094 -66444 -40677 -59719 69877 -7905 6192 59235 18681 95648 186275 342924
9456 342924 297530 212057 173788 -71508 -204028 -251600 -248014 -190215 -110731 -220362 -185949
9445 -185949 -64654 -88937 -195868 -155426 -230408 -282197 -247470 -180312 -23318 114218 78755
9434 78755 60980 51427 -97881 -328867 -267887 -81198 -149048 -62012 -114104 -143479 -142057 -109081
9422 -109081 -209008 -227067 -53601 110197 188959 34395 -71764 21808 98128 29609 -39912
9411 -39912 58846 39978 139468 100459 29959 85889 58929 116204 199986 177249 116765 75418
9399 75418 124708 190845 106111 43643 -103709 -122724 -28949 -78825 32095 181928 239372
9388 239372 -37346 -149882 -135297 -9621 -25909 -116040 -251870 -221851 -199055 -138539 -114274
9377 -114274 -15151 -2461 -182011 -284255 -319698 -376935 -188458 -132249 -125768 46557 82465
9366 82465 106213 8945 -62424 -168781 -101558 22197 -63428 -105594 71765 93346 -31795
9355 -31795 -70645 -60370 -17836 -65957 -118936 -101253 -186457 -33131 162817 237436 156860
9344 156860 37279 -57274 -81988 -158876 -211251 -76639 -63144 -20703 130278 224460 198966
9333 198966 175372 157291 48775 236703 321526 77666 21935 -2826 7117 -93441 -64982
9322 -64982 73041 127446 78809 19019 31579 97922 203196 164655 53501 -23220 -26272
9311 -26272 -98138 49228 134617 126226 31019 -44410 -15712 218263 280459 145001 139616 14795
9299 14795 -108402 -80736 50473 92908 2220 5785 -82925 8454 -5497 -31960 66166 110659
9287 110659 131074 194729 193393 215282 151692 155861 199410 185753 208565 320392 500907 484939
9275 484939 259243 209777 278678 317810 294268 365012 428067 435274 396386 277832 113435
9264 113435 77516 184475 196932 102112 68476 30630 159998 334230 475601 365363 363644
9253 363644 492466 456148 267651 305769 406115 444164 347393 304313 267011 370118 496869
9242 496869 451014 428269 542594 613776 571969 610013 733372 590008 496602 234376 338413
9231 338413 691640 735346 518746 364360 306291 385893 576818 606519 505592 725559
9221 725559 1008961 1176966 1078885 952344 1036002 1131599 1183059 1221449 1346973 1307698 1231953
9210 1231953 1262006 1398732 1712909 1831466 1719137 1746719 1893585 2030901 2263854 2456568
9200 2456568 2502662 2563661 2807289 3076245 3211276 3333363 3467259 3717483 3985526 4220728
9190 4220728 4626896 4803926 5062013 5518604 6080303 6488795 6734231 6966822 7459958 8180356
9180 8180356 8899174 9222521 9559790 10242130 10856243 11237030 11670717 12184687 12637806 13112837
9170 13112837 13660764 13992839 14370952 14603946 14824917 14933538 14870354 14606923 14345976 14036312
9160 14036312 13843752 13716976 13375983 12826364 12327635 11842736 11228152 10775311 10233296
$$ [...]
##END NTUPLES=NMR SPECTRUM
##END=
