##TITLE=Analysis number 307091
Compound Code km 08144
Book Reference 2
Project Code adrs
Chemist Name fudan
##JCAMPDX= 6.0         $$ Bruker NMR JCAMP-DX V2.0
##DATA TYPE= NMR SPECTRUM
##DATA CLASS= NTUPLES
##ORIGIN= Bruker BioSpin GmbH
##OWNER= NMR
$$ XWIN-NMR		Version 3.5
$$ Wed Apr 20 14:10:40 2005 GMT Daylight Time (UT+1h)  MAYBRIDGE\NMR@NMR_250MHZ
##.OBSERVE FREQUENCY= 250.131544655141
##.OBSERVE NUCLEUS= ^1H
##.ACQUISITION MODE= SIMULTANEOUS (DQD)
##.ACQUISITION SCHEME= undefined
##.AVERAGES= 16
##.DIGITISER RES= 18
##SPECTROMETER/DATA SYSTEM= dpx250
##.PULSE SEQUENCE= zg30
##.SOLVENT NAME= CDCl3
##.SHIFT REFERENCE= (INTERNAL, CDCl3, 0, 16.4482)
##AUDIT TRAIL= $$ (NUMBER, WHEN, WHO, WHERE, WHAT)
$$ ##TITLE= Audit trail, XWIN-NMR		Version 3.5
$$ ##JCAMPDX= 5.01
$$ ##ORIGIN= Bruker BioSpin GmbH
$$ ##OWNER= NMR
$$ C:\u/data/dgb/nmr/ADRS/1830/pdata/1/auditp.txt
$$ ##AUDIT TRAIL=  $$ (NUMBER, WHEN, WHO, WHERE, WHAT)
(   1,<2005-04-20 14:10:20.01 +100>,<MAYBRIDGE\NMR>,<NMR_250MHZ>,
      <created by zg, POWCHK disabled, PULCHK disabled
       configuration hash MD5:
       62 19 C7 07 E1 42 D1 B7 37 6C 3D D0 77 39 F9 E6
       data hash MD5: 64K
       2E A6 1A 32 6E 65 5D 9B 59 35 4E 6F 39 41 B1 CE>)
(   2,<2005-04-20 14:10:31.58 +100>,<MAYBRIDGE\NMR>,<NMR_250MHZ>,
      <Start of raw data processing
       ef LB = 0.3 FT_mod = 6 PKNL = 1 SI = 32K 
       data hash MD5: 32K
       E5 CA 14 FC B0 17 D4 E7 F1 22 4A B8 DD 54 8D 3B>)
(   3,<2005-04-20 14:10:33.10 +100>,<MAYBRIDGE\NMR>,<NMR_250MHZ>,
      <apk 
       data hash MD5: 32K
       F9 31 27 B8 B1 9F E8 40 AD 46 36 62 33 C5 23 B5>)
(   4,<2005-04-20 14:10:33.76 +100>,<MAYBRIDGE\NMR>,<NMR_250MHZ>,
      <abs ABSG = 5 
       data hash MD5: 32K
       62 37 14 FE 61 CF 1E 9E 3A E9 03 8B 04 5F C1 86>)
$$ ##END=
$$ 
$$ hash MD5
$$ 3E 03 43 90 58 4F CA C5 9A 1D 06 A6 47 F2 E2 04
##$RELAX= 
##$RELAX= 
##$RELAX= 
##$RELAX= 
##$RELAX= 
##$RELAX= 
##$RELAX= 
$$ Bruker specific parameters
$$ --------------------------
##$DU= <C:\u>
##$EXPNO= 1830
##$NAME= <ADRS>
##$PROCNO= 1
##$TYPE= <nmr>
##$USER= <dgb>
##$AMP= (0..31)
100 100 100 100 100 100 100 100 100 100 100 100 100 100 100 100 100 100 
100 100 100 100 100 100 100 100 100 100 100 100 100 100 
##$AQSEQ= 0
##$AQ_mod= 3
##$AUNM= <au_zg>
##$AUTOPOS= <22 >
##$BF1= 250.13
##$BF2= 250.13
##$BF3= 250.13
##$BF4= 250.13
##$BF5= 500.13
##$BF6= 500.13
##$BF7= 500.13
##$BF8= 500.13
##$BYTORDA= 1
##$CFDGTYP= 0
##$CFRGTYP= 5
##$CHEMSTR= <none>
##$CNST= (0..31)
1 1 145 1 1 1 1 1 1 1 1 1 1 1 1 1 1 1 1 1 1 1 1 1 1 1 1 1 1 1 1 1 
##$CPDPRG= <>
##$CPDPRG1= <>
##$CPDPRG2= <>
##$CPDPRG3= <>
##$CPDPRG4= <mlev>
##$CPDPRG5= <mlev>
##$CPDPRG6= <mlev>
##$CPDPRG7= <mlev>
##$CPDPRG8= <mlev>
##$CPDPRGB= <>
##$CPDPRGT= <>
##$D= (0..31)
0 1 0 0 0 0 0 0 0 0.06 0 0 0 0 0 0 0.0002 0 0 0 0 0 0 0 0 0 0 0 0 0 0 
0 
##$DATE= 1114002619
##$DBL= (0..7)
120 120 120 120 120 120 120 120 
##$DBP= (0..7)
150 150 150 150 150 150 150 150 
##$DBP07= 0
##$DBPNAM0= <>
##$DBPNAM1= <>
$$ [...]
##$SUBNAM7= <"">
##$SUBNAM8= <"">
##$SUBNAM9= <"">
##$SW= 20.6930455092707
##$SWIBOX= (0..15)
0 0 3 0 0 0 0 0 0 0 0 0 0 0 0 0 
##$SW_h= 5175.983436853
##$TD= 65536
##$TD0= 1
##$TE= 295.16
##$TE2= 300
##$TE3= 300
##$TEG= 300
##$TL= (0..7)
0 120 120 120 120 120 120 120 
##$TP= (0..7)
150 150 150 150 150 150 150 150 
##$TP07= 0
##$TPNAME0= <>
##$TPNAME1= <>
##$TPNAME2= <>
##$TPNAME3= <>
##$TPNAME4= <>
##$TPNAME5= <>
##$TPNAME6= <>
##$TPNAME7= <>
##$TPOAL= (0..7)
0.5 0.5 0.5 0.5 0.5 0.5 0.5 0.5 
##$TPOFFS= (0..7)
0 0 0 0 0 0 0 0 
##$TUNHIN= 0
##$TUNHOUT= 0
##$TUNXOUT= 0
##$USERA1= <user>
##$USERA2= <user>
##$USERA3= <user>
##$USERA4= <user>
##$USERA5= <user>
##$V9= 5
##$VALIST= <valist>
##$VCLIST= <CCCCCCCCCCCCCCC>
##$VD= 0
##$VDLIST= <DDDDDDDDDDDDDDD>
##$VPLIST= <PPPPPPPPPPPPPPP>
##$VTLIST= <TTTTTTTTTTTTTTT>
##$WBST= 1024
##$WBSW= 4
##$XGAIN= (0..3)
0 0 0 0 
##$XL= 0
##$YL= 0
##$YMAX_a= 349148
##$YMIN_a= -289376
##$ZGOPTNS= <>
##$ZL1= 120
##$ZL2= 120
##$ZL3= 120
##$ZL4= 120
##$ABSF1= 16.4482
##$ABSF2= -4.244972
##$ABSG= 5
##$ABSL= 3
##$ALPHA= 0
##$AQORDER= 0
##$ASSFAC= 0
##$ASSFACI= 0
##$ASSFACX= 0
##$ASSWID= 0
##$AUNMP= <proc_1d>
##$AZFE= 0.1
##$AZFW= 0.1
##$BCFW= 0
##$BC_mod= 0
##$BYTORDP= 0
##$COROFFS= 0
##$CY= 12.5
##$DATMOD= 1
##$DC= 0
##$DFILT= <>
##$DTYPP= 0
##$F1P= 14.0000005364418
##$F2P= -0.99999901652339
##$FCOR= 0.5
##$FTSIZE= 32768
##$FT_mod= 6
##$GAMMA= 0
##$GB= 0
##$INTBC= 1
##$INTSCL= 1
##$ISEN= 128
##$LB= 0.3
##$LEV0= 0
##$LPBIN= 0
##$MAXI= 10000
##$MC2= 0
##$MEAN= 0
##$ME_mod= 0
##$MI= 0
##$NCOEF= 0
##$NC_proc= -5
##$NLEV= 6
##$NOISF1= 0
##$NOISF2= 0
##$NSP= 0
##$NTH_PI= 0
##$NZP= 0
##$OFFSET= 16.4482
##$PC= 1
##$PHC0= -67.51737
##$PHC1= 8.744171
##$PH_mod= 1
##$PKNL= yes
##$PPARMOD= 0
##$PSCAL= 4
##$PSIGN= 0
##$REVERSE= no
##$SF= 250.130018458353
##$SI= 32768
##$SIGF1= 0
##$SIGF2= 0
##$SINO= 400
##$SIOLD= 32768
##$SREGLST= <1H.CDCl3>
##$SSB= 0
##$STSI= 32768
##$STSR= 0
##$SW_p= 5175.98343685301
##$SYMM= 0
##$S_DEV= 0
##$TDeff= 65536
##$TDoff= 0
##$TI= <Analysis number 999999
Compound Code 99
Book Reference 9
Project Code 9>
##$TILT= no
##$TM1= 0
##$TM2= 0
##$TOPLEV= 0
##$USERP1= <user>
##$USERP2= <user>
##$USERP3= <user>
##$USERP4= <user>
##$USERP5= <user>
##$WDW= 1
##$XDIM= 32768
##$YMAX_p= 456965232
##$YMIN_p= -893433
$$ End of Bruker specific parameters
$$ ---------------------------------
##NTUPLES= NMR SPECTRUM
##VAR_NAME=  FREQUENCY,     SPECTRUM/REAL,   SPECTRUM/IMAG
##SYMBOL=    X,             R,               I
##VAR_TYPE=  INDEPENDENT,   DEPENDENT,       DEPENDENT
##VAR_FORM=  AFFN,          ASDF,            ASDF
##VAR_DIM=   32768,         32768,           32768
##UNITS=     HZ,            ARBITRARY UNITS, ARBITRARY UNITS
##FACTOR=    0.157963299565203, 1,           1
##FIRST=     4114.18862609356, 0,            0
##LAST=      -1061.79481075945, 0,           0
##MIN=       -1061.79481075945, -893433,     0
##MAX=       4114.18862609356, 456965232,    0
$$ Real data points
##PAGE= N=1
##DATA TABLE= (X++(R..R)), XYDATA
$$ [...]
27381G7017l07669j42222J37566J22260J66603l6182q6158L3420n3741l8305J66324
$$ 77017 -230652 -372874 -235308 -113048 53555 17373 -68785 -35365 -89106 -127411 38913
27370C8913K44576n9881k09191p4180j39299J86662m6816j75080P6045n1638J80184
$$ 38913 283489 223608 14417 -59763 -199062 -12400 -59216 -234296 -158251 -209889 -29705
27359b9705M3909j1871o8785M7375J55731o8189q4634k28259K31310R2269j46615
$$ -29705 14204 2333 -66452 -19077 136654 68465 -16169 -244428 -13118 79151 -67464
27348f7464j02821q5882J87076m177r5646M21568K7203k33283J47945n6956J01142
$$ -67464 -170285 -256167 -69091 -73268 -168914 252654 279857 46574 194519 137563 238705
27337B38705J56740p5206k46640O7413P4330l0443l9687J533P0669j08032k458
$$ 238705 395445 320239 73599 141012 215342 184899 145212 146745 217414 109382 106924
27326A06924L4127j27393k06983j52487K4662L312M03302j57959l20640o2038
$$ 106924 141051 13658 -193325 -345812 -321150 -317838 85464 -72495 -393135 -455173
27316d55173K5291j844J81557N2293J67407P4068k19831l8951J38943J26209K14383
$$ -455173 -429882 -431726 -250169 -197876 -30469 43599 -176232 -215183 -76240 49969 264352
27305B64352j0523J44751n9617j09873n2666P9826J16170k16270n6344L287q0154
$$ 264352 253829 398580 338963 229090 176424 256250 372420 156150 99806 103093 22939
27294B2939j49511k20278L20520J03835o6049j62505r3892o1046L5296J42195
$$ 22939 -126572 -346850 -26330 77505 11456 -151049 -244941 -305987 -270691 -128496
27284a28496n3071J43963K43772l4417R2620l2165p8335J9327k6713p6142n6914
$$ -128496 -181567 -37604 206168 171751 264371 232206 153871 173198 146485 70343 13429
27273A3429p5506j26626p197P5093N2379N4382R1591J64712J63808l7989j33577
$$ 13429 -62077 -188703 -195900 -120807 -68428 -14046 77545 242257 406065 368076 234499
27262B34499j46923k5589j4906m2526j63696Q5122J19823M1634l1247N2793K2690
$$ 234499 87576 61987 47081 4555 -159141 -74019 45804 87438 56191 108984 131674
27251A31674R4388j23797j18317K30854P4903j20161k40373n5439j1165J37484
$$ 131674 226062 102265 -16052 214802 289705 169544 -70829 -126268 -137433 51
27241E1J76646p085m4704j90125J1793O1401J20190M690j7528j19586L0188j82109
$$ 51 176697 169612 124908 -65217 -53424 7977 128167 132857 115329 -4257 25931 -156178
27229a56178l9056O254K3032J84717K1674l7908R9488m0123J9794R0717P1090
$$ -156178 -195234 -188980 -165948 18769 40443 2535 102023 61900 81694 172411 243501
27218B43501j30743j75545n0096K33027o7150r7042m6577P0744J38624L233k45799
$$ 243501 112758 -62787 -112883 120144 52994 -44048 -90625 -19881 118743 121976 -123823
27207a23823J37276J37609K7055n3859o8648R0447n519R2796Q6918j57081r6168
$$ -123823 13453 151062 178117 124258 55610 146057 140538 233334 320252 163171 67003
27196F7003p509P2385K28895j48629m8533k0708j45685k94365K93141L18626k626
$$ 67003 59494 131879 360774 212145 163612 142904 -2781 -297146 -4005 314621 311995
27185C11995q4441J30206j06610Q3802R2060j37444j77715j82990R4819J08561
$$ 311995 227554 357760 251150 334952 427012 289568 111853 -71137 23682 132243
27175A32243o4818P531j09369Q9923J27300P3613P7082k25844o5150j28404N7027
$$ 132243 67425 74956 -34413 55510 182810 256423 333505 107661 42511 -85893 -28866
27164b8866K3495J45766R7841o4193J19170K421k23974P2955p5916j27240J5058
$$ -28866 -5371 140395 238236 174043 293213 295634 71660 144615 68699 -58541 -43483
27153d3483j6087J04510q9844j78759P2276J4624j66592L0104J18637J44501J64360
$$ -43483 -59570 44940 -44904 -223663 -151387 -136763 -303355 -273251 -154614 -10113 154247
27142A54247L4398o1185O6380J64321m3450k91616k41278P0161J40883J6876J45424
$$ 154247 188645 127460 193840 358161 314711 23095 -218183 -148022 -7139 9737 155161
27131A55161q7090J20449j07154p6060o7402j05350j40713J01649K72033j9535
$$ 155161 68071 188520 81366 5306 -62096 -167446 -308159 -206510 65523 45988
27121D5988r5990j01395j87106q4549L0713m3229n9794J42329J08415J50369j08814
$$ 45988 -50002 -151397 -338503 -423052 -392339 -435568 -495362 -353033 -244618 -94249 -203063
27110b03063J22400P0477j16359k41154l6824K60246K68708J09511P4028j52693
$$ -203063 -80663 -10186 -126545 -367699 -404523 -144277 124431 233942 307970 155277
27100A55277m1593j59052o9989J57682j11195r8226K15423J63401k52423j57446
$$ 155277 113684 -45368 -115357 42325 -68870 -167096 48327 211728 -40695 -198141
27090a98141L6447J67708j00943j38369n295Q1726K4544J69590L6686j13602k17243
$$ -198141 -161694 6014 -94929 -233298 -238593 -156867 -132323 37267 73953 -39649 -256892
27079b56892j29047J07695J46417K9681k2394K367J32361J28758l50174r4733
$$ -256892 -385939 -278244 -131827 -102146 -124540 -122173 10188 138946 -211228 -305961
27069c05961R4788J95793J27686J0227j6763j32057j31067M7095J75490J25901
$$ -305961 -211173 -15380 112306 122533 105770 -26287 -157354 -110259 65231 191132
27059A91132k1354p6823j65904l64246l23772J58365K06776O3466J45226K0555
$$ 191132 169778 92955 -72949 -437195 -760967 -602602 -395826 -332360 -187134 -166579
27049a66579o9208N3642r171O4589m8441L1139O3103j53017J09617Q7932Q241
$$ -166579 -235787 -182145 -191316 -126727 -175168 -144029 -80926 -233943 -124326 -36394 -28153
27038b8153P3198o9537k62071j44736J67433L56783J15607J959L6828J06841J36626
$$ -28153 45045 -24492 -286563 -431299 -263866 92917 208524 210483 247311 354152 490778
27027D90778j43532k6237R8813l34787r0618L25538O4410M0452j03731k68909
$$ 490778 347246 321009 419822 85035 -5583 319955 384365 424817 321086 52177
27017E2177k9875J79933Q6214j28457r8576j70061J52447J47477P9437j70000
$$ 52177 22302 202235 288449 159992 61416 -108645 43802 191279 270716 100716
27007A00716J23318R1464j54921K1746p5159j67733q3917L65749L18189j6932
$$ 100716 224034 315498 160577 182323 107164 -60569 -144486 221263 539452 522520
26997E22520n0386k02944k63870l02680Q668k9241O1525J73744k04448j03650
$$ 522520 472134 269190 5320 -297360 -288692 -317933 -256408 -82664 -287112 -390762
26987c90762Q9403J53445R0019r0005l51255Q7399K5011P743J77875K26998K01739
$$ -390762 -301359 -147914 -57895 -147900 -499155 -411756 -386745 -379002 -201127 25871 227610
26976B27610J0033p7605l51661K4533M5003k82837o2256K01451j6218j36827J1388
$$ 227610 237643 160038 -191623 -167090 -122087 -404924 -467180 -265729 -281947 -418774 -407386
26965d07386J22792q6398J56663J0384O6013j64145j24410J36927K83971O2076
$$ -407386 -284594 -370992 -214329 -203945 -137932 -302077 -426487 -289560 -5589 56487
26955E6487J05993N2462k33163k86246j28836K18338O5533J50481J0810J62667
$$ 56487 162480 214942 -18221 -304467 -433303 -214965 -149432 1049 11859 174526
26945A74526J53125j04779Q3778P4303N2750j19870j81455k37822k4224J07273
$$ 174526 327651 222872 306650 380953 433703 313833 132378 -105444 -129668 -22395
26935b2395l6351n7996l14185m9377J75694J35784O2089P5101M7425J40391m1384
$$ -22395 -58746 -116742 -430927 -480304 -304610 -168826 -106737 -31636 15789 156180 114796
26924A14796k36736o1766o2973J64461Q654k81723m3550J00600J20777J40800
$$ 114796 -121940 -183706 -246679 -82218 -73564 -355287 -398837 -298237 -177460 -36660
26914c6660j0184r3150Q0896k2784j2102K9623J25336J64353j92204J55471J23807
$$ -36660 -46844 -139994 -59098 -81882 -93984 -64361 60975 225328 33124 188595 312402
26903C12402j77847o0049p7075O2023j14606L9092L0360p0447j16703q1047K39742
$$ 312402 134555 74506 -2569 59454 -55152 -16060 14300 -56147 -172850 -253897 -14155
26892a4155L43067L5023l49067k49636L9211O843R1183K4417P5314l6607M6500
$$ -14155 328912 363935 14868 -234768 -195557 -188714 -97531 -73114 2200 -34407 12093
26881A2093M8826o241P4521J79803K637l6979K7889j14961n1932L0689m36161
$$ 12093 60919 54678 129199 309002 311639 274660 302549 187588 135656 166345 -269816
26870b69816J1627N6979J37608J79220L1490K3266m9181J00866P8909j1743k06657
$$ -269816 -258189 -201210 -63602 115618 147108 170374 121193 222059 300968 289225 82568
26859H2568j52085J93902J7072P3309K2614R534j11202n9629J17075M4810r8089
$$ 82568 -69517 124385 141457 214766 237380 246914 135712 76083 193158 237968 139879
26848A39879n7017O3400J59275j26750k62049k44986n7687J6480m6915P3247K58150
$$ 139879 82862 146262 305537 178787 -83262 -328248 -385935 -369455 -416370 -343123 -84973
26837h4973K64861J1336j51167l27403K09557J97405j8956J03206j61957j99332
$$ -84973 179888 191224 40057 -287346 -77789 119616 100660 203866 41909 -157423
26827a57423j13806k44893j00691K01192J59035L9543O597K48863J51977J28903
$$ -157423 -271229 -516122 -616813 -415621 -256586 -217043 -210446 38417 190394 319297
26817C19297J16468J206O818o9079k27534J07950P3690j98289l95358l2626J82540
$$ 319297 435765 436971 443789 374710 147176 255126 328816 130527 -264831 -297457 -114917
26806a14917l2922r2164J53890J07055r811J8341J9874j16122o369N912L3109
$$ -114917 -147839 -240003 -86113 20942 11131 29472 49346 -66776 -73145 -67233 -34124
26795c4124J32011k69210j09948J86544r1843J6904k6453p6983N1703K2257K8401
$$ -34124 97887 -171323 -281271 -94727 -186570 -169666 -196119 -273102 -221399 -199142 -170741
26784a70741J64625J3958K9391P0898j28969j7181L9276l0640j41414k0421K00239
$$ -170741 -6116 7842 37233 108131 -20838 -38019 1257 -29383 -170797 -191218 9021
26773I021K2103P5063J44365M3626l2566k70892r769J68547L10031r8131j83680
$$ 9021 31124 106187 250552 294178 261612 -9280 -19049 149498 459529 361398 177718
26762A77718p8311r4832n3257j8581o4475R3335J72065J13385j809n2125k42216
$$ 177718 99407 4575 -48682 -67263 -131738 -38403 133662 247047 245238 193113 -49103
26751d9103p0856K7454j84312J09836J83039j19495J39928J48989k9927J26817
$$ -49103 -119959 -92505 -276817 -166981 16058 -103437 36491 185480 155553 282370
26741B82370k28167j60301j63993P6415P2979r6702Q9814j11693m3613K66476
$$ 282370 54203 -106098 -270091 -193676 -120697 -217399 -127585 -239278 -282891 -16415
26731a6415j3769N5469J37568R5213m5279Q2551n1654L152J2382Q1690M248l151
$$ -16415 -30184 25285 162853 258066 212787 295338 243684 246836 259218 340908 345156 342005
26719C42005p6160q0967l80390j42834P972J43955K48873K60031R4878k6421k41315
$$ 342005 265845 184878 -195512 -338346 -330374 -186419 62454 322485 417363 390942 149627
26708A49627n0766L1971O5985m704m1657k6061j55603k16571j68664M41697K88278
$$ 149627 98861 130832 196817 192113 150456 124395 -31208 -247779 -416443 25254 313532
26697C13532l92303j94764J7600L9762Q5697N6889J33629j2041L9206j37051M6093
$$ 313532 -78771 -273535 -255935 -216173 -130476 -73587 60042 48001 87207 -49844 -3751
26686c751j01178O0151L6170j43324K2147O1951k87665k28147r2083J32320N5052
$$ -3751 -104929 -44778 -8608 -151932 -129785 -67834 -355499 -583646 -675729 -543409 -488357
26675d88357J82754K25528J09706M8009J48687J79705j49227j63265j36588j0453
$$ -488357 -305603 -80075 29631 77640 226327 406032 256805 93540 -43048 -53501
26665e3501O7510j22885o7690J97166N0889k6796q0560j33654l9439J21905N9015
$$ -53501 14009 -108876 -176566 20600 71489 44693 -35867 -169521 -208960 -87055 -28040
26654b8040j94403n664L39397m1716j30052L2762J26930K00894M9510j93254N8991
$$ -28040 -222443 -228107 111290 69574 -60478 -27716 99214 300108 349618 156364 215355
26643B15355p3162j39005K39304K26622r4936j54070k37091j24947J93721J36021
$$ 215355 142193 3188 242492 469114 374178 220108 -16983 -141930 51791 187812
26633A87812K6851p1378k67447M5257l3169O8701M9880J54124j0083j14011j69382
$$ 187812 214663 143285 -124162 -78905 -112074 -43373 6507 160631 150548 36537 -132845
26622a32845J40495o7458j39504J29077J81331q3062j49619q8848N7364j6601
$$ -132845 7650 -59808 -199312 -70235 111096 28034 -121585 -210433 -153069 -169670
26612a69670p2820K42160L24819K1113j24706j92957l1422Q7911M4010J4782j02901
$$ -169670 -242490 -330 324489 345602 220896 27939 -3483 84428 128438 143220 40319
26601D0319N6329M1776j40033p3975K65794K3618o3766j24320K7774K3798j15318
$$ 40319 96648 138424 -1609 -75584 190210 213828 150062 25742 53516 77314 -38004
26590c8004j45325K86219K6165p7119o9245L58926r7048j53838P2385M5011j14231
$$ -38004 -183329 102890 129055 51936 -17309 341617 244569 90731 163116 208127 93896
26579I3896N94J17379j20206j9593l79918j16000J56238N6399k1938J92704J14992
$$ 93896 94490 211869 91663 72070 -307848 -423848 -267610 -211211 -233149 -40445 74547
26568G4547l52002m3305o7527l0524K94891J22272Q6248l3297K6686J01424k22489
$$ 74547 -277455 -320760 -388287 -418811 -123920 -1648 84600 51303 77989 179413 -43076
26557d3076k49099m0360J90717J05813m3977j02359j06380O3626J39482J71294
$$ -43076 -292175 -332535 -141818 -36005 -79982 -182341 -288721 -225095 -85613 85681
26547H5681J61436k33883j75535K04383J51260J51096j33059R9158Q1488J6136
$$ 85681 247117 13234 -162301 42082 193342 344438 211379 310537 392025 408161
26537D08161Q7489k43682l63803j71693p9380j5388Q7753q363p2195j5014P8620
$$ 408161 495650 251968 -111835 -283528 -362908 -378296 -290543 -298906 -371101 -386115 -307495
26526c07495O8603O7667j50074K21001J54466R2664l25222j50J76404k08737N022
$$ -307495 -238892 -171225 -321299 -100298 54168 146832 -178390 -178540 -2136 -210873 -205851
26515b05851K96992K28609n0735k2653J04972j84494r7742J77094L8642j02385
$$ -205851 91141 319750 269015 246362 351334 166840 69098 246192 284834 182449
26505A82449k41876Q914J07307P7902q4871j00153l9893J32559n7607j56660J8358
$$ 182449 -59427 -50513 56794 134696 49825 -50328 -90221 42338 -15269 -171929 -153571
26494a53571p6442J64594J86183k87641j28975O5422j7145O5859J78395j05970
$$ -153571 -230013 -65419 120764 -166877 -295852 -230430 -247575 -181716 -3321 -109291
26484a09291k33471k00456R2823L60147J91417j8594k69470o4984K0573M7255
$$ -109291 -342762 -543218 -450395 -90248 101169 82575 -186895 -251879 -231306 -184051
26474a84051j30761j73489N5941K76365R7476K3349J29276j45062J0210k3552
$$ -184051 -314812 -488301 -432360 -155995 -58519 -35170 94106 -50956 -40746 -64298
26464f4298j26058O3886j23956M5003K66483J16499l05330n5087Q8515K15892
$$ -64298 -190356 -126470 -250426 -205423 61060 177559 -127771 -182858 -94343 121549
26454A21549O7899M551j81141k89742r0599J69134J41720J7520J22533R5086J1047
$$ 121549 189448 193999 12858 -276884 -367483 -198349 -56629 -39109 83424 178510 189557
26443A89557m7772j74963l82433K95216J82349Q7871M7046Q6660m016o1086P9230
$$ 189557 141785 -33178 -415611 -120395 61954 149825 196871 283531 279515 218429 297659
26432B97659r8439l01577m2773K59853M9400M4014j80549o543n2790L1617J28432
$$ 297659 199220 -102357 -145130 114723 164123 208137 27588 21045 -31745 -128 128304
26421A28304j52904J3182k16324j8989J9138R1812J18503J5285K0620n8659j45337
$$ 128304 -24600 -11418 -227742 -246731 -227593 -135781 -17278 -1993 18627 -40032 -185369
26410a85369R2901j67272J59003K02936l34285k52188N3765K227m2392K73190
$$ -185369 -92468 -259740 -100737 102199 -232086 -484274 -430509 -428282 -470674 -197484
26400a97484n6295k67217J161L94027L39851k14064l9001j94765J18839R2942
$$ -197484 -253779 -520996 -519835 -125808 214043 -21 -39022 -233787 -114948 -22006
26390b2006J34569J60742j16140m6921K6891N9605k35351k81270N9091j2014K25440
$$ -22006 112563 273305 157165 110244 137135 196740 -38611 -319881 -260790 -272804 -47364
26379d7364J74757J84300j72216j55791j99624k24380K0462K18915K79177O7347
$$ -47364 127393 311693 139477 -16314 -215938 -440318 -419856 -200941 78236 145583
26369A45583k56876q2356J36074L31730O775p3674j89865j13160j7792j28211
$$ 145583 -111293 -193649 -57575 274155 280930 207256 17391 -95769 -113561 -241772
26359b41772L4440K2545p6855n7739k02952k47654K04733J03062K34122r4648
$$ -241772 -207332 -184787 -261642 -319381 -522333 -769987 -565254 -462192 -228070 -322718
26349c22718l41927o6252J6849K20918L78232J63385j01810j4435N9353K04546
$$ -322718 -664645 -730897 -714048 -493130 -114898 48487 -53323 -67758 -8405 196141
26339A96141N8926j22669k33356o6974N9025k738k8487J87056K1134j0210j4885
$$ 196141 255067 132398 -100958 -167932 -108907 -111645 -140132 46924 68058 57848 42963
26328D2963J11076j15728l5656r0217J7913J59193m2930j14192M9479j46984K50093
$$ 42963 154039 38311 2655 -87562 -69649 89544 46614 -67578 -18099 -165083 85010
26317H5010j22254j1579J55356l38587r5164J06493Q3041q9101r6755Q1533L7996
$$ 85010 -37244 -48823 106533 -232054 -327218 -220725 -137684 -226785 -323540 -242007 -204011
26306b04011J656r2424J53572j4559k9301j18460L3853J4748j16132j06100P7376
$$ -204011 -202355 -294779 -141207 -155766 -185067 -303527 -269674 -254926 -371058 -477158 -399782
26295c99782J89391J13172R1485J89432M49689k98990k21142N9771o2423J4265
$$ -399782 -210391 -97219 -5734 183698 633387 334397 113255 173026 110603 124868
26285A24868k5574p2347j29906j96005l4733Q9987J0007K11832N4546j22614l2871
$$ 124868 99294 26947 -102959 -298964 -333697 -243710 -233703 -21871 32675 -89939 -122810
26274a22810L15647p5251l4132o8788j16512Q7739q5990j26653J34623j7384M3523
$$ -122810 192837 117586 83454 14666 -101846 -14107 -100097 -226750 -92127 -109511 -65988
26263f5988k58447j38544J26051K60227k4135J70320P8934o9013j55240k58251
$$ -65988 -324435 -462979 -336928 -76701 -100836 69484 148418 79405 -75835 -334086
26253c34086K00784L02595J78464Q4465J01143m9801k46806k03050m4000j69856
$$ -334086 -133302 169293 347757 432222 533365 483564 236758 33708 -10292 -180148
26243a80148j42709r4186J02053L1115k2799J21570P3155M3564J12020M0531j83256
$$ -180148 -322857 -417043 -314990 -283875 -306674 -185104 -111949 -68385 43635 84166 -99090
26232i9090j05435J09482J4061J2542R6537J88582R1946L1145r427k4976j51785
$$ -99090 -204525 -95043 -80982 -68440 28097 216679 308625 339770 330343 305367 153582
26221A53582k27088j98333l1881J07925m2j57982R2699K79163J38621K1105J874
$$ 153582 -73506 -271839 -303720 -195795 -195837 -353819 -261120 18043 156664 177769 179643
26210A79643r5664n4199J1082o9620k6652J58563R8559J66897k3251j6473j14859
$$ 179643 83979 29780 40862 -28758 -55410 103153 201712 368609 345358 328885 214026
26199B14026j86356J731q4067j1778L09235K05101k99623k64155j11640k04769
$$ 214026 27670 29401 -54666 -66444 242791 447892 148269 -115886 -227526 -432295
26189d32295j65271J99007J5982j04131J447R2838J81937J36047k1448j26622
$$ -432295 -597566 -398559 -382577 -486708 -485261 -392423 -210486 -74439 -95887 -222509
26179b22509J31860O8776o3982o6471j99165m5162J19389M32894L24641M0227
$$ -222509 -90649 -21873 -85855 -152326 -351491 -396653 -277264 155630 480271 520498
26169E20498k51117K72474J15329j94218j96701j53216j3976J70008k9074p2538
$$ 520498 269381 541855 657184 462966 266265 113049 99073 269081 240007 167469
26159A67469k00793m5380R7884M2783K8271j14386K2523r0655N6464J20466K8964
$$ 167469 -33324 -78704 19180 61963 90234 -24152 -1629 -92284 -35820 84646 113610
26148A13610K23993k786j59721j21585k3167j03442k46042P3545K07858K28501
$$ 113610 337603 334817 175096 53511 30344 -73098 -319140 -245595 -37737 190764
26138A90764k48866l20604J24686J71947l9506J12527j17359p9325j33932j78747
$$ 190764 -58102 -378706 -254020 -82073 -121579 -9052 -126411 -205736 -339668 -518415
26128e18415K28866K7995j1054J25591o0998k32297J89308K76505P3727j57207
$$ -518415 -289549 -261554 -272608 -147017 -208015 -440312 -251004 25501 99228 -57979
26118e7979j83629j19675j14907j4335O6137L62310M08906r5499j78514K6977
$$ -57979 -241608 -361283 -476190 -490525 -424388 -62078 346828 251329 72815 99792
26108I9792J85017J16868O3122l27455k60735L6417j46400l6866J0104J02235
$$ 99792 284809 401677 464799 137344 -123391 -86974 -233374 -270240 -260136 -157901
26098a57901O9704N6094J12258m7383L7327R0005j8832P0069R2058J09615O4809
$$ -157901 -88197 -32103 80155 32772 70099 160104 141272 211341 303399 413014 477823
26087D77823J30579J78537o9404m00521k78727j89171J40669L09543J71550M4324
$$ 477823 608402 786939 717535 317014 38287 -150884 -10215 299328 470878 515202
26077E15202k51660q0032N6793J38883j18689p3318p7574M3806o7375j46383N3835
$$ 515202 263542 183510 240303 379186 260497 187179 109605 153411 86036 -60347 -6512
26066f512q3711o5366N0161p0641P4681J26995j88241j61553P5127k02586j67887
$$ -6512 -90223 -155589 -105428 -176069 -101388 25607 -162634 -324187 -249060 -451646 -619533
26055f19533J9499r947J22311P419J46177J41665M0798P279J3092J58144R2522
$$ -619533 -600034 -609981 -487670 -480251 -334074 -192409 -151611 -144332 -131240 26904 119426
26044A19426N6640k34853o5908J11612P0221J00957K4028n4292j07031L9497J55614
$$ 119426 176066 -58787 -124695 -13083 57138 158095 182123 127831 20800 60297 215911
26033B15911P9869l15247j4851k75697P2980L08251k706j17401p9788J92853q6955
$$ 215911 295780 -19467 -34318 -310015 -237035 71216 68510 -48891 -128679 64174 -22781
26022b2781j44047k07757L2422L02703o009p7787J61240J59848J1348j95156j7994
$$ -22781 -166828 -374585 -342163 -39460 -45469 -123256 37984 197832 209180 14024 -3970
26011c970K64346K95188k64658k50678R821J8578n6642j00272K6125J04930O2433
$$ -3970 260376 555564 290906 40228 50049 68627 11985 -88287 -62162 42768 105201
26000A05201J51041r5063l46562L2666O8309L0979P2939J43725j15099k15618
$$ 105201 256242 161179 -185383 -152717 -84408 -53429 19510 163235 48136 -167482
25990a67482M7059j4617j54083J62849Q3332m498k4764Q5643J04922k45005j57418
$$ -167482 -120423 -135040 -289123 -126274 -42942 -47440 -72204 13439 118361 -126644 -284062
25979b84062P1755J05117K5078J07150j1195k27143o2602m0347p3760J58682j8984
$$ -284062 -212307 -107190 -82112 25038 13843 -213300 -275902 -316249 -390009 -231327 -250311
25968b50311P5798J64991o5000n1631J75287J91534J6704j22892j963K29108O6682
$$ -250311 -174513 -9522 -74522 -126153 49134 240668 257372 134480 132517 361625 428307
25957D28307j48344j22200K7305K95724K43771k58477l13452k41308m399j2586
$$ 428307 279963 157763 185068 480792 724563 466086 152634 -88674 -93073 -105659
25947a05659n9896J9024o3567J8329K28657k5202j75094j81611j1913n8258J30537
$$ -105659 -165555 -146531 -210098 -191769 36888 11686 -163408 -345019 -356932 -415190 -284653
25936b84653L4044K04555J46408J14j21039q217L8076j09440J07616m7157K8207
$$ -284653 -250609 -46054 100354 100468 -20571 -28788 9288 -100152 7464 -39693 -11486
25925a1486j19874j43053L7136Q4793K14522Q5078M7101q1705q2755j4839r598
$$ -11486 -131360 -274413 -237277 -152484 62038 147116 194217 112512 29757 14918 5320
25914E320Q0829Q1932l5973j45559K0479K1177q8365k6827J31349J61676j55189
$$ 5320 86149 168081 132108 -13451 7028 28205 -60160 -86987 44362 206038 50849
25903E0849j6604N4333R2854J07928L2683k9778k43047j59281o3500P0486P850
$$ 50849 34245 88578 181432 289360 322043 292265 49218 -110063 -173563 -103077 -95227
25892i5227J21041J18160O6914n285j82470j74431Q4335j03j60559m9355m6350
$$ -95227 25814 143974 210888 205603 23133 -151298 -66963 -67066 -227625 -276980 -323330
25881c23330K14865O0158j30866q4144k3412O5019j9321M1010R2896k22947J25398
$$ -323330 -108465 -48307 -179173 -263317 -286729 -221710 -241031 -200021 -107125 -330072 -204674
25870b04674M6004J2237n2057o0811j6792k28202J49018n2465l6337L68365K76138
$$ -204674 -158670 -146433 -198490 -259301 -276093 -504295 -355277 -407742 -444079 -75714 200424
25859B00424N4388j88306N2771K91368k9627j33227j60915M7547J0678J15718
$$ 200424 254812 66506 119277 410645 381018 247791 86876 134423 145101 260819
25849B60819k02734j65345k99962o5610K22121K56161j8556r065J66929J05093
$$ 260819 58085 -107260 -407222 -472832 -250711 5450 -13106 -22171 144758 249851
25839B49851j18944k07981J03409J55686L8506k8503J66069l8734k7567K504k44526
$$ 249851 130907 -77074 26335 182021 220527 192024 358093 319359 291792 294296 49770
25828D9770m8969L6159j40552j43186J14228J18007J5701p4361K18967r9358m5527
$$ 49770 801 36960 -103592 -246778 -132550 -14543 1158 -73203 145764 46406 879
25817H79l31556n4484L46780j20515q5421J54082N1012l7588N246j60211M7579
$$ 879 -330677 -385161 -38381 -158896 -244317 -90235 -39223 -76811 -71565 -231776 -184197
25806a84197J78125j45638L1879K44926L61020K83461N134l73327l3247q3720
$$ -184197 -6072 -151710 -119831 125095 486115 769576 774710 401383 368136 284416
25796B84416R3734k4282j14940k5205r1626M022O5598r1312j52932J8731j31140
$$ 284416 378150 353868 238928 213723 122097 126119 191717 100405 -52527 -33796 -164936
25785a64936l6038j75621K1238K49634j7390m1364l3559k7903p522j67232J2865
$$ -164936 -200974 -376595 -355357 -105723 -123113 -164477 -198036 -225939 -233461 -400693 -387828
25774c87828K57401J87473J24970K19803J92863l14166k88189k4284J30808l8828
$$ -387828 -130427 57046 182016 401819 594682 280516 -7673 -31957 98851 60023
25764F0023j63917k39023m8301J13201N4921J27456K01882n8777j67414j53303
$$ 60023 -103894 -342917 -391218 -278017 -223096 -95640 106242 47465 -119949 -273252
25754b73252j0044k33727J52005J24834k79786j0594n141J29952K08459p4764
$$ -273252 -283296 -517023 -365018 -240184 -519970 -530564 -535705 -405753 -197294 -272058
25744b72058R8658J77817l4358n5826L6101L3090N0526K86662m7837Q1168J65979
$$ -272058 -173400 4417 -29941 -85767 -49666 -16576 33950 320612 272775 353943 519922
25733E19922l58924j99353j43576K7276J88119J49543j20260p8697o6528M4519
$$ 519922 160998 -38355 -181931 -154655 33464 183007 62747 -15950 -82478 -37959
25723c7959J39047N6187R7238j24807j62098O5710m9360m0035K9407J94498q2306
$$ -37959 101088 157275 254513 129706 -32392 33318 -16042 -56077 -26670 167828 85522
25712H5522j71714k47014L54754M9247n8598j26401j65158R6765L5176j84208
$$ 85522 -86192 -333206 21548 70795 12197 -114204 -279362 -182597 -147421 -331629
25702c31629j09988l0746J77847J31341O7624K26088K45240N5327k287k11979
$$ -331629 -441617 -472363 -294516 -163175 -95551 130537 375777 431104 428817 216838
25692B16838k38569K27793J40385k27311q7724K03873l5263O6671R1513j1318
$$ 216838 -21731 206062 346447 119136 31412 235285 200022 266693 358206 346888
25682C46888k73893j98349r8636J2515J74273L14878K26404k85943r5262P4411
$$ 346888 72995 -125354 -223990 -211475 -37202 277676 504080 218137 122875 197286
25672A97286J02852P3200L0451J01380k33245j40637j09170K76083K97660j29562
$$ 197286 300138 373338 403789 505169 271924 131287 22117 298200 595860 466298
25662D66298j66721k74678k23125k3593l5139J9451O0163M0548J47354Q5662r6299
$$ 466298 299577 24899 -198226 -221819 -256958 -237507 -177344 -136796 10558 96220 -79
25651g9p8201J30610O4116J11651j33749j4862k41043r8843j62899q2331J23987
$$ -79 -78280 52330 116446 228097 94348 79486 -161557 -260400 -423299 -505630 -381643
25640c81643M45367M47373J65404j6390l96475k41972M6801Q3107q1674P004J21175
$$ -381643 63724 511097 676501 660111 263636 21664 68465 151572 69898 76902 198077
25629A98077o4825j36046k8903J44438K08862j0406p8635o4326k18840k8858P6155
$$ 198077 133252 -2794 -31697 112741 321603 311197 232562 168236 -50604 -79462 -3307
25618c307p6781J34697K01637O8265j79385j20777L12397O4931n5624J4798k25725
$$ -3307 -80088 54609 256246 324511 145126 24349 336746 401677 346053 360851 135126
25607A35126l7591J57666O5931j02740R2764k33314j01052r062o536m9559j33600
$$ 135126 97535 255201 321132 218392 311156 77842 -23210 -32272 -38808 -88367 -221967
25596b21967R2435K66644J95207j88711j92170K79510J86753m03115k92998j37773
$$ -221967 -129532 137112 332319 143608 -48562 230948 417701 14586 -278412 -416185
25586d16185J98440L26405J47366q6170K06345J55776k10301j88898j33096j26653
$$ -416185 -217745 108660 256026 169856 376201 531977 321676 132778 -318 -126971
25576a26971L17571K0865j134Q7201j11022L7656K65477j75513j29122P2825l2071
$$ -126971 190600 211465 210331 297532 186510 224166 489643 314130 185008 257833 225762
25565B25762n8908j16425p2797Q3726q6060j95125R2895n7164l5228j86040j98772
$$ 225762 166854 50429 -22368 61358 -24702 -219827 -126932 -184096 -219324 -405364 -604136
25554f04136j16257K15765L57953Q6617O3159J45725l3374k15898M6280K65133
$$ -604136 -720393 -504628 -146675 -60058 3101 148826 115452 -100446 -54166 210967
25544B10967n177O3986J47226j38695j0723j930j96019r4276K03008K8557k22471
$$ 210967 205790 269776 417002 278307 267584 265654 69635 -24641 178367 206924 -15547
25533a5547k13254Q4695J4023m8063r0294k1765J2915O1966K01550K19456N289
$$ -15547 -228801 -144106 -130083 -178146 -268440 -290205 -277290 -215324 -13774 205682 210971
25522B10971P6446J20093p3572j99729o7461P2531J61763j41419L5883J4529j37349
$$ 210971 287417 407510 333938 134209 66748 139279 301042 159623 195506 210035 72686
25511G2686j33689k78796j26771J9176o7535M2966J40753j9599j63815l7019O562
$$ 72686 -61003 -339799 -466570 -447394 -514929 -471963 -331210 -350809 -514624 -551643 -545081
25500e45081J7355J77995R4723J64872Q4100k28640j48784K71197K51437M2316
$$ -545081 -527726 -349731 -255008 -90136 -6036 -234676 -383460 -112263 139174 181490
25490A81490Q2782k7201J29098j82313j36337J30633q839j54140l06154j81839
$$ 181490 264272 237071 366169 183856 47519 178152 169313 15173 -290981 -472820
25480d72820J81728L77558P6961P2293o8880j84677j09695J9784o4368R6215j69329
$$ -472820 -291092 86466 163427 235720 166840 -17837 -127532 -107748 -172116 -75901 -245230
25469b45230N6175M4249J7859K5786j0753m1927l036M4688R1047Q592o4332o5432
$$ -245230 -189055 -144806 -126947 -101161 -111914 -153841 -156877 -112189 -21142 -12550 -76882 -142314
25457a42314O9904o4430l4968O8538L8068L5477N5216J48882L3753R402r5134
$$ -142314 -72410 -136840 -171808 -103270 -65202 -29725 25491 174373 208126 217528 122394
25446A22394N6536p5342m4115J492q5950K54449K23732q9586J0851K300j22002
$$ 122394 178930 103588 59473 60965 -24985 229464 453196 363610 374461 376761 254759
25435B54759J8907J14064j91818k31338J46442O2007n6146j3431L1252Q6636O8027
$$ 254759 273666 387730 195912 -35426 111016 173023 116877 103446 134698 221334 289361
25424B89361m7796p6958l33832J432L80644J16862j07080j9108p9389L6291k4325
$$ 289361 241565 164607 -169225 -167793 212851 329713 222633 203525 124136 160427 136102
25413A36102J41008o6774n0255j6992r089q9754K78739M561k1722J16152p0153
$$ 136102 277110 210336 160081 143089 134000 44246 322985 327546 305824 421976 351823
25402C51823l56358n9746J77338J26850j10709j33291j90307p1442N5933K39265
$$ 351823 -4535 -64281 113057 239907 129198 -4093 -194400 -265842 -209909 29356
25392B9356j14336j84105k6791J67361K6140q5958J2173k3003K650j5240j03588
$$ 29356 -84980 -269085 -295876 -128515 -102375 -188333 -176160 -199163 -196513 -211753 -315341
25381c15341l07677J26368M65056K56713R7118K532j02701j02466O4793l4638
$$ -315341 -623018 -496650 -31594 225119 322237 324769 222068 119602 184395 149757
25371A49757l32508j38113r4007J41774J60905J19955O3786K29264O5237j13953
$$ 149757 -182751 -320864 -414871 -273097 -112192 7763 71549 300813 366050 252097
25361B52097k86140L3670K4103j76969J7915J33703O2346l1534K7416R0249P7028
$$ 252097 -34043 -373 23730 -153239 -135324 -1621 60725 29191 56607 146856 223884
25350B23884J18659k00017r5545J00143j94373j94510K40187J02535J25060j26839
$$ 223884 342543 142526 46981 147124 -47249 -241759 -1572 100963 226023 99184
25340I9184j98099j97992n7573O3003j76550R2046J13221J01049q0904k82772
$$ 99184 -98915 -296907 -354480 -291477 -468027 -375981 -262760 -161711 -242615 -525387
25330e25387K35565M72054M04363j99592j43727K54302J8247m49595l49716n085
$$ -525387 -289822 182232 586595 387003 243276 497578 515825 66230 -283486 -288571
25320b88571R6605J09336k16670j67368K8216L01463J97318K2762j78246o6175
$$ -288571 -191966 -82630 -299300 -466668 -438452 -136989 60329 83091 -95155 -161330
25310a61330j17772K6251m6463J73667J81723J91703j6623m47077k54065L7771
$$ -161330 -279102 -252851 -299314 -125647 56076 247779 231156 -215921 -469986 -432215
25300d32215Q7504k0280J49406Q0710J039j07150J61940m4061j30752q041o9380
$$ -432215 -344711 -364991 -215585 -134875 -133836 -240986 -79046 -123107 -253859 -261900 -331280
25289c31280L4094P4351p6018J06181Q1245L2619n8983J88727K05403L8354j43671
$$ -331280 -297186 -222835 -298853 -192672 -111427 -78808 -137791 50936 256339 294693 151022
25278A51022M6949J92941P5379J07873q1730m27424Q906p001K64867J10880l32037
$$ 151022 197971 390912 466291 574164 492434 65010 73916 66915 331782 442662 110625
25267A10625j29280n8810J15191J77005M4787k71139j24942J28292n2281O2300
$$ 110625 -18655 -77465 37726 214731 259518 -11621 -136563 -8271 -60552 1748
25257A748J51132J4543r5623J81040K72895j70063j91276k05341N3610j10987
$$ 1748 152880 167423 71800 252840 525735 355672 164396 -40945 12665 -98322
25247i8322k00377J33821J45239r5320M6557n7003J0289j17618j3062P5283J66264
$$ -98322 -298699 -164878 -19639 -114959 -68402 -125405 -115116 -232734 -245796 -170513 -4249
25236d249j3630K4385j43379p6271P2757L6700k6178P3969J03185K7773R4305
$$ -4249 -17879 6506 -136873 -213144 -140387 -103687 -129865 -55896 47289 75062 169367
25225A69367j4876l9747j90636O9993L8022K19254j1651J89892n4956k52901j66144
$$ 169367 154491 114744 -75892 -5899 32123 251377 239726 429618 374662 121761 -44383
25214d4383m8874J62397J30003j13905j61535L08946K36546j74503j31930N4248
$$ -44383 -93257 69140 199143 85238 -76297 232649 469195 294692 162762 217010
25204B17010l4429J48329m0328O3007J54367J12596l00959j01146k7809j80794
$$ 217010 182581 330910 290582 353589 507956 620552 319593 218447 190638 9844
25194I844K1539Q9009j00725k1007R494k0078J22660J46977J43124j18035m30220
$$ 9844 31383 120392 19667 -1340 8154 -11924 110736 257713 400837 282802 -147418
25183a47418r8409J94754j30972J40683K07515l1827m645N5695J77035k41977
$$ -147418 -245827 -51073 -182045 -41362 166153 134326 129681 185376 362411 120434
25173A20434p3960K36373j09222K7675K00165j05848l3757n780r6842j1618j16952
$$ 120434 46474 282847 173625 201300 401465 295617 261860 256080 159238 147620 30668
25162C0668l0034j85540k43400N4712o0159k9604P4099L12733p6480k16818J59683
$$ 30668 634 -184906 -428306 -373594 -433753 -463357 -389258 -76525 -153005 -369823 -210140
25151b10140j01778l5139J68784M6539j50155j58655L6011J78229J85741L0878
$$ -210140 -311918 -347057 -178273 -131734 -281889 -440544 -404533 -226304 -40563 -9685
25141i685m00850l3368K95985J44905k5380j19867L3106J4595K21503K45713J56774
$$ -9685 -410535 -443903 -147918 -3013 -28393 -148260 -115154 -100559 120944 366657 523431
25130E23431n4226Q7644q2776j43856j89517P1279j53508m8046k35174j92400
$$ 523431 469205 556849 474073 330217 140700 211979 58471 10425 -224749 -417149
25120d17149L49449m6207J3292O5885M19552J40959k7603n7263j00277k42020
$$ -417149 -67700 -113907 -100615 -34730 384822 525781 498178 440915 340638 98618
25110I8618j43663k09968j4685J48410j58166J52018q1742j23201J47039L03884
$$ 98618 -45045 -255013 -269698 -121288 -279454 -127436 -209178 -332379 -185340 118544
25100A18544P4038j15746N243j26709J24388Q513k80j24340L9097Q9288J06036
$$ 118544 192582 76836 82079 -44630 79758 88271 87991 -36349 2748 92036 198072
25089A98072p2323n6569K4411j31012k76283J7770M05069J19798L9820n1689n8794
$$ 198072 125749 69180 93591 -37421 -313704 -295934 109135 228933 268753 217064 158270
25078A58270L2863l7379M1362j89121l4473O4474P8808l6395j25657o256J54542
$$ 158270 191133 153754 195116 5995 -28478 35996 114804 78409 -47248 -53504 101038
25067A01038j22293j5448K16923N9308L5263n9741J5261n3239q3490l50j03654
$$ 101038 -21255 -36703 180220 239528 274791 215050 230311 177072 93582 93232 -10422
25056a0422J66785L71792j07941j36931q2233O8261j1911P3787J33870j99880
$$ -10422 156363 528155 420214 283283 201050 269311 257400 331187 465057 265177
25046B65177j62611O5125O4989n579j13651k2898J25600J66467j10517j94836
$$ 265177 102566 167691 232680 227101 113450 90552 216152 382619 272102 77266
25036G7266j47789K04321Q1030p7677j90648K59803j55153q6916K44076j4428
$$ 77266 -70523 133798 214828 137151 -53497 206306 51153 -35763 208313 193885
25026A93885k35441j17211J98635J96924o7934l7316j62012j83309J86635Q1416
$$ 193885 -41556 -158767 39868 236792 168858 131542 -30470 -213779 -27144 54272
25016E4272J73190J46333k99625o5513O8445j76989j48286J90433J49978p2789
$$ 54272 227462 373795 74170 8657 77102 -99887 -248173 -57740 92238 19449
25006A9449m435k13135k36753j12272p9857K10309Q1438J35914J26588K2868K3602
$$ 19449 15014 -198121 -434874 -547146 -627003 -416694 -335256 -199342 -72754 -49886 -26284
24995b6284r4081M2521n7137J4853k6405P7409N6527J88664k4140j16691L9465
$$ -26284 -120365 -77844 -134981 -120128 -146533 -69124 -12597 176067 151927 35236 74701
24984G4701p258J75761k2380J36912R6066j61336j82929q4372O7080M3293r103
$$ 74701 67443 243204 220824 357736 453802 292466 109537 25165 92245 135538 126435
24973A26435k47235r7791j93455m284L30186o4591r8471K0844K0456J99456N1782
$$ 126435 -120800 -218591 -412046 -416330 -86144 -150735 -249206 -228362 -207906 -8450 43332
24962D3332j55886M9637L0962j71023J21297j8070K5725J85698M266N326n5110
$$ 43332 -112554 -62917 -31955 -202978 -81681 -99751 -74026 111672 115938 121264 66154
24951F6154o9063L5122j42149M4377k8739q9102q8885R1321J15212n0363r4764
$$ 66154 -2909 32213 -109936 -65559 -94298 -183400 -272285 -180964 -65752 -116115 -210879
24940b10879R2301J6369q410J66725l8418J28036J90447Q2678K8724l8439k25833
$$ -210879 -118578 -102209 -110619 56106 17688 145724 336171 418849 447573 409134 183301
24929A83301q3693j30770O7795P7688j49895J93400l7725L7792j32678r309q1886
$$ 183301 99608 -31162 36633 114321 -35574 157826 120101 157893 25215 15906 -65980
24918f5980q9393R8452q9740R3584L7303J05991o8033m0821P491n5097k58505
$$ -65980 -155373 -56921 -146661 -53077 -15774 90217 22184 -18637 -11146 -66243 -324748
24907c24748j93832P7653P8737K03101M6395K13248K32399k0784n9317J07006
$$ -324748 -518580 -440927 -362190 -159089 -112694 100554 332953 312169 252852 359858
24897C59858j65080k15809k27060o64N3981L8117N5627q2916J05933J17924k5710
$$ 359858 194778 -21031 -248091 -248755 -194774 -156657 -101030 -183946 -78013 39911 14201
24886A4201M9917l2786J1903p9187n1126J97133J13646K8366j1389J30134L7454
$$ 14201 64118 31332 43235 -35952 -87078 110055 223701 252067 240678 370812 408266
24875D08266j55216J9434J53065q8678l14889k58124J02087J86034K4479j77622
$$ 408266 253050 272484 425549 336871 21982 -236142 -134055 51979 76458 -101164
24865a01164p7260j72338R5800M2840L149Q0668L9546q1014j14638j39267R8707
$$ -101164 -178424 -350762 -254962 -212122 -208973 -128305 -88759 -169773 -284411 -423678 -324971
24854c24971j42170L2388K20339K80013o161q4738j23797P0215K51693j40276
$$ -324971 -467141 -434753 -214414 65599 59438 -25300 -149097 -78882 172811 32535
24844C2535j72242J70522J65081K99982j5095q4922j5813l65523j36721j97023
$$ 32535 -139707 30815 195896 495878 480783 395861 380048 14525 -122196 -319219
24834c19219k4122J86849K15600R2949j5379j76741N6999j15096J60246R0150
$$ -319219 -343341 -156492 59108 152057 136678 -40063 16936 -98160 62086 152236
24824A52236k21088j13420J36199J4277r8928L55544j12997k55745j31924k4397
$$ 152236 -68852 -182272 -46073 -31796 -130724 224820 111823 -143922 -275846 -300243
24814c00243J50523R1481l89731K8375J08034k7011M15156L1620J8939K30501
$$ -300243 -149720 -58239 -447970 -419595 -311561 -338572 76584 108204 127143 357644
24804C57644j31275j19586q4900p6281o1269p8504J47451O0869R2324l35049k67203
$$ 357644 226369 106783 21883 -54398 -115667 -194171 -46720 14149 106473 -228576 -495779
24793d95779K93278J37829r0207j42584K77619N6789j22570n1677j60583K00258
$$ -495779 -202501 -64672 -154879 -297463 -19844 36945 -85625 -137302 -297885 -97627
24783i7627L13935N2662j24500J0727J98115N6358N2898j680j82173l05875k93518
$$ -97627 216308 268970 144470 155197 353312 409670 462568 460888 278715 -27160 -320678
24772c20678J17636K22717k3511l13627k21989q501K94312k4582J53331J40415
$$ -320678 -203042 19675 -3836 -317463 -539452 -547953 -253641 -278223 -124892 15523
24762A5523L9705R9514m7784j06849k82151m8218R2363K43323k13060r5833j05889
$$ 15523 55228 154742 106958 109 -282042 -330260 -237897 5426 -207634 -303467 -409356
24751d09356J03753J16597Q7462q6276j8447J2827P6276J81611J4730q6362j42141
$$ -409356 -305603 -189006 -101544 -187820 -206267 -193440 -117164 64447 79177 -7185 -149326
24740a49326J6828J7018n3970q2563J34175l403k9233J1093r8704N3928o6051
$$ -149326 -132498 -115480 -169450 -252013 -117838 -121241 -150474 -139381 -238085 -184157 -250208
24729b50208p7710J14649J12191K31025J74208q043r8171k38020o4083K11720
$$ -250208 -327918 -213269 -101078 129947 304155 296112 197941 -40079 -104162 107558
24719A07558M9590j60462l35825R6111J28103p8049J17449K83274M185k55716
$$ 107558 157148 -3314 -339139 -243028 -114925 -192974 -75525 207749 211934 -43782
24709d3782n5001J15605j08717M8868K95824J61177K08959M292j62231Q0278q1129
$$ -43782 -98783 16822 -91895 -43027 252797 413974 622933 627225 464994 545272 464143
24698D64143l82323j01993J24874k24278k02572j2039K18304J11332L45244j8695
$$ 464143 81820 -20173 104701 -119577 -322149 -334188 -115884 -4552 340692 321997
24688C21997J36018p829j61537j41479j76976l2136Q7132j08575p2916Q1709J15067
$$ 321997 458015 450186 288649 147170 -29806 -61942 25190 -83385 -156301 -74592 40475
24677D0475k73301j32176j23785j18660K6564J96138J21988l4592K13350J0082
$$ 40475 -232826 -365002 -488787 -607447 -580883 -384745 -262757 -297349 -83999 -73917
24667g3917l4463J30426J97128o2763Q5345j09268j77266J211J93814J12888K6781
$$ -73917 -108380 22046 219174 156411 241756 132488 -44778 -43567 150247 263135 289916
24656B89916L6912j7378J6827J43914p3666j20767j73337l20761j30567Q3782
$$ 289916 326828 309450 326277 470191 396525 275758 102421 -218340 -348907 -265125
24646b65125K3358J19898j53508k30589L8614K5511J04909L5917l5657R0536K03635
$$ -265125 -241767 -121869 -275377 -505966 -467352 -441841 -336932 -301015 -336672 -246136 -42501
24635d2501L6025k0864j31135n5675j60304p9061J41936J8102k78721L9467J37834
$$ -42501 -6476 -27340 -158475 -214150 -374454 -453515 -311579 -293477 -572198 -532731 -394897
24624c94897J01456J21259j06324J01496P4086j49681N2911K4992j05902K62507
$$ -394897 -293441 -172182 -278506 -177010 -102924 -252605 -199694 -174702 -280604 -18097
24614a8097r5307j86251R0286J67851l2618j12666n084k12604j96037K06536M78728
$$ -18097 -113404 -299655 -209369 -41518 -74136 -186802 -191886 -404490 -600527 -393991 84737
24603H4737Q6405k1k02809k31036m1801O4354J91999J66889K2898j64813l1130
$$ 84737 171142 171121 -31688 -262724 -304525 -240171 -48172 118717 141615 -23198 -54328
24592e4328r9494j04332J87885L24947j09076q3374j6894m1362J44976K4857J10733
$$ -54328 -153822 -258154 -70269 254678 145602 62228 45334 3972 148948 173805 284538
24581B84538r3134J56044n2250m14021l26434K26600L28215J96701J30968l19785
$$ 284538 191404 347448 295198 -118823 -445257 -218657 109558 306259 437227 117442
24571A17442j91970m7372O5256J48311J88193O9911k63664j10109j26134k3838
$$ 117442 -74528 -121900 -56644 91667 279860 349771 86107 -24002 -150136 -173974
24561a73974P8926N8506m3952J3761J0419j07842j62033K3301Q1244N7990K71576
$$ -173974 -95048 -36542 -80494 -66733 -56314 -164156 -326189 -302888 -221644 -163654 107922
24550A07922N6234j21429O8784J88157K7217l59100j63547J13163m9252p1252
$$ 107922 164156 42727 111511 299668 326885 -32215 -195762 -82599 -131851 -203103
24540b03103J12170K69974m7955k41960q9858l623J27234L3886k6089k4908L749
$$ -203103 -90933 179041 131086 -110874 -200732 -204355 -77121 -43235 -69324 -94232 -90483
24529i0483m8661J06944m5211k87358J65167K42512J15404l088j66788O0409p0589
$$ -90483 -139144 -32200 -77411 -364769 -199602 42910 158314 155226 -11562 48847 -21742
24518b1742j7329q4503M9283j57251m4206J40361Q217J04377K43334J09825J50456
$$ -21742 -39071 -123574 -74291 -231542 -275748 -135387 -127170 -22793 220541 330366 480822
24507D80822o0547l08244j09572K35446J38439k19849j04282k51953M6013J19312
$$ 480822 420275 112031 2459 237905 376344 156495 52213 -199740 -153727 -34415
24497c4415J66801P1040n4910l00032k68888J08827L5524O7149R5985m0522q6662
$$ -34415 132386 203426 148516 -151516 -420404 -311577 -276053 -208904 -112919 -153441 -240103
24486b40103n011J4658j58628k0815J45262J82127J77450l05245k65698m7657
$$ -240103 -245114 -230456 -389084 -409899 -264637 -82510 94940 -210305 -476003 -523660
24476e23660J27310L43642J1548j19396q6262J09669K02584k0780q0727k77980
$$ -523660 -396350 -52708 -41160 -160556 -246818 -137149 65435 44655 -36072 -314052
24466c14052r7890K50392K51150P1558j00863p2573K8345m2978l08852j13291
$$ -314052 -411942 -161550 89600 161158 60295 -12278 16067 -26911 -335763 -449054
24456d49054K83097J60795P8294l8114m4471m6651o6859M0934j37240L0269j34826
$$ -449054 -165957 -5162 73132 35018 -9453 -56104 -122963 -82029 -219269 -189000 -323826
24445c23826j52770j36675M8205J81998P6225j35747M5901J34642J47078L81227
$$ -323826 -476596 -613271 -565066 -383068 -306843 -442590 -396689 -262047 -114969 266258
24435B66258n2857k50766j18961j59708j80972K07757j07494k0597J49919L63849
$$ 266258 213401 -37365 -156326 -316034 -497006 -289249 -396743 -417340 -267421 96428
24425I6428k3608k99305j83469J24789P2298O7852J84551M5500L1713j54723k79489
$$ 96428 72820 -226485 -409954 -285165 -212867 -145015 39536 85036 116749 -37974 -317463
24414c17463p6952K65916R817Q496p2957j53070J08392J15914R3420P3017K51185
$$ -317463 -394415 -128499 -118682 -110186 -183143 -336213 -227821 -111907 -18487 54530 305715
24403C05715J99719j56359l86112l45601P7466j671J25058K12842j88628J7904
$$ 305715 505434 349075 -37037 -382638 -305172 -306843 -181785 31057 -157571 -139667
24393a39667K5174J5016K02716l15422q0259L04808O5997l9686l80967k28574
$$ -139667 -114493 -99477 103239 -212183 -292442 12366 78363 38677 -342290 -570864
24383e70864L08046J98197J49912K53432m8422m8807r6605R9850R3396j30132
$$ -570864 -262818 -64621 85291 338723 290301 241494 144889 244739 338135 208003
24373B08003q3374j0154J44266j30416P3772N7918K6566n2254j19949j80265j68039
$$ 208003 124629 114475 258741 128325 202097 260015 286581 234327 114378 -65887 -233926
24362b33926q2596K07624o7515j01234J10631J72638J01615K79896j13945M6903
$$ -233926 -316522 -108898 -176413 -277647 -167016 5622 107237 387133 273188 320091
24352C20091k9113j05663k53911j04679j5795J91941j37930r8257K52632J84121
$$ 320091 290978 185315 -68596 -173275 -189070 2871 -135059 -233316 19316 203437
24342B03437r4281J21983j11545r6659k9817j16401N1011O7452L5088o9480R4535
$$ 203437 109156 231139 119594 22935 -6882 -123283 -72272 -4820 30268 -39212 55323
24331E5323L27215K07990m9400r9471p4929J6839k0061r5398n6078m594J11468
$$ 55323 382538 590528 541128 441657 366728 383567 363506 268108 212030 207436 318904
24320C18904K2740k24030k75156L00243L08762r6304r4246j10689j62096j13770
$$ 318904 341644 117614 -157542 142701 451463 355159 260913 150224 -11872 -125642
24310a25642J19997K83887l5990j63558j28699L1112Q2385n0712R4759R0978J50412
$$ -125642 -5645 278242 242252 78694 -50005 -18893 63492 12780 107539 198517 348929
24299C48929o452j39566j85733r2844M202j0711K86904J32842k9236j6686K13396
$$ 348929 342477 202911 17178 -75666 -71464 -82175 204729 337571 308335 291649 505045
24288E05045q4351l35719j12209J85775j00562j12974J17267l5145j38291j68478
$$ 505045 420694 84975 -27234 158541 57979 -54995 62272 27127 -111164 -279642
24278b79642q1896J65354j22473J03220K58696j81587p162R7932J19990J53501
$$ -279642 -361538 -196184 -318657 -215437 43259 -138328 -145490 -47558 72432 225933
24268B25933p0994P9567r4067M372k02717k2882l4064M9953k002j83351o9348
$$ 225933 154939 234506 140439 144811 -57906 -80788 -114852 -64899 -66901 -250252 -319600
24257c19600Q8712o1250Q3957O8720K0890L7435J28360J81225M3503j42797j65209
$$ -319600 -230888 -292138 -208181 -139461 -118571 -81136 47224 228449 271952 129155 -36054
24246c6054Q350k1885L3124j34665m56356k63406J73248L89851J78747O4450J14381
$$ -36054 -27704 -49589 -16465 -151130 -607486 -870892 -697644 -307793 -129046 -64596 49785
24235D9785L38416k04814l4209k5186n3146R265J15435J09669k05266l00236J06041
$$ 49785 388201 183387 149178 123992 70846 80111 195546 305215 99949 -200287 -94246
24224i4246l6889k99735L61311J36739k47674L260P4019j4500K55397J3597k1488
$$ -94246 -131135 -430870 -69559 67180 -180494 -177234 -103215 -117715 137682 151279 129791
24213A29791O131n8354k47706k42322J80278Q5007k0646M2547M0760J1727k60515
$$ 129791 135922 77568 -170138 -412460 -232182 -147175 -167821 -125274 -84514 -72787 -333302
24202c33302r3523L3671L74884L40185K77585j04748l45701L2222J76702K5368
$$ -333302 -426825 -393154 -18270 321915 599500 494752 149051 181273 357975 383343
24192C83343j43946N9071p2926j28800r7425J47691K28443j35962k26914K1484
$$ 383343 239397 298468 225542 96742 -683 147008 375451 239489 12575 34059
24182C4059N9395J8513j65572l0077k3698J31718R8191L3054r6952m8152J02399
$$ 34059 93454 111967 -53605 -83682 -107380 24338 122529 155583 58631 10479 112878
24171A12878p0447k98170j60831o5687j34038J19613p9367P8705K02265l6178
$$ 112878 42431 -255739 -416570 -482257 -616295 -496682 -576049 -497344 -295079 -331257
24161c31257K67169J11062j13648k93503m8320o2707K31485K42225Q8223j29277
$$ -331257 -64088 46974 -66674 -360177 -408497 -471204 -239719 2506 90729 -38548
24151c8548J23441M4865j34210r7535J4459l4747J93983J12191j27520R5110J10941
$$ -38548 84893 129758 -4452 -101987 -87528 -122275 71708 183899 56379 151489 262430
24140B62430k20674q7234j43866j83783J96228J76449Q8885K9188k00845O0095
$$ 262430 41756 -45478 -189344 -373127 -176899 -450 88435 117623 -83222 -23127
24130b3127L5457j05549k9253J33300J47718M5621j08989N4777q648j46800r548
$$ -23127 12330 -93219 -122472 10828 158546 204167 95178 149955 141307 -5493 -15041
24119a5041j40687J39532L16653K35860j09567J27128m7421j34953k14219j25266
$$ -15041 -155728 -16196 300457 536317 426750 553878 506457 371504 157285 32019
24109C2019L2273J0010l2835j421q4830j0569k46365J21369J06079J46516r6416
$$ 32019 64292 74302 41467 40046 -44784 -55353 -301718 -180349 -74270 72246 -24170
24098b4170J49166j00595j34777j07896m8683O1538k06330J6430M555J90802K07175
$$ -24170 124996 24401 -110376 -218272 -266955 -205417 -411747 -395317 -390762 -199960 7215
24087G215O3517n39m3978k8182m5355l0627Q5919k59419k52942J10887L58116
$$ 7215 70732 70193 26215 -1967 -47322 -77949 7970 -251449 -504391 -393504 -35388
24076c5388J44546Q7754M6115L4022q7409k82667j75039r746k6139M3101O5731
$$ -35388 109158 196912 243027 277049 189640 -93027 -268066 -277812 -303951 -260850 -195119
24065a95119k39238J89861K98068k05151K1175K02851l3859q7847k06389P359
$$ -195119 -434357 -244496 53572 -151579 -130404 72447 38588 -49259 -255648 -248289
24055b48289R4453L39701R3918j43882j22483O4042k11912J8131J60142R4273
$$ -248289 -153836 185865 279783 135901 13418 77460 -134452 -116321 43821 138094
24045A38094j6911k6973k08807l0490M950o5599Q175l8818k501K95764O3618k2033
$$ 138094 121183 94210 -114597 -145087 -140137 -205736 -197561 -236379 -238880 56884 120502 98469
24033I8469J15268j5406p454j69741k3996K4850j25902j72329n0777J68845J08660
$$ 98469 213737 198331 190877 21136 -2860 21990 -103912 -276241 -327018 -158173 -49513
24022d9513L8109q4675j51441Q7971l612j5092P6884l1953K52473K04651l90051
$$ -49513 -11404 -96079 -247520 -159549 -163161 -178253 -101369 -133322 119151 323802 -66249
24011f6249q9922K30338J58180P6494O6196J23201q4133l1962m01886j72242o420
$$ -66249 -156171 74167 232347 308841 375037 498238 414105 382143 -19743 -191985 -198405
24000a98405J13263N1654j98873k4731M1123K90655J54293K3973j39465j0679
$$ -198405 -85142 -33488 -232361 -257092 -215969 74686 228979 252952 113487 102808
23990A02808J76161p4847r0016K01003m29443K3661L8374J38437k6923N6634r1755
$$ 102808 278969 204122 114106 315109 -114334 -90673 -52299 86138 59215 115849 24094
23979B4094k51607J31780J05192l4383j45059r5117J65567J25310J33737j00232
$$ 24094 -227513 -95733 9459 -24924 -169983 -265100 -99533 25777 159514 59282
23969E9282k9399Q7973K01137N6195J60j53434j33950l03543n5489J21365k00405
$$ 59282 29883 117856 318993 375188 375348 221914 87964 -215579 -271068 -149703 -350108
23958c50108o6193L4931J06352Q8765K28831o356j39510O2754N9465N9475j47951
$$ -350108 -416301 -381370 -275018 -186253 42578 36222 -103288 -40534 18931 78406 -69545
23947f9545j31380N3623N6204r31j50593k29971K09559Q6967Q3335K49038J68049
$$ -69545 -200925 -147302 -91098 -92029 -242622 -472593 -263034 -176067 -92732 156306 324355
23936C24355l26553j72484m8818R8913N6984J90215J19982O4387k44669J5504
$$ 324355 -2198 -174682 -223500 -124587 -67603 122612 242594 306981 62312 77816
23926G7816j00752q6944K28162N0974j31152q2150p2528j83068Q5602K14772R0280
$$ 77816 -22936 -109880 118282 169256 38104 -44046 -116574 -299642 -214040 732 91012
23915I1012R9217q884l9765k19407j30082N5696L86024R9144K2383j30006j40926
$$ 91012 190229 181345 141580 -77827 -207909 -152213 233811 332955 355338 225332 84406
23904H4406o8724j78178J08008M3087p3812j31940j44261k740J27503n0858J2079
$$ 84406 15682 -162496 -54488 -11401 -85213 -217153 -361414 -364154 -236651 -287509 -275430
23893b75430q276J25356K16991J62157l5569k50925n680J79083K64626j16838
$$ -275430 -283706 -158350 58641 220798 185229 -65696 -71376 107707 372333 255495
23883B55495j08879M2929k48350j29041M6556J08828M6918K7450l4656j49069
$$ 255495 146616 189545 -58805 -187846 -141290 -32462 14456 41906 7250 -141819
23873a41819j73935J13519J3249J3947R1363K8988j03151m820L024J4246j6170
$$ -141819 -315754 -202235 -188986 -175039 -83676 -54688 -157839 -162659 -159635 -145389 -161559
23862a61559j06676N9324j01072J17446q5232J3835K11620j41686m7417J64453
$$ -161559 -268235 -208911 -309983 -192537 -277769 -263934 -52314 -194000 -241417 -76964
23852g6964l5939q3365m8709n7325J22638k5215N3608l0796k2256j13544l8811
$$ -76964 -112903 -196268 -244977 -302302 -179664 -204879 -151271 -182067 -204323 -317867 -356678
23841c56678J58633K88463J44146J52522j05789q5551P5251k45053M583L27069
$$ -356678 -198045 90418 234564 387086 281297 195746 270997 25944 30527 357596
23831C57596q623j46861O962k89212q4805K4945J78042j88015O4297J5358R963
$$ 357596 348973 202112 209074 -80138 -164943 -139998 38044 -149971 -85674 -70316 -60353
23820f0353m8904k65049p3202j31697K8022K35468J35328l16811K28626J58768
$$ -60353 -109257 -374306 -447508 -579205 -551183 -315715 -180387 -497198 -268572 -109804
23810a09804j61964m2078R9402J06970o4222k37556K76700J58898J0790j51794
$$ -109804 -271768 -313846 -214444 -107474 -171696 -409252 -132552 26346 37136 -114658
23800a14658m2162k20981J0132J84753K12129j36641p9501J15921r8969K71718
$$ -114658 -156820 -377801 -367669 -182916 29213 -107428 -186929 -71008 -169977 101741
23790A01741L24749l0472m4654J26685l3811K75352j1811k60887l29867j64288
$$ 101741 426490 396018 351364 478049 444238 719590 707779 446892 117025 -47263
23780d7263M3219j81293j240J34147R9994j91657k18136k35731L945J68745J72906
$$ -47263 -4044 -185337 -186577 -52430 47564 -144093 -362229 -597960 -594015 -425270 -252364
23769b52364K18348L6859R1568O7208j49997K6086P1349p2189J22130J06778j04531
$$ -252364 -34016 2843 94411 161619 11622 37708 109057 36868 158998 265776 161245
23758A61245k17142K5561Q3671l22846m9609J83733J69538j5584k39950j03471
$$ 161245 -55897 -30336 53335 -269511 -319120 -135387 34151 18567 -221383 -324854
23748c24854j19321J57028K98311J57105o9340q0162j09387P8657J75358p3100
$$ -324854 -444175 -287147 11164 168269 98929 18767 -90620 -11963 163395 90295
23738I0295o7367j14611q3355N8457j44088j6317K07207N5636j9350M7511l3403
$$ 90295 22928 -91683 -175038 -116581 -260669 -276986 -69779 -14143 -33493 14018 -19385
23727a9385K7138K78808k67385l56403k21921l9383J76586R7768J80019J66990
$$ -19385 7753 286561 19176 -337227 -559148 -598531 -421945 -324177 -144158 22832
23717B2832K09688J12206L9027n2806j1982p2691k89811k10616J0846J85149J14588
$$ 22832 232520 344726 383753 330947 318965 246274 -43537 -254153 -243307 -58158 56430
23706E6430J7788K70285K4594j04019l6955J46353j7957J21527N9470j20720j92270
$$ 56430 74218 344503 369097 265078 228123 374476 356519 478046 537516 416796 224526
23695B24526k0405j28053J2203p4270J10611O4286K1845l111o0277p9628O0699
$$ 224526 204121 76068 88271 14001 124612 188898 210743 207632 147355 67727 128426
23684A28426P2930l2683j90303j41884P7974J67240L7150R1949K2042J28112j39328
$$ 128426 201356 168673 -21630 -163514 -85540 81700 118850 210799 232841 360953 221625
23673B21625k85175j71973j37774L61667o1504R9765Q2514n9494j82742j31427
$$ 221625 -63550 -235523 -373297 -11630 -73134 26631 109145 49651 -133091 -264518
23663b64518L9446J27756K79455k02130l8913K00087Q4925P6651l42634k38863
$$ -264518 -225072 -97316 182139 -19991 -58904 141183 226108 302759 -39875 -278738
23653b78738j20272K67000R3837o5523k6616Q2220Q6578Q1971j60624j30760Q0983
$$ -278738 -399010 -132010 -38173 -103696 -130312 -48092 38486 120457 -40167 -170927 -89944
23642h9944J39136O9251o1962j83374M5440J36120L7211q5737k18161K06501J29626
$$ -89944 49192 118443 56481 -126893 -81453 54667 91878 6141 -212020 -5519 124107
23631A24107J19645p9581j13436J14609N4170k07580P7773r2072p3762k0249k0173
$$ 124107 243752 164171 50735 165344 219514 11934 89707 -2365 -76127 -96376 -116549
23620a16549n1383j12637P0605J71973L39432M1529j20771k01019J68925M8758
$$ -116549 -167932 -280569 -209964 -37991 301441 342970 222199 21180 190105 238863
23610B38863r9247j32788j22879L9986J32623r6618k53550R3010N35675k5133
$$ 238863 139616 6828 -116051 -76065 56558 -40060 -293610 -200600 335075 309942
23600C09942l60816k35303O8777k9315j90969p540J81350N8795K63001J21575
$$ 309942 -50874 -286177 -217400 -246715 -437684 -445224 -263874 -205079 57922 179497
23590A79497j75498R025P7669J76426K30992M529k83211j97655p3425L4989Q1215
$$ 179497 3999 13024 90693 267119 498111 502640 219429 21774 -51651 -16662 64553
23579F4553J20955K34541j75715k02524p4970p7885J53911K40531L3990N679K16364
$$ 64553 185508 420049 244334 41810 -33160 -111045 42866 283397 317387 323066 539430
23568E39430k25135k77618j02659K78894k6306o4859j914k26090j7680K23979
$$ 539430 314295 36677 -65982 212912 186606 121747 119833 -106257 -123937 100042
23558A00042K52219M8298j13315l29130l43721r8035K38773r9311J29890J7897
$$ 100042 352261 400559 287244 -41886 -385607 -483642 -244869 -344180 -214290 -196393
23548a96393Q186M7900Q7430r6611Q4041J83614O6758J86646P8969j34596p1069
$$ -196393 -188207 -140307 -52877 -149488 -65447 118167 184925 371571 450540 315944 244875
23537B44875n648J22940r3260r1861o1749K7390j41178j78729J41904P5061P3914
$$ 244875 239227 362167 268907 177046 115297 142687 1509 -177220 -35316 39745 113659
23526A13659j41485k4780N0126q4672j06195N6454R9434N8028L6773o7412K4210
$$ 113659 -27826 -52606 -2480 -87152 -193347 -136893 -37459 20569 57342 -10070 14140
23515A4140K5064j5252M095j24079k1401J24757J37741p9673j80443J390Q9427
$$ 14140 39204 23952 28047 -96032 -117433 7324 145065 65392 -115051 -113661 -24234
23504b4234J21296O2577n9973j31902n3481j61925p7703l3206j14823J10702J64614
$$ -24234 97062 159639 99666 -32236 -85717 -247642 -325345 -358551 -473374 -362672 -198058
23493a98058J87566j05035J28045K39465J51260j21090k56945j64813J72332K42780
$$ -198058 -10492 -115527 12518 251983 403243 282153 25208 -139605 32727 275507
23483B75507o5758q8774j56089l1575K15390j00297q5776q6462m6782j34374N224
$$ 275507 209749 120975 -35114 -66689 148701 48404 -37372 -123834 -170616 -304990 -299766
23472b99766J39288Q9285o9252j93199j42861Q0757K13240L08141J53258m1870
$$ -299766 -160478 -71193 -140445 -333644 -476505 -395748 -182508 125633 278891 237021
23462B37021q2694k79304j16869n9207M2811q5895J11229K50145p3949j82522
$$ 237021 154327 -124977 -241846 -301053 -258242 -344137 -232908 17237 -56712 -239234
23452b39234l234N9484j60783j50888K90413K11953J66809J38195m3172q4974
$$ -239234 -242468 -182984 -343767 -494655 -204242 7711 174520 312715 269543 184569
23442A84569K08376j37619j12416q4819j43464j65734J31892L47700N7651k00540
$$ 184569 392945 255326 142910 58091 -85373 -251107 -119215 228485 286136 85596
23432H5596j69956k83504K1327O8978J34410J6589Q973J44271K1972J02699j5812
$$ 85596 -84360 -367864 -346537 -277559 -143149 -126560 -117587 26684 48656 151355 135543
23421A35543m2326p0933k56387O0594J91080K33475P4755m9796k05048j93234
$$ 135543 93217 22284 -234103 -173509 17571 251046 325801 276005 70957 -122277
23411a22277k52950L4582K70970M8475O5449J0380k28703J02228J27444J23586
$$ -122277 -375227 -340645 -69675 -21200 44249 54629 -174074 -71846 55598 179184
23401A79184J26454K99k55433j9986j56059J19659N6672j21948j76026j05984
$$ 179184 305638 305937 50504 30518 -125541 -5882 50790 -71158 -247184 -353168
23391c53168P9341J41374R4893J33811M2845n5199k05531l8199j60948p0507L340
$$ -353168 -273827 -132453 -37560 96251 139096 83897 -121634 -159833 -320781 -391288 -387948
23380c87948R0897K22886K7779K21964J73139j23287q5092J63842L8447j05449
$$ -387948 -297051 -74165 -46386 175578 348717 225430 140338 304180 342627 237178
23370B37178k9411r3502M1985k25806j60907p7085J56667K02674N2006J02621
$$ 237178 207767 114265 156250 -69556 -230463 -307548 -150881 51793 103799 206420
23360B06420p9375j38735k44862p599K38527M9464L8964k51429k36467J45278
$$ 206420 127045 -11690 -256552 -264151 -25624 23840 62804 -188625 -425092 -279814
23350b79814K9804P7414o704O8295j38852m56636K16848K99850L37343K28651
$$ -279814 -250010 -172596 -179300 -111005 -249857 -706493 -489645 -189795 147548 376199
23340C76199k66580k03073K5331k32585j0626r538j6975J89012o4702l1727L2559
$$ 376199 109619 -93454 -68123 -300708 -311334 -320872 -337847 -148835 -213537 -245264 -212705
23329b12705K3438K12800j09507j39212k38109J6923J57035J52060L7747L78596
$$ -212705 -189267 23533 -85974 -225186 -463295 -446372 -289337 -137277 -99530 279066
23319B79066l6602j41270J8179J7383J47652l2896k58114j17405J37722o2442
$$ 279066 242464 101194 119373 136756 284408 251512 -6602 -124007 13715 -48727
23309d8727j57938m5808o1143O1740L45992L38336j4379k8657r5552r8731N4726
$$ -48727 -206665 -252473 -313616 -251876 94116 432452 418073 389416 293864 195133 249859
23298B49859m8252k01766J74701n1127k22342J68415p2191k42397k31211k23725
$$ 249859 201607 -159 174542 123415 -98927 69488 -2703 -245100 -476311 -700036
23288g00036L10766J41893K79408K51171j35828k17757n4310K8048Q0925k40145
$$ -700036 -389270 -247377 32031 283202 147374 -70383 -124693 -96645 -15720 -255865
23278b55865j54989J30609J53905m2727J64421M2908Q7086j95515j02232K7892
$$ -255865 -410854 -280245 -126340 -169067 -4646 38262 125348 -70167 -172399 -144507
23268a44507J99265o0683j55902N3080j50138m5130K12422J93748l070M9111j62590
$$ -144507 54758 -5925 -161827 -108747 -258885 -304015 -91593 102155 99085 148196 -14394
23257a4394j37781j34164j70536j69438K66617K20684J54187j7746j38761J55357
$$ -14394 -152175 -286339 -456875 -626313 -359696 -139012 15175 -2571 -141332 14025
23247A4025K48191K3394j06918j43006j5001R6745J97334J22638n9236q0840m1629
$$ 14025 262216 285610 178692 35686 20685 117430 314764 437402 378166 297326 255697
23236B55697M112q4943N4506k3772j49425K12212P8888n8068k4091P4653R0892
$$ 255697 259809 174866 229372 205600 56175 268387 347275 289207 265116 339769 430661
23225D30661k12747k43381Q4176k5996k04007J5055q1419J26084k8244l14423
$$ 430661 217914 -25467 58709 32713 -171294 -156239 -237658 -111574 -139818 -454241
23215d54241j30192K87441J20157J1426k24684J85128K38595K40922K53020l2856
$$ -454241 -584433 -296992 -176835 -165409 -390093 -204965 33630 274552 527572 494716
23205D94716k36918j84099K14794p760j53453J58093k99046j50213J95254J2311
$$ 494716 257798 73699 288493 280733 127280 285373 -13673 -163886 31368 43679
23195D3679k39052L1828K19103J30732J75297m4412n6504n6149P8715p5937j4553
$$ 43679 -195373 -163545 55558 186290 361587 317175 260671 204522 283237 207300 192747
23184A92747O5674m3770n4514j02082j08696P9575m0479J15218N7454J7543n8163
$$ 192747 258421 214651 160137 58055 -50641 28934 -11545 103673 161127 178670 120507
23173A20507q5539j68095n8609K74166J60585K45592j99808k67381O2422m6810
$$ 120507 34968 -133127 -191736 82430 243015 488607 288799 21418 83840 37030
23163C7030j2777P4153n6216j48181o9688n7800r161j2392m5151M04639L90184
$$ 37030 24253 98406 42190 -105991 -175679 -233479 -242640 -255032 -300183 104456 494640
23152D94640M4197l29542m05665L788J2519K43437K23076p3914m0625Q3207q1397
$$ 494640 538837 209295 -196370 -192582 -180063 63374 286450 212536 171911 255118 173721
23141A73721M7334J80125k08168j10356k47249j25276K43128J58231J159j34178
$$ 173721 221055 401180 193012 82656 -164593 -289869 -46741 111490 112649 -21529
23131b1529l2279K1671K20164m8052q9197M9349P0758J6520j02279j81911o368
$$ -21529 -53808 -32137 188027 139975 50778 100127 170885 187405 85126 -96785 -103153
23120a03153J25673j26696m8628o9603j79821j14513R1171N1754O1171L5533J79354
$$ -103153 22520 -104176 -152804 -222407 -402228 -516741 -425570 -373816 -312645 -277112 -97758
23109i7758J59596j92540l1401J04150r1922m1946R9132n2527M0241K5741m172
$$ -97758 61838 -130702 -162103 -57953 -149875 -191821 -92689 -145216 -104975 -79234 -83406
23098h3406J02315J39381O8383j39524j7306k3619n0107j96400o6955J71160K00592
$$ -83406 18909 158290 226673 87149 69843 46224 -3883 -200283 -267238 -96078 104514
23087A04514n1632j97099J04142J33957J45264j94078j58457Q5405m5236j0428
$$ 104514 52882 -144217 -40075 93882 239146 45068 -113389 -27984 -73220 -83648
23077h3648K89062R8600m0397k36483o418J94474J20595j24172j08067J02035
$$ -83648 205414 304014 263617 27134 20716 215190 335785 211613 103546 205581
23067B05581P6052M8678k62859k04266J82956J4000n6487M1377P709J13794J76805
$$ 205581 281633 330311 67452 -136814 46142 60142 3655 45032 52741 166535 343340
23056C43340m1229k07598r6234j13187M518j60777l0834M41167J04134l41340
$$ 343340 302111 94513 -1721 -114908 -110390 -271167 -302001 139166 243300 -98040
23046i8040p9731Q1168j14193m4900k0823J41284J47693J36230R495p4940R953
$$ -98040 -177771 -96603 -210796 -255696 -276519 -135235 12458 148688 158183 83243 93196
23035I3196P9957l0735r8239j86467M0319J06898p6556j71371J68904K55887J39172
$$ 93196 173153 142418 44179 -142288 -101969 4929 -71627 -242998 -74094 181793 320965
23024C20965k6937p23m8641j01645R9201J04609Q8924j85562j60330j21318j88032
$$ 320965 294028 293305 244664 143019 242220 346829 435753 250191 89861 -31457 -219489
23013b19489L3087Q3338Q2863R4148J21745J61840r7101j58256q9168O5806J29076
$$ -219489 -186402 -103064 -20201 73947 195692 357532 260431 102175 13007 78813 207889
23002B07889j27328L7670j02677l98972l3912J53070K76261L8622l919K70858
$$ 207889 80561 118231 15554 -383418 -417330 -264260 12001 50623 46704 317562
22992C17562J01733j99774J4742j15516j73050O1733M6341J35329J4362N0111
$$ 317562 419295 219521 234263 118747 -54303 7430 53771 189100 203462 253573
22982B53573J86927j17655m05078p0695J8860L8170J29286q3166r2117q9585r799
$$ 253573 440500 322845 -82233 -152928 -134068 -95898 33388 -49778 -141895 -231480 -241279
22971b41279n5182K83558O6946j03402K1965L3840K86969K23202p5543o32k23907
$$ -241279 -296461 -12903 54043 -49359 -27394 6446 293415 516617 441074 440442 216535
22960B16535j20172q0184K9833M4011n667k2964r0788o2616k6698J14788K39857
$$ 216535 96363 16179 46012 90023 84356 61392 -29396 -92012 -118710 -3922 235935
22949B35935j24613L7503J65686J24643p2968j32657j4539m8448j06499j70527
$$ 235935 111322 148825 314511 439154 366186 233529 218990 170542 64043 -106484
22939a06484R1485N9604o7371m7050q0283J7212J18222Q3073j13251J40971j34796
$$ -106484 -14999 44605 -22766 -69816 -150099 -132887 -14665 68408 -44843 96128 -38668
22928c8668N3207l6566q8567J03209Q8525J47220R1246J36930o6030o7265k36975
$$ -38668 14539 -22027 -110594 -7385 81140 228360 319606 456536 390506 323241 86266
22917H6266j93292K0322j7927J88720K62031P5103Q5595N5706j49537j10197N34
$$ 86266 -107026 -86704 -104631 84089 346120 421223 506818 562524 412987 302790 303324
22906C03324r2313J13076n0357k10220j35914R9103M4148k7547j07742j43368
$$ 303324 211011 324087 273730 63510 -72404 26699 70847 43300 -64442 -207810
22896b07810M9337J0201j17829l7612J54776J78736J23746J07795J26321k5571
$$ -207810 -158473 -148272 -266101 -303713 -148937 29799 153545 261340 387661 362090
22886C62090j52466l00085k94282P3022J00579N0413J37078o2206N0370N7460
$$ 362090 209624 -90461 -384743 -311721 -211142 -160729 -23651 -85857 -35487 21973
22876B1973j84411j07062J93212j35503J15451J56124J23993l6311J0259j63609
$$ 21973 -162438 -269500 -76288 -211791 -96340 59784 183777 147466 157725 -5884
22866e884q8631P3284K44555o6353j74216O5422J59403j94128j86838k27710J16075
$$ -5884 -94515 -21231 223324 156971 -17245 48177 207580 13452 -173386 -401096 -285021
22855b85021J60456K45117J9788l9056j5687K89576P4993j24774j22639r3022
$$ -285021 -124565 120552 140340 101284 85597 375173 450166 325392 202753 109731
22845A09731L9880R499j55088j97294L6160J1108N7380J33873m143q0942j14568
$$ 109731 149611 159110 4022 -193272 -157112 -146004 -88624 45249 41106 -39836 -154404
22834a54404q8551J35952R6649o8394j26176J71931K93780L7476k90803j47260
$$ -154404 -242955 -107003 -10354 -78748 -204924 -32993 260787 298263 7460 -139800
22824a39800J60280j19623O7237J41276P180K0128J01884J58714O1751M51353
$$ -139800 20480 -99143 -31906 109370 116550 136678 238562 397276 459027 910380
22814I10380O76045L70251K53904J26106q3301m02068o66054n96242k79701j86357
$$ 910380 1586425 1956676 2210580 2336686 2253385 1851317 1185263 589021 309320 122963
22804A22963J88652L98724o8896j35288o5158k03458j91146k82900k06784L9444
$$ 122963 311615 710339 641443 506155 440997 237539 46393 -236507 -443291 -403847
22794d03847K18100j72859L8500K04129J07284M58748j2961k52736k20601J06209
$$ -403847 -185747 -358606 -320106 -115977 -8693 450055 437094 184358 -36243 69966
22784F9966J10852p7844q3705l62999L8610J32618L26103k00628k85546J36118
$$ 69966 180818 102974 19269 -343730 -305120 -172502 153601 -47027 -332573 -196455
22774a96455k3282J57972J07155o5490L4738J45535j42328P3141j680J6592J40420
$$ -196455 -219737 -61765 45390 -20100 14638 160173 17845 90986 89306 105898 246318
22763B46318k08995l62730j71486N7879J3529P3285P4276J17206q8993j9488K23436
$$ 246318 37323 -325407 -496893 -439014 -425485 -352200 -277924 -160718 -249711 -269199 -45763
22752d5763K15177p2690J33334K23298O4965k70729q5587J81417k29869k28198
$$ -45763 169414 96724 230058 453356 518321 247592 162005 343422 113553 -114645
22742a14645m1939K6042J28878J29212K39849r8365j18590j93138o8910o3004
$$ -114645 -156584 -130542 -1664 127548 367397 269032 150442 -42696 -111606 -174610
22732a74610R390j10091j33507J30234M9493m3391N8014j0115J39576J12462J0243
$$ -174610 -165220 -275311 -408818 -278584 -229091 -272482 -214468 -224583 -85007 27455 37698
22721C7698L5351P2697J01712L225j48057k9883M5080J46331J75433j8323k04864
$$ 37698 73049 145746 247458 250683 102626 72743 117823 264154 439587 421264 216400
22710B16400r6631m085J3152O4143o3235j35902J16100Q3858K85801j35747k01823
$$ 216400 119769 115684 128836 192979 129744 -6158 109942 193800 479601 343854 142031
22699A42031K32845N6303o3272m5258q2901N7790O5656k7677k1970m9427p1700
$$ 142031 374876 431179 367907 322649 239748 297538 363194 335517 313547 264120 192420
22688A92420N6706J66607r8809l22230L8902K02067n4099Q0620K7365J23893k3844
$$ 192420 249126 415733 316924 -5306 33596 235663 181564 262184 289549 413442 389598
22677C89598q4730K2522l4547p1855r8855k03659j29699M3626J90378J81209K73769
$$ 389598 304868 327390 292843 220988 122133 -81526 -211225 -167599 22779 203988 477757
22666D77757K39013m2427j75665J64814K23686j46591m50097p6367K66773r3189
$$ 477757 716770 674343 498678 663492 887178 740587 290490 214123 480896 387707
22656C87707l18891l0077o7038l5166J6622J01145j56335k49838m1950k5103K8017
$$ 387707 68816 38739 -28299 -63465 -46843 54302 -102033 -351871 -393821 -418924 -390907
22645c90907K15049J21532j22912j16566j29888N0989J00805P7586N7137J23490
$$ -390907 -175858 -54326 -177238 -293804 -423692 -372703 -271898 -194312 -137175 -13685
22635a3685M4067R1309J42253J36404l2468k4237K903K9880J08057j21389l5532
$$ -13685 30382 121691 263944 400348 367880 343643 346546 376426 484483 363094 327562
22624C27562j41879l2309M6210k88514j4793n4450Q8031n3959K15662J20864m6260
$$ 327562 185683 153374 199584 -88930 -103723 -158173 -70142 -124101 91561 212425 166165
22613A66165l8807M4963p430j85067l3716M3163j67424k58470M0295q3517K11644
$$ 166165 127358 172321 164891 -20176 -53892 -10729 -178153 -436623 -396328 -479845 -268201
22602b68201K21171r8147o2471l5680j9686J32941R3210R6968L0030J9643j6671
$$ -268201 -47030 -145177 -207648 -243328 -263014 -130073 -36863 60105 90135 109778 93107
22591I3107j6925o0673k36024O2148K09222J3554O9254M4238J2067K13110m0602
$$ 93107 76182 15509 -220515 -158367 50855 64409 133663 177901 189968 403078 362476
22580C62476m5044Q2602M2393j02055m4655m2188j42809r7473j2531k76762k02050
$$ 362476 317432 400034 442427 340372 295717 253529 110720 13247 716 -276046 -478096
22569d78096J00314L75082o364j33807O1524J17130j11447k28230o177K38858
$$ -478096 -377782 -2700 -9064 -142871 -81347 35783 -75664 -303894 -310071 -71213
22559g1213j40774k59940J63956K3682n4326J8663o8792p9805K94325R3890R578
$$ -71213 -211987 -471927 -307971 -284289 -338615 -319952 -388744 -468549 -174224 -80334 -70756
22548g0756J93401J79631j15469j58603J80630M9255j12222r5247P5185P6330
$$ -70756 122645 302276 186807 28204 208834 258089 145867 50620 125805 202135
22538B02135j47963j94698J02944K36584j1633j80538J61118J87799r988k4404
$$ 202135 54172 -140526 -37582 199002 187369 6831 167949 355748 345760 321356
22528C21356P3886K08081j55692k34254p6592p921K14314K23129o5238j02627
$$ 321356 395242 603323 447631 213377 136785 128864 343178 566307 501069 398442
22518C98442k9055M3775k66242N3101n163M0772r5930K8588p8478o4673J97J54785
$$ 398442 369387 413162 146920 200021 194858 235630 139700 168288 89810 25137 25334 180119
22506A80119j0596m7847J69920O1593K31859P3235j32285j00059k18743j12831
$$ 180119 169523 121676 291596 353189 585048 658283 525998 425939 207196 94365
22496I4365K02563K73715J4644o4946l79036k06471j7486n4120Q6302j02560L0986
$$ 94365 296928 570643 585287 520341 141305 -65166 -82652 -136772 -50470 -153030 -122044
22485a22044J72061M8845q4532m9671J86181N8921J07863r7550l1520o8829O9407
$$ -122044 50017 98862 14330 -35341 150840 209761 317624 220074 188554 119725 189132
22474A89132K75011J01173j23597p2532P8936m4072j19930k5329J7637k09402
$$ 189132 464143 565316 441719 369187 448123 404051 284121 258792 276429 67027
22464F7027k16886J00895J52625J72106j4056J510P0756n0127k0376k16275q3170
$$ 67027 -149859 -48964 103661 275767 261711 263221 333977 283850 263474 47199 -35971
22453c5971K03095J64881P2387m8012q4557q20O159L7467j07289n5922J50403
$$ -35971 167124 332005 404392 356380 271823 271003 277162 314629 207340 151418 301821
22442C01821K90347O716n6654j54145k27882l951J34563k48359l33987j9883J1394
$$ 301821 592168 598884 542230 388085 160203 156252 290815 42456 -291531 -311414 -300020
22431c00020L23709J57432n1759o8503J07999o6922k3635J47774J91050j1938
$$ -300020 23689 181121 129362 60859 168858 101936 78301 226075 417125 405187
22421D05187j90820r1010r6152j87415M0963K58374j29067L3753K8595r950J88434
$$ 405187 214367 123357 27205 -160210 -119247 139127 10060 43813 72408 62458 250892
22410B50892m1661J6838j6488j46477k16008j77641J05151L4680j07622j58028
$$ 250892 209231 226069 209581 63104 -152904 -330545 -225394 -190714 -298336 -456364
22400d56364J49244K19185N09616j4883j67651p5308P7996K02870R7721R5653
$$ -456364 -307120 -87935 421681 406798 239147 163839 241835 444705 542426 638079
22390F38079J45678J75037q7659j75904j34840k2370m286K2769L9550J05859K08295
$$ 638079 783757 958794 871135 695231 560391 538021 533735 556504 596054 701913 910208
22379I10208K14028m3382k9838j40484m0526J21464j95350k37584K56409J64308
$$ 910208 1124236 1080854 1051016 910532 870006 991470 796120 558536 814945 979253
22369I79253p5568j81586j15449j40978l8662J34736j21005J21417R9711J89751
$$ 979253 903685 722099 606650 465672 427010 561746 440741 562158 661869 851620
22359H51620K09743m1437K14305O93120N94988M14501N8043j172n76786p13448
$$ 851620 1061363 1019926 1234231 1927351 2522339 2936840 2994883 2993711 2416925 1703477
22349A703477n20878k88242k17017j61523j26277J21174J91205j72025k03131
$$ 1703477 1182599 894357 677340 515817 389540 510714 701919 529894 326763
22340C26763j83485J56163L92927L03644J06950k22850j22997j74309L8194J3662
$$ 326763 143278 299441 692368 996012 1102962 880112 757115 582806 621000 634662
22330F34662k7851o538K44602K25253O3167l26918o5356m1923J96225K11881p993
$$ 634662 606811 600273 844875 1070128 1133295 806377 741021 699098 895323 1107204 1099211
22319A099211k39097j03685K6111Q3531M36585o6340l4818J04120K99015j00851
$$ 1099211 860114 756429 782540 866071 1302656 1236316 1201498 1305618 1604633 1503782
22309A503782k00992j74767j60329K42270q4250n1762J51258J68571K23927n7353
$$ 1503782 1302790 1128023 967694 1209964 1125714 1073952 1225210 1393781 1617708 1560355
22299A560355o1092l0405M41932K97827o9978m95552Q3229K11862K4997J58935
$$ 1560355 1499263 1468858 1910790 2208617 2138639 1643087 1726316 1938178 1963175 2122110
22289B122110J37061K08001K14673K59617J10844k6466J078N1839m4531J32964
$$ 2122110 2259171 2467172 2681845 2941462 3052306 3025840 3026918 3078757 3034226 3167190
22279C167190M14743M87759M69097K76849N64812N75262P53967R08217P88668
$$ 3167190 3581933 4069692 4538789 4815638 5380450 5955712 6709679 7617896 8406564
22270H406564P47550P98988J023072J383991J449320J601325K166816K726167
$$ 8406564 9154114 9953102 10976174 12360165 13809485 15410810 17577626 20303793
22262B0303793L330373M058949N043598N953560P176829Q623544J1329782J5927949
$$ 20303793 23634166 27693115 32736713 38690273 45867102 54490646 65820428 81748377
22254H1748377K3885382L8353123O0719806Q5080725Q9966014O2676884J4534921
$$ 81748377 105633759 143986882 204706688 289787413 379753427 442430311 456965232
22247D56965232n7227494j10523089r7216128n8883649l2560858j8416621j0964391
$$ 456965232 399737738 289214649 191998521 133114872 100554014 82137393 71173002
22240G1173002o253416l805433l453712m907896o297541o213536n636336m982755
$$ 71173002 64919586 61114153 57660441 52752545 46455004 40241468 34605132 29622377
22232B9622377m138059l237995k800162k231884j972495j673496j539469j277504
$$ 29622377 25484318 22246323 19446161 17214277 15241782 13568286 12028817 10751313
22224A0751313j043069p88823p39714q30191n11523n47689m70072l99004k32326
$$ 10751313 9708244 8919421 8179707 7349516 6837993 6290304 5820232 5421228 5188902
22215E188902n77469q52218m60768p46566l13811K7349j8016k17198l22632k29149
$$ 5188902 4611433 3759215 3298447 2551881 2238070 2265419 2247403 2030205 1707573 1478424
22205A478424p0660L4384M3033L9652j32200k7173k52205j66144k27522j13649
$$ 1478424 1407764 1442148 1485181 1524833 1392633 1365460 1113255 947111 719589 605940
22195F05940L6458j59163K2257k05428j91489k46590J19122K65658J99400k34611
$$ 605940 642398 483235 505492 300064 108575 -138015 -18893 246765 446165 211554
22185B11554j01970K26114K29999j21694j16433k3943J9206Q2041p7960j12253
$$ 211554 109584 335698 565697 444003 327570 303627 322833 404874 326914 214661
22175B14661J46181J08885J40051Q7456Q503p6010J98421J31489l7243p9788j04680
$$ 214661 360842 469727 609778 697234 705737 629727 828148 959637 922394 842606 737926
22164G37926o7459j34732p9459q8209j59069M5194j78951K36150J14646j25136
$$ 737926 670467 535735 456276 368067 208998 254192 75241 311391 426037 300901
22154C00901J17448M9122l10761J05186K04207J67588K55903K21221K75170L93680
$$ 300901 418349 467471 156710 261896 466103 633691 889594 1110815 1385985 1779665
22144A779665L99372K62580L9881m37660p06029n48066j64040l3166J47328j0987
$$ 1779665 2179037 2441617 2481498 2043838 1337809 789743 625703 592537 739865 728878
22134G28878k52492n7779k8326n9578J08526j73703j4779q7090J61992J12789
$$ 728878 476386 418607 390281 330703 439229 265526 250747 163657 325649 438438
22124D38438j8442K35698J8571k95745J19552J72365r1133j42564k51298Q3775
$$ 438438 419996 655694 674265 378520 498072 670437 579304 436740 185442 269217
22114B69217k39664k52703J21666J02412R0718N0579n0543j08963M8716k84460
$$ 269217 29553 -223150 -101484 928 91646 142225 91682 -17281 31435 -253025
22104b53025O0730P1159J51207L04129L4122Q5369M759l5040q1232J9613m8006
$$ -253025 -192295 -121136 30071 334200 368322 453691 458450 423410 342178 361791 313785
22093C13785M9052O5082K8663l6724j39726j43354K80430J33895L4493r5153L1329
$$ 313785 362837 427919 456582 419858 280132 136778 417208 551103 585596 490443 521772
22082E21772M6450k7651n8227r9996K7980O6841j23156J2024R6711P0032k20430
$$ 521772 568222 540571 482344 382348 410328 477169 354013 366037 462748 532780 312350
22071C12350j72087l6499j25005K02707J08189J61528j27033o5023m3149q9998
$$ 312350 140263 103764 -21241 181466 289655 451183 324150 259127 215978 125980
22061A25980l06614m6512L4730J414k6290J26895K21362r171k17235l97576O385
$$ 125980 -180634 -227146 -192416 -191002 -217292 -90397 130965 121794 -95441 -493017 -486632
22050d86632K32280J51217J79101n5028j8973p6387R5038M3661o4178J81978N2336
$$ -486632 -254352 -103135 75966 20938 1965 -74422 20616 64277 99 182077 234413
22039B34413r1754k34091p6970j62257M0731J31718Q9861j65055k19321J14539
$$ 234413 142659 -91432 -168402 -330659 -289928 -158210 -68349 -233404 -452725 -338186
22029c38186K6576J30991J13855O5100J14801j66542j71760p0650k7277L1744
$$ -338186 -311610 -180619 -66764 -1664 113137 -53405 -225165 -295815 -323092 -291348
22019b91348O0008N7578o6471j37551n3803N4408R2309r335Q2558M8818N833j2779
$$ -291348 -231340 -173762 -240233 -377784 -431587 -377179 -284870 -294205 -211647 -162829 -156996 -169775
22007a69775N2665N6891j73008k63138J48141K76238K01621o7886k7642J39077
$$ -169775 -117110 -60219 -233227 -496365 -348224 -71986 129635 61749 34107 173184
21997A73184Q0228J4650j76831m7749K0982R4638J78464j20222l1095k0571k41164
$$ 173184 253412 268062 91231 43482 64464 159102 337566 217344 186249 165678 -75486
21986g5486q7191n5388p4417j48915j39641Q4910L61637J60053J60994n1462j65139
$$ -75486 -162677 -218065 -292482 -441397 -581038 -496128 -134491 25562 186556 135094 -30045
21975c0045j05949J48594J01276j07247J6259K7902J29210J23508p3132j66545
$$ -30045 -135994 12600 113876 6629 22888 50790 180000 303508 230376 63831
21965F3831n5018N3901j13792P1236J03260l96785j32162j6430o9041q9565J93936
$$ 63831 8813 62714 -51078 20158 123418 -273367 -405529 -421959 -491000 -580565 -386629
21954c86629J7195o2268o253J70168K58958j36874J18319J25068j0124J42844
$$ -386629 -369434 -431702 -437955 -267787 -8829 -145703 -27384 97684 87560 230404
21944B30404k34785N7696R4751K8531j50928j31514J95730m0848q928q103o7233
$$ 230404 -4381 53315 148066 176597 25669 -105845 89885 49037 40109 32006 -35227
21933c5227j90787n3776Q3420J31460q489J19319j03877k68058K4856j7857R2806
$$ -35227 -226014 -279790 -196370 -64910 -73399 45920 -57957 -326015 -301159 -319016 -226210
21922b26210j47626M3488K83773P9637O6500n0147j46983p4357J66175Q5825k39245
$$ -226210 -373836 -330348 -46575 33062 99562 49415 -97568 -171925 -5750 80075 -159170
21911a59170j07254K62876K322k27998M4408J90737k1335p9481J02452K2692J28047
$$ -159170 -266424 -3548 -1226 -229224 -184816 5921 -15414 -94895 7557 30249 158296
21900A58296R4875K05891O8446j72483n3970O7305J50925j51861l38089p2197
$$ 158296 253171 459062 527508 355025 301055 368360 519285 367424 29335 -42862
21890d2862k92421P9484R3510J28467J13410k9836J75339p4750k14862r5903K24257
$$ -42862 -335283 -255799 -162289 -33822 79588 49752 225091 150341 -64521 -160424 63833
21879F3833K24687J8738j3890n1484j7555R9716J4982o8257k5952M2583j27815
$$ 63833 288520 307258 293368 241884 224329 324045 339027 270770 244818 287401 159586
21868A59586j23665k7393J30026J4665j16959r3711Q2454m8141J97249j40743
$$ 159586 35921 8528 138554 153219 36260 -57451 25003 -23138 174111 33368
21858C3368j81963J31594J49849J44674j40575j17421R2249l8757R9644J53528
$$ 33368 -148595 -17001 132848 277522 136947 19526 111775 73018 172662 326190
21848C26190q5100k22041j26137M6057M4709k16337O5895P6478J19646J7925o2008
$$ 326190 241090 19049 -107088 -61031 -16322 -232659 -166764 -90286 29360 47285 -14723
21837a4723L6096K34553Q1032j89634k29313p6086j4184j57881J29707O5894j29117
$$ -14723 21373 255926 336958 147324 -81989 -158075 -172259 -330140 -200433 -134539 -263656
21826b63656j65808J67856N6218J23821K93693k027k76076m4652M8432R6912J98155
$$ -263656 -429464 -261608 -205390 -81569 212124 210097 -65979 -110631 -62199 34713 232868
21815B32868k60889O0007N4204j65804j37397n0284n7854J98045L50709j23309
$$ 232868 -28021 31986 86190 -79614 -217011 -267295 -325149 -127104 223605 100296
21805A00296k16557K44767K28228m1266o9706K43230J76336m4062o67673k70751
$$ 100296 -116261 128506 356734 315468 245762 488992 665328 621266 -46407 -317158
21795c17158P882J83353k04531j03362K23917J63150q5722k1205k05004N0551
$$ -317158 -309276 -125923 -330454 -433816 -209899 -46749 -132471 -153676 -358680 -308129
21785c08129J62720J62412m6212p0947M1067j17576l21614K38177K45022m4158
$$ -308129 -145409 17003 -29209 -100156 -59089 -176665 -498279 -260102 -15080 -59238
21775e9238j61674k50956K75693J3262M2868J80920k07273j84079J92529R8900
$$ -59238 -220912 -471868 -196175 -182913 -140045 40875 -166398 -350477 -157948 -59048
21765e9048j24005k5317k11627R588K3796l3238J50882P4909J66105J05416k6613
$$ -59048 -183053 -208370 -419997 -410409 -386613 -419851 -268969 -194060 -27955 77461 50848
21754E0848l30706q9725L24505j05158L5399r0359K5612J27611J16128j96041
$$ 50848 -279858 -369583 -45078 -150236 -114837 -205196 -179584 -51973 64155 -131886
21744a31886o161p1847r2993j44174J66818J53325L989k0682K08310J34922q6161
$$ -131886 -138047 -209894 -302887 -447061 -280243 -126918 -122929 -143611 64699 199621 113460
21733A13460K267j17144k3821J72948r8189j19125j19358J71806J73506j8554
$$ 113460 115727 -1417 -25238 147710 49521 -69604 -188962 -17156 156350 137796
21723A37796k10691k20146R839q888k19647O0786J64014O4484q461j18824j74053
$$ 137796 -72895 -293041 -283202 -292090 -511737 -450951 -286937 -222453 -230914 -349738 -523791
21712e23791J28276K68301J36656K60158K11227j60171k79698p7740N5354J14584
$$ -523791 -395515 -127214 9442 269600 480827 320656 40958 -36782 18572 133156
21702A33156j12756K0355N6169N6353j75640k82567q2436p0432J66574L24722
$$ 133156 20400 40755 96924 153277 -22363 -304930 -387366 -457798 -291224 33498
21692C3498L11633J86381R5896j48148m9300k5666J317n333j78316J80925L80212
$$ 33498 345131 531512 627408 479260 429960 404294 405611 400278 221962 402887 783099
21681G83099L06085J87396K77192L30217K19572o0524k56394o29820m87629j5868
$$ 783099 1089184 1276580 1553772 1883989 2103561 2043037 1786643 1156823 669194 653326
21671F53326k01901k19566q7662J75987M8738j83166k15757j12647J37929l3805
$$ 653326 451425 231859 144197 320184 368922 185756 -30001 -142648 -4719 -38524
21661c8524m57482j91416J19703Q4231J09099o9847R9821J43702j4046j95291
$$ -38524 -496006 -687422 -567719 -483488 -374389 -444236 -344415 -200713 -214759 -410050
21651d10050K08250J71932o3314k07110k9307J8141R3892r2738m8238R7592Q5592
$$ -410050 -201800 -29868 -93182 -300292 -329599 -311458 -217566 -310304 -358542 -260950 -175358
21640a75358N8302j03589k0830J24957J28011o4803P072m2395l7212K10768l0710
$$ -175358 -117056 -220645 -241475 -116518 11493 -53310 -46238 -88633 -125845 84923 54213
21629E4213k06946J86693J05274j07827J25413J03164k44570J8941J93757k76086
$$ 54213 -152733 33960 139234 31407 156820 259984 15414 34355 228112 -47974
21619d7974k06794J39330K63189J16894o8826K5721L35394n0733l33910m09258
$$ -47974 -254768 -115438 147751 264645 195819 221540 556934 506201 172291 -236967
21609b36967j30685R3970J51108J34095j97716o5296k7448l3285J16687J26259
$$ -236967 -367652 -273682 -122574 11521 -186195 -251491 -278939 -312224 -195537 -69278
21599f9278n5102m5541R2022O1415N0390J77897o4530k65007L1858J7441Q4907
$$ -69278 -124380 -169921 -77899 -16484 33906 211803 147273 -117734 -85876 -68435 16472
21588A6472l4707r7068l5063J94817K04212L5907J1396k62525J13814M3043K20298
$$ 16472 -18235 -115303 -150366 44451 248663 284570 295966 33441 147255 190298 410596
21577D10596K85652j45596k50857N4826j45650m4494r6257j41414j60609J40667
$$ 410596 696248 550652 299795 354621 208971 164477 68220 -73194 -233803 -93136
21567i3136J31381l458m76908l2207M04991J80464P8483K4142J9204K11328k72135
$$ -93136 38245 34787 -442121 -474328 -69337 111127 189610 213752 232956 444284 172149
21556A72149k43781j08801j2949J03701M8974L8478J7236K5760q6526j36929m4108
$$ 172149 -71632 -180433 -193382 -89681 -40707 -2229 15007 40767 -45759 -182688 -226796
21545b26796N1374J59049J63729k6781j23524O0027p9936J22023K70971l42753
$$ -226796 -175422 -16373 147356 120575 -2949 57078 -22858 99165 370136 27383
21535B7383j73886k05583K14895L5751J1107N7231j42794J17737Q0760J19308
$$ 27383 -146503 -352086 -137191 -101440 -90333 -33102 -175896 -58159 22601 141909
21525A41909J27421J3352j73009j0452R4888j01978Q4218J81619L1370P7029j56182
$$ 141909 269330 282682 109673 99221 194109 92131 176349 357968 389338 466367 310185
21514C10185j7994q8836q4304j5370r5814j75533J68647K01254o9287q3844k19688
$$ 310185 292191 203355 119051 103681 7867 -167666 981 202235 132948 49104 -170584
21503a70584l31780N2946K95569J5832p9213J7476J00155J90226k8357j70000
$$ -170584 -502364 -449418 -153849 -138017 -217230 -199754 -99599 90627 62270 -107730
21493a07730K9295K41275M8925N365m24523p3515K13393N5195j0593j09972J82377
$$ -107730 -78435 162840 211765 217130 -207393 -280908 -67515 -12320 -22913 -132885 49492
21482D9492L5131j57656K7750n2261r5481M3191M9433M8164N07663l5635j44556
$$ 49492 84623 -73033 -45283 -97544 -193025 -149834 -100401 -52237 455426 419791 275235
21471B75235k49297r8916o8569M8589J9865J80930J11189J1316m960r0576k67952
$$ 275235 25938 -72978 -141547 -92958 -73093 107837 219026 230342 225382 134806 -133146
21460a33146j84251k7701n1690J70994J86182L1630L7200l19396J65811K10024
$$ -133146 -317397 -345098 -396788 -225794 -39612 -7982 29218 -290178 -124367 85657
21450H5657N2078j78247m2942K7450r789J53010R6735K5715L0236L9717L8290
$$ 85657 137735 -40512 -83454 -56004 -65793 87217 183952 209667 239903 279620 317910
21439C17910K626l16577k89784k42721K05553K25613J11730k60892J40829L1138
$$ 317910 320536 3959 -285825 -528546 -322993 -97380 14350 -246542 -105713 -74575
21429g4575M3011J45345R7203p3777m001J47494j51931q6695k60453q085K1375
$$ -74575 -31564 113781 210984 137207 133206 280700 128769 42074 -218379 -226464 -205089
21418b05089K71527J15346L4996j02322j38786k45945k15032Q7549K6642l6896
$$ -205089 66438 181784 216780 114458 -24328 -270273 -485305 -397756 -371114 -408010
21408d08010n0116j30981K51666M08363P6053m949j05843j56903K16079l7831
$$ -408010 -458126 -589107 -337441 70922 146975 142026 36183 -120720 95359 57528
21398E7528o2997J74566j77071l22811r5744J92767J2707L7031M6881O0814k38181
$$ 57528 -5469 169097 -7974 -330785 -426529 -233762 -221055 -184024 -137143 -76329 -314510
21387c14510J25792O8813j0868K9731M9974j1535p168k9372J63896J05025k03489
$$ -314510 -188718 -119905 -130773 -101042 -51068 -62603 -69771 -99143 64753 169778 -33711
21376c3711j8076k972J73472J97332j24568r2641P2877k15018p0474J06623q6951
$$ -33711 -51787 -54759 118713 316045 191477 98836 171713 -43305 -113779 -7156 -94107
21365i4107j22725J75422L2864n2625j44459J04851p2501K3871J14327J76552
$$ -94107 -216832 -41410 -8546 -61171 -205630 -100779 -173280 -149409 -35082 141470
21355A41470Q9591J51870j40058k49679m7327j22595Q8080J03880J06813O8914
$$ 141470 231061 382931 242873 -6806 -54133 -176728 -88648 15232 122045 190959
21345A90959l4332j46339r3848J06298O4039j08884O2185n4008P3784L20347n0118
$$ 190959 156627 10288 -83560 22738 86777 -22107 40078 -13930 59854 380201 330083
21334C30083j49682k41295p1425k31597j31426K29387L08682K3361J13566p0016
$$ 330083 180401 -60894 -132319 -363916 -495342 -265955 42727 66088 179654 109638
21324A09638J38186J06001q4588n6502k18025k27820r527K55679M3171o5004k0604
$$ 109638 247824 353825 269237 212735 -5290 -233110 -242637 13042 56213 -8791 -29395
21313b9395j66567l9878J50049J704j23257K2837M9399l8986L1984N7219M6346
$$ -29395 -195962 -235840 -85791 -84087 -207344 -184507 -135108 -174094 -142110 -84891 -38545
21302c8545o8680p0895N2794m7769k629n0404J69539J15333N4583j76765J39467
$$ -38545 -107225 -178120 -125326 -173095 -175724 -226128 -56589 58744 113327 -63438 76029
21291G6029j7044l2516k4674L35573J51050k86005j84225k77751Q1252J95013
$$ 76029 58985 26469 1795 337368 488418 202413 18188 -259563 -178311 16702
21281A6702N8957J98993K09407l9784M9272j68808l52116R0050J48872k12717
$$ 16702 75659 274652 484059 444275 493547 324739 -27377 62673 211545 -1172
21271a172j56128K0271K2903J96956J42772o9947J59590j73907j58670m7754k7897
$$ -1172 -157300 -137029 -114126 82830 225602 155655 315245 141338 -17332 -65086 -92983
21260i2983p296Q827p5601k1221o9757J8878J18277J48745o846Q5006j1287O950
$$ -92983 -100279 -91452 -167053 -188274 -258031 -239153 -120876 27869 21023 106029 94742 101692
21248A01692K1960J81072j66520j81068r0097j46751M5546j0203P5490n8131J4633
$$ 101692 123652 304724 138204 -42864 -132961 -279712 -234166 -244369 -168879 -227010 -212377
21237b12377N2732N6536k00645j87721k784K59722K61799J15004J32748j44580
$$ -212377 -159645 -103109 -303754 -491475 -494259 -234537 27262 142266 275014 130434
21227A30434p7606j21758Q6396K80180j96889r5814p1678p6996j2178l13873j10701
$$ 130434 52828 -68930 17466 297646 100757 4943 -66735 -143731 -155909 -469782 -580483
21216e80483J40346K0744J03567J49540j3930P5624Q5085N7232r2694j80895j91465
$$ -580483 -440137 -419393 -315826 -166286 -180216 -104592 -19507 37725 -54969 -235864 -427329
21205d27329K7209m6313O3969L99553J52602q2058j15578J02977k282J03844l3706
$$ -427329 -400120 -446433 -382464 17089 169691 87633 -27945 75032 72750 176594 142888
21194A42888j50596j27925J24185j27662r3858N3833p3995k59k22009Q7130K41841
$$ 142888 -7708 -135633 -11448 -139110 -232968 -179135 -253130 -253389 -475398 -388268 -146427
21183a46427K20355J42610K0131K00993J48385j08290l09634j00815k18015l39205
$$ -146427 73928 216538 236669 437662 586047 477757 168123 67308 -150707 -489912
21173d89912o5430J89280J37560J01460J60114j94840o7103P1538j2799k0070
$$ -489912 -555342 -366062 -228502 -127042 33072 -161768 -228871 -157333 -170132 -190202
21163a90202K39635r5180j39912J67060J05384j97072m3764j06518r1193K28586
$$ -190202 49433 -45747 -185659 -18599 86785 -110287 -154051 -260569 -351762 -123176
21153a23176J57564N3203m0034R1898M4149o8202N8548P9729J31240K10968k24000
$$ -123176 34388 87591 47557 139455 183604 115402 173950 253679 384919 595887 371887
21142C71887k20406o4453j79674k62717j2673j94844L41208J96336j63791K43314
$$ 371887 151481 87028 -92646 -355363 -368036 -562880 -221672 -25336 -189127 54187
21132E4187J90099j37909n5091J16863J8497j05827j55524k974J32288J24715
$$ 54187 244286 106377 51286 168149 186646 80819 -74705 -77679 54609 179324
21122A79324k86556j11172J16611K41872j08439j50858j88567L4275L58801j59253
$$ 179324 -107232 -218404 -101793 140079 31640 -119218 -307785 -273510 85291 -73962
21112g3962k75724P1619O7075J89524K35643J7266j98149j05470R9990j37034
$$ -73962 -349686 -278067 -210992 -21468 214175 231441 33292 -72178 27812 -109222
21102a09222l25529m926L16776L73994K733j37590k33698p1679J49073k7095M8216
$$ -109222 -434751 -439677 -122901 251093 253826 116236 -117462 -189141 -40068 -67163 -18947
21091a8947K12841j42101j8926N8535j33697j20068J2710J29974N5957k391j42896
$$ -18947 193894 51793 32867 91402 -42295 -162363 -149653 -19679 36278 33887 -109009
21080a09009o9387J20415j17387j7625J46434K06721J75214k26796l8807L12390
$$ -109009 -178396 -57981 -175368 -192993 -46559 160162 335376 108580 69773 382163
21070C82163J20326l1765l29404j67498j82702J9032q0748M9589m6380J22292
$$ 382163 502489 470724 141320 -26178 -208880 -189848 -270596 -221007 -267387 -145095
21060a45095K27835N2692m5521j31724j5757k9375P6674q5620L7140K25860Q6513
$$ -145095 82740 135432 89911 -41813 -57570 -86945 -10271 -95891 -58751 167109 253622
21049B53622n9264n8028l2443k1366n5992K5248R1804K453q036p4921j52959l43426
$$ 253622 194358 136330 103887 82521 26529 51777 143581 146034 137998 63077 -89882 -433308
21037d33308J08533K25189j21347N875R2425j00506J46686K50177R2738j57997
$$ -433308 -324775 -99586 -220933 -215058 -122633 -223139 -76453 173724 266462 108465
21027A08465j75487J87675r7875k54180L2745J45962K26198j11450k00020N0941
$$ 108465 -67022 120653 22778 -231402 -198657 -52695 173503 62053 -137967 -87026
21017h7026Q061K49104j14215j14403j00942Q9449M7366p8403j81321o9148J88451
$$ -87026 -78965 170139 55924 -58479 -159421 -69972 -22606 -101009 -282330 -351478 -163027
21006a63027J88370J98683M7611J30420J9041j90326j31751J55657J00606k1434
$$ -163027 25343 224026 271637 402057 421098 230772 99021 254678 355284 333850
20996C33850k35058J45136N3238j11146J67501J17068k50306j05223J19637r6076
$$ 333850 98792 243928 297166 186020 353521 470589 220283 115060 234697 138621
20986A38621k09588l92458o2798L34316r8363R1864L08261j03723l79864k3420
$$ 138621 -70967 -463425 -526223 -191907 -290270 -198406 109855 6132 -373732 -397152
20976c97152r6217L581J62769R2898m8121p5842P1105l6896l05111j9177L95907
$$ -397152 -493369 -489788 -327019 -234121 -282242 -358084 -286979 -323875 -628986 -648163 -252256
20965b52256J74474j07423N393J68363L9842j4807Q6984k28998l4218J58124O115
$$ -252256 -77782 -185205 -179812 -11449 28393 13586 100570 -128428 -162646 -4522 1593
20954A593l1092J26826R992l039j59024K12063J02359m8218m7686o7437k40701
$$ 1593 -29499 97327 107319 104280 -54744 157319 259678 211460 163774 96337 -144364
20943a44364p5646J41069L59219J77175j53267k61934k0773J08168k27757N6476
$$ -144364 -220010 -78941 280278 457453 304186 42252 21479 129647 -98110 -41634
20933d1634R9195K21991J6531j12164j28908j72889R7059J50009j15245J8056
$$ -41634 57561 279552 296083 183919 55011 -117878 -20819 129190 13945 32001
20923C2001M3781Q5723J28603J06139m4563k11684j52059K04666q2002n2240k35284
$$ 32001 75782 161505 290108 396247 351684 140000 -12059 192607 110605 58365 -176919
20912a76919r0168q4294M653K07657J17260r0574K6570r6557l9639r0215q214
$$ -176919 -267087 -351381 -346728 -139071 -21811 -112385 -85815 -182372 -222011 -312226 -320440
20901c20440o624J17476n8834M6293j64550K8476p4158m3696J14537J99045K12887
$$ -320440 -327064 -209588 -268422 -222129 -386679 -358203 -432361 -476057 -361520 -162475 50412
20890E0412L7461r745l33387j57395k6520L91763n2447k22974P0395J41257J08898
$$ 50412 87873 78128 -255259 -412654 -439174 -47411 -99858 -322832 -252437 -111180 -2282
20879b282O4268J93464r4535j61513j15400j89528k5971J11006K13985J24384
$$ -2282 61986 255450 160915 -598 -115998 -305526 -331497 -220491 -6506 117878
20869A17878M7476J07802m2297j63401k4991j23423N8616J68791j63244m2626
$$ 117878 165354 273156 230859 67458 42467 -80956 -22340 146451 -16793 -59419
20859e9419k4767Q7890P0067J4039n9907k0686j26234K5431k37791J18821K54227
$$ -59419 -84186 3704 73771 87810 27903 7217 -119017 -93586 -331377 -212556 41671
20848D1671L267j55543j22667O5215J30027j49668p0027L01244K36704k4189q0778
$$ 41671 44938 -110605 -233272 -168057 -38030 -187698 -257725 43519 280223 256034 175256
20837A75256M0710m9779j29446J2993n4684k37862K6237K45511J34627j9109K92938
$$ 175256 215966 166187 36741 49734 -4950 -242812 -216575 28936 163563 144454 437392
20826D37392j62563j18179M3905l35737k11917J67043J61746o3211K31427m7881
$$ 437392 274829 156650 200555 -135182 -347099 -180056 -18310 -81521 149906 102025
20816A02025k26284n4173J42963K18675Q3154j32577j20213k3222q5951P0989
$$ 102025 -124259 -178432 -35469 183206 266360 133783 13570 -9652 -95603 -24614
20806b4614J03135q0294k91717o3707M08862J63312o1947q4963J34871O6677j03268
$$ -24614 78521 -1773 -293490 -357197 51665 214977 153030 68067 202938 269615 166347
20795A66347j02624J9047k18402k53395J45040J20588r7759o2815M8274J39757
$$ 166347 63723 82770 -135632 -389027 -243987 -123399 -221158 -283973 -235699 -95942
20785i5942J64344j10025l9602l8038K2104J81460J10337j8480j26547l2625n4909
$$ -95942 68402 -41623 -81225 -119263 -97159 84301 194638 176158 49611 16986 -37923
20774c7923q6761J2114k4353j04459k7l9504L52733p5591o9148O5336k12041j65620
$$ -37923 -124684 -112570 -136923 -241382 -241409 -280913 71820 -3771 -72919 -7583 -219624 -385244
20762c85244q7053N1394J30772Q6770J6270L4150k3719J31860M2840k01429j00264
$$ -385244 -472297 -420903 -290131 -203361 -187091 -152941 -176660 -44800 -1960 -203389 -303653
20751c03653j42643j20320J92398K51525K5920Q1696M2533L3448O6925o9627l34095
$$ -303653 -446296 -566616 -374218 -122693 -96773 -15077 27456 60904 127829 58202 -275893
20740b75893j21995j64121J90978R792q0228O6051L3531k055J86773J67342N8872
$$ -275893 -397888 -562009 -371031 -361239 -441467 -375416 -341885 -343940 -157167 10175 69047
20729F9047J00651r872O6998j86401l13445K25270K25231K0053K5654J4293K12963
$$ 69047 169698 159826 226824 40423 -273022 -47752 177479 197532 223186 237479 450442
20718D50442K48786j19194m79830j34363J53340k1665j46421k27406r0314K40174
$$ 450442 699228 580034 100204 -34159 119181 97516 -48905 -276311 -366625 -126451
20708a26451J49539K53141O0729k10393p7802J07121N9778p5022l6325r3520r4295
$$ -126451 23088 276229 336958 126565 48763 155884 215662 140640 104315 10795 -83500
20697h3500Q8196P2398q5940m3861J3445l0697l0988l43642J79695N0959P9905
$$ -83500 4696 77094 -8846 -52707 -39262 -69959 -100947 -444589 -264894 -213935 -134030
20686a34030J42667J19820k6300p3783O6603k43784k8273p8080l6331l1337m9600
$$ -134030 8637 128457 102157 28374 94977 -148807 -177080 -255160 -291491 -322828 -372428
20675c72428J6640M3647K07795j3067M0822J17270n2230n282J28748Q3519k19701
$$ -372428 -355788 -312141 -104346 -117413 -76591 40679 -11551 -16833 111915 195434 -24267
20664b4267R5575P8912r9597l53372K20880j1091J81766K28585j91700K0858J23503
$$ -24267 71308 150220 50623 -302749 -81869 -92960 88806 317391 125691 146549 270052
20653B70052q180j09232k30929n9756J01970Q9319K5952l7445j80413j22233L4549
$$ 270052 261872 152640 -78289 -138045 -36075 53244 79196 41751 -138662 -260895 -226346
20642b26346J55822J29800j03173j61286J31613n2807R1834J57039o1570j05696
$$ -226346 -70524 59276 -43897 -205183 -73570 -126377 -34543 122496 60926 -44770
20632d4770K10446J65847m9432k01551k06637L36069K33881n2243j96973m20329
$$ -44770 165676 331523 282091 80540 -126097 209972 443853 391610 194637 -225692
20622b25692l96O0907o7087N3288J35925J72487j30513M7735j96549J58974J86079
$$ -225692 -226088 -165181 -232268 -178980 -43055 129432 -1081 46654 -149895 9079 195158
20611A95158L98k28433j58698M1151J72845J39033Q4797q739j36051p1769O3556
$$ 195158 195556 -32877 -191575 -150424 22421 161454 246251 237512 101461 29692 93248
20600I3248J81640k7424r7658j59792q7200R7661k743o0452J33086j04318k78926
$$ 93248 274888 247464 149806 -9986 -97186 475 -2268 -62720 70366 -33952 -312878
20589c12878j5712K69960m7657k23811J09589j47317K23893K96309j22809N8439
$$ -312878 -328590 -58630 -106287 -330098 -220509 -367826 -143933 152376 29567 88006
20579H8006j01049J620m6712j45805k02292k8714K24799K41108N7515R4811J39227
$$ 88006 -13043 -11423 -58135 -203940 -406232 -434946 -210147 30961 88476 183287 322514
20568C22514l62871k38645r180L554R1158M5849J09189J55595k31446k15909O6639
$$ 322514 -40357 -279002 -288182 -284628 -193470 -147621 -38432 117163 -114283 -330192 -263553
20557b63553P2810J06776J97493n40j69571j82523r8719Q9779L4412l8673J29751
$$ -263553 -190743 -83967 113526 112986 -56585 -239108 -337827 -248048 -213636 -252309 -122558
20546a22558J29409K63516J81688j97872n3815j35893l8755k0222r6136j40716
$$ -122558 6851 270367 452055 254183 200368 64475 25720 5498 -90638 -231354
20536b31354M0778K72050K23788p8877k89075j19144j0615k3551J50279J96288
$$ -231354 -190576 81474 305262 226385 -62690 -181834 -192449 -216000 -65721 130567
20526A30567o5822o307Q2753p2293J59036J09652P3368J11479l50574j96811J13509
$$ 130567 64745 58438 141191 68898 227934 337586 410954 522433 171859 -24952 88557
20515H8557K56716n1435L4825k1761p5614l5840n0134j62368K5509N1742J24892
$$ 88557 345273 293838 328663 306902 231288 195448 145314 -17054 8455 60197 185089
20504A85089L9875j60678j91060k26236J21731M01681K66697k00825j47732L2535
$$ 185089 224964 64286 -126774 -353010 -231279 170402 437099 236274 88542 121077
20494A21077m7430l2043K53483J67902k52984j86686j21238j14402j27203J90718
$$ 121077 73647 41604 295087 462989 210005 23319 -97919 -212321 -339524 -148806
20484a48806o7940m8465j5744Q0726J41984r9415K4186N8030j2011J24416O5940
$$ -148806 -216746 -265211 -280955 -200229 -58245 -157660 -133474 -75444 -87455 36961 102901
20473A02901L9888m1173p592m0023j91381M6706k4118K1202O9847K18409K57095
$$ 102901 142789 101616 94024 54001 -137380 -90674 -114792 -93590 -23743 194666 451761
20462D51761l8591l04007j23572O637o0505P5131N5339K6180m08045L6563L56242
$$ 451761 413170 109163 -14409 -7772 -68277 6854 62193 88373 -319672 -283109 73133
20451G3133K1764j31287o4876Q2043J18246J28206j93010j68184J721L9624l04541
$$ 73133 94897 -36390 -101266 -19223 99023 227229 34219 -133965 -132244 -92620 -397161
20440c97161K4506M5756J26196J75344J94855n855j38187j58452K18386j16641
$$ -397161 -372655 -326899 -200703 -25359 169496 163641 25454 -132998 85388 -31253
20430c1253J01944r649o906m5267K945k57732N5298K65292J17277M7885P0441
$$ -31253 70691 61042 54136 8869 11814 -245918 -190620 74672 191949 239834 310275
20419C10275j65557j73845r7278k12349P3991J75940P2505K5497j08533J67975
$$ 310275 144718 -29127 -126405 -338754 -264763 -88823 -16318 9179 -99354 68621
20409F8621P4603j46259O8040r3986k67666j5561p2490J17278K35886N7803L0608
$$ 68621 143224 -3035 65005 -28981 -296647 -312208 -384698 -267420 -31534 26269 56877
20398E6877j08612j72571J9108L06546P3041j02168J42315J43286j90139k90224
$$ 56877 -51735 -224306 -205198 101348 174389 72221 214536 357822 167683 -122541
20388a22541j31423n680q5320m1050J46396J45676m9384k9642J63082J72016k89731
$$ -122541 -253964 -259644 -344964 -386014 -239618 -93942 -143326 -172968 -9886 162130 -127601
20377a27601o8017K08935L1116k78675n5128J47462n1187P5073o1118k27163n7465
$$ -127601 -195618 13317 44433 -234242 -289370 -141908 -193095 -118022 -179140 -406303 -463768
20366d63768J27266P8337M9104K94487L55018j38640j76445l3956o224J03550
$$ -463768 -336502 -258165 -209061 85426 440444 301804 125359 91403 85179 188729
20356A88729j76935n5934j26395j89612J43806K07299K341J2731l4375J92219
$$ 188729 11794 -44140 -170535 -360147 -216341 -9042 -6701 6030 -28345 163874
20346A63874k2753k29959j96070L6132J07629J73038K11635p8367p6469j79736
$$ 163874 141121 -88838 -284908 -248776 -141147 31891 243526 165159 88690 -91046
20336i1046j92889n2265K04212n3715j00801o8004K3192R2379J97483j90835o8057
$$ -91046 -283935 -336200 -131988 -185703 -286504 -354508 -331316 -238937 -41454 -232289 -300346
20325c00346P4041K8777J28288K23949O2908P665j18386m3421j70487k47797J0266
$$ -300346 -226305 -197528 -69240 154709 217617 225282 106896 63475 -107012 -354809 -344543
20314c44543R2218j8870J23418N0995K61396P7411o950K3581j7096j87368j43246
$$ -344543 -252325 -271195 -147777 -96782 164614 242025 235075 258656 241560 54192 -89054
20303h9054P9461j24767k60804q1467K11645J20804J46273J81710k65858m5926
$$ -89054 -9593 -134360 -395164 -476631 -264986 -144182 2091 183801 -82057 -127983
20293a27983l0842O4156J28834O5989j20030k337k94507j44824K0211J82855k2556
$$ -127983 -158825 -94669 34165 100154 -19876 -22213 -316720 -461544 -441333 -258478 -281034
20282b81034N0020j58433J742K91287k03178k10999L71319R6847o4576K39969
$$ -281034 -231014 -389447 -387705 -96418 -299596 -510595 -139276 -42429 -107005 132964
20272A32964J18089M9133j41090k55245m66814L06666K10767j01245J06260L6025
$$ 132964 251053 300186 159096 -96149 -562963 -256297 -45530 -146775 -40515 -4490
20262d490j03463J17912j09272j50988j03478m5193J30051k7555J94217O1820
$$ -4490 -107953 9959 -99313 -250301 -353779 -398972 -268921 -296476 -102259 -40439
20252d0439j3422j5734J21399l3190k94167j23617j08815L7757K52620M9987n0907
$$ -40439 -53861 -69595 51804 18614 -275553 -399170 -507985 -470228 -217608 -167621 -218528
20241b18528P0630L03720j7409k38689l478l494k59571p9790J69838J85048L0559
$$ -218528 -147898 155822 138413 -100276 -103754 -107248 -366819 -446609 -276771 -91723 -61164
20230f1164J8224Q3685k6130N7069K12424J5187M1049j91799n495J80548j80579
$$ -61164 -42940 40745 14615 71684 284108 299295 340344 148545 143050 323598 143019
20219A43019j74037n8436K56730L30938p0547j34911L5137k7561j18153m26588
$$ 143019 -31018 -89454 167276 498214 427667 292756 327893 300332 182179 -244409
20209b44409O1883K57559j06849J10576j20509J40458m0012r4665J21587l5772
$$ -244409 -182526 75033 -31816 78760 -41749 98709 58697 -35968 85619 49847
20199D9847p985J33331P7745j67237j24881K66215J87679k51606l07642J4671
$$ 49847 41862 175193 252938 85701 -39180 227035 414714 163108 -144534 -129863
20189a29863J64804M0259l9129j67715R2899r2232p5570J86680J7133o4619n3294
$$ -129863 34941 75200 36071 -131644 -38745 -130977 -206547 -19867 -2734 -67353 -120647
20178a20647p0976k48176J74028P0662O1699k68001q6618K39081k3450J19073
$$ -120647 -191623 -439799 -265771 -195109 -133410 -401411 -488029 -248948 -272398 -153325
20168a53325O3497N1244m4410m6261m7004k9216k06658K4411K85528O1143Q8756
$$ -153325 -89828 -38584 -82994 -129255 -176259 -205475 -412133 -387722 -102194 -41051 47705
20157D7705J84923J62539j92306k90467q8503N0739o733L78937K94181r2743n5995
$$ 47705 232628 395167 202861 -87606 -176109 -125370 -132103 246834 541015 448272 392277
20146C92277j22730J45890N1858K328k05439j95681q0085j20995n8835J98757
$$ 392277 269547 415437 467295 469623 264184 68503 -11582 -132577 -191412 7345
20136G345K31430j74453j19059j4680K3557k2957K3811k860j14269n5297J55093
$$ 7345 238775 64322 -54737 -69417 -45860 -68817 -45006 -47866 -162135 -217432 -62339
20125f2339J40948K21156n8329l26962j92722K0230K24066n042k64502K38788
$$ -62339 78609 299765 241436 -85526 -278248 -258018 -33952 -38994 -303496 -64708
20115f4708K94701J31156j40066j18547q0795M3576J13722k50189J30544O2749
$$ -64708 229993 361149 221083 102536 21741 65317 179039 -71150 59394 122143
20105A22143k95069j0563p309J29244L4661k43558o8369K21747J84444r2334k00355
$$ 122143 -172926 -183489 -190798 -61554 -26893 -270451 -338820 -117073 67371 -24963 -225318
20094b25318K45603J88951o8730k56977j75424n7596K5957L29070R1451Q1831
$$ -225318 20285 209236 140506 -116471 -291895 -349491 -323534 5536 96987 178818
20084A78818n347l23794j59098J49155J90132J67765m3097j88718j90060J05303
$$ 178818 173471 -150323 -309421 -160266 29866 197631 154534 -34184 -224244 -118941
20074a18941p0916n7837R7789J7149R5658Q5230K08737n3678j37924o9432o4375
$$ -118941 -189857 -247694 -149905 -132756 -37098 48132 256869 203191 65267 -4165 -68540
20063f8540m3409P428P3069P6098k92965M8631L54830p9560J8012m6729j28827
$$ -68540 -111949 -104521 -31452 44646 -248319 -199688 155142 75582 93594 46865 -81962
20052h1962l0202N5141O2696j80583o2225L2861k8708j2596N4596J13966K58911
$$ -81962 -112164 -57023 5673 -174910 -237135 -204274 -232982 -245578 -190982 -77016 181895
20041A81895m7307P5280q553p8062j9364j0007N4657o5008J13904J73609O7631
$$ 181895 134588 209868 201315 123253 103889 93882 148539 83531 197435 371044 438675
20030D38675k62907k42456o2610Q5963K00615J29692k42168r1647K6337Q2206
$$ 438675 175768 -66688 -129298 -43335 157280 286972 44804 -46843 -20506 61700
20020F1700J29767L0133k11991j43017P3521J12667P7659o1386j91093j97261
$$ 61700 191467 221600 9609 -133408 -59887 52780 130439 69053 -122040 -319301
20010c19301Q9699O5833J12848L957N8884k4942l75614J5720K76891Q7586k4874
$$ -319301 -229602 -163769 -50921 -46964 11920 -13022 -388636 -372916 -96025 -8439 -33313
19999c3313k79200J56047J63244k7127j29857O9041j7341l8646M0255J09406J68593
$$ -33313 -312513 -156466 6778 -20349 -150206 -81165 -98506 -137152 -96897 12509 181102
19988A81102K16388J60158k6561l76796j14411n2548r9890p5858K11J81124q4725
$$ 181102 397490 557648 531087 154291 39880 -12668 -112558 -188416 -188205 -7081 -91806
19977i1806k4951J40179J76224K3508J27363r5647k2813N1686q0266n0520O1358
$$ -91806 -116757 23422 199646 223154 350517 254870 232057 283743 203477 152957 214315
19966B14315L305O8210j61323j15637N541O6415m4767J7210K0031M5901j39491
$$ 214315 217620 285830 124507 8870 14411 80826 36059 53269 73300 119201 -20290
19955b0290J18452J03595J8804R2034J3586Q0203L1860l0554j46462Q5656j19232
$$ -20290 98162 201757 220561 312595 326181 406384 438244 407690 261228 346884 227652
19944B27652k81107j5612p3752q7603O6166M07489K35417M433j80379j59883k67607
$$ 227652 -53455 -69067 -142819 -230422 -164256 243233 478650 483083 302704 142821 -124786
19933a24786j88497R8156l338O4455L27261J58349m1124k00033l0935j59398Q6184
$$ -124786 -313283 -215127 -218465 -154010 173251 331600 290476 90443 59508 -99890 -13706
19922a3706M4595k34104m9752K3132J80738Q8307J16992J5334r5885Q0918p4799
$$ -13706 30889 -203215 -252967 -229835 -49097 39210 156202 171536 75651 156569 81770
19911H1770O5205J87620q589p0802p6236J8k34252m2388J54443o4965j21409O7419
$$ 81770 146975 334595 326006 255204 178968 178986 -55266 -97654 56789 -8176 -129585 -62166
19899f2166K7614N3725L3431j60301j69484J34717K33784j75514k6777J65593
$$ -62166 -34552 19173 52604 -107697 -277181 -142464 91320 -84194 -110971 54622
19889E4622N3283J24565j05164j99456l59252J21373K26690L7575J4118J05048
$$ 54622 107905 232470 127306 -72150 -431402 -310029 -83339 -45764 -31646 73402
19879G3402m1745J00148K44376J9786l3734n6877m1474J47223j56867j1079N4038
$$ 73402 31657 131805 376181 395967 362233 305356 263882 411105 254238 243159 297197
19868B97197j59637l98042j51996K4978O1166K33442k047j22048O5320J87198
$$ 297197 137560 -260482 -412478 -387500 -326334 -92892 -94939 -216987 -151667 35531
19858C5531J0501o5919P2657Q5472M5910J71768j53999k02327J65037K2307n1238
$$ 35531 46032 -19887 52770 138242 184152 355920 201921 -406 164631 186938 135700
19847A35700j56427l9929n4141J05717j18806l34924K89950J28616m9223o892
$$ 135700 -20727 -60656 -114797 -9080 -127886 -462810 -172860 -44244 -93467 -100359
19837a00359j25924J23245J03517R7755J08256j7596j88984J04488k0805j7246
$$ -100359 -226283 -103038 479 98234 206490 188894 -90 104398 83593 66347
19827F6347N342O6296N1816l2708K7959m3436K0718m5547j86859N9063Q8390p7873
$$ 66347 71689 137985 189801 157093 185052 141616 162334 116787 -70072 -11009 77381 -492
19815d92j42083j5483k3232J02642K09787m0290k13203k47086L2050J55120Q4970
$$ -492 -142575 -158058 -181290 -78648 131139 90849 -122354 -369440 -337390 -182270 -97300
19804i7300Q1067L9002j40335J5895O9015J4640j46407r8477k65411L1176m9870
$$ -97300 -16233 22769 -117566 -101671 -32656 -18016 -164423 -262900 -528311 -497135 -547005
19793e47005J53413j18307j05763P7055L35366K75589J79198l3123j38005O5892
$$ -547005 -393592 -511899 -617662 -540607 -205241 70348 249546 216423 78418 144310
19783A44310j77972k50779O4322O1247K34151K5303M0667p8784J02046j15931
$$ 144310 -33662 -284441 -220119 -158872 75279 100582 141249 62465 164511 48580
19773D8580k43840K12632L8825j31588M6877L8042R9887L4964l1686R497l20925
$$ 48580 -195260 17372 56197 -75391 -28514 9528 109415 144379 112693 122190 -198735
19762a98735O3206J38667j21633K9128K73736J39763o9039o2009n1789k92612
$$ -198735 -135529 3138 -118495 -89367 184369 324132 255093 193084 141295 -151317
19752a51317j91636J80141J70169L4133m8876J072J55595J22189j78514l05022
$$ -151317 -342953 -162812 7357 41490 -7386 -6314 149281 271470 92956 -212066
19742b12066n561O3217L2532K07751J69153k57921r4772j2300J27986J11967J18061
$$ -212066 -217627 -154410 -121878 85873 255026 -2895 -97667 -109967 18019 129986 248047
19731B48047J036j0553Q9490k02090k64918J08755L03600R6310K9546J21691o4736
$$ 248047 249083 238530 328020 125930 -138988 -30233 273367 369677 399223 520914 456178
19720D56178j56353P8488o0761j87020m6911J32921J27250k01448k42334Q2680
$$ 456178 299825 378313 317552 130532 83621 216542 343792 142344 -99990 -17310
19710a7310k7889r5169J77255j3561Q789m6951j5294M1994J27928j97138K6899
$$ -17310 -45199 -140368 36887 23326 32115 -14836 -30130 11864 139792 -57346 -30447
19699c0447k1103j24569l4782R9163J07259j464j94210k24242N6391J09184K72464
$$ -30447 -51550 -176119 -210901 -111738 -4479 -5943 -200153 -424395 -368004 -258820 13644
19688A3644J41063J57537k17761k34419J60645L04051K694j76735r3553k6720
$$ 13644 154707 312244 94483 -139936 20709 324760 327454 150719 57166 30446
19678C0446n9494o1000k40J27971Q6630M599j99465r7025Q6203k27733K62120
$$ 30446 -29048 -90048 -90288 37683 124313 128912 -70553 -167578 -81375 -309108 -46988
19667d6988L59166j59905m0562O7784K203k12722M3557j005n1531j36499N4556
$$ -46988 312178 152273 111711 179495 181698 -31024 12533 11528 -40003 -176502 -121946
19656a21946L19715o226J38633M4908R1320j99396k61549l5229J94146J40431
$$ -121946 197769 191543 330176 375084 466404 267008 5459 -29770 164376 304807
19646C04807L6231k00880o4179J68994k43476l34379J89431J60144J78024o3970
$$ 304807 341038 140158 75979 244973 1497 -332882 -143451 16693 194717 130747
19636A30747p2765o0304K5142K1684k36377J30564J88472j83700k28126j8152
$$ 130747 57982 -2322 22820 44504 -191873 -61309 127163 -56537 -284663 -302815
19626c02815J06020P6938p9799K96596J25656J79921J7821j67773N5182O3744
$$ -302815 -196795 -119857 -199656 96940 222596 402517 420338 252565 307747 371491
19616C71491m5752k55136J35772J65091K8427j35691j52290q6375j17728K70155
$$ 371491 325739 70603 206375 371466 399893 264202 111912 25537 -92191 177964
19606A77964J27694q8721j33435m6238r878J4101P8447o1540k9554M5047J32675
$$ 177964 305658 216937 83502 37264 27386 41487 119934 58394 28840 73887 206562
19595B06562N839K71634O7266j28814p5989j17346j16716N9311p2659n6903K9217
$$ 206562 212401 484035 551301 422487 346498 229152 112436 171747 99088 42185 71402
19584G1402l8061k03451j38248K10601P0020K3425n1914M9673j72356j33856O0849
$$ 71402 33341 -170110 -308358 -97757 -27737 -4312 -56226 -6553 -178909 -312765 -251916
19573b51916J32288l5546M8562K61008R5512m4879k03322K06917k842k28880j42148
$$ -251916 -119628 -155174 -106612 154396 249908 205029 1707 208624 205782 -23098 -165246
19562a65246N2859J19473Q784r8888j80391K07465L08494l0868n6750N1878J57646
$$ -165246 -112387 7086 15870 -83018 -263409 -55944 252550 221682 164932 216810 374456
19551C74456m6106K6856Q9616r5274L9378P9214Q7143j85772j09859L3141m19488
$$ 374456 328350 355206 444822 349548 388926 468140 555283 369511 259652 292793 -126695
19540a26695L08202J00532L7765J48455j74056j39552q8757q6192L778j94489
$$ -126695 181507 282039 319804 468259 294203 154651 65894 -20298 -16520 -211009
19530b11009j58086p6480J18724R4558o7017J55848M73035K46958j96572o4187
$$ -211009 -369095 -445575 -326851 -232293 -299310 -143462 329573 576531 379959 315772
19520C15772l97535j82760J99600Q1084j52056l29043M7697K09660Q6661J71298
$$ 315772 -81763 -264523 -64923 16161 -135895 -464938 -417241 -207581 -120920 50378
19510E0378L78088q8796k97077j09098L13420L5634j59250k40500p8918J51691
$$ 50378 428466 339670 42593 -66505 246915 282549 123299 -117201 -196119 -44428
19500d4428K39474J17519J69701j59264Q9659J32901N400n1857k58480j72544
$$ -44428 195046 312565 482266 323002 412661 545562 550962 499105 240625 68081
19490F8081R53m1888j33021N2120K03245j24587m7372j2014J11613Q7007j34623
$$ 68081 69034 27146 -105875 -53755 149490 24903 -22469 -34483 77130 164137 29514
19479B9514j0712R840J11135j73198k6684J68790L6617p3836K06882p0561o152
$$ 29514 18802 28642 139777 -33421 -60105 108685 145302 71466 278348 207787 201635
19468B01635k4755o7349j35590o6940K11065J33095K24810Q0537j42236j78277
$$ 201635 176880 109531 -26059 -92999 118066 251161 475971 556508 414272 235995
19458B35995M7891j10090j09111K0352O506M016N1617K55116j52077o1864J9406
$$ 235995 283886 173796 64685 85037 91543 95559 147176 402292 250215 188351 207757
19447B07757k4586j1898q6400K3260K11202Q0340j46395j75557l503p160N8943
$$ 207757 183171 171273 84873 108133 319335 399675 253280 77723 74220 67060 126003
19436A26003j6755J9345q2498p400j79838k8738k1452K1944Q6170J72063J6528
$$ 126003 109248 128593 46095 38695 -141143 -169881 -191333 -169389 -83219 88844 105372
19425A05372n1727q4662L6206k2294j16744k5064j37479p452P6407K0454J39152
$$ 105372 53645 -31017 5189 -17105 -133849 -158913 -296392 -303844 -227437 -206983 -67831
19414f7831J92226K02116J18894j05924K3980q5556j68732j08861K47263Q8834
$$ -67831 124395 326511 445405 339481 363461 277905 109173 312 247575 336409
19404C36409k54184j85894L9074J59093J4499K03726j67506k05749p1576k3581
$$ 336409 82225 -103669 -64595 94498 108997 312723 145217 -60532 -132108 -155689
19394a55689j42867K61577p8273o5359m9503l8485J87483O0102R334Q7028O4819
$$ -155689 -298556 -36979 -115252 -180611 -230114 -268599 -81116 -21014 -11680 75348 140167
19383A40167K0210J65196k17740p5039j08101J3465K51014p2122J07534n4982
$$ 140167 160377 325573 107833 32794 -75307 -61842 189172 117050 224584 169602
19373A69602L3640K2493j0725Q4113P0770N1194o1431n5150p5972j61970m2296
$$ 169602 203242 225735 215010 299123 369893 421087 359656 304506 228534 66564 24268
19362B4268N0925k35350L0624J35950K79563J27129N9829j59466l0589j43249
$$ 24268 75193 -160157 -129533 6417 285980 413109 472938 313472 282883 139634
19352A39634K9865J03282j51386j48058K6425Q4717K58485L2353J10033j7451
$$ 139634 169499 272781 121395 -26663 -238 84479 342964 375317 485350 467899
19342D67899j65182J97831m2266j28483m5804N6980J55625n0157j42539m0353
$$ 467899 302717 500548 458282 329799 283995 340975 496600 446443 303904 263551
19332B63551K09868j17321j97026j54518J60282J07149m49443o2145J46293m6440
$$ 263551 473419 356098 159072 4554 164836 271985 -177458 -239603 -93310 -139750
19322a39750O7232N9281P4443Q2875K06783K40508J29842k5713L19383L06654
$$ -139750 -72518 -13237 61206 144081 350864 591372 721214 695501 1014884 1321538
19312A321538J85481J73497l69111m01949k69323j26492n645r9606r5164O5065
$$ 1321538 1507019 1680516 1311405 909456 640133 513641 507996 408390 313226 378291
19302C78291Q2642K2099O1180l3284j24742J60160M1143r2663j45573J17806J90147
$$ 378291 460933 483032 544212 510928 386186 546346 587489 494826 349253 467059 657206
19291F57206L90270J14585J79461R8128q4877m7064k88188m77035j64723k71551
$$ 657206 1047476 1162061 1341522 1439650 1354773 1307709 1019521 542486 377763 106212
19281A06212k87903J37705M9682j40757M4219p4723K71264O2807n716J23567J46342
$$ 106212 -181691 -43986 5696 -135061 -90842 -165565 105699 168506 162790 286357 432699
19270D32699L3766j23823n2439K7377k18287l2510J30356M2895j36674J00352
$$ 432699 466465 342642 290203 317580 99293 66783 197139 240034 103360 203712
19260B03712K21516m045k31734k2625R7220r5093q1741j77303J19247J78253Q8523
$$ 203712 425228 421183 189449 166824 264044 168951 87210 -90093 29154 207407 295930
19249B95930J6900l5620o1153n6280K72746P0569k25858j44456k06883p5731J9670
$$ 295930 312830 277210 216057 159777 432523 503092 277234 132778 -74105 -149836 -130166
19238a30166Q3250K45353J13779L6432j30683p7737j33064J00185j29268j03555
$$ -130166 -46916 198437 312216 348648 217965 140228 7164 107349 -21919 -125474
19228a25474n7391m798J93141l9966j32080K30260J77372K06039j20663k51050
$$ -125474 -182865 -187663 5478 -34488 -166568 63692 241064 447103 326440 75390
19218G5390K6066J97826Q0706j59769k67265l1056K18238j16792k15256r5996
$$ 75390 101456 299282 379988 220219 -47046 -78102 140136 23344 -191912 -287908
19208b87908J20325l2714K52766Q9982o6585O0665o7422J68975O56Q7640K87440
$$ -287908 -167583 -200297 52469 142451 75866 136531 69109 238084 238740 326380 613820
19197F13820M3361m6815J8926j36461k71766o5892o567p9619j56295M6744L31212
$$ 613820 657181 610366 629292 492831 221065 155173 148606 68987 -87308 -40564 290648
19186B90648l0951k6212J01836N2313j25642j32360j38906j45023R7163K03534
$$ 290648 259697 233485 335321 387634 261992 129632 -9274 -154297 -57134 146400
19176A46400j2832K13089M9730m54930r6588j4193l4369O3900J63468L021k7714
$$ 146400 133568 346657 396387 -58543 -155131 -169324 -203693 -139793 23675 26696 -1018
19165a018m7640J36446R2689K11841n7753j13475o8479k0934P3849k58605m0156
$$ -1018 -48658 87788 180477 392318 334565 221090 152611 131677 205526 -53079 -93235
19154i3235J31724J93584J71465k01771J7125k9809k8363J72796J12110n4543
$$ -93235 38489 232073 403538 201767 218892 189083 160720 333516 445626 391083
19144C91083j91970k9072J44641q3716J68424J21684l9063k65564k63548j87785
$$ 391083 199113 170041 314682 230966 399390 521074 482011 216447 -47101 -234886
19134b34886J30240J2125R2975J384R8631J01423m2349K35205J39656m8174M837
$$ -234886 -104646 -92521 454 1838 100469 201892 159543 394748 534404 486230 491067
19123D91067J02875J70850j22366M4387R225l3020k53778p9426J93119j30295
$$ 491067 593942 764792 642426 686813 696038 663018 409240 329814 522933 392638
19113C92638q550P0268k460r33L6869k1501J9501J17307J63442J55443P1803J74190
$$ 392638 384088 454356 451896 450963 487832 466331 485832 603139 766581 922024 993827 1168017
19101A168017j5618j06536r5311k48310p9456O9880K0355p757J29512P7729K58241
$$ 1168017 1152399 1045863 950552 702242 622786 692666 713021 705264 834776 912505 1170746
19090A170746P6996k08041n9075q0559j15869N1231k62703k97801J63791N89717
$$ 1170746 1247742 1039701 980626 900067 784198 835429 572726 274925 438716 1028433
19080A028433M40336r8294l56582k32707l25694p8296P0681J50548J33079Q2156
$$ 1028433 1468769 1370475 1013893 781186 455492 377196 447877 598425 731504 813660
19070H13660J15557j11765Q1016l618P720p9797k3634j15403R3662O6950r0285
$$ 813660 929217 817452 898468 894850 902570 822773 799139 683736 777398 844348 754063
19059G54063n5831j8416N6901n5221j9942P2792l973P4326P4666L9009k5271J7887
$$ 754063 698232 679816 736717 681496 661554 734346 730373 804699 879365 918374 893103 910990
19047I10990K610j40409k72587Q0410P8404Q4505M1214R3716r2273r5103k11791
$$ 910990 913600 773191 500604 581014 659418 743923 785137 878853 786580 691477 479686
19036D79686k14879P282K44481J19182k9943L5021k3467o7519k41636k45010o0894
$$ 479686 264807 272089 516570 635752 605809 640830 617363 549844 308208 63198 2304
19025B304l3335O8376L32626J65618k2576J69067J39303j86646j47545J9015N2451
$$ 2304 -31031 37345 369971 535589 513013 682080 821383 634737 487192 506207 558658
19014E58658P68j52929o3717L7033j04094O8733K07656l6157l33291p2926L33018
$$ 558658 559426 406497 342780 379813 275719 344452 552108 515951 182660 109734 442752
19003D42752J20961j30250J09200J38538l07595N5481K67808l4717o1800j93637
$$ 442752 563713 433463 542663 681201 373606 429087 696895 662178 600378 406741
18993D06741j4478j30123J00465J13975J05591K84108J03880k68615p2364K9167
$$ 406741 392263 262140 362605 476580 582171 866279 970159 701544 629180 658347
18983F58347j91758O4750P1763n4715j07407J75099K3528j9773J39124k9145K3189
$$ 658347 466589 531339 603102 548387 440980 616079 639607 619834 758958 729813 753002
18972G53002j79211r2435n3579j4357J7757K43658j00665j23946o4850j19477
$$ 753002 573791 481356 427777 413420 431177 674835 574170 450224 385374 265897
18962B65897j86348J10050N12954O1560q834J75564J5487l32451k8576J14043
$$ 265897 79549 189599 702553 764113 755279 930843 946330 613879 585303 699346
18952F99346K44384k05109j03232N2875l28405Q256J53200J98522n9598L68166
$$ 699346 943730 738621 635389 688264 359859 368115 521315 719837 660239 1028405
18942A028405j88775j54667j42561j1349R4940N0255M0583J05364j47027p9627
$$ 1028405 839630 684963 542402 531053 625993 676248 716831 822195 675168 595541
18932E95541L3222K73858J52389j35747j9349k78235n3485R7886K11582J56921
$$ 595541 628763 902621 1055010 919263 899914 621679 568194 666080 877662 1034583
18922A034583j90031j48363k9254j39684J38413J76102J83903l2685q3581j12545
$$ 1034583 844552 696189 666935 527251 665664 841766 1025669 992984 909403 796858
18912G96858l09617k73058J99451Q2592l0683J36676L37027K8224O9027j40211
$$ 796858 487241 214183 413634 496226 465543 602219 939246 967470 1036497 896286
18902H96286j56447j74048J27814N2489L1391r251j18927p9449k1381m0799J02885
$$ 896286 739839 565791 693605 746094 777485 768234 649307 569858 548477 507678 610563
18891F10563K03395M5792k58688j18586J49892P5154J23548K54230q7959R7156
$$ 610563 813958 859750 601062 482476 632368 707522 831070 1085300 997341 1094497
18881A094497K8235k60276j69201M2157O9072J87011K37939K1281l9061k22245
$$ 1094497 1122732 862456 693255 735412 804484 991495 1229434 1250715 1211654 989409
18871I89409P0966N06j0935p1202n7181J31025J73544J3460Q588r4620k32098
$$ 989409 1060375 1060881 1049946 978744 921563 1052588 1226132 1239592 1248180 1153560 921462
18860I21462J07323p8298j34213j88812K30256K10883L1625J08698J50530L2431
$$ 921462 1028785 950487 816274 627462 857718 1068601 1100226 1208924 1359454 1391885
18850A391885J2871r6296p8260q9776K3628J6248L58929J68334P757p5433J70975
$$ 1391885 1404756 1308460 1230200 1140424 1164052 1180300 1539229 1707563 1715320 1639887 1810862
18839A810862J84341K43524J86757J29401q524N809N2477j60910k26892J8638
$$ 1810862 1995203 2238727 2425484 2554885 2546361 2552170 2604647 2443737 2216845 2235483
18829B235483J90479M7531K51320O6563J22568j00633K44997M82139L55615J23246
$$ 2235483 2425962 2473493 2724813 2791376 2913944 2813311 3058308 3540447 3896062 4019308
18819D019308k2207m595L8902J26879R5314j08671l2605R0766P6484O9281j1157
$$ 4019308 3997101 3992506 4031408 4158287 4253601 4144930 4112325 4203091 4279575 4348856 4337699
18808D337699Q8823J89374M85907L37871K41619N02953Q96970J086114R42350
$$ 4337699 4426522 4615896 5101803 5439674 5681293 6184246 7081216 8167330 9109680
18799I109680J115114J334079J182050J295316J426781J623014J710675K149648
$$ 9109680 10224794 11558873 12740923 14036239 15463020 17086034 18796709 20946357
18791B0946357K241255L190415M138672N269897P507249J1283627J8075741K8328566
$$ 20946357 23187612 26378027 30516699 35786596 43293845 54577472 72653213 100981779
18783A00981779L9549735M1993912K8875196O974462k6056180n0035501m2595075
$$ 100981779 140531514 182525426 211400622 218375084 192318904 142283403 99688328
18776I9688328k5557575j4074478p593974m289339k070565p60572j60183k09151
$$ 99688328 74130753 60056275 52462301 48172962 46102397 45341825 45181642 44972491
18768D4972491l08231l41511L70484J251217K102651L816229O931311J1816022
$$ 44972491 44664260 44322749 44693233 45944450 48047101 51863330 58794641 70610663
18760G0610663J9322206L0955375M2819531M3622324K8269281L368546l3292430
$$ 70610663 89932869 120888244 163707775 207330099 235599380 238967926 205675496
18753B05675496n7283831m7104042k8345401j5871549r232005n556069l296483
$$ 205675496 148391665 101287623 72942222 57070673 47838668 42282599 38986116
18746C8986116j775660j786652k401270l051863l485687l264526k557742k365604
$$ 38986116 37210456 35423804 33022534 29970671 26484984 23220458 20662716 18297112
18738A8297112j662553j532049j583843j400357j238639j501995r13048o94338
$$ 18297112 16634559 15102510 13518667 12118310 10879671 9377676 8464628 7770290
18730G770290m35439m19061m87100n40065n59891o21211k09268r0138J5599m7018
$$ 7770290 7334851 6915790 6428690 5888625 5328734 4707523 4498255 4408117 4423716 4376698
18720D376698J04295j72473l75987k81608l18511n61826l80682l2359J2976q9319
$$ 4376698 4480993 4308520 3932533 3650925 3332414 2770588 2389906 2357547 2370523 2281204
18710B281204J28767j51968j24540j6808j02917r27J04588J37111j53804l79164
$$ 2281204 2409971 2258003 2133463 2116655 2013738 2012811 2117399 2254510 2100706 1721542
18700A721542k07726j25160J06528k9263k5729J14532O5694j74251j118O311m5163
$$ 1721542 1513816 1388656 1495184 1465921 1440192 1554724 1620418 1446167 1445049 1451360 1406197
18689A406197j41161l34497J76916J80567n7401n2716R689j10384k11262r9075
$$ 1406197 1265036 930539 1107455 1288022 1230621 1177905 1187594 1077210 865948 766873
18679G66873J31745J51567o2017P0567j8780p9336J04009J20304J13467j34015
$$ 766873 898618 1050185 988168 1058735 1039955 960619 1064628 1184932 1298399 1164384
18669A164384J33662q4667J6575q2603K06093K62787k3338R1103K01443k499L5197
$$ 1164384 1298046 1213379 1229954 1147351 1353444 1616231 1592893 1683996 1885439 1882940 1918137
18658A918137J66131P2585o964Q028j54456K452o1222k03414J00517J57515N8933
$$ 1918137 2084268 2156853 2149889 2157917 2003461 2005913 1944691 1741277 1841794 1999309 2058242
18647B058242r6759L79580L37582J08008k1244K93505L39692L28072K45009J51637
$$ 2058242 1961483 2341063 2678645 2786653 2765409 3058914 3398606 3726678 3971687 4123324
18637D123324J45090M5104L42136L65316N97917M09739M06299L0906K71318P49574
$$ 4123324 4268414 4313518 4655654 5020970 5618887 6028626 6434925 6465831 6737149 7486723
18627G486723R62783Q62293P11672K72789M17590N69576R14925J161018M82426
$$ 7486723 8449506 9311799 10023471 10296260 10713850 11283426 12198351 13359369 13841795
18618A3841795P4709n04570o54346j32669K43303O37982O69896P31626J198923
$$ 13841795 13916504 13411934 12757588 12624919 12868222 13506204 14176100 14907726 16106649
18609A6106649J795803K234959L286191L947988M857448N737310O998348Q739858
$$ 16106649 17902452 20137411 23423602 27371590 32229038 37966348 44964696 53704554
18601E3704554J1823204J5514021J6338620J1701491L658240n533702j5890211
$$ 53704554 65527758 81041779 97380399 109081890 112740130 107206428 91316217
18594I1316217j6749743j0469284m135761J046957N788386J0437822J3658775
$$ 91316217 74566474 64097190 59961429 61008386 66796772 77234594 90893369
18587I0893369J4934760J5420465J3146343Q322524L188193m057634j5257781
$$ 90893369 105828129 121248594 134394937 142717461 145905654 141848020 126590239
18580A26590239k4057974j9767768j1191229m324574m52538R34075J108606M80911
$$ 126590239 102532265 82764497 71573268 67248694 66796156 67730231 68838837 69319748
18572F9319748M20722K471714N434026Q021774Q881965R592695J0212731J1201619
$$ 69319748 69740470 72212184 77646210 85667984 94549949 104142644 114355375 125556994
18564A25556994J3141110J3279863J0657727K674215k573176l274944n722577
$$ 125556994 138698104 151977967 162635694 165309909 162736733 159461789 153739212
18557A53739212p722125j2269811j5786691j1329563l960367J445606K942522
$$ 153739212 146017087 133747276 117960585 106631022 102670655 104116261 107058783
18550A07058783P13533l235113o449026n162179j33891N126092Q817923Q894671
$$ 107058783 107772316 104537203 98088177 92925998 92792107 97918199 106736122 115630793
18542A15630793N970354R38990o51351M462938J2489033J7398969J3870792M055198
$$ 115630793 121601147 122540137 121888786 126351724 138840757 156239726 170110518 174165716
18534A74165716j0785926k2450128k1634104j6009527j2925287j3157885j1933816
$$ 174165716 163379790 140929662 119295558 103286031 90360744 77202859 65269043
18527F5269043p844654m088837j844875j052268j005068j452673k708943l206687
$$ 65269043 57424389 53335552 51490677 50438409 49433341 47980668 45271725 42065038
18519D2065038l613837l922869m506497m363556l197781k104930j586870r23774
$$ 42065038 38451201 34528332 30021835 25658279 22460498 20355568 18768698 17844924
18511A7844924n82983j26750L833J89558O10349N43814R506j026113j705562j542706
$$ 17844924 17261941 17135191 17139024 17328582 17938931 18482745 18492251 17466138 15760576 14217870
18501A4217870j093695j297792j091884j082497j022145l92821j63363K7036l2457
$$ 14217870 13124175 11826383 10734499 9652002 8629857 8237036 8073673 8100709 8068252
18492H068252N3237o837n01530n00672m75137n76015n35018n50080m09110k98436
$$ 8068252 8121489 8114652 7613122 7112450 6637313 6061298 5526280 4976200 4567090 4268654
18482D268654n61022k84251J2996J64522L514j01147o0510O7055j233m46720n11591
$$ 4268654 3707632 3423381 3436377 3600899 3604413 3503266 3442756 3509811 3508578 3061858 2550267
18471B550267j34310O9384Q3854p5443j90204j11369P7214J50928r3207j84164
$$ 2550267 2415957 2485341 2569195 2493752 2303548 2192179 2269393 2420321 2327114 2142950
18461B142950j04155R0095Q3225R2221K22123Q2394k54564j93172J05515k00132
$$ 2142950 2038795 2128890 2212115 2304336 2526459 2608853 2354289 2161117 2266632 2066500
18451B066500j76123j93475J2264J00694j22669K85767L25638J35741R577j69658
$$ 2066500 1890377 1696902 1709166 1809860 1687191 1972958 2298596 2434337 2443914 2274256
18441B274256K3460K2549j05040J12559K37228j95746k29303k97881K58605J23906
$$ 2274256 2297716 2320265 2215225 2327784 2565012 2369266 2139963 1842082 2100687 2224593
18431B224593k60625j4779K74366J9645J9427j07649j37290O4328K35549K07727
$$ 2224593 1963968 1949189 2223555 2243200 2262627 2154978 2017688 2082016 2317565 2525292
18421B525292K3431j14949J7450J69124K04065O7088N0699j9578M6001k7403j77417
$$ 2525292 2548723 2433774 2451224 2620348 2824413 2891501 2942200 2922622 2968623 2941220 2763803
18410B763803K9447o8286L8643P3446j48700J55235k0066K89775j2540k38039
$$ 2763803 2793250 2724964 2763607 2837053 2688353 2843588 2823522 3113297 3100757 2862718
18400B862718j02813K99703J60272J96769R1801M82246K17556M5276O9717R9572
$$ 2862718 2759905 3059608 3219880 3416649 3508450 3990696 4208252 4253528 4323245 4422817
18390D422817J16645P7804N3882k09967J08293M40962O80465N36673R31785J044058
$$ 4422817 4539462 4617266 4671148 4461181 4569474 5010436 5690901 6227574 7159359 8203417
18380H203417R61110O33340k9513n16997p42443m99731k57088Q8808P8522J81911
$$ 8203417 9164527 9797867 9768354 9251357 8508914 8009183 7752095 7840903 7919425 8101336
18370H101336O10656M79163M69241P25404P91172J088118R40148J131142J427772
$$ 8101336 8711992 9191155 9660396 10385800 11176972 12265090 13205238 14336380 15764152
18361A5764152K293417L150995M393502N433429N401218M191479K434908J77685
$$ 15764152 18057569 21208564 25602066 31035495 36436713 40628192 43063100 43240785
18353D3240785L77534K137670L039796K672768J610592P20775K538698L913621
$$ 43240785 43618319 45755989 48795785 51468553 53079145 53799920 56338618 60252239
18345F0252239L710014K672460L11592L71153L113903O610940J0930293J5891555
$$ 60252239 63962253 66634713 66946305 67317458 70431361 77042301 87972594 103864149
18337A03864149K0820335K5079736K9359016L4166179M0855625M6372567M1765724
$$ 103864149 124684484 149764220 179123236 213289415 254145040 300517607 342283331
18330C42283331K3763474p502502m0489429n3672024m1700376k4556227j3804851
$$ 342283331 366046805 358544303 318054874 264382850 222682474 198126247 184321396
18323A84321396l314270R139386K0286638K8093270L2591932L0759652K1511739
$$ 184321396 181007126 190146512 210433150 238526420 271118352 301878004 323389743
18316C23389743J1627970k694057k3129896l7448786m0781193m0055884l3360155
$$ 323389743 335017713 332323656 309193760 271744974 230963781 190907897 157547742
18309A57547742k2530401j3410957o906637k399657J035738L923222O473719R521930
$$ 157547742 135017341 121606384 114699747 112300090 113335828 117259050 123732769 133254699
18301A33254699J2065513J2269277J0329275Q773879N194592J628904M93345k629022
$$ 133254699 145320212 157589489 167918764 176692643 181887235 183516139 184009484 181380462
18293A81380462j0567284j7920361j3024544r43598J0106325J5203050J2809293
$$ 181380462 170813178 152892817 139868273 138924675 149031000 164234050 177043343
18286A77043343L544813j1717042k3053854k7759490k3295710j5053167r529966
$$ 177043343 180588156 168871114 145817260 118057770 94762060 79708893 70178927
18279G0178927o059847l876082k876122j834932j345299j544683k300950k426951
$$ 70178927 64119080 60242998 57366876 55531944 54186645 52641962 50341012 47914061
18271D7914061k081156j847423k273014k791256j910879M22278K692861M006848
$$ 47914061 45832905 43985482 41712468 38921212 37010333 37432611 40125472 44132320
18263D4132320L324285J256904k090041o106220o394666m807919l593974k704753
$$ 44132320 47456605 48713509 46623468 40517248 34122582 29314663 25720689 23015936
18255B3015936k469216j921833j304431q40831p64534p59323m75768k34440l75632
$$ 23015936 20546720 18624887 17320456 16479625 15715091 14955768 14480000 14245560 13869928
18246A3869928r433j04507n32218l00412j95892L31362P35729Q02840R56769O94770
$$ 13869928 13860495 13755988 13223770 12923358 12727466 13058828 13794557 14597397 15554166 16248936
18236A6248936N00350O25692J065404J214436J327407J153941R75211J177110
$$ 16248936 16749286 17374978 18440382 19654818 20982225 22136166 23111377 24288487
18228B4288487J722134K772730K938526L259236L608775L713109N582458R143258
$$ 24288487 26010621 28783351 31721877 34981113 38589888 42302997 47885455 57028713
18220E7028713J4519021K3060787L5007274M4758560M0712069K1968426m682220
$$ 57028713 71547734 94608521 129615795 174374355 215086424 237054850 232372630
18213B32372630m2499802n5685584l9534285k2196633j2078477o576075l468620
$$ 232372630 189872828 134187244 94652959 72456326 60377849 53801774 50333154
18206E0333154j682052q38016n18555j319675j469122r98628Q803J064927K377990
$$ 50333154 48651102 47813086 47294531 45974856 44505734 43507106 43515909 44580836 46958826
18197D6958826M906886Q333308J3236958K1444820L2473017M0572770L4957061
$$ 46958826 51865712 60199020 73435978 94880798 127353815 167926585 202883646
18190B02883646J7145997q430574m2744056n0636951l4943898k0491486j1922189
$$ 202883646 220029643 211599069 168855013 118218062 83274164 62782678 50860489
18183E0860489p320410m727559k656166j584955k109139l142471l636426l236976
$$ 50860489 43540079 38812520 36156354 34571399 32462260 29319789 25683363 22446387
18175B2446387k586923k091376j836432j259724j006570p32315j001368j129667
$$ 22446387 19859464 17768088 15931656 14671932 13665362 12933047 11931679 10802012
18167A0802012j117209q67405n60688k33637r2897k06211l28914l04738k80997
$$ 10802012 9684803 8817398 8256710 8023073 7930176 7723965 7395051 7090313 6809316
18158F809316n71285o92072o08958j44738k93779j30840l9378J7302k3441k45613
$$ 6809316 6238031 5545959 4937001 4792263 4498484 4367644 4328266 4345568 4322127 4076514
18148D076514j89098p4311j04219o1501O2304j27926L36059R7990j22466O3752
$$ 4076514 3887416 3813105 3708886 3647385 3709689 3581763 3917822 4015812 3893346 3957098
18138C957098J37620K47351M20403L89870L21454K92332L90535M28084N98408
$$ 3957098 4094718 4342069 4762472 5152342 5473796 5766128 6156663 6584747 7183155
18129G183155O88821J072831R79679J068508J255210J598168J907334K321727
$$ 7183155 7871976 8944807 9924486 10992994 12248204 13846372 15753706 18075433
18121A8075433K983145L728165M657984N525537O573496Q227719J1092527J6532278
$$ 18075433 21058578 24786743 29444727 34970264 41543760 49771479 60864006 77396284
18113G7396284K6964957M4835620O6684760P5092394M8232437J6808814m5223350
$$ 77396284 104361241 149196861 215881621 290974015 339206452 356015266 310791916
18106C10791916r8195724p4262316m1206238k2239647j2915380p952217m540686
$$ 310791916 212596192 138333876 97127638 74887991 61972611 54020394 49479708
18099D9479708k450742j999704l519061m854564m813992m382517l694188l080212
$$ 49479708 47028966 45029262 41510201 36655637 31841645 27459128 23764940 20684728
18091B0684728k631914k048345j783890j735378j122939r68420j112942n96176
$$ 20684728 18052814 16004469 14220579 12485201 11362262 10393842 9280900 8684724
18083H684724m55784p98894p33092l15104j90680k32001m42417l80584k72041
$$ 8684724 8228940 7430046 6696954 6381850 6191170 5959169 5516752 5136168 4864127
18074D864127l52816n30213m08563j43517j4612K500q3384m90619j17711O5853
$$ 4864127 4511311 3981098 3572535 3429018 3414406 3416906 3333522 2842903 2725192 2791045
18064B791045k64699k29846k02942q9487N3372L42468L90596j54563j77517k66896
$$ 2791045 2526346 2296500 2093558 2004071 2057443 2399911 2790507 2635944 2458427 2191531
18054B191531k07706k338O1835r4921k7634q4500j75549m3084j66604J83314K24414
$$ 2191531 1983825 1981487 2043322 1948401 1920767 1836267 1660718 1617634 1451030 1634344 1858758
18043A858758k63812j53861j52676j1882Q4552o7005L6267K44372j16405m07756
$$ 1858758 1594946 1441085 1288409 1276527 1361079 1294074 1330341 1574713 1458308 1050552
18033A050552o3890K28337k10069J52867J35069m1375J20067k50311j49625q8773
$$ 1050552 986662 1214999 1004930 1157797 1292866 1251491 1371558 1121247 971622 882849
18023H82849o7711j88915J40727N0395j89440L6037p5373M3685k8790n1679J69451
$$ 882849 815138 626223 766950 817345 627905 663942 588569 632254 603464 551785 721236
18012G21236J0775k64441J0426J95082R4397P7012K59609q7956l15105J4456j82552
$$ 721236 732011 467570 477996 673078 767475 844487 1104096 1016140 701035 715491 532939
18001E32939j55405J74950r0158k01728J137L19593K65156J92289j83843o4044
$$ 532939 377534 552484 462326 260598 261735 581328 846484 1038773 854930 790886
17991G90886p5171j52959q1464k31579k23845L88926N18563R4472j44795j18010
$$ 790886 715715 562756 481292 249713 25868 414794 933357 1027829 883034 765024
17981G65024l0920J59519K69704q5756k88710k15338l52267j17657l9279L24869
$$ 765024 734104 893623 1163327 1077571 788861 573523 221256 103599 64320 389189
17971C89189J10121j18799J64786M7265n6511k8178N4892q5324N4067j29512j85482
$$ 389189 499310 380511 545297 592562 536051 507873 562765 477441 531508 401996 216514
17960B16514K1001k9195J81967J56203M4553k27684O6351J04517K57480J16919
$$ 216514 237515 208320 390287 546490 591043 363359 429710 534227 791707 908626
17950I08626p1424j36012k51981N5614K48974M8197m08181l08663J20573J77841
$$ 908626 837202 701190 449209 504823 753797 801994 393813 85150 205723 383564
17940C83564m3034q0761j22201j7154L0216P42l7996l2613L12970j340p2093J37777
$$ 383564 340530 259769 137568 120414 150630 151372 113376 80763 393733 392393 320300 458077
17928D58077k27904o4137J1438J78587K80013L6470k47077j70288j01580K8161
$$ 458077 230173 166036 177474 356061 636074 672544 425467 255179 153599 181760
17918A81760N068o8135q5069n7536k10336j84874m2577J42408P6657L30989M17837
$$ 181760 186828 118693 33624 -23912 -234248 -419122 -461699 -319291 -242634 88355 506192
17907E06192n4548m28727j28926M3640J71638M4864m2163O3354l3090q9318L6367
$$ 506192 451644 22917 -106009 -62369 109269 154133 111970 175324 142234 52916 89283
17896H9283P1823J44681j35286o9511L6969k07733l02250j27096M6353L22828
$$ 89283 161106 305787 170501 100990 137959 -69774 -372024 -499120 -452767 -129939
17886a29939R2365J68324j1470j32049p5972L65883J54760l5470P4482J3932J97537
$$ -129939 -37574 130750 119280 -12769 -88741 277142 431902 396432 470914 484846 682383
17875F82383j334j45706p8134R0146K92014q6639q6129j61210m3988J85610O3619
$$ 682383 681049 535343 457209 547355 839369 752730 666601 505391 461403 647013 710632
17864G10632o2043n8811J24489K03114j71941k21826k45637k26692j48980L59560
$$ 710632 648589 589778 714267 917381 745440 523614 277977 51285 -97695 261865
17854B61865K38711j04019o1215q3795J24221L4676N7353J52700q550j22128l3072
$$ 261865 500576 396557 335342 251547 375768 410444 467797 620497 611947 489819 456747
17843D56747m8600K40507j9864j0233J08207Q7990k25347k77495o1871r6178j1205
$$ 456747 408147 648654 628790 618557 726764 814754 589407 311912 250041 153863 142658
17832A42658J25323K2746M9635K11484N0018J47106N046k41402j32241K00160
$$ 142658 267981 290727 340362 551846 601864 748970 754016 512614 380373 580533
17822E80533r9561j81181R9603j10780n8088J11604M23804K78056q2225k16797
$$ 580533 480972 299791 399394 288614 230526 342130 765934 1043990 961765 744968
17812G44968K24098L14803N3727l27222k94389j18928J4551N4157J80912R5884
$$ 744968 969066 1283869 1337596 1010374 715985 597057 611608 665765 846677 942561
17802I42561n9367n0854P7043o0858N0668l8636m0085J87653Q0421J17518J02444
$$ 942561 883194 832340 909383 848525 899193 860557 820472 1008125 1088546 1206064 1308508
17791A308508n6587j15447J77794K94276k874j44389l11519j6400r3053j94865
$$ 1308508 1251921 1136474 1314268 1608544 1605670 1461281 1149762 1133362 1040309 845444
17781H45444k97566O2100j3468k36695J52634J01640m0599p5621L4649J9548J9429
$$ 845444 547878 609978 596510 359815 512449 614089 573490 497869 532518 552066 571495
17770E71495J98789m9527q542j09542n458K07539J29404r6616m4364J01769J5426
$$ 571495 770284 720757 712215 602673 597215 804754 934158 837542 793178 894947 910373
17759I10373R6248m3306Q2072j97911q2459p2016j55447j01522J765k9566o6748
$$ 910373 1006621 963315 1045387 847476 765017 693001 537554 436032 437797 408231 341483
17748C41483K43471J63991j15459k43336k5925j83673n9678M05835J48766L8251
$$ 341483 584954 748945 633486 390150 364225 180552 120874 526709 675475 713726
17738G13726L3746r2835j09475j16896J8531K0412l9573q9396q7961J23195N0373
$$ 713726 747472 654637 545162 428266 446797 467209 427636 338240 250279 373474 423847
17727D23847p1270n8696j47409k00985J46701K33168J84340l0728l82117N1503
$$ 423847 352577 293881 146472 -54513 92188 325356 509696 478968 96851 148354
17717A48354L93531K09525q4970j20375j61832O2487k957k8933k1877k91256j24630
$$ 148354 541885 751410 666440 546065 384233 446720 443763 414830 392953 101697 -22933
17706b2933N7994J66463K2603J90643P4137o5598o8349j63456q7301Q0123J3171
$$ -22933 35061 201524 224127 414770 488907 423309 354960 191504 104203 184326 197497
17695A97497J22947l7128k03646l1949j09622J6037r52k9596k3805J39865j1045
$$ 197497 320444 283316 79670 47721 -61901 -45864 -46816 -76412 -100217 39648 28603
17684B8603r8110J46976L3572r4041R6185m2452M999J32068k35212R9513Q4134
$$ 28603 -69507 77469 111041 17000 113185 70733 75732 207800 -27412 72101 156235
17673A56235j77734J98143o0548J00059J41576J13070L03021L15980J86080N9874
$$ 156235 -21499 176644 116096 216155 357731 470801 773822 1089802 1275882 1335756
17663A335756m0880j40832l97587k66846M0866l2244k39229k82033j85162K40941
$$ 1335756 1294876 1154044 756457 489611 530477 498233 259004 -23029 -208191 32750
17653C2750J50811O2090J57502K15537J66804o3737J63216Q7473k41770r8053
$$ 32750 183561 245651 403153 618690 785494 721757 884973 972446 730676 632623
17643F32623K4552K13365K29222L2231P7772j690j05622j57179J1882l20021k71009
$$ 632623 657175 870540 1099762 1131993 1209765 1208075 1102453 945274 957156 637135 366126
17632C66126j89734m2055j15369J05626k5492p6772n146N2797J92259M7497k26550
$$ 366126 176392 134337 18968 124594 99102 22330 17184 69981 262240 309737 83187
17621H3187l3093n3979J2776K77465j21395J51225j72468Q4472j45689l53736
$$ 83187 50094 -3885 8891 286356 164961 316186 143718 228190 82501 -271235
17611b71235k00747J0741q9837P6235K69624J41043k462J52450n6618k27122M6793
$$ -271235 -471982 -461241 -551078 -474843 -205219 -64176 -66638 85812 29194 -197928 -151135
17600a51135p294o3254Q8879J56829J36497o6540j26178M1434k6489M1466J27818
$$ -151135 -158429 -221683 -132804 24025 160522 93982 -32196 9238 -17251 24215 152033
17589A52033l9330m9629j10215O7005K26630Q774J3926j30180l09235l0471K11219
$$ 152033 112703 63074 -47141 19864 246494 255268 269194 139014 -170221 -200692 10527
17578A0527k9820r8304k8428L74096M979j96755J57957L48401o7184k03733k39664
$$ 10527 -19293 -117597 -146025 228071 233050 36295 194252 542653 475469 271736 32072
17567C2072q3340K83144J35951L0588j40950k4093P1075p361o4579k40810j96542
$$ 32072 -51268 231876 367827 398415 257465 233372 304447 297086 232507 -8303 -204845
17556b04845P6924K1545J00762K12298l071P7718M2138J31377J54243p801l3496
$$ -204845 -127921 -106376 -5614 206684 203613 281331 323469 454846 609089 601288 567792
17545E67792r6195p8966p525J06530r2889k3935N2685Q907k57069r6087J25923
$$ 567792 471597 392631 385106 491636 398747 374812 427497 436404 179335 83248 209171
17534B09171K50976k81993j11240M6868o0692Q41k9045j0189n8117j1776J4803
$$ 209171 460147 178154 66914 113782 53090 53931 24886 14697 -43420 -55196 -40393
17523d0393l9660P4602K86592j26829k36623q0892J58458K26320L7779l989j0479
$$ -40393 -80053 -5451 281141 154312 -82311 -163203 -4745 221575 259354 255365 244886
17512B44886j84383j18094K301r9656J13034k25646j44636l817J23990Q5406j22879
$$ 244886 60503 -57591 -55290 -154946 -41912 -267558 -412194 -416011 -292021 -206615 -329494
17501c29494o1837K01533L56530n5183k1629p1668P4492r4624k58446m8306K96302
$$ -329494 -391331 -189798 166732 111549 89920 18252 92744 -1880 -260326 -308632 -12330
17490a2330j94914J67889j21381j89105L04567J04437j72169j38765K14730J28453
$$ -12330 -207244 -39355 -160736 -349841 -45274 59163 -113006 -251771 -37041 91412
17480I1412j30815k62884M3517Q0481J07435J16052n9057j51583J76727j55186
$$ 91412 -39403 -302287 -258770 -178289 -70854 45198 -13859 -165442 11285 -143901
17470a43901r1866J70691l5028j00651j5904N1784j15841n8838J91281M299o7720
$$ -143901 -235767 -65076 -100104 -200755 -216659 -164875 -280716 -339554 -148273 -143974 -211694
17459b11694R773K04594j18711J46728P2111l4205j45578J925j865Q94J39667
$$ -211694 -201921 2673 -116038 30690 102801 68596 -76982 -75057 -76922 -76028 63639
17448F3639l907j35388K53314P91433L70705M12584M85148l8937p22815o19020
$$ 63639 59732 -75656 177658 969091 1339796 1752380 2237528 2198591 1475776 856756
17438H56756j38731k03301j55532l9540j64077m4967j17684p1897K02717m3998
$$ 856756 718025 514724 359192 319652 155575 110608 -7076 -78973 123744 79746
17428G9746r6447n8361n1415R5584q176k8011J62171J19386J71291J73189j85843
$$ 79746 -16701 -75062 -126477 -30893 -39069 -67080 95091 214477 385768 558957 373114
17417C73114k18010k77011O4875L6673j62402L16995L0316j23383J6465N9645
$$ 373114 155104 -121907 -57032 -20359 -182761 134234 164550 41167 57632 117277
17407A17277m5398L1724J08828j40650j1359J41594l2031N0248q2816q3488j0853
$$ 117277 71879 103603 212431 71781 60422 202016 169985 220233 137417 53929 43076
17396D3076K41338j58240k36525p7552Q5328J7085j69453J34733K54681j07576
$$ 43076 284414 126174 -110351 -187903 -102575 -85490 -254943 -120210 134471 26895
17386B6895O8194O623j4032k08369R0324K32314j84548j22108J55926q6029j24391
$$ 26895 95089 101712 87680 -120689 -30365 201949 17401 -104707 51219 -34810 -159201
17375a59201j21058j01426K48994Q6561K4725L1997J81945m9479j34260P1822
$$ -159201 -280259 -381685 -132691 -46130 -21405 10592 192537 143058 8798 80620
17365H0620p7775k15117j72652J47625K97741l06869k85314K3331K41532J01916
$$ 80620 2845 -212272 -384924 -237299 60442 -246427 -531741 -508410 -266878 -164962
17355a64962L3266l7096k5566J26992L28565k1994k94196j91468k19905m9994
$$ -164962 -131696 -168792 -194358 -67366 261199 239205 -54991 -246459 -466364 -516358
17345e16358J35878K37050K36640N0119j16491o8979J85064p3286k55936j93430
$$ -516358 -380480 -143430 93210 143329 26838 -42141 142923 69637 -186299 -379729
17335c79729q4532O6082K45277J11095O044J50938K23017o8056k27435q0302J06766
$$ -379729 -464261 -398179 -152902 -41807 -35763 115175 338192 270136 42701 -37601 69165
17324F9165j70245j79761K92777L94017r5265m17987j84429J47840K60064j28076
$$ 69165 -101080 -280841 11936 405953 310688 -107299 -291728 -143888 116176 -11900
17314a1900J03913j32345R0609k4885J03846J68522N8666k57129k03705j53781
$$ -11900 92013 -40332 50277 25392 129238 297760 356426 99297 -104408 -258189
17304b58189N6720J63210L3042k2681j09432p1912j369K9945M7593o7333J7452
$$ -258189 -201469 -38259 -5217 -27898 -137330 -209242 -210611 -180666 -133073 -200406 -182954
17293a82954j80316n6277K06328q2831k16766o4319J05540L45902J86186k91644
$$ -182954 -363270 -419547 -213219 -296050 -512816 -577135 -471595 -125693 60493 -231151
17283b31151k92726p5447O1224L8396K62426K07823j77852k4552N898O0884O1607
$$ -231151 -523877 -599324 -538100 -499704 -237278 -29455 -207307 -231859 -225961 -165077 -103470
$$ [...]
##END NTUPLES=NMR SPECTRUM
##END=
