##TITLE=Analysis number 312262
Compound Code km 08625
Book Reference 358/149
Project Code adrs
Chemist Name mikem
##JCAMPDX= 6.0         $$ Bruker NMR JCAMP-DX V2.0
##DATA TYPE= NMR SPECTRUM
##DATA CLASS= NTUPLES
##ORIGIN= Bruker BioSpin GmbH
##OWNER= NMR
$$ XWIN-NMR		Version 3.5
$$ Mon Aug  1 10:06:45 2005 GMT Daylight Time (UT+1h)  MAYBRIDGE\NMR@NMR_250MHZ
##.OBSERVE FREQUENCY= 250.131544655141
##.OBSERVE NUCLEUS= ^1H
##.ACQUISITION MODE= SIMULTANEOUS (DQD)
##.ACQUISITION SCHEME= undefined
##.AVERAGES= 16
##.DIGITISER RES= 18
##SPECTROMETER/DATA SYSTEM= dpx250
##.PULSE SEQUENCE= zg30
##.SOLVENT NAME= DMSO
##.SHIFT REFERENCE= (INTERNAL, DMSO, 0, 16.522)
##AUDIT TRAIL= $$ (NUMBER, WHEN, WHO, WHERE, WHAT)
$$ ##TITLE= Audit trail, XWIN-NMR		Version 3.5
$$ ##JCAMPDX= 5.01
$$ ##ORIGIN= Bruker BioSpin GmbH
$$ ##OWNER= NMR
$$ C:\u/data/dgb/nmr/ADRS/6880/pdata/1/auditp.txt
$$ ##AUDIT TRAIL=  $$ (NUMBER, WHEN, WHO, WHERE, WHAT)
(   1,<2005-08-01 10:06:27.28 +100>,<MAYBRIDGE\NMR>,<NMR_250MHZ>,
      <created by zg, POWCHK disabled, PULCHK disabled
       configuration hash MD5:
       62 19 C7 07 E1 42 D1 B7 37 6C 3D D0 77 39 F9 E6
       data hash MD5: 64K
       8D C0 82 8E AC 0E 22 F3 59 5C 7B 13 54 18 CF E0>)
(   2,<2005-08-01 10:06:38.26 +100>,<MAYBRIDGE\NMR>,<NMR_250MHZ>,
      <Start of raw data processing
       ef LB = 0.3 FT_mod = 6 PKNL = 1 SI = 32K 
       data hash MD5: 32K
       A6 5B EC 1A 77 40 A9 D5 5C E0 BB 50 F8 39 6D BB>)
(   3,<2005-08-01 10:06:40.03 +100>,<MAYBRIDGE\NMR>,<NMR_250MHZ>,
      <apk 
       data hash MD5: 32K
       70 B0 61 03 9A E9 C2 E7 56 1E 96 49 C7 D9 7F 8F>)
(   4,<2005-08-01 10:06:40.75 +100>,<MAYBRIDGE\NMR>,<NMR_250MHZ>,
      <abs ABSG = 5 
       data hash MD5: 32K
       BD 4B E6 8B 46 2A C4 1B A9 D0 67 4A FE 0B 61 08>)
$$ ##END=
$$ 
$$ hash MD5
$$ 05 3A 42 4A C1 EA A2 6A 18 04 F5 F5 8F AA FD 04
##$RELAX= 
##$RELAX= 
##$RELAX= 
##$RELAX= 
##$RELAX= 
##$RELAX= 
##$RELAX= 
$$ Bruker specific parameters
$$ --------------------------
##$DU= <C:\u>
##$EXPNO= 6880
##$NAME= <ADRS>
##$PROCNO= 1
##$TYPE= <nmr>
##$USER= <dgb>
##$AMP= (0..31)
100 100 100 100 100 100 100 100 100 100 100 100 100 100 100 100 100 100 
100 100 100 100 100 100 100 100 100 100 100 100 100 100 
##$AQSEQ= 0
##$AQ_mod= 3
##$AUNM= <au_zg>
##$AUTOPOS= <6 >
##$BF1= 250.13
##$BF2= 250.13
##$BF3= 250.13
##$BF4= 250.13
##$BF5= 500.13
##$BF6= 500.13
##$BF7= 500.13
##$BF8= 500.13
##$BYTORDA= 1
##$CFDGTYP= 0
##$CFRGTYP= 5
##$CHEMSTR= <none>
##$CNST= (0..31)
1 1 145 1 1 1 1 1 1 1 1 1 1 1 1 1 1 1 1 1 1 1 1 1 1 1 1 1 1 1 1 1 
##$CPDPRG= <>
##$CPDPRG1= <>
##$CPDPRG2= <>
##$CPDPRG3= <>
##$CPDPRG4= <mlev>
##$CPDPRG5= <mlev>
##$CPDPRG6= <mlev>
##$CPDPRG7= <mlev>
##$CPDPRG8= <mlev>
##$CPDPRGB= <>
##$CPDPRGT= <>
##$D= (0..31)
0 1 0 0 0 0 0 0 0 0.06 0 0 0 0 0 0 0.0002 0 0 0 0 0 0 0 0 0 0 0 0 0 0 
0 
##$DATE= 1122887186
##$DBL= (0..7)
120 120 120 120 120 120 120 120 
##$DBP= (0..7)
150 150 150 150 150 150 150 150 
##$DBP07= 0
##$DBPNAM0= <>
##$DBPNAM1= <>
$$ [...]
##$SUBNAM7= <"">
##$SUBNAM8= <"">
##$SUBNAM9= <"">
##$SW= 20.6930455092707
##$SWIBOX= (0..15)
0 0 3 0 0 0 0 0 0 0 0 0 0 0 0 0 
##$SW_h= 5175.983436853
##$TD= 65536
##$TD0= 1
##$TE= 295.16
##$TE2= 300
##$TE3= 300
##$TEG= 300
##$TL= (0..7)
0 120 120 120 120 120 120 120 
##$TP= (0..7)
150 150 150 150 150 150 150 150 
##$TP07= 0
##$TPNAME0= <>
##$TPNAME1= <>
##$TPNAME2= <>
##$TPNAME3= <>
##$TPNAME4= <>
##$TPNAME5= <>
##$TPNAME6= <>
##$TPNAME7= <>
##$TPOAL= (0..7)
0.5 0.5 0.5 0.5 0.5 0.5 0.5 0.5 
##$TPOFFS= (0..7)
0 0 0 0 0 0 0 0 
##$TUNHIN= 0
##$TUNHOUT= 0
##$TUNXOUT= 0
##$USERA1= <user>
##$USERA2= <user>
##$USERA3= <user>
##$USERA4= <user>
##$USERA5= <user>
##$V9= 5
##$VALIST= <valist>
##$VCLIST= <CCCCCCCCCCCCCCC>
##$VD= 0
##$VDLIST= <DDDDDDDDDDDDDDD>
##$VPLIST= <PPPPPPPPPPPPPPP>
##$VTLIST= <TTTTTTTTTTTTTTT>
##$WBST= 1024
##$WBSW= 4
##$XGAIN= (0..3)
0 0 0 0 
##$XL= 0
##$YL= 0
##$YMAX_a= 291668
##$YMIN_a= -269842
##$ZGOPTNS= <>
##$ZL1= 120
##$ZL2= 120
##$ZL3= 120
##$ZL4= 120
##$ABSF1= 16.522
##$ABSF2= -4.171173
##$ABSG= 5
##$ABSL= 3
##$ALPHA= 0
##$AQORDER= 0
##$ASSFAC= 0
##$ASSFACI= 0
##$ASSFACX= 0
##$ASSWID= 0
##$AUNMP= <proc_1d>
##$AZFE= 0.1
##$AZFW= 0.1
##$BCFW= 0
##$BC_mod= 0
##$BYTORDP= 0
##$COROFFS= 0
##$CY= 12.5
##$DATMOD= 1
##$DC= 0
##$DFILT= <>
##$DTYPP= 0
##$F1P= 14.0000005364418
##$F2P= -0.99999901652339
##$FCOR= 0.5
##$FTSIZE= 32768
##$FT_mod= 6
##$GAMMA= 0
##$GB= 0
##$INTBC= 1
##$INTSCL= 1
##$ISEN= 128
##$LB= 0.3
##$LEV0= 0
##$LPBIN= 0
##$MAXI= 10000
##$MC2= 0
##$MEAN= 0
##$ME_mod= 0
##$MI= 0
##$NCOEF= 0
##$NC_proc= -5
##$NLEV= 6
##$NOISF1= 0
##$NOISF2= 0
##$NSP= 0
##$NTH_PI= 0
##$NZP= 0
##$OFFSET= 16.522
##$PC= 1
##$PHC0= -84.84403
##$PHC1= 12.36361
##$PH_mod= 1
##$PKNL= yes
##$PPARMOD= 0
##$PSCAL= 4
##$PSIGN= 0
##$REVERSE= no
##$SF= 250.13
##$SI= 32768
##$SIGF1= 0
##$SIGF2= 0
##$SINO= 400
##$SIOLD= 32768
##$SREGLST= <1H.DMSO>
##$SSB= 0
##$STSI= 32768
##$STSR= 0
##$SW_p= 5175.98343685301
##$SYMM= 0
##$S_DEV= 0
##$TDeff= 65536
##$TDoff= 0
##$TI= <Analysis number 999999
Compound Code 99
Book Reference 9
Project Code 9>
##$TILT= no
##$TM1= 0
##$TM2= 0
##$TOPLEV= 0
##$USERP1= <user>
##$USERP2= <user>
##$USERP3= <user>
##$USERP4= <user>
##$USERP5= <user>
##$WDW= 1
##$XDIM= 32768
##$YMAX_p= 356636813
##$YMIN_p= -740364
$$ End of Bruker specific parameters
$$ ---------------------------------
##NTUPLES= NMR SPECTRUM
##VAR_NAME=  FREQUENCY,     SPECTRUM/REAL,   SPECTRUM/IMAG
##SYMBOL=    X,             R,               I
##VAR_TYPE=  INDEPENDENT,   DEPENDENT,       DEPENDENT
##VAR_FORM=  AFFN,          ASDF,            ASDF
##VAR_DIM=   32768,         32768,           32768
##UNITS=     HZ,            ARBITRARY UNITS, ARBITRARY UNITS
##FACTOR=    0.157963299565203, 1,           1
##FIRST=     4132.6476996994, 0,             0
##LAST=      -1043.33573715361, 0,           0
##MIN=       -1043.33573715361, -740364,     0
##MAX=       4132.6476996994, 356636813,     0
$$ Real data points
##PAGE= N=1
##DATA TABLE= (X++(R..R)), XYDATA
$$ [...]
23639a8460J3117p7296j4023K76522J75126n790j58787P1877o7791q7801r0260
$$ -18460 -5343 -82639 -96662 179860 354986 349196 190409 262286 194495 106694 16434
23628A6434J52543j1641k6635O4284m836O1024l6797L0217j21000j3079M5733
$$ 16434 168977 157336 130701 194985 190149 251173 214376 244593 123593 110514 156247
23617A56247j28637O76J64803R7289j20839j29887m9585j38997M4767N3770R3514
$$ 156247 27610 28286 193089 290378 169539 39652 -9933 -148930 -104163 -50393 43121
23606D3121J21902M0755k07987j45835k5357O7086J29338J38643J32657J68116
$$ 43121 165023 205778 -2209 -148044 -173401 -106315 23023 161666 294323 462439
23596D62439j86567k30990k44327j07175J37680M6084j47383r160K4377l3309
$$ 462439 275872 44882 -199445 -306620 -168940 -122856 -270239 -279399 -255022 -288331
23586b88331Q0886Q1753l0840J1764M0137o7974k1670L7301J31107J68946j08753
$$ -288331 -207445 -125692 -156532 -144768 -104631 -172605 -194275 -156974 -25867 143079 34326
23575C4326r7697J56510q5531j35912l685p6760p6036P0972P4294J89534m9059
$$ 34326 -63371 93139 7608 -128304 -131989 -208749 -284785 -213813 -139519 50015 956
23564I56j96962O7317P1124j2266L6809j13746j35653J34472O1517m1136k18986
$$ 956 -196006 -128689 -57565 -69831 -33022 -146768 -282421 -147949 -86432 -127568 -346554
23553c46554l08601k8837L40633K29421N4577R5172j54574O3644j85998K0084
$$ -346554 -655155 -683992 -343359 -113938 -59361 35811 -118763 -55119 -241117 -221033
23543b21033L7944k22746k2102Q8611K26886J12622J05883J83893p0266p9965
$$ -221033 -183089 -405835 -427937 -339326 -112440 182 106065 289958 219692 139727
23533A39727j35538j26893J18886J06540J9182O6184q7479m868J29769o4835j01059
$$ 139727 4189 -122704 -3818 102722 121904 188088 100609 95741 225510 160675 59616
23522E9616j26394M5559l9253j10312P8815j552l1259j10421J44111Q1978m8818
$$ 59616 -66778 -21219 -60472 -170784 -91969 -93521 -124780 -235201 -91090 -9112 -57930
23511e7930q4099L0203L4679l0015l7275Q1674J60492l220j21446J3671m736J25012
$$ -57930 -142029 -111826 -77147 -107162 -144437 -62763 97729 94509 -26937 -13266 -18002 107010
23499A07010j5715j95178K18503O1716j01575j86506n8597J95820r214n052j37565
$$ 107010 91295 -103883 114620 176336 74761 -111745 -170342 25478 16264 11212 -126353
23488a26353q7984K59373Q3203j56703j97687N3945J8597n9139L7909J42184J20241
$$ -126353 -214337 45036 128239 -28464 -226151 -172206 -153609 -212748 -174839 -32655 87586
23477H7586o8279j42620r802K00309L0937j21300M8930J32552j87127J46431q450
$$ 87586 19307 -123313 -133115 67194 98131 -23169 25761 158313 -28814 117617 109167
23466A09167j22963k73410k20868J06907K67697j2253l1893J08160K19380Q8655
$$ 109167 -13796 -287206 -508074 -401167 -133470 -145723 -177616 -69456 149924 238579
23456B38579j54375l5378K09342j99914k15882m2742J79619r1677O897o3860j52762
$$ 238579 84204 48826 258168 58254 -157628 -200370 -20751 -112428 -105531 -169391 -322153
23445c22153j3916J60127L877k2407q9413m0654K28637J17365J88531J9978M4021
$$ -322153 -336069 -175942 -172065 -194472 -283885 -324539 -95902 21463 209994 229972 273993
23434B73993j44175n2194J66946j11150P3813J26008J1390Q011J17076j55743
$$ 273993 129818 77624 244570 133420 207233 333241 344631 352642 469718 313975
23424C13975j65679O7591J6962l57382k37119K68810K27424N9522j21755o7454
$$ 313975 148296 215887 232849 -124533 -361652 -92842 134582 194104 72349 4895
23414D895m8967r5519P462K7863R6093O0782j77228J21224J57156K4205j08249
$$ 4895 -44072 -139591 -132129 -104266 -8173 52609 -124619 -3395 153761 177966 69717
23403F9717J0405K1166j25310J75186P83M929J91461r408k1588K877m5451r5311
$$ 69717 80122 101288 -24022 151164 151947 156876 348337 338929 317341 320218 274767 179456
23391A79456o6188p8527N2388P6506j62480p375J11545j01108j14998k014l4814
$$ 179456 113268 34741 87129 163635 1155 -6220 105325 4217 -110781 -112795 -147609
23380a47609K40434K21372q9056l2922m0329j96971J46474o7025q2176j67824
$$ -147609 92825 314197 225141 192219 151890 -45081 101393 34368 -47808 -215632
23370b15632r121n2138Q7929J74528j24712O6568J20501J41870R7827k3368k9652
$$ -215632 -224753 -276891 -188962 -14434 -139146 -72578 47923 189793 287620 264252 234600
23359B34600j57806j37298J47922o7168j39979j19258N5467J3474j36588Q0343
$$ 234600 76794 -60504 87418 20250 -119729 -238987 -183520 -170046 -306634 -226291
23349b26291Q3896n1370J69404j18840j10486l326J25510L7567j837j24653k5175
$$ -226291 -142395 -193765 -24361 -143201 -253687 -257013 -131503 -93936 -95773 -220426 -245601
23338b45601J07501J24786P1650P8090j21144j25769j19386O1826J11344j5010
$$ -245601 -138100 -13314 58336 136426 15282 -110487 -229873 -168047 -56703 -71713
23328g1713J09016N158p4508j77988m2033n75J13751j06296M5269J37461n4076
$$ -71713 37303 42461 -32047 -210035 -252068 -252643 -138892 -245188 -199919 -62458 -116534
23317a16534n4168K3350k5478J3067r0625n4449j6230l291J85757O0899q3738
$$ -116534 -170702 -147352 -172830 -159763 -250388 -304837 -321067 -324358 -138601 -77702 -161440
23306a61440K6002K32246L7512j67347m6444o2462k3621M6580L4063P5728J11466
$$ -161440 -135438 96808 134320 -33027 -79471 -141933 -165554 -118974 -84911 -9183 102283
23295A02283K40674k21014k08608n0448J28544J1831L3231J45134n384j1179p9589
$$ 102283 342957 121943 -86665 -137113 -8569 3262 36493 181627 176243 165064 85475
23284H5475j83391r7439p3014R9925K06366m4149J0262l6580J11885p2425j12232
$$ 85475 -97916 -195355 -268369 -168444 37922 -6227 4035 -32545 79340 6915 -105317
23273a05317j19229N7142J2607J22073P2302J14026K5992j53418L4123N7630l0909
$$ -105317 -224546 -167404 -154797 -32724 39578 153604 179596 26178 60301 117931 87022
23262H7022r5183j63880J34896K23472k9053o3344j83966O4685L6049j88458k44915
$$ 87022 -8161 -172041 -37145 186327 157274 93930 -90036 -25351 10698 -177760 -422675
23251d22675L7179O2356q6717J82475J81748J22560J30850o2195q7074j77692
$$ -422675 -385496 -323140 -409857 -227382 -45634 76926 207776 145581 58507 -119185
23241a19185j15919J16241J73367j16864O8800K39087j24920n4585J25190k15671
$$ -119185 -235104 -118863 54504 -62360 6440 245527 120607 66022 191212 -24459
23231b4459l84587r2645K4350J85366P2769Q7136J21101J61191n8916o9584o0380
$$ -24459 -409046 -501691 -477341 -291975 -219206 -132070 -10969 150222 91306 21722 -38658
23220c8658j3646j42157R8631J87905j2411j101j59194m8762J40473J51241j19550
$$ -38658 -52304 -194461 -95830 92075 79664 78563 -80631 -129393 11080 162321 42771
23209D2771k1701J78495M3339o1771j29440r7629J09118p8473p9382j24176J8208
$$ 42771 21070 199565 242904 181133 51693 -45936 63182 -15291 -94673 -218849 -200641
23198b00641Q4944j77321q8702M2143N7872n2685J32408J71952k8517j30159k1673
$$ -200641 -115697 -293018 -381720 -339577 -281705 -334390 -201982 -30030 -58547 -188706 -210379
23187b10379J86907J05800j93579j44797P3204J07816L5118q0579J7536J87376
$$ -210379 -23472 82328 -111251 -256048 -182844 -75028 -39910 -120489 -102953 84423
23177H4423K0422p0316L3683J45566J26630K266l0940l31683j80723J34536j8836
$$ 84423 104845 34529 68212 213778 340408 342674 311734 -19949 -200672 -66136 -84972
23166h4972J67620Q9360k1114o9943M6198j20598j09806l01J57238j63275j85022
$$ -84972 82648 172008 150894 80951 127149 6551 -103255 -103556 53682 -109593 -294615
23155b94615J22582J58700J5637P3432P1499j65295J56502J8177Q5205p8866j64613
$$ -294615 -172033 -13333 2304 75736 147235 -18060 138442 156619 241824 162958 -1655
23144a655J0690Q2403P1858j64502L0911O8725k27319J32964J063R9095K7252
$$ -1655 9035 91438 163296 -1206 29705 98430 -128889 4075 5138 104233 131485
23133A31485o8702J53924O5557k14960j77374m0689J30660J34920l7271j1329
$$ 131485 62783 216707 282264 67304 -110070 -150759 -20099 114821 77550 66221
23123F6221n8619J49o9779K02724J6969n457l534l78501j23888J2447J63695M1692
$$ 66221 7602 7751 -62028 140696 157665 152208 148674 -229827 -353715 -341268 -177573 -135881
23111a35881K21431j4393j47709r838P4705q3623p4620p7507j83242L871J08152
$$ -135881 85550 71157 -76552 -86390 -11685 -95308 -169928 -247435 -430677 -426806 -318654
23100c18654J84489J00560q4189j05469K47816Q6268o3853j04781j56624M28J58944
$$ -318654 -134165 -33605 -117794 -223263 24553 110821 46968 -57813 -214437 -214009 -55065
23089e5065K02252o8697R8798J06346k88564m0345l5105K2106K9993K95955J49497
$$ -55065 147187 78490 177288 283634 -4930 -45275 -80380 -58274 -28281 267674 417171
23078D17171j28017R8157m7903j76841j24940j71286j77487J59384J88234k0237
$$ 417171 289154 387311 339408 162567 37627 -133659 -311146 -151762 36472 16235
23068A6235m1532j4960n8503O3087j07378k40136J65638O1497k3512m077k6556
$$ 16235 -25297 -40257 -98760 -35673 -143051 -383187 -217549 -156052 -179564 -183641 -210197
23057b10197N1343J80202k9973j7176l6975j38808j06366K49121K49079k09621
$$ -210197 -158854 21348 -8625 -25801 -62776 -201584 -307950 -58829 190250 -19371
23047a9371j36599R0661J92646M4059J1499k57221P3589o3880j61317Q2648P9414
$$ -19371 -155970 -65309 127337 171396 182895 -74326 -737 -64617 -225934 -143286 -63872
23036f3872J27462q6354j13618N0441K29587j08995L5002l873j14025K161P0532
$$ -63872 63590 -22764 -136382 -85941 143646 34651 69653 65780 -48245 -46084 24448
23025B4448q093O6841j41028K8611J60607j83923L7462L5738o5888j21814R5753
$$ 24448 16355 83196 -57832 -29221 131386 -52537 -15075 20663 -45225 -167039 -71286
23014g1286J1744L5496l2083j81203J04751P6399m8114J10601J19337o7864k0449
$$ -71286 -59542 -24046 -56129 -237332 -132581 -56182 -104296 6305 125642 57778 37329
23003C7329Q0524q7692j13838k3788m7968m5157O5049P2906O5175J86972L3183
$$ 37329 117853 30161 -83677 -107465 -155433 -200590 -135541 -62635 2540 189512 222695
22992B22695m7019K382O6824j7809J26936J76953j60647k57276Q9343J05963o021
$$ 222695 175676 178058 244882 227073 354009 530962 370315 113039 202382 308345 302324
22981C02324j22025j2692J27683j5188k15664n1585K4612J69725Q317j76317p3560
$$ 302324 180299 167607 295290 280102 64438 12853 37465 207190 215507 39190 -34370
22970c4370k18555k9936l6804n3038J50122R5537L5451j37791j27787K62252J15137
$$ -34370 -252925 -282861 -319665 -372703 -222581 -127044 -91593 -229384 -357171 -94919 20218
22959B0218J67433j3838j69923j22726P6150J94227J8500l9587k70547j40287
$$ 20218 187651 173813 3890 -118836 -42686 151541 170041 130454 -140093 -280380
22949b80380J38440R1655k2503k54792N4881J19565J80370N0419q7187p3927K37462
$$ -280380 -141940 -50285 -72788 -327580 -272699 -153134 27236 77655 -9532 -83459 154003
22938A54003j2963j47459K2553l4478j3742N3529q24O1662J04222K6996J38451
$$ 154003 141040 -6419 16134 -18344 -32086 21443 20619 82281 186503 213499 351950
22927C51950m9654k18189j09698K9908L0229n8645k26521j35128j1549J42479
$$ 351950 302296 84107 -25591 4317 34546 -24099 -250620 -385748 -397297 -254818
22917b54818R3892L2063J09565R4143p0042k37859P2075J42806j28582k80167
$$ -254818 -160926 -128863 -19298 74845 4803 -233056 -160981 -18175 -146757 -426924
22907d26924r7207J43683K27778R453j8252r0205k809n4915N4524J88635L5308
$$ -426924 -524131 -380448 -152670 -143217 -161469 -251674 -254483 -309398 -254874 -66239 -30931
22896c0931j8895n0463m8590O9314J93060p4276j59262M8416K08181n6641o6070
$$ -30931 -49826 -100289 -148879 -79565 113495 39219 -120043 -71627 136554 79913 13843
22885A3843R5062j59481n2757j31173J98946R9911r971k5856j67484k54941m2995
$$ 13843 108905 -50576 -103333 -234506 -35560 64351 54380 28524 -138960 -393901 -436896
22874d36896R5909j3297J80067l5428k085J0323J34547J56175O33m8107J48888
$$ -436896 -340987 -354284 -174217 -209645 -211730 -201407 -66860 89315 89948 41841 190729
22863A90729j17698j78042P1572J61982R1024L1869j59948o8642k8554L0219P8809
$$ 190729 73031 -105011 -33439 128543 219567 251436 91488 22846 -5708 24511 103320
22852A03320R0105k54931M9930J06049m0724r8439P353J42187J1844J20508j6286
$$ 103320 193425 -61506 -11576 94473 53749 -44690 -37337 104850 116694 237202 220916
22841B20916O0704j11j68312q1198J57330K0795j1251j38625k07270Q9254O1565
$$ 220916 281620 281509 113197 31999 189329 210124 198873 60248 -147022 -57768 3797
22830C797r2637J93815O5211O1450k12094j75077q474k5259N2898n6459J06078
$$ 3797 -88840 104975 170186 231636 19542 -155535 -164009 -189268 -136370 -192829 -86751
22819h6751N6449O7156R427K4916j44396J31805m4639j02842K853Q9382p3086
$$ -86751 -30302 36854 46281 71197 -73199 58606 13967 -88875 -86022 3360 -69726
22808f9726O3651J58361r2821N1005M7444J5811l1791J16526q7560j74920J8418
$$ -69726 -6075 152286 59465 110470 157914 173725 141934 258460 170900 -4020 14398
22797A4398r5441q9841Q9414J30189j87742j21025L5160M6276n669K07832O817
$$ 14398 -81043 -170884 -81470 48719 -139023 -260048 -224888 -178612 -184281 23551 30368
22786C0368M067p140k2716o76P970P0671p4121m8694J7267L1907m8902m9732J29376
$$ 30368 34435 27295 4579 3903 11873 82544 8423 -40271 -23004 8903 -39999 -89731 39645
22773C9645Q766L6700k8152j38266j65511Q6163J77046R515l2366J35247r0637
$$ 39645 48411 85111 56959 -81307 -246818 -160655 16391 25906 -6460 128787 38150
22762C8150r0680K30917K08383j62049j61089K3098J57445L863j27176m4139k9958
$$ 38150 -52530 178387 386770 224721 63632 86730 244175 248038 120862 76723 46765
22751D6765o7248q6288k40311Q655p782L8339J18227P0399m8715P8794Q4817K50283
$$ 46765 -20483 -106771 -347082 -338427 -346209 -307870 -189643 -119244 -167959 -89165 -4348 245935
22739B45935M3395j27531j26943k7675P5936j00192q4115o3832k3388J42372J24253
$$ 245935 289330 161799 34856 7181 83117 -17075 -101190 -165022 -188410 -46038 78215
22728G8215o4943j01074J19042M5690j89506J64263O4731j29212n7569M0083M2378
$$ 78215 13272 -87802 31240 76930 -112576 51687 116418 -12794 -70363 -30280 12098
22717A2098j56390R8304J18643k1715N1256q5552n1258n2510M3862J50612n9736
$$ 12098 -144292 -45988 72655 50940 102196 16644 -34614 -87124 -43262 107350 47614
22706D7614j10789m794J13616J1916p6998q0120k8839J70908J20586j40910J7660
$$ 47614 -63175 -67969 45647 57563 -19435 -99555 -128394 42514 163100 22190 39850
22695C9850J63349k15083m6472K62105r3368k28691J9536j09607J9929o6812R604
$$ 39850 203199 -11884 -58356 203749 110381 -118310 -98774 -208381 -188452 -255264 -245660
22684b45660K07216J09177j22829J10128M6792q312j95932j47707K2845M471K13802
$$ -245660 -38444 70733 -52096 58032 104824 96512 -99420 -247127 -224282 -219811 -6009
22673f009L36592R2942j58109k71504p7150n5747l8366n2670J4286k758j47866
$$ -6009 330583 423525 265416 -6088 -83238 -138985 -177351 -230021 -215735 -218493 -366359
22662c66359K26924J32629p7262j88925n7067K5864J8607o0364m0191L3992K77213
$$ -366359 -139435 -6806 -84068 -272993 -330060 -304196 -285589 -345953 -386144 -352152 -74939
22651g4939J47379p3720o199K8486j60712L3984J47508k94480k9888K36111N5585
$$ -74939 72440 -1280 -7479 21007 -139705 -105721 41787 -252693 -282581 -46470 9115
22640I115k99022N0940o25Q033P3385K2232r3035P7272J73668l5385L4813j42738
$$ 9115 -289907 -238967 -239592 -231559 -158174 -135942 -228977 -151705 21963 -13422 21391 -121347
22628a21347j93627J5695J36046o1536K4332K4235N2792K37581k8665m9865J04466
$$ -121347 -314974 -299279 -163233 -224769 -200437 -176202 -123410 114171 85506 35641 140107
22617A40107J71079J2018j25450j12315l2734p1465L0020p2076j42896L09996
$$ 140107 311186 323204 197754 85439 52705 -18760 11260 -60816 -203712 106284
22607A06284J80519m0730o4865n937j55062L1346M1201j20521k1803J44567p2965
$$ 106284 286803 246073 181208 175271 20209 51555 92756 -27765 -49568 94999 22034
22596B2034j03630K11651K45769K00091j97297m18520r2418p5193k09717o2974
$$ 22034 -81596 130055 375824 575915 378618 -39902 -132320 -207513 -417230 -480204
22586d80204L51330J11394q1046k46257R172Q5863K02208R7891j07369m5719o3355
$$ -480204 -128874 -17480 -98526 -344783 -335611 -249748 -47540 50351 -57018 -102737 -166092
22575a66092j58289L19730K72762o4759j74973k56911J10740Q8378j22699n8190
$$ -166092 -324381 -4651 268111 203352 28379 -228532 -117792 -29414 -152113 -210303
22565b10303M1670O6392l3246N2401J5055o7229K1209O5676n3465N8654N558j48322
$$ -210303 -168633 -102241 -135487 -83086 -68031 -135260 -114051 -48375 -101840 -43186 -37628 -185950
22553a85950j00975N6628J64104l6423L8425K0897O6555P2990L1480p0636q4286
$$ -185950 -286925 -230297 -66193 -102616 -64191 -43294 23261 96251 127731 57095 -27191
22542b7191q5491J108j3505L199J42155J18295R9714m1012l22826q6392j11989
$$ -27191 -112682 -111574 -125079 -121880 20275 138570 238284 197272 -125554 -211946 -323935
22531c23935o0477J9068R0925J18505P6287r3227j79200q4550J23808J10038j50682
$$ -323935 -384412 -365344 -274419 -155914 -79627 -172854 -352054 -436604 -312796 -202758 -353440
22520c53440j819K30864J68755L256J12267l5003L3342n1685j66759J8745p532
$$ -353440 -355259 -124395 44360 47616 159883 124880 158222 106537 -60222 -41477 -49009
22509d9009p2639J25947K4462K8643j4354K6939p4150J7671q5676j19544J68370
$$ -49009 -121648 4299 28761 57404 43050 69989 -4161 13510 -72166 -191710 -23340
22498b3340j27648L4996J86868J67265j63271j99196j89475O120K00214J19965
$$ -23340 -150988 -115992 70876 238141 74870 -124326 -313801 -307681 -107467 12498
22488A2498o488r8383J03990P7876n3314j1310o3056J5829R7984J16454J1215
$$ 12498 6010 -92373 11617 89493 36179 24869 -38187 -22358 75626 192080 203295
22477B03295L6773q1453k00676R0081M7296j02110J3555k60104L9604K07342J72844
$$ 203295 240068 158615 -42061 48020 95316 -6794 6761 -253343 -213739 -6397 166447
22466A66447K0094K2536n0800j33352l2676j1244o947Q250M1866r9884q5105j28422
$$ 166447 186541 209077 158277 24925 -7751 -18995 -25942 -17692 24174 -75710 -160815 -289237
22454b89237l3009j745J19314R5281J47592j3477j55401k7630O2772L9822J34368
$$ -289237 -322246 -323991 -204677 -109396 38196 24719 -130682 -158312 -95540 -55718 78650
22443G8650M4812R1618o2898p2515N8751M5500q9670N885K3550M7842j32083j08472
$$ 78650 123462 215080 152182 79667 138418 183918 94248 100133 123683 171525 39442 -69030
22431f9030p2552J4572J55143j02717j90260q6398K21833l2370m4108l5441j05999
$$ -69030 -141582 -127010 28133 -74584 -264844 -351242 -129409 -161779 -205887 -241328 -347327
22420c47327J80153L31735r2922k52494o9790J21615J40426j25541Q6801n1410
$$ -347327 -167174 164561 71639 -180855 -250645 -129030 11396 -114145 -27344 -78754
22410g8754j05405Q9235l8148o21k0396j85399M6686J11218j425j29168j01928
$$ -78754 -184159 -94924 -133072 -133693 -154089 -339488 -292802 -181584 -183009 -312177 -414105
22399d14105n5417p6010R5598L66417J38569r0079L3577r5959l7632J30318P6744
$$ -414105 -469522 -545532 -449934 -83517 55052 -35027 -1450 -97409 -135041 -4723 72021
22388G2021j18156J04893J40231l6935l15050o7874k8906K4270o1169N8077K10048
$$ 72021 -46135 58758 198989 162054 -152996 -220870 -249776 -225506 -286675 -228598 -18550
22377a8550J68297M7967l5095n9417r7315l4341j35405j24945J57740j23419p2161
$$ -18550 149747 197714 162619 103202 5887 -28454 -163859 -288804 -131064 -254483 -326644
22366c26644O272j061K0111K21479J57558l119P5003R5793k86581j34781P9238
$$ -326644 -320372 -321433 -301322 -79843 77715 74596 149599 245392 -41189 -175970 -96732
22355i6732K61944r5521j37430M1042J19724K74341K42733j01285j78007k33325
$$ -96732 165212 69691 -67739 -26697 93027 367368 610101 508816 330809 97484
22345I7484L2817p0947l1347Q8018N5298n9831k3463r5960j39014K268k03315
$$ 97484 130301 59354 28007 116025 171323 111492 88029 -7931 -146945 -144677 -347992
22334c47992J27658J60888o7728k28622r48L9895Q1312J95981J67150K2106P386
$$ -347992 -220334 -59446 -127174 -355796 -356744 -316849 -235537 -39556 127594 149700 157086
22323A57086r0640K0922j3363j6352k5120O6119R85k4707L255K19927K82464p5587
$$ 157086 66446 87368 74005 57653 32533 98652 99637 74930 78185 298112 580576 504989
22311E04989l07086j51291R8766k07197k07408n2429l2124K9976J82731J33124
$$ 504989 197903 46612 145378 -61819 -269227 -321656 -353780 -323804 -141073 -7949
22301g949K867M0968k6217n2442M2662M879j32526k16521R6662J63779k2298n970
$$ -7949 -5082 35886 9669 -42773 -111 4768 -127758 -344279 -247617 -83838 -106136 -112106
22289a12106k976M2274o0897N8007r259M9155M3131N8244M821m5889K2442N1175
$$ -112106 -115082 -72808 -133705 -75698 -84957 -35802 7329 65573 70394 24505 46947 98122
22277I8122q8394P2293j03776j54489J0515n7269r1389P797J54703l4016M6312
$$ 98122 9728 82021 -21755 -176244 -165729 -222998 -314387 -306590 -151887 -185903 -139591
22266a39591Q0693J73097J79255J46566m10j18587r3750L1031m2000P0232j45153
$$ -139591 -58898 114199 293454 440020 439610 321023 227273 258304 216304 286536 141383
22255A41383j28977r027k7294p6776K431J36243J89090J22085Q789j340l6578
$$ 141383 12406 3379 -23915 -100691 -98260 37983 227073 349158 357947 356607 320029
22244C20029k00431m4487M8045j23760L4275K31492l2294j61815q8614m0135J81456
$$ 320029 119598 75111 123156 -604 33671 265163 232869 71054 -17560 -57695 123761
22233A23761L8555J40770k7606q7678j05440o7909L27M2536M2224m3322M4333
$$ 123761 162316 303086 275480 187802 82362 14453 14780 57316 99540 56218 100551
22222A00551n4759j04720j74017k9542Q5642N6764j27267O8346J25768J62695
$$ 100551 45792 -58928 -232945 -262487 -176845 -120081 -247348 -179002 -53234 109461
22212A09461p2584Q4648J30072R5166K4324j43044P8260J02577j54575l22698
$$ 109461 36877 121525 251597 346763 371087 228043 306303 408880 254305 -68393
22202f8393K5505J7900j01559J12250J36760J51596O8928Q9746n5525j66413l91795
$$ -68393 -42888 -24988 -126547 -14297 122463 274059 342987 432733 377208 210795 -181000
22191a81000k37053P5900J07067J07616R7847k42172j13641L14372J52237m4455
$$ -181000 -418053 -342153 -235086 -127470 -29623 -271795 -385436 -71064 81173 36718
22181C6718p969j9737J66985n4427k8770n46j72054j55717M5197M3915J2228m917
$$ 36718 28749 9012 175997 121570 92800 92254 -79800 -235517 -190320 -146405 -134177 -139094
22169a39094L0174r7475j1691j64808J2974N2693Q5006K52574J0325Q659j98875
$$ -139094 -108920 -206395 -218086 -382894 -369920 -317227 -232221 20353 30678 39337 -159538
22158a59538j44047j40598k4054L28637J81092L484o4380j47879j24073J01788
$$ -159538 -303585 -444183 -468237 -139600 41492 44976 -19404 -167283 -291356 -189568
22148a89568Q8418O9961q9481p4248p2938J36932Q0487M8271Q9445r8743l01842
$$ -189568 -101150 -31189 -120670 -194918 -267856 -130924 -50437 -2166 87279 -11464 -313306
22137c13306J99470K1167j17171q832K65321P3967p9836k9582j41654j13801P6123
$$ -313306 -113836 -92669 -209840 -218672 46649 120616 40780 11198 -130456 -244257 -168134
22126a68134n5334p8078K22194K00033Q2655o574j32397K31067J07728p7277j8336
$$ -168134 -223468 -301546 -79352 120681 203336 196762 64365 295432 403160 325883 307547
22115C07547J9055j22829j59718q3596j32450M9466M0483n7475J68582J7031r6352
$$ 307547 326602 203773 44055 -39541 -171991 -122525 -82042 -139517 29065 46096 -50256
22104e0256l1971r8307O0759J31940J43969N9958j13665k04143P610L1171L6089
$$ -50256 -82227 -180534 -119775 12165 156134 216092 102427 -101716 -94106 -62935 -26846
22093b6846K09275L2976j7736r7830p3237J23278O7183j59207MK5257M2553j17758
$$ -26846 182429 215405 197669 99839 26602 149880 217063 57856 57860 83117 125670 7912
22081G912n3525L7007J85928j69054J08162J35646O1550r5627j37291j18162j73844
$$ 7912 -45613 -8606 177322 8268 116430 252076 313626 217999 80708 -37454 -211298
22070b11298k60430J34161J33521K38233O637n7552j8346n0034k1809o420m0912
$$ -211298 -471728 -337567 -204046 34187 40824 -16728 -35074 -85108 -106917 -113337 -154249
22059a54249k1771J68631k40619N8459k7734P2217J23786J39680K38674M6254
$$ -154249 -176020 -7389 -248008 -189549 -217283 -145066 -21280 118400 357074 403328
22049D03328k58563k8435k27875j56283Q4520L64685J60039k12650j21625J32144
$$ 403328 144765 116330 -111545 -267828 -183308 181377 341416 128766 7141 139285
22039A39285J80602j32621k3223l5634l0722J65J18291j01742j82130l0187K898
$$ 139285 319887 187266 164043 128409 97687 97852 216143 114401 -67729 -97916 -95018
22028i5018j64166j6907q812O1003K43637K34627K4564p3104M0105j45383m8294
$$ -95018 -259184 -276091 -284903 -223900 19737 254364 278928 205824 245929 100546 52252
22017E2252k16968q3415O478K0868K8172K9314P4239Q4706k7858m3658L47043
$$ 52252 -164716 -248131 -241653 -220785 -192613 -163299 -89060 -4354 -32212 -75870 271173
22006B71173O3105K1056K7699p2419k04134k0734n2671N4465K61240j03430j40138
$$ 271173 334278 355334 383033 310614 106480 85746 33075 87540 348780 245350 105212
21995A05212j71294J03890J65806J07002J00770m0925m872k89744j38799J81453
$$ 105212 -66082 37808 203614 310616 411386 370461 365589 75845 -62954 118499
21985A18499Q4151J74099J38316k41780j90150L6921j67843p33o6744K4447M3577
$$ 118499 202650 376749 515065 273285 83135 120056 -47787 -48520 -115264 -90817 -47240
21974d7240k33757k8917O3053K973l2880J75634J15906k8701K5159L2452m7692
$$ -47240 -280997 -309914 -246861 -243888 -276768 -101134 14772 -13929 11230 43682 -4010
21963d010p8117O0740J09801l7259j37226J00185J34490k81840r8739J9983Q5501
$$ -4010 -82127 -21387 88414 51155 -86071 14114 148604 -133236 -231975 -211992 -126491
21952a26491J01807J05066M3574N0731M5028j170n1251l70407k3204P0925k4886
$$ -126491 -24684 80382 123956 174687 219715 218545 167294 -203113 -226317 -155392 -180278
21941a80278J18265K7768J45060J86430L2274K617j49562j56066J183M2794O6859
$$ -180278 -62013 -34245 110815 297245 329519 332136 182574 26508 27691 70485 137344
21930A37344M1208K4053J12226J3822j54321r7701q176M5663r8232L8798k5096
$$ 137344 178552 202605 314831 328653 174332 76631 68455 114118 15886 54684 29588
21919B9588O0103J896j08658J5467O226l4806m1632j52006k7298K45942K25576
$$ 29588 89691 91587 -17071 -1604 4622 -30184 -71816 -223822 -251120 -5178 220398
21908B20398j11587q9573l19429j44659J88149J08069j8475n0550J15086L2071
$$ 220398 108811 19238 -300191 -444850 -256701 -148632 -167107 -217657 -102571 -70500
21898g0500J6135J16246o5992M9713O1187j01672l23713R8508l4059p9072J79904
$$ -70500 -54365 61881 -4111 45602 106789 5117 -318596 -220088 -254147 -333219 -153315
21887a53315K79202k5415l24599j10956J02270K55261M8512J9250k0941o098l8555
$$ -153315 125887 100472 -224127 -335083 -232813 22448 70960 90210 69269 63171 24616
21876B4616k00658Q3317K06074N9391K7797j2044J60390R6853k42377j24795j45356
$$ 24616 -176042 -92725 113349 172740 200537 188493 348883 445736 203359 78564 -66792
21865f6792o0256m3925K4335o3253J963j12231m3564L5963r302j44452J03988
$$ -66792 -127048 -170973 -146638 -209891 -207928 -320159 -363723 -327760 -337062 -481514 -377526
21854c77526l0158O3323J54978p0628K09790P524K0994J14203J59549k0137q0663
$$ -377526 -407684 -344361 -189383 -260011 -50221 -42697 -21703 92500 252049 231912 151249
21843A51249p5775r7927o9887m5244K21935l0957M224j05824j38153q2979M2830
$$ 151249 75474 -22453 -92340 -137584 84351 53394 57618 -48206 -186359 -269338 -226508
21832b26508J20031R3910j25556q1558P5306j67021R7454r0394J35514L9559O0689
$$ -226508 -106477 -12567 -138123 -219681 -144375 -311396 -213942 -304336 -168822 -129263 -68574
21821f8574K1800o1761P1637l5058P3576J0759N4898J14868j00714O009J7207
$$ -68574 -46774 -108535 -36898 -71956 1620 12379 67277 182145 81431 87440 104647
21810A04647q379k9205M6391P2673P8021j89402k66574j39967n4956Q8280P8806
$$ 104647 96268 67063 113454 186127 264148 74746 -191828 -331795 -386751 -298471 -219665
21799b19665J84903J65351k0753j19044j15688m8390P4085j57834k87199J03939
$$ -219665 -34762 130589 109836 -9208 -124896 -173286 -99201 -257035 -544234 -440295
21789d40295N87355J55864k15425j15113j02306L3278P1762Q0949p0625j7775
$$ -440295 147060 302924 87499 -27614 -129920 -96642 -24880 56069 -14556 -32331
21779c2331l6877K7834p2689K2966j2453l7789j06973L50595K54754j67439l31217
$$ -32331 -69208 -41374 -114063 -91097 -103550 -141339 -248312 102283 357037 189598 -141619
21768a41619j62457J33852L35974P9060M5548j70658j16165O3167j81520k5537
$$ -141619 -304076 -170224 165750 244810 290358 119700 3535 66702 -114818 -140355
21758a40355O3412J13343O7076o827o3544O4865j06207j89700r398J44614m651
$$ -140355 -76943 36400 103476 96649 33105 97970 -8237 -197937 -207335 -62721 -67372
21747f7372k15288M2311J3626J01857J96488n93o260j65607J1000J1865J6394
$$ -67372 -282660 -240349 -226723 -124866 71622 71029 64769 -100838 -89838 -77973 -61579
21736f1579j03538J54487K87069j57685k50890k9441p3007l4211K92360j8914
$$ -61579 -165117 -10630 276439 118754 -132136 -161577 -234584 -268795 23565 4651
21726D651k1654J64990m5022O3241p3696L8250n7547p7713N7438J65424j81091
$$ 4651 -17003 147987 102965 166206 92510 130760 73213 -4500 52938 218362 37271
21715C7271Q2411R5262j29844j08841j9711j17263l8692K25704o4514k75731k8539
$$ 37271 119682 214944 85100 -23741 -43452 -160715 -199407 26297 -38217 -313948 -342487
21704c42487J64431L2902N1810K0754M5878l1430K6556j26496m1471N2602j24211
$$ -342487 -178056 -145154 -93344 -72590 -26712 -58142 -31586 -158082 -199553 -146951 -271162
21693b71162O2447o9459J7167q464J9025K33623J08824n6589j19543k43987K869
$$ -271162 -208715 -278174 -261007 -269471 -250446 -16823 92001 35412 -84131 -328118 -325249
21682c25249l015L4487k145K29083n1442m0106O7541o8859K8849J26775J54799
$$ -325249 -328264 -293777 -295922 -66839 -118281 -158387 -90846 -159705 -130856 -4081 150718
21671A50718J17405j67891l1355J23014o7142q5089O5913q6337j88908N9959J14130
$$ 150718 268123 100232 68877 191891 124749 39660 105573 19236 -169672 -109713 4417
21660D417P3409l9306j98405l6087O389J6154Q7086P6023j51788q4088J93180
$$ 4417 77826 38520 -159885 -195972 -189583 -173429 -86343 -10320 -162108 -246196 -53016
21649e3016j93966k40248L30308J90363K13953j0164J03519J29804j0315l00072
$$ -53016 -246982 -487230 -156922 33441 247394 237230 340749 470553 460238 160166
21639A60166j63664j23221n6537K4169M412L9251l0525k3485j67175r0053J20607
$$ 160166 -3498 -126719 -183256 -159087 -154675 -115424 -145949 -169434 -336609 -426662 -306055
21628c06055O6158R4548q4547J8949J62362L5604m4349j25922N0710J13799j72873
$$ -306055 -239897 -145349 -229896 -210947 -48585 -12981 -57330 -183252 -132542 -18743 -191616
21617a91616j572L2328j645l0366m6769j50882M9650K89951J07757k6517K2417
$$ -191616 -193188 -160860 -162505 -192871 -239640 -390522 -340872 -50921 56836 30319 52736
21606E2736Q9563q3891l572l0595l2990M1102K44034o4832j18778j37155N8452
$$ 52736 142299 58408 54836 24241 -8749 32353 276387 211555 92777 -44378 14074
21595A4074j86517J17559M4958N04o6119l34059M0916K23705J20365J8386Q2859
$$ 14074 -172443 -54884 -9926 -9422 -75541 -409600 -368684 -144979 -24614 -6228 76631
21584G6631j5745j39569o3271J93172K52440j7898l07966r1432L2058J24431p9978
$$ 76631 60886 -78683 -141954 51218 303658 285760 -22206 -113638 -81580 42851 -37127
21573c7127m7364J83561K49261J05844l13534J2638J06987r7276j13047J00568
$$ -37127 -84491 99070 348331 454175 140641 153279 260266 162990 49943 150511
21563A50511M094k15593o9234K9296J38796n88j05484j39724n2004p2678J60622
$$ 150511 154605 -60988 -130222 -100926 37870 37282 -68202 -207926 -259930 -332608 -171986
21552a71986R6889L0456o8793J8160m2908j8587K0473j9016L9663J15011L687
$$ -171986 -75097 -44641 -113434 -95274 -138182 -156769 -136296 -155312 -115649 -638 3049
21541C049p0325N3469n5788l67297o1756J63272K14248P3472q4105J56387J26228
$$ 3049 -67276 -13807 -69595 -436892 -498648 -335376 -121128 -47656 -131761 24626 150854
21530A50854l20566p9261R7531o7548M602j23671J23502J41488o7398O568J48446
$$ 150854 -169712 -248973 -151442 -218990 -214388 -338059 -214557 -73069 -140467 -133899 14547
21519A4547K468l6996L7935N1984O4328n8008J08836M8468j37029j31628j03534
$$ 14547 17015 -19981 17954 69938 134266 76258 185094 233562 96533 -35095 -138629
21508a38629J35372q3044J0828J1684m3227j87717j69441j07618J40501K50881
$$ -138629 -3257 -86301 -75473 -63789 -107016 -294733 -464174 -571792 -431291 -180410
21498a80410R6951R3609K49948j82817j52415R9202j97210j44245L9016L2241
$$ -180410 -83459 10150 260098 77281 -75134 24068 -173142 -317387 -278371 -246130
21488b46130K9804K15153j4089M5595K20397r2032j86574q8294k9334M9245l4287
$$ -246130 -216326 -1173 -15262 30333 250730 158698 -27876 -116170 -145504 -96259 -130546
21477a30546R771J65938K00792n3163r5407J22618R6143j57653q0429L0480k9448
$$ -130546 -120775 45163 245955 192792 97385 220003 316146 158493 78064 108544 79096
21466G9096L8927j8861l6225J15504k6252j07680L1868Q6800J08160k44694q7329
$$ 79096 118023 99162 62937 178441 152189 44509 76377 163177 271337 26643 -60686
21455f0686J68222J55829J47787M0287p2420j21616n3834j69095k30330l1688
$$ -60686 107536 263365 411152 451439 379019 257403 203569 34474 -195856 -227544
21445b27544Q1319N1791J19490M1980j2189j03084j62471J33223Q6305P6212J5246
$$ -227544 -146225 -94434 25056 67036 54847 -48237 -210708 -77485 8820 85032 100278
21434A00278r8698k1425j52163J75415l1157l24337K4939J75748N0271j99935
$$ 100278 1580 -19845 -172008 3407 -27750 -352087 -327148 -151400 -101129 -301064
21424c01064L5292K88088l0140m3364R3901j50132j03658J06035j13448K4748
$$ -301064 -265772 22316 -7824 -51188 42713 -107419 -211077 -105042 -218490 -193742
21414a93742J42188J40112l408O9481m5021R2742m1521j76661m8782N2953J26050
$$ -193742 -51554 88558 85150 154631 109610 202352 160831 -15830 -64612 -11659 114391
21403A14391N5109r5618q9668o7619J47600J22593O4033K0704j15238m7862j21382
$$ 114391 169500 73882 -15786 -83405 64195 186788 250821 271525 156287 108425 -12957
21392a2957p135m7366J91885J91880M6061j52735j13858J02943r8933k62098n3714
$$ -12957 -20092 -67458 124427 316307 362368 209633 95775 198718 99785 -162313 -216027
21381b16027R1758J29306J30043k7912n4886j08474Q4777P9086j21894J50326
$$ -216027 -124269 5037 135080 107168 52282 -56192 28585 107671 -14223 136103
21371A36103L7812M8507L8097q8191k16876j30698L0505j07379J01752K19039
$$ 136103 173915 222422 260519 172328 -44548 -175246 -144741 -252120 -150368 68671
21361F8671J51438R8984q6915o0393p5659J34834Q9291j90958j46500L0603P876
$$ 68671 220109 319093 232178 171785 96126 230960 320251 129293 -17207 13396 21272
21350B1272p3233j40133R1476K79696J28028m5928j25838k7040p3554J01802k2919
$$ 21272 -51961 -192094 -100618 179078 307106 261178 135340 108300 34746 136548 113629
21339A13629j1984P9106N8605Q8691q1421k29796j46881J5227k4244K22044J05131
$$ 113629 101645 180751 239356 328047 246626 16830 -130051 -114824 -139068 82976 188107
21328A88107j63371n7578J44847Q5950n0817k17747n1730J91417J97465J78688
$$ 188107 24736 -32842 112005 197955 147138 -70609 -122339 69078 266543 445231
21318D45231j69159l21763j23302j69133R5248J77247n1232r8597J47779J79502
$$ 445231 276072 -45691 -168993 -338126 -242878 -65631 -116863 -215460 -67681 111821
21308A11821J08381P4294k20201k32301k09901J38826P3346j10040j18979K22820
$$ 111821 220202 294496 74295 -158006 -367907 -229081 -155735 -265775 -384754 -161934
21298a61934J60756n2821K6667K29812j06479l96149j02032J74633L15676N7363
$$ -161934 -1178 -53999 -27332 202480 96001 -300148 -402180 -227547 88129 145492
21288A45492k99538k80777k7707K64846R5451j02864j5333n5644j09146K1756
$$ 145492 -154046 -434823 -462530 -197684 -102233 -205097 -220430 -276074 -385220 -363464
21278c63464P0300J32437J25226J0774q4405j9251l3304p8934j40015M3268K05085
$$ -363464 -293164 -160727 -35501 -24727 -109132 -128383 -161687 -240621 -380636 -337368 -132283
21267a32283j6177j49030P8136J79474O1500R8634o6904p8194J62491L7851j05608
$$ -132283 -148460 -297490 -219354 -39880 21620 120254 53350 -24844 137647 175498 69890
21256F9890p020j0760j72054l7103q2598j40460R2302J46427J63700O8618j32022
$$ 69890 62870 52110 -119944 -157047 -239645 -380105 -287803 -141376 22324 90942 -41080
21245d1080M9570L6269o2895K3956M3875j62792o588K22053J25211O1706J46978
$$ -41080 8490 44759 -18136 5820 49695 -113097 -119685 102368 227579 289285 436263
21234D36263j39274p4723K2868l9254j19349r2189n1074J21244R7384k40731Q7859
$$ 436263 296989 222266 245134 205880 86531 -5658 -56732 64512 161896 -78835 9024
21223I024l2119Q4940P8040J2653p7305P93Q1137M7880p8510q6157r8348N2039
$$ 9024 -23095 61845 139885 152538 75233 76026 157163 205043 126533 40376 -57972 -5933
21211e933l5760j84080J66457J87351j21703n6874r6654J3635N4046J50211o3297
$$ -5933 -41693 -225773 -59316 128035 6332 -50542 -147196 -133561 -79515 70696 7399
21200G399l126p6205n6559J28911J50801j60494j30686L9896J43617m2991j48661
$$ 7399 4273 -71932 -128491 420 151221 -9273 -139959 -100063 43554 563 -148098
21189a48098k58394J06504J39288m6137M9216j9373K37209J45032l5347k7426
$$ -148098 -406492 -299988 -160700 -206837 -157621 -176994 60215 205247 169900 142474
21179A42474o6048J5739J2188K6854P0226J5554k49152p358J38334M1187R4781
$$ 142474 76426 92165 104353 131207 201433 216987 -32165 -39523 98811 139998 234779
21168B34779p3216q6314J2638p6396j41251M5176K1552j19354K5518j8284J85161
$$ 234779 161563 75249 87887 11491 -129760 -84584 -63032 -182386 -156868 -175152 10009
21157A0009M2035o6836Q0449p0346n7274N0489Q5184j08870n0444j3102K9406
$$ 10009 52044 -14792 65657 -4689 -61963 -11474 73710 -35160 -85604 -98706 -69300
21146f9300J23212m5234j67454m8772q934N8239R996P3263L3011J4660K39326
$$ -69300 53912 8678 -158776 -207548 -216482 -158243 -148247 -74984 -41973 -27313 212013
21135B12013j08597r7116j08614l4440k8099j7175r0437P2335K34385K4437l2836
$$ 212013 103416 6300 -102314 -136754 -164853 -182028 -272465 -200130 34255 58692 25856
21124B5856j62224l52863N7808K03909m451J08998Q1748r721j42720m6102P0276
$$ 25856 -136368 -489231 -431423 -227514 -231965 -122967 -41219 -50940 -193660 -239762 -169486
21113a69486K08164O1444k17492N5479J19297L1594J568O0865j71294m9338o5013
$$ -169486 38678 100122 -117370 -61891 57406 89000 90568 151433 -19861 -69199 -134212
21102a34212J34404J59743j63400p6035N1083O7785J3881n4724L3271j18223o0455
$$ -134212 192 159935 -3465 -79500 -28417 39368 53249 -1475 31796 -86427 -146882
21091a46882p6107Q288l0366K16461J42461q3774k47200k5373O903J6130K6362
$$ -146882 -222989 -214701 -245067 -28606 113855 30081 -217119 -242492 -235589 -219459 -193097
21080a93097K90130J86270j44513n5277j10736L0380P1686m7103j92816J50656
$$ -193097 97033 283303 138790 83513 -27223 3157 74843 27740 -165076 -14420
21070a4420j0242j72224k8752L0343n0546P9780Q1831R2239M0192j3314R2347
$$ -14420 -24662 -196886 -225638 -195295 -245841 -166061 -84230 8009 48201 34887 127234
21059A27234j20080O7459j40128j26558j9984m562J193J21732j9475O3309K3517
$$ 127234 7154 74613 -65515 -192073 -212057 -216619 -215426 -93694 -113169 -49860 -26343
21048b6343P0832J0007j72610j69535m838l6342J74572J91614j566m767q916M2025
$$ -26343 44489 54496 -118114 -287649 -292487 -328829 -154257 37357 35791 31024 22108 64133
21036F4133J44933P2963j44660p1012n2377j9185l7275j37417l2003M2190n0177
$$ 64133 209066 282029 137369 66357 13980 -5205 -42480 -179897 -211900 -169710 -219887
21025b19887r230J8213J75063R2123J00780N2198j14107q5072m3907Q2535k40788
$$ -219887 -229117 -210904 -35841 56282 157062 209260 95153 10081 -33826 48709 -192079
21014a92079j05982J63246L4282J2961o6919j81303J48247K3704j14318o1784
$$ -192079 -298061 -134815 -100533 -87572 -154491 -335794 -187547 -163843 -278161 -339945
21004c39945J47034J28533j23897j01131K32587J9002k42468N6289J08818j4788
$$ -339945 -192911 -64378 -188275 -289406 -56819 -37817 -280285 -223996 -115178 -129966
20994a29966K30579P9499k01010k26701m6422J11476J84345J43232K31244n8597
$$ -129966 100613 180112 -20898 -247599 -294021 -182545 1800 145032 376276 317679
20984C17679j57693N677j00750Q6355n961o5378J3894k84177p8583Q718J27003
$$ 317679 159986 165663 64913 151268 145307 79929 93823 -190354 -268937 -260219 -133216
20973a33216J43649J67392K9089q7124n2115J44084j00052j28830p3064M8936
$$ -133216 10433 177825 206914 119790 67675 211759 111707 -17123 -90187 -41251
20963d1251J0448J24919p4334p6025k9275j18247j39710J40317Q8182M4630J56812
$$ -41251 -30803 94116 19782 -56243 -85518 -203765 -343475 -203158 -114976 -70346 86466
20952H6466J18772q919k3461r2018j78774Q4311Q943m6095q1195J45217J90784
$$ 86466 205238 196319 172858 80840 -97934 -13623 -4680 -50775 -131970 13247 204031
20941B04031j28473j38500J7760J18466n4121k27L7636N205R0251R0145k02914
$$ 204031 75558 -62942 -45182 73284 19163 18936 56572 61777 152028 242173 39259
20930C9259j35501R9138R71l6525J49001N7455j79278L8852k3870k04226r5898
$$ 39259 -96242 2896 3867 -32658 116343 173798 -5480 33372 9502 -194724 -290622
20919b90622K12173l2645o4880L7711J83554J07304J23373k2216j57572j35879
$$ -290622 -78449 -111094 -175974 -138263 45291 152595 275968 253752 96180 -39699
20909c9699J65643o8458j34134r2893J01900N9621J70201Q7658r3279j70155m3234
$$ -39699 125944 57486 -76648 -169541 -67641 -8020 162181 249839 156560 -13595 -56829
20898e6829j55153k0583J48564j4293K12519O3111P7636O2326l3613k29234m0522
$$ -56829 -211982 -232565 -84001 -98294 114225 177336 254972 317298 283685 54451 13929
20887A3929R9388j47522j55429K28173J72307m4103k21220l5124L6665M3866J29997
$$ 13929 113317 -34205 -189634 38539 210846 166743 -54477 -89601 -52936 -9070 120927
20876A20927K27265L1996L260l4568j28162p6277j85188j93743J7782J4223j61563
$$ 120927 348192 380188 383448 348880 220718 144441 -40747 -234490 -216708 -202485 -364048
20865c64048o3264L8865J20161J52511K14668p971l2637L1176l1327l5986j50543
$$ -364048 -427312 -388447 -268286 -115775 98893 90922 58285 89461 58134 22148 -128395
20854a28395n0583k1003L1670K16677J66384j41779k6452P2091l9000p0252J18122
$$ -128395 -178978 -199981 -168311 48366 214750 72971 46519 118610 79610 9358 127480
20843A27480J9579j45478J7549L3469j5893j00744k3866N7928K9056L4868K2225
$$ 127480 147059 1581 19130 52599 36706 -64038 -87904 -29976 -920 33948 56173
20832E6173j07241J3643j0562m7471M0786k9593N1819L6615P7858m7687n7291
$$ 56173 -51068 -37425 -47987 -95458 -54672 -84265 -32446 4169 82027 34340 -22951
20821b2951L2050O314o36k21004l1505J6044J38084K09299M9090j51831j26196
$$ -22951 9099 15413 14777 -206227 -237732 -221688 -83604 125695 174785 22954 -103242
20810a03242N0846o2046l5654K0252J00681K43251j90750j16193N7170J10124
$$ -103242 -52396 -114442 -150096 -129844 -29163 214088 23338 -92855 -35685 74439
20800G4439j40168J67749R4432O161q9969j42600M0758o9102K2136r1290n8072
$$ 74439 -65729 102020 196452 202613 112644 -29956 10802 -58300 -36164 -127454 -185526
20789a85526N6744K9738j38289P6473L2082J5139K0505k6536J58612P0683k195
$$ -185526 -128782 -99044 -237333 -160860 -128778 -113639 -93134 -119670 38942 109625 107430
20778A07430M2375J6094m0865n0733J758J22027O3353j16270j02546P7576j28069
$$ 107430 149805 165899 125034 74301 76059 198086 261439 145169 42623 120199 -7870
20767g870q416P1616K11056j67030k31588o9700n4839j8204J34589K89520k84805
$$ -7870 -16286 55330 266386 99356 -132232 -201932 -256771 -274975 -140386 149134 -135671
20756a35671j94487K57499K6352j43412J04284J29507J73446K7286q5389n3072
$$ -135671 -330158 -72659 -46307 -189719 -85435 44072 217518 244804 159415 106343
20746A06343J9270k9437j19693j30157N2243L8731j71467l2229L14002R0276j1648
$$ 106343 125613 96176 -23517 -153674 -101431 -62700 -234167 -266396 47606 137882 126234
20735A26234J2852p8021l4137l534L4931j47173J36414Q8579N6422j15513j72782
$$ 126234 139086 61065 26928 23394 58325 -88848 47566 136145 192567 77054 -95728
20724i5728k40205j28491J83471J76965M4877M751J16131J54392m0037k57707
$$ -95728 -335933 -464424 -280953 -103988 -59111 -54360 61771 216163 176126 -81581
20714h1581p7657J23905j56737J09868J35803k4950j56713n6134N6961j91972
$$ -81581 -159238 -35333 -192070 -82202 53601 28651 -128062 -184196 -127235 -319207
20704c19207k06946J48080J58130K5198J6402o0441Q1481J75309j05780j43354
$$ -319207 -526153 -378073 -219943 -194745 -178343 -238784 -157303 18006 -87774 -231128
20694b31128O5498J42878j18554J0121J93270o1341j97003j13052R5153J22948
$$ -231128 -165630 -22752 -141306 -131185 62085 744 -196259 -309311 -214158 -91210
20684i1210J95904J11827J65331J6966j12458l46486j07426J67576P7328J51338
$$ -91210 104694 216521 381852 398818 286360 -60126 -167552 24 77352 228690
20674B28690N8021k68222p1173k7475q529j12627j7171P6455k46979J1280K90351
$$ 228690 286711 18489 -52684 -80159 -88688 -201315 -218486 -142031 -389010 -377730 -87379
20663h7379J44756j37761j36436J26216l5710J19220R5616J92587M6785R5978
$$ -87379 57377 -80384 -216820 -90604 -126314 -7094 88522 281109 327894 423872
20653D23872k26079k26250l9420J51380j23783p663m1207l1019N0671J96405M93
$$ 423872 197793 -28457 -67877 83503 -40280 -47943 -89150 -120169 -69498 126907 127400
20642A27400j27494j06962j35417K0014K56779N8848n2038L3939N8793O6160n9871
$$ 127400 -94 -107056 -242473 -222459 34320 93168 41130 75069 133862 200022 140151
20631A40151J6715o0779Q515j25405n0594O40p0385k1233L8259Q176j75015n4719
$$ 140151 156866 96087 104602 -20803 -71397 -70757 -141142 -162375 -124116 -115940 -290955 -345674
20619c45674K75816l7734M6892m5037M56J35855m6513M8164M6995m0117K12352
$$ -345674 -69858 -107592 -60700 -105737 -105281 30574 -15939 32225 79220 39103 251455
20608B51455p2849O8977R1378J57879n0110k58245k14817j96537J34328O3611
$$ 251455 178606 247583 338961 496840 446730 188485 -26332 -222869 -88541 -24930
20598b4930m2802J78267N5017j6463j4755r8853k1824n1197N9765l0257j24146
$$ -24930 -67732 110535 165552 149089 134334 35481 13657 -37540 22225 -8032 -132178
20587a32178j9662K27157J87972j3633j04965o6385j57006j2055O051M8441k92
$$ -132178 -151840 75317 263289 249656 144691 78306 -78700 -90755 -84704 -36263 -36555
20576c6555K22990R9933M5877O469l1657p4575j97759k27854O4353K25079Q6795
$$ -36555 186435 286368 332245 338714 307057 232482 34723 -193131 -128778 96301 183096
20565A83096M8076Q6228R1054K217j45963P325P5430j75067j27030L2510R6297
$$ 183096 231172 317400 408454 410671 264708 272033 347463 172396 45366 77876 174173
20554A74173k8919j09983j80893j19126k3286n5589J39007J10170J11502L7612
$$ 174173 145254 35271 -145622 -264748 -288034 -343623 -204616 -94446 17056 54668
20544E4668j33887j89052K0138L9395J05503q3206J17534n8893r7401O0636k9720
$$ 54668 -79219 -268271 -248133 -208738 -103235 -186441 -68907 -127800 -225201 -164565 -194285
20533a94285j6088L01407J38158j3266j38572k19663j1874M4584O8529P4216J6426
$$ -194285 -210373 91034 229192 215926 77354 -142309 -154183 -109599 -41070 33146 49572
20522D9572K14474J26697q5646P0464m4829k11308l33406r8597P0037l6036O5046
$$ 49572 264046 390743 305097 375561 330732 119424 -213982 -312579 -242542 -278578 -213532
20511b13532J04278J26872M3550J4355n0203j41361r4101M405K0933j3213r7040
$$ -213532 -109254 17618 61168 75523 25320 -116041 -210142 -205737 -184804 -198017 -295057
20500b95057j05989J99943J27382r4765j92370r826k8783l6757K0937l3431Q8119
$$ -295057 -401046 -201103 -73721 -168486 -360856 -370682 -399465 -436222 -415285 -448716 -360597
20489c60597K18372J40802P0046J1019k1331r8897o5424K9964J05814M6514j41908
$$ -360597 -142225 -1423 68623 79642 58311 -40586 -106010 -76046 29768 76282 -65626
20478f5626p5040p748K46680l4359j48192o6511J00054O7989Q9557l9873k9705
$$ -65626 -140666 -148414 98266 63907 -84285 -150796 -50742 17247 106804 66931 37226
20467C7226p0443J23530J13404l6897J11179m1027k03294j49583N0900n3656l3010
$$ 37226 -33217 90313 203717 166820 277999 236972 33678 -115905 -65005 -118661 -151671
20456a51671j5346q9659j03878j1249K05952Q1983P8959r6901m632M0906r2877
$$ -151671 -167017 -256676 -360554 -371803 -165851 -83868 -4909 -101810 -106442 -65536 -158413
20445a58413m349J09870M9456j35302q0059Q211j8895L631L11583R1720L5818
$$ -158413 -162762 -52892 -3436 -138738 -218797 -210586 -229481 -225850 85733 177453 213271
20434B13271n0826Q6963K7239P776j06919r4847j93848j10472P2460o5583M570
$$ 213271 162445 249408 276647 284423 177504 82657 -111191 -221663 -149203 -214786 -210216
20423b10216j9120J16934J26949r7870R701n4500Q1089J10914j42972j2608l5352
$$ -210216 -229336 -112402 14547 -83323 -73622 -128122 -47033 63881 -79091 -91699 -127051
20412a27051J188N5501q697K8895M2580k1446m927K10420j08299l8664P914l4841
$$ -127051 -125863 -70362 -79059 -50164 -7584 -29030 -33957 176463 68164 29500 37414 2573
20400B573L7481J76854M5162j48987j04929j63412j37331P360p174P0745K38880
$$ 2573 40054 216908 262070 113083 8154 -155258 -292589 -285229 -292403 -221658 17222
20389A7222P6437j49162l4473R9187N5807J48604q40k28367m9049K08540P6848
$$ 17222 93659 -55503 -89976 9211 65018 213622 212782 -15585 -64634 143906 220754
20378B20754K3644k4488j96083K0890O6264k7568j64780j16715J5105R0249N3644
$$ 220754 244398 219910 23827 44717 110981 83413 -81367 -198082 -182977 -92728 -39084
20367c9084P0834J398j23798j73035p2750J2719Q5648J69929J27366J12583q8562
$$ -39084 31750 33148 -90650 -263685 -336435 -323716 -238068 -68139 59227 171810 83248
20356H3248j68928J51430K00207J60814n2291j95388n8886J18787q0719j06562
$$ 83248 -85680 65750 265957 426771 374480 179092 120206 238993 158274 51712
20346E1712k43845j05191n0642J47993J96240P7359j63778o3321J1307J34962
$$ 51712 -192133 -297324 -347966 -199973 -3733 73626 -90152 -153473 -142166 -7204
20336g204M5102P2049J42889L5902L7671k3153m8359M6008j71956p6274l9178
$$ -7204 37898 109947 252836 288738 326409 303256 254897 300905 128949 52675 13497
20325A3497J50404n4784j89613M2156M4712k14523j59434j00529K86413J99169
$$ 13497 163901 109117 -80496 -38340 6372 -208151 -367585 -468114 -181701 17468
20315A7468l1805j38015J04007j5078k7807O2285N0249l8203M1976J30247k3705
$$ 17468 -14337 -152352 -48345 -63423 -91230 -28945 21304 -16899 25077 155324 131619
20304A31619j66096j88602J83109l3279Q6907J2568O6053j04543p5210J78706
$$ 131619 -34477 -223079 -39970 -73249 13658 26226 92279 -12264 -87474 91232
20294I1232J11091J6770j59129j36631j34305q252Q0246J16599J57068k08265
$$ 91232 202323 219093 59964 -76667 -210972 -219224 -138978 -22379 134689 -73576
20284g3576k25102K5330J21178j04293J5718Q5514R0551L0758R211J72588q800
$$ -73576 -298678 -273348 -152170 -256463 -240745 -155231 -64680 -33922 -24711 147877 139077
20273A39077P1083J32594m589n7389k3129L5144j41226l2419j0575j15201j2641
$$ 139077 210160 342754 338165 280776 257647 292791 151565 119146 108571 -6630 -19271
20262a9271J7931M8387k15804o011o3169J17266J12016J27565r9958p3280J42498
$$ -19271 -1340 47047 -168757 -174768 -237937 -120671 -8655 118910 18952 -54328 88170
20251H8170J29495j84987k63832L3601m0458j65829J18567Q2079n197J93932P9943
$$ 88170 217665 32678 -231154 -197553 -238011 -403840 -285273 -203194 -208391 -14459 65484
20240F5484J4242J25833k5261p4354j09169j05844q0596k83662j28198J06616
$$ 65484 79726 205559 180298 105944 -3225 -109069 -189665 -473327 -601525 -494909
20230d94909K45141K70348R2045K09233k11422k33133m7240j54538l0225J71649
$$ -494909 -249768 20580 112625 321858 110436 -122697 -169937 -324475 -354700 -183051
20220a83051m9320J79426J25969j09885p0726P0200o3884L12192M8477j99193
$$ -183051 -232371 -52945 73024 -36861 -107587 -37387 -101271 210921 259398 60205
20210F0205j06674M9511J1100n5767R5353R7225j60069j86217J05070J54884p4154
$$ 60205 -46469 3042 14142 -41625 53728 150953 -9116 -195333 -90263 64621 -9533
20199i533r6898J0068J00591N7705j55575n2148J47372P0827j51607l4678J8977
$$ -9533 -106431 -96363 4228 61933 -93642 -145790 1582 72409 -79198 -113876 -94899
20188i4899O0359J91485M792k10669o0979N7051L182K58796M2342j61495m5132
$$ -94899 -34540 156945 161737 -48932 -109911 -52860 -49678 209118 251460 89965 44833
20177D4833j14060J18362J52104k01490j79478L7906J98053N2882Q9922j10725
$$ 44833 -69227 49135 201239 -251 -179729 -141823 56230 109112 199034 88309
20167H8309k41385r4659J61065o8584Q0788j5154j7080L8996j58498k1114P1027
$$ 88309 -153076 -247735 -86670 -155254 -74466 -89620 -106700 -67704 -226202 -247316 -176289
20156a76289J94049K7693K3955P0624n3264l7778j92133k79767j96587J86222
$$ -176289 17760 45453 69408 140032 86768 48990 -143143 -422910 -619497 -433275
20146d33275J51889K54961k365j3734r4645l0674m9594j38935Q9957M4004l5205
$$ -433275 -281386 -26425 -28790 -42524 -137169 -167843 -217437 -356372 -266415 -222411 -257616
20135b57616J08457O558N770M7827M6009R7814J16727r0016j89302r0166m321
$$ -257616 -149159 -142601 -136831 -89004 -42995 54819 171546 81530 -107772 -197938 -202259
20124b02259J59966Q0023r2245n9451n1548N8483J95166j73551j54755j72680
$$ -202259 -42293 37730 -54515 -113966 -165514 -107031 88135 -85416 -240171 -412851
20114d12851L746P1928M3449M8562J91883K7353O3080q5505N8192R0861k03466
$$ -412851 -409105 -337177 -293728 -245166 -53283 -25930 37150 -48355 9837 100698 -102768
20103a02768n9823J87882R9750k3742r8489j12074p4414j83055N1621J70515L2431
$$ -102768 -162591 25291 125041 101299 2810 -109264 -183678 -366733 -315112 -144597 -112166
20092a12166j1447O4249k4766r915l3834N2277K97359R5022j66888j32852j07525
$$ -112166 -123613 -59364 -84130 -94045 -127879 -75602 221757 316779 149891 17039 -90486
20081i0486l7311j51081l8707J10034q1170J88675Q0114P9437j09266p9716J81824
$$ -90486 -127797 -278878 -317585 -207551 -288721 -100046 -19932 59505 -49761 -129477 52347
20070E2347J60224j23219J22762J61838m11161j90282J61290N2731p329j9224
$$ 52347 212571 89352 212114 373952 -37209 -227491 -66201 -13470 -20799 -40023
20060d0023j06790k9948o8086Q8798l9747K28716J44465J26788n5124j87628j50363
$$ -40023 -146813 -176761 -244847 -156049 -195796 32920 177385 304173 249049 61421 -88942
20049h8942K0546m8866o330n744m9592n0224q6198n7430j6903K06916P4633O8975
$$ -88942 -68396 -117262 -123592 -129336 -178928 -229152 -315350 -372780 -389683 -182767 -108134 -39159
20037c9159L0195k438j07180R1662J99426q9728J4119Q906j71223o1008n2463
$$ -39159 -8964 -11402 -118582 -26920 172506 82778 96897 105803 -65420 -126428 -178891
20026a78891O3971j04285l7813K8500J65738L3887J31837J82453N1243M1428j29825
$$ -178891 -114920 -219205 -257018 -228518 -62780 -28893 102944 285397 336640 378068 248243
20015B48243k14404m0674q7257p1906O6353J57182J37159j70803r5523J46273
$$ 248243 33839 -6835 -94092 -165998 -99645 57537 194696 23893 -71630 74643
20005G4643J30756j59872k40643J3766J2309j8191L8742J31065J84373N672j13013
$$ 74643 205399 45527 -195116 -181350 -169041 -187232 -148490 -17425 166948 172620 59607
19994E9607k9072n1240m3560K9121O8330l1254P4222J521J26531k40849j41672
$$ 59607 30535 -20705 -64265 -35144 33186 1932 76154 77675 204206 -36643 -178315
19983a78315N677J4304P106J19753J13054l0169m7214l4491R7879j96977j09220
$$ -178315 -172638 -158334 -151228 -31475 81579 51410 4196 -30295 67584 -129393 -238613
19972b38613m6918k7385R7421P1729j7304j02875O8394P6678k1475K7408J60647
$$ -238613 -285531 -312916 -215495 -143766 -161070 -263945 -195551 -118873 -140348 -112940 47707
19961D7707J56126Q2516r651j3584j19232q7003j28582K8408q661J19437l9424
$$ 47707 203833 286349 276698 263114 143882 56879 -71703 -43295 -51956 67481 28057
19950B8057m1966L5385M6599L1232J08133K2369o8308o4832k7130J49759M1598
$$ 28057 -13909 21476 68075 99307 207440 229809 161501 96669 69539 219298 260896
19939B60896l770n6161K5081N4572o8519j16593q5674K60595K1574m9757o2399
$$ 260896 257126 200965 226046 280618 212099 95506 9832 270427 292001 242244 179845
19928A79845j54300j2378L1478M1689P5602J01376j08267K24O9576J56663j68461
$$ 179845 25545 13167 44645 86334 161936 263312 155045 155269 224845 381508 213047
19917B13047l23627j39175K18769P5862j04071L045q2681j4404K1602p0136J34115
$$ 213047 -110580 -249755 -30986 44876 -59195 -56150 -138831 -153235 -131633 -201769 -67654
19906f7654N9442o6556j33735r340N083N6458J39978J67372P1601j79032l3286
$$ -67654 -8212 -74768 -208503 -217843 -212760 -156302 -16324 151048 222649 43617 10331
19895A0331Q3460L8903k6909j12566J2688j9700p581L8344J13065k682j5739k14094
$$ 10331 93791 132694 105785 -6781 5907 -13793 -21374 16970 130035 127353 111614 -102480
19883a02480n6617J58410Q5188n7211j53982m4535J48524k7738J01758j26778
$$ -102480 -159097 -687 84501 27290 -126692 -171227 -22703 -50441 51317 -75461
19873g5461M4688j22581q3239M1299n4573n9752p5831m3994J13835J75214J51925
$$ -75461 -30773 -153354 -236593 -195294 -249867 -309619 -385450 -429444 -315609 -140395 11530
19862A1530J22369P3626K46581q04J969l35847j50024j3284J01216J2180O1823
$$ 11530 133899 207525 454106 453302 455271 119424 -30600 -43884 57332 69512 131335
19851A31335k14k4526j51861o7914K31023j0377j74552j07351Q4521P5238j15964
$$ 131335 131121 106595 -45266 -113180 117843 107466 -67086 -174437 -89916 -14678 -130642
19840a30642j8587o8516J87357N8146p7017N8502M6139n0854k7142l7077N926
$$ -130642 -149229 -217745 -30388 27758 -49259 9243 55382 4528 -22614 -59691 -53765
19829e3765J83481o768j37365p7474j83866L1686J00995J62337j3223j9711j84370
$$ -53765 129716 122948 -14417 -91891 -275757 -244071 -143076 19261 6038 -13673 -198043
19818a98043j64980J43120L18878L9728p5495o2940k0552L4124J34657K00416
$$ -198043 -363023 -219903 98975 138703 63208 268 -20284 13840 148497 348913
19808C48913p9148j75653k19420J36332J44546J40535J26075J20844j71979k04915
$$ 348913 269765 94112 -125308 11024 155570 296105 422180 543024 371045 166130
19798A66130p1303O8215J51961L8874K54278n3247j82244j51142n1023O425L193
$$ 166130 94827 163042 315003 353877 608155 554908 372664 221522 170499 176924 180117
19787A80117J42272J32358J39807j5493j98872k49607N25K08013J1663m8726j6958
$$ 180117 322389 454747 594554 579061 380189 130582 131107 339120 350783 302057 285099
19776B85099K6727p2177j17442k1559j7135p0742n7137J59406N2264p574J65241
$$ 285099 311826 239649 122207 100648 83513 12771 -44366 115040 167304 159730 324971
19765C24971o742j47572j53522j16869J23540L0432N0655N5903n562q1934o7015
$$ 324971 318229 170657 17135 -99734 23806 54238 104893 160796 155234 73300 6285
19754F285J57191J06535j11043k55649M7332j75889J41394J12394J08022O1781
$$ 6285 163476 270011 158968 -96681 -49349 -225238 -83844 28550 136572 198353
19744A98353o9545N5423l6500j2780K9287o5283q6990k25528k7267J3160O6917
$$ 198353 128808 184231 147731 134951 164238 98955 11965 -213563 -240830 -227670 -160753
19733a60753J25160j53114n9811k4530J01082Q8798J29226k66K1143R6928O3769
$$ -160753 -35593 -188707 -248518 -273048 -171966 -83168 46058 45792 66935 163863 227632
19722B27632J41981j50048J7760j85442j95420k86279j8738J98225R5222n3951
$$ 227632 369613 219565 237325 51883 -143537 -429816 -448554 -250329 -155107 -209058
19712b09058j34732J38598L8335O0701M8936J24699j05798j23864J16209L8657
$$ -209058 -343790 -205192 -166857 -106156 -57220 67479 -38319 -162183 -45974 -7317
19702g317j23059j38810J74491J96488j62778k88534R8410J53502O2588J57803
$$ -7317 -130376 -269186 -94695 101793 -60985 -349519 -251109 -97607 -35019 122784
19692A22784j0283j68943l35616j34242P9801K05097j7705J01733N5761m4367
$$ 122784 112501 -56442 -392058 -526300 -446499 -241402 -259107 -157374 -101613 -145980
19682a45980Q9681L3342J62361m1872R7060J89252p8719k11335K2728J01849o77
$$ -145980 -56299 -22957 139404 97532 194592 383844 305125 93790 116518 218367 217690
19671B17690o067m8019n7918j60139K7370j0007N0436J57186j05361J5276J32583
$$ 217690 211623 163604 105686 -54453 -27083 -37090 13346 170532 65171 80447 213030
19660B13030K5933L1169j68832j07505r2371K54739o9726r9029J26171k3732k8024
$$ 213030 238963 270132 101300 -6205 -98576 156163 86437 -12592 113579 89847 61823
19649F1823l4552j07436J5281M5748K4314l9996q4266n1442q7877P310K6573J56272
$$ 61823 27271 -80165 -64884 -19136 5178 -34818 -119084 -170526 -258403 -251093 -224520 -68248
19637f8248J13452L5359M4J26236L7087j15853q275k7783j25154k87912j5372
$$ -68248 45204 80563 80607 206843 243930 128077 119802 92019 -33135 -321047 -336419
19626c36419J00832j48453j6428J28312L97112J84983K7426j5123j66678j1858
$$ -336419 -235587 -384040 -400468 -272156 124956 309939 337365 322242 155564 143706
19616A43706R330M2039j10457j48838j01529P3548N2187p794j44654R1798J33505
$$ 143706 153036 195075 84618 -64220 -165749 -92201 -40014 -47808 -192462 -100664 32841
19605C2841q0245J99232n6452R1700J06662j85686k83551J39240J6172j89553
$$ 32841 -47404 151828 95376 187076 293738 108052 -175499 -36259 -20087 -209640
19595b09640K03383K98990m1358r3522J34076l4126n7720j52267r5325R5959K36091
$$ -209640 -6257 292733 251375 157853 291929 257803 200083 47816 -47509 48450 284541
19584B84541k2169j06440k53246p9575p6423M4386J39106N1306j24167L6385m4948
$$ 284541 262372 155932 -97314 -176889 -253312 -208926 -69820 -18514 -142681 -106296 -151244
19573a51244j2202J19080J37508M8900j46567J35221L9408q0588J58537q0567
$$ -151244 -163446 -44366 93142 142042 -4525 130696 170104 89516 248053 167486
19563A67486l0790J81570j17474q1984k9955j66098k5391K2378K5331J13558J92005
$$ 167486 136696 318266 200792 118808 88853 -77245 -102636 -80258 -54927 58631 250636
19552B50636R5359j63490o4716Q7004k5924L9187n5569j84457K0287o7852m2352
$$ 250636 345995 182505 117789 204793 178869 218056 162487 -21970 -1683 -69535 -111887
19541a11887K08261K4943o634k9145l7440j49316R4056J30605L7401j80987N6259
$$ -111887 96374 121317 114683 85538 48098 -101218 -7162 123443 160844 -20143 36116
19530C6116N2355p4414M8709K41696J51613J5260j34544k0644K3530J81935o4913
$$ 36116 88471 14057 62766 304462 456075 471335 336791 316147 339677 521612 456699
19519D56699J3881J4166k24119N972R7053M1333m2300o8748q2144j46816j16398
$$ 456699 470580 484746 260627 266599 363652 404985 362685 293937 211793 64977 -51421
19508e1421k34883m6043L56030J19521m3993J84166R402k83904p4828J05738P1134
$$ -51421 -286304 -332347 23683 143204 99211 283377 292779 8875 -65953 39785 110919
19497A10919r922j99455k31925K53259L52030L1502k49183k67772n3064o2402
$$ 110919 100997 -98458 -330383 -77124 274906 306408 57225 -210547 -263611 -326013
19487c26013O4709p684k661J02009J55812O9650J39727J697J0131m0704r1983
$$ -326013 -261304 -268988 -271649 -169640 -13828 55822 195549 197246 207377 166673 74690
19476G4690j50316J11906q9861k204K11105L7684N8045r3221p9018n9136r8449
$$ 74690 -75626 36280 -53581 -55785 155320 193004 251049 157828 78810 19674 -78775
19465g8775J8141K210J1091J8064p8012N4537J29999P5242r6371j83989l4241
$$ -78775 -60634 -58424 -47333 -29269 -107281 -52744 77255 152497 56126 -127863 -162104
19454a62104J55879J13255l3173j86971J73342J30693N272L4257k1117J74281
$$ -162104 -6225 107030 73857 -113114 60228 190921 196193 230450 209333 383614
19444C83614r5458j51307j91854m6063J21725k5903m7265K33927P3470J33740
$$ 383614 288156 136849 -55005 -101068 20657 -5246 -52511 181416 254886 388626
19434C88626Q8138j973k25239k7051o1295J97016O7652j10922k25001o678j22934
$$ 388626 476764 474791 249552 222501 161206 358222 425874 314952 89951 83273 -39661
19423c9661j006J35585J13820j66495k82299m999K21190R6021J27676J77720J26521
$$ -39661 -40667 94918 208738 42243 -240056 -245055 -23865 72156 199832 377552 504073
19412E04073k25790p0979q5899r8835K0583K30301l4593l7961l1659M0266O6760
$$ 504073 278283 207304 121405 22570 43153 273454 238861 200900 169241 209507 276267
19401B76267l0152j81459j59305P3863K4441j7415j4074J78983J61153J55755
$$ 276267 246115 64656 -94649 -20786 3655 -13760 -27834 151149 312302 468057
19391D68057N2150j95829j8607p855n5156J47101L5127j20602o95k09781j11404
$$ 468057 520207 324378 305771 297916 242760 389861 424988 304386 303691 93910 -17494
19380a7494l5085j68011J0760N0375J82062R9452j27391q5072J81113N0513l6824
$$ -17494 -52579 -220590 -209830 -159455 22607 122059 -5332 -90404 90709 141222 104398
19369A04398M4833q8721j28798m7325m68J08829J23832M3255j16259m1900J08537
$$ 104398 149231 60510 -68288 -115613 -116081 -7252 116580 159835 43576 1676 110213
19358A10213J39667J36730j10127j46299j29321L6092N3504J67305j26978L3159
$$ 110213 249880 386610 276483 130184 863 36955 90459 257764 130786 163945
19348A63945l8812m3529o5741J22374r3430j45228J85254k5200j59955L7541Q4701
$$ 163945 125133 81604 15863 138237 44807 -100421 84833 59633 -100322 -62781 21920
19337B1920K2382O5497J11260p5733q9776j03148n7352l2451j9332J53227j5531
$$ 21920 44302 109799 221059 145326 55550 -47598 -104950 -137401 -156733 -3506 -19037
19326a9037L593n1225q3723J57281R7348l0699q7362k8505N0348l7517M0961M3964
$$ -19037 -15444 -66669 -150392 6889 104237 73538 -13824 -42329 8019 -29498 11463 55427
19314E5427K0529J62475P3689j39833o1784J15195N494m9850j7752j17135R0510
$$ 55427 75956 238431 312120 172287 110503 225698 231192 181342 163590 46455 136965
19303A36965r4350O888r081K2956O205J14955l9847P928J01233n5853j12877Q1742
$$ 136965 42615 49503 40422 63378 69583 184538 144691 152619 253852 197999 85122 166864
19291A66864k26188o5025J87600J54750J42689p4661j10964j3605k3657M6299
$$ 166864 -59324 -124349 63251 218001 360690 286029 175065 161460 137803 184102
19281A84102j2428l78278k0546M01052j6484M9935P8350J3805k13160j78376J35737
$$ 184102 171674 -206604 -227150 173902 157418 207353 285703 299508 86348 -92028 43709
19270D3709K38235L817M4074k93828K2420J36688P1647j5744N1138J47519K2046
$$ 43709 281944 285761 329835 36007 58427 195115 266762 251018 302156 449675 471721
19259D71721O220k20708n3248J46129r2436m1848j68744j22272K29630L29336
$$ 471721 477941 257233 203985 350114 257678 215830 47086 -75186 154444 483780
19249D83780J66831J15781p3414j40476k21630l6232P0641p9419l3141n6894J09210
$$ 483780 650611 766392 692978 552502 330872 294640 365281 285862 252721 195827 305037
19238C05037o9855L8573P8783J22481j2755J49271Q0566j35142p5203l7817L6090
$$ 305037 235182 273755 352538 475019 462264 611535 692101 556959 481756 443939 480029
19227D80029J13570k9253J84375J75674M6392o0214j76037j02443K8201r4005
$$ 480029 593599 564346 748721 924395 970787 910573 734536 632093 660294 566289
19217E66289n8219J05822R9984J13315K6622L7612k67770k24155J35720n925k1593
$$ 566289 508070 613892 713876 827191 853813 891425 623655 399500 535220 529295 507702
19206E07702o453n4858q99j3166p442Q8052J74566Q0397J30530j73037p8296j26617
$$ 507702 501249 446391 445492 432326 424884 512936 687502 767899 898429 725392 647096 520479
19194E20479l8736o3945L03470O9461j3652j31305j0471J80537M8481N5198N1156
$$ 520479 481743 417798 721268 790729 777077 645772 635301 815838 864319 919517 970673
19183I70673K7476j20416j64794N8859N2546J10046J148k9516n9026P5222j06547
$$ 970673 998149 877733 712939 771798 824344 934390 935538 906022 846996 922218 815671
19172H15671j85673j95635q8292k3829o0435p9126O6247N1853J47887O4797p7326
$$ 815671 629998 434363 346071 322242 261807 182681 248928 300781 448668 513465 436139
19161D36139l3694j32203r9193J65460k012j07651J15788l2488k24455J56254
$$ 436139 402445 270242 171049 336509 334497 226846 342634 310146 85691 241945
19151B41945J77202j9176o6684O6514j26272l27229M3064L7796N4652p6659j01596
$$ 241945 419147 399971 333287 399801 273529 -53700 -10636 27160 81812 5153 -96443
19140i6443O2257J33248o3638o6501L5659J84762J52509n8143j39106N5070l7882
$$ -96443 -34186 99062 35424 -31077 4582 189344 341853 283710 144604 199674 161792
19129A61792j47292J51318K3890j32845j03534L7042J77450K7354j01660n8911
$$ 161792 14500 165818 189708 56863 -46671 -9629 167821 195175 93515 34604
19119C4604N0504O800L5339J6089J34368L8691n4831K692o5227k54202K71902
$$ 34604 85108 91908 127247 143336 277704 316395 261564 264256 199029 -55173 216729
19108B16729K72451k12454j76274j78934k4094K2724K26747K30543j4789l20947
$$ 216729 489180 276726 100452 -78482 -102576 -79852 146895 377438 362649 41702
19098D1702j78436K30247l7341o9620K6827K05826j37501k24552J02986P1826
$$ 41702 -136734 93513 56172 -13448 13379 219205 81704 -142848 -39862 31964
19088C1964J01948n775P1891J31677J13357q503R1746m2672k44156k6805R7527
$$ 31964 133912 128137 200028 331705 445062 436559 528305 485633 241477 214672 312199
19077C12199J5404J01121r2290J1367K6542M706j21816k58045m9537N3698K11948
$$ 312199 327603 428724 336434 347801 374343 379049 257233 -812 -50349 3349 215297
19066B15297l3170l6049K83647l769J5613m7977J27540q1195j64279J2329O711
$$ 215297 182127 146078 429725 425956 441569 393592 521132 439937 275658 287987 294698
19055B94698j36852J1258j08326P956K27143J19674q0058J5406J11272k7733K25183
$$ 294698 157846 169104 60778 68734 295877 415551 335493 350899 462171 434438 659621
19044F59621o6043j14907j08750J01146J32044K3534m0698l5454m0665Q5470j1675
$$ 659621 593578 478671 369921 471067 603111 626645 585947 550493 509828 595298 583623
19033E83623k3168J97401K3923l03336j38336K29869L7936J0510K2208l8937j8763
$$ 583623 560455 757856 781779 478443 340107 569976 607912 618422 640630 601693 582930
19022E82930J60882J16922j64119j07420o5489O7833J74855n2606J59949J22763
$$ 582930 743812 860734 696615 589195 523706 591539 766394 713788 873737 996500
19012I96500o0841o8772k5384q55m7418j1472N763k6184J08123K36291m3516m9935
$$ 996500 935659 866887 841503 840648 793230 781758 787521 761337 869460 1105751 1062235 1012300
19000A012300j64249k36639J15541K1803k51125j02048K33665J85603j50563o8926
$$ 1012300 848051 611412 726953 748756 497631 395583 629248 814851 664288 595362
18990E95362K5164J01011P0155J84377K06883J83186k23556q4468M3965m9136
$$ 595362 620526 721537 791692 976069 1182952 1366138 1142582 1058114 1102079 1052943
18980A052943p1708j8084J74062M3406o2304j4917J06022m4975K11554j2035j55350
$$ 1052943 981235 963151 1137213 1180619 1118315 1103398 1209420 1164445 1375999 1363964 1208614
18969A208614r0365J00091N4392k3578j20453j60804m9174k1330J59769J67845
$$ 1208614 1118249 1218340 1272732 1249154 1128701 967897 918723 897393 1057162 1225007
18959A225007j14639j27132k3732L7665o918l0141l2085o2121j08356j30303k0323
$$ 1225007 1110368 983236 959504 997169 990251 960110 928025 865904 757548 627245 606922
18948F06922J75809R6264m26M614P9250J52897M403R0320j03943j02258p4842
$$ 606922 782731 878995 878569 883183 962433 1115330 1119733 1210053 1106110 1003852 929010
18937I29010j23778j35573r7531n3981M5179o0156J88942K59875n6564j60565
$$ 929010 805232 669659 572128 518147 563326 503170 692112 951987 895423 734858
18927G34858J81088J06380K00757k01265p1778P7587K09881J107j43293k00537
$$ 734858 915946 1022326 1223083 1021818 950040 1027627 1237508 1238615 1095322 894785
18917H94785j74333j02054p915M0839n9217J7378K7907K02021J90817j64072j46844
$$ 894785 720452 618398 610483 651322 592105 609483 637390 839411 1030228 866156 719312
18906G19312N0555j74341m4243p0863j32530k5232N8380J39542M5232j7447j18877
$$ 719312 769867 595526 551283 480420 347890 322658 381038 520580 565812 548365 429488
18895D29488j53186l6259J22351M9540K7458K62834q892j98114R8800J26813k8579
$$ 429488 276302 240043 362394 411934 439392 702226 693334 495220 594020 720833 692254
18884F92254O9510J85243j28836k47631m6948l9790J41159L32733l6038J7786
$$ 692254 761764 947007 818171 570540 523592 483802 624961 957694 921656 939442
18874I39442j14266j10526J11841J9609j84685k3620J19618j02186l8796m3328
$$ 939442 825176 714650 826491 846100 661415 637795 757413 655227 616431 573103
18864E73103K89837N7507j40445k41862k9494P8184K47351L05212o6027n1641
$$ 573103 862940 920447 780002 538140 508646 586830 834181 1139393 1073366 1021725
18854A021725m9551L5723q3389k17884j6252K9591j34388J45064J6773j27497
$$ 1021725 972174 1007897 924508 706624 690372 719963 585575 730639 747412 619915
18844F19915p6952Q4891J60516K3057N2494r7547p998j40363Q3820K22173m5197
$$ 619915 542963 627854 788370 811427 863921 766374 758376 618013 701833 924006 878809
18833H78809k21816j91798j3739M0485Q8513M2299K7457J33922J41335K9525J03638
$$ 878809 656993 465195 451456 491941 580454 622753 650210 784132 925467 954992 1058630
18822A058630k51652k40349j22144J03300P9201j19061O8847K30071Q736n0795
$$ 1058630 806978 566629 444485 547785 626986 507925 576772 806843 815579 764784
18812G64784K11069J5343J00468m5975q7927J69416P029j32970L2193m1824k0231
$$ 764784 975853 991196 1091664 1045689 957762 1127178 1134207 1001237 1033430 991606 971375
18801I71375P5935P2769J950n72M8773J81030R0463J59853J80642J23171O5462
$$ 971375 1047310 1120079 1122029 1121457 1170230 1351260 1441723 1601576 1782218 1905389 1970851
18790A970851L0309P0560K1552J08358K09719k28875L9943L49319K43591K8936
$$ 1970851 2001160 2071720 2093272 2201630 2411349 2182474 2222417 2571736 2815327 2844263
18780B844263j92815n5788o2457j13725j49237J4714q3813J90481J51967J04323
$$ 2844263 2651448 2595660 2533203 2419478 2270241 2284955 2201142 2391623 2543590 2647913
18770B647913L61408N56968N62515N44066K13820J07610j09911m756j6507J62741
$$ 2647913 3009321 3566289 4128804 4672870 4886690 4994300 4884389 4879633 4863126 5025867
18760E025867J51326J85318Q7305K3622q9660O8431K48532M30295O86853P96541
$$ 5025867 5177193 5362511 5449816 5473438 5383778 5452209 5700741 6131036 6817889 7614430
18750G614430R76444J369414J124279P24345M30860J79629r4690k64583p5130
$$ 7614430 8590874 9960288 11084567 11808912 12239772 12419401 12324711 12060128 11984998
18741A1984998L04699O83900J052283J470339J840787K184414K724343L890770
$$ 11984998 12289697 12973597 14025880 15496219 17337006 19521420 22245763 26136533
18733B6136533N799344Q679792J2952182J7320508J9684456J6371707O721866
$$ 26136533 31935877 40615669 53567851 70888359 90572815 106944522 113666388
18726A13666388j973807p598437j1641855j1901568q675876l266522K948793J0265031
$$ 113666388 111692581 104094144 92452289 80550721 71874845 68608323 71557116 81822147
18718H1822147J7187162K0420613K0185279J5240868L409315p913270j4520325
$$ 81822147 99009309 119429922 139615201 154856069 158265384 150352114 135831789
18711A35831789j8560258j9366315j5998285j0990632o247239l189163j685553
$$ 135831789 117271531 97905216 81906931 70916299 64669060 61479897 59794344
18704E9794344r95787M8946K166774M768666P904192J0120450J1225815J1962798
$$ 59794344 58798557 58847503 61014277 65782943 73687135 83807585 95033400 106996198
18696A06996198R300240L161571k406318m163902l961720j258125K967943N946017
$$ 106996198 116296438 119458009 117051691 112887789 108926069 107667944 110635887 116581904
18688A16581904P584056R567822Q415004L866981l94615l180912m738448n739763
$$ 116581904 124165960 133733782 142148786 146015767 145621152 142440240 137701792 131962029
18680A31962029p359159q998128q864492p846624n443621j215469L947838P915829
$$ 131962029 124602870 115604742 106740250 98893626 93450005 92234536 96182374 104098203
18672A04098203R420366R685153J0065243J4175611K0355896K2994589J6630416
$$ 104098203 113518569 123203722 133268965 147444576 167800472 190795061 207425477
18665B07425477K707018j0112045j9862339k6530815k8547292k5148552k0200682
$$ 207425477 210132495 200020450 180158111 153627296 125080004 99931452 79730770
18658G9730770j5370424j0720359o474693l416949k530943l012299l074672k698436
$$ 79730770 64360346 53639987 47165294 43748345 41217402 38205103 35130431 32431995
18650C2431995k620509j947016j668558k030105k236418k363216k468905k482851
$$ 32431995 29811486 27864470 26195912 24165807 21929389 19566173 17097268 14614417
18642A4614417k074409j441274j128220j014158p82790o35093k54942P4320N25218
$$ 14614417 12540008 11098734 9970514 8956356 8173566 7538473 7283531 7357851 7883069
18633G883069R72866J133960J015172K30909l35907q31944j236941j271787q16203
$$ 7883069 8855935 9989895 11005067 11235976 10900069 10068125 8831184 7559397 6743194
18624F743194n86342l24416k34844j366J35919L8205l0151j5199j16302j63502
$$ 6743194 6156852 5832436 5597592 5596226 5732145 5770350 5740199 5725000 5608698 5445196
18614E445196J91300M36928K95267K17588q4886l06133o68260o99117o60519n98749
$$ 5445196 5636496 6073424 6368691 6586279 6501393 6195260 5527000 4827883 4167364 3568615
18604C568615m22631j63126k42617l80000k08076n1348J9211j15411q7424R7024
$$ 3568615 3145984 2982858 2740241 2360241 2152165 2100817 2120028 2004617 1917193 2014217
18594B014217j22644p2935J28437J61244k61278j97411J48328K13325k9587p2441
$$ 2014217 1891573 1818638 1947075 2108319 1847041 1649630 1797958 2011283 1981696 1909255
18584A909255J22733K60630R1034J6327J32446p8212J18793J38201R5853o0544
$$ 1909255 2031988 2292618 2383652 2399979 2532425 2454213 2573006 2711207 2807060 2746516
18574B746516J88580K23547J05561J91179N23308N38710P40317J087644R42855
$$ 2746516 2935096 3158643 3264204 3455383 3978691 4517401 5257718 6345362 7288217
18565G288217L44504l22548m34368n31236m79919o38108k00192R8139O75753R85075
$$ 7288217 7632721 7310173 6875805 6344569 5864650 5226542 5026350 5124489 5800242 6785317
18555F785317J283869J643596Q24342j24320l69527o23827j071856j021546q26241
$$ 6785317 8069186 9712782 10537124 10412804 10043277 9419450 8347594 7326048 6499807
18546F499807n64704m38059p1297M6507P0439p1986K1778K37820J63474K68581
$$ 6499807 5935103 5497044 5425747 5472254 5542693 5470707 5492485 5730305 5893779 6162360
18536F162360O03265N74788P57308R42920R86285J446248K344974L684574N522733
$$ 6162360 6765625 7340413 8097721 9040641 10026926 11473174 13818148 17502722 23025455
18527B3025455O789851N959555K816252M43180o88099j556331j265469O52197
$$ 23025455 29815306 35774861 38591113 39034293 38346194 36789863 35524394 36176591
18519C6176591L682203O283545P935853P905317O758620N505700L645696K394306
$$ 36176591 39858794 46142339 54078192 61983509 68742129 74247829 77893525 80287831
18511H0287831J152985j772836l774765l931489l977781k588436J045133N993370
$$ 80287831 81440816 79667980 75893215 71961726 67983945 65395509 66440642 72434012
18503G2434012J1921622K0376671L1793590M3008036M8051813M5403948M0247442
$$ 72434012 84355634 104732305 136525895 179533931 227585744 272989692 313237134
18496C13237134L0693123J2706556p267467k3272330l0396062k9364319k1487183
$$ 313237134 343930257 356636813 349369346 326097016 295700954 266336635 244849452
18489B44849452o389185J1552353K4916277K9091816K4580816J2030583k020497
$$ 244849452 238460267 250012620 274928897 304020713 328601529 340632112 338611615
18482C38611615j4691045k5374850l2874526l6365821l5688882l2843361k8500740
$$ 338611615 323920570 298545720 265671194 229305373 193616491 160773130 132272390
18475A32272390k2871988j7094014j1866032p248695k993686J246324N717106
$$ 132272390 109400402 92306388 80440356 73191661 70197975 71444299 77161405
18468G7161405J0453766J3538115J2492750R506257P537854N040270J365112m87232
$$ 77161405 87615171 101153286 113646036 123152293 130690147 135730417 137095529 136608297
18460A36608297M0373J037272K1807j424702l180458l571050n21258M601535R202168
$$ 136608297 136648670 137685942 137707749 136283047 133102589 129531539 129010281 133611816 142813984
18451A42813984R681709O291259P27924p858738j5070869j7312420j7189772j5707043
$$ 142813984 152495693 158786952 159514876 151656138 136585269 119272849 102083077 86376034
18443H6376034j3216577j1417419r891603q487267p156692n525598m272521k811835
$$ 86376034 73159457 61742038 51850435 43363168 36206476 30680878 26408357 23596522
18435B3596522j366877l32082J131412K594362L382603K939244J452496k79386
$$ 23596522 22229645 21897563 23028975 25623337 29005940 31945184 33397680 33118294
18427C3118294j128156j869001j381279L43160K318425L710442K853970M3204
$$ 33118294 31990138 30121137 28739858 29083018 31401443 35111885 37965855 38009059
18419C8009059j434047k486161m031146m719123m037192l424135k875925k292693
$$ 38009059 36575012 34088851 30057705 25338582 21301390 17877255 15001330 12708637
18411A2708637j594830j202738p36534k17822J00180Q89618J297446P98672J42838
$$ 12708637 11113807 9911069 9174535 8956713 9056893 9946511 11243957 12042629 12185467
18402A2185467k53575n41220p16984j16468N08319R16681Q02552Q01354J008543
$$ 12185467 11931892 11390672 10673688 10557220 11065539 11982220 12784772 13586126 14594669
18393A4594669P20447N90022k82543j118373j453439j863113j971938j573728
$$ 14594669 15315116 15905138 15622595 14504222 13050783 11187670 9215732 7642004
18385G642004j267360r64678o83342p11743o25184k30850l8088J32030N5970M1337
$$ 7642004 6374644 5409966 4726624 4014881 3389697 3158847 3120759 3252789 3308759 3350096
18375C350096P4403n5379m947k54521j63583P716O8666M4523N1367j27587l31628
$$ 3350096 3424499 3369120 3364173 3109652 2946069 2953785 3022451 3066974 3118341 2990754 2659126
18364B659126k02691k8784k29758l09704j79746q9704k589n6213J8424j47996
$$ 2659126 2456435 2427651 2197893 1888189 1708443 1618739 1616150 1559937 1578361 1430365
18354A430365n6323P8145m1531k75389k6149J72381J25521q1274o9947j70221
$$ 1430365 1374042 1452187 1410656 1135267 1109118 1281499 1407020 1325746 1255799 1085578
18344A085578P2706R274L5302K0269o7803K26547Q3456q342j34722k80932k66670
$$ 1085578 1158284 1167558 1202860 1223129 1155326 1381873 1465329 1456987 1322265 1041333 774663
18333G74663l7624O475J14468J80509n2194j28176p507j03357r6670m7932k5237
$$ 774663 737039 743514 857982 1038491 986297 858121 850614 747257 650587 602655 577418
18322E77418q2911j6789K7894P4993K61888L47430j04458j33663q0720j09286
$$ 577418 494507 477718 505612 580605 842493 1189923 1085465 951802 871082 761796
18312G61796j35049j63607k6782K55311j32745j77782j23049K2510K3382m9758
$$ 761796 626747 463140 436358 691669 558924 381142 258093 280603 303985 254227
18302B54227J57813q9035J56875k005j44927n7884N9056N2124j15566j00879O3158
$$ 254227 412040 323005 479880 477875 332948 275064 334120 386244 270678 169799 232957
18291B32957q7252j20281N9712P2269J90753J23313J21539r5521L1983J31777
$$ 232957 145705 25424 85136 157405 348158 471471 593010 497489 529472 661249
18281F61249l9966r1652o2933K7593O6697J03338N3969r2270q4642p1298R150
$$ 661249 621283 529631 466698 494291 560988 664326 718295 626025 541383 470085 479235
18270D79235o2370J94904J68205r6588q4911J15426J11011L3065j22107R1333
$$ 479235 416865 611769 779974 683386 598475 713901 824912 857977 735870 827203
18260H27203M8277n3683j49672J53908K36504J04999P1011Q4308R3257m679l1103
$$ 827203 875480 821797 672125 826033 1062537 1167536 1238547 1322855 1416112 1411433 1380330
18249A380330m536j04683M1719K41898L34599M46711M52988O42648O04450L04353
$$ 1380330 1375794 1271111 1312830 1554728 1889327 2336038 2789026 3431674 4036124 4340477
18239D340477o0778R5447O0606j74777j50657J55717R5807l3612K83895M91487
$$ 4340477 4279699 4375146 4435752 4260975 4110318 4266035 4361842 4328230 4612125 5103612
18229E103612M33629Q81968Q66019O72681J078410J794172K231936K574736L373174
$$ 5103612 5537241 6419209 7285228 7957909 9036319 10830491 13062427 15637163 19010337
18220A9010337N296196Q082418J2669634K0634547L3751650M9477855N4333430
$$ 19010337 24306533 32388951 45058585 65693132 99444782 148922637 203256067
18213B03256067L0276547l242172j7479301l1415864m0806816l5606684k6109353
$$ 203256067 233532614 230290442 212811141 181395277 140588461 104981777 78872424
18206G8872424j8876715j3454675r373236n981348l471152j872898m15350P72839
$$ 78872424 59995709 46541034 37167798 31186450 27715298 25842400 25427050 26199889
18198B6199889K252357M383643P988814J3382035K3118282L8817134N6225730
$$ 26199889 28452246 32835889 40824703 54206738 77325020 116142154 172367884
18191A72367884N9342574K9811384o021041k0752928l6663486m5895285l9215832
$$ 172367884 231710458 261521842 255500801 234747873 198084387 152189102 112973270
18184A12973270k8942372k0839239j5223339j1278545q288008o068526m201495
$$ 112973270 84030898 63191659 47968320 36689775 28401767 22333241 18131746
18177A8131746l271395k335190j810243j439234j121278q63546q05212m65871
$$ 18131746 14860351 12525161 10714918 9275684 8154406 7290860 6485648 6019777
18169F019777o08166m15365k14462l27408k49470L25334N07270M81855j8952k88293
$$ 6019777 5411611 4996246 4781784 4454376 4204906 4530240 5037510 5519365 5500413 5212120
18159E212120m13031p19071n65381m37297k14003j47586k22307l70226k93593
$$ 5212120 4799089 4080018 3514637 3077340 2863337 2715751 2493444 2123218 1829625
18150A829625K2600J56603j50021j62913j99236j7597k02966k7839J52351Q6113
$$ 1829625 1852225 2008828 1858807 1695894 1496658 1479061 1276095 1248256 1400607 1486720
18140A486720o3378J10399N5306r2541Q1095j05903k07064j41286r0185o0670
$$ 1486720 1423342 1533741 1589047 1496506 1577601 1471698 1264634 1123348 1033163 972493
18130I72493q5842j628N1340J2111r4966j9549K5795O1990n2386o1867Q893j15688
$$ 972493 886651 885023 936363 948474 853508 833959 859754 921744 869358 807491 816384 700696
18118G00696k99P3598j10153N4704m6872j43617J41643J99k07907j26730j02627
$$ 700696 700397 773995 663842 718546 671674 528057 669700 669899 461992 335262 232635
18107B32635m788P7763q3768L2574k2327J12371M9616J5500J84908o653m8326
$$ 232635 227847 305610 221842 254416 232089 344460 394076 409576 594484 587831 539505
18096E39505M7909k1524M0967j89538M060J52854L5328p6338j43424p6267J02623
$$ 539505 587414 565890 606857 417319 421379 574233 609561 533223 389799 313532 416155
18085D16155j8510J51593n2983r4065j00508l7665o6489L1966J9023K08551K017
$$ 416155 397645 549238 496255 402190 301682 264017 197528 229494 248517 457068 459085
18074D59085J0879j14765N7053J628j28838o6952J04630m7598l04775j30732J72752
$$ 459085 469964 355199 412252 413880 285042 218090 322720 275122 -29653 -160385 12367
18063A2367K84756J42202R8342r2584j76335k6778j18964L0612O0623J07443j23371
$$ 12367 297123 439325 537667 445083 268748 241970 123006 153618 214241 321684 198313
18052A98313J065L0739M5683q6312K6329l545j52964m4203K724m8544J09824J88026
$$ 198313 199378 230117 275800 189488 215817 212272 59308 15105 17829 -30715 79109 267135
18040B67135l4691J57088J09237N7796j08499P209M0730J01109J17812o7135m6664
$$ 267135 232444 389532 498769 556565 448066 455275 496005 597114 714926 647791 601127
18029F01127r0258P7982j77154N8840j04655P966j654j63303j38809n6000L15303
$$ 601127 510869 588851 411697 470537 365882 373848 372194 208891 70082 14082 329385
18018C29385K03668j10678k09400q62P2003R1766M9133P4205J09518j18721j30159
$$ 329385 533053 422375 212975 212113 284116 375882 425015 499220 608738 490017 359858
18007C59858p2452J33705K65521J78515q9875j56878j45925J36311L73186j68416
$$ 359858 287406 421111 686632 865147 775272 618394 472469 608780 981966 813550
17997H13550j28452Q1967L4947N6760J03035K9094k12756P514J55703J98078L8451
$$ 813550 685098 767065 802012 858772 961807 990901 778145 785659 941362 1139440 1177891
17986A177891J03822j95939Q9661K2963n3531J35457l17401k38570p7793m2412
$$ 1177891 1281713 1085774 1175435 1198398 1144867 1280324 962923 724353 646560 604148
17976F04148o6390K38448k6615l01553r772j01318q6937l0603r3318J85396K22166
$$ 604148 537758 776206 749591 448038 438266 336948 250011 219408 126090 311486 533652
17965E33652l9051j5281J96741J08838m1881M9581j66331j82177k1738M0483K1281
$$ 533652 494601 479320 676061 784899 743018 792599 626268 444091 422353 462836 484117
17954D84117M7793K52638j693J20340P216P8758K50618j0122M3094K56281R5992
$$ 484117 531910 784548 782855 903195 910411 989169 1239787 1229665 1272759 1529040 1625032
17943A625032J34009n0704k79232m43191k11672R0440j38441k5996P2710j3035
$$ 1625032 1759041 1708337 1429105 985914 774242 864682 726241 700245 772955 759920
17933G59920m00n2275O2497k3774N4247N0234j16545k07822q6517j33300K73931
$$ 759920 759520 707245 769742 745968 800215 850449 733904 526082 439565 306265 580196
17922E80196K03929J43953j51581j43458r051J96883j8424j40428o4441j46314
$$ 580196 784125 928078 776497 633039 623988 820871 802447 662019 597578 451264
17912D51264N1885M7257J12948Q5310j79566l7725m8559j20836P6115N4331N1523
$$ 451264 503149 550406 663354 748664 569098 531373 482814 361978 438093 492424 543947
17901E43947O8079j46452K3044j34532o6353K29129L63344J75418M7666k4138
$$ 543947 612026 465574 488618 354086 287733 516862 880206 1055624 1103290 1079152
17891A079152k70078r1485j62733K3572l2517r0950L5775J22624k2617k03698
$$ 1079152 809074 717589 554856 578428 545911 454961 490736 613360 590743 387045
17881C87045N6337n0306j50372o3192K83L3941n3667j0049J88216K13831J99423
$$ 387045 443382 393076 242704 179512 179795 213736 160069 150020 338236 552067 751490
17870G51490N4664J09650n8103o7511k25018n9632J20611J10545l9494L0119J74666
$$ 751490 806154 915804 857701 790190 565172 505540 626151 736696 697202 727321 901987
17859I01987L0546Q8528J78275n1123k50275L2811J44184K41927K21466K31447
$$ 901987 932533 1021061 1199336 1148213 897938 930749 1074933 1316860 1538326 1769773
17849A769773K43409M70806L45799L63052K68967K53740K89189K35836L16017
$$ 1769773 2013182 2483988 2829787 3192839 3461806 3715546 4004735 4240571 4556588
17840D556588J34507J10816m9180q6076O3675K46230L70151O39153N19476P76896
$$ 4556588 4691095 4801911 4752731 4666655 4730330 4976560 5346711 5985864 6505340 7282236
17830G282236J078662J509564J551960K062382K867560M083221O252042R382938
$$ 7282236 8360898 9870462 11422422 13484804 16352364 20435585 26687627 36070565
17822C6070565J4497512K3983282L8891204N5590160N8642598L0879669l785833
$$ 36070565 50568077 74551359 113442563 169032723 227675321 258554990 254769157
17815B54769157k0055262l5799857m4943656l9315606k8970089k0772906j4878350
$$ 254769157 234713895 198914038 153970382 114654776 85684687 64911781 50033431
17808E0033431j0298720o933685m254686k387134j459525j26251J476039L893015
$$ 50033431 39734711 32801026 28546340 26159206 24699681 24573430 26049469 29942484
17800B9942484P231274J2529681K1468418L5834111N0891828N1640145K3926997
$$ 29942484 37173758 49703439 71171857 107005968 157897796 209537941 233464938
17793B33464938o360904j9483584l3864037m0623898l4618762k5480327j8261645
$$ 233464938 227104034 207620450 173756413 133132515 98513753 73033426 54771781
17786E4771781j3059071r460295o921078m956409l661583k986288k169207j802313
$$ 54771781 41712710 32252415 25331337 20374928 16713345 13727057 11557850 9755537
17778I755537j514949j120335j024584o97678l55614q4614N2839j28928l94823
$$ 9755537 8240588 7120253 6095669 5397991 5042377 4957763 5010602 4881674 4486851
17769D486851l59848l44581l70573j96061j03390Q5837M6311J66759o3573k79296
$$ 4486851 4127003 3782422 3411849 3215788 3112398 3198235 3244546 3411305 3347732 3068436
17759C068436l92539m58221m07132j93732k07594m9491p811p414j81560j47937
$$ 3068436 2675897 2217676 1810544 1616812 1409218 1359727 1351916 1344502 1162942 1015005
17749A015005l7577P1868o3811j21749j4153o5292m8545j90437n0369m9451R2958
$$ 1015005 977428 1049296 985485 863736 849583 784291 735746 545309 494940 445489 538447
17738E38447N4871L9108J09548q7951j14867k36898R4460P7480j06689j5332Q7513
$$ 538447 593318 632426 741974 654023 539156 302258 396718 474198 367509 352177 439690
17727D39690k9883q699l8829Q5230N0385j41714j25223O0357O8796N615j45465
$$ 439690 409807 401108 362279 447509 497894 356180 230957 291314 360110 365725 220260
17716B20260J5085K32874J2919q0219j17482j75770J0834j40293O2265J29898
$$ 220260 235345 468219 481138 400919 283437 107667 118501 -21792 40473 170371
17706A70371J39j7284J05814m2779K304j00798j56615n96O8787J53723J7591M3449
$$ 170371 170510 153226 259040 216261 218565 117767 -38848 -39444 29343 183066 200657 244106
17694B44106J45188j19076j44107j3434Q9795j20186j71736L5549J71880M1351
$$ 244106 389294 270218 126111 112677 202472 82286 -89450 -53901 117979 159330
17684A59330J32900M4723j43747j38882j40301P1582K07919P0140R6573Q9768
$$ 159330 292230 336953 193206 54324 -85977 -14395 193524 263664 360237 450005
17674D50005r200M528j27570J6449J94181J10857l4262n3173l6847m5441o4141
$$ 450005 440805 445333 317763 334212 528393 639250 604988 551815 514968 469527 405386
17663D05386m78Q0465j04515n2388j30327J04835j86479j18534M3498k5927j97883
$$ 405386 404908 485373 380858 328470 198143 302978 116499 -2035 41463 15536 -182347
17652a82347j33322J80568L00291Q8669j09104J2327N6905j35030Q5787K1809
$$ -182347 -315669 -135101 165190 253859 144755 157082 213987 78957 164744 186553
17642A86553J60578O7536O3309J49441K02888K79123M7823J8771j17820j31463
$$ 186553 347131 414667 477976 627417 830305 1109428 1157251 1176022 1058202 926739
17632I26739j40891k46376j21732K4740j24829k05213j22103j23171K8631J41566
$$ 926739 785848 539472 417740 442480 317651 112438 -9665 -132836 -104205 37361
17622C7361m6730J6651O7991N6845j4879J68786K05256J67153J05155Q1284n9315
$$ 37361 -9369 7282 75273 132118 117239 286025 491281 658434 763589 844873 785558
17611G85558k0544r4406l4578j54234m29136j47826L2182j6529J844J31390L0201
$$ 785558 765014 670608 636030 481796 52660 -95166 -62984 -79513 -77669 53721 83922
17600H3922l3895j21900j96557o971j8196K01249J11735j34310q7696j02140J48608
$$ 83922 50027 -71873 -268430 -275401 -293597 -92348 19387 -114923 -202619 -304759 -156151
17589a56151J38888N9737q7683j74756k04910K01948K58180L2314n5558R7290
$$ -156151 -17263 42474 -45209 -219965 -424875 -222927 35253 67567 12009 109299
17579A09299R2165L1432j67501K7709q8510k34174j06501j07036K8519K15596
$$ 109299 201464 232896 65395 93104 4594 -229580 -336081 -443117 -414598 -199002
17569a99002J31732j30155J17309P5608k7536L3706K8622q8493K4324l715l7291
$$ -199002 -67270 -197425 -80116 -4508 -32044 1662 30284 -58209 -33885 -37600 -74891
17558g4891p4417j06736n5689K77090K0944j6281R2595r5600L013K01374J27223
$$ -74891 -149308 -256044 -311733 -34643 -13699 -29980 62615 -32985 -29972 171402 298625
17547B98625o7604K9835q0237j41010j46169l9656o8774P9755K9205p769J10122
$$ 298625 231021 260856 180619 39609 -106560 -146216 -214990 -135235 -106030 -113799 -3677
17536c677K27291J60777k13315p4672O8568k3478r2786k44736J34819J77473J1379
$$ -3677 223614 384391 171076 96404 164972 141494 48708 -196028 -61209 116264 127643
17525A27643j00963J00987J3974j30561j87205N6837J30971j46230k97145O4259
$$ 127643 26680 127667 141641 11080 -176125 -119288 11683 -134547 -431692 -367433
17515c67433J35161m3593J21753Q4439l8048J9487J56209m5653r1060R4240J34682
$$ -367433 -232272 -275865 -154112 -69673 -107721 -88234 67975 22322 -68738 25502 160184
17504A60184J5239k17792k70074M9850O9723K09615K3685k79346k922J4409R4521
$$ 160184 175423 -42369 -312443 -262593 -192870 16745 40430 -238916 -241838 -227429 -132908
17493a32908N2424N9163R950N9644Q7740j08189j42988m9597j91122M4949J46329
$$ -132908 -80484 -21321 -11371 48273 136013 27824 -115164 -164761 -355883 -310934 -164605
17482a64605n555P5371j18965R4647O2386K5156q054P4578r343j0938M1592l7349
$$ -164605 -170160 -94789 -213754 -119107 -56721 -31565 -39619 34959 25616 14678 56270 18921
17470A8921j27787j26507L698J0231J54057j12228j2051r5319N358k8221J62730
$$ 18921 -108866 -235373 -231675 -221444 -67387 -179615 -191666 -286985 -281627 -309848 -147118
17459a47118M9055P1291r972j39887j41334Q8150Q3728l4402K3192K4028L4455
$$ -147118 -98063 -26772 -36744 -176631 -317965 -229815 -146087 -180489 -157297 -133269 -98814
17448i8814k52674j5064K48521Q8338j1517K9639N3051J97391N5086k5939J1029
$$ -98814 -351488 -366552 -118031 -29693 -41210 -11571 41480 238871 293957 268018 279047
17437B79047m6186o340P3287O1632K029J0270m4685o3783r7816j33766q1631j02098
$$ 279047 232861 226521 299808 361440 363469 373739 329054 265271 167455 33689 -47942 -150040
17425a50040N1926q2181J95744J93556K0065j53238o4194n4062J02980J19172
$$ -150040 -98114 -180295 15449 209005 229070 75832 11638 -42424 60556 179728
17415A79728o8250J48851k28556q9919L2624r0698j04751K1195l3401J61900P9354
$$ 179728 111478 260329 31773 -58146 -25522 -116220 -220971 -199776 -233177 -71277 8077
17404H077k45163K06715K22499J49772p848l852j6318j29231j25610j16121k8994
$$ 8077 -237086 -30371 192128 341900 334052 330200 313882 184651 59041 -57080 -86074
17393h6074K90818m1916k03360p7105p9007O6108M0514o5341P18N9523r2190O217
$$ -86074 204744 162828 -40532 -117637 -196644 -130536 -90022 -155363 -154645 -95122 -187312 -181095
17381a81095m1223j11170m0508L91449L3576j23959J32897L9667j1685k38609
$$ -181095 -222318 -333488 -373996 17453 51029 -72930 59967 99634 87949 -150660
17371a50660j96339j25060J81646J78180K9051P5233r9713k4094o9135j31208
$$ -150660 -346999 -472059 -290413 -112233 -83182 -7949 -107662 -131756 -200891 -332099
17361c32099M6779J66057j6946J42608J50176j14661l6242p3281j73877n3270
$$ -332099 -285320 -119263 -136209 6399 156575 41914 5672 -67609 -241486 -294756
17351b94756K2210o2073r6661J16931M9081K25569q174o1385k1693j3105K1336
$$ -294756 -272546 -334619 -431280 -314349 -265268 -39699 -47873 -109258 -130951 -144056 -122720
17340a22720N8882J53915J25689j97431j11021P7547O1450K8879j47976R1863
$$ -122720 -63838 90077 215766 18335 -92686 -15139 46311 75190 -72786 19077
17330A9077j97222k33287Q5824J27481J08623J21726K54777J29266j08489j36905
$$ 19077 -178145 -411432 -325608 -198127 -89504 32222 286999 416265 307776 170871
17320A70871o2696n4172r1257j13230k34782j76431J63106R1477K24915R7433
$$ 170871 108175 54003 -37254 -150484 -385266 -561697 -398591 -307114 -82199 15234
17310A5234K62285j0697p534M7024r5933l08634k03427N7787K00297p2660J5178
$$ 15234 277519 266822 259288 306312 210379 -98255 -301682 -243895 -43598 -116258 -101080
17299a01080K88664K6481Q8762l5552j75639j11481l5008N4965J71832j06580
$$ -101080 187584 214065 302827 267275 91636 -19845 -54853 112 171944 65364
17289F5364M0369l084J0553l589L6219j66493r1599J23017l7413j31004O6751
$$ 65364 105733 102649 113202 109613 145832 -20661 -112260 10757 -26656 -157660 -90909
17278i0909m854r861J6675M5052J017K13074R7560m0439K2902m4425j16403r1324
$$ -90909 -95763 -105624 -88949 -43897 -42880 170194 267754 227315 250217 205792 89389 -1935
17266a935p6185k52201J341L5046n0627j06532J23815J08558j4146O6748J21195
$$ -1935 -78120 -330321 -328980 -293934 -344561 -451093 -327278 -218720 -232866 -166118 -44923
17255d4923J75533j35663j55108p6898J29526K33230L0980N5064M0917k8157J856
$$ -44923 130610 -5053 -160161 -237059 -107533 125697 156677 211741 252658 224501 226357
17244B26357P6533J29528J41100K56283J42711j3046R114m7882j30761J2959M8102
$$ 226357 302890 432418 573518 829801 972512 959466 968580 920698 789937 802896 850998
17233H50998j6908j29947j72631j46026P5232j00449j24064J05961J98243M4592
$$ 850998 834090 704143 531512 385486 460718 360269 236205 342166 540409 585001
17223E85001q7700m6260j42175r2141J90766K25277K59477R5368J7559j36297
$$ 585001 497301 451041 308866 216725 407491 632768 892245 987613 1005172 868875
17213H68875j09241k52902j58870J32295n1501L6746l6271l25622j15923r1308
$$ 868875 759634 506732 347862 480157 428656 465402 429131 103509 -12414 -103722
17203a03722J06652Q0342m0167k8892R586M9786j00143k8678j15926N6759P3455
$$ -103722 2930 83272 43105 14213 23799 73585 -26558 -55236 -171162 -114403 -40948
17192d0948O1259J75679Q2546k94540n208J81754p4910k73001J0167M9756n3304
$$ -40948 20311 195990 278536 -16004 -21212 160542 85632 -187369 -177202 -127446 -180750
17181a80750M7775M7923j9269N8694j24895m2148Q1488l4515p056j4815J45378
$$ -180750 -132975 -85052 -104321 -45627 -170522 -212670 -131182 -165697 -172753 -187568 -42190
17170d2190P9934P9268K04052J25391j07214j5236O8514j25616j32355j38337
$$ -42190 37744 117012 321064 446455 339241 324005 392519 266903 134548 -3789
17160c789J95657J28065j40825n6304J00852O757J31386j501j26709j14785n2657
$$ -3789 191868 319933 179108 122804 223656 230413 361799 360298 233589 118804 66147
17149F6147j58475j98929L4088R922R7338J05600j9580R1150J00169j27274k72467
$$ 66147 -92328 -291257 -257169 -247247 -149909 -44309 -63889 27261 127430 156 -272311
17138b72311j31764k7199J39615J19007o4342n9571l7648J28076J00013M5684
$$ -272311 -404075 -431274 -291659 -172652 -236994 -296565 -334213 -206137 -106124 -60440
17128f0440q2682j61925J91595J82209J33167j18399j37407j09922k5273P5451
$$ -60440 -143122 -305047 -113452 68757 201924 83525 -53882 -163804 -189077 -113626
17118a13626J31437L280j75208K0575J32854O1628j32507M8113j30290p7370j31495
$$ -113626 17811 21091 -154117 -133542 -688 60940 -71567 -23454 -153744 -231114 -362609
17107c62609o234M7324J30403J58336l0824k21191j5435J09653L8994N0641N1014
$$ -362609 -368843 -321519 -191116 -32780 -63604 -284795 -300230 -190577 -151583 -100942 -49928
17096d9928m7019k829Q674J85270K1162j76941o9007j21802l8234J22424J2951
$$ -49928 -96947 -99776 -91102 94168 115330 -61611 -130618 -252420 -290654 -168230 -155279
17085a55279N511j7241R1713k6638j14277J55169o7403M4476J26139l6584J6539
$$ -155279 -149768 -167009 -75296 -101934 -216211 -61042 -128445 -83969 42170 5586 22125
17074B2125J3982N2812l589J0535k1356J5435j20797k16301r4191j0793O9798
$$ 22125 36107 88919 85330 95865 74509 89944 -30853 -247154 -341345 -352138 -282340
17063b82340J53458M8499K40039K9412j62186K7363K05866j39732j31674o3861
$$ -282340 -128882 -80383 159656 189068 26882 54245 260111 120379 -11295 -75156
17053g5156j7720k00657N5410k9049p4481l2595p3293J18391K59125K11974l1584
$$ -75156 -92876 -293533 -238123 -267172 -341653 -374248 -447541 -329150 -70025 141949 110365
17042A10365j43705m1758r2624M9263Q9193j7194j41540l6299J01203m4398j98354
$$ 110365 -33340 -75098 -167722 -118459 -29266 -46460 -188000 -224299 -123096 -167494 -365848
17031c65848k9822J4124P5825N2637J56314P3232j47996P3749l9693J72550K73684
$$ -365848 -395670 -381546 -305721 -253084 -96770 -23538 -171534 -97785 -137478 35072 308756
17020C08756Q8432R3247k69775l54885L2723J09153R0982J03983j63506j39592
$$ 308756 397188 490435 220660 -134225 -101502 7651 98633 202616 39110 -100482
17010a00482L10101P9768p5647q7252l3450j02301q3316J5151R4121L4083l0863
$$ -100482 209619 289387 213740 126488 93038 -9263 -92579 -77428 16693 50776 19913
16999A9913j15277p7754r0885P7500O9408N6679j16179J09974j7804K6111P7944
$$ 19913 -95364 -173118 -264003 -186503 -117095 -60416 -176595 -66621 -84425 -58314 19630
16988A9630J8574k48504p2383J60205R5273O6638K13347j14821o0710J6922N0507
$$ 19630 38204 -210300 -282683 -122478 -27205 39433 252780 137959 77249 94171 144678
16977A44678o516j00159j03867J28269m2965n7175Q5417k62752j63198J350L4191
$$ 144678 138162 38003 -65864 62405 19440 -37735 47682 -215070 -378268 -376918 -342727
16966c42727J07754l4688R4797L11511J18141p0991j81147k4547R2710J505k8832
$$ -342727 -234973 -269661 -174864 136647 254788 183797 2650 -21897 70813 72318 43486
16955D3486J08309M1209k95482n7327J63987R9428j19836K6196l4248P3972L9176
$$ 43486 151795 193004 -102478 -159805 4182 103610 -16226 9970 -24278 49694 88870
16944H8870j96194j17431j09388Q3638J20482P1508n4538J35090J36106j4366
$$ 88870 -107324 -224755 -334143 -250505 -130023 -58515 -113053 22037 158143 143777
16934A43777j04298q9152M262M5529k400J98015J81291j02682j9421l1227J0522
$$ 143777 39479 -49673 -45411 118 -2282 195733 377024 274342 254921 223694 234216
16923B34216J38989J17841j89053j09139Q2243j97706j58983q5791L0731J328
$$ 234216 373205 491046 301993 192854 275097 77391 -81592 -167383 -136652 -135324
16913a35324l1768J03690J81910J58969q9480k05936j38417P8116J50703k9743
$$ -135324 -167092 -63402 118508 277477 187997 -17939 -156356 -78240 72463 42720
16903D2720q5517O4673J45265k56754k38247m6270J75432O5735K57207O5816o4396
$$ 42720 -42797 21876 167141 -89613 -327860 -374130 -198698 -132963 124244 190060 125664
16892A25664k60664j95667O9422J43233Q4547K12939J89144j23046j66228j71474
$$ 125664 -135000 -330667 -261245 -118012 -33465 179474 368618 245572 79344 -92130
16882i2130j09710N7630J56894k4800j54125q4802k59084J08498P1163J51334
$$ -92130 -201840 -144210 12684 -12116 -166241 -251043 -510127 -401629 -330466 -179132
16872a79132l7232P9770J36327K6137m1408q9164M6682J59251q162p0482k29037
$$ -179132 -216364 -136594 -267 25870 -15538 -104702 -58020 101231 93069 22587 -206450
16861b06450R3094J48203J54106k7585L9374K6159k943j44327k36343k2523k5560
$$ -206450 -113356 34847 188953 161368 200742 226901 223958 79631 -156712 -179235 -204795
16850b04795M407o7978o4025j4506J47865Q6574j15308k16372j8707N2243J88245
$$ -204795 -200388 -268366 -332391 -346897 -199032 -112458 -227766 -444138 -462845 -410602 -222357
16839b22357J72170L0644K9523l2449P6173j03616k09724m2008L286j29656N0055
$$ -222357 -50187 -19543 9980 -22469 53704 -49912 -259636 -301644 -298358 -428014 -377959
16828c77959J36762R0063m7084M8447J1788l8300J3698J2571j8261J16415Q164
$$ -377959 -241197 -151134 -198218 -149771 -137983 -176283 -162585 -150014 -168275 -51860 -43696
16817d3696l8500j35572Q1553l2501m4632p4234J01170J51212L6088k2292j14035
$$ -43696 -82196 -217768 -136215 -168716 -213348 -287582 -186412 -35200 888 -21404 -135439
16806a35439K4481j20427J41649K23622K4634k1484j33190r551J23555J84456
$$ -135439 -110958 -231385 -89736 133886 158520 137036 3846 -5705 117850 302306
16796C02306K0601j9983j93203j39908J21748k7550o4404N4207J13766J10796
$$ 302306 322907 302924 109721 -30187 91561 64011 -393 53814 167580 278376
16786B78376p3268p5105k6432k80871o7671J89693L09658N519L393j05775J6916
$$ 278376 205108 130003 103571 -177300 -244971 -55278 254380 259899 263292 157517 174433
16775A74433M9633J30711m5528r6182j31004j44756l5770O2560P2103R5327q6098
$$ 174433 224066 354777 309249 213067 82063 -62693 -98463 -35903 36200 131527 45429
16764D5429k18590j90831J15613J83959K3692l2740p5965L2972J75309L7938n9624
$$ 45429 -173161 -363992 -248379 -64420 -40728 -73468 -149433 -116461 58848 96786 37162
16753C7162m7673J76152j0043k0043J07932o4960j2044M829j61021n1839K3412
$$ 37162 -10511 165641 155598 135555 243487 178527 166483 171312 10291 -41548 -18136
16742a8136j67596j38071Q856N8509O9833M9403K8581K1197o7450n0241K0250
$$ -18136 -185732 -323803 -314947 -256438 -186605 -137202 -108621 -87424 -154874 -205115 -184865
16731a84865j07471J65844L0574k9737P4002n379J26802N6179p4275J26356J4100
$$ -184865 -292336 -126492 -95918 -125655 -51653 -57032 69770 125949 51674 178030 192130
16720A92130q2637J04362k50794p7416J35756r3684j02156p0630L2768K11516
$$ 192130 109493 213855 -36939 -114355 21401 -72283 -174439 -245069 -212301 -785
16710g85K42344J5790j87045k17178n6677J47791J16994j18778O8262J4276l1738
$$ -785 241559 257349 70304 -146874 -203551 -55760 61234 -57544 10718 24994 -6744
16699f744J09078l6557o7163j46957J6160k2572J02142J83119p4965K58990J36904
$$ -6744 102334 65777 -1386 -148343 -132183 -154755 -52613 130506 55541 314531 451435
16688D51435j66859k65448k54626p4920j2734q2431p3274j4409J96666P8286n315
$$ 451435 284576 19128 -235498 -310418 -323152 -405583 -478857 -493266 -296600 -218314 -223629
16677b23629l975K48719J88229R0481J33495j04462j10738l56974o6065J89194
$$ -223629 -227604 21115 209344 299825 433320 328858 218120 -138854 -204919 -15725
16667a5725K2018j34531Q3579n0037M6776j19042N072m9679r0392M4384j04215
$$ -15725 6293 -128238 -44659 -94696 -47920 -166962 -161890 -211569 -301961 -257577 -361792
16656c61792Q7261K02623J1711J09460O0370r0704j52648K2282Q9211O0670J49629
$$ -361792 -274531 -71908 -60197 49263 109633 18929 -133719 -111437 -22226 38444 188073
16645A88073N77L8264o0669k54698k1239k0163R5823N9233J37522M8932K8490
$$ 188073 188650 226914 166245 -88453 -109692 -129855 -34032 25201 162723 211655 240145
16634B40145j78961j91022N6111n5459o6552O1502P8101Q2270P5467j29718m7842
$$ 240145 61184 -129838 -73727 -129186 -195738 -134236 -56135 26135 101602 -28116 -75958
16623g5958L3319p6045j72800K0214K5820K7800K18903Q5690M8402p8921L3798
$$ -75958 -42639 -118684 -291484 -271270 -245450 -217650 1253 86943 135345 56424 90222
16612I0222M7139j93576k27465j04325J18705J37517J28981o729J00735m4977
$$ 90222 137361 -56215 -283680 -388005 -269300 -131783 -2802 -9531 91204 46227
16602D6227L7048R771j89737J8786J2940N1921m9116N8249o4699o876j21009j62442
$$ 46227 83275 93046 -96691 -77905 -64965 -13044 -62160 -3911 -68610 -75486 -196495 -358937
16590c58937K78201J76373o5802j07899k4203O9840Q9740o1389J4864J14849O6336
$$ -358937 -80736 95637 29835 -78064 -102267 -32427 57313 -4076 10788 125637 191973
16579A91973j20079j80771k64305m3088o4872K5951n9614J17919N0886M4459J30656
$$ 191973 71894 -108877 -373182 -416270 -481142 -455191 -514805 -396886 -346000 -301541 -170885
16568a70885j55672M3516M37812K5408o1929P2455m3098n732p8277k67175j801
$$ -170885 -326557 -283041 154771 180179 118250 190705 147607 141875 63598 -203577 -205378
16557b05378J88314K44474O1711J30702k02749j46978M1952p0651l7335P4742
$$ -205378 -17064 227410 289121 419823 217074 70096 112048 41397 4062 78804
16547G8804J62912O6403j39901j77242p9024r5865j64680j02204J08354K48127
$$ 78804 241716 308119 168218 -9024 -88048 -183913 -348593 -450797 -342443 -94316
16537i4316j33958j7152l7097J46852J99744J2205j67014J02627K49553r3738
$$ -94316 -228274 -245426 -282523 -135671 64073 76278 -90736 11891 261444 167706
16527A67706o205m2940R9091J88973q8140n2059J2930J15506j78038k00599l9344
$$ 167706 161501 118561 217652 406625 318485 266426 279356 394862 216824 16225 -23119
16516b3119j36110P4423J30855k41264p5694J79257J20167j41878l7353N5929
$$ -23119 -159229 -84806 46049 -195215 -270909 -91652 28515 -113363 -150716 -94787
16506i4787n9146J18885R6995k1604P4295o567n4494N3567n2739k90907j26342
$$ -94787 -153933 -35048 61947 40343 114638 108071 53577 107144 54405 -236502 -362844
16495c62844K15508L1370p9285m8316J6043J17853Q6179N7577j13903l4588J12628
$$ -362844 -147336 -115966 -195251 -243567 -227524 -109671 -23492 34085 -79818 -114406 -1778
16484a778p8844J975O0339O2186J37549j37672j87565r6377k42288j35565M20865
$$ -1778 -80622 -78647 -18308 43878 181427 43755 -143810 -240187 -482475 -618040 -197175
16473a97175K86025J0677j1681m8521j04768r8240q282J84141N9564l4776O1825
$$ -197175 88850 99527 87846 39325 -65443 -163683 -171965 12176 71740 36964 98789
16462I8789O6594l3591m9071j54693l73147l047J35024O2712L0367j72113j8894
$$ 98789 165383 131792 82721 -71972 -445119 -448166 -313142 -250430 -220063 -392176 -411070
16451d11070L01628J40595M1752o1052m77k12491Q7631K72187m1059j03267j45359
$$ -411070 -109442 31153 72905 11853 11376 -201115 -113484 158703 117644 14377 -130982
16440a30982k6265M8148j61336K8011K85358n9866j15372J01176K8332K7475n9065
$$ -130982 -157247 -109099 -270435 -242424 42934 -16932 -132304 -31128 -2796 24679 -34386
16429c4386j01539j73786Q143J82807k5022j02919J93024l2243j05119j25881
$$ -34386 -135925 -309711 -301568 -118761 -143783 -246702 -53678 -85921 -191040 -316921
16419c16921J31136Q518J00370p9897N1910L6589j14124j2538K89221l9569k80051
$$ -316921 -185785 -177267 -76897 -156794 -104884 -68295 -182419 -194957 94264 54695 -225356
16408b25356j31410J78801L35054N9888p0619M5137p6656k03354q2598N1987j15196
$$ -225356 -356766 -177965 157089 216977 146358 191495 114839 -88515 -171113 -119126 -234322
16397b34322J39035J46868j94654K4891M5983K8214r0248q0200j60200m3385K51940
$$ -234322 -95287 51581 -143073 -118182 -72199 -43985 -134233 -214433 -374633 -418018 -166078
16386a66078O0161K5860M0535J07846j00552k23348j33197j7532Q8538K2759Q2194
$$ -166078 -105917 -80057 -39522 68324 -32228 -255576 -388773 -406305 -317767 -295008 -212814
16375b12814j12486j28637J95676J68464j62277p3669K97015J92082j40925n1977
$$ -212814 -325300 -453937 -258261 -89797 -252074 -325743 -28728 163354 22429 -29548
16365b9548j03036j15318m0409Q5585r2146K4232J00612k8353J41390L737r9508
$$ -29548 -132584 -247902 -288311 -202726 -294872 -270640 -170028 -198381 -56991 -53254 -152762
16354a52762J14680J86124k33706j1661p6088J28037l0419M3534R3596j63079
$$ -152762 -38082 148042 -85664 -97325 -173413 -45376 -75795 -32261 61335 -101744
16344a01744j21286l8637n4600j2027J82618K465j02134Q1607J36529j07664j71704
$$ -101744 -223030 -261667 -316267 -328294 -145676 -143211 -245345 -163738 -27209 -134873 -306577
16333c06577J80974j1694M7019k4179o964J25117K333l444N1136k4618J31913
$$ -306577 -125603 -137297 -90278 -114457 -121421 3696 6029 2585 53721 29103 161016
16322A61016n73j37868j37553n8898R8075j6600J33341p1565k8566J853m0840
$$ 161016 160443 22575 -114978 -173876 -75801 -92401 40940 -30625 -59191 -57338 -98178
16311i8178J67762Q7147J30576j62108j66572j03421K44083K1800n0792o1138
$$ -98178 69584 156731 287307 125199 -41373 -144794 99289 121089 70297 9159
16301I159j50611q5268m0412K4378O6159r7983p9886j6701J27029J6849J07979
$$ 9159 -141452 -226720 -267132 -242754 -176595 -274578 -354464 -371165 -244136 -227287 -119308
16290a19308L7014J0034O9669P0123o8439K1785k1831J58313J10255o0369j20279
$$ -119308 -82294 -72260 -2591 67532 -907 20878 -953 157360 267615 207246 86967
16279H6967p593o2418k2258k55357j2910J01650l7458k7754R4021j6795j11084
$$ 86967 79374 16956 -5302 -260659 -273569 -171919 -209377 -237131 -143110 -159905 -270989
16268b70989J52879J16421Q9731k1354L565j63510k86993q045J19061J54898J28997
$$ -270989 -118110 -1689 88042 66688 70253 -93257 -380250 -388295 -269234 -114336 14661
16257A4661K8609m1139m1399J2492o104N7926k63063l031J02630O9415N2831j32264
$$ 14661 43270 2131 -39268 -26776 -32880 25046 -238017 -241048 -138418 -69003 -16172 -148436
16245a48436N9434p6795j16231N8122L1311J19724m9755q934j6738j15886m7114
$$ -148436 -89002 -165797 -282028 -223906 -192595 -72871 -122626 -131560 -148298 -264184 -311298
16234c11298j48326K0811J77504J49273J9654M7649j8196J5839L3862N6923p2043
$$ -311298 -459624 -438813 -261309 -112036 -92382 -44733 -62929 -47090 -13228 43695 -28348
16223b8348k70329J18962R5452J05666M7511J9231j26995J12456J46802j79063
$$ -28348 -298677 -179715 -84263 21403 68914 88145 -38850 73606 220408 41345
16213D1345r5740O1466K4500q2903P932r8692m6340n3935J1081j0502L9318M7159
$$ 41345 -54395 7071 31571 -51332 -43400 -142092 -188432 -242367 -231286 -241788 -202470 -155311
16201a55311m8207J14764j8130j9138j5713j78786J20164J13791L9001l9147J2213
$$ -155311 -203518 -88754 -106884 -126022 -141735 -320521 -200357 -86566 -47565 -86712 -74499
16190g4499j31240j39780n2459J5109K26755J6906m1715j42863j0162J42736j3813
$$ -74499 -205739 -345519 -397978 -382869 -156114 -139208 -180923 -323786 -333948 -191212 -205025
16179b05025r6075j56700m1210J02461J95868N114j9458K8683J21032J11419K46520
$$ -205025 -301100 -457800 -499010 -396549 -200681 -195567 -215025 -186342 -65310 46109 292629
16168B92629P6421q1110k04817p3925o8435m7853N7953J95734m1888M09P5580
$$ 292629 369050 287940 83123 9198 -59237 -107090 -49137 146597 104709 105118 180698
16157A80698r0103j61119o7717j00983j87971m1105N6493J32031K53999K64303
$$ 180698 90595 -70524 -138241 -239224 -427195 -468300 -411807 -279776 -25777 238526
16147B38526j51926p1246J2498J6211L6916l3041p072N0790l7403j67257j51965
$$ 238526 86600 15354 27852 44063 80979 47938 40866 91656 54253 -113004 -264969
16136b64969J6098m64J24976P2826j05680K6414o0411j39386o7744K00008Q5650
$$ -264969 -248871 -249335 -124359 -51533 -157213 -130799 -191210 -330596 -398340 -198332 -112682
16125a12682N8567L1770R8034j5348J6548p0061j14967j05784J1275J12692r9254
$$ -112682 -54115 -22345 75689 60341 76889 6828 -108139 -213923 -202648 -89956 -189210
16114a89210J00061L7375N0994J06285J12904p7170r2107q8340j19760J04539
$$ -189210 -89149 -51774 -780 105505 218409 141239 49132 -39208 -158968 -54429
16104e4429R3128j56656J37278p294j68666k46704K33638J78004j1732L214P7184
$$ -54429 38699 -117957 19321 12027 -156639 -403343 -169705 8299 -3433 -219 76965
16093G6965r2287J4037P2121r1720o5397j49481o1781K6475q6261J64656Q0883
$$ 76965 -15322 -1285 70836 -20884 -86281 -235762 -297543 -271068 -357329 -192673 -111790
16082a11790L6737O5093j24982R5473K2611J50762j044o9943J92096l3000k31126
$$ -111790 -75053 -9960 -134942 -39469 -16858 133904 132860 62917 255013 222013 -9113
16071i113p0920M251L3018q3386N3276J53062Q2926j13154j50672j97285J61651
$$ -9113 -80033 -75782 -42764 -126150 -72874 80188 163114 49960 -100712 -297997 -136346
16060a36346J96801P1718J9085p9909P2840m7783R797j2204j73184j43952M4407
$$ -136346 60455 132173 151258 71349 144189 96406 106203 93999 -79185 -223137 -178730
16049a78730J37702J05697J88839M5836j00829j38836o7610Q7914J09988p2787
$$ -178730 -41028 64669 253508 299344 198515 59679 -7931 79983 189971 117184
16039A17184k8842j32880q7899Q007M1362N349m9258m276L3538p6405J21455L4933
$$ 117184 88342 -44538 -132437 -124430 -83068 -77719 -126977 -131253 -97715 -174120 -52665 -17732
16027a7732m8176J15914J26031O3739J35407k63105j11737k7054n4473j615p2183
$$ -17732 -65908 50006 176037 239776 375183 112078 341 -26713 -81186 -82801 -154984
16016a54984N6634K0708K4053l0937K65796Q6571r6326O7868j48331j86575M847
$$ -154984 -98350 -77642 -53589 -84526 181270 267841 171515 239383 91052 -95523 -90676
16005i0676J0147J9108K859J12636J04078J97267j69822n21L9121o4316j48272
$$ -90676 -80529 -61421 -58562 54074 158152 355419 185597 185076 224197 159881 11609
15994A1609j18940q0119j33535J34736K07150q227j18649j40021j50522J4909
$$ 11609 -107331 -187450 -320985 -186249 20901 12674 -105975 -245996 -396518 -381609
15984c81609K00598J42172m1553p087J39629k6773j02992o33p0204N8941J58690
$$ -381609 -181011 -38839 -80392 -87479 52150 25377 -77615 -78248 -148452 -89511 69179
15973F9179J07583j39997q9217L2769O2518n5910N6459q3875k47423J24288N2260
$$ 69179 176762 36765 -52452 -19683 42835 -13075 43384 -40491 -287914 -163626 -111366
15962a11366l6351J33068J85819l06648k70343j0822K42428J00430j6789Q6247
$$ -111366 -147717 -14649 171170 -135478 -405821 -416643 -174215 -73785 -90574 -4327
15952d327l5196j11680j9750j79517P3930J08389K29037K81576k00169l49635
$$ -4327 -39523 -151203 -170953 -350470 -276540 -168151 60886 342462 142293 -207342
15942b07342j36019J36348l5378j48139L1029K30693J23199j38767L0225J89507
$$ -207342 -343361 -207013 -242391 -390530 -359501 -128808 -5609 -144376 -114151 75356
15932G5356j61248q2352L41166j2412p8010j40839k45097n1631K11890K47728
$$ 75356 -85892 -168244 172922 160510 82500 -58339 -303436 -355067 -143177 104551
15922A04551J11077j83382p0710L21702p2762k73426j62905l7169l106O0205J12959
$$ 104551 215628 32246 -38464 283238 210476 -62950 -225855 -263024 -266130 -205925 -92966
15911i2966L7597O2662P7579l8860j04054l25567k63963R8666J10668J65887K40753
$$ -92966 -55369 7293 84872 46012 -58042 -383609 -647572 -548906 -438238 -272351 -31598
15900c1598L8285K4186j16976N3048j59108J7387o1614r9802q220L9916j36839
$$ -31598 6687 30873 -86103 -33055 -192163 -174776 -236390 -336192 -344412 -304496 -441335
15889d41335K7305p832N9510J6021J22725J40936n1903r6481L0247J11266O3378
$$ -441335 -414030 -421862 -362352 -346331 -223606 -82670 -134573 -231054 -200807 -89541 -26163
15878b6163N7099j15876Q9349J10024j28747J37943J6394k62948k22048J19044
$$ -26163 30936 -84940 4409 114433 -14314 123629 140023 -122925 -344973 -225929
15868b25929J57414J46525r4826K3189j46808k38714j94654J55653R8476K34235
$$ -225929 -68515 78010 -16816 6373 -140435 -379149 -573803 -418150 -319674 -85439
15858h5439J47576l8474q2645j37427j05326Q0865L795j04444j3598J19858J97135
$$ -85439 62137 23663 -58982 -196409 -301735 -220870 -217075 -321519 -335117 -215259 -18124
15847a8124J13681N7985q2662q7275k0473j03608N4816K3030O6957K26566l7539
$$ -18124 95557 153542 70880 -16395 -36868 -140476 -85660 -62630 4327 230893 193354
15836A93354k46279n9783o6764K2823M1578k25779n8636O6902R910J15562J10544
$$ 193354 -52925 -112708 -179472 -156649 -115071 -340850 -399486 -332584 -322674 -207112 -96568
15825i6568J05747j4748m4342K27041L03841p7098o3974j22190k62004m232O8144
$$ -96568 9179 -5569 -49911 177130 480971 403873 339899 217709 -44295 -48527 19617
15814A9617J4378k41874j11392P1118K10012K68792j17503k8141j67939J9086
$$ 19617 33995 -207879 -319271 -248153 -38141 230651 113148 85007 -82932 -63846
15804f3846L8598m0533R8827Q1158J22275O2394q7194m3361j08609j93614L8303
$$ -63846 -25248 -65781 33046 114204 236479 298873 211679 168318 59709 -133905 -95602
15793i5602M3614P9787k9292J13026K39851n1864k80261m0017L7368k8874k5058
$$ -95602 -51988 27799 -1493 111533 351384 299520 19259 -20758 16610 -12264 -37322
15782c7322K423K1554J12035K4511l616j62421n4985j7261L875N1296p303j09032
$$ -37322 -34899 -13345 98690 123201 119585 -42836 -97821 -115082 -111207 -59911 -67214 -176246
15770a76246k6235l7708P1442k5376N9201K22992J52192J519K703L0093j42322
$$ -176246 -202481 -240189 -168747 -194123 -134922 88070 240262 241781 244484 274577 132255
15759A32255j65176j01024j31052n4347L3267O1833J33332M8172J45136K06558
$$ 132255 -32921 -133945 -264997 -319344 -286077 -224244 -90912 -42740 102396 308954
15749C08954o0029k30495l6656M3473j77993L5167j5766J06982l9538j51963P050
$$ 308954 248925 18430 -18226 25247 -152746 -117579 -133345 -26363 -65901 -217864 -210814
15738b10814J97157J89k4530o5552k1823O5859k3944Q9722P1997J5305n9303M0700
$$ -210814 -13657 -13468 -37998 -103550 -125373 -59514 -83458 6264 78261 93566 34263 74963
15726G4963J9914N4045m2916j26662j0964J46115P5346j49113k09050J1545J6917
$$ 74963 94877 148922 106006 -20656 -31620 114495 189841 40728 -168322 -156777 -139860
15715a39860m8554J88527n1850o189J43668J91102j25281r5797N698o823j32660
$$ -139860 -188414 113 -51737 -57926 85742 276844 151563 55766 61464 54641 -78019
15704g8019j64837m0278o4518K1004N2278k8761N6235l2594k05128q665J71647
$$ -78019 -242856 -283134 -347652 -326648 -274370 -303131 -246896 -279490 -484618 -493283 -321636
15693c21636N1558n565N0907j57672O8020J21106P0765j8630J40543m6001R4478
$$ -321636 -270078 -275643 -224736 -382408 -314388 -193282 -122517 -141147 -604 -46605 47873
15682D7873J62023j39827q7066m4247P4649K564K097j04546o1215J87466o8011
$$ 47873 209896 70069 -16997 -61244 13405 15969 18066 -86480 -147695 39771 -28240
15671b8240O2720m6981l52126j61294J70291K16054R670j1360J82501j24904n5591
$$ -28240 34480 -12501 -364627 -525921 -355630 -139576 -129906 -141266 41235 -83669 -139260
15660a39260J33620J1641j80970j84474O9469R4500J55202O1520Q9321r1563k74979
$$ -139260 -5640 6001 -174969 -359443 -289974 -195474 -40272 21248 110569 19006 -255973
15649b55973J16218J16631p9403J3886L8965J54195L5185N2768J05655j23870
$$ -255973 -139755 -23124 -102527 -88641 -49676 104519 139704 192472 298127 174257
15639A74257p8082J1278p5569j05226R0695j57758M6888J82521Q4431m2952p8122
$$ 174257 96175 107453 31884 -73342 17353 -140405 -93517 89004 173435 130483 52361
15628E2361J39629L4265j0892k31501L2148j50702j11513J53609K33042O7298
$$ 52361 191990 226255 215363 -16138 16010 -134692 -246205 -92596 140446 207744
15618B07744p1065q1771J53817Q6278k19724j87996j3851J18925M5923j39764
$$ 207744 136679 54908 208725 295003 75279 -112717 -126568 -7643 38280 -101484
15608a01484N7518J46791J45881R1634j15339j03655r5525q7818K46060j08214
$$ -101484 -43966 102825 248706 340340 225001 121346 25821 -61997 184063 75849
15598G5849R4584J6760k35266l08805J40835L0o4884o0197J60683O9392Q3780
$$ 75849 170433 187193 -48073 -356878 -216043 -216013 -280897 -341094 -180411 -111019 -27239
15587b7239l7217j49362K2535J52459J02547R713K7856m4196o0005N3006k62541
$$ -27239 -64456 -213818 -191283 -38824 63723 73436 101292 57096 -2909 50097 -212444
15576b12444k12631j8260J49989J99690L23717l7487k95151k3268J16089K89747
$$ -212444 -425075 -443335 -293346 -93656 230061 192574 -102577 -125845 -9756 279991
15566B79991p021j69156j22467O8590Q6906J64586q6447j96900J17o150J49834
$$ 279991 272970 103814 -18653 49937 136843 301429 214982 18082 18199 12049 161883
15555A61883K29424l1870K5018j72086n6887k1654p1629m850J54285J16109k83345
$$ 161883 391307 359437 384455 212369 155482 133828 62199 57349 211634 327743 44398
15544D4398J30329J06811k20806k1121K02857l2339K6079k06584j49800J52706
$$ 44398 174727 281538 60732 39611 242468 210129 236208 29624 -120176 32530
15534C2530J99920J28760j09645j13382N1375j03581p6028K50981R9174j03014
$$ 32530 232450 361210 251565 138183 189558 85977 9949 260930 360104 257090
15524B57090n8970p0434K8539m5460l6301k00437j7532K91214J12138j48797l18039
$$ 257090 198120 127686 156225 110765 74464 -125973 -143505 147709 259847 111050 -206989
15513b06989j42284J14583J66658M9980r0724J11425R0989k97349R9721o4546
$$ -206989 -349273 -234690 -68032 -18052 -108776 2649 93638 -203711 -103990 -168536
15503a68536Q2478O8035M4189l9550P9701r133N0181J51868J7356K1520n9063
$$ -168536 -86058 -18023 26166 -13384 66317 57184 107365 259233 276589 298109 239046
15492B39046j30873p1040q919j68244q0728R1412O6289K4511K81266O4791R998
$$ 239046 108173 37133 28214 -140030 -220758 -129346 -63057 -38546 242720 307511 317509
15481C17509N2915n8423N6195M553k51398j01767n2926m8768l7904J85979J27139
$$ 317509 370424 312001 368196 372749 121351 19584 -33342 -82110 -120014 65965 193104
15470A93104q015k7945j36366j1600N9549j43164j99095k86946J80028L49450
$$ 193104 185089 157144 20778 9178 68727 -74437 -273532 -560478 -380450 -31000
15460c1000J13382J5382j5903j9435J80450j08345L6536J32037q5288k39675m9643
$$ -31000 82382 97764 81861 62426 242876 134531 171067 303104 217816 -21859 -71502
15449g1502K6429n4607J77163M858r7876R1175l0097j33824J9878P3884n6667
$$ -71502 -45073 -99680 77483 82341 -15535 75640 45543 -88281 -68403 5481 -51186
15438e1186J38267J07978J918J2082j37275j79176K28697L9216j18434p0961o2720
$$ -51186 87081 195059 196977 209059 71784 -107392 121305 160521 42087 -28874 -91594
15427i1594j00981M1842k247J13554k4236l0119J71934j6328j8636M0556k2292
$$ -91594 -192575 -150733 -152980 -39426 -63662 -93781 78153 61825 43189 83745 61453
15416F1453J8033p7396j04398p5818k9899r9739m0072l5537k2021J15083M67782
$$ 61453 79486 2090 -102308 -178126 -208025 -307764 -347836 -383373 -405394 -290311 177471
15405A77471K04529j46908L1532n2216k59991n1212q9107K2641O9974J07159k0265
$$ 177471 382000 235092 266624 214408 -45583 -96795 -185902 -163261 -93287 13872 -6393
15394f393k45282k01298p18K18086J97764Q1287j49460m5399J83579l2107P9879
$$ -6393 -251675 -452973 -453691 -235605 -37841 43446 -106014 -151413 32166 59 79938
15383G9938r1528p3462o4649m3838K32035M454r8503M719j44563n1130J02201
$$ 79938 -11590 -85052 -149701 -193539 38496 42950 -55553 -50834 -195397 -246527 -144326
15372a44326J16792q37K1893r1503n8039j0j9091L6791l8230O3087J63202L3534
$$ -144326 -27534 -28371 -6478 -97981 -156020 -156030 -175121 -138330 -176560 -113473 49729 83263
15360H3263p407l7597J85794N5786j06766r6936j2370j28503j38926j94531Q6022
$$ 83263 75856 38259 224053 279839 173073 76137 63767 -64736 -203662 -398193 -312171
15349c12171L15662J41625K5373p277p7363J02909M1080k87377j75277l4031M3419
$$ -312171 3491 145116 170489 163212 85849 188758 229838 -57539 -232816 -266847 -223428
15338b23428R1242J56632N2559P3692j06935P0577O2248k04522L5697J52J28851
$$ -223428 -132186 24446 77005 150697 43762 114339 176587 -27935 7762 7914 136765
15327A36765n4057r6181p2709j71695n891J78232n1564o7771L8411L0092J90328
$$ 136765 82708 -13473 -86182 -257877 -263768 -85536 -137100 -204871 -166460 -136368 53960
15316E3960K58477j38752p2008K3519P3162o2245k2865J1699j11414j8251J22352
$$ 53960 312437 173685 101677 125196 198358 136113 113248 124947 13533 -4718 117634
15305A17634J5099l0217j83256j77231J2742N6198K7886Q6414P3406J03655R8684
$$ 117634 132733 102516 -80740 -257971 -245229 -189031 -161145 -74731 -1325 102330 201014
15294B01014j91887j44844j13324j64011l9993O9544K22654P4700K0534k3283
$$ 201014 9127 -135717 -249041 -413052 -453045 -383501 -160847 -86147 -65613 -88896
15284h8896j02675k5947J09619J12832j2073k7413J07382j3219j23387j84315
$$ -88896 -191571 -217518 -107899 4933 -7140 -34553 72829 59610 -63777 -248092
15274b48092J13002J65975O273n1522k07588k9762J81566N4387j8082J92308j49253
$$ -248092 -135090 30885 37158 -14364 -221952 -251714 -70148 -15761 -33843 158465 9212
15263I212l9087O6742q7290J52684P422j0937r8504J31972Q009k83263j10280
$$ 9212 -29875 36867 -50423 102261 109683 98746 242 132214 140223 -143040 -253320
15252b53320m3467M296J61644J52916l1710j03978m6631M7801P5681k0087J11251
$$ -253320 -296787 -292491 -130847 22069 -9641 -113619 -160250 -112449 -36768 -56855 54396
15241E4396q3856r2628K9182M104J23547Q5331J29893o7400k20795j45238O0877
$$ 54396 -29460 -122088 -92906 -88802 34745 120076 249969 182569 -38226 -183464 -122587
15230a22587K111K00170M6593j60861j91476q2758J1847j8972J30785Q7271Q938
$$ -122587 -120476 79694 126287 -34574 -226050 -308808 -296961 -315933 -185148 -97877 -88939
15219h8939L3050L824j6497k30252j62330K69981L16894Q2590R4917j987r6000
$$ -88939 -55889 -52065 -68562 -298814 -461144 -191163 125731 208321 303238 301251 205251
15208B05251l2741j69439K00060K01084p0316j58881l8260j02425L7345J8578
$$ 205251 172510 3071 203131 404215 333899 175018 136758 34333 71678 90256
15198I0256k9872Q8447p0257j51686j09490P2815J90407n101K0116k8802j81569
$$ 90256 60384 148831 78574 -73112 -182602 -109787 80620 75519 95635 66833 -114736
15187a14736j06643n4423J70248M5067L5930J71706J62705M1993j68401j4329
$$ -114736 -221379 -275802 -105554 -60487 -24557 147149 309854 351847 183446 169117
15177A69117K458r0855n3535J17374l4859j11746j65218q6551R2398J44005q6887
$$ 169117 171575 80720 27185 144559 109700 -2046 -167264 -253815 -161417 -17412 -104299
15166a04299J60000K13899P6430l1010k38666J6011J3204j02635J33431M3860
$$ -104299 55701 269600 346030 315020 76354 92365 105569 2934 136365 180225
15156A80225j13242n9212K38040M427j95880K5655j09944j19423J44872J85731
$$ 180225 66983 7771 245811 250238 54358 80013 -29931 -149354 -4482 181249
15146A81249l12829r8616J24047J73481K9200P663k9064l5262p7459Q4088J29883
$$ 181249 -131580 -230196 -106149 67332 96532 104195 75131 39869 -37590 46498 176381
15135A76381l1574j08199J02161r9422L3871J01213K0601j18222q7142j93622
$$ 176381 144807 36608 138769 39347 73218 174431 195032 76810 -10332 -203954
15125b03954R4719J63100j82390J7169K8560K9363k7257n7752J72510j19671o1336
$$ -203954 -109235 53865 -128525 -111356 -82796 -53433 -80690 -138442 34068 -85603 -146939
15114a46939L7720j95340j14469L00010L14013K5593p2266P4804N3238q1112j81157
$$ -146939 -109219 -304559 -419028 -119018 194995 220588 148322 223126 276364 195252 14095
15103A4095N5625O4862O4720L9869o7455k64004J9095Q8055J07039j05433j56369
$$ 14095 69720 134582 199302 239171 171716 -92288 -73193 14862 121901 16468 -139901
15092a39901M6973J15114j8945q8023p2985K9901K4128J20037q8781J28721J48683
$$ -139901 -92928 22186 3241 -84782 -157767 -127866 -103738 16299 -72482 56239 204922
15081B04922j24846k84937J5040J21816q5588j30116M7070K09109O6808R8572
$$ 204922 80076 -204861 -189821 -68005 -153593 -283709 -236639 -27530 39278 137850
15071A37850k21514k8818Q0755r5695J7551Q2120K8814J03406Q1958P0969m8178
$$ 137850 -83664 -112482 -31727 -127422 -109871 -27751 1063 104469 186427 257396 209218
15060B09218o9676j73530k22366j5399J06853m4796Q6279K1664K27692J70080
$$ 209218 139542 -33988 -256354 -271753 -164900 -209696 -123417 -101753 125939 296019
15050B96019m3921j44227m2438m3655P7876J68109P7967m1038j69308J38393j82949
$$ 296019 252098 107871 65433 21778 99654 267763 345730 304692 135384 273777 90828
15039I0828k11674l1719q4357J5508J10841K2788k05100l4005J08535J74189m6574
$$ 90828 -120846 -152565 -236922 -221414 -110573 -87785 -292885 -326890 -218355 -44166 -90740
15028i0740Q3726j16968j44116p352M7142p1305M8538J39590j57405j45651L3284
$$ -90740 -7014 -123982 -268098 -275450 -228308 -299613 -251075 -111485 -268890 -414541 -381257
15017c81257r348j026j2949N6753P4475m8736K81666k7667j01025J10453k9032
$$ -381257 -390605 -391631 -404580 -347827 -273352 -322088 -40422 -68089 -169114 -58661 -87693
15006h7693J55641j8758j0254K8307l4132j629j07559l1223P0798K1471j40851
$$ -87693 67948 49190 38936 67243 33111 31482 -76077 -107300 -36502 -15031 -155882
14995a55882n7363k4086k3977p9855n5567K10181L6788Q6834k29036p084J08148
$$ -155882 -213245 -237331 -261308 -341163 -396730 -186549 -149761 -62927 -291963 -299047 -190899
14984a90899M6269J91836O3520l8026J00134J43501l0262j02470j95224j59024
$$ -190899 -144630 47206 110726 72700 172834 316335 286073 183603 -11621 -170645
14974a70645P4534Q8217j01303J01375P2045L815j16810k9521O854p6921j31234
$$ -170645 -96111 -7894 -109197 -7822 64223 68038 -48772 -78293 -71439 -148360 -279594
14963b79594J1574q030L4184J67776K0341k154l448j51141k2202O483J0463l2512
$$ -279594 -268020 -276050 -241866 -74090 -53749 -55903 -59351 -210492 -232694 -226211 -215748 -248260
14951b48260K13737J42582J05454k5964k24549l352K38069K749p2513l1909J01675
$$ -248260 -34523 108059 213513 187549 -37000 -40352 197717 200466 127953 96044 197719
14940A97719J45208j25599j14563n6292j14471k1345K2244j65475J7615j25646
$$ 197719 342927 217328 102765 46473 -67998 -89343 -67099 -232574 -214959 -340605
14930c40605J4708J54347J57921J37260J160r7732P6987j12776q5506k3345N8535
$$ -340605 -325897 -171550 -13629 123631 124791 27059 104046 -8730 -94236 -117581 -59046
14919e9046J95291L5769n276j10562j11375R3157J1921j18758j03239N5196K63439
$$ -59046 136245 172014 166738 56176 -55199 37958 49879 -68879 -172118 -116922 146517
14908A46517J37720O2053j04857J5710n749L5825l5064k57414J6252j04435j672
$$ 146517 284237 346290 241433 257143 251394 287219 252155 -5259 10993 -93442 -95114
14897i5114K2703j01645k54879p7858R0912K23548j3941j24408k6247K12875K76950
$$ -95114 -72411 -174056 -428935 -506793 -415881 -192333 -206274 -330682 -356929 -144054 132896
14886A32896j25561j68585m5427q684M2814J1331j55913l2588K07663L2564k0832
$$ 132896 7335 -161250 -206677 -215361 -172547 -161216 -317129 -349717 -142054 -109490 -130322
14875a30322m672j73133J2370K9752R269K707R4791l8172L5584J41902O7414j46994
$$ -130322 -134994 -308127 -295757 -266005 -256736 -254029 -159238 -197410 -161826 -19924 47490 -99504
14863i9504r2203L6429q1978O5930J70213J82870J954j90819n612J05551k5878
$$ -99504 -191707 -155278 -237256 -171326 -1113 181757 183711 -7108 -12720 92831 66953
14852F6953k1734k28284l5796J40809l1575p0049q2137M8028J51654R6352o7136
$$ 66953 45219 -183065 -218861 -78052 -109627 -179676 -261813 -213785 -62131 34221 -32915
14841c2915K4231J13978K9101j17307q6181j7050J42818R1082m626p8009J27817
$$ -32915 -8684 105294 134395 17088 -69093 -86143 56675 147757 143131 65122 192939
14830A92939K0146R83L7448P0645j01737l5083j60807j86521p6072L339Q9757
$$ 192939 213085 214068 251516 322161 220424 185341 24534 -161987 -238059 -234720 -144963
14819a44963Q3363j25022J31552R1646K24928J61974K9346k34878j48682j63743
$$ -144963 -61600 -186622 -55070 36576 261504 423478 452824 217946 69264 -94479
14809i4479r0129j66534Q4764J04670j10614J4092n9843K31412j32259m7180K9915
$$ -94479 -184608 -351142 -266378 -161708 -272322 -258230 -318073 -86661 -218920 -266100 -236185
14798b36185J27877o0898J62012l656J72126o2837l6774L4105j65808l3246N6229
$$ -236185 -108308 -169206 -7194 -10850 161276 98439 61665 95770 -70038 -103284 -47055
14787d7055K02558J30911j6531p3486m8452r6120L6339Q4009n1770q9910k23273
$$ -47055 155503 286414 269883 196397 147945 51825 88164 172173 120403 30493 -192780
14776a92780J61360J92870q9915j01443J5222J34707j17213J3826J6097J07012
$$ -192780 -31420 161450 71535 -29908 -14686 120021 2808 16634 32731 139743
14766A39743k21231q3357p9319P894m5898J47872J86824O7941l6830j79431j43065
$$ 139743 -81488 -164845 -244164 -236270 -282168 -134296 52528 120469 83639 -95792 -238857
14755b38857l8982o4101O0677O4040j85895j19069L6496K78083L10635O572J47079
$$ -238857 -277839 -341940 -281263 -217223 -403118 -522187 -485691 -207608 103027 109599 256678
14744B56678p2070j47722J02634J57454J63914k9355l36712j79351N1564n2661
$$ 256678 184608 36886 139520 296974 460888 431533 94821 -84530 -32966 -85627
14734h5627p0517j67733k79985r4312O1276K07704N9471N2892p609J59574N9925
$$ -85627 -156144 -323877 -603862 -698174 -636898 -429194 -369723 -316831 -324440 -164866 -104941
14723a04941P2170N6170Q3265l4732N2738M2612O8237q2861j77086J11540J72229
$$ -104941 -32771 23399 106664 71932 124670 167282 235519 152658 -24428 87112 259341
14712B59341l9380r7734j00895j50035J39542J17459j3552k9725m8233L04487
$$ 259341 219961 122227 21332 -128703 10839 128298 114746 85021 36788 341275
14702C41275J9529o1656j71859k2093k47239r26J75033Q7278j34076r826Q4316
$$ 341275 360804 299148 127289 105196 -142043 -142969 32064 119342 -14734 -24560 59756
14691E9756j07242j76964Q5889K9638m5930R2815R310J06765l7141n9082j38796
$$ 59756 -47486 -224450 -138561 -108923 -154853 -62038 -52728 54037 16896 -42186 -180982
14680a80982j34671p4860P3478O6509j22900l2359L01084K75796R7342r6082j30295
$$ -180982 -315653 -390513 -317035 -250526 -373426 -405785 -104701 171095 268437 172355 42060
14669D2060l5895L54187q90n7633q482n2662k087o4408k32489j37694J10886J34161
$$ 42060 6165 360352 359462 301829 293347 240685 238598 174190 -58299 -195993 -85107 49054
14657D9054R600k3077l9180j26699J871p666L358k3749R3826J81846J82579j75433
$$ 49054 58654 35577 -3603 -130302 -128431 -136097 -132739 -156488 -62662 119184 301763 126330
14645A26330j60769p9843K3778Q4553j94767p1255J75983J22298N8056j33071
$$ 126330 -34439 -114282 -90504 -5951 -200718 -271973 -95990 26308 84364 -48707
14635d8707m6566k1355J04770N8494k42439P8510k3158P4412J96195p963O9968
$$ -48707 -95273 -116628 -11858 46636 -195803 -117293 -140451 -66039 130156 122193 192161
14624A92161J08901k42191m0205j36135R320j67668k0691P9792Q5133J51473P6994
$$ 192161 301062 58871 18666 -117469 -108149 -275817 -296508 -216716 -131583 19890 96884
14613I6884j78203O6852K771p5296n6687J66096j66087l86148J04968K88405N9409
$$ 96884 -81319 -14467 -11696 -86992 -143679 22417 -143670 -529818 -424850 -136445 -77036
14602g7036J2979n796n0723J51508M554l23364n4870J38861J77112o9581o9878
$$ -77036 -64057 -69853 -120576 30932 35486 -287878 -342748 -203887 -26775 -96356 -166234
14591a66234k3557R6222O2746j31177p6670O2898l4121j59909o2815J31057K48365
$$ -166234 -189791 -93569 -30823 -162000 -238670 -175772 -209893 -369802 -432617 -301560 -53195
14580e3195M1561K2736N7789j12752k6440m512m5061O0725j04391o2784J15658
$$ -53195 -11634 11102 68891 -43861 -70301 -74813 -119874 -59149 -163540 -226324 -110666
14569a10666K50528K62427K9173k64477l18363L5355J24022J91455l2083n1846
$$ -110666 139862 402289 431462 166985 -151378 -116023 7999 199454 167371 115525
14559A15525r976r0490j62238r8715R7834P0812o6724o3145K63133P2801j21797
$$ 115525 105549 15059 -147179 -245894 -148060 -77248 -143972 -207117 56016 128817 7020
14548G020j60989J0961J08523J92321j99258k04900P5320J88084Q4724j65055
$$ 7020 -153969 -143008 -34485 157836 -41422 -246322 -171002 17082 101806 -63249
14538f3249k95403j66561J34935K57027J55439R9289Q291r0862j73472J69730
$$ -63249 -358652 -525213 -390278 -133251 22188 121477 129768 38906 -134566 35164
14528C5164j947j57705J4495J68440O7320O2485K17158m841k37861k97496J18130
$$ 35164 33217 -124488 -109993 58447 125767 188252 405410 400569 162708 -134788 -16658
14517a6658K41513J15740j91806n1672P2179r6984P4691O3916j66815j71330n5475
$$ -16658 224855 340595 148789 97117 169296 72312 147003 210919 44104 -127226 -182701
14506a82701j10104o0277J66362J10911q0092K4912M3198p3987j54631r5881J72091
$$ -182701 -292805 -353082 -186720 -75809 -155901 -130989 -87791 -161778 -316409 -412290 -240199
14495b40199J90422n4149R3225l6052k9194Q6895K796K2610m3706j60718p1783
$$ -240199 -49777 -103926 -10701 -46753 -75947 10948 13744 36354 -7352 -168070 -239853
14484b39853K71617J46876k64956m5227J28136j81474j91106K14678K38123q2566
$$ -239853 31764 178640 -86316 -131543 -3407 -184881 -375987 -161309 76814 -5752
14474e752J1221P2536l581J74245J35244j4608r3472j51495j47435M6862J04040
$$ -5752 5469 78005 74424 248669 383913 369305 275833 124338 -23097 23765 127805
14463A27805l1715Q7020J73802k27275l61318J41327p2444P737O2131Q9737J53488
$$ 127805 96090 183110 356912 129637 -231681 -90354 -162798 -155061 -92930 -3193 150295
14452A50295K77803l403k79828K771k3810n3259M1986K6239P3333p7966k10921
$$ 150295 428098 424695 144867 147638 123828 70569 112555 138794 212127 134161 -76760
14441g6760J84984N5104J20993K01905n5640n960l5782m12098j62383N147l5755
$$ -76760 108224 163328 284321 486226 430586 424626 388844 -23254 -185637 -180490 -216245
14430b16245J28850K47589J74209p033j04888k9347j19808o1048N7986j92749
$$ -216245 -87395 160194 334403 327370 222482 193135 73327 12279 70265 -122484
14420a22484Q5533O087M0772R0244l3840j26115Q574M9917K08197J6020l33814
$$ -122484 -36951 -30864 9908 100152 66312 -59803 -51229 -1312 206885 222905 -110909
14409a10909j07080N5731J29416J7642R3268r4985R5779K6259K0874j11909o8948
$$ -110909 -217989 -162258 -32842 -15200 78068 -16917 78862 105121 125995 14086 -54862
14398e4862Q5189K50409L3625j33732j33855M6546R0244R7012j26267k1737j43608
$$ -54862 30327 280736 314361 180629 46774 93320 183564 280576 154309 132572 -11036
14387a1036P5064J85517n0150j36376j09195K814j82611j17222j20258J30833
$$ -11036 64028 249545 199395 63019 -46176 -43362 -225973 -343195 -463453 -332620
14377c32620N0757J46365J56774P2051k24164J0659r0461J18425k8703r5433o1868
$$ -332620 -281863 -135498 21276 93327 -130837 -120178 -210639 -92214 -120917 -216350 -278218
14366b78218L3223R0264j39742n8426J14228J79307O7163O3405J37846j18201
$$ -278218 -244995 -154731 -294473 -352899 -238671 -59364 7799 71204 209050 90849
14356I0849l6585k2124o4333j04726J11441R1307o6656o1964m725j4663K8460
$$ 90849 54264 32140 -32193 -136919 -25478 65829 -827 -62791 -67516 -82179 -53719
14345e3719m4002O0579R8386k1705j93238J00440Q1808J39078j29382n2672q3508
$$ -53719 -97721 -37142 61244 39539 -153699 -53259 28549 167627 38245 -14427 -97935
14334i7935N7215K24935K23738l0487j95437n4307n1380Q572j35392k29885K21996
$$ -97935 -40720 184215 407953 377466 182029 127722 76342 84914 -50478 -280363 -58367
14323e8367K4845r5033o79M9034o6954j73444K18761R9453O8390R6088J02233
$$ -58367 -33522 -128555 -129234 -80200 -147154 -320598 -101837 -2384 66006 162094 264327
14312B64327q9276m3389q495j26377m4390p9262n4693o4144m2658J6517M3403
$$ 264327 175051 131662 123167 -3210 -47600 -126862 -181555 -245699 -288357 -271840 -228437
14301b28437k1256Q0656N7511J29506J88130K49684k8426k87683J6182q9256k17081
$$ -228437 -249693 -169037 -111526 17980 206110 455794 427368 139685 155867 66611 -150470
14290a50470n5085L79484J45217j35041j78928p1536Q5944l756j33474j94072
$$ -150470 -205555 173929 319146 184105 5177 -66359 19585 15829 -117645 -311717
14280c11717r3147N914J13465N8496J68681P8024Q6182O4748j2129j33098o96
$$ -311717 -404864 -398950 -285485 -226989 -58308 19716 105898 170646 158517 25419 24723
14269B4723R0594j1331Q2571J60762L4190l06331j67306K2148M3424Q575o427
$$ 24723 115317 103986 186557 347319 381509 75178 -92128 -69980 -26556 -17981 -24408
14258b4408k2942r575j08045n0105K60115M1291j60542q5846Q9738J03183K2733
$$ -24408 -47350 -56925 -164970 -215075 45040 86331 -74211 -160057 -70319 32864 55597
14247E5597J9901p5291N1157O8572o2025j84124r6877J22425n7570k3355J87253
$$ 55597 75498 207 51364 119936 57911 -126213 -223090 -100665 -158235 -181590 5663
14236E663J70127k2667j26912P7634J6381p015N6353q5105o6195j64898k9511
$$ 5663 175790 153123 26211 103845 120226 113211 169564 84459 18264 -146634 -176145
14225a76145N9962J27223j39393j18291k0710k371j17221o7244R1606J65824j23543
$$ -176145 -116183 11040 -128353 -246644 -267354 -269725 -386946 -454190 -362584 -196760 -320303
14214c20303j33348J0877K71595o2484m392R0618J77881J00430m930j6508N6545
$$ -320303 -453651 -442774 -171179 -233663 -238055 -147437 30444 130874 125944 109436 165981
14203A65981k3271P524J5010r4143k69781j1070M9339p3268R1133n3680k4500
$$ 165981 142710 150234 165244 71101 -198680 -209750 -160411 -233679 -142546 -196226 -220726
14192b20726J40261Q4122j01122p1523j59366K1958J03024K43718K08124j58357
$$ -220726 -80465 3657 -97465 -168988 -328354 -306396 -203372 40346 248470 90113
14182I0113K0417J33798M3980j28127q1718r6853r0581n1670k2489J01450L7479
$$ 90113 110530 244328 288308 160181 78463 -18390 -108971 -160641 -183130 -81680 -44201
14171d4201J57607j32636j19352N0444L6110k735j88035J13725J40180k43783
$$ -44201 113406 -19230 -138582 -88138 -52028 -54763 -242798 -129073 11107 -232676
14161b32676k21450J05729J52910K11302J54810J3046q5930K0731j19508l15158
$$ -232676 -454126 -348397 -195487 15815 170625 183671 97741 118472 -1036 -316194
14151c16194m1881J48700O9029P0878n6105P647K22682K18380J70352j83974k29942
$$ -316194 -358075 -209375 -140346 -69468 -125573 -117926 104756 323136 493488 309514 79572
14140G9572Q9723r9495j44337j97414j8445J98162K08389k00988l15904k6366
$$ 79572 169295 69800 -74537 -271951 -290396 -92234 116155 -84833 -400737 -427103
14130d27103J75170J44371j6907K7360K02695n790j41638m1507R9378k1673j33463
$$ -427103 -251933 -107562 -124469 -97109 105586 99796 -41842 -83349 16029 -5644 -139107
14119a39107P3269N1967p2913j70747l4095J78752P4742j97282R4375R2100n3653
$$ -139107 -65838 -13871 -86784 -257531 -291626 -112874 -38132 -235414 -141039 -48939 -102592
14108a02592K27300q0122r3847K29098L5132J1912o2178j89676k12335l5274J75919
$$ -102592 124708 44586 -49261 179837 214969 226881 164703 -24973 -237308 -272582 -96663
14097i6663K67610k55698o2070l6644K5344K07146k9124l2620J5518j09795J7542
$$ -96663 170947 -84751 -146821 -183465 -158121 49025 19901 -12719 2799 -106996 -89454
14086h9454P4517K21221n7991O3393k3408j28497J33865m8336j03014O9062J43406
$$ -89454 -14937 206284 148293 211686 188278 59781 193646 145310 42296 111358 254764
14075B54764j32361k8911k72708k49277J23227J29254n731J19034O5336L6241
$$ 254764 122403 93492 -179216 -428493 -305266 -176012 -181743 -62709 2627 38868
14065C8868j07636O2197J25814j19904j58401K49713O1199R9378l5689r4203j37489
$$ 38868 -68768 -6571 119243 -661 -159062 90651 151850 251228 215539 121336 -16153
14054a6153j53349J25959J26946o7111n7988K6378k1198r303K06767Q5141O6136
$$ -16153 -169502 -43543 83403 16292 -41696 -15318 -36516 -45819 160948 246089 312225
14043C12225n4329k04161j4687n8289r6512M3736P532K7467R4275J23031n3715
$$ 312225 257896 53735 39048 -19241 -115753 -72017 -64485 -37018 57257 180288 126573
14032A26573O7074p8278K8499N5477j5382m82N2161J7192j06220n7777j01493
$$ 126573 193647 115369 143868 199345 183963 183481 235642 252834 146614 88837 -12656
14021a2656q9255j46178P2944J47701j75854m2550J57633m64J7493J5325q6702
$$ -12656 -101911 -248089 -175145 -27444 -203298 -245848 -88215 -88679 -71186 -55861 -142563
14010a42563J45863L0894K2323J50235P3105k26189k03649J7933K81382K54169
$$ -142563 3300 34194 56517 206752 279857 53668 -149981 -132048 149334 403503
14000D03503o658k48080o2359l5271O9866N5910n7307k35175j76288J66669J78946
$$ 403503 396845 148765 86406 51135 121001 176911 119604 -115571 -291859 -125190 53756
13989E3756j0803p1630p1326k6636l7310p2N4774K74459r2157k34052M7047J17812
$$ 53756 42953 -28677 -100003 -126639 -163949 -164021 -109247 165212 73055 -160997 -113950 3862
13977C862j54447o3991Q3686O555J44653j06046J42631J63828n4743k8637j98177
$$ 3862 -150585 -214576 -130890 -124335 20318 -85728 56903 220731 165988 137351 -60826
13966f0826K2563O5692j39117L0745J85878P0699N456J9832N8005J00107P7659
$$ -60826 -38263 27429 -111688 -80943 104935 175634 181090 200922 258927 359034 436693
13955D36693j56169j00346J01129l9080j32983p3436j16254P2048J06288k6752
$$ 436693 280524 180178 281307 242227 109244 35808 -80446 -8398 97890 71138
13945G1138J6000R554N0511l8597j40905l727O247m3234m504N7333K61383J59073
$$ 71138 87138 96692 147203 108606 -32299 -36026 -29779 -73013 -77517 -20184 241199 400272
13933D00272j19466r8072j41784O9901m61k36900M2371J94065Q5504K6462J30999
$$ 400272 280806 182734 40950 110851 110390 -126510 -84139 109926 195430 221892 352891
13922C52891k6998N3685k7851j20462j46749r3632J45555J17616j69887j71626
$$ 352891 325893 379578 351727 231265 84516 -9116 136439 254055 84168 -87458
13912h7458J44949N2869M435J32580M521J3099m9810k08222M4834R2430M1109
$$ -87458 57491 110360 114795 247375 251896 264995 215185 6963 51797 144227 185336
13901A85336o1152n1377k1109p3534l1434J561R743l0086o4271J38170j9202q6357
$$ 185336 124184 72807 51698 -21836 -53270 -51709 -41966 -72052 -136323 1847 -17355 -103712
13889a03712R9540J2641l5083Q1784o6550M0744M7617r9773q1162O6245J43686
$$ -103712 -4172 8469 -26614 55170 -11380 29364 76981 -22792 -103954 -37709 105977
13878A05977l0702l32385n5082J60410J38553K4062J69743K2015j43270J06834
$$ 105977 75275 -257110 -312192 -151782 -13229 10833 180576 202591 59321 166155
13868A66155Q6262j13499R3469L7276k23583j97790K5608O3162l1875K1448j37405
$$ 166155 252417 138918 232387 269663 46080 -151710 -126102 -62940 -94815 -73367 -210772
13857b10772j31413J58666Q7417k019J25737R2013r5478l6152l0279M7671j86580
$$ -210772 -342185 -183519 -96102 -98121 27616 119629 24151 -12001 -42280 5391 -181189
13846a81189K6235J72248l820p0976Q0798L6760j33420r4077o898R4334J24065
$$ -181189 -154954 17294 13474 -57502 23296 60056 -73364 -167441 -174339 -80005 44060
13835D4060P3272M4919j30221L2354m9663p0797O7386J0821N942j22898P3504
$$ 44060 117332 162251 32030 64384 14721 -56076 11310 22131 28073 -94825 -21321
13824b1321J16807O9482k19950n9868J43937M4191K37684M0708j32425q8957O2
$$ -21321 95486 164968 -54982 -114850 29087 73278 310962 351670 219245 130288 130350
13813A30350j35744j16897j8618O0834P4275l5351J22518o5672j96389J05104
$$ 130350 -5394 -122291 -140909 -80075 -5800 -41151 81367 15695 -180694 -75590
13803g5590j02919J9437J53065j1860J63397K9206M452n9444K14278K4446l13199
$$ -75590 -178509 -159072 -6007 -17867 145530 174736 179188 119744 334022 358468 45269
13792D5269q4866L3205O5070o4637j86475K5394P9311m436k562n7115J99590J44757
$$ 45269 -39597 -6392 58678 -5959 -192434 -167040 -87729 -92165 -94727 -151842 47748 192505
13780A92505K4830l7486j98744j30844r8446Q2552O4900J24322j20722o5943P1048
$$ 192505 217335 179849 -18895 -149739 -248185 -165633 -100733 23589 -97133 -163076 -92028
13769i2028K29249J54306j17943j02317j01701M8424L7717j10785j42070q6925
$$ -92028 137221 291527 173584 71267 -30434 17990 55707 -55078 -197148 -284073
13759b84073J45182K34385j19756J4123M2322N481m0242K6432P6160j23672k5218
$$ -284073 -138891 95494 -24262 -10139 32183 37664 -2578 23854 100014 -23658 -48876
13748d8876l6191r4003J47673P2302m7495l8073K6763p0292K06129J61380j66389
$$ -48876 -85067 -179070 -31397 40905 -6590 -44663 -17900 -88192 117937 279317 112928
13737A12928J1382j99400q0068j1136R9778K20127N3314J49943k17597j11787
$$ 112928 124310 -75090 -155158 -166294 -66516 153611 206925 356868 139271 27484
13727B7484J09629N6544j81187J32525K2679o5360j1281q5339n0351K273n0646
$$ 27484 137113 193657 12470 144995 167674 102314 91033 5694 -44657 -42384 -93030
13716i3030P6368J11525m2651k59169L3368P6593o6283m2916K7267J9112L1411
$$ -93030 -16662 94863 52212 -206957 -173589 -96996 -163279 -206195 -178928 -159816 -128405
13705a28405p8568N4219p4006n5554J01118J43425J24862K54086J6584k27265
$$ -128405 -206973 -152754 -226760 -282314 -181196 -37771 87091 341177 357761 130496
13695A30496l97687q1166J77178J66553K0546p9603m9038r7826L4579L4221j19042
$$ 130496 -267191 -348357 -171179 -4626 15920 -63683 -112721 -210547 -175968 -141747 -260789
13684b60789O8921r0162P0K77734K31210j87911M468K64458j94998j40055J28247
$$ -260789 -191868 -282030 -281960 -4226 226984 39073 43541 307999 113001 -27054 101193
13673A01193R3352J7095p4729N680J44102r0204j6223R9534j78323k18065O1659
$$ 101193 194545 211640 136911 142591 286693 196489 180266 279800 101477 -116588 -54929
13662e4929J57001O9490m0015q2188J047Q5255k4824J4728o6426k7358J8627n3393
$$ -54929 102072 171562 131547 49359 50406 135661 110837 125565 59139 31781 50408 -2985
13650b985r9167M3590l9798n4779m297R4929j67546q2070j03973J24404j02630
$$ -2985 -102152 -58562 -98360 -153139 -157436 -62507 -230053 -312123 -416096 -291692 -394322
13639c94322R2605L43323R9684r106M1455J16439J5650j08681j39007k2297j26050
$$ -394322 -301717 41606 141290 132184 173639 290078 305728 197047 58040 35743 -90307
13628i0307O1316J87477J15574q0743j76895k5377j14690N0784n5105K8782j57636
$$ -90307 -28991 158486 274060 193317 16422 -8955 -123645 -72861 -127966 -99184 -256820
13617b56820j36810J32517o9935j2141Q5150K04436J15813r6278j55991r9261
$$ -256820 -393630 -261113 -331048 -343189 -258039 -53603 62210 -34068 -190059 -289320
13607b89320J01002J87282P4337L4165j14211j58408K3889m6116r2664K1627K24117
$$ -289320 -188318 -1036 73301 107466 -6745 -165153 -141264 -187380 -280044 -258417 -34300
13596c4300q182k9795R5235J7085R3252L3515l9851o275J4745o2494K24632J18773
$$ -34300 -42482 -72277 22958 40043 133295 166810 126959 120684 135429 72935 297567 416340
13584D16340m9837l49775j27386Q6452J86377j2209m3022L2157J18174N745j18409
$$ 416340 366503 16728 -110658 -24206 162171 149962 106940 139097 257271 263016 144607
13573A44607j45734l33914j04423J76205J35968o9353K2199J20059m0289K6700
$$ 144607 -1127 -335041 -439464 -263259 -127291 -196644 -174445 -54386 -94675 -67975
13563f7975q4425K1275J76906k6972o0674n8229o7898j8441J56671J20964P3569
$$ -67975 -152400 -131125 45781 18809 -41865 -100094 -167992 -186433 -29762 91202 164771
13552A64771P0659j2363p7357J3137j04678k5884o4046L3379j6129r7257N024
$$ 164771 235430 223067 145710 158847 54169 28285 -35761 -2382 -18511 -115768 -110744
13541a10744q1478N8071M7426J83368J40085P4845J27612k92199l06430j02674
$$ -110744 -192222 -134151 -86725 96643 236728 311573 439185 146986 -159444 -262118
13531b62118J87048J26324j162n5652M4029k9526L9452l7401L9625j7212J61122
$$ -262118 -75070 51254 50092 -5560 38469 8943 48395 10994 50619 33407 194529
13520A94529J27313L8765k36068j83470O4728J83729r860Q8031M5101k19316k63420
$$ 194529 321842 360607 124539 -58931 5797 189526 179666 267697 312798 93482 -169938
13509a69938K14740J14509o2429m226l7630J10577l3673j95151P9849L2258P4744
$$ -169938 44802 159311 96882 92656 55026 165603 131930 -63221 16628 48886 123630
13498A23630K7983l6455R6193o3543n7784j8103R335j39012o6686M1050L5032
$$ 123630 151613 115158 211351 147808 90024 71921 81256 -57756 -124442 -83392 -48360
13487d8360P8968N0239j4628q6325j30508J7501k2468K70426J63206l779j42640
$$ -48360 30608 80847 66219 -20106 -150614 -133113 -155581 114845 278051 274272 131632
13476A31632K8045r7662o3976L8128J82350R4169j62867n7408n5743Q244k5567
$$ 131632 159677 62015 -1961 36167 218517 312686 149819 92411 36668 44912 19345
13465A9345k4517m5936j2264L8530M0452r0277j26667J44801R6897J22553K657
$$ 19345 -5172 -51108 -63372 -24842 15610 -74667 -201334 -56533 40364 162917 165574
13454A65574j54100j1040q888Q7285K9524M7604j6188o3629M4927o402L3190J18007
$$ 165574 11474 434 -8454 78831 108355 155959 139771 76142 121069 114667 147857 265864
13442B65864m8020k56159j36912J11979J66522k395k1867J61939k5384J76672
$$ 265864 217844 -38315 -175227 -63248 103274 100879 79012 240951 215567 392239
13432C92239j9983j10786K757J31662O4722r2894P0501L9093l15133l64850M0718
$$ 392239 372256 261470 264227 395889 460611 367717 438218 477311 162178 -202672 -161954
13421a61954k1485n9273J90382J03450J03377J39795K772j45869n3739n1139p3757
$$ -161954 -183439 -242712 -52330 51120 154497 294292 297064 151195 97456 46317 -27440
13410b7440M6222K79665N7630R724k8217j87210P2754q0942j83903k6368j61177
$$ -27440 18782 298447 356077 365801 337584 150374 223128 142186 -41717 -68085 -229262
13399b29262O6683J80372k9695J190Q3738L3335O6582l3929j14259j80401J74678
$$ -229262 -162579 17793 -11902 -10712 73026 106361 172943 139014 24755 -155646 19032
13388A9032J15376j536j4129q7602P741P921l0430k4136J76015M4919o2463j26309
$$ 19032 134408 132872 118743 31141 38882 46803 16373 -7763 168252 213171 150708 24399
13376B4399k03586k2384Q5274j2683m4592N9764J74629J35605j42857k13300o9677
$$ 24399 -179187 -201571 -116297 -128980 -173572 -113808 60821 196426 53569 -159731 -229408
13365b29408N3023J19854j42967m3892K65129j7033J93262J92582k94927k02810
$$ -229408 -176385 -56531 -199498 -243390 21739 4706 197968 390550 95623 -107187
13355a07187J37828N7310Q856J23866P7786L8503j66401j623p0054N297m030n1858
$$ -107187 30641 87951 96807 220673 298459 336962 170561 168938 98884 104181 100151 48293
13343D8293r8100J95307J52777j68407K3926J8039m4353J55168n9514j71229m7904
$$ 48293 -49807 145500 298277 129870 153796 171835 127482 282650 223136 51907 4003
$$ [...]
##END NTUPLES=NMR SPECTRUM
##END=
