##TITLE=Analysis number 312889
Compound Code km 09875
Project Code adrs
Chemist Name endeavour
##JCAMPDX= 6.0         $$ Bruker NMR JCAMP-DX V2.0
##DATA TYPE= NMR SPECTRUM
##DATA CLASS= NTUPLES
##ORIGIN= Bruker BioSpin GmbH
##OWNER= NMR
$$ XWIN-NMR		Version 3.5
$$ Wed Aug 17 12:06:25 2005 GMT Daylight Time (UT+1h)  MAYBRIDGE\NMR@NMR_250MHZ
##.OBSERVE FREQUENCY= 250.131544655141
##.OBSERVE NUCLEUS= ^1H
##.ACQUISITION MODE= SIMULTANEOUS (DQD)
##.ACQUISITION SCHEME= undefined
##.AVERAGES= 16
##.DIGITISER RES= 18
##SPECTROMETER/DATA SYSTEM= dpx250
##.PULSE SEQUENCE= zg30
##.SOLVENT NAME= CDCl3
##.SHIFT REFERENCE= (INTERNAL, CDCl3, 0, 16.522)
##AUDIT TRAIL= $$ (NUMBER, WHEN, WHO, WHERE, WHAT)
$$ ##TITLE= Audit trail, XWIN-NMR		Version 3.5
$$ ##JCAMPDX= 5.01
$$ ##ORIGIN= Bruker BioSpin GmbH
$$ ##OWNER= NMR
$$ C:\u/data/dgb/nmr/ADRS/8060/pdata/1/auditp.txt
$$ ##AUDIT TRAIL=  $$ (NUMBER, WHEN, WHO, WHERE, WHAT)
(   1,<2005-08-17 12:06:05.32 +100>,<MAYBRIDGE\NMR>,<NMR_250MHZ>,
      <created by zg, POWCHK disabled, PULCHK disabled
       configuration hash MD5:
       62 19 C7 07 E1 42 D1 B7 37 6C 3D D0 77 39 F9 E6
       data hash MD5: 64K
       DF 73 D5 81 06 6E 06 5D 2E D2 FE 50 B0 9E 35 70>)
(   2,<2005-08-17 12:06:17.56 +100>,<MAYBRIDGE\NMR>,<NMR_250MHZ>,
      <Start of raw data processing
       ef LB = 0.3 FT_mod = 6 PKNL = 1 SI = 32K 
       data hash MD5: 32K
       EA 99 A6 7A 7D 2A 89 CE DE 43 DA B0 D4 03 25 49>)
(   3,<2005-08-17 12:06:19.28 +100>,<MAYBRIDGE\NMR>,<NMR_250MHZ>,
      <apk 
       data hash MD5: 32K
       B9 70 AF CA 61 66 78 05 8F AF 7A 15 CB 64 A3 1D>)
(   4,<2005-08-17 12:06:20.04 +100>,<MAYBRIDGE\NMR>,<NMR_250MHZ>,
      <abs ABSG = 5 
       data hash MD5: 32K
       46 F4 F1 A9 E6 8F 3E CE 25 47 FF 12 DB 87 15 ED>)
$$ ##END=
$$ 
$$ hash MD5
$$ 14 1B EF 42 AF B9 EA 01 23 76 36 DF 99 E4 E8 D6
##$RELAX= 
##$RELAX= 
##$RELAX= 
##$RELAX= 
##$RELAX= 
##$RELAX= 
##$RELAX= 
$$ Bruker specific parameters
$$ --------------------------
##$DU= <C:\u>
##$EXPNO= 8060
##$NAME= <ADRS>
##$PROCNO= 1
##$TYPE= <nmr>
##$USER= <dgb>
##$AMP= (0..31)
100 100 100 100 100 100 100 100 100 100 100 100 100 100 100 100 100 100 
100 100 100 100 100 100 100 100 100 100 100 100 100 100 
##$AQSEQ= 0
##$AQ_mod= 3
##$AUNM= <au_zg>
##$AUTOPOS= <19 >
##$BF1= 250.13
##$BF2= 250.13
##$BF3= 250.13
##$BF4= 250.13
##$BF5= 500.13
##$BF6= 500.13
##$BF7= 500.13
##$BF8= 500.13
##$BYTORDA= 1
##$CFDGTYP= 0
##$CFRGTYP= 5
##$CHEMSTR= <none>
##$CNST= (0..31)
1 1 145 1 1 1 1 1 1 1 1 1 1 1 1 1 1 1 1 1 1 1 1 1 1 1 1 1 1 1 1 1 
##$CPDPRG= <>
##$CPDPRG1= <>
##$CPDPRG2= <>
##$CPDPRG3= <>
##$CPDPRG4= <mlev>
##$CPDPRG5= <mlev>
##$CPDPRG6= <mlev>
##$CPDPRG7= <mlev>
##$CPDPRG8= <mlev>
##$CPDPRGB= <>
##$CPDPRGT= <>
##$D= (0..31)
0 1 0 0 0 0 0 0 0 0.06 0 0 0 0 0 0 0.0002 0 0 0 0 0 0 0 0 0 0 0 0 0 0 
0 
##$DATE= 1124276764
##$DBL= (0..7)
120 120 120 120 120 120 120 120 
##$DBP= (0..7)
150 150 150 150 150 150 150 150 
##$DBP07= 0
##$DBPNAM0= <>
##$DBPNAM1= <>
##$DBPNAM2= <>
$$ [...]
##$SUBNAM7= <"">
##$SUBNAM8= <"">
##$SUBNAM9= <"">
##$SW= 20.6930455092707
##$SWIBOX= (0..15)
0 0 3 0 0 0 0 0 0 0 0 0 0 0 0 0 
##$SW_h= 5175.983436853
##$TD= 65536
##$TD0= 1
##$TE= 295.16
##$TE2= 300
##$TE3= 300
##$TEG= 300
##$TL= (0..7)
0 120 120 120 120 120 120 120 
##$TP= (0..7)
150 150 150 150 150 150 150 150 
##$TP07= 0
##$TPNAME0= <>
##$TPNAME1= <>
##$TPNAME2= <>
##$TPNAME3= <>
##$TPNAME4= <>
##$TPNAME5= <>
##$TPNAME6= <>
##$TPNAME7= <>
##$TPOAL= (0..7)
0.5 0.5 0.5 0.5 0.5 0.5 0.5 0.5 
##$TPOFFS= (0..7)
0 0 0 0 0 0 0 0 
##$TUNHIN= 0
##$TUNHOUT= 0
##$TUNXOUT= 0
##$USERA1= <user>
##$USERA2= <user>
##$USERA3= <user>
##$USERA4= <user>
##$USERA5= <user>
##$V9= 5
##$VALIST= <valist>
##$VCLIST= <CCCCCCCCCCCCCCC>
##$VD= 0
##$VDLIST= <DDDDDDDDDDDDDDD>
##$VPLIST= <PPPPPPPPPPPPPPP>
##$VTLIST= <TTTTTTTTTTTTTTT>
##$WBST= 1024
##$WBSW= 4
##$XGAIN= (0..3)
0 0 0 0 
##$XL= 0
##$YL= 0
##$YMAX_a= 411657
##$YMIN_a= -512176
##$ZGOPTNS= <>
##$ZL1= 120
##$ZL2= 120
##$ZL3= 120
##$ZL4= 120
##$ABSF1= 16.522
##$ABSF2= -4.171173
##$ABSG= 5
##$ABSL= 3
##$ALPHA= 0
##$AQORDER= 0
##$ASSFAC= 0
##$ASSFACI= 0
##$ASSFACX= 0
##$ASSWID= 0
##$AUNMP= <proc_1d>
##$AZFE= 0.1
##$AZFW= 0.1
##$BCFW= 0
##$BC_mod= 0
##$BYTORDP= 0
##$COROFFS= 0
##$CY= 12.5
##$DATMOD= 1
##$DC= 0
##$DFILT= <>
##$DTYPP= 0
##$F1P= 14.0000005364418
##$F2P= -0.99999901652339
##$FCOR= 0.5
##$FTSIZE= 32768
##$FT_mod= 6
##$GAMMA= 0
##$GB= 0
##$INTBC= 1
##$INTSCL= 1
##$ISEN= 128
##$LB= 0.3
##$LEV0= 0
##$LPBIN= 0
##$MAXI= 10000
##$MC2= 0
##$MEAN= 0
##$ME_mod= 0
##$MI= 0
##$NCOEF= 0
##$NC_proc= -5
##$NLEV= 6
##$NOISF1= 0
##$NOISF2= 0
##$NSP= 0
##$NTH_PI= 0
##$NZP= 0
##$OFFSET= 16.522
##$PC= 1
##$PHC0= 128.9311
##$PHC1= 6.028467
##$PH_mod= 1
##$PKNL= yes
##$PPARMOD= 0
##$PSCAL= 4
##$PSIGN= 0
##$REVERSE= no
##$SF= 250.13
##$SI= 32768
##$SIGF1= 0
##$SIGF2= 0
##$SINO= 400
##$SIOLD= 32768
##$SREGLST= <1H.CDCl3>
##$SSB= 0
##$STSI= 32768
##$STSR= 0
##$SW_p= 5175.98343685301
##$SYMM= 0
##$S_DEV= 0
##$TDeff= 65536
##$TDoff= 0
##$TI= <Analysis number 999999
Compound Code 99
Book Reference 9
Project Code 9>
##$TILT= no
##$TM1= 0
##$TM2= 0
##$TOPLEV= 0
##$USERP1= <user>
##$USERP2= <user>
##$USERP3= <user>
##$USERP4= <user>
##$USERP5= <user>
##$WDW= 1
##$XDIM= 32768
##$YMAX_p= 592862443
##$YMIN_p= -105835
$$ End of Bruker specific parameters
$$ ---------------------------------
##NTUPLES= NMR SPECTRUM
##VAR_NAME=  FREQUENCY,     SPECTRUM/REAL,   SPECTRUM/IMAG
##SYMBOL=    X,             R,               I
##VAR_TYPE=  INDEPENDENT,   DEPENDENT,       DEPENDENT
##VAR_FORM=  AFFN,          ASDF,            ASDF
##VAR_DIM=   32768,         32768,           32768
##UNITS=     HZ,            ARBITRARY UNITS, ARBITRARY UNITS
##FACTOR=    0.157963299565203, 1,           1
##FIRST=     4132.6476996994, 0,             0
##LAST=      -1043.33573715361, 0,           0
##MIN=       -1043.33573715361, -105835,     0
##MAX=       4132.6476996994, 592862443,     0
$$ Real data points
##PAGE= N=1
##DATA TABLE= (X++(R..R)), XYDATA
$$ [...]
16605B883r738l3044p182p379n00J2220J3988j0195P369o177o490N891M629k009
16591c5734p637M026m129p769N663J5635N028Q472M779j5740M656R5K700j968
16577b1923j06j759r369n353J943K860q135J7701m086r44J4284K6194P06n589
16563F424O346J0954K961k4969k6267L243K4090p407J2530l5979l1857O202P640
16550d6089l347L525n86k0935j594J0081J3131j3093m556k963O483K5716J4489
16537a9738o588j4172j2486n871R217J1774N14O321j2243n271J814R170J6743
16524b0816j787M209J9561l795j1261O453J8709j234p84n339k7137J6936L1489
16511B5204l828k9271k9160NM552J1996m22j7203o511J9142q583L559r647n884
$$ plain form
16605 2883 -6855 -39899 -47081 -54460 -54960 -42740 -28752 -38947 -31578 -37755 -44245 -38354 -33725 -35734
16591 -35734 -43371 -39345 -43474 -51243 -45580 -29945 -24917 -16445 -11666 -27406 -22750 -22655 -19955 -21923
16577 -21923 -22029 -23788 -33157 -38510 -36567 -33707 -41842 -24141 -28227 -29171 -14887 11307 12013 6424
16563 6424 12770 23724 26685 1716 -24551 -21308 2782 -4625 7905 -28074 -59931 -53729 -46089
16550 -46089 -49436 -45911 -46497 -67432 -69026 -58945 -45814 -58907 -63463 -66426 -59943 -34227 -19738
16537 -19738 -26326 -40498 -52984 -58855 -49638 -37864 -37350 -31029 -43272 -48543 -46729 -37559 -20816
16524 -20816 -22603 -18394 1167 -2628 -13889 -7436 11273 10039 9255 3916 -23221 -6285 25204
16511 25204 21376 -7895 -37055 -37050 -32498 -20502 -20924 -38127 -44638 -25496 -34079 -30520 -40167 -46051
16497d6051K0593J081k7905j1333j6469r414J4792J1774M616J7287J0264j3049
16485d3814p032O547j6398p68J3606n49k401P087O732j4778k4683J8011J0382
16472d8058J1791P959L191m228m820n360R28l313r521Q934J7096J5223J638j0581
16458a9121k2464l2674M186J1683K4108Q56o542j8211j5850K745L220J043j21
16445f7142L831O063j218j1576q023J362J9585Q072o194J6523K711k2733k8536
16432h7275J765L1894N149j0055M894J0196L656J4576o02o186j9804P241j0997
16419e5548k4693m490N801R410K4135J5978k475j9151j1216J388o494J5165Q902
16406d3288J4518j5792l050K884j2972O285P845M26j5283m997J7446L204k1709
$$ plain form
16497 -46051 -25458 -24377 -52282 -63615 -80084 -89498 -74706 -62932 -58316 -41029 -30765 -43814
16485 -43814 -50846 -44299 -60697 -61465 -47859 -48408 -50809 -43722 -36990 -51768 -76451 -58440 -48058
16472 -48058 -36267 -28308 -25117 -29345 -34165 -39525 -38597 -41910 -51431 -42497 -25401 -10178 -8540 -19121
16458 -19121 -41585 -74259 -70073 -58390 -34282 -33426 -39968 -58179 -74029 -71284 -68064 -67021 -67142
16445 -67142 -63311 -57248 -58466 -70042 -78065 -76703 -57118 -49046 -55240 -38717 -36006 -58739 -87275
16432 -87275 -85510 -53616 -48467 -58522 -53628 -43432 -39776 -25200 -25802 -31988 -51792 -44551 -55548
16419 -55548 -80241 -84731 -78930 -69520 -45385 -29407 -31882 -51033 -62249 -60861 -67355 -52190 -43288
16406 -43288 -28770 -44562 -47612 -44728 -57700 -51415 -43570 -43144 -58427 -63424 -45978 -42774 -64483
16393f4483R83L088M386n648j518J3917J3958l006l925M040j4433j284O993P598
16379c9334q442K190L3255J996L427j8238j4009j6869j1009l260j1733J1702K4608
16366d5716J1765K583j2643j8721J7576J6870n555j4280j0771Q027Q738n26L528
16353c9125J2330l724M271K419j746j1257J427R803O533o805j5172k063J849p488
16339d8748J679O684J1966r876j7054l589o132j8752m611Q91J5311N37j7648k784
16325i2126R064J5955J1325J5486J0915j146j661j4380j6262j2455j47N911N36
16312f8985m050L795J2580o9J988l050j4658k9201m185K3005P766J1690l667J0502
16298e6539J4318J5941K770M04O65k57R590o294j4176j0018k4708K1367J3604
$$ plain form
16393 -64483 -63500 -60412 -56026 -61674 -63192 -49275 -35317 -38323 -42248 -38208 -52641 -53925 -46932 -39334
16379 -39334 -47776 -45586 -12331 -10335 -6908 -25146 -39155 -56024 -67033 -70293 -82026 -70324 -45716
16366 -45716 -33951 -31368 -44011 -62732 -45156 -28286 -33841 -48121 -58892 -50865 -42127 -42653 -39125
16353 -39125 -26795 -30519 -26248 -23829 -25575 -36832 -35405 -25602 -19069 -25874 -41046 -43109 -41260 -48748
16339 -48748 -47069 -40385 -28419 -38295 -55349 -58938 -65070 -83822 -88433 -87542 -72231 -71694 -89342 -92126
16325 -92126 -83062 -67107 -55782 -40296 -29381 -30527 -32188 -46568 -62830 -75285 -75432 -69521 -68985
16312 -68985 -73035 -69240 -56660 -56729 -54741 -57791 -72449 -101650 -105835 -82830 -75064 -63374 -67041 -56539
16298 -56539 -42221 -26280 -23510 -23106 -22441 -22698 -13108 -19402 -33578 -43596 -68304 -46937 -33333
16285c3333l497k2334j6985M412K576k5540J1374J6980Q631L482j0981q362K2855
16272e0722k390P068j2569J258j266J1998j2041J4728K4625j8880j1751k072o864
16259e8878J4980m443j3196J2502M286r599l4841o228J3462l281k340L771K274
16246h1531J439J4175J6304J911j2366P354N582n876J3834j0370j0289J5535O481
16233c7817J7484j1475j4567J2216K1827R265n903n557L185k0897k1628j3614
16221f7481m875Q568p228K0952J6752o217q965o801J8740K5045k0557M050Q566
16208a9451j779r916J3915J0777j6615j0104p637n712O387j3569j7945M240K8777
16195c8632j3350j1004L446k1724k246J0467J3790J5733K6461R647j2417m950
$$ plain form
16285 -33333 -36830 -59164 -76149 -71737 -69161 -94701 -83327 -66347 -57716 -54234 -65215 -73577 -50722
16272 -50722 -53112 -46044 -58613 -57355 -58621 -46623 -58664 -43936 -19311 -38191 -49942 -52014 -58878
16259 -58878 -43898 -48341 -61537 -49035 -44749 -54348 -89189 -95417 -81955 -85236 -87576 -83805 -81531
16246 -81531 -80092 -65917 -49613 -47702 -60068 -52714 -47132 -53008 -39174 -49544 -59833 -44298 -37817
16233 -37817 -20333 -31808 -46375 -34159 -12332 -3067 -8970 -14527 -11342 -32239 -53867 -67481
16221 -67481 -72356 -63788 -71016 -50064 -33312 -39529 -48494 -55295 -36555 -11510 -32067 -28017 -19451
16208 -19451 -21230 -31146 -17231 -6454 -23069 -33173 -40810 -46522 -40135 -53704 -71649 -67409 -38632
16195 -38632 -51982 -62986 -59540 -81264 -83510 -73043 -59253 -43520 -17059 -7412 -19829 -24779
16183b4779j1170l000K2170R183L231O994q154k4149k880P398j9728L878J1265
16170b9741Q16R122J02j1383j7139m500J1124J5248o270L030m209j715M716J3548
16156a7251j4865K389J317m168k286Q28L529R289J4263j560N958k831L101k0524
16142b2811l7523l1846J0849J8609J4672k609J1626l739j4150j4180K0227K3195
16130b7680J0842n334n49P242k8129k4529J5022J031J0277j648K294q929q985
16117e9075j285J0620J6788P493J474j7215j9502o156k6720J4710J3414K1183
16105d4271M947j5658j488J094P41O274P445J9417K3541j919k4852j9891k2654
16092f7274l084L821J5380J4031K1948j704m935r033p079k869j4157J953J4935
$$ plain form
16183 -24779 -35949 -38949 -16779 -7596 -4365 2629 -5525 -29674 -32554 -25156 -44884 -41006 -29741
16170 -29741 -28925 -19803 -19701 -31084 -48223 -52723 -41599 -26351 -32621 -29591 -33800 -35515 -30799 -17251
16156 -17251 -32116 -29727 -28410 -32578 -34864 -34036 -30507 -21218 -6955 -8515 -2557 -5388 -2287 -22811
16142 -22811 -60334 -92180 -81331 -62722 -48050 -50659 -39033 -42772 -56922 -71102 -50875 -27680
16130 -27680 -16838 -22172 -22721 -15479 -43608 -68137 -53115 -52084 -41807 -43455 -41161 -50090 -59075
16117 -59075 -60360 -49740 -32952 -25459 -23985 -41200 -60702 -66858 -93578 -78868 -65454 -44271
16105 -44271 -39324 -54982 -56470 -55376 -54635 -48361 -40916 -21499 2042 123 -24729 -44620 -67274
16092 -67274 -70358 -66537 -51157 -37126 -15178 -16882 -21817 -30850 -37929 -40798 -54955 -53002 -38067
16079c8067o020j9468k090J8825J7437m54n388k375r510q096Q188o267K3730L1309
16065A754N6j4423k0636P652M181k830o507J393k5133p59O768K060l4000j3557
16051i3981n714J5846K2001R334k351K5482J183K753j281k044K6059J1303j1705
16038c115j9326k7396j1741K0619Q090n72n078p058J997j0700j2002k832M082
16025f5032n181J8621N415J427L237J148Q874O587o70p785j5563l312J0019j365
16011d3580j3480P09m290j0655o519J9374Q390o707l394O526J1136j6245j4564
15998g3299O127J9687n748q283k409L176J8627J2292Q501p623j7204j3393J2747
15985d6802R652J0118l291j6830J0934M85k6657q617R531k644m337O342j1746
$$ plain form
16079 -38067 -44087 -63555 -65645 -46820 -29383 -29837 -35225 -37600 -47110 -55206 -47018 -53285 -29555 1754
16065 1754 1810 -12613 -33249 -25597 -21416 -24246 -30753 -29360 -54493 -55252 -48484 -46424 -80424 -93981
16051 -93981 -99695 -83849 -61848 -52514 -54865 -29383 -28200 -25447 -26728 -28772 -2713 8590 -3115
16038 -3115 -22441 -49837 -61578 -40959 -32869 -33441 -38519 -45577 -43580 -54280 -66282 -69114 -65032
16025 -65032 -70213 -51592 -46177 -44750 -41513 -40365 -31491 -24904 -25574 -33359 -48922 -52234 -42215 -43580
16011 -43580 -57060 -56351 -60641 -71296 -77815 -58441 -50051 -56758 -60152 -53626 -42490 -58735 -73299
15998 -73299 -67172 -47485 -53233 -61516 -63925 -60749 -42122 -29830 -21329 -28952 -46156 -59549 -46802
15985 -46802 -37150 -27032 -30323 -47153 -36219 -35734 -62391 -71008 -61477 -64121 -68458 -62116 -73862
15972g3862R336J0663j0623J4804k0065k351L4204Q145j0256k037j3109o408M964
15959e6595J1399L882o759K476O795M899J0019r965l5435J4695j0158k1060N190
15946h0617J8476p62J4381J9828k400l610l82J9865j0734j7971O727k028o28J0916
15932b8939L012k320j731q731j1429k2124J241M033P348J3435Q824M82m536n677
15918d7112J4472p08O809J5911J3311J1560p082l3732K409j4735J0692J3052o301
15905b1454M383j7745j5682L862L501j6648J3604O107m997J963m046R616J550
15892c5986J9701j1706j1428k1432p169m23k2486K4138J0108K552k0440j703J6368
15879e9906M506j774l1876J265L0016k482J2118J4650m509r439R491J2232q687
$$ plain form
15972 -73862 -64526 -53863 -64486 -49682 -69747 -72098 -37894 -29749 -40005 -42042 -55151 -61559 -56595
15959 -56595 -45196 -41314 -48073 -45597 -38802 -33903 -23884 -33849 -69284 -54589 -64747 -85807 -80617
15946 -80617 -62141 -62903 -48522 -28694 -31094 -34704 -35086 -15221 -25955 -43926 -37199 -39227 -39855 -28939
15932 -28939 -25927 -28247 -29978 -38709 -50138 -72262 -71021 -66988 -59640 -46205 -37381 -36899 -41435 -47112
15918 -47112 -32640 -33348 -26539 -10628 2683 14243 7161 -26571 -24162 -38897 -28205 -15153 -21454
15905 -21454 -17071 -34816 -50498 -46636 -43135 -59783 -46179 -40072 -45069 -43106 -47152 -37536 -35986
15892 -35986 -16285 -27991 -39419 -60851 -68020 -68443 -90929 -66791 -56683 -54131 -74571 -76274 -59906
15879 -59906 -55400 -57174 -89050 -87785 -57769 -60251 -48133 -33483 -37992 -47431 -37940 -25708 -34395
15866c4395K902j5559P626J0920m349q770P209R358J7935M396k7483l0522m861
15853f5593J7368Q316L724m995j2395n623R112r400J783K368J6199N563j450o348
15839d1371J192l452q160j4004J171l114J4379J9579O866m354k768J6818K705
15826a4513n316k0461m02P804j6525k418j16k041J0704o225j8701q912L1398q32
15812d6556o226K2911J4803j2472p517n420n891K198M007q93q702j692l498K1197
15798c3751J6185r604k8447p954P21P794p55P486j5044j68J8447J9035j2057k683
15784d0795j0860j4189Q553M498r383J3689J0442K880l143j6267K0640K652J3074
15771a8209m708j2098o488Q385K041R103m116m388l212l267j1904M630J0847q524
$$ plain form
15866 -34395 -31493 -47052 -39426 -28506 -32855 -41625 -34416 -25058 -7123 -2727 -30210 -60732 -65593
15853 -65593 -48225 -39909 -36185 -41180 -53575 -59198 -50086 -59486 -57703 -55335 -39136 -33573 -35023 -41371
15839 -41371 -40179 -43631 -51791 -65795 -64624 -67738 -53359 -33780 -26914 -31268 -34036 -17218 -14513
15826 -14513 -19829 -40290 -40692 -32888 -49413 -51831 -51947 -53988 -43284 -49509 -68210 -77122 -45724 -46556
15812 -46556 -52782 -29871 -15068 -27540 -35057 -40477 -46368 -44170 -40163 -41056 -49758 -51450 -54948 -33751
15798 -33751 -17566 -27170 -55617 -63571 -62850 -55056 -55811 -48325 -63369 -63537 -45090 -26055 -38112 -40795
15784 -40795 -51655 -65844 -57291 -52793 -62176 -48487 -38045 -35165 -38308 -54575 -33935 -31283 -18209
15771 -18209 -22917 -35015 -41503 -33118 -31077 -21974 -26090 -30478 -33690 -36957 -48861 -44231 -33384 -41908
15757d1908j2176j3123P223K1321l078k1472K570O462j33J2571P546l909n903
15744d4009R940r375j6769J1035R317J6124m464J55K62L65J4850j1788R295J4404
15730f58J2053j9939l2029J6698K4689M648l444j2130J0556j1438j5340j2144
15718c8478Q419J6171K3693k764k8940M323K124L378j1049j0013J0407J349Q723
15705a2657M014J8415R89k6379j8362J5255n29j116J0477k590M558J3890Q600
15692A4565N193j0373j5727k2467n445P710L266j2705M277Q85O218j3801j1013
15679d9417o646m057J3605J4569o074P638K5574j0602j5867p215j5078j1468J2820
15666e2218K4246k370j26j979K052l195L851P637J1345N710j5312j1852O483k781
$$ plain form
15757 -41908 -54084 -67207 -59984 -38663 -41741 -63213 -60643 -54181 -54314 -41743 -34197 -38106 -44009
15744 -44009 -34069 -43444 -60213 -49178 -39861 -23737 -28201 -28046 -27784 -27419 -12569 -24357 -15062 -658
15730 -658 11395 -8544 -40573 -23875 814 5462 2018 -10112 444 -10994 -26334 -38478
15718 -38478 -30059 -13888 9805 7041 -21899 -17576 -15452 -12074 -23123 -33136 -22729 -21380 -12657
15705 -12657 -8643 9772 10761 -15618 -33980 -18725 -19254 -20370 -9893 -12483 -7925 5965 14565
15692 14565 19758 9385 -6342 -28809 -34254 -26544 -23278 -35983 -31706 -30821 -24603 -38404 -49417
15679 -49417 -56063 -60120 -46515 -31946 -38020 -30382 -4808 -15410 -31277 -38492 -53570 -65038 -52218
15666 -52218 -27972 -30342 -30468 -32447 -30395 -33590 -29739 -22102 -10757 -5047 -20359 -32211 -25728 -28509
15652b8509j1303j1518J8316J1203l54l166O934l078j1235k505n606o061m313
15639e1195m980J3728J4172Q868J405m192N894J024p762j2954k298j2599r679
15626f0568j2691P719K0134R919L317l136J7675J753q792j0560k9745j9691R375
15613g5291P342R108k202J3454J0658N984K168j1878K454j899l018q888j3563
15600f5571M559Q835J840j102J369M590J2526n983j1714Q38q75L052L560R978
15586c4098q571R552r4j170K017M489K131R798j1164q016O29L569J7792N547r199
15571a6788p735o690M458j5529j3025K1680J3730Q531j6028k5697j1703O736J3169
15558d4891K822o307J2268o610n20J7051K408j1237J210M757j3783k2344p657
$$ plain form
15652 -28509 -39812 -51330 -33014 -21811 -22165 -25331 -18397 -21475 -32710 -35215 -40821 -46882 -51195
15639 -51195 -56175 -42447 -28275 -19407 -18002 -22194 -16300 -15276 -23038 -35992 -38290 -50889 -60568
15626 -60568 -73259 -65540 -45406 -35487 -32170 -35306 -17631 -15878 -24670 -35230 -64975 -84666 -75291
15613 -75291 -67949 -58841 -61043 -47589 -36931 -30947 -28779 -40657 -38203 -40102 -43120 -52008 -65571
15600 -65571 -61012 -52177 -50337 -51439 -50070 -45480 -32954 -38937 -50651 -49813 -50688 -47636 -44076 -34098
15586 -34098 -42669 -33117 -33211 -34381 -32364 -27875 -25744 -15946 -27110 -35126 -34497 -30928 -13136 -7589 -16788
15571 -16788 -24523 -31213 -26755 -42284 -55309 -33629 -19899 -11368 -27396 -53093 -64796 -58060 -44891
15558 -44891 -42069 -48376 -36108 -42718 -43238 -26187 -23779 -35016 -33806 -29049 -42832 -65176 -72833
15545g2833J6231J2549j4465K402J252j2481p400O069K623Q248K1513K200j3030
15532d7122q717J9657J7384k8965j9884J116J2862J3729K7328J3213j8592l2759
15520e0750J880o176o392J5063p255q667J1532J3690K4905R665k0001J918Q423
15507a2165l863J029r744j9532j4764j7904P598J3214K095K456O701J5296M785
15494b4798m412J5364j4189k019M476m291N93K714R676j6385k2306K2403J5933
15481a7241k0564j6518n825k535P061J2391J6072j299o457Q738p082O804M107
15468b2348J441J8740r670m496O522j591p016j2712J9L354L741j7397o598K849
15454d5162j6826k874K610K0254R27J514R946r911j19O431L807M059p764k6994
$$ plain form
15545 -72833 -56602 -44053 -58518 -56116 -54864 -67345 -74745 -68676 -66053 -57805 -36292 -34092 -47122
15532 -47122 -55839 -36182 -18798 -47763 -67647 -66531 -53669 -39940 -12612 601 -17991 -50750
15520 -50750 -48870 -55046 -61438 -46375 -53630 -62297 -50765 -37075 -12170 -2505 -22506 -20588 -12165
15507 -12165 -16028 -14999 -24743 -44275 -59039 -76943 -69345 -56131 -54036 -51580 -44879 -29583 -24798
15494 -24798 -29210 -13846 -28035 -30054 -25578 -29869 -29276 -26562 -16886 -33271 -55577 -33174 -17241
15481 -17241 -37805 -54323 -60148 -62683 -55622 -43231 -27159 -28458 -34915 -26177 -33259 -26455 -22348
15468 -22348 -20907 -2167 -11837 -16333 -9811 -11402 -18418 -31130 -31111 -27757 -24016 -41413 -48011 -45162
15454 -45162 -61988 -64862 -62252 -41998 -41071 -39557 -29611 -39522 -39641 -33210 -29403 -25344 -33108 -60102
15440f0102j4181K994J0117J5205j0963O92O731J6155q722o769R074j875O214
15427c5430n534q108Q29l687O643J1747n549j9405k069J5707j127l37j2895j2987
15413g2202r46J7372P501Q039N010j1083L612j1844J4438N266J0797J5099L686
15400e255j2549K1362j0807k3236L503o779L474J302J3136J2647j1262M019L116
15387g329j4626L857r038m030k856K39j5802J5286O603K083J4572Q144q077p870
15373a8844j9029l4332Q476N458J1023J3973q227j3764J4831J7586l624q930M030
15360c1373R65k0212j3082J107R25O257J931R117p577Q282J4417R852J4095n600
15346a0896l185p193k467j7467J900O481r169J460N431J7549J3483l835P81R578
$$ plain form
15440 -60102 -74283 -71289 -61172 -45967 -56930 -56238 -49507 -33352 -42074 -48843 -39769 -41644 -35430
15427 -35430 -40964 -49072 -48243 -51930 -45287 -33540 -39089 -58494 -60563 -44856 -45983 -46320 -59215 -72202
15413 -72202 -73148 -55776 -48275 -40236 -35226 -46309 -42697 -54541 -40103 -34837 -24040 -8941 -5255
15400 -5255 -17804 3558 -7249 -30485 -26982 -33761 -30287 -28985 -15849 -3202 -14464 -10445 -7329
15387 -7329 -21955 -18098 -27136 -31166 -34022 -33783 -49585 -34299 -27696 -25613 -11041 -2897 -10974 -18844
15373 -18844 -37873 -72205 -63729 -58271 -47248 -33275 -41502 -55266 -40435 -22849 -26473 -35403 -31373
15360 -31373 -30408 -50620 -63702 -62595 -61670 -55413 -53482 -44365 -51942 -43660 -29243 -19391 -5296 -10896
15346 -10896 -14081 -21274 -23741 -41208 -39308 -32827 -41996 -40536 -35105 -17556 -4073 -7908 -7127 2451
15332B451R57o585l341k558n650j289j03J840J6843j010l590p283l577j3888J120
15317b5663L921j897q026p598J3638R032J9327J6086q158r154J7712N489k1190
15304C519j1756O369n232o189j732J878m434m037O387M620o192m663J6674Q076
15290C288q650q987m479Rj9396k159K389o533j4734p025p715J1582L8500K283
15276b1627j6068m953o326n372j0414j572l578R040Q288J3156J5851k5763N631
15263d3707K256J6501Q005j1772k862J3953J0322r79j3756r628k1472o202J7367
15250d1974K0777q164n230j0478j3389m693N835N773P799O588O591O896L142J5184
15236e343j4694q274j291j8292P24N518J2736R601j5342O739r373k3699n339K0279
$$ plain form
15332 2451 3408 -3177 -6518 -9076 -14726 -16015 -16118 -14278 2565 1555 -2035 -9318 -12895 -26783 -25663
15317 -25663 -21742 -23639 -31665 -39263 -25625 -16593 2734 18820 10662 1508 19220 24709 3519
15304 3519 -8237 -1868 -7100 -13289 -15021 -13143 -17577 -21614 -15227 -10607 -16799 -21462 -4788 3288
15290 3288 -5362 -14349 -18828 -18819 -38215 -40374 -37985 -44518 -59252 -66277 -73992 -62410 -23910 -21627
15276 -21627 -37695 -42648 -48974 -54346 -64760 -66332 -69910 -60870 -52582 -39426 -23575 -49338 -43707
15263 -43707 -41451 -24950 -16945 -28717 -31579 -17626 -7304 -8283 -22039 -31667 -53139 -59341 -41974
15250 -41974 -21197 -29361 -34591 -45069 -58458 -63151 -57316 -51543 -43744 -37156 -30565 -23669 -20527 -5343
15236 -5343 -20037 -28311 -29602 -47894 -47170 -41652 -28916 -19315 -34657 -27918 -37291 -60990 -66329 -46050
15222d6050j5119M645J1457P973n908j1450J3215k309j2174J7882J8746j4867
15210c3959p993K2098l919j3721j712L504M950p421J7849J2064k2817m85K6633
15197d929P399j1658j3329M72R112j6207j1593r22J7104K6625M969j0070m989
15184h016J0370Q1k7792j3288K188K806J9939R175m783P479j168n832K873k00
15170f168k921q949K869l856q067j0000p9J7550J7520O086j035k0780m7195j0322
15156g5347R130R379K3390L184j8486o9q35j0568j623n567J719M445j7851J949
15142g7150O413K624Q16Q036K5513k390l060P050j4814k3117q609m913R046J947
15128g2608J2861Q547O159k0483l082J5939O384J7378j1759M147M550L006r723
$$ plain form
15222 -46050 -61169 -56524 -45067 -37094 -43002 -54452 -41237 -43546 -55720 -37838 -19092 -33959
15210 -33959 -41952 -19854 -23773 -37494 -39206 -35702 -30752 -38173 -20324 -8260 -31077 -31562 -4929
15197 -4929 2470 -9188 -22517 -22045 -12933 -29140 -40733 -41655 -24551 2074 7043 -3027 -8016
15184 -8016 2354 2435 -25357 -38645 -36457 -33651 -13712 -4537 -9320 -1841 -3009 -8841 -5968 -6168
15170 -6168 -9089 -18038 -15169 -19025 -27092 -37092 -37171 -19621 -2101 3985 2950 -17830 -65025 -75347
15156 -75347 -66217 -56838 -33448 -30264 -48750 -48819 -49654 -60222 -61845 -67412 -65693 -61248 -79099 -77150
15142 -77150 -70737 -68113 -67297 -59261 -33748 -36138 -39198 -32148 -46962 -70079 -78688 -83601 -74555 -72608
15128 -72608 -59747 -51200 -45041 -65524 -68606 -52667 -46283 -28905 -40664 -36517 -31967 -28961 -38684
15115c8684J4791R145j2298J5915j0729j3228m598j4248l58K658Q88K795J6204
15102c1747J0600K5340J927j8865l0659m524J8931J5148l376m161j0766q898p96
15089d1846p596q534l512j650J8673P10j6463J2518J4138J3517J0873J678M978
15076b516n297k4186j1243R419Q260k287j1222P102L743Q848m753j765P302J2543
15062f052j1134r265m623Q931J3794J6533r727j9699j2253r860J003p029p291
15049e6672j6851O465P204K2434J2176N159j687J991j1505j1272m420m116q332
15036e9426n954O164K6900L293j8756J545P93K021r990K951J1806J3593Q04K626
15022b1630n368j3884K34p408O929M315j3431N190J1111Q373J8240M840j6574
$$ plain form
15115 -38684 -23893 -14748 -27046 -11131 -21860 -35088 -39686 -53934 -54292 -51634 -50746 -47951 -31747
15102 -31747 -21147 4193 6120 -12745 -43404 -47928 -28997 -13849 -17225 -21386 -32152 -41050 -41846
15089 -41846 -49442 -57976 -61488 -63138 -44465 -43755 -60218 -47700 -33562 -20045 -9172 -7494 -2516
15076 -2516 -7813 -31999 -43242 -33823 -25563 -27850 -39072 -31970 -28227 -19379 -24132 -25897 -18595 -6052
15062 -6052 -17186 -26451 -31074 -22143 -8349 8184 -1543 -21242 -33495 -43355 -42352 -49381 -56672
15049 -56672 -73523 -67058 -59854 -37420 -25244 -20085 -21772 -19781 -31286 -42558 -46978 -51094 -59426
15036 -59426 -65380 -59216 -32316 -29023 -47779 -46234 -45441 -43420 -53410 -50459 -38653 -25060 -24256 -21630
15022 -21630 -26998 -40882 -40648 -48056 -41127 -36812 -50243 -45053 -33942 -25569 -7329 -2489 -19063
15009a9063r81j85r123l615J3984P489p097j0492j1460J0260q630j0881o468K234
14995e4028Q752j0906j2082r019J3180J1024J8394L098K558J3246j5992j7542
14983d9317n37j0768J4243J5393Q544Q296j6348K792R132J083J6625j3515r338
14970b3715j6266l686K6142j248J4729r113q945r342r19l108J6789J8803j3471
14957a3350j2861Q919K1897j131o681k866r381M395O852j746n345n609j4764j1479
14943d3150p006K0857j740j4165j612k324Q857J0840J5647j975j0531P79j0053
14930c5576k1744K877J3979j020N727k006K3698J1869r229j2681l397j5501n904
14917d8908N502r822R70K746R069K3793J3806j4241k5603j1168J4366J2924j3945
$$ plain form
15009 -19063 -20044 -20229 -29352 -32967 -18983 -11494 -18591 -29083 -40543 -30283 -38913 -49794 -56262 -54028
14995 -54028 -45276 -56182 -68264 -77283 -64103 -53079 -34685 -31587 -29029 -15783 -31775 -49317
14983 -49317 -49854 -60622 -46379 -30986 -22442 -14146 -30494 -27702 -18570 -17487 -862 -14377 -23715
14970 -23715 -39981 -43667 -17525 -18773 -4044 -13157 -22102 -31444 -32363 -35471 -18682 121 -13350
14957 -13350 -26211 -17292 4605 3474 -3207 -6073 -15454 -11059 -4207 -5953 -11298 -16907 -31671 -43150
14943 -43150 -50156 -29299 -31039 -45204 -46816 -49140 -40283 -29443 -13796 -15771 -26302 -25523 -35576
14930 -35576 -57320 -54443 -40464 -41484 -35757 -37763 -14065 -2196 -11425 -24106 -27503 -43004 -48908
14917 -48908 -43406 -53228 -52258 -49512 -40443 -16650 -2844 -17085 -42688 -53856 -39490 -26566 -40511
14904d0511K168J6611k0006o749J1948R406J3974J3396Q373J8792q523r089r252
14891E38j4202q712o450J2185J3116j1890k0638r259K4018K5137m905l281k4489
14878b8832R341R935n757k144j1290j2091K246j641N474K0821J8926J721L938
14865A0647j9376l640O798N75n12j0418m897M455j3362K439M479j1083j458J2739
14851b2614n455o194M634k373j3357K0425J9164k969n784J846K3351k722l283
14838D669k457o149j2462j2565J9694Q602l020j0945k3947m8K1964L541n550k508
14824b1181Q583k1373j9799J2471Q705J0942R809j2108j5396m686M769Q529M945
14811b5790J2939L948N109m411J0896M320j0221R594J419R710l264o466K814J3917
$$ plain form
14904 -40511 -38343 -21732 -41738 -48487 -36539 -27133 -13159 237 8610 27402 18879 9790 538
14891 538 -13664 -22376 -28826 -16641 -3525 -15415 -36053 -45312 -21294 3843 -1062 -4343 -28832
14878 -28832 -19491 -9556 -15313 -17457 -28747 -40838 -38592 -40233 -34759 -13938 4988 6709 10647
14865 10647 -8729 -12369 -5571 -4996 -5508 -15926 -20823 -16368 -29730 -27291 -22812 -33895 -35353 -22614
14851 -22614 -28069 -34263 -29629 -32002 -45359 -24934 -5770 -8739 -14523 -12677 10674 7952 4669
14838 4669 2212 -3937 -16399 -28964 -9270 -668 -3688 -14633 -38580 -38628 -16664 -13123 -18673 -21181
14824 -21181 -12598 -33971 -53770 -41299 -32594 -21652 -11843 -23951 -39347 -44033 -39264 -30735 -25790
14811 -25790 -12851 -8903 -3794 -8205 2691 7011 -3210 6384 7803 17513 14249 7783 10597 24514
14797B4514n369K2836K9874K6409K7317M3561L9308M2844M5763K3327q936l8113
14785B73335n1757o6345m3904k6012l1622k6286j2047M845J299k8773o944o259
14773b0470M847J2095J0851R713o214j2082k524K262J3101q96p873o324m295J6457
14759H648K5346o859j3317j1010m038k3133j3377r469l038J2117J7132J3990J1483
14746D475J0831l670o612P499K317r187j9490j0359M489N053N687O41K385J674
14732d267j210n36J144k839O305O066N473O370j504J2799J7594J5909K542R343
14718G3189j4914J535j1230j0273p255j3240j9075J400j2940l979J5082L703k068
14705f5j1376J1060N992J3666K0605m753j93j2317K0402m488k4789L771J3147
$$ plain form
14797 24514 19145 41981 71855 98264 125581 169142 208450 251294 297057 320384 311448 273335
14785 273335 221578 155233 111329 85317 53695 27409 15362 20207 21506 -7267 -14211 -20470
14773 -20470 -15623 -3528 7323 17036 10822 -1260 -3784 -1522 11579 10683 2810 -3514 -7809 8648
14759 8648 33994 27135 13818 2808 -1230 -24363 -37740 -47209 -50247 -38130 -20998 -7008 4475
14746 4475 15306 11636 5024 12523 14840 5653 -13837 -24196 -19707 -14654 -8967 -8326 -5941 -4267
14732 -4267 -5477 -6013 -4869 -7708 -1403 4663 10136 16506 15002 27801 45395 61304 63846 73189
14718 73189 58275 59810 48580 38307 31052 17812 -1263 137 -12803 -16782 -1700 2003 -65
14705 -65 -11441 -381 5611 19277 39882 35129 34936 22619 43021 38533 13744 17515 30662
14692C0662k3366P866r612K1777l398k4915P220J2861j9478O52J4988Q991J5730
14679C9978m158r024O884J4552K112J2097N743k2422L389n309l93O222j2154k5556
14665A1961r592K0712M168p424M566n610k240l15k0644j0068K1987J6638J802
14652B5941j2874j2704R507J8361J6244p192j401Q122l144r577L463l226j6336
14639A5184k152L1799L3983j7765l9027n043K684J756P022P180j123p261L504
14626C0741O280O946j4480j0563J952J391Q95J3990J5995n003k2038M982K3465
14613E4553K377j2615M643K2781r213K375J7756Q707j0031o770j0374j1843j5752
14600C6594r457N139j657R203L807o381l230J3605j978j192J2048j9926k5871
$$ plain form
14692 30662 7296 15162 5550 27327 23929 -986 6234 19095 -383 269 15257 24248 39978
14679 39978 35820 26796 33680 48232 50344 62441 68184 45762 49151 43842 43449 49671 37517 11961
14665 11961 2369 23081 27249 19825 24391 18781 16541 16226 -4418 -14486 7501 24139 25941
14652 25941 13067 363 9870 28231 44475 37283 35882 44004 40860 31283 34746 31520 15184
14639 15184 13032 44831 78814 61049 22022 16979 19663 21419 28441 35621 34498 27237 30741
14626 30741 37021 43967 29487 18924 20876 22267 23162 37152 53147 48144 26106 31088 54553
14613 54553 56930 44315 48958 71739 62526 64901 82657 91364 81333 74563 64189 52346 36594
14600 36594 27137 32276 30619 39822 43629 37248 34018 47623 45645 44453 56501 36575 10704
14587A0704J9790J2563K946q345j627j4224J218K354J2275Q336q427m41o073j3073
14573A7976N884K1872r502O510k172j122R987o882o088L055J731R501k0028m118
14559B6604K1046K254J0050r303o747r851q795j752P601l286j9375J9351J9263
14546D7060J0437k0448j0229j1819J5944J5762Q841j8473p966j6687j9000J796
14534d782K7077K447P759J8451J0119j2184J3948n309j4851q53j5072J1017J8847
14521E6614J691M242Q551j1246N409O296n211K4499r487j3437k3813n352K550
14508D1306J1049J1686O566R790L90q717j0283n305O991P006k780N189M218P853
14494H4959M962l677l918j3229Q620o754j5390j2830K4232K6792R927L044q283
$$ plain form
14587 10704 30494 43057 46003 37658 36031 21807 23025 25379 37654 45990 37563 37122 31049 17976
14573 17976 23860 45732 36230 42740 40568 39446 49433 42551 36463 39518 41249 50750 30722 26604
14559 26604 47650 49904 59954 50651 43904 34053 25258 23506 31107 27821 8446 27797 47060
14546 47060 57497 37049 26820 15001 30945 46707 55548 37075 29109 12422 -6578 -4782
14534 -4782 22295 24742 32501 50952 61071 48887 62835 57526 42675 41822 26750 37767 56614
14521 56614 58305 62547 71098 59852 65261 71557 66346 90845 81358 67921 44108 38756 41306
14508 41306 52355 64041 70607 80397 80787 72070 61787 56482 63473 70479 67699 72888 77106 84959
14494 84959 89921 86244 82326 69097 77717 70963 55573 42743 66975 93767 103694 106738 98455
14481I8455r562j6228J2441J6163j1897k2346K8704J7343K726l148K849N273j5831
14468A04942Q100J0244j6106j0638J5997M930k61j0083m621j633L568Q485p656
14455A05268n288N205j458J4636M448p167P710J6269j4624j7429j3677o47J9811
14442A13057R039P345m885K078K630K3216m620k283n682K3082Q12q725o853l175
14428A45036n048q555P987J9396J1986O283P605q940M366Q7J379O15l9618l094
14414A39485M341K0057J6975Q580J8329K8j5236p544J2867J5399R979J1789J5301
14401B50350O776j1769J0976L20J1078N698q585p387J98m23J324M1K4748J7831
14387C01176J1260N326k020J548J0160K2399K1337J3305M658m465n512J4114O522
$$ plain form
14481 98455 88893 72665 85106 101269 89372 67026 95730 113073 115799 112651 115500 120773 104942
14468 104942 113042 123286 107180 96542 112539 117469 117208 107125 102504 100871 104439 112924 105268
14455 105268 99980 105185 103727 118363 122811 115644 123354 139623 124999 107570 93893 93246 113057
14442 113057 122096 129441 124556 126634 129264 152480 147860 145577 139895 162977 163789 155064 148211 145036
14428 145036 139988 131433 139420 158816 170802 177085 184690 175750 180116 180203 181582 182197 142579 139485
14414 139485 143826 163883 180858 189438 207767 207795 192559 185015 197882 213281 223260 235049 250350
14401 250350 257126 245357 256333 256653 267731 273429 264844 257457 257655 257232 258556 258597 283345 301176
14387 301176 312436 317762 315742 317290 327450 349849 371186 384491 389149 384684 379172 393286 399808
14374C99808r631o061P217k7381j5303L067J3051k934k4897n716J4507k518o969
14361C36240j7605j2028j2022J2451K0461q224N247M550O15L537Q287l0908j5996
14348B94605R179J263J0632l855p394J6597J697K3383J3281j5188j8929n583J3429
14335C33117k035J959j5269l92o729j5780J8335K8552M794r204L187m221k565
14322C33749k45J1400J5332L382j9169p014p755K1755J5101j1546r015J7528K3520
14309C87023M758q157j39J7527L2210O914J3621J3504M753r389J5096K8199R916
14296E15836J7450M0994K3596J9756K8142J8446j6659l120P879J7772K5128K8195
14284G23415K9830K8622K6603J1092J3762J5768L3887K2033K3866n700R195K8416
$$ plain form
14374 399808 390177 384116 391333 363952 348649 351716 364767 361833 336936 331220 345727 343209 336240
14361 336240 318635 306607 294585 307036 327497 319273 324520 329070 329685 333222 341509 310601 294605
14348 294605 303784 305047 315679 311824 304430 321027 322724 346107 359388 344200 325271 319688 333117
14335 333117 331082 333041 317772 317380 310651 294871 313206 341758 346552 337348 340535 336314 333749
14322 333749 333504 344904 360236 363618 344449 337435 329680 351435 366536 354990 345975 363503 387023
14309 387023 391781 383624 383485 401012 433222 440136 453757 467261 472014 462625 477721 505920 515836
14296 515836 533286 574280 597876 617632 645774 664220 647561 644441 652320 670092 695220 723415
14284 723415 753245 781867 808470 819562 833324 849092 882979 905012 928878 923178 932373 960789
14272I60789M8967L2764J1409K1767L0783L1826J3931K6771L6796L4545K7722
14261A278070M0824K760M3638M8697K9016J9632q96Q768J5929J3769k94J0584
14249A510497K1711L9519N274R632l590J7443L4486L2721J2279P025K8893M5083
14237A760973N3838L9382J1173L2492K6333M6851M4718N3131M6902M9336O3909
14226B229038M9195O9799N5032Q1129O5043N6544P2218R2366Q4385Q9904J07099
14215C051752J22029J02344J00699J08671J04566J06478J30489J32784J57029
14206D116841J59029J55521J59579J83501J85292K03393K06846K29146K35997
14197E835145K70006K72897K78916L02596L06329L33354L43461L71826M03986
$$ plain form
14272 960789 1009756 1042520 1053929 1075696 1106479 1138305 1152236 1179007 1215803 1250348 1278070
14261 1278070 1318894 1321654 1365292 1413989 1443005 1462637 1461741 1470509 1486438 1500207 1499913 1510497
14249 1510497 1532208 1571727 1577001 1586633 1583043 1600486 1634972 1667693 1679972 1686997 1715890 1760973
14237 1760973 1814811 1854193 1865366 1897858 1924191 1971042 2015760 2068891 2115793 2165129 2229038
14226 2229038 2278233 2348032 2403064 2484193 2549236 2605780 2677998 2770364 2854749 2944653 3051752
14215 3051752 3173781 3276125 3376824 3485495 3590061 3696539 3827028 3959812 4116841
14206 4116841 4275870 4431391 4590970 4774471 4959763 5163156 5370002 5599148 5835145
14197 5835145 6105151 6378048 6656964 6959560 7265889 7599243 7942704 8314530 8718516
14188H718516M22887M30812M75633N17492N34491N60563N80693O31230O67864
14179A3540181P26773P57182Q01581Q54286R25430R61582J039953J109252J170244
14170B1886464J218320J312123J378461J468389J556848J648806J748829J843350
14162C4061590J966165K092269K219404K347135K500456K645536K804712K969864
14154E3607131L142564L375809L626592L846277M053827M309642M587627M874533
14146H5424002N205486N491857N779780O090874O374187O646603O887537P035886
14138A34936212P113819P114416O992465O710308O259592N698127M932666M023044
14130A83780649K970957J799982O03990o20663j831889k975907l989047m832963
$$ plain form
14188 8718516 9141403 9572215 10047848 10565340 11099831 11660394 12241087 12872317 13540181
14179 13540181 14266954 15024136 15825717 16680003 17605433 18567015 19606968 20716220 21886464
14170 21886464 23104784 24416907 25795368 27263757 28820605 30469411 32218240 34061590
14162 34061590 36027755 38120024 40339428 42686563 45187019 47832555 50637267 53607131
14154 53607131 56749695 60125504 63752096 67598373 71652200 75961842 80549469 85424002
14146 85424002 90629488 96121345 101901125 107991999 114366186 121012789 127900326 134936212
14138 134936212 142050031 149164447 156156912 162867220 169126812 174824939 179757605 183780649
14130 183780649 186751606 188551588 189155578 188534915 186703026 183727119 179738072 174905109
14122A74905109n544996o087139o497327o740915o872070o875129o796698o654385
14114A22836450o447385o196457n940568n662595n371530n092462m834841m561797
14106G8728815m299359m043916l805967l580895l388569l193598l016498k841422
14098E0558591k679721k501452k378661k261509k135047k012176j876773j798115
14090C2915137j697330j583564j505997j428073j357523j276738j185404j130093
14082B1750415j078118j011465r72004r14870q74223q33841p61962p18025o88605
14073A3897302o54861o23014n67124n36936n18859n01578m43693m31921l93605
14064I225711l93018l94417l51352l27511l18413l00694k78269k39660k49984
$$ plain form
14122 174905109 169360113 163272974 156775647 150034732 143162662 136287533 129490835 122836450
14114 122836450 116389065 110192608 104252040 98589445 93217915 88125453 83290612 78728815
14106 78728815 74429456 70385540 66579573 62998678 59610109 56416511 53400013 50558591
14098 50558591 47878870 45377418 42998757 40737248 38602201 36590025 34713252 32915137
14090 32915137 31217807 29634243 28128246 26700173 25342650 24065912 22880508 21750415
14082 21750415 20672297 19660832 18688828 17773958 16899735 16065894 15303932 14585907 13897302
14073 13897302 13242441 12619427 12052303 11515367 10996508 10494930 10051237 9619316 9225711
14064 9225711 8832693 8438276 8086924 7759413 7441000 7140306 6862037 6622377 6372393
14055F372393k34681k13923k15578k06969j93151k07456j91332j67322j47441
14046D594540j60092j20599j22052j49733j38404r8305j06990j35806j15642j00671
14036C346246q4806p9166q5503r3621r4877q0169o6301n3821n3768p1606p1510
14025B511098m7928m8737n9901n3828l5660m9494n2461l8909n1518l9001l7271
14014A996390l8323m9511l2773k9978k4697l2824m1437k7133j2146l5586l4438
14003A637544k7674l8888l7919j8915k8365l0009l9735l0702k1629m4656k5722
13992A293330l2736k5051j8359k9604j7273k9833l2758j9514l0402k3287j6787
13981A017726j9275j2579k0235l7312l0391j1855j7088k6770k6815Q568l987n853
$$ plain form
14055 6372393 6137712 5923789 5708211 5501242 5308091 5100635 4909303 4741981 4594540
14046 4594540 4434448 4313849 4191797 4042064 3903660 3805355 3698365 3562559 3446917 3346246
14036 3346246 3261440 3182274 3096771 3003150 2908273 2828104 2761803 2707982 2654214 2582608 2511098
14025 2511098 2463170 2414433 2354532 2300704 2265044 2215550 2163089 2124180 2072662 2033661 1996390
14014 1996390 1958067 1908556 1875783 1845805 1821108 1788284 1746847 1719714 1707568 1671982 1637544
14003 1637544 1609870 1570982 1533063 1514148 1485783 1455774 1416039 1385337 1363708 1319052 1293330
13992 1293330 1260594 1235543 1217184 1187580 1170307 1140474 1107716 1088202 1057800 1034513 1017726
13981 1017726 998451 985872 965637 928325 897934 886079 868991 842221 815406 823974 819987 814134
13969H14134p805Q715o42l6089k1179J1458J8820K843N046J2610j7090j5525L961
13956G79257O418j4478j7115J829k465j0167J1322J1881l956j4293l1222n64j0142
13943G06305j8769n050o245Q904k839k4928O827K450j8417k6500m0870j0488J0001
13930E80381L904o420j0141q107j8781l1657j5387k295j1178k1665M551M650j8493
13917D49362k7064j951o961j3398P956l76l952R811j5509l2987j2760n596L826
13904C50401p520j0139p812O869J2391J1804j9952q157l251L89j4636q905J5614
13891C17096n061j0873j2549o642j5122L0790m926j8537M429p424j5673P582J059
13878B64149M188J4146n157j0509K754j6214j1330j0289o584O93O495J015j9312
$$ plain form
13969 814134 806329 815044 814402 778313 757134 768592 787412 790255 795301 807911 790821 775296 779257
13956 779257 785675 771197 754082 755911 753446 743279 754601 766482 762526 748233 717011 716447 706305
13943 706305 687536 682486 676241 685145 682306 657378 664205 666655 648238 621738 580868 570380 580381
13930 580381 584285 577865 567724 559617 540836 509179 493792 491497 480319 458654 463205 467855 449362
13917 449362 422298 420347 413386 399988 407944 407568 403616 413427 397918 364931 352171 346575 350401
13904 350401 342881 332742 324930 331799 344190 355994 336042 327885 324634 325023 310387 301482 317096
13891 317096 312035 301162 288613 281971 266849 297639 292713 274176 278605 271181 255508 263090 264149
13878 264149 268337 282483 277326 266817 269571 253357 242027 231738 225154 225847 232342 233357 214045
13865B14045p227K2577J3405k362p497J4388R779Q206k3322j4097n499j1291M15
13852B11520r654J2048J5780Q626j2745k6349j6704L496K3183r486k870K1923
13840B18768o377q233P432P254j0362k1456p21n337o80r133j460q008j2202O770
13826A56255J1212J6137j4110P806N535r569j6577J62Q656R031O649J0483J6385
13813B08055K1654M0936Q963l58l0285l0767k0847k0174j9652j0732J1322j1111
13801A47004j9316n878k766j2J6316K212k0221n047J7029L154Q744j4728o105
13788A20386K0932Q933j015k721J5754M446J2507J3051K2653O4104O5415P2981
13776D17426M4963l5904m7811n6596n0212n0111l4256j9405j5873j6406j1553
$$ plain form
13865 214045 206818 229395 242800 240438 232941 247329 257108 265314 241992 227895 222396 211105 211520
13852 211520 201866 213914 229694 238320 225575 199226 182522 186018 209201 199715 196845 218768
13840 218768 212391 204158 211590 218844 208482 187026 186305 180968 180288 171155 169695 161687 149485 156255
13826 156255 167467 183604 169494 177300 182835 173266 156689 156851 165507 174538 181187 191670 208055
13813 208055 229709 270645 279608 279250 248965 218198 197351 177177 157525 146793 158115 147004
13801 147004 127688 121810 119044 119032 135348 137560 117339 112292 129321 132475 141219 126491 120386
13788 120386 141318 150251 149236 146515 162269 166715 179222 192273 214926 279030 344445 417426
13776 417426 462389 426485 378674 322078 271866 221755 187499 168094 152221 135815 124262
13765A24262p654L690O555J8910j4766j1466Q481K1590k966n159J418k0592l6103
13752H6200n771Q027K3611Q473L149K6621J8895N153N1007L7050Q449M753j8784
13739B56833m2174m1409k5904j9556J257m347l5793j0533R242m053j0319J3487
13727H6731K4838J5298J1680m377J359k1311k8207j4964L363J4494K2595Q737
13715A20236m905k3338q262m602j5449J2691J9438O720N764J1437o038o675p585
13702I9432N573r9j5534k0421M31n026q344J288K4108J968p661o92r552J0588
13688G6059p59j5259q908J218M910K3131M359p361R113L570K873r637L20Q593
13674I2222j3530q886M59q474j4821j468J1524j5574o060j2005o672N303K0424
$$ plain form
13765 124262 116608 120298 126853 145763 130997 119531 128012 149602 146636 141477 142895 122303 86200
13752 86200 80429 88456 112067 120540 123689 150310 169205 174358 225365 262415 270864 275617 256833
13739 256833 214659 173250 147346 127790 129047 124700 88907 78374 87616 83563 73244 86731
13727 86731 111569 126867 138547 134170 135529 114218 86011 71047 74410 88904 111499 120236
13715 120236 115331 91993 83731 79129 63680 76371 95809 102529 108293 119730 113692 107017 99432
13702 99432 105005 104906 89372 68951 69382 64356 56012 57300 81408 83376 75715 75023 65471 76059
13688 76059 75300 60041 51133 52351 57261 80392 84751 77390 86503 90073 92946 83309 83629 92222
13674 92222 78692 69806 70265 61791 46970 45502 57026 41452 35392 23387 16715 22018 42442
13661D2442L258j956J0867M89k8213j3738p227J6718K9727m906r787K082k391
13648C7365J307N31J7010j3163n727R180j2621L750J0587J794M145m621j9867
13635B9670j8278K752O976n840N01J3115J6048o738J53j6157k2162n282J1025
13622E783J5411R044L163L58m916O480J1590J6987j734k9342j59R620K04l802
13608C8687K1264l501j1332J4695j210j6794k601P173j1777r562q737k737j0138
13595C430p201n534r89L4762J0289P688m62j800j0390K32O718K0840k726j728
13581E3129J0231n405p759k1343J2046J896l219N716j3042o718j46R656M343O964
13567D6349j8366j2282j0332O668n314j4901J6100J2100R766J0565j1452o154
$$ plain form
13661 42442 45700 43744 54611 55100 26887 13149 5922 22640 52367 47461 37674 39756 37365
13648 37365 38672 39203 56213 43050 37323 46503 33882 37632 48219 50013 54158 49537 29670
13635 29670 11392 14144 21120 15280 15781 28896 44944 38206 38359 22202 40 -5242 5783
13622 5783 21194 30238 33401 33759 28843 35323 46913 63900 62166 32824 32665 42285 42489 38687
13608 38687 59951 56450 45118 59813 58603 41809 39208 46381 34604 25042 16305 13568 3430
13595 3430 -3771 -9305 -10294 24468 34757 42445 41983 40183 29793 30025 36743 57583 54857 53129
13581 53129 63360 57955 50196 28853 40899 42795 39576 45292 32250 25532 25386 35042 39385 46349
13567 46349 27983 15701 5369 12037 6723 -8178 7922 20022 29788 40353 28901 22747
13555B2747j946m961m235K4717J5822j0584r169l0881o359K1027J2215J2443J5285
13542E6121P513n877j8921K311K0833o786o320o705J4280K3815O852k0219o918
13529E9979n754J241K4615j1474l4087j1436j0857J5939L294Q7J1476K9267P692
13516G9982k1435M648K2775o474l2196k4434J2972l110J0999K0320L681R838j2818
13503F4748r297P57m114Q740j1887j6961l417J4833P980J2746o49k951j1231l134
13489D6163j3735j80J0288O229j5263q931Q548P890R804M853J3500J6609o200
13476G9575j3436j4103o410J625m783K3922j945k0165j9014M800M120J3249l172
13463D4263j3040j4340J157j1211K831K1845m451O170r739j31j4276j5623j257
$$ plain form
13555 22747 20801 15840 11605 36322 52144 41560 32391 1510 -4849 16178 28393 40836 56121
13542 56121 63634 57757 38836 41147 61980 55194 48874 42169 56449 80264 87116 66897 59979
13529 59979 54225 55466 80081 68607 34520 23084 12227 28166 31460 31547 43023 72290 79982
13516 79982 58547 63195 85970 79496 47300 22866 35838 32728 43727 64047 67728 77566 64748
13503 64748 55451 56208 52094 60834 48947 31986 28569 43402 51382 64128 63479 60528 49297 46163
13489 46163 32428 32248 42536 48765 33502 24571 33119 41009 50813 55666 69166 85775 79575
13476 79575 66139 52036 45626 47251 42468 66390 64445 44280 25266 30066 34186 47435 44263
13463 44263 31223 16883 18040 6829 9660 31505 27054 33224 23485 23354 9078 -6545 -7802
13450g802j171P274Q163J6481J2273K98O128m952j0646j8196l689J8569k732M357
13436B4355p342j0572m661K1935o840j5393k4946q924J6364K7781J7762j11q870
13423B0538L214Q963j672O936L853k3217n595J0132O708r411J054K0271K699l613
13409D0860q381r174J9799J9921p00j780k5173o408K778j0147J0907J4855Q519
13396E5876k3850m726m363R115J024m48O94K3026m594j5685j186m357j0424r440
13382A0662J3079M534q834m588P86O040O573j2357N723p800k810J8406J175O826
13368C7415J6495j3497j425P103J2028J652k1329l4196l080J7872M57N094P30
13355B5319m744J973n308l201J3225L694J39Q598R976J1981J4989m116Q06L53
$$ plain form
13450 -7802 -8973 -1699 6464 22945 35218 35516 41644 36692 26046 7850 4161 22730 19998 24355
13436 24355 17013 6441 1780 23715 16875 1482 -23464 -32388 -16024 11757 29519 29408 20538
13423 20538 23752 32715 31043 37979 41832 18615 13020 23152 29860 20449 21503 41774 44473 40860
13409 40860 32479 23305 43104 63025 62325 60545 35372 28964 31742 21595 32502 47357 55876
13396 55876 32026 27300 22937 32052 33076 32628 33322 56348 51754 36069 34883 30526 20102 10662
13382 10662 23741 28275 19441 14853 15639 21679 28252 15895 21618 13818 11008 29414 30589 37415
13368 37415 53910 40413 38988 46091 58119 59771 38442 4246 1166 19038 19495 24589 25319
13355 25319 20575 22548 17240 14039 27264 30958 31097 39695 49671 61652 76641 72525 73331 73684
13341G3684J9036N128l0637j5004j0162J383J439j8369k4407j875J2098J8078
13329C0392r87J2186J4779r362n54l906j0967J481M98R394J3762j2190k060R467
13315E1933j637k8679j985l863J272N661q753j832N796J7420k0160J1297J9880
13302D6350o434L240J0524j0189Q555K846j7884k4895o890n039K409K1299J3639
13289C7531m272J8340J1655N06q157O145n175j6447P319q695p380j54L6213K0424
13275H7853m642k4252q159j646j109K8626K241j854O983j4620J405k3406m715
13262D2705L923J5948j324j9679o985J2831J528R278J171j1131r399P104O264
13249E2234N496m022j5537K73p4j6574l028L012O404k053R933J8282J856Q071
$$ plain form
13341 73684 92720 97848 67211 52207 42045 43428 44867 26498 2091 216 12314 30392
13329 30392 29405 41591 56370 47008 46454 42548 31581 33062 33560 42954 56716 44526 42466 51933
13315 51933 50296 21617 19632 15769 17041 22702 13949 12117 17913 35333 15173 26470 46350
13302 46350 39916 43156 53680 43491 52046 54892 37008 12113 5223 184 2593 23892 37531
13289 37531 33259 51599 63254 63760 55603 61748 56573 40126 47445 38750 31370 31216 67429 87853
13275 87853 83211 58959 50800 49154 48045 76671 78912 77058 84041 69421 70826 47420 42705
13262 42705 46628 62576 61252 41573 34588 47419 48947 58225 59396 48265 38866 45970 52234
13249 52234 57730 53708 38171 38444 38370 21796 18768 21780 28184 26131 36064 54346 56202 64273
13235F4273j349J215m505O867K370o001M112P944j0240l70N03K0693J4996k1712
13221G8796j3011P034O915k308L428R37j2730k770K519m910j4678m0J8003J118
13207F8303n962j0661K5043Q506J0193K894j3744j387N239k2824j7481l072N844
13194E0891R776J0050J9757O733j7940m780K2247l120l1515j3532J1680K288j3448
13181D9087N996K756l788P8m80K135m510n186L665J4671J5203j980n150k0388
13167E2109j1174J8744j0064Q01J2952j2030M947k344m588R428n675l912K5961
13154G5155K0590j8751J060K3942N946j830j0541q537J5841J0619n530j4987n583
13141H7394J4929O583j4049l221J7762K064J1687J7231p513k1428k520j4025p267
$$ plain form
13235 64273 62924 64139 59634 66501 68871 62870 66982 74926 64686 64316 64819 85512 100508 78796
13221 78796 65785 72819 79734 77426 80854 81791 69061 66291 68810 63900 49222 49182 67185 68303
13207 68303 62341 51680 76723 85229 95422 98316 84572 83185 88424 65600 48119 45047 50891
13194 50891 60667 70717 90474 97207 79267 74487 96734 93614 62099 48567 60247 62535 49087
13181 49087 55083 57839 54051 54129 53649 55784 51274 46088 49753 64424 79627 77647 72497 52109
13167 52109 40935 59679 49615 50416 63368 51338 56285 53941 49353 58781 53106 49194 75155
13154 75155 95745 76994 78054 101996 107942 106112 95571 87034 102875 113494 107964 92977 87394
13141 87394 102323 108906 94857 91636 109398 111462 123149 140380 132867 111439 108919 94894 87627
13128H7627O319O153p366n871J6990L677M198m00J6966P221n155m345R188R365
13114A44567j8043J3127K5608j984k285J0914J6013j2908j6363k553K2497R823
13102A88413N907l541J7401J2103N943K2014K5164N441K1807K2056J0291K1714
13090C54713L1780J3602L8143M8036L4345M9280O3282L9211N419K6342N1377K9890
13078G85420L7421N6680L6791J4106k0800j9295k4638k2890j1573k3824m9895
13067G57503k0471L748l4240l8558k7048k8508j0198j6271j8755j626R573J186
13055E76335K2872O062R227R578L5540M4352M2729N6866N1497P3196M9108O6645
13043A044007P7772P8173Q9208Q9700R7557P8804P3473N4736L0138L5786n513
$$ plain form
13128 87627 93946 100099 92733 86862 103852 107529 111727 111327 128293 135514 130359 126014 135202 144567
13114 144567 126524 139651 165259 163275 160990 171904 187917 175009 158646 156093 178590 188413
13102 188413 194320 190779 208180 220283 226226 248240 273404 278845 300652 322708 332999 354713
13090 354713 386493 400095 438238 486274 520619 569899 633181 672392 677811 704153 755530 785420
13078 785420 822841 879521 916312 930418 909618 890323 865685 842795 831222 807398 757503
13067 757503 737032 740780 706540 667982 640934 612426 602228 585957 567202 565576 575149 576335
13055 576335 599207 605269 614496 624074 659614 703966 746695 803561 855058 928254 977362 1044007
13043 1044007 1121779 1199952 1289160 1378860 1476417 1555221 1628694 1683430 1713568 1749354 1743841
13032A743841m4721m9044o8416n2825q0108r4758j01472j10077q0037o6369p3616
13021I22398o5514l1935n0714o5773l4189k6015q013k4901m2215l5365r02J9299
13009E56161J0131O752J4902J0847P466J2552J6499N0567L8283M3256L7781L5920
12997H41117M5416K7366L0163K370O11M939o313j7512k1537m1648n5802o6460
12985G42710n1685n7903m3660l3531l4153j7743l6752l5703k8253j6341j5535
12974C71451k0761k7422o829j7824J435j0988p105l6265j4873K101J1459j2587
12962B31792j35J138J431j4264P77j7575O600K231J4848J6024k490j9225k5597
12949A95555q367j2409o331j2574l001R398N652L222K2591R685Q353j2146l659
$$ plain form
13032 1743841 1699120 1650076 1581660 1528835 1448727 1353969 1252497 1142420 1062383 996014 922398
13021 922398 856884 824949 774235 708462 674273 648258 640245 615344 573129 537764 536862 556161
13009 556161 566292 573044 587946 598793 606259 618811 635310 685877 724160 767416 805197 841117
12997 841117 886533 913899 944062 946432 947043 951982 945669 928157 906620 864972 809170 742710
12985 742710 691025 633122 589462 555931 521778 504035 467283 431580 403327 386986 371451
12974 371451 350690 323268 316439 298615 300050 289062 281957 245692 230819 232920 244379 231792
12962 231792 231657 232795 234226 219962 220739 203164 209764 211995 226843 242867 240377 221152 195555
12949 195555 187188 174779 168448 155874 152873 162271 167923 171145 193736 203421 211774 199628 195969
12936A95969K505K253Q960p394j4505K691L368J6072J1407l273j6754j3507J8793
12923B06585N748j075k566L336L041N304l157j998o4L4842O683j1448P828l388
12909B49671L511l842M649J872N336N562R067j0423O09j2766J1253J750j6115
12896B50134J3892K4218J518R244N602j730K3107K8823J2824J7689L4112J2335
12884D31768l100J8421J3797j2817l0129j7544N331J6390P377N257j0213k2121
12872D02417q994l247P195J7444l856k1261L136P317j728K2J7165k140j1043J8179
12858D20606l294j4291j894n178J2366K2662JK412J1880J2692K3030K8250N713
12845E14955J5343K1590L8739K7027K2402J6104P80j1287j7274j5878k1921j2319
$$ plain form
12936 195969 198474 200727 209687 202293 187788 190479 193847 209919 221326 218053 201299 187792 206585
12923 206585 212333 211258 208692 212028 215069 220373 217216 215218 215154 249996 256679 245231 253059 249671
12909 249671 253182 249340 253989 255861 261197 266759 275826 265403 266012 253246 264499 266249 250134
12896 250134 264026 288244 289762 299006 304608 302878 325985 354808 367632 385321 419433 431768
12884 431768 428668 447089 460886 448069 417940 400396 405727 422117 429494 434751 424538 402417
12872 402417 393423 390176 397371 414815 410959 389698 392834 400151 398423 398445 415610 413470 402427 420606
12858 420606 417312 403021 401127 395949 408315 430977 430978 433390 445270 457962 480992 509242 514955
12845 514955 530298 551888 590627 617654 640056 656160 656940 645653 628379 612501 590580 578261
12833E78261k1848j4690o800q657j5610R702l297n496j1160k4482j9136k155J268
12820D55900J1214l765j9413p266J2920L300N001J7248J753J659Q814L1799Q118
12807E27282o844p590J2766J1079r837j1156P063J870L425J5644K3933M4033K870
12794F14538J3274J3708N439J1666k9058q085K612o68r707j002O408K450O836
12781F28411j382J1922r703j9215l988J3500K4958M786N005J8481K4271o709j5734
12768F74603J6196P615J6942L7549L0544K2167J1478J8924J7457J0727J9314K4233
12756I07749J8159L7486M3846J5163K293K6318J5933L2979L2739J3024R222L1690
12744A186601M811k1855r576K76K189j095L2394M1091L8185J5544K6111M364K4598
$$ plain form
12833 578261 556413 541723 534923 526266 510656 520358 517061 511565 500405 475923 456787 454632 455900
12820 455900 467114 463349 443936 436670 449590 452890 457891 475139 476892 478551 487365 519164 527282
12807 527282 520438 512848 525614 536693 526856 515700 522763 524633 528058 543702 567635 611668 614538
12794 614538 627812 641520 646959 658625 629567 621482 624094 623426 613719 612717 619125 621575 628411
12781 628411 627029 638951 629248 610033 606045 619545 644503 649289 654294 672775 697046 690337 674603
12768 674603 690799 698414 715356 752905 783449 805616 817094 836018 853475 864202 883516 907749
12756 907749 925908 963394 1007240 1022403 1024696 1051014 1066947 1099926 1132665 1145689 1154911 1186601
12744 1186601 1191412 1169557 1159981 1160257 1162446 1161351 1193745 1234836 1273021 1288565 1314676 1319040 1343638
12731A343638Q162N794M4084M2638J5522K9417M2370L6799M5419M9462N7076P9538
12719A799919O9738P4336O4889M5263L3606L5744L0579K8415J3110J285L5421
12708B232305K2886M1903M0533N8721O8312M8109M2195N1792M6202O6949N3733
12697B773640M3790M4822N3541Q3671J15790J21062J05698J02727R7980R4784
12687C637505J02568J30182J64590J88271J68650J53242J79331K13373K29241
12678E166953K37806K76889K65248L02407L26814L45829L65017L57334L92530
12669H036827M33299M60522N28626N56609O05785O46021O99716P70619Q50039
12660A3588063R30565J022249J110872J223447J328023J483237J642395J815455
$$ plain form
12731 1343638 1351800 1357594 1401678 1444316 1459838 1489255 1531625 1568424 1613843 1663305 1720381 1799919
12719 1799919 1869657 1943993 2008882 2054145 2087751 2123495 2154074 2182489 2195599 2196884 2232305
12708 2232305 2255191 2297094 2337627 2396348 2464660 2512769 2554964 2606756 2652958 2719907 2773640
12697 2773640 2817430 2862252 2915793 2999464 3115254 3236316 3342014 3444741 3542721 3637505
12687 3637505 3740073 3870255 4034845 4223116 4391766 4545008 4724339 4937712 5166953
12678 5166953 5404759 5681648 5946896 6249303 6576117 6921946 7286963 7644297 8036827
12669 8036827 8470126 8930648 9459274 10015883 10621668 11267689 11967405 12738024 13588063
12660 13588063 14518628 15540877 16651749 17875196 19203219 20686456 22328851 24144306
12652B4144306J990375K218956K458401K721327L022891L374889L765969M171955
12644D7869069M599743N103596N632663O196885O760347P336518P880789Q307488
12636I9687098Q620567Q701013Q486770P972547P074481N759847M147474K351802
12628A52801599M28741j426207l101014m464578n473654o135147o431104o413593
12620A19785043o165571n756866n199724m530887l834073l116538k343899j565839
12612H7271646q07274k8012P62090J568317K418416L282987M198815N152688O152809
12603A09972482P222860Q363102R552330J0796296J2074379J3354528J4572624
12596A85908601J5654546J6478172J6893415J6814674J6050075J4500453J2146424
$$ plain form
12652 24144306 26134681 28353637 30812038 33533365 36556256 39931145 43697114 47869069
12644 47869069 52468812 57572408 63205071 69401956 76162303 83498821 91379610 99687098
12636 99687098 108307665 117008678 125495448 133467995 140542476 146302323 150449797 152801599
12628 152801599 153230340 151804133 148703119 144238541 138764887 132629740 126198636 119785043
12620 119785043 113619472 107862606 102662882 98131995 94297922 91181384 88837485 87271646
12612 87271646 86464372 86436360 87198450 88766767 91185183 94468170 98666985 103819673 109972482
12603 109972482 117195342 125558444 135110774 145907070 157981449 171335977 185908601
12596 185908601 201563147 218041319 234934734 251749408 267799483 282299936 294446360
12589B94446360Q971010N220087J107080l042946o990458j0398873j3082615j5006142
12581B61223503j6127565j6537295j6423996j5852947j4951432j3844199j2640607
12574A54845462j1392256j0174701q963926p802751o711697n657143m643035l705449
12566I5794504k797404j911374j069354j83887O58185J494745K323711L150807
12558I7459933L985407M844888N646678O323949O925007P317195P476867P333716
12550A47313640O793825N833093M444361K671487O68588j428329l485047n355048
12542A57456570o911572q071523q854630r247163r310302r131860q800310q284907
12534H8844303p716429p138396o536848n956747n427977m931502m452998m033144
$$ plain form
12589 294446360 303417370 308637457 309744537 306701591 299711133 289312260 276229645 261223503
12581 261223503 245095938 228558643 212134647 196281700 181330268 167486069 154845462
12574 154845462 143453206 133278505 124314579 116511828 109800131 104142988 99499953 95794504
12566 95794504 92997100 91085726 90016372 89832485 90490670 91985415 94309126 97459933
12558 97459933 101445340 106290228 111936906 118260855 125185862 132503057 139979924 147313640
12550 147313640 154107465 159940558 164384919 167056406 167724994 166296665 162811618 157456570
12542 157456570 150544998 142473475 133618845 124371682 115061380 105929520 97129210 88844303
12534 88844303 81127874 73989478 67452630 61495883 56067906 51136404 46683406 42650262
12526D2650262l623943l258462k964883k680073k408336k151210j951800j773347
12518B1838208j578629j407131j276039j183359j083888r89255r01210q08593
12510A2610104p47558o81973o22447n56618n33379n07107m35118m03568l97063
12501G725273l69543l58977l35645l04026k81155k66460k55905k34025k09882
12492E109655k01672k03365j82445j82370j69416j55640j60714j41932j09521
12483C602580j16563j26385r5513r2166q9553r7189o3050o6410q0732o3708m1274
12472B670037o0787j3706k0819o4110m7698k7931m8292j3743k5862n0367l7843
12461B258879n6448n0162l7535m2967m7268m6162n0023o8356n1622n4260n0545
$$ plain form
12526 42650262 39026319 35767857 32802974 30122901 27714565 25563355 23611555 21838208
12518 21838208 20259579 18852448 17576409 16393050 15309162 14319907 13418697 12610104
12510 12610104 11862546 11180573 10558126 10001508 9468129 8961022 8525904 8122336 7725273
12501 7725273 7355730 6996753 6661108 6357082 6075927 5809467 5553562 5319537 5109655
12492 5109655 4907983 4704618 4522173 4339803 4170387 4014747 3854033 3712101 3602580
12483 3602580 3486017 3359632 3264119 3171953 3082400 2985211 2922161 2855751 2775019 2711311 2670037
12472 2670037 2609250 2595544 2574725 2510615 2462917 2434986 2386694 2372951 2347089 2296722 2258879
12461 2258879 2202431 2152269 2114734 2071767 2024499 1978337 1928314 1859958 1808336 1754076 1703531
12450A703531p0407l5532l9162l8615n1991m6004j9242j7305k4509k5724l3085
12439A301955l9357j9810o779j7347j4863j7286L323k89k3114j5395J0280J7503
12427A178821J6784M619o879M960J9695P41n367o399N601M349K2798L6720N0462
12414A326905M5139J1204L398l4038o0752o1430o2012m6605j7236n4035l5853
12403A014685k1630k7125j1655k2345k7139n45P740J3727L6375O3284N7762M2086
12391A125220K4299o149m6607n1355l7441q380N144J437P583K5354P799l596J3905
12378A057213Q097M423j8338l3995l1308l1861l0782k4952j8492l9987m6730k9603
12366G63685j4084m551J2152J8522j0577k3676k014K084J4616L6551N4244M7354
$$ plain form
12450 1703531 1633124 1597592 1558430 1519815 1467824 1421820 1402578 1385273 1360764 1335040 1301955
12439 1301955 1262598 1242788 1236009 1218662 1203799 1186513 1189836 1189547 1166433 1151038 1161318 1178821
12427 1178821 1195605 1200224 1193345 1198305 1218000 1218741 1213374 1206975 1212576 1216925 1239723 1276443 1326905
12414 1326905 1372044 1383248 1386646 1352608 1291856 1230426 1168414 1121809 1104573 1050538 1014685
12403 1014685 993055 965930 954275 931930 904791 904246 911986 925713 962088 1025372 1083134 1125220
12391 1125220 1149519 1143370 1096763 1045408 1007967 999587 1004731 1006168 1013751 1039105 1046904 1043308 1057213
12378 1057213 1065310 1069733 1051395 1017400 986092 954231 923449 898497 880005 840018 793288 763685
12366 763685 749601 745050 757202 775724 765147 741471 739457 741541 756157 792708 846952 894306
12354H94306N3286Q068J0157J4155N292J6058m079l9928o7453o8511p4233o5464
12342F81654l3859l4667k2522n237L45J0216K7783O0756P2875L6194j7423m8743
12330G27372o8838o7040m9090k0177k9312l1425j6845j8988j797K6537J0290q738
12318D51949Q857M193p857R580J870j3435k0856M976n292j2738p069J5115r9m964
12304D24230M830K1174L56j9741k2362m4O463L816J6640P853K1896L6709K6830
12291E28650L3953L8657L9851K2247N896k1876n2515n6015m4259j7555j0269k157
12279D64608k4657k3194k4066l3151j4093J7664j1978j3434J5530L260m171n154
12267C47164K227K1093r260k121l4219J8422K1991M496j0357j7758r968j7504
$$ plain form
12354 894306 947592 955660 965817 979972 985264 1001322 997243 957315 889862 821351 747118 681654
12342 681654 647795 613128 590606 585369 585714 595930 623713 684469 757344 793538 776115 727372
12330 727372 658534 591494 542404 522227 492915 461490 444645 425657 423860 450397 460687 451949
12318 451949 460806 464999 457142 466722 468592 455157 434301 439277 433985 421247 414178 429293 429194 424230
12304 424230 429060 450234 450590 430849 408487 408443 414906 418722 435362 443215 465111 501820 528650
12291 528650 562603 601260 641111 663358 669254 647378 594863 538848 494589 477034 466765 464608
12279 464608 439951 416757 392691 359540 345447 363111 351133 337699 353229 356489 352318 347164
12267 347164 349391 370484 361224 359103 324884 343306 365297 369793 359436 341678 331710 314206
12255C14206j101K2795K1999Q675K436m186o706N567J6520M1076K6124L4848L322
12242D85575j6803l9010j6455L660j9118j6208m721j1084J2506j3319k4625M107
12230C44505j1143p592J1159J0705M754O91J531K491m277j8097k3040j004O096
12217C16779J145J5500J0081j0471k7435j0846n452O097K0552N899L596O976R931
12204C42352n790j736K5456Q219l389j3662J3236M1305J1815J3215K0078l912
12192D47187K7110K0890J2182L2835K6123K9822K7091L8276N2821O6503M4363
12181H25203L8406L7149K1014K0588K7163L4663K3251K586o765k1119l1257j8237
12169I52645l3518j9131k4381k8174m7339m1372j2474k4755l6454j8572n676M685
$$ plain form
12255 314206 313105 335900 357899 366574 369010 364824 358118 363685 380205 421281 447405 482253 485575
12242 485575 468772 429762 413307 416967 397849 381641 376920 365836 378342 365023 340398 344505
12230 344505 333362 325770 336929 347634 352388 353079 354610 357101 352824 334727 311687 310683 316779
12217 316779 317924 333424 343505 333034 305599 294753 289301 295398 315950 321849 325445 332421 342352
12204 342352 336562 334826 360282 368501 365112 351450 364686 405991 417806 431021 451099 447187
12192 447187 474297 495187 507369 540204 566327 596149 623240 661516 714337 780840 825203
12181 825203 863609 900758 921772 942360 969523 1004186 1027437 1030023 1023258 1002139 970882 952645
12169 952645 919127 899996 875615 847441 800102 758730 746256 721501 685047 666475 660799 665484
12157F65484K4512J2618J4627O591Q819J6901J0493J4260M6724O6726L8978N3802
12145I80535N5962O2730P8316P3981P8898Q2388R1939Q4031N2221M8632J9047
12134A708680L8103K1937k9479k2901o4398o8167o7424q0917p3470r0449q2639
12123A188876q3199q8634o6466n1422n2423o3770n1262l3274j7302k2058j5777
12112F43289j8688j8142K851O055l998J3953L1798K1536N490J3780K3871L4966
12100G56761M0160N3011M5091J2988K9668J3227K9060J1049l570o945j7689j8674
12088I44137m3272m5952m8706o0821k4510k3770k2954k4866l8457l8017n6060
12077E16752n8180m3003l7752m9251k4524j2111j8051q933j9504j7925R563M790
$$ plain form
12157 665484 689996 702614 717241 723832 732651 749552 760045 774305 821029 887755 926733 980535
12145 980535 1036497 1099227 1177543 1251524 1330422 1412810 1504749 1588780 1641001 1689633 1708680
12134 1708680 1746783 1768720 1739241 1716340 1651942 1583775 1516351 1435434 1361964 1271515 1188876
12123 1188876 1105677 1017043 950577 899155 846732 782962 731700 698426 681124 659066 643289
12112 643289 624601 606459 609310 615365 611367 625320 657118 678654 684144 697924 721795 756761
12100 756761 796921 849932 895023 908011 937679 950906 979966 991015 987445 980500 962811 944137
12088 944137 900865 854913 806207 745386 720876 697106 674152 649286 610829 572812 516752
12077 516752 458572 415569 377817 328566 304042 291931 273880 264947 245443 227518 237081 241871
12065B41871l114k8875r289M953N210k7076j7571K3887J0485j0541j741K2637
12053B10836M03j553k2044q491q786j0756p905K4751O530m813P293j760j0492
12040A73213K7256L1510O1384Q0046N4811J0761l2730o0700m7557n3130l9217
12029B05647k8200j1954p527Q044J6799p820r807K6013J9569j5158j0861j4413
12017A70332N685q230l4284L632O801M163R54K730l079M974k593J41j278L122
12003A53070N031k588r444k160m729q395J5951K5858L2476O3577O7805O9600K5794
11990D31846k8401m8040n0910o1182l0834n160J0744q080N399l296J1502L8023
11978B61611M5119L0134K617p775k0314o1923o3322l4964O810O785n344J1555
$$ plain form
12065 241871 238757 209882 200593 205546 210756 183680 166109 189996 200481 189940 188199 210836
12053 210836 211239 209686 187642 179151 170365 159609 151704 176455 182985 178172 185465 183705 173213
12040 173213 200469 231979 293363 373409 428220 438981 406251 345551 297994 244864 205647
12029 205647 177447 165493 157966 166010 182809 174989 165182 191195 210764 195606 184745 170332
12017 170332 176017 167787 133503 137135 143936 148099 149053 151783 148704 153678 151085 151226 149948 153070
12003 153070 158101 155513 146069 143909 139180 130785 146736 172594 205070 268647 336452 406052 431846
11990 431846 403445 355405 304495 243313 212479 207319 218063 209983 215382 212086 223588 261611
11978 261611 306730 336864 339481 331706 311392 249469 186147 151183 157993 164778 159434 170989
11966A70989M110j1072O34r47k6578k0652J6188K3402J5553K784q888j6731j2087
11953A36705P948L684M510Q508K6176K2285J9719O775q905j4449p318k2004R258
11940A92892J0535n357J7324J5873L47J6777M1416K9533N4409L3577l0636o5211
11928C11479m6499l5120m3255j6321k511J108n591k699j2397J4299R910m676K717
11915A70444K8060J4991N292j6245l300Q388Q332p684j0480j5132j704j2217J1355
11902A80100J7250K9916j268q873J638j957R505l228j5872l523J4052J5315O295
11889B39350J9058K8892N674q066j5398N49k1463r903k0535j1030j3043L839J6869
11876B14793J3263J3646K023r265j2456Q566J0713N606J8561K536j1267l0112
$$ plain form
11966 170989 175099 164027 164661 163714 137136 116484 132672 156074 171627 174411 165523 148792 136705
11953 136705 144653 148337 152847 161355 187531 209816 229535 236310 227405 212956 205638 183634 192892
11940 192892 203427 198070 215394 231267 231614 248391 289807 319340 373749 407326 376690 311479
11928 311479 264980 229860 186605 170284 167773 168881 163290 160591 148194 162493 172403 167727 170444
11915 170444 198504 213495 218787 202542 199242 207630 215962 208278 197798 182666 180962 168745 180100
11902 180100 197350 227266 225998 217125 218763 216806 226311 223083 207211 203688 217740 233055 239350
11889 239350 258408 287300 292974 284908 269510 270059 248596 238693 218158 207128 194085 197924 214793
11876 214793 228056 241702 243725 234460 222004 230570 241283 246889 265450 267986 256719 226607
11864B26607R58Q291K884J4022K3126J1067L859N599j0085k924j3255p263O455
11851B69341J2204J3307K4661j4795m627M816J4591k062m312o014L169o858J763
11838C05184K0201Q887K3314k209q991j066p819j3721j6686O260M728J6713K8771
11825C63566J2567J2900R636j0028k390N038l450J1827N190J2984o79j2376J1858
11812D16643O187P442n232J5356L7137K4242J3306Q819Q152k0184k8431K7167
11800E10604K3201K095J813J238J799M84O186K0232M378q95k661K7108K5486J1962
11786F33030L6776J0638j2761J8024J9372J0645J0210Q361r77J6597K2317J3239
11774G85471j94O976M3513M2336j1868q066L0275L7420J8652O64Q412K2401L3424
$$ plain form
11864 226607 227565 235856 238740 252762 275888 286955 290814 296413 286328 283404 270149 262886 269341
11851 269341 281545 294852 319513 304718 300091 304907 319498 317436 313124 307110 310279 303421 305184
11838 305184 325385 334272 357586 355377 346386 345320 337501 323780 307094 313354 318082 334795 363566
11825 363566 376133 389033 398669 388641 386251 391289 387839 399666 404856 417840 417161 404785 416643
11812 416643 422830 430272 425040 440396 477533 501775 515081 523900 532052 511868 483437 510604
11800 510604 533805 535900 537713 538951 540750 541234 547420 567652 572030 571135 568474 595582 621068 633030
11786 633030 669806 680444 667683 685707 705079 715724 725934 734295 733318 749915 772232 785471
11774 785471 785277 792253 835766 878102 866234 858168 888443 925863 944515 945179 953591 975992 1009416
11761A009416N1692K3785J4185J7081J5888K186J5147K4763M1097L0117K0463
11750A265820K6457J1393L4954L7977K2811L1183L2547M6386J9226J0278L0644
11739A569676L3132K4433L1752K6499J4496M9350L2391L4060N2452L0739K3512
11728A922492K8252J3610N7636O1215K1792L9917L4631J6706L2709L0784L0931
11717B290675L9840K0276J4611K7475K3441R326J8734J04m774N959J1188J0956
11705B467811J0263r772Q608J5743l3214k6761j7949j6091j6812n54j2235j4090
11693B354947k5272k9469k2012k1097k7823m4503l5509j7384m3528n4478m3606
11682A990266p571l0644l5650k7399m4082n1013j7141k8023l8694k6744k3242
$$ plain form
11761 1009416 1061108 1084893 1099078 1116159 1132047 1134233 1149380 1174143 1215240 1245357 1265820
11750 1265820 1292277 1303670 1338624 1376601 1399412 1430595 1463142 1509528 1528754 1539032 1569676
11739 1569676 1602808 1627241 1658993 1685492 1699988 1749338 1781729 1815789 1868241 1898980 1922492
11728 1922492 1950744 1964354 2021990 2083205 2104997 2144914 2179545 2196251 2228960 2259744 2290675
11717 2290675 2330515 2350791 2365402 2392877 2416318 2425644 2444378 2444482 2439708 2445667 2456855 2467811
11705 2467811 2478074 2468302 2476910 2492653 2459439 2432678 2414729 2398638 2381826 2381272 2369037 2354947
11693 2354947 2329675 2300206 2278194 2257097 2229274 2184771 2149262 2131878 2088350 2033872 1990266
11682 1990266 1982695 1952051 1916401 1889002 1844920 1793907 1776766 1748743 1710049 1683305 1660063
11671A660063m0992l5838l7292k5800l9343k8863k5944j8781k8067l5092l3241
11660A310810j2654l6984l0065k5783l2563l4046k6661M991j8940l0109j1062
11649A056934n038k9383l3190m3613l1927j536j7698j2327p075l8065k1064j3608
11637H02410j0431j4660j255j7740n2543l1611j4806j0156J2476J3581L835k5988
11625F53112k8037k2085j3268R45m872m542j8842j4371P6k3959q645r474j88r722
11611D96128k553p104p432P071J1615j3565j2486k4653l823J1285j0396j7511
11599D26576n417m884o072n771p675J1741m872p91J884N068p706j3532k9226k3923
11585C35400o28J0705P455j4455O564j7104P179J0321l421n232j7193J256K1061
$$ plain form
11671 1660063 1619071 1583233 1545941 1520141 1480798 1451935 1425991 1407210 1379143 1344051 1310810
11660 1310810 1298156 1261172 1231107 1205324 1172761 1138715 1112054 1117045 1098105 1067996 1056934
11649 1056934 1051896 1022513 989323 945710 913783 912247 894549 882222 875147 837082 816018 802410
11637 802410 791979 777319 776064 758324 705781 674170 659364 649208 661684 675265 679100 653112
11625 653112 625075 602990 589722 590667 585795 581253 562411 548040 548116 524157 515512 506038 505850 496128
11611 496128 493575 486471 479039 486110 497725 484160 471674 447021 443198 454483 444087 426576
11599 426576 421159 416275 410203 404432 396757 408498 403626 402835 404719 409787 402081 388549 359323 335400
11585 335400 334772 345477 352932 338477 345041 327937 335116 345437 342016 336784 319591 320847 341908
11572C41908K812j9296j9455j5240N788N06M261O100m30k35J233R815J3130k4455
11558C06442k2229k3884q473Q417K0749o722j5006j2232m43r687k0416K654k216
11545B16954J4182O124M15k2968m511J2967k659Q563K712J1244K26l467q300l973
11531B27509R791j0795j6700R491J2225q939L799R79L420j5667P41L49J068K0294
11517B37565Q240l704j0001K727j3378p715k287q75n426p479p53L493j797K1076
11503B19686Q603K119r54k4843m782J3072j0051n979k848J2752R887k992k4971
11490A88699j6639J6675P086k02k907j0453j3000j0961O142J8126J4968N506j8071
11477A84969k793J5181m81J8322L712j6686J0320L935L766J5384J9938O836r573
$$ plain form
11572 341908 344720 325424 305969 290729 296517 297023 301284 307384 306954 306719 307952 317767 330897 306442
11558 306442 284213 260329 251856 260273 281022 274300 259294 247062 246619 236932 216516 219170 216954
11545 216954 231136 237260 237675 214707 210196 223163 220504 229067 231779 243023 243249 239782 231482 227509
11531 227509 237300 226505 209805 219296 231521 222582 226381 227360 230780 215113 215854 216203 217271 237565
11517 237565 245805 242101 232100 234827 221449 213734 211447 210572 205146 197667 196914 200407 198610 219686
11503 219686 228289 230408 229454 204611 199829 212901 202850 196871 194023 206775 216662 213670 188699
11490 188699 172060 188735 195821 195619 192712 182259 169259 158298 164440 182566 197534 203040 184969
11477 184969 182176 197357 196876 215198 218910 202224 212544 216479 220245 235629 255567 262403 252830
11464B52830o550q734o049o879Q529J4144N850M019n775j3339L033M159l533q035
11450B33670j035k737O919K931L951J9269L5265K3842K3667N2886P1743R7733
11438E68104J40156J52379J69731J96076J81356J38494P6274M2741p972o1926
11428A595413j00831j45138j65803j52063j56269j43435q2344o2431o2909l0259
11418D93931k5010l8811l4796q61J0163m026o508k3723l0797j5027K4680J6270
11406C65485L661J1762L3173M0477K0371N0940Q6364J34912J68690K29792K72583
11395A418210L31226L35250L34610L01438K22578J23335M875j30942k24526k73934
11385B442120l12081l45840l18023k66842k09308j47682j26011r8984o5660o3181
$$ plain form
11464 252830 246280 237546 231497 224618 233147 247291 253141 257160 251385 238046 241079 245238 241705 233670
11450 233670 232635 229898 236817 239748 243699 262968 298233 322075 345742 398628 470371 568104
11438 568104 708260 860639 1030370 1226446 1407802 1546296 1622570 1665311 1657339 1595413
11428 1595413 1494582 1349444 1183641 1031578 875309 731874 649530 587099 524190 493931
11418 493931 468921 430110 395314 394453 404616 400590 394082 370359 339562 324535 349215 365485
11406 365485 369146 380908 414081 454558 474929 525869 612233 747145 915835 1145627 1418210
11395 1418210 1749436 2084686 2419296 2720734 2943312 3066647 3071522 2940580 2716054 2442120
11385 2442120 2130039 1784199 1466176 1199334 990026 842344 716333 617349 551689 488508
11375D88508l9639j8903l362J0538n236k862r995q856j2887j2140j8881P447J6649
11362C90381N450j2807j2873M4299N5528O1020J04133J33186J43730J39874J38124
11351A190045J30863J10180N5122J6948l1124m4536j16449j44873j32032j42059
11341H92085j36599j15987j05285o6991n7143n8616m7970k7837r874l911j2603
11330B49269m650r957j1819K5689J3916l2921o277J7565M536j269j8877j3999
11318B11206r142n597Q02J601Q408N411o245j7349j1178P779N446J098K1241J6564
11304B30045O923J5008N594O650l143q719r833k8891j4927J4008J6702k48k486
11291B26683j4272J1988L0595M5287J8866J5044J7013J7784J6875K6875K1999
$$ plain form
11375 488508 448869 429966 426604 437142 431906 429044 419049 410193 397306 385166 366285 373732 390381
11362 390381 395831 383024 370151 414450 469978 530998 635131 768317 912047 1051921 1190045
11351 1190045 1320908 1431088 1486210 1503158 1472034 1427498 1311049 1166176 1034144 892085
11341 892085 755486 639499 534214 467223 410080 351464 303494 275657 265783 261872 249269
11330 249269 244619 234662 222843 248532 262448 229527 223250 240815 245351 244082 225205 211206
11318 211206 202064 196467 197269 198870 207278 212689 206444 189095 177917 185696 191142 192240 213481 230045
11304 230045 236968 251976 257570 264220 261077 252358 242525 213634 198707 212715 229417 229169 226683
11291 226683 212411 224399 254994 300281 319147 334191 351204 368988 385863 412738 434737
11280D34737O384J6415j712k9248k3080j6936j3605l1685l6745r666j2208j1868
11268B70783M484J4316R38j0345l758o423J5054R678o689k1385K4693K8530Q878
11255C28754r340n434L1763K0589K7123K8075J2056K5118Q117N672M7510N3299
11243E73302J9399J0289n084J9164j1212j8712l03j3870O502j9531m1552j9145
11231D99247l8396m2051j6448o102k7857j3635j3995j6893L626L638j5715l7183
11219B78236l5062j3268P634j2202l256J1174O634p708J3406K3546L4534L7948
11207C41616J4330J9932J2525J5725M07P105J0212O498K7953L6401k621K657K796
11194D95536k0405K478J8319Q640K5658L0413p730p808p159P464j824r851j9319
$$ plain form
11280 434737 441121 457536 455824 426576 403496 386560 372955 341270 304525 294859 282651 270783
11268 270783 275267 289583 290521 280176 276418 269995 285049 294727 288038 266653 291346 319876 328754
11255 328754 319414 313980 345743 366332 393455 421530 433586 458704 466821 472493 520003 573302
11243 573302 592701 602990 597906 617070 605858 587146 586843 572973 579475 559944 518392 499247
11231 499247 460851 418800 402352 396250 368393 354758 340763 323870 327496 331134 315419 278236
11219 278236 243174 229906 237540 225338 222082 233256 239890 232182 245588 269134 303668 341616
11207 341616 355946 375878 388403 404128 404535 411640 421852 428350 456303 492704 490083 492740 495536
11194 495536 475131 477609 495928 504568 530226 560639 552909 545101 537942 545406 543582 533731 514412
11181E14412j4274j7140j9073j2289j8301k9120o056J050j3345J284q081R297
11169C88364J3274K7444K7580L9069M4412O5595O9435O1387N8769N9709N0669
11158I05707M0368L6371L2766k1008l4767l5617n1648l9945k6284k44N298L4000
11146H44997L5035K9257L6278K0940J1979K4678Q104k2501k9200l4442q220q298
11134I08607j857L2678L0186K8241M1354N7677Q7654P1830O8884J06841J03758
11123A535853R5672Q9164R6636J05955Q8247O1021L6894J9402L871l3386o9823
11112B029506j05555j07478j00875q3915o8665o0201k9490J577M1611K6929K5501
11101A568945M4356M1796L2544O4763N8278O0291O4637Q1897R9785J01870Q7319
$$ plain form
11181 514412 500138 482998 463925 451636 433335 404215 398159 399209 385864 387148 379067 388364
11169 388364 401638 429082 456662 495731 540143 605738 675173 736560 795329 855038 905707
11158 905707 946075 982446 1015212 994204 959437 923820 872172 832227 805943 805699 810997 844997
11146 844997 880032 909289 945567 966507 978486 1003164 1011268 988767 959567 925125 916905 908607
11134 908607 906750 939428 969614 997855 1039209 1096886 1184540 1256370 1325254 1432095 1535853
11123 1535853 1631525 1720689 1817325 1923280 2011527 2072548 2109442 2128844 2132715 2099329 2029506
11112 2029506 1923951 1816473 1715598 1631683 1563018 1502817 1473327 1474904 1516515 1543444 1568945
11101 1568945 1613301 1655097 1687641 1752404 1810682 1870973 1935610 2017507 2117292 2219162 2306481
11090B306481P5261M7631M516K0281P915k6488l062J0190L4793P3779R1869J22566
11078B765732J40845J51445J66524J48783J58097J62185J24410J11321J11853
11069D041195R4319J30681J60182J81646K09993K38138K58700L13088L46991L83309
11059F358242M56804N48042O23349Q01091R72988J109728J293258J463545J597700
11050A5224747J669318J704297J735635J784466J937734K219699K782902L787975
11042C2846773N363866P784697J1366806J6320417K2205254K8195031L3477217
11035A57560061L6864920L7056225L3454803K6097265J5428542K988605r595621
11028B99854800k0772830k9072161l3735538l4906927l2970907k8695904k3322173
$$ plain form
11090 2306481 2381742 2429373 2433889 2454170 2462085 2435597 2432535 2442725 2477518 2551297 2643166 2765732
11078 2765732 2906577 3058022 3224546 3373329 3531426 3693611 3818021 3929342 4041195
11069 4041195 4135514 4266195 4426377 4608023 4818016 5056154 5314854 5627942 5974933 6358242
11059 6358242 6815046 7363088 7986437 8787528 9760516 10870244 12163502 13627047 15224747
11050 15224747 16894065 18598362 20333997 22118463 24056197 26275896 29058798 32846773
11042 32846773 38210639 45995336 57362142 73682559 95887813 124082844 157560061
11035 157560061 194424981 231481206 264936009 291033274 306461816 309450421 299854800
11028 299854800 279081970 250009809 216274271 181367344 148396437 119700533 96378360
11021I6378360j7896908j3082777r265052o397793m293304k749636j554097o46464
11013D0492329K5896N27918Q71544J126843J290766J435756J496789J596055J881373
11004E0745269K440789L421704N075337P626690J1612400J7789330K6848031L8475242
10996A64034792N0663986O2184560P0732354P3028257O8005723N5691601L6085271
10989E80426544J2435899j2042096l5060696n3082727o4150785o8719902o6803158
10982B93003079n9489597m9399215l8570811k8659268k0615907j4576281j0227672
10975G1464328p179684n103177l699737k840422k389043k160636k042513j949423
10967D4099693j822527j592307j316490q89207l60467L05402J235652K471750
$$ plain form
11021 96378360 78481452 65398675 56133623 49735830 45442526 42692890 41138793 40492329
11013 40492329 40518225 41046143 41917687 43044530 44335296 45771052 47267841 48863896 50745269
11004 50745269 53186058 56607762 61683099 69309789 80922189 98711519 125559550 164034792
10996 164034792 214698778 276883338 347615692 420643949 488649672 544341273 580426544
10989 580426544 592862443 580820347 545759651 492676924 428526139 359806237 293003079
10982 293003079 233513482 184114267 145543456 116884188 96268281 81692000 71464328
10975 71464328 64284644 59181467 55481730 52641308 50252265 48091629 46049116 44099693
10967 44099693 42277166 40684859 39368369 38479162 38118695 38424097 39659749 42131499
10959D2131499M182490O648347J0173333J4838107K0217099K5572801L0079719
10952A53843395L2676654L2210855K8292052K1065264J0972890m37735j1635944
10945B66987431k1324848k8176725l1687745l2072066k9750624k5572686k0635883
10938G7766854j5800077j1655528q434784o068155m403002l266952k529005k066156
10930B3543195j837307j727589j697714j694569j644855j549621j404859j254226
10922A0732455j070132r02793p24472o00556m71794l91078l33476k99363k60575
10913E678216k35806k04939j83799j99513j67651j63052j18903r0033j18217j35520
10903D060783j16985j38355j29695j30261j21442j24928j38616j25991j24604
$$ plain form
10959 42131499 46313989 52962336 63135669 77973776 98190875 123763676 153843395
10952 153843395 186520049 218730904 247022956 268088220 279061110 278623375 266987431
10945 266987431 245662583 217485858 185798113 153726047 123975423 98402737 77766854
10938 77766854 61966777 50311249 41876465 35808310 31405308 28138356 25609351 23543195
10930 23543195 21705888 19978299 18280585 16586016 14941161 13391540 11986681 10732455
10922 10732455 9662323 8759530 8035058 7434502 6962708 6571630 6238154 5938791 5678216
10913 5678216 5442410 5237471 5053672 4854159 4686508 4523456 4404553 4314520 4196303 4060783
10903 4060783 3943798 3805443 3675748 3545487 3424045 3299117 3160501 3034510 2909906
10894B909906j11864j20424q9527r6028q1810o8877p1729p6388p9428q1882p1006
10883A960943m3509l7925m9750n9221l4531m6054j2367r422o583M1161L8290O2580
10871A803612N2571K2047M6877O7960M7685O5497M4863K2890j3538m7467n6502
10860B056495p5142q8114j10413j16824j03061r2968p1288p3336n6200n9464n1512
10849A158173k9900k8474k6642l7682n6147m7054j9332j8808j3445l2168l7228
10838H11293n2041n0547j2839K452K0381J7201M9563O0266M3764L1164L2570L1278
10826I84505K5786L1762K9489M240J4032p647k5377j5850k8604n3998k4584k1014
10814I12740j7750l7606l344k954l1296k5433l0071q668N364j5762m7271l1472
$$ plain form
10894 2909906 2798042 2677618 2588091 2492063 2410253 2341376 2269647 2193259 2113831 2031949 1960943
10883 1960943 1917434 1879509 1829759 1770538 1736007 1689953 1677586 1668164 1661581 1702742 1741032 1803612
10871 1803612 1856183 1878230 1925107 1993067 2040752 2106249 2151112 2174002 2160464 2112997 2056495
10860 2056495 1981353 1893239 1782826 1666002 1562941 1469973 1398685 1325349 1269149 1209685 1158173
10849 1158173 1128273 1099799 1073157 1035475 979328 932274 912942 894134 880689 848521 811293
10838 811293 759252 708705 695866 698318 718699 735900 785463 845729 889493 920657 953227 984505
10826 984505 1010291 1042053 1071542 1075782 1089814 1082167 1056790 1040940 1012336 958338 933754 912740
10814 912740 894990 857384 854040 851086 819790 794357 764286 755618 760982 745220 697949 666477
10802F66477j1257l8304m5410l1611l7118l7970k8630m016k0917j785O509l104
10790D12864q12J505K1692K0195J8423q341N240l677j6607P648j9104J9066Q881
10777D66973l625k453n88k075j353n537p695J8037J8930K507K2963P087j5404
10764D97767j6796j9897r716m215k5210k4705k3348j1766k1407k8108k2064M060
10752B94595J2242J4010p139m209j1097j6306r959l367j616J1959N243K725j2705
10739B74376K4702J1670N110m544N156L957j0397k479P24p274l004l602j2659
10726B81736k9296m297J5688J233N958j9561K3866N677k872j8535k4502J2181
10714B47276j0116J431J7149l235o130N91o310m705j4050L065k004j0459j9233
$$ plain form
10802 666477 655220 616916 571506 539895 502777 464807 436177 432161 411244 409459 415968 412864
10790 412864 412052 413557 435249 455444 473867 465526 470766 467089 450482 458130 439026 458092 466973
10777 466973 463348 460895 460307 458232 456879 451342 443647 461684 480614 483121 506084 513171 497767
10764 497767 480971 461074 451358 447143 421933 397228 373880 362114 340707 312599 290535 294595
10752 294595 306837 320847 313708 309499 298402 282096 272137 268770 267154 279113 284356 287081 274376
10739 274376 299078 310748 315858 311314 316470 320427 310030 307551 308275 301001 297997 294395 281736
10726 281736 252440 248143 263831 265064 271022 251461 275327 281004 278132 259597 235095 247276
10714 247276 237160 238591 255740 252505 246375 246966 240656 235951 221901 224966 222962 212503 193270
10701A93270J234o021j2714Q86R536L061J7306M731J2051K4654o725m997k5473
10688B10799p090p282J1443J55j7065j5010r433o034P865R882j2042k3996o014
10675A36178Q234K428o033J2716L95N147J0903N802j0722m909J8963J3559k270
10662A90391j0850m881L542j241k062j5765j1248P047J6136O127L933J440J789
10649A84358J6162J6821J8164J5125R272Q106K7667K3764P333r022j6752J2023
10637C13021M2945M3007M0101P3261J13373J36285J62106J71830J63779J71612
10627A431320J83938J12483P1288O855o3146r3270j40709j71718j69561j67983
10617I99497j51770j28316j15933p6965m5712l8309j9274j2976J033p24Q699J1362
$$ plain form
10701 193270 194504 188483 175769 176655 186191 189252 206558 211289 223340 247994 241269 236272 210799
10688 210799 203709 196427 207870 208025 190960 175950 166517 160483 168348 178230 166188 142192 136178
10675 136178 144412 146840 140807 153523 153918 159065 169968 175770 165048 160139 179102 192661 190391
10662 190391 179541 174660 178202 176961 174899 159134 147886 154933 171069 177196 181129 182569 184358
10649 184358 200520 217341 235505 250630 259902 268008 295675 319439 326772 317750 300998 313021
10637 313021 355966 398973 439074 512335 625708 761993 924099 1095929 1259708 1431320
10627 1431320 1615258 1727741 1799029 1805884 1742738 1649468 1508759 1337041 1167480 999497
10617 999497 847727 719411 603478 526513 480801 442492 423218 410242 411275 410551 419250 430612
10605D30612R850L007J4555N37q099J5940r900P816L8653N3004N1768N6379P5744
10592G39866J05204J59829K32801K72467K88520L40224L62225L16936K34130J17408
10582C169610J8535j03099k13106k92378l22134l32311k96519k45767k12209j45508
10572A025114r8967j08904j02093o8420m6172m4046n0600l7152j3572l3983k8548
10561C92657j6665j5425j6960J1295p396n877j231N768J0965L356L5736Q9222
10549D85445J09201J17032J46545J66633J40071J50110J25275P7855J8539j6895
10539A519811r0777j36776j52315j33548j47597j04377r3109p9983p8891o3318
10529D39120j6023M222m1596l2231k2778l4045l4579j8163k2678l1821k0321j3384
$$ plain form
10605 430612 440462 443469 458024 458561 450462 466402 456502 464318 502971 555975 607743 664122 739866
10592 739866 845070 1004899 1237700 1510167 1798687 2138911 2501136 2818072 3052202 3169610
10582 3169610 3188145 3085046 2871940 2579562 2257428 1925117 1628598 1382831 1170622 1025114
10572 1025114 926147 817243 715150 646730 600558 556512 505912 468760 455188 421205 392657
10561 392657 375992 360567 343607 354902 347506 341629 340398 346166 357131 360487 396223 485445
10549 485445 594646 711678 858223 1024856 1164927 1315037 1440312 1518167 1536706 1519811
10539 1519811 1429034 1292258 1139943 1006395 858798 754421 661312 581329 502438 439120
10529 439120 423097 427319 385723 353492 330714 296669 262090 243927 221249 189428 169107 155723
10517A55723n107n555r741k23J5199J3294j0119K291n275Q269J6051L0386M1277
10504B46470M6388M3033K3714R516P686J6990M830j3072k2281l3540k7458j1707
10492B90569m06m000j0294o344o930j345M18L207o327k092P376O021J7540K2632
10478C10025J4428j2002R999K0070K2409R409L2044M9756M1483n36k9782j8685
10466D48618k8220l3867l3343k2865j9621n217j5365j1303m169k5804k0905o278
10454B21661P504K9352q949j6831o299m773J2591N493K0243L3134K4113J2378
10442C29617j7330k9510J2864K2780j7281l5317l8710p658j4333j7946l3034j8334
10430A35808M626J4128k2368k2271q372L2022L4130M46k0624j3212m09j0082j2649
$$ plain form
10517 155723 150616 145061 135320 135097 150296 163590 153471 155762 150487 158756 174807 205193 246470
10504 246470 292858 335891 359605 369121 376807 393797 398627 385555 363274 329734 302276 290569
10492 290569 290163 286163 275869 269525 262595 261250 261668 264875 258548 256456 263832 269853 287393 310025
10478 310025 324453 312451 322450 342520 364929 374338 406382 456138 497621 497085 467303 448618
10466 448618 420398 386531 353188 330323 310702 305485 290120 278817 274648 248844 227939 221661
10454 221661 229165 258517 249568 232737 226438 221665 234256 239749 259992 293126 317239 329617
10442 329617 312287 282777 295641 318421 301140 265823 227113 219455 205122 187176 154142 135808
10430 135808 140434 154562 132194 109923 101551 133573 167703 168149 147525 134313 133904 123822 111173
10417A11173r519j7666j1700l747O201K3173O034k0062p755J4409K576j4373m607
10404G4137R84J3836J1293j1019k2191q666j114J6863P000j763l142k236K988
10391G6970Q455J0815k4124k4107J0038N902n377J3532O520k2737k109j275M673
10378E7176L831o973k814k083M819K3410Q232J8705J89k7488j440N168l1987j9834
10364B8911J2175N577K994k489K1213N246p805k3815j3045J1116J5251K0852K7372
10351A03553r56k3434j5969m812o317k0184J741P45m554m826j7605Q151n395J4106
10337B4244J5101j612n65O715P198l703r354O001M302J3854K7819J3457j4887
10324H8570r466l8083j5838j1682j0287O908L099J0739K2962o428m403m55j1774
$$ plain form
10417 111173 101654 83988 72288 68541 74742 97915 103949 83887 76132 90541 93117 78744 74137
10404 74137 75121 88957 100250 89231 67040 58374 57260 74123 81123 79360 76218 73982 76970
10391 76970 85425 96240 72116 48009 58047 63949 58572 72104 78624 55887 53778 52503 57176
10378 57176 61007 54034 51220 49137 53956 77366 85598 104303 104492 77004 75564 80732 48745 28911
10364 28911 41086 46663 49657 47168 68381 73627 65822 42007 28962 40078 55329 76181 103553
10351 103553 102597 79163 63194 58382 52065 31881 33622 34367 29813 24987 7382 15533 10138 24244
10337 24244 39345 37733 37168 43883 51081 47378 38024 44025 48327 62181 90000 103457 88570
10324 88570 79104 41021 25183 13501 3214 10122 13221 23960 46922 40494 36091 35636 23862
10311B3862k03P14k919p31J7868j4655k0844J115L9404P183j8239n468J0751Q75
10297C8713l324K489L257R066j1859r677k3585n037q586m447J2638M981m190R007
10283I446J625J7107O401o166J7149J0859j3037n832k05j2329j2046l30R074J7115
10269C8831J0698j6448N394J9039k017K667j8995j0575K2040j913k0181M080M609
10256C7229L906r574K174q765r945j7262K162J0573J8150N804n92J8413k442j1043
10242C8788j0037q182q349q182K929K3248M244K101K8439P282k375l949o192m900
10228E4865J2060n315K67J3669J8146Q64l281m72Q206k223k1108j0866J797k2788
10214D3821j2805L240j916Q227j038k4112p434L941J3930M636J4862J549j7881
$$ plain form
10311 23862 23659 24373 21454 20723 38591 23936 3092 4207 43611 50794 32555 27087 37838 38713
10297 38713 35389 37878 41135 50201 38342 28665 5080 43 -8543 -12990 -352 4629 439 9446
10283 9446 11071 28178 34579 28413 45562 56421 43384 37552 37347 25018 12972 12642 21716 38831
10269 38831 49529 33081 38475 57514 55497 58164 39169 28594 50634 48721 28540 32620 37229
10256 37229 41135 31561 33735 24970 15025 -2237 -75 10498 28648 34452 33860 52273 49831 38788
10242 38788 28751 20569 12220 4038 6967 30215 34459 36560 64999 72281 69906 65957 59765 54865
10228 54865 66925 61610 61877 75546 93692 94556 91275 90803 99009 96786 75678 64812 66609 43821
10214 43821 31016 34256 32340 40567 39529 15417 7983 11924 25854 30490 45352 46901 29020
10201B9020q619L134k751j4419O800l412k2919J4612K3642J374N977p463o113
10188A8863j622k660j4568P898J3178p66R272J3913L033k8286j6835Q396Q88J214
10174A1918K8337J8383j3595j9828j4520r629Q950R048o491o729J125J3854M672
10161B5495j4182L999J9872K771k317q376J5279O772j1027K584L362n8j1366p468
10147B5340k657Q000K4308J5198J1480J362j3538q280j907N894J2754P902Q464
10134I4320o216j4529J357k10j2183L271J0659o67Q329J7010p9P321j4775N366
10120I8974J0030K3864K2632N2983Q5730Q9807J04478Q5678P8242J02803J02297
10109H57518N9903k2773m1012q2879q7719p9288p4911q1260n3069l8116q033K1825
$$ plain form
10201 29020 20401 23535 20784 6365 13165 9753 -13166 1446 25088 26462 32439 24976 18863
10188 18863 17241 14581 13 7911 21089 20323 29595 43508 46541 18255 1420 9816 10704 11918
10174 11918 40255 58638 45043 25215 10695 1066 10016 19064 12573 5844 6969 20823 25495
10161 25495 11313 15312 35184 37955 35638 27262 42541 49313 38286 40870 44232 44174 32808 25340
10147 25340 22683 30683 54991 70189 81669 83031 69493 61213 59306 65200 77954 85856 94320
10134 94320 88104 73575 74932 74722 62539 65810 76469 75802 84131 101141 101062 108383 93608 98974
10120 98974 109004 132868 155500 208483 294213 384020 488498 574176 652418 755221 857518
10109 857518 917421 894648 853636 770757 683038 603750 528839 447579 394510 356394 348361 370186
10097C70186M9403L1114J098J2287J7621k7560l6902m4086o2338k9473l1899m2938
10085B06513m7380j3950l4118k5728K965P651p942J775j1302r267j2396j1355
10073D5466r669Q099K6520N755k6274m387J217O031l341k667j3121j9151N888
10060B0366M1258j2917m489p935j7690q24m446l954o192J0444K2448J6569j340
10047E1298j2900j0424J6249o574k783m819o534J2085J0492o982m340j2j5781
10034A8975J0448N679o441r375K164k89J6274j1629l013L683O651K793o628M879
10020C4171l664K1741n176j0647P665Q208n628J014j4987P410Q903m998J3368
10007E7380p88k441l832j980J872J1411k728j7373j7552K058J2223J1606J8167
$$ plain form
10097 370186 419589 450703 451801 464088 481709 454149 417247 373161 310823 281350 249451 206513
10085 206513 159133 145183 111065 85337 88302 95953 88011 89786 78484 69217 56821 45466
10073 45466 35797 43896 70416 76171 49897 45510 46727 52758 49417 46750 33629 14478 20366
10060 20366 61624 48707 44218 36283 18593 17769 13323 9369 3177 13621 36069 52638 51298
10047 51298 38398 27974 44223 37649 34866 30047 23513 35598 46090 39108 34768 34756 18975
10034 18975 29423 35102 28661 19286 21450 21161 37435 25806 22793 26476 33127 35920 29292 34171
10020 34171 30507 52248 47072 36425 44090 52298 46670 47684 32697 40107 49010 44012 57380
10007 57380 56592 54151 50319 48339 50211 61622 58894 41521 23969 26027 38250 49856 68023
9994F8023M501q739K641j380J4752P151j8903o723l961N430m372R077j0371J0440
9980F7566L3402n512j9454j3475j6273j5138J6095O866q03O42l366r645M321J4317
9966E9543K1472J5997o043j3945k7248N205O225k3270j4828J0891J3190J1960
9954E9149n084N739K3048J3559j0121j1749J0819N87l358J0652Q62J5182L6232
9941A45517J4472j3180k9633j6672J4795R159m114j5724j4226L308K12n500J1965
9928A00379K6860M1559N1992k423k4643l7760k3765j2761q658R431o893n578N599
9915A13339p502m475p660j597K6658J7384m931n553K79j9388J048J576j980L041
9901A10239R362P12m368k107j3604Q864J7678l158r800K3360j3815k1166J1954
$$ plain form
9994 68023 72524 63785 66426 65046 79798 86949 68046 61323 57362 62792 58420 67497 57126 67566
9980 67566 100968 95456 76002 62527 46254 31116 47211 54077 53274 53916 50550 40905 45226 59543
9966 59543 81015 97012 90969 77024 49776 54981 61206 37936 23108 33999 47189 59149
9954 59149 54065 59804 82852 96411 86290 74541 85360 85947 82589 93241 94103 109285 145517
9941 145517 159989 146809 117176 100504 115299 124458 120344 104620 90394 93702 93914 88414 100379
9928 100379 127239 168798 220790 218367 193724 155964 132199 119438 110780 120211 113318 107740 113339
9915 113339 105837 101362 93702 92105 118763 136147 131216 125663 125942 106554 107602 109178 107198 110239
9901 110239 119601 120313 115945 113838 100234 109098 126776 123618 113818 137178 123363 102197 114151
9888A14151j7269j6440o556j3732q897l400J3957R732o971M137K0882Q636l665
9875I4565r944K036P586p774j1704J524J3161J4042o859j6938J3331K1957R308
9862A24291k0760P767J8857J4323l4269j8486J1548J4311m228k5811J5331R125
9850A11999j5210Q567M025k313n630l355K225n385n09j2223j4250J700P595O538
9836H3774m482J782P977j7743J4315R97r908j5165m10j917J5705o631r612Q651
9822F7333k036k835o016J9979Q447p043L744R245M430k0971k7458J0155J1594
9809F8568K4712O107j1802r445j2309L932k3900q968J7924o604O52R616O13j1879
9795D7217l962O556n346K7692J2492M470j2998N41K528L729O053r313j6748j543
$$ plain form
9888 114151 96882 80442 73886 60154 51257 47857 61814 71546 64575 68712 89594 98230 94565
9875 94565 84621 86657 94243 86469 74765 76289 89450 103492 96633 79695 93026 114983 124291
9862 124291 103531 111298 130155 144478 110209 91723 103271 117582 113354 87543 102874 111999
9850 111999 96789 105356 109381 107068 101438 98083 100308 94923 94414 82191 67941 69641 77236 83774
9836 83774 79292 81074 89051 71308 85623 86620 76712 61547 61137 59220 74925 68294 58682 67333
9822 67333 65297 62462 56446 76425 84872 77829 81573 90818 95248 74277 46819 56974 68568
9809 68568 93280 99387 87585 78140 65831 69763 45863 36895 54819 48215 48867 58483 59096 47217
9795 47217 43255 49811 44465 72157 84649 89119 76121 76662 79190 82919 88972 79659 62911 61368
9781F1368j356j7966j966M142P257J9593k230j135j6539K3266R834k131q222k5749
9767D8166J2357K3243O385O887J166R642J4955J350q724k0629k090J418m00J639
9753I5365k416j1903j1112j1054m456O185J5462L4694Q254o892K794K785j4429
9740A03277R574J1421j6424p784j1658k838L108j0819M997M601j0368J6386J7552
9727A11025l863N380n941j152O819n281j0279m526J058k000j194M8136J9192j1684
9713A45690J81j843k6756k0801M501k757k9579n812J0757J0746n585L249L769
9700H5760q604j20k248L0j531j1403m26M87O843O248N508m566J7861K0514j128
9685A13225j443k0139j3787L526M180k1581j3169M431K4923J4659l609K748k066
$$ plain form
9781 61368 60012 42046 40080 44222 51479 71072 68842 67707 51168 74434 84268 82137 73915 48166
9767 48166 60523 83766 90151 97038 98204 107846 122801 124151 115427 94798 92708 94126 93726 95365
9753 95365 92949 81046 69934 58880 54424 60609 76071 110765 119019 112127 114921 117706 103277
9740 103277 112851 124272 107848 100064 88406 85568 88676 77857 82854 87455 77087 93473 111025
9727 111025 107162 112542 106601 105449 112268 106987 96708 92182 93240 91240 90046 138182 157374 145690
9713 145690 145871 144028 117272 96471 100972 98215 68636 62824 73581 84327 78742 81991 85760
9700 85760 77156 77036 74788 74818 73287 61884 61458 61945 68788 75036 80544 75978 93839 114353 113225
9685 113225 111782 91643 77856 81382 85562 63981 50812 55243 80166 94825 91216 93964 91898
9672I1898o807j6651j732J8598k934j8328k3316j698L1345j728j2779O292m310
9659E7850j0592M152P578M525R708K925k8910r370J9779P669j1168r384k5342
9646A9420k608R403o042J535j7592J5586J7170M274K731j2021J8117O523J4677
9633G1173p86k3070M419j0498n672J9034P478j9579k892j487J6888Q378O821p154
9619F3053k2555Q063J4899Q044O46P516j0981J6627l194p694q941r143P035N121
9605F8496k1770J5463r73J1176j1857k35L163J162k6967j1342P30N217J8277J0998
9591F1538L268J1255p319k1919j0808J7184K0782J4780N348k6j4496q956J1421
9578H2052Q418p975l528o70j9293L150N957R15Q799P061N952J774k3242J0178
$$ plain form
9672 91898 85091 68440 66708 85306 82372 64044 40728 39030 70375 68647 55868 62160 57850
9659 57850 47258 51410 58988 63513 73221 76146 47236 37866 57645 65314 54146 44762 19420
9646 19420 16812 26215 20173 21708 4116 19702 36872 41146 43877 31856 49973 56496 71173
9633 71173 70387 47317 51736 41238 35566 54600 62078 42499 39607 38120 55008 63386 70207 63053
9619 63053 40498 48561 63460 71504 72150 79666 68685 85312 82118 74424 65483 56340 63375 68496
9605 68496 46726 62189 61216 72392 60535 60300 63463 64625 37658 26316 27046 32263 50540 61538
9591 61538 64806 76061 68742 46823 36015 53199 73981 88761 94109 94083 79587 70631 82052
9578 82052 90470 82495 78967 78297 59004 62154 68111 69026 77825 84886 90838 92612 69370 79548
9564G9548J3599r060k950j7611p874Q811J1970o067j1938O008L782p766O73K4105
9550H5230n054j1152j2857j7741p014k295R335J5647k593l896n150r273j154J7029
9536D9062J3796l083N812J0230q441o280k026o66J9259J0650n47J301j0864K446
9522H0649m581j7985M789M915L464J3085j5350k1402J864P840J2136M684p072
9509F7036j0145j1290p133j9616L212J1844K5946J6849O04N964J8030j8156j1906
9496G1239j6088j5198M816J3376J1252J073K472K815J0004P784L362O814M162
9483A07883j8950j3921J7815J3477k0563j5980k645J0146J0748o08o298j0824
9471G0280M33P28n049K334j1727l026J2509j6120j5593Q283J1128j4030j0419
$$ plain form
9564 79548 93147 84087 81137 63526 55652 64463 76433 70366 58428 64436 68218 60452 61125 85230
9550 85230 80176 69024 56167 38426 31412 29117 38452 54099 51506 47610 42460 33187 32033 49062
9536 49062 62858 59775 65587 75817 67376 61096 59070 58404 77663 88313 87766 89067 78203 80649
9522 80649 76068 58083 62872 67787 71251 84336 68986 47584 49448 57288 69424 74108 67036
9509 67036 56891 45601 38468 18852 22064 33908 59854 76703 77307 83271 101301 83145 71239
9496 71239 55151 39953 44769 58145 69397 70470 72942 75757 85761 93545 96907 103721 107883
9483 107883 88933 75012 92827 106304 85741 69761 67116 77262 88010 87402 81104 70280
9471 70280 70713 71441 66392 68726 56999 53973 66482 50362 34769 43052 54180 40150 29731
9458B9731j334j3455J6876K5682J9780P332m927J3903K0961J0401n927l858k981
9445A12184j462k753p578L566k822R221j0991j8552j1304M852K0843k091K743
9432I5856o407j2431J659O111N513j3325O552J447J714k9972q530o14M286j0190
9418D1669j5406p725J0026p487O634J6297L4519J1099p043j0174N157l654N562
9405G9474J1947j0218j9489M615J964J522k521P052J7395K0098M363r826J269
9392A07645M786N109j5781q495J0634J6514k6786j9514j0148m109r411k0876r94
9379B8574P358K326K250J165j3705J3051J0764M825k3867P758J670L215l544j0334
9365C1506O924O489L353J0237O121j103q645p923J6309J0484R524Q074R30m117
$$ plain form
9458 29731 28397 14942 31818 57500 77280 84612 79685 93588 114549 124950 119023 115165 112184
9445 112184 110722 107969 100391 103957 101135 110356 99365 80813 69509 74361 95204 93113 95856
9432 95856 89449 77018 78677 84788 90301 76976 83528 84975 86689 56717 48187 47573 51859 41669
9418 41669 26263 18538 28564 21077 27711 44008 78527 89626 82583 72409 77566 73912 79474
9405 79474 91421 81203 61714 66329 68293 69815 67294 74346 91741 111839 116202 106376 107645
9392 107645 112431 117540 101759 93264 103898 120412 93626 74112 63964 59855 50444 29568 28574
9379 28574 35932 38258 40508 41673 27968 41019 51783 56608 32741 40499 42169 45384 41840 31506
9365 31506 38430 44919 48272 58509 64630 63527 54882 46959 63268 73752 83276 91350 92280 88163
9351H8163M190j2924p748j7635N156J8871J0644K3013j4382l0514j8394J2876
9339F1316M682j7235K300N225k030p14r74n083n577J3795K5121k392J386O839
9325H6659j1327k0065k2510J7846J8104L290p523m169m320J9650L129k408j8684
9312E7672k3901o75J8161j1186j4664q822o621M310J8870k869j984j335L873J859
9298C2688L901J3938R3N704P587J9056J054J4090j08j728j0942j4944K204j0639
9284F1954j2115r623k148J3795J1083k167J826k331j2717j309q578k459L928m603
9270C4536o728J7049P209n078q517L095L075n001M426l835J6476K5413K707Q043
9256I2870k524n245K677m91j4056O999P115j8125J0487N096j3934j5697M302L403
$$ plain form
9351 88163 92353 79429 71681 54046 59202 78073 88717 111730 97348 66834 48440 61316
9339 61316 65998 48763 51063 56288 54258 53544 52570 47487 41910 55705 80826 78434 79820 86659
9325 86659 75332 55267 32757 50603 68707 71997 64474 60305 55985 75635 78764 76356 57672
9312 57672 33771 33096 51257 40071 25407 16585 9964 14274 33144 30275 28291 26956 30829 32688
9298 32688 36589 50527 50620 56324 63911 82967 84021 98111 98003 96275 85333 70389 72593 61954
9284 61954 49839 40216 38068 51863 62946 60779 62605 60274 47557 46248 37670 35211 39139 34536
9270 34536 27808 44857 52066 46988 38471 41566 44641 39640 44066 40231 56707 82120 84827 92870
9256 92870 90346 85101 87778 87287 73231 80230 87345 69220 79707 84803 70869 55172 59474 62877
9242F2877r356k8l447j4620O113K459n08K5984J6734P820j1332j3345k7544k487
9228C9320J8749J7130q569n218P351K0853j4648j3658m710J3595K8632j13L395
9215A02109j2869k7783j6894L024m80J1846J9432m809k284J960R827k033M018
9202H5064k2365k7468j1987N680L2426J4270j7909j9858J2040J2094L489J6727
9190H2203Q413l773J857j2385k2233j1576p719J4256L460j2466n942J6128L7487
9177H7710K4787q700p671k132J9118J2431M046N258j2731k7435K123J7462Q728
9164A22994k720o34R378j1492j0842j21r068L981Q838R963l303n889j0682r593
9150I0810J9738K2756M94M448Q180K915o089o842Q490J2323J517j1798m263l538
$$ plain form
9242 62877 53521 53493 50046 35426 41539 43998 43490 69474 86208 94028 82696 69351 41807 39320
9228 39320 58069 75199 66630 61412 68763 89616 74968 61310 56600 70195 98827 98714 102109
9215 102109 89240 61457 44563 47587 47107 58953 78385 73576 71292 73252 83079 81046 85064
9202 85064 62699 35231 23244 28924 61350 75620 57711 37853 49893 61987 65476 82203
9190 82203 90616 86843 88700 76315 54082 42506 34787 49043 52503 40037 34095 50223 87710
9177 87710 112497 103797 96126 93994 113112 125543 129589 134847 122116 94681 96804 114266 122994
9164 122994 120274 119640 129018 117526 106684 106563 97495 101476 110314 120277 116974 111085 100403 90810
9150 90810 110548 133304 133798 138246 146426 149341 143252 136410 144900 157223 158740 146942 142679 139141
9136A39141m821m277M753m399m05q687O852J8419M1735K0581J4861J462j494J1875
9122B35596j9461l9159j2825l011m985k8594k926R296p409q912Q796N587j557
9109A30436J2942O185O085o663l774p00K441n108r998j877J062j732l180j3305
9095A12814L337J0959J0274R931N044L958K689L590J1459J0074Q924m569k1010
9082A67474q650r584j3931J9127J6502N766j2690k515j1299k8809p745P677J0937
9069A32260M309J2560j470j9368j0607M387M367L615j2651r382r750j0884K1236
9056A08622P88n961R49J2327m564k0159R22R350K703j2895J3732K2230Q515n43
9042A36016j7931j0154N867j5988O613K2357J1414N449j2322j2946j5967j7561
$$ plain form
9136 139141 134320 130043 134796 130397 129992 121305 128157 146576 188311 208892 223753 225215 223721 235596
9122 235596 216135 176976 164151 161140 156155 127561 124635 133931 126522 117610 126406 131993 130436
9109 130436 143378 149563 155648 148985 145211 144511 146952 141844 131846 129969 131031 129299 126119 112814
9095 112814 116151 127110 137384 147315 152359 156317 159006 162596 174055 184129 193053 188484 167474
9082 167474 158824 149240 135309 154436 170938 176704 164014 161499 150200 121391 113646 121323 132260
9069 132260 136569 149129 147659 128291 117684 122071 126438 130053 117402 108020 98270 87386 108622
9056 108622 109410 103449 104398 116725 112161 92002 92924 102274 104977 92082 105814 128044 136559 136016
9042 136016 118085 107931 113798 97810 104423 126780 138194 143643 131321 118375 102408 84847
9030H4847J6729R058P477j6570j8460p85J6592L0830P126o858p8J7897j2886k8837
9016A06082J783l27L195k795L160K1668J1090p129J0290j2201q265p23o883q658
9002A10287j1233p257J125J0859R679P050M366n583L089p425j3873J23l147J2046
8988A10106J7753n037j1951p177k6457q047p00J1830Q675j593J233o723R509J163
8974I2584P922o198P1K091j9796j9214l169J1852j5363J0909L3814j4660n500
8961G5343J3087p148p736K0103N770j6262n914J7686K337j2014P78J2555q207
8948I0378n511J2192o558K749q779P27q698K9932L80n81j8561k4160q377k025
8934E3108l743j511K4160J1748J259K1776K4686j2049M574P933J5957j2276k0673
$$ plain form
9030 84847 101576 110634 118111 101541 83081 82296 98888 129718 136844 129986 129908 147805 134919 106082
9016 106082 107865 107538 110733 107938 111098 132766 143856 136727 147017 134816 126551 125828 118945 110287
9002 110287 99054 91797 92922 103781 113460 120510 124876 119293 122382 114957 101084 101207 98060 110106
8988 110106 127859 122822 110871 103694 77237 69190 68490 80320 88995 87402 88635 81912 91421 92584
8974 92584 100506 94308 94379 96470 76674 57460 54291 66143 50780 61689 95503 80843 75343
8961 75343 88430 81282 73546 93649 99419 83157 77243 94929 97266 85252 86030 98585 90378
8948 90378 84867 97059 90501 93250 84471 85198 76500 106432 106812 106231 87670 63510 55133 53108
8934 53108 49365 47854 72014 83762 85021 106797 131483 119434 124008 131941 147898 135622 114949
8921A14949o294k169j0934j1214r585J326L495l647Q104K6152K8871k9999k1428
8908H7627J7354J0000J3887K1433M3364N8289M4691l596k5311m0310k9348q298
8896A89782j6989k6242j4349N497j5207j8006K940k884j1925N596j1771j9037
8884F7405Q55R341K065J4299N215j0610L348j2888p140J4359j2426P501J9649
8871A00973J7613L223q620R484J609J3046J3816Q898J5854L6917N1701J3845k0306
8858B58053k6572k5736j1368m7156l1877n342j6220j9552j7838K1989K1378j4730
8846H5029k4240n375J6296J4783Q981j437o929k786J3239j632p795R065j9790
8833G7409M330O037J042j1121j961j4542n513O965o630L234P119J4592J6216L091
$$ plain form
8921 114949 108655 106486 95552 84338 74753 76079 79574 75927 84031 110183 139054 109055 87627
8908 87627 104981 114981 128868 150301 193665 251954 296645 293049 267738 227428 198080 189782
8896 189782 172793 146551 132202 137699 122492 104486 107426 104542 92617 98213 86442 67405
8884 67405 68260 77601 79666 93965 99180 88570 91918 79030 71890 86249 73823 81324 100973
8871 100973 118586 121809 113189 122673 124282 137328 151144 160042 175896 212813 264514 278359 258053
8858 258053 231481 205745 194377 147221 115344 110002 93782 74230 56392 78381 99759 85029
8846 85029 60789 55414 71710 86493 95474 94037 87108 84322 97561 95929 88134 97199 77409
8833 77409 81739 87776 88818 77697 75736 61194 55681 62646 56016 59250 66369 80961 97177 100268
8819A00268j0809j1928J2829M642J3905l536j3029j3255k254N817R448J102N725
8806I8925L4731n178q800M235J4454J3078K2226o053L693j874n8K4653J1605L4739
8792B40376K9719J7032J9967L8286O6469L2372K4154O2500J02585J11571J52748
8781H97779K64042M76274Q23235J308303J752066J449549L11144o60245j291799
8772E330348j406834j124991p64838n16082l57334k52557j56133j18563r4397
8763E38619n8208n4734n3561j8739j3914n2268l6080l4712j5695j1711p371q027
8751A73599j4058q024L830l1274q503J634j0773n027K3263l587N977l382l918
8738A19757j3186l865N813J0544r282j2130j8909k1878M50J5848N894J4564K4363
$$ plain form
8819 100268 89459 77531 90360 95002 108907 105371 92342 79087 76833 82650 92098 93200 98925
8806 98925 133656 128478 119678 123913 138367 151445 173671 167618 171311 169437 169379 194032 205637 240376
8792 240376 270095 287127 307094 345380 411849 444221 468375 530875 633460 745031 897779
8781 897779 1161821 1638095 2461330 3769633 5521699 6971248 7282392 6622147 5330348
8772 5330348 3923514 2798523 2033685 1517603 1160269 907712 751579 633016 538619
8763 538619 480411 425677 372116 353377 339463 287195 251115 216403 200708 188997 181626 173599
8751 173599 159541 151517 155347 124073 115570 117204 106431 101404 124667 121080 127057 123675 119757
8738 119757 106571 102706 108519 119063 109781 97651 78742 56864 57314 73162 79056 93620 117983
8725A17983j9142k680j7968L845J2131L324j0745N980l73J429R299n026l583K2376
8711A16850L4476P381Q614K3121o273j0676l2777k2023M454j478j0713p183j0425
8698I3348J3932q72K473K901l290K0522K4685j8543j3815p753j7682L997Q496
8685A08399k4703k4670l727k332K76Q263L918n020j2900P433J6238L909k0023
8672E5061j2110J9948Q285J1968K0951L5752L4934P0465O2315K9181k2517n4428
8660B59805p3508l2176j4117p928j5300k6165j8438J0787O147J7256Q038K8010
8648A42411M4810L1997O871j8467m3999l5457k7812K786j1450j4620J440j716
8636G6794J360R9j0303K46J3989q154j799M792P996n047j0444R890K1157J0453
$$ plain form
8725 117983 98841 96161 78193 82038 94169 97493 86748 92728 92355 93784 103083 98057 94474 116850
8711 116850 151326 158707 167321 190442 184169 173493 140716 118693 123147 121669 110956 103773 93348
8698 93348 107280 106408 108881 111782 108492 129014 153699 135156 121341 113588 95906 99903 108399
8685 108399 83696 59026 55299 52967 53243 61506 65424 60404 47504 54937 71175 75084 55061
8672 55061 42951 62899 71184 83152 104103 139855 174789 245254 307569 336750 314233 259805
8660 259805 186297 154121 140004 132076 116776 90611 72173 82960 89107 106363 114401 142411
8648 142411 187221 219218 226089 207622 163623 128166 100354 103140 91690 77070 78510 76794
8636 76794 78154 78253 67950 68196 82185 74031 72232 77024 85020 79973 69529 79419 100576 111029
8622A11029R088K5748K4335J8931R076j4005l3229l3574l3246p368P63j7042j4787
8609D5719l181O220K2876J2487M004L1198L989j0709P917L137k4889k0885K066
8596G9949j022l172q415k714L045K690j4784k4598K363L92j413J4952J1820J8777
8582G7870k749j9226R5j1136j740K8664R654K2867J5035J826j827n918k0586k2683
8568G0146N663J105r530l207M238r975N043P919P125j3034M03q133j993J731M746
8553F2247J5021r109O7J4692K2247q550J0103L112l829j50m397P780J0949j517
8539A18666k8642m032M914J559K5665J6001j8508K396K5804o55M068J099K011
8526A50346J0261P975r427K714K5981K1465K579P388K954k36J8694J4592O030
$$ plain form
8622 111029 120117 145865 170200 189131 198207 184202 150973 117399 84153 76785 77548 60506 45719
8609 45719 42538 48758 71634 84121 88125 119323 123312 112603 120520 123657 98768 77883 79949
8596 79949 78927 75755 67340 64626 67671 70361 55577 30979 33342 33734 32321 47273 59093 77870
8582 77870 75121 55895 55990 44854 43114 71778 81432 104299 119334 121160 119333 113415 92829 70146
8568 70146 75809 76914 67384 64177 68415 58440 63483 71402 78527 65493 65896 57763 55770 57501 62247
8553 62247 77268 68159 68226 82918 105165 96615 106718 109830 106001 105851 101454 109234 120183 118666
8539 118666 90024 85992 90906 92465 118130 134131 115623 118019 143823 143168 147236 148335 150346
8526 150346 160607 168582 159155 161869 187850 209315 211894 219282 222236 222000 240694 255286 261316
8513B61316K4115K5198J9801Q629L5204K8212J5600L3057L7965L7794M1931K891
8501E71713j5265m0906k6929k6491m9595n5578n7958n2528k2634O178j5899l5228
8489A78880j3213Q215j3418j9652j6358Q126j041j9144L3350j5069j4599M147
8477A20224J3089n085k0359j4000j751q478J309Q948J6536m605k2291r477J8610
8464I2670j1077j8932j4138K677J1928J0098p584o271j060N209j1398J0435J107
8451F3664m004k354o566k767J2400J4791L887Q057j208j7456l164j2745k1737
8438C0798M740J577J4513P42p231k259J3745L473M428J4099P82j3246J5907k2572
8424E9496j9762M11J1049K3569J9N77j0279p711L407q330P177J7898L7468J2059
$$ plain form
8513 261316 285431 310629 330430 339059 374263 402475 418075 451132 489097 526891 568822 571713
8501 571713 556448 515542 488613 462122 412527 356949 298991 246463 223829 230007 214108 178880
8489 178880 165667 173882 160464 140812 124454 132580 131539 112395 145745 130676 116077 120224
8477 120224 133313 128228 107869 93869 92118 83640 84949 93897 110433 105828 83537 74060 92670
8464 92670 81593 62661 48523 51200 63128 73226 65642 59371 58311 63520 52122 62557 63664
8451 63664 59660 57306 50740 47973 60373 75164 79051 87108 85900 68444 65280 52535 30798
8438 30798 35538 37115 51628 52370 45139 42880 56625 60098 64526 78625 79407 66161 82068 59496
8424 59496 39734 40145 51194 74763 74782 75359 65080 57369 60776 52446 59623 77521 114989 127048
8410A27048j438Q199J8333K6809L6988O7008J03291J84370K79132K27194P4658
8399A151592q6294j97994k37732j77151q7847o1231o9045m1892m1179m9685j4579
8388H6963K315J286O941j0269j4833O743k489o345K064n820J9532l275l16K4019
8374A06516K1390r985j1917j4020j748K9216J4989p728q091L1592L8439N7394
8362B46047P4975J04003J58486K85495M74486N71089L78414j9879k86269m58856
8352A527991m42302l09068k28652j64198p4015l7926m3626n4598k8454J5059j1211
8341A49000p208j1323l1846k0687O817q97r664K768Q528q396j4085M964P879J091
8327G6941n030j8939R439J2498m486q15J2879K0152M844P658L7430O6323R7511
$$ plain form
8410 127048 125610 133809 152142 178951 215939 282947 386238 570608 849740 1076934 1151592
8399 1151592 1065298 867304 629572 452421 364574 303343 234298 192406 151227 101542 86963
8388 86963 89278 90564 97505 87236 72403 79146 76657 70312 72376 66556 86088 82813 82497 106516
8374 106516 127906 117921 106004 91984 90236 119452 134441 126713 118622 150214 188653 246047
8362 246047 321022 425025 583511 869006 1343492 1914581 2292995 2273116 1986847 1527991
8352 1527991 1085689 776621 547969 383771 309756 271830 228204 173606 145152 160211 149000
8341 149000 141792 130469 98623 77936 84753 83856 74192 76960 85488 77092 63007 67971 75850 76941
8327 76941 71911 52972 62411 74909 70423 69608 82487 102639 107483 115141 152571 218894 316405
8314C16405J59165K32771K36907J18271o6346j70369j93414j78263j28371q4745
8304B42011p0392k9299l2568m6403j3030q84R072m779k340j1742k796j0757j8276
8291G817K060o903j1388P543J2712K1990O252k8170k5632J1676L3872n229r534
8278A7066J0619P068j1568j4757k528K4100J1820J905J0067k1329j6218k0668
8266d423M797J3918p458n198l2058j6197K2495K3607P004N537O620J0078K593
8253C1315J747k4378j5365J7792J296j4838k632j5399J0274J9312J2791q62r438
8240A1615K784N682J017P498p257K328n603j1599j4109l823J6717j0212J2868
8227G906N885q818rJ5613K9104l507L321p740p473j5557M282J5230o725k2050
$$ plain form
8314 316405 475570 708341 945248 1063519 997173 826804 633390 455127 326756 242011
8304 242011 171619 142320 109752 63349 50319 49435 58507 53728 51388 39646 36850 26093 7817
8291 7817 9877 2974 -8414 -871 11841 33831 40083 11913 -13719 -2043 31829 26600 17066
8278 17066 27685 34753 23185 8428 5900 30000 41820 43725 53792 32463 16245 -4423
8266 -4423 374 14292 6834 1636 -30422 -46619 -24124 -517 6487 12024 18644 28722 31315
8253 31315 33062 8684 -6681 11111 12407 -2431 -5063 -20462 -10188 9124 21915 21053 11615
8240 11615 14399 20081 21098 28596 21339 23667 18064 6465 -7644 -11467 5250 -4962 7906
8227 7906 13791 4973 4964 20577 49681 46174 49495 41755 34282 18725 23007 38237 31512 9462
8213I462O543j4003J4865j0162j8177p56n83n33J3862j882p184J0353m517n986
8199h698L907m993q083k3932M638J3921j491N663J6821k306P934j1253l951Q329
8185c494j3689J1361N995j06J415j1005k091K1801k151j6413j2320J3307J5109
8172G719J7032J3239J5846j5239L737k0629jJ0758q233l7681k5874R154K0497
8159i675K2710m191N29p389k8311J849j4867Q476K1109n809j4194J1479J3070
8146e214j3397P092R85J1170m893k3507j5551N310j0028J2856M0253N598J517
8133A2191J4265m812n989k2785j584K1835j197L353J9008k8897k0078K4390J4875
8120B4575L328r879N016N56o81r864j1202l944l79J0809k401j5872r771K110K630
$$ plain form
8213 9462 16005 2002 16867 6705 -11472 -12228 -12811 -13344 518 -1364 -8548 1805 -2712 -8698
8199 -8698 -4791 -9784 -17867 -41799 -37161 -23240 -24731 -19068 -2247 -4553 3381 -7872 -11823 -3494
8185 -3494 -17183 -5822 173 67 1482 -9523 -11614 10187 8036 -8377 -20697 -7390 7719
8172 7719 24751 37990 53836 38597 42334 21705 21704 32462 24229 -13452 -39326 -30172 -9675
8159 -9675 13035 8844 9373 1984 -26327 -24478 -39345 -30869 -9760 -15569 -29763 -18284 -5214
8146 -5214 -18611 -11519 -10534 636 -4257 -27764 -43315 -38005 -48033 -35177 5076 10674 12191
8133 12191 26456 21644 15655 -7130 -8714 13121 11924 15277 34285 5388 -14690 9700 24575
8120 24575 27903 18024 23040 23596 22915 13051 1849 -2095 -2474 8335 5934 -9938 -19709 -17599 -14969
8105a4969k125j1751K003r63J123ol749J1682k773M623l122j0586L429Q24j422
8090b7782O259J0862J3653K0954R426N177L22j8656j2953j6021j7052k677R064
8077a9424J4523J0741m081N055J1125j0090J5119o740j5429O255Q652j6641o796
8064g731O562J3045j5341k4314K910o425P079K2519L975J0739k342n78J4541q715
8050A5924r927M325J580j3088N539J449k630j650O87O812n471j071j2986N616
8036d891N656J5503O682o253j9176k0807L340L3329J2224k771K047M099q950j1185
8022H847o967J9375K7438o644j9545R31l333K596k293j4883j0618R065K2305Q942
8008C5216p600k297j418j0940J1759J2056K3680k617L220J1695r904j8427r044
$$ plain form
8105 -14969 -17094 -28845 -26842 -27805 -26682 -26688 -30437 -18755 -21528 -16905 -20027 -30613 -27184 -26360 -27782
8090 -27782 -21523 -10661 2992 23946 33372 38549 38871 20215 7262 -8759 -25811 -28488 -19424
8077 -19424 -4901 5840 1759 6814 17939 7849 22968 16228 799 7054 15706 -935 -7731
8064 -7731 -1169 11876 -3465 -27779 -24869 -31294 -24215 -1696 2279 13018 10676 10098 24639 15924
8050 15924 5997 10322 11902 -1186 4353 5802 3172 1522 2209 9021 3550 2479 -10507 -4891
8036 -4891 765 16268 22950 16697 -2479 -23286 -19946 13383 25607 22836 24883 28982 20032 8847
8022 8847 1880 21255 48693 42049 22504 23435 20102 22698 20405 5522 -5096 3969 26274 35216
8008 35216 27616 25319 23901 12961 24720 36776 60456 57839 61059 72754 62850 44423 35379
7995C5379r97j871n227j4262m014J0367r095k3637J6735J3473p698J1052J341
7982B1546p565j538J0946Q025Q3P339K399r214j5426j5285m785P182J7548J069
7968B2324j0730K915J4886J8j91j2096j3599p239L5426J4245j6905r308k3819
7955d073M05K9120R217j6452n036L831Q959R503r815L463j813J2283Q255m643
7941D3204J880j3473j3085Q441l892q903j836J4705K6594j2640j1653M322J6391
7928E0055q55j6766j0021J2707O669P669k088p037m075j994K990o768l481n61
7914B6444J1189J5361K9457J7653J559K6575P910j3355O594M512M29o510o127
7901A21691j2591J8851L1779P34k9550k1707j589j050j6616k0573j6399J780r85
$$ plain form
7995 35379 34382 32511 27284 13022 9008 19375 10280 -13357 3378 16851 9153 20205 21546
7982 21546 13981 12443 23389 31414 31497 38836 41235 32021 16595 1310 -3475 3707 21255 22324
7968 22324 11594 14509 29395 29413 29222 17126 3527 -3712 31714 45959 29054 19746 -4073
7955 -4073 -3668 25452 34669 18217 13181 17012 25971 35474 25659 29122 27309 39592 47847 43204
7941 43204 45084 31611 18526 26967 23075 14172 12336 27041 53635 40995 29342 33664 50055
7928 50055 49200 32434 22413 35120 41789 49458 47370 40333 36258 34264 37254 30486 27005 26444
7914 26444 37633 52994 82451 100104 101663 128238 136148 122793 129387 133899 134328 127818 121691
7901 121691 109100 127951 159730 160464 130914 109207 107618 106568 89952 69379 52980 54760 53775
7888E3775K910K533O012m628k6312k5040L1239L1361K3191J0259P137p724M51
7875A05164J1478o341l017K694j0592j4814J2496K0301q692K240M986L526J771
7862A21200o606L140J5807j5578j1498J0237K900J5471O166k1450q657p46Q078
7849A18464k1648k1573J0479M508M033p642k0592j5431J895J1247R965J2092J2624
7836I8421j6540p020L049j142J4992o97r578L349J3723J3142j7404l5707l9638
7823A8950l013K2195J1244j6355P075L938J65J1756j9792O292l626Q747q381p945
7809C1250n881r294j3718J3811K426J1770p437n07N479j0745k3944j9159r758
7796c5707R596J977J5199Q177J527j1428n023l497Q743J0611J0974j652l514q431
$$ plain form
7888 53775 56685 59218 65230 60602 34290 9250 40489 71850 95041 105300 112437 104713 105164
7875 105164 116642 110301 107284 109978 99386 84572 97068 117369 108677 110917 115903 119429 121200
7862 121200 114594 117734 133541 117963 106465 116702 119602 135073 141239 119789 111132 110386 118464
7849 118464 96816 75243 85722 90230 94263 86621 66029 50598 52493 63740 73705 85797 98421
7836 98421 81881 74861 77910 76768 91760 91063 81485 84834 98557 111699 94295 58588 18950
7823 18950 15937 38132 49376 33021 40096 44034 44199 55955 36163 42455 38829 47576 39195 31250
7809 31250 25369 16075 2357 16168 18594 30364 22927 22420 27899 17154 -6790 -25949 -35707
7796 -35707 -26111 -24134 -8935 -758 769 -10659 -15682 -19179 -10436 175 11149 9497 5983 -2448
7782b448N199j7035r359j650m433J7835J5065J4915j146k6125k6762J2486J1049
7769a2409j8438P448J3659r13J0984J2659L740N127p458j8116r335R120j324J1835
7755F579L443J4857o363j6178j7515n655J5582j0411Q909l048n380K414L041L089
7741f636j790r653J4029J1274J794J3386n257n270Q036N929L399k3656m634L002
7727C953j2888N522L72Q571l664m327q839q020j7211M446L0096O510R608j6639
7713b510j6087L010J591j0407R875j5724j1020J1656L550J6105l307J2448j4662
7700a5482k140M007m27k916j6034j2785N086Q508R683l015j9229J696R78L4433
7686g637K1870l226j0344j7984j7896j3032K3749l675r668J0346O515j1512j4722
$$ plain form
7782 -2448 2751 -14284 -23643 -25293 -29726 -11891 3174 18089 16943 -9182 -35944 -23458 -12409
7769 -12409 -30847 -23399 -9740 -10653 331 12990 16730 21857 14399 -3717 -13052 -3932 -5256 6579
7755 6579 10022 24879 18516 2338 -15177 -20832 -5250 -15661 -6752 -9800 -15180 -12766 -9725 -6636
7741 -6636 -8426 -18079 -4050 7224 9018 22404 17147 11877 19913 25842 29241 5585 951 3953
7727 3953 -8935 -3413 -3041 5530 1866 -2461 -11300 -19320 -36531 -32085 -1989 4521 14129 -2510
7713 -2510 -18597 -15587 -13996 -24403 -14528 -30252 -41272 -29616 -26066 -9961 -13268 -820 -15482
7700 -15482 -17622 -13615 -14042 -16958 -32992 -45777 -40691 -32183 -22500 -25515 -44744 -43048 -42070 -7637
7686 -7637 14233 11007 663 -17321 -35217 -48249 -24500 -28175 -37843 -27497 -20982 -32494 -47216
7673d7216M645J5521K6714k5447k3029j870L687N821o824Q749J4153o23k265j754
7659b9738n981j5076O462R687j1884J0323J2402J85j2253J6784r623j1363j890
7646d1965k7868L093L5667j718Q313l214M595q217J0960K2781p171j2445q264
7633b5453j123J2523M701M179k929m64o238K0570j8692l0458n162K662K175J1240
7619c2469J9846J5925n589K714j6022j7211n327N455J0522P912R946J5287o228
7606D761j7394k3774j4988j71K508K8598q93j5267J515K2865L310j9453j8721
7593d7104p391k0810J7164J128K160K2452J0404j7770l120K322P152N937J2949
7580a4527J859o646j20n246L27p599r549j2224N340L761n398K881r464q197O69
$$ plain form
7673 -47216 -42571 -27050 -336 -25783 -48812 -50682 -46995 -41174 -47998 -39249 -25096 -25719 -27984 -29738
7659 -29738 -35719 -50795 -44333 -34646 -46530 -36207 -23805 -23620 -35873 -19089 -28712 -40075 -41965
7646 -41965 -69833 -66740 -31073 -32791 -24478 -27692 -23097 -31314 -20354 2427 -4744 -17189 -25453
7633 -25453 -26576 -14053 -9352 -5173 -8102 -8566 -14804 5766 -12926 -43384 -48546 -45884 -43709 -32469
7619 -32469 -12623 3302 -2287 427 -15595 -32806 -38133 -32678 -22156 -14244 -4298 10989 4761
7606 4761 -12633 -36407 -51395 -51566 -49058 -20460 -21353 -36620 -35105 -12240 -8930 -28383 -47104
7593 -47104 -54495 -75305 -58141 -57013 -54853 -32401 -21997 -39767 -42887 -40565 -33413 -27476 -14527
7580 -14527 -12668 -19314 -19434 -24680 -24353 -31952 -41501 -53725 -48385 -44624 -50022 -47141 -56605 -64802 -64133
7565f4133K2925R962N68r410N035N810J65j5347N09L2381L0706J11l9804j2939
7551c3461k234J0193Q692J553r399j9256n790J3791Q077M22M373N605j1830k1812
7537e1076j2932o914J1471K2326n840L191K2156K921j2293o936J2320j3043J027
7524c3622R265p393p266J2794K4960n176Q45o850R207j2404j0903q945j8096o543
7510f0127R598o729j0059j3532K0194M259j4196K5652K3534j053o230J4315L478
7497a0896j0653j702R437l540j4383j6026k059J2651k536J5784J9831j6703j4799
7484c5594R15m655q518J4275L5202J4477p209q505q246q143j8248j2822L845L2931
7470a0295J9021j0808j9439j2837J1577k147l640J1919q092j0770J1223j5475
$$ plain form
7565 -64133 -41208 -31246 -30678 -40088 -35053 -29243 -29078 -44425 -43916 -11535 19171 19282 -20522 -33461
7551 -33461 -35695 -25502 -16810 -15257 -24656 -43912 -49702 -35911 -27834 -27412 -23039 -17434 -29264 -51076
7537 -51076 -64008 -70922 -59451 -37125 -42965 -39774 -17618 -14697 -26990 -33926 -21606 -34649 -33622
7524 -33622 -24357 -31750 -39016 -26222 -1262 -6438 -5593 -12443 -3236 -15640 -26543 -35488 -53584 -60127
7510 -60127 -50529 -57258 -67317 -80849 -60655 -56396 -70592 -44940 -21406 -22459 -28689 -14374 -10896
7497 -10896 -21549 -23251 -13814 -17354 -31737 -47763 -49822 -37171 -39707 -23923 -4092 -20795 -35594
7484 -35594 -34679 -39334 -47852 -33577 1625 16102 8893 388 -7858 -16001 -34249 -47071 -43226 -10295
7470 -10295 8726 -2082 -21521 -34358 -22781 -24928 -28568 -16649 -24741 -35511 -24288 -39763
7458c9763J367J2866m804O545j442N91O543o24j6790j1018J5019R680L193q688
7444b7325m923M925J2763J3695L712j4937j6415k547J1775J7567q051j4314j3564
7431c7639P835L097k874J538j4284o461K098R498m519P308J0619J5247O619j719
7417c637j6907k7299k173K2575J1793j1647P182p101q609P901L589l733J8975
7404i091N822l3988n014J3346o666M808O498j106j2041o259J4914J0049o65l25
7390a9718n333j7605j4296o340J5966M354J2467J7171J23l526M453P599p853j1818
7376b4356J2425K1606j7957j1442j0842j2297j6553L426K3482J1438P638K0227
7364F795k570L474j541M179M098j3460L480l796k0834j2752J3134O769j3299L414
$$ plain form
7458 -39763 -38396 -25530 -30334 -23789 -25231 -24640 -18097 -18721 -35511 -46529 -31510 -21830 -18637 -27325
7444 -27325 -32248 -27323 -14560 -865 2847 -12090 -28505 -31052 -19277 -1710 -9761 -24075 -37639
7431 -37639 -29804 -26707 -29581 -28043 -42327 -48788 -46690 -37192 -41711 -34403 -23784 -8537 -1918 -3637
7417 -3637 -20544 -47843 -50016 -27441 -15648 -27295 -20113 -27214 -35823 -27922 -24333 -28066 -9091
7404 -9091 -3269 -37257 -42271 -28925 -35591 -30783 -24285 -25391 -37432 -43691 -28777 -18728 -19393 -19718
7390 -19718 -25051 -42656 -56952 -63292 -47326 -42972 -30505 -13334 -13211 -16737 -12284 -4685 -12538 -24356
7376 -24356 -11931 9675 -8282 -19724 -30566 -42863 -59416 -55990 -32508 -21070 -13432 6795
7364 6795 4225 7699 6158 10337 14435 975 4455 659 -20175 -32927 -19793 -13024 -26323 -22909
7350b2909L557J174M179j6865p119J8174m092O87P014J727q062P258J4876p899
7336h300k766k0134q999J3677N060N337o03r288q705j692N97N759K614l801K4598
7321f646n431k91p667L647K3361J6834J058q756j719j5836q235K123J0984k4838
7307b1412j3935r42J516K1153J6363q434j3246N485j6235m671k504L314m246j2272
7293e0066J255M876k644j2464L415P94O142Q511P20J1428J8362n656k0677k4494
7279f0498O66J1660K2416L95Q143J0685J1567p719k0272j4226J8045J1836j8168
7266b5470k2541k0689J2835L2338Q474j4544k79j2344O295m66R369n174j0584
7253d2780L0805J4261o336r221n298l739j0716j3841J8058J1203J1335J508j4944
$$ plain form
7350 -22909 -19352 -18178 -13999 -30864 -37983 -19809 -23901 -23214 -16200 -14473 -22535 -15277 -401 -8300
7336 -8300 -11066 -31200 -40199 -26522 -21462 -16125 -16728 -26016 -34721 -36413 -35816 -30057 -27443 -31244 -6646
7321 -6646 -12077 -12368 -20035 -16388 6973 23807 24865 16109 14390 -1446 -9681 -7558 3426 -21412
7307 -21412 -35347 -36289 -34773 -13620 2743 -5691 -18937 -13452 -29687 -34358 -36862 -33548 -37794 -50066
7293 -50066 -48811 -43935 -46579 -59043 -55628 -54834 -48692 -40181 -39461 -28033 -9671 -15327 -36004 -60498
7279 -60498 -59832 -48172 -25756 -25361 -17218 -6533 5034 -2685 -22957 -37183 -19138 -7302 -25470
7266 -25470 -48011 -68700 -55865 -23527 -15053 -29597 -29876 -42220 -35925 -36391 -27022 -32196 -42780
7253 -42780 -11975 2286 -4050 -13271 -18569 -22308 -33024 -46865 -28807 -17604 -6269 -4761 -19705
7240a9705k1350O673K0232l936j5501k958j2j3019J4815J9543m680j7461o453
7227d3812Q930j8663j5202j736K7858J8668k460K2937J3834j7939l072j4018Q543
7214a6132m388K55q103k813N14k0027J1850M554J3408j664j313j180l784j1700
7200d0523J609k855q526J8732J9497q99k736q752N1r482P1J8638p59N318q895
7185a9511q457M406q117j4974j446K059O848P759o329j0171K5261n52k1202j7358
7171f1784K663L6389J621j2850k5795n53J3917J3626J5004O162l686m79k9581
7158d5346j4646R954J2073j740k663l619p749O787p086n327J1410K1011r801m918
7144d1660J794L953l73N94j806l822L3027M282r893R600P415k080J3857J153K8
$$ plain form
7240 -19705 -41055 -34382 -14150 -18086 -33587 -36545 -36557 -49576 -34761 -15218 -19898 -37359 -43812
7227 -43812 -34882 -53545 -68747 -70483 -42625 -23957 -26417 -3480 10354 -7585 -10657 -24675 -16132
7214 -16132 -20520 -20265 -28368 -31181 -30667 -50694 -38844 -34290 -20882 -22546 -23859 -25039 -28823 -40523
7200 -40523 -38914 -41769 -50295 -31563 -12066 -12965 -15701 -24453 -24402 -33884 -33813 -15175 -15934 -10616 -19511
7185 -19511 -27968 -23562 -31679 -46653 -48099 -46040 -39192 -31433 -37762 -47933 -22672 -23224 -44426 -61784
7171 -61784 -59121 -22732 -21111 -33961 -59756 -60309 -46392 -32766 -17762 -11600 -15286 -15765 -45346
7158 -45346 -59992 -50038 -37965 -39705 -42368 -45987 -53736 -46949 -54035 -59362 -47952 -26941 -36742 -41660
7144 -41660 -39866 -35913 -36286 -35692 -37498 -41320 -8293 -4011 -13904 -4304 3111 1031 14888 16041 16069
7129A6069k7676q761j7150Q041o165J2988j2402j2767p654J7967J9899J5751k102
7116c962j5401k5007M144K6174n715l1908j4113j805K0165K575K4096K9692j1676
7103b741q022m450k2208O921J6789o258j9562p57K1873m297j2166J2125M89o733
7089b8997Q630K780o378q898j3484o849K0816q48l8390l643K7402K5863Q307o965
7075b0654n787K653j4383N491P576J3630j4711o19J3505Q442q93j0570J466o734
7061b1588j2921n450r87m980M863J2411M50p698P791O895l127r474L292p44K650
7046b8617N563J921j3799J069j3012j5589J0806K4372K0974N55K962j1836L268
7033a1363j0595J1708o3p211J248M513j3379P917J904m649o16j739o684J0525
$$ plain form
7129 16069 -11607 -20368 -37518 -29477 -35642 -22654 -35056 -47823 -55477 -37510 -17611 -1860 -3962
7116 -3962 -19363 -44370 -40226 -14052 -19767 -51675 -65788 -67593 -47428 -44853 -20757 8935 -2741
7103 -2741 -10763 -15213 -37421 -30500 -13711 -19969 -39531 -40288 -18415 -22712 -34878 -22753 -22264 -28997
7089 -28997 -20367 -17587 -23965 -32863 -46347 -53196 -32380 -33228 -71618 -75261 -47859 -21996 -13689 -20654
7075 -20654 -26441 -23788 -38171 -32680 -25104 -11474 -26185 -26804 -13299 -4857 -5750 -16320 -14854 -21588
7061 -21588 -34509 -39959 -40946 -45926 -41063 -28652 -28202 -35900 -28109 -21214 -24341 -33815 -30523 -31267 -28617
7046 -28617 -23054 -21133 -34932 -33863 -46875 -62464 -51658 -27286 -6312 -5757 -2795 -14631 -11363
7033 -11363 -21958 -10250 -10313 -17524 -16276 -11763 -25142 -17225 -15321 -19970 -20586 -22325 -29009 -18484
7019a8484J1560J5621o721k0884K440K0959n622j7553%Q608m090j1135q620q048
7005d1969O262q494q468o80M508J4265M430J554K1437o809j2370j2195K167J5303
6991b1059O839o80J2431N787j1447j2538q283m973l232l682N473J4621k708j4965
6977c8416j2695j7908n504J6313Q286K997J0695J8531j26j3543j4511j4390M266
6964e6005K065J3006J5388l790k353J7225n155J665o094m163Q102R559j1575J833
6950b0292j1045j4667K771K318j1407m88J3643j076j447R218Q040O115J193r113
6936b6237P977R28j1086k2067j024j304L261J9827K2675M947r551k2079o239R357
6922c0615j851l772J0180j1401J3690J5382j5367j8823R418n979m834L753O4J1428
$$ plain form
7019 -18484 -6924 8697 1976 -18908 -16468 4491 -1131 -18684 -18684 -10076 -14166 -25301 -33921 -41969
7005 -41969 -35707 -44201 -52669 -53349 -48841 -34576 -30146 -28592 -7155 -13964 -26334 -38529 -36362 -21059
6991 -21059 -14220 -14900 -2469 3318 -8129 -20667 -28950 -33923 -37155 -40837 -35364 -20743 -23451 -38416
6977 -38416 -51111 -69019 -74523 -58210 -49924 -46927 -36232 -17701 -17827 -31370 -45881 -60271 -56005
6964 -56005 -53940 -40934 -25546 -29336 -31689 -14464 -19619 -17954 -24048 -28211 -20109 -10550 -22125 -20292
6950 -20292 -31337 -46004 -43233 -40915 -52322 -52810 -39167 -40243 -41690 -32472 -24432 -18317 -17124 -26237
6936 -26237 -18260 -17332 -28418 -50485 -51509 -52813 -49552 -29725 -7050 -2103 -11654 -33733 -39972 -30615
6922 -30615 -32466 -36238 -26058 -37459 -23769 -8387 -23754 -42577 -33159 -39138 -43972 -40219 -40155 -28727
6908b8727K717M772j0333M451J7934J0403o776j4551q27r818r979L811K703L181
6894c1039j156K713p29k886K2022M911K5485J3430j1177j5862k5764j0892n805
6881c6749J1323K0160K1897j5228j5363J3415J7650J228k7190j5499K800J0153
6869a1403n532j048O825J0957j8263j3182m809j3380k246K0471J0140J0601k7523
6856c8392k824K2520j670j3331l0813k69J5780K296j1395l653K0536J9199l979
6843b5995k3604j1822L745L586N374N064J3590L848R051Q230R634j3180m6999
6830e9478k1656P447n393K504K7143J3394j4935R060K5429m771j5750k3184o634
6817f6824O937k471M776N783R791J0188L651J0057k259j0583l864o832r866q496
$$ plain form
6908 -28727 -26010 -21238 -31571 -27120 -9186 1217 -5559 -20110 -20937 -30755 -40734 -36923 -34220 -31039
6894 -31039 -32195 -29482 -30211 -33097 -11075 -6164 19321 32751 21574 5712 -20052 -30944 -36749
6881 -36749 -25426 -5266 16631 1403 -13960 -545 17105 18333 -8857 -24356 -21556 -11403
6869 -11403 -16935 -17983 -11158 -201 -18464 -31646 -36455 -49835 -52081 -31610 -21470 -10869 -38392
6856 -38392 -41216 -18696 -20366 -33697 -64510 -64779 -48999 -46703 -58098 -61751 -41215 -22016 -25995
6843 -25995 -49599 -61421 -57676 -54090 -48716 -43652 -30062 -26214 -17163 -8933 701 -12479 -59478
6830 -59478 -81134 -73687 -79080 -76576 -49433 -36039 -50974 -41914 -16485 -21256 -37006 -60190 -66824
6817 -66824 -59887 -62358 -57582 -51799 -42008 -31820 -28169 -18112 -20371 -30954 -34818 -41650 -51516 -60012
6803f0012R730k630M682K6304N695J4390K06K03n791j5032N857o377q519J469
6789b9825J5920j1354o347j3012J8719K6265J8454p269l0902o108m265M811J6066
6776h847J282Q721Q600Q07J913j0607k0496j569J4313n885r867n846l688P306
6762b3863r92O078J0284M393j0227q90j2075L758P254k164J4M778n828k30k5J4353
6746e382p530o414J02m696k324r956q208m989Q18N424J0851r811l42Q108J3348
6731b1001L038J793N985m319J6629j609j2003p111L625j8442q285n222N651o713
6717d7984p878N812J1957Q179n246J3418J1393j0413j6632J2878O364n501j1298
6704c4951Q167J2353j8783N938m463k209K0936J739o647O285K74o02n680j5214
$$ plain form
6803 -60012 -50282 -52912 -48230 -21926 -16231 -1841 -1635 -1432 -7223 -22255 -16398 -22775 -31294 -29825
6789 -29825 -13905 -25259 -31606 -44618 -25899 366 18820 11551 -19351 -25459 -29724 -24913 -8847
6776 -8847 -7565 1156 9756 10563 12476 1869 -18627 -20196 -5883 -11768 -21635 -27481 -31169 -23863
6762 -23863 -24855 -18777 -8493 -4100 -14327 -15217 -27292 -23534 -16280 -18444 -18430 -13652 -19480 -19710 -19735 -5382
6746 -5382 -12912 -19326 -19224 -23920 -26244 -36200 -44408 -49397 -48579 -43155 -32304 -42115 -42457 -34349 -21001
6731 -21001 -17963 -16170 -10185 -14504 2125 516 -11487 -18598 -14973 -33415 -41700 -46922 -41271 -47984
6717 -47984 -55862 -50050 -38093 -29914 -35160 -21742 -10349 -20762 -37394 -24516 -18152 -23653 -34951
6704 -34951 -26784 -14431 -33214 -27276 -31739 -33948 -13012 -11273 -17920 -11635 -11361 -11963 -17643 -32857
6690c2857q3j3603l534K936J3747J9897P226J4133N063k813q432J943J5243J099
6676A9965p324l3761L391K051R273K173l782P378j6927l1406j0009L343Q142O302
6662d1191J3196Q694J4606L402J4091M552J2283J3264K0131J2208L363j2468j1268
6649E4863P761K4842L1959N372j0708p601j4798k8551j6976k353r366l4492l3428
6636c3476R724L4051J2559r684j3758m714K57q510j3756p24j1335M75J9900l229
6622b2220m695q359K5017J0397k0724n060M218R959j9146K406P629o547J1911
6609a5214J1240r932p073N819J913j5453j731P2J2965K201n318J3171l479j3574
6595b4393k116Q153J5414k631r201l251k4571j3069m524J5087L0814r860k2503
$$ plain form
6690 -32857 -32940 -46543 -50077 -47141 -33394 -13497 -6271 7862 12925 10112 1680 3623 18866 19965
6676 19965 12641 -21120 -17729 -15678 -6405 -4232 -8014 -636 -17563 -48969 -58978 -55635 -47493 -41191
6662 -41191 -27995 -19301 -4695 -1293 12798 17350 29633 42897 63028 75236 78599 66131 54863
6649 54863 62624 87466 119425 124797 114089 106488 91690 63139 46163 43810 34444 -48 -33476
6636 -33476 -23752 10299 22858 13174 -584 -5298 -5041 -13551 -27307 -28031 -39366 -38891 -18991 -22220
6622 -22220 -26915 -35274 -10257 140 -20584 -25644 -21426 -11467 -30613 -28207 -20578 -27125 -15214
6609 -15214 -3974 -13906 -20979 -15160 -13247 -28700 -30431 -30359 -17394 -15193 -20511 -7340 -10819 -24393
6595 -24393 -26509 -18356 -2942 -5573 -14774 -18025 -42596 -55665 -60189 -45102 -14288 -24148 -46651
6582d6651l869K566j460o99P643L2360J0111N428m126k7550j8646k2507L265J3279
6568e0856L3167J1091j8576J792J4545j5576j378l274n134Q427m697J4650J7309
6555A490K0001m362j3067r3m034J4960k0975k3804j3162M887J7850J0213j5646
6542b5742j0473K1182J1135j296N270p587k3361j5518J5723L2937r825l274K3120
6529A2291m846j8263j1149J1689K8631q648j1709k5342k0446q978O081j0120J3670
6516d7139J7855n850p430r151J3497Q070M30J9960l056j1257l772J4287j094j2613
6502b7263K4459k406j6301J0325n813j9640o21m490N043J3845P291P996J2152
6489D577n673k1576o040J82l281N10K3257J2992q541j065r493j0105p354K2747
$$ plain form
6582 -46651 -50520 -47954 -49414 -50113 -42470 -10110 1 5429 1303 -26247 -44893 -67400 -64135 -50856
6568 -50856 -17689 -6598 -25174 -23382 -8837 -24413 -25791 -29065 -34199 -25772 -30469 -15819 1490
6555 1490 21491 17129 4062 3969 -65 14895 -6080 -29884 -43046 -38159 -20309 -10096 -25742
6542 -25742 -36215 -15033 -3898 -5194 76 -7511 -30872 -46390 -30667 2270 -7555 -10829 12291
6529 12291 7445 -10818 -21967 -10278 18353 9705 -2004 -27346 -47792 -56770 -50689 -60809 -47139
6516 -47139 -29284 -35134 -42564 -51715 -38218 -30148 -29718 -9758 -12814 -24071 -27843 -13556 -14650 -27263
6502 -27263 -2804 -5210 -21511 -11186 -16999 -36639 -37260 -41750 -36707 -22862 -15571 -7575 4577
6489 4577 -1096 -22672 -28712 -28530 -31811 -31301 -8044 4948 -3593 -4658 -14151 -24256 -31610 -8863
6475h863K8053L148k3190j7447n654N210K2075Q718o162k1741j7399j562L339
6462c1475K6131J1742J640j2168r285R21j2425j0291J4405L059K411j956M251
6449a3040N067N188J3983m692l7536k4029M12K3845J5043p236k655j9496k915
6436d8061R218R919J2637m789j5294O180J0944R504j0363N180p093j7278j467
6423d0763j970j1619j8577Q716J1848J4397K409J7108K4658k106O805k3351j4621
6410b7066K501L790J732M478O96J2671o906O401J281m280J2559J0369k7740j4836
6396b4350j7491O844Q248L268k0179l539J9460J4169P832J5762k0049j1215q63
6383b2103o502N019J2172k148P308n792J652J3018P939P485n064k862j386j9105
$$ plain form
6475 -8863 19190 22338 -852 -18299 -23953 -18743 3332 12050 5888 -15853 -33252 -34814 -31475
6462 -31475 -5344 6398 8038 -4130 -13415 -12494 -24919 -35210 -20805 -17746 -15335 -17291 -13040
6449 -13040 -7973 -2785 11198 6506 -31030 -55059 -54647 -30802 -15759 -22995 -25650 -45146 -48061
6436 -48061 -38843 -28924 -16287 -21076 -36370 -30190 -19246 -9742 -20105 -14925 -22018 -39296 -40763
6423 -40763 -42733 -54352 -72929 -64213 -52365 -37968 -35559 -18451 6207 4101 10906 -12445 -27066
6410 -27066 -24565 -20775 -19043 -14565 -13869 -1198 -8104 -1703 -422 -4702 7857 18226 -9514 -24350
6396 -24350 -41841 -34997 -26749 -23481 -43660 -47199 -27739 -13570 -5738 10024 -10025 -21240 -22103
6383 -22103 -28605 -23586 -11414 -13562 -6254 -12046 -10394 2624 10563 18048 12984 10122 8736 -10369
6369a0369K576J5354l978j8769k099r670k0882J416K2120k950P176j972j3836
6356c5883k008J039n770O06K5900J9004k2370l385Q765n754j1918Q231J9492j1738
6342a5789r222p877K0013M355j5485K092M248q152P231j853r750L28N413J5118
6328i330J1597n914k1571j0623J1634n54n277J466j0826N025j5601m860M212P623
6314d2999Q025M237M766j2578l1767R801J8767j4122J3040J9628l0779k5609O952
6301g2638K7071K9837M409k236n647k5153k226p136J2756J9415j4168q072K593
6288d1195r465J3570l437n144J1829J8479N645P805J6566j4752m120P489M03J815
6274E488j1049J009P297J1125p068m12k4767l4264O877J7858r69L2772M289K080
$$ plain form
6369 -10369 -7793 7561 3583 -15186 -17285 -26955 -47837 -46421 -24301 -27251 -20075 -22047 -35883
6356 -35883 -37891 -36852 -42622 -42016 -16116 2888 -19482 -22867 -14102 -19856 -31774 -23543 -4051 -15789
6342 -15789 -25011 -32888 -12875 -8520 -24005 -21913 -17665 -25817 -18586 -20439 -30189 -29861 -24448 -9330
6328 -9330 2267 -3647 -25218 -35841 -24207 -24761 -30038 -28572 -39398 -34373 -49974 -54834 -50622 -42999
6314 -42999 -34974 -30737 -25971 -38549 -70316 -60515 -41748 -55870 -42830 -23202 -53981 -79590 -72638
6301 -72638 -45567 -15730 -11321 -13557 -19204 -44357 -46583 -53719 -40963 -21548 -35716 -43788 -41195
6288 -41195 -50660 -37090 -40527 -45671 -33842 -15363 -9718 -1913 14653 -99 -4219 3270 3673 5488
6274 5488 -5561 -4552 2745 13870 6802 6390 -18377 -52641 -45764 -27906 -28875 3897 8186 10266
6260A0266J928K419k5594l4580m108M918N572P647l218L486l646J123J7194k060
6246a8653O077O252k997j1873j4814J0717J0774L801L305k1191K465j051P677
6233a9511M793m123j2585q003O863K263j84j1054m231L273J0130J4825O005N416
6219f123K996o086p069Q352Q106m404O177N804l286l26k0233K1325J8646j1267
6205A2612q667j0191j3326k653k963K796K328k943Q837K892k155L460j2075j9979
6191d2027l295J1234R092Q716o026j2410k887n752l853K4621J2672j2818k5546
6178d8279p901j039m883J5183L1798K2886o281M400J0271j0135l772N923k1489
6165a3318k28J7131q964M146k689j6513j5682L69J0918J4453P827n835r23J3102
$$ plain form
6260 10266 12194 14613 -10981 -45561 -49669 -44751 -39179 -31532 -34750 -31264 -34910 -33787 -16593 -18653
6246 -18653 -12576 -6324 -9321 -21194 -36008 -25291 -14517 -10716 -7411 -28602 -26137 -27188 -19511
6233 -19511 -14718 -18841 -31426 -39429 -32566 -30303 -30487 -41541 -45772 -42499 -32369 -17544 -11539 -6123
6219 -6123 -3127 -9213 -16282 -7930 176 -4228 1949 7753 4467 4141 -16092 5233 23879 12612
6205 12612 3945 -6246 -19572 -22225 -25188 -22392 -20064 -23007 -14170 -11278 -13433 -9973 -22048 -42027
6191 -42027 -45322 -34088 -24996 -16280 -22306 -34716 -37603 -43355 -47208 -22587 -9915 -22733 -48279
6178 -48279 -56180 -57219 -62102 -46919 -15121 7765 1484 5884 16155 6020 2248 8171 -13318
6165 -13318 -13546 3585 -5379 -1233 -3922 -20435 -36117 -35748 -24830 -10377 -2550 -8385 -9308 3794
6151C794O845k5406j4787J0735k286n057J0506L4863J9706O856j5860l6879p829
6138a4799M466q937R261j458j3393j5919k015R403J5132o72j9838j1398N493k010
6124d6684J2683J9202j538j1720j3492M798j392L463J6317O384N38j0193l982
6111b5616j6439P665K3219L2094J0415m358J554j5279j2666j4040p256M999L240
6098a2468J5634M012j4356j3057j5546m832J0466N674q52m148J0511R286j9518
6085b9194r373J1294J1282q629J0850J0880j4685m783O060n615j7777P900J558
6072c0232J5792k1434J7428n18m003K6933J4864j5487O849K62j0166O320N368
6059A1976Q935r636j0674r900l296K3419K8995n126j2978k1675j9103q43J7553
$$ plain form
6151 3794 10639 -14767 -29554 -18819 -21105 -26162 -15656 19207 38913 45769 29909 -6970 -14799
6138 -14799 -10333 -19270 -10009 -11467 -24860 -40779 -42794 -33391 -18259 -18931 -38769 -50167 -44674 -46684
6124 -46684 -34001 -14799 -16337 -28057 -41549 -36751 -38143 -34680 -18363 -11979 -11441 -21634 -25616
6111 -25616 -42055 -34390 -11171 20923 31338 26980 28534 13255 589 -13451 -20707 -15708 -12468
6098 -12468 3166 7178 -7178 -20235 -35781 -40613 -30147 -24473 -25325 -29473 -18962 -9676 -29194
6085 -29194 -38567 -27273 -15991 -24620 -13770 -2890 -17575 -22358 -16298 -21913 -39690 -31790 -30232
6072 -30232 -14440 -35874 -18446 -18964 -22967 3966 18830 3343 10192 10454 288 6608 11976
6059 11976 20911 11275 601 -9299 -12595 10824 39819 34693 21715 40 -19063 -19906 -2353
6046b353l783L518L202N500q700p379J4390r986j3121q741j1397J753J2248J1095
6032a3754J1643R447j9246o896n522J407J0616m148n371n658k2350r873J759P814
6018e0132K2664J4681L188j5890K026J5403O521o020o002R014r46j0584j3685
6005b9762J1826j941J927J7941j018j4723j6526K267j924J8109o350k742l145
5992b6061L26R385J0253j4080J146J4726m832j8677r912P219N689N994K3247R899
5978A4322N464J2928j3394j9371K018j2991j1887m354j5801k2937p925K2086L0809
5965b1033R402R912l341J1439Q364Q999j5538l9189k414K7637Q558K421K743o580
5951A380r461o841o031K10j5808P614R032M144n188M680Q649j2614k555J1834
$$ plain form
6046 -2353 -6136 -2618 584 6084 -2616 -9995 4395 -5591 -18712 -27453 -38850 -37097 -24849 -13754
6032 -13754 -2111 7336 -11910 -18806 -24328 -22921 -12305 -16453 -21824 -27482 -49832 -59705 -57946 -50132
6018 -50132 -27468 -12787 -9599 -25489 -23463 -8060 -1539 -7559 -13561 -4547 -5493 -16077 -29762
6005 -29762 -17936 -19877 -17950 -9 -1027 -15750 -32276 -30009 -31933 -13824 -20174 -22916 -26061
5992 -26061 -25735 -16350 -6097 -20177 -19031 -4305 -9137 -27814 -37726 -30507 -24818 -18824 4423 14322
5978 14322 19786 32714 19320 -51 1967 -11024 -22911 -27265 -43066 -66003 -73928 -51842 -21033
5965 -21033 -11631 -1719 -5060 6379 14743 23742 8204 -30985 -33399 -5762 2796 5217 7960 1380
5951 1380 -8081 -14922 -20953 -20743 -36551 -28937 -19905 -15761 -20949 -16269 -7620 -20234 -22789 -10955
5937a0955q773j6372J1569K2220P589m422J0631J743m9Q510J304j7459k6537j516
5923b2517L620J1522j2848N482Q309l196L794r268l043Q037q659j6818j4921m658
5909e5164J7913L1414N576q298j2059j0295J184J8992O631n546R984J997j7331
5896a5002j2142P563M387J2451Q425N263j2357l592N235O999r215j2355n58J697
5882a3201n01J9443J9181K754j2264k1602j6976k136N575R627J2501r960j4354
5869b1913q55k0984J8104L477p379J5301M60J1768o214J0226J2556j3058j70J2682
5855A4001j4834O490P430R013l839N789J1969j5926r466j3154l842R77q213M414
5841i191l454l952q555J7445J1167j704p821M53L191L551q054N544J3747l550
$$ plain form
5937 -10955 -19728 -36100 -24531 -2311 5278 856 11487 13230 13181 21691 22995 5536 -21001 -22517
5923 -22517 -18897 -7375 -20223 -14741 -6432 -9628 -5834 -15102 -18145 -10108 -18767 -35585 -50506 -55164
5909 -55164 -37251 -5837 -261 -8559 -20618 -30913 -29729 -10737 -4106 -9652 332 2329 -15002
5896 -15002 -27144 -19581 -15194 -2743 5682 10945 -1412 -5004 231 7230 -1985 -14340 -14898 -13201
5882 -13201 -13702 5741 24922 27676 15412 -6190 -23166 -25302 -19727 -10100 2401 -7559 -21913
5869 -21913 -22768 -43752 -25648 -22171 -29550 -14249 -13789 -2021 -8235 1991 14547 1489 1319 14001
5855 14001 -833 5657 13087 22100 18261 24050 36019 20093 10627 -2527 -6369 -5392 -13605 -9191
5841 -9191 -12645 -16597 -25152 -7707 3460 1756 -6065 -5612 -2421 1130 -6924 -1380 12367 8817
5827H817n598j2867k7046o30J524j0669P832J8360J1394J2198m843J2955N21k0533
5813h585p648K0607J6957J1233O526j1579j7174j9094j0437J077J0953P019l231
5800c376j1166j3738j0937J4385k795J3806L3523J2952n620r483k9393J274n687
5787a6255K490k487K376Q358R668j1852k0531N463J7661J0180m185o655J682P169
5773C082j3901j2823j1227J6485M6352M324m265j3462k338L868L177M61n775j5838
5759a880j650k225m996R971J9085L39j2747j7593k745R595j351Q541j0342j8223
5745b6221q277J3036Q992n767l565J0959K509o960j4977N667K2143J4233j668
5732A0104n141j2668P33k370J1300J6108P81j2185n010o973j7121j1429k009M421
$$ plain form
5827 8817 3219 -9648 -36694 -37324 -35800 -46469 -38637 -20277 -8883 3315 -1528 11427 11948 -8585
5813 -8585 -16233 4374 21331 32564 39090 27511 10337 -8757 -19194 -18117 -7164 -145 -3376
5800 -3376 -14542 -28280 -39217 -24832 -27627 -13821 19702 32654 27034 17551 -11842 -10568 -16255
5787 -16255 -13765 -16252 -13876 -5518 4150 -7702 -28233 -22770 -5109 5071 886 -5769 -4087 3082
5773 3082 -10819 -23642 -34869 -18384 27968 32292 28027 14565 12227 16095 19272 19733 13958 -1880
5759 -1880 -3530 -5755 -10751 -780 18305 18644 5897 -11696 -14441 -4846 -6197 2344 -7998 -26221
5745 -26221 -34498 -21462 -12470 -18237 -21802 -10843 -8334 -15294 -30271 -24604 -2461 11772 10104
5732 10104 4963 -7705 -6972 -9342 1958 18066 18847 6662 1652 -5321 -22442 -33871 -35880 -31459
5718c1459K007J2116J1275j2743o479N975j3954l252K6094O770m881P598L862
5705B929j6172j1730J5189o012p547J2859L1590m374k1071j0205J1139j1883J3259
5692b029N973j7050n150j7506J4497J6815J3630q456j3674K0667j176j0809P722
5679C454P282j3934k676L333N884j6976p667p550J1365N009m150J8312m822k384
5665e520p593L887M916k7517o766R568j8286j681J1696J7543n716k0825R946J7306
5651a9042J939J7235L239j170o688p261L08J2440L059j1255m92N128n898j9249
5637b7707j0320n825K983k154j8818j0818R15K7925O399J2491Q65N480m092Q593
5623a4083P641l242J429n853L414j6491o53o257Q723O790k836K229N095P116k0844
$$ plain form
5718 -31459 -29452 -17336 -6061 -18804 -25283 -19308 -33262 -36514 -10420 -3650 -8531 -933 2929
5705 2929 -13243 -24973 -9784 -15796 -23343 -10484 21106 16732 -4339 -14544 -3405 -15288 -2029
5692 -2029 3944 -13106 -18256 -35762 -21265 -4450 9180 724 -12950 7717 6541 -4268 3454
5679 3454 10736 -3198 -5874 -2541 3343 -13633 -21300 -28850 -17485 -12476 -16626 1686 -3136 -5520
5665 -5520 -13113 -9226 -4310 -31827 -38593 -29025 -47311 -48992 -37296 -19753 -25469 -46294 -36348 -19042
5651 -19042 -17103 132 3371 2201 -4487 -11748 -11440 1000 4059 -7196 -7688 -2560 -8458 -27707
5637 -27707 -38027 -43852 -40869 -43023 -61841 -72659 -71744 -43819 -37420 -24929 -24064 -18584 -22676 -14083
5623 -14083 -6442 -9684 -8255 -14108 -10694 -27185 -27838 -34095 -25372 -18582 -21418 -19189 -14094 -6978 -27822
5608b7822k8010K611K2788L1324k374K633O972R332Q043M30m816k190j947L161
5594B0135L853J004j4949j7479j3926j774q50J3516p607j4269k46J4723J583J492
5580a4794M178j229j0709j3052K5398K2409r79l928j180j4909l81k0847O44M393
5566b4986P02J3725p289j5119J5907j892M658r276j6247N270J1508J8970m429
5553h498m627j4153m030J0999J0020J2157p183k1090M292R884N099K831p606j7277
5539b9182q339k397m139J3434J3328Q055R960Q072L166j0851m303R677q15L925
5525I591k429q985j5409j7632m749J8849J1500K3669J0518L638P85k033M375j6404
5511A5284j189N203j0570o753L687J1353q803k0147p772J512o25q240Q683j1439
$$ plain form
5608 -27822 -55832 -53221 -30433 891 -1483 1150 8122 17454 25497 25927 21111 18921 16974 20135
5594 20135 23988 24992 10043 -7436 -21362 -23136 -23986 -10470 -18077 -32346 -32592 -17869 -16286 -14794
5580 -14794 -10616 -11845 -22554 -35606 -10208 12201 11222 7294 6114 -8795 -9176 -30023 -29379 -24986
5566 -24986 -24284 -10559 -17848 -32967 -17060 -18952 -14294 -23570 -39817 -34547 -23039 -4069 -8498
5553 -8498 -13125 -27278 -31308 -20309 -10289 1868 -5315 -26405 -22113 -12229 -7130 -4299 -11905 -29182
5539 -29182 -37521 -39918 -44057 -30623 -17295 -9240 720 8792 11958 1107 -3196 6481 5666 9591
5525 9591 7162 -1823 -17232 -34864 -39613 -20764 -9264 14405 24923 28561 29346 27313 31688 15284
5511 15284 14095 19298 8728 1975 5662 17015 8212 -11935 -19707 -18195 -18820 -27060 -18377 -29816
5497b9816p948K2022J0875L464k261L52P48j1287j5566j2818J4673M3016K4535
5484C9989j8421j2720o393N102p920k0175r629l360j4134J1821K3436Q158k8821
5471c3067l188R199K0845J7503J4903p972M456k3451j087L349p458k811O80j752
5457i851p656R159P971J911m068j0479J574j3753N392J2364J0922m308o518M27
5443f913n533J378J373O354R948J404j6258p633j1169P442K001j5263m220J0177
5429b6912K3249p920j2478O010N756O824N244K219o421j5833P99j4288m682P295
5415c1138P805J2428J0938K3365J7523L016j6519o4M764j9344l603Q287j1834
5402E624L452J9467J1335k7272o080Q796j2893r396J3192J878K628j2825m823
$$ plain form
5497 -29816 -37764 -15742 -4867 -1403 -3664 -3312 -2564 -13851 -29417 -42235 -27562 15454 39989
5484 39989 21568 8848 2455 7557 -363 -20538 -30167 -33527 -47661 -35840 -12404 -4246 -33067
5471 -33067 -36255 -27056 -6211 11292 26195 18223 22679 -772 -1859 1490 -5968 -8779 -8099 -9851
5457 -9851 -17507 -8348 -377 1534 -2534 -13013 -11439 -25192 -19800 -7436 3486 -822 -7340 -6913
5443 -6913 -12446 -11068 -9695 -3341 6607 8011 -8247 -15880 -27049 -19607 -17606 -32869 -37089 -26912
5429 -26912 -3663 -11583 -24061 -18051 -12295 -5471 -227 1992 -4429 -20262 -19463 -33751 -38433 -31138
5415 -31138 -23333 -10905 33 23398 40921 43937 27418 27354 32118 12774 9171 17458 5624
5402 5624 9076 28543 39878 12606 6526 15322 2429 -6967 6225 8103 10731 -2094 -6917
5389f917J0456p870p090j4433o277M945P503K2r376L234J561m740j1417k493J4817
5374b8075o501P319O224n29q626L774L339m350j3787Q715K377L538L318K877J4847
5359e540N408j525K473J970K65Q033m227P50K756k2098n31J3803J6262j7886j2022
5344a2109r59j5523n010J8839J7384K230M110j7535J92p342l825P749j090K208
5330a0681l625P360l510j0981p549R771j81K579J5698K949j9360J9292K0023m894
5316A6891k839n036m274o749L534J7300q00J0610J0083M268Q541K125k2811j3302
5302A7541J3012N565Q75m193q136j8247j3111p221N142M374J7279j2276j2098
5289a1494p927Q303P35L568R018P973j4500k2278N681Q71J4653o61k1521J752
$$ plain form
5389 -6917 3539 -4331 -11421 -25854 -32131 -27186 -19683 -19661 -29037 -25803 -24242 -28982 -40399 -42892 -28075
5374 -28075 -34576 -27257 -21033 -21562 -30188 -26414 -23075 -27425 -41212 -32497 -30120 -26582 -23264 -20387 -5540
5359 -5540 -132 -1657 816 2786 3051 11084 6857 7607 10363 -11735 -12266 1537 17799 -87 -12109
5344 -12109 -13068 -28591 -33601 -14762 2622 4852 8962 -8573 -8381 -15723 -19548 -11799 -12889 -10681
5330 -10681 -14306 -6946 -10456 -21437 -28986 -19215 -19396 -16817 -1119 1830 -17530 1762 21785 16891
5316 16891 14052 9016 4742 -2007 1527 18827 18027 28637 38720 42988 51529 53654 30843 17541
5302 17541 30553 36118 36993 32800 24664 6417 -6694 -13915 -8773 -4399 12880 604 -11494
5289 -11494 -19421 -11118 -10383 -6815 2203 10176 -4324 -26602 -20921 -20050 -5397 -6058 -27579 -25827
5275b5827K1761J2133l656k8705m084M027J7197l423j5068R256L77O762k2901
5262c2151Q911K6270n222j9198R806P808q731N42o891q780j2031J0621J6541J80
5248a2325l123L232m503n052J003Q305K3653J5005r353j7088j3768O273k3886
5235c1627N2Q252J5625L0615j0655k036j418P747j0020k1113j5370O842J1216
5222a1890j2087q607J3532K110k841J205L422r6J206q959R991J5070l148j1428
5208a2520p33j0164J6095J0548K946K026j6601m618J086q817q481k2924j1047
5195f3204K5204J5111J3963r28N498k182q841p847M787J1936n591Q37J6695Q827
5181A4265j3593l1053l556r32J7949J9103l93J5815J998j9235k2144m678k523
$$ plain form
5275 -25827 -4066 8067 4411 -24294 -28378 -24351 -7154 -10577 -25645 -16389 -16012 -9250 -32151
5262 -32151 -23240 3030 -2192 -21390 -11584 -3776 -12507 -11965 -18856 -27636 -39667 -29046 -12505 -12325
5248 -12325 -15448 -12216 -16719 -21771 -20768 -12463 11190 26195 16842 -246 -14014 -7741 -31627
5235 -31627 -31575 -23323 -7698 22917 12262 10226 8808 16555 6535 -14578 -29948 -23106 -11890
5222 -11890 -23977 -32584 -19052 -16942 -19783 -18578 -15156 -15252 -14046 -23005 -13014 2056 -1092 -12520
5208 -12520 -13253 -23417 -7322 3226 6172 8198 -8403 -13021 -11935 -20752 -29233 -52157 -63204
5195 -63204 -38000 -22889 -8926 -9854 -4356 -6538 -15379 -23226 -18439 -6503 -12094 -11257 5438 14265
5181 14265 672 -30381 -33937 -34869 -16920 2183 1790 17605 19603 368 -21776 -26454 -28977
5168b8977K4788J9885j2054k4149j562j595J0936k857K0699r94q96J2799K457
5155A8480l628k0675j5391l403L426j5168R387l028Q325J8580K935j6012j1094
5142b7266J1679N134j4314J2337M974J563n404P388L160J253J2634q34k8353O125
5128i924M815r460K783P60J417L425n066j560J423K990n850j085r839J5905J6667
5113G401L023N291j240p531k241q630J6086J8073Q66k827j1963j0162m266o534
5099d654l977K3841K607o202J543r585k2423o045J7088J3668J727r28j741j6646
5085a1727j1324J8014r668j2373o704r936N671O986J8418P370j639K10J5173k185
5071F286j7768j5523Q221J5461R533J1519J3724j1627j5486j274M550l859P085
$$ plain form
5168 -28977 -4189 15696 3642 -20507 -22069 -23664 -12728 -15585 5114 4120 3224 16023 18480
5155 18480 14852 -5823 -21214 -24617 -21191 -36359 -26972 -30000 -21675 -3095 -160 -16172 -27266
5142 -27266 -15587 -10453 -24767 -12430 -7456 -5893 -11297 -3909 -749 504 13138 12304 -16049 -9924
5128 -9924 -5109 -14569 -11786 -11026 -9609 -6184 -11250 -12810 -11387 -8397 -14247 -15332 -25171 -9266 7401
5113 7401 10424 15715 14475 6944 4703 -3927 12159 30232 31098 28271 16308 6146 1880 -4654
5099 -4654 -8631 15210 17817 11615 13158 3573 -18850 -24895 -7807 5861 7588 6660 4919 -11727
5085 -11727 -23051 -5037 -14705 -27078 -33782 -43718 -38047 -31061 -12643 -5273 -6912 -6702 8471 6286
5071 6286 -11482 -27005 -18784 -3323 6210 17729 31453 19826 4340 3066 7616 3757 10842
5058A0842j0834P738J9218j2317k3642o292J5853R437P897k0995K240j1803P287
5045e371N020j7471m601J6055J1752N858m301n672l356q474o884k918J075L955
5031a5333k0809k0445N696J6540P731p898J7156K994K233L552n853J297j1749
5018b4888o436K0868r396k581Q13J4531J1443j6546j2199n85K4375L0315J47j8834
5004A1027n248M656q922k2626l1289p31K517J8508P759J4949K0659J846m302P082
4990A5885k305k8154k1691o5Q715P782K938N249J4200J4273K565l3122n538o301
4976b5569n231J2052J835m220Q957Q024m258j0131Q918M620J780o320l765k066
4962a5374l092J7379M608j7664J0857K3290J5485j9525k1745j4247N483Q171m642
$$ plain form
5058 10842 8 7746 26964 14647 -8995 -15287 566 10003 17900 -3095 -855 -12658 -5371
5045 -5371 -351 -17822 -22423 -6368 5384 11242 6941 1269 -2087 -10561 -17445 -20363 -19288 -15333
5031 -15333 -36142 -56587 -50891 -34351 -26620 -34518 -17362 -14368 -12135 -8583 -14436 -13139 -24888
5018 -24888 -31324 -10456 -19852 -22433 -21620 -7089 4354 -12192 -24391 -24976 -601 29714 29861 11027
5004 11027 5779 10435 1513 -21113 -52402 -53133 -50616 -32108 -24349 -9400 11259 13105 8803 15885
4990 15885 13580 -14574 -36265 -36330 -27615 -19833 -16895 -11646 2554 16827 19392 -13730 -19268 -25569
4976 -25569 -30800 -18748 -16913 -21133 -12176 -4152 -8410 -18541 -9623 -5003 -3223 -9543 -13308 -15374
4962 -15374 -18466 -1087 3521 -14143 -3286 20004 35489 15964 -5781 -20028 -14545 -6374 -11016
4949a1016P957J0400J4578l767l078j4042n940n790R88n368J1418M253o922J0202
4935C873N400q510j4185k434j7195J117J8576p709o356m999l838P970p31j0909
$$ plain form
4949 -11016 -3059 7341 21919 18152 15074 1032 -4908 -10698 -9710 -15078 -3660 593 -6329 3873
4935 3873 9273 763 -13422 -15856 -33051 -31934 -13358 -21067 -27423 -32422 -36260 -28290 -29021 -39930
$$ [...]
##END NTUPLES=NMR SPECTRUM
##END=
