##TITLE=Analysis number 309916
Compound Code km 10802
Book Reference 440/12
Project Code adrs
Chemist Name craigr
##JCAMPDX= 6.0         $$ Bruker NMR JCAMP-DX V2.0
##DATA TYPE= NMR SPECTRUM
##DATA CLASS= NTUPLES
##ORIGIN= Bruker BioSpin GmbH
##OWNER= NMR
$$ XWIN-NMR		Version 3.5
$$ Wed Jun  8 10:23:19 2005 GMT Daylight Time (UT+1h)  MAYBRIDGE\NMR@NMR_250MHZ
##.OBSERVE FREQUENCY= 250.131544655141
##.OBSERVE NUCLEUS= ^1H
##.ACQUISITION MODE= SIMULTANEOUS (DQD)
##.ACQUISITION SCHEME= undefined
##.AVERAGES= 16
##.DIGITISER RES= 18
##SPECTROMETER/DATA SYSTEM= dpx250
##.PULSE SEQUENCE= zg30
##.SOLVENT NAME= CDCl3
##.SHIFT REFERENCE= (INTERNAL, CDCl3, 0, 16.522)
##AUDIT TRAIL= $$ (NUMBER, WHEN, WHO, WHERE, WHAT)
$$ ##TITLE= Audit trail, XWIN-NMR		Version 3.5
$$ ##JCAMPDX= 5.01
$$ ##ORIGIN= Bruker BioSpin GmbH
$$ ##OWNER= NMR
$$ C:\u/data/dgb/nmr/ADRS/3930/pdata/1/auditp.txt
$$ ##AUDIT TRAIL=  $$ (NUMBER, WHEN, WHO, WHERE, WHAT)
(   1,<2005-06-08 10:22:45.70 +100>,<MAYBRIDGE\NMR>,<NMR_250MHZ>,
      <created by zg, POWCHK disabled, PULCHK disabled
       configuration hash MD5:
       62 19 C7 07 E1 42 D1 B7 37 6C 3D D0 77 39 F9 E6
       data hash MD5: 64K
       89 9B B2 BF 04 30 FC C3 5C B2 6E 9F EF 6A FE A3>)
(   2,<2005-06-08 10:23:03.56 +100>,<MAYBRIDGE\NMR>,<NMR_250MHZ>,
      <Start of raw data processing
       ef LB = 0.3 FT_mod = 6 PKNL = 1 SI = 32K 
       data hash MD5: 32K
       02 D0 FD 0E 63 D8 5D 87 73 9E 1F DC A7 00 1B 36>)
(   3,<2005-06-08 10:23:07.40 +100>,<MAYBRIDGE\NMR>,<NMR_250MHZ>,
      <apk 
       data hash MD5: 32K
       DB 93 37 19 E3 B4 55 B3 31 6C 41 FF C8 87 61 59>)
(   4,<2005-06-08 10:23:08.62 +100>,<MAYBRIDGE\NMR>,<NMR_250MHZ>,
      <abs ABSG = 5 
       data hash MD5: 32K
       25 CB 79 F3 34 8A F2 9B D6 47 53 FC BD 25 DA 3A>)
$$ ##END=
$$ 
$$ hash MD5
$$ AB B3 71 6F 38 6E D9 58 EC 02 08 90 B7 3C DF 5F
##$RELAX= 
##$RELAX= 
##$RELAX= 
##$RELAX= 
##$RELAX= 
##$RELAX= 
##$RELAX= 
$$ Bruker specific parameters
$$ --------------------------
##$DU= <C:\u>
##$EXPNO= 3930
##$NAME= <ADRS>
##$PROCNO= 1
##$TYPE= <nmr>
##$USER= <dgb>
##$AMP= (0..31)
100 100 100 100 100 100 100 100 100 100 100 100 100 100 100 100 100 100 
100 100 100 100 100 100 100 100 100 100 100 100 100 100 
##$AQSEQ= 0
##$AQ_mod= 3
##$AUNM= <au_zg>
##$AUTOPOS= <8 >
##$BF1= 250.13
##$BF2= 250.13
##$BF3= 250.13
##$BF4= 250.13
##$BF5= 500.13
##$BF6= 500.13
##$BF7= 500.13
##$BF8= 500.13
##$BYTORDA= 1
##$CFDGTYP= 0
##$CFRGTYP= 5
##$CHEMSTR= <none>
##$CNST= (0..31)
1 1 145 1 1 1 1 1 1 1 1 1 1 1 1 1 1 1 1 1 1 1 1 1 1 1 1 1 1 1 1 1 
##$CPDPRG= <>
##$CPDPRG1= <>
##$CPDPRG2= <>
##$CPDPRG3= <>
##$CPDPRG4= <mlev>
##$CPDPRG5= <mlev>
##$CPDPRG6= <mlev>
##$CPDPRG7= <mlev>
##$CPDPRG8= <mlev>
##$CPDPRGB= <>
##$CPDPRGT= <>
##$D= (0..31)
0 1 0 0 0 0 0 0 0 0.06 0 0 0 0 0 0 0.0002 0 0 0 0 0 0 0 0 0 0 0 0 0 0 
0 
##$DATE= 1118222564
##$DBL= (0..7)
120 120 120 120 120 120 120 120 
##$DBP= (0..7)
150 150 150 150 150 150 150 150 
##$DBP07= 0
##$DBPNAM0= <>
##$DBPNAM1= <>
$$ [...]
##$SUBNAM6= <"">
##$SUBNAM7= <"">
##$SUBNAM8= <"">
##$SUBNAM9= <"">
##$SW= 20.6930455092707
##$SWIBOX= (0..15)
0 0 3 0 0 0 0 0 0 0 0 0 0 0 0 0 
##$SW_h= 5175.983436853
##$TD= 65536
##$TD0= 1
##$TE= 295.16
##$TE2= 300
##$TE3= 300
##$TEG= 300
##$TL= (0..7)
0 120 120 120 120 120 120 120 
##$TP= (0..7)
150 150 150 150 150 150 150 150 
##$TP07= 0
##$TPNAME0= <>
##$TPNAME1= <>
##$TPNAME2= <>
##$TPNAME3= <>
##$TPNAME4= <>
##$TPNAME5= <>
##$TPNAME6= <>
##$TPNAME7= <>
##$TPOAL= (0..7)
0.5 0.5 0.5 0.5 0.5 0.5 0.5 0.5 
##$TPOFFS= (0..7)
0 0 0 0 0 0 0 0 
##$TUNHIN= 0
##$TUNHOUT= 0
##$TUNXOUT= 0
##$USERA1= <user>
##$USERA2= <user>
##$USERA3= <user>
##$USERA4= <user>
##$USERA5= <user>
##$V9= 5
##$VALIST= <valist>
##$VCLIST= <CCCCCCCCCCCCCCC>
##$VD= 0
##$VDLIST= <DDDDDDDDDDDDDDD>
##$VPLIST= <PPPPPPPPPPPPPPP>
##$VTLIST= <TTTTTTTTTTTTTTT>
##$WBST= 1024
##$WBSW= 4
##$XGAIN= (0..3)
0 0 0 0 
##$XL= 0
##$YL= 0
##$YMAX_a= 606645
##$YMIN_a= -425541
##$ZGOPTNS= <>
##$ZL1= 120
##$ZL2= 120
##$ZL3= 120
##$ZL4= 120
##$ABSF1= 16.522
##$ABSF2= -4.171173
##$ABSG= 5
##$ABSL= 3
##$ALPHA= 0
##$AQORDER= 0
##$ASSFAC= 0
##$ASSFACI= 0
##$ASSFACX= 0
##$ASSWID= 0
##$AUNMP= <proc_1d>
##$AZFE= 0.1
##$AZFW= 0.1
##$BCFW= 0
##$BC_mod= 0
##$BYTORDP= 0
##$COROFFS= 0
##$CY= 12.5
##$DATMOD= 1
##$DC= 0
##$DFILT= <>
##$DTYPP= 0
##$F1P= 14.0000005364418
##$F2P= -0.99999901652339
##$FCOR= 0.5
##$FTSIZE= 32768
##$FT_mod= 6
##$GAMMA= 0
##$GB= 0
##$INTBC= 1
##$INTSCL= 1
##$ISEN= 128
##$LB= 0.3
##$LEV0= 0
##$LPBIN= 0
##$MAXI= 10000
##$MC2= 0
##$MEAN= 0
##$ME_mod= 0
##$MI= 0
##$NCOEF= 0
##$NC_proc= -3
##$NLEV= 6
##$NOISF1= 0
##$NOISF2= 0
##$NSP= 0
##$NTH_PI= 0
##$NZP= 0
##$OFFSET= 16.522
##$PC= 1
##$PHC0= 130.9357
##$PHC1= 9.55267
##$PH_mod= 1
##$PKNL= yes
##$PPARMOD= 0
##$PSCAL= 4
##$PSIGN= 0
##$REVERSE= no
##$SF= 250.13
##$SI= 32768
##$SIGF1= 0
##$SIGF2= 0
##$SINO= 400
##$SIOLD= 32768
##$SREGLST= <1H.CDCl3>
##$SSB= 0
##$STSI= 32768
##$STSR= 0
##$SW_p= 5175.98343685301
##$SYMM= 0
##$S_DEV= 0
##$TDeff= 65536
##$TDoff= 0
##$TI= <Analysis number 999999
Compound Code 99
Book Reference 9
Project Code 9>
##$TILT= no
##$TM1= 0
##$TM2= 0
##$TOPLEV= 0
##$USERP1= <user>
##$USERP2= <user>
##$USERP3= <user>
##$USERP4= <user>
##$USERP5= <user>
##$WDW= 1
##$XDIM= 32768
##$YMAX_p= 520474388
##$YMIN_p= -21251
$$ End of Bruker specific parameters
$$ ---------------------------------
##NTUPLES= NMR SPECTRUM
##VAR_NAME=  FREQUENCY,     SPECTRUM/REAL,   SPECTRUM/IMAG
##SYMBOL=    X,             R,               I
##VAR_TYPE=  INDEPENDENT,   DEPENDENT,       DEPENDENT
##VAR_FORM=  AFFN,          ASDF,            ASDF
##VAR_DIM=   32768,         32768,           32768
##UNITS=     HZ,            ARBITRARY UNITS, ARBITRARY UNITS
##FACTOR=    0.157963299565203, 1,           1
##FIRST=     4132.6476996994, 0,             0
##LAST=      -1043.33573715361, 0,           0
##MIN=       -1043.33573715361, -21251,      0
##MAX=       4132.6476996994, 520474388,     0
$$ Real data points
##PAGE= N=1
##DATA TABLE= (X++(R..R)), XYDATA
$$ [...]
$$ plain form
15036 -10763 -5431 1296 -492 -1480 -3204 -5033 -3747 -7041 -13204 -14054 -16226 -13808 -6827 -1844 1494
15021 1494 6721 4881 709 2201 -652 -3703 -4604 -7927 -3174 -3312 -7687 -9024 -7598 -3909 -3657
15006 -3657 -5140 -8425 -9755 -6256 -1393 -1435 -793 1425 2758 1181 -464 -3950 -3761 -8060 -10434 -7643
14990 -7643 -6994 -3542 -5599 -7233 -10035 -10078 -11472 -9273 -10401 -13174 -14259 -12502 -9221 -8748 -15078 -16518
14974 -16518 -13544 -9488 -5908 -6642 -1616 2285 -332 -6105 -7376 -5216 -3159 -145 3107 4409 4793
14959 4793 2055 -979 -50 2010 -362 -443 -1601 -2515 3316 4481 -2045 -7088 -7748 -5163 -3068 -2575
14943 -2575 -3311 -3059 -3940 -4556 -3461 -3899 -3388 -603 -1632 -4708 -5241 464 501 -1752 -1703 -8151 -13686
14926 -13686 -14817 -10937 -10364 -11322 -11666 -7732 -5256 -4193 -8497 -7316 511 -991 -1365 177 -2113
$$ packed form
15036a0763N332O727j788r88j724j829J286l294o163q50k172K418O981M983L338
15021A494N227j840m172J492k853l051r01l323M753j38m375j337J426L689K52
15006c657j483l285j330L499M863m2O42K218J333j577j645l486J89m299k374K791
14990g643O49L452k057j634k802m3j394K199j128k773j085J757L281M73o330j440
14974a6518K974M056L580p34N026L901k617n773j271K160K057L014L252J302L84
14959D793k738l034R29K060k372q1j158r14N831J165o526n043o60K585K095M93
14943b575p36K52q81o16J095m38N11K785j029l076n33N705L7k253M9o448n535
14926a3686j131L880N73r58l44L934K476J063m304J181P827j502l74J542k290
$$ plain form
14911 -2113 -4835 -6563 -4993 -1435 -1537 -1157 -1201 -173 673 -1249 -592 -1900 -6083 -8567 -9965 -8100
14895 -8100 -7600 -7821 -5219 -4982 -10462 -9996 -3066 -4506 -8362 -7532 -4739 -6809 -8652 -7650 -7585 -6641 -10332
14878 -10332 -10023 -6308 3014 -133 -4550 -5645 -4845 -4641 -3786 -6480 -1443 1695 -2112 -6028 -3998
14863 -3998 -5144 -4341 -1433 -2953 -7303 -1110 955 -2916 -2084 -3642 -8273 -5902 -2202 -7779 -8541
14848 -8541 -5304 -3195 -2052 -5439 -5785 -3593 -2052 -1829 -4782 -4863 -7548 -7360 -4658 -3665 -9024 -8128
14832 -8128 -2978 -3207 -7099 -4253 -1139 1422 -1703 -7841 -5005 -5277 -4746 -7473 -6170 -7369 -11089
14817 -11089 -14707 -9687 -6406 -5623 -7204 -3739 -744 -5301 -3005 -2765 -1192 -2068 -5590 -9294 -9924
14802 -9924 -8773 -8336 -6404 -3873 -3167 -9574 -11362 -8781 -4886 -7179 -11350 -12877 -12439 -10025 -10255 -5852
$$ packed form
14911b113k722j728J570L558j02L80m4J028Q46j922O57j308m183k484j398J865
14895h100N00k21K602K37n480M66O930j440l856Q30K793k070j843J002O5R44l691
14878a0332L09L715R322l147m417j095Q00K04Q55k694N037L138l807l916K030
14863c998j146Q03K908j520m350O193K065l871Q32j558m631K371L700n577p62
14848h541L237K109J143l387l46K192J541K23k953q1k685J88K702R93n359Q96
14832h128N150k29l892K846L114K561l125o138K836k72N31k727J303j199l720
14817a1089l618N020L281P83j581L465K995m557K296K40J573q76l522l704o30
14802i924J151M37J932K531P06o407j788K581L895k293m171j527M38K414k30M403
$$ plain form
14786 -5852 -7915 -12366 -13221 -9811 -9517 -11759 -13173 -11648 -11235 -6979 -2827 -5406 -6244 -4984 -6717 -7145
14770 -7145 -4790 -403 39 788 3054 931 -2411 -8993 -7618 1798 6171 4500 -1369 -6842 -8114
14755 -8114 -5684 -2812 -2051 -3298 527 -1008 2307 7428 8397 3385 1680 -4953 -11320 -9626 -5953
14740 -5953 -3578 -1448 -1176 -1723 -5532 -8827 -7302 -4475 -3482 -6488 -10659 -9441 -6689 -5844 -6062 -8779
14724 -8779 -11053 -11376 -10323 -8082 -6246 -1471 2406 -2675 -4534 -6302 -2586 974 817 -3486 -1870
14709 -1870 -935 -2918 -1734 -235 -5017 -6136 -5436 -6890 -2489 -2646 -4052 -7046 -10090 -6068 -4646
14694 -4646 -3572 -181 -4167 -9168 -6941 -3215 -3448 -4162 -5140 -4126 -431 1270 -1119 241 -40 -4556
14678 -4556 -4220 -5093 961 1019 -1977 -5427 -5700 -5784 -1866 -312 4261 1031 -2651 -6221 -5754 -8938 -8731
$$ packed form
14786e852k063m451q55L410K94k242j414J525M13M256M152k579q38J260j733m28
14770g145K355M387M42P49K266k123l342o582J375R416M373j671n869n473j272
14755h114K430K872P61j247L825j535L315N121R69n012j705o633o367J694L673
14740e953K375K130K72n47l809l295J525K827R93l006m171J218K752Q45k18k717
14724h779k274l23J053K241J836M775L877n081j859j768L716L560j57m303J616
14709a870R35j983J184J499m782j119P00j454M401j57j406k994l044M022J422
14694d646J074L391l986n001K227L726k33p14r78J014L695J701k389J360k81m516
14678d556L36q73O054N8k996l450k73q4L918J554M573l230l682l570M67l184K07
$$ plain form
14661 -8731 -8062 -8986 -8203 -7754 -4788 -6262 -9155 -12185 -8903 -6920 -6334 -5337 -9197 -8618 -10774 -13771
14645 -13771 -12402 -11703 -11557 -9776 -9578 -10461 -7697 -6240 -5099 -6445 -9581 -8620 -5459 511 -866 -6016
14629 -6016 -9558 -6324 -3279 -4430 -6965 -6943 -5922 -5383 -9654 -11476 -10469 -8553 -7794 -9575 -7671 -5519
14613 -5519 -2585 -5887 -9972 -7370 -1909 -1705 -1338 -1204 -4997 -1492 -2125 -5144 -7123 -8943 -13288 -11108
14597 -11108 -6554 -3686 -2440 -1702 4347 4987 -225 -5704 -9871 -2826 -131 -1633 534 1998 1469
14582 1469 -2624 -8908 -15034 -14754 -9699 -8390 -7849 -8636 -7438 -5993 -3159 -1556 -1035 -240 314 -1354
14566 -1354 -6353 -11019 -12873 -8466 -5427 -5151 -1127 -2641 -3780 -2717 -4533 -7479 -9396 -6908 -7373
14551 -7373 -7139 -9815 -9666 -6836 -8257 -9745 -9458 -5492 -2189 705 -4214 1414 4637 -1046 -4163
$$ packed form
14661h731O69r24P83M49K966j474k893l030L282J983N86R97l860N79k156k997
14645a3771J369O99J46J781J98q83K764J457J141j346l136R61L161N970j377n150
14629f016l542L234L045j151k535K2J021N39m271j822J007J916P59j781J904K152
14613e519K934l302m085K602N461K04L67J34l793L505o33l019j979j820m345K180
14597a1108M554K868J246P38O049O40n212n479m167P045K695j502K167J464n29
14582A469m093o284o126K80N055J309N41p87J198J445K834J603N21P95N54j668
14566a354m999m666j854M407L039K76M024j514j139J063j816k946j917K488m65
14551g373K34k676J49K830j421j488K87L966L303K894m919N628L223n683l117
$$ plain form
14536 -4163 -1658 -1202 -5870 -9618 -8087 -1936 -1268 431 1004 -3283 -5774 -8240 -6662 -4312 -3858 -3197
14520 -3197 -1909 -5740 -5752 -5893 -2092 -40 806 1611 -320 -4473 -5245 -4730 -3450 -1649 -510 -4003
14504 -4003 -6672 -7314 -10436 -10538 -6135 2456 2236 -3474 -2549 896 -2252 -4589 -3779 -3156 -4442 -3113
14488 -3113 -3002 -1712 -3714 -3296 -2120 -3617 -8811 -10580 -8976 -7379 -8203 -7331 -9029 -8894 -5695 -2900
14472 -2900 -4706 -3700 -3241 -2570 -4504 -4612 -1983 227 3100 3337 -3141 -2510 -6716 -10046 -5928 -3093
14456 -3093 -4156 -3683 -3171 -4276 -4149 70 5324 5326 2581 -2812 -8724 -8124 -4379 -7335 -6476 -10741 -11666
14439 -11666 -8979 -7610 -7566 -6914 -8997 -7612 -4689 -6900 -8887 -11081 -4293 -1240 -1892 -2391 830 6312
14423 6312 5953 -1480 -913 -1821 -3526 -1446 1995 5571 2903 -5584 -10476 -5863 1353 -1046 -2903
$$ packed form
14536d163K505M56m668l748J531O151O68J699N73m287k491k466J578K350M54O61
14520c197J288l831j2j41L801K052Q46Q05j931m153p72N15J280J801J139l493
14504d003k669o42l122j02M403Q591k20n710R25L445l148k337Q10O23j286J329
14488c113J11J290k002M18J176j497n194j769J604J597q24Q72j698J35L199K795
14472b900j806J006M59O71j934j08K629K210K873K37o478O31m206l330M118K835
14456c093j063M73N12j105J27M219N254Kk745n393n912O00L745k956Q59m265r25
14439a1666K687J369M4O52k083J385K923k211j987k194O788L053o52m99L221N482
14423F312l59p433N67r08j705K080L441L576k668q487m892M613P216k399j857
$$ plain form
14408 -2903 -3393 -3958 -3296 -7480 -6949 -3782 -2850 -3891 -8344 -4959 -2496 -34 -406 -940 -1681 -395 -5012
14391 -5012 -3818 -3724 -6366 -8687 -7324 -2317 2659 -1634 -3668 -8477 -7001 -6359 -6605 -3039 -920 -1986
14375 -1986 -2501 -857 -1214 -275 2010 4397 5895 2528 -4770 -3192 -2264 -2529 -3133 -7199 -9040 -6976
14359 -6976 -3432 -4554 -3276 -4258 -4901 -4994 -4500 -3828 -6853 -7384 -8743 -11380 -5882 -1723 -6418 -6634 -969
14342 -969 1470 -701 -978 1936 4384 1667 -830 -4032 -5938 -3595 1461 -771 -3930 -712 -2163
14327 -2163 -1897 -2178 124 2126 407 -2122 -2715 -111 2851 -1082 -3812 -3323 -3302 -2819 1215 -1150
14311 -1150 -2080 -2602 -1857 -2331 2053 5594 3093 2985 6058 5066 1152 4914 3507 4504 2547 -563
14295 -563 -4676 -6479 -1512 878 -4486 -5613 -4133 -141 4008 6651 2899 653 4588 3062 -3190
$$ packed form
14408b903m90n65O62m184N31L167R32j041m453L385K463K462l72n34p41J286m617
14391e012J194R4k642k321J363N007M976m293k034m809J476O42k46L566K119j066
14375a986n15J644l57R39K285K387J498l367p298J578R28k65o04m066j841K064
14359f976L544j122J278r82o43r3M94O72l025n31j359k637N498M159m695k16N665
14342i69K439k171k77K914K448k717k497l202j906K343N056k232l159L218j451
14327b163K66k81K302K002j719k529n93K604K962l933k730M89K1M83M034k365
14311a150r30n22P45m74M384L541k501j08L073r92l914L762j407R97j957l110
14295e63m113j803M967K390n364j127J480L992M149K643l752k246L935j526o252
$$ plain form
14280 -3190 -1855 -2183 -2242 -523 1224 3117 4489 7405 7067 1089 -4477 -2508 -414 -2539 -7198 -7199
14264 -7199 -5352 -2628 -538 969 1327 -5941 -8812 -5933 -4649 -2506 -1741 -1860 -216 -1361 -2187 -3717
14248 -3717 -3430 -4097 -7142 -10658 -6137 -1955 -4295 -888 3320 1442 -2910 180 -282 1995 -425
14233 -425 -7839 -11633 -6492 -4278 -327 1980 3202 4038 1626 1174 5224 6858 3812 -1167 1224
14218 1224 5555 10252 8085 7991 5176 3364 4525 3946 4601 3964 4921 6416 8885 5396 7296 13534
14202 13534 8476 10775 12545 6065 2319 3558 8024 7058 5969 6262 3627 1342 2131 -2502 -4814
14187 -4814 -3049 -3961 505 1985 -644 2634 1620 4857 5231 2511 741 6697 8590 13914 10711
14172 10711 3059 -1026 -1718 2980 2451 -1682 1888 3530 6533 10706 6983 2160 -1880 -2090 -1303
$$ packed form
14280c190J335l28n9J719J747J893J372K916l38n978n566J969K094k125m659j
14264g199J847K724K090J507L58p268k871K879J284K143P65j19J644j145q26j530
14248c717K87o67l045l516M521M182k340L407M208j878m352L090m62K277k420
14233d25p414l794N141K214L951K307J222Q36k412m52M050J634l046m979K391
14218A224M331M697k167r4k815j812J161n79O55o37R57J495K469l489J900O238
14202A3534n058K299J770o480l746J239M466r66j089K93k635k285P89m633k312
14187d814J765r12M466J480k629L278j014L237L74k720j770N956J893N324l203
14172A0711p652m085o92M698n29m133L570J642L003M173l723m823m040k10P87
$$ plain form
14157 -1303 -1503 1538 3141 3240 6222 9552 7581 8533 11052 7835 3045 3823 4212 7277 11013 9405
14141 9405 6526 7298 6147 6684 6599 3686 1440 2957 4819 4866 4157 1530 6520 9401 9130 13714 16369
14124 16369 14950 11336 10730 12649 8205 6102 3592 5982 8805 9226 3109 -4023 3493 4092 11465
14109 11465 10557 10397 10223 11487 13800 11480 8671 8956 11490 12679 12726 14158 13564 4748 4384 6638
14093 6638 1844 5001 10027 9982 11856 16605 19949 17484 7344 6580 9531 10151 8880 10395 11261 8946
14077 8946 10070 12715 12678 11254 11209 7620 7101 6442 3428 3293 4260 5256 10013 7188 1165 3333 6699
14060 6699 2648 6050 13716 13456 9102 2191 1409 3724 9038 5354 2117 2163 2192 4752 6753 6365
14044 6365 8671 7479 7385 5799 2381 2565 5455 7245 5001 5577 8060 5681 6682 4529 3107 6011
$$ packed form
14157a303k00L041J603R9K982L330j971R52K519l217m790P78L89L065L736j608
14141I405k879P72j151N37q5k913k246J517J862M7p09k627M990K881k71M584K655
14124A6369j419l614o06J919m444k103k510K390K823M21o117p132P516N99P373
14109A1465r08j60j74J264K313k320k809K85K534J189M7J432n94q816l64K254
14093F638m794L157N026m5J874M749L344k465j0140p64K951O20j271J515Q66k315
14077H946J124K645l7j424m5l589n19o59l014j35R67R96M757k825o023K168L366
14060F699m051L402P666k60m354o911p82K315N314l684l237M6K9K560K001l88
14044F365K306j192r4j586l418J84K890J790k244N76K483k379J001k153j422K904
$$ plain form
14028 6011 4721 10716 10641 5032 242 1313 5274 4663 3066 2779 -2762 -4991 -2864 -3393 4982 10746
14012 10746 12603 10345 7510 7514 6017 4804 4537 3371 -360 548 314 4335 9773 6287 -678 909
13996 909 5067 9088 15456 17046 15528 15851 13918 16068 16180 13620 10875 10682 14705 15321 11027 6399
13980 6399 4144 4009 4251 4194 5196 3211 2232 92 3006 10698 16682 15648 12486 13174 6963 2934
13964 2934 7783 9389 9426 7282 6318 5880 8289 10048 15372 13645 12775 15095 18873 18569 17934 11285
13948 11285 9996 13735 17021 15500 8889 8077 5997 5313 4452 7452 12026 6324 4693 8564 7192
13933 7192 10507 16103 18267 21758 22790 24492 30337 32482 42928 52061 54695 67863 83391 99011
13919 99011 120260 139164 159802 175696 182547 185320 174973 150069 124462 98624 76371 56857
$$ packed form
14028F011j290N995p5n609m790J071L961o11j597k87n541k229K127n29Q375N764
14012A0746J857k258k835Mj497j213k67j166l731R08k34M021N438l486o965J587
13996I09M158M021O368J590j518L23j933K150J12k560k745j93M023O16m294m628
13980F399k255j35K42n7J002j985r79k140K914P692N984j034l162O88o211m029
13964B934M849J606L7k144r64m38K409J759N324j727q70K320L778l04o35o649
13948A1285j289L739L286j521o611q12k080o84q61L000M574n702j631L871j372
13933G192L315N596K164L491J032J702N845K145J0446R133K634J3168J5528J5620
13919I9011K1249J8904K0638J5894O851K773j0347k4904k5607k5838k2253j9514
$$ plain form
13907 56857 43037 36564 31185 25069 24953 26388 24823 22760 20240 19521 19497 21173 20725 16620 15577
13892 15577 12264 11363 13036 14654 15592 19082 16457 14930 19419 21338 16784 16631 14222 10863 10899 11339
13876 11339 14349 14811 12377 11247 12303 10146 5535 8080 8720 5882 7668 13800 15686 16613 14547
13861 14547 14564 13302 9785 10099 7834 7139 7393 11086 9270 9052 10583 10909 11589 10075 7657 6948 3119
13844 3119 5628 6544 2420 2423 4651 2618 3201 2226 -163 3056 8959 15819 17512 17544 15264 13665 13269
13827 13269 14683 10534 9827 12350 10424 8079 7011 4312 5757 12661 10488 5319 5831 8061 5691
13812 5691 4636 5822 5871 636 -1851 3955 5373 9571 7682 4319 6060 5022 5066 5951 8243 11469
13796 11469 10086 13561 13397 7355 11861 15386 15469 15651 15704 6186 4942 7283 7601 5344 9667 11719
$$ packed form
13907E6857j3820o473n379o116j16J435j565k063k520p19k4J676m48m105j043
13892A5577l313r01J673J618R38L490k625j527M489J919m554j53k409l359L6M40
13876A1339L010M62k434j130J056k157m611K545O40k838J786O132J886R27k066
13861A4547J7j262l517L14k265o95K54L693j816k18J531L26O80j514k418p09l829
13844C119K509R16m124LK228k033N83r75k389L219N903O860J693L2k280j599l96
13827A3269J414m149p07K523j926k345j068k699J445O904k173n169N12K230k370
13812E691j055J186M9n235k487N806J418M198j889l363J741j038M4Q85K292L226
13796A1469j383L475j64o042M506L525Q3J82N3r518j244K341L18k257M323K052
$$ plain form
13780 11719 10381 9931 10738 9465 7950 8741 8637 8143 6652 8823 9849 12746 11812 13070 9155 12381
13764 12381 9828 8984 7417 11631 17125 12606 14635 16997 19681 18801 22094 22961 18486 10292 6660
13749 6660 7979 6834 7469 8973 4906 4053 4529 6459 9959 14963 17513 18013 14374 13081 15994 13045
13733 13045 12804 11412 10920 9488 11190 10313 6113 8338 10595 11097 15250 16633 16897 12918 11383 16221
13717 16221 18080 20667 15611 15052 18300 15413 18028 22311 26551 26234 26948 24516 19479 21176 19483
13702 19483 20981 27020 27300 21818 20906 16143 8685 12531 18084 19318 20053 20022 19890 16533 15812 18725
13686 18725 17731 19237 20452 16884 11729 14982 16532 14135 16586 16543 18629 21495 22193 28191 34317
13671 34317 30108 25731 25854 26162 27020 30351 29819 24494 23857 26856 25034 24131 23041 20981 24188 23629
$$ packed form
13780A1719j338m50Q07j273j515P91j04m94j491K171J026K897r34J258l915L226
13764A2381k553q44j567M214N494m519K029K362K684q80L293Q67m475q194l632
13749F660J319j145O35J504m067q53M76J930L500N004K550N00l639j293K913k949
13733A3045k41j392m92j432J702q77m200K225K257N02M153J383K64l979j535M838
13717A6221J859K587n056n59L248k887K615M283M240l17P14k432n037J697j693
13702A9483J498O039K80n482r12m763p458L846N553J234P35l1j32l357p21K913
13686A8725r94J506J215l568n155L253J550k397K451m3K086K866O98N998O126
13671C4317m209m377J23L08Q58L331n32n325o37K999j822r03j090k060L207n59
$$ plain form
13655 23629 21896 22918 28450 30347 26769 17467 12714 17088 16848 13835 17978 20555 25584 24852 21312
13640 21312 18534 18676 16247 17341 23167 24218 23875 27325 30512 33235 31145 28904 30555 26979 26894
13625 26894 26845 22321 22064 23357 18760 19413 20680 19800 23307 25046 24643 26675 26484 33280 37010 37838
13609 37838 38315 39005 40846 42884 43634 42267 46893 50018 44845 41235 40550 43660 50111 51126 45853
13594 45853 37187 38253 38091 35369 38220 36228 33318 36540 40212 45281 45440 46065 51775 53779 54974
13579 54974 51509 47637 48304 52833 50817 47650 48789 54583 63101 64729 61588 60165 57435 57736 59436
13564 59436 54734 51728 55610 59561 63376 60702 64715 65718 67293 66381 71899 72132 74834 72522 69109
13549 69109 71720 75239 73399 75538 77819 77644 76411 80221 82094 81064 80970 84184 80274 77091 75579
$$ packed form
13655B3629j733J022N532J897l578r302m753M374k40l013M143K577N029p32l540
13640B1312k778J42k429J094N826J051l43L450L187K723k090k241J651l576q5
13625B6894m9m524k57J293m597O53J267q80L507J739m03K032j91O796L730Q28
13609C7838M77O90J841K038P50j367M626L125n173l610o85L110O451J015n273
13594D5853q666J066j62k722K851j992k910L222L672N069J59O25N710K004J195
13579E4974l465l872O67M529k016l167J139N794Q518J628l141j423k730L01J700
13564E9436m702l006L882L951L815k674M013J003J575r12N518K33K702k312l413
13549F9109K611L519j840K139K281j75j233L810J873j030r4L214l910l183j512
$$ plain form
13534 75579 77640 82257 82003 76490 78175 84814 90323 95682 92487 90295 87386 87622 91536 89699 88446
13519 88446 87291 87333 87443 87593 89085 90372 93138 95322 98009 102479 102199 97564 97854 95642 95309 98028
13503 98028 96532 94172 91369 94403 95970 96122 95409 96190 96242 94974 99464 104101 103950 102453 99974 97563
13487 97563 97086 98240 97230 99924 103642 106226 99990 90917 92496 94519 99453 107012 109398 105920 103892
13472 103892 107925 105819 102976 104487 110651 118926 119343 124283 123469 118537 120749 117683 116039 114816 117008
13457 117008 119224 124825 120856 119168 114427 110214 111310 118632 116735 117027 119572 118444 115958 113980
13443 113980 114713 117568 120883 126087 126956 124046 123496 123029 119704 123586 122782 124799 125859 124983 124978 127397
13427 127397 122625 118862 118106 120838 124159 125287 123581 128012 131367 131821 129301 128477 128887 125697 128238
$$ packed form
13534G5579K061M617k54n513J685O639N509N359l195k192k909K36L914j837j253
13519H8446j155M2J10J50J492J287K766K184K687M470k80m635K90k212l33K719
13503I8028j496k360k803L034J567J52p13P81N2j268M490M637j51j497k479k411
13487I7563m77J154j010K694L718K584o236r073J579K023M934P559K386l478k028
13472A03892M033k106k843J511O164Q275M17M940q14m932K212l066j644j223K192
13457A17008K216N601l969j688m741m213J096P322j897K92K545j128k486j978
13443A13980P33K855L315N204Q69k910n50m67l325L882q04K017J060q76nK419
13427A27397m772l763p56K732L321J128j706M431L355M54k520q24M10l190K541
$$ plain form
13412 128238 133831 132034 128627 120329 116198 122075 128711 130839 131855 130801 130021 133333 133682 130068 129512
13397 129512 131360 132151 134813 129331 128640 130208 132945 137631 139697 142637 142729 140923 143439 147326 143682
13382 143682 138976 138423 138719 140776 144166 138950 134543 134626 137429 142998 147532 150110 151429 146131 145245
13367 145245 152038 160703 157986 155877 152277 152868 155412 160098 162205 166584 168248 167657 161444 156868 158439
13352 158439 158614 160085 159220 163569 166814 164475 168770 173926 174064 174378 174735 179237 186009 188639 185856
13337 185856 186709 191033 193154 193332 194291 191050 195376 198607 199802 202063 203799 203558 201286 203290 200994
13322 200994 202453 203538 206786 214369 221618 221782 220441 223720 225702 226098 229027 232947 233665 232894 234904
13307 234904 240597 242499 245043 247421 246794 245521 250104 256526 260683 261126 266632 272125 275724 276502 275365
$$ packed form
13412A28238N593j797l407q298m131N877O636K128J016j054p80L312L49l614n56
13397A29512J848P91K662n482o91J568K737M686K066K940R2j806K516L887l644
13382A43682m706n53K96K057L390n216m407Q3K803N569M534K578J319n298q86
13367A45245O793Q665k717k109l600N91K544M686K107M379J664n91o213m576J571
13352A58439J75J471q65M349L245k339M295N156J38L14L57M502O772K630k783
13337A85856Q53M324K121J78R59l241M326L231J195K261J736k41k272K004k296
13322B00994J459J085L248P583P249J64j341L279J982L96K929L920P18p71K010
13307B34904N693J902K544K378o27j273M583O422M157M43N506N493L599P78j137
$$ plain form
13292 275365 274772 278922 280116 283800 289576 292725 295215 294924 294597 298085 306037 314671 310906 311477 320259
13277 320259 325378 328009 326851 331175 337524 340178 342137 347625 352147 358799 368755 372764 378232 379488
13263 379488 383345 383564 386020 389510 392913 399594 408755 414767 420474 425522 432344 431450 429891 433378 445278
13248 445278 448793 452069 463923 471746 477028 483625 492530 497352 505127 510151 514719 520237 521175 529425
13234 529425 533620 540559 551855 563505 568549 573734 585582 597465 600062 606868 615980 632591 643507
13221 643507 650875 653675 663336 674297 681052 692230 705324 707467 714260 725482 742202 758516 775414
13208 775414 786517 794002 800862 812180 821857 840901 854355 869911 887589 905217 921171 933239
13196 933239 948181 967882 987319 1004700 1018544 1030920 1044349 1062712 1085766 1109749 1130363
$$ packed form
13292B75365n93M150J194L684N776L149K490k91l27L488P952Q634l765N71Q782
13277C20259N119K631j158M324O349K654J959N488M522O652R956M009N468J256
13263C79488L857K19K456L490L403O681R161O012N707N048O822q94j559L487J1900
13248D45278L515L276J1854P823N282O597Q905M822P775N024M568N518R38Q250
13234E29425M195O939J1296J1650N044N185J1848J1883K597O806R112J6611J0916
13221F43507P368K800R661J0961O755J1178J3094K143O793J1222J6720J6314J6898
13208G75414J1103P485O860J1318R677J9044J3454J5556J7678J7628J5954J2068
13196I33239J4942J9701J9437J7381J3844J2376J3429J8363K3054K3983K0614
$$ plain form
13185 1130363 1149039 1168815 1188107 1206458 1231955 1256406 1278090 1304157 1336678 1362476 1391597
13174 1391597 1419103 1449654 1480715 1511166 1543589 1573780 1607835 1642423 1677257 1715097 1749153
13163 1749153 1788616 1829793 1867466 1910574 1956359 2000481 2048791 2093407 2142397 2198833 2251465
13152 2251465 2305038 2361260 2415149 2468139 2524670 2595425 2661278 2729986 2803256 2872216 2946867
13141 2946867 3026429 3104053 3186332 3267582 3347676 3433561 3520208 3614075 3709746 3806943 3904894
13130 3904894 4005775 4107469 4207779 4313442 4428443 4541152 4651074 4766897 4881983
13121 4881983 4993072 5104029 5219551 5335591 5451924 5576259 5700899 5820769 5938224
13112 5938224 6058276 6177814 6297915 6415060 6525717 6636938 6745837 6854931 6963030
$$ packed form
13185A130363J8676J9776J9292J8351K5497K4451K1684K6067L2521K5798K9121
13174A391597K7506L0551L1061L0451L2423L0191L4055L4588L4834L7840L4056
13163A749153L9463M1177L7673M3108M5785M4122M8310M4616M8990N6436N2632
13152B251465N3573N6222N3889N2990N6531P0755O5853O8708P3270O8960P4651
13141B946867P9562P7624Q2279Q1250Q0094Q5885Q6647R3867R5671R7197R7951
13130C904894J00881J01694J00310J05663J15001J12709J09922J15823J15086
13121D881983J11089J10957J15522J16040J16333J24335J24640J19870J17455
13112E938224J20052J19538J20101J17145J10657J11221J08899J09094J08099
$$ plain form
13103 6963030 7064561 7165633 7271492 7373334 7466551 7552394 7642194 7729637 7813635 7891821
13093 7891821 7966649 8043049 8112367 8170731 8225281 8279446 8330804 8383848 8429978 8472968 8509914
13082 8509914 8535219 8561164 8587423 8607542 8627119 8640255 8650429 8661577 8667415 8670141 8668497 8664040
13070 8664040 8659139 8656668 8644137 8627245 8613133 8599330 8578183 8561669 8548787 8528779 8512566 8499250
13058 8499250 8485527 8467474 8452971 8440772 8430876 8417912 8404792 8393971 8384663 8380941 8384971 8393354
13046 8393354 8397458 8405075 8412659 8422014 8437292 8454095 8474204 8501464 8530038 8560787 8585389 8612681
13034 8612681 8642987 8681262 8716537 8751344 8792533 8834297 8868526 8901652 8934263 8976893 9012752
13023 9012752 9043799 9079462 9113397 9145735 9175976 9203869 9233632 9260496 9280050 9298814 9313192
$$ packed form
13103F963030J01531J01072J05859J01842R3217Q5843Q9800Q7443Q3998P8186
13093G891821P4828P6400O9318N8364N4550N4165N1358N3044M6130M2990L6946
13082H509914K5305K5945K6259K0119J9577J3136J0174J1148N838K726j644m457
13070H664040m901k471j2531j6892j4112j3803k1147j6514j2882k0008j6213j3316
13058H499250j3723j8053j4503j2199r896j2964j3120j0821r308l722M030Q383
13046H393354M104P617P584R355J5278J6803K0109K7260K8574L0749K4602K7292
13034H612681L0306L8275L5275L4807M1189M1764L4229L3126L2611M2630L5859
13023I012752L1047L5663L3935L2338L0241K7893K9763K6864J9554J8764J4378
$$ plain form
13012 9313192 9324416 9335725 9344928 9348836 9353345 9354331 9344535 9334484 9320614 9297606 9275908 9245649
13000 9245649 9212594 9176151 9139635 9095968 9041053 8987304 8931338 8871405 8806459 8734313 8660635
12989 8660635 8581837 8503578 8414062 8325499 8238741 8147671 8050531 7945932 7845172 7736551 7624517
12978 7624517 7518045 7405761 7289908 7173854 7059052 6944866 6830512 6712526 6589928
12969 6589928 6466141 6346150 6226078 6103478 5993783 5883009 5767396 5648487 5528783
12960 5528783 5420027 5308348 5197134 5086784 4979612 4876587 4776015 4677304 4572628 4470815
12950 4470815 4375489 4283794 4189613 4097707 4008607 3919864 3834709 3749170 3665180 3586626 3507599
12939 3507599 3431155 3354889 3278283 3205402 3134231 3064416 2996300 2932867 2868888 2807391 2747548
$$ packed form
13012I313192J1224J1309R203L908M509R86r796j0051j3870k3008k1698l0259
13000I245649l3055l6443l6516m3667n4915n3749n5966n9933o4946p2146p3678
12989H660635p8798p8259q9516q8563q6758r1070r7140j04599j00760j08621j12034
12978G624517j06472j12284j15853j16054j14802j14186j14354j17986j22598
12969F589928j23787j19991j20072j22600j09695j10774j15613j18909j19704
12960E528783j08756j11679j11214j10350j07172j03025j00572r8711j04676j01813
12950D470815r5326r1695r4181r1906q9100q8743q5155q5539q3990p8554p9027
12939C507599p6444p6266p6606p2881p1171o9815o8116o3433o3979o1497n9843
$$ plain form
12928 2747548 2686445 2629424 2573928 2520545 2466379 2415554 2362174 2305958 2255146 2205510 2156607
12917 2156607 2112621 2072127 2030571 1990450 1945839 1898458 1861103 1828776 1792495 1756866 1718545
12906 1718545 1684813 1652604 1622850 1590262 1559467 1526117 1494863 1468079 1438293 1411340 1390260
12895 1390260 1363587 1332526 1304569 1278850 1257329 1231142 1204788 1188120 1165942 1143548 1121335
12884 1121335 1104228 1088191 1074119 1059221 1036994 1018292 997424 981873 970518 953938 936674
12873 936674 920633 904438 888105 869167 855802 848091 832431 820295 807911 793029 783331 771143
12861 771143 759639 750741 744025 734186 723166 707384 696802 687049 670975 655149 648480 642681 630422
12848 630422 620611 618716 612558 607658 598651 580262 568070 564175 561569 552888 542926 536427 527345 518697
$$ packed form
12928B747548o1103n7021n5496n3383n4166n0825n3380n6216n0812m9636m8903
12917B156607m3986m0494m1556m0121m4611m7381l7355l2327l6281l5629l8321
12906A718545l3732l2209k9754l2588l0795l3350l1254k6784k9786k6953k1080
12895A390260k6673l1061k7957k5719k1521k6187k6354j6668k2178k2394k2213
12884A121335j7107j6037j4072j4898k2227j8702k0868j5551j1355j6580j7264
12873I36674j6041j6195j6333j8938j3365p711j5660j2136j2384j4882r698j2188
12861G71143j1504q898o716r839j1020j5782j0582r753j6074j5826o669n799j2259
12848F30422r811j895o158m900r007j8389j2192l895k606q681r962o499r082q648
$$ plain form
12834 518697 515645 511169 507184 502814 489672 476089 470683 473898 470008 460904 451029 449675 447537 441918
12820 441918 433774 429332 428799 419800 415864 411445 404230 397041 396811 399817 394237 389530 385353 372250
12806 372250 361331 354339 351758 348142 347413 344156 343029 344646 336610 329269 322742 322007 322831 321609 319606
12791 319606 311279 303629 302301 295259 292567 293124 286552 280930 278221 281562 276468 276655 276470 271489 266818
12776 266818 261839 258375 261289 262476 261266 259550 255656 244808 237730 241306 242984 244151 242833 236437
12762 236437 235826 231475 223456 219819 218736 219592 220253 219009 216159 213331 208719 204949 204266 201211 200400
12747 200400 197499 195914 192183 189012 186951 187791 188284 185655 181405 178990 178686 180964 183227 181557 174895
12732 174895 171727 164453 165334 166459 162672 157603 156130 158611 155066 154602 155913 155399 158090 160202 156646
$$ packed form
12834E18697l052m476l985m370j3142j3583n406L215l890r104r875j354k138n619
12820D41918q144m442n33q999l936m419p215p189k30L006n580m707m177j3103
12806C72250j0919o992k581l616p29l257j127J617q036p341o527p35Q24j222k003
12791C19606q327p650j328p042k692N57o572n622k709L341n094J87j85m981m671
12776B66818m979l464K914J187j210j716l894j0848p078L576J678J167j318o396
12762B36437o11m351q019l637j083Q56O61j244k850k828m612l770o83l055q11
12747B00400k901j585l731l171k061Q40M93k629m250k415l04K278K263j670o662
12732A74895l168p274Q81J125l787n069j473K481l545m64J311n14K691K112l556
$$ plain form
12717 156646 151139 147825 147799 147129 147121 144354 142359 142120 138747 135770 133022 134619 138837 139624 140265 139987 136303
12700 136303 133144 130491 129826 133190 130094 131024 127170 121290 118363 120069 123861 123244 120499 123955 126436
12685 126436 128900 124821 120066 119264 122250 120801 121089 120786 124445 122160 116666 115787 120290 120532 122226
12670 122226 127320 128228 123250 114144 113777 117932 121402 119853 117654 115641 113522 116549 122705 129717 131417
12655 131417 128977 128934 124047 123724 124475 124695 121861 116131 118165 117904 116532 114014 112597 109527 112968 117806
12639 117806 118572 115215 115692 119067 117751 116338 113155 106845 104519 108026 113694 120333 124309 120208 119379
12624 119379 114611 112388 107062 106836 112371 111314 112662 112825 109997 113627 116134 116768 112420 113492 114619
12609 114619 115928 111244 113481 115177 113842 108651 107364 105337 106786 104267 100940 106159 109469 107919
$$ packed form
12717A56646n507l314k6o70qk767j995k39l373k977k748J597M218P87O41k78l684
12700A36303l159k653o65L364l096R30l854n880k927J706L792o17k745L456K481
12685A26436K464m079m755q02K986j449K88l03L659k285n494q79M503K42J694
12670A22226N094R08m978r106l67M155L470j549k199k013k119L027O156P012J700
12655A31417k440m3m887l23P51K20k834n730K034k61j372k518j417l070L441M838
12639A17806P66l357M77L375j316j413l183o310k326L507N668O639L976m101q29
12624A19379m768k223n326k26N535j057J348J63k828L630K507O34m348J072J127
12609A14619J309m684K237J696j335n191j287k027J449k519l327N219L310j550
$$ plain form
12595 107919 105458 99829 99952 97436 96227 96049 96611 96493 94024 94592 93533 95835 100234 96973 95418
12580 95418 95025 96567 95164 93832 95508 101639 109862 112643 107089 107044 108882 107500 105739 99110 94972
12565 94972 94495 93870 91990 90844 89747 87807 88730 92401 93439 92303 92418 90832 91532 89985 89350 89812
12549 89812 89433 87996 89703 85001 84126 83956 80983 79235 81130 81920 77885 79251 79674 76711 81382 82551
12533 82551 81102 81708 83159 86061 88571 85060 84654 84459 80781 77352 78451 83950 84284 81288 81935 82576
12517 82576 79621 74958 76784 80947 87177 93114 93423 97212 99954 95798 84284 78105 73512 68143
12503 68143 65510 60422 54133 48318 47315 45074 52442 54609 54906 56561 55126 56362 55051 49640 47572
12488 47572 47165 41500 35906 36650 40285 40544 39474 37104 35476 35167 33833 30538 33728 34381 37183 38744
$$ packed form
12595A07919k461n629J23k516j209j78N62j18k469N68j059K302M399l261j555
12580I5418l93J542j403j332J676O131Q223K781n554m5J838j382j761o629m138
12565I4972m77o25j880j146j097j940R23L671J038j136J15j586P00j547o35M62
12549H9812l79j437J707m702q75j70k973j748J895P90m035J366M23k963M671J169
12533H2551j449O06J451K902K510l511m06j95l678l429J099N499L34k996O47O41
12517H2576k955m663J826M163O230N937L09L789K742m156j1514o179m593n369
12503F8143k633n088o289n815j003k241P368K167K97J655j435J236j311n411k068
12488D7572m07n665n594P44L635K59j070k370j628l09j334l295L190O53K802J561
$$ plain form
12472 38744 36681 35285 37672 36814 34448 30168 28369 24897 25946 29174 28523 29628 31822 31863 26561
12457 26561 21845 17673 15451 17648 22159 21489 18899 18698 19687 23528 24625 22400 19054 17206 13984
12442 13984 9088 9706 12515 13743 12355 18681 16665 11682 11163 13237 19317 21319 21977 22611 21344
12427 21344 17312 20063 26465 23855 17599 12517 14790 15260 11401 13067 12461 12051 12230 12165 12132 11428 12279
12410 12279 13115 12284 12522 12473 7515 1613 1942 4836 8067 8800 8503 7611 9616 12743 11364 8893 9341
12393 9341 10741 14353 14698 13716 14313 18540 18100 12804 12418 13085 12379 13065 13329 14544 16019 16268 12857
12376 12857 6647 1773 4460 9579 13586 16731 18804 20835 17058 13933 18821 21646 14813 9669
12362 9669 9838 9667 6652 5195 14731 16114 10800 10535 13325 14374 16976 17763 20258 23435 26402 28669
$$ packed form
12472C8744k063j396K387q58k366m280j799l472J049L228o51J105K194M1n302
12457B6561m716m172k222K197M511o70k590k01R89L841J097k225l346j848l222
12442A3984m896O18K809J228j388O326k016m983n19K074O080K002O58O34j267
12427B1344m032K751O402k610o256n082K273M70l859J666o06m10J79o5l3p04Q51
12410A2279Q36q31K38m9m958n902L29K894L231P33k97q92K005L127j379k471M48
12393I341J400L612L45r82N97M227m40n296l86O67p06O86K64J215J475K49l411
12376A2857o210m874K687N119M007L145K073K031l777l125M888K825o833n144
12362I669J69j71l015j457R536J383n314k65K790J049K602P87K495L177K967K267
$$ plain form
12346 28669 26334 24827 21526 20800 16115 17860 14209 10821 10127 9183 7499 7492 9966 10052 5819 9790
12330 9790 13965 10389 3310 2854 10980 15369 16705 22029 19793 15652 12817 8926 7045 7124 6022
12315 6022 8606 13009 14053 13005 10909 5992 3486 9211 11266 9122 2646 5276 10607 9562 4108
12300 4108 -1130 780 2329 -982 -3138 -2554 2156 7018 2124 -1451 -5338 -5931 -3482 -1077 -2324
12285 -2324 -1172 -1085 2775 4545 7246 12120 11749 7995 4412 5566 4162 2890 7125 7286 5418 3129
12269 3129 5021 9386 7130 1487 2544 5942 8641 13417 11830 8000 5766 6240 173 1047 1258
12254 1258 2783 1641 -4098 41 3670 3935 5235 5758 6712 8070 7116 6625 9679 7662 10121 12432
12238 12432 10004 9527 7247 7000 10301 10935 10261 8236 7304 10428 9801 7589 5983 6410 5384 7844
$$ packed form
12346B8669k335j507l301p26m685J745l651l388o94r44j684pK474Q6m233L971
12330I790M175l576p079m56Q126M389J336N324k236m141k835l891j881P9j102
12315F022K584M403J044j048k096m917k506N725K055k144o476K630N331j045n454
12300D108n238J910J549l311k156N84M710M862m894l575l887n93K449K405j247
12285b324J152Q7L860J770K701M874l71l754l583J154j404j272M235J61j868k289
12269C129J892M365k256n643J057L398K699M776j587l830k234M74o067Q74K11
12254A258J525j142n739M139L629K65J300N23R54J358r54m91L054k017K459K311
12238A2432k428m77k280k47L301O34o74k025r32L124o27k212j606M27j026K460
$$ plain form
12222 7844 10238 9659 4256 387 -2675 -4396 -5172 -6706 -7213 -7217 -3737 -1646 -3842 -5665 -8162 -4648
12206 -4648 -2702 -3365 174 4508 2000 -430 -5359 -4586 -1334 -1159 -264 1019 -5228 -7514 -4804 -3863
12190 -3863 -3032 -2994 -707 2732 -794 55 2318 4361 3549 5212 4906 1139 2142 2204 -942 -6074 -832
12173 -832 5930 9984 8409 1510 -704 -176 1015 1406 64 -3554 -10168 -10679 -5215 -4441 -6524 -4615
12157 -4615 -1822 -2334 -326 -236 1401 758 -25 -3643 -9313 -11285 -11162 -9180 -6357 -4526 -5262 -5433 -5897
12140 -5897 -7218 -7689 -463 -1623 -3194 -3844 -3524 -3635 -3945 -3131 -7654 -9835 -8164 -9824 -9239 -7546
12124 -7546 -5786 -1560 2292 2327 5747 7192 5101 4455 4983 2008 369 -472 -1157 -1610 -2853 -7722
12108 -7722 -9156 -2706 399 133 1627 -1305 97 -1940 -1706 -4544 -9489 -3317 -2384 -5323 -5665 -6241
$$ packed form
12222G844K394n79n403l869l062j721p76j534n07mL480K091k196j823k497L514
12206d648J946o63L539M334k508k430m929P73L252J75Q95J283o247k286K710R41
12190c863Q31L8K287L439l526Q49K263K043q12J663l06l767J003O2l146n132N242
12173h32O762M054j575o899k214N28J191L91j342l618o614n11N464P74k083J909
12157d615K793n12K008R0J637o43p83l618n670j972J23J982K823J831p36j71m64
12140e897j321m71P226j160j571o50L20j11l10Q14m523k181J671j660N85J693
12124g546J760M226L852L5L420J445k091o46N28k975j639q41o85m53j243m869
12108g722j434O450L105k66J494k932J402k037K34k838m945O172R33k939l42n76
$$ plain form
12092 -6241 -6305 -7921 -6452 -6767 -9550 -4917 -4270 -6479 -12143 -13292 -8009 -8258 -6646 -8555 -7036 -5315
12076 -5315 -3976 -3639 -4832 -4396 -3740 -3047 -8360 -7974 -7484 -5506 -4733 -247 3418 6214 10550 2016
12060 2016 -4885 -4249 733 449 -2696 -1315 -3789 -4118 119 5744 4756 1488 -1149 -317 -2475 -7491
12044 -7491 -4054 -509 4955 3478 1662 878 -1950 -2733 -2134 -3542 -4272 -5332 339 4208 -57 -6999
12028 -6999 -7251 -5391 -8760 -8595 -7403 -7687 -9520 -12071 -10720 -4499 -3124 -4721 -5862 -3575 -2434
12013 -2434 -4153 -1841 2392 63 -869 -4452 -2104 -2300 -4271 -2716 -3592 -3241 -1383 946 2218 1074
11997 1074 -1107 -258 -1597 3304 5732 3245 -3410 -1705 1340 979 -6656 -5913 -4783 -8568 -13021
11982 -13021 -15703 -14030 -9433 -9595 -3813 1908 262 188 3326 1461 -6665 -9633 -14233 -12052 -7605
$$ packed form
12092f241o4j616J469l15k783M633O47k209n664j149N283k49J612j909J519J721
12076e315J339L37j193M36O56O93n313L86M90J978P73M486L665K796M336q534
12060B016o901O36M982k84l145J381k474l29M237N625r88l268k637Q32k158n016
12044g491L437L545N464j477j816p84k828p83N99j408p30j060N671L869m265o942
12028f999k52J860l369J65J192k84j833k551J351O221J375j597j141K287J141
12013b434j719K312M233k329r32l583K348j96j971J555q76L51J858K329J272j144
11997A074k181Q49j339M901K428k487o655J705L045l61p635P43J130l785m453
11982a3021k682J673M597j62N782N721j646p4L138j865q126k968m600K181M447
$$ plain form
11967 -7605 -3621 -4419 -7119 -4581 -119 438 -1550 -2793 -3113 -3809 195 6292 8078 12068 13811 19736
11951 19736 22705 22530 20600 18999 14128 10223 8621 6190 4956 4013 -1545 -2183 1219 4149 315
11936 315 -5494 -3694 -2806 -2131 -3132 -534 2449 5758 1071 -1351 -1203 -3796 -6417 -8713 -5624 228
11920 228 2094 6900 7162 4415 5242 4681 1094 -310 259 1394 -369 813 -374 -1342 2479 3623
11904 3623 539 -4887 -9693 -4859 368 1494 5061 9113 10854 5848 1992 6764 8840 11665 9615
11889 9615 7571 1880 7351 10590 10119 7102 275 -6071 -6112 -2306 -8532 -8231 -9703 -11712 -11839 -5763
11873 -5763 273 3119 -452 -2650 -3120 -3169 51 496 -1364 5250 4798 -1989 -3874 -7274 -5450 985
11857 985 2295 4251 1748 -1236 -3248 -10098 -9077 -8325 -11261 -11496 -10847 -6554 150 -527 -1835 -1920
$$ packed form
11967g605L984p98k700K538M462N57j988j243l20o96M004O097J786L990J743N925
11951A9736K969j75j930j601m871l905j602k431j234r43n558o38L402K930l834
11936C15n809J800Q88O75j001K598K983L309m687k422J48k593k621k296L089N852
11920B28J866M806K62k747Q27n61l587j404N69J135j763J182j187r68L821J144
11904C623l084n426m806M834N227J126L567M052J741n006l856M772K076K825k050
11889I615k044n691N471L239m71l017o827o346m1L806o226L01j472k009j27O076
11873e763O036K846l571k198m70m9L220M45j860O614m52o787j885l400J824O435
11857I85J310J956k503k984k012o850J021P52k936k35O49M293O704o77j308q5
$$ plain form
11841 -1920 -2127 -3206 1284 2939 2239 968 411 388 1429 1982 4815 4106 1652 2226 2282 517 -4696
11824 -4696 -3294 4184 5527 5509 873 -2106 2203 2815 5768 3949 2225 5222 8053 6484 3509
11809 3509 7955 7777 6003 3552 1130 1458 2485 3617 6696 11142 15506 9502 1064 -4697 -4915
11794 -4915 -4574 -2487 -534 -3483 -4756 -2657 -245 -160 2324 6807 10162 6045 3658 275 895 -2002
11778 -2002 -885 -1980 842 9544 12590 11300 10092 3247 340 1206 1974 -523 3174 6155 10347
11763 10347 11478 6034 3184 1220 1046 7147 8925 4223 622 4312 5117 1353 -2181 1933 211
11748 211 -989 -2409 -6345 -8006 -4440 -5310 -2195 887 469 -3062 -5429 -2740 1533 6336 7899
11733 7899 6543 6500 311 -4777 -4499 -851 3122 7661 5633 112 -1232 -5662 -6402 -4325 65 1084
$$ packed form
11841a920k07j079M490J655p00j271n57k3J041N53K833p09k454N74N6j765n213
11824d696J402P478J343j8m636k979M309O12K953j819j724K997K831j569k975
11809C509M446j78j774k451k422L28J027J132L079M446M364o004q438n761k18
11794d915L41K087J953k949j273K099K412Q5K484M483L355m117k387l383O20k897
11778b002J117j095K822Q702L046j290j208o845k907Q66P68k497L697K981M192
11763A0347J131n444k850j964j74O101J778m702l601L690Q05l764l534M114j722
11748B11j200j420l936j661L566q70L115L082m18l531k367K689M273M803J563
11733G899j356m3o189n088K78L648L973M539k028n521j344m430p40K077M390J019
$$ plain form
11717 1084 4640 -43 -3587 -5576 -2460 1487 579 -4065 -1281 526 -1952 1829 703 -2928 -1277
11702 -1277 -3432 -4330 -951 -281 -1168 4858 9524 14935 13046 6609 3502 8344 14626 13540 12624 17436
11686 17436 11722 5130 5388 -4653 -5106 -178 1073 7618 9532 10717 6947 3182 -607 292 5381
11671 5381 4891 4020 6555 5074 3415 2787 3862 5483 5248 2242 4604 7978 9341 4692 838 236
11655 236 2567 4410 5202 6650 7104 6421 6376 8930 6569 5627 4219 1408 3285 4070 5374 2212 4089
11638 4089 12483 7180 4802 6452 5900 3373 1263 2786 5843 7975 9093 7401 2681 840 2683
11623 2683 4810 -1230 -990 -1059 -1054 57 648 -2710 -6444 -6506 -5640 -1746 -2595 -3083 -1077 -2282 -8539 -5807
11605 -5807 -810 -669 -482 -251 -1682 1756 6121 5460 6635 4961 -4825 -1823 -821 -580 -979 579
$$ packed form
11717A084L556m683l544j989L116L947r08m644K784J807k478L781j126l631J651
11702a277k155q98L379O70q87O026M666N411j889o437l107M842O282j086r16M812
11686A7436n714o592K58j0041m53M928J251O545J914J185l770l765l789Q99N089
11671E381m90q71K535j481j659o28J075J621k35l006K362L374J363m649l854o02
11655B36K331J843P92J448M54o83m5K554k361r42j408k811J877P85J304l162J877
11638D089Q394n303k378J650n52k527k110J523L057K132J118j692m720j841J843
11623B683K127o040K40o9NJ111N91l358l734o2Q66L894q49m88K006j205o257K732
11605e807M997J41J87K31j431L438M365o61J175j674r786L002J002K41l99J558
$$ plain form
11589 579 1824 2791 3728 8963 13210 9588 4056 3704 3720 4591 -2870 -2296 2092 2745 4436 1220 2477
11572 2477 4384 2712 -3060 -4163 -3889 -2617 10 4520 2249 153 206 -986 -1747 5006 8614 7463
11556 7463 4306 5004 8243 9195 10428 9999 4485 3188 1060 4322 5040 4205 6464 12985 15259 9280
11540 9280 4527 6310 9122 7317 -442 -1231 6767 7137 2787 992 1187 1944 1525 3289 -1746 -822
11524 -822 309 3877 5091 4797 5027 6810 10946 14055 14424 14892 12715 11994 9933 5578 3636 5558
11508 5558 3947 -2554 795 4171 11097 12609 16368 16760 14874 13973 11857 12791 11181 10880 16923 21587
11492 21587 17545 12444 12330 13390 10668 9843 15317 17239 17615 25306 27782 29487 34159 38415 38798
11477 38798 38535 43006 43288 43061 43680 44765 46496 43000 46859 50625 52707 50510 48078 56189 63220
$$ packed form
11589E79J245R67R37N235M247l622n532l52J6Q71p461N74M388O53J691l216J257
11572B477J907j672n772j103K74J272K627M510k271k096N3j192p61O753L608j151
11556G463l157O98L239R52J233m29n514j297k128L262P18q35K259O521K274n979
11540I280m753J783K812j805p759p89P998L70m350j795J95P57m19J764n035R24
11524h22J131L568J214k94K30J783M136L109L69M68k177p21k061m355j942J922
11508E558j611o501L349L376O926J512L759L92j886r01k116R34j610l01O043M664
11492B1587m042n101j14J060k722q25N474J922L76P691K476J705M672M256L83
11477C8798k63M471K82k27O19J085J731l496L859L766K082k197k432Q111P031
$$ plain form
11462 63220 63928 61183 63996 66870 68344 71314 75501 79033 79301 77769 77240 81591 88540 84011 77617
11447 77617 76371 78287 80837 83873 81810 80365 72065 70150 74590 82475 90099 87181 86574 90984 95273
11432 95273 99299 101986 105087 110207 110400 107708 106190 110008 111820 112249 115071 119737 120477 122887 129769
11417 129769 136690 146506 158771 171600 184301 192712 203849 218179 235679 259743 280071 302421
11405 302421 329687 350025 368898 392643 415406 438530 453802 473037 488215 501153 512142
11394 512142 518370 518800 519769 521606 521269 519553 513069 506398 503753 502174 491262 476967 465772 450750
11380 450750 436535 426748 421001 414586 404861 396510 398124 396411 392645 389388 395552 400684 403820 413169
11366 413169 419142 430017 448480 461787 476789 496422 517292 535477 544807 555909 567668 578838
$$ packed form
11462F3220P08k745K813K874J474K970M187L532K68j532n29M351O949m529o394
11447G7617j246J916K550L036k063j445q300j915M440P885P624k918o07M410M289
11432I5273M026K687L101N120J93k692j518L818J812M29K822M666P40K410O882
11417A29769O921R816J2265J2829J2701Q411J1137J4330J7500K4064K0328K2350
11405C02421K7266K0338J8873K3745K2763K3124J5272J9235J5178J2938J0989
11394E12142O228M30R69J837l37j716o484o671k645j579j0912j4295j1195j5022
11380D50750j4215r787n747o415r725q351J614j713l766l257O164N132L136R349
11366D13169N973J0875J8463J3307J5002J9633K0870J8185R330J1102J1759J1170
$$ plain form
11354 578838 590216 593056 593550 595057 595627 591686 578595 562434 546794 528875 510052 490846 469832
11341 469832 451189 432240 413398 391778 367250 346690 325047 303261 283448 268172 254439
11330 254439 238103 227370 218022 205569 194652 184990 179292 174919 166436 153769 153424 156015 154113
11317 154113 147182 141295 137830 138376 139525 136754 133847 128702 131924 139162 139899 135188 132357 135952 138404
11302 138404 138621 139588 141048 134055 131526 129100 127190 125203 124625 119087 115481 121229 124412 124686 119963
11287 119963 117281 111362 111056 110458 110092 105421 107825 107372 104407 105980 108735 112569 116090 119380 120614
11272 120614 123035 126504 123699 124105 126770 125604 121204 120815 123018 122752 120035 117750 113412 111258 106628
11257 106628 101285 101101 101517 101931 100630 98295 86294 79120 79853 78011 78294 74430 74220 74448 75319 76394
$$ packed form
11354E78838J1378K840M94J507N70l941j3091j6161j5640j7919j8823j9206k1014
11341D69832j8643j8949j8842k1620k4528k0560k1643k1786j9813j5276j3733
11330B54439j6336j0733r348j2453j0917r662n698m373q483j2667l45K591j902
11317A54113o931n887l465N46J149k771k907n145L222P238P37m711k831L595K452
11302A38404K17R67J460o993k529k426j910j987n78n538l606N748L183K74m723
11287A19963k682n919l06n98l66m671K404m53k965J573K755L834L521L290J234
11272A20614K421L469k805M06K665j166m400l89K203k66k717k285m338k154m630
11257A06628n343j84M16M14j301k335j2001p174P33j842K83l864k10K28Q71J075
$$ plain form
11241 76394 76067 74536 75184 73956 75542 76981 78482 79136 86363 90200 87128 86969 87397 89251 98517 102029
11225 102029 96609 103285 110482 113037 110863 112417 116574 119870 122660 119919 118067 119485 118029 120901
11211 120901 128177 132545 130836 126338 122389 123349 127963 127868 123077 123629 125355 123407 117022 119596 123170
11196 123170 127673 126830 126174 122079 123753 122613 122366 120133 113370 115862 119931 119436 116798 113609 111836
11181 111836 109686 103664 100197 97843 101092 100539 96561 98981 97730 93587 93520 93357 91564 89930 87327
11166 87327 89402 94765 94489 92456 91351 93244 96023 96136 98172 98490 94344 92724 90274 90786 91378 94941
11150 94941 100502 101793 96117 94670 98108 100534 100072 103073 108372 110424 109572 111131 110513 112685 118212
11135 118212 117243 112918 113273 114860 116617 116147 118289 115556 117089 119573 119763 120028 124475 124888 126930 129324
$$ packed form
11241G6394l27j531O48j228J586J439J501O54P227L837l072j59M28J854R266L512
11225A02029n420O676P197K555k174J554M157L296K790k741j852J418j456K872
11211A20901P276M368j709m498l949R60M614r5m791N52J726j948o385K574L574
11196A23170M503q43o56m095J674j140k47k233o763K492M069m95k638l189j773
11181A11836k150o022l467k354L249n53l978K420j251m143o7j63j793j634k603
11166H7327K075N363k76k033j105J893K779J13K036L18m146j620k450N12N92L563
11150I4941N561J291n676j447L438K426m62L001N299K052q52J559o18K172N527
11135A18212r69m325L55J587J757m70K142k733J533K484J90K65M447M13K042K394
$$ plain form
11119 129324 133765 136476 139002 139236 139867 139624 136510 136612 136412 134098 133953 134375 134481 131489 127368 127455 128744
11102 128744 127689 124077 130588 125788 124243 125829 129478 128920 123843 120999 124900 127593 129538 127102
11088 127102 124706 120726 117882 114880 111367 116832 126536 125650 123669 122173 123918 124799 129306 132238 127321
11073 127321 130953 135187 137700 141067 145925 150920 157269 169806 178304 183281 190127 201379 212999
11060 212999 230784 256824 279456 307013 333564 355967 381462 392220 385686 367117 335642 304853
11048 304853 278959 256600 232714 221924 212184 208212 211260 213402 210987 203463 205159 209650 209605 212743
11034 212743 213818 215109 215371 224056 230692 235896 242533 244384 246659 255838 264110 269893 277097 291625
11020 291625 312227 333224 356376 382373 410925 438716 465831 486266 496349 488021 464612 436822
$$ packed form
11119A29324M441K711K526K34O31k43l114J02k00k314j45M22J06k992m121Q7J289
11102A28744j055l612O511m800j545J586L649n58n077k844L901K693J945k436
11088A27102k396l980k844l002l513N465R704q86j981j496J745Q81M507K932m917
11073A27321L632M234K513L367M858M995O349J2537Q498M977O846J1252J1620
11060B12999J7785K6040K2632K7557K6551K2403K5495J0758o534j8569l1475l0789
11048C04853k5894k2359k3886j0790r740l972L048K142k415p524J696M491m5L138
11034B12743J075J291K62Q685O636N204O637J851K275R179Q272N783P204J4528
11020B91625K0602K0997K3152K5997K8552K7791K7115K0435J0083q328k3409k7790
$$ plain form
11008 436822 408098 380687 364353 352339 343293 336273 328701 324653 318585 309424 302158 292870 286093
10995 286093 284952 282255 282248 284134 284783 290854 295763 297655 300225 300556 305548 310759 315865 319026 327622
10980 327622 335965 341544 347068 358135 372049 381376 384151 395455 410022 425007 443045 459848
10968 459848 485535 520723 562825 601956 641778 681999 706341 707261 689071 656248 617836 587184
10956 587184 563010 545211 539922 537732 532315 533510 534196 533376 538508 554035 569163 579076 591895
10943 591895 608269 619723 635105 658681 684357 708144 726470 751551 781470 815425 851031
10932 851031 889561 938608 995077 1061326 1142121 1242888 1356210 1474347 1585801 1675032 1724909
10921 1724909 1711491 1648035 1562630 1478290 1409399 1364975 1338804 1330880 1334059 1350538 1375684 1397050
$$ packed form
11008D36822k8724k7411j6334j2014r046p020p572m048o068r161p266r288o777
10995B86093j141k697pJ886O49O071M909J892K570L31M992N211N106L161Q596
10980C27622Q343N579N524J1067J3914R327K775J1304J4567J4985J8038J6803
10968D59848K5687L5188M2102L9131L9822M0221K4342R20j8190l2823l8412l0652
10956E87184k4174j7799n289k190n417J195O86q20N132J5527J5128R913J2819
10943E91895J6374J1454J5382K3576K5676K3787J8326K5081K9919L3955L5606
10932H51031L8530M9047N6469O6249Q0795J00767J13322J18137J11454Q9231M9877
10921A724909j3418o3456q5405q4340o8891m4424k6171p924L179J6479K5146K1366
$$ plain form
10909 1397050 1419091 1452334 1492768 1534863 1585647 1639222 1692112 1756648 1827257 1901094 1980999
10898 1980999 2066163 2160664 2261370 2374963 2496885 2629557 2771120 2924598 3100691 3303309
10888 3303309 3528357 3780087 4055667 4340512 4612403 4852787 5032988 5136408 5192403 5245665
10878 5245665 5326437 5440886 5584622 5756626 5938639 6127155 6317480 6504238 6680147 6849283
10868 6849283 7005160 7153258 7279094 7392472 7493774 7578734 7652625 7720489 7782318 7841456
10858 7841456 7888596 7933896 7975701 8008619 8029983 8037340 8031793 8018088 7997054 7967037 7933345 7900913
10846 7900913 7863081 7803447 7709048 7558859 7340290 7068517 6777851 6499216 6249570 6027352
10836 6027352 5832632 5668849 5526171 5398899 5292290 5201950 5125529 5061378 5016154 4975287
$$ packed form
10909A397050K2041L3243M0434M2095N0784N3575N2890O4536P0609P3837P9905
10898A980999Q5164R4501J00706J13593J21922J32672J41563J53478J76093K02618
10888C303309K25048K51730K75580K84845K71891K40384J80201J03420N5995N3262
10878E245665Q0772J14449J43736J72004J82013J88516J90325J86758J75909J69136
10868F849283J55877J48098J25836J13378J01302Q4960P3891O7864O1829N9138
10858G841456M7140M5300M1805L2918K1364P357n547j3705k1034l0017l3692l2432
10846G900913l7832n9634r4399j50189k18569k71773k90666k78635k49646k22218
10836F027352j94720j63783j42678j27272j06609r0340p6421o4151m5224m0867
$$ plain form
10826 4975287 4941455 4925615 4920933 4924878 4944226 4969675 5007631 5053175 5113335 5189709 5279773 5379668
10814 5379668 5490193 5609530 5751637 5916713 6100260 6299055 6525304 6774745 7041557
10805 7041557 7322906 7613281 7898438 8179743 8468212 8768192 9087119 9426559 9788389
10796 9788389 10161134 10545479 10929425 11313433 11693197 12060188 12407353 12726505 13027475
10787 13027475 13300060 13544594 13761029 13948128 14100635 14223396 14323492 14403116 14458522 14487927
10777 14487927 14495946 14477916 14433550 14362986 14262094 14137879 13986497 13808818 13600809 13368034
10767 13368034 13113188 12832716 12515356 12170007 11815731 11447464 11064142 10675472 10287797
10758 10287797 9905084 9532383 9170082 8826063 8501895 8197585 7905899 7638200 7391192
$$ packed form
10826D975287l3832j5840m682L945J9348K5449L7956M5544O0160P6374R0064R9895
10814E379668J10525J19337J42107J65076J83547J98795K26249K49441K66812
10805G041557K81349K90375K85157K81305K88469K99980L18927L39440L61830
10796I788389L72745L84345L83946L84008L79764L66991L47165L19152L00970
10787A3027475K72585K44534K16435J87099J52507J22761J00096P9624N5406K9405
10777A4487927Q019j8030m4366p0564j00892j24215j51382j77679k08009k32775
10767A3368034k54846k80472l17360l45349l54276l68267l83322l88670l87675
10758A0287797l82713l72701l62301l44019l24168l04310k91686k67699k47008
$$ plain form
10749 7391192 7154814 6934804 6731982 6546750 6369120 6212149 6068103 5933182 5807329
10740 5807329 5702419 5609862 5523621 5447368 5377814 5315901 5269171 5239261 5211615 5191707 5189445
10729 5189445 5197796 5213558 5235205 5271624 5324786 5390450 5464855 5547881 5646518 5751149 5872042
10718 5872042 6014784 6159864 6316110 6481008 6648075 6819876 6990690 7166110 7335656
10709 7335656 7491568 7637149 7766326 7886407 7991098 8074898 8144389 8193586 8234044 8257069
10699 8257069 8260011 8259378 8245892 8219880 8179369 8135276 8090947 8028842 7956779 7871729 7772526 7661493
10687 7661493 7529743 7381870 7226156 7055168 6868010 6669020 6456953 6248391 6043682
10678 6043682 5842703 5644890 5452133 5266400 5091981 4932913 4783364 4648756 4522342
$$ packed form
10749G391192k36378k20010k02822j85232j77630j56971j44046j34921j25853
10740E807329j04910r2557q6241p6253o9554o1913m6730k9910k7646j9908k262
10729E189445Q351J5762K1647L6419N3162O5664P4405Q3026R8637J04631J20893
10718E872042J42742J45080J56246J64898J67067J71801J70814J75420J69546
10709G335656J55912J45581J29177J20081J04691Q3800O9491M9197M0458K3025
10699H257069K942o33j3486k6012m0511m4093m4329o2105p2063q5050r9203j11033
10687G661493j31750j47873j55714j70988j87158j98990k12067k08562k04709
10678F043682k00979j97813j92757j85733j74419j59068j49549j34608j26414
$$ plain form
10669 4522342 4413354 4315848 4225392 4152964 4095259 4059767 4038066 4037875 4054653 4094687 4168335
10658 4168335 4285839 4449375 4663743 4944542 5296324 5729563 6249453 6859953 7565387
10649 7565387 8363362 9268050 10320730 11575403 13138234 15144659 17763905 21174330
10641 21174330 25506957 30745430 36614353 42493437 47409824 50261244 50219126 47168889
10633 47168889 41815986 35367884 29017285 23534555 19192361 15933782 13547254 11803461
10625 11803461 10525167 9576195 8864855 8319311 7885811 7540428 7274241 7096258 7004242
10616 7004242 7003013 7093729 7283907 7579274 7975279 8471651 9066215 9750879 10526683 11410611
10606 11410611 12436419 13669798 15209821 17191247 19784098 23162055 27448973 32634586
$$ packed form
10669D522342j08988r7506r0456p2428n7705l5492k1701j91J6778M0034P3648
10658D168335J17504J63536K14368K80799L51782M33239N19890O10500P05434
10649G565387P97975R04688J052680J254673J562831K006425K619246L410425
10641B1174330M332627N238473N868923N879084M916387K851420m2118l050237
10633D7168889n352903o448102o350599n482730m342194l258579k386528j743793
10625A1803461j278294r48972p11340n45544m33500l45383k66187j77983r2016
10616G004242j229R0716J90178K95367L96005M96372N94564O84664P75804Q83928
10606A1410611J025808J233379J540023J981426K592851L377957M286918N185613
$$ plain form
10598 32634586 38482526 44416111 49493255 52629185 52966463 50228840 44965459 38329079
10590 38329079 31552578 25543686 20698249 17002933 14254021 12209515 10666530 9473994
10582 9473994 8533048 7765723 7131385 6601001 6154867 5774895 5453393 5176378 4938001
10573 4938001 4732151 4557028 4408352 4279393 4171981 4072864 3991576 3924738 3869165 3823425
10563 3823425 3778020 3735144 3679837 3611908 3529985 3426935 3306677 3180413 3044946 2909826
10553 2909826 2771212 2637326 2516248 2399538 2288011 2186628 2089808 1994888 1902830 1823734
10543 1823734 1746915 1674237 1606315 1549795 1488064 1423430 1365656 1309186 1259706 1217451 1179416
10532 1179416 1132301 1089695 1055373 1025303 997627 969339 941830 921595 902154 877408 856238
$$ packed form
10598C2634586N847940N933585N077144L135930L37278k737623n263381o636380
10590C8329079o776501o008892m845437l695316k748912k044506j542985j192536
10582I473994r40946p67325o34338n30384m46134l79972l21502k77015k38377
10573D938001k05850j75123j48676j28959j07412r9117q1288o6838n5573m5740
10563C823425m5405m2876n5307o7929q1923j03050j20258j26264j35467j35120
10553B909826j38614j33886j21078j16710j11527j01383r6820r4920r2058p9096
10543A823734p6819p2678o7922n6520o1731o4634n7774n6470m9480m2255l8035
10532A179416m7115m2606l4322l0070k7676k8288k7509k0235j9441k4746k1170
$$ plain form
10521 856238 833276 814771 794467 774809 760575 749905 738666 724463 708952 688538 669222
10510 669222 644837 619806 598992 576283 552403 531853 516270 500317 484521 476390 465966 454530
10498 454530 444957 434492 422938 413498 406793 399587 402239 409155 410053 406418 406764 406899 407977 412728
10484 412728 429394 449188 465069 481960 500846 525398 557442 594981 639707 688833 739592
10473 739592 796899 864856 943903 1030430 1130668 1256894 1406321 1596359 1831338 2112334
10463 2112334 2432513 2759136 3058860 3273394 3359500 3298667 3096197 2800029 2463582 2134724
10453 2134724 1849016 1616929 1431605 1298701 1204638 1148424 1118722 1108985 1125183 1156017 1199897
10442 1199897 1248386 1290585 1321093 1329411 1308862 1273231 1231907 1196831 1177267 1171669 1182642 1209266
$$ packed form
10521H56238k2962j8505k0304j9658j4234j0670j1239j4203j5511k0414j9316
10510F69222k4385k5031k0814k2709k3880k0550j5583j5953j5796q131j0424j1436
10498D54530r573j0465j1554r440o705p206K652O916Q98l635L46J35J078M751
10484D12728J6666J9794J5881J6891J8886K4552L2044L7539M4726M9126N0759
10473G39592N7307O7957P9047Q6527J00238J26226J49427J90038K34979K80996
10463B112334L20179L26623K99724K14534Q6106o0833k02470k96168l36447l28858
10453B134724k85708k32087j85324j32904r4063n6214k9702r737J6198L0834M3880
10442A199897M8489M2199L0508Q318k0549l5631m1324l5076j9564n598J0973K6624
$$ plain form
10430 1209266 1251970 1311481 1389704 1484802 1604927 1763059 1966413 2224910 2542856 2898910
10420 2898910 3266164 3599634 3833993 3899601 3765823 3445431 3024789 2588579 2200349 1888721
10410 1888721 1656138 1483996 1358452 1265796 1212295 1186259 1173647 1186027 1219809 1268620 1316232
10399 1316232 1340512 1331530 1279711 1190753 1083692 975414 882623 812992 765716 734662 712477
10388 712477 701435 697930 700050 710982 729040 746899 770648 787132 809287 846390 901879 984914
10376 984914 1096216 1252312 1478438 1777832 2158950 2574502 2954142 3171995 3060210 2621143
10366 2621143 2075797 1609148 1273238 1045094 892085 780751 697007 631280 583618 537670
10356 537670 506804 483787 463735 447736 431286 417259 409578 400135 391621 382011 375292 371797 364621
$$ packed form
10430A209266M2704N9511P8223R5098J20125J58132K03354K58497L17946L56054
10420B898910L67254L33470K34359O5608j33778l20392m20642m36210l88230l11628
10410A888721k32583j72142j25544r2656n3501k6036j2612J2380L3782M8811M7612
10399A316232K4280q982n1819q8958j07061j08278r2791o9631m7276l1054k2185
10388G12477j1042l505K120J0932J8058J7859K3749J6484K2155L7103N5489Q3035
10376I84914J11302J56096K26126K99394L81118M15552L79640K17853j11785m39067
10366B621143n45346m66649l35910k28144j53009j11334q3744o5727m7662m5948
10356E37670l0866k3017k0052j5999j6450j4027p681r443q514r610o719l495p176
$$ plain form
10343 364621 350728 341010 332339 328462 326005 326493 319522 312701 309941 302653 293798 281212 271146 265539
10329 265539 255514 246302 242903 240971 233042 223512 213699 207354 198964 194159 193345 193164 185503 177382
10315 177382 167969 160484 157577 150433 137128 126128 122715 120906 119913 116766 117894 115171 114582 114685
10301 114685 116175 111268 110055 105778 104444 106406 104682 105517 103439 99794 106446 108122 109660 111177
10287 111177 110962 111581 107176 109144 110180 107546 105048 105229 109454 108896 103870 96697 99728 103871 107362
10272 107362 104827 108207 108454 103506 98079 89525 82166 86600 90474 92221 93233 95216 101263 96492
10258 96492 94825 97927 99454 94330 91141 84727 81208 82442 83521 83621 83020 80020 79965 81585 80067
10243 80067 73682 71903 69238 67179 67078 66504 65597 66819 67580 61150 62301 64745 71073 77446 73495
$$ packed form
10343C64621j3893r718q671l877k457M88o971o821k760p288q855j2586j0066n607
10329B65539j0025r212l399j932p929r530r813o345q390m805q14j81p661q121
10315A77382r413p485k907p144j3305j1000l413j809r93l147J128k723n89J03
10301A14685J490m907j213m277j334J962j724Q35k078l645O652J676J538J517
10287A11177k15O19m405J968J036k634k498J81M225n58n026p173L031M143L491
10272A07362k535L380K47m948n427q554p359M434L874J747J012J983O047m771
10258I6492j667L102J527n124l189o414l519J234J079J00o01l000n5J620j518
10243H0067o385j779k665k059j01n74r07J222P61o430J151K444O328O373l951
$$ plain form
10228 73495 71584 75463 79398 82812 90466 95947 99967 109870 117920 130990 146064 164467 187883
10215 187883 219396 248642 277301 290522 290493 283154 257594 224230 193148 167437 146793 127133
10203 127133 116460 105070 96463 90930 86118 84426 80526 75534 76191 74089 76594 83672 85137 84295
10189 84295 82585 80573 79534 80647 85947 90890 96571 107189 114320 116348 122002 134141 149038 171075
10175 171075 197506 222887 249970 277574 297096 302411 296617 278358 249875 214003 183567 149157
10163 149157 124459 105059 93432 88319 80735 74102 66815 66237 66166 67457 71480 67197 56959 52046
10149 52046 48238 48948 46113 46418 48537 52618 56785 53050 52618 52110 53631 52837 57773 58850 54690 53768
10133 53768 51974 50329 54457 53719 60189 68136 65510 61759 56187 46084 42877 42984 43149 46591 45097
$$ packed form
10228G3495j911L879L935L414P654N481M020R903Q050J3070J5074J8403K3416
10215A87883L1513K9246K8659J3221k9p339k5560l3364l1082k5711k0644j9660
10203A27133j0673j1390q607n533m812j692l900m992O57k102K505P078J465q42
10189H4295j710k012j039J113N300M943N681J0618P131K028N654J2139J4897K2037
10175A71075K6431K5381K7083K7604J9522N315n794j8259k8483l5872l0436l4410
10163A49157k4698j9400j1627n113p584o633p287n78p1J291M023m283j0238m913
10149E2046l808P10k835L05K119M081M167l735m32n08J521p94M936J077m160r22
10133E3768j794j645M128p38O470P947k626l751n572j0103l207J07J65L442j494
$$ plain form
10118 45097 44383 36778 30092 26843 33591 37600 39679 37187 36231 42607 44912 43262 39007 34393 35413
10103 35413 38707 43961 42612 42203 44818 48818 45349 41933 42151 41755 44606 40903 33736 26217 26494
10088 26494 28307 27754 28322 30875 30736 27378 29958 30195 33067 37884 39678 36019 32457 35306 36714
10073 36714 33028 35751 35419 30276 29476 28939 34731 30894 28930 28290 27084 30499 31769 32784 33303 32204
10057 32204 27668 24423 28988 30521 26578 24808 25691 26562 27426 29762 30476 33791 34618 36991 39716 38795
10041 38795 35452 35025 33335 36751 35510 33535 33932 37091 41117 37863 39266 38861 35654 33375 32630
10026 32630 26961 21577 25310 23972 24493 27433 26372 26143 25303 24963 23730 25603 25518 23913 25137 27784
10010 27784 29354 26189 26448 30459 31148 29363 31663 37990 43811 46066 50007 52491 53393 45151 36860
$$ packed form
10118D5097p14p605o686l249O748M009K079k492r56O376K305j650m255m614J020
10103C5413L294N254j349m09K615M000l469l416K18l96K851l703p167p519K77
10088B6494J813n53N68K553j39l358K580K37K872M817J794l659l562K849J408
10073C6714l686K723l32n143q00n37N792l837j964o40j206L415J270J015N19j099
10057C2204m536l245M565J533l943j770Q83Q71Q64K336P14L315Q27K373K725r21
10041C8795l343m27j690L416j241j975L97L159M026l254J403m05l207k279p45
10026C2630n669n384L733j338N21K940j061k29q40l40j233J873q5j605J224K647
10010B7784J570l165K59M011O89j785K300O327N821K255L941K484R02q242q291
$$ plain form
9995 36860 29676 26452 28211 30678 30328 30719 27814 27676 29309 27285 27940 25108 29368 35952 40599 43422
9979 43422 37066 31371 32266 33856 32082 29224 26632 25821 27450 27526 29247 34801 38216 40954 46495 54728
9963 54728 56380 50764 41418 33198 32369 34987 37252 35512 28738 24790 30259 35427 35071 33621 34674
9948 34674 30091 28302 28290 31333 31675 30374 27895 26883 29163 34875 32329 26239 22350 21238 19551
9933 19551 17700 18278 14933 11160 13545 16124 14220 15491 12899 6944 8461 12342 13434 13662 10288
9918 10288 4370 2216 5303 10840 11780 17011 17659 17499 17917 14275 10913 8552 8104 10269 11053 10799
9902 10799 11057 13418 15900 13797 16270 15951 13892 12873 13203 11085 9529 12064 11930 11547 8126 7576
9886 7576 10079 6794 6543 8717 9011 11429 11493 13216 17875 13612 8015 10065 7632 5327 6483 10453
$$ packed form
9995C6860p184l224J759K467l50L91k905j38J633k024O55k832M260O584M647K823
9979D3422o356n695Q95J590j774k858k592q11J629P6J721N554L415K738N541Q233
9963E4728J652n616r346q220q29K618K265j740o774l948N469N168l56j450J053
9948C4674m583j789j2L043L42j301k479j012K280N712k546o090l889j112j687
9933A9551j851N78l345l773K385K579j904J271k592n955J517L881J092K28l374
9918A0288n918k154L087N537R40N231O48j60M18l642l362k361m48K165P84k54
9902A0799K58K361K482k103K473l19k059j019L30k118j556K535j34l83l421n50
9886G576K503l285k51K174K94K418O4J723M659m263n597K050k433k305J156L970
$$ plain form
9870 10453 13276 14335 20865 20961 22484 22015 16969 13252 13509 18044 20879 18811 12976 16058 20384 18776
9854 18776 15477 17763 19387 20654 19016 12123 7216 11790 19206 25151 22524 18289 16500 17614 14286
9839 14286 18560 18386 15844 15655 15830 16544 12690 16955 25270 28366 26164 22642 20546 18158 13865 14095
9823 14095 13446 9904 10418 12593 14945 17439 16697 16721 17343 19533 20648 14150 13894 17772 21939 26276
9807 26276 29853 27953 29190 27241 23360 23069 23592 25733 28895 34049 38017 39926 42217 40021 41628
9792 41628 43399 43012 38804 33684 32371 28580 29228 26173 27886 27201 27903 32393 33093 30475 28156 27219
9776 27219 29308 25754 26413 28450 29706 34836 37016 32901 29396 30214 34395 35754 36161 36666 34313 33859
9760 33859 35555 32615 32724 29820 30348 31946 30979 33606 35966 38001 41719 45882 50036 50483 58368 57240
$$ packed form
9870A0453K823J059O530R6J523m69n046l717K57M535K835k068n835L082M326j608
9854A8776l299K286J624J267j638o893m907M574P416N945k627m235j789J114l328
9839A4286M274j74k542j89J75P14l854M265Q315L096k202l522k096k388m293K30
9823A4095o49l542N14K175K352K494p42K4O22K190J115o498k56L878M167M337
9807B6276L577j900J237j949l881k91N23K141L162N154L968J909K291k196J607
9792D1628J771l87m208n120j313l791O48l055J713o85P02M490P00k618k319r37
9776B7219K089l554O59K037J256N130K180m115l505Q18M181J359M07N05k353m54
9760C3859J696k940J09k904N28J598r67K627K360K035L718M163M154M47P885j128
$$ plain form
9744 57240 55659 56110 61972 67497 70483 65155 65817 69428 77488 88886 97018 107421 117125 128322
9730 128322 143857 161335 178411 197081 220599 257441 296668 343331 396590 467341 562424 679190
9718 679190 815867 967006 1124490 1267667 1366583 1409513 1425791 1456167 1538084 1683138 1874201
9707 1874201 2068706 2225926 2264542 2140425 1906687 1673933 1505646 1404417 1355806 1335234
9697 1335234 1312784 1246409 1122990 965430 801949 665292 567040 494651 441393 400754 371288
9686 371288 348390 328878 312022 300997 291485 281135 270365 270733 271806 265899 263643 267314 270345
9673 270345 266968 261721 256671 257589 258332 256632 254770 247677 244110 240166 229350 222138 220840 222011 223965
9658 223965 226492 220832 210632 201284 197313 189031 183083 179638 179075 176420 169764 161764 159446 158931 158619
$$ packed form
9744E7240j581M51N862N525K986n328O62L611Q060J1398Q132J0403R704J1197
9730A28322J5535J7478J7076J8670K3518L6842L9227M6663N3259P0751R5083J16766
9718F79190J36677J51139J57484J43177R8916M2930J6278L0376Q1917J45054J91063
9707A874201J94505J57220L8616j24117k33738k32754j68287j01229m8611k0572
9697A335234k2450o6375j23419j57560j63481j36657r8252p2389n3258m0639k9466
9686C71288k2898j9512j6856j1025r512j0350j0770L68J073n907k256L671L031
9673B70345l377n247n050R18P43j700j862p093l567l944j0816p212j298J171J954
9658B23965K527n660j0200r348l971q282n948l445n63k655o656q000k318n15l12
$$ plain form
9643 158619 157953 156572 151710 145055 137929 134350 131478 129905 121785 112204 104185 104606 103015 103534 105337
9628 105337 102510 95221 94647 93762 95313 95641 96127 93266 86666 83825 83535 83858 91037 90569 92042 91304
9612 91304 89299 94300 97951 93813 92409 98239 101411 101981 101245 107327 112622 114304 117337 122489 121749
9597 121749 122999 123240 119565 119259 119718 120831 117471 121615 120395 118805 122656 127352 130584 134722 136180
9582 136180 137566 143367 140331 137271 138137 134052 128175 119967 114931 116303 117306 116988 117806 114187 107313
9567 107313 106026 109529 116576 117081 118274 117573 114919 115338 114389 109237 106728 105987 106764 105733 100641 102342
9551 102342 103300 105067 103926 104458 100780 95897 94598 93396 94736 92972 89446 90550 94033 97956 95493
9536 95493 91024 89910 94388 96674 94630 91505 90312 96605 99267 97870 99174 99930 100157 99382 100864
$$ packed form
9643A58619o66j381m862o655p126l579k872j573q120r581q019M21j591N19J803
9628A05337k827p289n74q85J551L28M86k861o600k841k90L23P179m68J473p38
9612I1304k005N001L651m138j404N830L172N70p36O082N295J682L033N152p40
9597A21749J250K41l675l06M59J113l360M144j220j590L851M696L232M138J458
9582A36180J386N801l036l060Q66m085n877q208n036J372J003l18Q18l619o874
9567A07313j287L503P047N05J193p01k654M19r49n152k509p41P77j031n092J701
9551A02342R58J767j141N32l678m883j299j202J340j764l526J104L483L923k463
9536I5493m469j114M478K286k044l125j193O293K662j397J304P56K27p75J482
$$ plain form
9521 100864 100442 102036 108374 108933 108250 106696 104681 102146 104996 107773 107948 110289 103816 102544 104992
9506 104992 110040 110380 105400 102104 100280 104942 104253 109128 118029 131377 133095 128717 129169 124430 116429
9491 116429 116041 112974 109829 107609 106474 107819 107981 104992 105991 107611 108887 110516 112815 114870 114898 113447
9475 113447 114342 120217 122801 130661 132606 133927 138146 134132 130225 127047 121795 125981 127142 130564 139016
9460 139016 139090 142944 150629 162409 168213 170508 175745 179901 185911 188374 186551 184477 184181 184722 187271
9445 187271 190272 188132 186343 183814 180986 187847 189777 191426 190643 193106 202614 208062 214657 224693
9431 224693 229988 235879 242797 246368 251751 258964 264788 270431 280703 295810 304304 312117 328762 345044
9417 345044 361524 384295 413248 445067 481585 529292 582684 650509 735446 834366 968527
$$ packed form
9521A00864m22J594O338N59o83j554k015k535K850K777J75K341o473j272K448
9506A04992N048L40m980l296j824M662o89M875Q901J3348J718m378M52m739q001
9491A16429l88l067l145k220j135J345J62k989R99J620J276J629K299K055K8j451
9475A13447Q95N875K584P860J945J321M219m014l907l178n252M186J161L422Q452
9460A39016P4L854P685J1780N804K295N237M156O010K463j823k074k96N41K549
9445A87271L001k140j789k529k828O861J930J649p83K463R508N448O595J0036
9431B24693N295N891O918L571N383P213N824N643J0272J5107Q494P813J6645J6282
9417C45044J6480K2771K8953L1819L6518M7707N3392O7825Q4937R8920J34161
$$ plain form
9406 968527 1139005 1346010 1592852 1871124 2164869 2442324 2688587 2899953 3065842 3155325
9396 3155325 3083309 2852664 2557454 2272287 2007037 1735661 1460261 1214582 1021799 882099
9386 882099 782024 713580 667315 633949 610081 592682 576995 561510 545237 531699 522461 508441
9374 508441 489992 479450 470633 466117 462529 463033 460699 464731 476328 486349 497297 508858 524052
9361 524052 540436 553407 558187 564837 572891 574324 570381 569709 570651 569542 570049 576438 583829 597602
9347 597602 609445 624054 634433 649771 667915 686813 698461 709811 724933 737461 749040 762654
9335 762654 779149 797973 817564 830108 842368 863563 883812 895357 910607 926443 949588 972224
9323 972224 992171 1015160 1036371 1060512 1088863 1113947 1134119 1155684 1187894 1225434 1265420 1306450
$$ packed form
9406I68527J70478K07005K46842K78272K93745K77455K46263K11366J65889Q9483
9396C155325p2016k30645k95210k85167k65250k71376k75400k45679j92783j39700
9386H82099j00075o8444m6265l3366k3868j7399j5687j5485j6273j3538r238j4020
9374E08441j8449j0542q817m516l588N04k334M032J1597J0021J0948J1561J5194
9361E24052J6384J2971M780O650Q054J433l943o72R42j109N07O389P391J3773
9347E97602J1843J4609J0379J5338J8144J8898J1648J1350J5122J2528J1579J3614
9335G62654J6495J8824J9591J2544J2260K1195K0249J1545J5250J5836K3145K2636
9323I72224J9947K2989K1211K4141K8351K5084K0172K1565L2210L7540L9986M1030
$$ plain form
9311 1306450 1358494 1413737 1479771 1560634 1655923 1771669 1906699 2056955 2228678 2430329
9301 2430329 2649083 2885010 3120456 3357818 3596064 3824808 4048160 4276116 4513118 4760339
9291 4760339 5032925 5332049 5664251 6023637 6408897 6802327 7203275 7621421 8052738 8491086
9281 8491086 8935413 9377845 9804550 10208231 10584735 10925659 11240922 11523630 11784990 12035683
9271 12035683 12284818 12537980 12788908 13033228 13257193 13447417 13598056 13709129 13787280 13838405
9261 13838405 13876311 13908894 13933143 13947631 13945678 13934330 13913206 13883883 13842678 13785344 13700588
9250 13700588 13581397 13425428 13228183 12995570 12732055 12441094 12134755 11813495 11490435
9241 11490435 11166355 10838959 10518808 10199368 9895195 9613308 9372609 9176773 9034266
$$ packed form
9311A306450N2044N5243O6034Q0863R5289J15746J35030J50256J71723K01651
9301B430329K18754K35927K35446K37362K38246K28744K23352K27956K37002K47221
9291D760339K72586K99124L32202L59386L85260L93430M00948M18146M31317M38348
9281H491086M44327M42432M26705M03681L76504L40924L15263K82708K61360K50693
9271A2035683K49135K53162K50928K44320K23965J90224J50639J11073P8151N1125
9261A3838405L7906L2583K4249J4488j953j1348k1124k9323m1205n7334q4756
9250A3700588j19191j55969j97245k32613k63515k90961l06339l21260l23060
9241A1490435l24080l27396l20151l19440l04173k81887k40699j95836j42507
$$ plain form
9232 9034266 8944580 8902713 8908522 8952380 9012622 9060749 9069066 9027638 8936173 8795639 8630054
9221 8630054 8466445 8309806 8175795 8071526 7992248 7935102 7894642 7866849 7862505 7893392 7968388
9210 7968388 8095750 8283299 8529595 8831877 9189836 9592925 10019266 10465792 10921777 11377272
9200 11377272 11830076 12275429 12694675 13071744 13407682 13707686 13984883 14246902 14505725
9191 14505725 14753786 14986714 15202672 15400257 15582878 15742493 15881146 16001529 16101836
9182 16101836 16184836 16251256 16304851 16346666 16362425 16353857 16316251 16249889 16167407 16071811 15967222
9171 15967222 15854094 15733129 15591105 15422501 15196333 14906320 14561755 14163885 13726957
9162 13726957 13269476 12803966 12341828 11887134 11445741 11014428 10605252 10202953 9807534
$$ packed form
9232I034266q9686m1867N809M3858O0242M8127Q317m1428r1465j40534j65585
9221H630054j63609j56639j34011j04269p9278n7146m0460k7793m344L0887P4996
9210G968388J27362J87549K46296L02282L57959M03089M26341M46526M55985M55495
9200A1377272M52804M45353M19246L77069L35938L00004K77197K62019K58823
9191A4505725K48061K32928K15958J97585J82621J59615J38653J20383J00307
9182A6101836Q3000O6420N3595M1815J5759q568l7606o6362q2482r5596j04589
9171A5967222j13128j20965j42024j68604k26168k90013l44565l97870m36928
9162A3726957m57481m65510m62138m54694m41393m31313m09176m02299l95419
$$ plain form
9153 9807534 9412098 9009015 8610242 8229206 7867988 7523545 7192573 6862674 6533069 6197110
9143 6197110 5855244 5513865 5179006 4852436 4547598 4272111 4021901 3796547 3590194 3401454
9133 3401454 3229062 3074895 2935014 2806503 2682014 2577392 2483360 2393920 2308574 2227464
9123 2227464 2160351 2091488 2026787 1956259 1886774 1820170 1759012 1700430 1642970 1584482 1529696
9112 1529696 1477297 1430640 1393294 1353807 1309209 1270246 1239960 1209827 1185405 1165371 1146659
9101 1146659 1132716 1123721 1108951 1094530 1083390 1072190 1060589 1045594 1031355 1017601 1008491 1013013
9089 1013013 1023413 1038529 1062454 1093760 1125899 1168898 1213019 1241880 1263892 1272574 1260731 1249708
9077 1249708 1244526 1186121 1095729 1023100 974816 939003 908945 884311 853397 819931 789006 752405
$$ packed form
9153I807534l95436m03083l98773l81036l61218l44443l30972l29899l29605l35959
9143F197110l41866l41379l34859l26570l04838k75487k50210k25354k06353j88740
9133C401454j72392j54167j39881j28511j24489j04622r4032q9440q5346q1110
9123B227464o7113o8863o4701p0528o9485o6604o1158n8582n7460n8488n4786
9112A529696n2399m6657l7346l9487m4598l8963l0286l0133k4422k0034j8712
9101A146659j3943q995j4770j4421j1140j1200j1601j4995j4239j3754r110M522
9089A013013J0400J5116K3925L1306L2139M2999M4121K8861K2012Q682j1843j1023
9077A249708n182n8405r0392p2629m8284l5813l0058k4634l0914l3466l0925l6601
$$ plain form
9065 752405 723445 702821 689411 681264 682512 689554 695160 708246 712084 712918 711671 705238 697110 692140
9051 692140 690311 684975 693429 706820 710107 713466 706778 687733 658923 621216 588762 568643 553852
9038 553852 550238 553920 565988 582960 598567 612273 628319 642459 653194 661200 656107 641083
9026 641083 613413 592709 580835 574331 568416 564201 565546 566392 572544 586675 604227 624995 654594
9013 654594 697089 737602 778865 825059 877071 924990 964446 989866 1004751 997859 967663 925003
9001 925003 878453 834703 792984 762939 749979 738205 726887 727482 730995 739776 755208 770784
8989 770784 788788 804934 823919 849918 884354 924301 956587 976067 982248 983905 981284 980288 978066
8976 978066 979327 978189 973096 966091 960416 952168 948945 963041 992863 1031949 1071842 1112492 1151155
$$ packed form
9065G52405k8960k0624j3410q147J248P042N606J3086L838Q34j247o433q128m970
9051F92140j829n336Q454J3391L287L359o688j9045k8810l7707l2454k0119j4791
9038E53852l614L682J2068J6972J5607J3706J6046J4140J0735Q006n093j5024
9026F41083k7670k0704j1874o504n915m215J345Q46O152J4131J7552K0768K9599
9013F54594M2495M0513M1263M6194N2012M7919L9456K5420J4885o892l0196m2660
9001I25003m6550m3750m1719l0045j2960j1774j1318N95L513Q781J5432J5576
8989G70784J8004J6146J8985K5999L4436L9947L2286J9480O181J657k621r96k222
8976I78066J261j138n093p005n675q248l223J4096K9822L9086L9893M0650L8663
$$ plain form
8963 1151155 1195042 1237652 1275889 1315123 1353691 1389052 1413120 1399892 1380142 1386766 1402690 1386642
8951 1386642 1363645 1365869 1391394 1445273 1514981 1586572 1651338 1698573 1724729 1717057 1690519 1649660
8939 1649660 1611422 1580172 1557192 1548251 1556374 1573926 1600979 1636492 1673819 1717366 1772700 1842392
8927 1842392 1914916 2002525 2116940 2247774 2384250 2507262 2605657 2666782 2689152 2675219 2643150
8916 2643150 2603123 2576924 2560722 2560226 2575401 2607662 2662645 2751662 2871263 3024542 3196121
8905 3196121 3370534 3550261 3711344 3829250 3907002 3937700 3922552 3877316 3814760 3759659 3726212
8894 3726212 3722404 3753263 3818297 3900972 4002370 4119903 4253624 4421339 4624773 4861689
8884 4861689 5132695 5431280 5735235 6024734 6277551 6472270 6608647 6700986 6782510 6888447
$$ packed form
8963A151155M3887M2610L8237L9234L8568L5361K4068j3228j9750O624J5924j6048
8951A386642k2997K224K5525N3879O9708P1591O4766M7235K6156p672k6538m0859
8939A649660l8238l1250k2980q941Q123J7552K7053L5513L7327M3547N5334O9692
8927A842392P2524Q7609J14415J30834J36476J23012R8395O1125K2370j3933l2069
8916B643150m0027k6199j6202m96J5175L2261N4983Q9017J19601J53279J71579
8905C196121J74413J79727J61083J17906P7752L0698j5148m5236o2556n5101l3447
8894C726212l808L0859O5034Q2675J01398J17533J33721J67715K03434K36916
8884D861689K71006K98585L03955K89499K52817J94719J36377R2339Q1524J05937
$$ plain form
8874 6888447 7017235 7161906 7313240 7460377 7597773 7709564 7794702 7897706 8055466 8276584
8864 8276584 8549035 8866841 9233881 9659696 10153179 10701595 11301037 11969298 12728356 13584361
8854 13584361 14556487 15674498 16973961 18519857 20379053 22607297 25270210 28456384
8846 28456384 32283389 36904595 42435490 48900369 56207843 64179743 72682291 81764643
8838 81764643 91639450 102949487 117009443 135530516 160406808 193864304 237890241
8831 237890241 293344406 358416721 425545535 483838475 520474388 515430885 464219129
8824 464219129 389126496 315854219 256830572 211399273 175017624 145413736 122032031
8817 122032031 104248943 91029522 81267291 73989668 68382736 63751518 59646910 56010156
$$ packed form
8874F888447J28788J44671J51334J47137J37396J11791Q5138J03004J57760K21118
8864H276584K72451L17806L67040M25815M93483N48416N99442O68261P59058Q56005
8854A3584361R72126J118011J299463J545896J859196K228244K662913L186174
8846B8456384L827005M621206N530895O464879P307474P971900Q502548R082352
8838H1764643R874807J1310037J4059956J8521073K4876292L3457496M4025937
8831B37890241N5454165O5072315O7128814N8292940L6635913n043503n1211756
8824D64219129p5092633p3272277n9023647m5431299l6381649k9603888k3381705
8817A22032031j7783088j3219421r762231p277623n606932m631218m104608l636754
$$ plain form
8809 56010156 52892188 50217111 47875974 45759281 43793185 41956522 40254819 38721878
8801 38721878 37380055 36231186 35278939 34531469 33958463 33504213 33060566 32587385 32128564
8792 32128564 31708170 31310318 30848860 30232335 29462310 28589400 27639100 26613146 25524907
8783 25524907 24400006 23283534 22213457 21206524 20297899 19500290 18800609 18169313 17585566
8774 17585566 17010666 16430472 15869275 15333582 14839756 14400803 14001437 13636775 13279622
8765 13279622 12907223 12507044 12087657 11683668 11327454 11045128 10827386 10637696 10450814
8756 10450814 10230927 9955374 9634526 9281158 8918102 8559305 8222941 7920705 7660991
8747 7660991 7435383 7246805 7101965 6987885 6883893 6790118 6721627 6685990 6703150 6787200
$$ packed form
8809E6010156l117968k675077k341137k116693j966096j836663j701703j532941
8801C8721878j341823j148869r52247p47470n73006m54250m43647m73181m58821
8792C2128564m20394l97852m61458o16525p70025q72910r50300j025954j088239
8783B5524907j124901j116472j070077j006933r08625p97609o99681o31296n83747
8774A7585566n74900n80194n61197n35693m93826m38953l99366l64662l57153
8765A3279622l72399m00179m19387m03989l56214k82326k17742j89690j86882
8756A0450814k19887k75553l20848l53368l63056l58797l36364l02236k59714
8747G660991k25608j88578j44840j14080j03992r3775o8491l5637J7160Q4050
$$ plain form
8737 6787200 6922236 7062732 7170634 7193335 7089595 6845475 6481423 6035719 5579081 5155164
8727 5155164 4781800 4471799 4229732 4057272 3951349 3890510 3879306 3915780 3995303 4113152
8717 4113152 4248531 4399056 4555053 4682716 4768987 4791971 4746383 4627695 4443626 4223964
8707 4223964 4008541 3819480 3645496 3466162 3326401 3228548 3169220 3144211 3113510 3093834
8697 3093834 3123013 3183011 3247440 3293828 3300459 3252909 3140135 2962260 2741880 2508365 2292475
8686 2292475 2106185 1962376 1844857 1745769 1661246 1596143 1550920 1528393 1526201 1540044 1564562
8675 1564562 1610280 1668780 1732522 1799199 1860101 1882741 1868111 1821881 1750625 1659082 1567644
8664 1567644 1490388 1431863 1393899 1365753 1346439 1330073 1321475 1314870 1303234 1276098 1241746 1194074
$$ packed form
8737F787200J35036J40496J07902K2701j03740k44120l64052m45704m56638m23917
8727E155164l73364l10001k42067j72460j05923o0839j1204L6474P9523J17849
8717D113152J35379J50525J55997J27663Q6271K2984m5588j18688j84069k19662
8707D223964k15423j89061j73984j79334j39761r7853n9328k5009l0701j9676
8697C093834K9179N9998O4429M6388O631m7550j12774j77875k20380k33515k15890
8686B292475j86290j43809j17519r9088q4523o5103m5223k2527k192J3843K4518
8675A564562M5718N8500O3742O6677O0902K2640j4630m6230p1256r1543r1438
8664A567644p7256n8525l7964k8146j9314j6366q598o605j1636k7136l4352m7672
$$ plain form
8652 1194074 1151017 1107891 1064530 1034071 1011032 994720 990800 992925 994697 996998 1006090 1031096
8640 1031096 1067015 1098854 1119886 1133145 1140341 1142530 1143462 1145661 1142920 1132718 1116325 1100358 1079792
8627 1079792 1056620 1026170 996490 967975 950964 942752 938596 937303 937610 932521 922171 913475 899789
8614 899789 878458 852025 829825 807074 781103 757841 748563 750584 754474 744759 730517 715305
8602 715305 700619 684502 671325 664729 662428 665528 662361 662434 667211 666567 669844 673751 671386 666872
8588 666872 658495 656896 660576 663587 656306 642226 635316 636509 636561 637217 636175 634059 630090 625943 621787
8573 621787 591514 555122 544090 537724 529694 530536 529263 513286 498401 487206 478022 474956 469590
8560 469590 466230 461597 456029 451591 454003 450372 448797 443979 438975 429977 413621 394973 381251 369101
$$ packed form
8652A194074m3057m3126m3361l0459k3039j6312l920K125J772K301R092K5006
8640A031096L5919L1839K1032J3259P196K189R32K199k741j0202j6393j5967k0566
8627A079792k3172l0450k9680k8515j7011q212m156j293L07n089j0350q696j3686
8614H99789k1331k6433k2200k2751k5971k3262r278K021L890r715j4242j5212
8602G15305j4686j6117j3177o596k301L100l167P3M777o44L277L907k365m514
8588F66872q377j599L680L011p281j4080o910J193N2O56j042k116l969m147m156
8573F21787l0273l6392j1032o366q030Q42j273j5977j4885j1195r184l066n366
8560D69590l360m633n568m438K412l631j575m818n004q998j6356j8648j3722j2150
$$ plain form
8546 369101 359966 350314 346108 337538 336483 334973 335046 333163 330726 330442 329509 332164 335800 343966 345566
8531 345566 347304 349553 348763 348291 352400 356730 362529 369745 374787 376132 378114 374455 380351 392552 400432
8516 400432 404125 407920 407568 409273 411908 415728 420632 419890 410006 397814 385825 376388 368496 358412
8502 358412 340419 305931 259711 239733 251712 279131 306404 327670 348515 367388 378347 385163
8490 385163 393840 400407 405515 409920 414707 419979 416278 414631 415566 415797 412351 402827 400087 405657 412775
8475 412775 422798 423083 422512 417797 413767 411599 411671 417848 420246 421660 421842 427572 427726 426584 429952 435362
8459 435362 438737 445950 444914 448194 458123 464664 471521 480293 480822 482883 490796 501616 514262 528243
8445 528243 540996 561359 581585 608220 636167 670101 709427 748739 789610 844670 920736 1012464
$$ packed form
8546C69101r135r652m206q570j055j510P3j883k437k84r33K655L636Q166J600
8531C45566J738K249p90m72M109M330N799P216N042J345J982l659N896J2201P880
8516D00432L693L795l52J705K635L820M904p42r884j2192j1989r437p892j0084
8502C58412j7993l4488m6220j9978J1979K7419K7273K1266K0845J8873J0959O816
8490C85163Q677O567N108M405M787N272l701j647R35K31l446r524k740N570P118
8475D12775J0023K85n71m715m030k168P2O177K398J414J82N730J54j142L368N410
8459D35362L375P213j036L280R929O541O857Q772N29K061P913J0820J2646J3981
8445E28243J2753K0363K0226K6635K7947L3934L9326L9312M0871N5060P6066R1728
$$ plain form
8433 1012464 1119696 1245270 1399298 1571938 1762778 1961829 2159029 2332837 2464611 2555634
8423 2555634 2595536 2574779 2495170 2369605 2218953 2052628 1884516 1728043 1593420 1479491
8413 1479491 1388283 1321246 1273593 1239964 1221235 1210813 1216310 1229989 1247429 1271041 1303174 1343293
8401 1343293 1388528 1437806 1481103 1525464 1570550 1614439 1661241 1719338 1783322 1859861 1952521
8390 1952521 2058685 2176751 2323781 2505104 2718045 2965080 3259028 3591891 3976091 4413988
8380 4413988 4899469 5418148 5926721 6383956 6734506 6937167 6970154 6840363 6581289 6234685
8370 6234685 5846438 5459090 5093877 4768484 4494606 4270081 4090877 3966963 3890193 3861326
8360 3861326 3874589 3925057 4021486 4165128 4361467 4610434 4909673 5258791 5657477 6083691
$$ packed form
8433A012464J07232J25574J54028J72640J90840J99051J97200J73808J31774R1023
8423B555634L9902k0757p9609j25565j50652j66325j68112j56473j34623j13929
8413A479491r1208o7037m7653l3629j8729j0422N497J3679J7440K3612L2133M0119
8401A343293M5235M9278M3297M4361M5086M3889M6802N8097O3984P6539R2660
8390A952521J06164J18066J47030J81323K12941K47035K93948L32863L84200M37897
8380D413988M85481N18679N08573M57235L50550K02661L2987j29791k59074l46604
8370F234685l88247l87348l65213l25393k73878k24525j79204j23914p6770k8867
8360C861326J3263N0468R6429J43642J96339K48967K99239L49118L98686M26214
$$ plain form
8350 6083691 6505330 6880475 7176395 7336855 7343436 7197551 6926765 6573066 6183774 5789582
8340 5789582 5416522 5081532 4786998 4540972 4331636 4161759 4030581 3940798 3882714 3850971
8330 3850971 3844482 3855682 3881637 3918278 3961474 4016251 4079540 4152235 4240366 4346267 4462678
8319 4462678 4596819 4738542 4898465 5072334 5258776 5468025 5713972 6012159 6371100 6788225
8309 6788225 7278312 7848971 8487788 9195753 9955525 10748790 11542635 12316490 13061627 13760690
8299 13760690 14399927 14964605 15425297 15746228 15891623 15852848 15611116 15190579 14627028 13973221
8289 13973221 13280830 12621789 12046764 11586467 11258947 11064559 11006253 11090246 11300677 11627357
8279 11627357 12064699 12586551 13189883 13853673 14550188 15259894 15961258 16637561 17282059
$$ packed form
8350F083691M21639L75145K95920J60460O581j45885k70786l53699l89292l94192
8340E789582l73060l34990k94534k46026k09336j69877j31178q9783n8084l1743
8330C850971o489J1200K5955L6641M3196N4777O3289P2695Q8131J05901J16411
8319D462678J34141J41723J59923J73869J86442K09249K45947K98187L58941M17125
8309F788225M90087N70659O38817P07965P59772P93265P93845P73855P45137O99063
8299A3760690O39237N64678M60692L20931J45395l8775k41732m20537n63551o53807
8289A3973221o92391o59041n75025m60297l27520j94388n8306Q3993K10431L26680
8279A1627357M37342N21852O03332O63790O96515P09706P01364O76303O44498
$$ plain form
8270 17282059 17858447 18349453 18713379 18905729 18914784 18742199 18407422 17964209 17461616 16968164
8260 16968164 16541308 16217966 16027211 15991831 16112383 16386464 16799176 17355359 18044023 18862261
8250 18862261 19810264 20885804 22085181 23404088 24847729 26416870 28101677 29898202
8242 29898202 31785937 33747262 35749706 37738249 39665726 41467418 43075990 44429377
8234 44429377 45464307 46151005 46468564 46421737 46037040 45369700 44478561 43419083 42255167
8225 42255167 41021851 39754210 38477830 37204726 35951255 34717904 33502959 32321210
8217 32321210 31163371 30024123 28905649 27793254 26688639 25603017 24545935 23552920
8209 23552920 22665274 21944285 21434913 21183676 21241660 21656324 22489379 23767702 25424905
$$ packed form
8270A7282059N76388M91006L63926J92350R055j72585l34777m43213n02593m93452
8260A6968164m26856l23342j90755l5380J20552K74081M12712N56183O88664Q18238
8250A8862261R48003J075540J199377J318907J443641J569141J684807J796525
8242B9898202J887735J961325K002444J988543J927477J801692J608572J353387
8234D4429377J034930O86698L17559m6827l84697o67340q91139j059478j163916
8225D2255167j233316j267641j276380j273104j253471j233351j214945j181749
8217C2321210j157839j139248j118474j112395j104615j085622j057082r93015
8209B3552920q87646p20989n09372k51237N7984M14664Q33055J278323J657203
$$ plain form
8200 25424905 27234273 28851372 29766343 29441097 27956278 25992913 24169925 22722569
8192 22722569 21604824 20702206 19919783 19195341 18482413 17744457 16975999 16165925 15309611
8183 15309611 14419221 13522532 12655641 11849512 11134789 10525492 10020492 9611061 9286971
8174 9286971 9038244 8849815 8711180 8623509 8586298 8601217 8692998 8893696 9240784 9777394
8164 9777394 10570649 11656352 13043507 14626602 16117250 17145109 17184001 15964884 13952351
8155 13952351 11888854 10220696 9028637 8210232 7657952 7294363 7068458 6931148 6870944
8146 6870944 6880442 6938483 7019815 7091711 7128518 7103974 7000920 6806049 6525381 6186350 5826588
8135 5826588 5476955 5150430 4854324 4601906 4395059 4225969 4093939 3996938 3933021 3893675
$$ packed form
8200B5424905J809368J617099R14971l25246j484819j963365j822988j447356
8192B2722569j117745r02618p82423p24442p12928p37956p68458q10074q56314
8183A5309611q90390q96689q66891q06129p14723o09297n05000m09431l24090
8174I286971k48727j88429j38635q7671l7211J4919R1781K00698L47088N36610
8164I777394P93255J085703J387155J583095J490648J027859L8892j219117k012533
8155A3952351k063497j668158j192059q18405n52280l63589k25905j37310o0204
8146F870944R498N8041Q1332P1896L6807k4544j03054j94871k80668l39031l59762
8135E826588l49633l26525k96106k52418k06847j69090j32030r7001o3917l9346
$$ plain form
8125 3893675 3883280 3900586 3943259 4005334 4099471 4220398 4363379 4521173 4682956 4843400
8115 4843400 4989078 5096861 5138753 5096460 4957960 4727838 4431850 4094634 3751355 3426581
8105 3426581 3138221 2882140 2660018 2473016 2312961 2171799 2052639 1948469 1856490 1773707
8095 1773707 1702598 1636454 1577881 1522662 1472009 1424134 1384453 1348193 1308841 1272060 1237322
8084 1237322 1206687 1180741 1151529 1124499 1102546 1084702 1065838 1045097 1022383 1002578 987261
8073 987261 969142 948953 923092 902679 888185 872566 853038 830048 814226 802651 791515 780013
8061 780013 766124 746914 730335 719023 707074 696693 682975 665510 653847 643937 633961 630800
8049 630800 623521 613189 607017 599028 594514 586519 582387 575026 569670 566455 563743 558100 557287 558456
$$ packed form
8125C893675j0395J7306M2673O2075R4137J20927J42981J57794J61783J60444
8115D843400J45678J07783M1892m2293j38500k30122k95988l37216l43279l24774
8105C426581k88360k56081k22122j87002j60055j41162j19160j04170r1979q2783
8095A773707p1109o6144n8573n5219n0653m7875l9681l6260l9352l6781l4738
8084A237322l0635k5946k9212k7030k1953j7844j8864k0741k2714j9805j5317
8073I87261j8119k0189k5861k0413j4494j5619j9528k2990j5822j1575j1136j1502
8061G80013j3889j9210j6579j1312j1949j0381j3718j7465j1663r910r976l161
8049F30800p279j0332o172p989m514p995m132p361n356l215k712n643q13J169
$$ plain form
8035 558456 554003 544979 538527 534635 525191 524623 523884 515222 499816 492934 486982 476771 473627 468755
8021 468755 461719 457758 452704 449336 441454 437718 432153 425256 417971 413613 415715 416951 417936 410694 409211
8006 409211 402128 398213 396992 392162 388401 383758 375836 377061 375336 366003 364811 367375 370540 371506 369688
7991 369688 371078 372753 373648 371548 368013 361637 358780 357948 361417 361298 358159 358305 356456 355003 359386
7976 359386 358699 354958 355851 365545 372961 379727 385926 387858 386064 380136 376785 367334 359109 349007 339767
7961 339767 335466 329594 326631 324452 317902 314609 316667 315380 309694 304759 305570 305958 307893 305557 302079
7946 302079 299198 291540 284642 279214 275657 277346 278295 276151 274153 275717 282276 286939 291330 298805 308427
7931 308427 315720 318457 319252 314917 306485 292319 278572 267831 261097 260067 258221 258483 265105 268553
$$ packed form
8035E58456m453r024o452l892r444n68p39q662j5406o882n952j0211l144m872
8021D68755p036l961n054l368p882l736n565o897p285m358K102J236R85p242j483
8006D09211p083l915j221m830l761m643p922J225j725r333j192K564L165R66j818
7991C69688J390J675Q95k100l535o376k857q32L469j19l139J46j849j453M383
7976C59386o87l741Q93R694P416O766O199J932j794n928l351r451q225j0102r240
7961C39767m301n872k963k179o550l293K058j287n686m935Q11L88J935k336l478
7946C02079k881p658o898n428l557J689R49k144j998J564O559M663M391P475R622
7931C08427P293K737P95m335q432j4166j3747j0741o734j030j846K62O622L448
$$ plain form
7917 268553 262941 259943 259376 261355 254285 249558 240244 234901 235714 237372 237130 237649 239534 241028 240931 241413
7901 241413 244198 246657 247901 249710 247221 246698 240769 237416 239239 236672 234835 231668 230799 227751 221664
7886 221664 218972 221539 219592 217847 216710 214948 213514 216246 217356 217419 216126 216809 221009 223362 223076
7871 223076 223313 221166 218817 216276 214883 210246 206952 203464 200546 197102 188961 182042 175767 169825 162128
7856 162128 159198 166686 167728 165309 167125 160580 155828 155316 160948 161617 162069 160534 158343 157848 157831 160283
7840 160283 160137 158323 151095 145120 143729 145078 152296 151990 147877 144731 147777 148935 152328 156318 156317 159847
7824 159847 160640 163891 168459 169259 173379 175201 171986 167602 172452 179048 176336 177117 177478 179899 182482
7809 182482 180147 173043 168172 169343 171402 176379 180031 182967 190672 194118 193870 192087 189563 185910 183069
$$ packed form
7917B68553n612k998n67J979p070m727r314n343Q13J658k42N19J885J494r7M82
7901B41413K785K459J244J809k489n23n929l353J823k567j837l167q69l048o087
7886B21664k692K567j947j745j137j762j434K732J110O3j293O83M200K353k86
7871B23076K37k147k349k541j393m637l294l488k918l444q141o919o275n942p697
7856A62128k930P488J042k419J816o545m752n12N632O69M52j535k191m95j7K452
7840A60283j46j814p228n975j391J349P218l06m113l146L046J158L393L990jL530
7824A59847P93L251M568Q00M120J822l215m384M850O596k712P81L61K421K583
7809A82482k335p104m871J171K059M977L652K936P705L446k48j783k524l653k841
$$ plain form
7794 183069 182132 178169 175717 176455 175347 170582 172301 169038 164596 162939 159040 153110 144048 133571 135478
7779 135478 136111 137519 138744 135116 131844 129547 134760 135353 130936 128474 132377 131696 129313 131877 139239
7764 139239 147105 153200 157657 157679 158559 156120 149642 145938 139882 133039 126915 118481 114713 109199 103632
7749 103632 107791 103978 100315 99919 97549 99358 101545 103256 104917 107728 104119 104556 107407 108508 109797
7734 109797 112531 111904 107984 105284 100676 96371 88363 82720 85562 92499 92429 90286 88622 85656 80945
7719 80945 80384 82053 83705 86933 91502 91210 90257 87711 85087 86510 84583 84762 87524 91197 93663 91258
7703 91258 85291 82281 79957 74317 77617 80227 83093 84960 80962 78448 73806 70393 66266 67738 66802
7688 66802 69796 69666 66989 63314 58930 57819 60958 65990 66234 65783 65451 63635 60331 55598 56309 60332
$$ packed form
7794A83069r37l963k452P38j108m765J719l263m442j657l899n930r062j0477J907
7779A35478O33J408J225l628l272k297N213N93m417k462L903o81k383K564P362
7764A39239P866O095M457K2Q80k439o478l704o056o843o124q434l768n514n567
7749A03632M159l813l663l96k370J809K187J711J661K811l609M37K851J101J289
7734A09797K734o27l920k700m608m305q008n643K842O937p0k143j664k966m711
7719H0945n61J669J652L228M569k92r53k546k624J423j927J79K762L673K466k405
7703I1258n967l010k324n640L300K610K866J867l998k514m642l413m127J472r36
7688F6802K994j30k677l675m384j111L139N032K44m51l32j816l304m733P11M023
$$ plain form
7672 60332 58307 57291 58141 57464 54458 54726 54086 52180 51821 53583 54678 60256 59279 61248 57817 53954
7656 53954 54485 50227 53102 57228 58337 54568 47591 46716 45787 48288 47120 42958 45664 48391 51189
7641 51189 52237 52707 49745 46192 42877 41955 45440 46334 44972 45335 47694 46237 41671 45408 45458 48855
7625 48855 52955 51390 48967 47611 45374 38921 41711 39663 39896 39366 39289 38378 42700 47261 47118 43335
7609 43335 44572 49227 52461 50651 50529 52052 52322 45164 43707 45663 49989 47277 44848 50583 54515
7594 54515 55385 48505 46629 43467 44438 43072 40861 41281 42391 42890 45645 47992 47621 48718 51021 47277
7578 47277 48405 48229 40833 37466 39636 40688 40844 41440 46165 49862 46075 37518 33362 33174 39754 42187
7562 42187 40637 44686 45747 47525 46028 43376 41444 40045 35272 34155 38728 35451 31217 33591 36089
$$ packed form
7672F0332k025j016Q50o77l006K68o40j906l59J762J095N578r77J969l431l863
7656E3954N31m258K875M126J109l769o977q75r29K501j168m162K706K727K798
7641E1189J048M70k962l553l315r22L485Q94j362L63K359j457m566L737N0L397
7625D8855M100j565k423j356k237o453K790k048K33n30p7r11M322M561j43l783
7609D3335J237M655L234j810j22J523K70p158j457J956M326k712k429N735L932
7594E4515Q70o880j876l162R71j366k211M20J110M99K755K347l71J097K303l744
7578D7277J128j76p396l367K170J052J56N96M725L697l787q557m156j88O580K433
7562D2187j550M049J061J778j497k652j932j399m773j117M573l277m234K374K498
$$ plain form
7547 36089 37489 35081 33661 33391 30281 31480 34393 35070 32691 32583 34967 30452 25148 29161 28593 33884
7531 33884 35932 35030 36419 38528 34782 34723 35459 35534 35460 34085 33355 31764 32096 41129 43447 37272 35145
7514 35145 38129 37510 36367 36464 35159 36900 41619 44366 46155 42298 31865 32302 31642 26920 29808 28588
7498 28588 23479 23223 31637 33364 32001 28336 29480 32535 38669 38055 35902 36635 37210 36420 40722 36347
7482 36347 31929 27195 27687 24800 21913 22939 28749 31957 33014 32700 35666 37532 32242 33281 32705
7467 32705 34519 36054 30774 27696 25952 25737 29537 31096 33446 32368 30626 32636 30190 27901 28793
7452 28793 27813 27965 27295 26741 26460 29699 26393 28083 26755 24299 23226 18542 21956 25621 26013 24033
7436 24033 22043 24573 31364 32738 28517 28123 25646 26097 27315 27753 25164 25075 22589 21776 22641 26008
$$ packed form
7547C6089J400k408j420k70l110J199K913O77k379j08K384m515n304M013n68N291
7531C3884K048r02J389K109l746n9P36P5p4j375p30j591L32R033K318o175k127
7514C5145K984o19j143R7j305J741M719K747J789l857j0433M37o60m722K888j220
7498B8588n109k56Q414J727j363l665J144L055O134o14k153P33N75p90M302m375
7482C6347m418m734M92k887k887J026N810L208J057l14K966J866n290J039n76
7467C2705J814J535n280l078j744k15L800J559K350j078j742K010k446k289Q92
7452B8793r80J52o70n54k81L239l306J690j328k456j073m684L414L665L92j980
7436B4033j990K530O791J374m221l94k477M51J218M38k589q9k486q13Q65L367
$$ plain form
7420 26008 27215 23426 23730 25365 22803 19924 20607 29440 29545 30954 28283 25641 20350 20375 24021 21553
7404 21553 18988 22139 22548 22825 20622 14993 18736 19830 19532 19108 20276 22799 27944 29472 24864 20408
7388 20408 21302 26851 26006 29043 27049 27240 27015 26534 28419 30986 23990 19071 17159 18582 19839 25336
7372 25336 22130 22604 20935 19644 20012 15990 12259 13055 18094 24984 26335 21465 21705 25694 30601 29548
7356 29548 24624 22668 21031 20666 21396 25830 23730 23501 26235 26449 22930 21306 22429 19981 18481 26535
7340 26535 27851 29918 26613 24888 19179 17916 19937 23512 27773 26581 23189 20408 18917 20990 22786
7325 22786 22834 19522 16081 11482 11459 12252 16650 18307 17304 16765 17096 19399 18562 15448 18022 22695 24852
7308 24852 22682 20003 18706 14650 15220 14825 14967 12734 6537 10386 14442 15854 20983 26517 24060
$$ packed form
7420B6008J207l789L04J635k562k879O83Q833J05J409k671k642n291K5L646k468
7404B1553k565L151M09K77k203n629L743J094k98m24J168K523N145J528m608m456
7388B0408Q94N549q45L037j994J91k25m81J885K567o996m919j912J423J257N497
7372B5336l206M74j669j291L68m022l731P96N039O890J351m870K40L989M907j053
7356B9548m924j956j637l65P30M434k100k29K734K14l519j624J123k448j500Q054
7340B6535J316K067l305j725n709j263K021L575M261j192l392k781j491K073J796
7325B2786M8l312l441m599k3P93M398J657j003n39L31K303q37l114K574M673K157
7308B4852k170k679j297m056N70l95J42k233o197L849M056J412N129N534k457
$$ plain form
7293 24060 22790 17359 18335 22576 21723 18888 15984 15874 17335 22107 22801 22860 21426 17271 14932 15289
7277 15289 16779 19649 18746 13722 13935 9440 7057 6620 6002 11884 17307 17813 20613 17165 13491 14055
7261 14055 18806 18861 23097 22951 21453 18400 21855 25734 28031 24816 21939 21233 20423 21239 23389 22708
7245 22708 22243 23672 24956 26425 24092 17785 16637 13266 12944 12269 11966 14913 20890 22268 23862 21207
7229 21207 17406 16823 17702 17994 13433 16700 19042 22104 24997 24502 19127 18178 15494 14710 15286 15601 17183
7212 17183 21924 22101 12462 7236 7589 10249 11025 12847 10325 9238 9310 9072 13753 11476 12500 11240
7196 11240 14127 21079 20485 14676 17460 13354 13435 13557 17238 20559 23315 24577 21321 21377 21433 16163 14828
7179 14828 16115 16727 14045 12487 6852 7259 11111 8935 9648 10673 10210 12703 15427 15477 16158 17276
$$ packed form
7293B4060j270n431R76M241q53k835k904j10J461M772O94N9j434m155k339L57
7277A5289J490K870r03n024K13m495k383m37o18N882N423N06K800l448l674N64
7261A4055M751N5M236j46j498l053L455L879K297l215k877p06q10Q16K150o81
7245B2708m65J429J284J469k333o307j148l371l22o75l03K947N977J378J594k655
7229B1207l801n83Q79K92m561L267K342L062K893m95n375r49k684p84N76L15J582
7212A7183M741J77r639n226L53K660P76J822k522j087P2k38M681k277J024j260
7196A1240K887O952n94n809K784m106Q1J22L681L321K756J262l256N6N6n270j335
7179A4828J287O12k682j558n635M07L852k176P13J025m63K493K724N0O81J118
$$ plain form
7163 17276 21313 15789 11148 8199 5919 6828 11095 12450 12432 12416 7831 3531 9289 12126 12062 14618
7147 14618 16601 13851 17040 16844 9884 8080 7220 4637 9154 10617 4035 3024 1783 4289 5372
7132 5372 6161 11475 17788 16000 12509 10239 14566 15629 14772 13620 15499 11127 8388 12222 8005
7117 8005 7420 7476 6956 4427 5602 10312 12887 10536 11167 11242 10128 13910 12843 13148 14832 17306 13335
7100 13335 6682 3556 2761 6400 9059 10942 16076 17131 13647 10162 13312 14672 14403 15670 17028
7085 17028 12724 8004 8327 8884 6389 3846 1621 2677 -1520 2472 5333 8728 9621 13670 15343
7070 15343 15040 12922 5848 6548 8458 10333 17106 19601 29447 31529 33442 27757 23188 16298 10346
7055 10346 6710 9418 11324 6333 9424 14542 17414 18921 15910 13649 14934 13094 15429 13412 11051
$$ packed form
7163A7276M037n524m641k949k280R09M267J355j8j6m585m300N758K837o4K556
7147A4618J983k750L189j96o960j804q60k583M517J463o582j011j241K506J083
7132E372P89N314O313j788l491k270M327J063q57j152J879m372k739L834m217
7117H005n85N6n20k529J175M710K575k351O31P5j114L782j067L05J684K474l971
7100A3335o653l126p95L639K659J883N134J055l484l485L150J360k69J267J358
7085A7028m304m720L23N57k495k543k225J056m197L992K861L395Q93M049J673
7070A5343l03k118p074P00J910J875O773K495R846K082J913n685m569o890n952
7055A0346l636K708J906m991L091N118K872J507l011k261J285j840K335k017k361
$$ plain form
7040 11051 10366 8978 8228 5358 5098 9885 9376 7617 11292 13313 19508 13052 7341 3899 1121 5304
7024 5304 6455 5403 7612 16254 21550 25798 28307 25155 19353 13945 11552 9928 9690 12353 11258
7009 11258 7331 6179 4602 4022 1392 2607 3577 4877 6345 7676 4899 6845 5863 6589 11223 14282
6993 14282 14432 10384 4448 2227 4273 3475 2596 643 -2440 -5342 444 7599 7427 6535 5736 4809
6977 4809 6060 8459 12015 13891 10366 11819 13958 12872 12463 8613 7770 8179 8128 7346 8673 10101
6961 10101 12566 6711 5091 6856 4788 7419 10869 8829 5956 6079 4343 6869 13273 15750 10123
6946 10123 11389 17877 17018 16508 12602 10924 11960 14452 13305 9892 8984 5407 6882 7154 7872 9771
6930 9771 11524 11786 9373 10051 8740 7710 8557 5104 6652 6845 6942 2782 1996 2137 2658 2976 6536
$$ packed form
7040A1051o85j388p50k870k60M787n09j759L675K021O195o456n711l442k778M183
7024E304J151j052K209Q642N296M248K509l152n802n408k393j624k38K663j095
7009A1258l927j152j577n80k630J215R70J300J468J331k777J946r82P26M634L059
6993A4282J50m048n936k221K046p98q79j953l083k902N786P155j72q92p99r27
6977D809J251K399L556J876l525J453K139j086m09l850q43M09n1p82J327J428
6961A0101K465n855j620J765k068K631L450k040k873J23j736K526O404K477n627
6946A0123J266O488q59n10l906j678J036K492j147l413r08l577J475K72P18J899
6930I771J753K62k413O78j311j030Q47l453J548J93R7m160p86J41N21L18L560
$$ plain form
6913 6536 7416 12047 7921 2362 3618 7971 10345 13702 13960 11729 8188 3478 1666 4369 11571
6898 11571 14443 14346 12632 13040 13007 13603 15323 14553 8870 3551 4028 -338 -2600 -1062 5860 9204 11432
6881 11432 14274 14944 12352 11088 11023 7900 6732 8346 12596 13010 12426 8111 9026 10875 12294 10588
6865 10588 9963 6706 2874 1304 5767 8025 8065 9603 5266 2282 10554 12304 9703 9822 8560 8792
6849 8792 10275 8303 5586 5574 6876 8367 9884 9472 10664 8530 9279 9667 8717 13603 7978 4285
6833 4285 5628 7719 9672 7458 5327 5802 6757 3735 2793 3570 4532 6620 8309 9616 8247 3233
6817 3233 7370 7247 7735 7046 2700 3993 11792 12591 8890 1994 -1825 -1722 4876 4288 1941 411
6801 411 5252 1108 -172 -1871 -4213 -2436 1663 1384 4664 6747 4076 5833 8034 7824 8033 8269
$$ packed form
6913F536Q80M631m126n559J256M353K374L357K58k231l541m710j812K703P202
6898A1571K872r7j714M08l3N96J720p70n683n319M77m366k262J538O922L344K228
6881A1432K842O70k592j264o5l123j168J614M250M14n84m315R15J849J419j706
6865A0588o25l257l832j570M463K258M0J538m337k984Q272J750k601J19j262K32
6849H792J483j972k717j2J302J491J517m12J192k134P49L88r50M886n625l693
6833D285J343K091J953k214k131M75R55l022r42P77R62K088J689J307j369n014
6817C233M137j23M88o89m346J293P799P99l701o896l819J03O598n88k347j530
6801D11M841m144j280j699k342J777M099k79L280K083k671J757K201k10K09K36
$$ plain form
6785 8269 8251 11846 15160 10098 9127 6832 3413 2503 1980 2744 1689 6231 3549 5721 8078 10092
6769 10092 11357 8456 8076 8268 5565 5410 6664 4991 2691 686 2661 3125 -304 6662 10827 5489
6753 5489 3523 1855 -1103 -3542 -829 4203 5455 3718 5419 5336 5771 8226 11731 13074 6830 2868
6737 2868 2770 3523 7580 10148 5057 -153 -6524 3490 6658 3604 3154 10249 11186 8774 3145 5439
6721 5439 15031 15776 10308 10937 12506 11203 3000 7165 7450 5598 1796 -614 640 705 2283 6333
6705 6333 6691 8329 10194 11100 7006 1915 2364 289 1123 1134 2145 2756 2147 1443 902 2315 6507
6688 6507 5617 150 -5061 -2726 -1777 980 5201 6824 2857 499 3092 5140 9691 10517 5861 6280
6672 6280 4943 5540 5711 5482 8010 12549 11416 12756 14585 10583 5842 3553 8086 10044 15297 16551
$$ packed form
6785H269j8L595L314n062r71k295l419r10n23P64j055M542k682K172K357K014
6769A0092J265k901l80J92k703j55J254j673k300k005J975M64l429O966M165n338
6753E489j966j668k958k439K713N032J252j737J701q3M35K455L505J343o244l962
6737B868r8P53M057K568n091n210o371J0014L168l054m50P095R37k412n629K294
6721E439R592P45n468O29J569j303q203M165K85j852l802k410J254O5J578M050
6705F333L58J638J865R06m094n091M49k075Q34J1J011O11o09p04n41J413M192
6688F507q90n467n211K335R49K757M221J623l967k358K593K048M551Q26m656M19
6672F280j337N97J71k29K528M539j133J340J829m002m741k289M533J958N253J254
$$ plain form
6656 16551 14317 15006 14740 18140 21035 21624 17955 15921 14313 14367 16610 15894 16515 15627 12010 13497 16105
6639 16105 19481 20523 20518 19676 16197 9937 7565 10100 10940 10548 10530 14611 15376 18659 20070 16568 13450
6622 13450 12913 10124 11208 14395 9825 8007 5247 5118 3798 7151 6479 5786 4934 6377 2525 1906
6606 1906 -214 550 4173 6297 3030 1562 3918 4482 1123 3847 4189 2398 -3541 -2996 -159 919
6590 919 6289 6003 6081 1492 -1194 -1038 3238 4681 5100 4548 4231 4940 2567 4914 4485 4971 5039 5773
6572 5773 7680 7617 6606 6402 2970 4163 3639 2376 -1476 26 1103 5733 4619 2539 1926 3044
6556 3044 6199 7009 5449 3315 2649 -1158 -1442 108 -229 -1378 -2900 -816 1632 3510 5404 7784
6540 7784 7021 5091 4302 3044 5856 4954 3530 5783 7514 4983 360 -322 2715 3803 2641 4121
$$ packed form
6656A6551k234O89k66L400K895N89l669k034j608N4K243p16O21q88l617J487K608
6639A6105L376J042nq42l479o260k372K535Q40l92j8M081P65L283J411l502l118
6622A3450n37k789J084L187m570j818k760j29j320L353o72o93q52J443l852o19
6606A906k120P64L623K124l267j468K356N64l359K724L42j791n939N45K837J078
6590I19N370k86P8m589k686J56M276J443M19n52l17P09k373K347m29M86O8P34
6572E773J907o3j011k04l432J193n24j263l852J502J077M630j114k080o13J118
6556C044L155Q10j560k134o66l807k84J550l37j149j522K084K448J878J894K380
6540G784p63j930p89j258K812r02j424K253J731k531m623o82L037J088j162J480
$$ plain form
6524 4121 5350 6364 1969 2181 6975 9681 9711 8582 2743 3412 5005 4510 3632 3549 4844 4306 3718
6507 3718 4111 3812 2169 5550 10900 6496 4465 4048 4097 3988 1478 4832 2366 -5163 -1565 1743
6491 1743 -654 -1066 -660 499 -1832 -438 1118 2966 6170 12093 9050 2083 -2625 -2876 815 4851
6475 4851 3698 1416 -570 -1658 -641 3243 3247 250 133 4454 4724 1352 -2125 -5053 -2984 -889
6459 -889 300 -1884 -2848 -6522 -6090 -5613 -1858 2657 7997 6201 4395 4768 9564 9189 5108 4928 6095
6442 6095 -1282 -6473 -3581 -681 -22 -2965 -5023 -4499 -2409 1103 2172 2434 2977 400 4609 3080
6426 3080 1335 -2569 -2554 2883 4785 1214 5864 10141 10863 5631 2763 1986 1653 920 1115 2489 4133
6409 4133 2243 3325 4537 1975 -2014 -3470 269 8458 9912 8844 6411 4235 6852 11668 6371
$$ packed form
6524D121J229J014m395K12M794K706L0j129n839O69J593m95q78q3J295n38n88
6507C718L93k99j643L381N350m404k031m17M9j09k510L354k466p529L598L308
6491A743k397m12M06J159k331J394J556J848L204N923l043o967m708k51L691M036
6475D851j153k282j986j088J017L884Mk997j17M321K70l372l477k928K069K095
6459h89J189k184r64l674M32M77L755M515N340j796j806L73M796l75m081j80J167
6442F095p377n191K892K900O59k943k058N24K090L512J069K62N43k577M209j529
6426C080j745l904J5N437J902l571M650M277P22n232k868p77l33p33J95J374J644
6409D133j890J082J212k562l989j456L739Q189J454j068k433k176K617M816n297
$$ plain form
6394 6371 4665 847 -236 687 -1920 -1967 -1218 833 -331 -1072 1036 5259 14531 15694 6100 536
6378 536 -546 7204 10653 5197 4193 208 1513 1643 -1761 -3152 -5412 -4384 -8255 -6274 -929
6363 -929 976 4355 4586 2919 2337 2485 5733 3249 2024 4227 6281 6762 4977 -2481 -1976 -694
6347 -694 -1248 -4212 -5125 496 2347 -3726 -9847 -11515 -10354 -7808 -6356 -7868 -9161 -10836 -5700 1900
6331 1900 4143 944 733 758 -2167 -1032 301 -4282 -1257 4645 3960 3404 -668 -4132 -7894 -10114
6315 -10114 -7751 -5137 -3596 -3090 1717 2270 228 -847 -2481 954 1035 6545 9842 2621 -2484 -3915
6299 -3915 -1141 937 2393 2220 3214 3839 704 -736 1403 2602 -6 -1159 1353 -2142 -8985 -9429
6283 -9429 -3243 -1279 -157 2068 3529 7932 10923 5862 3716 6236 10323 12498 12914 14842 10929
$$ packed form
6394F371j706l818j083R23k607m7P49K051j164p41K108M223R272J163r594n564
6378E36j082P750L449n456j004l985J305J30l404j391k260J028l871J981N345
6363i29J905L379K31j667n82J48L248k484j225K203K054M81j785p458N05J282
6347f94n54k964r13N621J851o073o121j668J161K546J452j512j293j675N136P600
6331A900K243l199k11K5k925J135J333m583L025N902o85n56m072l464l762k220
6315a0114K363K614J541N06M807N53k042j075j634L435Q1N510L297p221n105j431
6299c915K774K078J456j73R94O25l135j440K139J199k608j153K512l495o843m44
6283i429O186J964J122K225J461M403K991n061k146K520M087K175M16J928l913
$$ plain form
6268 10929 9308 6777 4006 2044 6083 3341 2552 2505 -1505 537 4116 9600 13091 5414 6630
6253 6630 7431 6898 5121 7038 8701 8552 5148 1498 587 4643 6046 6435 4417 1794 -492 -2090
6237 -2090 -2244 -767 -2034 -6819 -4901 -2646 -9248 -15644 -13007 -7527 -644 97 -1261 -3482 -4639
6222 -4639 -4750 -2458 -3589 -2933 -2713 -361 1338 -1392 -2095 132 -1737 2000 4950 -201 -3230 795
6206 795 3921 2493 3030 1078 -833 5830 9373 4544 2572 2979 2399 4562 5627 687 -2342 -926
6190 -926 914 2492 3727 4727 3776 4360 3845 85 -1820 -2016 1196 1293 1125 -1093 -2796 4426 6044
6173 6044 3095 488 -413 -587 -885 -2375 -357 709 1863 4152 3765 2364 -4606 -5620 290 3455
6157 3455 3081 4494 7839 11167 10577 11670 11677 12085 12592 14971 10790 3755 2861 3096 2813 -99 3360
$$ packed form
6268A0929j621k531k771j962M039k742p89m7m010K042L579N484L491p677J216
6253F630Q01n33j777J917J663j49l404l650r11M056J403L89k018k623k286j598
6237b090j54J477j267m785J918K255o602o396K637N480O883P41j358k221j157
6222d639j11K292j131O56K20K352J699k730p03K227j869L737K950n151l029M025
6206G95L126j428N37j952j911O663L543m829j972M07n80K163J065m940l029J416
6190i26J840J578J235J000r51N84n15l760j905j96L212R7j68k218j703P222J618
6173F044k949k607r01j74k98j490K018J066J154K289l87j401o970j014N910L165
6157C455l74J413L345L328n90J093PM08N07K379m181p035q94K35k83k912L459
$$ plain form
6140 3360 5237 2518 -1180 -1079 1308 4553 6575 8055 4380 3728 4921 2292 -1732 -2319 -2031 -2104
6124 -2104 2542 2069 1676 7937 7335 5732 8797 6948 -757 300 3264 6265 5922 3900 -757 2680
6108 2680 8368 6009 3129 1409 1176 -1581 -4139 -5128 -2042 -3919 -3133 -6111 -2278 2956 4228 5272
6092 5272 4637 4143 3938 4198 6245 6338 6588 4302 5695 9292 11876 9555 -1042 -4232 1484 5143
6076 5143 3425 2344 1146 -1882 515 -1595 -408 4074 6316 4010 559 -89 -3384 -5848 483
6061 483 5230 3438 1269 -2051 -5541 668 3492 4018 6010 5081 -671 -2470 -1384 -40 1536 1799
6045 1799 -2769 -7396 -3303 -617 -2097 -526 -920 -4643 -8921 -10782 -7178 -8612 -8350 -9792 -12536
6030 -12536 -9794 -1759 -2129 -4215 3383 7687 7534 -1034 -7876 -5815 857 3057 2434 2384 -4090 -4277
$$ packed form
6140C360J877k719l698J01K387L245K022J480l675o52J193k629m024n87K88p3
6124b104M646m73l93O261o02j603L065j849p705J057K964L001l43k022m657L437
6108B680N688k359k880j720k33k757k558r89L086j877P86k978L833N234J272J044
6092E272o35m94k05K60K047R3K50k286J393L597K584k321j0597l190N716L659
6076E143j718j081j198l028K397k110J187M482K242k306l451o48l295k464O331
6061D83M747j792k169l320l490O209K824N26J992r29n752j799J086J344J576K63
6045A799m568m627M093K686j480J571l94l723m278j861L604j434K62j442k744
6030a2536K742Q035l70k086P598M304j53q568o842K061O672K200o23n0o474j87
$$ plain form
6014 -4277 131 127 -149 -1084 74 -2557 -5642 -6623 -5372 -7469 -11116 -6838 -7079 -5758 -9518 -6583 -4987
5997 -4987 -5784 -5060 -3181 -5507 -3664 -3246 -7478 -10801 -9322 -3175 -473 759 438 -631 564 4011
5981 4011 7203 5812 2550 3062 2937 3192 367 -277 -2713 -3517 -839 2769 4216 4757 1798 -2428
5965 -2428 -3059 -1875 -1635 4350 8712 6752 5486 4238 -590 -8242 -13297 -5585 -126 2664 3173 -3113
5949 -3113 -3346 817 -1134 -6643 -5560 620 478 1915 3725 -1792 -3963 -3828 -6731 -8190 -7644 -8405
5933 -8405 -4355 1785 4383 1666 -506 -861 -3342 -1881 -966 3414 7522 3468 -4454 -1273 3107
5918 3107 1717 297 256 1479 3214 -1124 -3034 1060 6658 7781 -974 -5928 -6274 -5176 -5840 -2487
5902 -2487 -891 -2392 -5767 -4277 -1847 -2652 -4704 -7015 -8284 -6924 -5250 -3753 -658 43 -2007
$$ packed form
6014d277M408mk76r35J158k631l085r81J251k097l647M278k41J321l760K935J596
5997d987p97P24J879k326J843M18m232l323J479O147K702J232l21j069J195L447
5981D011L192j391l262N12j25K55k825o44k436q04K678L608J447N41k959m226
5965b428o31J184K40N985M362j960j266j248m828p652n055P712N459K790N09o286
5949c113k33M163j951n509J083O180j42J437J810n517k171J35k903j459N46p61
5933h405M050O140K598k717k172l55k481J461R15M380M108m054p922L181M380
5918C107j390j420m1J223J735m338j910M094N598J123q755m954l46J098o64L353
5902b487J596j501l375J490K430q05k052k311j269J360J674J497L095P01k050
$$ plain form
5887 -2007 -3654 -3476 -137 1569 1921 1262 3922 6602 7314 6291 3774 3475 4613 3017 428 2023
5871 2023 2827 -2197 -3167 -4303 -3483 238 4836 7925 3279 -572 -5882 -8995 -1500 3912 897 -1656
5855 -1656 -536 -2790 -8305 -9900 -11865 -6280 -2575 -1856 1467 -3012 -3962 -3670 -3434 -5224 -1940 -3321
5839 -3321 -906 2244 1243 2557 -211 582 2614 6916 4805 -506 2769 5186 4691 -2368 -4212
5824 -4212 239 4848 6942 4963 -207 -3350 -3014 -2974 2366 5037 10408 8381 3040 2570 1776 -1575
5808 -1575 -6370 -5976 -5619 -3277 -624 1021 -1810 2599 6309 8069 7091 5072 2433 3062 1969 -2670
5792 -2670 -11728 -9577 -4107 -3994 -3848 -6719 -6714 -2488 4462 4076 1568 3530 1413 -762 -1221 -268 -353
5775 -353 -4969 -9594 -4937 -3126 -632 2175 -2306 -3663 -3876 -6371 -9474 -3014 -2568 -5698 -5801 -5288
$$ packed form
5887b007j647J78L339J706L52o59K660K680P12j023k517k99J138j596k589J595
5871B023Q04n024r70j136Q20L721M598L089m646l851n310l113P495N412l015k553
5855a656J120k254n515j595j965N585L705P19L323m479r50K92K36j790L284j381
5839c321K415L150j001J314k768P93K032M302k111n311L275K417m95p059j844
5824d212M451M609K094j979n170l143L36M0N340K671N371k027n341m70p94l351
5808a575m795L94L57K342K653J645k831M409L710J760r78k019k639O29j093m639
5792b670r058K151N470J13J46k871NM226O950l86k508J962k117k175m59R53q5
5775c53m616m625M657J811K494K807m481j357k13k495l103O460M46l130j03N13
$$ plain form
5759 -5288 -1856 392 2339 2421 2483 3884 3564 970 -2042 -1375 246 2518 -353 -5696 -8374 -6883
5743 -6883 -2931 -3835 -7147 -8730 -8849 -10187 -11135 -10913 -6708 -3354 -5317 -6499 -5502 -5503 -1656 -1737 -2483 -3365
5725 -3365 -3360 -2572 -1944 -3974 -7186 -5742 -3123 -4819 -2241 -447 2335 6584 6847 2940 1954 2870 3025
5708 3025 3435 883 -2993 -3311 -2379 -2469 -6821 -5618 2126 4717 4554 565 80 3945 2697 6715 7772
5691 7772 4599 -3648 -3551 2820 3275 4271 4512 3960 4453 -743 -440 -1778 -3521 258 1346 -796 -2932
5674 -2932 -4918 -2340 -3732 -4778 -3083 -2317 -753 -4728 -7216 -8055 -998 -307 -4368 -5847 -2297 -2933
5658 -2933 -2988 -5303 -3633 -240 408 -4501 -10367 -15751 -18572 -15082 -10813 -10753 -9964 -5729 -3651 -5754
5642 -5754 -6888 -7184 -5915 -7677 -8009 -11185 -11435 -8390 -4843 -1678 -9922 -8152 -5472 1053 3623 2819
$$ packed form
5759e288L432K248J947Q2O2J401l20k594l012O67J621K272k871n343k678J491
5743f883L952r04l312j583j19j338r48K22M205L354j963j182R97jL847q1p46q82
5725c365NP88O28k030l212J444K619j696K578J794K782M249K63l907r86R16J55
5708C025M10k552l876l18R32r0m352J203P744K591j63l989m85L865j248M018J057
5691G772l173q247R7O371M55R96K41n52M93n196L03j338j743L779J088k142k136
5674b932j986K578j392j046J695P66J564l975k488q39P057O91m061j479L550o36
5658b933n5k315J670L393O48m909n866n384k821L490M269O0P89M235K078k103
5642e754j134k96J269j762l32l176k50L045L547L165q244J770K680O525K570q04
$$ plain form
5626 2819 -5014 -6839 -7527 -7515 -8195 -5254 -3536 299 3969 -559 -962 583 -268 -3405 460 5295
5610 5295 3627 999 2476 2390 -1897 -7464 -6090 166 -2428 -5364 -2479 1666 3414 2208 -1727
5595 -1727 -5783 -7311 -5331 -5493 -2079 -2660 -1962 1129 -287 -4534 -5065 -792 -1020 -1382 5104 6144
5579 6144 5015 2257 -2106 -6400 -6970 -3351 -2648 -4134 120 -2557 -3208 -4631 -641 -3158 -8919 -6944
5563 -6944 -6597 -5137 -3760 -2085 -308 446 -4729 -3816 -1075 -406 524 3390 -3129 -3720 -547 -3165
5547 -3165 -5977 -7345 -6983 -6379 -7356 -11597 -14540 -9327 -1294 -3416 -8867 -3415 83 -872 5100 4067
5531 4067 -247 4844 8355 4653 450 1813 3660 2088 -36 3773 3854 2153 -2059 1144 -547
5516 -547 970 -602 2065 1336 1966 1441 3633 1376 1942 3412 6170 5653 4018 4009 737 275 3909
$$ packed form
5626B819p833j825o88J2o80K941J718L835L670m528m03J545q51l137L865M835
5610E295j668k628J477q6m287n567J374O256k594k936K885M145J748j206l935
5595a727m056j528J980j62L414n81O98L091j416m247n31M273k28l62O486J040
5579F144j129k758m363m294n70L619P03j486M254k677o51j423L990k517n761J975
5563f944L47J460J377J675J777P54n175R13K741O69R30K866o519n91L173k618
5547c165k812j368L62O04r77m241k943N213Q033k122n451N452L498r55N972j033
5531D067m314N091L511l702m203J363J847j572k124L809Q1j701m212L203j691
5516e47J517j572K667p29O30n25K192k257N66J470K758n17j635rl272m62L634
$$ plain form
5499 3909 3956 2660 3011 3579 4694 9350 5653 3254 4751 3678 3080 4925 2760 1346 4494 4506 32
5482 32 -4438 -3277 -5059 -4422 -1118 -2266 -663 3107 6682 4653 6277 6865 1873 1278 4525 6271
5466 6271 4689 7264 7537 4081 4643 5162 5549 6221 1173 -2200 -1864 197 -2136 485 -1971 -5554
5450 -5554 -7087 -9169 -5302 -851 -6051 -8114 -5927 -4063 -5530 -1677 1898 5814 11169 6221 -539
5435 -539 -2605 -3811 -2820 1326 2843 -1397 -5532 -3195 2057 7086 4248 -3337 -1924 -2171 -1547 -997
5419 -997 -136 723 191 1167 1605 4814 2751 -1598 -3632 -6249 -5784 -5245 -2251 -6912 -11512 -13176 -14122
5402 -14122 -11800 -7856 -6782 -6346 -5968 -8017 -10134 -10345 -8435 -6347 -9016 -9299 -6392 -5379 -4742 -4543
5386 -4543 -3615 -2139 -3358 -156 2870 -1211 -2099 -1286 1933 2824 1510 -342 -1427 -1381 -3974 -841
$$ packed form
5499C909M7j296L51N68J115M656l697k399J497j073n98J845k165j414L148J2m474
5482C2m470J161j782O37L304j148J603L770L575k029J624N88m992n95L247J746
5466F271j582K575K73l456N62N19L87O72n048l373L36K061k333K621k456l583
5450e554j533k082L867M451n200k063K187J864j467L853L575L916N355m948o760
5435e39k066j206R91M146J517m240m135K337N252N029k838p585J413k47O24N50
5419i97Q61Q59n32R76M38L209k063m349k034k617M65N39K994m661m600j664r46
5402a4122K322L944J074M36L78k049k117k11J910K088k669k83K907J013O37J99
5386d543R28J476j219L202L026m081q88Q13L219Q91j314j852j085M6k593L133
$$ plain form
5370 -841 -165 -683 928 -253 -4073 -5940 -7405 -5961 941 557 711 4055 3232 -650 -957 2488 4048
5353 4048 3075 2753 5162 5519 3642 -816 129 6306 10162 8434 -798 -7636 -9210 -3449 -2786 -3812
5337 -3812 -7068 -8061 -8475 -7360 -9537 -11197 -13109 -11179 -3529 1742 3890 76 806 -2637 -5615 -2544
5321 -2544 -3508 715 -230 -4349 -902 1632 -394 -3679 -1842 -4735 -7371 -8664 -10449 -12648 -6971
5306 -6971 -6283 -3741 -2261 -2132 -3122 -2602 186 1359 -1281 -927 483 -2021 -8909 -9582 -10776 -9411
5290 -9411 -3167 -997 2128 -2090 -3853 -788 -852 -954 -1198 -1343 1956 4114 -1107 -611 1404 3018
5274 3018 2620 1414 -4032 -6098 -4675 -6740 -2924 1302 -1937 -3500 -4207 -2320 -2488 -2668 349 1021
5258 1021 -1882 -5379 -2555 241 4494 -2141 -10571 -9806 -7034 -6643 -3625 -3482 -2544 -2796 -4825 -1762
$$ packed form
5370h41O76n18J611j181l820j867j465J444O902l84J54L344q23l882l07L445J560
5353D048r73l22K409L57j877m458R45O177L856j728r232o838j574N761O63j026
5337c812l256r93m14J115k177j660j912J930P650N271K148l814P30l443k978L071
5321b544r64M223r45m119L447K534k026l285J837k893k636j293j785k199N677
5306f971O88K542J480J29r90N20K788J173k640L54J410k504o888o73j194J365
5290i411O244K170L125m218j763L065o4j02k44j45L299K158n221M96K015J614
5274C018l98j206n446k066J423k065L816M226l239j563p07J887j68j80L017O72
5258A021k903l497K824K796M253o635q430P65K772L91L018J43R38k52k029L063
$$ plain form
5242 -1762 933 1612 -2117 -1336 391 813 4346 2991 919 929 160 -5810 -8348 -6470 -6879 -8261 -4614
5225 -4614 -6517 -4962 -3652 -6062 -5548 -3886 -5172 -7882 -7273 -4771 2015 4522 1712 -3966 -4216 -3845
5209 -3845 -4602 -6483 -7751 -10838 -4131 -1317 -6425 -5285 -2996 -5299 -4502 -3706 -3525 -7618 -4614 -1220
5193 -1220 -300 -3574 -7505 -7148 -3728 -4297 -5049 -11224 -13662 -9738 -6722 -8406 -9580 -5913 -2655 -2612
5177 -2612 1064 113 -804 -610 -1882 -2170 402 -1945 -1054 3301 4314 3872 94 -3279 -4615 -6067
5161 -6067 -9015 -5956 -3336 -1875 1938 -2112 -9732 -10341 -6482 -3645 -2349 -7385 -10403 -12104 -10303
5146 -10303 -9389 -14503 -17144 -16274 -17639 -12434 -9612 -5437 -52 -3454 -6784 -6956 -1568 -181 -193 630
5130 630 5467 8352 2834 -1119 -2553 -286 3902 3208 2372 3577 8505 15181 11621 5639 -1921 -4041
$$ packed form
5242a762K695O79l729P81J727M22L533j355k072J0p69n970k538J878m09j382L647
5225d614j903J555J310k410N14J662j286k710O09K502O786K507k810n678k50L71
5209c845p57j881j268l087O707K814n108J140K289k303P97P96J81m093L004L394
5193a220R20l274l931L57L420n69p52o175k438L924L016j684j174L667L258M3
5177b612L676r51r17J94j272k88K572k347Q91M355J013m42l778l373j336j452
5161f067k948L059K620J461L813m050p620o09L859K837J296n036l018j701J801
5146a0303R14n114k641Q70j365N205K822M175N385l402l330j72N388J387j2Q23
5130F30M837K885n518l953j434K267M188o94q36J205M928O676l560n982p560k120
$$ plain form
5114 -4041 -5242 -6812 -7918 -3722 -2840 -2640 -3625 -4027 -4919 -4270 -3003 -4326 -2146 698 2057 4295
5098 4295 836 2325 5745 5164 -619 -4289 867 2052 569 -1662 -2110 -1733 931 -1615 542 936
5082 936 6745 9726 7212 10021 9903 2165 -3700 -6574 -5103 -1278 -2023 -3715 -3492 1498 3505 2453
5066 2453 1711 -5912 -11608 -9071 -7888 -4821 -4987 -4856 -2614 -2341 -1696 -89 5377 6312 2431 5950
5050 5950 1978 -2323 -4098 -6477 -2817 -1049 808 -1383 -1147 3722 7364 5540 3603 6310 4786
5035 4786 5597 3584 1702 1713 3523 2564 3038 -2887 -10044 -10322 -9162 -5086 -4075 -7149 -9232 -8875 -3242
5018 -3242 -2940 -4459 -4983 -7681 -12035 -11178 -3863 -1925 -2230 5 4204 6602 5698 116 -6919 -9720
5002 -9720 -9635 -9172 -4064 -2426 -1961 699 5473 4284 -1871 -3562 -93 2028 3039 4684 7681 7596
$$ packed form
5114d041j201j570j106M196Q82K00r85m02q92O49J267j323K180K844J359K238
5098D295l459J489L420n81n783l670N156J185j483k231m48L77K664k546K157L94
5082I36N809K981k514K809j18p738n865k874J471L825p45j692K23M990K007j052
5066B453p42p623n696K537J183L067j66J31K242K73O45J607N466R35l881L519
5050E950l972m301j775k379L660J768J857k191K36M869L642j824j937K707j524
5035D786Q11k013j882J1J810r59M74n925p157k78J160M076J011l074k083L57N633
5018c242L02j519n24k698m354Q57P315J938l05K235M199K398r04n582p035k801
5002i720Q5M63N108J638M65K660M774j189o155j691L469K121J011J645K997q5
$$ plain form
4986 7596 5775 219 -6640 -5019 -5345 -2299 -757 -2419 -4881 -3282 5202 6103 -566 -2682 630
4971 630 -497 -3004 -2288 -2017 -1392 2535 -1523 -4932 -8856 -7129 -7999 -4178 -4147 -265 6147 8763 5795
4954 5795 7111 3794 4552 5629 5051 -3937 -5482 -1530 -129 -138 888 28 -2238 408 665 536 332
4937 332 -1937 -893 3271 7638 4040 5113 4612 1682 3095 1011 1121 514 -1800 -2836 -2500 1480
4921 1480 3503 4742 -429 1008 1253 402 -5087 -5361 -5532 -6853 -9024 -9680 -10152 -2670 -6461 -5921 -8213
4904 -8213 -4047 -3790 -6136 -4683 -4188 -1810 -3872 -3423 -5393 -4362 -5140 -7985 1875 8228 3236 -2937
4888 -2937 -4230 -1800 -989 90 508 1019 -2107 -3747 -4097 -2224 -4575 -3379 -3381 -426 -887 -2194 -5530
4871 -5530 -3426 -6072 -9613 -6530 -9128 -11272 -9489 -2331 -1777 114 -397 5274 4378 4276 7195 5517
$$ packed form
4986G596j821n556o859J621l26L046J542j662k462J599Q484R01o669k116L312
4971F30j127k507P16K71O25L927m058l409l924J727q70L821L1L882O412K616k968
4954E795J316l317P58J077n78q988j545L952J401rJ026q60k266K646K57j29k04
4937C32k269J044M164M367l598J073n01k930J413k084J10o07k314j036L36L980
4921A480K023J239n171J437K45q51n489k74j71j321k171o56m72P482l791N40k292
4904h213M166K57k346J453M95K378k062M49j970J031p78k845R860O353m992o173
4888b937j293K430Q11J079M18N11l126j640l50J873k351J196kK955m61j307l336
4871e530K104k646l541L083k598k144J783P158N54J891n11N671q96j02K919j678
$$ plain form
4855 5517 3535 -51 -2972 -2467 -2058 -507 2051 905 -2755 -3675 -1988 2034 -400 -4635 -5520 -7509
4839 -7509 -11904 -9711 -479 6146 3316 -4028 -7010 -10111 -9308 -4203 2884 7865 12629 6068 3478
4824 3478 -2148 -2101 -2827 -1028 -5399 -5869 -1858 -2657 -4714 -5781 -5267 -4580 -493 2538 2185 1003 -2509
4807 -2509 -3108 -2941 4319 5290 2649 3498 4816 6177 3454 1886 30 263 -3385 -10294 -9849 -7552
4791 -7552 -5123 -1826 -592 3159 -533 -7047 -10968 -9528 -10928 -13242 -11052 -4294 2893 4382 393
4776 393 1394 1008 -5207 -7232 -4372 -3417 -2887 -3389 -3841 -3533 -912 -1463 -4870 -4399 4220 5712 3100
4759 3100 -3485 -6279 -1052 1830 2943 1648 423 246 -4525 -2298 1524 -334 -1402 243 3342
4744 3342 -1730 -2422 -1207 -1144 -976 -2743 -724 -1084 -3527 -1518 -518 -3911 -1510 -1336 3474 1674
$$ packed form
4855E517j982l586k921N05M09J551K558j146l660r20J687M022k434m235q85j989
4839g509m395K193R232O625k830p344k982l101Q03N105P087M981M764o561k590
4824C478n626M7p26J799m371m70M011p99k057j067N14O87M087L031l53j182l512
4807b509n99J67P260R71k641Q49J318J361k723j568j856K33l648o909M45K297
4791g552K429L297J234L751l692o514l921J440j400k314K190O758P187J489l989
4776C93J001l86o215k025K860R55N30n02m52L08K621n51l407M71Q619J492k612
4759C100o585k794N227K882J113j295j225j77m771K227L822j858j068J645L099
4744C342n072o92J215O3J68j767K019l60k443K009J000l393K401J74M810j800
$$ plain form
4728 1674 -964 4155 5427 5571 635 88 1858 279 2193 -991 -1925 -4656 532 3485 1043 3859
4712 3859 7048 3779 2836 744 -1551 1061 2182 3335 1995 1043 1088 1112 -2055 -1767 -1130 -4805 -5242
4695 -5242 -6480 -8399 -7456 -7224 -6797 -4206 -2687 532 4317 1018 4250 9066 9485 3146 2036 499
4679 499 -3535 -5036 -7176 -5672 -2139 -3084 -4500 -11125 -13248 -10189 -8126 -5059 -6375 -8133 -4684
4664 -4684 -534 -1144 -2096 -641 1391 -943 -256 -290 -2807 -2058 -6367 -8802 -5795 -6779 -4496 -678 -1802
4647 -1802 -7351 -10563 -12984 -12475 -6615 -7525 -6030 -10156 -12421 -11140 -11588 -12020 -11199 -8113 -4407 884
4631 884 299 -233 -639 -2938 -3664 -3084 -3875 -3319 -6884 -9020 -8020 -10179 -9409 -5967 -1127 -497 -4997
4614 -4997 -4339 -4493 -4109 356 3137 2256 80 -6463 -5093 -4200 -3242 -4066 -5816 -3187 -3852 -6681 -8817
$$ packed form
4728A674k638N119J272J44m936n47J770j579J914l184r34k731N188K953k442K816
4712C859L189l269r43k092k295K612J121J153j340r52M5K4l167K88O37l675m37
4695e242j238j919R43K32M27K591J519L219L785l299L232M816M19o339j110j537
4679D99m034j501k140J504L533r45j416o625k123L059K063L067j316j758L449
4664d684M150o10r52J455K032k334O87l4k517P49m309k435L007r84K283L818j124
4647a802n549l212k421N09N860r10J495m126k265J281m48m32Q21L086L706N291
4631H84n85n32m06k299p26N80p91N56l565k136J000k159P70L442M840O30m500
4614d997O58j54L84M465K781q81k176o543J370Q93R58q24j750K629o65k829k136
$$ plain form
4597 -8817 -3524 1988 887 1730 4107 1748 -4065 -2194 -3493 -6210 -6296 -2905 -2017 -4723 -830 1735
4581 1735 -1361 -4151 -6010 -2341 4489 682 -3875 -3156 1319 2582 -705 -2065 4813 2047 -2507
4566 -2507 -1760 -4062 -1338 2073 3275 1718 4987 5187 4926 6107 -342 -2890 -5783 -6349 -3917 -778
4550 -778 -4831 -2974 -5304 -6603 -8442 -7119 -10792 -13383 -13320 -10824 -9608 -6910 -1799 297 474 -424
4534 -424 -1132 -2544 -4845 77 2433 2186 -2604 -4951 -5686 -3696 -3272 -4940 -1169 -754 -3942 -8423
4518 -8423 -6488 -602 3700 2920 1845 -2821 -8333 -12193 -8083 -3004 -4866 -7184 -6391 -6142 -7289 -8152
4502 -8152 -9151 -2172 1336 -815 -6427 -9078 -8200 -10193 -10165 -9138 -8111 -13563 -8995 -8242 -4634 -2725
4486 -2725 -3385 -2576 1084 1510 -434 -358 -2594 -3408 -3764 -3710 -2010 -463 1411 3266 6597 4856 147
$$ packed form
4597h817N293N512j101Q43K377k359n813J871j299k717q6L391Q88k706L893K565
4581A735l096k790j859L669O830l807m557P19M475J263l287j360O878k766m554
4566b507P47k302K724L411J202j557L269K00k61J181o449k548k893n66K432L139
4550g78m053J857k330j299j839J323l673k591O3K496J216K698N111K096J77q98
4534d24p08j412k301M922K356k47m790k347p35J990M24j668L771M15l188m481
4518h423J935N886M302p80j075m666n512l860M110N079j862k318P93K49j147q63
4502h152r99O979L508k151n612k651Q78j993K8J027J027n452M568P53L608J909
4486b725o60Q09L660M26j944P6k236q14l56N4J700J547J874J855L331j741m709
$$ plain form
4469 147 -634 1045 -2907 -6501 -6680 -4662 -3366 946 5119 5010 635 -848 1056 6352 5467 1735
4453 1735 1148 -748 -274 -805 2298 3426 552 -1290 -4635 -7406 -10942 -14595 -14680 -12982 -7874 -5652
4437 -5652 -2689 -511 -675 -2210 -2253 -516 1706 -1378 -5967 -3903 -3367 -883 -3346 -2011 -4724 -3985
4421 -3985 -75 1200 -5531 -9179 -9620 -6931 -5468 -2987 -527 -2039 -12088 -17861 -15886 -13510 -11482
4406 -11482 -8414 -3803 -5960 -8756 -10709 -8867 -7811 -3952 -632 -768 -2565 -879 -4946 -2258 -2253 -4324
4390 -4324 -2936 -8745 -14261 -14029 -9480 -9844 -5824 -4065 -3911 4690 1947 -1572 -6848 -7767 -6987 -7394
4374 -7394 -5767 -8549 -6238 -2426 -2 3345 3543 1652 1198 2602 2005 -1327 -684 2985 2668 -1169
4358 -1169 -4127 -3518 -543 -897 1302 7237 9009 6462 2680 1108 1670 1931 1800 -463 -2255 -1474
$$ packed form
4469A47p81J679l952l594j79K018J296M312M173j09m375j483J904N296q85l732
4453A735n87j896M74n31L103J128k874j842l345k771l536l653q5J698N108K222
4437e652K963K178j64j535m3J737K222l084m589K064N36K484k463J335k713P39
4421c985L910J275o731l648m41K689J463K481K460j512j0049n773J975K376K028
4406a1482L068M611k157k796j953J842J056L859L320j36j797J686m067K688Nk071
4390d324J388n809n516K32M549l64M020J759J54Q601k743l519n276r19P80m07
4374g394J627k782K311L812K424L347J98j891m54J404n97l332O43L669l17l837
4358a169k958O09K975l54K199N935J772k547l782j572N62K61j31k263j792P81
$$ plain form
4342 -1474 -4550 -9502 -10850 -7732 -241 2672 879 -1118 -3979 -7408 -9082 -5768 -8526 -13046 -8404
4327 -8404 -5684 -11433 -10296 -9643 -8707 -9966 -10984 -11738 -4363 -141 -29 -1345 1493 -2282 -2778 -5804
4311 -5804 -5812 -1073 -82 213 -893 -3884 -5650 -3427 -2720 -6620 -5699 -3339 -2227 -4680 -7430 -2733 2810
4294 2810 584 -3916 -3268 -1425 -1973 -6077 -1901 -1669 -1085 -3428 -2747 -2945 -3229 -2571 -3417 -4957 -5490
4277 -5490 -5357 -2965 -514 -3406 -1747 1770 1237 157 1478 2776 -1593 1617 7611 5548 -1380
4262 -1380 2130 4272 4524 -1943 -6576 -6928 -5144 -6351 -8553 -5180 -2658 -1573 -1753 -9253 -9058 -6166
4246 -6166 -7024 -9202 -4811 -3762 -3505 -3727 -6694 -7837 -9404 -7216 -5821 -6821 -7873 -9205 -4483 -2415
4230 -2415 -6310 -9847 -7905 -3660 -3070 -2828 -663 3381 2578 5466 4542 1452 516 -1887 -214 2956
$$ packed form
4342a474l076m952j348L118P491K913j793j997k861l429j674L314k758m520M642
4327h404K720n749J137O53R36j259j018p54P375M222J12j316K838l775m96l026
4311e804qM739R91K95j106k991j766K223P07l900R21K360J112k453k750M697N543
4294B810k226m500O48J843n48m104M176K32N84k343O81j98k84O58q46j540n33
4277e490J33K392K451k892J659L517n33j080J321J298m369L210N994k063o928
4262a380L510K142K52o467m633l52J784j207k202L373K522J085j80p500J95K892
4246f166q58k178M391J049K57k22k967j143j567K188J395j000j052j332M722K068
4230b415l895l537J942M245N90K42K165M044q03K888r24l090r36k403J673L170
$$ plain form
4214 2956 3916 2748 -1355 -2797 -1707 -7975 -9370 -4430 -5151 -3454 -1662 -3655 -9143 -9393 -9137 -7538
4198 -7538 297 2770 1367 1627 -2910 -3126 1100 1868 -40 2823 4732 662 2188 467 1112 -148
4182 -148 798 327 -6862 -8756 -8655 -4549 -3289 -4251 -3490 -3499 -3144 -715 -1356 -4281 -5125 -2316 -473 -458
4164 -458 2023 1624 -524 -826 2119 6353 5294 898 -735 -1420 -3879 -10459 -10074 -4630 -2623 -4582
4148 -4582 -4676 -207 -2748 -9517 -5168 -3105 -4260 -624 1231 -2797 -2042 283 668 2756 -438 -5640
4132 -5640 -4041 -4483 -5096 -3652 -2651 -6017 -6160 -1666 -2397 -3853 -4513 -1717 -3739 -4016 -6691 -7798
4116 -7798 -10465 -6782 -5436 -7560 -4117 -7493 -4532 -3780 -4952 -3289 -4536 -5098 -5931 -4433 -2846 -3661
4100 -3661 -6609 -2314 3095 2983 4402 5649 6363 -1815 -8027 -4479 -2056 207 4949 4150 1708 -1165
$$ packed form
4214B956R60j168m103j442J090o268j395M940p21J697J792j993n488k50K56J599
4198g538P835K473j403K60m537k16M226P68j908K863J909m070J526j721O45j260
4182a48R46m71p189j894J01M106J260r62P61rL55K429o41k925q44K809J843J5
4164d58K481l99k148l02K945M234j059m396j633o85k459o580L85N444K007j959
4148d582r4M469k541o769M349K063j155L636J855m028P55K325L85K088l194n202
4132e640J599m42o13J444J001l366j43M494p31j456o60K796k022k77k675j107
4116g798k667L683J346k124L443l376K961P52j172J663j247n62q33J498J587q15
4100c661k948M295N409j12J419J247P14q178o212L548K423K263M742p99k442k873
$$ plain form
4084 -1165 346 1262 -3511 -6443 -6418 -8636 -11470 -11753 -10084 -5125 -4491 -7127 -8659 -4477 -4274 -3254
4068 -3254 1464 996 -1240 -1851 -4262 -4530 -4321 -6489 -7145 -4116 -5920 -8690 -9153 -11317 -10282 -5732
4052 -5732 453 2604 2552 4012 -1661 -4306 -5089 -1644 -3404 -1008 2101 1066 -3260 -8318 -11825 -7111
4036 -7111 -4254 -3396 -4135 -4820 -4821 698 5 -4466 -6080 -6380 -7760 -3313 -3079 -4964 -9543 -5904 -6193
4019 -6193 -8750 -9131 -7471 -5885 -3181 -2866 -428 -1236 -3324 -3327 -4363 -3710 -2779 -4770 -4718 -5093 -4558 -5488
4001 -5488 -2329 164 3766 842 -1783 -5101 -8263 -6619 -8732 -5391 -59 -853 -433 -2335 -4402
3986 -4402 -1636 -2108 -1545 -1140 868 -155 -4504 -8691 -7276 -1280 -5661 -7101 -1062 2176 2877 -787
3970 -787 -5091 -252 2097 -662 -3671 -5234 -6105 -6516 -9729 -9637 -4654 1725 3766 1764 1956 1753 -411
$$ packed form
4084a165J511R16m773k932K5k218k834k83J669M959O34k636j532M182K03J020
4068c254M718m68k236o11k411k68K09k168o56L029j804k770m63k164J035M550
4052e732O185K151n2J460n673k645p83L445j760K396L109j035m326n058l507M714
4036g111K857Q58p39o85jN519o93m471j614l00j380M447K34j885m579L639k89
4019f193k557l81J660J586K704L15K438q08k088lj036O53R31j991N2l75N35r30
4001e488L159K493L602k924k625l318l162J644k113L341N332p94M20j902k067
3986d402K766m72N63M05K008j023m349m187J415N996m381j440O039L238P01l664
3970g87m304M839K349k759l009j563q71m11l213R2M983O379K041k002J92k03k164
$$ plain form
3953 -411 -5913 -5004 -4311 -3464 -4865 -3683 -6356 -4369 -3237 -6016 -10074 -7720 -3539 -4240 -6834 -1721
3937 -1721 2388 31 -5004 -8452 -5800 -1603 3287 137 -179 2247 -637 -2694 649 7281 8977
3922 8977 4157 356 -6131 -7719 -3186 -548 -899 -908 -2219 -2936 -1663 2031 2793 5355 2515 -4184
3906 -4184 -9252 -10930 -3949 -5451 -8447 -7347 -4768 -9874 -11467 -9198 -2605 2295 3677 -1549 211
3891 211 -2416 -3157 -3564 -5939 -9879 -15786 -17489 -14930 -7618 -4766 -4533 -7025 -6928 -11628 -13585 -10109
3875 -10109 -3147 -5309 -8802 -7535 -201 1277 1401 3184 2143 1423 -178 -4388 -6951 -3584 2053
3860 2053 5048 -662 -4863 -3199 -154 72 -1900 -1753 3418 207 -73 3175 1453 -4885 -6651 -5924
3844 -5924 -4135 -4269 -5169 -6187 -6307 -3113 -4578 -3374 -3620 -1056 -3150 -5184 -9125 -11062 -6507 -3551
$$ packed form
3953d11n502R09O93Q47j401J182k673J987J132k779m058K354M181p01k594N113
3937a721M109k357n035l448K652M197M890l150l16K426k884k057L343O632J696
3922H977m820l801o487j588M533K638l51rj311p17J273L694P62K562k840o699
3906d184n068j678O981j502k996J100K579n106j593K269O593M900J382n226J760
3891B11k627p41m07k375l940n907j703K559P312K852K33k492R7m700j957L476
3875a0109O962k162l493J267P334J478J24J783j041p20j601m210k563L367N637
3860B053K995n710m201J664L045K26j972J47N171l211k80L248j722o338j766P27
3844e924J789j34r00j018j20L194j465J204k46K564k094k034l941j937M555K956
$$ plain form
3828 -3551 -6137 -7061 -8500 -6888 -6641 -6471 -2116 170 -896 -1577 -7371 -4659 -1502 -6556 -8860 -9379
3812 -9379 -10536 -3136 450 1905 8038 8739 8036 7638 4494 5905 5118 6604 -521 -4331 -6413 -10236
3796 -10236 -10666 -4531 -5633 -1879 276 -4510 -5290 -4515 -6738 -2299 -1439 -5772 -7828 -7187 -5521 -4819
3780 -4819 -5884 -5847 -5218 -5385 -2605 -657 -2594 -6718 -8099 -4959 -5462 -2562 2324 1280 -5110 -6941
3764 -6941 -5289 -4974 -8736 -12498 -7592 -1701 3367 2207 4852 4099 3528 3275 744 -861 1848 2949
3748 2949 3235 1508 3486 -2320 -6219 -3624 -2832 -4129 -2516 -1938 5099 5741 4614 6150 3189 818
3732 818 2007 3599 3001 10542 8727 4639 7475 7432 2423 -2188 -3079 -1705 -3870 -6278 -4593 -7160
3716 -7160 -2467 297 4463 5401 5854 3193 784 -5772 -1295 -3417 -6950 -3529 -4343 -8927 -6147 -3356
$$ packed form
3828c551k586r24j439J612K47J70M355K286j066o81n794K712L157n054k304n19
3812i379j157P400L586J455O133P01p03l98l144J411p87J486p125l810k082l823
3796a0236m30O135j102L754K155m786p80P75k223M439Q60m333k056O41J666P02
3780d819j065L7O29j67K780J948j937m124j381L140n03K900M886j044o390j831
3764f941J652L15l762l762M906N891N068j160K645p53n71k53k531j605K709J101
3748B949K86j727J978n806l899K595P92j297J613N78P037O42j127J536k961k371
3732H18J189J592n98P541j815m088K836m3n009m611q91J374k165k408J685k567
3716g160M693K764M166R38M53k661k409o556M477k122l533L421q14m584K780K791
$$ plain form
3700 -3356 -11351 -12871 -8300 -6623 -6705 -8849 -8956 -8056 -12841 -15423 -13106 -13508 -11483 -13507 -10923 -4393
3684 -4393 -519 2310 2729 1391 2040 -1932 -4758 -10239 -5355 -3355 -4583 -4410 -7784 -5960 -2898 -1427
3668 -1427 -3703 -4424 -5257 -6188 -5738 -5810 -7589 -7365 -7864 -3345 -2519 -3971 -2465 -4108 -10026 -4088 -1543
3651 -1543 -2948 -4095 -812 -2679 -5560 -4415 -3807 -1883 -2501 -3261 -4444 -4285 -4232 -3039 -6877 -9205
3635 -9205 -6941 -5512 -7472 -11686 -10345 -6623 -1539 1480 2076 3136 4505 6812 10698 5633 2127
3620 2127 -2298 -9087 -9664 -4263 -3294 -4459 -1693 -224 -481 1104 949 -1597 -4536 -4204 -4733 -4119 -6132
3603 -6132 -1283 4001 248 1888 3021 -286 -2619 -3865 -2232 -772 1768 3618 129 -967 -1288
3588 -1288 -435 -1170 -2459 -2797 -1637 -527 -4582 -5393 -3703 -4567 -3337 -2482 -2 972 -422 537 2119
$$ packed form
3700c356p995j520M571J677q2k144j07R00m785k582K317m02K025k024K584O530
3684d393L874K829M19j338O49l972k826n481M884K000j228J73l374J824L062J471
3668a427k276p21q33r31M50p2j779K24m99M519Q26j452J506j643n918N938K545
3651a543j405j147L283j867k881J145O08J924o18p60j183J59N3J193l838k328
3635i205K264J429j960m214J341L722N084L019N96J060J369K307L886n065l506
3620B127m425o789n77N401R69j165K766J469k57J585j55k546k939L32n29O14k013
3603f132M849N284l753J640J133l307k333j246J633J460K540J850l489j096l21
3588a288Q53p35j289l38J160J110m055q11J690q64J230Q55K480R74j394R59J582
$$ plain form
3571 2119 1395 -1493 -3687 -2617 -1920 3365 2806 5419 5263 1981 -5622 -9065 -6360 -4924 -4171 3565
3555 3565 3205 -1966 3117 4792 -162 -478 -1732 -4939 -2285 1265 926 83 -1799 -7079 -8155 -4126
3539 -4126 1797 4442 6376 5289 7667 978 -6392 -7628 -7651 -5191 -4107 -5791 -10666 -10251 -4666 964
3523 964 -4899 -11370 -11895 -6083 -4400 -8891 -2871 -2663 -7470 -7695 -5380 -4316 2670 4071 3775 3878
3507 3878 3455 1259 727 2100 325 -334 690 174 -2289 -3284 -4080 -3721 -5630 -3482 2980 8010 5678
3490 5678 -3458 -3171 126 3915 6589 2362 627 6502 12656 12810 8654 1937 -2820 -4817 -4282 -674
3474 -674 3418 5180 1568 -4345 -4277 2660 1533 -1658 -3647 -5617 -7191 -4618 2369 1848 -3443 -2428
3458 -2428 2851 4038 7222 5088 1006 2827 2062 -1387 -4065 -8093 -14033 -14059 -10089 -10263 -5996 -909
$$ packed form
3571B119p24k888k194J070O97N285n59K613j56l282p603l443K705J436P53P736
3555C565l60n171N083J675m954l16j254l207K654L550l39q43j882n280j076M029
3539d126N923K645J934j087K378o689p370j236k3K460J084j684m875M15N585N630
3523I64n863o471n25N812J683m491O020K08m807k25K315J064O986J401k96J03
3507C878m23k196n32J373j775o59J024n16k463r95p96L59j909K148O462N030k332
3490E678r136K87L297L789K674m227j735N875O154J54m156o717m757j997N35L608
3474f74M092J762l612n913O8O937j127l191j989j970j574K573O987n21n291J015
3458b428N279J187L184k134m082J821p65l449k678m028n940k6L970j74M267N087
$$ plain form
3442 -909 2596 2716 1064 1366 -1540 -2466 -6303 -3139 415 -1715 -5589 -5457 -3230 -3074 -693 -1611 -8173
3425 -8173 -9290 -3697 -1485 5044 7890 7064 5008 79 -5257 -6151 -5749 -6832 -9211 -845 7762 11675
3409 11675 10190 7185 3192 -1680 -4435 -5380 904 2761 1041 2020 1522 1326 -1616 -4179 -4704 -786
3393 -786 -3937 -3386 -672 6885 6350 -4652 -9704 -9470 -6624 -4713 -3430 -6178 -6081 -491 1923 -724
3377 -724 -2479 -5543 -3881 -5328 -4100 42 2549 -2861 -5661 -3430 -1777 -57 4282 3070 121
3362 121 -5400 -1575 -4106 -3471 -2816 621 2482 1016 -866 577 4927 1760 2722 1382 -1759 -9106
3346 -9106 -12768 -9538 -1088 732 -1225 -4738 -3442 -283 -3002 -2005 353 31 175 2905 4828 8086
3330 8086 3165 -3117 -6638 -7801 -4335 -6308 -8816 -8669 -13090 -8696 -6228 -7474 -4805 -5661 -8187
$$ packed form
3442i09L505J20j652L02k906r26l837L164L554k130l874J32K227J56K381r18o562
3425h173j117N593K212O529K846q26k056m929n336q94M02j083k379Q366Q607L913
3409A1675j485l005l993m872k755r45O284J857j720R79m98j96k942k563n25L918
3393g86l151N51K714P557n35j1002n052K34K846J911J283k748R7N590K414k647
3377g24j755l064J662j447J228M142K507n410k800K231J653J720M339j212k949
3362A21n521L825k531O35O55L437J861j466j882J443M350l167R62j340l141p347
3346i106l662L230Q450J820j957l513J296L159k719R97K358l22J44K730J923L258
3330H086m921o282l521j163L466j973k508J47m421M394K468j246K669q56k526
$$ plain form
3315 -8187 -2977 -6321 -9534 -8938 -5195 -3395 -1065 553 3707 1469 -3952 -5880 -3202 24 -2136
3300 -2136 -7513 -10306 -6632 -4509 -4472 -6560 -3261 -3821 -834 4851 3229 111 3437 2477 -1179 -5208
3284 -5208 -4123 -9295 -9365 -11595 -6895 -7088 -3548 -2687 -7734 -9949 -5760 -4781 -2474 -2307 -2341 -534 5336
3267 5336 5791 5545 4295 2434 1895 -1348 -340 1685 -2758 -3801 -4399 -2008 -1826 -1578 -1992 -2508 -2110
3250 -2110 -1985 2802 5041 4404 90 -3239 -249 3144 5304 2067 -1813 -3815 -5787 -8542 -5277
3235 -5277 3059 262 1798 823 -1801 -5094 -3875 -302 -657 -1174 348 -5955 -9854 -9436 -2645 4437
3219 4437 -245 -5141 -1684 1361 2371 7441 5977 2828 -78 -1117 1368 3678 3561 1597 -1304
3204 -1304 1394 -4137 -9091 -6372 -5601 -5063 -4223 -3835 -910 -4443 -6942 -4364 2163 1773 1551 -790
$$ packed form
3315h187N210l344l213N96L743J800K330J618L154k238n421j928K678L226k160
3300b136n377k793L674K123L7k088L299n60K987N685j622l118L326r60l656m029
3284e208J085n172p0k230M700j93L540Q61n047k215M189R79K307J67l4J807N870
3267E336M55k46j250j861n39l243J008K025m443j043n98K391J82K48m14n16L98
3250b110J25M787K239o37m314l329K990L393K160l237l880k002j972k755L265
3235e277Q336k797J536r75k624l293J219L573l55n17J522o303l899M18O791P082
3219D437m682m896L457L045J010N070j464l149k906j039K485K310j17j964k901
3204a304K698n531m954K719P71N38Q40L88K925l533k499K578O527l90k22k341
$$ plain form
3188 -790 -3089 1493 -154 -6851 -4276 -49 8347 6502 1563 3474 4115 1850 -2857 -3868 -1794
3173 -1794 -2575 -2796 408 4574 5074 -1611 -3263 -3656 -4902 -6064 -4737 -7358 -6057 -2595 -2397 -5274
3157 -5274 -5591 1126 2150 -660 -2512 -3302 -1050 -5908 -8426 -10839 -6420 -3552 -4157 -3158 -607 3896
3141 3896 4512 2602 3357 3084 -899 -5645 -7360 -2315 -2818 -2672 -4048 -3783 -1177 262 2468 2380 -5194
3124 -5194 -12574 -7107 -792 -29 4083 3138 644 -1726 -3332 -48 1425 1628 -3273 -3632 -2426 -1293
3108 -1293 -1616 1570 -101 -1760 -3884 -3619 -2043 -3305 -1196 -97 1610 2699 -84 -7104 -9263
3093 -9263 -5277 -3563 -5813 -6621 -3604 529 1664 -2914 -7404 -10709 -9495 -10699 -8131 -7186 -6054
3078 -6054 2686 5820 2800 -553 -2379 -3257 -3417 -2728 -5761 -3585 1948 -3786 -4896 -1162 2290 705
$$ packed form
3188g90k299M582j647o697K575M227Q396j845m939J911O41k265m707j011K074
3173a794p81k21L204M166N00o685j652l93j246j162J327k621J301L462J98k877
3157e274l17O717J024k810j852p90K252m858k518k413M419K868o05R99K551M503
3141C896O16j910P55k73l983m746j715N045n03J46j376K65K606J439K206q8p574
3124e194p380N467O315P63M112r45k494k370j606L284J473K03m901l59J206J133
3108a293l23L186j671j659k124K65J576j262K109J099J707J089k783p020k159
3093i263L986J714k250q08L017M133J135m578m490l305J214j204K568R45J132
3078f054Q740L134l020l353j826q78j60O89l033K176N533n734j110L734L452j585
$$ plain form
3062 705 -236 -3241 -398 -1327 -6420 -8530 -4713 -2917 -946 -1275 -6923 -10047 -4233 -858 -5446 -7097
3046 -7097 -401 1824 2241 -1236 -537 1114 1475 1577 -3659 -2278 -287 -4814 -4141 -606 -2224 -2785
3030 -2785 -199 -3310 -4773 -4720 -10062 -6918 -2097 -6613 -7285 -7154 -681 1918 1070 -294 318 4622
3014 4622 -71 -1119 2735 1851 -4498 -4835 424 -2377 -2035 -4202 -7594 -6286 -4603 -2461 -2917 -3017
2998 -3017 1311 -129 -3960 -2988 -3069 -737 4713 394 -653 -2948 -204 1456 6327 4585 1733 -1858
2982 -1858 -1528 -1501 2867 2887 1990 3047 4637 4627 -519 245 1987 -343 -2042 106 184 2954 2939 2390
2964 2390 -2612 -532 4204 6517 7896 3727 -720 -5426 -8360 -11967 -14627 -16924 -12375 -7828 -6001
2949 -6001 -4227 -4627 -598 81 -283 -2856 3488 5739 -781 -3445 -4900 -6130 -4395 -5265 -1267 -1993
$$ packed form
3062G05r41l005K843r29n093k110L817J796J971l29n648l124N814L375m588j651
3046g097O696K225M17l477O99J651L61J02n236J381J991m527O73L535j618n61
3030b785K586l111j463N3n342L144M821m516o72J31O473K599q48j364O12M304
3014D622m693j048L854q84o349l37N259k801L42k167l392J308J683K142m56j00
2998c017M328j440l831R72q1K332N450m319j047k295K744J660M871j742k852l591
2982a858L30K7M368K0q97J057J590j0n146P64J742k330j699K148P8K770j5n49
2964B390n002K080M736K313J379m169m447m706k934l607k660k297M549M547J827
2949f001J774m00M029O79l64k573O344K251o520k664j455j230J735q70L998p26
$$ plain form
2933 -1993 -2741 -1446 -2835 -1446 -2000 -3199 -4014 -3255 -2487 1125 5476 6911 8245 9524 4138 -1816
2917 -1816 -2544 -728 -865 1826 1543 -2228 3211 1914 3265 -1218 -4858 279 -1303 -3447 -3300 -1863
2901 -1863 931 -128 -698 1684 6042 7648 1247 -825 -2436 -585 199 2469 4773 3353 5229
2886 5229 1027 -3556 -4260 -5465 -5220 876 7882 3717 -2830 128 5740 6660 5029 -1319 -8677 -2760
2870 -2760 2929 1290 -2669 -2741 3657 3707 2244 3516 6629 9665 911 -1934 -1604 -1417 -1520 4369 5897
2853 5897 203 -1302 -48 605 955 -2574 -1220 3573 5943 4359 3384 6123 2415 -1217 -2747 -3326
2837 -3326 -500 -1214 -2896 1159 2151 -2156 -11987 -14742 -12826 -12734 -9643 -8310 -6448 -3754 2256 -853
2821 -853 -3465 -3211 -3453 -4292 -6270 -4726 -1733 -53 -2036 -4716 -6928 -3235 110 2115 -2549 -4436
$$ packed form
2933a993p48J295j389J389n54j199q15P59P68L612M351J435J334J279n386n954
2917a816p28J816j37K691k83l771N439j297J351m483l640N137j582k144J47J437
2901a863K794j059n70K382M358J606o401k072j611J851P84K270K304j420J876
2886E229m202m583p04j205K45O096P006m165o547K958N612R20j631o348p358N917
2870b760N689j639l959p2O398N0j463J272L113L036q754k845L30J87j03N889J528
2853E897n694j505J254O53L50l529J354M793K370j584r75K739l708l632j530n79
2837c326K826p14j682M055R92m307r831k755J916R2L091J333J862K694O010l109
2821h53k612K54k42q39j978J544K993J680j983k680k212L693L345K005m664j887
$$ plain form
2805 -4436 -4586 188 4955 -1140 -6662 -4483 -885 2218 2122 -1430 -2030 -4270 -3173 -1630 -4768 -7409
2789 -7409 -8829 -13613 -12945 -14881 -11254 -7291 -7517 -4904 -6231 -6498 -4850 -2506 1244 245 -4727 -6655
2773 -6655 -2294 1372 -389 -3963 -9070 -6951 -1840 196 -1264 -3002 -603 11 2510 2919 2895 3678
2757 3678 6911 7874 2337 -4597 -6203 -8269 -4642 -5507 -9840 -8091 -6044 -5198 -1559 2688 5426 3371
2741 3371 1648 -2412 -2227 -855 -5199 -3695 -882 269 -5415 -1725 -185 -1147 -518 -4888 -4733 -4568
2725 -4568 -7243 -9214 -9000 -6989 -4743 -3507 -5672 -5900 -250 4212 4458 3632 1604 133 -3017 -6921
2709 -6921 -5159 69 2855 4740 893 -863 2699 -646 -1619 -5506 -6270 -3044 -3699 -1186 333 2855
2693 2855 6435 1364 -17 234 -2675 -5166 -6028 -3553 -2583 614 -974 912 6434 6660 3065 5896
$$ packed form
2805d436j50M774M767o095n522K179L598L103r6l552o00k240J097J543l138k641
2789g409j420m784O68j936L627L963k26K613j327k67J648K344L750r99m972j928
2773f655M361L666j761l574n107K119N111K036j460j738K399O14K499M09k4P83
2757C678L233R63n537o934j606k066L627q65m333J749K047Q46L639M247K738k055
2741C371j723m060J85J372m344J504K813J151n684L690J540r62O29m370J55J65
2725d568k675j971K14K011K246J236k165k28N650M462K46q26k028j471l150l904
2709f921J762N228K786J885l847j756L562l345r73l887p64L226o55K513J519K522
2693B855L580n071j381K51k909k491q62K475R70L197j588J886N522K26l595K831
$$ plain form
2677 5896 2961 3762 4736 3296 2594 171 -3433 1229 3559 174 -1189 3769 818 -2256 -983 -3222
2661 -3222 -7263 -5700 -580 2002 -1626 -4681 -5787 -5568 -3358 -5966 -10024 -4962 -5 2586 -956
2646 -956 -6004 -5942 -7485 -6100 -5556 -3846 -2854 -944 -4500 -3466 -1495 -3695 -6080 -5324 -2869 -4337
2630 -4337 -4598 -991 1131 2148 1767 4674 5224 2206 -1653 -1575 -2055 -4874 -3916 -1734 -1768 -475 -8468
2613 -8468 -9929 -7611 -1209 3623 5813 7152 10197 8676 3893 4632 4606 -62 3198 5412 6485 2189
2597 2189 -1379 368 -491 -1499 -997 -3926 -6503 -4781 -5762 -6718 -4921 -4741 -6815 -3049 211 -3540
2581 -3540 -6993 -2738 1307 -113 -7558 -10696 -5189 -666 -4177 -6888 -5714 -2343 3925 3653 485
2566 485 1985 -792 -4576 -5700 -5532 -7308 -11762 -9798 -11600 -13429 -8450 -3476 2017 -1144 -2668
$$ packed form
2677E896k935Q01R74j440p02k423l604M662K330l385j363M958k951l074J273k239
2661c222m041J563N120K582l628l055j106K19K210k608m058N062M957K591l542
2646i56n048O2j543J385N44J710R92J910l556J034J971k200k385P56K455j468
2630d337k61L607K122J017l81K907N50l018l859P8m80k819R58K182l4J293p993
2613h468j461K318O402M832K190J339L045j521m783P39k6m668L260K214J073m296
2597B189l568J747q59j008N02k929k577J722r81r56J797J80k074L766L260l751
2581c540l453M255M045j420p445l138N507M523l511k711J174L371O268k72l168
2566D85J500k777l784j124J68j776m454J964j802j829M979M974N493l161j524
$$ plain form
2551 -2668 -4554 -3144 -2187 2740 4334 687 -4666 -3719 -2529 -46 644 1498 5571 5400 5947 6220 4810
2534 4810 836 -3508 -2876 -1610 -2748 -4002 -1337 780 2591 1176 893 34 -3475 -2911 619 1725
2518 1725 838 2097 366 -796 229 -3024 -7807 -6801 -4726 2090 1354 1890 -579 -4097 -3715 -2564
2502 -2564 -2207 -3978 -3238 358 -21 -6165 -7195 -4363 -4422 -3791 -2259 -543 -2930 -2330 -3931 -3309 -6404
2485 -6404 -3614 -3888 -3142 -3269 -2184 -425 -1033 -60 -5260 -6659 -6733 -6095 -3644 -1819 -4147 -6203 -8531
2468 -8531 -9991 -5884 655 3441 4152 121 1578 140 -2712 -3720 -1663 489 188 2076 -1022
2453 -1022 -1852 -539 1522 -54 2815 2591 288 3177 5927 156 -3207 -1029 171 3381 3856 5607
2437 5607 6691 5002 3936 3767 6977 6066 4598 2529 -4638 -6165 -5132 -6191 -6230 -6731 -5071 -5432
$$ packed form
2551b668j886J410R57M927J594l647n353R47J190K483O90Q54M073j71N47K73j410
2534D810l974m344O32J266j138j254K665K117J811j415k83q59l509N64L530J106
2518A725q87J259j731j162J025l253m783J006K075O816p36N36k469l518L82J151
2502b564L57j771P40L596l79o144j030K832n9O31J532J716k387O00j601O22l095
2485f404K790k74P46j27J085J759o08R73n200j399p4O38K451J825k328k056k328
2468h531j460M107O539K786P11m031J457j438k852j008K057K152l01J888l098
2453a022q30J313K061j576K869k24k303K889K750n771l363K178J200L210M75J751
2437E607J084j689j066j69L210r11j468k069p167j527J033j059l9n01J660l61
$$ plain form
2421 -5432 -2689 1287 1539 189 -926 -1790 -966 -4102 -1637 863 -2353 1818 2139 -1327 141 -2571
2405 -2571 -253 1609 5446 5176 6300 133 -3654 -4958 3081 9009 8826 935 -65 1817 1943 633
2389 633 1071 -969 -224 731 75 4472 6880 5339 6824 8661 8616 6691 5028 -2489 -1506 2759 3234
2372 3234 1592 63 -2740 -3087 -3636 -988 -4473 -8293 -6984 -2842 -3267 -5233 -5672 -8973 -8552 -6202
2356 -6202 -2715 -7609 -10474 -15774 -13094 -10458 -7638 -2416 688 4941 5426 5780 2182 2512 2003 -1845
2340 -1845 -5023 -9142 -8396 -5936 -2279 -4419 -2629 3452 2025 -5013 -9072 -4972 -3421 -5782 -2801
2325 -2801 -803 -485 1202 4361 68 63 -2221 -938 1480 -2290 276 3122 5023 -1809 -6857 -7556
2309 -7556 -9080 -10194 -2382 3262 -263 -4820 -6583 -4584 -1191 523 134 743 1878 5278 4117
$$ packed form
2421e432K743L976K52j350j115q64Q24l136K465K500l216M171L21l466J468k712
2405b571K318J862L837k70J124o167l787j304Q039N928j83p891j000J882J26j310
2389F33M38k040P45R55o56M397K408j541J485J837m5j925j663p517R83M265M75
2372C234j642j529k803l47n49K648l485l820J309M142m25j966m39l301M21K350
2356f202L487m894k865n300K680K636K820N222L104M253M85L54l598L30n09l848
2340a845l178m119P46K460L657k140J790O081j427p038m059M100J551k361K981
2325b801J998L18J687L159m293nk284J283K418l770K566K846J901o832n048o99
2309g556j524j114P812N644l525m557j763J999L393J714l89O09J135L400j161
$$ plain form
2294 4117 5199 9772 7642 962 -4500 -6906 -5572 -195 -763 -279 -2451 -6737 -1608 -1150 -1263 -3290
2278 -3290 -5028 -3300 -1504 -3544 -6321 -10257 -9177 -5985 -6890 -2338 -1421 434 834 -2159 -1586 958
2262 958 -1486 -1191 -404 -392 1532 3127 4171 599 -1822 -6007 -7398 -4324 -559 -4809 -8242 -10050
2246 -10050 -9638 -8482 -6826 914 1599 3953 3262 2592 3925 6657 833 -9697 -10994 -5298 -6040 -3647
2230 -3647 -4504 -2493 -2403 28 610 2290 9370 9228 4268 1117 1496 2180 1259 3124 4705 8810 7739
2213 7739 2057 437 3668 2909 2621 3283 554 1423 462 -3485 -2703 849 -404 5709 7032 6794 8798
2196 8798 6668 4733 3660 4755 4946 2980 4210 3382 668 -2185 -4816 -1595 -808 -1184 -113 -2355
2180 -2355 -743 4061 2344 -453 -2226 2966 5031 4818 1382 -764 1922 -1141 -1961 -3482 -1019
$$ packed form
2294D117J082M573k130o680n462k406J334N377n68M84k172m286N129M58j13k027
2278c290j738J728J796k040k777l936J080L192r05M552R17J855M00k993N73K544
2262I58k444K95P87J2J924J595J044l572k421m185j391L074L765m250l433j808
2246a0050M12J156J656P740O85K354o91o70J333K732n824j0530j297N696p42K393
2230c647q57K011R0K431N82J680P080j42m960l151L79O84r21J865J581M105j071
2213G739n682j620L231p59k88O62k729Q69r61l947P82L552j253O113J323k38K004
2196H798k130j935j073J095J91j966J230q28k714k853k631L221P87l76J071k242
2180b355J612M804j717k797j773N192K065k13l436k146K686l063q20j521K463
$$ plain form
2165 -1019 -5385 -13237 -14956 -13942 -5364 -1381 -2888 -5180 -4245 221 -2638 -2741 -557 2473 1151
2150 1151 -4819 -3348 988 1201 -2819 -3412 -1593 -1631 -1785 120 2145 -2667 -5053 -2126 -270 -78
2134 -78 1381 970 -1875 787 4284 2344 6254 7451 2048 -5446 -7195 -3760 -7588 -6356 -1075 -2379
2118 -2379 -3442 331 -2094 -1139 -5944 -6241 -3368 406 3540 6062 4785 -2159 -5593 -5389 -10740 -10076
2102 -10076 -3305 360 583 -2823 -9682 -11528 -5189 -3707 -5450 -3948 -804 1324 3804 3438 -4539
2087 -4539 -4041 -1591 -1370 -2093 2372 1462 -2698 -1075 781 1922 3069 2564 90 701 2099 2313 677
2070 677 3101 9369 9501 3696 2452 1852 -3075 -850 1070 4977 563 -987 -1795 -1614 -1020 -359 1925
2053 1925 -551 -4171 -2582 -4031 -4438 -729 8751 7966 1591 -2685 474 3479 5761 6512 7745 4138
$$ packed form
2165a019m366p852j719J014Q578L983j507k292R35M466k859j03K184L030j322
2150A151n970J471M336K13m020n93J819l8j54J905K025m812k386K927J856J92
2134g8J459m11k845K662L497j940L910J197n403p494j749L435l828J232N281j304
2118b379j063L773k425R55m805k97K873L774L134K522j277o944l434K04n351O64
2102a0076O771L665K23l406o859j846O339J482j743J502L144K128K480l66p977
2087d539M98K450K21p23M465r10m160J623J856J141J147n05k474O11J398K14j636
2070F77K424O268J32n805j244o00m927K225J920L907m414j550q08J81N94O61K284
2053A925k476l620J589j449m07L709R480p85o375m276L159L005K282P51J233l607
$$ plain form
2037 4138 6864 7640 5405 6926 8883 8988 3635 7478 9806 5038 1252 -1907 -1784 -5439 -6031 -5845
2021 -5845 -4699 -2917 -3805 -5414 4571 5339 -1475 -3934 -520 -1553 -5583 -5374 -3404 -3189 -6343 -4914
2005 -4914 -429 -763 907 -2338 -2222 -1774 -1056 472 -975 -6856 -3341 -2618 -5385 -6060 -7163 -3844
1989 -3844 -4446 -3065 2383 7161 7936 4663 6663 5307 -148 1526 1126 -2193 -2449 -659 1262 1962
1973 1962 -1071 560 -3993 -5161 -2157 5883 10889 8083 4673 2424 -1740 -3749 -5374 -3374 515
$$ packed form
2037D138K726P76k235J521J957J05n353L843K328m768l786l159J23l655n92J86
2021e845J146J782q88j609R985P68o814k459L414j033m030K09J970K15l154J429
2005d914M485l34J670l245J16M48P18J528j447n881L515P23k767o75j103L319
1989c844o02J381N448M778P75l273K000j356n455J674m00l319k56J790J921P00
1973A962l033J631m553j168L004Q040N006k806l410k249m164k009j625K000L889
$$ [...]
##END NTUPLES=NMR SPECTRUM
##END=
