##TITLE=Analysis number 320255
Compound Code cc 51309
Book Reference 494/14
Project Code adrs
Chemist Name craigr
##JCAMPDX= 6.0         $$ Bruker NMR JCAMP-DX V2.0
##DATA TYPE= NMR SPECTRUM
##DATA CLASS= NTUPLES
##ORIGIN= Bruker BioSpin GmbH
##OWNER= nmr
$$ XWIN-NMR		Version 3.5
$$ Tue Jun 20 08:54:18 2006 GMT Daylight Time (UT+1h)  MAYBRIDGE\nmr@NMR_250MHZ
##.OBSERVE FREQUENCY= 250.131544655141
##.OBSERVE NUCLEUS= ^1H
##.ACQUISITION MODE= SIMULTANEOUS (DQD)
##.ACQUISITION SCHEME= undefined
##.AVERAGES= 16
##.DIGITISER RES= 18
##SPECTROMETER/DATA SYSTEM= dpx250
##.PULSE SEQUENCE= zg30
##.SOLVENT NAME= CDCl3
##.SHIFT REFERENCE= (INTERNAL, CDCl3, 0, 16.522)
##AUDIT TRAIL= $$ (NUMBER, WHEN, WHO, WHERE, WHAT)
$$ ##TITLE= Audit trail, XWIN-NMR		Version 3.5
$$ ##JCAMPDX= 5.01
$$ ##ORIGIN= Bruker BioSpin GmbH
$$ ##OWNER= nmr
$$ C:\u/data/dgb/nmr/ADRS/1040/pdata/1/auditp.txt
$$ ##AUDIT TRAIL=  $$ (NUMBER, WHEN, WHO, WHERE, WHAT)
(   1,<2006-06-20 08:53:53.34 +100>,<MAYBRIDGE\nmr>,<NMR_250MHZ>,
      <created by zg, POWCHK disabled, PULCHK disabled
       configuration hash MD5:
       E2 DF 36 D8 04 B2 41 60 5A D7 A3 38 5A 4B D0 FE
       data hash MD5: 64K
       BA B1 BB F9 7B B7 C4 3D 8A 68 94 34 38 12 FB 79>)
(   2,<2006-06-20 08:54:06.62 +100>,<MAYBRIDGE\nmr>,<NMR_250MHZ>,
      <Start of raw data processing
       ef LB = 0.3 FT_mod = 6 PKNL = 1 SI = 32K 
       data hash MD5: 32K
       60 58 8D 9D A9 52 6A AA AB 67 54 5D E5 86 82 35>)
(   3,<2006-06-20 08:54:08.26 +100>,<MAYBRIDGE\nmr>,<NMR_250MHZ>,
      <apk 
       data hash MD5: 32K
       3B 2D D1 60 2A 6C 15 CA 2D C9 37 8D 79 B5 18 D3>)
(   4,<2006-06-20 08:54:09.17 +100>,<MAYBRIDGE\nmr>,<NMR_250MHZ>,
      <abs ABSG = 5 
       data hash MD5: 32K
       73 B4 B5 B3 63 0F EB 76 B3 BB DE 5F AF 69 FB AE>)
$$ ##END=
$$ 
$$ hash MD5
$$ BD 63 EF 0A 6C C4 06 70 FB 1F FA 72 CC F5 59 A2
##$RELAX= 
##$RELAX= 
##$RELAX= 
##$RELAX= 
##$RELAX= 
##$RELAX= 
##$RELAX= 
$$ Bruker specific parameters
$$ --------------------------
##$DU= <C:\u>
##$EXPNO= 1040
##$NAME= <ADRS>
##$PROCNO= 1
##$TYPE= <nmr>
##$USER= <dgb>
##$AMP= (0..31)
100 100 100 100 100 100 100 100 100 100 100 100 100 100 100 100 100 100 
100 100 100 100 100 100 100 100 100 100 100 100 100 100 
##$AQSEQ= 0
##$AQ_mod= 3
##$AUNM= <au_zg>
##$AUTOPOS= <1 >
##$BF1= 250.13
##$BF2= 250.13
##$BF3= 250.13
##$BF4= 250.13
##$BF5= 500.13
##$BF6= 500.13
##$BF7= 500.13
##$BF8= 500.13
##$BYTORDA= 1
##$CFDGTYP= 0
##$CFRGTYP= 5
##$CHEMSTR= <none>
##$CNST= (0..31)
1 1 145 1 1 1 1 1 1 1 1 1 1 1 1 1 1 1 1 1 1 1 1 1 1 1 1 1 1 1 1 1 
##$CPDPRG= <>
##$CPDPRG1= <>
##$CPDPRG2= <>
##$CPDPRG3= <>
##$CPDPRG4= <mlev>
##$CPDPRG5= <mlev>
##$CPDPRG6= <mlev>
##$CPDPRG7= <mlev>
##$CPDPRG8= <mlev>
##$CPDPRGB= <>
##$CPDPRGT= <>
##$D= (0..31)
0 1 0 0 0 0 0 0 0 0.06 0 0 0 0 0 0 0.0002 0 0 0 0 0 0 0 0 0 0 0 0 0 0 
0 
##$DATE= 1150790032
##$DBL= (0..7)
120 120 120 120 120 120 120 120 
##$DBP= (0..7)
150 150 150 150 150 150 150 150 
##$DBP07= 0
##$DBPNAM0= <>
##$DBPNAM1= <>
$$ [...]
##$SUBNAM6= <"">
##$SUBNAM7= <"">
##$SUBNAM8= <"">
##$SUBNAM9= <"">
##$SW= 20.6930455092707
##$SWIBOX= (0..15)
0 0 3 0 0 0 0 0 0 0 0 0 0 0 0 0 
##$SW_h= 5175.983436853
##$TD= 65536
##$TD0= 1
##$TE= 294.16
##$TE2= 300
##$TE3= 300
##$TEG= 300
##$TL= (0..7)
0 120 120 120 120 120 120 120 
##$TP= (0..7)
150 150 150 150 150 150 150 150 
##$TP07= 0
##$TPNAME0= <>
##$TPNAME1= <>
##$TPNAME2= <>
##$TPNAME3= <>
##$TPNAME4= <>
##$TPNAME5= <>
##$TPNAME6= <>
##$TPNAME7= <>
##$TPOAL= (0..7)
0.5 0.5 0.5 0.5 0.5 0.5 0.5 0.5 
##$TPOFFS= (0..7)
0 0 0 0 0 0 0 0 
##$TUNHIN= 0
##$TUNHOUT= 0
##$TUNXOUT= 0
##$USERA1= <user>
##$USERA2= <user>
##$USERA3= <user>
##$USERA4= <user>
##$USERA5= <user>
##$V9= 5
##$VALIST= <valist>
##$VCLIST= <CCCCCCCCCCCCCCC>
##$VD= 0
##$VDLIST= <DDDDDDDDDDDDDDD>
##$VPLIST= <PPPPPPPPPPPPPPP>
##$VTLIST= <TTTTTTTTTTTTTTT>
##$WBST= 1024
##$WBSW= 4
##$XGAIN= (0..3)
0 0 0 0 
##$XL= 0
##$YL= 0
##$YMAX_a= 306436
##$YMIN_a= -464412
##$ZGOPTNS= <>
##$ZL1= 120
##$ZL2= 120
##$ZL3= 120
##$ZL4= 120
##$ABSF1= 16.522
##$ABSF2= -4.171173
##$ABSG= 5
##$ABSL= 3
##$ALPHA= 0
##$AQORDER= 0
##$ASSFAC= 0
##$ASSFACI= 0
##$ASSFACX= 0
##$ASSWID= 0
##$AUNMP= <proc_1d>
##$AZFE= 0.1
##$AZFW= 0.1
##$BCFW= 0
##$BC_mod= 0
##$BYTORDP= 0
##$COROFFS= 0
##$CY= 12.5
##$DATMOD= 1
##$DC= 0
##$DFILT= <>
##$DTYPP= 0
##$F1P= 14.0000005364418
##$F2P= -0.99999901652339
##$FCOR= 0.5
##$FTSIZE= 32768
##$FT_mod= 6
##$GAMMA= 0
##$GB= 0
##$INTBC= 1
##$INTSCL= 1
##$ISEN= 128
##$LB= 0.3
##$LEV0= 0
##$LPBIN= 0
##$MAXI= 10000
##$MC2= 0
##$MEAN= 0
##$ME_mod= 0
##$MI= 0
##$NCOEF= 0
##$NC_proc= -3
##$NLEV= 6
##$NOISF1= 0
##$NOISF2= 0
##$NSP= 0
##$NTH_PI= 0
##$NZP= 0
##$OFFSET= 16.522
##$PC= 1
##$PHC0= 168.3993
##$PHC1= 11.201
##$PH_mod= 1
##$PKNL= yes
##$PPARMOD= 0
##$PSCAL= 4
##$PSIGN= 0
##$REVERSE= no
##$SF= 250.13
##$SI= 32768
##$SIGF1= 0
##$SIGF2= 0
##$SINO= 400
##$SIOLD= 32768
##$SREGLST= <1H.CDCl3>
##$SSB= 0
##$STSI= 32768
##$STSR= 0
##$SW_p= 5175.98343685301
##$SYMM= 0
##$S_DEV= 0
##$TDeff= 65536
##$TDoff= 0
##$TI= <Analysis number 999999
Compound Code 99
Book Reference 9
Project Code 9>
##$TILT= no
##$TM1= 0
##$TM2= 0
##$TOPLEV= 0
##$USERP1= <user>
##$USERP2= <user>
##$USERP3= <user>
##$USERP4= <user>
##$USERP5= <user>
##$WDW= 1
##$XDIM= 32768
##$YMAX_p= 362575086
##$YMIN_p= -65561
$$ End of Bruker specific parameters
$$ ---------------------------------
##NTUPLES= NMR SPECTRUM
##VAR_NAME=  FREQUENCY,     SPECTRUM/REAL,   SPECTRUM/IMAG
##SYMBOL=    X,             R,               I
##VAR_TYPE=  INDEPENDENT,   DEPENDENT,       DEPENDENT
##VAR_FORM=  AFFN,          ASDF,            ASDF
##VAR_DIM=   32768,         32768,           32768
##UNITS=     HZ,            ARBITRARY UNITS, ARBITRARY UNITS
##FACTOR=    0.157963299565203, 1,           1
##FIRST=     4132.6476996994, 0,             0
##LAST=      -1043.33573715361, 0,           0
##MIN=       -1043.33573715361, -65561,      0
##MAX=       4132.6476996994, 362575086,     0
$$ Real data points
##PAGE= N=1
##DATA TABLE= (X++(R..R)), XYDATA
$$ [...]
$$ plain form
16165 151433 168727 181018 177619 176355 184441 182682 178483 182753 187830 186632 194670 205983 200962
16152 200962 187097 175401 177665 174779 173852 192215 208028 192427 194185 197951 204826 213225 221359
16139 221359 220413 205721 208480 213525 214399 216950 217577 222818 218609 221952 223696 221723 209144 211908
16125 211908 223112 216995 213619 213992 225522 234421 231270 234570 241293 224596 214203 217809 225705
16112 225705 239676 245083 240472 237966 232761 218233 208427 231060 250304 258433 264940 261487 259020
16099 259020 260658 258794 254979 253432 239309 234960 239061 237485 240350 245383 264438 271712 262277 255181
16085 255181 248950 253170 262426 258575 260725 257533 262937 281544 285559 289892 291454 298710 317844 308383
16071 308383 303726 309960 320621 325339 315903 304594 307947 314660 304787 297198 309897 313041 305654
$$ packed form
16165A51433J7294J2291l399j264Q086j759m199M270N077j198Q038J1313n021
16152B00962j3865j1696K264k886r27J8363J5813j5601J758L766O875Q399Q134
16139B21359r46j4692K759N045Q74K551O27N241m209L343J744j973j2579K764
16125B11908J1204o117l376L73J1530Q899l151L300O723j6697j0393L606P896
16112B25705J3971N407m611k506n205j4528r806K2633J9244Q129O507l453k467
16099B59020J638j864l815j547j4123m349M101j576K865N033J9055P274r435p096
16085B55181o231M220R256l851K150l192N404J8607M015M333J562P256J9134r461
16071C08383m657O234J0661M718r436j1309L353O713r873p589J2699L144p387
$$ plain form
16058 305654 305053 309903 313832 327998 333845 342772 361094 369236 375432 368834 356938 358909 368590 367215
16044 367215 370127 372759 361896 364688 371671 371993 376329 385336 387219 387196 386733 374006 370408 385022
16030 385022 398465 398281 403224 403069 409803 406495 397809 388679 387219 387162 407787 413611 402141 385206
16016 385206 378107 396493 411302 415392 426292 447290 442851 431403 433256 442120 440962 425646 428809
16003 428809 445750 458770 469907 476967 485477 485512 473829 467872 492481 487391 479961 478251 486742
15990 486742 503363 502292 510327 519953 521725 537824 547793 564883 552003 541543 533958 543859 549589
15977 549589 554063 563096 563104 569752 576701 568510 564696 571243 578404 579571 588998 596571 604044 593810 570227
15962 570227 569563 593640 611408 614379 627960 634522 644284 639099 639626 633404 640248 646346 647832 654383
$$ packed form
16058C05654o01M850L929J4166N847Q927J8322Q142O196o598j1896J971R681j375
16044C67215K912K632j0863K792O983L22M336R007J883k3m63j2727l598J4614
16030C85022J3443j84M943j55O734l308q686r130j460n7K0625N824j1470j6935
16016C85206p099J8386J4809M090J0900K0998m439j1448J853Q864j158j5316L163
16003D28809J6941J3020J1137P060Q510L5j1683n957K4609n090p430j710Q491
15990D86742J6621j071Q035R626J772J6099R969J7090j2880j0460p585R901N730
15977E49589M474R033QO648O949q191l814O547P161J167R427P573P473j0234k3583
15962E70227o64K4077J7768K971J3581O562R762n185N27o222O844O098J486O551
$$ plain form
15948 654383 656504 662848 673232 694712 712317 706039 700249 701510 713307 713857 702807 707325 709539
15935 709539 728063 739903 737369 751016 758907 769704 769903 755178 769936 785089 791142 793495 787457
15922 787457 773445 782192 797358 806593 804888 796789 801034 817865 831009 839968 836939 852123 854096
15909 854096 852961 860695 871036 873456 866052 888296 922795 943798 951294 948502 962776 965383 974892
15896 974892 968700 973038 984795 984057 997858 1009031 1007138 1021406 1035756 1035117 1033069 1047593 1050914
15883 1050914 1056207 1058118 1063968 1076595 1092721 1109144 1117365 1121982 1128588 1139242 1131968 1126067 1138958
15870 1138958 1154242 1168918 1186138 1199805 1197789 1213952 1223906 1228277 1225134 1240545 1271675 1280363
15858 1280363 1267021 1256700 1265760 1276825 1301196 1316235 1317070 1323796 1331655 1335302 1343616 1356135 1373822
$$ packed form
15948F54383K121O344J0384K1480J7605o278n790J261J1797N50j1050M518K214
15935G09539J8524J1840k534J3647P891J0797J99j4725J4758J5153O053K353o038
15922G87457j4012Q747J5166R235j705q099M245J6831J3144Q959l029J5184J973
15909H54096j135P734J0341K420p404K2244L4499K1003P496k792J4274K607R509
15896I74892o192M338J1757p38J3801J1173j893J4268J4350o39k048J4524L321
15883A050914N293J911N850J2627J6126J6423Q221M617O606J0654p274n901J2891
15870A138958J5284J4676J7220J3667k016J6163R954M371l143J5411L1130Q688
15858A280363j3342j0321R060J1065K4371J5039Q35O726P859L647Q314J2519J7687
$$ plain form
15845 1373822 1382546 1385076 1389139 1393921 1416321 1434198 1439873 1436401 1454695 1473018 1481678 1498946 1513248
15832 1513248 1529431 1540908 1548977 1556879 1549186 1553762 1567436 1561850 1570880 1598889 1608353 1612057 1603652
15819 1603652 1606184 1604738 1614112 1642462 1665021 1670898 1665101 1676483 1692352 1699125 1697454 1695200 1708297
15806 1708297 1727105 1747541 1763378 1769134 1776659 1787819 1797942 1791916 1788357 1783690 1789398 1796301 1819490
15793 1819490 1825161 1836854 1852219 1845297 1850066 1864616 1884647 1891373 1898901 1882501 1881855 1887386 1886085
15780 1886085 1888769 1896764 1908484 1921661 1930357 1944209 1935847 1921094 1942507 1961207 1972123 1990096
15768 1990096 1994994 1991700 1984542 1979211 1975391 1963380 1964400 1956647 1960721 1962796 1967253 1967904 1968568 1962937
15754 1962937 1960727 1960833 1960729 1957459 1968827 1965884 1952531 1965547 1972539 1972281 1979644 1990278 1990185 1994642
$$ packed form
15845A373822Q724K530M063M782K2400J7877N675l472J8294J8323Q660J7268J4302
15832A513248J6183J1477Q069P902p693M576J3674n586R030K8009R464L704q405
15819A603652K532j446R374K8350K2559N877n797J1382J5869O773j671k254J3097
15806A708297J8808K0436J5837N756P525J1160J0123o026l559m667N708O903K3189
15793A819490N671J1693J5365o922M769J4550K0031O726P528j6400o46N531j301
15780A886085K684P995J1720J3177Q696J3852q362j4753K1413J8700J0916J7973
15768A990096M898l294p158n331l820j2011J020p753M074K075M457O51O64n631
15754A962937k210J06j04l270J1368k943j3353J3016O992k58P363J0634r3M457
$$ plain form
15740 1994642 1993795 1996119 1984081 1959921 1951380 1958739 1952981 1946210 1936605 1920935 1915311 1919438 1933811
15727 1933811 1929270 1932092 1934340 1927052 1918503 1910950 1903087 1911372 1904565 1881891 1866970 1863043 1861025
15714 1861025 1843062 1839049 1835057 1837512 1834887 1838809 1839780 1828295 1819780 1815996 1823438 1818377 1799080
15701 1799080 1783366 1758153 1756272 1747630 1744416 1744379 1745081 1723941 1703669 1687346 1702977 1726665 1716727
15688 1716727 1695324 1689811 1672252 1660875 1644389 1625352 1626140 1618472 1622246 1627206 1617480 1605215 1589512
15675 1589512 1583203 1582353 1566189 1556463 1553325 1547618 1541036 1514656 1494297 1501994 1494296 1471303 1464736
15662 1464736 1465878 1462623 1449918 1431947 1422128 1424086 1419642 1405862 1390840 1385307 1379122 1365156 1367657
15649 1367657 1360096 1339980 1323391 1309795 1311380 1318426 1314088 1294535 1281738 1285819 1272945 1260110
$$ packed form
15740A994642q47K324j2038k4160q541P359n758o771r605j5670n624M127J4373
15727A933811m541K822K248p288q549p553p863Q285o807k2674j4921l927k018
15714A861025j7963m013l992K455k625L922R71j1485q515l784P442n061j9297
15701A799080j5714k5213j881q642l214l7P02k1140k0272j6323J5631K3688r938
15688A716727k1403n513j7559j1377j6486j9037P88p668L774M960r726j2265j5703
15675A589512o309q50j6164r726l138n707o582k6380k0359P697p698k2993o567
15662A464736J142l255j2705j7971r819J958m444j3780j5022n533o185j3966K501
15649A367657p561k0116j6589j3596J585P046m338j9553j2797M081j2874j2835
$$ plain form
15637 1260110 1252755 1236414 1216843 1199611 1188082 1190027 1188651 1181243 1179810 1173229 1169005 1160536 1145594
15624 1145594 1147320 1133195 1119227 1123065 1115902 1102915 1103071 1109657 1097598 1073505 1066177 1057685 1058409
15611 1058409 1051830 1050951 1054939 1045944 1033711 1027379 1014317 1009448 1017437 1024116 1015245 1003689 998360
15598 998360 997808 991383 988234 985640 961156 945011 940451 943802 936707 921613 926320 924261 902915
15585 902915 897226 878284 880052 876715 871797 871745 863827 852053 853133 838807 838542 838340 834359 828294
15571 828294 816828 805622 795110 783799 778398 775523 779002 777167 769472 768704 767620 758008 746188
15558 746188 751305 758340 760691 764449 755724 753436 737238 717749 710756 721997 715814 703293 701290
15545 701290 718933 717708 713742 724733 719804 714679 725259 753177 764286 775670 775155 790672 791291
$$ packed form
15637A260110p355j6341j9571j7232j1529J945j376p408j433o581m224q469j4942
15624A145594J726j4125j3968L838p163j2987J56O586j2059k4093p328q492P24
15611A058409o579q79L988q995j2233o332j3062m869P989O679q871j1556n329
15598I98360n52o425l149k594k4484j6145m560L351p095j5094M707k059k1346
15585I02915n689j8942J768l337m918n2p918j1774J080j4326k65k02l981o065
15571H28294j1466j1206j0512j1311n401k875L479j835p695p68j084r612j1820
15558G46188N117P035K351L758q725k288j6198j9489o993J1241o183j2521k003
15545G01290J7643j225l966J0991m929n125J0580K7918J1109J1384n15J5517O19
$$ plain form
15532 791291 805342 835655 847236 846490 852543 845658 848696 836568 813429 781881 747266 719783
15520 719783 695475 672950 656040 643701 659198 656841 645391 635109 612556 584611 576312 583770
15508 583770 580691 570982 565633 569893 566655 556273 556023 554188 557633 551445 546598 528196 534989 529036
15494 529036 516769 513806 515333 514219 507409 502132 499906 507348 519808 513919 495039 483745 492357
15481 492357 483467 477781 484938 489237 494126 492639 481472 462924 457024 466905 471645 465204 460542 444256
15467 444256 435282 428758 419351 425513 419467 411510 409633 418596 415079 392204 388861 396023 394400 390843
15453 390843 391067 400721 403091 402055 395736 381992 383979 391150 377474 381377 381317 384549 392624 394491
15439 394491 396220 391359 384138 370041 353930 347788 349948 339248 338795 351399 342685 336143 349386
$$ packed form
15532G91291J4051L0313J1581p46O053o885L038j2128k3139l1548l4615k7483
15520G19783k4308k2525j6910j2339J5497k357j1450j0282k2553k7945q299P458
15508E83770l079r709n349M260l238j0382k50j835L445o188m847j8402O793n953
15494E29036j2267k963J527j114o810n277k226P442J2460n889j8880j1294Q612
15481D92357q890n686P157M299M889j487j1167j8548n900R881M740o441m662j6286
15467D44256q974o524r407O162o046p957j877Q963l517k2875l343P162j623l557
15453C90843K24R654K370j036o319j3744J987P171j3676L903o0L232Q075J867
15439C94491J729m861p221j4097j6111o142K160j0700m53J2604q714o542J3243
$$ plain form
15426 349386 354842 357978 337927 345496 354514 351489 348223 345948 343497 342108 347439 354139 348350 339112
15412 339112 343910 350180 345550 333835 327269 311057 291377 295808 296939 296169 300719 311571 302064
15399 302064 297808 294400 295736 297949 288129 284104 287735 295379 281818 274048 284664 296353 297615
15386 297615 295949 295201 276693 271538 265807 260732 265386 268299 269399 261172 254740 260296 263681 255123
15372 255123 247920 250493 251894 250301 259787 253453 240939 250359 251022 250015 237537 232029 242126 244929
15358 244929 246880 242689 224627 220362 230541 243420 248168 253430 253861 247005 246893 252636 260217 245537
15344 245537 232071 228253 234886 238398 235498 229337 235581 234853 227332 213331 192465 187688 198708
15331 198708 208505 216932 226429 229406 230317 224008 209587 204710 195329 198270 206010 214645 200063 190863
$$ packed form
15426C49386N456L136k0051P569R018l025l266k275k451j389N331O700n789r238
15412C39112M798O270m630j1715o566j6212j9680M431J131p70M550J0852r507
15399C02064m256l408J336K213r820m025L631P644j3561p770J0616J1689J262
15386B97615j666p48j8508n155n731n075M654K913J100q227o432N556L385q558
15372B55123p203K573J401j593R486o334j2514R420O63j007j2478n508J0097K803
15358B44929J951m191j8062m265J0179J2879M748N262M31o856j12N743P581j4680
15344B45537j3466l818O633L512k900o161O244p28p521j4001k0866m777J1020
15331A98708R797Q427R497K977R11o309j4421m877r381K941P740Q635j4582r200
$$ plain form
15317 190863 189328 179540 185308 191269 190751 196618 202320 200651 193680 169840 179008 201531 196921 183826
15303 183826 183710 190686 190647 189554 192482 197192 185137 174699 187564 185795 186862 196760 190456 176180
15289 176180 164916 161681 177758 186770 185873 177454 166325 166278 171658 180907 168032 164788 167709 179877
15275 179877 189470 193693 208119 192877 180338 184501 190727 182677 172844 162527 164616 173816 169598
15262 169598 160380 144573 135074 137491 146683 151410 160267 169544 167457 167424 154821 149548 153454 161406
15248 161406 173527 191256 193675 192500 192643 193795 176148 168600 172981 160356 155726 165592 163927
15235 163927 158744 148995 150339 135384 125859 126119 126657 134000 152208 155150 138374 123564 115855 117824
15221 117824 124062 131882 135487 134637 126028 112998 108720 128844 133491 130638 141462 145488 146934 152788
$$ packed form
15317A90863j535r788N768N961n18N867N702j669o971k3840R168K2523m610j3095
15303A83826j16O976l9j093K928M710j2055j0438J2865j769J067R898o304j4276
15289A76180j1264l235J6077R012q97q419j1129m7N380R249j2875l244K921J2168
15275A79877R593M223J4426j5242j2539M163O226q050r833j0317K089R200m218
15262A69598r218j5807r499K417R192M727Q857R277k087l3j2603n273L906P952
15248A61406J2121J7729K419j175J43J152j7647p548M381j2625m630R866j665
15235A63927n183r749J344j4955r525K60N38P343J8208K942j6776j4810p709J969
15221A17824O238P820L605q50q609j3030m278K0124M647k853J0824M026J446N854
$$ plain form
15207 152788 157633 160183 160340 148674 137407 140411 136155 133070 137828 145154 147546 143258 143107 153796
15193 153796 148645 148201 148568 147758 146794 139466 134426 128096 129295 125145 127808 132313 123375 115333 116996
15178 116996 126010 132178 120716 124238 132194 124316 127257 127773 115076 104710 99040 94289 80150
15165 80150 76062 85614 91757 102928 111567 108005 115758 120431 113418 110416 93582 90997 112212 123520
15151 123520 118183 128049 128787 106532 111005 132160 138020 150830 153006 147731 142709 133043 125386 107478
15137 107478 95243 96503 98795 100653 106786 117181 116259 120438 117902 112834 93041 80390 89007
15124 89007 100509 108907 112436 103545 96793 95025 86548 82013 80681 74155 74248 78771 80423 65263
15110 65263 74788 89453 98113 99151 85124 76444 87153 85394 70701 71809 89472 94684 96392
$$ packed form
15207A52788M845K550J57j1666j1267L004m256l085M758P326K392m288j51J0689
15193A53796n151m44L67q10r64p328n040o330J199m150K663M505q938q042J663
15178A16996R014O168j1462L522P956p878K941N16j2697j0366n670m751j4139
15165H0150m088R552O143J1171Q639l562P753M673p013l002j6834k585K1215J1308
15151A23520n337R866P38k2255M473K1155N860J2810K176n275n022r666p657j7908
15137A07478j2235J260K292J858O133J0395r22M179k536n068j9793j2651Q617
15124H9007J1502Q398L529q891o752j768q477m535j332o526R3M523J652j5160
15110F5263R525J4665Q660J038j4027q680J0709j759j4693J108J7663N212J708
$$ plain form
15097 96392 100313 96140 106573 98595 83294 75496 83464 100290 90409 103020 120535 114522 100568
15084 100568 88908 74977 73911 68212 78438 85974 74364 62301 75003 87256 91047 84434
15072 84434 78120 86435 98311 90743 67986 56179 69338 87983 104653 117075 92688 88675
15060 88675 85432 81882 81223 67594 67785 77973 74014 75676 87655 84416 92971 105729 93470 70568
15046 70568 67504 76441 91768 95207 86793 77212 76102 71630 77638 90281 97732 90323 90662 96692
15032 96692 102811 98225 80210 76393 70299 75436 76537 88330 100156 91837 76575 71815 90709
15019 90709 98615 91121 83464 95377 98443 85573 88824 79824 64590 62076 66764 74979 81000 85542
15005 85542 100270 108027 110494 111190 114161 125697 136579 153676 174189 226684 313854 422659
$$ packed form
15097I6392L921m173J0433p978j5301p798P968J6826r881J2611J7515o013j3954
15084A00568j1660j3931j066n699J0226P536j1610j2063J2702J2253L791o613
15072H4434o314Q315J1876p568k2757j1807J3159J8645J6670J2422k4387m013
15060H8675l243l550o59j3629J91J0188l959J662J1979l239Q555J2758j2259k2902
15046G0568l064Q937J5327L439q414r581j110m472O008J2643P451p409L39O030
15032I6692O119m586j8015l817o094N137J101J1793J1826q319j5262m760J8894
15019I0709P906p494p657J1913L066j2870L251r000j5234k514M688Q215O021M542
15005H5542J4728P757K467O96K971J1536J0882J7097K0513N2495Q7170J08805
$$ plain form
14993 422659 478389 499308 518221 545078 547375 428770 288698 207182 160233 152061 145062 134112
14981 134112 124909 110910 115879 124576 116489 102632 94082 93272 95201 86674 88875 88527 103586 103084
14967 103084 92655 82053 79908 82722 91947 98038 101102 85100 81819 76915 87094 74664 70710
14954 70710 69101 70428 73633 83944 85340 78771 77524 67993 70137 65443 55006 51760 47053 43696
14940 43696 55004 57167 47263 41968 49623 62981 59398 62546 81425 82049 82687 69088 50656 62854
14926 62854 71663 75373 84693 83709 71647 62306 62432 60361 48226 53780 69913 70533 79649 85351
14912 85351 70889 65555 53176 48448 46803 50274 35140 30591 41959 52336 45476 60921 67574
14899 67574 69776 70897 72415 61066 45989 43393 51969 60012 57341 46584 38162 32765 30286 36242
$$ packed form
14993D22659N5730K0919J8913K6857K297j18605j40072q1516m6949q172o999j0950
14981A34112r203j3999M969Q697q087j3857q550q10J929q527K201l48J5059n02
14967A03084j0429j0602k145K814R225O091L064j6002l281m904J0179j2430l954
14954G0710j609J327L205J0311J396o569j247r531K144m694j0437l246m707l357
14940D3696J1308K163r904n295P655J3358l583L148J8879O24O38j3599j8432J2198
14926F2854Q809L710R320r84j2062r341J26k071j2135N554J6133O20R116N702
14912H5351j4462n334j2379m728j645L471j5134m549J1368J0377o860J5445O653
14899F7574K202J121J518j1349j5077k596Q576Q043k671j0757q422n397k479N956
$$ plain form
14885 36242 37160 43954 48895 53603 56867 53390 44515 36167 39399 41708 43894 40725 51162 57156
14871 57156 47414 36094 18410 18026 32206 36736 39397 36449 41332 52781 52493 50726 54824 61738
14857 61738 49219 51680 54011 48515 36643 35472 36585 45630 51035 52036 41826 44368 48294 45883
14843 45883 45292 52839 47129 35089 41728 43834 34816 42959 50909 49001 27146 22494 35473 45979
14829 45979 44108 33646 32673 47465 38459 29671 38308 50726 41557 45290 37980 36181 46597 47837
14815 47837 29848 23856 26743 36940 35999 51654 55663 53836 42403 47813 47266 59972 39247
14802 39247 25229 22348 33769 43630 48554 34372 23098 31059 34157 35776 40339 27644 20896
14789 20896 29227 24454 32118 38243 45534 55957 53931 38144 44807 50458 48468 42872 43298 55996
$$ packed form
14885C6242R18O794M941M708L264l477q875q348L232K309K186l169J0437N994
14871E7156r742j1320j7684l84J4180M530K661k948M883J1449k88j767M098O914
14857F1738j2519K461K331n496j1872j171J113R045N405J001j0210K542L926k411
14843D5883n91P547n710j2040O639K106r018Q143P950j908k1855m652J2979J0506
14829D5979j871j0462r73J4792r006q788Q637J2418r169L733p310j799J0416J240
14815D7837j7989n992K887J0197r41J5655M009j827j1433N410n47J2706k0725
14802C9247j4018k881J1421R861M924j4182j1274P961L098J619M563j2695o748
14789B0896Q331m773P664O125P291J0423k026j5787O663N651j990n596M26J2698
$$ plain form
14775 55996 46355 22738 27466 37101 35983 40799 37295 33858 29272 33888 18290 15436 11743 22729
14761 22729 34274 46289 39775 20973 33918 33057 37932 33392 28628 35482 39237 42123 38831 31137
14747 31137 29903 36826 24810 24590 33263 26741 21762 21159 27425 32712 24981 20335 15525 15818 18559
14732 18559 19994 18752 31920 47920 47798 44875 35517 22333 15312 13490 19581 31253 24733 18498
14718 18498 10942 9497 16149 16969 14294 8959 2051 5344 12245 20290 15504 17454 16272 32631
14704 32631 48871 44717 43704 43133 39538 42309 39054 35065 32829 30742 37798 44309 43738 36067 32829
14689 32829 31466 44050 46132 54147 57488 36969 29004 40297 40083 33629 33655 36225 35428 40702 40463
14674 40463 39687 36147 33238 36590 37034 33428 33481 42446 40509 53344 50095 51608 56561 55758 55906 61829
$$ packed form
14775E5996r641k3617M728R635j118M816l504l437m586M616j5598k854l693J0986
14761B2729J1545J2015o514j8802J2945q61M875m540m764O854L755K886l292p694
14747C1137j234O923j2016k20Q673o522m979o03O266N287p731m646m810K93K741
14732A8559J435j242J3168J6000j22k923r358j3184p021j822O091J1672o520o235
14718A8498p556j445O652Q20k675n335o908L293O901Q045m786J950j182J6359
14704C2631J6240m154j013n71l595K771l255l989k236k087P056O511n71p671l238
14689C2829j363J2584K082Q015L341k0519p965J1293k14o454K6K570p97N274k39
14674D0463p76l540k909L352M44l606N3Q965j937J2835l249J513M953q03J48N923
$$ plain form
14658 61829 73741 82289 59010 52204 35761 19579 21019 21124 14646 12423 15669 20270 8995
14645 8995 4733 19437 26301 41385 34652 20969 27328 42011 38886 35848 24716 25247 29542 35404
14631 35404 35559 32259 26162 23526 23709 40810 33217 12353 6015 12131 20412 18814 26862 25814
14617 25814 20083 22338 17401 15524 22723 30185 51296 61249 51086 38271 36187 28332 18991 38862
14603 38862 50418 45022 30529 17462 25518 30066 28566 25158 17085 14104 13643 19168 20747 18607
14589 18607 17355 16542 13009 23758 26845 24802 37025 47652 46962 34401 30526 27857 36526 37833
14575 37833 29093 33980 28908 23341 27846 29837 33976 23772 29398 23633 8978 12477 13334 23298
14561 23298 35682 42533 54663 56025 41298 29918 13994 18169 43028 40195 29024 18987
$$ packed form
14658F1829J1912Q548k3279o806j6443j6182J440J05o478k223L246M601j1275
14645H995m262J4704O864J5084o733j3683O359J4683l125l038j1132N31M295N862
14631C5404J55l300o097k636J83J7101p593k0864o338O116Q281j598Q048j048
14617B5814n731K255m937j877P199P462K1111R953j0163j2815k084p855r341J9871
14603C8862J1556n396j4493j3067Q056M548j500l408q073k981m61N525J579k140
14589A8607j252q13l533J0749L087k043J2223J0627o90j2561l875k669Q669J307
14575C7833q740M887n072n567M505J991M139j0204N626n765j4655L499Q57R964
14561B3298J2384O851J2130J362j4727j1380j5924M175K4859k833j1171j0037
$$ plain form
14549 18987 23794 28825 26087 33199 39873 29561 20536 26359 37491 41540 42052 39007 38440 38744 32317
14534 32317 35638 51416 54874 61850 68464 63759 61069 60951 57843 57668 50890 44835 49189 50464 40149
14519 40149 29617 28250 29306 43064 41631 29246 23603 27909 27244 13538 3360 -4871 6810
14506 6810 8132 6931 -11175 -4238 23086 13642 -2529 1246 15754 17010 18804 18336 14270 17186
14492 17186 14096 21307 27152 22993 25326 19771 7029 13832 17015 1469 -10949 -13712 -2784
14479 -2784 5548 14501 25130 30474 31397 23185 14236 17212 17454 18174 23792 5847 6993 7491 8962
14464 8962 7329 18843 35526 20743 29007 24184 21983 4012 -1932 737 3223 -3351 -4839 14487
14450 14487 17715 14197 20795 12447 7852 8031 18635 27036 30705 30532 32853 35370 26825 18663 3264
$$ packed form
14549A8987M807N031k738P112O674j0312r025N823J1132M049N12l045n67L04o427
14534C2317L321J5778L458O976O614m705k690j18l108j75o778o055M354J275j0315
14519D0149j0532j367J056J3758j433j2385n643M306o65j3706j0178q231J1681
14506F810J322j201j8106O937K7324r444j6171L775J4508J256J794m68m066K916
14492A7186l090P211N845m159K333n555j2742O803L183j5546j2418k763J0928
14479b784Q332Q953J0629N344R23q212q949K976K42P20N618j7945J146M98J471
14464H962j633J1514J6683j4783Q264m823k201j7971n944K669K486o574j488J9326
14450A4487L228l518O598q348m595J79J0604Q401L669j73K321K517q545q162j5399
$$ plain form
14435 3264 15716 14197 10464 6490 8881 9350 17672 25383 26084 30964 27878 24842 19053 18865 24505
14420 24505 40417 37270 23607 20017 6201 7262 11126 6456 14007 24978 12712 13633 22431
14407 22431 26014 26866 27102 15061 20427 22722 16328 31393 36066 34021 29506 29258 35956 31235 31555
14392 31555 42473 52192 51861 49782 22982 8108 3587 6441 23929 27883 30964 27353 24414 28693
14378 28693 18544 23014 35106 28002 21687 21088 31615 23444 12869 14650 31231 36024 20421
14365 20421 18920 33826 26009 33312 35725 31956 29880 23559 25903 20760 37955 55918 64468 82362
14351 82362 109508 140420 182133 236715 275684 332264 380639 439637 495646 532426 554719 541565
14339 541565 515603 461585 399583 345684 290379 235104 205077 179986 163885 135566 113389
$$ packed form
14435C264J2452j519l733l974K391M69Q322P711P01M880l086l036n789j88N640
14420B4505J5912l147j3663l590j3816J061L864m670P551J0971j2266R21Q798
14407B2431L583Q52K36j2041N366K295o394J5065M673k045m515k48O698m721L20
14392C1555J0918R719l31k079k6800j4874m521K854J7488L954L081l611k939M279
14378B8693j0149M470J2092p104o315n99J0527q171j0575J781J6581M793j5603
14365B0421j501J4906p817P303K413l769k076o321K344n143J7195J7963Q550J7894
14351H2362K7146L0912M1713N4582L8969N6580M8375N8998N6009L6780K2293j3154
14339E41565k5962n4018o2002n3899n5305n5275l0027k5091j6101k8319k2177
$$ plain form
14328 113389 97379 103273 101051 76481 64216 73122 73184 73664 69181 65606 56112 54247 49659 53099
14314 53099 52398 52321 36759 31049 39565 46416 37410 25006 10512 15638 27870 31207 28300 21932
14300 21932 18196 17799 30727 29001 24498 31514 36144 35356 36163 46970 53541 45939 17917 6666
14286 6666 8749 22852 24142 17773 21895 27783 18910 18695 22821 25864 22516 23098 23526 21428 13638
14271 13638 24093 38759 37916 27407 19911 27302 31063 25957 26497 26828 31672 33542 31061 23543
14257 23543 14972 6344 669 4948 11305 16468 15916 26409 39481 37213 22234 8858 11392 13321
14243 13321 7603 1455 6174 8110 -1792 7338 13796 10652 11328 33885 33736 38005 32511 41859 45993
14228 45993 29449 20165 26142 21984 20326 12303 -3959 -7361 -7226 366 -3246 2396 12199 28310
$$ packed form
14328A13389j6010N894k222k4570j2265Q906O2M80m483l575r494j865m588L440
14314E3099p01p7j5562n710Q516O851r006j2404j4494N126J2232L337k907o368
14300B1932l736l97J2928j726m503P016M630p88Q07J0807O571p602k8022j1251
14286F666K083J4103J290o369M122N888q873k15M126L043l348N82M28k098p790
14271A3638J0455J4666q43j0509p496P391L761n106N40L31M844J870k481p518
14257B3543q571q628n675M279O357N163n52J0493J3072k268j4979j3376K534J929
14243A3321n718o148M719J936r902R130O458l144O76K2557j49M269n494R348M134
14228D5993j6544r284N977m158j658q023j6262l402J35P592l612N642R803J6111
$$ plain form
14214 28310 35320 19488 13168 27478 20254 6643 -2594 4358 7185 1951 -1561 16440 37435
14201 37435 24210 24473 16981 6718 7661 2988 18006 20719 12627 20123 22595 17990 26801 9541
14187 9541 5749 1025 20790 13658 4319 9934 23182 26793 18988 4053 -6214 -10691 -6763 8049
14173 8049 13751 12899 19976 42747 34412 34216 50678 55748 47853 57635 77241 65980 45002 26036
14159 26036 23420 28304 21818 14455 14458 10023 9231 22341 39372 51568 46501 50432 69304 71354
14145 71354 75661 69951 69094 53835 52215 54762 53769 60582 51823 44271 53401 42434 39383 49424
14131 49424 65378 69951 67815 57868 47123 45444 36987 28863 27072 30170 38691 41730 48176 51776
14117 51776 52720 50308 47756 39589 38212 51884 55047 59628 75250 80115 72250 62640 54196 68064
$$ packed form
14214B8310P010j5832o320J4310p224j3611r237O952K827n234l512J8001K0995
14201C7435j3225K63p492j0263R43m673J5018K713q092P496K472m605Q811j7260
14187I541l792m724J9765p132r339N615J3248L611p805j4935j0267m477L928J4812
14173H049N702q52P077K2771q335j96J6462N070p895R782J9606j1261k0978j8966
14159B6036k616M884o486p363Lm435p92J3110J7031J2196n067L931J8872K050
14145G1354M307n710q57j5259j620K547r93O813q759p552R130j0967l051J0041
14131D9424J5954M573k136r947j0745j679q457q124j791L098Q521L039O446L600
14117E1776R44k412k552q167j377J3672L163M581J5622M865p865r610q444J3868
$$ plain form
14103 68064 72935 70330 68246 74209 86044 93705 85679 84802 72212 71799 74248 80944 93737 98788
14089 98788 76973 66571 75786 75453 74800 78639 75582 68994 65177 51946 46295 38900 49080 46188
14075 46188 46580 55526 38431 28505 24838 33319 41297 51478 50661 46041 38862 34811 39080 41839
14061 41839 21120 20433 30442 33005 50132 59508 55800 50755 51328 53502 67942 63645 55127 58296
14047 58296 80864 86754 70837 68677 84802 88765 85136 92218 92689 83210 87431 94953 111072 110322
14033 110322 114828 132499 138775 135923 137632 135413 121199 129108 145840 165315 172983 166357 172917
14020 172917 167550 186254 195463 192757 193472 185530 195200 199471 218134 225617 234003 263914 284762
14007 284762 305981 319919 327816 350460 353851 351689 344625 323079 293787 277863 265850 268962
$$ packed form
14103F8064M871k605k084N963J1835P661q026q77j2590m13K449O696J2793N051
14089I8788k1815j0402R215l33o53L839l057o588l817j3231n651p395J0180k892
14075D6188L92Q946j7095r926l667Q481P978J0181q17m620p179m051M269K759
14061D1839k0719o87J0009K563J7127R376l708n045N73K174J4440m297q518L169
14047E8296K2568N890j5917k160J6125L963l629P082M71r479M221P522J6119p50
14033A10322M506J7671O276k852J709k219j4214P909J6732J9475P668o626O560
14020A72917n367J8704R209k706P15p942R670M271J8663P483Q386K9911K0848
14007B84762K1219J3938P897K2644L391k162p064k1546k9292j5924j2013L112
$$ plain form
13995 268962 262130 256650 247449 233227 237609 243133 235707 230259 213967 209696 215105 233446 236730
13982 236730 241430 249961 243111 234415 238336 245453 248169 242776 240658 250895 261144 254351 254278 250445
13968 250445 241578 259604 274846 280897 293150 305043 316056 319521 331768 337539 335443 348100
13956 348100 346253 359363 357215 351504 365316 381384 395011 416261 431644 443328 475844 499336
13944 499336 517396 537324 554162 558460 562351 579480 621364 653003 690427 725314 748539 784983
13932 784983 840176 908597 968017 1020705 1090848 1158649 1236669 1323965 1411518 1508120 1628475
13921 1628475 1770345 1937158 2120388 2310252 2549992 2848647 3203677 3644198 4141344
13912 4141344 4718212 5391587 6169698 7055063 8108016 9356219 10870465 12746752 15190189
$$ packed form
13995B68962o832n480r201j4222M382N524p426n448j6292m271N409J8341L284
13982B36730M700Q531o850q696L921P117K716n393k118J0237J0249o793p3l833
13968B50445q867J8026J5242O051J2253J1893J1013L465J2247N771k096J2657
13956C48100j847J3110k148n711J3812J6068J3627K1250J5383J1684L2516K3492
13944D99336J8060J9928J6838M298L891J7129M1884L1639L7424L4887K3225L6444
13932G84983N5193O8421N9420N2688P0143O7801P8020Q7296Q7553R6602J20355
13921A628475J41870J66813J83230J89864K39740K98655L55030M40521M97146
13912D141344N76868O73375P78111Q85365J052953J248203J514246J876287K443437
$$ plain form
13903 15190189 18484835 23008650 29173173 37292988 47354477 58910477 71147328 82927839
13895 82927839 92793927 99366006 101659657 99342243 92749261 82619626 70423689 57967537
13887 57967537 46854876 37953738 31346285 26667247 23378771 20991024 19163321 17668035
13879 17668035 16407519 15287298 14242024 13240809 12292461 11413774 10601908 9882938 9236514
13870 9236514 8659368 8134745 7680330 7281823 6919581 6574584 6264458 5978348 5698272
13861 5698272 5440025 5201428 4964596 4730137 4526836 4326777 4140354 3971404 3810304
13852 3810304 3662917 3520345 3384930 3271347 3157784 3049621 2946793 2839719 2732873
13843 2732873 2636317 2545809 2464790 2407688 2330914 2261437 2195968 2130466 2078687 2017389 1947553
$$ packed form
13903A5190189L294646M523815O164523Q119815J0061489J1556000J2236851J1780511
13895H2927839R866088O572079K293651k317414o592982j0129635j2195937j2456152
13887E7967537j1112661q901138o607453m679038l288476k387747j827703j495286
13879A7668035j260516j120221j045274j001215r48348q78687q11866p18970o46424
13870I236514n77146n24623m54415l98507l62242l44997l10126k86110k80076
13861E698272k58247k38597k36832k34459k03301k00059j86423j68950j61100
13852C810304j47387j42572j35415j13583j13563j08163j02828j07074j06846
13843B732873r6556r0508q1019n7102p6774o9477o5469o5502n1779o1298o9836
$$ plain form
13832 1947553 1873644 1811168 1737570 1672359 1624481 1586188 1558932 1530263 1500037 1463244 1428698
13821 1428698 1396101 1374695 1368254 1355787 1343652 1320685 1280927 1251055 1230615 1199068 1154694
13810 1154694 1100340 1054147 1023078 987311 943426 897653 853381 793986 742072 717681 681168
13799 681168 646689 622148 587752 548266 522529 510355 485326 448213 425862 383677 358972
13788 358972 350556 348585 338813 322188 311611 295469 288107 282335 273033 277522 268392 245833 232505
13775 232505 237676 235302 238592 237015 244365 247818 253774 242473 234440 248348 251880 250481 227451
13762 227451 229770 227944 219529 210647 210872 212140 222451 221052 222900 205774 196586 196547 191199 202278
13748 202278 205468 214146 224320 212212 205061 213416 214502 220785 248429 267414 280922 299491 318747
$$ packed form
13832A947553p3909o2476p3598o5211m7878l8293k7256k8669l0226l6793l4546
13821A428698l2597k1406o441j2467j2135k2967l9758k9872k0440l1547m4374
13810A154694n4354m6193l1069l5767m3885m5773m4272n9395n1914k4391l6513
13799F81168l4479k4541l4396l9486k5737j2174k5029l7113k2351m2185k4705
13788C58972q416j971r772j6625j0577j6142p362n772r302M489r130k2559j3328
13775B32505N171k374L290j577P350L453N956j1301q033J3908L532j399k3030
13762B27451K319j826q415q882K25J268J0311j399J848j7126r188l9n348J1079
13748B02278L190Q678J0174j2108p151Q355J086O283K7644J8985J3508J8569J9256
$$ plain form
13735 318747 330340 330094 332138 340146 339784 338732 319281 286913 275710 284513 271888 269229 270417
13722 270417 278122 287901 286564 280522 278407 297176 313412 312696 322586 323941 336663 362164 378639
13709 378639 403083 430765 450005 471561 486453 503174 527165 526942 533251 544537 539531 529751
13697 529751 511239 488387 476065 455310 428052 419248 392448 371109 359862 341943 325035 316590
13685 316590 298321 282629 279970 272235 267655 260725 253364 259023 260471 257017 268107 282196 308545
13672 308545 328296 321392 338645 365521 381144 388707 387734 368845 335444 309228 281350 259762
13660 259762 250568 237193 227330 207437 205177 196983 183533 175698 175596 170260 172403 170052 167436 154792
13646 154792 155093 166089 176880 164355 151921 157816 165247 152790 147036 170583 202778 226600
$$ packed form
13735C18747J1593k46K044Q008l62j052j9451l2368j1203Q803j2625k659J188
13722B70417P705R779j337o042k115J8769J6236p16R890J355J2722K5501J6475
13709C78639K4444K7682J9240K1556J4892J6721K3991k23O309J1286n006r780
13697E29751j8512k2852j2322k0755k7258q804k6800k1339j1247j7919j6908q445
13685C16590j8269j5692k659p735m580o930p361N659J448l454J1090J4089K6349
13672C08545J9751o904J7253K6876J5623P563r73j8889l3401k6216k7878k1588
13660B59762r194j3375r863j9893k260q194j3450p835j02n336K143k351k616j2644
13646A54792L01J0996J0791j2525j2434N895P431j2457n754K3547L2195K3822
$$ plain form
13634 226600 236693 248123 235927 228021 225196 221684 209275 186232 176307 165903 157742 161087 159887
13621 159887 143269 135201 122584 113545 106998 100297 87415 75871 83908 89305 89324 102717 97870
13608 97870 78096 88981 99810 95760 101500 93348 86505 86445 89142 106904 120661 119888 113666 109110
13594 109110 92712 80033 83784 77052 62037 60077 62539 66909 74098 85602 83392 79947 68449
13581 68449 53120 44115 62631 66314 60046 51913 45995 30040 27402 22144 17953 31636 40771
13568 40771 47437 41852 39329 51600 57227 52143 31216 25994 33969 36255 44492 43744 50217 57150
13554 57150 58158 55776 55045 61692 63772 77833 87801 79515 83563 88049 85115 90710 102787 92810
13540 92810 91606 92407 95196 90129 79675 66919 65004 75688 72920 72627 71796 63865 65772 67749
$$ packed form
13634B26600J0093J1430j2196p906k825l512j2409k3043r925j0404q161L345j200
13621A59887j6618q068j2617r039o547o701j2882j1544Q037N397J9J3393m847
13608I7870j9774J0885J0829m050N740q152o843o0K697J7762J3757p73o222m556
13594A09110j6398j2679L751o732j5015j960K462M370P189J1504k210l445j1498
13581F8449j5329r005J8516L683o268q133n918j5955k638n258m191J3683R135
13568D0771O666n585k523J2271N627n084k0927n222P975K286Q237p48O473O933
13554E7150J008k382p31O647K080J4061R968q286M048M486k934N595J2077r977
13540I2810j204Q01K789n067j0454j2756j915J0684k768k93q31p931J907J977
$$ plain form
13526 67749 59223 60955 69719 74195 64777 64997 68835 62702 57487 63267 77261 63769 53480 46558
13512 46558 60269 67081 65056 72932 62330 49769 66539 77757 79940 75922 90725 89399 84451
13499 84451 66876 54963 63500 74194 74457 84159 99446 101361 103784 97392 87785 63880 54106
13486 54106 42685 50649 61677 73797 88363 79913 71995 73919 69788 62539 65638 65495 63388 55637
13472 55637 62143 77625 82365 85268 86550 74993 68219 67565 62964 56871 48816 51767 59753 59362
13458 59362 57398 70021 89023 104526 119079 138101 142712 165394 198267 234188 261605 300097
13446 300097 363736 428086 481265 543003 603844 671245 710128 742410 763377 750384 711486
13435 711486 664554 597193 536576 486834 424078 367033 321760 288141 247065 230575 208051
$$ packed form
13526F7749q526J732Q764M476r418K20L838o133n215N780J3994j3492j0289o922
13512D6558J3711O812k025P876j0602j2561J6770J1218K183m018J4803j326m948
13499H4451j7575j1913Q537J0694K63R702J5287J915K423o392r607k3905r774
13486E4106j1421P964J1028J2120J4566q450p918J924m131p249L099j43k107p751
13472E5637O506J5482M740K903J282j1557o774o54m601o093q055K951P986l91
13458E9362j964J2623J9002J5503J4553J9022M611K2682L2873L5921K7417L8492
13446C00097O3639O4350N3179O1738O0841O7401L8883L2282K0967j2993l8898
13435G11486m6932o7361o0617m9742o2756n7045m5273l3619m1076j6490k2524
$$ plain form
13424 208051 187006 178777 187139 181938 179576 184416 186906 173389 172972 184997 211792 213760 221787
13411 221787 257909 276135 315845 352808 365979 375976 374104 372999 374240 364198 350613 345091
13399 345091 342029 329058 326473 341158 329861 318389 300175 286530 274183 248133 242198 236558
13387 236558 224386 231731 255286 252655 253072 256360 236853 232010 215312 200285 196507 189095 180295
13374 180295 168524 163289 175034 180190 187534 185358 183276 188383 179830 173028 181457 182609 174885 159789
13360 159789 164222 171472 176458 184719 187064 179801 185288 186917 173993 176169 186500 194087 192383 188980
13346 188980 181621 180081 182238 186304 190854 184108 172704 168376 182335 192774 195734 207944 226774
13333 226774 242275 224881 215774 237341 240006 236671 246582 258219 260643 279794 312703 333334
$$ packed form
13424B08051k1045q229Q362n201k362M840K490j3517m17J2025K6795J968Q027
13411B21787L6122J8226L9710L6963J3171R997j872j105J241j0042j3585n522
13399C45091l062j2971k585J4685j1297j1472j8214j3645j2347k6050n935n640
13387B36558j2172P345K3555k631M17L288j9507m843j6698j5027l778p412q800
13374A80295j1771n235J1745N156P344k176k082N107q553o802Q429J152p724j5096
13360A59789M433P250M986Q261K345p263N487J629j2924K176J0331P587j704l403
13346A88980p359j540K157M066M550o746j1404m328J3959J0439K960J2210J8830
13333B26774J5501j7394r107K1567K665l335R911J1637K424J9151L2909K0631
$$ plain form
13321 333334 344786 350132 349499 362252 382109 412316 434344 451294 451907 462970 494441 523725
13309 523725 545761 568038 607489 652408 706118 761984 837415 900745 978096 1088857 1229257
13298 1229257 1371153 1562459 1793402 2098656 2475882 2936273 3507276 4267442 5302076
13289 5302076 6734870 8792056 11682624 15490184 19742223 23564204 26321836 28080570
13281 28080570 29002695 28526313 25913785 21591429 17074424 13577949 11285789 9886858
13273 9886858 9109185 8810636 8852446 9034448 9210108 9319660 9428746 9527887 9455283 9205016
13263 9205016 9001920 9125932 9761025 11004834 12932660 15484082 18366434 21324407 24495411
13254 24495411 28165746 32084999 35287645 37115876 37836913 38226893 38446376 37932835 36107482
$$ packed form
13321C33334J1452N346o33J2753J9857L0207K2028J6950O13J1063L1471K9284
13309E23725K2036K2277L9451M4919N3710N5866P5431O3330P7351J10761J40400
13298A229257J41896J91306K30943L05254L77226M60391N71003P60166J034634
13289E302076J432794K057186K890568L807560M252039L821981K757632J758734
13281B8080570R22125m76382k612528m322356m517005l496475k292160j398931
13273I886858p77673k98549M1810J82002J75660J09552J09086R9141p2604k50267
13263I205016k03096J24012O35093J243809J927826K551422K882352K957973L171004
13254B4495411L670335L919253L202646J828231P21037L89980K19483n13541j825353
$$ plain form
13245 36107482 33118908 29780891 26901940 24710853 22646410 20088107 17189893 14624897
13237 14624897 12838112 11757833 11215236 11046598 11125133 11239557 11314097 11384019 11453780 11409790
13227 11409790 11198480 10956280 10971981 11500990 12664630 14635256 17608932 21484590 25603536
13218 25603536 29031801 31266202 32477711 32755929 31343999 27679617 22577189 17705573
13210 17705573 14042880 11548643 9865113 8677592 7803271 7126099 6577527 6111026 5697464
13201 5697464 5338832 5034394 4764958 4490403 4225388 4000717 3803711 3625986 3454329
13192 3454329 3291356 3141093 3002285 2876106 2765108 2646247 2540607 2444989 2352506 2254380
13182 2254380 2162723 2079779 1991096 1910685 1846590 1789238 1736208 1688939 1643440 1597971 1546426
$$ packed form
13245C6107482k988574l338017k878951k191087k064443k558303k898214k564996
13237A4624897j786785j080279n42597j68638P8535J14424P4540O9922O9761m3990
13227A1409790k11310k42200J5701N29009J163640J970626K973676L875658M118946
13218B5603536L428265K234401J211509K78218j411930l664382n102428m871616
13210A7705573l662693k494237j683530j187521q74321o77172n48572m66501m13562
13201E697464l58632l04438k69436k74555k65015k24671j97006j77725j71657
13192C454329j62973j50263j38808j26179j10998j18861j05640r5618r2483r8126
13182B254380r1657q2944q8683q0411o4095n7352n3030m7269m5499m5469n1545
$$ plain form
13171 1546426 1491938 1429551 1386773 1350096 1297881 1247026 1202684 1165617 1146502 1120928 1082641
13160 1082641 1051416 1017710 995235 969559 920923 886405 856357 825428 784635 759875 744233
13149 744233 718235 693164 679916 672463 662735 647080 658909 659088 642452 636409 640950 646164 661074
13136 661074 674210 664504 655614 641633 611243 571146 536195 500260 468267 446547 432022 408313
13124 408313 394075 380774 363268 344311 339143 346381 341115 333642 327866 308417 307875 319352 322513
13111 322513 312008 311334 315282 309819 326079 342022 361279 385131 412192 446689 481846 523822
13099 523822 575424 620483 668509 692911 692246 660586 609251 554702 488023 423339 378895 354210
13087 354210 343853 326512 309741 316017 316719 304274 300293 298297 290293 270389 257794 261666 253404
$$ packed form
13171A546426n4488o2387m2778l6677n2215n0855m4342l7067j9115k5574l8287
13160A082641l1225l3706k2475k5676m8636l4518l0048l0929m0793k4760j5642
13149G44233k5998k5071j3248p453r728j5655J1829J79j6636o043M541N214J4910
13136F61074J3136r706q890j3981l0390m0097l4951l5935l1993k1720j4525k3709
13124D08313j4238j3301j7506j8957n168P238n266p473n776j9449n42J1477L161
13111C22513j0505o74L948n463J6260J5943J9257K3852K7061L4497L5157M1976
13099E23822N1602M5059M8026K4402o65l1660n1335n4549o6679o4684m4444k4685
13087C54210j0357j7341j6771O276P02j2445l981j996q004j9904j2595L872q262
$$ plain form
13074 253404 253774 263286 280586 288978 295033 298510 289332 298999 319727 342493 365674 390937 398879
13061 398879 425528 456446 455375 443041 426162 401947 375069 353843 331369 309939 293633 287600
13049 287600 301340 313175 314339 330291 332132 336342 312052 299057 266721 239573 227325 218442
13037 218442 218662 201115 178923 183435 175859 177286 180742 179161 177831 180738 182840 181148 182322 186505
13023 186505 191096 187222 185418 171287 161040 151375 150641 142149 152931 156383 146849 150979 151164 136592
13009 136592 154315 184011 186878 152687 143013 140151 126644 106352 98366 88580 85480 90311 92792
12996 92792 96310 96978 96990 92685 99242 102571 104615 105040 113495 111396 115763 94531 86248 86255 83125 81388
12980 81388 80180 76339 66436 58882 51705 57350 68603 56034 42232 36210 35441 39723 34566 26055
$$ packed form
13074B53404L70R512J7300Q392O055L477r178R667K0728K2766K3181K5263P942
13061C98879K6649L0918j071j2334j6879k4215k6878k1226k2474k1430j6306o033
13049B87600J3740J1835J164J5952J841M210k4290j2995l2336k7148j2248q883
13037B18442K20j7547k2192M512p576J427L456j581j330K907K102j692J174M183
13023A86505M591l874j804j4131j0247r665p34q492J0782L452r534M130J85j4572
13009A36592J7723K9696K867l4191r674k862j3507k0292p986r786l100M831K481
12996I2792L518O68J2m305O557L329K044M25Q455k099M367k1232q283Pl130j737
12980H1388j208l841r903p554p177N645J1253j2569j3802o022p69M282n157q511
$$ plain form
12966 26055 32137 39855 32835 27070 32619 54241 70103 72226 64278 59617 51845 50783 51632 48592
12952 48592 49823 51560 49381 39084 32483 34901 27573 19750 23366 42899 56415 61389 62210 68523
12938 68523 72164 75352 66975 58506 58572 62150 57716 56570 64646 57135 37276 33064 43062 42913 29544
12923 29544 35417 45640 50069 39828 31871 43883 52666 46538 35492 38899 34888 19428 16209
12910 16209 30970 33178 31203 22738 34315 39910 32825 27646 23501 21359 9999 19768 28537 43198
12896 43198 48608 41528 27947 25340 12138 16357 11764 4933 32527 40683 50464 49162 39918 23508
12882 23508 14356 17993 44370 39849 25011 33909 36490 32184 29553 21691 15592 18196 19698 25779
12868 25779 27592 34520 38196 41640 48010 50494 51279 54114 48453 54769 52615 36161 37031 45195 40880
$$ packed form
12966B6055O082P718p020n765N549K1622J5862K123p948m661p772j062Q49l040
12952D8592J231J737k179j0297o601K418p328p823L616J9533J3516M974Q21O313
12938F8523L641L188q377q469O6L578m434j146Q076p511j9859m212R998j49j3369
12923B9544N873J0223M429j0241p957J2012Q783o128j1046L407m011j5460l219
12910A6209J4761K208j975q465J1577N595p085n179m145k142j1360R769Q769J4661
12896D3198N410p080j3581k607j3202M219m593o831K7594Q156R781j302r244j6410
12882B3508r152L637K6377m521j4838Q898K581m306k631p862o099K604J502O081
12868B5779J813O928L676L444O370K484P85K835n661O316k154j6454Q70Q164m315
$$ plain form
12853 40880 28627 21297 17313 22667 14633 989 -1743 11766 24812 21151 11705 -1141 5730
12840 5730 32457 16283 4247 4067 18672 23399 27289 46039 45492 36700 47464 56467 66197 81060
12826 81060 102127 124769 139627 135389 141334 146048 146251 153626 130738 114621 98783 95350 89032
12813 89032 81311 67686 68169 70053 64646 68342 76120 66833 78002 82089 93855 102757 89560 103201
12799 103201 105954 100881 120851 136118 142249 159230 180645 194725 190909 207046 219571 213350
12787 213350 206840 182734 157455 169370 157303 149298 133116 113728 93082 77995 70872 65046
12775 65046 61826 72401 76091 70493 73952 78049 82275 89931 90212 86710 81671 75400 79979 112006
12761 112006 134426 148210 164993 172611 175614 171071 171278 150475 119687 101576 74034 67249 72000
$$ packed form
12853D0880j2253p330l984N354q034j3644k732J3509J3046l661r446j2846O871
12840E730K6727j6174j2036j80J4605M727L890J8750n47q792J0764R003R730J4863
12826H1060K1067K2642J4858m238N945M714K03P375k2888j6117j5838l433o318
12813H9032p721j3625M83J884n407L696P778r287J1169M087J1766Q902j3197J3641
12799A03201K753n073J9970J5267O131J6981K1415J4080l816J6137J2525o221
12787B13350o510k4106k5279J1915j2067q005j6182j9388k0646j5087p123n826
12775F5046l220J0575L690n598L459M097M226P656K81l502n039o271M579L2027
12761A12006K2420J3784J6783P618L003m543K07k0803l0788j8111k7542o785M751
$$ plain form
12748 72000 68578 51404 38842 39872 48329 50349 50795 47894 36715 42288 44824 21503 9206
12735 9206 -7971 -1293 1079 -4448 11969 33671 34668 30442 27937 33722 36796 40021 32201 39126
12721 39126 38104 26000 6608 8934 19736 22098 25866 32479 30589 35095 33414 23003 12934
12708 12934 20534 37521 36271 41777 45264 34044 26426 22254 22017 25943 24447 22715 16828 10936
12694 10936 -3358 -7506 -4974 -6865 1047 10640 -2443 -7093 -1006 5200 15909 16857 -3404 -16538
12680 -16538 -16669 -14298 20882 46696 43307 48160 35384 27214 15285 7972 16781 23682 19862 15628
12666 15628 12779 17238 -1856 3454 10100 2359 12072 13701 14109 13890 9314 -2745 -8231 -6618
12652 -6618 -13325 -7827 -6223 -9472 -9864 -9026 -7044 -11278 -12752 -15793 -3192 11724 18791 4450
$$ packed form
12748G2000l422j7174j2562J030Q457K020M46k901j1179N573K536k3321j2297
12735I206j7177O678K372n527J6417K1702R97m226k505N785L074L225p820O925
12721C9126j022j2104j9392K326J0802K362L768O613j890M506j681j0411j0069
12708A2934P600J6987j250N506L487j1220p618m172k37L926j496j732n887n892
12694A0936j4294m148K532j891P912R593j3083m650O087O206J0709R48k0261j3134
12680a6538j31K371L5180K5814l389M853j2776q170j1929p313Q809O901l820m234
12666A5628k849M459j9094N310O646p741R713J629M08k19m576j2059n486J613
12652f618o707N498J604l249l92Q38J982m234j474l041J2601J4916P067j4341
$$ plain form
12638 4450 8033 13965 14490 16402 18689 9806 -459 9253 20920 18431 4855 701 1203 10340
12624 10340 18906 17116 15647 9685 -5566 -13783 -4473 -15029 -18199 -19684 -22252 -17032 -17947 -14945
12610 -14945 -13467 -17827 -17117 -20963 -29926 -27216 -28466 -22659 -18297 -1001 2395 -8552 -3912 5530
12596 5530 4690 4055 18827 23365 24701 24333 10772 5368 -1752 -13132 -1430 15226 21407 15134
12582 15134 11500 1747 -12056 -8847 -1994 6868 6847 3809 2355 -196 12446 13968 25724 24632
12568 24632 21516 16358 23383 17156 17428 15531 7690 57 11695 24892 37835 41593 12660 -12968
12554 -12968 -17382 -13222 -16843 -9621 -5492 -6527 1328 -10625 -16895 -8070 4475 -636 1405 13718
12540 13718 6244 5021 15710 32808 14626 -6330 -11028 -25089 -21515 -4868 -2419 6282 1715
$$ packed form
12638D450L583N932N25J912K287q883j0265R712J1667k489j3576m154N02R137
12624A0340Q566j790j469n962j5251q217R310j0556l170j485k568N220r15L002
12610a4945J478m360P10l846q963K710j250N807M362J7296L396j0947M640R442
12596E530q40o35J4772M538J336l68j3561n404p120j1380J1702J6656O181o273
12582A5134l634r753j3803L209O853Q862k1l038j454k551J2642J522J1756j092
12568B4632l116n158P025o227K72j897p841p633J1638J3197J2943L758k8933k5628
12554a2968m414M160l621P222M129j035P855j1953o270Q825J2545n111K041J2313
12540A3718p474j223J0689J7098j8182k0956m698j4061L574J6647K449Q701m567
$$ plain form
12527 1715 -5266 -17763 -12935 5946 2703 -3014 -12360 -14419 -22402 -15524 -19736 -12945 -1205 -1425
12513 -1425 1425 14804 10895 -18731 -38119 -32637 -19217 -33 -3956 -8855 -6006 -14659 -22529
12500 -22529 -10948 -17016 -11944 -7954 -9623 -8979 -15066 -14947 -8123 -1582 -14025 -20808 -9737 2566
12486 2566 7191 9997 17167 39749 42572 29580 7014 -15327 -16635 -12044 -4769 -1382 3189 5193
12472 5193 -9043 -14528 -11809 -7078 11595 18605 18608 23376 15865 9587 13947 20289 22488 14443 6615
12457 6615 9688 12779 6516 185 6184 -2319 -16521 -22215 -34659 -37335 -24857 -9339 -8283 3916
12443 3916 18789 13240 -5117 -5196 4134 4182 129 -15521 -19411 -21102 -26726 -18201 2689 16642
12429 16642 20677 29014 24669 16681 7311 12228 1760 -4062 -9450 -13043 -9999 -1611 4107 -15499
$$ packed form
12527A715o981j2497M828J8881l243n717r346k059p983O878m212O791J1740k20
12513a425K850J3379l909k9626j9388N482J3420J9184l923m899K849q653p870
12500b2529J1581o068N072L990j669O44o087J19O824O541j2443o783J1071J2303
12486B566M625K806P170K2582K823j2992k2566k2341j308M591P275L387M571K004
12472E193j4236n485K719M731J8673P010LM768p511o278M360O342K199q045p828
12457F615L073L091o263o331N999q503j4202n694j2444k676J2478J5518J056J2199
12443C916J4873n549j8357p9R330M8m053j5650l890j691n624Q525K0890J3953
12429A6642M035Q337m345p988r370M917j0468n822n388l593L044Q388N718j9606
$$ plain form
12415 -15499 -23313 -24450 -25434 -6712 -12581 -13771 -7242 -2077 -4775 -4496 -2909 -2645 -3368 -14781 -16097
12400 -16097 -7789 5377 -7570 195 15216 15904 1116 -12499 -11288 -2671 2485 15508 4972
12387 4972 7797 20308 34272 28336 22545 14233 19533 28060 38437 27417 1324 -6367 6716
12374 6716 13068 15066 21596 9479 3720 -9010 -20461 -16511 -2137 12605 12870 -1539 9519
12361 9519 22262 31374 23672 17210 18799 23118 16153 15203 20435 20703 -97 -29365 -22476 -8337
12347 -8337 2549 8743 10141 16443 15982 9303 3769 1523 11309 22105 14629 2568 -6495 -8648
12333 -8648 -11614 -25621 -23974 -17121 -17530 -26157 -16627 -12783 -10114 87 7240 -3547 -5599 -1618
12319 -1618 -1615 -4704 -5047 4978 16120 24851 27403 36064 31010 20054 -3212 -18097 -20314 -20747 -18374
$$ packed form
12415a5499p814j137r84J8722n869j190O529N165k698K79J587K64p23j1413j316
12400a6097Q308J3166j2947P765J5021O88j4788j3615J211Q617N156J3023j0536
12387D972K825J2511J3964n936n791q312N300Q527J0377j1020k6093p691J3083
12374F716O352J998O530j2117n759j2730j1451L950J4374J4742K65j4409J1058
12361I519J2743R112p702o462J589M319o965r50N232K68k0800k9268O889J4139
12347h337J0886O194J398O302m61o679n534k246R786J0796p476j2061r063k153
12333h648k966j4007J647O853m09q627R530L844K669J0201P153j0787k052L981
12319a618Ll089l43J0025J1142Q731K552Q661n054j0956k3266j4885k217m33K373
$$ plain form
12304 -18374 -19815 -26179 -21973 -26336 -29211 -28268 -23593 -17872 -8705 995 5716 17505 42139 55227
12290 55227 43257 28170 16421 1036 -976 8703 -279 -3502 8773 12898 9314 666 14550
12277 14550 17161 -3625 -10278 -1108 508 -9441 -13866 -8983 4506 -3532 -20455 -21242 -6647 392
12263 392 -6548 -2878 -2132 -8599 -12087 -8696 483 8134 4086 4402 191 -16096 -13282 -1202 -7439
12248 -7439 -5266 11491 1467 -7372 569 -6300 -13299 -10224 4146 5588 2010 -9011 -6241 -2171
12234 -2171 -9119 -11002 -1963 8805 7130 5598 15233 4518 -5743 12727 12735 10048 11276 5884
12220 5884 -1956 485 -3799 -877 -2152 -1859 -1267 2533 -568 3359 13486 21259 23122 17576 20712
12205 20712 17350 23316 36205 41997 40544 44743 63960 68670 79078 102548 113923 130819 170988
$$ packed form
12304a8374j441o364M206m363k875R43M675N721R167R700M721J1789K4634J3088
12290E5227j1970j5087j1749j5385k012R679q982l223J2275M125l584q648J3884
12277A4550K611k0786o653R170J616r949m425M883J3489q038j6923p87J4595P039
12263C92o940L670P46o467l488L391R179P651m048L16m211j6287K814J2080o237
12248g439K173J6757j0024q839P941o869o999L075J4370J442l578j1021K770M070
12234b171o948j883R039J0768j675j532R635j0715j0261J8470Qk687J228n392
12220E884p840K441m284K922j275K93N92L800l101L927J0127P773J863n546L136
12205B0712l362N966J2889N792j453M199J9217M710J0408K3470J1375J6896M0169
$$ plain form
12192 170988 220505 256063 296139 357440 431117 507446 572743 626633 665614 693474 694162 670752
12180 670752 636303 584496 533273 467181 406531 338354 294423 266678 249085 236956 226238
12169 226238 209640 193613 180713 172245 153347 123502 111258 100517 97488 98747 82123 72303
12157 72303 70654 70542 54807 48253 55223 47485 48861 45572 55404 67950 58475 47274 44364 35527
12143 35527 24803 27329 38843 42484 48707 46726 48487 46692 38462 34201 31806 43031 25039
12130 25039 17521 28614 39391 42129 32873 9958 15448 11204 8005 14477 12248 16929 8414 5885
12116 5885 1430 11050 -1066 1019 -1373 20943 34868 26498 7167 5233 18237 20976 29532
12103 29532 25131 15987 16430 8052 2730 15250 11732 12025 20764 25563 30827 29965 18987 23918 31446
$$ packed form
12192A70988M9517L5558M0076O1301P3677P6329O5297N3890L8981K7860O88k3410
12180F70752l4449n1807n1223o6092o0650o8177m3931k7745j7593j2129j0718
12169B26238j6598j6027j2900q468j8898k9845j2244j0741l029J259j6624r820
12157G2303j649j12j5735o554O970p738J376l289R832J2546r475j1201k910q837
12143C5527j0724K526J1514L641O223j981J761j795q230m261k395J1225j7992
12130B5039p518J1093J0777K738r256k2915N490m244l199O472k229M681q515k529
12116E885m455R620j2116K085k392K2316J3925q370j9331j934J3004K739Q556
12103B9532m401r144M43q378n322J2520l518K93Q739M799N264q62j0978M931P528
$$ plain form
12088 31446 25876 28778 15800 6876 20840 28942 34839 38673 40402 38410 47190 45023 55173 71790
12074 71790 81462 87779 86667 93462 107533 129191 157743 192826 216267 247161 286340 319745
12062 319745 348898 391245 446541 482557 483199 459267 419635 375164 325604 299425 258865 222627
12050 222627 198848 180192 153991 129745 106336 102909 104747 101672 89040 94162 93398 89626 76006
12037 76006 73188 71952 66129 56932 58245 39085 21804 13834 25169 26780 29216 18132 13983
12024 13983 18304 8979 3489 9950 9276 13906 10537 13754 24131 19879 7018 -2091 -3620 4348
12010 4348 7532 22924 18259 13911 10415 12316 9410 17457 9442 5361 -3133 -6630 2085 -2924
11996 -2924 -20106 -24412 -29933 -19308 -8449 -4318 -10256 -5147 -3461 -11224 -16669 -16367 -10113 -7161
$$ packed form
12088C1446n570K902j2978q924J3964Q102N897L834J729j992Q780k167J0150J6617
12074G1790R672O317j112O795J4071K1658K8552L5083K3441L0894L9179L3405
12062C19745K9153M2347N5296L6016O42k3932l9632m4471m9560k6179m0560l6238
12050B22627k3779j8656k6201k4246k3409l427J838l075j2632N122p64l772j3620
12037G6006k818j236n823r197J313j9160j7281p970J1335J611K436j1084m149
12024A3983M321r325n490O461o74M630l369L217J0377m252j2861r109j529P968
12010D348L184J5392m665m348l496J901k906Q047q015m081q494l497Q715n009
11996b924j7182m306n521J0625J0859M131n938N109J686p763n445L02O254K952
$$ plain form
11982 -7161 3 -4412 -1634 7082 3394 1076 10290 7180 6489 16945 30424 16285 -5963 -13400
11968 -13400 -20380 -25722 -18372 -7759 -4563 -6048 -21571 -20126 -6069 -693 7577 14242 20274 8871
11954 8871 1772 -2571 95 -13746 -14412 -15341 -12676 -15719 -19216 -26052 -23576 -23142 -28983 -25116 -27536
11939 -27536 -25537 -28659 -33917 -21238 -17284 -12111 -17956 -4431 1609 -7484 -17058 -4924 1759 -9686
11925 -9686 -8967 6929 13191 2899 -6561 -1461 7055 12719 3242 -569 5355 -1583 -10833 -16017
11911 -16017 -13924 -26573 -21834 -8013 -4429 -6903 -6437 -16678 -11882 -12615 -13506 -20507 -30629 -15144
11897 -15144 -8442 -6970 -3882 904 -9845 -24229 -29363 -17297 -13674 1513 -8340 -13190 -18026
11884 -18026 -9887 -4000 2784 -3296 -10671 -12141 -20540 -26092 -27132 -30475 -24686 -18613 -15297 -17269
$$ packed form
11982g161P164m415K778Q716l688k318R214l110o91J0456J3479j4139k2248p437
11968a3400o980n342P350J0613L196j485j5523J445J4057N376Q270O665O032j1403
11954H871p099m343K666j3841o66r29K665l043l497o836K476M34n841L867k420
11939b7536J999l122n258J2679L954N173n845J3525O040r093r574J2134O683j1445
11925i686P19J5896O262j0292r460N100Q516N664r477l811N924o938r250n184
11911a6017K093j2649M739J3821L584k474M66j0241M796p33q91p001j0122J5485
11897a5144O702J472L088M786j0749j4384n134J2066L623J5187r853m850m836
11884a8026Q139N887O784o080p375j470q399n552j040l343N789O073L316j972
$$ plain form
11870 -17269 -22442 -26726 -20651 -13636 -6095 -4322 -1678 1336 -14342 -32228 -25793 -15328 -14599 -19264
11856 -19264 -4944 -166 265 -5179 -522 -2812 -15250 -10862 -2377 -3342 -7934 -15835 -17060 -22895
11842 -22895 -26957 -15199 -10185 -22263 -29798 -28863 -17504 -26882 -35093 -42479 -31322 -32636 -43661
11829 -43661 -44608 -34959 -28236 -14896 -10569 -16522 -28603 -32210 -17824 -7704 -13109 -8909 -6583 -16888
11815 -16888 -27217 -22078 -18192 -10716 -30139 -34465 -48032 -34388 -15304 -13908 -12310 -5711 -4172
11802 -4172 -9464 -14941 -24036 -30189 -28007 -27516 -15427 -17198 -15581 -7755 -12736 -19181 -18725 -15178 -11833
11787 -11833 -7966 -6666 -15303 -19771 -27869 -21622 6221 28816 39493 55123 65501 96098 101555
11774 101555 94948 84000 84036 83314 69369 40306 21944 26189 21798 11870 2761 -3275 -10016 1071
$$ packed form
11870a7269n173m284O075P015P541J773K644L014j5678j7886O435J0465P29m665
11856a9264J4320M778M31n444M657k290j2438M388Q485r65m592p901j225n835
11842b2895m062J1758N014j2078p535R35J1359r378q211p386J1157j314j1025
11829d3661r47R649O723J3340M327n953j2081l607J4386J0120n405M200K326j0305
11815a6888j0329N139L886P476j9423m326j3567J3644J9084J396J598O599J539
11802d172n292n477r095o153K182M91J2089j771J617P826m981o445M56L547L345
11787a1833L867J300q637m468q098O247K7843K2595J0677J5630J0378L0597N457
11774A01555o607j0948L6p22j3945k9063j8362M245m391r928r109o036o741J1087
$$ plain form
11760 1071 14530 17272 14319 652 -8480 -800 -902 -13174 -25477 2154 17748 19744 28884
11747 28884 35532 33229 22286 18154 702 -14586 -12430 -1342 11754 17807 416 -5621 910
11734 910 16147 14131 10808 10691 3254 4867 13301 7798 -2699 2826 15833 29832 39604 44277
11720 44277 42518 45212 49560 64917 77195 76473 80463 86160 91711 84044 64957 44422 35610 33617
11706 33617 31159 39791 39654 28505 20977 6194 8953 12164 4620 -391 2783 8248 567 4146
11692 4146 7824 6842 8827 6756 8463 12098 12830 12032 26919 30951 18667 18511 28408 28894 25965
11677 25965 26519 30450 23734 11377 10265 2097 -13250 -2480 6505 14013 655 -1981 6239 6168
11663 6168 6871 -3711 -13585 -25531 -24296 -4140 -1611 -13950 -30068 -22543 -24725 -42794 -30824
$$ packed form
11760A071J3459K742k953j3667r132P680j02j2272j2303K7631J5594J996R140
11747B8884O648k303j0943m132j7452j5288K156J1088J3096O053j7391o037O531
11734I10J5237k016l323j17p437J613Q434n503j0497N525J3007J3999R772M673
11720D4277j759K694M348J5357J2278p22L990N697N551p667j9087k0535q812j993
11706C3617k458Q632j37j1149p528j4783K759L211p544n011L174N465p681L579
11692D146L678r82J985k071J707L635P32p98J4887M032j2284j56R897M86k929
11677B5965N54L931o716j2357j112q168j5347J0770Q985P508j3358k636Q220p1
11663F168P03j0582r874j1946J235K0156K529j2339j6118P525k182j8069J1970
$$ plain form
11650 -30824 -53286 -65561 -50159 -27832 -19479 -20368 -30815 -36657 -36643 -39960 -38358 -24423 -15615 -30361
11636 -30361 -40938 -40092 -31750 -24742 -25308 -16498 -6230 -8767 -18732 -4487 -958 -12577 -11275 -6802
11622 -6802 -18191 -25870 -22777 -18013 -13544 -9877 641 -2813 -8540 -1790 -8697 -24392 -22688 -12234
11608 -12234 -4519 -4799 -7775 -11650 -8750 2794 -9432 -11720 -13414 -23297 -28585 -6740 32 -5383
11594 -5383 -18109 -26940 -17656 -11787 -18343 -16861 -9885 -12410 -17742 -13667 -9701 -21052 -17035 -10835
11580 -10835 4166 2425 -1734 6154 10618 8383 -2703 -3803 -3293 -8557 -13164 -24088 -33499 -20495
11566 -20495 1192 -6851 -17537 -19319 -21855 -23629 -21834 -21952 -33571 -29202 -48924 -50497 -44085 -39705
11552 -39705 -31334 -22861 -14756 -14805 -7845 -20011 -26419 -18358 -13790 -17716 -16774 -21558 -35412 -35703 -31217
$$ packed form
11650c0824k2462j2275J5402K2327Q353q89j0447n842J4l317J602J3935Q808j4746
11636c0361j0577Q46Q342P008n66Q810J0268k537r965J4245L529j1619J302M473
11622f802j1389p679L093M764M469L667J0518l454n727O750o907j5695J704J0454
11608a2234P715k80k976l875K900J1544j2226k288j694r883n288K1845O772n415
11594e383j2726q831R284N869o556J482O976k525n332M075L966j1351M017O200
11580a0835J5001j741m159P888M464k235j1086j100N10n264m607j0924r411J3004
11566b0495K1687q043j0686j782k536j774J795j18j1619M369j9722j573O412M380
11552c9705Q371Q473Q105m9O960j2166o408Q061M568l926R42m784j3854k91M486
$$ plain form
11537 -31217 -36965 -46781 -45533 -43050 -47249 -45062 -37066 -24378 -10403 -12850 -28739 -48412 -36563
11524 -36563 -26401 -29011 -37878 -37262 -30648 -20299 -16799 -13823 -12786 -14269 -18043 -24811 -30218 -32287
11510 -32287 -22087 -12564 -19308 -31518 -18486 -11615 -12796 2775 3210 -14017 -21801 -33975 -44577
11497 -44577 -44347 -40373 -32011 -22188 -23365 -23490 -17850 -13553 1402 -6288 -18550 -13076 -14125 -23115
11483 -23115 -25697 -33319 -20097 -2693 8880 7445 -8686 -24082 -32557 -26996 -16805 -10090 -8925
11470 -8925 -5796 -9631 -18562 -39894 -39782 -15778 -4266 -11332 -14513 -16179 -16025 -9069 410 8458
11456 8458 1814 12081 18054 9313 6989 -1150 3524 -4333 -13838 -16780 -6662 410 -2113 -1927
11442 -1927 -13557 -16114 -11621 -8714 -1957 2026 7109 2353 -6422 -1014 -12938 -20893 -19245 -17202
$$ packed form
11537c1217n748r816J248K483m199K187P996J2688J3975k447j5889j9673J1849
11524c6563J0162k610q867O16O614J0349L500K976J037j483l774o768n407k069
11510c2287J0200R523o744j2210J3032O871j181J5571M35j7227p784j2174j0602
11497d4577K30L974Q362R823j177j25N640M297J4955p690j2262N474j049q990
11483b3115k582p622J3222J7404J1573j435j6131j5396q475N561J0191O715J165
11470h925L129l835q931k1332J12K4004J1512p066l181j666J54O956R479Q048
11456H458o644J0267N973q741k324q139M674p857r505k942J0118P072k523J86
11442a927j1630k557M493K907O757L983N083m756q775N408j1924p955J648K043
$$ plain form
11428 -17202 -19349 -20376 -8237 -7989 -4314 -603 1991 -4180 -5000 -15389 -2965 11785 8972 7
11414 7 -7995 -19639 -36377 -33669 -30289 -32380 -20031 -18409 -12029 -13818 -14021 -9520 -23703 -24002 -30478
11399 -30478 -41529 -46262 -27814 -14526 -4627 14673 21225 12936 -4712 -13729 -8415 -11779 -16608
11386 -16608 -19405 -34848 -22543 -5150 -258 87 -5268 -10447 -1456 -2279 -11942 756 5741 8523
11372 8523 11735 9688 7561 19251 26194 14728 8339 -1072 5141 12376 13227 1240 269 6937
11358 6937 13558 6102 -9684 -18893 -5806 -2529 -12915 -16787 -7419 -10069 -15521 -4009 -5345 589
11344 589 909 -3217 1813 -284 13828 3046 3498 4943 17491 29754 37429 19661 2615 439
11330 439 -9583 -8452 -896 4151 10792 9648 -3442 -19515 -20019 -13962 -12823 -11739 -17056 -9870
$$ packed form
11428a7202k147j027J2139K48L675L711K594o171q20j0389J2424J4750k813q965
11414Gq002j1644j6738K708L380k091J2349J622O380j789k03M501j4183k99o476
11399c0478j1051m733J8448J3288R899J9300O552q289j7648r017N314l364m829
11386a6608k797j5443J2305J7393M892L45n355n179Q991q23r663J2698M985K782
11372H523L212k047k127J1690O943j1466o389r411O213P235Q51j1987r71O668
11358F937O621p456j5786r209J3087L277j0386l872R368k650n452J1512j336N934
11344E89L20m126N030k097J4112j0782M52J445J2548J2263P675j7768j7046k176
11330D39j0022J131P556N047O641j144j3090j6073n04O057J139J084n317P186
$$ plain form
11316 -9870 9063 7683 10606 8301 12102 1879 -8917 -8505 -6293 -14041 -12456 -1930 -6523 -13214
11302 -13214 -15158 -24178 -22506 -22323 -26062 -20833 -23766 -21886 -25842 -36156 -29108 -11153 4224 632
11288 632 -6487 -9649 -20930 -25746 -11806 -9986 -14771 -15866 -9769 -7552 -7005 -4379 -13064 -13975 -21799
11273 -21799 -32215 -43316 -32097 -28988 -20810 -11957 -26917 -30204 -20016 -20384 -29747 -28682 -18526
11260 -18526 -22845 -26508 -22258 -23505 -7790 -4415 -14826 -23524 -10401 -4228 -11827 -8772 -1474 2960
11246 2960 -14552 -23796 -13424 -18856 -5142 10165 3013 12787 25111 17579 22791 50877 84056
11233 84056 96615 113750 130106 140172 158051 142373 107560 87167 76086 53005 39435 38612
11221 38612 53499 44857 33781 41392 47952 39868 31749 41117 47053 45842 40948 42407 50934 62626
$$ packed form
11316i870J8933j380K923k305L801j0223j0796M12K212p748J585J0526m593o691
11302a3214j944r020J672J83l739N229k933J880l956j0314P048J7955J5377l592
11288F32p119l162j1281m816J3940J820m785j095O097K217N47K626q685r11p824
11273b1799j0416j1101J1219L109Q178Q853j4960l287J0188l68r363J065J0156
11260a8526m319l663M250j247J5715L375j0411q698J3123O173p599L055P298M434
11246B960j7512r244J0372n432J3714J5307p152R774J2324p532N212K8086L3179
11233H4056J2559J7135J6356J0066J7879j5678l4813k0393j1081k3081j3570q23
11221C8612J4887q642j1076P611O560q084q119R368N936j211m894J459Q527J1692
$$ plain form
11207 62626 67429 78974 101527 126139 132292 147968 166191 155950 161780 180918 187260 192400 168896
11194 168896 160096 152423 137362 145712 155894 147731 136881 127018 103023 89530 85509 72736 47921
11181 47921 52126 60193 57400 38908 20997 23314 27122 44831 64181 80346 73819 87752 107119
11168 107119 120039 119656 132865 141594 150139 140650 133908 123501 99217 61811 54427 55055 49579
11155 49579 40630 40412 24628 24542 17572 11714 10499 18308 12174 7709 12678 4359 -11941 -10017 -17059
11140 -17059 -10046 -1212 -2142 -2652 -4936 -7064 -9678 -1723 -13762 -21175 -25500 -12681 223 11987
11126 11987 23014 10302 -3879 -21206 -16048 -9098 4693 -1263 -4366 -3279 1861 2349 4218
11113 4218 7152 7194 -11132 -14350 -16826 -8631 -7416 -12523 -15058 -24270 -17037 -4158 3916 -7352
$$ packed form
11207F2626M803J1545K2553K4612O153J5676J8223j0241N830J9138O342N140k3504
11194A68896q800p673j5061Q350J0182q163j0850r863k3995j3493m021j2773k4815
11181D7921M205Q067k793j8492j7911K317L808J7709J9350J6165o527J3933J9367
11168A07119J2920l83J3209Q729Q545r489o742j0407k4284l7406p384O28n476
11155D9579q949k18j5784q6o970n858j215P809o134m465M969q319j6300J924p042
11140a7059P013Q834r30n10k284k128k614P955j2039p413m325J2819J2904J1764
11126A1987J1027j2712j4181j7327N158O950J3791n956l103J087N140M88J869
11113D218K934M2j8326l218k476Q195J215n107k535r212P233J2879Q074j1268
$$ plain form
11099 -7352 -22937 -26656 -26787 -13825 -17808 -11104 -15767 -20813 -24875 -18573 -7689 -12638 -16793 -15407
11085 -15407 856 -411 -12630 -20202 -36019 -41079 -44371 -30271 -15445 -9176 -19699 -21717 -12464
11072 -12464 -10848 -13423 -26867 -19155 -6775 1600 6633 19513 18021 27791 30739 19459 6014
11059 6014 19816 30349 31858 32120 37625 55748 73572 96026 125427 140218 145353 162601 162958
11046 162958 146763 132639 116231 98512 85317 84260 76374 65158 58578 55143 39385 47276
11034 47276 57884 54231 57369 57078 68260 78827 88090 92378 86294 96869 83434 82658 79632 81438
11020 81438 84108 89955 110155 135780 169075 202732 237362 285401 317882 338456 369575 382715
11008 382715 376957 344383 297386 237797 196276 163630 130282 123166 134776 131701 126658 118381
$$ packed form
11099g352j5585l719j31J2962l983O704m663n046m062O302J0884m949m155J386
11085a5407J6263j267j2219p572j5817n060l292J4100J4826O269j0523k018R253
11072a2464J616k575j3444P712J2380Q375N033J2880j492R770K948j1280j3445
11059F014J3802J0533J509K62N505J8123J7824K2454K9401J4791N135J7248L57
11046A62958j6195j4124j6408j7719j3195j057p886j1216o580l435j5758P891
11034D7276J0608l653L138k91J1182J0567R263M288o084J0575j3435p76l026J806
11020H1438K670N847K0200K5625L3295L3657L4630M8039L2481K0574L1119J3140
11008C82715n758l2574m6997n9589m1521l2646l3348p116J1610l075n043q277
$$ plain form
10996 118381 100914 93071 84687 86609 84409 104604 93456 80608 82860 86638 92485 99743 100069
10983 100069 118563 132722 131868 134528 139568 153966 169217 189682 213644 225165 230267 237787 245296
10970 245296 236695 209739 179467 150662 132680 132008 132848 118902 98953 78389 83162 82419 80090
10957 80090 83892 77357 83263 94318 101580 120695 125692 111845 124147 124001 125419 131154 139245 146239
10943 146239 155982 159790 186114 216526 252408 309058 346039 379420 418158 459354 490589 527997
10931 527997 561813 583307 600388 625389 628315 609407 568696 533159 499832 448201 414119 373130
10919 373130 313038 282051 269123 244122 242434 242990 244055 232266 218397 219072 222589 211383 208397
10906 208397 198218 191070 191594 189744 188177 196474 196218 196466 198066 189132 185121 187623 179535 162616
$$ packed form
10996A18381j7467p843q384J922k200K0195j1148j2848K252L778N847P258L26
10983A00069J8494J4159q54K660N040J4398J5251K0465K3962J1521N102P520P509
10970B45296q601k6956l0272k8805j7982o72Q40j3946j9949k0564M773p43k329
10957H0090L802o535N906J1055P262J9115M997j3847J2302j46J418N735Q091O994
10943A46239R743L808K6324L0412L5882N6650L6981L3381L8738M1196L1235L7408
10931E27997L3816K1494J7081K5001K926j8908m0711l5537l3327n1631l4082m0989
10919C73130o0092l0987j2928k5001j688N56J065j1789j3869O75L517j1206k986
10906B08397j0179p148N24j850j567Q297k56K48J600q934m011K502q088j6919
$$ plain form
10892 162616 155560 146175 140766 136536 137021 149061 146296 153114 154600 157419 156983 153146 159635 153115
10878 153115 156837 164663 166833 171109 173761 176880 184210 187879 192199 200478 195949 177664 173938 178178
10864 178178 169110 168864 185486 189195 201928 196142 193147 202244 213361 217437 231284 246979 253132
10851 253132 276382 295605 304273 338372 361295 374925 395477 405090 414969 429578 466676 511409
10839 511409 549532 602016 666887 722771 797636 905482 1015298 1140968 1317135 1511130
10829 1511130 1733498 1996824 2295703 2664759 3129324 3733233 4526229 5644437 7237928
10820 7237928 9488261 12533829 16301437 20383792 24126251 26980578 28785952 29480718
10812 29480718 28714975 26138042 22189734 17988563 14493992 12051481 10529144 9713782
$$ packed form
10892A62616p056r385n409m230M85J2040k765O818J486K819m36l837O489o520
10878A53115L722P826K170M276K652L119P330L669M320Q279m529j8285l726M240
10864A78178r068k46J6622L709J2733n786k995R097J1117M076J3847J5695O153
10851B53132K3250J9223Q668L4099K2923J3630K0552R613R879J4609L7098M4733
10839E11409L8123N2484O4871N5884P4865J07846J09816J25670J76167J93995
10829A511130K22368K63326K98879L69056M64565O03909P92996J118208J593491
10820G237928K250333L045568L767608M082355L742459K854327J805374O94766
10812B9480718p65743k576933l948308m201171l494571k442511j522337q15362
$$ plain form
10804 9713782 9400941 9423665 9588420 9742312 9864679 9955796 9936572 9749999 9499210 9407084
10794 9407084 9677496 10459539 11836139 13782617 16097844 18586463 21163909 23973296
10786 23973296 27068486 30155986 32767430 34705991 36129481 37253019 38020025 38021736 36770255
10777 36770255 34257104 31075670 27937612 25113322 22378742 19527887 16783825 14539804
10769 14539804 12971575 12029200 11578093 11475905 11515536 11558640 11572325 11553510 11456556 11236126
10759 11236126 10925969 10698582 10782829 11351206 12535173 14471965 17232687 20617711 24152216
10750 24152216 27169777 29238659 30323608 30288362 28745007 25537282 21299977 17155518
10742 17155518 13802840 11365788 9674829 8492652 7638152 6983906 6487640 6087860 5732477
$$ packed form
10804I713782l12841K2724J64755J53892J22367R1117j9224j86573k50789r2126
10794I407084K70412P82043J376600J946478K315227K488619K577446K809387
10786B3973296L095190L087500K611444J938561J423490J123538P67006J711j251481
10777C6770255k513151l181434l138058k824290k734580k850855k744062k244021
10769A4539804j568229r42375m51107j02188L9631M3104J3685j8815r6954k20430
10759A1236126l10157k27387Q4247N68377J183967J936792K760722L385024L534505
10750B4152216L017561K068882J084949l5246j543355l207725m237305m144459
10742A7155518l352678k437052j690959j182177q54500o54246m96266l99780l55383
$$ plain form
10733 5732477 5420008 5115815 4815605 4535075 4273793 4041103 3822492 3618697 3427998
10724 3427998 3268354 3119772 2981088 2856779 2728406 2619169 2515771 2418258 2328923 2231056
10714 2231056 2133997 2038733 1947470 1880624 1833266 1782821 1729011 1662943 1605606 1559516 1514348
10703 1514348 1470960 1426267 1373077 1325547 1275681 1224473 1196515 1182288 1150341 1114918 1078384
10692 1078384 1050141 1016182 984011 954942 915552 878153 855365 831261 799611 760656 735962
10681 735962 717642 698928 666475 644824 635219 631068 605061 580058 567198 553536 535777 526882
10669 526882 522071 500574 468715 454069 452859 443958 441611 432245 420862 402663 382681 364024
10657 364024 354177 348264 324123 309393 304088 304302 292071 279438 281333 270665 269482 259249 256183
$$ packed form
10733E732477l12469l04193l00210k80530k61282k32690k18611k03795j90699
10724C427998j59644j48582j38684j24309j28373j09237j03398r7513q9335r7867
10714B231056r7059r5264r1263o6846m7358n0445n3810o6068n7337m6090m5168
10703A514348m3388m4693n3190m7530m9866n1208k7958j4227l1947l5423l6534
10692A078384k8243l3959l2171k9069l9390l7399k2788k4104l1650l8955k4694
10681G35962j8320j8714l2453k1651r605m151k6007k5003j2860j3662j7759q895
10669E26882m811k1497l1859j4646j210q901k347r366j1383j8199j9982j8657
10657C64024r847n913k4141j4730n305K14j2231j2633J895j0668j183j0233l066
$$ plain form
10644 256183 245346 251126 237790 245435 260797 267300 262215 249756 239792 249485 242148 239752 239631
10631 239631 243673 248529 257560 253583 259094 259573 269190 280918 277019 273370 275640 273368 268315 274829
10617 274829 264088 252475 261457 280806 308051 341260 387915 436477 480551 558614 667576
10606 667576 806506 988688 1195992 1402767 1585950 1718921 1804356 1823560 1764001 1628249
10596 1628249 1440307 1228915 1027523 861844 718121 613453 545858 493984 455615 428887
10586 428887 406942 397732 401037 406593 403077 383662 372748 359598 347278 328095 334833 329618 300238
10573 300238 291856 260137 233764 214988 199658 192021 186938 179011 183251 183736 181706 172998 179074
10560 179074 192833 200131 197231 186540 190235 190859 180828 171048 170804 170623 166657 158019 162375 167286
$$ packed form
10644B56183j0837N780j3336P645J5362O503n085j2459r964R693p337k396j21
10631B39631M042M856R031l977N511M79R617J1728l899l649K270k272n053O514
10617B74829j0741j1613Q982J9349K7245L3209M6655M8562M4074P8063J08962
10606F67576J38930J82182K07304K06775J83183J32971Q5435J9204n9559j35752
10596A628249j87942k11392k01392j65679j43723j04668o7595n1874l8369k6728
10586D28887k1945r210L305N556l516j9415j0914j3150j2320j9183O738n215k9380
10573C00238q382l1719k6373j8776j5330p637n083p927M240M85k030q708O076
10560A79074J3759P298k900j0691L695O24j0031r780k44j81l966q638M356M911
$$ plain form
10546 167286 172904 187258 208489 227609 221485 205925 200610 192232 184939 158803 139099 139372 119817
10533 119817 120287 113271 120870 130813 115540 109957 93454 85594 88134 108149 136985 136656 138368 137456
10519 137456 130618 134552 141376 137589 114328 93444 99888 99927 91406 86212 84666 94005 103706 121206
10505 121206 122713 126657 148797 159840 160840 165028 165292 153763 142853 127360 100438 84337 84348
10492 84348 77470 71744 61056 55166 42141 37787 39744 34862 28889 32746 51004 44988 29442
10479 29442 36184 37345 20790 21670 7137 -4603 -6638 -4750 10042 37394 48344 61353 57588
10466 57588 54274 55175 43430 26863 34937 37589 24772 20182 17990 14676 -736 -10957 -1905
10453 -1905 -6426 -1693 6909 2129 -2315 6344 11742 19155 9035 14758 15757 5086 19331 50764
$$ packed form
10546A67286N618J4354K1231J9120o124j5560n315q378p293k6136j9704K73j9555
10533A19817M70p016P599R943j5273n583j6503p860K540K0015K8836l29J712r12
10519A37456o838L934O824l787k3261k0884O444L9q521n194j546R339R701J7500
10505A21206J507L944K2140J1043J000M188K64j1529j0910j5493k6922j6101J1
10492H4348o878n726j0688n890j3025m354J957m882n973L857J8258o016j5546
10479B9442O742J161j6555Q80j4533j1740k035J888J4792K7352J0950J3009l765
10466E7588l314R01j1745j6567Q074K652j2817m590k192l314j5412j0221R052
10453a905m521M733Q602m780m444Q659N398P413j0120N723R99j0671J4245L1433
$$ plain form
10439 50764 81942 100214 126167 143239 145898 167106 200536 230097 229464 203463 165711 135183
10427 135183 120211 118192 109325 105270 109511 105754 96457 97975 99112 100876 102076 81233 73578 76273
10413 76273 57540 55248 69153 56598 30508 36848 36979 35774 53566 63076 58307 46462 62452
10400 62452 95618 104437 108763 148806 192914 235903 269442 300072 320235 336591 347249 325810
10388 325810 282434 250791 224115 210049 183206 180653 201661 204887 204432 186387 177170 182024 193773
10375 193773 179451 183573 182441 171232 171165 171775 174894 189829 211000 222435 237098 251485 257750
10362 257750 272509 278094 270739 290898 307733 302224 293010 308347 307572 310742 330934 349172 379534
10349 379534 407222 432124 464769 464031 465490 467128 454809 451724 482623 522321 577695 686891
$$ packed form
10439E0764L1178J8272K5953J7072K659K1208L3430K9561o33k6001l7752l0528
10427A35183j4972k019q867m055M241l757r297J518J137J764J200k0843p655K695
10413G6273j8733k292J3905j2555k6090O340J31j205J7792R510m769j1845J5990
10400F2452L3166Q819M326M0043M4108M2989L3539L0630K0163J6356J0658k1439
10388C25810m3376l1643k6676j4066k6843k553K1008L226m55j8045r217M854J1749
10375A93773j4322M122j132j1209o7O10L119J4935K1171J1435J4663J4387O265
10362B57750J4759N585p355K0159J6835n509r214J5337p75L170K0192J8238L0362
10349C79534K7688K4902L2645p38J459J638j2319l085L0899L9698N5374J09196
$$ plain form
10337 686891 850750 1083808 1406264 1801613 2161574 2418684 2581362 2675939 2677547 2489025
10327 2489025 2112368 1697416 1359597 1131107 992401 896826 828383 784821 783197 805371
10317 805371 849428 949364 1089432 1217954 1335191 1433936 1507635 1550592 1533454 1438101 1282363
10306 1282363 1143460 1028142 948990 914168 901319 887068 879823 881578 871953 866345 839434 790199
10294 790199 746710 713472 693690 673871 680538 699451 724618 755310 764876 753620 740814 724205
10282 724205 689313 659487 652449 636864 611356 600248 594176 583401 572902 582618 572253 535719
10270 535719 508016 505352 512189 529633 564990 586045 597689 603370 625646 619948 605915 575213
10258 575213 550546 514744 478030 479103 490722 516558 545711 588003 636571 678532 721780 757497
$$ packed form
10337F86891J63859K33058L22456L95349L59961K57110J62678R4577J608j88522
10327B489025l76657m14952l37819k28490j38706r5575o8443m3562j624K2174
10317H05371M4057R9936J40068J28522J17237R8745P3699M2957j7138r5353j55738
10306A282363j38903j15318p9152l4822j2849j4251p245J755r625n608k6911m9235
10294G90199m3489l3238j9782j9819O667J8913K5167L0692R566j1256j2806j6609
10282G24205l4892k9826p038j5585k5508j1108o072j0775j0499R716j0365l6534
10270E35719k7703k664O837J7444L5357K1055J1644N681K2276n698j4033l0702
10258E75213k4667l5802l6714J073J1619K5836K9153M2292M8568M1961M3248L5717
$$ plain form
10246 757497 817548 862356 887505 900332 893662 864076 815031 787211 767056 755975 768907 803434
10234 803434 846798 893285 952995 996086 1016433 1026492 1010280 1003040 1013109 1046112 1072193 1135376
10222 1135376 1219710 1325590 1462838 1621157 1767579 1920689 2072253 2223094 2389339 2565426
10212 2565426 2735054 2906983 3102044 3354924 3629289 3946307 4340910 4817580 5411659
10203 5411659 6157449 7069219 8141972 9396453 10830578 12426536 14135729 15948111
10195 15948111 17968993 20312889 23043262 26335124 30614260 36522682 44867696 56859891
10187 56859891 74464986 100793090 139823210 193103661 252975969 302709081 333045422
10180 333045422 350729011 362575086 357975631 315939699 245518478 179998302 134210036
$$ packed form
10246G57497O0051M4808K5149J2827o670k9586m9045k7820k0155j1081J2932L4527
10234H03434M3364M6487N9710M3091K0347J0059j6212p240J0069L3003K6081O3183
10222A135376Q4334J05880J37248J58319J46422J53110J51564J50841J66245J76087
10212B565426J69628J71929J95061K52880K74365L17018L94603M76670N94079
10203E411659P45790R11770J072753J254481J434125J595958J709193J812382
10195A5948111K020882K343896K730373L291862M279136N908422Q345014J1992195
10187E6859891J7605095K6328104L9030120N3280451N9872308M9733112L0336341
10180C33045422J7683589J1846075m599455m2035932p0421221o5520176m5788266
$$ plain form
10173 134210036 104802638 85747397 73020023 64254549 57980564 53347538 49838320
10166 49838320 47026339 44598072 42335478 40118946 37833521 35400259 32905567 30548830
10158 30548830 28448805 26613803 24969273 23530207 22265000 21144013 20143397 19243405
10150 19243405 18399410 17584886 16773865 16004375 15257440 14542708 13877407 13259862 12688873
10141 12688873 12159809 11690361 11269626 10888187 10522678 10159735 9816257 9491704 9154924
10132 9154924 8808257 8459316 8139999 7849496 7575784 7310885 7097420 6922190 6773604
10123 6773604 6619883 6441136 6249318 6045657 5839655 5641015 5447508 5267418 5104481
10114 5104481 4961094 4824942 4712639 4616218 4519714 4430869 4364174 4291722 4211720 4156144 4086703
$$ packed form
10173A34210036k9407398j9055241j2727374q765474o273985m633026l509218
10166D9838320k811981k428267k262594k216532k285425k433262k494692k356737
10158C0548830k100025j835002j644530j439066j265207j120987j000616q99992
10150A9243405q43995q14524q11021p69490p46935p14732o65301o17545n70989
10141A2688873n29064m69448m20735l81439l65509l62943l43478l24553l36780
10132I154924l46667l48941l19317k90503k73712k64899k13465j75230j48586
10123F773604j53721j78747j91818k03661k06002j98640j93507j80090j62937
10114E104481j43387j36152j12303r6421r6504q8845o6695p2452q0002n5576o9441
$$ plain form
10103 4086703 4008505 3926134 3841782 3770156 3709799 3627841 3517848 3402595 3284040 3162656
10093 3162656 3034945 2893701 2739832 2588404 2458143 2315131 2192310 2081566 1992676 1906177
10083 1906177 1799539 1705922 1627251 1560099 1510335 1448826 1379575 1312142 1238377 1177340 1125187
10072 1125187 1082625 1050094 1020820 996394 974231 948021 915226 892428 868195 848299 849687
10061 849687 850885 840652 851573 867570 857880 867904 884235 899597 896548 869402 830161 807524
10049 807524 784358 753629 735328 722643 717171 741169 747689 752721 766108 773009 763286 749153
10037 749153 735785 711405 693965 702243 717060 722856 721725 710694 702428 693438 686608 683403 684377
10024 684377 697417 693334 686102 670876 654887 643984 632061 626705 630040 631113 629637 619477 618735
$$ packed form
10103D086703p8198q2371q4352p1626o0357q1958j09993j15253j18555j21384
10093C162656j27711j41244j53869j51428j30261j43012j22821j10744q8890q6499
10083A906177j06638r3617p8671o7152m9764o1509o9251o7433p3765o1037n2153
10072A125187m2562l2531k9274k4426k2163k6210l2795k2798k4233j9896J388
10061H49687J198j0233J0921J5997r690J0024J6331J5362l049k7146l9241k2637
10049H07524k3166l0729j8301j2685n472K3998O520N032J3387O901r723j4133
10037G49153j3368k4380j7440Q278J4817N796j131j1031q266q990o830l205R74
10024F84377J3040m083p232j5226j5989j0903j1923n356L335J073j476j0160p42
$$ plain form
10011 618735 610727 603331 584818 591187 602664 597888 591566 589509 588397 579420 575897 570731 573910 571818
9997 571818 560481 546071 543163 540257 517352 508045 530766 521145 517269 510905 492515 477542 471567
9984 471567 461057 440779 425500 416269 401857 387151 398617 415634 434843 436146 449891 468934
9972 468934 446527 422059 426766 427474 424669 426431 435838 446006 455363 447386 440033 441237 430864 432489
9958 432489 443817 442054 452298 461508 453645 438904 424884 399777 386725 389280 380659 349146 332760
9945 332760 320457 316029 312809 313847 296152 264177 259987 269356 273921 278188 261312 255729 260352
9932 260352 267510 275753 276038 273628 269645 292727 302163 307350 315208 307783 316006 315061 318208 309052 310607
9917 310607 311454 311529 292701 277649 270950 274758 288018 291828 281212 276641 279649 270711 259862 260687
$$ packed form
10011F18735q008p396j8513O369J1477m776o322k057j112q977l523n166L179k092
9997E71818j1337j4410k908k906k2905r307K2721r621l876o364j8390j4973n975
9984D71567j0510k0278j5279r231j4412j4706J1466J7017J9209J303J3745J9043
9972D68934k2407k4468M707P08k805J762R407J0168R357p977p353J204j0373J625
9958D32489J1328j763J0244R210p863j4741j4020k5107j3052K555q621l1513j6386
9945C32760j2303m428l220J038j7695l1975m190R369M565M267j6876n583M623
9932B60352P158Q243K85k410l983K3082R436N187P858p425Q223r45L147r156J555
9917C10607Q47P5j8828j5052o699L808J3260L810j0616m571L008q938j0849Q25
$$ plain form
9903 260687 261880 254180 240364 245122 246138 245171 232204 231182 226980 220288 221170 223655 210203 226682
9889 226682 258112 269270 261105 265242 263541 267256 254032 232123 234883 236163 230241 209914 187404
9876 187404 187226 197436 189722 195365 210729 209789 206739 200687 185760 172115 174345 168703 167864 168313
9862 168313 162019 172806 168217 175583 179308 176523 168496 180798 187221 185823 180155 178947 177284 178997
9848 178997 184892 196931 194334 186303 182750 179960 177037 165752 151535 153492 166449 173195 187168
9835 187168 181082 173798 179353 188399 170647 163698 155276 140335 133595 126747 138895 142098 151338 149802
9821 149802 151314 147131 147986 158251 154354 158072 156596 140312 130370 119591 117270 120312 114852 135855
9807 135855 160662 154194 146769 145495 152932 157273 154398 151760 155904 149739 145942 142949 143816 155960
$$ packed form
9903B60687J193p700j3816M758J016r67j2967j022m202o692Q82K485j3452J6479
9889B26682L1430J1158q165M137j701L715j3224k1909K760J280n922k0327k2510
9876A87404j78J0210p714N643J5364r40l050o052j4927j3645K230n642q39M49
9862A68313o294J0787m589P366L725k785q027J2302O423j398n668j208j663J713
9848A78997N895J2039k597q031l553k790k923j1285j4217J957J2957O746J3973
9835A87168o086p284N555R046j7752o949q422j4941o740o848J2148L203R240j536
9821A49802J512m183Q55J0265l897L718j476j6284r942j0779k321L042n460K1003
9807A35855K4807o468p425j274P437M341k875k638M144o165l797k993Q67J2144
$$ plain form
9793 155960 160481 160234 154805 140712 130616 135919 142717 133149 147825 157634 154529 146711 150032 150730
9779 150730 150330 147684 158126 166769 172652 189079 197276 191276 203818 232149 246344 257538 268665
9766 268665 274953 295598 326292 391086 476551 559446 678483 852295 1047807 1252021 1446188
9755 1446188 1615264 1737329 1780651 1759338 1644379 1461403 1257253 1061621 887261 739539
9745 739539 621106 531284 493508 459002 405337 368526 353886 338416 331136 328553 315366 289718
9733 289718 266341 259739 252175 247297 244497 237046 217026 193431 186341 192620 189023 178846 185794
9720 185794 188914 189767 190934 186258 179907 176281 169227 175356 170847 137983 124943 131972 150410 153114
9706 153114 152049 160091 156340 153450 154918 147279 149977 141915 129573 121069 122287 142666 141094 138793
$$ packed form
9793A55960M521k47n429j4093j0096N303O798r568J4676R809l105p818L321O98
9779A50730m00k646J0442Q643N883J6427Q197o000J2542K8331J4195J1194J1127
9766B68665O288K0645L0694O4794Q5465Q2895J19037J73812J95512K04214J94167
9755A446188J69076J22065M3322k1313j14959j82976k04150j95632j74360j47722
9745G39539j18433q9822l7776l4506n3665l6811j4640j5470p280k583j3187k5648
9733B89718k3377o602p564m878k800p451k0020k3595p090O279l597j0177O948
9720A85794L120Q53J167m676o351l626p054O129m509l2864j3040P029J8438K704
9706A53114j065Q042l751k890J468p639K698q062j2342q504J218K0379j572k301
$$ plain form
9692 138793 135395 137634 131541 146937 151768 145709 130705 121208 115706 100084 102157 102290 106359 108154
9678 108154 106007 107741 112490 136738 131304 107483 97005 99217 105565 100824 110852 108557 99184
9665 99184 103340 113402 107995 98979 101890 116703 123070 117522 97720 94789 95470 102730 102489 111093
9651 111093 129684 135036 116175 94789 93553 110349 109524 106657 100241 98359 83790 72655 69606
9638 69606 76566 78134 68605 80884 91012 94790 88573 97132 102274 90384 91986 108414 115577 115836
9624 115836 102091 93389 83840 96053 99790 95169 80840 88930 93839 94070 110273 110961 114126 115009
9610 115009 113474 104168 96081 88147 76592 71083 77774 78876 73775 71567 66020 76842 85552 80598
9596 80598 81374 69656 69952 84954 92599 90228 97347 95603 95901 84131 74203 79384 81443 88137 90526
$$ packed form
9692A38793l398K239o093J5396M831o059j5004r497n502j5622K073J33M069J795
9678A08154k147J734M749K4248n434k3821j0478K212O348m741J0028k295r373
9665I9184M156J0062n407r016K911J4813O367n548j9802k931O81P260k41Q604
9651A11093J8591N352j8861k1386j236J6796q25k867o416j882j4569j1135l049
9638F9606O960J568r529J2279J0128L778o217Q559N142j1890J602J6428P163K59
9624A15836j3745q702r549J2213L737m621j4329Q090M909K31J6203O88L165Q83
9610A15009j535r306q087p934j1555n509O691J102n101k208n547J0822Q710m954
9596H0598P76j1718K96J5002P645k371P119j744K98j1770r928N181K059O694K389
$$ plain form
9581 90526 88825 80931 70984 70719 70549 85406 97840 91065 83858 83245 71388 72125 92000 96660 82599
9566 82599 78650 88440 83484 82917 87575 75739 76010 90905 93536 77158 65925 64589 76767 94821
9552 94821 87354 79924 82048 88210 93621 90984 84990 74105 63169 56525 60357 62160 73534 69404
9538 69404 58666 43131 43882 42222 50659 55947 67228 61087 62315 71701 53958 29932 43750
9525 43750 57411 61776 58039 59286 69699 84683 79497 60707 43922 34935 47092 60878 64991
9512 64991 68892 65186 66266 70827 59613 45335 38675 36385 46149 65805 76077 61871 58297
9499 58297 56618 59615 64947 62515 57501 57573 57314 56509 63600 71310 68078 65053 77280 91849 83732
9484 83732 78043 69551 64813 66382 64439 56895 69818 78756 72642 70079 64340 58822 59737 62876 73991
$$ packed form
9581I0526j701p894r947k65j70J4857J2434o775p207o13j1857P37J9875M660j4061
9566H2599l949R790m956n67M658j1836K71J4895K631j6378j1233j336J2178J8054
9552I4821p467p430K124O162N411k637n994j0885j0936o644L832J803J1374m130
9538F9404j0738j5535P51j660Q437N288J1281o141J228R386j7743k4026J3818
9525D3750J3661M365l737J247J0413J4984n186j8790j6785q987J2157J3786M113
9512F4991L901l706J080M561j1214j4278o660k290R764J9656J0272j4206l574
9499E8297j679K997N332k432n014P2k59q05P091P710l232l025J2227J4569q117
9484H3732n689q492m738J569j943p544J2923Q938o114k563n739n518R15L139J1115
$$ plain form
9469 73991 85104 73651 55251 67177 79643 76902 59870 62067 81622 74959 66128 49211 60577
9456 60577 66495 61050 62841 59962 62421 56334 49306 50248 57537 65601 63419 76407 74425 53573
9442 53573 54323 54989 43778 50397 63563 66562 54999 64530 71606 59640 53825 58406 58246 46114
9428 46114 49464 75206 91262 91142 74582 71201 69416 78923 88276 85502 87093 80186 74126 86234
9414 86234 85595 74212 63050 62150 71905 79991 90807 85168 53217 35176 33134 49432 50771 62106
9400 62106 59923 59836 53419 43691 32395 34286 51008 72850 81162 91260 95997 74862 70386 73794
9386 73794 68365 61289 59925 60714 55933 48798 48513 62597 54859 54150 67921 71526 78944 75036 60779
9371 60779 53991 63040 63773 54625 45434 53811 67099 55938 43206 44823 45551 51539 47816 60792
$$ packed form
9469G3991J1113j1453j8400J1926J2466k741j7032K197J9555o663q831j6917J1366
9456F0577N918n445J791k879K459o087p028R42P289Q064k182J2988j982k0852
9442E3573P50O66j1211O619J3166K999j1563R531P076j1966n815M581j60j2132
9428D6114L350K5742J6056j20j6560l381j785R507R353k774J591o907o060J2108
9414H6234o39j1383j1162r00R755Q086J0816n639l1951j8041k042J6298J339J1335
9400F2106k183q7o417r728j1296J891J6722K1842Q312J0098M737k1135m476L408
9386G3794n429p076j364P89m781p135k85J4084p738p09J3771L605P418l908j4257
9371F0779o788R049P33r148r191Q377J3288j1161j2732J617P28N988l723J2976
$$ plain form
9357 60792 58458 51870 57517 54486 48981 56629 45558 35775 29183 27735 27685 29084 35216 50060 44951
9342 44951 43283 38932 35779 34856 28237 35726 55734 73105 60649 52887 55505 51298 44681 36069
9328 36069 45527 58956 67243 56414 50634 73466 75335 70427 51900 35837 38684 51813 70902
9315 70902 70532 58666 51038 43009 50828 52736 55568 60192 51202 52262 50269 56648 58868 49872 46639
9300 46639 43895 40922 37178 32833 36552 43282 50712 46412 55158 60614 51850 43662 38697 35515 34117
9285 34117 44430 55711 44173 36786 55107 66879 66023 58198 65176 75183 70157 65422 52056
9272 52056 42757 50001 54481 53136 62375 63065 58882 59722 57915 71306 62347 61620 64086 76843 87576
9257 87576 66174 53281 49664 50081 57379 65435 52995 33477 29738 46224 63952 70308 58387
$$ packed form
9357F0792k334o588N647l031n505P648j1071r783o592j448n0J399O132J4844n109
9342D4951j668m351l153r23o619P489K0008J7371j2456p762K618m207o617q612
9328C6069R458J3429Q287j0829n780K2832J869m908j8527j6063K847J3129J9089
9315G0902l70j1866p628q029P819J908K832M624q990J060j993O379K220q996l233
9300D6639k744k973l744m345L719O730P430m300Q746N456q764q188m965l182j398
9285C4117J0313J1281j1538p387J8321J1772q56p825O978J0007n026m735j3366
9272E2056r299P244M480j345R239O90m183Q40j807J3391q959p27K466J2757J0733
9257H7576k1402j2893l617M17P298Q056j2440j9518l739J6486J7728O356j1921
$$ plain form
9244 58387 50665 54139 36466 35106 45462 43447 39580 48105 36641 31505 33986 50898 53709 41839
9230 41839 41267 51166 40737 37044 50017 57978 50618 56207 67799 64957 55108 48045 48195 55885
9216 55885 67645 69189 62150 61461 67005 66040 68033 67774 76022 89935 71659 55243 59619 56753
9202 56753 41119 26699 38701 35738 35276 39636 39814 50828 58079 59325 57281 52270 48209 51205
9188 51205 54789 57313 67187 62760 58951 55548 38236 40333 41053 45877 49348 40871 37745 22423
9174 22423 13790 23391 36343 29202 20381 34178 41223 46730 31772 35683 34091 32861 44266 38360
9160 38360 52803 60027 59706 56345 63140 74151 74215 65319 58581 46837 46145 53534 51702 44069 27394
9145 27394 29105 27635 40250 40571 24142 20128 30869 28459 29794 43440 46594 48753 48229 45739
$$ packed form
9244E8387p722L474j7673j360J0356k015l867Q525j1464n136K481J6912K811j1870
9230D1839n72R899j0429l693J2973P961p360N589J1592k842r849p063J50P690
9216E5885J1760J544p039o89N544r65J993k59Q248J3913j8276j6416M376k866
9202E6753j5634j4420J2002k963m62M360J78J1014P251J246k044n011m061K996
9188E1205L584K524R874m427l809l403j7312K097P20M824L471q477l126j5322
9174B2423q633R601J2952p141q821J3797P045N507j4958L911j592j230J1405n906
9160C8360J4443P224l21l361O795J1011O4q896o738j1744o92P389j832p633j6675
9145B7394J711j470J2615L21j6429m014J0741k410J335J3646L154K159n24k490
$$ plain form
9131 45739 46811 49063 46125 55227 47428 36548 38315 42383 46765 44703 54381 56331 63038 60516
9117 60516 47668 40603 31451 20696 12271 32510 60785 68445 58954 60081 61181 50628 45838
9104 45838 44966 48111 46954 53366 59308 47694 28215 23473 28620 54132 56442 56241 63358 59993
9090 59993 57276 53086 52012 54083 40057 37561 25726 31207 32460 26099 21633 31931 40048 30607
9076 30607 19968 21866 27433 31848 37972 42532 37270 14630 3581 1444 1644 18391 33716 44046
9062 44046 38357 46335 49401 41571 34082 25554 25274 39051 44837 26784 12498 10882 10127 3033
9048 3033 11353 25542 33825 31801 33718 39905 38393 29738 30603 30959 35489 30088 31842 25261 34451
9033 34451 35973 27670 24224 29816 30018 36352 44662 54568 62204 56867 45716 51367 47856 34526
$$ packed form
9131D5739J072K252k938R102p799j0880J767M068M382k062R678J950O707k522
9117F0516j2848p065r152j0755q425K0239K8275P660r491J127J100j0553m790
9104D5838q72L145j157O412N942j1614j9479m742N147K5512K310k01P117l365
9090E9993k717m190j074K071j4026k496j1835N481J253o361m466J0298Q117r441
9076C0607j0639J898N567M415O124M560n262k2640j1049k137K00J6747J5325J0330
9062D4046n689P978L066p830p489q528k80J3777N786j8053j4286j616p55p094
9048C033Q320J4189Q283k024J917O187j512q655Q65L56M530n401J754o581R190
9033C4451J522q303l446N592K02O334Q310R906P636n337j1151N651l511j3330
$$ plain form
9019 34526 44132 59828 60801 46147 49993 53039 50050 65126 67948 61878 48456 42286 61879 57707
9005 57707 41383 46422 53100 65186 64009 52099 57568 52798 40767 34658 35678 39797 36063 21630
8991 21630 12982 13131 13914 25322 34548 39980 39427 46651 49650 49911 39716 41494 38645 41113 38463
8976 38463 47926 43537 40767 29750 15340 7669 19233 22972 18042 27268 29178 25726 16703 15955
8962 15955 17048 19779 15153 22538 22168 34604 38847 30768 30731 37671 32891 27624 39418 43482 41188
8947 41188 39829 44219 42626 45557 46226 35583 29638 46405 63078 58983 44454 40413 41118 31247
8933 31247 28555 29724 34410 54474 47160 58748 55326 37700 24644 16296 8433 15698 24722 29724
8919 29724 24141 17632 25169 38867 37740 34215 34479 35124 29021 37928 43347 51959 57673 47209 55828
$$ packed form
9019C4526R606J5696R73j4654L846L046k989J5076K822o070j3422o170J9593m172
9005E7707j6324N039O678J2086j177j1910N469m770j2031o109J020M119l734j4433
8991B1630q648J49P83J1408R226N432n53P224K999K61j0195J778k849K468k650
8976C8463R463m389k770j1017j4410p671J1564L739m930R226J910l452r023p48
8962A5955J093K731m626P385l70J2436M243q079l7O940m780n267J1794M064k294
8947D1188j359M390j593K931O69j0643n945J6767J6673m095j4529m041P05r871
8933C1247k692J169M686K0064p314J1588l422j7626j3056q348p863P265R024N002
8919B9724n583o509P537J3698j127l525K64O45o103Q907N419Q612N714j0464Q619
$$ plain form
8904 55828 59107 56685 49477 33646 23612 21282 17648 23183 29586 42609 62352 62326 60893 65653
8890 65653 57981 51609 54386 50898 31317 27568 31828 38711 26721 32990 41891 34065 35598 31322
8876 31322 22619 16972 5068 4400 13501 24269 26482 32983 29111 34461 38634 31194 38114 40891
8862 40891 33382 28992 41065 45924 39718 25034 23577 25894 28113 18737 23111 31017 42784 39156
8848 39156 28511 24746 27711 32466 42419 52348 42548 41113 47383 48350 32843 31720 35962 42750
8834 42750 34365 18417 30756 41866 39838 43713 46973 46061 35989 29263 18122 22865 38340
8821 38340 45142 47278 36145 26096 38935 48965 48555 44704 24584 14331 8006 4494 30866
8808 30866 43737 37954 35938 41918 38989 48798 51000 34819 28031 37377 45247 31861 27252 33212
$$ packed form
8904E5828L279k422p208j5831j0034k330l634N535O403J3023J9743k6j433M760
8890F5653p672o372K777l488j9581l749M260O883j1990O269Q901p826J533m276
8876C1322q703n647j1904o68R101J0768K213O501l872N350M173p440O920K777
8862D0891p509m390J2073M859o206j4684j457K317K219r376M374P906J1767l628
8848C9156j0645l765K965M755R953R929r800j435O270R67j5507j123M242O788
8834D2750q385j5948J2339J1110k028L875L260r12j0072o726j1141M743J5475
8821C8340O802K136j1133j0049J2839J0030m10l851k0120j0253o325l512K6372
8808C0866J2871n783k016N980k929R809K202j6181o788R346P870j3386m609N960
$$ plain form
8794 33212 45609 40035 34181 25095 14828 11956 11676 12634 5761 8242 21076 32349 33729 17248
8780 17248 21633 32060 43838 48456 39992 22224 5668 5093 24770 34709 34223 34805 38171 36382
8766 36382 52810 58049 54478 44181 50792 55004 56908 56078 62072 58914 55208 59628 57479 59141
8752 59141 64133 57544 67177 66152 60389 63526 65566 62757 54547 38525 34974 41974 55523 66483
8738 66483 56628 49787 52471 53960 60745 51536 48618 57372 56584 65848 70931 68130 66255 60325 59147
8723 59147 52407 47586 54312 66804 70576 50268 41630 49156 64933 76746 75009 67454 50477
8710 50477 50585 66510 71311 63194 68238 71644 68205 75049 71344 70788 66286 43065 53608 54950
8696 54950 65901 75037 66926 49371 39604 60299 79423 82231 74094 67178 68249 59836 52437 45969
$$ packed form
8794C3212J2397n574n854r086j0267k872k80R58o873K481J2834J1273J380j6481
8780A7248M385J0427J1778M618q464j7768j6556n75J9677R939m86N82L366j789
8766C6382J6428N239l571j0297O611M212J904q30N994l158l706M420k149J662
8752E9141M992o589R633j025n763L137K040k809q210j6022l551P000J3549J0960
8738F6483r855o841K684J489O785r209k918Q754p88R264N083k801j875n930j178
8723E9147o740m821O726J2492L772k0308q638P526J5777J1813j737p555j6977
8710E0477J08J5925M801q117N044L406l439O844l705n56m502k3221J0543J342
8696E4950J0951R136q111j7555r767K0695J9124K808q137o916J071q413p399o468
$$ plain form
8682 45969 52425 57148 39338 36117 43921 50480 42153 38474 60716 74985 74492 66131 62450 60959
8668 60959 61918 48501 51016 51912 41548 21114 18095 22858 35151 54451 52968 48229 54470 52845
8654 52845 46290 36688 41948 50803 50966 47784 56261 66789 51904 38138 30376 34303 43236 50183
8640 50183 54090 46550 53760 63539 60762 60125 56756 66245 60296 45868 39784 42855 40929 54680
8626 54680 57629 50875 57715 61220 62371 49103 47547 46180 52853 60138 47698 47886 48776 62389
8612 62389 78635 75149 77993 80771 79933 70000 67257 83911 83491 87460 85641 89438 95536 93468 91380
8597 91380 99243 106891 103742 111093 121194 118988 124610 121729 113160 109097 103042 97872 97362 113323
8583 113323 107700 90687 81288 90122 92317 88078 88884 77525 67018 60132 56923 56614 61630 59951
$$ packed form
8682D5969O456M723j7810l221P804O559q327l679K2242J4269m93q361l681j491
8668F0959R59j3417K515Q96j0364k0434l019M763J2293J9300j483m739O241j625
8654E2845o555r602N260Q855J63l182Q477J0528j4885j3766p762L927Q933O947
8640E0183L907p540P210R779k777o37l369R489n949j4428o084L071j926J3751
8626E4680K949o754O840L505J151j3268j556j367O673P285j2440J88Q90J3613
8612F2389J6246l486K844K778q38r933k743J6654m20L969j819L797O098k068k088
8597I1380P863P648l149P351J0101k206N622k881q569m063o055n170n10J5961
8583A13323n623j7013r399Q834K195m239Q06j1359j0507o886l209l09N016j679
$$ plain form
8569 59951 48896 56708 57046 58283 60256 65921 61179 47396 42473 35296 43005 49086 57337 52503
8555 52503 67695 60529 46432 36109 41664 40084 44817 48115 48546 38025 38430 33841 32950 39810
8541 39810 40048 36117 32921 13522 26500 27716 32489 32883 45558 53372 48671 41744 44099 42231
8527 42231 36861 37797 28522 25666 21157 15936 11241 10713 11968 17761 24198 32376 26742 31689 29858
8512 29858 35170 51717 53302 32859 15469 29170 37715 36607 39833 33551 20702 19339 24123
8499 24123 33921 29604 23460 30152 34915 39756 33618 39254 33598 26527 29655 30918 31122 37451 35885
8484 35885 18355 12071 15536 16120 8531 6318 12490 16999 30145 37348 39815 48446 41880 34686
8470 34686 23681 26127 25511 29596 37632 30428 22535 10500 5739 9527 34669 41650 42756 44757
$$ packed form
8569E9951j1055P812L38J237J973N665m742j3783m923p177P709O081Q251m834
8555E2503J5192p166j4097j0323N555j580M733L298M31j0521M05m589q91O860
8541C9810K38l931l196j9399J2978J216M773L94J2675P814m701o927K355j868
8527D2231n370R36r275k856m509n221m695n28J255N793O437Q178n634M947j831
8512B9858N312J6547J585k0443j7390J3701Q545j108L226o282j2849j363M784
8499B4123R798m317o144O692M763M841o138N636n656p071L128J263K04O329j566
8484C5885j7530o284L465N84p589k213O172M509J3146P203K467Q631o566p194
8470C4686j1005K446o16M085Q036p204p893j2035m761L788K5142O981J106K001
$$ plain form
8456 44757 37834 32468 41830 27424 15468 13859 19216 47620 37968 29411 33712 24442 9995 -9117
8442 -9117 -6982 -1343 6381 23024 25930 16457 18096 22145 4386 2100 7786 13701 21909 23365
8428 23365 18583 37484 39986 30253 32263 42632 46566 31765 18191 14908 24567 22678 22136 22941
8414 22941 20539 35525 35634 46482 29059 10525 5070 9402 19674 20362 8161 409 15643
8401 15643 22102 25959 28564 31256 28236 22620 22280 25560 18801 1764 -5967 8402 17520 18527
8387 18527 8953 -4188 1492 26637 34407 36980 32552 28901 32154 26906 25278 25905 40035 26323
8373 26323 16275 10811 14344 24472 27495 26278 21462 17079 22964 33741 42358 32809 25952 32923
8359 32923 34313 22480 22407 25723 28174 27992 27806 15740 5219 -3742 -7280 10106 10689 6310 14162
$$ packed form
8456D4757o923n366R362j4406j1956j609N357K8404r652q557M301r270j4447j9112
8442i117K135N639P724J6643K906r473J639M049j7759k286N686N915Q208J456
8428B3365m782J8901K502r733K010J0369L934j4801j3574l283R659j889n42Q05
8414B2941k402J4986J09J0848j7423j8534n455M332J0272O88j2201p752J5234
8401A5643O459L857K605K692l020n616l40L280o759j7037p731J4369R118J007
8387A8527r574j3141N680K5145P770K573m428l651L253n248j628O27J4130j3712
8373B6323j0048n464L533J0128L023j217m816m383N885J0777Q617r549o857O971
8359C2923J390j1833p3L316K451j82j86j2066j0521q961l538J7386N83m379P852
$$ plain form
8344 14162 20341 31516 34630 18157 19802 31752 40560 40160 38355 26050 31819 42229 27630
8331 27630 18135 15787 15691 11075 12409 20220 11646 17772 23466 19656 26305 30348 36992 39174 38521
8316 38521 37044 29555 37261 41545 37769 29848 35733 37857 28338 28133 24245 26446 35938 38339 33540
8301 33540 32323 40258 31425 5089 14414 24730 34879 28669 24055 15608 16486 14646 20425 7344
8287 7344 16547 25632 41218 50572 41052 25291 19368 21670 29649 22906 11227 -2741 4931 13945
8273 13945 14065 18406 10465 18864 12705 11513 2642 5427 17237 20859 13819 15451 16126 12624 18950
8258 18950 20989 26048 5519 -10175 -3604 9482 26563 14182 -7427 -9124 20266 33256 24929
8245 24929 7429 -2512 -13088 -16218 -6815 -4687 -6925 10378 21698 28168 31394 21581 23486 6211
$$ packed form
8344A4162O179J1175L114j6473J645J1950Q808m00j805j2305N769J0410j4599
8331B7630r495k348r6m616J334P811q574O126N694l810O649M043O644K182o53
8316C8521j477p489P706M284l776p921N885K124r519k05l888K201R492K401m799
8301C3540j217P935q833k6336R325J0316J0149o210m614q447Q78j840N779j3081
8287G344R203R085J5586R354r520j5761n923K302P979o743j1679j3968P672R014
8273A3945J20M341p941Q399o159j192q871K785J1810L622p040J632O75l502O326
8258A8950K039N059k0529j5694O571J3086J7081j2381k1609j697K9390J2990q327
8245B4929j7500r941j0576l130R403K128k238J7303J1320O470L226r813J905j7275
$$ plain form
8231 6211 -2565 298 7316 6448 6472 7652 6767 8563 3515 7380 8232 13628 18905 16534 5186 14369
8215 14369 26232 19151 16327 17816 20156 19031 23987 12932 10005 9942 12814 3843 1630 1084 6035
8200 6035 6979 6620 11590 19815 19083 21480 23180 40055 41636 27299 13793 9766 1967 -5743 -13985
8185 -13985 -2090 18033 25326 27466 18418 12493 7099 7480 7864 11859 6707 13897 25159 35508
8171 35508 29049 15353 11254 14905 14004 2387 7228 20679 26379 34288 32018 31433 17956 21821
8157 21821 16549 7631 15560 16083 5502 11484 22728 19743 26036 20882 25694 34934 26541 17220
8143 17220 23586 34448 36747 38951 35389 18396 20529 22982 24339 38338 47800 18859 8551
8130 8551 23134 22009 27057 24176 23860 13697 221 832 -580 7096 22322 25499 16661 15480
$$ packed form
8231F211q776K863P018q68K4J180q85J796n048L865Q52N396N277k371j1348R183
8215A4369J1863p081k824J489K340j125M956j1055k927o3K872q971k213n46M951
8200F035R44l59M970Q225p32K397J700J6875J581j4337j3506m027p799p710q242
8185a3985J1895K0123P293K140r048n925n394L81L84L995n152P190J1262J0349
8171C5508o459j3696m099L651r01j1617M841J3451N700P909k270n85j3477L865
8157B1821n272q918P929N23j0581N982J1244k985O293n154M812R240q393r321
8143A7220O366J0862K299K204l562j6993K133K453J357J3999R462k8941j0308
8130H551J4583j125N048k881l16j0163j3476O11j412P676J5226L177q838j181
$$ plain form
8116 15480 16168 3814 -1234 13273 16856 30588 28721 20370 21757 23260 20354 15628 15513 8306
8102 8306 7268 17143 24503 30532 15842 -2843 -3118 17024 16294 19379 21316 19367 10950 13661 5129
8087 5129 2353 4474 10606 21963 28370 28266 39178 31748 20829 16092 248 3993 13887 31703
8073 31703 37478 39025 44839 20745 157 12156 33540 37056 51680 64855 58029 42481 40222
8060 40222 25760 24238 25704 28772 42146 44201 46911 38096 31592 30885 21168 28310 32625 42274
8046 42274 40064 39763 32478 23646 25681 29028 16820 13698 25846 12033 21285 35863 34156 36471
8032 36471 30549 21505 21094 35112 49028 59401 67344 65655 58725 67193 56806 45053 22549
8019 22549 14643 16318 31409 54740 45371 35396 40303 40324 48430 51331 31198 38179 30142 23250
$$ packed form
8116A5480O88j2354n048J4507L583J3732j867q351J387J503k906m726j15p207
8102H306j038R875P360O029j4690j8685k75K0142p30L085J937j949q417K711q532
8087E129k776K121O132J1357O407j04J0912p430j0919m737j5844L745R894J7816
8073C1703N775J547N814k4094k0588J1999K1384L516J4624J3175o826j5548k259
8060D0222j4462j522J466L068J3374K055K710q815o504p07r717P142M315R649
8046D2274k210l01p285q832K035L347j2208l122J2148j3813R252J4578j707K315
8032C6471n922r044m11J4018J3916J0373P943j689o930Q468j0387j1753k2504
8019B2549p906J675J5091K3331r369r975M907K1Q106K901k0133O981q037o892
$$ plain form
8005 23250 33470 35483 31693 37262 39781 34167 45307 38146 32191 29361 34711 47821 47983 34621
7991 34621 25105 24873 36039 53520 46541 31205 23649 27194 16057 18093 21366 22700 29757 31172
7977 31172 24316 21317 26514 37285 31169 15713 15035 11432 11770 12088 16875 26609 37920 43103 39173
7962 39173 42526 37569 38722 42837 38949 31957 38395 39146 52703 53663 47741 49752 55884 43629 25560
7947 25560 30316 39320 37471 31546 31507 32478 34880 30944 23122 20043 21708 9820 14206 37403 33268
7932 33268 44682 53217 41972 36135 34125 36042 34635 38360 47604 38698 37322 15359 2616 13468
7918 13468 25271 31674 34349 26383 24671 25818 27890 17648 18134 22964 25866 33333 35022 26497
7904 26497 11394 12156 11564 21658 17244 4122 10333 14708 26091 31786 29875 37484 31841 30965
$$ packed form
8005B3250J0220K013l790N569K519n614J1140p161n955k830N350J3110J62j3362
7991C4621r516k32J1166J7481o979j5336p556L545j1137K036L273J334P057J415
7977C1172o856k999N197J0771o116j5456o78l603L38L18M787R734J1311N183l930
7962C9173L353m957J153M115l888o992O438P51J3557R60n922K011O132j2255j8069
7947B5560M756R004j849n925l9R71K402l936p822l079J665j1888M386K3197m135
7932C3268J1414Q535j1245n837k010J917j407L725R244q906j376k1963j2743J0852
7918A3468J1803O403K675p966j712J147K072j0242M86M830K902P467J689q525
7904B6497j5103P62n92J0094m414j3122O211M375J1383N695j911P609n643q76
$$ plain form
7890 30965 46285 65786 47348 33213 34651 34493 32641 28302 26076 25349 27007 21738 22697 38128
7876 38128 35244 27788 29515 27568 21546 19036 28190 33336 40993 42090 32397 26500 19141 -6705
7862 -6705 -1942 1835 11341 16086 23183 33494 30018 29940 21301 16419 30672 17413 13514 3656 -2940
7847 -2940 818 1362 8173 14998 27222 40051 22740 7913 8000 14867 19046 14556 4459 -3275
7833 -3275 -6518 -3954 -8391 -15104 -14394 -14788 -171 8187 15179 1731 -726 1789 1686 1191 20227
7818 20227 18154 17328 13342 12921 14952 11927 13194 15251 8127 15041 19315 10061 382 280 3529
7803 3529 2225 -8171 542 8557 8123 14390 24708 27996 20307 24171 33573 16368 2797 5059
7789 5059 10152 9828 11444 21159 16552 -3747 -9543 -5088 2688 8039 6701 -10498 -31149 -27328
$$ packed form
7890C0965J5320J9501j8438j4135J438j58j852m339k226p27J658n269R59J5431
7876C8128k884p456J727j947o022k510R154N146P657J097r693n897p359k5846
7862f705M763L777R506M745P097J0311l476p8q639m882J4253j3259l899r858o596
7847b940L758N44O811O825J2224J2829j7311j4827Q7O867M179m490j0097p734
7833c275l243K564m437o713P10l94J4617Q358O992j3448k457K515j03m95J9036
7818B0227k073q26l986m21K031l025J267K057p124O914M274r254r679j02L249
7803C529j304j0396Q713Q015m34O267J0318L288p689L864R402j7205j3571K262
7789E059N093l24J616R715m607k0299n796M455P776N351j338j7199k0651L821
$$ plain form
7775 -27328 -18679 -1220 4322 3174 7554 17035 18707 17905 19961 25697 37247 24087 12923 13249
7761 13249 14475 12882 19679 21505 13352 11558 16636 20686 29201 14852 6883 8941 15322 16344
7747 16344 22877 24076 23482 1871 3941 1847 -1611 11213 15639 21761 27299 29075 17393 22228
7733 22228 37977 35318 29657 23075 33519 29103 32190 29968 31994 34424 27844 29969 19229 5837
7719 5837 9956 245 -13182 4249 6538 17524 14497 9415 5920 16703 16307 5268 -7305 -7016
7705 -7016 5692 270 -10696 -4550 -6640 -2357 -7038 263 6105 3672 -7372 -9084 -9805 -8950 -1512
7690 -1512 -1003 -9330 -7933 -458 7847 3710 2706 -768 -523 -7513 3957 2640 12447 15424 15314
7675 15314 8421 -2418 -1421 -1872 11474 23812 24677 29966 19512 6309 -2320 -11289 -24078 -7380
$$ packed form
7775b7328Q649J7459N542j148M380R481J672q02K056N736J1550j3160j1164L26
7761A3249J226j593O797J826q153j794N078M050Q515j4349p969K058O381J022
7747A6344O533J199n94k1611K070k094l458J2824M426O122N538J776j1682M835
7733B2228J5749k659n661o582J0444m416L087k222K026K430o580K125j0740j3392
7719E837M119r711j3427J7431K289J0986l027n082l495J0783l96j1039j2573K89
7705g016J2708n422j0966O146k090M283m681P301N842k433j1044j712p21Q55P438
7690a512N09q327J397P475Q305m137j004l474K45o990J1470j317R807K977j10
7675A5314o893j0839R97m51J3346J2338Q65N289j0454j3203q629q969j2789J6698
$$ plain form
7661 -7380 -6770 -13334 -7409 -9148 -5538 -15397 -12935 1764 -16887 -12199 18698 22735 21633 14906
7647 14906 11172 7458 6364 20565 27575 21715 19021 3254 -8335 -4591 8144 915 -3547 -5340
7633 -5340 621 -483 -9944 -15441 -10270 -13626 -5884 -4262 -4501 9356 17281 16491 3955 2168 5964
7618 5964 20762 12068 9054 7074 3438 8485 6142 1721 6045 8761 6129 15289 14215 1220
7604 1220 -8853 -13845 -11312 -8564 -11181 -16507 -20782 -15801 779 20072 578 -15912 -6719 8679
7590 8679 14094 5212 -2419 -4788 -2657 -4623 -3526 5247 7634 4261 -3845 11608 17923 13476 4791
7575 4791 5855 8309 -459 1956 8325 10979 15197 7351 -4195 -6529 4119 14574 17131 4588
7561 4588 -1559 1870 -6909 -13897 -21341 -6430 -11432 -21878 -1530 4587 6705 15635 22071 6012
$$ packed form
7661g380O10o564N925j739L610r859K462J4699j8651M688L0897M037j102o727
7647A4906l734l714j094J4201P010n860k694j5767j1589L744J2735p229m462j793
7633e340N961j104r461n497N171l356P742J622k39J3857P925p90j2536j787L796
7618E964J4798q694l014j980l636N047k343m421M324K716k632R160j074j2995
7604A220j0073m992K533K748k617n326m275M981J6580J9293j9494j6490R193J5398
7590H679N415q882p631k369K131j966J097Q773K387l373q106J5453O315m447q685
7575D791J064K454q768K415O369K654M218p846j1546k334J0648J0455K557j2543
7561D588o147L429q779o988p444J4911n002j0446K0348O117K118Q930O436j6059
$$ plain form
7547 6012 -1306 9435 17987 20990 34079 36748 21892 11872 2648 9985 15092 18235 21541 10108
7533 10108 4210 -4376 919 19139 41746 40113 22813 15042 5807 8803 11255 19148 16598 9695
7519 9695 10175 4250 -7245 -27953 -28655 -15883 -17545 -30936 -32905 -26404 -9620 11119 11654 6235
7505 6235 -17262 -31564 -24981 -16511 -17279 -19241 -16393 -28515 -34633 -17934 -10018 -12771 -3478 15627
7491 15627 18437 7298 12075 10033 -3862 -4689 4955 2709 -8849 -13192 554 8705 4896 913
7477 913 -8991 -9654 -17091 -18541 -9808 11135 16313 1388 -19037 -7223 7295 3593 2947 14965
7463 14965 17355 19946 6567 -4319 -8942 -8602 -9932 -760 3093 -4956 -3530 -3184 -14561 -13913 -8172
7448 -8172 -10612 -16622 -33592 -28982 -18882 -20644 -22750 -16741 -22082 -16754 -12669 -15391 -22657 -21980 -18602
$$ packed form
7547F012p318J0741Q552L003J3089K669j4856j0020r224P337N107L143L306j1433
7533A0108n898q586N295J8220K2607j633j7300p771r235K996K452P893k550o903
7519I695M80n925j1495k0708p02J2772j662j3391j969O501J6784K0739N35n419
7505F235k3497j4302O583Q470p68j962K848j2122o118J6699P916k753R293J9105
7491A5627K810j1139M777k042j3895q27R644k246j1558m343J3746Q151l809l983
7477I13r904o63p437j450Q733K0943N178j4925k0425J1814J4518l702o46J2018
7463A4965K390K591j3379j0886m623L40j330R172L853q049J426L46j1377O48N741
7448h172k440o010j6970M610J0100j762k106O009n341N328M085k722p266O77L378
$$ plain form
7433 -18602 -9149 306 61 6745 -866 77 4351 -4436 -505 1830 2458 -11728 -24825 -25926 -22216
7418 -22216 -23848 -25146 -20762 -26124 -30542 -25247 -22088 -15918 -13857 -17745 -22904 -17623 -10081 2478
7404 2478 7829 5396 6154 6249 11515 15537 17037 20561 7754 -12660 -20614 -22404 -34411 -35190 -21828
7389 -21828 -13577 -6284 -788 -764 -5720 -14468 -25084 -32472 -33918 -23809 -21935 -29076 -40514 -30247
7375 -30247 -12779 -10376 -20854 -14155 -6697 -12223 -13880 800 8156 9367 9828 12097 12045 -529
7361 -529 -16020 -5360 1608 420 8412 11118 -3225 -10203 -11883 -15110 -13823 -15244 -15104 -16653 -18028
7346 -18028 -13918 -2551 -1888 -11088 -17627 -13839 -382 -7742 -12611 -16393 -20960 -14713 -8645 -5454
7332 -5454 -4085 -12546 -26997 -31715 -21315 -12236 911 14186 26301 19634 10120 17432 13125 9854
$$ packed form
7433a8602R453R455k45O684p611R43M274q787L931K335O28j4186j3097j101L710
7418b2216j632j298M384n362m418N295L159O170K061l888n159N281P542J2559
7404B478N351k433P58R5N266M022J500L524j2807k0414p954j790j2007p79J3362
7389b1828Q251P293N496K4m956q748j0616p388j446J0109J874p141j1438J0267
7375c0247J7468K403j0478O699P458n526j657J4680P356J211M61K269n2j2574
7361e29j5491J0660O968j188P992K706j4343o978j680l227J287j421J40j549j375
7346a8028M110J1367O63r200o539L788J3457p360m869l782m567O247O068L191
7332e454J369q461j4451m718J0400R079J3147J3275J2115o667r514P312m307l271
$$ plain form
7318 9854 5728 -12140 -13226 -38403 -33916 -5526 7885 12889 2896 -791 10055 11667 5473 3215
7304 3215 -1886 -2918 2535 3620 -92 -3749 15805 35826 27172 1376 4961 2045 -6849 -18757
7290 -18757 -17377 -9147 -15596 -6663 -12667 -12962 -2508 2097 2180 2810 3484 1749 8317 5512 -2389 -419
7274 -419 671 150 -4473 3969 -1659 -399 5579 11308 5929 -7565 5752 21044 16512 4441
7260 4441 -9480 -1150 18614 16829 13043 22741 33989 21889 12775 9921 10120 -13352 -25695 -12938
7246 -12938 -5498 -570 3804 15084 14036 7313 1885 -13399 -18251 -10577 -6937 -6042 5128 906
7232 906 -10902 -4913 -5306 -14767 -5434 4746 7114 15355 13803 1717 7519 14267 24954 19216
7218 19216 14139 4559 -422 3250 13359 6933 -10442 -10802 -16471 -15616 -23249 -14792 -6531 -7921 -11565
$$ packed form
7318I854m126j7868j086k5177M487K8390J3411N004r993l687J0846J612o194k258
7304C215n101j032N453J085l712l657J9554K0021q654k5796L585k916q894j1908
7290a8757J380Q230o449Q933o004k95J0454M605Q3O30O74j735O568k805p901J970
7274d19J090n21m623Q442n628J260N978N729n379j3494J3317J5292m532j2071
7260D441j3921Q330J9764j785l786R698J1248j2100r114k854J99k3472j2343J2757
7246a2938P440M928M374J1280j048o723n428j5284m852P674L640Q95J1170m222
7232I06j1808N989l93r461R333J0180K368Q241j552j2086N802O748J0687n738
7218A9216n077r580m981L672J0109o426j7375l60n669Q55p633Q457Q261j390l644
$$ plain form
7203 -11565 -8425 10243 21158 19988 9424 1576 -12225 -35575 -31136 -10060 -12772 -3587 6034
7190 6034 2824 -5831 -677 8947 15217 13176 7921 11991 11268 859 -12868 -17838 -14151 -2714
7176 -2714 -11861 -12922 -14770 -12468 -1139 1269 -6436 -13195 -17282 -21497 5864 15729 10469 17173
7162 17173 15162 107 -7282 -4358 -605 2491 9017 4916 2500 672 3503 -636 8371 16439
7148 16439 8612 4353 15669 12035 506 -2547 4224 -10037 -17078 -8893 -9632 -13098 -836 155
7134 155 -15446 -25481 -12684 -12542 -2631 8532 8024 12180 2989 -2543 -2059 -7756 -5864 -2296 -12750
7119 -12750 -11745 1423 1587 -6190 -10248 -17565 -10863 -4064 10236 12876 17773 17147 12415 12666 -737
7104 -737 -5112 -9111 -17412 -1290 -16423 -21061 -15480 -988 2875 11303 18656 873 -8153 -19504
$$ packed form
7203a1565L140J8668J0915j170j0564p848j3801k3350M439K1076k712R185R621
7190F034l210q655N154R624O270k041n255M070p23j0409j3727m970L687J1437
7176b714r147j061j848K302J1329K408p705o759m087m215K7361R865n260O704
7162A7173k011j5055p389K924L753L096O526m101k416j828K831m139R007Q068
7148A6439p827m259J1316l634j1529l053O771j4261p041Q185p39l466J2262R91
7134A55j5601j0035J2797J42R911J1163n08M156r191n532M84n697J892L568j0454
7119a2750J005J3168J64p777m058p317O702O799J4300K640M897o26m732K51j3403
7104g37m375l999q301J6122j5133m638N581J4492L863Q428P353j7783r026j1351
$$ plain form
7090 -19504 -8252 -5625 -4936 3405 6760 -4921 -16453 -6567 2806 5939 11594 24348 23130 13860
7076 13860 9403 9368 22972 15226 14934 14892 7191 6456 13522 9035 -4556 -13482 -9211 -3381 -11345 272
7060 272 239 -1528 2090 354 -470 1087 -1586 42 2627 3578 -4514 616 1934 -8127 -10887 -15732
7044 -15732 -22020 -14319 -6392 -8852 -19109 -14673 -4268 -4007 1793 -7692 -15200 -7145 -1399 5909
7030 5909 15255 17469 17391 22997 25293 20904 18123 13473 2006 12637 26021 23243 20764 8160
7016 8160 4656 4637 16847 10436 6753 2230 7715 8462 -1899 -11370 522 -3652 -10069 -6614 -4959
7001 -4959 320 -18431 -22425 -28695 -31477 -22922 -6370 11261 6420 -9229 -13318 -8730 -5357 -1225
6987 -1225 -12297 -10939 -11099 -10093 7827 15341 23412 37808 40783 27674 17999 14370 1713 3922
$$ packed form
7090a9504J1252K627O89Q341L355j1681j1532R886R373L133N655J2754j218r270
7076A3860m457l5J3604p746k92m2p701p35P066m487j3591q926M271N830p964J1617
7060B72l3j767L618j736q24J557k673J628K585R51q092N130J318j0061k760m845
7044a5732o288P701P927k460j0257M436J0405K61N800r485p508Q055N746P308
7030E909R346K214p8N606K296m389k781m650j1467J0631J3384k778k479j2604
7016H160l504j9J2210o411l683m523N485P47j0361r471J1892m174o417L455J655
7001d959N279j8751l994o270k782Q555J6552J7631m841j5649m089M588L373M132
6987a225j1072J358j60J006J7920P514Q071J4396K975j3109r675l629j2657K209
$$ plain form
6973 3922 1627 10184 12758 7239 4632 -836 -20676 -21210 -11821 -13302 -9420 6057 13739 12385 9100
6958 9100 873 -2525 3778 4001 8696 -2775 -5632 -13417 -21892 -27369 -13559 1098 -11429 -15113
6944 -15113 -16173 -6103 11403 12060 810 -15860 -25579 -24747 -26842 -30945 -25662 -5285 10943 12364
6930 12364 10793 20839 11834 -4213 920 1286 -4153 -6380 6490 16304 8094 7127 7601 97 5388
6915 5388 -1994 -21633 -31773 -30152 -32794 -20020 -10435 -7266 -860 18388 12200 8728 18263 15179
6901 15179 10589 2762 926 -10383 -13214 -4824 -1188 3886 14510 10953 -3728 3331 15910 24656
6887 24656 18201 -681 -12218 -26308 -22524 -10778 -3809 -7519 -8870 -26422 -20742 1072 -4318
6874 -4318 6544 6136 2549 24256 37621 22715 -6602 -13795 -16313 -13723 -1180 4113 4803 -1143
$$ packed form
6973C922k295Q557K574n519k607n468j9840n34R389j481L882J5477P682j354l285
6958I100q227l398O303K23M695j1471k857p785q475n477J3810J4657j2527l684
6944a5113j060J0070J7506O57j1250j6670r719Q32k095m103N283K0377J6228J421
6930A2364j571J0046r005j6047N133L66n439k227J2870R814q210r67M74p504N291
6915E388p382j9639j0140J621k642J2774R585L169O406J9248o188l472R535l084
6901A5179m590p827j836j1309k831Q390L636N074J0624l557j4681P059J2579Q746
6887B4656o455j8882j1537j4090L784J1746O969l710j351j7552N680K1814n390
6874d318J0862m08l587K1707J3365j4906k9317p193k518K590J2543N293O90n946
$$ plain form
6860 -1143 -6774 2289 5690 6045 -2457 4484 -5611 -12479 -12754 -6982 -2692 -4341 -2237 2964 7182
6845 7182 8589 1202 -9727 -6962 -3683 -1626 3858 4835 996 3254 -3006 -7678 490 4561 96
6830 96 -10774 -11066 -1355 2830 -13361 -7445 -856 -13513 -15500 -12111 1009 7951 1496 2141 2665
6815 2665 -11674 -20793 -12421 600 4655 802 8087 8312 -2239 -377 -1173 -3482 -10379 -9401 -4951
6800 -4951 5130 5921 111 4057 4515 14513 19370 16201 17436 18247 13498 6715 -2177 -18009 -14805
6785 -14805 -28304 -34453 -9190 5671 4875 299 1699 2535 4003 5178 1611 5407 9458 2129
6771 2129 4926 9468 3506 -972 5841 8942 -14878 -27893 -20682 -21789 -26767 -18815 -12839 -7127
6757 -7127 -2418 -2167 5012 593 -10579 -6887 4347 12341 8557 -5828 -10909 -23870 -29412 -26591
$$ packed form
6860a143n631R063L401L55q502O941j0095o868k75N772M290j649K104N201M218
6845G182J407p387j0929K765L279K057N484R77l839K258o260m672Q168M071m465
6830I6j0870k92R711M185j6191N916O589j2657j987L389J3120O942o455O45N24
6815B665j4339r119Q372J3021M055l853P285K25j0551J862p96k309o897R78M450
6800d951J0081P91n810L946M58R998M857l169J235Q11m749o783q892j5832L204
6785a4805j3499o149K5263J4861p96m576J400Q36J468J175l567L796M051p329
6771B129K797M542n962m478O813L101k3820j3015P211j107m978P952N976N712
6757g127M709K51P179m419j1172L692J1234P994l784j4385n081j2961n542K821
$$ plain form
6743 -26591 -12903 2586 15995 15922 28497 14933 10184 8245 3507 12587 9355 -1267 -4527 -6093
6729 -6093 -8107 6383 15701 15686 17670 23838 39121 40011 47050 48015 53011 59027 58204 65369 51820
6714 51820 27048 23552 29340 27567 22254 12081 6348 -15386 -9947 -3632 -13833 -13032 -14006 -3736
6700 -3736 2543 -4321 -6264 -6351 -188 5185 16895 12833 3348 15500 20470 12476 8755 8811 3950
6685 3950 3249 4859 -19372 -13869 -5794 -4306 -2220 -2 -13990 -9093 20318 27868 14503 5081
6671 5081 6182 -6267 -645 16861 20595 10978 4881 -1534 1674 11393 8877 1535 -1358 3590
6657 3590 -3784 -13289 -19083 -16076 -120 6349 7287 4594 10296 -2565 -36508 -54834 -47117 -18408
6643 -18408 4573 8517 1125 2853 14130 13495 883 2973 4038 -829 -8430 -9791 5038 1242
$$ packed form
6743b6591J3688J5489J3409p3J2575j3564m749j939m738R080l232j0622l260j566
6729f093k014J4490R318j5J984O168J5283Q90P039R65M996O016q23P165j3549
6714E1820k4772l496N788j773n313j0173n733k1734N439O315j0201Q01r74J0270
6700c736O279o864j943q7O163N373J1710m062r485J2152M970p994l721N6m861
6685C950p01J610k4231N503Q075J488K086K218j3988M897K9411P550j3365r422
6671E081J101j2449N622J7506L734r617o097o415L208R719k516p342k893M948
6657C590p374r505n794L007J5956O469R38k693N702j2861l3943j8326P717K8709
6643a8408K2981L944p392J728J1277o35j2612K090J065m867p601j361J4829l796
$$ plain form
6629 1242 -6773 -3379 911 1034 -6581 -7277 6204 22649 18792 14245 22403 18257 790 -14442
6615 -14442 -10878 -4634 -7971 -24024 -29768 -26500 -33676 -35516 -33080 -29620 -30980 -37815 -26174 -17140
6601 -17140 -28538 -18288 -13695 -9014 -8510 1746 -3646 7919 15047 18326 23860 24867 3620 -6076
6587 -6076 -11709 -13590 -11434 398 461 -14554 -25546 -26874 -22434 -12980 -4674 -1025 -12486 -23277
6573 -23277 -10502 -6835 -13291 -15639 -8960 -11226 -17632 -1149 6348 2759 -2499 6722 8103 21
6559 21 -4911 -5670 1781 8076 255 -5140 -17717 -11882 1557 -7072 3130 1770 -15821 -23995 -19548
6544 -19548 -9728 -13970 -19729 -13874 -12131 -16036 -13663 3859 -477 -7253 -22245 -10465 -9996 -10108
6530 -10108 -7358 -530 11376 14470 -3870 -9199 -8777 -17761 -17482 -8151 -6502 -10748 -5134 -2444 3712
$$ packed form
6629A242q015L394M290J23p615o96J3481J6445l857m547Q158m146j7467j5232
6615a4442L564O244l337j6053n744L268p176j840K436L460j360o835J1641R034
6601a7140j1398J0250M593M681N04J0256n392J1565P128L279N534J007k1247r696
6587f076n633j881K156J1832O3j5015j0992j328M440R454Q306L649j1461j0791
6573b3277J2775L667o456k348O679k266o406J6483P497l589n258R221J381q082
6559B1m932p59P451O295p821n395j2577N835J3439q629J0202j360j7591q174M447
6544a9548R820m242n759N855J743l905K373J7522m336o776j4992J1780M69j12
6530a0108K750O828J1906L094j8340n329M22q984K79R331J649m246N614K690O156
$$ plain form
6515 3712 -6341 -13572 -17371 -24751 -31708 -26015 -18235 -11630 -7514 -12223 7374 19513 17672 15501
6501 15501 9048 16598 12581 14362 11390 3516 -4110 -1771 -2088 -2156 5044 -7486 -12924 -11875 -16824
6486 -16824 -14162 -11525 -14630 -6703 -2617 -4970 -13555 -17934 -9942 -8225 -4432 -2234 956 -1926 8263
6471 8263 2277 -456 17301 22369 14958 14167 13185 8955 8111 3296 781 -2265 -19851 -31024 -33367
6456 -33367 -32951 -26716 -15998 346 8257 -6595 -8226 -17453 -26241 -13300 -9513 -3545 -1972 8779
6442 8779 4164 -7426 -14902 -11729 -12350 -10091 -2233 6589 -250 10408 1875 3422 23866 21550
6428 21550 23078 20646 5038 -498 -4516 -4061 -5179 -24466 -28205 -19844 -16445 -9122 6910 6449
6414 6449 -20271 -39087 -23765 -20678 -8863 -9971 -13027 -8501 -12939 -6124 -5682 -12310 -12776 -13132 -14367
$$ packed form
6515C712j0053p231l799p380o957N693P780O605M116m709J9597J2139j841k171
6501A5501o453P550m017J781k972p874p626K339l17o8P200j2530n438J049m949
6486a6824K662K637l105P927M086k353q585m379P992J717L793K198L190k882J0189
6471H263n986k733J7757N068p411p91r82m230q44m815k515l046j7586j1173k343
6456c3367M16O235J0718J6344P911j4852j631r227q788J2941L787N968J573J0751
6442H779m615j1590p476L173o21K259P858Q822o839J0658q533J547K0444k316
6428B1550J528k432j5608n536m018M55j118j9287l739Q361L399P323J6032m61
6414F449k6720j8816J5322L087J1815j108l056M526m438O815M42o628m66l56j235
$$ plain form
6399 -14367 -16314 -24093 -42433 -35663 -25649 -25667 -11225 -5988 -7210 -8370 -12592 -25504 -11953 7218
6385 7218 11646 -302 -5317 -2753 2345 1600 -3938 -10335 -22500 -32922 -22705 -9040 -12502 -3741
6371 -3741 -3419 -3861 6088 12640 4591 -5376 -10453 -14598 -8526 -4127 -4575 -21992 -27128 -14071 -28275
6356 -28275 -25830 -2743 -2310 -4644 2629 4517 4843 9101 8601 15581 7870 5442 -6761 -4212 -4492
6341 -4492 -13775 -5411 9614 6204 785 -73 12989 5046 -5916 -5627 -10242 -129 10713 7575
6327 7575 8918 17506 10161 -440 -8398 -10723 -7918 647 8356 7966 10229 11383 -12464 -24791
6313 -24791 -28695 -13650 -17702 -15166 -7151 4132 3483 960 -1723 9042 5922 2390 11331 15412
6299 15412 -6835 -13908 -8680 -10303 -20659 -23303 -28143 -40266 -25739 -17308 -8014 -5501 -20887
$$ packed form
6399a4367j947p779j8340O770J0014j8J4442N237j222j160m222j2912J3551J9171
6385G218M428j1948n015K564N098p45n538o397j2165j0422J0217J3665l462Q761
6371c741L22m42R949O552q049r967n077m145O072M399m48j7417n136J3057j4204
6356b8275K445K3087M33k334P273J888L26M258n00O980p711k428j2203K549k80
6341d492r283Q364J5025l410n419q58J3062p943j0962K89m615J0113J0842l138
6327G575J343Q588p345j0601p958k325K805Q565P709l90K263J154k3847j2327
6313b4791l904J5045m052K536Q015J1283o49k523k683J0765l120l532Q941M081
6299A5412k2247p073N228j623j0356k644m840j2123J4527Q431R294K513j5386
$$ plain form
6286 -20887 -28471 -5975 8469 7198 5906 3676 3400 -6692 -4971 -335 5900 6374 265 -5762
6272 -5762 -8347 -18053 -19828 -28501 -23357 -16632 -4169 6223 3168 -10890 -12883 -10866 -7687 -12026
6258 -12026 -18735 -20237 -7948 2544 13737 19549 17603 7909 -11655 -13494 -7569 -2718 -2198 4164
6244 4164 14204 5263 -5580 -570 10031 18924 23624 12930 -2148 969 -1550 -7201 7676
6231 7676 19516 28203 27499 14909 2110 4052 5931 787 2293 5260 3039 -12922 -15012 -8365
6217 -8365 -3622 -633 -5781 -17116 -16866 -5046 -12379 -16642 -3490 -9820 -13236 -14374 -3075 -4748
6203 -4748 -3878 5049 13185 10744 1912 -5396 -198 9963 -4576 -16313 -1464 5965 5041 6908
6189 6908 -5942 -15222 -8725 -5637 -9373 -9159 -20750 -22952 -19919 -22233 -38435 -48954 -27092 -12387
$$ packed form
6286b0887p584K2496J4444j271j292k230k76j0092J721M636O235M74o109o027
6272e762k585r706j775q673N144O725J2463J0392l055j4058j993K017L179m339
6258a2026o709j502J2289J0492J1193N812j946r694j9564j839N925M851N20O362
6244D164J0040q941j0843N010J0601Q893M700j0694j5078L117k519n651J4877
6231G676J1840Q687p04j2590j2799J942J879n144J506K967k221j5961k090O647
6217h365M743K989n148j1335K50J1820p333m263J3152o330l416j138J1299j673
6203d748Q70Q927Q136k441q832p308N198J0161j4539j1737J4849P429r24J867
6189F908j2850r280O497L088l736K14j1591k202L033k314j6202j0519K1862J4705
$$ plain form
6175 -12387 -17154 -18916 -5105 5874 10950 3537 917 3821 3902 4978 -10746 -20051 -9733 -6344
6161 -6344 -1716 1552 2222 8069 11369 14992 9695 8344 10372 -8800 -16094 -2701 -6601 -21936
6147 -21936 -14907 -10025 -21699 -21525 -8800 314 15341 11340 -12754 -29331 -22021 -8303 -4718
6134 -4718 -3977 10612 2285 -13113 -15566 -14039 -26320 -21386 5168 6161 -1253 423 857 -2543 -6863
6119 -6863 -9917 -14018 -27299 -31784 -27672 -15257 -17960 -17076 -6387 5005 13117 10000 10224 8726
6105 8726 -2704 -16342 -8602 -5806 -9764 -15953 -19995 -4292 9732 8104 1346 -20720 -19885 -22178
6091 -22178 -21570 -6309 2041 -3429 -7516 -5264 -5709 -7059 -946 2213 1555 -4768 -17413 -22076 -15672
6076 -15672 -12738 -1060 5226 9695 11722 -750 7115 19086 3451 -8683 -4260 597 22069
$$ packed form
6175a2387m767j762J3811J0979N076p413k620K904Q1J076j5724r305J0318L389
6161f344M628L268O70N847L300L623n297j351K028j9172p294J3393l900j5335
6147b1936P029M882j1674J74J2725R114J5027m001k4094j6577P310J3718L585
6134d718P41J4589q327j5398k453J527j2281M934K6554R93p414J676M34l400m320
6119f863l054m101j3281m485M112J2415k703Q84J0689J1392Q112l117K24j498
6105H726j1430j3638P740K796l958o189m042J5703J4024j628o758k2066Q35k293
6091b2178O08J5261Q350n470m087K252m45j350O113L159o58o323j2645m663O404
6076a5672K934J1678O286M469K027j2472P865J1971j5635j2134M423M857K1472
$$ plain form
6063 22069 31851 30106 13409 9772 20160 9419 3971 11371 11046 5682 1414 7260 14968 2917
6049 2917 -2373 11203 16838 5547 6510 -449 1447 10774 10147 4769 11018 11892 -2406 3999 -1763
6034 -1763 -16130 -20019 -13629 -16415 -25329 -28617 -12433 -3424 -3666 640 2038 -20841 -30254 -30045 -18497
6019 -18497 -19205 -15549 -14892 -8640 4807 9664 4828 1890 2369 5602 1398 3488 -3738 -9514 3536
6004 3536 8821 13735 17349 4382 -12440 -15285 -17985 -14104 -2768 -3361 -7292 -11058 -15067 -24187
5990 -24187 -14005 -7785 -3997 -4309 -8033 -5123 5501 -1974 -6965 677 9067 -7837 -2578 950
5976 950 5686 13662 7002 4163 4253 6519 7466 6803 22656 30484 25254 8134 8482 -3642 -13102 -12294
5960 -12294 -16906 -20897 -16867 -12471 -10729 -3619 -2275 -13617 -17424 -12050 -12342 -16997 -9902 -10636 -19875
$$ packed form
6063B2069R782j745j6697l637J0388j0741n448P400l25n364m268N846P708j2051
6049B917n290J3576N635j1291R63o959J896R327o27n378O249Q74j4298O405n762
6034a763j4367l889O390k786q914l288J6184R009k42M306J398k2879r413K09J1548
6019a8497p08L656O57O252J3447M857m836k938M79L233m204K090p226n776J3050
6004C536N285M914L614j2967j6822k845k700L881J1336n93l931l766m009r120
5990b4187J0182O220L788l12l724K910J0624p475m991P642Q390j6904N259L528
5976I50M736P976o660k839R0K266R47o63J5853P828n230j7120L48j2124r460Q08
5960a2294m612l991M030M396J742P110J344j1342l807N374k92m655P095p34r239
$$ plain form
5945 -19875 -10626 4896 11206 21692 20668 11653 14876 18034 17741 7110 14843 15304 9540 3397
5931 3397 -1373 2398 6544 7327 4321 -4351 -8974 876 -4642 -14733 -16135 -18659 -8996 176 -99
5916 -99 13230 29943 19013 8079 7742 -2725 -18578 -22519 -4210 409 -3602 -5688 -1162 -11081
5902 -11081 -25017 -19863 -22943 -22862 -27408 -23928 -23963 -20370 -12259 -2111 -9259 -10901 -5808 654 -8789
5887 -8789 -15991 -27214 -13167 8484 -1064 -2844 1915 -1972 -6914 -15785 -15093 -12029 -14103 -21995
5873 -21995 -12217 -16644 -21718 -14032 -5279 -1042 -2771 -420 -13208 -14563 -13618 -17964 -12445 -25769
5859 -25769 -24638 -12037 3031 19676 893 -12387 6003 12376 -7359 1734 11964 8620 4493
5846 4493 7252 15240 5439 290 -5136 -10340 -13894 -6203 -2295 -9600 -19008 -25690 -26260 -18358 -11099
$$ packed form
5945a9875R249J5522O310J0486j024r015L223L158k93j0631P733M61n764o143
5931C397m770L771M146P83l006q672m623R850n518j0091j402k524R663R172k75
5916i9J3329J6713j0930j0934l37j0467j5853l941J8309M619m011k086M526r919
5902a1081j3936N154l080Q1m546L480l5L593Q111J0148p148j642N093O462r443
5887h789p202j1223J4047K1651r548j780M759l887m942q871O92L064k074p892
5873b1995R778m427n074P686Q753M237j729K351j2788j355R45m346N519j3324
5859b5769J131J2601J5068J6645j8783j3280J8390O373j9735R093J0230l344m127
5846D493K759P988r801n149n426n204l554P691L908p305r408o682n70P902P259
$$ plain form
5831 -11099 -11972 -15397 -14820 -8582 1498 9278 -5574 -12429 -6919 -4762 -12155 -9958 1645 -215
5817 -215 -1615 -454 -2291 -7645 -1718 7088 491 -20997 -31199 -31304 -15035 -9412 -300 -4913 -9553
5802 -9553 -11233 -5404 -1237 -14236 -18245 -12391 -16759 -24965 -19466 -8135 -16746 -23045 -10145 3228
5788 3228 8636 1733 -6500 -21563 -8734 590 -3322 -12586 -14195 -14345 -15205 -16751 -11495 -5950 3168
5773 3168 12734 8789 -358 -11130 -23577 -22348 -30062 -37791 -33661 -21279 -18015 -26314 -28938 -30185
5759 -30185 -26141 -30687 -36264 -32348 -28360 -28335 -8663 -3219 -2354 6430 9505 6801 -10428 -22180 -23612
5744 -23612 -2639 8163 -3873 -17702 -37472 -32715 -21751 -6151 -5558 -11325 -9778 4590 8199
5731 8199 1773 -4660 1641 16368 19249 6268 -5065 -26055 -32913 -31762 -27469 -31591 -23195 -15887
$$ packed form
5831a1099q73l425N77O238J0080P780j4852o855N510K157p393K197J1603j860
5817b15j400J161j837n354N927Q806o597k1488j0202j05J6269N623R112m613m640
5802i553j680N829M167j2999m009N854m368q206N499J1331q611o299J2900J3373
5788C228N408o903q233j5063J2829R324l912r264j609j50q60j546N256N545R118
5773C168R566l945r147j0772j2447J229p714p729M130J2382L264q299k624j247
5759c0185M044m546n577L916L988K5J9672N444Q65Q784L075k704j7229j1752j432
5744b3612K0973J0802j2036j3829j9770M757J0964J5600N93n767J547J4368L609
5731H199o426o433O301J4727K881j2981j1333k0990o858J151M293m122Q396P308
$$ plain form
5717 -15887 -8518 -9203 -14566 -12542 -8221 -16924 -24299 -31272 -40649 -34234 -8929 10560 13716 4072
5703 4072 -11721 -18660 -26588 -21787 -17032 -21451 -18061 -16882 -14883 -7716 8527 5216 -1042 -3371
5689 -3371 -1085 4204 5838 8156 12728 10930 95 -9790 12369 19329 -10115 -19691 -3892 2411
5675 2411 2490 -5036 -4844 -15768 -17837 -15724 -6252 5711 19876 11226 -4062 -10294 -6080 -4966 -1819
5660 -1819 -760 -11056 -9633 -14643 -2710 -13003 -19905 -24968 -20961 -12651 -14463 -11392 -851 2409
5646 2409 11002 16636 7657 -2028 1572 10656 6993 -3453 -5698 -4158 3642 1065 12764 26865
5632 26865 44349 40978 35247 22416 17504 7198 -5874 -20435 394 16144 12794 738 -13233
5619 -13233 -15755 -15565 -27155 -17850 -5897 1787 4228 -7244 -5262 -10253 -10721 -3840 -10775 -3662
$$ packed form
5717a5887P369o85n363K024M321q703p375o973r377O415K5305J9489L156r644
5703D072j5793o939p928M801M755m419L390J179J999P167J6243l311o258k329
5689c371K286N289J634K318M572j798j0835r885K2159O960k9444r576J5799O303
5675B411P9p526J92j0924k069K113R472J1963J4165q650j5288o232M214J114L147
5660a819J059j0296J423n010J1933j0293o902n063M007Q310j812L071J0541L260
5646B409Q593N634q979r685L600R084l663j0446k245J540P800k577J1699J4101
5632B6865J7484l371n731j2831m912j0306j3072j4561K0829J5750l350j2056j3971
5619a3233k522J90j1590R305J1953P684K441j1472J982m991m68O881o935P113
$$ plain form
5605 -3662 -801 8600 11823 266 -7920 -1218 6366 10460 -201 -5709 -1096 406 12343 25204
5591 25204 13103 7102 10422 -1517 6938 -34 -6460 -5334 -6334 -12899 2391 10715 9660 2339
5577 2339 -12491 -18947 -24406 -26986 -29359 -25225 -18303 -17825 -9999 -7752 -11697 -10087 -3936 -3684 -4632
5562 -4632 -594 3857 2400 -5371 -1779 1717 -8341 -11347 9114 15390 14612 16309 6002 -13228
5548 -13228 -21871 -19694 -20660 -15809 -17028 -24483 -33913 -32588 -13678 -9104 -22406 -28483 -11355 -3605
5534 -3605 -18931 -13374 -6590 3913 -2181 -9665 -5235 -917 11144 5803 5135 15679 18414 15861
5520 15861 13603 7337 5440 506 -1993 -18131 -19647 6735 20223 15744 11217 -15444 -24562 -33164
5506 -33164 -29400 -14673 -7461 -6897 -19056 -12117 -7308 -12001 -15905 -19913 -20086 -14785 -6500 -11084 -12277
$$ packed form
5605c662K861R401L223j1557q186O702P584M094j0661n508M613J502J1937J2861
5591B5204j2101o001L320j1939Q455o972o426J126j000o565J5290Q324j055p321
5577B339j4830o456n459k580k373M134O922M78P826K247l945J610O151K52r48
5562d632M038M451j457p771L592L496j0058l006K0461O276p78J697j0307j9230
5548a3228q643K177r66M851j219p455r430J325J8910M574j3302o077J7128P750
5534c605j5326N557O784J0503o094p484M430M318J2061n341o68J0544K735k553
5520A5861k258o266j897m934k499j6138j516K6382J3488m479m527k6661r118q602
5506c3164L764J4727P212N64j2159O939M809m693l904m008j73N301Q285m584j193
$$ plain form
5491 -12277 -2553 -19196 -24038 -12986 3197 17457 28506 18662 15112 15514 11827 9207 -2305
5478 -2305 -5762 -5685 -6810 -8233 4150 4968 1696 2207 2785 6246 16283 13493 -2428 -16541 -18490
5463 -18490 -9317 -20109 -29003 -34731 -36619 -13022 4759 9765 7803 7249 14579 10496 1064 -17367
5449 -17367 -10271 -6622 1071 -11876 -7237 4531 10212 3041 1017 3907 17347 20642 3227 -5838
5435 -5838 -6554 -7049 -4523 -819 6027 -2532 -10945 -13412 -10424 -23992 -9634 3650 -481 -13579
5421 -13579 -6774 -10182 -13547 -16986 -16282 -9835 1297 -5506 -17398 -27518 -26797 -23967 -11059 -11729
5407 -11729 -9180 -9075 1989 8819 5714 12420 18333 14779 -4968 -13953 -21704 -34089 -34363 -28706
5393 -28706 -25850 -23104 -11769 -5065 -13239 -15779 -17524 -2442 3873 9811 8226 8580 -1125 7327
$$ packed form
5491a2277R724j6643m842J1052J6183J4260J1049r844l550M02l687k620j1512
5478b305l457P7j125j423J2383Q18l272N11N78L461J0037k790j5921j4113j949
5463a8490R173j0792q894n728j888K3597J7781N006j962n54P330m083r432j8431
5449a7367P096L649P693j2947M639J1768N681p171k024K890J3440L295j7415r065
5435e838p16m95K526L704O846q559q413k467K988j3568J4358J3284m131j3098
5421a3579O805l408l365l439P04O447J1132o803j1892j0120P21K830J2908o70
5407a1729K549J05J1064O830l105O706N913l554j9747q985p751j2385k74N657
5393b8706K856K746J1335O704q174k540j745J5082O315N938j585L54r705Q452
$$ plain form
5379 7327 9675 -11540 -881 -4918 -5642 6606 6159 6263 7562 -6465 -8339 -13650 -21630 -12159 8368
5364 8368 29271 30043 18231 12647 -561 -10304 -10065 -6998 -9076 -12045 -17293 -20320 -16088 -8947 -5409
5349 -5409 -6487 -8657 -19422 -26139 -10710 8406 17744 20013 9390 -13007 -10848 -15393 -14244 -14581
5335 -14581 -16463 -4497 1777 4398 258 -2186 8825 6921 -6395 -14672 -7610 -6319 -11050 -8129
5321 -8129 -12798 -18982 -19667 -13746 -12908 -26734 -32984 -21328 -7356 -802 6604 18338 10324 -5636
5307 -5636 375 9441 1232 -10477 -12458 -11110 -11413 4485 10843 7217 7355 9602 10587 4365 -7178
5292 -7178 -5234 -3687 -15168 5048 12098 9046 -201 -3919 -10333 -4624 -6772 -17560 -9327 17374
5278 17374 17307 18524 5572 -5444 -2596 286 -937 6398 7870 -204 5151 14112 4997 13461 17898
$$ packed form
5379G327K348k1215J0659m037p24J2248m47J04J299j4027j874n311p980R471K0527
5364H368K0903P72j1812n584j3208r743K39L067k078k969n248l027M232P141L538
5349e409j078k170j0765o717J5429J9116R338K269j0623k2397K159m545J149l37
5335a4581j882J1966O274K621m140k444J1011j904j3316q277P062J291m731K921
5321h129m669o184o85N921Q38j3826o250J1656J3972O554P406J1734q014j5960
5307e636O011R066q209j1709j981J348l03J5898O358l626J38K247R85o222j1543
5292g178J944J547j1481K0216P050l052r247l718o414N709k148j0788Q233K6701
5278A7374o7J217j2952j1016K848K882j223P335J472q074N355Q961r115Q464M437
$$ plain form
5263 17898 9430 4523 7061 12825 19557 14710 -5787 -16639 -13075 -2080 6359 10323 9707 4189
5249 4189 6259 671 54 2947 -2176 5577 21227 31339 25309 20837 7736 8262 4277 -12584
5235 -12584 -18113 -14452 -17024 -10592 -4732 -380 -3842 -8509 -11480 -1675 -10180 -10423 -9914 -5584 -9070
5220 -9070 -27801 -35927 -13282 -1290 -5143 -17790 -14555 -8852 -3986 -2281 -2488 -4672 -14633 -5495
5206 -5495 2024 -8574 -21369 -35350 -47902 -26085 -12981 -7385 536 9787 1545 -9389 -14965
5193 -14965 -7608 -4010 -4661 1881 -4441 -1266 -4131 -6424 -14565 -20201 -22719 -29985 -27321 -16875 -9961
5178 -9961 -10391 -19060 -16993 -17235 -6775 -13284 -12244 -10709 762 679 -723 -6040 -9270 -8459 -4041 -14937
5162 -14937 -5472 4526 -264 -9544 -1394 5559 6956 14800 31253 40197 32899 11554 10277 11878
$$ packed form
5263A7898q468m907K538N764O732m847k0497j0852L564J0995Q439L964o16n518
5249D189K070n588o17K893n123P753J5650J0112o030m472j3101N26l985j6861
5235a2584n529L661k572O432N860M352l462m667k971R805q505k43N09M330l486
5220i070j8731q126K2645J1992l853j2647L235N703M866J705k07k184r961R138
5206e495P519j0598j2795j3981j2552K1817J3104N596P921R251q242j0934n576
5193a4965P357L598o51O542o322L175k865k293q141n636k518p266K664J0446O914
5178i961m30q669K067k42J0460o509J040J535J1471q3j402n317l230Q11M418j0896
5162a4937R465R998m790r280Q150O953J397P844J6453Q944p298k1345j277J601
$$ plain form
5148 11878 9587 -3604 -11704 -12960 -10022 1371 2855 -3693 -4819 -11118 -8765 2470 6952 2945
5134 2945 -515 5004 406 -7955 -13055 -17613 -21230 -18610 -11313 -11627 -12873 -19998 -30957 -30430 -9417
5119 -9417 -3873 -9406 -19487 -21419 -17653 -11219 12728 18890 10404 -11509 -17639 -10107 -17086 -25708
5105 -25708 -14247 -12107 -22429 -25732 -6582 -7740 -15572 -8245 6459 12044 12325 12429 16324 5572
5091 5572 3345 5730 -6196 7092 20647 28377 9074 9079 2632 3213 18152 13471 11522 -2861
5077 -2861 -19386 -22730 -9253 2452 5610 337 356 -10190 -12654 -5774 759 15606 21266 17510
5063 17510 16945 10129 -2672 -11429 -14433 -23361 -20235 -8590 -7639 -2488 6153 6327 14037 12797 5278
5048 5278 -4505 1300 4367 7380 -173 -7400 -6973 -3427 -9865 -19105 -14929 5833 3623 16431 23748
$$ packed form
5148A1878k291j3191q100j256K938J1393J484o548j126o299K353J1235M482m007
5134B945l460N519m598q361n100m558l617K620P297l14j246p125j0959N27K1013
5119i417N544n533j0081j932L766O434K3947O162q486k1913o130P532o979q622
5105b5708J1461K140j0322l303J9150j158p832P327J4704N585K81J04L895j0752
5091E572k227K385j1926J3288J3555P730j9303No447N81J4939m681j949j4383
5077b861j6525l344J3477J1705L158n273J9j0546k464O880O533J4847N660l756
5063A7510n65o816j2801q757l004q928L126J1645R51N151Q641J74P710j240p519
5048E278r783N805L067L013p553p227M27L546o438r240M176K0762k210J2808P317
$$ plain form
5033 23748 7436 8019 11229 8640 -1992 -2730 11002 3703 -6939 -21811 -21666 -15775 -23427 -19960
5019 -19960 -6728 4934 1931 -905 -12522 -15294 -6217 1715 -4757 9464 -758 -19426 -14834
5006 -14834 1432 155 -6359 -3647 2352 -5738 -1424 2681 16413 21492 12148 3800 -1232 -7321
4992 -7321 -14701 -1718 12851 15528 10662 13174 12274 10859 1038 -2764 5647 -2744 -10154 672
4978 672 -12890 -7544 1885 6063 1496 -3028 103 3317 6643 6021 7718 5450 525 10010 1987
4963 1987 2621 8073 13108 4947 -15076 -15319 -18093 -26266 -24191 -12232 -2015 -11575 749 7538
4949 7538 6439 10190 5151 -6344 -2440 11475 10517 -6711 -17976 -3851 2640 2523 -1657 -16063
4935 -16063 -4972 3147 -5711 12774 26541 19799 19926 15963 -2409 3030 10956 -2120 -24461
$$ packed form
5033B3748j6312N83L210k589j0632p38J3732p299j0642j4872J45N891p652L467
5019a9960J3232J1662l003k836j1617k772R077P932o472J4221j0222j8668M592
5006a4834J6266j277o514K712N999q090M314M105J3732N079r344q348n032o089
4992g321p380J2983J4569K677m866K512r00j415r821l802Q411q391p410J0826
4978F72j3562N346R429M178m567m524L131L214L326o22J697k268m925R485q023
4963A987O34N452N035q161k0023k43k774q173K075J1959J0217r560J2324O789
4949G538j099L751n039j1495L904J3915r58j7228j1265J4125O491j17m180j4406
4935a6063J1091Q119q858J8485J3767o742J27l963j8372N439P926j3076k2341
$$ plain form
4922 -24461 -23877 -8171 -5396 -3189 -648 15650 16830 15814 14455 2581 4368 218 4487 18535
4908 18535 19446 19539 25128 13137 12659 6536 10510 23956 28966 10541 333 4810 9088 1124 -3655
4893 -3655 -11411 -12651 -3695 5470 -7646 -16305 -20694 -32732 -34777 -18762 -14507 -10395 -13746 -31618
4879 -31618 -21158 -13481 -21008 -23345 -23446 -30043 -20529 -16911 -22641 -11529 -10554 -27809 -23330 -14946
4865 -14946 -14869 -17492 -12165 -18083 -14447 -6187 1815 -3092 -16026 -25282 -21657 -6060 -7567 -10917 -3620
4850 -3620 9104 21065 16684 -4927 -12099 -18904 -36440 -38654 -19993 -11825 -20135 -16836 -3280
4837 -3280 16169 8196 2910 7300 16332 24948 19936 11807 8690 13890 6560 11018 14968 5096 261
4822 261 -6118 -13765 -1337 -1174 -6809 226 11180 22717 20766 14584 4439 1644 6793 -585
$$ packed form
4922b4461N84J5706K775K207K541J6298J180j016j359j1874J787m150M269J4048
4908A8535R11R3N589j1991m78o123L974J3446N010j8425j0208M477M278p964m779
4893c655p756j240Q956R165j3116q659m389j2038k045J6015M255M112l351j7872
4879c1618J0460P677p527k337j01o597R514L618n730J1112R75j7255M479Q384
4865a4946P7k623N327n918L636Q260Q002m907j2934r256L625J5597j507l350P297
4850c620J2724J1961m381k1611p172o805j7536k214J8661Q168q310L299J3556
4837c280J9449p973n286M390R032Q616n012q129l117N200p330M458L950r872m835
4822B61o379p647J2428J63n635P035J0954J1537j951o182j0145k795N149p378
$$ plain form
4808 -585 6204 13796 20770 24696 23018 9603 8041 681 -20070 -22039 -7886 -997 2164 1756 -5086
4793 -5086 -271 6704 4860 -2332 -21798 -22587 -9423 -5272 -2074 -9959 -5760 6263 5042 -1077
4779 -1077 -5958 -14904 -14393 -19804 -30428 -21445 -9653 -10130 321 2652 -6098 -12859 -5313 9664
4765 9664 7603 5274 1731 -9293 -30662 -45431 -45858 -33415 -23868 -11509 -11984 -14586 -24024 -8983
4751 -8983 -346 -10110 -16285 -18200 -6497 1532 -7394 -15799 -19757 -18169 -17170 -11309 2470 15407
4737 15407 19458 3889 -5285 -8980 -13421 -17047 -21045 -17925 -21518 -16527 6103 -575 -10856 5072
4723 5072 3503 -20217 -22550 -23859 -30735 -40398 -46394 -32700 -31831 -29872 -16831 4457 -183 -23165
4709 -23165 -13160 -17332 -5530 4700 -331 -11967 958 1902 -10157 -5227 -306 -1461 -5688
$$ packed form
4808e85O789P592O974L926j678j3415j562p360k0751j969J4153O889L161m08o842
4793e086M815O975j844p192j9466p89J3164M151L198p885M199J2023j221o119
4779a077m881q946N11n411j0624Q983J1792m77J0451K331q750o761P546J4977
4765I664k061k329l543j1024k1369j4769m27J2443R547J2359m75k602r438J5041
4751h983Q637r764o175j915J1703Q029q926q405l958J588R99N861J3779J2937
4737A5407M051j5569r174l695m441l626l998L120l593M991K2630o678j0281J5928
4723E072j569k3720k333j309o876r663n996J3694Q69J959J3041K1288m640k2982
4709b3165J0005m172J1802J0230n031j1636J2925R44j2059M930M921j155m227
$$ plain form
4696 -5688 -7347 -9637 -6243 3718 9682 16393 20318 18477 6782 -2619 -12804 -7183 -13836 -17870
4682 -17870 -18766 -18019 -7016 10064 424 -3782 -10213 -9359 -9860 -6082 5406 10014 6239 -5115 -5781
4667 -5781 -23070 -24131 -20125 -16751 -14129 -14506 395 -1230 -2281 3461 -3656 -15482 -11060 -15362
4653 -15362 -12958 7772 9220 6093 1314 9496 18112 7893 -1445 5418 -1675 -16668 -21978 -20392
4639 -20392 -28960 -30879 -26529 -18860 -5052 1050 5406 4387 456 -8710 -11282 -10282 -11676 -76
4625 -76 12022 6915 831 12045 18762 12910 5759 -1898 -8563 652 9793 12896 6863 6394 3576
4610 3576 -11010 -3220 10182 19016 34243 33595 30334 25727 3767 -1632 -8873 -17698 -10473 6782
4596 6782 14014 1808 -5353 8454 24327 11424 10784 10974 5853 14721 12895 5261 5915 12835 7154
$$ packed form
4696e688j659k290L394R961N964O711L925j841j1695r401j0185N621o653m034
4682a7870q96P47J1003J7080r640m206o431Q54n01L778J1488M608l775j1354o66
4667e781j7289j061M006L374K622l77J4901j625j051N742p117j1826M422m302
4653a5362K404K0730J448l127m779Q182Q616j0219r338O863p093j4993n310J586
4639b0392q568j919M350P669J3808O102M356j019l931r166k572J000j394J1600
4625g6J2098n107o084J1214O717n852p151p657o665R215R141L103o033m69k818
4610C576j4586P790J3402Q834J5227o48l261m607k1960n399p241q825P225J7255
4596F782P232j2206p161J3807J5873j2903o40J90n121Q868j826p634O54O920n681
$$ plain form
4581 7154 6545 3900 -7993 -6768 -12388 -9272 5152 10689 4442 109 3557 15989 9866 13837
4567 13837 17593 5971 3558 -2312 -3372 -11510 2231 15751 -603 -4194 -764 -8504 -23977
4554 -23977 -24265 -10782 -10560 7600 11394 -2167 -5842 -4793 30 1261 -2910 -10353 -7455 -11626
4540 -11626 -18706 -25313 -6883 -110 -8756 1787 17901 19802 11494 8963 8815 9401 3683 -426
4526 -426 -17857 -22071 -18092 -32906 -33761 -25329 -14030 -5727 -7867 644 -4411 -10633 -14421 -11501 1323
4511 1323 -1222 -11051 -13395 -8169 -1955 -1493 -12156 -8400 15906 10446 5759 2543 -4130 -19884
4497 -19884 -25583 -24643 -19360 269 3599 -9668 -13408 -13975 -23338 -33215 -42212 -39106 -22467 -13167
4483 -13167 -28031 -31514 -29063 -7002 3949 -12770 -23397 -17662 -7604 900 3804 7140 21363
$$ packed form
4581G154o09k645j1893J225n620L116J4424N537o247m333L448J2432o123L971
4567A3837L756j1622k413n870j060q138J3741J3520j6354l591L430p740j5473
4554b3977k88J3483K22J8160L794j3561l675J049M823J231m171p443K898m171
4540a1626p080o607J8430O773q646J0543J6114J901q308k531j48N86n718m109
4526d26j7431m214L979j4814q55Q432J1299Q303k140Q511n055o222l788K920J2824
4511A323k545r829k344N226O214M62j0663L756K4306n460m687l216o673j5754
4497a9884n699R40N283J9629L330j3267l740n67r363r877q997L106J6639R300
4483a3167j4864l483K451K2061J0951j6719j0627N735J0058Q504K904L336J4223
$$ plain form
4470 21363 24247 26722 20685 4147 11824 20427 12206 8579 21137 23675 21627 11530 4165 3041
4456 3041 18427 12677 11069 4144 -5236 -11412 -7894 6120 -11464 -13480 -12992 -3914 3948 5434
4442 5434 -2738 1775 2016 -11159 -13026 -5138 -738 8014 5231 -2948 -1670 2981 299 -9397 -8267
4427 -8267 -2102 -9493 3508 1402 4012 11263 15011 2376 -1668 6082 7228 -3080 -6059 -6249
4413 -6249 -4089 -5615 -3937 3705 5645 14450 5046 -7579 -1306 6693 21522 10900 -1178 7811
4399 7811 16354 8945 -6534 -6971 -4302 -8660 -374 -455 253 -8697 -18276 -15647 -14101 -16415 -28513
4384 -28513 -28544 -15682 -8258 -1264 7889 10873 -323 -6958 -5418 -9866 -10197 -2586 4703 8234 2257
4369 2257 -14938 -18041 -14805 -2566 -110 -6391 -7233 -13829 -18685 -29792 -18635 -4054 -13656 -22528
$$ packed form
4470B1363K884K475o037j6538P677Q603q221l627J2558K538k048j0097p365j124
4456C041J5386n750j608o925r380o176L518J4014j7584k016M88R078P862J486
4442E434q172M513K41j3175j867P888M400Q752k783q179J278M651k682r696J130
4427h267O165p391J3001k106K610P251L748j2635m044P750J146j0308k979j90
4413f249K160j526J678P642J940Q805r404j2625O273P999J4829j0622j2078Q989
4399G811Q543p409j5479m37K669m358Q286q1P08q950r579K629J546k314j2098
4384b8513l1J2862P424O994R153K984j1196o635J540m448l31P611P289L531n977
4369B257j7195l103L236J2239K456o281q42o596m856j1107J1157J4581r602q872
$$ plain form
4355 -22528 -30317 -18653 1920 2659 10729 19838 14196 -5165 -5061 8867 6020 8435 -10473 -31104
4341 -31104 -24488 -10166 -3252 658 6156 11361 5496 -3855 -4263 -4870 3576 16022 9470 7581 195
4326 195 -2575 -18584 -22288 -20107 -15537 -29023 -32788 -28017 -22546 -14122 -16733 -14548 -8537 -4611 -4291
4311 -4291 -3011 4636 19657 28924 26646 13847 -3361 -3810 -6936 -22533 -28047 -24803 -11972 14120
4297 14120 18876 -838 -10789 -5254 -16469 -21913 -17290 -10271 -7171 -5037 -2358 -9659 -19467 -25778
4283 -25778 -25588 -9557 -6043 -3240 -434 2939 3338 -3981 -11769 -5607 -14399 -21339 -11859 -3054 -3323
4268 -3323 1529 7628 16669 15690 7135 -2990 -1235 6509 11644 25917 25252 13440 6048 6112 14112
4253 14112 9490 6644 12835 11287 6238 19501 7042 -5378 1242 14031 13193 4019 -9425 -10423
$$ packed form
4355b2528p789J1664K0573P39Q070R109n642j9361J04J3928k847K415j8908k0631
4341c1104O616J4322O914L910N498N205n865r351m08o07Q446J2446o552j889p386
4326A95k770j6009l704K181M570j3486l765M771N471Q424k611K185O011L926L20
4311d291J280P647J5021R267k278j2799j7208m49l126j5597n514L244J2831K6092
4297A4120M756j9714r951N535j1215n444M623P019L100K134K679p301r808o311
4283b5778J90J6031L514K803K806L373L99p319p788O162q792o940R480Q805k69
4268c323M852O099R041r79q555j0125J755P744N135J4273o65j1812p392O4Q000
4253A4112m622k846O191j548n049J3263j2459j2420O620J2789q38r174j3444r98
$$ plain form
4239 -10423 -2979 13864 27338 13342 -13982 -20417 -22389 -19352 -4567 -1312 -6077 -3627 -5103
4226 -5103 -12398 -12433 -8337 -3955 -12815 -19878 -15782 1110 3673 2963 3760 -8191 -19226 -20094 -15330
4211 -15330 -13308 -11849 -2018 -4562 -6976 -3326 6956 19091 3599 -7025 -6499 -3789 -10868 -16695
4197 -16695 -10809 -4193 -6288 -10118 -2029 8769 3491 6565 8504 5019 8975 12587 6558 3516
4183 3516 530 -1152 -15250 -20346 -18673 -24944 -32226 -21241 -18513 -9059 -1234 -856 6718 11419 -1536
4168 -1536 -16241 -11830 -130 6181 6648 13068 25552 17162 8885 -726 2129 7310 -4779 -34057
4154 -34057 -43988 -29895 -16415 -15319 -1355 5444 -1450 -4184 -4825 3378 15187 28884 28830 16340
4140 16340 -14890 -28808 -21562 -7523 -7193 -5308 326 1062 -3837 -13477 -14823 -17667 -8692 -1835
$$ packed form
4239a0423P444J6843J3474j3996k7324o435j972L037J4785L255m765K450j476
4226e103p295l5M096M382q860p063M096J6892K563p10P97j1951j1035q68M764
4211a5330K022J459R831k544k414L650J0282J2135j5492j0624N26K710p079n827
4197a6695N886O616k095l830Q089J0798n278L074J939l485L956L612o029l042
4183C516k986j682j4098n096J673o271p282J0985K728R454P825L78P574M701j2955
4168a536j4705M411J1700O311M67O420J2484q390q277r611K855N181j2089k9278
4154c4057r931J4093J3480J096J3964O799o894k734o41Q203J1809J3697n4j2490
4140A6340l1230j3918P246J4039L30J885N634P36m899r640j346k844Q975O857
$$ plain form
4126 -1835 -4257 -3601 -4396 5788 11892 7051 4611 -5677 8686 16082 18597 18999 16640 8201 -2283
4111 -2283 -9759 -7082 -3354 4497 18136 4679 -8963 -13871 -8205 3022 13919 7424 13935 11609
4097 11609 11165 4181 -7627 -10091 -3160 -4303 1033 -441 18414 13022 12523 10966 7530 5977 -2826
4082 -2826 -3531 11627 8081 -8239 -17071 -18229 -27736 -18510 -8242 -14030 -5232 -11343 -15239 -8062
4068 -8062 1279 -7985 -12370 -17749 -15220 -9604 -5023 -11469 -14433 -9867 -6624 -352 316 4059 -969
4053 -969 944 1639 -5375 2304 13747 6131 10434 12612 13791 -3528 -3662 -4814 -14754 -29626 -33961
4038 -33961 -16176 -3896 -5145 -13254 -16505 -19891 -12281 -7059 -13660 -10280 -8821 -13566 -21195 -9308
4024 -9308 7931 11301 -643 5572 4607 -5683 -10880 -26628 -17834 -1540 4909 5404 10597 4448
$$ packed form
4126a835k422O56p95J0184O104m841k440j0288J4363P396K515M02k359q439j0484
4111b283p476K677L728P851J3639j3457j3642m908N666J1227J0897o495O511k326
4097A1609m44o984j1808k464O931j143N336j474J8855n392m99j557l436j553q803
4082b826p05J5158l546j6320q832j158r507R226J0268n788Q798o111l896P177
4068h062R341r264m385n379K529N616M581o446k964M566L243O272O68L743n028
4053i69J913O95p014P679J1443p616M303K178J179j7319j34j152r940j4872m335
4038c3961J7785J2280j249q109l251l386P610N222o601L380J459m745p629J1887
4024i308J7239L370j1944O215r65j0290n197j5748Q794J6294O449M95N193o149
$$ plain form
4010 4448 1358 982 2859 -9145 -12189 -26270 -21721 -13038 -15273 -4076 -11420 -13403 -4782 6445
3996 6445 13368 9238 -2564 -10455 -17041 -5453 6287 7711 1077 -10892 2543 18488 20549
3983 20549 6068 -1876 -3287 568 7559 18441 12397 -6210 -17641 -25663 -18654 -24001 -18196 -7504
3969 -7504 -14256 -9716 -7130 5301 9833 -7484 -12019 -16647 -16928 -7572 -3156 -2876 -10585 -22281 -24857
3954 -24857 -18531 -13462 -14020 -310 -2531 -4282 -2488 3084 3476 4225 -5397 -15037 -25635 -24267 -29426
3939 -29426 -24796 -7367 -4093 -4862 -2486 1115 -189 8604 18001 7718 3583 -7048 -11503 -8577
3925 -8577 -5415 -2781 12092 8324 -3544 -11061 -24027 -13336 -5093 -3125 -8585 -20897 -33931
3912 -33931 -35602 -25389 -18793 -16313 -19022 -15713 -6668 -6830 38 -6554 1533 -4765 -4072 -11750 -14955
$$ packed form
4010D448l090l76J877j2004l044j4081M549Q683k235J1197p344j983Q621J1227
3996F445O923m130j1802p891o586J1588J1740J424o634j1969J3435J5945K061
3983B0549j4481p944j411L855O991J0882o044j8607j1431q022P009n347N805J0692
3969g504o752M540K586J2431M532j7317m535m628k81R356M416K80p709j1696k576
3954b4857O326N069n58J3710k221j751J794N572L92P49r622r640j0598J368n159
3939b9426M630J7429L274p69K376L601j304Q793R397j0283m135j0631m455K926
3925h577L162K634J4873l768j1868p517j2966J0691Q243J968n460j2312j3034
3912c3931j671J0213O596K480k709L309R045j62O868o592Q087o298O93p678l205
$$ plain form
3897 -14955 -21245 -28857 -38650 -31478 -26539 -6466 11539 9762 3485 597 -2882 1089 -164 3461
3883 3461 3536 452 624 3041 6715 12761 15671 9351 -12030 -7949 1322 6997 17764 10822 -7119
3868 -7119 -11678 -3510 3961 5525 12253 18554 21202 23056 19551 18974 5899 -10958 -20148 -23926 -26004
3853 -26004 -26264 -19005 -16630 712 8625 9716 11710 5297 -6037 -5066 -13696 -27510 -18490 1923
3839 1923 -2482 -14534 -24191 -28706 -30776 -19232 -7598 4576 -6457 -1799 547 -3982 -14471
3826 -14471 -12772 -15522 -20362 -22341 -12194 2845 9094 -2899 -18607 -20387 -10515 5715 16598
3813 16598 8789 9112 10875 14453 -9927 -34544 -23395 -14206 -17712 -28699 -14906 11522 12953
3800 12953 -2119 -11872 -25052 -22101 -4339 -3989 -14299 -8749 1956 -1137 -3837 -940 2383 6793
$$ packed form
3897a4955o290p612r793P172M939K0073J8005j777o277k888l479L971j253L625
3883C461P5l084J72K417L674O046K910o320k1381M081R271N675J0767o942j7941
3868g119m559Q168P471J564O728O301K648J854l505n77j3075j6857r190l778k078
3853b6004k60P259K375J7342P913J091J994o413j1334R71q630j3814R020K0413
3839A923m405j2052r657m515k070J1544J1634J2174j1033M658K346m529j0489
3826a4471J699k750m840j979J0147J5039O249j1993j5708j780R872J6230J0883
3813A6598p809L23J763L578k4380k4617J1149R189l506j0987J3793K6428J431
3800A2953j5072r753j3180K951J7762L50j0310N550J0705l093k700K897L323M410
$$ plain form
3786 6793 7204 4540 14328 -874 -13818 1699 6206 3158 4788 3347 -1127 8197 13082 5938
3772 5938 -6182 -2753 -1191 5242 13936 3811 -4604 -7602 -10322 -9269 -3953 -9409 -14865 1141
3758 1141 14107 7074 1241 -567 -10778 -20168 -27511 -33436 -38580 -25230 -11638 -3703 9622 17070
3744 17070 10145 3913 -1004 2372 -2333 -8144 -22967 -19891 -11496 -18468 -17458 -2272 -16296 -16471
3730 -16471 -3111 -454 -8734 -569 9939 10578 12648 27594 40387 31321 9914 3353 1806 -2735
3716 -2735 -289 4156 6729 4592 3088 7432 23369 20756 24770 33663 14745 -3206 -7388 -4966
3702 -4966 -9867 -19049 -11351 -1581 -18393 -16360 -6973 -1337 -2274 11493 8229 -1751 7012 8380 13371
$$ packed form
3786F793M11k664R788j5202j2944J5517M507l048J630j441m474R324M885p144
3772E938j2120L429J562O433Q694j0125q415k998k720J053N316n456n456J6006
3758A141J2966p033n833j808j0211r390p343n925n144J3350J3592P935J3325P448
3744A7070o925o232m917L376m705n811j4823L076Q395o972J010J5186j4024j75
3730a6471J3360K657q280Q165J0508O39K070J4946J2793r066k1407o561j547m541
3716b735K446M445K573k137j504M344J5937k613M014Q893j8918j7951m182K422
3702d966m901r182P698R770j6812K033R387N636r37J3767l264r980Q763J368M991
$$ [...]
##END NTUPLES=NMR SPECTRUM
##END=
