##TITLE=Analysis number 320444
Compound Code cc 51313
Book Reference 494/18
Project Code adrs
Chemist Name craigr
##JCAMPDX= 6.0         $$ Bruker NMR JCAMP-DX V2.0
##DATA TYPE= NMR SPECTRUM
##DATA CLASS= NTUPLES
##ORIGIN= Bruker BioSpin GmbH
##OWNER= nmr
$$ XWIN-NMR		Version 3.5
$$ Mon Jun 26 09:58:40 2006 GMT Daylight Time (UT+1h)  MAYBRIDGE\nmr@NMR_250MHZ
##.OBSERVE FREQUENCY= 250.131544655141
##.OBSERVE NUCLEUS= ^1H
##.ACQUISITION MODE= SIMULTANEOUS (DQD)
##.ACQUISITION SCHEME= undefined
##.AVERAGES= 16
##.DIGITISER RES= 18
##SPECTROMETER/DATA SYSTEM= dpx250
##.PULSE SEQUENCE= zg30
##.SOLVENT NAME= CDCl3
##.SHIFT REFERENCE= (INTERNAL, CDCl3, 0, 16.522)
##AUDIT TRAIL= $$ (NUMBER, WHEN, WHO, WHERE, WHAT)
$$ ##TITLE= Audit trail, XWIN-NMR		Version 3.5
$$ ##JCAMPDX= 5.01
$$ ##ORIGIN= Bruker BioSpin GmbH
$$ ##OWNER= nmr
$$ C:\u/data/dgb/nmr/ADRS/1440/pdata/1/auditp.txt
$$ ##AUDIT TRAIL=  $$ (NUMBER, WHEN, WHO, WHERE, WHAT)
(   1,<2006-06-26 09:58:17.85 +100>,<MAYBRIDGE\nmr>,<NMR_250MHZ>,
      <created by zg, POWCHK disabled, PULCHK disabled
       configuration hash MD5:
       E2 DF 36 D8 04 B2 41 60 5A D7 A3 38 5A 4B D0 FE
       data hash MD5: 64K
       57 BD DA C1 47 94 C2 31 19 F8 38 F7 9B DF 72 F0>)
(   2,<2006-06-26 09:58:31.64 +100>,<MAYBRIDGE\nmr>,<NMR_250MHZ>,
      <Start of raw data processing
       ef LB = 0.3 FT_mod = 6 PKNL = 1 SI = 32K 
       data hash MD5: 32K
       23 54 53 FA 13 20 09 EA C2 16 CE 39 F2 64 55 4F>)
(   3,<2006-06-26 09:58:33.24 +100>,<MAYBRIDGE\nmr>,<NMR_250MHZ>,
      <apk 
       data hash MD5: 32K
       FE 35 5D FF FA 62 BA BA C7 DA F7 B3 84 86 82 0B>)
(   4,<2006-06-26 09:58:33.92 +100>,<MAYBRIDGE\nmr>,<NMR_250MHZ>,
      <abs ABSG = 5 
       data hash MD5: 32K
       7A 09 C9 BC 3E 96 75 1F 81 07 58 95 90 0C 98 17>)
$$ ##END=
$$ 
$$ hash MD5
$$ 71 B2 41 0E 11 2B 4B CD 68 33 C5 0B BE 52 30 8E
##$RELAX= 
##$RELAX= 
##$RELAX= 
##$RELAX= 
##$RELAX= 
##$RELAX= 
##$RELAX= 
$$ Bruker specific parameters
$$ --------------------------
##$DU= <C:\u>
##$EXPNO= 1440
##$NAME= <ADRS>
##$PROCNO= 1
##$TYPE= <nmr>
##$USER= <dgb>
##$AMP= (0..31)
100 100 100 100 100 100 100 100 100 100 100 100 100 100 100 100 100 100 
100 100 100 100 100 100 100 100 100 100 100 100 100 100 
##$AQSEQ= 0
##$AQ_mod= 3
##$AUNM= <au_zg>
##$AUTOPOS= <11 >
##$BF1= 250.13
##$BF2= 250.13
##$BF3= 250.13
##$BF4= 250.13
##$BF5= 500.13
##$BF6= 500.13
##$BF7= 500.13
##$BF8= 500.13
##$BYTORDA= 1
##$CFDGTYP= 0
##$CFRGTYP= 5
##$CHEMSTR= <none>
##$CNST= (0..31)
1 1 145 1 1 1 1 1 1 1 1 1 1 1 1 1 1 1 1 1 1 1 1 1 1 1 1 1 1 1 1 1 
##$CPDPRG= <>
##$CPDPRG1= <>
##$CPDPRG2= <>
##$CPDPRG3= <>
##$CPDPRG4= <mlev>
##$CPDPRG5= <mlev>
##$CPDPRG6= <mlev>
##$CPDPRG7= <mlev>
##$CPDPRG8= <mlev>
##$CPDPRGB= <>
##$CPDPRGT= <>
##$D= (0..31)
0 1 0 0 0 0 0 0 0 0.06 0 0 0 0 0 0 0.0002 0 0 0 0 0 0 0 0 0 0 0 0 0 0 
0 
##$DATE= 1151312296
##$DBL= (0..7)
120 120 120 120 120 120 120 120 
##$DBP= (0..7)
150 150 150 150 150 150 150 150 
##$DBP07= 0
##$DBPNAM0= <>
##$DBPNAM1= <>
$$ [...]
##$SUBNAM7= <"">
##$SUBNAM8= <"">
##$SUBNAM9= <"">
##$SW= 20.6930455092707
##$SWIBOX= (0..15)
0 0 3 0 0 0 0 0 0 0 0 0 0 0 0 0 
##$SW_h= 5175.983436853
##$TD= 65536
##$TD0= 1
##$TE= 296.16
##$TE2= 300
##$TE3= 300
##$TEG= 300
##$TL= (0..7)
0 120 120 120 120 120 120 120 
##$TP= (0..7)
150 150 150 150 150 150 150 150 
##$TP07= 0
##$TPNAME0= <>
##$TPNAME1= <>
##$TPNAME2= <>
##$TPNAME3= <>
##$TPNAME4= <>
##$TPNAME5= <>
##$TPNAME6= <>
##$TPNAME7= <>
##$TPOAL= (0..7)
0.5 0.5 0.5 0.5 0.5 0.5 0.5 0.5 
##$TPOFFS= (0..7)
0 0 0 0 0 0 0 0 
##$TUNHIN= 0
##$TUNHOUT= 0
##$TUNXOUT= 0
##$USERA1= <user>
##$USERA2= <user>
##$USERA3= <user>
##$USERA4= <user>
##$USERA5= <user>
##$V9= 5
##$VALIST= <valist>
##$VCLIST= <CCCCCCCCCCCCCCC>
##$VD= 0
##$VDLIST= <DDDDDDDDDDDDDDD>
##$VPLIST= <PPPPPPPPPPPPPPP>
##$VTLIST= <TTTTTTTTTTTTTTT>
##$WBST= 1024
##$WBSW= 4
##$XGAIN= (0..3)
0 0 0 0 
##$XL= 0
##$YL= 0
##$YMAX_a= 354009
##$YMIN_a= -582660
##$ZGOPTNS= <>
##$ZL1= 120
##$ZL2= 120
##$ZL3= 120
##$ZL4= 120
##$ABSF1= 16.522
##$ABSF2= -4.171173
##$ABSG= 5
##$ABSL= 3
##$ALPHA= 0
##$AQORDER= 0
##$ASSFAC= 0
##$ASSFACI= 0
##$ASSFACX= 0
##$ASSWID= 0
##$AUNMP= <proc_1d>
##$AZFE= 0.1
##$AZFW= 0.1
##$BCFW= 0
##$BC_mod= 0
##$BYTORDP= 0
##$COROFFS= 0
##$CY= 12.5
##$DATMOD= 1
##$DC= 0
##$DFILT= <>
##$DTYPP= 0
##$F1P= 14.0000005364418
##$F2P= -0.99999901652339
##$FCOR= 0.5
##$FTSIZE= 32768
##$FT_mod= 6
##$GAMMA= 0
##$GB= 0
##$INTBC= 1
##$INTSCL= 1
##$ISEN= 128
##$LB= 0.3
##$LEV0= 0
##$LPBIN= 0
##$MAXI= 10000
##$MC2= 0
##$MEAN= 0
##$ME_mod= 0
##$MI= 0
##$NCOEF= 0
##$NC_proc= -3
##$NLEV= 6
##$NOISF1= 0
##$NOISF2= 0
##$NSP= 0
##$NTH_PI= 0
##$NZP= 0
##$OFFSET= 16.522
##$PC= 1
##$PHC0= 171.8286
##$PHC1= 3.840208
##$PH_mod= 1
##$PKNL= yes
##$PPARMOD= 0
##$PSCAL= 4
##$PSIGN= 0
##$REVERSE= no
##$SF= 250.13
##$SI= 32768
##$SIGF1= 0
##$SIGF2= 0
##$SINO= 400
##$SIOLD= 32768
##$SREGLST= <1H.CDCl3>
##$SSB= 0
##$STSI= 32768
##$STSR= 0
##$SW_p= 5175.98343685301
##$SYMM= 0
##$S_DEV= 0
##$TDeff= 65536
##$TDoff= 0
##$TI= <Analysis number 999999
Compound Code 99
Book Reference 9
Project Code 9>
##$TILT= no
##$TM1= 0
##$TM2= 0
##$TOPLEV= 0
##$USERP1= <user>
##$USERP2= <user>
##$USERP3= <user>
##$USERP4= <user>
##$USERP5= <user>
##$WDW= 1
##$XDIM= 32768
##$YMAX_p= 477687830
##$YMIN_p= -63256
$$ End of Bruker specific parameters
$$ ---------------------------------
##NTUPLES= NMR SPECTRUM
##VAR_NAME=  FREQUENCY,     SPECTRUM/REAL,   SPECTRUM/IMAG
##SYMBOL=    X,             R,               I
##VAR_TYPE=  INDEPENDENT,   DEPENDENT,       DEPENDENT
##VAR_FORM=  AFFN,          ASDF,            ASDF
##VAR_DIM=   32768,         32768,           32768
##UNITS=     HZ,            ARBITRARY UNITS, ARBITRARY UNITS
##FACTOR=    0.157963299565203, 1,           1
##FIRST=     4132.6476996994, 0,             0
##LAST=      -1043.33573715361, 0,           0
##MIN=       -1043.33573715361, -63256,      0
##MAX=       4132.6476996994, 477687830,     0
$$ Real data points
##PAGE= N=1
##DATA TABLE= (X++(R..R)), XYDATA
$$ [...]
##PAGE= N=2
##DATA TABLE= (X++(I..I)), XYDATA
15054I32210K243N455Q355P627O455o625o230J1759J2647j1505j2873j2986l636
15041I32896p487R812J536O725J4629O836m595L026J3450j8516k0706M795M650
15028I47051J3592J031L687J406o622l2m904J659n29J971O504o340J054Q776J628
15013I69932j0551l560k120Q22P938K3686p694N076J0298m577K556m293r843q341
14999I69329j3675O930J3391j0607J053J0489Q460J0260j054j642P357J43j6198
14986I84236j2493K740M890J1819O139J142J1265J1847K745n165j0296n379j1626
14973I91864l230k088M621O013P14p61P895L501j5479R613M808j2791m584q974
14959I81122j421N847o32N206M884M955R76j1379m727Q395J4736P087K618M981
$$ y = [932210, 934453, 939908, 948263, 955890, 962345, 955720, 949490, 961249, 973896, 962391, 949518, 936532, 932896, 925409, 935221, 936757, 943482, 958111, 964947, 960352, 963378, 976828, 958312, 937606, 942401, 947051, 960643, 961674, 965361, 966767, 960145, 960113, 955209, 956868, 956339, 958310, 964814, 958474, 959528, 968304, 969932, 959381, 955821, 953701, 954523, 962461, 986147, 978453, 983529, 993827, 989250, 991806, 987513, 977670, 969329, 955654, 962584, 975975, 965368, 966421, 976910, 985370, 995630, 994576, 992934, 1000291, 1000434, 984236, 971743, 974483, 979373, 991192, 997331, 998473, 1009738, 1021585, 1024330, 1019165, 1008869, 1003490, 991864, 988634, 986546, 991167, 997180, 997894, 997133, 1005028, 1008529, 993050, 1002663, 1007471, 994680, 990096, 981122, 979701, 985548, 984916, 990122, 995006, 999961, 1000937, 989558, 984831, 993226, 1007962, 1015049, 1017667, 1022648]
14945A022648K774J559j877l980O304J179L569Q667K88l287j7990P71J8863L260
14931A042748q31j3550J432N112N577K560l330O466o250j5696j4267R003M358
14918A023332P543P325L916J1861Q58o231J138N686p639P048J960J0092m280j2114
14904A050495l365Q216K451N959K077K132n413J1670J844j4237l803o04N848O540
14890A069810n671n633n602J2029r26J395P10j3712q653Q321J3922N304K345q443
14876A065196k126M630p51L775k846r16J3820j244q174j5916j3935J0201J3895
14863A065609O036J3171R76r443j405M295o326L764Q566M201j9170M268O505J2292
14849A093339K1774p542j1731j5620J0050J3884L815j1964K662m071j618O385
$$ y = [1022648, 1025422, 1026981, 1025104, 1021124, 1027428, 1028607, 1032176, 1040843, 1041131, 1037844, 1019854, 1020625, 1039488, 1042748, 1041917, 1028367, 1029799, 1034911, 1040488, 1043048, 1039718, 1046184, 1039934, 1024238, 1009971, 1018974, 1023332, 1030875, 1038200, 1042116, 1053977, 1054835, 1048604, 1049742, 1055428, 1047789, 1054837, 1056797, 1066889, 1062609, 1050495, 1047130, 1055346, 1057797, 1063756, 1065833, 1067965, 1062552, 1074222, 1076066, 1061829, 1058026, 1057422, 1063270, 1069810, 1064139, 1058506, 1052904, 1064933, 1064007, 1065402, 1066112, 1052400, 1043747, 1052068, 1065990, 1071294, 1073639, 1065196, 1063070, 1067700, 1066949, 1070724, 1067878, 1066962, 1080782, 1079538, 1071364, 1055448, 1041513, 1051714, 1065609, 1071645, 1084816, 1085792, 1076349, 1074944, 1079239, 1072913, 1076677, 1085243, 1089444, 1070274, 1074542, 1081047, 1093339, 1115113, 1107571, 1095840, 1080220, 1090270, 1104154, 1107969, 1096005, 1098667, 1094596, 1092978, 1099363]
14837A099363N091L834M767J0197m207j5112l187l347O739J3229R470q685l104
14824A115048r263Q32P111j3190m754J0105J252L52R904J5977Q772J3007l665
14811A151488k0202o96n081j4089r04J0733L332o693J4665K463j0157n067Q395
14798A128187J2100K581j1714j9629j4489K2032K592j85J1777R102l192M879M948
14785A148989j4545o123k089J2851L17j777r235J4947O169n707L483p04o661L043
14771A142958O450j1758o604J2746O081Q794O56p179r51j0357P979M395O330L762
14757A163302J29M965Q619O188k0719j2560n96q193J3292K000m299k241m525j008
14743A144354P893L215O777J3077r870q756N779Q500l009J1429M607m429P403
$$ y = [1099363, 1104454, 1108288, 1113055, 1123252, 1119045, 1103933, 1100746, 1097399, 1104138, 1117367, 1126837, 1118152, 1115048, 1105785, 1106617, 1113728, 1100538, 1095784, 1105889, 1107141, 1107493, 1117397, 1133374, 1142146, 1155153, 1151488, 1131286, 1130590, 1125509, 1111420, 1110516, 1121249, 1124581, 1117888, 1132553, 1135016, 1124859, 1119792, 1128187, 1140287, 1142868, 1131154, 1111525, 1097036, 1119068, 1121660, 1121475, 1133252, 1142354, 1139162, 1144041, 1148989, 1134444, 1128321, 1126232, 1139083, 1139400, 1137623, 1128388, 1143335, 1149504, 1143797, 1147280, 1146576, 1139915, 1142958, 1149408, 1137650, 1131046, 1143792, 1149873, 1158667, 1159323, 1152144, 1151193, 1140836, 1148815, 1153210, 1159540, 1163302, 1163431, 1168396, 1177015, 1183203, 1162484, 1149924, 1149328, 1141135, 1154427, 1156427, 1152128, 1149887, 1145362, 1144354, 1152247, 1155462, 1162239, 1175316, 1165446, 1156690, 1162469, 1170969, 1167960, 1179389, 1183996, 1179567, 1186970]
14730A186970Q461N061J763k04j3712l46P603p143J256j2002o025M936O591P618
14716A190827o416L694m39j3299q965o761Q47J1091R564J1114L244K88J5047J2936
14702A222772P478k0418j0177o58J0405K391o895K888J1164J436j2070K762j27
14689A210951M879J3091j096k841o723M290j391M543L059p570p807p511J0835
14676A216709L584J0477O629j01J435l361M572p421Q586J025j8110O456J1627
14663A242107M602j1253o32k492N017R574k0635m301K186m490j3397l336J9695
14650A222645K6259m550M560k636n017q633k041J3153L917m571j4282N116J2961
14637A246881M711l968K284N793O311K47j0109p147R457Q886J0919M000k131o200
$$ y = [1186970, 1195431, 1200492, 1202255, 1202051, 1188339, 1187993, 1195596, 1188453, 1189709, 1177707, 1171682, 1176618, 1183209, 1190827, 1184411, 1188105, 1187666, 1174367, 1165402, 1158641, 1159488, 1170579, 1180143, 1191257, 1194501, 1194789, 1209836, 1222772, 1230250, 1209832, 1199655, 1198997, 1209402, 1211793, 1204898, 1207786, 1218950, 1220386, 1208316, 1211078, 1210951, 1215830, 1228921, 1227825, 1224984, 1218261, 1222551, 1221160, 1225703, 1228762, 1221192, 1213385, 1205874, 1216709, 1220293, 1230770, 1237399, 1237298, 1238733, 1235372, 1239944, 1232523, 1241109, 1242134, 1224024, 1230480, 1242107, 1246709, 1235456, 1234824, 1232332, 1237349, 1246923, 1226288, 1221987, 1224173, 1219683, 1206286, 1202950, 1222645, 1248904, 1244354, 1248914, 1246278, 1241261, 1232628, 1230587, 1243740, 1247657, 1243086, 1228804, 1233920, 1246881, 1251592, 1247624, 1249908, 1255701, 1262012, 1262259, 1252150, 1245003, 1254460, 1263346, 1274265, 1278265, 1276134, 1269934]
14623A269934o381j72n784j5019Q004L813J3984P414M339K921j0364K440o531
14610A268598j0352Ro97N622L065J0734N025o557K622Q764n113N740J2335Q30
14596A300625j80j0833P329J395j6686J4047J9130j3489n774J0169q751o867l229
14583A286886r248j860R387Q905Q042m46j126j4693L986J3097M409N636M191J971
14569A319137J251j6954r207M35K349M664J328N479k794m610K160n67m252j40
14555A298279o96n301m819K005O780J0717J3274J1228L812J4367O383j2147j3367
14542A330515j6838J2417O958k838O871P487m991k655K696N635j0547n355l09
14529A329046O032K0464K4406o181q245j0237j0627M59M625K2297k993j2331R660
$$ y = [1269934, 1263553, 1263381, 1257597, 1242578, 1250582, 1254395, 1268379, 1275793, 1280132, 1283053, 1272689, 1275129, 1268598, 1258246, 1258255, 1257558, 1263180, 1266245, 1276979, 1282004, 1275447, 1278069, 1286833, 1281720, 1287460, 1299795, 1300625, 1300445, 1289612, 1296941, 1298336, 1281650, 1295697, 1314827, 1301338, 1295564, 1305733, 1296982, 1290115, 1286886, 1277638, 1275778, 1285165, 1294070, 1302112, 1301666, 1300540, 1285847, 1289833, 1302930, 1307339, 1312975, 1317166, 1319137, 1320388, 1303434, 1294227, 1294662, 1297011, 1301675, 1303003, 1308482, 1305688, 1301078, 1303238, 1302671, 1298419, 1298279, 1297583, 1292282, 1287463, 1289468, 1296248, 1306965, 1320239, 1331467, 1335279, 1349646, 1356029, 1343882, 1330515, 1313677, 1326094, 1333052, 1330214, 1337085, 1344572, 1339581, 1336926, 1339622, 1345257, 1334710, 1329355, 1329046, 1335078, 1355542, 1379948, 1373767, 1365522, 1355285, 1344658, 1345117, 1349742, 1372039, 1369046, 1356715, 1366375]
14516A366375P991q996j7222j3805K566K2843o33p956P04M87J8606k153M780p184
14502A366403L822J0916m612j6008J1838J3549k893r512N122J913j2303j0339
14490A357896K19k339P407n881P171L005Q83J970m312j0839R692K0419L778j0256
14476A378813p966k225M653N851l893M71l625J3675K1402J4495M111j4928m659
14463A406175M50o091k562k708k225J0034l516M178L217J359J0145J2130j221
14450A429365P04j784J39K452j786n793q452r081j4777K232J3387J3580M054k726
14436A421514j0672k153N165R187N767j0744p06K1940K1080l714j1329N036J154
14423A451525q091j4537j971l995p961K3201J3061j0896j6572N768Q198m536L611
$$ y = [1366375, 1374366, 1365370, 1348148, 1334343, 1336909, 1359752, 1359119, 1351163, 1351867, 1352354, 1370960, 1368807, 1373587, 1366403, 1370225, 1381141, 1376529, 1360521, 1372359, 1385908, 1383015, 1373503, 1378625, 1380538, 1368235, 1357896, 1358115, 1355776, 1363183, 1357302, 1364473, 1367478, 1368361, 1370331, 1366019, 1355180, 1364872, 1385291, 1389069, 1378813, 1370847, 1368622, 1373275, 1379126, 1375233, 1375704, 1372079, 1385754, 1407156, 1421651, 1425762, 1410834, 1406175, 1406625, 1400534, 1397972, 1395264, 1393039, 1403073, 1399557, 1403735, 1406952, 1408311, 1418456, 1430586, 1429365, 1430069, 1428285, 1428424, 1430876, 1429090, 1423297, 1414845, 1405764, 1390987, 1393219, 1406606, 1420186, 1424240, 1421514, 1410842, 1408689, 1413854, 1423041, 1428808, 1418064, 1417358, 1439298, 1460378, 1456664, 1445335, 1450371, 1451525, 1443434, 1428897, 1426926, 1422931, 1414970, 1438171, 1451232, 1440336, 1423764, 1429532, 1437730, 1433194, 1436805]
14410A436805Q805L328M903j9732l885O247j056M721J6255J5045J2035o272K547
14397A479746P022q669j6547o33J6654J5421l271m701j813j7383K680J4089J5982
14384A498577q196J822N675l902l888J8051j382n168L352K791J736k0040j0482
14371A478946N328k645J6785J7605J4558j1542j7452j393J0149n617p485m657
14359A492580L781k954N86O490J5997j41r45k0466J823R671N432M246P52K511
14345A519363o968j4019R860P462R374O82K392q974p557M442J4618L221P47n19
14331A534124J5028P200j804m546K659o06l365p970L434J3857j0132j5995K39
14318A532123J3725N854O540k233k835r650P47Q709J1435l925q625L740Q915l881
$$ y = [1436805, 1445610, 1448938, 1453841, 1434109, 1430224, 1436471, 1435415, 1440136, 1456391, 1471436, 1483471, 1477199, 1479746, 1486768, 1478099, 1461552, 1460919, 1477573, 1492994, 1489723, 1485022, 1483209, 1465826, 1468506, 1482595, 1498577, 1490381, 1492203, 1497878, 1493976, 1490088, 1508139, 1506757, 1501589, 1504941, 1507732, 1509468, 1489428, 1478946, 1484274, 1481629, 1498414, 1516019, 1530577, 1519035, 1501583, 1500190, 1510339, 1504722, 1497237, 1492580, 1496361, 1493407, 1493993, 1500483, 1516480, 1516339, 1515394, 1494928, 1496751, 1506422, 1511854, 1516100, 1516852, 1519363, 1512395, 1498376, 1508236, 1515698, 1525072, 1525754, 1528146, 1519172, 1511615, 1516057, 1530675, 1533896, 1534643, 1534124, 1549152, 1556352, 1554548, 1550002, 1552661, 1552055, 1548690, 1540720, 1544154, 1558011, 1547879, 1531884, 1532123, 1545848, 1551702, 1558242, 1556009, 1553174, 1543524, 1544271, 1552980, 1564415, 1560490, 1551865, 1555605, 1564520, 1560639]
14304A560639j373R77M746k11L487Q68k1797J489K3004l609K383J5722m354j540
14290A580431M173N121L666m804q079L976J4675M027n63o226O945O337K24L900
14276A613803j3115j2466L915m38j354J9149L227P524o533j1387n549Q384J6179
14263A621339K228j1673p791R119q903q284M089n544o145J3269J4975M001J713
14250A622393O377M935o047P387J6755o917j5444Q737K27m308n901m971R597Q401
14236A641221K047R035M574K667j798k1098p898K353J2396J2382r116l648J1843
14223A654960R7j1068r755R356L008J3204J695j9305p264n619k388J415K750K2051
14209A653137J6830L067R849K1008k1100j6985J663m490J2558J2157k187Q308
$$ y = [1560639, 1559266, 1560243, 1564989, 1564778, 1568265, 1569133, 1547336, 1548825, 1571829, 1568220, 1570603, 1586325, 1581971, 1580431, 1584604, 1589725, 1593391, 1588587, 1580508, 1584484, 1599159, 1603186, 1602623, 1596397, 1603342, 1609679, 1609903, 1613803, 1600688, 1588222, 1592137, 1591699, 1590345, 1609494, 1612721, 1620245, 1613712, 1602325, 1596776, 1605160, 1621339, 1623567, 1611894, 1604103, 1613222, 1604319, 1596035, 1600124, 1594580, 1588435, 1601704, 1616679, 1620680, 1622393, 1628770, 1633705, 1627658, 1635045, 1651800, 1644883, 1629439, 1638176, 1638403, 1634095, 1628194, 1623223, 1632820, 1641221, 1643268, 1652303, 1656877, 1659544, 1657746, 1636648, 1628750, 1631103, 1643499, 1655881, 1646765, 1643117, 1654960, 1655057, 1643989, 1634234, 1643590, 1646598, 1659802, 1661497, 1642192, 1634928, 1629309, 1626921, 1628336, 1631086, 1653137, 1669967, 1673034, 1682883, 1703891, 1682791, 1665806, 1667469, 1662979, 1675537, 1687694, 1685507, 1693815]
14197A693815O146R014m100j5184o633P879o995P634J1985J1195N049p445j716
14184A710644R888j038o598P844K501M731J1782p464j6419j1980L804o578j1512
14171A689605k952M31J4764J7495K258J8741J4083O627P071j4996J044M574o623
14158A752122n385M032j2520l275O610j021j207n949L022P323K499J698J4614
14145A762563j779q930j5005l616J6792Q434R894j127l970K693O099j202m85L101
14131A773462M829o021j3433K0283J3218n673k870M299l861o496M051m575J1284
14118A788497N213J0083Q587J483q360j878O648j6041j2057J0091O472N715N16
14105A804969m707J1357J8263O346l509j1511j134P225j2577L005O341l733l377
$$ y = [1693815, 1699961, 1708975, 1704875, 1689691, 1683058, 1690937, 1683942, 1691576, 1703561, 1714756, 1719805, 1712360, 1710644, 1720532, 1719494, 1712896, 1720740, 1723241, 1727972, 1739754, 1732290, 1715871, 1703891, 1707695, 1701117, 1689605, 1686653, 1687084, 1701848, 1719343, 1721601, 1740342, 1754425, 1761052, 1768123, 1753127, 1754171, 1758745, 1752122, 1746737, 1750769, 1738249, 1734974, 1741584, 1740563, 1739356, 1733407, 1736429, 1743752, 1746251, 1747949, 1762563, 1760784, 1751854, 1736849, 1733233, 1750025, 1758459, 1768353, 1767226, 1763256, 1765949, 1772048, 1770846, 1770361, 1773462, 1778291, 1772270, 1758837, 1779120, 1792338, 1786665, 1783795, 1788094, 1784233, 1777737, 1781788, 1777213, 1788497, 1793710, 1803793, 1812380, 1813863, 1805503, 1803625, 1810273, 1794232, 1782175, 1792266, 1798738, 1804453, 1804969, 1800262, 1811619, 1829882, 1836228, 1832719, 1821208, 1820074, 1827299, 1814722, 1817727, 1824068, 1820335, 1816958]
14092A816958M146r200O285J5441J0637J647R85j384r47j5455J2706K3334R751
14079A874904q486K113r671O4j3628Q58k451o098K632K4318J6802M985l566k582
14065A880194j703p554j0619j3537j676J7467J5408p60j0830m553K763O859K0099
14052A891558Q431J0555p670m930j2440j3266K435Q272R300O593O74R171j549
14039A907134q606O828J2978J6488M584j1454j0266k5j060L59K551l384l192n564
14025A907371R43n472K321J3386J4811J4656l801o307J4692R616j4159j2414O681
14012A942324Q236N392N267n884O692M647k1865l73o44l67L359J5786N873J22
13998A968565J6746O543j2778q889n385k779K2316N940r575l347P652J5722n784
$$ y = [1816958, 1821104, 1811904, 1818189, 1833630, 1844267, 1845914, 1846899, 1845515, 1844568, 1829113, 1841819, 1865153, 1874904, 1866418, 1868531, 1858860, 1858924, 1845296, 1846154, 1843703, 1837605, 1840237, 1864555, 1881357, 1886342, 1882776, 1880194, 1878491, 1870937, 1860318, 1846781, 1845105, 1862572, 1877980, 1877220, 1866390, 1861837, 1864600, 1871459, 1891558, 1899989, 1910544, 1902874, 1897944, 1885504, 1872238, 1874673, 1882945, 1892245, 1898838, 1899512, 1908683, 1907134, 1898528, 1905356, 1918334, 1934822, 1939406, 1927952, 1917686, 1917661, 1916601, 1916960, 1919511, 1916127, 1912935, 1907371, 1908314, 1902842, 1905163, 1918549, 1933360, 1948016, 1944215, 1937908, 1952600, 1962216, 1948057, 1935643, 1942324, 1950560, 1955952, 1961219, 1955335, 1962027, 1966674, 1944809, 1944436, 1943792, 1943425, 1946784, 1962570, 1968443, 1968565, 1985311, 1991854, 1979076, 1970187, 1964802, 1962023, 1984339, 1990279, 1980704, 1977357, 1985009, 2000731, 1994947]
13985A994947j528J4010m593j7345j985L829J258N394L627J7468M163M163O349
13972B029757o068m784P288N665o512k130J884o522q180k801K6434J7273J2023
13959B063327n226o869q727r043O713O807M072n072P459P693K081J188J0887K09
13945B075499p546M644k113K574J1568R698L662J311j4201j0301M881R519N871
13932B095066l121q157j3781K461K5599J4058L172j3549j0708l98N430K158J526
13919B099756p86J6115J1272K511j1060j235l385P292K1908J707L290k473j883
13906B143029N470n784j3741M385J0055P535j698R945Q83q159p0L928Q495R729
13892B174002O980m53p534n877n192L371o475j052K2099J9083j4484k24K719J3411
$$ y = [1994947, 1993419, 2007429, 2002836, 1985491, 1983506, 1987335, 1988593, 1993987, 1997614, 2015082, 2019245, 2023408, 2029757, 2023689, 2018905, 2026193, 2031858, 2025346, 2023216, 2025100, 2018578, 2010398, 2007597, 2034031, 2051304, 2063327, 2058101, 2051232, 2042505, 2033462, 2040175, 2046982, 2051054, 2045982, 2053441, 2061134, 2063215, 2064403, 2075290, 2075499, 2067953, 2072597, 2070484, 2073058, 2084626, 2094324, 2097986, 2099297, 2085096, 2074795, 2079676, 2089195, 2095066, 2091945, 2083788, 2070007, 2072468, 2098067, 2112125, 2115297, 2101748, 2091040, 2090642, 2096072, 2098230, 2099756, 2098970, 2115085, 2126357, 2128868, 2117808, 2116573, 2113188, 2120480, 2142388, 2144095, 2147385, 2144912, 2143029, 2148499, 2142715, 2128974, 2133359, 2143414, 2150949, 2149251, 2159196, 2160079, 2151920, 2151850, 2155778, 2164273, 2174002, 2180982, 2180529, 2172995, 2167118, 2161926, 2165297, 2158822, 2157770, 2179869, 2198952, 2184468, 2184244, 2186963, 2200374]
13878B200374o299n864L477o373J504n147R680K5556J200N53k847q425K976r532
13864B200833P732J5711M020J1835K165N72J2080Q188r722p7J4687P930q900N650
13850B272704k83P556M202L22n537k35R086n68Q223j3018p066j673q828J416J3532
13835B279833J890m751m338j0942o592N014N561J4612l244j7035P834J7338J9596
13822B304776m614j2510k050m208J1408k244m281N16J2146J0321K460m073j0413
13809B297234J9713J3841O844N906K452r102R453K148J915Q778p679j1602J966
13796B341867J3148M07J4000J3789J3228m621j1146l851L226o653L836J4734k579
13783B389385q878k191P055K7345p736p476R560K908P660j867N904O708o987j431
$$ y = [2200374, 2194075, 2188211, 2191688, 2185315, 2186819, 2181672, 2191352, 2216908, 2218108, 2218661, 2215814, 2207389, 2210365, 2200833, 2208565, 2224276, 2228296, 2240131, 2242296, 2242868, 2254948, 2263136, 2253414, 2253337, 2268024, 2275954, 2267054, 2272704, 2272421, 2279977, 2284179, 2284501, 2278964, 2278729, 2287815, 2287247, 2295470, 2282452, 2275386, 2273713, 2264885, 2266301, 2279833, 2281723, 2276972, 2272634, 2261692, 2255100, 2260114, 2265675, 2280287, 2277043, 2260008, 2267842, 2285180, 2304776, 2300162, 2287652, 2285602, 2281394, 2292802, 2290558, 2286277, 2286793, 2298939, 2309260, 2311720, 2307647, 2297234, 2316947, 2330788, 2337632, 2343538, 2345990, 2336888, 2346341, 2348489, 2350404, 2359182, 2351503, 2339901, 2341867, 2355015, 2355422, 2369422, 2383211, 2396439, 2391818, 2380672, 2376821, 2380047, 2373394, 2377230, 2391964, 2389385, 2380507, 2378316, 2385371, 2412716, 2404980, 2397504, 2407064, 2409972, 2417632, 2415765, 2421669, 2428377, 2421390, 2419959]
13769B419959k171l569Q610J5697N282j3744P486J5911P653j1437j4605o889l275
13756B424908J0811J4479K2593J954P919j1592j5400J2552J0811P2K153K1607
13744B502867J677J2433k2005q853J3129K2279L363k972j451K322l419K175J989
13731B523534P074Q505R732N209k014p102J2759r139j657J9418J597J687J726
13718B571329l830J428J1611R723n097J3128L014j5302L939M261J2390J0864J163
13705B618621J889M901Q819l818K26p528M291P477J1761o654M255N493J3391J6809
13691B679933j664J0078K149p644R39J1918J5230M816m397n155q533p61o582N742
13677B696069J9503K237L141j0113m38J3375J0719M008m580j4769P315N002J3312
$$ y = [2419959, 2417788, 2414219, 2422829, 2438526, 2443808, 2430064, 2437550, 2453461, 2461114, 2449677, 2435072, 2428183, 2424908, 2435719, 2450198, 2472791, 2474745, 2482664, 2471072, 2455672, 2468224, 2479035, 2479107, 2481260, 2502867, 2504544, 2516977, 2494972, 2486119, 2499248, 2521527, 2524890, 2521918, 2520467, 2522789, 2519370, 2521545, 2523534, 2530608, 2539113, 2548845, 2554054, 2552040, 2544938, 2557697, 2548558, 2546901, 2566319, 2567916, 2569603, 2571329, 2567499, 2568927, 2580538, 2590261, 2585164, 2598292, 2601306, 2586004, 2589943, 2594204, 2606594, 2617458, 2618621, 2620510, 2625411, 2634230, 2630412, 2630638, 2623110, 2627401, 2634878, 2646639, 2639985, 2644240, 2649733, 2663124, 2679933, 2678269, 2688347, 2690496, 2682852, 2683791, 2695709, 2710939, 2715755, 2711358, 2706203, 2697670, 2696909, 2690327, 2696069, 2715572, 2717809, 2720950, 2710837, 2710399, 2723774, 2734493, 2738501, 2733921, 2719152, 2726467, 2731469, 2744781]
13664B744781M266m684l364K770Q535r498k0135l962K3699L0682P166k1314J0312
13651B769254J2066n479O617J9144J012J332P569L450l353Q676J6507J4004m637
13638B846162l059P929Q797J3225R565K356R733n346j3966K386m040o803j520
13625B865419K79j2575j0601k258L536J7251J9209J7518Q392m673L165J0014k202
13612B912474L654L198J4909K5163M950J9196P078l112J6142K4042q11O46J9702
13599C047231J7956J2419R134j884o673k1852l4241l4996k8199k4608P94Q461
13587B943542n206N821Q262J3408R205K719N930K0558J2733R531J2996J7753O407
13574C063659p165n018J3442J6156R69J2792L7794J9670J8438L4697J6373J5309
$$ y = [2744781, 2749047, 2744363, 2740999, 2743769, 2752304, 2742806, 2722671, 2718709, 2742408, 2773090, 2780256, 2758942, 2769254, 2781320, 2775841, 2782458, 2801602, 2802614, 2803946, 2811515, 2814965, 2811612, 2820288, 2836795, 2850799, 2846162, 2843103, 2851032, 2859829, 2873054, 2882619, 2884975, 2894708, 2889362, 2875396, 2877782, 2873742, 2866939, 2865419, 2865698, 2853123, 2842522, 2840264, 2843800, 2861051, 2880260, 2897778, 2906170, 2901497, 2904662, 2914676, 2912474, 2916128, 2919326, 2934235, 2959398, 2964348, 2983544, 2990622, 2987510, 3003652, 3027694, 3026883, 3027529, 3047231, 3065187, 3077606, 3086740, 3084856, 3078183, 3056331, 3022090, 2987094, 2958895, 2934287, 2935081, 2943542, 2938336, 2944157, 2952419, 2965827, 2975032, 2977751, 2983681, 3004239, 3016972, 3026503, 3039499, 3057252, 3063659, 3056494, 3051476, 3064918, 3081074, 3082043, 3094835, 3132629, 3152299, 3170737, 3205434, 3221807, 3237116]
13562C237116J8341Q312l0024n1261o3199o1376n8898m4086k7978J541K5042L0274
13550B983804J8420J0816N240m803J7499K8412J5962K3071M434m928P567M833
13538C110327J7553K4037n060R697K5669J2542M997J4205P359J2417J1872K3582
13526C269197R617M213J0395n020k1858k9301l3089k0939j7105k933P678K2599
13514C193454J6630M407N013R296J4908q712J573N219J3891J3113K5312j99n686
13501C288219Q984J626Q023Q107j352J4338Q195J3970L928J0667J627J0567J8817
13488C395716q60J1851K915R831K05p1P359J5154R050O037R681O853J864k299
13474C473286j2346J8653J9372K6527K8845O604O123K809r879q373J6370Q554
$$ y = [3237116, 3255457, 3263769, 3233745, 3182484, 3119285, 3057909, 2999011, 2954925, 2926947, 2928488, 2953530, 2983804, 3002224, 3013040, 3018280, 3013477, 3030976, 3059388, 3075350, 3098421, 3102855, 3097927, 3105494, 3110327, 3127880, 3151917, 3146857, 3156554, 3182223, 3194765, 3199762, 3213967, 3221326, 3233743, 3245615, 3269197, 3278814, 3283027, 3293422, 3288402, 3266544, 3237243, 3204154, 3183215, 3166110, 3163177, 3170855, 3193454, 3210084, 3214491, 3219504, 3228800, 3243708, 3234996, 3236569, 3241788, 3255679, 3268792, 3294104, 3293905, 3288219, 3297203, 3298829, 3306852, 3314959, 3313607, 3327945, 3336140, 3350110, 3354038, 3364705, 3366332, 3376899, 3395716, 3394856, 3406707, 3409622, 3419453, 3419658, 3419587, 3426946, 3442100, 3451150, 3457187, 3466868, 3473721, 3475585, 3473286, 3460940, 3479593, 3498965, 3525492, 3554337, 3560941, 3567064, 3569873, 3559994, 3551621, 3567991, 3576545]
13462C576545o00P698J3P73R143N75J8977l355N478K0225J9080J5677K252J0323
13448C682804R747Q009p572J0335K7547R285j3562L705M504p69K4881J1198j435
13435C768677J2233K2545j784Q447P197J0952j033O656J1202M592Q544J4262J5473
13422C887963N562K643J0346Q065K1164J3928m10J0087J0641O853J2994L977j019
13409C992794K4256Q108P314P320J0269J5349M098J2018K6164M634j828K764J944
13396D115204k075M597J4948K7078P199Q743K2186Q227J7113J2165k571k68j189
13383D231357J0210L486J7228K2116J1931J7413N212J0104J9916R528L475J2459
13371D374435J8845J3610K1597J0927Q952L769q07P669J2698P103O433J0137J095
$$ y = [3576545, 3575945, 3583643, 3583656, 3584429, 3593572, 3594147, 3613124, 3609769, 3615247, 3635472, 3654552, 3670229, 3672481, 3682804, 3692551, 3700560, 3692988, 3703323, 3730870, 3740155, 3726593, 3730298, 3734802, 3734033, 3758914, 3770112, 3768677, 3780910, 3803455, 3801671, 3810118, 3817315, 3828267, 3827234, 3833890, 3845092, 3849684, 3858228, 3872490, 3887963, 3893525, 3896168, 3906514, 3914579, 3935743, 3949671, 3949261, 3959348, 3969989, 3976842, 3989836, 3993813, 3992794, 4017050, 4025158, 4032472, 4039792, 4050061, 4065410, 4069508, 4081526, 4107690, 4112324, 4110496, 4113260, 4115204, 4113129, 4117726, 4132674, 4159752, 4166951, 4175694, 4197880, 4206107, 4223220, 4235385, 4232814, 4232546, 4231357, 4241567, 4245053, 4262281, 4284397, 4296328, 4313741, 4318953, 4329057, 4348973, 4358501, 4361976, 4374435, 4393280, 4406890, 4428487, 4439414, 4448366, 4452135, 4451328, 4458997, 4471695, 4478798, 4485231, 4495368, 4496463]
13358D496463R420K3034J0701R94J673K0098J3896K9628J4861J6339J7298J6083
13346D670488J6445K4619J5487K688P120M113J2905K9556J4398L448J4643K3765
13334D839675K4969P106J6581J9045J313O950J7542Q328O715J4353K0794J1088
13322D994459K0188J0362K0901R428J2974M1803M6811K6011N636J1916J3424R565
13310E223478J5592J4491O668K2799L0474J4277J3787L6400L3827R010J2819J6465
13298E450087K3739L4223L5121K5957Q915J7312L400J32K4523K2283L2015J8050
13286E695757J1784Q552L0832K3122K1464L1929M2229K4771K729K3037L3686J8916
13274E968808J5878K3635K5350K5835K3989K6709L6173K5500K5504M1650L4626
$$ y = [4496463, 4505883, 4528917, 4539618, 4540612, 4542285, 4562383, 4576279, 4605907, 4620768, 4637107, 4654405, 4670488, 4686933, 4711552, 4727039, 4729727, 4736847, 4740960, 4753865, 4783421, 4797819, 4801267, 4815910, 4839675, 4864644, 4871750, 4888331, 4907376, 4908689, 4915639, 4933181, 4941509, 4948224, 4962577, 4983371, 4994459, 5014647, 5025009, 5045910, 5055338, 5068312, 5110115, 5156926, 5182937, 5188573, 5200489, 5213913, 5223478, 5239070, 5253561, 5260229, 5283028, 5313502, 5327779, 5341566, 5377966, 5411793, 5420803, 5433622, 5450087, 5473826, 5508049, 5543170, 5569127, 5578042, 5595354, 5598754, 5598886, 5623409, 5645692, 5677707, 5695757, 5707541, 5716093, 5746925, 5770047, 5791511, 5823440, 5865669, 5890440, 5893169, 5916206, 5949892, 5968808, 5984686, 6008321, 6033671, 6059506, 6083495, 6110204, 6146377, 6171877, 6197381, 6239031, 6273657]
13263F273657M5473L9260K4609L6244L0748L2310J5141J8119K4961L2675K9254
13252F602451L7998M3734L8259K5911L4656M7647M4564L9480L1073K6485L4349
13241G006607M0458L3775L9237L3513L3265M5895K7927K9842N3116O1193O2819
13230G467647M7280M1374N3946N3806M1802M8873N1122O0384O6815N6840O4842
13219H054731O7022O2222N0171N4725O9891P4031O5014O0779O6203O7199N9561
13208H751549N9307O8883P8154Q7256Q6426Q8994Q4342Q4033P6015Q2315J01884
13197I649158R6596R3501J09402J14856J12823J16280J41138J30120J17332J30046
13187A0811252J33428J32503J20978J34821J66868J69678J71070J66217J78520
$$ y = [6273657, 6319130, 6358390, 6382999, 6419243, 6449991, 6482301, 6497442, 6515561, 6540522, 6573197, 6602451, 6640449, 6684183, 6722442, 6748353, 6783009, 6830656, 6875220, 6914700, 6945773, 6972258, 7006607, 7047065, 7080840, 7120077, 7153590, 7186855, 7232750, 7260677, 7290519, 7343635, 7404828, 7467647, 7514927, 7556301, 7610247, 7664053, 7705855, 7754728, 7805850, 7866234, 7933049, 7989889, 8054731, 8121753, 8183975, 8234146, 8288871, 8358762, 8432793, 8497807, 8558586, 8624789, 8691988, 8751549, 8810856, 8879739, 8957893, 9045149, 9131575, 9220569, 9304911, 9388944, 9464959, 9547274, 9649158, 9745754, 9839255, 9948657, 10063513, 10176336, 10292616, 10433754, 10563874, 10681206, 10811252, 10944680, 11077183, 11198161, 11332982, 11499850, 11669528, 11840598, 12006815, 12185335]
13178A2185335J97360K08822K06144K20599K27749K47687K40211K66250K83278
13169A4283435L04373L28842L37247L71227L95193M35623N02988N37942N67548
13160A8064418O33026O83743P69917Q73165R77074J108958J256807J476268J714368
13151B7557744J848429J688906R21192m17583k088343m129264o349525p602951
13143A1428605p008222n052949k166150L65080J526455J741837J619604J459880
13135C914140J324479J214096J145442J039732R80685R52028R14263Q91504R19190
13126A3295559R86186J112616J255384J370469J464219J580482J747426J969683
13118B4782024K250542K596780L034354L471039L690224L017380R34487k179956
$$ y = [12185335, 12382695, 12591517, 12797661, 13018260, 13246009, 13493696, 13733907, 14000157, 14283435, 14587808, 14916650, 15253897, 15625124, 16020317, 16455940, 16958928, 17496870, 18064418, 18697444, 19381187, 20151104, 21024269, 22001343, 23110301, 24367108, 25843376, 27557744, 29406173, 31095079, 32016271, 31598688, 29510345, 25381081, 19031556, 11428605, 4420383, -632566, -2798716, -2433636, -907181, 834656, 2454260, 3914140, 5238619, 6452715, 7598157, 8637889, 9618574, 10570602, 11484865, 12376369, 13295559, 14281745, 15394361, 16649745, 18020214, 19484433, 21064915, 22812341, 24782024, 27032566, 29629346, 32663700, 36134739, 39824963, 42842343, 43776830, 41596874]
13110D1596874n908359j0572508j5040255j6425081j4080232r280917k863676
13103c2574154J928644L507550L401706K934423K470319K105144J833758J629629
13095a2762981J469038J338046J228349J101339R92711R27101R28221R30033R52773
13086b895370R73569J014974J053650J139005J240598J384620J546748J762903
13078G220697J943829J886571J247305o1648j754098l839822o285869q059431
13070g702466p954541o312336l470537l51234J357860J770191J640949J410070
13062a9612044J207586J036134R01128Q03420P21927O50063N62225M93704M34914
13053a2800943L87326L59946L64815L67340L39726L28884K99952K79617K44851
$$ y = [41596874, 35688515, 25116007, 10075752, -6349329, -20429561, -29710478, -32574154, -30645510, -27137960, -23736254, -20801831, -18331512, -16226368, -14392610, -12762981, -11293943, -9955897, -8727548, -7626209, -6633498, -5706397, -4778176, -3848143, -2895370, -1921801, -906827, 146823, 1285828, 2526426, 3911046, 5457794, 7220697, 9164526, 11051097, 12298402, 12236754, 10482656, 6642834, 356965, -7702466, -15657007, -21969343, -25439880, -25791114, -24433254, -22663063, -21022114, -19612044, -18404458, -17368324, -16467196, -15663776, -14941849, -14291786, -13729561, -13235857, -12800943, -12413617, -12053671, -11688856, -11321516, -10981790, -10652906, -10352954, -10073337, -9828486]
13044i828486K36373K32890K04119J66519J62423J36569J14806J43027J56626
13035h275134J67765J68130J71423J62536J68854J60460J37053J32308J50166
13026f856439J50311J27797J09799J15928J05901J17811J23193J08664R9389J01782
13016e695864J12196J19583R6927R0353Q7634Q4628Q7665R3512R8282R1394Q6872
13005d646818Q6163Q9833R0203Q6870O3751P8128P5871O4675O8346O9210O7122
12994c806646O8531P4447P1416O0141O2523P2846O6848O2946N6693L8343N2647
12983c119265O4835N3101M5396M3465N8517O2080N4786O1242O0647O0269O3634
12972b491293O3978N6423N8242M6191N9506N5055N2115M4097M4000L6004N7189
$$ y = [-9828486, -9592113, -9359223, -9155104, -8988585, -8826162, -8689593, -8574787, -8431760, -8275134, -8107369, -7939239, -7767816, -7605280, -7436426, -7275966, -7138913, -7006605, -6856439, -6706128, -6578331, -6468532, -6352604, -6246703, -6128892, -6005699, -5897035, -5797646, -5695864, -5583668, -5464085, -5367158, -5276805, -5189171, -5104543, -5016878, -4923366, -4825084, -4733690, -4646818, -4560655, -4470822, -4380619, -4293749, -4229998, -4151870, -4075999, -4011324, -3942978, -3873768, -3806646, -3738115, -3663668, -3592252, -3532111, -3469588, -3396742, -3329894, -3266948, -3210255, -3171912, -3119265, -3054430, -3001329, -2955933, -2912468, -2853951, -2791871, -2737085, -2675843, -2615196, -2554927, -2491293, -2427315, -2370892, -2312650, -2266459, -2206953, -2151898, -2099783, -2055686, -2011686, -1975682, -1918493]
12961a918493N9873M4001M9342M9105M2540L6320M9287M3716K7775K5487L2646
12950a458401N2459N1834M2341J7507L2030K8180L3027N4325K8994L9895M8665
12939a029144M9170N0385L4244K8471L3800L4176L4517L1197M7504N9299L5145
12928e91236K6880J2648K6162M0764M0443L1337L2357L7145M3328L9696L3023
12917b27453L3789K5630K6845L8174L7700K3281L8304L6752L2648L4369L0236
12906A30275K1685K0359K6982M1163L2690L7517J8404J5287K6403L8642L3139
12895D42546M982J6516J8323M2072K8998L3357J9360L0094L6087L3194L3561K9945
12883G69035L4278K8027L9655K1526K2570J1635K3179J4746K0058L0971M1351
$$ y = [-1918493, -1858620, -1814619, -1765277, -1716172, -1673632, -1637312, -1588025, -1544309, -1516534, -1491047, -1458401, -1405942, -1354108, -1311767, -1294260, -1262230, -1234050, -1201023, -1146698, -1117704, -1077809, -1029144, -979974, -929589, -895345, -866874, -833074, -798898, -764381, -733184, -685680, -626381, -591236, -564356, -551708, -525546, -484782, -444339, -413002, -380645, -343500, -300172, -260476, -227453, -193664, -168034, -141189, -103015, -65315, -42034, -3730, 33022, 65670, 100039, 130275, 151960, 172319, 199301, 240464, 273154, 310671, 329075, 344362, 370765, 409407, 442546, 447528, 464044, 482367, 524439, 553437, 586794, 606154, 636248, 672335, 705529, 739090, 769035, 803313, 831340, 870995, 892521, 915091, 926726, 949905, 964651, 984709, 1015680, 1057031]
12872A057031L0805L6384M0854L6770L6368L0925J8542J4933L4840K5832L2946
12861A396230K8130J3135K2212L0807K3839K9183K1595L2344L0430K3123K1831
12850A672859L7210L3945K6777J4970K1316M1508M0497L7358M1869L5368J6242
12839B019919J5794L2328L0897K5441M6600L9542L4385L0862K4177J4185L0070
12828B344200L1569K2846J9048J7371K7214L3760L2808J8432J4691K9050L1305
12817B622294K6475L1663K8589K7650K7384K6792L7443L1913L3701K1475L0867
12806B946246L6483K6571M0556L1199K9435K9821L7305L9654L9409L1726L1250
12795C319655M2375L2814K5034L2846K6000K1689K1825L8536N7716M2301L7404
$$ y = [1057031, 1087836, 1124220, 1165074, 1201844, 1238212, 1269137, 1287679, 1302612, 1337452, 1363284, 1396230, 1424360, 1437495, 1459707, 1490514, 1514353, 1543536, 1565131, 1597475, 1627905, 1651028, 1672859, 1710069, 1744014, 1770791, 1785761, 1807077, 1848585, 1889082, 1926440, 1968309, 2003677, 2019919, 2035713, 2068041, 2098938, 2124379, 2170979, 2210521, 2244906, 2275768, 2299945, 2314130, 2344200, 2375769, 2398615, 2417663, 2435034, 2462248, 2496008, 2528816, 2547248, 2561939, 2590989, 2622294, 2648769, 2680432, 2709021, 2736671, 2764055, 2790847, 2828290, 2860203, 2893904, 2915379, 2946246, 2982729, 3009300, 3049856, 3081055, 3110490, 3140311, 3177616, 3217270, 3256679, 3288405, 3319655, 3362030, 3394844, 3419878, 3452724, 3478724, 3500413, 3522238, 3560774, 3618490, 3660791, 3698195]
12784C698195L1463M3112M4575N2431M7352L6945K9321M1311M8323L2052J9961
12773D125041J4933K5149L0758L2147M1413N6774N4819N0584O1199N9776O5203
12762D617796O4181N3536O1302M7553N0226N1362M2642M2478M5939M9277N3087
12751E179379O9705O2887M3046M2635N2678N4172N1371N5227O6402P0850P0870
12740E819222O5092Q3982P1569N7633P2781P5838O3836P6657R5613Q8051P3759
12729F644033P8994P3356P6417P1733P4533Q5756Q9287Q5416Q8266J08008J04633
12718G580432J14603J16873J06457J13601J15748J38347J35317J30592J30978
12709H682948J40439J35367J31300J44527J53872J38802J52751J57069J55185
$$ y = [3698195, 3729658, 3772770, 3817345, 3869776, 3917128, 3954073, 3983394, 4024705, 4073028, 4105080, 4125041, 4139974, 4165123, 4195881, 4228028, 4269441, 4326215, 4381034, 4431618, 4492817, 4552593, 4617796, 4681977, 4735513, 4796815, 4844368, 4894594, 4945956, 4988598, 5031076, 5077015, 5126292, 5179379, 5249084, 5311971, 5355017, 5397652, 5450330, 5504502, 5555873, 5611100, 5677502, 5748352, 5819222, 5884314, 5968296, 6039865, 6097498, 6170279, 6246117, 6309953, 6386610, 6482223, 6570274, 6644033, 6723027, 6796383, 6872800, 6944533, 7019066, 7104822, 7194109, 7279525, 7367791, 7475799, 7580432, 7695035, 7811908, 7918365, 8031966, 8147714, 8286061, 8421378, 8551970, 8682948, 8823387, 8958754, 9090054, 9234581, 9388453, 9527255, 9680006, 9837075, 9992260]
12700I992260J72794J98424J79260J90441K28306K19456K16284K29869K38326
12691A1865420K50980K45072K46340K43605K47525K44859K60885K88841L05629
12682A4199156L10993L38051L87804L95170M00313M32658M64969M85880N25736
12673A7940730N50372N87711O40182O93860P27985P60896Q42525R07463R97324
12664B4649048J068706J151521J260644J364842J453722J561771J672448J822968
12656C6005670K008739K267537K642321L161350L771047M388491M816040M757085
12648F3818280L967016K140507r07075n082882r791466j4380434j7740440j9272772
12640B750734j8832963j6562065j2805445q116655l450769M09441K915495M099060
$$ y = [9992260, 10165054, 10363478, 10542738, 10733179, 10961485, 11180941, 11397225, 11627094, 11865420, 12116400, 12361472, 12607812, 12851417, 13098942, 13343801, 13604686, 13893527, 14199156, 14510149, 14848200, 15236004, 15631174, 16031487, 16464145, 16929114, 17414994, 17940730, 18491102, 19078813, 19718995, 20412855, 21140840, 21901736, 22744261, 23651724, 24649048, 25717754, 26869275, 28129919, 29494761, 30948483, 32510254, 34182702, 36005670, 38014409, 40281946, 42924267, 46085617, 49856664, 54245155, 59061195, 63818280, 67785296, 69925803, 69018728, 63935846, 54144380, 39763946, 22023506, 2750734, -16082229, -32644294, -45449739, -53566394, -57017163, -56607722, -53692227, -49593167]
12632d9593167M183709L727714L129101K601807K167434J802310J523772J329823
12624b9127497J201408J121112J028684R69689R28698Q36211P75280P28718O45192
12615b0892505N76605N39522N06332M78381M56178M21710M13360M04698L89394
12606a6706325L47238L40072L48688L41079L24176L33113L12908K94361K86755
12597a3777935K70328K55416K49739K40697K24322K29823K24333K23547K30697
12588a1629033K21579J83772J65288J49547J03903P0630P8291J31854J65389J53739
12578a0205041J45349J49901J53982J46859J31165J40649J47732J19782J15841
12569h953781J07847J12750J21847J12751J21601J17300J09836J11522J24142
$$ y = [-49593167, -45409458, -41681744, -38552643, -35950836, -33783402, -31981092, -30457320, -29127497, -27926089, -26804977, -25776293, -24806604, -23877906, -23041695, -22266415, -21537697, -20892505, -20315900, -19776378, -19270046, -18791665, -18335487, -17913777, -17500417, -17095719, -16706325, -16359087, -16019015, -15670327, -15329248, -15005072, -14671959, -14359051, -14064690, -13777935, -13507607, -13252191, -13002452, -12761755, -12537433, -12307610, -12083277, -11859730, -11629033, -11407454, -11223682, -11058394, -10908847, -10804944, -10734314, -10656023, -10524169, -10358780, -10205041, -10059692, -9909791, -9755809, -9608950, -9477785, -9337136, -9189404, -9069622, -8953781, -8845934, -8733184, -8611337, -8498586, -8376985, -8259685, -8149849, -8038327, -7914185]
12560g914185J07457J01337J06407R6717R4643J01713J15976R8809J25405J15260
12550f850461Q5598R7919J01718R0316P9403Q4625J01913R9123J05863J17549
12540e886434J18246J15153J02975J08772R2642N8082K1196k9188m7083p9440
12530e425079r6654r0482p0014l9673J3503M2481P3615Q1978R1687Q7664Q4308
12519e246666N6908N4949N6912N2211N3866M7149M7474O3294N7216N9603O9825
12508d627259O9111P0637P3319P2714P7943N0197M2453N2911O1966L0243L6642
12497c989123M5434L3237M7708N6075N8902M6938M3715M2958L9642L4650N5109
12486c484755M7632M6211L8378L8066L0108N3028O1831M5689K9450L3129N8342
$$ y = [-7914185, -7806728, -7705391, -7598984, -7502267, -7407624, -7305911, -7189935, -7091126, -6965721, -6850461, -6764863, -6666944, -6565226, -6474910, -6395507, -6310882, -6208969, -6109846, -6003983, -5886434, -5768188, -5653035, -5550060, -5441288, -5348646, -5290564, -5269368, -5298556, -5345639, -5425079, -5521733, -5612215, -5682229, -5721902, -5708399, -5665918, -5592303, -5510325, -5418638, -5330974, -5246666, -5189758, -5134809, -5077897, -5025686, -4971820, -4924671, -4877197, -4813903, -4756687, -4697084, -4627259, -4558148, -4487511, -4414192, -4341478, -4263535, -4213338, -4170885, -4117974, -4056008, -4025765, -3989123, -3943689, -3910452, -3862744, -3806669, -3747767, -3700829, -3657114, -3614156, -3574514, -3539864, -3484755, -3437123, -3390912, -3352534, -3314468, -3284360, -3231332, -3169501, -3123812, -3094362, -3061233, -3002891]
12475c002891L6233M0471M7067N6419K7619M6192M4082L9320M4892L2169L5824
12464b552603N1340L9886M1362M0223L7738M1226L8734L5490L7000L0052M6072
12453b113480M1568M2533L7793L3518K9192M6912L6255L4777L3742L6912M6229
12442a694049L7585L8429L1788L7413L5587M4140M1802M0303M3945N4466M5745
12431a242846O2525P7269N9012M6624M5663L6586L8206L7013L3608M3074N0999
12420g12267N6970O9743P7183Q1894O9862P2231O9812N7650N4195M2251M2678
12409a7798N4555P3485Q3714Q1539P0583O1356O2361J02883J21468J45890J43944
12398I83980J75037K01949K10601K22787K23114K29823K22567J66303K9933j82354
$$ y = [-3002891, -2966658, -2926187, -2879120, -2822701, -2795082, -2748890, -2704808, -2665488, -2620596, -2588427, -2552603, -2501263, -2461377, -2420015, -2379792, -2342054, -2300828, -2262094, -2226604, -2189604, -2159552, -2113480, -2071912, -2029379, -1991586, -1958068, -1928876, -1881964, -1845709, -1810932, -1777190, -1740278, -1694049, -1656464, -1618035, -1586247, -1548834, -1513247, -1469107, -1427305, -1387002, -1343057, -1288591, -1242846, -1180321, -1103052, -1044040, -997416, -951753, -915167, -876961, -839948, -806340, -763266, -712267, -655297, -585554, -508371, -426477, -356615, -284384, -214572, -156922, -102727, -60476, -17798, 36757, 110242, 193956, 275495, 346078, 407434, 469795, 572678, 694146, 840036, 983980, 1159017, 1360966, 1571567, 1794354, 2017468, 2247291, 2469858, 2636161, 2666094, 2483740]
12388B483740l87900n53768p56331p89091m30723j6643J80375K30453K14412J97396
12378C71920J85211J53266J48731J22192Q0322O4006J7429o588L1118R2764P3905
12367A334276p865o4406q0409q7841o9354K8634J60131K64807L58406M11293L90121
12356B637793L27425K06833k8983m31499q68236j272046j583499j657681j345049
12347d014942p82883l14410L0125K54737L29908L27389K88457K34499J57388P2200
12337c417532l2645j38444j83921j12507k0255K3398L0464L9166M5880O350l3628
12326c793674r188O7626J36928J86543J91965J98098J97168J88249J28794n1642
12316b559133k50527m06540o24700r09787q86259m61064q6494J15267K32348K60679
$$ y = [2483740, 2095840, 1542072, 785741, -3350, -434073, -450716, -270341, -39888, 174524, 371920, 557131, 710397, 859128, 981320, 1061642, 1125648, 1143077, 1136489, 1167607, 1260371, 1334276, 1326411, 1262005, 1181596, 1093755, 1024401, 1053035, 1213166, 1477973, 1836379, 2247672, 2637793, 2965218, 3172051, 3143068, 2711569, 1843333, 571287, -1012212, -2669893, -4014942, -4797825, -5112235, -5082110, -4827373, -4497465, -4170076, -3881619, -3647120, -3489732, -3417532, -3450177, -3588621, -3772542, -3885049, -3905304, -3881906, -3851442, -3812276, -3766396, -3760046, -3793674, -3802862, -3735236, -3598308, -3411765, -3219800, -3021702, -2824534, -2636285, -2507491, -2559133, -2809660, -3216200, -3840900, -4750687, -5636946, -6098010, -6184504, -6069237, -5836889, -5576210]
12306e576210K37730K06854J75702J48371J54436J40254J31431J05931Q9307P2586
12296d113608N7983M7658L6517L4310M3530M3630K8071L3272L0366K1886L0296
12285c706089N1604N3302M9993M1514M6356M8582M4713L7919M0260L5977K0802
12274c235067K7380L9839L1794L1342L8624L2385L7355L4921M8478N2997L6599
12263b823353L0446L3169J9693L3165K8998K1077K5406K1875J7495J8750J1698
12252b561581K6363L0777J4577J5872K0182J6854K0682L2641K5238K2319J4530
12241b321546J5413K0326Q162J0831K4134L6435L1338K9370M5063L4453J6327
12230b049694K1463K7911J9426K7666K3452J3464J3921J6448K4693M6008M2750
$$ y = [-5576210, -5338480, -5131626, -4955924, -4807553, -4653117, -4512863, -4381432, -4275501, -4186194, -4113608, -4055625, -4007967, -3971450, -3937140, -3893610, -3849980, -3821909, -3788637, -3758271, -3736385, -3706089, -3654485, -3601183, -3551190, -3509676, -3463320, -3414738, -3370025, -3332106, -3291846, -3255869, -3235067, -3207687, -3167848, -3136054, -3104712, -3066088, -3033703, -2996348, -2961427, -2912949, -2859952, -2823353, -2792907, -2759738, -2740045, -2706880, -2677882, -2656805, -2631399, -2609524, -2592029, -2573279, -2561581, -2535218, -2504441, -2489864, -2473992, -2453810, -2436956, -2416274, -2383633, -2358395, -2336076, -2321546, -2306133, -2285807, -2277645, -2266814, -2242680, -2206245, -2174907, -2145537, -2100474, -2066021, -2049694, -2028231, -2000320, -1980894, -1953228, -1929776, -1916312, -1902391, -1885943, -1861250, -1815242, -1772492]
12219a772492M1764K6631M0954O4244K4654K9876L1992J7763j7474k1866n4524
12208a588478o1837p7610r0988q3303o9454m8229j0320P178J9672M1948L0318
12197a931103J9760L2261L2600K8470J8660J8624K4225K0072K3778J6700K1887
12186a674066K9602O287K8965K2800N506M81J2484J6565M798L319J0913J1014
12174a521332K6475J7737J7739K7131K3546N266J0493j896J0411J6593J9778J4900
12162a333159N503L490J2106R293M606J968J5811L2748J9361J7977J5776J5542
12150a178978N219o885k816J1400J1262K1617J9417J7638j732r095J1196J2738
12138a089019J0471P442J6404J8624J4334r31O324J0238o744J2713P942J1669
$$ y = [-1772492, -1730728, -1704097, -1663143, -1598899, -1574245, -1544369, -1512377, -1494614, -1512088, -1533954, -1588478, -1650315, -1727925, -1818913, -1902216, -1971670, -2019899, -2030219, -2023041, -2003369, -1961421, -1931103, -1911343, -1879082, -1846482, -1818012, -1799352, -1780728, -1756503, -1736431, -1712653, -1695953, -1674066, -1644464, -1638177, -1609212, -1586412, -1580906, -1580425, -1567941, -1551376, -1546578, -1543259, -1532346, -1521332, -1494857, -1477120, -1459381, -1432250, -1408704, -1403438, -1392945, -1394841, -1384430, -1367837, -1348059, -1333159, -1327656, -1324166, -1312060, -1302767, -1298161, -1296193, -1280382, -1247634, -1228273, -1210296, -1194520, -1178978, -1173759, -1180644, -1183460, -1172060, -1160798, -1139181, -1119764, -1102126, -1103858, -1112953, -1101757, -1089019, -1078548, -1071106, -1054702, -1036078, -1021744, -1022675, -1016351, -1006113, -1012857, -1000144, -992202, -980533]
12126i80533J0649J1455J5551m727k129J6798Q885J8447Q417J1334O24L664R917
12113h71648J1972J4657J1337K307n756j0356J0171K1966J6750J6679o159L89
12101g87691J1494J6278Q943K493M332O507J3676J8296N561J5838J2226l571M554
12088f71064m420J1095L968R355J4750Q409J8912j2686j196Q158J1799l390J7471
12075e88839J3274o373r335N421K6271l873K514J6052N686k285M582J9153J6910
12062e00842L617M926K867K0880K871M27J6812N501J070L853K76m997J5611L371
12048d23757l388J3406J2013k336l666P698Q418J3175Q583J0516J3221J2547P153
12035c26417L609k594q922P482J7039P300j1816L611J6170J7990M275K719Q378
$$ y = [-980533, -969884, -958429, -942878, -947605, -949734, -932936, -924051, -905604, -897187, -885853, -885229, -881565, -871648, -859676, -845019, -833682, -831375, -837131, -847487, -837316, -815350, -798600, -781921, -788080, -787691, -776197, -759919, -750976, -748483, -744151, -737644, -723968, -705672, -700111, -684273, -672047, -675618, -671064, -675484, -664389, -660421, -651066, -636316, -627907, -608995, -621681, -622877, -614719, -602920, -606310, -588839, -575565, -581938, -591273, -585852, -559581, -563454, -560940, -544888, -539202, -541487, -536905, -517752, -500842, -497225, -492299, -489432, -468552, -465681, -465254, -448442, -442941, -441871, -438018, -437742, -442739, -427128, -423757, -427145, -413739, -401726, -404062, -407728, -400030, -391612, -378437, -369854, -359338, -346117, -333570, -326417, -322808, -325402, -334324, -326842, -309803, -302503, -314319, -310708, -294538, -276548, -272273, -269554, -261176]
12022b61176P7N370K527K700P557J5585Q422J1053M822L380K0446J3933P63o142
12008a70683K365O422q914n314J3627N525J2372P536o601J2046K044k700n183
11995a37458R759J0350M554J1721M338J2701J9048k880q976j1944J2106J5088
11983f1593Q674k922P933J8406K952n890m030L492J3659q41J1099Q543m496j790
11969f804K0917J9821L046m465R588K067l46R914K1171J4444k290l124P678K1342
11955A12959j6806l917Q50L139l750Q526J5333J4602P649N734r984L053L85J51
11941A37924K14P651J2143Q339o79q816L218J2942K1043o442o529k453J1393O654
11927A96602K415J0846Q638o12M194K030J4286r098L150J1213K893M681J0700
$$ y = [-261176, -261099, -255729, -253202, -250502, -242945, -227360, -218938, -207885, -203063, -199683, -179237, -165304, -164541, -170683, -168318, -161896, -170810, -176124, -162497, -156972, -144600, -137064, -143665, -131619, -129575, -132275, -137458, -127699, -117349, -112795, -101074, -96736, -84035, -64987, -67867, -76843, -88787, -76681, -61593, -52919, -55841, -47908, -29502, -26550, -32440, -36470, -32978, -19319, -20160, -9061, -518, -5014, -6804, 14113, 33934, 36980, 32515, 42103, 44170, 43824, 53738, 74909, 89353, 87063, 83939, 91617, 112959, 96153, 92236, 93086, 96225, 92475, 101001, 116334, 130936, 138585, 144319, 134335, 137388, 137773, 137924, 138138, 145789, 157932, 166271, 165592, 156776, 159994, 172936, 193979, 187537, 181008, 178555, 189948, 196602, 199017, 209863, 218501, 217889, 222083, 224113, 238399, 229301, 232451, 243664, 246557, 251238, 261938]
11914B61938R447M452l173J0640J2547k83P900l842k351m088j281J785M648J457
11900B99796M084r231n126J1300P270Q609Q407k085l79K796r436J0686K673J1254
11886C40618L205R34n431P730K1586K8937L804j1929q49Q209J1278R360N880m144
11872D19188P051j924P546Q315k956J1218O272o471j901K251j217J191k83J3453
11858D61733q221O340J5105K0638M781p277j9513m044L0486K1537N299P670k827
11845E31707J2550J0914k955n448Q093J1847M988L145N950l057r428K241P114
11832E77661m253J5029M089K185M665m802p80J5773J3898R803J0752k929n047
11819F36044J2501J3456J158r326r652J107J5895P865l558j1701J2680N15J176
$$ y = [261938, 271385, 275837, 272664, 283304, 295851, 295568, 303468, 299626, 297275, 293187, 291906, 293691, 298339, 299796, 303880, 294649, 289523, 300823, 308093, 316702, 325109, 323024, 322645, 325441, 316005, 326691, 329364, 340618, 343823, 344757, 339326, 347056, 368642, 397579, 401383, 389454, 388605, 396814, 408092, 417452, 423332, 419188, 426239, 424315, 431861, 440176, 437220, 448438, 454710, 448239, 446338, 448589, 447372, 448563, 448280, 461733, 453512, 459852, 474957, 495595, 500376, 493099, 473586, 469542, 500028, 521565, 526864, 534534, 531707, 544257, 555171, 552216, 546768, 554861, 566708, 571696, 574841, 580791, 577734, 568306, 570547, 577661, 573408, 588437, 592526, 594711, 599376, 594574, 593794, 609567, 623465, 633268, 644020, 641091, 636044, 648545, 662001, 663159, 653833, 644181, 645288, 661183, 669048, 665490, 653789, 666469, 666984, 668160]
11806F68160O906m5M67M584J0416J0034J2749Q146j766M469K115J4417k646n578
11792G32428N158J0997N053k178J085J4931N830m039j587J7984J3576R984l087
11779H06135n043N394Q261L905R897o660k133P801J8474k034p349O126J56P558
11765H50488O954P452M569Q536n545Q65Q946J4048K149n820p707n308J1865o536
11751H84956k662K016K6500K3433J4191Q213j1562O041J119R02j84M461P984J1922
11737I77330K534l313J1445N828n946k523O17j117N613L029J9454O298l584L407
11723A019072o31m120O459J9795J7418k81o135L369P122P321R026Q94R23J078
11709A081310k514J1223P888P308M68l27j6101J4527J9362R609p93l795j3399
$$ y = [668160, 675066, 675021, 675488, 680072, 690488, 700522, 713271, 721417, 719651, 724120, 726235, 740652, 738006, 732428, 737586, 748583, 753636, 751458, 752543, 767474, 773304, 769265, 767678, 785662, 799238, 809222, 806135, 801092, 806486, 814747, 818652, 828549, 821889, 819756, 827557, 846031, 843997, 836648, 842774, 842930, 850488, 857442, 864894, 869463, 877999, 872454, 873319, 882265, 896313, 898462, 892642, 884935, 879627, 891492, 884956, 882294, 884310, 910810, 934243, 948434, 956647, 945085, 951126, 952245, 953147, 952963, 957424, 965408, 977330, 979864, 976551, 987996, 993824, 987878, 985355, 985972, 984855, 990468, 993497, 1012951, 1019249, 1015665, 1019072, 1018441, 1014321, 1020780, 1040575, 1057993, 1057712, 1051577, 1054946, 1062068, 1069389, 1078415, 1079309, 1080232, 1081310, 1078796, 1090019, 1097907, 1105215, 1105683, 1105356, 1089255, 1103782, 1123144, 1132753, 1131960, 1128165, 1114766]
11696A114766M978J4984J0061L349jN202J801J2625J3554O807q439O80O627J15
11682A187109P86J0719P657j5339r320M521J8064L1362J6545n495P467j2146j0406
11669A231524J2635J7327Q47o469P067N637M32J9660J2535k794k870K5J035O00
11655A297191L405R006k592M587L549J0907J8139n049m384P798L964J267J1048
11642A358836k150j396J410M120m993J9120J6283O368j769K822n940j180L222
11629A394753Q642J1566O623J8382p232l704O972L276r511P389J4767J4898L518
11616A470339O13P208J2291M41l64p489Q129k917N085Q605J6743N747J1346J4082
11602A549859O585j1420j6822j031J0780K969M874J860L62Q949J804L075L486
$$ y = [1114766, 1119744, 1134728, 1144789, 1148138, 1148137, 1153339, 1155140, 1167765, 1181319, 1188126, 1179687, 1180367, 1186994, 1187109, 1187895, 1198614, 1206271, 1190932, 1181612, 1186133, 1204197, 1235559, 1252104, 1246609, 1254076, 1241930, 1231524, 1244159, 1261486, 1262333, 1255864, 1262931, 1268568, 1269000, 1288660, 1301195, 1298401, 1295531, 1295556, 1296591, 1297191, 1300596, 1309602, 1307010, 1311597, 1315146, 1326053, 1344192, 1339143, 1334759, 1342557, 1346521, 1347788, 1358836, 1356686, 1355290, 1356700, 1360820, 1355827, 1374947, 1391230, 1397598, 1395829, 1398651, 1392711, 1391531, 1394753, 1403395, 1414961, 1421584, 1439966, 1432734, 1429030, 1436002, 1439278, 1429767, 1437156, 1451923, 1466821, 1470339, 1470952, 1478160, 1490451, 1490892, 1490528, 1483039, 1491168, 1488251, 1493336, 1501941, 1518684, 1524431, 1535777, 1549859, 1556444, 1545024, 1528202, 1527171, 1537951, 1540920, 1545794, 1547654, 1548016, 1556965, 1558769, 1561844, 1565330]
11589A565330M848J3215Q167O478j006o489m192Q149k36K4011J2172P71l199k397
11575A625622l87J7727J1158m056J76P824m558k543P078J3683N891O468R367J2460
11561A705910Q647J3378q04K830n886M165J1360p035j9963r9N265J4262O833Q182
11547A747045R779J5329P246J3717L007j4514J2068K6064J6198r92q6k423L301
11534A835739N064l252K415L666M648O109O231j946L780Q3o10K503J4603N597
11520A884630p374l682J5726J3464r041Q747K481j1832R854N411L374N460J9482
11507A936700J7929O001J9866J7443k544J515J2875P886l970K425N188L263m686
11494B019891K6241k72j0980k019N306J0587J6021J7914N715n374Q435Q065l436
$$ y = [1565330, 1570178, 1583393, 1591560, 1598038, 1597032, 1590543, 1586351, 1594500, 1594264, 1618275, 1630447, 1631218, 1628019, 1625622, 1625235, 1642962, 1654120, 1650064, 1650240, 1658064, 1653506, 1650963, 1658041, 1671724, 1677615, 1684083, 1693450, 1705910, 1714557, 1727935, 1727131, 1729961, 1724075, 1728240, 1739600, 1732565, 1712602, 1712503, 1717768, 1732030, 1738863, 1747045, 1756824, 1772153, 1779399, 1793116, 1796123, 1781609, 1793677, 1819741, 1835939, 1834947, 1834861, 1832438, 1835739, 1840803, 1837551, 1839966, 1843632, 1848280, 1854389, 1860620, 1858674, 1862454, 1862537, 1861927, 1864430, 1879033, 1884630, 1877256, 1873574, 1889300, 1902764, 1893723, 1902470, 1904951, 1893119, 1902973, 1908384, 1911758, 1917218, 1936700, 1954629, 1960630, 1980496, 1997939, 1995395, 1996910, 2009785, 2017671, 2013701, 2016126, 2021314, 2024577, 2019891, 2046132, 2045860, 2034880, 2032861, 2038167, 2048754, 2064775, 2082689, 2088404, 2083030, 2091465, 2099530, 2096094]
11481B096094N198J4090L363M51R362r37J0664J357J1959M876j4441J633J1242
11468B154911J8390K726J679r283J0566J286J1920L954Q460J3744J0300J5773
11456B244426p618P326J3374J4431K0705L326q563O524J0922K157J9243J5931
11444B342184O657Q61J3098k08M653J6541J609n03M514O505P725J3683J2072O125
11430B435516L126J2207K1562K8535J863K485R700K1240Q123o092o068k6405k9266
11417B476526l2418k8309j1952O022P976O366j048Q364L5521J7439K143K6072
11405B512702K1420J7723K1207J4241O184O524P186J4810J6717N996K4266K5307
11393B694283K4194J4896j4354K0126L0518J5946J5593O536k966k3944m3964o1588
$$ y = [2096094, 2101292, 2115382, 2118745, 2119196, 2128558, 2127621, 2138285, 2139642, 2151601, 2156477, 2142036, 2143669, 2154911, 2173301, 2176027, 2177706, 2168423, 2178989, 2180275, 2192195, 2196149, 2204609, 2218353, 2228653, 2244426, 2236808, 2244134, 2257508, 2271939, 2292644, 2295970, 2287407, 2293931, 2304853, 2307010, 2326253, 2342184, 2348841, 2349702, 2362800, 2362592, 2367245, 2383786, 2385395, 2384892, 2389406, 2395911, 2403636, 2417319, 2429391, 2435516, 2438642, 2450849, 2472411, 2500946, 2502809, 2505294, 2514994, 2536234, 2544357, 2538265, 2532197, 2505792, 2476526, 2444108, 2415799, 2403847, 2409869, 2417845, 2424211, 2423163, 2431527, 2467048, 2484487, 2486630, 2512702, 2534122, 2551845, 2573052, 2587293, 2593477, 2600001, 2607187, 2621997, 2638714, 2644710, 2668976, 2694283, 2718477, 2733373, 2719019, 2739145, 2769663, 2785609, 2801202, 2807738, 2804772, 2780828, 2736864, 2675276]
11381B675276p1711n9634l5131r2K6576L213J752J7762K9924K1549J1941J5278
11369B636703J3863J2152J5547J188P607K7800K5797J6808O283j023o46M510J0480
11356B777069J6577J2246L586J1739Q822J1779J3277J7203J157k1155k1032k2205
11344B809063k5536j4055j2333O979R286J1985J4537J0727K6801K2473J8162P674
11332B885763J1239J5034J6712J6888K8448j745J0J3194R939j049o979j1481L864
11319B979837P774K0877R890J3506J0793p28J2216J4897k631J0668J579L371J6381
11306C098430L4055K0684J8422j3889O980K439Q06J3301J070K7850K2215K758
11294C235121l591Q667J0821L874J6708K0403J1608j158J5635P915J5091J7635
$$ y = [2675276, 2603565, 2543931, 2508800, 2508708, 2535284, 2538497, 2540249, 2558011, 2587935, 2609484, 2621425, 2636703, 2650566, 2662718, 2678265, 2679453, 2687060, 2714860, 2740657, 2757465, 2763748, 2762725, 2762079, 2766589, 2777069, 2793646, 2805892, 2809478, 2821217, 2830039, 2841818, 2855095, 2872298, 2873455, 2852300, 2831268, 2809063, 2783527, 2769472, 2757139, 2764118, 2773404, 2785389, 2799926, 2810653, 2837454, 2859927, 2878089, 2885763, 2897002, 2912036, 2928748, 2945636, 2974084, 2972339, 2972349, 2985543, 2995482, 2994433, 2987454, 2975973, 2979837, 2987611, 3008488, 3018378, 3031884, 3042677, 3041949, 3054165, 3069062, 3066431, 3077099, 3078678, 3082049, 3098430, 3132485, 3153169, 3171591, 3157702, 3164682, 3167121, 3167927, 3181228, 3182298, 3210148, 3232363, 3235121, 3231530, 3240197, 3251018, 3254892, 3271600, 3292003, 3303611, 3302453, 3318088, 3326003, 3341094, 3358729]
11282C358729O19J938J4728K0808J4950J2017N869M248J177o13K0128J5780J2951
11269C483329L1976J4480N622J0790P073J2417J973K436J0354J7064K0458O739
11257C624711L853Q593K1643J0247k713M007J3947J6336J1613P393J1075J403
11245C732108O928J9499J5261J0158J4318J7495K3429J6831J5966J3323P439J3210
11233C905965P180J3159J6981J2547O835J3787L359M962K0876J7072Q715R520
11221D040958K4710J6278N225J9226P624O518J8645J0978P744J7583J7308J6571
11209D209368J0757N765K8732J8983J4023K1202J3693K4005J3149k304J0483K3258
11197D391114K4905J5569K9539J4979R943K6789J7941K605J0071o408N195J1336
$$ y = [3358729, 3359348, 3361286, 3376014, 3396822, 3411772, 3423789, 3429658, 3433906, 3435083, 3434470, 3454598, 3470378, 3483329, 3515305, 3529785, 3535407, 3546197, 3553270, 3565687, 3567660, 3570096, 3580450, 3597514, 3617972, 3624711, 3628564, 3637157, 3658800, 3669047, 3666334, 3670341, 3684288, 3700624, 3712237, 3719630, 3730705, 3732108, 3739036, 3758535, 3773796, 3783954, 3798272, 3815767, 3839196, 3856027, 3871993, 3885316, 3892755, 3905965, 3913145, 3926304, 3943285, 3955832, 3962667, 3976454, 3979813, 3984775, 4005651, 4022723, 4031438, 4040958, 4065668, 4081946, 4087171, 4106397, 4114021, 4120539, 4139184, 4150162, 4157906, 4175489, 4192797, 4209368, 4220125, 4225890, 4254622, 4273605, 4287628, 4308830, 4322523, 4346528, 4359677, 4357373, 4367856, 4391114, 4416019, 4431588, 4461127, 4476106, 4486049, 4512838, 4530779, 4533384, 4543455, 4537047, 4542242, 4553578]
11185D553578L0287L5930K2210K1126K1177Q370M081R748J3513K2333K6134J1569
11173D780056J2676L1245K4465K4033K4394J9972L3759L3571J0438L505J4595
11162E012709K2860K7650Q948K7150K8161L4845J5244K5211J8448K958J8321L9227
11150E281732L2064K2350J8997J9604J5998J1097J8671K7981L0423K5280K2962
11139E527159K3053K6550K1635K8631J2753J7195K9821K5617L0331L1485K1422
11128E795652K6406K5729L5348M9543N1996K2120O405K7445N9579M0958K8950
11117F170131K0673K4450L9274K8496L0914M2421M1583L3061L2255L0727L4970
11106F528955M1100L8297M2867M8271L9948L8778L4026N0002L3545K4629L4537
$$ y = [4553578, 4583865, 4619795, 4642005, 4663131, 4684308, 4692678, 4696759, 4706507, 4720020, 4742353, 4768487, 4780056, 4792732, 4823977, 4848442, 4872475, 4896869, 4916841, 4950600, 4984171, 4994609, 4998114, 5012709, 5035569, 5063219, 5072167, 5099317, 5127478, 5162323, 5177567, 5202778, 5221226, 5224184, 5242505, 5281732, 5313796, 5336146, 5355143, 5374747, 5390745, 5401842, 5420513, 5448494, 5478917, 5504197, 5527159, 5550212, 5576762, 5598397, 5627028, 5639781, 5656976, 5686797, 5712414, 5742745, 5774230, 5795652, 5822058, 5847787, 5883135, 5932678, 5984674, 6006794, 6013199, 6040644, 6100223, 6141181, 6170131, 6190804, 6215254, 6254528, 6283024, 6313938, 6356359, 6397942, 6431003, 6463258, 6493985, 6528955, 6570055, 6608352, 6651219, 6699490, 6739438, 6778216, 6812242, 6862244, 6895789, 6920418, 6954955]
11095F954955M2258K9567K4502N9108O0041N7466N5305N6817M7645M1808O9551
11084G499023N4618M4769N5027O0990O1093N9580N7063O1668P5037P8523O1330
11073H168721O3362N7967O3741P1277O0952O8389O7318Q2829Q7538P8311R6397
11062H966802P8717Q5404P9521R5066R1041Q8341Q6779R1381J08465J10405J05259
11051I987181J07953J20338J43314J45893J42582J31467J35607J36433J57009
11042A1207777J45532J51585J76135J85170J89179J96816K03533K04962K29328
11033A2890017K39163K46725K54394K66454K89252K95449L22270L43873L87276
11024A5534873M13153M29307M66947M96610N28674N81099O22728O82078P48910
$$ y = [6954955, 6997213, 7026780, 7051282, 7110390, 7170431, 7227897, 7283202, 7340019, 7387664, 7429472, 7499023, 7553641, 7598410, 7653437, 7714427, 7775520, 7835100, 7892163, 7953831, 8028868, 8107391, 8168721, 8232083, 8290050, 8353791, 8425068, 8486020, 8554409, 8621727, 8704556, 8792094, 8870405, 8966802, 9045519, 9130923, 9210444, 9305510, 9396551, 9484892, 9571671, 9663052, 9771517, 9881922, 9987181, 10095134, 10215472, 10358786, 10504679, 10647261, 10778728, 10914335, 11050768, 11207777, 11353309, 11504894, 11681029, 11866199, 12055378, 12252194, 12455727, 12660689, 12890017, 13129180, 13375905, 13630299, 13896753, 14186005, 14481454, 14803724, 15147597, 15534873, 15948026, 16377333, 16844280, 17340890, 17869564, 18450663, 19073391, 19755469, 20504379]
11015B0504379Q51163J038045J191924J391835J592548J769444J762151J392437
11007C1493926M71876r74657k777240m679942o314559p086294o464584m494425
10999h25899k003302L6958J201536J642328J678500J570358J414387J259962J144853
10990G119681J052616R79593R24994Q85518R10460R76430J064701J131225J209737
10981A6254955J277711J367766J489495J692210J974579K320222K722239L151360
10973C2250537L422137L166860K042313j97386l435503p244078j0968798j3761996
10965E274086j4296494j1794316p117201k324879J035449K627055L024401K845608
10957b0726291K482873K127047J814974J561455J349537J209158J086004R99252
$$ y = [20504379, 21355542, 22393587, 23585511, 24977346, 26569894, 28339338, 30101489, 31493926, 31965802, 30991145, 28213905, 23533963, 17219404, 10133110, 3668526, -825899, -2829201, -2792243, -1590707, 51621, 1730121, 3300479, 4714866, 5974828, 7119681, 8172297, 9151890, 10076884, 10962402, 11872862, 12849292, 13913993, 15045218, 16254955, 17532666, 18900432, 20389927, 22082137, 24056716, 26376938, 29099177, 32250537, 35672674, 38839534, 40881847, 40684461, 37248958, 30004880, 19036082, 5274086, -9022408, -20816724, -27933925, -30258804, -29223355, -26596300, -23571899, -20726291, -18243418, -16116371, -14301397, -12739942, -11390405, -10181247, -9095243, -8095991]
10949h095991R67496R44423R22096R08130Q77121Q83895Q99864R55866J040058
10940C02958J146185J275641J452054J593161J633546J381601O86664n43943k161132
10931F766735l920580n525030o505563o295471m757113k520462m48596Q51207
10923b2354873J404062J489753J337386J146846R96075Q52062P12827O20757N39327
10914a3255778M81509M53569M21039L87964L81472L60717L36101L11023K76467
10905i845917K37202K15464J89844J61338J44089J52931J73420J74835J80716
10896h216078J72580J84388J78828J68905J68008J55865J39412J48511J46474
10887f753107J38650J41349J39384J38206J17960J28066J30052J04008J01526
$$ y = [-8095991, -7128495, -6184072, -5261976, -4353846, -3476725, -2592830, -1692966, -737100, 302958, 1449143, 2724784, 4176838, 5769999, 7403545, 8785146, 9471810, 8927867, 6766735, 2846155, -2678875, -9184438, -15479909, -20237022, -22757484, -23206080, -22354873, -20950811, -19461058, -18123672, -16976826, -15980751, -15128689, -14415862, -13795105, -13255778, -12774269, -12320700, -11899661, -11511697, -11130225, -10769508, -10433407, -10122384, -9845917, -9608715, -9393251, -9203407, -9042069, -8897980, -8745049, -8571629, -8396794, -8216078, -8043498, -7859110, -7680282, -7511377, -7343369, -7187504, -7048092, -6899581, -6753107, -6614457, -6473108, -6333724, -6195518, -6077558, -5949492, -5819440, -5715432, -5613906]
10878e613906J20276J06010R9953J04996J03684J03507R7987J13048Q4316P6710
10868d603419P1586P2062Q5124R1653Q5515P8318R1709Q9972N7700O6238Q2130
10857c731412P5678Q0125Q7125O0919O6006O6647O9397O9795P7383O4412O4599
10846b949326N3775N1217O7328P2097N6188N0856M9543M5999N0762N5242N0008
10835b346311O3488N4572O2800P0754N7249O9268O9218M6755M9314M8213M2245
10824a712435M4231M8699L6972M6062N6257M5644L6222M9459O2300L6067L9937
10813a210585N2827L8654L6968M7401M9855K9433L4062L5889K6359K4172L2828
10802h02137M6165N6917M3389L4803M5521M4694L8751L5991M2143L0408L4899
$$ y = [-5613906, -5493630, -5387620, -5287667, -5182671, -5078987, -4975480, -4877493, -4764445, -4680129, -4603419, -4531833, -4459771, -4374647, -4282994, -4197479, -4119161, -4027452, -3937480, -3879780, -3813542, -3731412, -3655734, -3575609, -3488484, -3427565, -3361559, -3294912, -3225515, -3155720, -3078337, -3013925, -2949326, -2895551, -2844334, -2777006, -2704909, -2648721, -2597865, -2548322, -2502323, -2451561, -2396319, -2346311, -2282823, -2228251, -2165451, -2094697, -2037448, -1968180, -1898962, -1852207, -1802893, -1754680, -1712435, -1668204, -1619505, -1582533, -1536471, -1480214, -1434570, -1398348, -1348889, -1286589, -1250522, -1210585, -1157758, -1119104, -1082136, -1034735, -984880, -955447, -921385, -885496, -859137, -834965, -802137, -755972, -699055, -655666, -620863, -575342, -530648, -491897, -455906, -413763, -383355, -348456]
10791c48456M4965M0168L8047M0576M1964L6876M3862L5434L7560L1255L3951
10780G6202L4319L5729L5102K8333K2123L5009L5764M3153L4805K5452K5020K8440
10768D59451L4382L5038J5558K9558N6843O5772N0448L8764M2082M3149L7614
10757I08659L1560L3500L5095L5641O362K8439M5892K9596M0667M3517M3117M5988
10745A328033N3336M8311M1564M5199M4277L9299M4528M4064M9844N7578P3552
10734A869585O7624O7396Q4252R6912J12159J13076J18352J27000R0849K1521
10724B768726o0348j65622k43215k99896l38292l23117k68798j74539o8233K921
10714H29587M5765O9195R3956R3239Q8130R1329O6087N0418N4798O3603M0404
$$ y = [-348456, -303491, -263323, -225276, -184700, -142736, -105860, -61998, -26564, 10996, 42251, 76202, 110521, 146250, 181352, 209685, 231808, 266817, 302581, 345734, 380539, 405991, 431011, 459451, 493833, 528871, 544429, 573987, 630830, 696602, 747050, 785814, 827896, 871045, 908659, 940219, 973719, 1008814, 1044455, 1050817, 1079256, 1125148, 1154744, 1195411, 1238928, 1282045, 1328033, 1381369, 1429680, 1471244, 1516443, 1560720, 1600019, 1644547, 1688611, 1738455, 1796033, 1869585, 1937209, 2004605, 2088857, 2185769, 2297928, 2411004, 2529356, 2656356, 2747205, 2768726, 2708378, 2542756, 2299541, 1999645, 1661353, 1338236, 1069438, 894899, 826666, 829587, 875352, 944547, 1038503, 1131742, 1219872, 1311201, 1377288, 1427706, 1482504, 1546107, 1586511]
10703A586511L1879L9903M8960M1527M4712N2104M0906K1267K5721J7564L3822
10692A984876L3610L9275M2118L8333L9073J8966J2860L2816L6342L6532J8520
10681B333321K1555L2875J6796K9981K7711L0370L4483L8844L2111M692J9120
10670B621859K7905J7974K4925L9924K4679K3671K6500L9458K4760L3065L0072
10659B934792K2782K2938L6061K7416L1392L1964J6163K1370L7342K7917K5266
10648C235403O995J8878J4440Q902L0776K2046L4101M2029K7459L3264K5245J8219
10636C517757L6694L2237K3967K9536M1564M0704L4552K4064J8964L1965L5369
10625C867373K4357K0471J9974J9872J9098K5332L3478N2772M4961J7405M1210
$$ y = [1586511, 1618390, 1658293, 1707253, 1748780, 1793492, 1845596, 1886502, 1907769, 1933490, 1951054, 1984876, 2018486, 2057761, 2099879, 2138212, 2177285, 2196251, 2209111, 2241927, 2278269, 2314801, 2333321, 2354876, 2387751, 2404547, 2434528, 2462239, 2492609, 2527092, 2565936, 2598047, 2602739, 2621859, 2649764, 2667738, 2692663, 2732587, 2757266, 2780937, 2807437, 2846895, 2871655, 2904720, 2934792, 2957574, 2980512, 3016573, 3043989, 3075381, 3107345, 3123508, 3144878, 3182220, 3210137, 3235403, 3242398, 3261276, 3275716, 3284618, 3315394, 3337440, 3371541, 3413570, 3441029, 3474293, 3499538, 3517757, 3554451, 3586688, 3610655, 3640191, 3681755, 3722459, 3757011, 3781075, 3800039, 3832004, 3867373, 3891730, 3912201, 3932175, 3952047, 3971145, 3996477, 4029955, 4082727, 4127688, 4145093, 4186303]
10614D186303M7295M6011L7783K6081J8852K7616L2229J6597K6023K8843L5060
10603D528693K0044L2546M0916K8945K9199M4165M2791L8711M8742M0205M1196
10592D936153M1889M7581M3462M9824M9993M0217J8126N921k1557n5779p7224
10581E078606o5278j5788J8099L2286M7000M3343L6536N0143N7051L7689K9324
10570E349011M1706P4941P3980N7880N5698M3031L9259L8174L4190K8375J0643
10559E846888J1841P315L701J4810K7678N4140N2249O1158N1707M7226N0317L7044
10547F266074K5702J5254l266r514j5468k5801k2215J7542L9489M4707M8586M1403
10535F422493M1913M2476M7933N2936O3948P6308O8929O2168M8280M2894M9017
$$ y = [4186303, 4233598, 4279609, 4317392, 4343473, 4362325, 4389941, 4422170, 4438767, 4464790, 4493633, 4528693, 4548737, 4581283, 4622199, 4651144, 4680343, 4724508, 4767299, 4806010, 4854752, 4894957, 4936153, 4978042, 5025623, 5069085, 5118909, 5168902, 5209119, 5227245, 5233166, 5211609, 5155830, 5078606, 5013328, 4997540, 5015639, 5047925, 5094925, 5138268, 5174804, 5224947, 5281998, 5319687, 5349011, 5390717, 5465658, 5539638, 5597518, 5653216, 5696247, 5735506, 5773680, 5807870, 5836245, 5846888, 5858729, 5866044, 5869745, 5884555, 5912233, 5966373, 6018622, 6079780, 6131487, 6178713, 6229030, 6266074, 6291776, 6307030, 6303764, 6294250, 6278782, 6252981, 6230766, 6248308, 6287797, 6332504, 6381090, 6422493, 6464406, 6506882, 6554815, 6607751, 6671699, 6748007, 6816936, 6879104, 6927384, 6970278, 7019295]
10524G019295M9775M9979N3086K3656L1141M2780M3051L4210L9503M8088N5323
10513G489887N6526N9847N9606M0869K6301L1796K2525J9137L5626O0926O5272
10502G968318O1795O7770P7223N9366N2372M7383N4546P2255O8369R2041R7050
10491H718488R2781O6393M0983L4177L4993K7093M7283M8543M3233M9863L6587
10480I240417N6382L8931M5706N6533O0261O5253P6547P0914P4370Q5315P8386
10469I949015P6306N7998N3334N8333N2263M5077O3960R3701J03590Q4893Q6527
10458A0724997R6482R9170Q5967Q6297Q6027P4982P5957Q6462Q7846R1781R5222
10447A1691190R6941R3824R7941R0665J15642J13699R5966J04311J18525J13859
$$ y = [7019295, 7069070, 7119049, 7172135, 7195791, 7226932, 7269712, 7312763, 7346973, 7386476, 7434564, 7489887, 7546413, 7606260, 7665866, 7706735, 7733036, 7764832, 7787357, 7806494, 7842120, 7903046, 7968318, 8030113, 8097883, 8175106, 8234472, 8286844, 8334227, 8388773, 8461028, 8529397, 8621438, 8718488, 8811269, 8877662, 8918645, 8952822, 8987815, 9014908, 9062191, 9110734, 9153967, 9203830, 9240417, 9296799, 9335730, 9381436, 9437969, 9498230, 9563483, 9640030, 9710944, 9785314, 9870629, 9949015, 10025321, 10083319, 10136653, 10194986, 10247249, 10292326, 10356286, 10449987, 10553577, 10638470, 10724997, 10821479, 10920649, 11006616, 11092913, 11178940, 11253922, 11329879, 11416341, 11504187, 11595968, 11691190, 11788131, 11881955, 11979896, 12070561, 12186203, 12299902, 12395868, 12500179, 12618704, 12732563]
10437A2732563P6802N3876N8558N2343N7848P4709O6181P9551J08001J60212J98827
10426A3719471K09919J94659J57277J27250J23347J23223J40886J47403J30442
10417A5073877J42493J58241J71235J62652J58193J44069J37159J45159J45763
10408A6438841J42233J49825J45763J70848J93577J99562K00301K10461K29928
10399A8081339K23497K25778K28735K29973K46280K49197K58113K54855K69196
10390B0266963K99210L39359L53704K71322J23717L8264l0844k26892l63188j28479
10380B0943136K19353L90833M25636M15971M14609M36824M23271M20533M19603
10371B4509769M26574M31098M25514M00604L69592L89808M03086M24177M46654
$$ y = [12732563, 12809365, 12863241, 12921799, 12974142, 13031990, 13106699, 13172880, 13252431, 13360432, 13520644, 13719471, 13929390, 14124049, 14281326, 14408576, 14531923, 14655146, 14796032, 14943435, 15073877, 15216370, 15374611, 15545846, 15708498, 15866691, 16010760, 16147919, 16293078, 16438841, 16581074, 16730899, 16876662, 17047510, 17241087, 17440649, 17640950, 17851411, 18081339, 18304836, 18530614, 18759349, 18989322, 19235602, 19484799, 19742912, 19997767, 20266963, 20566173, 20905532, 21259236, 21530558, 21654275, 21692539, 21661695, 21434803, 21071615, 20943136, 21162489, 21553322, 21978958, 22394929, 22809538, 23246362, 23669633, 24090166, 24509769, 24936343, 25367441, 25792955, 26193559, 26563151, 26952959, 27356045, 27780222, 28226876]
10362B8226876M88335N05063N25970N91887O24323O14959O09403O17491O34947
10353C3439254O58916O95877P40095P79506Q16567Q50743Q85882Q91760Q92971
10344D0651571R20548R82393J039615J091288J139562J205277J300678J419093
10336D9750025J509095J579113J649198J779539J882842J989397K080341K248841
10328F4468391K464282K674043K885053L119180L366790L591051L775022L971954
10320I0315766M297708M709857N167558N794445O894452Q451881J0218418J2215295
10312A48065380J4682671J7825109K1686056K5591627K6493578J8095033l714409
10305B68725045l1829773n5988871q2591267j14494287j22989363q1786844k2480535
$$ y = [28226876, 28715211, 29220274, 29746244, 30338131, 30962454, 31577413, 32186816, 32804307, 33439254, 34098170, 34794047, 35534142, 36313648, 37130215, 37980958, 38866840, 39758600, 40651571, 41572119, 42554512, 43594127, 44685415, 45824977, 47030254, 48330932, 49750025, 51259120, 52838233, 54487431, 56266970, 58149812, 60139209, 62219550, 64468391, 66932673, 69606716, 72491769, 75610949, 78977739, 82568790, 86343812, 90315766, 94613474, 99323331, 104490889, 110285334, 117179786, 125631667, 135850085, 148065380, 162748051, 180573160, 202259216, 227850843, 254344421, 272439454, 268725045, 236895272, 180906401, 98315134, -16179153, -139168516, -220955360, -243435895]
10298b43435895J4007034K3865994K2159230J8526078J5500031J3135189J1148545
10291a25093794R429476P966807O728240N591469M578108L651991K915348K599037
10283h1633318K617628K696128K700183K582094K380299K178359K003326J856891
10275f2618410J732732J585698J440926J302521J208169J117471J068888J068308
10267e2093697J044633J009025R77342R56324R66912R66275R19586R02063Q38686
10258d3512851P62433O73978O03164N63266N69339O25167O45237O33375O36181
10249c7800711N83380N30206M47506L78033L44197L82681M45434M77414M76439
10240c3735421M49609M11405M07108M19253M03890L90963L79241L55385L33837
$$ y = [-243435895, -229428861, -205562867, -183403637, -164877559, -149377528, -136242339, -125093794, -115664318, -107697511, -100969271, -95377802, -90799694, -87147703, -84232355, -81633318, -79015690, -76319562, -73619379, -71037285, -68656986, -66478627, -64475301, -62618410, -60885678, -59299980, -57859054, -56556533, -55348364, -54230893, -53162005, -52093697, -51049064, -50040039, -49062697, -48106373, -47139461, -46173186, -45253600, -44351537, -43512851, -42750418, -42076440, -41473276, -40910010, -40340671, -39715504, -39070267, -38436892, -37800711, -37217331, -36687125, -36239619, -35861586, -35517389, -35134708, -34689274, -34211860, -33735421, -33285812, -32874407, -32467299, -32048046, -31644156, -31253193, -30873952, -30518567, -30184730]
10231c0184730L33510L44445L29236L26137L14686L09723L13501L23453L19188
10222b7270851L25668L01333K87057K79161K64437K48909K54324K78663K79151
10213b4752148K69763K47148K37550K40686K43083K41277K32373K25014K15156
10204b2600098J92602K00728J95421K03562K25945K10195K10388K19878K21890
10195b0719489K04952J89833J93295K20221J91248J79148J75128J90762K01929
10186a8972973K14728K04863J95960J45320J02527P1122R282o5902r4287l9850
10176a8229210L0769P7474J18959J47799J87885K05651J94956K01669J89914J70910
10166a6703224J55165J40902J44529J35346J00436J07927J25722J04877J05367
$$ y = [-30184730, -29851220, -29506775, -29177539, -28851402, -28536716, -28226993, -27913492, -27590039, -27270851, -26945183, -26643850, -26356793, -26077632, -25813195, -25564286, -25309962, -25031299, -24752148, -24482385, -24235237, -23997687, -23757001, -23513918, -23272641, -23040268, -22815254, -22600098, -22407496, -22206768, -22011347, -21807785, -21581840, -21371645, -21161257, -20941379, -20719489, -20514537, -20324704, -20131409, -19911188, -19719940, -19540792, -19365664, -19174902, -18972973, -18758245, -18553382, -18357422, -18212102, -18109575, -18038453, -18029171, -18095073, -18189360, -18229210, -18198441, -18120967, -18002008, -17854209, -17666324, -17460673, -17265717, -17064048, -16874134, -16703224, -16548059, -16407157, -16262628, -16127282, -16026846, -15918919, -15793197, -15688320, -15582953]
10157a5582953J24173J12309J09259J05476J08798R9360J14160J12888Q6776P6388
10147a4533366P8112Q7495J00748Q6043P5040J05413J17083J06866R5733R8603
10137a3582230J04617J00893J08516R8062Q5641P8812N3594Q5313P2101P8083
10127a2716598Q6465Q2441P8909O9972O7793P6074Q5240R3567Q3803P0814Q4591
10116a1836929Q2610Q1950Q2130P5165N4766K7771L3314P8301Q2443P5837P9221
10105a1083421P2813N8901N0480M2670N5364L6905M4257O2701N2209M9558N7556
10094a0500007O0058N3886N9885N3113M7210N2931O2516N9181O2013P0928O9231
10083i849055P3298N5060N6689N6403O4070N3284L6981M0369M2604M7745N5936
$$ y = [-15582953, -15458780, -15346471, -15237212, -15131736, -15022938, -14923578, -14809418, -14696530, -14609754, -14533366, -14455254, -14367759, -14267011, -14180968, -14105928, -14000515, -13883432, -13776566, -13680833, -13582230, -13477613, -13376720, -13268204, -13170142, -13084501, -13005689, -12952095, -12866782, -12794681, -12716598, -12630133, -12547692, -12468783, -12398811, -12331018, -12254944, -12169704, -12076137, -11992334, -11921520, -11836929, -11754319, -11672369, -11590239, -11515074, -11460308, -11432537, -11399223, -11320922, -11238479, -11162642, -11083421, -11010608, -10951707, -10901227, -10858557, -10803193, -10766288, -10722031, -10659330, -10607121, -10557563, -10500007, -10439949, -10386063, -10326178, -10273065, -10225855, -10172924, -10110408, -10051227, -9989214, -9918286, -9849055, -9775757, -9720697, -9664008, -9607605, -9543535, -9490251, -9453270, -9412901, -9370297, -9322552, -9266616]
10072i266616M8765N9595N3494M7091M2433M8590O1561O5535L5429M2138L6794
10061h725191M0291K4406L3604N0797N1275M1300N1763N2366K4998J6484L8713
10050h299194L8688J6524J9498L4940M8732N1022M1273M7244M9858L3854L6461
10039g881100L4728L6720K2937J7836K2104L4554K5578M0432N0024M0961L8049
10028g517177N1269N1792J7795K0371L7130J6704K7338N1851L3854K6758K9797
10017g152518K4399M2108M2291L3922K9212J9368L2745K3969M8241L7581K9429
10006f789253K4106K5995K8189L2474L7667L6896L8493K3160L4688L6534K7883
9995f443168K2430L4564K9027K4903J9571J4679J0490J3544J1222Q472L5064L1501
$$ y = [-9266616, -9217851, -9158256, -9104762, -9057671, -9015238, -8966648, -8905087, -8839552, -8804123, -8761985, -8725191, -8684900, -8660494, -8626890, -8576093, -8524818, -8483518, -8431755, -8379389, -8354391, -8337907, -8299194, -8260506, -8243982, -8224484, -8189544, -8140812, -8089790, -8048517, -8001273, -7951415, -7917561, -7881100, -7846372, -7809652, -7786715, -7768879, -7746775, -7712221, -7686643, -7646211, -7596187, -7555226, -7517177, -7465908, -7414116, -7396321, -7375950, -7338820, -7322116, -7294778, -7242927, -7209073, -7182315, -7152518, -7128119, -7086011, -7043720, -7009798, -6980586, -6961218, -6928473, -6904504, -6856263, -6818682, -6789253, -6765147, -6739152, -6710963, -6678489, -6640822, -6603926, -6565433, -6542273, -6507585, -6471051, -6443168, -6420738, -6386174, -6357147, -6332244, -6312673, -6297994, -6287504, -6273960, -6262738, -6254266, -6219202, -6187701]
9983f187701J0188L1658L3150K0305K1414M2431L4123K6166K0385L6794J8804
9972e892283J3580P369J5924J1827K9559K7917K1307L3541M1469J9962J7556K3633
9960e628639L0182L1850L2943L4671L2712J3919K1383K8382K8684M3233K9082
9949e301598J2185J8520K2116J9530K2638L5080N0107L9226K0834R424J7865K4123
9937e009950K6300K7882J8395L0056K7956K8746J8509K1825L4775K7270K8214
9926d720022M4721L2371L5063K5488J5739Q054R480K0223L3837L3746L0657J4392
9914d416251M272J4153k683l920J9323K6506L7168M3482L1273K1303K0567L1234
9902d173573M1504L3019N0228M5063N2802M3340M3964N3965M8815M6452M4408
$$ y = [-6187701, -6177513, -6145855, -6112705, -6092400, -6070986, -6028555, -5994432, -5968266, -5947881, -5911087, -5892283, -5878703, -5871334, -5855410, -5843583, -5814024, -5786107, -5764800, -5731259, -5689790, -5669828, -5652272, -5628639, -5598457, -5566607, -5533664, -5498993, -5466281, -5452362, -5430979, -5402597, -5373913, -5330680, -5301598, -5289413, -5270893, -5248777, -5229247, -5206609, -5171529, -5121422, -5082196, -5061362, -5051938, -5034073, -5009950, -4983650, -4955768, -4937373, -4907317, -4879361, -4850615, -4832106, -4810281, -4775506, -4748236, -4720022, -4675301, -4642930, -4607867, -4582379, -4566640, -4558586, -4549106, -4528883, -4495046, -4461300, -4430643, -4416251, -4411979, -4397826, -4400509, -4404429, -4385106, -4358600, -4321432, -4277950, -4246677, -4225374, -4204807, -4173573, -4132069, -4099050, -4048822, -4003759, -3950957, -3907617, -3863653, -3809688, -3760873, -3714421, -3670013]
9891c670013P3818P1208O6706J04561J10856J08067J19722Q5802N2422j9366j29469
9880c025686k11341k92083l34473l40323k91136k24513j29898l1453L5524Q2810
9870d762572R9471Q9447P9333P9375Q7281P3728O7310O6424M9263N1812M2765
9859c976363M9810L9976L1291L9961N5624Q8844P9511P2778L5893J2378j384l3659
9847c505340q6312q6516J6849R6828J21820Q9934J526q5298j30542k37594l56330
9836d160975l32995j21135O1190J10770J04085R0797P2720N3222N3864N4939N0049
9825c963469M1096N5694N1376L9615K4185L3933L1083K9331J9889L6166K0650
9814c580451J9722Q440J8224J6820K4298K2479J6300L0816K2846L1425K9819n277
$$ y = [-3670013, -3596195, -3524987, -3458281, -3353720, -3242864, -3134797, -3015075, -2929273, -2876851, -2896217, -3025686, -3237027, -3529110, -3863583, -4203906, -4495042, -4719555, -4849453, -4880906, -4845382, -4762572, -4663101, -4573654, -4494321, -4414946, -4327665, -4253937, -4186627, -4120203, -4070940, -4019128, -3976363, -3926553, -3886577, -3855286, -3815325, -3759701, -3670857, -3591346, -3518568, -3482675, -3470297, -3471681, -3505340, -3591652, -3678168, -3661319, -3564491, -3442671, -3352737, -3351211, -3436509, -3567051, -3804645, -4160975, -4493970, -4615105, -4553915, -4443145, -4339060, -4248263, -4175543, -4122321, -4068457, -4013518, -3963469, -3922373, -3866679, -3815303, -3775688, -3751503, -3717570, -3686487, -3657156, -3637267, -3601101, -3580451, -3560729, -3552289, -3534065, -3517245, -3492947, -3470468, -3454168, -3423352, -3400506, -3369081, -3339262, -3344539]
9802c344539Q380J7939K3952J6471J5188O097J3065K5706J8146L3896R052n816
9790c162463N510K0090K9868K4658J9711J0675J3994P062R191K5734K8710J7250
9778b950010Q712J7379K5819P145P021J3814J7619K4561L2540K0282J0104P365
9766b757649J2291Q401K4880K2006R79M074o287Q301L4359K2850L395J1348K1908
9753b589144J1215J8813J3406K447J1498J2011R602R078J6466L7134K9372K3009
9741b395093J7883J6687J0843P925R425R179q758j951m276K3203L1457K0796L878
9728b258802O536P975K195R772K4778L2244L763J1838J4007Q750J9975O894J885
9715b108190J4060K7199J0103J0555P782K3194K3402J8599j433J5973L1098J6732
$$ y = [-3344539, -3336159, -3318220, -3294268, -3277797, -3262609, -3256512, -3243447, -3217741, -3199595, -3165699, -3156647, -3162463, -3156953, -3136863, -3106995, -3082337, -3062626, -3051951, -3037957, -3030895, -3021704, -2995970, -2967260, -2950010, -2941298, -2923919, -2898100, -2890955, -2883934, -2870120, -2852501, -2827940, -2795400, -2775118, -2765014, -2757649, -2745358, -2736957, -2712077, -2690071, -2689092, -2685018, -2691305, -2683004, -2648645, -2625795, -2622400, -2611052, -2589144, -2577929, -2559116, -2545710, -2543263, -2531765, -2519754, -2510152, -2501074, -2484608, -2447474, -2418102, -2395093, -2377210, -2360523, -2349680, -2341755, -2332330, -2323151, -2331909, -2333860, -2338136, -2314933, -2283476, -2262680, -2258802, -2252266, -2244291, -2242096, -2232324, -2207546, -2175302, -2171539, -2159701, -2145694, -2136944, -2116969, -2110075, -2108190, -2094130, -2066931, -2056828, -2046273, -2038491, -2015297, -1991895, -1973296, -1974729, -1958756, -1927658, -1910926]
9703a910926J1393Q997J3791J2107J6850J6191P513m851L034J4432J6113m99O815
9690a789040L669P488J1642J8867J3707J0010K5737K5273J8370J1779J7650K169
9678a622679K0510J9775J3228K815J197J5209K1970L0188J4873L555J3570N431
9666a460358J4138J7371K0405J3663R673J1805o20m263L634M011o443l059q789
9653a388832j8467l593J5845J4587J727K0257O556J1173J7894K0128K6459J7272
9641a258994K9579l637l764J7139K2841K3294K1828K3671J4536j0064l3118m7556
9629a204245n7065o9099l8453P383J1870J3872J6047J0044J7833Q963J0510L479
9617a268861j3437L092N40l967J0805J5022J0263L714L951M318P983N243k775
$$ y = [-1910926, -1899533, -1890536, -1876745, -1864638, -1847788, -1831597, -1824084, -1828935, -1825901, -1811469, -1795356, -1795855, -1789040, -1785371, -1777883, -1766241, -1747374, -1733667, -1723657, -1697920, -1672647, -1654277, -1642498, -1624848, -1622679, -1602169, -1582394, -1569166, -1566351, -1565154, -1549945, -1527975, -1497787, -1482914, -1479359, -1465789, -1460358, -1446220, -1428849, -1408444, -1394781, -1385108, -1373303, -1373923, -1378186, -1374552, -1370541, -1376984, -1380043, -1388832, -1407299, -1410892, -1395047, -1380460, -1378733, -1358476, -1351920, -1340747, -1322853, -1302725, -1276266, -1258994, -1229415, -1233052, -1236816, -1219677, -1196836, -1173542, -1151714, -1128043, -1113507, -1123571, -1156689, -1204245, -1261310, -1330409, -1368862, -1361479, -1349609, -1335737, -1319690, -1309646, -1291813, -1282850, -1272340, -1268861, -1282298, -1279206, -1278666, -1282633, -1271828, -1256806, -1246543, -1242829, -1238878, -1234560, -1226577, -1221334, -1224109]
9604a224109j103P147N622o067R085M315J874J923K848L108k0786j5643J8158
9591a213628J4167J1965k590M244k011j9111p584J1765l674m003l706R1q129j7212
9577a239416j0490p666j1888k1765k7036k7108k5387P206K3456J1111J3776j6684
9565a331891k1437k5642p60m067k5622j6198j2052l073j2555j534j2539j3908
9553a481278k05k5731j7558J8053q875k3254k8629k2658j6749q788m599k2417
9541a642688l9901l3745j6709j8517j8739j8668k4012k2588j6895q348r636k3226
9529a893672l8224j4486k1278k9125k2847o724j4203j9381l2999l2182j3480k3458
9517b162059m0705k5463j2903j9408k0180k6164k9716l4968k5863k3664l4037
$$ y = [-1224109, -1225212, -1218065, -1212443, -1218510, -1209425, -1205110, -1203236, -1201313, -1198465, -1195357, -1216143, -1231786, -1213628, -1199461, -1187496, -1190086, -1185842, -1187853, -1206964, -1214548, -1202783, -1206457, -1210460, -1214166, -1214075, -1222204, -1239416, -1249906, -1257572, -1269460, -1291225, -1318261, -1345369, -1370756, -1363550, -1340094, -1328983, -1315207, -1331891, -1353328, -1378970, -1379730, -1383797, -1409419, -1425617, -1437669, -1440742, -1453297, -1454831, -1467370, -1481278, -1481483, -1507214, -1524772, -1506719, -1515594, -1538848, -1567477, -1590135, -1606884, -1615672, -1620271, -1642688, -1682589, -1716334, -1733043, -1751560, -1770299, -1788967, -1812979, -1835567, -1852462, -1860810, -1870446, -1893672, -1931896, -1946382, -1967660, -1996785, -2019632, -2026356, -2040559, -2059940, -2092939, -2125121, -2138601, -2162059, -2202764, -2228227, -2241130, -2260538, -2280718, -2306882, -2336598, -2371566, -2397429, -2421093, -2455130]
9506b455130k8935k3335o316j3878l0722l8067m1142l0580r943k9070l9496l2777
9494b779391l9579k5962k6501m1947l7722l6712k1033M813k7062m0563l1470l5368
9482c138497l4799l8964m4935k7383k2795p713l4176l5757k7010k1049m2466k6476
9470c502020j5832q920k4614l3810k5584j2959k3640j0314l0277l6218k5103k6122
9458c775413k6581k2789k0571k2496j5416j6241j9748k1261k5458l2520l5871
9447d034365l8922k6751l3009k6641j8414k4492l2598k3209k3064k1671j5991
9436d319127k1109k7222m593m447j1928p716o040k078j1064j5006L657j0570l0555
9423d467798k2335j0074j2506J0141j0405p623k1309k3383j2613l641l337l1296
$$ y = [-2455130, -2484065, -2507400, -2513716, -2527594, -2558316, -2596383, -2637525, -2668105, -2678048, -2707118, -2746614, -2779391, -2818970, -2844932, -2871433, -2913380, -2951102, -2987814, -3008847, -3004034, -3031096, -3071659, -3103129, -3138497, -3173296, -3212260, -3257195, -3284578, -3307373, -3315086, -3349262, -3385019, -3412029, -3433078, -3475544, -3502020, -3517852, -3526772, -3551386, -3585196, -3610780, -3623739, -3647379, -3657693, -3687970, -3724188, -3749291, -3775413, -3801994, -3824783, -3845354, -3867850, -3883266, -3899507, -3919255, -3940516, -3965974, -3998494, -4034365, -4073287, -4100038, -4133047, -4159688, -4178102, -4202594, -4235192, -4258401, -4281465, -4303136, -4319127, -4340236, -4367458, -4372051, -4376498, -4388426, -4396142, -4402182, -4404260, -4415324, -4430330, -4426673, -4437243, -4467798, -4490133, -4500207, -4512713, -4502572, -4512977, -4520600, -4541909, -4565292, -4577905, -4581546, -4584883, -4616179]
9411d616179k4276j6974l6972m6493k4004r821q936k1134J781K2979j2277p122
9399d799428K064P503O921J2179j7194j3638L662L026j808n125O08O778P029J7431
9385d769992J8691j321q046M134R968P904L723j702j6124k0739k0001j3209L876
9372d802838P771j0033j4024L123P528j0974R709J0839J2882K1175J0706L14K294
9359d751528L832J038N543R874J2611R397J7275J6608K1009P779K0747L3484K6478
9346d565853K6820J9144J8283K1430Q491n19J5179r686j885J1054J0860J2750
9334d433932J169J340J5399L0521K3448R185O505P654j872K4465J6074J4079J2528
9321d273437K7089L0557K4071K8331J5612J1432J4660J8022L9086M2620L7421
$$ y = [-4616179, -4640455, -4657429, -4694401, -4740894, -4764898, -4774719, -4783655, -4804789, -4803008, -4780029, -4792306, -4799428, -4797364, -4789861, -4782940, -4770761, -4787955, -4801593, -4797931, -4794905, -4796713, -4801838, -4801230, -4794452, -4787423, -4769992, -4751301, -4752622, -4760668, -4756534, -4746566, -4738662, -4734939, -4736641, -4752765, -4773504, -4793505, -4806714, -4802838, -4795067, -4805100, -4819124, -4816001, -4808473, -4819447, -4809738, -4798899, -4786017, -4764842, -4754136, -4753822, -4751528, -4747696, -4746658, -4741115, -4731241, -4718630, -4709233, -4691958, -4675350, -4654341, -4646562, -4625815, -4592331, -4565853, -4539033, -4519889, -4501606, -4480176, -4471685, -4472204, -4457025, -4466711, -4468596, -4457542, -4446682, -4433932, -4432763, -4431423, -4416024, -4385503, -4362055, -4352870, -4346365, -4338711, -4340583, -4316118, -4300044, -4285965, -4273437, -4246348, -4215791, -4191720, -4163389, -4147777, -4136345, -4121685, -4103663, -4064577, -4021957, -3984536]
9310c984536M1421N3521N1389L5486K8879K4222o68k8742l5015l3368l4180k8153
9298c909744K1579M8167N4085O7079P2660O9502N8931M7891O1065P9439N8435
9287c270911N1544O7989O0940O3275N6782P5249Q9413J03231J12739J01832R9146
9276b388771J11783J21718J44451J66957K15661K36904K30261K26368K01814J08804
9266f24050n5891k51876m06846n40278p29953p70859m64461p7123J59163K82088
9256c480086L68268L95368L67389L67507L16161K10389R6496n9024k38941l45880
9246b002353l73752l63039k69449j19823P865L4975K9182R1538J88001K72750
9236b504105K94475L28684L95279M82146M80894L65691O0537m18735r36290j438139
$$ y = [-3984536, -3943115, -3889594, -3838205, -3802719, -3773840, -3749618, -3750286, -3779028, -3814043, -3847411, -3881591, -3909744, -3888165, -3839998, -3785913, -3718834, -3646174, -3576672, -3517741, -3469850, -3408785, -3329346, -3270911, -3219367, -3151378, -3090438, -3027163, -2970381, -2895132, -2805719, -2702488, -2589749, -2487917, -2388771, -2276988, -2155270, -2010819, -1843862, -1628201, -1391297, -1161036, -934668, -732854, -624050, -679941, -931817, -1338663, -1878941, -2608894, -3379753, -3844214, -3921337, -3762174, -3480086, -3111818, -2716450, -2349061, -1981554, -1665393, -1455004, -1358508, -1417532, -1656473, -2002353, -2376105, -2739144, -3008593, -3128416, -3120551, -3085576, -3056394, -2964856, -2776855, -2504105, -2209630, -1880946, -1485667, -1003521, -522627, -156936, -96399, -515134, -1451424, -2889563]
9226b889563j847467k037158j650418q13774p2218L31278M67687M62606M19048
9217g629979L42541K57878J88363J91444J96150J40374N2858n9626j53714k14611
9207f688322k88050m02909m70072m06006k30183j5296J91418L06825L38661L47637
9197g316297L37671L18243K78695J75038k300k48505m27098o00301p97383p63518
9187i045755l90733o8244P7551J14276J67797J95656J97730J67921J58762J27802
9177h297237J16666J26993J08850Q9742Q9705P3722N8363P1622P8298O2747O4081
9166g356448M5837N3090L5505L9791M4629N2036M8909N2711O0736N2085N2761
9155f818358M4762J5690M936P124p078k8990k8648j9482j1234K2514M0208L7342
$$ y = [-2889563, -4737030, -6774188, -8424606, -9238380, -9310598, -8979320, -8511633, -8049027, -7629979, -7287438, -7029560, -6841197, -6649753, -6453603, -6313229, -6260371, -6319997, -6473711, -6688322, -6976372, -7379281, -7849353, -8255359, -8485542, -8500838, -8309420, -8002595, -7663934, -7316297, -6978626, -6660383, -6381688, -6206650, -6208950, -6457455, -6884553, -7484854, -8282237, -9045755, -9436488, -9504732, -9427181, -9312905, -9145108, -8949452, -8751722, -8583801, -8425039, -8297237, -8180571, -8053578, -7944728, -7854986, -7765281, -7691559, -7633196, -7561574, -7483276, -7420529, -7356448, -7310611, -7257521, -7222016, -7182225, -7137596, -7085560, -7036651, -6983940, -6923204, -6871119, -6818358, -6773596, -6757906, -6752970, -6745846, -6752924, -6781914, -6810562, -6830044, -6841278, -6818764, -6778556, -6741214]
9143f741214M3586N5488K6480K5106L3097K7214K3365K7721L3333L4400L7653
9132f373771L1386K0616K5886K9988K2611J3505J9053L494K984J1803J6342J9977
9120f156126K3380K3131J5737K9400L0896N480K156K6865K9641K1530K3823J0650
9108e913437K078R685Q016K3203K6372J5645J3521J3009K6734J6378M743R569
9096e744484K0067J8889J8082J6268R024K930J2872J8433J9542k429M286K0930
9084e585590K7746J5998K0442K6832K3251K0295O127M178J5132m482J0711K1396
9072e397964J6176J0296J4040O408J5944Q776K123K3424Q547J0385N653J9233
9060e256959K9786J8699K1M302L499N870Q754K1201L1648p827n362J5538Q105
$$ y = [-6741214, -6697628, -6642140, -6615660, -6590554, -6557457, -6530243, -6506878, -6479157, -6445824, -6411424, -6373771, -6342385, -6321769, -6295883, -6265895, -6243284, -6229779, -6210726, -6207232, -6204248, -6192445, -6176103, -6156126, -6132746, -6109615, -6093878, -6064478, -6033582, -6028102, -6025946, -5999081, -5969440, -5947910, -5924087, -5913437, -5911359, -5901674, -5893658, -5870455, -5844083, -5828438, -5814917, -5801908, -5775174, -5758796, -5754053, -5744484, -5724417, -5705528, -5687446, -5671178, -5662154, -5659224, -5646352, -5627919, -5608377, -5610806, -5606520, -5585590, -5557844, -5541846, -5521404, -5494572, -5471321, -5451026, -5444899, -5440721, -5425589, -5430071, -5419360, -5397964, -5381788, -5371492, -5357452, -5351044, -5335100, -5326324, -5324201, -5300777, -5292230, -5281845, -5276192, -5256959, -5227173, -5208474, -5208453, -5204151, -5200652, -5194782, -5186028, -5164827, -5133179, -5141006, -5146368, -5130830, -5122725]
9047e122725Q945K2579J7515J7075K0571O218O097j877L554J7295R304Q184J9916
9034d967349L777m060J6600K8205p704k1304J1940K0171J3556N928Q042J3830
9022d878368O811J6063J6637K783R442L1043K1610N369K846r502J0188J3853O11
9009d750614r194R415J0852J7259K1413J188N159J9959K1531L317J5981J7916
8997d615818O591R254J0769O265o183M597Q373K609J1352J010r373J8143J4506
8984d537905O239R703k462M757J2473J915k055J9228J8800P547N08J892o655N077
8970d460938p11l17J5779K5187J1875N714J1951J3851J0558r735q743R452J6922
8957d359155J2265O457J1652j007J9809J0462j0303j654J775O877J1979j332J6420
$$ y = [-5122725, -5113780, -5091201, -5073686, -5056611, -5036040, -5029822, -5023725, -5025602, -5022048, -5004753, -4995449, -4987265, -4967349, -4963572, -4967632, -4951032, -4922827, -4930531, -4951835, -4939895, -4919724, -4906168, -4900240, -4892198, -4878368, -4871557, -4855494, -4838857, -4836074, -4826632, -4795589, -4773979, -4768610, -4765764, -4775266, -4765078, -4751225, -4750614, -4759808, -4750393, -4739541, -4722282, -4700869, -4699681, -4694522, -4674563, -4653032, -4649715, -4633734, -4615818, -4609227, -4599973, -4589204, -4582939, -4589122, -4584525, -4576152, -4573543, -4562191, -4561181, -4570554, -4552411, -4537905, -4531666, -4521963, -4524425, -4519668, -4507195, -4505280, -4507335, -4488107, -4469307, -4461760, -4461252, -4459360, -4466015, -4460938, -4461649, -4461966, -4446187, -4421000, -4409125, -4403411, -4391460, -4377609, -4367051, -4376786, -4385529, -4376077, -4359155, -4346890, -4340433, -4328781, -4329788, -4309979, -4299517, -4309820, -4311474, -4309699, -4302822, -4290843, -4292175, -4275755]
8944d275755P831J17K361O6Q910K2033M606M343N428J2674R793O991J0047K698
8930d177857q593O814M618J3604N377O956J5305J3152J796N111m363m178K937
8917d119321J5824P513J1078p538P336J427J0371L99j3195m349J3349J1715K0285
8904d045106J4924R182m118o975J2056K3914M328J58k552L273K1473J1078J2695
8891c945670J9263J1649N132Q225K265l612J3697K498J049J1661L6981K3927P42
8878c812193J137q179P141K1899M5416L6163K9419L3259K8877L4072O06m0793
8866c623176o2921q1780j49617j76185q6729J1206L0450K7009K7490J5860J4150
8855d054243M996J9410K3931Q068J9815J6539M943J4091k053K3907J8013j165
$$ y = [-4275755, -4267924, -4267807, -4265446, -4265380, -4256470, -4234437, -4229831, -4225488, -4220060, -4207386, -4197593, -4190602, -4180555, -4177857, -4186450, -4179636, -4175018, -4161414, -4156037, -4149081, -4133776, -4120624, -4118828, -4113717, -4118080, -4122258, -4119321, -4103497, -4095984, -4084906, -4092444, -4085108, -4083681, -4073310, -4072911, -4086106, -4090455, -4077106, -4065391, -4045106, -4030182, -4021000, -4025118, -4032093, -4020037, -3996123, -3991795, -3991637, -3994189, -3990916, -3969443, -3958365, -3945670, -3926407, -3914758, -3909626, -3901401, -3899136, -3902748, -3889051, -3886553, -3885504, -3873843, -3836862, -3812935, -3812193, -3811056, -3819235, -3812094, -3790195, -3744779, -3708616, -3679197, -3645938, -3617061, -3582989, -3582383, -3623176, -3686097, -3767877, -3917494, -4093679, -4180408, -4169202, -4138752, -4111743, -4084253, -4068393, -4054243, -4049247, -4029837, -4005906, -3997838, -3978023, -3961484, -3956541, -3942450, -3944503, -3920596, -3902583, -3903748]
8843c903748O047P765P865O732o47P954K0823N190r996P653J3120J1855Q275J0086
8829c801026l630o095Q594J1160L163k144o712j0339N524J0394J0226p409L905
8816c784389M688J5471N626J897J0185P993K3909M146J3416k225j5998j410Q25
8803c715866o123j118J0188Q836J7334J7066J6253J2589K932K597K949l981j2908
8790c649252J861K1473j0387q108j937N485P376l074P417J4737J266J312n611
8777c617442m220l18J3602J7055k92l565j21J2531J9365J0863K667M65j1668r944
8763c571022M604m552K200K1573J6637N632M930N122j1419k237n275N405K501
8750c525901L750j3646R858J7770J2247Q79k917J1722M037J492N095j693L566
$$ y = [-3903748, -3897701, -3889936, -3882071, -3875339, -3875986, -3868032, -3847209, -3842019, -3852015, -3844362, -3831242, -3819387, -3811112, -3801026, -3804656, -3810751, -3802157, -3790997, -3787834, -3789978, -3796690, -3807029, -3801505, -3791111, -3780885, -3788294, -3784389, -3779701, -3764230, -3758604, -3756707, -3746522, -3738529, -3714620, -3710474, -3697058, -3699283, -3715281, -3716691, -3715866, -3721989, -3723107, -3712919, -3704083, -3686749, -3669683, -3653430, -3640841, -3637909, -3635312, -3632363, -3636344, -3649252, -3647391, -3625918, -3636305, -3644413, -3646350, -3640865, -3633489, -3636563, -3629146, -3614409, -3613143, -3611831, -3617442, -3621662, -3621980, -3608378, -3591323, -3591615, -3595180, -3595301, -3582770, -3563405, -3552542, -3549875, -3549410, -3561078, -3571022, -3566418, -3570970, -3568770, -3547197, -3530560, -3524928, -3519998, -3514876, -3526295, -3528532, -3533807, -3528402, -3525901, -3522151, -3535797, -3525939, -3508169, -3495922, -3495043, -3497960, -3486238, -3482201, -3480709, -3475614, -3477307, -3473741]
8737c473741J7350J2694j2373P358M275p788j0758J577K354J1163R164j922P203
8724c433444J0979K507j663Q475Q105j56L17k3133j0884Q301J7261Q110k443K0125
8710c387543J540Q226j641M596j804J0828N738R250L275q513p857N795M646j2788
8696c366252O496J1746J2880O968J5535J0873j0108j4476M265J0417J6237R583
8684c285836p196m428J5929J29J517l003n176R136P904p085K041N260J2196k313
8670c260925O215R47n238r667q992N483J6199R430J6724K447j2577j2692m8N134
8656c247560P471M79J1032Q714N777J5825Q027J64o404k579P400P791m440p257
8642c195560l987k001P815J8519O985n949N73J0083R182M048n60r38n846j7074
$$ y = [-3473741, -3456391, -3443697, -3456070, -3448712, -3444437, -3452225, -3462983, -3461406, -3459052, -3447889, -3438725, -3440647, -3433444, -3422465, -3419958, -3421621, -3413146, -3405041, -3405197, -3404880, -3428013, -3438897, -3430596, -3413335, -3405225, -3407668, -3387543, -3386003, -3377777, -3379418, -3374822, -3376626, -3365798, -3360060, -3350810, -3347535, -3356048, -3363905, -3358110, -3353464, -3366252, -3359756, -3348010, -3335130, -3328162, -3312627, -3301754, -3311862, -3326338, -3322073, -3311656, -3295419, -3285836, -3293032, -3297460, -3281531, -3281402, -3279885, -3282888, -3288064, -3278928, -3271024, -3278109, -3276068, -3270808, -3258612, -3260925, -3254710, -3253763, -3259001, -3268668, -3277660, -3272177, -3255978, -3246548, -3229824, -3227377, -3239954, -3252646, -3252694, -3247560, -3240089, -3239610, -3228578, -3219864, -3214087, -3198262, -3190235, -3190071, -3196475, -3199054, -3191654, -3183863, -3188303, -3195560, -3199547, -3201548, -3193733, -3175214, -3168229, -3174178, -3173605, -3163522, -3154340, -3150292, -3150852, -3151790, -3157636, -3174710]
8628c174710Q114n087J0420p169l917l792J0451J2898k06J5118J0756K3434R892
8615c093798n947q472q761L025M152P449O002J0238Q433R08m685j0045O582J1101
8601c073818j3237j0827l457J5656N678M271q215K176K0773N018n716J895J777
8588c058026N64j0412j0350J673j3172k754m459K487M861J3170R728K020J5681
8575c048989R508n518J75K693r168p221p916J3619J3278J337j2589J0837R026
8562c030928n776J1267R820K476J232K286J706J0691J5965O740J347p982p232
8549b988388M232l877M894Q504l911r14M749Q800p368m727J740P430N821m981
8535b967996L554k345R671K857j3648n054K755M229Q190R720r051l485R982k278
$$ y = [-3174710, -3166596, -3171683, -3161263, -3168432, -3172349, -3176141, -3165690, -3152792, -3152998, -3137880, -3127124, -3103690, -3093798, -3099745, -3108217, -3116978, -3113953, -3109801, -3102352, -3096350, -3086112, -3077679, -3076771, -3081456, -3091501, -3084919, -3073818, -3087055, -3097882, -3101339, -3085683, -3080005, -3075734, -3083949, -3081773, -3061000, -3055982, -3061698, -3059803, -3058026, -3057462, -3067874, -3078224, -3076551, -3089723, -3092477, -3096936, -3094449, -3089588, -3076418, -3066690, -3064670, -3048989, -3039481, -3044999, -3044824, -3042131, -3051299, -3058520, -3066436, -3052817, -3039539, -3038202, -3050791, -3039954, -3030928, -3036704, -3025437, -3015617, -3013141, -3011909, -3009623, -3007917, -2997226, -2981261, -2974521, -2973174, -2981156, -2988388, -2984156, -2988033, -2983139, -2974635, -2978546, -2979460, -2974711, -2965911, -2973279, -2978006, -2976266, -2968836, -2963015, -2967996, -2964442, -2966787, -2957116, -2954259, -2967907, -2972961, -2970206, -2965977, -2957787, -2948067, -2957118, -2960603, -2950621, -2952899]
8521b952899Q490j2731M376J3508R492J637J011J4683J2647j1489q539j899o85
8508b922398j370P345r79j259R537Q851J0890J1944L988K575O01J2852m485j0245
8494b872153o603J070N675k507l406k730N415L749q801n75O835p63L146R906n108
8479b866850j830R825m565J157M063j4237M354K2633J1607nk690j205j3770n279
8465b856792p298p416J4786J6725j499q977j3018J3858R659N783k074K781o182
8452b839664J3533R336M139j1546n460P630o465m17K285L227J867j675M573Q76
8438b817761K6821J4729N97R15Q883j2051Q02r155m493R011J1751k0211j1682
8425b801844P224J3156J0857j484k701j536j7169Q081J0130O822J4969l369o278
$$ y = [-2952899, -2944409, -2957140, -2952764, -2939256, -2929764, -2928127, -2927116, -2912433, -2899786, -2911275, -2919814, -2921713, -2922398, -2923768, -2916423, -2917402, -2918661, -2909124, -2900273, -2889383, -2877439, -2873451, -2870876, -2870275, -2857423, -2861908, -2872153, -2878756, -2877686, -2872011, -2874518, -2877924, -2880654, -2875239, -2871490, -2880291, -2880866, -2874031, -2874794, -2871648, -2861742, -2866850, -2868680, -2858855, -2863420, -2862263, -2858200, -2872437, -2868083, -2845450, -2833843, -2833848, -2836538, -2837743, -2851513, -2856792, -2864090, -2871506, -2856720, -2839995, -2841494, -2850471, -2863489, -2849631, -2839972, -2834189, -2836263, -2833482, -2839664, -2826131, -2816795, -2812656, -2824202, -2829662, -2822032, -2828497, -2828914, -2826629, -2823402, -2821535, -2823210, -2818637, -2817761, -2790940, -2776211, -2775614, -2774699, -2765816, -2777867, -2777065, -2786220, -2790713, -2781702, -2769951, -2790162, -2801844, -2794620, -2781464, -2770607, -2772091, -2774792, -2776328, -2793497, -2785416, -2775286, -2768464, -2753495, -2756864, -2763142]
8412b763142L962J4069R639j607j988J138p53k765k973R678j629r55p287j0084
8398b754697J6257J8203m294j1398M830K837P268m865J2188Q096K411J920m739
8385b705983J1184R492r6M635L483p819q875j0791J2393J0618P946P46Q049o058
8371b671076J491L764k788K093j727m107M402j616q15n759l530J4774K1891K812
8357b640191n230j3442M707J1698O887O235J5396q570O796l493j9952R79k153
8344b640333P105J3334P35n6K647K531M191j394l92p186O312J4970J371J1244
8330b584921L167q802j6750q591Q916J2758j1159l75k299l116K967J3735k714
8317b597184o523m155M498J3959M257m395p144l324m16J0722K4172m641q963r152
$$ y = [-2763142, -2759180, -2745111, -2735472, -2737079, -2739067, -2737929, -2738682, -2741447, -2744420, -2734742, -2736371, -2737326, -2744613, -2754697, -2738440, -2720237, -2724531, -2735929, -2731099, -2728262, -2720994, -2725859, -2713671, -2705575, -2703164, -2701244, -2705983, -2694799, -2685307, -2685403, -2680768, -2677285, -2685104, -2693979, -2704770, -2692377, -2681759, -2673813, -2673067, -2665018, -2671076, -2669585, -2665821, -2668609, -2666516, -2668243, -2672350, -2667948, -2669564, -2670379, -2676138, -2679668, -2664894, -2643003, -2640191, -2645421, -2658863, -2654156, -2642458, -2635571, -2629336, -2613940, -2622510, -2615714, -2619207, -2639159, -2638180, -2640333, -2633228, -2619894, -2619159, -2619215, -2616568, -2614037, -2609846, -2611240, -2611632, -2618818, -2612506, -2597536, -2596165, -2584921, -2581754, -2590556, -2607306, -2615897, -2606981, -2594223, -2605382, -2605757, -2608056, -2611172, -2608205, -2594470, -2597184, -2603707, -2607862, -2603364, -2589405, -2585148, -2589543, -2596687, -2600011, -2600427, -2589705, -2565533, -2570174, -2579137, -2588289]
8303b588289R54J4726O797k791j6628n45P954P471J5792M792P288O468J15r057
8289b544953l904m979J5802J3950l524n764j3457m119p27J1059m763J34K250N239
8275b537756p963q332M363p299Q699J0054Q368o376J2289J5006J630K269j5934
8262b520982j1986r85o586P171P284J294J6280q495j8434j3617J5311K0783J2816
8249b500146j96K063q35k86L332N12n014j4166L690m846J3204P024L420P815m848
8234b489277m800l576l959Q839J7078j400J0042J4323o579P171Q183o465k0721
8221b471141l281J0488P455M395L666l150o762K164J968O51J0813O852k318O749
8207b431451k566K872P528k41L717p531n512r40j4342J3875O899K445L140j3606
$$ y = [-2588289, -2587335, -2572609, -2565812, -2568603, -2585231, -2585776, -2577822, -2570351, -2554559, -2549767, -2542479, -2536011, -2535896, -2544953, -2548857, -2553836, -2538034, -2524084, -2527608, -2533372, -2546829, -2550948, -2551675, -2540616, -2545379, -2545245, -2542995, -2537756, -2545719, -2554051, -2549688, -2556987, -2548288, -2538234, -2529866, -2536242, -2523953, -2508947, -2507317, -2505048, -2520982, -2532968, -2533953, -2540539, -2533368, -2526084, -2524790, -2508510, -2517005, -2535439, -2549056, -2533745, -2512962, -2500146, -2500342, -2498279, -2499114, -2499400, -2496068, -2495556, -2500570, -2514736, -2511046, -2515892, -2502688, -2495664, -2492244, -2484429, -2489277, -2494077, -2497653, -2501612, -2492773, -2475695, -2477095, -2467053, -2452730, -2459309, -2452138, -2443955, -2450420, -2471141, -2474422, -2463934, -2456479, -2452084, -2448418, -2451568, -2458330, -2456166, -2454198, -2453547, -2442734, -2435882, -2438200, -2431451, -2434017, -2431145, -2423617, -2423858, -2420141, -2427672, -2433184, -2434124, -2448466, -2434591, -2427692, -2425247, -2422107, -2435713]
8193b435713r592K1279J4938j094q836O940m853j1259o137K363K2327j704j4435
8180b425776Q629J1171M835p059R591N167p24j2725J1094p53n698r615M480J856
8166b405527l903J5736K2182n784r017O266j0806j4044J979N506N984Q937J659
8153b380832P84n848l379R628J3932q724l89O27L740q952j1499Q673K3665O738
8139b351836L905j1405K872J6762M989j4334k2223M768P195M844P919q185q249
8126b362978J3125R078J1165m400p823J62j689m044n934k559J538J7165k790J7855
8112b322129K768m191j3337p786J410R837q19J78J0598j0192k007m615M344P206
8098b328735L70L211R919K4074M352j8483m383n186J2897P735m332M411Q389J0815
$$ y = [-2435713, -2445305, -2424026, -2409088, -2410182, -2419018, -2412078, -2416931, -2428190, -2434327, -2431964, -2409637, -2411341, -2425776, -2417147, -2405976, -2401141, -2408200, -2398609, -2393442, -2394166, -2406891, -2395797, -2396550, -2402248, -2411863, -2407383, -2405527, -2409430, -2393694, -2371512, -2377296, -2386313, -2380047, -2390853, -2404897, -2402918, -2397412, -2391428, -2382491, -2380832, -2380048, -2385896, -2389275, -2379647, -2365715, -2374439, -2374828, -2374201, -2370461, -2379413, -2390912, -2382239, -2358574, -2351836, -2347931, -2359336, -2356464, -2339702, -2334713, -2349047, -2371270, -2366502, -2359307, -2354463, -2346544, -2354729, -2362978, -2349853, -2340775, -2329610, -2334010, -2341833, -2341671, -2343360, -2347404, -2353338, -2355897, -2354359, -2337194, -2339984, -2322129, -2319361, -2323552, -2336889, -2344675, -2343265, -2333428, -2334247, -2334069, -2323471, -2333663, -2335670, -2340285, -2335941, -2328735, -2328365, -2325154, -2315235, -2291161, -2286809, -2305292, -2309675, -2314861, -2301964, -2294229, -2298561, -2294150, -2285761, -2274946]
8084b274946j1083J974q553K883k292r6m10K6103p254j8918J0465K2397J215r535
8070b268050j6257l094J1352J6369N574N602j1387l388k088j5094j4768j3389
8058b308618M366K2034P157l96K528Q43K643O896K579o221p154L778J7168j835
8044b254232K573n52O380K2859k753j6821Q024k82l323M261j1033o516J5192O181
8030b230042j133N54P870J0304M593j0113k1997j1054J6043J0492k098l319J5546
8017b214354K984j405j2934j1138q107M485N850M512M96J2026N518j5941M69j1104
8003b238643N217M522P364L522j0012R036J4912J346j4796q393K738M574p202
7990b225815o90R548R111J493K976j446r304Q33M329R177J0444J96j305P619O111
$$ y = [-2274946, -2286029, -2284055, -2292608, -2289725, -2292017, -2292113, -2292523, -2266420, -2273674, -2292592, -2282127, -2259730, -2258515, -2268050, -2284307, -2287401, -2276049, -2259680, -2254106, -2248504, -2259891, -2263279, -2265367, -2280461, -2295229, -2308618, -2304252, -2282218, -2275061, -2275457, -2272929, -2272086, -2269443, -2262547, -2259968, -2266189, -2273343, -2269565, -2252397, -2254232, -2251659, -2252211, -2245831, -2222972, -2225725, -2242546, -2234522, -2234804, -2238127, -2233866, -2244899, -2251415, -2236223, -2230042, -2231175, -2230621, -2222751, -2212447, -2207854, -2217967, -2239964, -2251018, -2234975, -2224483, -2226581, -2229900, -2214354, -2211370, -2212775, -2225709, -2236847, -2244954, -2240469, -2234619, -2230107, -2229611, -2217585, -2212067, -2228008, -2227539, -2238643, -2233426, -2228904, -2221540, -2218018, -2228030, -2218994, -2204082, -2202736, -2217532, -2225925, -2223187, -2218613, -2225815, -2226505, -2216957, -2207846, -2206353, -2203377, -2204823, -2214127, -2213294, -2208965, -2199788, -2189344, -2189148, -2190453, -2182834, -2176723]
7975b176723p586J1012O2j2073M740Q911K3717m281j1810j779k8350j6475l258
7962b213893O114j2410j926R075M695R582P748J4977l048M84K157l224J1898l354
7948b171125j2283k356O917L977J7R761n300m024o863P784K277n951M439J116
7934b171614O071M409J320L853R116J6562p037j6678k4932Q975J4083K297J5075
7921b138500n051j8744M34J9934J0234j0062p536l60k088j059J4250P203o150
7908b137495M936Q47k863j2267q981j93J4461J0369O609M04p859j428q73M689
7894b129644l251K490M4j0036N935K604J246o588j251K500l312J8804Q224j22
7880b112357l996k899p936p352J2853R952M42q05o082R447J7182J26j3017K164
$$ y = [-2176723, -2184309, -2173297, -2173235, -2185308, -2180568, -2171657, -2147940, -2152221, -2164031, -2165810, -2194160, -2210635, -2213893, -2207779, -2220189, -2222115, -2213040, -2208345, -2198763, -2191015, -2176038, -2179086, -2178602, -2176445, -2179669, -2167771, -2171125, -2183408, -2185764, -2178847, -2174870, -2174853, -2165092, -2170392, -2174416, -2181279, -2173495, -2171218, -2177169, -2172730, -2171614, -2165543, -2161134, -2159814, -2155961, -2146845, -2130283, -2137320, -2153998, -2178930, -2169955, -2155872, -2153575, -2138500, -2143551, -2162295, -2161861, -2141927, -2131693, -2141755, -2149291, -2149651, -2151739, -2152798, -2138548, -2131345, -2137495, -2132559, -2131712, -2134575, -2146842, -2155823, -2156016, -2141555, -2131186, -2124577, -2124173, -2132032, -2133460, -2134333, -2129644, -2132895, -2130405, -2130361, -2140397, -2134462, -2131858, -2130612, -2137200, -2138451, -2135951, -2139263, -2120459, -2112235, -2112357, -2116353, -2119252, -2127188, -2134540, -2121687, -2111735, -2111293, -2112098, -2118180, -2108733, -2091551, -2091425, -2104442, -2102278]
7866b102278K960M677P220o141j238J842l228P264j0659j1623n081P749N959J302
7852b101275l449O492J4859m562J809J5696P446j8802j2609R386J035q906L766
7839b089114P44J1946L778l803M482P488o12M364n971q501L186J083Q231j0409
7825b073108n815J0534L575N396L337J725k523n005j0271J4861K763R34K523J029
7811b050045O175Q507M55l282q227k197J7570O59k0812o921k10J9524J5138M516
7797b019150l111j4185N68P925p919p6M950r568q702J1027O534J2001j5860j815
7783b037381M490L585J0866n528n482Q346J4776r738j5181j1388Q804O475k51
7770b027607m058J2854p150o392J5L433J1789O983N63J6889M842L823L90j0881
$$ y = [-2102278, -2099318, -2094641, -2087421, -2093562, -2094800, -2092958, -2096186, -2088922, -2099581, -2111204, -2116285, -2108536, -2102577, -2101275, -2104724, -2098232, -2083373, -2087935, -2086126, -2070430, -2062984, -2081786, -2094395, -2085009, -2083974, -2092880, -2089114, -2088370, -2076424, -2072646, -2076449, -2071967, -2064479, -2065091, -2060727, -2066698, -2075199, -2072013, -2070930, -2062699, -2073108, -2078923, -2068389, -2064814, -2059418, -2056081, -2054356, -2056879, -2061884, -2072155, -2057294, -2054531, -2053597, -2051074, -2050045, -2043870, -2035363, -2034908, -2038190, -2046417, -2048614, -2031044, -2030385, -2051197, -2058118, -2058328, -2038804, -2023666, -2019150, -2022261, -2036446, -2035878, -2027953, -2035872, -2035948, -2030998, -2040566, -2049268, -2038241, -2031707, -2019706, -2035566, -2037381, -2032891, -2029306, -2018440, -2023968, -2029450, -2021104, -2006328, -2016066, -2031247, -2042635, -2033831, -2027356, -2027607, -2031665, -2018811, -2025961, -2032353, -2032338, -2028905, -2017116, -2010133, -2009570, -1992681, -1987839, -1984016, -1983626, -1994507]
7756a994507p028j0062M829q997k689P734P826Q585l86q652r425Q913m896q282
7742b017037J3016P74n663M665K6308J4897m333j6120k990O535n461O430k631
7729a981610J0861J0060j8095j6850Q723J905j456k0665J1261L236l112P970O37
7716a987135J3047m376j7173M14J2395K3793J5047M763j2960r137Q415l94j3650
7703a966951n180l870o515J1188Q063k793j904M166O997j690p679m677J5180R001
7689a946664q86m826J6783J0592j617R3l233j4572j4153J774q282p868P354N784
7675a959721Q158J7893m537j020l213l99j3674J459J312L73j22o684O033P545
7661a946597q382J674J0068K717J3786k322j243N566p652j5916m90O090m835P653
$$ y = [-1994507, -2001535, -2011597, -2006768, -2015765, -2018454, -2010720, -2002894, -1994309, -1994695, -2003347, -2012772, -2003859, -2008755, -2017037, -2004021, -2003247, -2008910, -2004245, -1977937, -1963040, -1967373, -1983493, -1986483, -1979948, -1985409, -1978979, -1981610, -1970749, -1960689, -1978784, -1995634, -1986911, -1985006, -1986462, -2007127, -1995866, -1992630, -1995742, -1987772, -1987135, -1974088, -1978464, -1995637, -1995223, -1982828, -1959035, -1943988, -1939225, -1952185, -1961322, -1952907, -1953301, -1966951, -1972131, -1976001, -1982516, -1971328, -1963265, -1966058, -1967962, -1963796, -1956799, -1958489, -1966168, -1970845, -1955665, -1946664, -1947550, -1952376, -1935593, -1925001, -1926618, -1926525, -1929758, -1944330, -1958483, -1956709, -1964991, -1972859, -1965505, -1959721, -1951563, -1933670, -1938207, -1939227, -1942440, -1942839, -1956513, -1955054, -1953742, -1953369, -1953491, -1960175, -1954142, -1946597, -1954979, -1953305, -1943237, -1940520, -1926734, -1929056, -1930299, -1924733, -1932385, -1948301, -1948791, -1942701, -1947536, -1939883]
7647a939883N831k322P928O785K661j016j0013j683M904M578J0595L740p578j7722
7633a933195R253l166l621L51J3505P350j49J942K0620r056j1854j074j3768m010
7619a926872J4770O163j980n75P137J3250L515L334O893j4408j3155N814J9436
7606a876678L751r961j645o221r950k8J1694p111N320J2194p836n344K260N48
7592a889007j7043K87Q549O678K428P028l653J8459L395k3066n305L373n285Q135
7578a885027r23k212q41J558P80L034J9781P035k057L270n85j42R292M664r859
7563a852232p493j1118L167N442J109j279j2035Q390P527r701p878O754Q518K915
7549a857914k598Q707Q793J819J1635o230o531j2911L720J8534j814j8832J0982
$$ y = [-1939883, -1934052, -1936374, -1928446, -1921661, -1919000, -1920016, -1930029, -1931712, -1926808, -1922230, -1911635, -1907895, -1915473, -1933195, -1923942, -1927108, -1930729, -1930378, -1916873, -1909523, -1909672, -1907730, -1887110, -1896166, -1908020, -1909094, -1922862, -1926872, -1912102, -1905939, -1907919, -1908494, -1901357, -1888107, -1884592, -1881258, -1874365, -1888773, -1901928, -1896114, -1876678, -1872927, -1882888, -1884533, -1890754, -1900704, -1900732, -1889038, -1896149, -1890829, -1878635, -1886471, -1891815, -1889555, -1889007, -1906050, -1905763, -1897214, -1890536, -1888108, -1881080, -1884733, -1866274, -1862879, -1885945, -1891250, -1887877, -1893162, -1885027, -1885950, -1888162, -1889003, -1887445, -1886665, -1883631, -1863850, -1856815, -1858872, -1855602, -1856187, -1856329, -1847037, -1842373, -1852232, -1859725, -1870843, -1867676, -1862234, -1861125, -1862404, -1874439, -1866049, -1858522, -1868223, -1876101, -1869347, -1860829, -1857914, -1860512, -1851805, -1843012, -1841193, -1829558, -1835788, -1842319, -1855230, -1851510, -1832976, -1834790, -1853622, -1842640]
7536a842640R117M43n176n993M306j1057K493j39K972m433p789L081K2901J513
7522a830401k890L791L062Q050o374p854k47K940K380k831N874M081l607Q341
7508a815685m137j27j1207L968P168L544m40L320J771O791j0771j5915p344P738
7494a831326K3415j5187j582m358l47J903j4491m52Q134R105K5871J0305j227
7481a790237j7803L664K663M046j141j60O143J0987m144j5296J841J0370r9o756
7467a795922k0309o307O550J1194K998J1939K496j1042l014J125k468J3292O397
7454a783071j250n288o841j0491L135k465J1095J0922J425M778N391j0420j4922
7441a798002J1948L761N226N006r472N704n437p923Q695J650P34l373O172J2598
$$ y = [-1842640, -1833523, -1833080, -1838256, -1844249, -1839943, -1851000, -1848507, -1848646, -1845674, -1850107, -1857896, -1854815, -1831914, -1830401, -1833291, -1829500, -1826438, -1818388, -1824762, -1832616, -1832863, -1829923, -1827543, -1830374, -1824500, -1820419, -1824026, -1815685, -1819822, -1819949, -1831156, -1827188, -1820020, -1816476, -1816916, -1813596, -1811825, -1805034, -1815805, -1831720, -1839064, -1831326, -1807911, -1823098, -1824680, -1829038, -1829385, -1827482, -1841973, -1842425, -1834291, -1825186, -1799315, -1789010, -1790237, -1808040, -1804376, -1801713, -1797667, -1798808, -1798968, -1792825, -1781838, -1785982, -1801278, -1799437, -1789067, -1789166, -1795922, -1816231, -1822538, -1815988, -1804794, -1801796, -1789857, -1787361, -1798403, -1801417, -1800292, -1802760, -1789468, -1783071, -1784321, -1789609, -1796450, -1806941, -1803806, -1806271, -1795176, -1784254, -1782829, -1778051, -1772660, -1783080, -1798002, -1786054, -1782293, -1777067, -1772061, -1781533, -1775829, -1781266, -1789189, -1780494, -1778844, -1778110, -1781483, -1775311, -1762713]
7427a762713J0417L217q307N279O717q635o169o512M747l123R722j3453O072Q353
7413a754388J1388J112r24j1775j9776K840O510N56j3124j1012J1722P777K666
7400a766428Q565J56n939N779N722J4093J2782M79q796q392J010n24Q154J685
7386a731654o139l310j4102j3720K697L499j896M398J5520J037j2991p397J4756
7373a749302K65R007p761j478J683N199L018j2561K029r805j743J4972m172K819
7359a747830Q94l50L207N793J0819M615m480r415o737J2251J0102L732k018j4007
7345a733424o839K601j609j136M455N647J2542l48J2921J9082j3175m476j5359
7332a719118j4427r243L68J5390J7084o626m210N327o366j2431L944k78m779J255
$$ y = [-1762713, -1752296, -1749079, -1757386, -1752107, -1745390, -1754025, -1760194, -1766706, -1761959, -1765082, -1755360, -1768813, -1762741, -1754388, -1743000, -1741888, -1742812, -1754587, -1774363, -1771523, -1765013, -1764457, -1777581, -1788593, -1776871, -1769094, -1766428, -1757863, -1757707, -1763646, -1757867, -1752145, -1738052, -1725270, -1724791, -1733587, -1741979, -1740969, -1741493, -1733339, -1731654, -1737793, -1741103, -1755205, -1768925, -1766228, -1762729, -1764625, -1760227, -1744707, -1743670, -1756661, -1764058, -1749302, -1749037, -1740030, -1747791, -1749269, -1747586, -1742387, -1739369, -1751930, -1749901, -1759706, -1761449, -1746477, -1750649, -1747830, -1746936, -1747286, -1744079, -1738286, -1727467, -1722852, -1727332, -1736747, -1743484, -1731233, -1721131, -1717399, -1719417, -1733424, -1740263, -1737662, -1739271, -1740407, -1735952, -1730305, -1717763, -1718111, -1705190, -1686108, -1699283, -1703759, -1719118, -1733545, -1742788, -1742420, -1727030, -1709946, -1716572, -1720782, -1715455, -1721821, -1734252, -1730308, -1730586, -1735365, -1734110]
7318a734110M02k275Q298L908l239J114J7179L024n653j3235o812m396J3349O756
7304a715690o853Q510K411N520R871M885K33L101n260o701o993O584M069l385
7290a699698L752m106q32O81m99M861L575J4120n0k785R470j0694K541m468J888
7275a682244n254r204p445J4740J1437o826J587P140j6871j4463J1962J4629l754
7262a684566J2117J963r861n151M065p573j2328j103J3056J0734J1726O423j0059
7249a670557m639k726R041l719J1230k85L663L755j8421j1430J6431J568n315
7236a671404j9784n765J1748R126J634N06j7241j820K0012L221j9279J0985K1534
7223a656527J52l30o15N531K349n861o088o902L586o494k696o985j316O43P261
$$ y = [-1734110, -1733708, -1735983, -1727685, -1723777, -1727016, -1725902, -1708723, -1705699, -1711352, -1724587, -1731399, -1735795, -1722446, -1715690, -1722543, -1714033, -1711622, -1706102, -1696231, -1691346, -1691113, -1688012, -1693272, -1699973, -1706966, -1700382, -1696313, -1699698, -1695946, -1700052, -1700884, -1700203, -1700702, -1695841, -1692266, -1678146, -1678196, -1680981, -1671511, -1682205, -1679664, -1684132, -1682244, -1687498, -1696702, -1704147, -1689407, -1677970, -1684796, -1683209, -1676069, -1692940, -1707403, -1695441, -1680812, -1684566, -1672449, -1670486, -1680347, -1685498, -1681433, -1689006, -1701334, -1702437, -1689381, -1678647, -1666921, -1660498, -1670557, -1675196, -1677922, -1668881, -1672600, -1661370, -1661655, -1657992, -1654237, -1672658, -1684088, -1667657, -1666089, -1671404, -1691188, -1696953, -1685205, -1676079, -1674445, -1673939, -1691180, -1693000, -1672988, -1669767, -1689046, -1678061, -1656527, -1656375, -1656705, -1657320, -1651789, -1649440, -1655301, -1661389, -1668291, -1664705, -1671199, -1673895, -1680880, -1682196, -1681553, -1674292]
7208a674292q21J4596R42l69j4047M393J1446N354k877j1653M762J2518n87L271
7194a647364L380l945j322J1506k176r133m818N403j091k886J7653M078j2867
7181a643582j175J4409J369J316N648J53j0065j0016L180Q214j800O652R857N093
7167a610747k865m335n404O387J513j739o335j1252J0125J4734o145r920l089
7154a629072q747l162M448J3798o908j870j003J137J0989l700r788J3997M407
7141a615474r114m109P578j35k2924k372M212O267L393J1464P937j2414k686J4026
7127a614351J0891l748J1115R798o017j4853o364j422NP287l214r792N269K522
7113a612874J5694q226r011K769O92R179P485n833j1850M463J1765O88K10r056
$$ y = [-1674292, -1675113, -1660517, -1659575, -1659944, -1673991, -1669598, -1658152, -1652798, -1655675, -1667328, -1662566, -1650048, -1650635, -1647364, -1643984, -1647929, -1649251, -1637745, -1639921, -1649054, -1653872, -1648469, -1649560, -1652446, -1634793, -1630715, -1643582, -1644757, -1630348, -1628979, -1627663, -1622015, -1621862, -1631927, -1641943, -1638763, -1630549, -1632349, -1625697, -1615840, -1610747, -1613612, -1617947, -1623351, -1616964, -1615451, -1617190, -1623525, -1634777, -1624652, -1609918, -1616063, -1625983, -1629072, -1637819, -1640981, -1636533, -1622735, -1629643, -1631513, -1632516, -1631379, -1620390, -1624090, -1633878, -1619881, -1615474, -1624588, -1628697, -1621119, -1621254, -1644178, -1646550, -1642338, -1636071, -1632678, -1621214, -1613277, -1625691, -1628377, -1614351, -1603460, -1607208, -1596093, -1586295, -1592312, -1607165, -1613529, -1614951, -1614946, -1607659, -1610873, -1620665, -1615396, -1612874, -1597180, -1605406, -1614417, -1611648, -1610956, -1601777, -1594292, -1600125, -1611975, -1607512, -1595747, -1595059, -1594849, -1603905]
7099a603905r38m937j2226R83J0298n244Q317m286R089R990q09k096J0122L597
7085a582045k169K735N02L853n854n904N298J5262J280j7266j0216Q564N346j2
7071a580626l650q863K477J4288J154K200n00J097m33L980r841n138Q375O721
7057a568759j3435j7999o42J303N410J0208K0551j3256n256k568k1N855q846p753
7043a595208j36Q451J1002N088P316j2676q648l681J0699Q607r426P44m705J1604
7029a570969L329k599K287o521J404J0123K836j0885Q036l147j1184N587N710
7016a565993L001M961M052O484J2530O493K34n660r681q582J1295N700m431r669
7002a549266J7960N281j1814N222o312O30p99J253o461Q137J2717n946n623j2779
$$ y = [-1603905, -1604843, -1609780, -1622006, -1621023, -1610725, -1615969, -1607652, -1611938, -1602849, -1592859, -1593668, -1595764, -1585642, -1582045, -1584214, -1581479, -1580977, -1577124, -1582978, -1588882, -1583584, -1568322, -1567042, -1584308, -1594524, -1585960, -1580614, -1580626, -1584276, -1593139, -1590662, -1576374, -1575220, -1573020, -1573520, -1572423, -1572856, -1568876, -1578717, -1583855, -1575480, -1568759, -1582194, -1600193, -1600835, -1599532, -1594122, -1583914, -1563363, -1576619, -1581875, -1584443, -1584464, -1578609, -1587455, -1595208, -1595344, -1586893, -1575891, -1570803, -1563487, -1576163, -1584811, -1588492, -1577793, -1569186, -1578612, -1577868, -1582573, -1570969, -1567640, -1570239, -1567952, -1574473, -1573069, -1562946, -1560110, -1570995, -1562959, -1566106, -1577290, -1571703, -1565993, -1562992, -1558031, -1553979, -1547495, -1534965, -1528472, -1528238, -1533898, -1543579, -1552161, -1540866, -1535166, -1539597, -1549266, -1531306, -1526025, -1537839, -1532617, -1538929, -1538299, -1539098, -1537845, -1544306, -1536169, -1523452, -1529398, -1535021, -1547800]
6988a547800q124J2108k060J017J762j1915n919L055j0082J0461k387J717J5073
6975a543094l386o54N970n808Q710j6212L352P815J2029o730P420m494M586l188
6961a533684o104J5403J3089j102O454J2835K504k0958k1222j0279N620n523j1969
6948a554936J3197L167R779L905K599l314m028J1206m888k753O555L431Q965J8319
6934a488796n057q69j249j0146j1624N505l464j1505j85j1268m561R605J2136
6921a521478K641m867j0168j97n189L138k515P457m49r410R15M479M721o720M927
6906a532715J1837j0319N117L278O232N324J0019j502j1328j8048k204J1436J1451
6893a511422P637j625m644j0008K82K729O515O810J277m549O237m21j4761p88
$$ y = [-1547800, -1555924, -1543816, -1545876, -1544859, -1543097, -1555012, -1560931, -1557876, -1567958, -1557497, -1559884, -1558167, -1543094, -1546480, -1547134, -1541164, -1546972, -1538262, -1554474, -1551122, -1543307, -1531278, -1538008, -1530588, -1535082, -1530496, -1533684, -1539788, -1524385, -1511296, -1512398, -1505944, -1493109, -1490605, -1511563, -1532785, -1543064, -1537444, -1542967, -1554936, -1541739, -1538572, -1528793, -1524888, -1522289, -1525603, -1529631, -1518425, -1523313, -1526066, -1519511, -1516080, -1507115, -1488796, -1493853, -1494722, -1495971, -1506117, -1517741, -1512236, -1515700, -1527205, -1527390, -1538658, -1543219, -1533614, -1521478, -1518837, -1523704, -1533872, -1534069, -1539258, -1536120, -1538635, -1531178, -1531627, -1541037, -1540122, -1535643, -1530922, -1537642, -1532715, -1520878, -1531197, -1526080, -1522802, -1516570, -1511246, -1501227, -1502729, -1514057, -1532105, -1534309, -1522873, -1511422, -1503785, -1505410, -1510054, -1520062, -1519780, -1517051, -1510536, -1503726, -1502449, -1506998, -1500761, -1501182, -1515943, -1516731]
6879a516731Q201M135J5654N01M286j316j7335p489J524J1879P722P220m803j0224
6865a496776k144P853m507n472k46k330O098j392L887r53j905K385L666J9333
6851a472503M837p375p463p628j227K538J642J0917M356K53j8020N15J4290N178
6837a469690j3017k477n568J2312J1985J2637j666N451J210J867r791o233k029
6824a465009j2478p990k374O66K954J63P916n25N851m319N328N135j2421m971
6810a482074J9103J9345j286j4421n911m37J3857j217j1203j7782K77L987j0767
6797a488529Q240P121O635m899k744p808K182m886J3054K047k062K824M077M149
6783a460599p657K126j217m386J990q351K728M951J1362J047r755p370O836j0778
$$ y = [-1516731, -1508530, -1504395, -1488741, -1488240, -1483954, -1485270, -1502605, -1510094, -1508570, -1496691, -1488969, -1481749, -1486552, -1496776, -1498920, -1491067, -1495574, -1501046, -1501292, -1503622, -1497524, -1498916, -1495029, -1495982, -1497887, -1495502, -1491836, -1472503, -1467666, -1475041, -1482504, -1490132, -1491359, -1488821, -1487179, -1476262, -1471906, -1471653, -1489673, -1489158, -1474868, -1469690, -1482707, -1485184, -1490752, -1478440, -1466455, -1453818, -1455484, -1450033, -1448823, -1446956, -1456747, -1462980, -1465009, -1477487, -1485477, -1487851, -1487185, -1484231, -1484068, -1476152, -1476677, -1470826, -1475145, -1469817, -1464682, -1477103, -1482074, -1462971, -1443626, -1444912, -1459333, -1465244, -1465681, -1451824, -1453041, -1464244, -1482026, -1481749, -1477762, -1488529, -1480289, -1473168, -1466533, -1471432, -1474176, -1481984, -1479802, -1484688, -1471634, -1469587, -1471649, -1468825, -1464748, -1460599, -1468256, -1466130, -1467347, -1471733, -1469743, -1478094, -1475366, -1470415, -1459053, -1458006, -1467761, -1475131, -1468295, -1479073]
6769a479073N636q54M209O642j5167M791J3675J3982L395N880Q038k359r994m656
6755a445855j962p310L933j104j6457o458K840J1463J0615P062k780m18P214o936
6741a446153p757j884K284j604N948o568P076J335m183m376r347O91Q548N376
6727a450614M156M958o12o553J0377K1240o296p861l934r635r17m105p998L287
6713a454507L420k693p375j2969P150J1381R705J3729K35o302P748Q385Q522r63
6699a414534j8207q464N368J7604J775J275l260O703K13j7152j2727O785P864
6686a426757P818j6132k615O566j711o573k433N938M691n933J846J0749J7818
6673a406728M714j122j489j3022q947J239o294K947R699J0194n752j0432M477
$$ y = [-1479073, -1473437, -1474291, -1470082, -1463440, -1478607, -1473816, -1460141, -1446159, -1442764, -1436884, -1428846, -1431205, -1441199, -1445855, -1447817, -1455127, -1451194, -1452298, -1468755, -1475213, -1472373, -1460910, -1450295, -1443233, -1446013, -1446431, -1439217, -1446153, -1453910, -1455794, -1453510, -1455114, -1449166, -1455734, -1448658, -1447323, -1451506, -1455882, -1465229, -1464538, -1455990, -1450614, -1446458, -1441500, -1442112, -1448665, -1438288, -1417048, -1423344, -1431205, -1435139, -1444774, -1445691, -1449796, -1457794, -1454507, -1451087, -1453780, -1461155, -1474124, -1466974, -1455593, -1445888, -1432159, -1431924, -1438226, -1430478, -1422093, -1413571, -1414534, -1432741, -1441205, -1435837, -1418233, -1416458, -1415183, -1418443, -1411740, -1411527, -1428679, -1441406, -1434621, -1426757, -1418939, -1435071, -1437686, -1431120, -1432831, -1439404, -1441837, -1435899, -1431208, -1437141, -1435295, -1424546, -1406728, -1402014, -1403136, -1404625, -1417647, -1426594, -1425355, -1431649, -1428702, -1419003, -1408809, -1414561, -1424993, -1420516]
6660a420516R815o942P553L249k939K18j2983j47j2420J7438L29k853N882l383
6646a417699N538N410m879J894l499j3811m665R673N089k567J1072R853Q90k574
6632a400275j0265j1111L003O284k375j773R315O27O101n781R54R489k437l596
6618a401840J1912n878j9778n333J3530J0451k638K960k522L092j236l949K834
6605a398395r221o143J0058J1277p318j807M484Q461M072O807r307n659R555j0844
6591a393980j6383n548M361L044L714m821p078j007K350L177R555P398L476J0710
6577a381032m350l483o005p004J1377N09j5841j836J9941N987K25L645l474m599
6563a385940l547l557K802L811o855m106K828k663R436l480n698j3397l049J4918
$$ y = [-1420516, -1410701, -1417643, -1410090, -1406841, -1409780, -1409562, -1422545, -1422692, -1435112, -1417674, -1417345, -1420198, -1414316, -1417699, -1412161, -1406751, -1411630, -1409736, -1413235, -1427046, -1431711, -1422038, -1416949, -1419516, -1408444, -1398591, -1397701, -1400275, -1410540, -1421651, -1418648, -1412364, -1414739, -1416512, -1407197, -1406570, -1400469, -1406250, -1405296, -1395807, -1398244, -1401840, -1389928, -1395806, -1415584, -1420917, -1407387, -1396936, -1399574, -1396614, -1399136, -1396044, -1397280, -1401229, -1398395, -1407616, -1413759, -1403701, -1392424, -1399742, -1401549, -1397065, -1388604, -1384532, -1377725, -1387032, -1392691, -1383136, -1393980, -1410363, -1415911, -1411550, -1408506, -1404792, -1409613, -1416691, -1417698, -1415348, -1412171, -1402616, -1395218, -1391742, -1381032, -1385382, -1388865, -1394870, -1401874, -1390497, -1389988, -1405829, -1407665, -1387724, -1381737, -1381512, -1377867, -1381341, -1385940, -1389487, -1393044, -1390242, -1386431, -1393286, -1397392, -1394564, -1397227, -1387791, -1391271, -1396969, -1410366, -1413415, -1398497]
6549a398497J8684J393J707Q732j2015j9554j332Q780l038P486O762M323L515
6536a373054K240k130q210Q063p840J787P256J2396J72j1672j1056j4220J05J3068
6522a383095M053K437M492M285J0178P31r624l166j699p6N343J1158l975m532
6508a363490q387j1017m113J1676k407J218J0902J251k563J108L671N446M17J566
6494a354722j0889R217N255P16m663m470N459J336k261j2207P620P733q428o716
6480a367020Q530l746J2006n5j6469L435P032P684o53j2308j8212l26r81M011
6466a377072L870J1856J9320P219J6742K141j6312k801N759J981K54K7n041k283
6452a334340j141n263K0N127r504M835J3146J438j8833j3623J4612J1574J1789
$$ y = [-1398497, -1379813, -1378420, -1376713, -1367981, -1379996, -1399550, -1400882, -1392102, -1395140, -1387654, -1380892, -1376569, -1373054, -1370814, -1372944, -1381154, -1373091, -1380931, -1379144, -1371888, -1359492, -1359320, -1370992, -1382048, -1396268, -1396163, -1383095, -1379042, -1376605, -1372113, -1367828, -1357650, -1356919, -1366543, -1369709, -1371408, -1371484, -1366141, -1354983, -1358958, -1363490, -1371877, -1382894, -1387007, -1375331, -1377738, -1376520, -1365618, -1364367, -1366930, -1365822, -1362151, -1356705, -1356288, -1354722, -1365611, -1356394, -1351139, -1350423, -1355086, -1359556, -1354097, -1352761, -1355022, -1367229, -1359609, -1351876, -1360304, -1367020, -1358490, -1362236, -1350230, -1350285, -1366754, -1363319, -1356287, -1348603, -1349256, -1361564, -1379776, -1380102, -1381083, -1377072, -1373202, -1361346, -1342026, -1334807, -1318065, -1315924, -1332236, -1335037, -1329278, -1327297, -1327043, -1327016, -1332057, -1334340, -1335481, -1340744, -1340724, -1335597, -1345101, -1340266, -1327120, -1325682, -1344515, -1358138, -1343526, -1331952, -1320163]
6439a320163R285n500J429j1829l525q210k1187O933J9187J2428j3807r247n315
6426a349521M28l128K494J768J6208J1779J1405m358j818L697j0443j1800j2414
6413a345703j4530m656P503M676J9174L662n207k640J404J952k894o676q39J896
6399a342878K953j0519N986K269L470M922P85j244K633M888J8880l273j9673p756
6385a338557J0335k684j2681N742p343l018J682l49k855N660N384k975q166R373
6371a340452J6593O277o894l637L271K750J983o758j021N52K185N289R432N397
6357a305033r129q149m288l90m616k993q866N534O017P234R203N369K481O654
6343a300972o300j0507j4577O902R465m803n123P515M039r074R639J3541J4091
$$ y = [-1320163, -1310878, -1316378, -1314949, -1326778, -1330303, -1338513, -1359700, -1352767, -1333580, -1321152, -1334959, -1344206, -1349521, -1349093, -1352221, -1349727, -1347959, -1331751, -1319972, -1308567, -1312925, -1314743, -1311046, -1321489, -1333289, -1345703, -1360233, -1364889, -1357386, -1352710, -1333536, -1329874, -1335081, -1337721, -1336317, -1334365, -1337259, -1343935, -1344774, -1342878, -1339925, -1350444, -1344458, -1342189, -1338719, -1333797, -1333012, -1334256, -1331623, -1326735, -1307855, -1311128, -1330801, -1338557, -1328222, -1330906, -1343587, -1337845, -1345188, -1348206, -1346524, -1346873, -1349728, -1344068, -1338684, -1341659, -1349825, -1340452, -1323859, -1317582, -1324476, -1328113, -1324842, -1322092, -1320109, -1326867, -1327888, -1327336, -1325151, -1319862, -1310430, -1305033, -1314162, -1322311, -1326599, -1326989, -1331605, -1334598, -1343464, -1337930, -1331913, -1324679, -1315476, -1310107, -1307626, -1300972, -1307272, -1317779, -1332356, -1325454, -1315989, -1320792, -1325915, -1318400, -1314361, -1323435, -1313796, -1300255, -1286164]
6330a286164O903n657k0857j4472K1522J6171o535j5597K988J2149O735M240p070
6317a285644n463j3373j1281j1568j5088r98K5270J0605M205J5000r794j1287
6305a309416p912M772J1415J1347q768o266L061j0556J031L692l628q90R200Q378
6291a294540J3973j937r966J0359O095r628R434j6657o65n312j043J4423n679
6278a291143p941L057J6123q412J0296J919j2117J473P39k563j51L257j2203p330
6264a304996k14M845P722p596j2649M521J9414N791K748r387o599J5520o051j0431
6250a297362J517J280L617k02j387j60l517n785n127N021J5632J042l461n241
6236a294133j9183J602J3887Q42p073O366J918P580j077j953O693j767P254J0994
$$ y = [-1286164, -1279261, -1284918, -1305775, -1320247, -1298725, -1282554, -1289089, -1304686, -1301698, -1289549, -1282814, -1278574, -1285644, -1291107, -1304480, -1315761, -1327329, -1342417, -1343415, -1318145, -1307540, -1303335, -1288335, -1298129, -1309416, -1317328, -1312556, -1301141, -1289794, -1298562, -1304828, -1301767, -1312323, -1311292, -1307600, -1311228, -1312118, -1302918, -1294540, -1280567, -1282504, -1292470, -1282111, -1276016, -1285644, -1276210, -1292867, -1293532, -1298844, -1299887, -1285464, -1291143, -1299084, -1296027, -1279904, -1288316, -1278020, -1276101, -1288218, -1286745, -1286006, -1288569, -1288720, -1285463, -1297666, -1304996, -1305210, -1300365, -1292643, -1300239, -1312888, -1308367, -1288953, -1283162, -1280414, -1289801, -1296400, -1280880, -1286931, -1297362, -1295845, -1294565, -1290948, -1291150, -1292537, -1292697, -1296214, -1301999, -1307126, -1302105, -1286473, -1285431, -1288892, -1294133, -1313316, -1311714, -1297827, -1296985, -1304058, -1297692, -1295774, -1288194, -1289271, -1291224, -1284531, -1286298, -1279044, -1268050]
6222a268050J3978j971o431k813j7670p746J5239J124j4404J168o505m397m282
6209a302760J4153J3526l478j7579q894q564J064J6084K2027k10j785m616J077
6196a279955Q089O293O93j3690M738J1539l50q269p733q06M96o723j0899m12O718
6181a290271J8711J0111j0783j0018J7666J0831l954r18M46m954q63J749q509
6168a270756j2576R798J0443q963p507k67R022K1r30k761J2151J6828o17j943
6154a248057m911L457J879k953P051j3059j06K659J4900L875m471n592j0123j654
6140a257105j3938j6541J6045K1665q502j765n246p677n967l114J4145J7713J0863
6127a239424m193l060N055J2603O800k1481r587J1296Q134j0444o800J3207J3708
$$ y = [-1268050, -1254072, -1256043, -1262474, -1265287, -1282957, -1290703, -1275464, -1274340, -1288744, -1287576, -1294081, -1298478, -1302760, -1288607, -1275081, -1278559, -1296138, -1305032, -1313596, -1312532, -1296448, -1274421, -1274631, -1276416, -1281032, -1279955, -1271866, -1265573, -1264880, -1278570, -1273832, -1262293, -1262643, -1270912, -1278645, -1279451, -1278955, -1285678, -1296577, -1296989, -1290271, -1271560, -1261449, -1272232, -1282250, -1264584, -1253753, -1257707, -1258625, -1258179, -1263133, -1263996, -1262247, -1270756, -1283332, -1273534, -1263091, -1272054, -1279561, -1279828, -1270806, -1270785, -1271715, -1274476, -1262325, -1245497, -1246114, -1248057, -1252968, -1249511, -1247632, -1250585, -1243534, -1256593, -1256699, -1254040, -1239140, -1235265, -1239736, -1245328, -1255451, -1257105, -1271043, -1287584, -1271539, -1249874, -1258376, -1260141, -1265387, -1273064, -1279031, -1282145, -1268000, -1250287, -1239424, -1243617, -1246677, -1241622, -1229019, -1222219, -1243700, -1253287, -1241991, -1233857, -1244301, -1251101, -1237894, -1224186]
6114a224186k775n070L722k630L696M450j5417o08P530L694m587p007J2216k86
6100a227258M68m794k943k091j9851j4955K0491P555n022l545J0139k443k082
6087a246331k397N776O216O886n832R67O200o066j5257O788J0919q979p542l314
6073a251966P902L853k82J923J907j8118j757J6239K203j5758j626J2791N981
6060a236708J3371l031j3668n822j1217j1298K0635J2362l589j966M7P90m140
6047a244234q294Q927k20j1189J2674M12k472J2828J2988L549j0639j815k909
6034a230394M058M788M596J9805J0457j480j903q204j942j769k198j5171j1406
6021a230763j446J0119n122M127m071o369J13K5842o206j8854R445Q114N221j906
$$ y = [-1224186, -1226961, -1232031, -1228309, -1230939, -1227243, -1222793, -1238210, -1238818, -1231288, -1227594, -1232181, -1239188, -1226972, -1227258, -1226790, -1231584, -1234527, -1236618, -1256469, -1271424, -1250933, -1243378, -1248400, -1251945, -1241806, -1244249, -1246331, -1248728, -1242952, -1236736, -1229850, -1235682, -1234715, -1228515, -1234581, -1249838, -1243050, -1232131, -1241110, -1248652, -1251966, -1244064, -1240211, -1240493, -1238570, -1236663, -1254781, -1256538, -1240299, -1238096, -1253854, -1255480, -1242689, -1236708, -1223337, -1226368, -1240036, -1245858, -1257075, -1268373, -1247738, -1235376, -1238965, -1240931, -1240884, -1240094, -1244234, -1252528, -1243601, -1243821, -1255010, -1242336, -1241924, -1244396, -1231568, -1218580, -1215031, -1225670, -1227485, -1230394, -1226336, -1221548, -1216952, -1197147, -1186690, -1188170, -1190073, -1198277, -1200219, -1201988, -1204186, -1219357, -1230763, -1232209, -1222090, -1227212, -1223085, -1227156, -1233525, -1233412, -1207570, -1213776, -1232630, -1223185, -1215071, -1209850, -1211756]
6007a211756n00L748J6409K016j3462k373j0926j3832n747N185R684R997o62p467
5993a219686P778R096Q794q908m274k595O810M094p933L246N195J887K874L060
5979a190562j4156m107l988j264j6051j3244J4843J6948R528k412m895O972J2532
5966a189856k083l145M545R058r251l938M681o023k812J182j199L707M824J1660
5952a178650R232q505R96q428q277r830j2567J658P631o775M312k057r467k795
5938a223522K678L586m362k558l87O441N449J9144L048o104j1979N173M447J0793
5924a188153l07k504O29q59n219J247M395k171P094M127m316J0448P476j6525
5910a184638j103j758j4936j4570L96J2335k785M920J2454J0596O692j194r784
$$ y = [-1211756, -1212256, -1208508, -1192099, -1190083, -1203545, -1205918, -1216844, -1230676, -1236423, -1231238, -1221554, -1211557, -1212219, -1219686, -1211908, -1202812, -1194018, -1202926, -1207200, -1209795, -1202985, -1198891, -1206824, -1203578, -1198383, -1196496, -1193622, -1190562, -1204718, -1208825, -1212813, -1214077, -1230128, -1243372, -1228529, -1211581, -1202053, -1204465, -1209360, -1202388, -1189856, -1191939, -1195084, -1190539, -1181481, -1190732, -1194670, -1189989, -1196012, -1198824, -1197642, -1198841, -1195134, -1190310, -1178650, -1169418, -1177923, -1176927, -1185355, -1193632, -1203462, -1216029, -1214371, -1206740, -1213515, -1209203, -1211260, -1220727, -1223522, -1220844, -1217258, -1221620, -1224178, -1224565, -1218124, -1212675, -1193531, -1190483, -1196587, -1208566, -1203393, -1198946, -1188153, -1188460, -1190964, -1190335, -1191194, -1196413, -1195166, -1190771, -1192942, -1185848, -1181721, -1186037, -1175589, -1168113, -1184638, -1185741, -1187499, -1202435, -1217005, -1216609, -1204274, -1207059, -1202139, -1189685, -1179089, -1172397, -1173591, -1183375]
5897a183375p007k299j3618M679J012J2163J509l150O619L347L854M986j5765
5884a187045o546O683L073j2913J1209R895J572o042R71q952o362P832K49j1223
5870a197599k34Q328J797m246K523r179L89J6093J0732J500k873Q23j944p113
5856a181003K308k312j36q980n63j5371m33q84J072K8293K5221j734j0787O450
5842a158859L143q23r551j826J594k152J1731O49j5071R203P874k048J0320m987
5828a150803j1390j2413O070J0567N044Q751J2946j0730o443j3284K483n921r211
5815a174334j351P374J4174j2775j2782J2632O662m0N504o65r269M624J9887Q673
5801a131686j0864j4814p542j7569r85Q347P353P974j4516j0072J4503Q316k987
$$ y = [-1183375, -1190382, -1192681, -1206299, -1201620, -1200608, -1188445, -1186936, -1190086, -1183467, -1180120, -1176266, -1171280, -1187045, -1193591, -1186908, -1183835, -1196748, -1185539, -1175644, -1174072, -1180114, -1179143, -1188095, -1194457, -1186625, -1186376, -1197599, -1197833, -1189505, -1187708, -1191954, -1189431, -1198610, -1198221, -1182128, -1171396, -1169896, -1172769, -1171946, -1173890, -1181003, -1178695, -1181007, -1181143, -1190123, -1190686, -1206057, -1206490, -1207374, -1206302, -1178009, -1152788, -1154522, -1165309, -1158859, -1155716, -1156539, -1166090, -1167916, -1166322, -1168474, -1156743, -1156094, -1171165, -1161962, -1154088, -1156136, -1145816, -1150803, -1162193, -1174606, -1168536, -1157969, -1152925, -1144174, -1131228, -1141958, -1148401, -1161685, -1159202, -1165123, -1174334, -1175685, -1168311, -1154137, -1166912, -1179694, -1167062, -1160400, -1160440, -1154936, -1155601, -1164870, -1160246, -1140359, -1131686, -1142550, -1157364, -1164906, -1182475, -1183460, -1175113, -1167760, -1159786, -1174302, -1184374, -1169871, -1161555, -1164542]
5788a164542r405m30p244N198J1874Q179l642N098N440l389p668m590j926L835
5774a163212o312j2594J0000M502J5167L912l453K291r101p848Q01p994Q02J2936
5760a160103l44o291R974j1233J8314K234q23p518J791J1199P51j2072j498k294
5746a157913j1207j4408l061J9438P864L087N764K963R507Q386J067k316n001
5733a135830j1592j2787o206j369M453J1317R205L05M027n65m825j0625k015R029
5719a147478p295l162J2891m684j12o3k095M00k7577Q566J8785K046p317N762
5705a151333M754L578R54l977o113o25m547P968J7663k312j7128j9379l716J2496
5691a161717J7910K899k093J1572J6056j2594l594m371m037J760o324N877K403
$$ y = [-1164542, -1173947, -1174377, -1181621, -1176423, -1164549, -1156370, -1160012, -1154914, -1149474, -1152863, -1160531, -1165121, -1167047, -1163212, -1169524, -1182118, -1172118, -1167616, -1152449, -1148537, -1151990, -1149699, -1158800, -1166648, -1165847, -1173841, -1173039, -1160103, -1160447, -1166738, -1156764, -1167997, -1149683, -1147449, -1148272, -1155790, -1153999, -1142800, -1142049, -1154121, -1155619, -1157913, -1169120, -1183528, -1186589, -1167151, -1159287, -1156200, -1150436, -1147473, -1137966, -1129580, -1128513, -1130829, -1135830, -1147422, -1160209, -1166415, -1167784, -1163331, -1152014, -1142809, -1142504, -1138477, -1139042, -1143867, -1154492, -1156507, -1147478, -1154773, -1157935, -1145044, -1149728, -1149840, -1149903, -1151998, -1151598, -1179175, -1170609, -1151824, -1149778, -1157095, -1151333, -1146579, -1143001, -1142047, -1146024, -1152137, -1152762, -1157309, -1149341, -1131678, -1133990, -1151118, -1170497, -1174213, -1161717, -1143807, -1140908, -1143001, -1131429, -1115373, -1127967, -1131561, -1135932, -1139969, -1138209, -1144533, -1138656, -1136253]
5678a136253j585K331j1705l98M950p056P428M306m139m203l420P737J3560r104
5664a137551K228m649P268Q765L95j929j0856Q220M585m881M074M444j1025k749
5650a133661o180L45P191r480o849N025j0560O456J8117R760K502j460q860k80
5636a127934k621p589J7960J0332l230l206n997j918Q596N709J699J3411o567
5623a101355o078k279K677J226j0206p157K972L864k106k572J0525J291j2784
5610a121982q671j5173J0810J2670P515p952n975N307Q804q652r015K2O187M873
5596a121232o292n988R035J0438n88l807J0350L552P071M169r313o089J315J992
5582a105387k5464n543M773P580m071Q037j1770j800P069N152o604l985J30K302
$$ y = [-1136253, -1137838, -1135507, -1147212, -1147610, -1142660, -1149716, -1142288, -1137982, -1142121, -1146324, -1149744, -1142007, -1128447, -1137551, -1135323, -1139972, -1132704, -1123939, -1123544, -1125473, -1136329, -1128109, -1123524, -1128405, -1124331, -1119887, -1130912, -1133661, -1139841, -1139496, -1132305, -1141785, -1148634, -1143609, -1154169, -1147713, -1129596, -1119836, -1117334, -1118794, -1127654, -1127934, -1130555, -1138144, -1120184, -1109852, -1113082, -1116288, -1122285, -1124203, -1115607, -1109898, -1108199, -1094788, -1101355, -1107433, -1109712, -1107035, -1105809, -1116015, -1123172, -1120200, -1116336, -1118442, -1121014, -1110489, -1109198, -1121982, -1130653, -1145826, -1135016, -1122346, -1114831, -1122783, -1128758, -1123451, -1114647, -1123299, -1132314, -1132292, -1126105, -1121232, -1127524, -1133512, -1124477, -1114039, -1114627, -1118434, -1108084, -1104532, -1097461, -1093292, -1102605, -1108694, -1107379, -1105387, -1130851, -1136394, -1131621, -1124041, -1128112, -1120075, -1131845, -1133645, -1126576, -1121424, -1128028, -1132013, -1131883, -1129581]
5568a129581Q001P684j050o991k211l954R451J2594j2181r203N702k248j3672
5555a137659Q05J0180O423O48k729O071M584M098Q335q25O374k32k1244r497Q869
5540a115799J0831M732l652m996j517L841J812K058k271K949J602j0921j0907
5527a122238L083r368J351P358J8848K453n142R369N494j48P273M569j1575l134
5513a091807l462j0618l306J1692N137n728j7297p616J7253J0786r128o997m315
5500a115406P110Q067O967J3174q557j869Q795l819P646J298O024N334N02o979
5486a071713m755P899j3160l712K442J268j1616L318l342j2050k425J9837J0824
5473a077185j797j47m631q564k802J3639R984j2291P862J862M338M778j359m568
$$ y = [-1129581, -1121580, -1113896, -1114946, -1121937, -1124148, -1128102, -1118651, -1106057, -1118238, -1127441, -1121739, -1123987, -1137659, -1136854, -1126674, -1120251, -1119603, -1122332, -1116261, -1111677, -1107579, -1099244, -1100069, -1093695, -1093927, -1115171, -1124668, -1115799, -1104968, -1100236, -1103888, -1108884, -1110401, -1106560, -1104748, -1102690, -1104961, -1102012, -1100410, -1111331, -1122238, -1119155, -1128523, -1127172, -1119814, -1100966, -1098513, -1103655, -1094286, -1088792, -1088940, -1081667, -1077098, -1088673, -1091807, -1095269, -1105887, -1109193, -1097501, -1092364, -1098092, -1115389, -1123005, -1105752, -1094966, -1104094, -1111091, -1115406, -1108296, -1100229, -1093262, -1080088, -1088645, -1090514, -1081719, -1085538, -1077892, -1076594, -1070570, -1065236, -1064734, -1071713, -1076468, -1068569, -1081729, -1085441, -1082999, -1081731, -1093347, -1090029, -1093371, -1105421, -1107846, -1088009, -1077185, -1078982, -1079129, -1083760, -1092324, -1095126, -1081487, -1071503, -1083794, -1075932, -1074070, -1069732, -1064954, -1066313, -1070881]
5459a070881k329l20j5967P915N485m10k321r90m97n369l626J936L855R83Q939
5444a073597k550l907l012K919j030m433q047R133l5J1847N391l686n357J091
5430a075273o78M127L592Q778m441r173j1522j4464O58J5982L674l961O608m44
5416a076537L937Q889o623j7238L9J1229J0771J807L161m143l186m98o20j889
5402a070901L98j213k746j671r754n243O374J0611Q779p552O597m546j7233R541
5388a078559J1096J628J0912N39o709K342K072k823M141o826j3653j9493o151
5375a101484K70J2160J3898L708J919j4278K433J632k851P652J2318p250q623
5362a078496N999M082j1413n645K16J784O947q89j1659j86J737L880O873l378
$$ y = [-1070881, -1073210, -1073530, -1089497, -1081582, -1076097, -1076507, -1078828, -1079818, -1080315, -1085684, -1089310, -1087374, -1083519, -1082536, -1073597, -1076147, -1080054, -1083066, -1080147, -1081177, -1085610, -1093657, -1084524, -1084559, -1072712, -1067321, -1071007, -1076364, -1075273, -1075951, -1071824, -1068232, -1059454, -1063895, -1073068, -1084590, -1099054, -1098396, -1082414, -1078740, -1082701, -1076093, -1076537, -1072600, -1063711, -1070334, -1087572, -1087533, -1076304, -1065533, -1063726, -1060565, -1064708, -1067894, -1068392, -1069012, -1070901, -1070503, -1071716, -1074462, -1076133, -1085887, -1091130, -1084756, -1074145, -1065366, -1072918, -1066321, -1070867, -1088100, -1078559, -1067463, -1065835, -1054923, -1054384, -1061093, -1058751, -1056679, -1059502, -1055361, -1062187, -1075840, -1095333, -1101484, -1101214, -1089054, -1075156, -1071448, -1069529, -1083807, -1081374, -1079742, -1082593, -1074941, -1062623, -1069873, -1078496, -1072497, -1068415, -1079828, -1085473, -1085257, -1083473, -1076526, -1077415, -1089074, -1089260, -1087523, -1083643, -1076770, -1080148]
5348a080148r403R186k458j512P496P40J0942n465r267o2K0436P940k53p48n525
5333a058101o412Q984m992K063j46q001L347j4937K055K0n204l268j3070Q453
5319a089209K1489J3372J5220N166j4938j760J9784L669n273M23o891n486l33
5306a044767k138q188P146L235K204j4218r00n670l186j566j6868q954M462L569
5292a085839R535j1966J3910O984L464m931m984j583O020J533P637q171N681J6108
5278a046602j6313j4136J1100N878k639J709J088P661n099L850J5295m330p441
5265a049979l081r251r949K4688Q473q653j821J4171k538j5806J09J1617p121
5252a049141j0194O269m935p620Q182J4727P538K418r769l195j3124J27N035P49
$$ y = [-1080148, -1089551, -1080365, -1082823, -1084335, -1076839, -1076099, -1065157, -1070622, -1079889, -1079951, -1059515, -1051575, -1051828, -1052576, -1058101, -1064513, -1055529, -1060521, -1058458, -1058604, -1066605, -1063258, -1078195, -1076140, -1076120, -1081324, -1084592, -1097662, -1089209, -1067720, -1054348, -1039128, -1033962, -1048900, -1050660, -1030876, -1027207, -1032480, -1032057, -1038948, -1044434, -1044767, -1046905, -1055093, -1047947, -1044712, -1042508, -1056726, -1057626, -1063296, -1066482, -1068048, -1084916, -1093870, -1089408, -1085839, -1076304, -1088270, -1074360, -1067376, -1063912, -1068843, -1073827, -1075410, -1069390, -1067857, -1060220, -1068391, -1062710, -1046602, -1062915, -1077051, -1065951, -1060073, -1062712, -1061003, -1059915, -1052254, -1057353, -1053503, -1038208, -1042538, -1049979, -1053060, -1062311, -1072260, -1047572, -1039099, -1047752, -1049573, -1035402, -1037940, -1053746, -1053637, -1042020, -1049141, -1059335, -1053066, -1058001, -1065621, -1057439, -1042712, -1035174, -1032756, -1042525, -1045720, -1058844, -1058717, -1053682, -1052933]
5238a052933J1069K767o180n947O600j2481p009o766o370O610N870R042L654J3011
5224a039063n407j2489M537J6676J5130J670j3019j6089J11j1278K359l160o892
5211a066914J994J0013L595J3434Q699o24K764k163k355p034n321j887l239l109
5197a052147j7506k63Q211J822J4854N945o038r539l358J6507J8375N786j5246
5184a032597j7303N809j095k863M078J708N194M795K499q697J346N997q260O267
5170a033122L07K136N947m112K1R996J0783p390o16K965Q783l863j2086j3746
5156a033997j1528M437J954P773J3001J2695Q821j8346p624O011j1661m628O809
5143a026283p85o74l172j6172k175r250p890k619M332J0986R412K3746M580j0350
$$ y = [-1052933, -1041864, -1039097, -1045277, -1051224, -1044624, -1057105, -1064114, -1070880, -1077250, -1070640, -1064770, -1055728, -1052074, -1039063, -1044470, -1056959, -1052422, -1035746, -1020616, -1018946, -1031965, -1048054, -1047943, -1059221, -1056862, -1060022, -1066914, -1064920, -1054907, -1051312, -1037878, -1029179, -1029803, -1027039, -1029202, -1031557, -1038591, -1043912, -1045799, -1049038, -1052147, -1069653, -1069916, -1061705, -1059883, -1045029, -1039084, -1045122, -1054661, -1058019, -1041512, -1023137, -1017351, -1032597, -1049900, -1044091, -1045186, -1048049, -1043971, -1042263, -1037069, -1032274, -1029775, -1038472, -1037126, -1031129, -1039389, -1033122, -1032815, -1030679, -1024732, -1028844, -1028823, -1018827, -1008044, -1015434, -1016050, -1013085, -1004302, -1008165, -1020251, -1033997, -1045525, -1041088, -1039134, -1031361, -1018360, -1005665, -996844, -1015190, -1022814, -1016803, -1028464, -1033092, -1026283, -1027068, -1027742, -1030914, -1047086, -1049261, -1058511, -1066401, -1069020, -1064688, -1053702, -1044290, -1020544, -1015964, -1026314]
5129a026314j3491k180K0141K0005M421m637m992k678R89R95o829o789p762O399
5115a022722Q798j6610k630k078N762l1n195m429N336k972M615R721Q972Q227
5101a005236k0688k3658J1872J7129J3007L608J195Q888n551j250N587L711q481
5088i99867J576J809m932M206r808n843O775J226k538p446j2728m458r647l662
5074a045337J2088K1181J380m896j2461M730N883L205O2L338J0703R762n025N120
5060i90267K84r919j587j8768l205J4421o850j5736O455J1361q839J647M191J0167
5046a006645L738l708n051m010o679K526R917k902q383j1056k900J5702J2071
$$ y = [-1026314, -1039805, -1041985, -1021844, -1001839, -997418, -1002055, -1007047, -1009725, -1008736, -1007741, -1014570, -1021359, -1029121, -1022722, -1013924, -1030534, -1033164, -1035242, -1029480, -1029511, -1034706, -1039135, -1033799, -1036771, -1032156, -1022435, -1013463, -1005236, -1025924, -1049582, -1037710, -1020581, -1007574, -1003966, -1002771, -993883, -999434, -1000684, -995097, -991386, -999867, -998291, -996482, -1001414, -997208, -1007016, -1012859, -1006084, -1004858, -1007396, -1014842, -1027570, -1032028, -1041675, -1045337, -1033249, -1012068, -1010688, -1015584, -1028045, -1023315, -1017432, -1014227, -1014165, -1010827, -1000124, -990362, -995387, -990267, -989983, -999902, -1001489, -1020257, -1023462, -1009041, -1015891, -1031627, -1025172, -1013811, -1022650, -1021003, -1016812, -1006645, -1002907, -1006615, -1011666, -1015676, -1022355, -1019829, -1009912, -1012814, -1021197, -1032253, -1035153, -1019451, -1007380]
$$ [...]
##END NTUPLES=NMR SPECTRUM
##END=
