##TITLE=Analysis number 320539
Compound Code cc 51514
Book Reference 438/156/1
Project Code adrs
Chemist Name antons
##JCAMPDX= 6.0         $$ Bruker NMR JCAMP-DX V2.0
##DATA TYPE= NMR SPECTRUM
##DATA CLASS= NTUPLES
##ORIGIN= Bruker BioSpin GmbH
##OWNER= nmr
$$ XWIN-NMR		Version 3.5
$$ Thu Jun 29 09:51:17 2006 GMT Daylight Time (UT+1h)  MAYBRIDGE\nmr@NMR_250MHZ
##.OBSERVE FREQUENCY= 250.131544655141
##.OBSERVE NUCLEUS= ^1H
##.ACQUISITION MODE= SIMULTANEOUS (DQD)
##.ACQUISITION SCHEME= undefined
##.AVERAGES= 16
##.DIGITISER RES= 18
##SPECTROMETER/DATA SYSTEM= dpx250
##.PULSE SEQUENCE= zg30
##.SOLVENT NAME= CDCl3
##.SHIFT REFERENCE= (INTERNAL, CDCl3, 0, 16.522)
##AUDIT TRAIL= $$ (NUMBER, WHEN, WHO, WHERE, WHAT)
$$ ##TITLE= Audit trail, XWIN-NMR		Version 3.5
$$ ##JCAMPDX= 5.01
$$ ##ORIGIN= Bruker BioSpin GmbH
$$ ##OWNER= nmr
$$ C:\u/data/dgb/nmr/ADRS/1750/pdata/1/auditp.txt
$$ ##AUDIT TRAIL=  $$ (NUMBER, WHEN, WHO, WHERE, WHAT)
(   1,<2006-06-29 09:50:51.51 +100>,<MAYBRIDGE\nmr>,<NMR_250MHZ>,
      <created by zg, POWCHK disabled, PULCHK disabled
       configuration hash MD5:
       E2 DF 36 D8 04 B2 41 60 5A D7 A3 38 5A 4B D0 FE
       data hash MD5: 64K
       AD 93 35 C0 8D 56 3D 38 30 EE EA DA 1E 28 A1 E6>)
(   2,<2006-06-29 09:51:05.76 +100>,<MAYBRIDGE\nmr>,<NMR_250MHZ>,
      <Start of raw data processing
       ef LB = 0.3 FT_mod = 6 PKNL = 1 SI = 32K 
       data hash MD5: 32K
       C1 C9 0A D5 F7 60 F7 CC 0B A2 99 9E F7 AE D6 09>)
(   3,<2006-06-29 09:51:07.68 +100>,<MAYBRIDGE\nmr>,<NMR_250MHZ>,
      <apk 
       data hash MD5: 32K
       2F 60 45 CD 0B 52 35 9E E1 3A 28 D6 AC 45 55 62>)
(   4,<2006-06-29 09:51:08.98 +100>,<MAYBRIDGE\nmr>,<NMR_250MHZ>,
      <abs ABSG = 5 
       data hash MD5: 32K
       8D 1D A6 78 9F F2 A1 93 B2 62 95 C0 B2 F4 AC 7E>)
$$ ##END=
$$ 
$$ hash MD5
$$ 44 C3 D2 1A AB CC FB 5A EC 28 43 26 DB 52 B7 68
##$RELAX= 
##$RELAX= 
##$RELAX= 
##$RELAX= 
##$RELAX= 
##$RELAX= 
##$RELAX= 
$$ Bruker specific parameters
$$ --------------------------
##$DU= <C:\u>
##$EXPNO= 1750
##$NAME= <ADRS>
##$PROCNO= 1
##$TYPE= <nmr>
##$USER= <dgb>
##$AMP= (0..31)
100 100 100 100 100 100 100 100 100 100 100 100 100 100 100 100 100 100 
100 100 100 100 100 100 100 100 100 100 100 100 100 100 
##$AQSEQ= 0
##$AQ_mod= 3
##$AUNM= <au_zg>
##$AUTOPOS= <11 >
##$BF1= 250.13
##$BF2= 250.13
##$BF3= 250.13
##$BF4= 250.13
##$BF5= 500.13
##$BF6= 500.13
##$BF7= 500.13
##$BF8= 500.13
##$BYTORDA= 1
##$CFDGTYP= 0
##$CFRGTYP= 5
##$CHEMSTR= <none>
##$CNST= (0..31)
1 1 145 1 1 1 1 1 1 1 1 1 1 1 1 1 1 1 1 1 1 1 1 1 1 1 1 1 1 1 1 1 
##$CPDPRG= <>
##$CPDPRG1= <>
##$CPDPRG2= <>
##$CPDPRG3= <>
##$CPDPRG4= <mlev>
##$CPDPRG5= <mlev>
##$CPDPRG6= <mlev>
##$CPDPRG7= <mlev>
##$CPDPRG8= <mlev>
##$CPDPRGB= <>
##$CPDPRGT= <>
##$D= (0..31)
0 1 0 0 0 0 0 0 0 0.06 0 0 0 0 0 0 0.0002 0 0 0 0 0 0 0 0 0 0 0 0 0 0 
0 
##$DATE= 1151571049
##$DBL= (0..7)
120 120 120 120 120 120 120 120 
##$DBP= (0..7)
150 150 150 150 150 150 150 150 
##$DBP07= 0
##$DBPNAM0= <>
##$DBPNAM1= <>
$$ [...]
##$SUBNAM7= <"">
##$SUBNAM8= <"">
##$SUBNAM9= <"">
##$SW= 20.6930455092707
##$SWIBOX= (0..15)
0 0 3 0 0 0 0 0 0 0 0 0 0 0 0 0 
##$SW_h= 5175.983436853
##$TD= 65536
##$TD0= 1
##$TE= 296.16
##$TE2= 300
##$TE3= 300
##$TEG= 300
##$TL= (0..7)
0 120 120 120 120 120 120 120 
##$TP= (0..7)
150 150 150 150 150 150 150 150 
##$TP07= 0
##$TPNAME0= <>
##$TPNAME1= <>
##$TPNAME2= <>
##$TPNAME3= <>
##$TPNAME4= <>
##$TPNAME5= <>
##$TPNAME6= <>
##$TPNAME7= <>
##$TPOAL= (0..7)
0.5 0.5 0.5 0.5 0.5 0.5 0.5 0.5 
##$TPOFFS= (0..7)
0 0 0 0 0 0 0 0 
##$TUNHIN= 0
##$TUNHOUT= 0
##$TUNXOUT= 0
##$USERA1= <user>
##$USERA2= <user>
##$USERA3= <user>
##$USERA4= <user>
##$USERA5= <user>
##$V9= 5
##$VALIST= <valist>
##$VCLIST= <CCCCCCCCCCCCCCC>
##$VD= 0
##$VDLIST= <DDDDDDDDDDDDDDD>
##$VPLIST= <PPPPPPPPPPPPPPP>
##$VTLIST= <TTTTTTTTTTTTTTT>
##$WBST= 1024
##$WBSW= 4
##$XGAIN= (0..3)
0 0 0 0 
##$XL= 0
##$YL= 0
##$YMAX_a= 412589
##$YMIN_a= -621268
##$ZGOPTNS= <>
##$ZL1= 120
##$ZL2= 120
##$ZL3= 120
##$ZL4= 120
##$ABSF1= 16.522
##$ABSF2= -4.171173
##$ABSG= 5
##$ABSL= 3
##$ALPHA= 0
##$AQORDER= 0
##$ASSFAC= 0
##$ASSFACI= 0
##$ASSFACX= 0
##$ASSWID= 0
##$AUNMP= <proc_1d>
##$AZFE= 0.1
##$AZFW= 0.1
##$BCFW= 0
##$BC_mod= 0
##$BYTORDP= 0
##$COROFFS= 0
##$CY= 12.5
##$DATMOD= 1
##$DC= 0
##$DFILT= <>
##$DTYPP= 0
##$F1P= 14.0000005364418
##$F2P= -0.99999901652339
##$FCOR= 0.5
##$FTSIZE= 32768
##$FT_mod= 6
##$GAMMA= 0
##$GB= 0
##$INTBC= 1
##$INTSCL= 1
##$ISEN= 128
##$LB= 0.3
##$LEV0= 0
##$LPBIN= 0
##$MAXI= 10000
##$MC2= 0
##$MEAN= 0
##$ME_mod= 0
##$MI= 0
##$NCOEF= 0
##$NC_proc= -2
##$NLEV= 6
##$NOISF1= 0
##$NOISF2= 0
##$NSP= 0
##$NTH_PI= 0
##$NZP= 0
##$OFFSET= 16.522
##$PC= 1
##$PHC0= 173.1682
##$PHC1= 3.530128
##$PH_mod= 1
##$PKNL= yes
##$PPARMOD= 0
##$PSCAL= 4
##$PSIGN= 0
##$REVERSE= no
##$SF= 250.13
##$SI= 32768
##$SIGF1= 0
##$SIGF2= 0
##$SINO= 400
##$SIOLD= 32768
##$SREGLST= <1H.CDCl3>
##$SSB= 0
##$STSI= 32768
##$STSR= 0
##$SW_p= 5175.98343685301
##$SYMM= 0
##$S_DEV= 0
##$TDeff= 65536
##$TDoff= 0
##$TI= <Analysis number 999999
Compound Code 99
Book Reference 9
Project Code 9>
##$TILT= no
##$TM1= 0
##$TM2= 0
##$TOPLEV= 0
##$USERP1= <user>
##$USERP2= <user>
##$USERP3= <user>
##$USERP4= <user>
##$USERP5= <user>
##$WDW= 1
##$XDIM= 32768
##$YMAX_p= 295072570
##$YMIN_p= -58053
$$ End of Bruker specific parameters
$$ ---------------------------------
##NTUPLES= NMR SPECTRUM
##VAR_NAME=  FREQUENCY,     SPECTRUM/REAL,   SPECTRUM/IMAG
##SYMBOL=    X,             R,               I
##VAR_TYPE=  INDEPENDENT,   DEPENDENT,       DEPENDENT
##VAR_FORM=  AFFN,          ASDF,            ASDF
##VAR_DIM=   32768,         32768,           32768
##UNITS=     HZ,            ARBITRARY UNITS, ARBITRARY UNITS
##FACTOR=    0.157963299565203, 1,           1
##FIRST=     4132.6476996994, 0,             0
##LAST=      -1043.33573715361, 0,           0
##MIN=       -1043.33573715361, -58053,      0
##MAX=       4132.6476996994, 295072570,     0
$$ Real data points
##PAGE= N=1
##DATA TABLE= (X++(R..R)), XYDATA
$$ [...]
16418A8121q634j2928N689l783k210K038J389j506n317L357M407k015Q611J0579
16404A7798J574o992k831j4839m943j074o115J6925M799j850O021p859o062Q941
16390C493J722j6045m573Q617M769L346M717K118K691p424l620o861K041O878
16376A869j813o801J2838o112K207j863q924j1445r813J2063J2561K060J3877
16363A0704P027n821L301j690P23m850j0548j1466J7262J9164j075p096r616o917
16349h98n047l679j3158l499N026Q368J1184m158k801J6425q105l857J710l463
16335e952Q516J597K029J560l024k457K441l756O255M114n456j2216p225M382
16321i192R491L015J156o26Q473n848p956J964JR165J579n984l633l207q469n274
$$ plain form
16418 18121 9487 -3441 2248 -1535 -3745 -1707 -318 -1824 -7141 -3784 623 -1392 7219 17798
16404 17798 19372 12380 9549 -5290 -10233 -11307 -17422 -497 4302 2452 8473 614 -5448 3493
16390 3493 5215 -10830 -15403 -6786 -2017 1329 6046 8164 10855 3431 -189 -7050 -5009 1869
16376 1869 56 -6745 6093 -19 2188 325 -8599 -20044 -29857 -17794 -5233 -3173 10704
16363 10704 17731 11910 15211 13521 14244 9394 -1154 -12620 4642 23806 22731 15635 6019 -898
16349 -898 -5945 -9624 -22782 -26281 -21255 -12887 -1703 -5861 -8662 7763 -342 -4199 -2489 -5952
16335 -5952 2564 4161 6190 7750 4726 2269 4710 954 7209 11323 5867 -6349 -13574 -9192
16321 -9192 299 3314 4470 3844 12317 6469 -1487 477 478 9643 11222 5238 1605 -1602 -10071 -15345
16305a5345M651N684J2253j789O05r285L007J069j2551r166M801Q279L598p783
16291a1972l18r967j1110K5850K3561r631j1582m456j121j2591J1876J8089N23
16278G151j3216J2430j606m388m119m248p48k497K535K110m25l232l03n091j3363
16263b9010J367N185J7240K808n823o931M080J2183J084r696k946K429j612j583
16249a1225J608k09J994j2273R64R443Q755K042J700l669Q785J1685j4959j0873
16235f232j4218n904O564L842R977m888m886N569j647P548R59l549m53j491Q759
16220e0l729J3006l805J995J039L66M792M424j1355r535L885l531n426m728J8510
16205E858N57j589R80k738j0175k686O325J3293P627Q518j1486j3679j3924n819
$$ plain form
16305 -15345 -10694 -5010 7243 5454 6059 -3226 -219 850 -11701 -20867 -16066 -7787 -4189 -11972
16291 -11972 -12290 -22257 -33367 -7517 16044 6413 -5169 -9625 -10746 -23337 -11461 6628 7151
16278 7151 -6065 6365 4759 371 -3748 -7996 -8744 -11241 -8706 -6596 -7021 -10253 -10556 -15647 -29010
16263 -29010 -27643 -22458 -5218 -2410 -8233 -15164 -11084 1099 2183 -7513 -10459 -8030 -9642 -11225
16249 -11225 -9617 -9826 -7832 -20105 -19141 -9698 -943 1099 2799 -870 7915 19600 4641 -6232
16235 -6232 -20450 -26354 -19790 -15948 -5971 -10859 -15745 -10176 -11823 -4275 -3316 -6865 -7318 -8809 -50
16220 -50 -3779 9227 5422 7417 8456 8822 13614 18038 6683 -2852 1033 -2498 -7924 -12652 5858
16205 5858 6415 4826 5806 3068 -7107 -9793 -3468 9825 17452 25970 14484 805 -13119 -18938
16191a8938L384N748J1818k720q247j5254m928J2375J1321J5641M789p399p793
16178b03k208M214o111m86j60j0650p997J5931J0446q340j0953J2291N266P402
16164H442J949q874o369M412j577q400n352Q121J8293j561m251j1626K83P649
16150A139r71j706k811j129n512M938L250j2655p385K408P471m322L746J2803
16136g36m279k0639n776J3084j412m952j0444Q22K966j684J8261K0901J0746k66
16122A6592J442N51O878O49r328j9060P357P633l404o087L376r322M277J7937
16108A9491k049j7199o887n448k898R721J9969r561q295J2974n75j61O958j4961
16094A079j3744Q423P689j510n454j0301j0074J773J1754R473K389P06O316J511
$$ plain form
16191 -18938 -15554 -9806 2012 -708 -8955 -24209 -29137 -16762 -5441 10200 14989 7590 -203
16178 -203 -2411 1803 -4308 -4794 -4954 -15604 -23601 -7670 2776 -5564 -16517 -4226 1040 8442
16164 8442 10391 1517 -4852 -440 -2017 -10417 -15769 -7648 10645 9084 4833 -6793 -6510 1139
16150 1139 168 -1538 -4349 -5478 -10990 -6052 -2802 -15457 -22842 -20434 -12963 -17285 -13539 -736
16136 -736 -5015 -25654 -31430 -18346 -19758 -24710 -35154 -34332 -31366 -33050 -14789 6112 16858 16592
16122 16592 18034 18585 25463 26112 16784 -2276 5081 12714 9310 3223 6599 -2723 1554 19491
16108 19491 17442 243 -6644 -12092 -14990 -5269 14700 5139 -3156 9818 9243 9082 16040 1079
16094 1079 -12665 -4242 3447 1937 -3517 -13818 -23892 -22119 -10365 -892 1497 2203 8519 10030
16080A0030q814J29J425l374k148K730n443p361L037K092K952j2354j264L953
16066a4410n36M946O433K946J783m773R119J2318O258j5597p901J415L230P554
16052A2785L855p576j5946Q673M708l643k111r506j878R707L805q182m47r381
16038a5137M769O645R258L312q452l228J2672J1107m746r635l608N0l542r202
16024i737k100R043R714p497N246j2489p912k123J3328J319L958J0806r303j2098
16010i845K501q68l051O310J4715O567J2624p015m95R92q003m423j1637o271L943
15995c956O210q574P8j784Q525O650o400r390J3941J304m734r198l280R19j1449
15980b1138n38J3196J0298P302O516n401l938L468n801r786k882L833j109J24
$$ plain form
16080 10030 1216 1345 2770 -604 -2752 -22 -5465 -12826 -9789 -7697 -4745 -17099 -18363 -14410
16066 -14410 -14946 -10000 -3567 -621 1162 -3611 5508 17826 24084 8487 586 2001 5231 12785
16052 12785 16640 9064 -6882 1791 6499 2856 745 -8761 -10639 -932 2873 -5309 -5756 -15137
16038 -15137 -10368 -3723 5535 8847 395 -2833 9839 20946 16200 6565 2957 3007 -535 -9737
16024 -9737 -11837 -2794 6920 -577 4669 -7820 -15732 -17855 -4527 -3208 750 11556 2253 -9845
16010 -9845 -7344 -8212 -11263 -4953 9762 16329 28953 21938 21443 22435 14432 10009 -1628 -7899 -3956
15995 -3956 2254 -6320 -6242 -8026 499 7149 749 -8641 5300 6604 1870 -7328 -10608 -9689 -21138
15980 -21138 -21676 -8480 1818 9120 15636 10235 6297 9765 3964 -5822 -8704 -4871 -5980 -5856
15966e856P168L361L008M454N169j1047k527O390q50j0060j398k651K470J3331
15952A0962O676n984m495P088L648j5066j6307p911P139J3428J122j631j0645
15939a1976q1J638K133L355P907J0401R914O922Q22q336r056j0669p197j0539
15925a4762o591J568L817P765J281L488L177L666L294m13k801n793J5448N004
15911A8148m323k902P779J672m709p596J584Q026M519L019j140j3585M34j943
15897H983O555K669q476j0231k44Q435P13r319J263l33L324j2136q161P859M959
15882d140K22Q338O01r887q985n482K7342m926o499R18P416j336r832J0523K491
15867F764n325K940q913R634J0064k404n131j239k227j841l698k813J294j0832
$$ plain form
15966 -5856 1312 4673 7681 12135 17304 6257 3730 10120 9270 -790 -2188 -4839 -2369 10962
15952 10962 17638 11654 7159 14247 17895 2829 -13478 -21389 -14250 -822 300 -1331 -11976
15939 -11976 -12057 -10419 -8286 -4931 2976 13377 23291 30213 31035 22699 13643 2974 -4223 -14762
15925 -14762 -21353 -19785 -15968 -8203 -6922 -3434 -257 3409 6703 6290 3489 -2304 13144 18148
15911 18148 13825 10923 18702 20374 15665 8069 9653 17679 22198 25217 24077 10492 10926 8983
15897 8983 15538 18207 9731 -500 -744 7691 8404 -915 348 15 3339 -8797 -16958 -9099 -4140
15882 -4140 -3918 4420 5021 -4866 -13851 -19333 8009 3083 -3416 -2498 4918 3582 -6250 4273 6764
15867 6764 1439 4379 -4534 5100 15164 12760 7629 6390 4163 2322 -1376 -4189 -2895 -13727
15853a3727r875K911K1927p4l421k582k250j293P01j0469J1685N337M946m504
15839f88k70l336o28j5122j160O197J1106R633J325k698L145j5781j4311P030
15825a5558J6960Q196P582o793o848K394J708m287l793k733Q514P735j901r093
15811B083j4628k539k394m294J0058q49K088n523P260M234K248k38o013J853q504
15796a5158o37M654J1196L480l928j458n846n530N965Q110l588p064j412k770
15782a3986J16N539J1150o594o581M022J6869J780n848p690L148K028O742k95
15768A0400m140P937q113j5837k4871q35M639J2612P144J240L082K641n429q30
15754a0360L541J0394K900r31R543P660p750j7563j6461L019L742P108k121N79
$$ plain form
15853 -13727 -23602 -20691 1236 1162 -2259 -4841 -7091 -8384 -7683 -18152 -6467 -1130 3816 -688
15839 -688 -958 -4294 -4922 -20044 -21204 -15007 -3901 5732 7057 4359 7504 -8277 -22588 -15558
15825 -15558 1402 9598 17180 10387 3539 5933 7641 3354 -439 -3172 5342 13077 11176 2083
15811 2083 -12545 -15084 -17478 -21772 -11714 -12563 -10475 -15998 -8738 -4504 -2256 -2494 -8507 -6654 -15158
15796 -15158 -15795 -11141 55 3535 -393 -1851 -7697 -13227 -7262 848 -2740 -9804 -11216 -13986
15782 -13986 -13870 -8331 2819 -3775 -10356 -6334 10535 12315 6467 -1223 1925 3953 10695 10400
15768 10400 6260 14197 6084 -9753 -34624 -35459 -30820 -18208 -11064 -9824 -6742 -4101 -9530 -10360
15754 -10360 -6819 3575 6475 5544 15087 22747 14997 -2566 -19027 -16008 -12266 -5158 -7279 -6700
15740f700m995o242N639l333J789J780R916Q036M34m530j1163k374o031M358J825
15725a1591N955M420K895N759k666O652O815o062P997j000l799N520k099o263
15711A2533j0076j1367N429K2790P361J719j1085j7572j3270J6349L933Q45j207
15698F382k348q002O393M000n124K936N337m980k056l824o98J455P734r145N25
15683a415K379q115Q380j2653o8J3440J2047O124q122K454K511j2679O478M740
15669A5501j0873j0430j0738j2145o193J0116J9445J3888k463M77k086p668k06
15656c375J937Q21J3013l755o171N301J0798M047p004j248M889o341r099K482
15642F295N134k137j84p95r278M074j1865l084J4372K112k828o621n157R26r053
$$ plain form
15740 -6700 -11695 -17937 -12298 -15631 -13842 -12062 -2146 5890 6324 1794 -9369 -11743 -17774 -13416 -11591
15725 -11591 -5636 -1216 1679 7438 4772 11424 18239 12177 20174 19174 15375 20895 18796 12533
15711 12533 2457 -8910 -3481 19309 26670 28389 17304 -268 -13538 2811 6744 7589 6382
15698 6382 4034 -3968 2425 6425 1301 4237 9574 4594 2538 -1286 -1984 -529 7205 -1940 -1415
15683 -1415 964 -7151 1229 -11424 -11492 1948 13995 20119 11997 14451 16962 4283 10761 15501
15669 15501 4628 -5802 -16540 -28685 -34878 -24762 -5317 8571 6108 6585 4499 -3169 -3375
15656 -3375 -1438 -617 12396 8641 2470 7771 18569 22616 15612 14364 19253 12912 3813 6295
15642 6295 11429 9292 9108 8313 -965 3109 -8756 -11840 2532 4644 1816 -4805 -9962 -9036 -18089
15627a8089L543J4917p227J388l912n759J1832J6279R019L616N911r213k0216
15614B089N768K628k962n269l14P279k03m399L3P246j0604j4349M555Q295R248
15599I041J5328M195j0215j4181K52K108o204R457O450j0991N093O540M803l075
15585A8601r329J370j0834J1080J5662J2491J059j383o504k012L868M68j0716
15572B3821n773L974j918j1435J14R123P492r439L027p181j3063N5j5779k028
15558a9010J9972J180j3056R869N797j763l760l660J6915n33o341j0936P93J703
15544b830Q78N063L140j26j0128j907Q388l096j1510p909N665J3674L042P359
15530I703j3513j262L425J0966j934L02K441l819K007j5532M925R872j332o667
$$ plain form
15627 -18089 -14546 371 -6856 -5468 -9380 -15139 -3307 12972 21991 25607 31518 22305 2089
15614 2089 7857 10485 7523 2254 1940 9219 9016 4617 4650 11896 1292 -13057 -8502 -207 9041
15599 9041 24369 28564 18349 4168 4420 6528 324 9781 16231 5240 10333 16873 21676 18601
15585 18601 9272 10642 -192 10888 26550 39041 40100 38717 32213 30201 34069 34537 23821
15572 23821 18048 22022 20104 8669 8783 17906 25398 15959 18986 11805 -1258 -1203 -16982 -19010
15558 -19010 962 2142 -10914 -1045 4752 2989 -771 -4431 12484 11951 5610 -5326 -4533 -2830
15544 -2830 -1952 3111 6251 6125 -4003 -5910 2478 -618 -12128 -20037 -14372 -698 2344 9703
15530 9703 -3810 -5072 -1647 9319 7385 7687 10128 6309 8316 -7216 -2291 7581 6249 -418
15516d18M883R897j354q357q18k831p530O449J2791R733Q040q872j2949R91J1324
15501B0979J912n468l988L30j2480r857L010J37J1400L470j2896r278n040N227
15487a2542J4881M621j0627j2765R600J0382k613n177o457Q029J2420L434k063
15474A1123j2765q332J2006J0684j0486j3664K998l789o064N001R784k106m191
15461i801J2159J2003j8584n693J4697P455j635M820j575r071m070j1786j2320
15448b3401p507J0760J4480J7602k613m190k172J1055k173L779J5367m64P36j732
15434B9527r804m817p235q838o193q95J0117m832o753O91L914l903Q255l017J905
15419a878j232R686P30k3038K2552M597m914m645j0974m673P615p66K116q88o397
$$ plain form
15516 -418 4465 14362 13008 4651 3833 1002 -6528 -79 12712 22445 30485 21613 8664 9655 20979
15501 20979 22891 17423 13435 13765 1285 -8572 -5562 -5425 5975 9445 -3451 -12729 -17769 -12542
15487 -12542 2339 6960 -3667 -16432 -6832 3550 937 -4240 -10697 -2668 9752 13186 11123
15474 11123 -1642 -9974 2032 12716 2230 -11434 -8436 -12225 -18289 -13288 -3504 -5610 -9801
15461 -9801 2358 14361 -4223 -9916 4781 12236 10601 15421 13846 4775 705 -11081 -23401
15448 -23401 -30908 -20148 -5668 11934 9321 5131 2959 14014 11841 15620 30987 30523 31259 29527
15434 29527 19723 14906 7671 -1167 -7360 -8255 1862 -2970 -9723 -9032 -5118 -9021 -766 -3783 -1878
15419 -1878 -3110 6576 7306 -15732 6820 11417 6503 1858 -9116 -13789 -6174 -6940 -4824 -5712 -12109
15404a2109j0121q469P146J6471L535P44J5557J945M328j8417l34J2595M87j2623
15390G35o85p981L887Q400o040J1565J0021l539o894p65n337L43j788o954K993
15375b039o00N954n01j2676r311m097O002J3934P047K928j873j970k376J0034
15361A0456L621O324n735j1348n058j771p043K490J6358P484p336M456J2980j0806
15347A5072j3861l38K3807P906j0597q108J220m582O882p516n282o111o91J5510
15333A3311P313j2801L37k567J367R983l275K66P811J4239j9777j1587k418n007
15319b805j331J808K143K853p69O142o722K677l517p877Q196O947r235k598J427
15304b661o08K159o312r33O11Q358o919m805m680k997p028j802P896R981j155
$$ plain form
15404 -12109 -22230 -30699 -23553 -7082 -3547 -2803 12754 14699 19027 610 276 12871 13358 735
15390 735 50 -7931 -4044 4356 -1684 9881 19902 16363 9469 8704 3367 3710 1922 -5032 -2039
15375 -2039 -2639 3315 2814 -9862 -19173 -23270 -17268 -3334 3713 6641 4768 2798 422 10456
15361 10456 14077 20401 14666 3318 -1740 -3511 -10554 -8064 8294 15778 8442 12898 25878 15072
15347 15072 1211 873 24680 32586 21989 13881 15101 10519 17401 9885 4603 -1508 -2199 13311
15333 13311 20624 7823 8160 5593 6960 16943 13668 13934 21745 35984 16207 4620 2202 -2805
15319 -2805 -4136 -2328 -185 2668 1899 8041 1319 3996 479 -7398 798 7745 -1490 -4088 -2661
15304 -2661 -3269 -1110 -7422 -8355 -7744 614 -6305 -11110 -15790 -18787 -25815 -27617 -19721 -9740 -10895
15289a0895J73J3053M070J72p229q967L993j7246L509J1972M883J2575q54k510
15275F699L900O407M15r617j36J1586k642n439r4n88l581L88k924K981J844K966
15259A2165Q364n892q068%j1156Q0J8476J8522q46q694j5622n362k22L581o21
15244D705j1162m520J2034p013n834q4M198J2979N850q865J792J1742N97j611
15230A4808J580r884k404M768L051L978j4254q267n190J417J1826J0488n942k422
15216C553P246R95o707j2271j7057Q391j527P7J9876J7554L21j7104o909o324
15202i886n248O49K4J1069n207P750P751l755J87M388K848j1305o76j797m357
15187g565L229m876N472m280r325Q936J5297N239j4571q556R772J4695R198l501
$$ plain form
15289 -10895 -10722 2331 6401 6573 -656 -9623 -5630 -22876 -19367 -7395 -2512 10063 9209 6699
15275 6699 10599 17006 17421 7804 7668 19254 16612 11173 11079 10491 6910 7298 4374 7355 9199 12165
15259 12165 20529 14637 6569 6569 -4587 -4507 13969 32491 31645 22951 7329 1967 1745 5326 4705
15244 4705 -6457 -10977 1057 -5956 -11790 -11874 -7676 5303 11153 2288 4080 15822 16419 14808
15230 14808 16388 6504 4100 8868 11919 15897 1643 -6624 -11814 -10397 1429 11917 5975 3553
15216 3553 10799 11794 5087 -7184 -24241 -15850 -17377 -17300 2576 20130 20451 3347 -3562 -9886
15202 -9886 -15134 -14485 -14461 -3392 -8599 -849 6902 3147 3334 7722 10570 -735 -1411 -3208 -7565
15187 -7565 -4336 -9212 -3740 -8020 -17345 -8409 6888 12127 -2444 -11000 -1228 13467 22665 19164
15173A9164n121j179o038p119l142Q11M187k221r793Q712M634J351r622j7483
15159b2859M646J3189R982l933j7065Q289P736J89l947l098M61N131J817J057
15145A595J4345Q96j623l372n049j1510M938J0952j655l565n267K224J1562J8871
15131C3342k921j8669r716O864J848k808J299j1129o22O722n516L700P442m43
15117I393k206Q12M492q517j1901p74M033P553K062j6413N44R694q01j235M404
15102A140j36M51k912M294L76l075L14r697m374O824q037N110R042J2021m529
15087F812o520j0360n391P470J4497j0054j549N884O517L764j1452j1643L033
15074h992L128Q714o805L030k399J0730P42q634r415j7131O156K7529J5529m560
$$ plain form
15173 19164 14043 12864 6826 -293 -3435 -2624 1563 -658 -10451 -1739 2895 4246 -5376 -22859
15159 -22859 -18213 -5024 4958 1025 -16040 -7751 -15 174 -3773 -6871 -6410 -1279 538 1595
15145 1595 15940 16836 15213 11841 6792 -4718 220 11172 9517 5952 685 2909 14471 33342
15131 33342 30421 11752 2036 8900 10748 7940 9239 -1890 -2512 4210 -1306 2394 9836 9393
15117 9393 7187 7999 12491 3974 -7927 -8701 -4668 2885 4947 -11466 -10922 -1228 -2029 -3264 1140
15102 1140 1004 1455 -1457 2837 3213 138 452 -9245 -13619 -6795 -14832 -9722 -680 11341 6812
15087 6812 292 -10068 -15459 -7989 6508 -3546 -5095 789 7306 11070 -382 -12025 -8992
15074 -8992 -5864 2850 -3955 -925 -3324 7406 8148 -486 -9901 -27032 -20876 6653 22182 17622
15060A7622J033R135O329k201j0656m416q817j856k183k722P742O766q970K646
15046I452q479l718R170L226N861j840m18O77N477j750l144o081M302J305M581
15031A8621m863o964j1308j2437L127J1861K197p151J7409J1922j867p518n36
15018A2493r08r778l964M541o22j050n639N75p36m80L481J5927k860q418n104
15003b542L94l553j434J4984o361m743R063p22l990M319M84n547n691L645p314
14988i008n870J5826L008J290o449p689J1293j03l491m275m578Q641J2503l67
14974A0731k0086m939j003k862k1K268P643O715m95k593J500j907j1925k436P896
14959a1514n740o953m595J1151P598M744n572K380J577J431J078M764q680j506
$$ plain form
15060 17622 18655 27790 34119 31918 21262 16846 8029 6173 3990 1268 9010 15776 6806 9452
15046 9452 973 -2745 6425 9651 15512 13672 13254 13931 19408 17658 14514 8433 12735 14040 18621
15031 18621 13758 6794 -4514 -16951 -13824 -1963 234 -6917 10492 22414 20547 13029 12493
15018 12493 11585 1807 -2157 2384 1762 712 -4927 -4352 -5088 -5568 -2087 13840 10980 2562 -2542
15003 -2542 -2148 -5701 -7135 7849 1488 -3255 5808 5086 1096 5415 5899 352 -5339 -1694 -9008
14988 -9008 -14878 948 3956 5246 -1203 -8892 2401 2298 -1193 -5468 -10046 -1405 11098 10731
14974 10731 -9355 -14294 -15297 -18159 -18180 -15912 -8269 -1554 -2049 -4642 -3142 -5049 -16974 -19410 -11514
14959 -11514 -17254 -24207 -28802 -17651 -10053 -5309 -10881 -8501 -6924 -5493 -4415 349 -8331 -9837
14945i837J1978O592l597l045J1865N478n454q79j804L112J807j1585n1k833J1778
14930A3525j2610P82l010p822K434M63j054j623K08O196O681R605K756P336r051
14915A4816J614j844m311m640k047j4131J013p398R251j086j4293j0564R543J3198
14901a0879J5081m07J049K673j2731j417J223k124j779o946L365m69p380R797
14887a0944J5337R011k579k164R92O618n008J1059P631k475j9788p734M827K3001
14873B7784O387j2580j1845R21m292j2518K797N981L983n116l916m432K380O63
14859c803r15J3425j3050j0611j825O166J0600M290j7163r876J0221J9994J537
14846H990q784K707L905K353Q46Q453r646o543M394j284l055R126N166q1j3014
$$ plain form
14945 -9837 2141 8733 5136 2091 13956 19434 13980 13101 11297 14409 16216 4631 4580 1747 13525
14930 13525 915 1697 -1313 -9135 -6701 -6238 -7292 -8915 -8707 -2511 4170 13775 16531 23867 14816
14915 14816 16430 14586 10275 5635 3588 -10543 -9530 -16928 -7677 -8763 -23056 -33620 -24077 -10879
14901 -10879 4202 3795 4844 7517 -5214 -6631 -5408 -7532 -9311 -16257 -12892 -13361 -20741 -10944
14887 -10944 4393 13404 10825 8661 9653 16271 11263 22322 29953 27478 7690 -44 4783 27784
14873 27784 34171 21591 9746 10667 6375 -6143 -3346 2635 6618 1502 -2414 -6846 -4466 -3803
14859 -3803 -4718 8707 -4343 -14954 -16779 -10613 -13 4277 -12886 -22762 -12541 7453 8990
14846 8990 206 2913 6818 9171 10017 18470 8824 2281 6675 5391 2336 11462 16628 16547 3533
14831C533j2269O316P970n977k54Q707q864R91Q489M377R982j047j166j1138j068
14816H582Q099K281o273K164k493j0p759q692L702q70Q87l169P006L963P125J184
14800A5727j1559n203J2960m426p014O558j4427k208R058p22M351L65q01k096
14786E63p314K804R091J7079O682j0598j4298j318J3833k958p114M2m1J2517O332
14771B5302j910j5783m166J574Q308k478k679r50J34N364l161j7885j8061M317
14757b2074p276j186P476J5594J503l092M065m247Q946J3244K553q157R14J685
14743I948Q568p564j812p319J5511j923n666j0416L782J3509q657j0326j4695
14730a7060m235N724P786J1469L442l533p374J2150P434n588j0425k86J1031J0940
$$ plain form
14831 3533 -8736 -2420 5550 -427 -681 8026 -838 153 8642 13019 23001 21954 20788 9650 8582
14816 8582 16681 18962 12689 14853 12360 12350 4591 -4101 -399 -1269 -382 -3551 3455 7418 14543 15727
14800 15727 4168 -1035 11925 7499 485 7043 -7384 -9592 -534 -1256 3095 3460 2659 563
14786 563 -6751 -3947 5144 22223 28905 18307 4009 2691 16524 13566 6452 6494 6453 18970 25302
14771 25302 23392 7609 3443 5017 13325 10847 8168 7218 7352 12716 9555 -8330 -26391 -22074
14757 -22074 -29350 -30536 -23060 -7466 -5963 -9055 -4990 -9237 -291 12953 15506 7349 8263 9948
14743 9948 18516 10952 9140 1821 17332 15409 9743 -673 3109 16618 7961 -2365 -17060
14730 -17060 -21295 -15571 -7785 3684 7126 3593 -3781 8369 15803 10215 -210 -496 10535 21475
14716B1475m169o844J081j0962L969j930l073m87P501j252R539L434j36l700p367
14701G079q387M303P164N259K012j993J771J887l870j0607l787N237j132j680
14687C256q143Q228p458K035K528O809N801j884o318j926K279j2701K520R18n074
14672i130r47J1489M37K017J262p605q334j725J37l862J0669O655n321M821J1398
14657A1961R33J575k109q046j0721k195J0648k561m518J006K68P755K204L319
14643I519R722N504r513q845J1104Q382j9361m521K528O432N114q111q216o193
14629f455J1556Q670r226j612J1507R958r312q664N159N244J3288J707o924j4153
14615A0743l095N131K364j6893O41j523J269J2689r819r11J9j3j7402L575J1410
$$ plain form
14716 21475 17306 10462 11543 581 4550 2620 -453 -940 6561 5309 14848 18282 18146 14446 7079
14701 7079 -1308 2995 10159 15418 17430 15437 17208 19095 15225 4618 831 6068 4936 3256
14687 3256 -4887 3341 -4117 -2082 446 7255 13056 11172 4854 2928 5207 -7494 -4974 -4056 -9130
14672 -9130 -10077 1412 1849 3866 5128 -2477 -10811 -12536 -12399 -16261 -5592 1063 -4258 563 11961
14657 11961 12894 14469 12360 4314 -6407 -8602 2046 -515 -5033 -4027 -3759 3996 6200 9519
14643 9519 19241 24745 15232 6387 17491 25873 6512 1991 4519 10951 16065 7954 -262 -6455
14629 -6455 5101 13771 4545 2933 14440 24398 15086 6422 11581 16825 30113 31820 24896 10743
14615 10743 7648 12779 15143 -1750 -1109 -2632 -1363 11326 1507 596 615 602 -16800 -13225 -1815
14600a815l041J1178J0512j4136m678n196K171l041J949Q343J4609k107j8364
14587c616j6772P473J7132k555j379l640P207K800M188k71n180K526Q791o570
14573A0134m939m620j14K559J1768N913o536O355r497p726l153k014J192K116
14559A438K25N987M11M831m440o014J499M576o493o990P064R925L716j3146j0743
14544h154J632J648O859n053J972O855M950j2455K337N422M276o665j2606K778
14530f204M465m135M489j1071o168J1248J2356J0337j551j8165J441J6943M498
14517A8483r744p270r301l784J712J660P376J2787o460k644O900m862o191M350
14503C012K954J714j747j0762q022N64O290L345j5055l753K0627J306j0874j108
$$ plain form
14600 -1815 -4856 6322 16834 2698 -1980 -7176 -5005 -8046 -6097 2246 16855 14748 -3616
14587 -3616 -20388 -12915 4217 1662 283 -3357 3850 6650 10838 10567 5387 7913 16704 10134
14573 10134 5195 575 461 3020 14788 20701 14165 20520 11023 3297 144 -1870 -678 1438
14559 1438 1663 7650 8061 12892 8452 2438 3937 8513 2020 -4970 2094 12019 15735 2589 -8154
14544 -8154 -6522 -4874 1985 -3068 -1096 5759 10709 -1746 591 6013 10289 3624 -8982 -6204
14530 -6204 -1739 -5874 -1385 -12456 -18624 -7376 4980 15317 13766 -4399 -2958 13985 18483
14517 18483 8739 1469 -7832 -11616 -9904 -8244 -868 11919 5459 2815 9715 4853 -1338 3012
14503 3012 5966 7680 5933 -4829 -12851 -12287 -5997 -2652 -17707 -21460 -833 473 -10401 -11509
14489a1509P178O801p336q06L619J0240m647m742m661k468l322o691J187O142
14475a1015R308N612k613r169N60L236P170m469n35m011j0190q56O458J0638j49
14460b5M360Q090j2190J265K767n377Q041L985q919j093m96n852R641j183k266
14445G48RM963Q84O612r579j7553M199P871J3860k043j6211p022l244J2257M539
14430B90J1954R408j5956j5382n52J1703l527k890O453Q741O958n544p862j2519
14416h725j1420M27J0884k696P763J0259l313m722q553R8m755J1861J0895j1886
14402c883K860J767j3392J177Q891M063j626L386J394Q962M400n301J790Q995
14388B3483J082r156j145q32n603j1673M242J2552O217l35N397l554q229m702
$$ plain form
14489 -11509 -4331 2470 -4866 -5672 -2053 8187 3540 -1202 -5863 -8331 -11653 -18344 -17157 -11015
14475 -11015 -1707 3905 1292 -7877 -7317 -4081 3089 -1380 -1915 -5926 -16116 -16972 -10514 124 -25
14460 -25 4335 12425 235 1500 4267 -1110 6931 10916 1997 904 408 -5444 4197 3014 748
14445 748 757 5720 6604 13216 3637 -13916 -9717 -1846 12014 9971 -6240 -13262 -16506 -4249 290
14430 290 12244 21652 5696 -9686 -10238 1465 -2062 -4952 1501 10242 17200 11656 3794 -8725
14416 -8725 -20145 -19718 -8834 -11530 -3767 6492 3179 -1543 -10096 -9998 -14753 -2892 8003 -3883
14402 -3883 -1023 744 -12648 -11471 -2580 1483 -143 3243 4637 13599 17999 12698 14488 23483
14388 23483 24565 15409 14264 13432 7829 -3844 398 12950 19167 18832 24229 20675 12446 7744
14374G744o326J24j60O912k556j4199K338P104J0692J0457j60N78o342l503J055
14359A3758N955m339j9826j2902P374J7111J043j930P77m895l27J661m394O954
14345F020Q913N677j3554J490L851L30r124k436J0487J167j9370j6202J3350M841
14331d560j4598M920K319L591p095J0574J619J1317k152n166l758R377j555p083
14317b250J722n463K98R15J1277J2376j2038j6436K112R904M138k851p290k257
14303e843M641P802M890j1940o860J8791M629p476k150p894o978P964N712j843
14289C445J816p816k739k178J0225M195M653k082n976N147n391n811p713J4687
14275D462R984p220N827R704L51q290n340l977o54O819R675j7068j5164K185J0443
$$ plain form
14374 7744 1418 1542 1382 8294 5738 -8461 -6123 981 11673 22130 21970 22548 16206 12703 13758
14359 13758 19713 15374 -4452 -17354 -9980 7131 8174 6244 7021 2126 1799 3460 -934 6020
14345 6020 14933 20610 7056 8546 12397 12727 3603 1167 11654 12821 -6549 -22751 -9401 -4560
14331 -4560 -19158 -14238 -11919 -8328 -15423 -4849 -3230 8087 5935 769 -2989 6388 4833 -2250
14317 -2250 -528 -5991 -5693 -4778 6499 18875 6837 -9599 -7487 2417 6555 3704 -3586 -5843
14303 -5843 -1202 6600 11490 -450 -7310 11481 16110 8634 6484 -1410 -8388 -424 5288 3445
14289 3445 5261 -2555 -5294 -7472 2753 6948 11601 9519 3543 8690 3299 -2512 -10225 4462
14275 4462 14446 7226 13053 22757 23108 14818 9478 5501 4847 11666 21341 4273 -10891 -8706 1737
14260A737Q477O869K335n835j0614q864j1785M789J4674M743q672j7220r503P245
14246b1624J2845N924k705R227O488K2r820r247J290L641Q850j1403l563l340
14232a3415J0347R123k512q090j782K3616J2427m861j0803l084o139j133O794
14219A0488P980Q03J0332L737m952j3092j1202q121J863L56k646P105P374m442
14205E583j382P243N390n025L30O440j0161j0541K502o42J3846L926n738j0129
14191A642q220k776q43j1228j334j287P289N299k373R547M176Q462J0475j4887
14177C942N71j5J030k61j417n429o785J2643J5108p69o474l739Q367l225Q179
14162B1726k380m177J672K206l776l510R14O451Q47L255n400r257Q811k80o163
$$ plain form
14260 1737 10214 17083 19418 13583 2969 -5895 -17680 -12891 1783 6526 -2146 -19366 -28869 -21624
14246 -21624 -8779 -2855 -5560 3667 10155 10177 357 -8890 -7600 -3959 4891 -6512 -10075 -13415
14232 -13415 -3068 6055 3543 -4547 -6329 17287 29714 24853 14050 10966 4827 3694 10488
14219 10488 18468 19271 29603 33340 28388 15296 4094 -4027 -2164 -1808 -4454 2651 10025 5583
14205 5583 4201 11444 16834 11809 12139 18579 8418 -2123 379 -263 13583 17509 11771 1642
14191 1642 -6578 -9354 -10197 -21425 -22759 -24046 -16757 -11458 -13831 -4284 -108 8354 18829 3942
14177 3942 4513 4498 5528 5267 3850 -1579 -8364 4279 19387 18618 12144 8405 16772 13547 21726
14162 21726 19346 15169 16841 19047 15271 11761 12675 19126 19973 23228 17828 8571 17382 17102 10939
14147A0939K291L8n598l14l179o449R331P224O937o269m615K229p682l729m543
14132c389L627K401P110M467p953O855O84J103k637p72l900l527m056N763M322
14117A0098q689j3404J4464P494l589q073q580K71J1883R515q437n573N984J181
14103D545Q06M670n24l893j794r327j2359j91Q714R693K858J5677P503j3320j1562
14088A496m044Q961J3983r531n89K819j345l49K641l315k902J016Q427j0001N557
14073A2824m013j8504L616K520Q402R732p33K666J1099M239j1435r466k447M090
14059A2590J1489n682j9858N545J62M789J753k19k690l337m951L973J080P405
14045A2049p92J1231l182j4128j896n888M996l874n053j1073m861l118N974M835
$$ plain form
14147 10939 13230 13268 7670 7356 4177 -2272 7059 14283 21220 14951 10336 12565 4883 1154 -3389
14132 -3389 238 2639 9749 14216 6263 13118 13802 14905 12268 11496 7596 4069 13 5776 10098
14117 10098 1409 -11995 2469 9963 6374 -1699 -10279 -10008 1875 11390 2953 -2620 3364 4545
14103 4545 5351 10021 9497 5604 3810 -5517 -17876 -18067 -9353 340 3198 18875 26378 13058 1496
14088 1496 -2548 6413 20396 10865 10276 13095 11750 11401 14042 10727 7825 8841 17268 7267 12824
14073 12824 8811 -9693 -6077 -3557 4845 14577 13844 16510 27609 31848 20413 10947 8500 12590
14059 12590 24079 18397 -1461 4084 4246 9035 10788 10569 7879 4542 -409 3564 4644 12049
14045 12049 11257 22488 19306 5178 3282 -2606 2390 -1484 -6537 -17610 -22471 -25589 -19615 -14780
14031a4780J2095J0369m144l788l823j728n837l18J01m78N173M194L479n854j059
14016f398K487L650K96q741K615L210j1492N336J875K150N861q320j54R278n035
14001c382p671L475m110k665M79m302l345J471m364O325J0953K012n046J1353
13987A183P005O405j1087r775J3512R391m801K86M984K544M040q390q371q644
13973a718l362j908J2283J1887n633j0367J387p194j4443N14J1256N27R140Q260
13959A0629k698j2565j3919P850K0223k45j2251j0057P511M055J208k123K192
13946a90R069M923L323K673o51j681l836q932n43K226L619q73n678q853k489n995
13930a3888R526L672k582Q527L426l104j84j1544r486n583P67R77J0590P638k130
$$ plain form
14031 -14780 -2685 7684 3540 -248 -4071 -5799 -11636 -11954 -11853 -12331 -7158 -2964 515 -5339 -6398
14016 -6398 -3911 -261 35 -8706 -6091 -2881 -14373 -9037 -7162 -5012 849 -7471 -7625 1653 -3382
14001 -3382 -11053 -7578 -11688 -14353 -13874 -18176 -21521 -20050 -24414 -18089 -7136 -5124 -10170 1183
13987 1183 8188 14593 3506 -6269 7243 16634 11833 12119 17103 19647 23687 15297 6926 -1718
13973 -1718 -5080 -6988 5295 17182 11549 1182 2569 -4625 -19068 -18554 -7298 -6771 2369 10629
13959 10629 7931 -4634 -18553 -10703 9520 9275 -2976 -13033 -5522 -1467 -259 -2382 -190
13946 -190 8879 13802 17125 19798 19147 17466 13630 4698 4155 6381 10000 9127 3449 -5404 -7893 -13888
13930 -13888 -4362 -690 -3272 5255 8681 5577 5393 -6151 -15637 -21220 -20453 -19476 -8886 -1248 -3378
13915c378R273K619k018n063m665m565M482k759J8341J2132j3069J633Q975J07
13901B2045L529p523o539k456J355L588K670q605j1303Q810O633R999j013m485
13887A6705m810m136R926K173n186P083n793j5074M843J2404L332K178Q988p490
13873B5143j9036j5467M401R300L740M505N562N675j307K255P869K84j3274K943
13859B2593J1206J0377r002N99M688J080O053R2j0213j016J5470N587m334j0585
13845D2595J0814J1659R14j1188o694M222m94R295R63J0238n758j0949L165R292
13831F8074j3826j196L64N258M599n952J2256K0839m40j0237j2522j3276j5691
13818C8250o150L191J6996R058M327m268j8179j2149M940J4518J1358m322j5134
$$ plain form
13915 -3378 5895 8514 6496 1433 -3232 -7797 -3315 -6074 12267 24399 11330 12963 21938 22045
13901 22045 25574 18051 11512 9056 10411 13999 16669 8064 -3239 5571 12204 22203 21190 16705
13887 16705 11895 7759 17685 19858 14672 21755 15962 888 5731 18135 21467 23645 32633 25143
13873 25143 6107 -9360 -4959 4341 8081 12586 18148 23823 22516 24771 32640 32924 19650 22593
13859 22593 33799 44176 35174 35773 40461 41541 47594 47686 37473 36457 51927 57514 53180 42595
13845 42595 53409 65068 65982 54794 48100 52322 51828 61123 62086 72324 66566 55617 58782 68074
13831 68074 54248 53052 53416 58674 63273 57321 69577 90416 89976 79739 67217 53941 38250
13818 38250 32100 35291 52287 61345 65672 61404 43225 31076 36016 50534 61892 57570 42436
13805D2436l174J417L601r076N859j0869R235L556o761J776J4318Q9K634N992
13791F1033j1054j4697l509j539o428J518l615p513K829Q310n732m57O088O134
13777C1368l385p064O572j920j551J020o365j7570K157L164M796R085l600o17
13763A6090O538j0329n221K546P804P357J3131o038n641q862k230o52J308K961
13749A8762K131n975N215J749o30n754l293l361K065O980m086r687l168L476M94
13734D918L492k693j5033n867J4945P785j431J420O182n570J2790K828m743p536
13720A1487q416J7142R466j0506n219j0667J8954P985n639l877l92j0383l867
13707F068M701n56p561n119l736L949P839O647J301Q72n921K47Q801m446p61M51
$$ plain form
13805 42436 39262 40679 44280 35204 41063 30194 39429 42985 36224 38000 52318 52407 55041 61033
13791 61033 49979 35282 31773 30234 23806 25324 21709 14196 17025 25335 19603 19146 25234 31368
13777 31368 27983 20919 27491 25571 24020 25040 18675 1105 3262 6426 11222 20307 16707 16090
13763 16090 22628 12299 7078 9624 17428 24785 37916 31878 26237 17375 15145 14493 15801 18762
13749 18762 20893 14918 20133 21882 21252 15498 12205 8844 10909 17889 13803 4116 948 4424 4918
13734 4918 8410 5717 -9316 -15183 -238 7547 6116 7536 13718 8148 20938 23766 19023 11487
13720 11487 3071 20213 29679 19173 13954 3287 22241 30226 24587 20710 20318 9935 6068
13707 6068 10769 10213 2652 -2467 -6203 -2254 5585 12232 13533 14405 8484 8731 17532 13086 12325 12776
13691A2776J1784j867n475L932M302K532J393j773o203p344j412N567J530L106
13677B2848o66k546l038K185K117j935j562M622o210O282J1905m268m284r225
13663A6225m704J197l060j086j2296j596R128l660k516l967o875J2762J1804o082
13649E274J1291J5028K625n313q755j148Q842R179l729o733L107k87o762n297
13635A7322k227j124N997N049L242Q21p336n871J0899Q084k926M361p729n527
13621B3035N066j340r601j1249j438R679J133n273n710K018R861N644J3509J144
13607C6478m60R548m278o477q380j1923N040J5807j3408o334O0N708Q666L993
13593C4040L677k145k473N03N09o8k21K967J2371j17J114o859P656Q561R953J562
$$ plain form
13691 12776 24560 22693 17218 21150 25452 27984 29377 27604 21401 14057 12645 18212 19742 22848
13677 22848 22182 19636 16598 18783 20900 18965 17403 22025 15815 22097 34002 29734 25450 16225
13663 16225 11521 12718 9658 8572 -3724 -5320 3808 148 -2368 -6335 -13210 -448 11356 5274
13649 5274 16565 31593 34218 28905 20150 19002 27844 37023 33294 26561 29668 29381 22619 17322
13635 17322 15095 13971 19968 25017 28259 29080 21744 15873 26772 34856 31930 36291 28562 23035
13621 23035 28101 26761 17160 5911 4473 14152 15285 10012 4302 6320 16181 21825 35334 36478
13607 36478 36018 45566 41288 34811 26431 14508 19548 35355 21947 15613 15673 21381 30047 34040
13593 34040 37717 35572 33099 33602 34111 34043 33822 36789 49160 49043 50157 43298 50954 59515 69468 71030
13577G1030o965J4495L390j8672j4382k467j556N588J168j478j0651Q67N332K626
13563D8325m011j2584K384n098K770J080O999q76M572m717j3473J2422J6053j495
13549E2351n123k637j3912k094O72l718m255r22n133o377l09K866M578O752l754
13534A8985o183n499J2312Q35J1052M99J256L003p58N384k844k410K710k338Q573
13519D4577j0849j9772k376J9122j540j0698k500J570N887K010n546q915n07N491
13505A5954k723J5751R842j480O386o218l892l463r384J726k417m344r56q745
13491F037j416j921M642Q608N170Q928o938j6553k482P699R048M393J334J1490
13477C8039m508q034K780J9107K638q107k468n853j2951j2311N893n499J3118
$$ plain form
13577 71030 64065 78560 81950 63278 48896 46429 44873 50461 51629 50151 39500 40367 45699 48325
13563 48325 44314 31730 34114 29016 31786 32866 39865 38989 43561 38844 25371 37793 53846 52351
13549 52351 47228 44591 30679 28585 29257 25539 21284 20362 15229 8852 8543 11409 15987 22739 18985
13534 18985 12802 7303 19615 20450 31502 32001 33257 36260 35502 40886 38042 35632 38342 36004 44577
13519 44577 33728 13956 11580 30702 29162 18464 15964 17534 23421 25431 19885 10970 10463 15954
13505 15954 13231 28982 38824 37344 43730 37512 33620 30157 20773 22499 20082 15738 14782 6037
13491 6037 4621 2700 7342 15950 21120 30048 23110 6557 4075 11774 20822 25215 26549 38039
13477 38039 33531 25497 28277 47384 50022 41915 39447 33594 20643 8332 14225 8726 21844
13464B1844L502n079j0755Q96l563Q047L384O750k055j2161N692K783n878O705
13450B0112m823o540j977k1L222J3830O426q35N629J1353M015n543n943j0670
13436B8235r876q573Q326O811O24j4827p7R767J1289J517j277j2249J599K501
13422B3790n210K540Q522n202L910M177P547n30L625K40J3276O112k788J2579
13408G2588K2913K5837J6379P228N515j1379l6614j9671o441j1211j1221j2027
13396D1896K542R354p194k1873m679J9977M692k851l111L486J6323K732p064o087
13382D8143l447j1543l772L731k616K452J0581L0413K0153J8559K4890K8573L7701
13369B03818K4638J2634M889j9371m7663m1507k7435q972j5641j0144J015j7611
$$ plain form
13464 21844 25346 20267 9512 10408 6845 14892 18276 25026 22971 10810 16502 19285 13407 20112
13450 20112 15289 8749 6772 6751 9973 23803 30229 29394 35023 46376 50391 44848 38905 28235
13436 28235 18359 9786 18112 24923 25547 10720 10643 20410 31699 33216 31939 19690 21289 23790
13422 23790 18580 21120 29642 24440 28350 32527 40074 39544 43169 43409 56685 62797 60009 72588
13408 72588 95501 121338 137717 144945 150460 139081 102467 82796 76355 65144 53923 41896
13396 41896 44438 53792 46598 24725 20046 40023 44715 41864 38753 42239 58562 61294 54230 48143
13382 48143 44696 33153 29381 33112 30496 32948 43529 73942 94095 112654 137544 166117 203818
13369 203818 228456 241090 245979 226608 178945 137438 110003 101031 85390 75246 76261 58650
13357E8650j0343L636R412o81L686m143j7032K768J897p458j663O86J3056K1132
13343G3603Rj4069j854K136J6579R686k333J5962q25J7532K0997J5467K0893m416
13329A69367k9067l0675j6346j1910j4622p377O349j082j8256r12O280M979l042
13316E3686O115o325m711L014K225K032r218j0729L934N419K0l466O703L984m941
13301D7742j2719p653l63j1438L604k0j520R672Q774R026J10o832r005p701j677
13286B0000J1958j015j4570N970J3896j563m638L338N318M769Q881l628k687L533
13272D9562j5281L636M97j228m485k566r014p244L601P52J0422J858n043M179
13258B9646j391q379L396j4k73P591K076l95k788J732J701N950k057j2826m016
$$ plain form
13357 58650 48307 51943 61355 60674 64360 60217 43185 45953 47850 40392 38729 39415 52471 73603
13343 73603 73612 59543 57689 59825 76404 86090 83757 99719 98894 116426 137423 152890 173783 169367
13329 169367 140300 109625 93279 81369 66747 59370 65719 64637 46381 45469 51749 56728 53686
13316 53686 59801 53476 48765 51779 54004 56036 46818 36089 40023 45442 45462 41996 48699 52683 47742
13301 47742 35023 27370 27007 15569 19173 19153 17633 27305 36079 45105 45215 38383 29378 21677 20000
13286 20000 31958 30943 16373 22343 36239 34676 30038 33376 38694 43463 52344 48716 46029 49562
13272 49562 34281 37917 38414 37186 32701 30135 21121 13877 17478 18230 28652 30510 25467 29646
13258 29646 28255 19876 23272 23258 22985 30576 32652 32257 29469 31201 32902 38852 36795 23969 19953
13243A9953M42J995M900Q259j228n980j0930p531M856r32m273O512o703l844J3359
13228A8855P506j205Q776J1247l863M511K919p729n422j140k960P846J0689P024
13214E7054r466j0931k321J1096P847m206j6948j0831J7629M482m637J858j223
13201C9403O180K179M088M737j0251j1029p86O181M307o197p012L412J0611O768
13187E2591j074j4514R270J6652J2925o264j1612J427Q714k49j3437M311P927
13174F6667m938m156j2317M54J5841J1777o424q137k727m264n844p50m428J902
13160D2656L06j7081J64R314J0486N608M377J38m027R76O139j5313R9p262R668
13145D6248J7456P186K534M320O21p134q124k979k439p13Q168K69j4848j5677
$$ plain form
13243 19953 20395 22390 27290 35549 34321 28341 17411 9880 14736 13804 9531 16043 9340 5496 18855
13228 18855 26361 25156 33932 45179 41316 45827 48746 41017 35595 34455 31495 39341 50030 57054
13214 57054 47588 36657 34336 45432 53279 49073 32125 21294 38923 43405 38768 40626 39403
13201 39403 45583 47762 51850 56587 46336 35307 34521 40702 45009 38812 31800 35212 45823 52591
13187 52591 51517 37003 46273 62925 75850 69586 57974 59401 68115 67866 54429 58740 66667
13174 66667 61729 57573 45256 45710 61551 73328 66904 58767 56040 51776 45932 45182 40754 42656
13160 42656 42962 25881 26045 35359 45845 51453 55830 55968 51941 52917 59056 43743 43842 36580 46248
13145 46248 63704 70890 73424 77744 78365 71231 63107 60128 57689 56976 65144 65413 50565 34888
13131C4888r878M638J2740n447q271o104j124J860j790o675J7614R724J455J0952
13117E4582J621q408q31J143P23q44j032l615j872M595J354J2323J6267O390j828
13102H0568m111M446r252j0616m855j187M174O835J5750k206K650l435J149k551
13088G7359n54L98M892J1445P219P104k368J760N013O757l521r667J2436R723
13074A27996j255l18m95k232P639K918J0022l893k89Q615o459o466L083J2399
13060A51265j956j2921N452Q806m572j193l73N831q895j5368N016N424J1545J8057
13046A66118K1300J2347o361K121O846K398K702O414M440K607k218j589j1625
13033B05500r192J3530O479k368L547l971r970J793N640P111M763k74K317J624
$$ plain form
13131 34888 25010 29648 42388 36941 28670 22566 21442 23302 21512 14837 32451 42175 43630 54582
13117 54582 56203 47795 46964 48107 48830 47986 46954 43339 41467 46062 47416 59739 76006 82396 80568
13102 80568 76457 80903 71651 61035 56180 54993 59167 66002 81752 79546 82196 78761 79910 77359
13088 77359 76805 77203 82095 93540 100759 107863 105495 107255 112268 119025 115504 105837 118273 127996
13074 127996 126741 126423 125928 123696 131335 134253 144275 140382 140093 148708 142249 135783 138866 151265
13060 151265 149309 136388 141840 150646 146074 144881 144508 150339 141444 126076 131092 136516 148061 166118
13046 166118 187418 199765 193404 195525 202371 204769 207471 213885 218325 220932 218714 217125 205500
13033 205500 196308 209838 216317 213949 217496 213525 203555 205348 210988 218099 222862 222588 224905 226529
13019B26529k040N861O373K301j0111l917K0999O788J1871J5654J08K320J8156
13006C00892J0839N184k0475m383J3365K2486K1986m511n585K3252J5911J0464
12994C89425J9162J2528Q010J0235J3088K0973Q303L230J9027K3857L2820L9176
12982E99834K7474M6424N4339N4892M8763N6591O9488Q7694J07264J45671J69641
12971A468075K05651K37002K73037L13409L72598M84617O66572R55795J470979
12962F447735K250416L247755M018307L910328K770813P60169j909142l958180
12954A7538201m131251l084160k029603j321599q90156o41788m84026l52952k37346
12945D365320j67988j18154o6893j4396j6430l245k442j1007L3131J14213K11796
$$ plain form
13019 226529 224489 230350 236723 239024 228913 224996 245995 252783 264654 280308 280416 282736 300892
13006 300892 311731 316915 296440 292057 305422 327908 349894 345383 339798 363050 378961 389425
12994 389425 408587 421115 429125 439360 452448 473421 481724 484954 503981 527838 560658 599834
12982 599834 627308 673732 728071 782963 831726 888317 957805 1045499 1152763 1298434 1468075
12971 1468075 1673726 1910728 2183765 2497174 2869772 3354389 4020961 4976756 6447735
12962 6447735 8698151 11945906 15964213 19874541 22645354 23405523 21496381 17538201
12954 17538201 13406950 10322790 8293187 6971588 6081432 5439644 4955618 4602666 4365320
12945 4365320 4197332 4079178 4012285 3997889 3981459 3978214 3975772 3964765 3997896 4112109 4323905
12934D323905K77965L69925M65043N76008P33796R65355J336046J994703L064149
12925A4106895M750903O849248Q349578Q003631N500750J107081m535766q670413
12917C5461907q882991o528560m163873k650000j815440j316285j020966q00068
12909H283724o29968n17774m24865l52559l05422k45154k07377j79254j63170
12900E258181j27653r7194q1404l1596M8832J43247K30725L35816M74400O78999
12890F832353J043801J622644K490275L530127M189949L863674K454152J00861
12882B6127836k768792m632949m454624l189958k083509j385832r65581p17847
12874E928744n71903m71863l90570l24593k70144k53845k32064k15858k04812
$$ plain form
12934 4323905 4601870 4971795 5436838 6012846 6746642 7711997 9048043 11042746 14106895
12925 14106895 18857798 25707046 34056624 42060255 47561005 48668086 44132320 35461907
12917 35461907 26578916 20050356 15886483 13236483 11421043 10104758 9083792 8283724
12909 8283724 7653756 7135982 6711117 6358558 6053136 5807982 5600605 5421351 5258181
12900 5258181 5130528 5033334 4951930 4920334 4969166 5112413 5343138 5678954 6153354 6832353
12890 6832353 7876154 9498798 11989073 15519200 19709149 23572823 26026975 26127836
12882 26127836 23359044 18726095 14271471 11081513 8998004 7612172 6646591 5928744
12874 5928744 5356841 4884978 4494408 4169815 3899671 3645826 3413762 3197904 2993092
12865B993092j97801j78664j38852j21906j18683r7984r1970q5257o3362o8475
12855A830138n5347m7801n8370p8410o9325o8061p3827o8823n3153m4084m4587
12844A168350m9778m2755l8813k6655m3447m4635k5310k8011k7984l5621k9272
12833G76069k0972l0606k2377j3694j0024j9663j9509m745k3969l3540k1513j8864
12821E36593j7468k348j6354l2580j6682j6496j8781q396l595r807j2648j1644
12809C69794k2888j6941j6716j7643j2510q435m214o190j885k01j0464r147o704
12796B35856O987o750K426k411J1848J8758o612j3217q356j2933j0586j1655j1658
12783A91697Q316R068l700p837n862j0799q228n341l981j4881N401l30L889j781
$$ plain form
12865 2993092 2795291 2616627 2477775 2355869 2237186 2139202 2047232 1961975 1898613 1830138
12855 1830138 1774791 1726990 1668620 1590210 1520885 1452824 1378997 1310174 1257021 1212937 1168350
12844 1168350 1118572 1075817 1037004 1010349 966902 922267 896957 868946 840962 805341 776069
12833 776069 755097 724491 702114 688420 678396 658733 639224 634479 610510 576970 555457 536593
12821 536593 519125 516777 500423 467843 451161 434665 415884 407488 403893 394086 381438 369794
12809 369794 346906 329965 313249 295606 283096 274661 270447 264257 262372 262171 251707 242560 235856
12796 235856 242843 236093 238519 236108 247956 266714 260102 246885 238529 225596 215010 203355 191697
12783 191697 200013 209081 205381 197544 191682 180883 172655 167314 163333 148452 153853 153523 157412 155631
12769A55631P01j8634K503p318r688Q931K206J2007L422p091J1134J1213l298
12756A61719n62J1578j7759n674o448l610Q224m247L344p732p520j487M904N370
12742A40100m343l389R81j419M692m946j913r511n44O720k647M903J0393j0038
12728A29039j1651K102J854l196l782L352j5718l780O717K7L747K02n064j91P982
12713A11640k106l444J7018K358J264l139j3740j8893m276m64O077k84M472O744
12699A03227n636M374R477N753R368o455K644K110l971Q957O509o778j5154j1255
12685A03170K653k913L81J3760M816q119q895j3485p898o162L532r954O221Q313
12671H5420N841k324J060K267l627l0J7185J6877o202q584k852j0394j791j0047
$$ plain form
12769 155631 156332 137698 140201 132883 123195 132126 134332 146339 149761 142670 153804 165017 161719
12756 161719 161157 172735 154976 149302 142854 139244 147468 143221 146565 138833 131313 129826 134730 140100
12742 140100 135757 132368 133349 131930 136622 131676 129763 120252 119708 126428 123781 128684 139077 129039
12728 129039 117388 119490 121344 118148 114366 117718 102000 98220 104937 104964 108711 108913 103849 103658 111640
12713 111640 109534 106090 123108 125466 126730 123591 109851 90958 86682 86218 92295 92011 96483 103227
12699 103227 97591 101965 111442 117195 126563 120108 122752 124862 120891 129848 136357 129579 114425 103170
12685 103170 105823 102910 103291 117051 121867 113748 104853 91368 83470 77308 80840 70886 77107 85420
12671 85420 91261 88937 89997 92264 88637 88607 105792 122669 116467 107883 105031 94637 92846 82799
12657H2799M379j749j040J802q779k501M038q567j129j990O397N365o085K520
12643G5460L332K440K892J291J653j0368N458J7070N089m325j8276r415p864Q80
12629F5317N939P663J2925l784q567k121j6348L168J4473R330n863j1032l915
12616F7185J92r187K851m646P218O124K0689m926r376n739P990M967O538m431
12602H5449o783N425M554j632M454k806n667m157J336K722j886K738R078P83r568
12587H4040k943Q613m450l875M516Q78Q632j357N50j5288l485O912Q660J661R284
12572A02348p438Q85J4559J545p841J890P437N450O741P34J197Q496k680r985
12558A23338m968j823J624K224J1998J226r66P304O900j286O69M186J692p540
$$ plain form
12657 82799 87178 85429 84389 86191 77412 74911 78949 70382 69253 67263 73660 79025 72940 75460
12643 75460 78792 81232 84124 85415 87068 76700 82158 99228 104317 99992 81716 72301 64437 65317
12629 65317 71256 78919 91844 88060 79493 77372 61024 64192 78665 87995 82132 71100 67185
12616 67185 67377 58190 61041 56395 63613 69737 90426 85500 76124 70385 78375 83342 89880 85449
12602 85449 78666 84091 88645 87013 91467 88661 82994 78837 80173 82895 81009 83747 92825 93608 84040
12587 84040 81097 89710 85260 81385 85901 86779 95411 94054 94604 79316 75831 82743 91403 93064 102348
12572 102348 94910 95795 110354 111899 104058 105948 113385 118835 125576 126310 127507 136003 133323 123338
12558 123338 118370 116547 118171 120395 132393 133619 132653 139957 146857 145571 146240 150426 152118 144578
12544A44578r983j539L976r092J3938M660n687K982L21J147Q753N365l948j3125
12530A42346j1097o213N846M745L661J251Q967k968p342n854L184J323k563p870
12516A27416L477n29j957j1306R132N007J9327L193k022o561J2465J7208J7588
12503A92438K7480L931j2769j3802j3654j4762o847r069j329O028Q80l964L993
12490A58554q011L959J1582m194o518j2032j2298q025N837M253J7668J608J125
12477A53508J3213k99L591Q105O603J0077R769K0542K9221M8985M2742J4001j6374
12464C43684k3750l0205k7511l6304l0129k1098p008N498l641o797p750J44j439
12451A53694j623J3915P586p938p184N24J0670N416K70k562r234J671r292j5007
$$ plain form
12544 144578 134595 133056 137032 127940 141878 146538 140851 143833 144154 145301 154054 159419 155471 142346
12530 142346 131249 125036 130882 135627 139288 140539 149506 146538 139196 133342 136526 137849 135286 127416
12516 127416 130893 130364 128407 117101 126233 131240 150567 153760 151738 145177 157642 174850 192438
12503 192438 219918 223849 211080 197278 183624 168862 162015 152946 151617 157645 158525 154561 158554
12490 158554 150543 154502 166084 161890 155372 143340 131042 123017 128854 133107 150775 152383 153508
12477 153508 166721 166422 170013 178118 184721 194798 204567 225109 254330 303315 346057 360058 343684
12464 343684 319934 289729 262218 225914 195785 174687 167679 173177 169536 162739 154989 155133 153694
12451 153694 152071 165986 173572 165634 158450 158974 169644 175060 175330 172768 163534 165205 155913 140906
12437A40906J655K836l581J3784K3778K7259K5118N405N573J4589P86j2569j9435
12424B26104k0428r632j5347j5460O57P113L033k090L824j762L233m25q300m191
12410A66329j423n821k89K00p111q154l354J1468J1336J5809J0266q604j987p016
12396A71649j0042J1003L731j420j1065M997L169k706J161Q648K419j2940m700
12383A63904N07J2551j595n399p71K777l966J2369R612J140l500j670j392M026
12369A88593K760K498j710K230j180K485k433L045l43R445n06j41n529L916K372
12354B05502j1322k356J2512M493Q673K697j940k912J862l0j288J81o36J978J1474
12339B28888J1296N944K073r869r788L313j628R194J2282M558p681k478J1336
$$ plain form
12437 140906 142561 145397 141816 155600 179378 206637 231755 237160 242733 257322 258108 245539 226104
12424 226104 205676 196044 180697 165237 165894 173007 176040 173950 177774 176012 179245 178820 170520 166329
12410 166329 164906 159085 158796 158996 151885 143731 140377 151845 163181 178990 189256 180652 178665 171649
12396 171649 161607 172610 176341 174921 163856 168853 172022 169316 170477 179125 181544 168604 163904
12383 163904 164411 176962 175367 169968 169197 171974 168008 180377 189989 191129 187629 185959 184567 188593
12369 188593 191353 193851 192141 194371 193191 195676 193243 196288 195945 205390 204884 204743 199214 203130 205502
12354 205502 194180 191824 204336 208829 217502 220199 218259 215347 217209 217179 215891 216072 215436 217414 228888
12339 228888 240184 246128 248201 238332 228544 231857 230229 239423 251705 256263 248582 246104 257440
12326B57440N501r025j4513J1197J5415o14p134n634J5057n237J079k322O652
12313B67862Q259M249p50k809N18n566P364L374Q452O201k339J891K0560P125
12299C24391j3612j3289J6180l731K374o23P797M780n315m271J4826R126Q029
12286C46662K662M402Q72M304m559n306o606P306P302K34N48J3506M256J4529
12272C90112P614Q039m463k556Q232R283J1934J3237J249L887J7856m233N828
12259D66019K4991J8916j0941j5601O823K956q80N955k317n737j9168M83Q743
12246D80242J7535J391m681L385M0k763R079K095r471j4518p48P723J3862Q903
12232E12074L050N886o756j4325q514J2481J3561J0319R894P107R068J1385J1352
$$ plain form
12326 257440 262941 253916 239403 250600 266015 265401 258267 252633 267690 262453 263532 261210 267862
12313 267862 276121 280370 279620 276811 277329 271763 279127 282501 290953 297154 294815 296706 317266 324391
12299 324391 310779 297490 313670 309939 312313 311690 319487 324267 318952 314681 329507 338633 346662
12286 346662 349324 353726 354598 358902 354343 349037 342431 349737 357039 357273 357821 371327 375583 390112
12272 390112 397726 405765 401302 398746 406978 416261 428195 441432 442681 446568 464424 460191 466019
12259 466019 491010 509926 498985 483384 490207 493163 492283 498238 495921 490184 471016 471499 480242
12246 480242 497777 499168 494487 497872 497912 495149 504228 506323 496852 482334 481586 489309 503171 512074
12232 512074 515124 521010 514254 499929 491415 503896 517457 527776 537670 544777 553845 565230 576582
12219E76582r344j5228M031m890J100Q674P229J2268M318P30k964K1054K1933
12206F25493o639p341L957J6861M529N317P392J0564J9193K855Q399J2098j339
12193G01339j146J68l100J5130J1080R981K853N440J0226J598J0907n245N283
12180G64514M074M422J2977K1561K5909J7110J0649p777q603O178P321J2423J6761
12167H87519K251N835J9298K2257J5446J9462j394L96o264M40R794J3006K1318
12154A009364K4695J1910J3179R436J3193J4956J5471J2607N355M038J2118K1771
12142A168093K3243K0073K2626K2232Q709O104K2185L0713K6512J2934J8161K2352
12130A403937L0722J3795J4337K2511J1473K2760L5592K7071J7597K6085J6289
$$ plain form
12219 576582 567238 552010 556041 551151 552251 560925 568154 580422 584740 585470 582506 603560 625493
12206 625493 618854 611513 615470 632331 636860 642177 649569 660133 679326 682181 690580 702678 701339
12193 701339 700193 700361 697261 712391 723471 733452 736305 741745 751971 753569 764476 759231 764514
12180 764514 768588 773010 785987 807548 833457 850567 861216 853439 844836 851014 858335 870758 887519
12167 887519 889770 895605 914903 937160 952606 972068 970674 971070 964806 965246 975040 988046 1009364
12154 1009364 1034059 1045969 1059148 1068584 1081777 1096733 1112204 1124811 1130166 1134204 1146322 1168093
12142 1168093 1191336 1211409 1234035 1256267 1264976 1271080 1293265 1323978 1350490 1363424 1381585 1403937
12130 1403937 1434659 1448454 1462791 1485302 1496775 1519535 1555127 1582198 1599795 1625880 1642169
12119A642169J2403Q571J3784J8613L2174K7020K0906L3777J2768J6677L2410
12108A871272J9430J8478K3522L2048K5864K7863K7761L1979L8177M4212K8071
12097B188677J9757L3183L6843L2371K5765M3861L7749L0688K3286L4813L9482
12086B546475M3432M5208M0521L4927M2464M9604M1090L0478M2366M3415M8004
12075C007984M3454K9283M5823N1976N5703M9907N2450L0767M3202M2438N1379
12064C504366N5463N2511N9378N6577N0245N6737N5695N4091M9804M9727N8996
12053D103590N9477N3592N8167N3973O7652O2227N2511O0197N3064M3436O1305
12042D729191O0345N2030N1010M5300M6301O0049N2938N0784M4344L8643L6369
$$ plain form
12119 1642169 1654572 1663143 1676927 1695540 1727714 1754734 1775640 1809417 1822185 1838862 1871272
12108 1871272 1890702 1909180 1932702 1964750 1990614 2018477 2046238 2078217 2116394 2160606 2188677
12097 2188677 2208434 2241617 2278460 2310831 2336596 2380457 2418206 2448894 2472180 2506993 2546475
12086 2546475 2589907 2635115 2675636 2710563 2753027 2802631 2843721 2874199 2916565 2959980 3007984
12075 3007984 3051438 3080721 3126544 3178520 3234223 3284130 3336580 3367347 3410549 3452987 3504366
12064 3504366 3559829 3612340 3671718 3728295 3778540 3835277 3890972 3945063 3994867 4044594 4103590
12053 4103590 4163067 4216659 4274826 4328799 4396451 4458678 4511189 4571386 4624450 4667886 4729191
12042 4729191 4789536 4841566 4892576 4937876 4984177 5044226 5097164 5147948 5192292 5230935 5267304
12031E267304K8628M1980N4713N0207L8678L7613M2635L7660L1522K7523J5855
12020E674318J2171J8969J8920J0987J8509Q121P657J4125R994R560j755K882
12008E804458j4363j5116j5569j4230k5380m009q918k8330k3258j3501k0377k4549
11996E596858l5529k3360l3780l1706l7551l2359l2798n9411n2117l2755k9361
11985E196131m3007n6700l8115k8465m8330n8110n4435n0829m6701m3957m8988
11974D678494n7269n3339o2020n1280m3615m3629m1848m2281m2316n5284n2459
11963D133154n2563n7582n4589k5702n0341n7836o0534m9074m1330m3504l6233
11952C603866l2194n2143n1772n7874n0815m3500m3306m5391l1573m4922l8238
$$ plain form
12031 5267304 5295932 5337912 5392625 5442832 5481510 5519123 5561758 5599418 5630940 5658463 5674318
12020 5674318 5686489 5705458 5724378 5735365 5753874 5761995 5769652 5783777 5793771 5803331 5801576 5804458
12008 5804458 5790095 5774979 5759410 5745180 5719800 5715791 5706873 5678543 5655285 5641784 5621407 5596858
11996 5596858 5561329 5537969 5504189 5472483 5434932 5402573 5369775 5310364 5258247 5225492 5196131
11985 5196131 5153124 5096424 5058309 5029844 4981514 4923404 4868969 4818140 4771439 4727482 4678494
11974 4678494 4621225 4567886 4505866 4454586 4410971 4367342 4325494 4283213 4240897 4185613 4133154
11963 4133154 4080591 4023009 3968420 3942718 3892377 3834541 3774007 3724933 3683603 3640099 3603866
11952 3603866 3571672 3519529 3467757 3409883 3359068 3315568 3272262 3226871 3195298 3150376 3112138
11941C112138m3563m8395l5851l5088m0246l5350k8826l3782l8420m4556l4503
11930B693558m3983k8366k1826k7963l5755m5619k3921l6578m5197k1639k8227
11919B334484l1343l3982k9217l2111k7776k6987l5693j5248r230l4399k8450
11908B030048k3685k5669l0388k7615j7449k5411k7890j8371k0563k6987j9694
11897A766326k4862l3845k9124k3443r301j3307j4729j4567j0909k7379k3263
11886A541597j9000k2976j8386j5055j9071k3350k2941o039q810j1281j7313n58
11874A356817j6483k5485j6584j3879j6306j1125j1773r857p558o193j9841k0399
11862A181334j6858n717j3482o100j3498j4340j7745r469j5400o154n022j0245
$$ plain form
11941 3112138 3068575 3020180 2984329 2949241 2908995 2873645 2844819 2811037 2772617 2728061 2693558
11930 2693558 2649575 2621209 2599383 2571420 2535665 2490046 2466125 2429547 2384350 2362711 2334484
11919 2334484 2303141 2269159 2239942 2207831 2180055 2153068 2117375 2102127 2092897 2058498 2030048
11908 2030048 2006363 1980694 1950306 1922691 1905242 1879831 1851941 1833570 1813007 1786020 1766326
11897 1766326 1741464 1707619 1678495 1655052 1645751 1632444 1617715 1603148 1592239 1564860 1541597
11886 1541597 1522597 1499621 1481235 1466180 1447109 1423759 1400818 1394779 1385969 1374688 1357375 1356817
11874 1356817 1340334 1314849 1298265 1284386 1268080 1256955 1245182 1235325 1227767 1221574 1201733 1181334
11862 1181334 1164476 1158759 1145277 1139177 1125679 1111339 1093594 1084125 1068725 1062571 1057549 1047304
11850A047304j3295q459r234j0197j7486m172p79J459q254j1183q460p949j5021
11837I34274q326l823m740j9471q435l72p916p350l873j4133r356l861P078p066
11823H42630j6737j1702q757j2956m538j9853M351P02K475j3250j417O773N338
11810G73059j4765k2714j5905j961M059r673q060j258q567J984j934o679j4597
11797F72989j1933j5852k622N846q01n844l112m201n42j4493j4891q234L107J4531
11783F13948n037j5824j0854Q465j900j835k630k942j7409j1333Q683m640j2426
11770E44266p105j461k653j2407P965L746q728n229j234j24p726k519m830O330
11756E08291m318j319m969j1938r821k259j5818j1694K436j306J4133J0977R57
$$ plain form
11850 1047304 1034009 1025550 1016316 1006119 988633 984461 983682 985141 976887 965704 957244 949295 934274
11837 934274 925948 922125 917385 897914 889479 889107 881191 873841 869968 855835 846479 842618 849696 842630
11823 842630 825893 814191 805434 792478 787940 768087 772438 773140 775615 762365 760948 767721 773059
11810 773059 758294 735580 719675 717714 721773 712100 704040 702782 694215 696199 694265 687586 672989
11797 672989 661056 645204 642582 648428 647627 641783 638671 634470 633928 619435 604544 596310 599417 613948
11783 613948 608911 593087 582233 590698 588798 586963 584333 581391 563982 552649 561332 556692 544266
11770 544266 537161 535700 533047 520640 528605 532351 523623 518394 517160 517036 509310 506791 501961 508291
11756 508291 503973 502654 497685 485747 475926 473667 457849 446155 448591 447285 461418 472395 473352
11743D73352j4431j3014j8714K757Q150N885q996j3454J975m76r212K919p842
11730D08899k388N341Q496j0502r254K460J3109n012L191P982o060o049r573j6572
11716C84068r612q467n979N014m728J513L73O783r19n121j2028m974j0485j904
11702C33534K419J0596N923k002j2573o925n684n432j055K08q453l47J7208R362
11688C36779k534j7307j5747L393l838R730M263m459n560O695M942m642k367l642
11674C05706m140M013o685j7011K176O898M092k453j2843k460Q938L302n56n506
11660B83471j926l827L331L612l547P0N030K206j2828l951m175J15K41L985J11
11645B71918r11K511p318j4827j598p497k753N439r208p922K24J9433J3473j57
$$ plain form
11743 473352 458921 445907 427193 429950 438100 443985 434989 421535 423510 423034 413822 416741 408899
11730 408899 406511 411852 420348 409846 400592 403052 416161 411149 414340 422322 416262 410213 400640 384068
11716 384068 374456 365989 360010 365024 360296 361809 362182 368965 368046 362925 350897 345923 335438 333534
11702 333534 335953 346549 352472 350470 337897 330972 325288 319856 318801 319009 310556 310209 327417 336779
11688 336779 334245 316938 301191 304584 300746 310476 314739 310280 304720 311415 316357 311715 309348 305706
11674 305706 301566 305579 298894 281883 284059 290957 295049 292596 279753 277293 286231 289533 288977 283471
11660 283471 281545 277718 281049 284661 281114 281184 286214 288420 275592 271641 267466 267581 267822 271807 271918
11645 271918 271007 273518 266200 251373 249775 242278 239525 244964 235756 227834 228058 247491 260964 260807
11631B60807j0365R615J869N063o596j590m435k018k693L37L011m330n933l490
11617B39252L714o763K091k541j3192j7927o555O031J3064j607J804j17K390k994
11603B16650O660J1371j0566n088j3237l779m691o749k392l522L050J5067K42
11590B03016k021j2770q786R876o825l287J470Q558J1110o249l913k192Q094J0325
11576B06406o135p64m426P116L066n578r744j3234N917Q659P315J974M41j1451
11562A89562r690J0292L627Q18M394K514n268n562R452Q957m347O090j417j5202
11548A94220j3761K257J315j0927L333O7J2119L173J135j129j880l038M96m53
11534A86927p276m636j613j1487J4828Q979m593O648m761q08o682j154K468P137
$$ plain form
11631 260807 250442 260057 261926 266989 260393 258803 254368 252350 249657 249994 253005 248675 242742 239252
11617 239252 242966 236203 238294 235753 222561 204634 198079 204110 217174 215567 217371 217254 219644 216650
11603 216650 223310 234681 224115 219027 205790 202011 197320 190571 188179 184657 187707 202774 203016
11590 203016 200995 188225 179439 189315 182490 179203 180673 189231 200341 194092 190179 187987 196081 206406
11576 206406 200271 199507 195081 202197 205263 199685 189941 176707 182624 191283 198598 200572 201013 189562
11562 189562 179872 190164 193791 194609 199003 201517 196249 190687 200139 209096 204749 210839 209422 194220
11548 194220 180459 182716 184031 173104 176437 176504 188623 191796 192931 191802 189922 186884 187380 186927
11534 186927 179651 175015 173402 161915 176743 185722 181129 187777 183016 182208 175526 174372 176840 183977
11520A83977k042o942o426N677P130j3563j3835L388j057N600n081o732J1579
11507A61673J6873o339m289K259P702l411o377n701p201n066n122P788J4427k093
11493A65123l537N396p190n142J917K419n805o182Q945M950K185J0001j1413M123
11479A65790K530m319R666k894j1784j4399q409J606M629l576P260P66k873P917
11465A51910K706J101q000j0579j3453j1875J4185Q92p261l86n890l732P904N267
11451A22789J6529O326n447j54Q775p292J110L247j5732l020j762Q659J643l713
11437A31958L377Q559O885j0453M093J0169L775l346L660l152m724p580p408l797
11423A32016j565m501m081K739R535J2440J669j0721r837R07j806q372R320R242
$$ plain form
11520 183977 181935 174993 168567 174244 181374 167811 153976 157364 156307 161907 156826 150094 161673
11507 161673 178546 172207 167918 170177 177879 174468 168091 162390 155189 150123 145001 152789 167216 165123
11493 165123 161586 166982 159792 154650 156567 158986 153181 146999 155944 160894 163079 173080 161667 165790
11479 165790 168320 164001 173667 170773 158989 144590 136181 137787 142416 138840 146100 146866 143993 151910
11465 151910 154616 155717 147717 137138 123685 111810 125995 126887 119626 119240 113350 109618 117522 122789
11451 122789 139318 145644 140197 140043 148818 141526 142636 145883 130151 127131 125369 134028 135671 131958
11437 131958 135335 143894 150779 140326 144419 154588 158363 155017 158677 155525 150801 143221 135813 132016
11423 132016 130451 125950 121869 124608 134143 146583 148252 137531 127694 128601 126795 118423 127743 136985
11409A36985q766n793O455J2856J3003q382j1494l822o299N774r296K502Q790
11396A32513P764J0109q450n634k016R662N524l139k3326m468n402l489J2863
11383A22511R565J660m595l147K436j938m40l10j0702j1021J4840P777O198N778
11369A38612L209J620r536N38k088M051l099j0200o875J587J0481k427j1227L832
11355A18478K649O974j0957k1914j652O006Q483O443l374p25R75L323p065o153
11341A01491J445K909k009L496J7134K054k921n285k750J3121J2083j491j0786
11328A28491j2608m881m894k361K697J0846K0286N279q762n758j217J4509M431
11315A46058q647k795R36J5741K4712J5605L0906K1305J3728j1556r276j9904
$$ plain form
11409 136985 128219 122426 128881 141737 154740 146358 134864 131042 124743 130517 121221 123723 132513
11396 132513 140277 150386 141936 136302 134286 143948 149472 146333 123007 118539 113137 109648 122511
11383 122511 132076 133736 129141 125994 128430 126492 126052 125742 115040 104019 118859 126636 132834 138612
11369 138612 141821 143441 133905 134443 132355 136406 133307 123107 116232 117819 128300 125873 114646 118478
11355 118478 121127 128101 117144 95230 93578 99584 108067 114510 111136 110411 111386 114709 107644 101491
11341 101491 102936 105845 103836 107332 124466 126520 123599 118314 115564 128685 140768 139277 128491
11328 128491 115883 111002 106108 103747 106444 117290 137576 142855 134093 128335 127118 141627 146058
11315 146058 137411 134616 135552 151293 176005 191610 222516 243821 257549 245993 236717 216813
11303B16813k7144j0966j1149n827O534p896j6561m146k859j673j531J9488l770
11290A49313Q55j392m1N471P344m352j2030Q55Q623j115J4536K2013J0988Q822
11276B09890J4453L4042M1429L9152M0700K6571j927k6094n2843o3678l3677j0368
11264B17650j8498j0606k2469j0578N039O389q402q542M374l423K525q35k96r313
11250A43015J0728M084o21Q0L954K3399J0503Q489K2139P965J3750J4640K9964
11237B92089K0217P781q572j4294j6851k1095l0248l0481j9743p471N75j0478
11225A61429q152n520l996k780P777N190p883J387l017p725K270M476q539O941
11211A41858J4268J2244J4613q300m709L248M716L054j2736j3784r642p117k2609
$$ plain form
11303 216813 189669 178703 167554 161727 168261 160365 143804 139658 136799 135126 133595 153083 149313
11290 149313 150168 148776 148735 154206 161550 157198 145168 146023 154646 153531 168067 190080 201068 209890
11276 209890 224343 258385 299814 338966 379666 406237 404310 378216 325373 261695 228018 217650
11264 217650 199152 188546 166077 155499 160538 166927 158525 149983 154357 150934 153459 152624 152328 143015
11250 143015 153743 157827 157206 157286 161240 184639 195142 203631 225770 233735 247485 262125 292089
11237 292089 312306 320087 311515 297221 280370 259275 229027 198546 178803 171332 171907 161429
11225 161429 153277 147757 143761 140981 148758 153948 146065 147452 144435 136710 138980 143456 134917 141858
11211 141858 156126 168370 182983 174683 169974 173222 177938 180992 168256 154472 144830 137713 115104
11198A15104q925O584k394j0661K794R880M804K489j3548l326J1416L574l842
11185A13949n243K591q00K392l962k634m476P630K4132J0227j0455j1604k884
11172A18863P02N089J271l358m781q521J537n642K195j379K589J3298j67j168
11158A20528K424L005m28q026J3534K0691j1317p503q970l045n996j0653O745
11145A10989J1612k018p901J204O665L053r240J362L263o112q699L984O767q95
11131A14034q097j1426k482J8547k732p819J7773J2436q902j0082J4832M708k088
11118A28702K878R221j079j2191n61n777p74N649Q188M180k610m14n452o21l897
11103A25442n491M573l590l241j34O779p14l619n628K101P236K884q175j7l304
$$ plain form
11198 115104 106179 112763 110369 99708 102502 112382 117186 119675 106127 102801 114217 117791 113949
11185 113949 108706 111297 110497 112889 108927 106293 101817 109447 133579 143806 133351 121747 118863
11172 118863 119565 124654 125925 122567 117786 109265 110802 105160 107355 105976 108565 121863 121696 120528
11158 120528 122952 125957 125529 117503 131037 151728 140411 132908 123938 120893 114897 104244 110989
11145 110989 122601 120583 112682 113886 120551 123604 114364 115726 118989 112877 104178 108162 114929 114034
11131 114034 105937 94511 92029 110576 107844 100025 117798 130234 121332 111250 126082 130790 128702
11118 128702 131580 140801 139722 127531 126970 121193 120419 126068 134256 138436 135826 135412 129960 129339 125442
11103 125442 119951 124524 120934 117693 117559 124338 123624 120005 114377 116478 123714 126598 118423 118406 115102
11088A15102j0732n42L137R375o207j7868l359m671N702J9611O970J7828J076
11075A35422O44n938p08k630k686j3544R708J1853l647j0255j216O928j009j497
11061A21425l291k622J1489M096j1668l282N562k306j041q694L412l67m332l846
11047A04535j5882M894O410L272R958O753l827L644P897j9K259R422M389l841
11033A39864K632Q770k6L54N57p379K025K220N30o427m936q215o23J5300N004
11018A49650p950J809N642Q603l865k973J1195J0230r264l985K866N487Q91p726
11004A60610J4704J3374r893J42l83J669J0410o381L746p839l850q72j484K961
10990A76914J2501P552K765m229l768j799n129n007J3703J3929L302N199K657
$$ plain form
11088 115102 104370 103828 106965 116340 110133 92265 88906 84235 89937 109548 116518 134346 135422
11075 135422 136066 130128 129420 126790 124104 110560 120268 132121 128474 118219 117003 123931 122922 121425
11061 121425 118134 115512 127001 131097 119429 116147 121709 119403 118362 109668 113080 112713 108381 104535
11047 104535 88653 93547 99957 103229 113187 119940 116113 119757 127654 127635 129894 139316 143705 139864
11033 139864 142496 151266 151240 151594 152151 144772 146797 149017 149547 143120 138184 129969 129346 144646 149650
11018 149650 141700 143509 149151 157754 153889 150916 162111 172341 163077 159092 161958 167445 168336 160610
11004 160610 175314 188688 178795 178937 178554 180223 190633 184252 187998 180159 176309 175437 173953 176914
10990 176914 189415 196967 199732 195503 191735 189936 184807 179800 193503 207432 210734 215933 218590
10977B18590J3848J8157J8216K875r860j1693o942O706N783o86J1831O949o897
10964B66877M734M929r172j1119j5141J052R405J0534N723J6754J3920l349n435
10951B89712k468M378K45k102J0479J3680K578O912J6414N273J03N616M645Q159
10937C63624m524M172N661J1934J8155K0845J3936J6772J6364J4102N845J4900
10925E01786R161K3149K3647K1163J3730J9186K7960M6718N4379M3374N2089O1823
10913H98165P7577R4912R9069J25785J28150J53169J76443K16670K30144K58216
10903B458300K94659L93199N50104P75397J146280J688224K380344L085976L519082
10894A6291565L335034K379534P15843j205414k739973l392456l172494k454093
$$ plain form
10977 218590 232438 250595 268811 271686 261826 250133 243191 249897 255680 254994 266825 273774 266877
10964 266877 271611 276540 267368 256249 241108 242160 251565 262099 267822 284576 298496 295147 289712
10951 289712 287244 291622 291867 289765 300244 313924 316502 323414 339828 345101 345204 350820 355465 363624
10937 363624 359100 363272 368933 380867 399022 419867 433803 450575 466939 481041 486886 501786
10925 501786 510947 534096 557743 578906 592636 611822 639782 686500 740879 784253 836342 898165
10913 898165 975742 1070654 1169723 1295508 1423658 1576827 1753270 1969940 2200084 2458300
10903 2458300 2752959 3146158 3696262 4471659 5617939 7306163 9686507 12772483 16291565
10894 16291565 19626599 22006133 22721976 21516562 18776589 15384133 12211639 9757546
10886I757546j739857j190247q06433n40444l61430k48072j54242r3190o9546
10877D554085n8683n6806l0837j9359K279M9908J31420K09352K41370L03491L88029
10866E714249N09866P04845J007844J501705K232195L330761M733216O103924
10858B5838605O856255O305212M187984P94410k972988n802268o799157o139905
10850B2268148m704805l295335k246778j537472j072504p71819n84332m55533
10842G599570l74742l35193l18262l02087k97530k49312k10134j66622j25313
10833E220375q9893m0647M602O5398J52488K77203M32478O76613J046904J566963
10823I312484K212003K811950L118431K828698J791343J78389j578831k879556
$$ plain form
10886 9757546 8017689 6827442 6021009 5480565 5119135 4871063 4716821 4623631 4554085
10877 4554085 4495402 4438596 4407759 4388400 4390679 4440587 4572007 4781359 5022729 5326220 5714249
10866 5714249 6224115 6928960 7936804 9438509 11670704 15001465 19734681 25838605
10858 25838605 32694860 39000072 43188056 43982466 41009478 35207210 28408053 22268148
10850 22268148 17563343 14268008 12021230 10483758 9411254 8639435 8055103 7599570
10842 7599570 7224828 6889635 6571373 6269286 5971756 5722444 5512310 5345688 5220375
10833 5220375 5130482 5089835 5094437 5159835 5312323 5589526 6022004 6698617 7745521 9312484
10823 9312484 11524487 14336437 17454868 20283566 22074909 22253298 20674467 17794911
10815A7794911l302849k956721k276500j602328j105423p75732n67073m32644
10807D775641l33450k65830k25491k17606k16121k22889k19920k21220j99955
10798B653159j58012j44573j20234j01335r3007r2038p8355p1155p1819p5948
10788A646683o8070n8535n8880n6395o6953o1450n2095l8411l9185m6492l9534
10777A060683l7132l2355l4662l1126k8427k3273j5982k8354k7313j8111k2588
10766G61360k6464p053k1511j4917q981k5232j9956k3739k5577j1664k0043k6318
10754E29905j7687j3158j2805Q749p045j3816k6935k1069j8085n279r899K2n738
10741C87160j4602k5749k0276l238k060p552n288L836K458m46p024l340N243O671
$$ plain form
10815 17794911 14492062 11535341 9258841 7656513 6551090 5775358 5208285 4775641
10807 4775641 4442191 4176361 3950870 3733264 3517143 3294254 3074334 2853114 2653159
10798 2653159 2495147 2350574 2230340 2129005 2035998 1943960 1865605 1794450 1722631 1646683
10788 1646683 1578613 1520078 1461198 1404803 1337850 1276400 1224305 1185894 1146709 1100217 1060683
10777 1060683 1023551 991196 956534 925408 896981 873708 857726 829372 802059 783948 761360
10766 761360 734896 727843 706332 691415 682434 657202 637246 613507 587930 576266 556223 529905
10754 529905 512218 499060 486255 495004 487959 474143 447208 426139 408054 402775 392876 392898 387160
10741 387160 372558 346809 326533 323295 321235 313683 308395 312231 314689 314243 307219 303879 309122 315793
10727C15793K606N251Q104n156j6298q261O137m38n731l410j276M467Q509N113
10713C15410m235l326J3711K2043K2239L5727N9076P2595R1448J29341J50517
10702I04546J69467J55548J23678N5512l1857r2139j27869j56702j57573j34997
10692G07614j07448n4473k7878l5871l7064l5951l1993l6559l468q278r214j1278
10680C08139j1846k851k4552k1136j3400j0171l752l057O512J2612Q003p359k613
10667B34529O855N499J784N797p91o967j0711j3208j783O555k546j4175n772r511
10653A95555j7656j263l760j428k004J590j316l246m546K201O302j043M700l139
10639A70947k376L955L892J425j5039p190J3562R15k700O847N156J607l265J8960
$$ plain form
10727 315793 318399 323650 331754 326598 310300 302039 308176 307738 302007 298597 297321 301788 310297 315410
10713 315410 311175 307849 321560 343603 365842 401569 460645 533240 624688 754029 904546
10702 904546 1074013 1229561 1353239 1408751 1376894 1284755 1156886 1000184 842611 707614
10692 707614 600166 545693 517815 481944 444880 408929 376936 340377 336909 328631 319417 308139
10680 308139 296293 293442 268890 247754 234354 224183 220431 217374 223886 236498 244501 237142 234529
10667 234529 241384 246883 248667 254464 253673 246706 235995 222787 221004 227559 225013 210838 205066 195555
10653 195555 177899 176636 172876 171448 169444 171034 169718 166472 161926 164127 170429 169386 174086 170947
10639 170947 168571 172526 176418 177843 162804 155614 169176 170091 167391 174238 179394 181001 177736 196696
10625A96696M440q553r761j3208m677p853k261p848j0172J782J5720K549j2780
10612A44074n109O212K737M754K525N741l70N466K061q337k672k374j6222q999
10598A29487l990Lj2057J5113Q180m543M078r907o790Q099L733J0562N163L067
10584A50198l089J5626J1217j2353j6098n955O237K273M52m200m497k071M001
10571A41741O46J4311M982N983n708k638L012N069J2462J1595K5780K9050K6666
10558B72951N7857Q5783P7985N9340K1194m4693q7927p4574n3318m4480k4654
10547B45464k1155r984J8379R762J5131J1492M947J7293O728J3673N304p972r768
10534B99294k826n716M28k2912j4611q446k1243j1784l645K01L686j2669j8013
$$ plain form
10625 196696 201136 192583 182822 169614 164937 157084 154823 146975 136803 138585 154305 156854 144074
10612 144074 138965 145177 147914 152668 155193 160934 160564 166030 168091 159754 157082 154708 138486 129487
10598 129487 125497 125500 113443 128556 136736 132193 136271 126364 119574 127673 131406 141968 147131 150198
10584 150198 147109 162735 173952 161599 145501 139546 145783 148056 148508 144308 139811 137740 141741
10571 141741 142387 156698 161680 167663 161955 159317 162329 167398 179860 191455 217235 246285 272951
10558 272951 330808 416591 494576 553916 575110 530417 442490 367916 314598 270118 245464
10547 245464 224309 214325 232704 242466 257597 269089 274036 291329 298057 311730 317034 309062 299294
10534 299294 296468 290752 291180 268268 253657 245211 223968 212184 208539 208740 212426 199757 181744
10521A81744J149O694R91j0267o572m811o815m138m389L213J1600M656M84m379
10507A69160l635K5619J4354j1432r994m275n760q377j4838O367r28j1791R215
10494A53685P521l469K169Q030J507O469q439l386j238j2355r697j1474o402J0219
10480A33140J1951N816J4369M626j915L088k209j2485p008K2145J9000J6257K6137
10467B32912J8631J8217J8756M408k740J456l218k74j0067j7659j1719J1124J8050
10454B77877p846m691L082p511j1742k997j326l940j808L181M966R142P370K2734
10440B86491J3460K7622M0167K8676L2605L8118K5414P291k3713m1993l6352l0217
10428C67569k369m297j8522j2348p171p760j1525p370J8710P372R781P952J3314
$$ plain form
10521 181744 182893 189587 190578 180311 173739 168928 162113 157975 153586 156799 168399 173055 173539 169160
10507 169160 165525 191144 205498 194066 184072 179797 174037 165660 150822 157189 156261 144470 153685
10494 153685 161206 157737 159906 167936 169443 175912 167473 164087 162849 150494 140797 129323 122921 133140
10480 133140 145091 150907 165276 169902 167987 171075 168866 156381 149373 171518 190518 206775 232912
10467 232912 251543 269760 288516 292924 290184 291640 288422 288148 278081 260422 248703 259827 277877
10454 277877 270031 265340 268422 260911 249169 246172 244846 240906 239098 242279 247245 256387 263757 286491
10440 286491 299951 327573 367740 396416 429021 467139 492553 499844 476131 434138 397786 367569
10428 367569 365200 360903 342381 330033 322862 315102 303577 296207 314917 322289 332070 340022 353336
10415C53336m375k5549l2527n0151l3835J2659O5095J03592J03402R3123N4573
10404F39343M083k123J2031K4711J8146O331J9588P701r871j4085j0711k0984
10392F74160j0755j2394n511r144p915p161N220J1729P248M404L745r396n459
10379F38771K238L864j085k5106j0094k797K126J3623J1450J9017J3054J7719
10367F82780P312Q772O180J45r649q764J0810J5164R476l045J6981K7172K1228
10354G84562K8677J8283n38Q318j927k337R822J0954J5064L6107L6138L8347M3353
10341A024823N3356L9417M7688M4486L4046K0888J2536L4890N0188M6472L8232
10330A447022L0979M1087L4253K7137M9768O9773O5548P6151R5295J09536J30016
$$ plain form
10415 353336 348961 323412 290885 240734 206899 219558 284653 388245 491647 584770 639343
10404 639343 643426 641303 653334 678045 696191 702522 722110 729811 719940 705855 695144 674160
10392 674160 663405 651011 645500 636356 628441 621280 626500 638229 645477 649881 653626 644230 638771
10379 638771 641009 644873 643788 618682 608588 605791 607917 621540 632990 652007 665061 682780
10367 682780 690092 698864 705044 705189 695540 686776 697586 712750 722226 719181 736162 763334 784562
10354 784562 813239 831522 830984 839302 837375 835038 844860 855814 870878 906985 943123 981470 1024823
10341 1024823 1078179 1117596 1165284 1209770 1243816 1264704 1277240 1312130 1362318 1408790 1447022
10330 1447022 1478001 1519088 1553341 1580478 1630246 1700019 1765567 1841718 1937013 2046549 2176565
10319B176565J53483J60079J73957J64741J51917J59337J75752J81723K00646
10310C698200K34230K94414L52018L88076M49518N38669O28259P28204Q47001
10301H158589J007380J146734J253585J306277J366238J418815J443996J567986
10293A8669600J952634K575447L478939M854189P007239J0448251J6069391K5038207
10285I0093897L7612865M9851747N3326007M3050153K1137901j0836174m4733029
10278B39503367n8428911m8715067l2433226k0699831j3793479r617864o958493
10271D8856496n150258l837979k849236k184953j784926j631677j678314j858095
10263B7881058k038612k088705j920957j683093j439717j221382j055313q88387
$$ plain form
10319 2176565 2330048 2490127 2664084 2828825 2980742 3140079 3315831 3497554 3698200
10310 3698200 3932430 4226844 4578862 4966938 5416456 5955125 6583384 7311588 8158589
10301 8158589 9165969 10312703 11566288 12872565 14238803 15657618 17101614 18669600
10293 18669600 20622234 23197681 26676620 31530809 38538048 48986299 65055690 90093897
10285 90093897 127706762 177558509 230884516 273934669 295072570 284236396 239503367
10278 239503367 181074456 132359389 99926163 79226332 65432853 55814989 48856496
10271 48856496 43706238 39868259 37019023 34834070 33049144 31417467 29739153 27881058
10263 27881058 25842446 23753741 21832784 20149691 18709974 17488592 16433279 15544892
10255A5544892p58702o64325n93643n74705n67249n50204n44705n35508n20144
10246A0235707m80180m39561l99314l60006l34191l16760l23430l06429k78359
10237F997477k76114k75310k43610k35921k33854k18478k02717k09290k00812
10228D901371j86737j72652j74059j66027j30791j23914j10177j10994j11672
10219C614348j08904j13825j13529r4445j01286j02896r6628j03089j13090q9819
10209B576837p7760o7502n6725p4071n6408n2368n3193p3015p9496o5945o3594
10198A856760o6713n2647l9250m3172n1751m7966j2716l378k2024j6475k2981
10187A477687l5075m1760m9074n5131o1332n9786o4855o1186n9897o1968m6637
$$ plain form
10255 15544892 14786190 14121865 13528222 12953517 12386268 11836064 11291359 10755851 10235707
10246 10235707 9755527 9315966 8916652 8556646 8222455 7905695 7582265 7275836 6997477
10237 6997477 6721363 6446053 6202443 5966522 5732668 5514190 5311473 5102183 4901371
10228 4901371 4714634 4541982 4367923 4201896 4071105 3947191 3837014 3726020 3614348
10219 3614348 3505444 3391619 3278090 3183645 3082359 2979463 2882835 2779746 2666656 2576837
10209 2576837 2499077 2431575 2374850 2300779 2244371 2192003 2138810 2065795 1986299 1920354 1856760
10198 1856760 1790047 1737400 1698150 1654978 1603227 1555261 1542545 1539167 1517143 1500668 1477687
10187 1477687 1442612 1400852 1351778 1296647 1235315 1175529 1110674 1049488 989591 927623 880986
10176H80986l6337m2120l9294m4041m0854k9834l8783k6085k2804k8997l0465
10165E01372k4475k7828l3092k1646j5361j6132j1001m760L736L0627M9236P4373
10153E05049Q0954N1100l131k4341l4311l6450m1296k8972j319l151Q695n874
10141D66953L230l694j6839m2448j5778p742M338j9612j437K0581j013L336K250
10128C92125j2233k954O33O544P197P537L503m451N625n472j1514k1426l939k729
10114C58446o719j845j9031j4658O951R166J004q656j4649j0355M192J563J420
10101C06829j3739j2648K611Q371P042J7754J3995K6323L6512L8701K9883l457
10089D58177k7866k3301k3658j9527n796K435N944J7592L862k635n266k1894j3971
$$ plain form
10176 880986 844649 802529 763235 719194 678340 648506 609723 583638 560834 531837 501372
10165 501372 476897 449069 415977 394331 378970 362838 351837 347077 350813 381440 430676 505049
10153 505049 586003 637103 633972 609631 575320 538870 497574 468602 467283 464132 472827 466953
10141 466953 470183 466489 449650 407202 391424 383682 388020 368408 366971 387552 386539 389875 392125
10128 392125 379892 376938 377571 384115 391312 398849 402352 397901 403526 398054 386540 365114 361175 358446
10114 358446 351727 349882 330851 316193 323144 332310 333314 324658 310009 299654 303846 305409 306829
10101 306829 293090 280442 283053 291424 298466 316220 330215 356538 393050 431751 461634 458177
10089 458177 430311 407010 383352 363825 358029 360464 366408 384000 387862 385227 379961 358067 344096
10076C44096j1254j7256n461J497K0174O183n029j3569q6J03p528q536R241M154
10062C16729K843P360j006k638O069m896J908M011J6701J3762J7776J9635k22
10049C98032K4187M5225R1126J64982K52854K97489J97850J15028l8646l98551
10039A149576l35493j82645r9222o0325m2216k4268j9116j3020m692k213r291
10028C57075j0633j894m106q758k765j2681k1118n098j2376k8758p690Q553j93
10015B49558j3840N08J1170M846K839l432r989l233L287n27N421j556j0697K93
10001B34648k290r367j2893q60J972K857K153m951j4160p604K615P880J3957l985
9987B09972R973Q107p458K045N138J1498j9802j2826j3737j7329O864J1418Q175
$$ plain form
10076 344096 332842 315586 310125 311622 331796 337979 332950 319381 319295 319398 311870 303334 312575 316729
10062 316729 319572 326932 325926 323288 329357 324461 326369 330380 347081 360843 378619 398254 398032
10049 398032 422219 467444 558570 723552 976406 1273895 1471745 1586773 1548127 1149576
10039 1149576 814083 631438 532216 471891 429675 405407 386291 373271 368579 366366 357075
10028 357075 346442 344548 340442 331684 328919 316238 295120 290022 277646 248888 241198 249751 249558
10015 249558 235718 236226 247396 252242 255081 251649 241660 238427 241714 241187 246608 245052 234355 234648
10001 234648 232358 222991 210098 209238 211210 214067 216220 211269 197109 189505 192120 200000 213957 209972
9987 209972 219945 228052 220594 222639 227777 239275 219473 206647 192910 175581 182445 193863 202038
9974B02038J0718K093k355l170l0K67L987k639j0929k479o072n664J278O020P074
9959B00137j77R868J8576J5239L747K616r861j0723j4626j5081M861K665k945
9946B04296n25j766j101J825J2130J1698K025j2592l290L029m83K126Q533k408
9932B23497q773j5421M935J8902N371K809M114L256j1033k0926n57J6935N31J2065
9918B35705N330k396n098o297O050P451l876P263M807n681q664l131o52n467m501
9903B20843R581p82o91n297M438O003K629p755n972O835K891J7123J3009R9M051
9888B67005q602l544P50N279n71J0188J5133J006j2739J834N63o55J5095J0405
9874C01147n377j816N363J7767Q759q34J1378L7435M2746M8832O3370J07670J30013
$$ plain form
9974 202038 212756 214849 212494 209324 209294 209561 213548 210909 199980 197501 191429 185765 187043 193063 200137
9959 200137 199960 209828 228404 243643 247390 250006 240145 229422 214796 199715 204576 207241 204296
9946 204296 203771 202005 200904 202729 214859 226557 228582 215990 212700 215729 215246 217372 225905 223497
9932 223497 214724 199303 204238 223140 228511 231320 235434 238690 227657 206731 206174 223109 223640 235705
9918 235705 241035 238639 233541 227244 233294 240745 236869 244132 248939 243258 234594 231463 230811 225344 220843
9903 220843 230424 229642 228951 223654 228092 234095 236724 228969 222997 229832 232723 249846 262855 262954 267005
9888 267005 258403 254859 255609 260888 260317 270505 285638 286644 273905 275739 276302 275647 290742 301147
9874 301147 295770 293954 299317 317084 325843 325009 336387 373822 416568 465400 528770 636440 766453
9861G66453J56657J61380J65973J40726P1382n135o7349j13321j50465j56256
9851I70045j38717j16465q9010o2654m2703k9661k9657k2653j8509k5154j6105
9840C78757m121K843j382j7872q345r73j3550r368O835j1941j7467J7841J6074
9827C37331n261O767k607N402j3247j1810j0893j0711j733q885J3962j4381r269
9814B74665j875q153m46J315K122l812J0271K144p611l728m09Q174N406J777q3
9799B79757j390KJ0420o284K158j8964j0096j752o839R1Q617N17N771L600q056
9784B57552L528J1004K356j0213q538q158n096O676J0561J595k900L503Q267j823
9770B68314m384R942K729O600L358L849j0184m671o647L710N432N973j900j0075
$$ plain form
9861 766453 923110 1084490 1250463 1391189 1462571 1457436 1390087 1276766 1126301 970045
9851 970045 831328 714863 625853 563199 520496 490835 461178 438525 420016 394862 378757
9840 378757 374636 377479 376097 358225 349880 348907 335357 325989 332824 320883 303416 321257 337331
9827 337331 332070 338837 336230 341632 328385 316575 305682 294971 293238 284353 298315 283934 274665
9814 274665 272790 264637 264191 265506 267628 263816 274087 276231 268620 264892 264483 272657 278063 279840 279757
9799 279757 278367 278369 288789 282505 284663 265699 255603 253851 247012 247103 255720 256237 262008 265608 257552
9784 257552 261080 272084 274440 264227 255689 247531 242435 249111 259672 261267 258367 261870 270137 268314
9770 268314 263930 273872 276601 283201 286559 290408 280224 275553 268906 272616 278048 284021 282121 272046
9756B72046k219j907o453Q324k588n591M543P887q665n875J253Q759J082j2493
9742B58103J876K164Q052O817k925q867j9899N115m924m776R006M300o198n961
9728B41883J93J6464O534j1219j5786N598N944j088q260O273J0069M511r104p738
9714B44274o106L203K693J772J3146l202o104n306J0892l573q002M936l313j4797
9700B30513p236L530J8016J306Q5M466R60m688j0040K501o841j3043k849M913
9686B21593J2748j25j093Q827J743N46n824k393j666L713N594o009o550L481m470
9671B30115O568M468k138J287q653J0574M999j2600j2817j890O438J1368N013
9658B42732j7341l515R756O387q895r711l140J390m2j0756j1206J3352O083Q45
$$ plain form
9756 272046 269827 267920 261467 269791 267203 261612 266155 274042 265377 259502 260755 269514 270596 258103
9742 258103 259979 262143 270195 277012 274087 265220 245321 250436 245512 240736 249742 254042 247844 241883
9728 241883 242076 258540 265074 253855 238069 243667 249611 248523 240263 246536 256605 261116 252012 244274
9714 244274 238168 241371 244064 245836 258982 255780 249676 244370 255262 251689 243687 248623 245310 230513
9700 230513 223277 226807 244823 246129 246214 250680 251640 246952 236912 239413 232572 219529 216680 221593
9686 221593 234341 234216 233123 241950 243693 244239 238415 236022 234356 238069 243663 237654 231104 234585 230115
9671 230115 236683 241151 239013 240300 231647 242221 247220 234620 221803 219913 226351 237719 242732
9658 242732 225391 221876 231632 238019 229124 219413 216273 217663 217621 206865 195659 209011 215094 215939
9644B15939p46l062j631p800n280R643Q829m782l994J009j341L521q393o29J0606
9629B11889P831Q319r792j1324k85j927M61j3051o983m490N626L332M039M917
9615A98562j5833r420J3870J5993j560o868r571O882o105r619j0540J458r280
9602A57969k419N063l313P230J7270n931l661L659J2942O72o517j0751n521J382
9588A68074n925r542p102M815P097N858p236Q786R176l024j1614j8685j432J0374
9574A49620J4250M540k933j3139N917O368n181N295p72o353J0669n284j1316J890
9560A53571J35J5563j538j0886p125N38j5463n5J2969J9370o327j2106p11p122
9546A40813M210P131O107j0846k997L22J8890q69r634p089N789J773r119j1797
$$ plain form
9644 215939 215193 212131 210500 202700 197420 207063 215892 211110 207116 208125 206784 210305 201912 201283 211889
9629 211889 219720 228039 218247 206923 206638 204711 205172 192121 185138 180648 186274 189606 193645 198562
9615 198562 182729 173309 187179 203172 201612 194744 185173 192055 185950 176331 165791 167249 157969
9602 157969 155550 160613 157300 164530 181800 175869 172208 175867 188809 189481 182964 172213 166692 168074
9588 168074 162149 152607 145505 150320 157417 163275 156039 164825 174001 170977 159363 140678 139246 149620
9574 149620 163870 168410 165477 152338 158255 164623 159442 164737 163965 157612 168281 162997 151681 153571
9560 153571 153706 169269 167731 156845 149720 150258 134795 134740 147709 167079 160752 148646 147935 140813
9546 140813 145023 152154 158261 147415 144418 144740 163630 162761 153127 146038 151827 153600 144481 132684
9532A32684J322J0652k042N40j0568J425P283m23N66N517l366J2062j0429j7532
9518A27691n426R518j654p681m264M981O273K321L334O265R65Q25n773o928q214
9503A22233j9123r239N326Q993O288j615L054J2153O627j4311j8096P39l604M918
9489A04343J313m503n965j234o0n983n888j88J1660O876R118M262q091o521P046
9474A06185L454q31k194j2889m768N455M270J393N35m42N278k732k921j0092n00
9459H9201M692N345K44o255R623K004j30Q08j0972j22p491p590j268k033K565
9444G8621n179n174j712K634R306J2820N600m065m692j678O199M573j056o25j441
9429I4131M504M192r06j0267r460k241L752J7932J2310q458k0735j0048j592J7798
$$ plain form
9532 132684 134006 144658 142616 143156 132588 134013 141296 140873 141439 146956 143590 155652 145223 127691
9518 127691 122265 131783 130129 122448 118184 123165 129438 131759 135093 141358 142323 143148 137375 130447 122233
9503 122233 103110 93871 99197 108190 114478 112863 115917 128070 134697 120386 102290 103029 99425 104343
9489 104343 105656 101153 95188 93954 93894 87911 82023 81835 93495 100371 109489 113751 105660 99139 106185
9474 106185 109639 108808 106614 93725 88957 94412 98682 100075 100610 100168 105446 102714 99793 89701 89201
9459 89201 93893 99238 99482 93227 102850 104854 104724 105532 94560 94438 86947 79357 78089 76056 78621
9444 78621 73442 68268 66556 69190 78496 91316 96916 92851 88159 86481 92680 97253 96197 95572 94131
9429 94131 98635 102827 101921 91654 82194 79953 83705 101637 113947 105489 84754 74706 73114 90912
9415I0912Q256j2J690n523r273p418j648O332P532M122l671j253K941l07r561
9400H3119j1695l663m622j316M359R183O841m742O008p500k089j2557l193K5469
9386H3602M92n015k574O202l817r705j2843N357J2210l678k122J956K980p886
9372F5159p459o707m850n248k501R259q510K750J4924N027p356J8698M237j4460
9358F2963q560j355J5363N689M611k1429j9911Q504R311K300J200n242J467L001
9344E7912q672k342J3169N455r977n617l281R194J1353q907n733l519j1334K342
9330D0043J3722J6292J244n529j8928j2260R014J2217p913o951J6701Q959j044
9317F5567M716q241O4L957K339p042n050m457j499o804l279O077J4029K422J1056
$$ plain form
9415 90912 99168 99156 100846 95323 86050 78632 76984 83316 90848 94970 91299 90046 92987 92680 83119
9400 83119 71424 67761 63139 61823 66182 75365 82206 77464 83472 75972 73883 61326 58133 83602
9386 83602 84094 79079 76505 82707 78890 69185 56342 61699 73909 70231 68109 70065 73045 65159
9372 65159 57700 50993 46143 40895 38394 47653 39143 41893 56817 61844 54488 73186 77423 62963
9358 62963 54403 53048 68411 74100 78711 57282 37371 45875 55186 57486 58686 53444 54911 57912
9344 57912 49240 46898 60067 65522 55545 49928 46647 55841 67194 58287 52554 49035 37701 40043
9330 40043 53765 70057 71301 65772 46844 34584 43598 55815 47902 40951 57652 66611 65567
9317 65567 70283 62042 62106 66063 68402 61360 56310 51853 50354 43550 40271 46348 60377 62799 73855
9302G3855L666q409j1775j7573q187J3475N404n972J207n605M509K021p078P152
9288D6690J400p580l853l260L745K725k039P23k467L582M779n27K031j678j828
9273D2443j509p935p16J0537M315N261m626k392N760P802k565O52J842q105j962
9258D8802k628j0911j0211L517L766L660P768n041m990m17P047j891k969J221
9244C6723k513L549j1304l219J2078N514r615J535l27M249P670K279l388m265
9230C8966j0430o085q242O729l366O311J1888J5497m43q700o983m393r26l86J1214
9215D0651L840p715p581p845j2N177p830j0923N217M888l763o030O663J3082J2798
9200D0617o423m978K836O347N365j0635M91J158n043l823j3426o920M902J2026
$$ plain form
9302 73855 77521 69112 57337 39764 31577 45052 50456 44484 45691 40086 44595 46616 39538 46690
9288 46690 48090 40510 36657 33397 37142 39867 37828 38551 36084 39666 44445 43918 45949 44271 42443
9273 42443 40934 32999 32283 42820 47135 52396 47770 45378 51138 58940 56375 57027 58869 50764 48802
9258 48802 46174 35263 25052 28569 32335 35995 43763 38722 33732 33315 40362 38471 35502 36723
9244 36723 34210 37759 26455 23236 35314 40828 31213 32748 32421 36670 44340 46619 43231 38966
9230 38966 28536 22451 14209 20938 17572 23883 35771 51268 50825 42125 35142 30749 29823 29437 40651
9215 40651 44491 36776 29195 21350 21338 26515 18685 7762 12979 17867 14104 8074 14737 27819 40617
9200 40617 34194 29216 32052 38399 43764 33129 33620 34778 29735 25912 12486 5566 10468 22494
9186B2494J4882l540m595n682j5802Q302L134M806q11L794P77R001J4023N71p570
9171D3784q291k167j8839l618N064Q236R143J2224J926J947m45j5515L544l794
9157C3199j5294J933J7098J1114n368L260m450j4149m705k832k131J4454O821
9144C8950o67R197o2N766j2576j5935L341Q274Q968O435o115N625M896l215l737
9129D9145P164q825o258n288n822N24j0521O005J3672O650j5475j2723K175P174
9115B7597m076p713M221K619q40p017j138M506k61j595O449O564k698j2637l663
9100A0318P886J379J345J0332L311p358r914J1423J6953k706L738l760j3498j4732
9086A4717l583K39J745R402Q992J819j1050O002j2753o610J3434J4118n123M295
$$ plain form
9186 22494 37376 33836 29241 23559 7757 16059 19193 23999 23188 26982 27759 36760 50783 51354 43784
9171 43784 35493 33326 14487 10869 15933 24169 33312 45536 47462 49409 48964 33449 36993 33199
9157 33199 17905 19838 36936 48050 42682 45942 41492 27343 22638 19806 17675 32129 38950
9144 38950 38283 47480 47418 53184 40608 24673 28014 36288 45256 51691 45576 51201 56097 52882 49145
9129 49145 56309 47484 41226 35938 30116 30640 20119 26124 39796 46446 30971 18248 20423 27597
9115 27597 23521 15808 20029 22648 21808 14791 13653 18159 17898 16303 22752 29316 26618 13981 10318
9100 10318 18204 19583 20928 31260 34571 27213 17299 28722 45675 42969 46707 42947 29449 14717
9086 14717 11134 11373 13118 22520 31512 33331 22281 28283 15530 8920 22354 36472 31349 35644
9072C5644l550o051j2131q313j267Q289p06Q62K103N050p45P048L72j84K664O250
9056C5335m265j537M213o791l403O287l797j0796J346J2534J6625L237r976j6392
9042B2620O526M928j212M555L789l276j215j5598r82N326L151K601j6961o408
9028G844j40p236P31Q291Q504j253N444P767k484o140J0853J245J649p382o970
9013B0723m752Q833J1268j956l937n496k465O12Q339L781j3627o840l752N347
8999A6078J0603k496j5221p216J756O857Q349L527m990p792J172J8692P588j10
8985C6797J0656K160J780o610J502p414n247L023m643o456L954L046K466J349
8971C6363j2536L707j517r310j0401M201P693k22j538n272l541J3014J4956j2958
$$ plain form
9072 35644 32094 26043 13912 5599 4332 12621 11915 12777 14880 19930 19185 26233 26605 26421 29085 35335
9056 35335 31070 29533 33746 26955 23552 29839 26042 15246 16592 29126 45751 48988 39012 22620
9042 22620 29146 34074 32862 37417 41206 37930 36715 21117 20135 25461 28612 31213 14252 7844
9028 7844 7704 468 1199 9490 17994 16741 22185 29952 27468 21328 32181 33426 35075 27693 20723
9013 20723 15971 24804 36072 34116 30179 24683 22218 22830 31169 34950 21323 14483 10731 16078
8999 16078 26681 24185 8964 1748 3504 10361 18710 22237 17247 9455 10627 29319 36907 36797
8985 36797 47453 49613 51393 44783 46285 38871 33624 36647 32004 25548 29502 32548 35014 36363
8971 36363 23827 27534 26017 16707 6306 10507 18200 17978 16440 11168 7627 20641 35597 22639
8957B2639m734j447m409r500J355m545k606Q904L56j7685N584R219J1426J966
8943A6523M226K599l885k261L357n497M661L89m516j1818r153P265J2089K846
8929A6825O393m412Q15m550r936Q989M219o873m358r870o461P302m55k781M202
8914i51J3682M788r050k364m613Q049J2970O755O69j1053M576P043L867q178j288
8899B4902n15p761M59J1107J53q806N086O187j2426Q03J140n081j229m8R542J0051
8883C3564O738p266p376K767m450j8610L462R479P995J1064n187p119M328K91
8869B9680O455N868J1458J8734J6833K229k762k703j5123k5849j5699r651J626
8856B1096L245M812K505o771J3182j052r636m177j1448l514l398R903j3483n084
$$ plain form
8957 22639 17905 16458 12049 2549 3904 -641 -3247 5657 6013 -11672 -6088 3131 14557 16523
8943 16523 20749 23348 19463 17202 20559 15062 19723 20112 15596 3778 -5375 1890 13979 16825
8929 16825 23218 18806 19621 15071 5135 14124 18343 11470 7112 -2758 -9219 -1917 -2372 -5153 -951
8914 -951 12731 17519 8469 6105 1492 9541 22511 29266 29935 18882 23458 30501 34368 26190 24902
8899 24902 24387 16626 17085 28192 28345 19539 24625 30812 18386 19189 20329 15248 14019 13971 23513 33564
8883 33564 40302 33036 25660 28427 23977 5367 8829 18308 26303 37367 32180 25061 29389 29680
8869 29680 36135 42003 53461 72195 89028 91257 88495 85792 70669 44820 29121 19470 21096
8856 21096 24341 29153 31658 24887 38069 37017 27381 23204 11756 8242 4844 14747 1264 -3820
8842c820J497j388P409j762O452K869k918n754L277j9Q224r493p415l557J5839
8827I441R463O839n48j6138m697M628P445O757j5855q911n567L74L766P235M842
8812I074l247K180n850Q603J3115L1p831j8427m097J3615M613P324N688l751K705
8797B3745j1165j9812O9J1788R705N491J323l115m15n5p761o634O320l141K153
8782H496k197j800J0775O116K421n665o091j874p12J3209Q675J480J347l967m536
8767B5677m871p840o657o6J3523P875K958M125j1494p122r565l363J2069R087
8753B4336n027j0965k631L48p496m606J6947J2433q55q667o475k465M306Q026
8739A7209M551P154k800K190l132l84j8783j0486J5180J2784J021O794M370o526
$$ plain form
8842 -3820 -2323 -3711 3698 1936 8388 11257 8339 2585 5862 5843 14067 4574 -2841 -6398 9441
8827 9441 18904 25743 25195 9057 4360 8988 16433 23190 7335 -1576 -7143 -6769 -3003 4232 9074
8812 9074 5827 8007 2157 10760 23875 23906 16075 -2352 -6449 7166 11779 19103 24791 21040 23745
8797 23745 12580 -7232 -7163 4625 14330 19821 21144 18029 17614 17559 9798 3164 9484 6343 8496
8782 8496 6299 4499 15274 21390 23811 18146 12055 10181 9469 22678 31353 32833 34180 30213 25677
8767 25677 20806 12966 6309 6243 19766 27641 30599 34724 23230 16108 6543 3180 15249 24336
8753 24336 19309 8344 5713 6061 -1435 -6041 10906 23339 22484 13817 7342 4877 9183 17209
8739 17209 21760 28914 26114 28304 25172 24788 6005 -4481 10699 23483 24504 31298 35668 29142
8725B9142N552j330l413r45j075q841L553l528k49p237J0611o300j0302Q137J2970
8710B6745K583k644p36j0287o295L680l242R920O015o108m010J6489o12o870J2506
8695C7134o145k631P952N978k202n486k45j1805L361N968l079o49k961K659R899
8680C7748K498Q808l60p660m558M911R80N153l694o372l960m044m405J441M315
8665C0801n72K881O132o329o314J2014N65M177o240p433J7591K0580n260l367
8651E9226O619L941Q044r386K618K375J185p848j4388K807Q319J1427P086L974
8637H5999l549K35n656N692l250j2948J7251L433p097J5064P816P65Q335J780
8623A13870J9301J6453J0499J7801J693j5233N853M76q392j1389O654R192N85
$$ plain form
8725 29142 34694 33364 29951 29006 27931 19090 22643 19115 18866 11629 22240 15940 5638 13775 26745
8710 26745 29328 26684 25948 15661 9366 13046 9804 19724 25739 19631 15621 32110 31498 24628 37134
8695 37134 30989 28358 36310 42288 40086 34600 34355 22550 25911 31879 28800 28151 25190 27849 37748
8680 37748 40246 49054 48694 41034 36476 41387 42367 47520 43826 37454 33494 29450 25045 26486 30801
8665 30801 30229 33110 39242 32913 26599 38613 39178 43355 37115 29682 47273 67853 62593 59226
8651 59226 65845 69786 77830 68444 71062 73437 74622 66774 52386 55193 63512 74939 82025 85999
8637 85999 82450 82685 77029 82721 79471 66523 83774 87207 80110 95174 102990 103755 112090 113870
8623 113870 133171 149624 160123 177924 179617 164384 170237 170713 162321 150932 157586 166778 167363
8610A67363r301o939L22M682J393n462k393M156k672p052j5366K616J6537k60
8596A47624K369k373N390m872p51p194q915m835n761l640o229j2557j1269j3354
8582G3633m359N306j097J351L358L334j4306m037j1358M806J942l19N258k496
8568F1016J274J7483M24j3973j1235L689P497j896j590j3086j1670K584K546j526
8554D1537L662r974j1227K414K898N010K085J626P08k255P941O703o158O064k523
8539D8511m293O235j554m358n017q499j7811M820J7030K93j1918J770P814M141
8525C7164m504N30J784N57l032r279q471O632M82M33K599m943q662J273R485P183
8509B9231K223L395K582k823N469j1895j1453K069k742n087j287L948j41j1370
$$ plain form
8610 167363 158062 151123 151445 156127 157520 152058 149665 153821 151149 144097 128731 131347 147884 147624
8596 147624 149993 147620 153010 148138 147387 140193 131278 126443 120682 117042 110813 98256 86987 73633
8582 73633 69274 74580 73483 74834 78192 81526 67220 63183 51825 56631 58573 58254 63512 61016
8568 61016 62290 79773 80197 66224 54989 58678 66175 64279 62689 49603 37933 40517 43063 41537
8554 41537 45199 35225 23998 26412 29310 34320 36405 38031 38739 36484 44425 51128 44970 51034 48511
8539 48511 44218 50453 48899 44541 39524 31025 13214 18034 35064 35357 23439 25209 33023 37164
8525 37164 32660 33190 34974 35531 32499 23220 14749 21381 21863 22296 24895 19952 11290 12563 22048 29231
8509 29231 31454 34849 37431 34608 40077 28182 16729 18798 16056 10969 9682 13630 13489 2119
8495B119n660K155J2666O115n082n197J799J795r20N014j713J460m181r124j4183
8480a2937k866P444J7748M507j006l573O624k66N465j138m607n58p807o534j235
8465g39L703k293R984N385k456p185q133K166J3620O616k61o586r947O911n260
8450E525j552K138J1538P349O743J2246o876M771m39j1888R334P390n659j240
8436C9380j3874j1793m71J262Q914l863k266L301J657L249O364N813J899j0530
8422B9042j0344q512l851O469m139J2569J1180L931n915m889o838r925R418J5843
8408C4039M107q032m885k178P882R409l635j5753o568m555l000L958J8964k914
8394B6839N374m58J064P14k482n728j4524o423l985J2599J2398J1968r612j605
$$ plain form
8495 2119 -3541 -1386 11280 17395 12313 7116 8915 10710 9790 14804 13091 14551 10370 1246 -12937
8480 -12937 -15803 -8359 9389 13896 12890 9317 15941 15675 21140 20002 15395 14837 7030 496 -739
8465 -739 2964 671 10655 16040 13584 6399 -1734 432 14052 20668 20407 13821 3874 10785 5525
8450 5525 3973 6111 17649 24998 31741 43987 37111 41882 41443 29555 38889 46279 40620 39380
8436 39380 25506 13713 13242 14504 23418 19555 17289 20590 22247 25496 31860 37673 39572 29042
8422 29042 18698 10186 6335 12804 8665 21234 32414 36345 30430 25541 18703 8778 18196 34039
8408 34039 38146 30114 25229 23051 30933 40342 36707 20954 14386 9831 6831 10789 29753 26839
8394 26839 32213 31755 32819 33533 31051 25323 10799 4376 391 12990 25388 37356 27744 26139
8380B6139N040n800n57o747k124l512J3770O708l911m961j1645o862J776p427
8366a13j190N23J6445J2042O125j1963o54M994o302k712n93l421K927j286o145
8351H677Q2k206k170j913L104N652J19J551m562m509L193k532O240J7370N725
8336C3821n894m74p179K423n727K089K846o244k858j305j105L894P095N845N623
8321C2850k315l122K244L060k418n647j76r342n635N286K309P579p335M138k009
8306A9467k0566n789m856j1722m508K4027N029J920p924J3055R833m794N865o915
8292A2122j234O147j1338j1701N577J0379M257J611j394M582j0488l576Q946j2322
8278A568K243K583P773R18J115N950n71N677L173q449j3387q936L470M598L296
$$ plain form
8380 26139 31179 25379 24822 18075 15951 12439 26209 32917 29006 24045 12400 5538 7314 -113
8366 -113 -1303 -780 15665 27707 33832 21869 21215 26209 19907 17195 16602 13181 16108 14822 8677
8351 8677 8759 6553 4383 2470 5574 11226 11345 12896 8334 3825 7018 4486 10726 28096 33821
8336 33821 27927 27453 20274 22697 16970 19059 21905 15661 12803 11498 10393 14287 21382 27227 32850
8321 32850 30535 27413 29657 32717 30299 24652 24476 15134 9499 14785 17094 24673 17338 21476 19467
8306 19467 -1099 -6888 -11744 -23466 -27974 -3947 1082 3002 -4922 8133 17966 13172 19037 12122
8292 12122 10888 17035 5697 -6004 -427 9952 14209 15820 14426 19008 8520 4944 13890 1568
8278 1568 3811 6394 14167 15085 16200 22150 21579 27256 30429 21980 8593 -343 3127 7725 11021
8263A1021M232n474o070R103Q323M251j66j4595j0263P408K777R124K425J578
8249B3674K887j2908O190O830O702K576J485j215k926k578r109j3226k031k654
8235C697O424Q514K562m131O154p59P659j1056k108j710o232k336n611j3252J096
8220a1089j523N848J176L713N465o73P40R372j73r95Q458P483K718p712j0998
8205A1810k3141q364J1927Q340L548k637l83K347N880M286j1392m433L820n774
8191d166L63N992j25p567O945J2263R67M294O75N872Q15l983n138K60j3306j1518
8175g357J1245m6L074L323q5L798N178m34l581J246j542o389l729Q793K423R316
8159B5233J0584O69J090J9064m950p908q330k0096j3567j186P056J507K174J0739
$$ plain form
8263 11021 15253 9779 3709 12812 21135 25386 25220 10625 362 7770 10547 19671 22096 23674
8249 23674 26561 13653 19843 26673 33375 35951 37436 36221 33295 30717 21608 8382 6351 3697
8235 3697 10121 18635 21197 17066 23220 22461 30120 19064 16956 15246 9014 6678 1067 -12185 -11089
8220 -11089 -12612 -6764 -5588 -1875 3590 2917 3657 13029 12856 11861 20319 27802 30520 22808 11810
8205 11810 -11331 -19695 -7768 572 4120 1483 1100 3447 9327 13613 2221 -2212 1608 -4166
8191 -4166 -3803 2189 2064 -5503 1442 13705 14672 18966 19641 25513 26328 22345 17207 17467 4161 -7357
8175 -7357 3888 3842 6916 10239 10154 13952 19130 18696 15115 16361 14819 8430 4701 13494 15917 25233
8159 25233 35817 36486 37576 56640 51690 43782 35452 15356 1789 603 7659 9166 11340 22079
8145B2079J782n526R28j2786o505R948P396n726j412r690k875M469n162m405n547
8130a3032J8919J3021M870m043j3847o738P507J1481L070M16p636k995P078M697
8116B2768l496Q84J2864r796p241q963J0571l27j957M240j854j0210l887q253
8102d657J466L473K328p6O760J218J493O971J393L628m460j4386k221j014o317
8087d401N415R940K768r706O259K017m526p40p865l392o419j1627j641J4323J1387
8072A792K060J0932J1219R944j054l409l750m123l689n825M267L21q941j593K113
8057A0264P224J436L158R809L731n530j611R73J3946K0569r441j0952J90J421
8043D5187q836J4487M764J0415K648N8P284M788l803j0681q613J5220n974L830
$$ plain form
8145 22079 23861 18335 19263 6477 -28 9920 17316 11590 10178 488 -2387 2082 -3080 -7485 -13032
8130 -13032 5887 18908 23778 19735 5888 -850 6657 18138 21208 21624 13988 10993 18071 22768
8116 22768 19272 20156 33020 23224 15983 7020 17591 17264 15307 19547 17693 7483 3596 -4657
8102 -4657 -3191 282 2610 2534 9294 10512 12005 18976 20369 23997 19537 5151 2930 1916 -4401
8087 -4401 1014 10954 13722 4016 10275 12292 7766 7026 -839 -4231 -10650 -22277 -23918 -9595 1792
8072 1792 3852 14784 26003 35947 34893 31484 27734 23611 19922 14097 18364 18685 9744 8151 10264
8057 10264 17488 18924 22082 31891 35622 30092 28481 29454 43400 63969 54528 43576 43766 45187
8043 45187 36351 50838 55602 66017 68665 68723 76007 80795 76992 66311 57698 72918 66944 70774
8029G0774j5063j3534Q265k088J477J678M918J0033J2539j987k656L484L542j5534
8015F5848K723N502J0206N539J7196J1655J6446K2154J8657K2802J3930m880k5122
8002A82656k6902k3427k4917o510m755m577J9368J7217K0311J7611J0406p315
7990A69166l4329k5216k8112n494L985q551r39J644M93j1687k40o267m85K761
7976E6729O664L95N244P213Q642l218n654O829m894L887L1374K5041J715P221
7962A47188J3832P489J6888M717k2128k1104k215l098j0842j075Q678J4555m14
7949A52471r054j7598k7369j5040n630l524o444j0084L101K513j2183j1973r394
7936B9792R16n3o387J0210Q978L648j435L912l195L844k826Q66j940q87O870K91
$$ plain form
8029 70774 55711 42177 50442 48354 49831 51509 56427 66460 78999 77012 74356 77840 81382 65848
8015 65848 68571 74073 84279 89818 107014 118669 135115 157269 175926 198728 212658 207778 182656
8002 182656 155754 132327 107410 100900 96145 91568 110936 128153 148464 166075 176481 169166
7990 169166 134837 109621 81509 76015 80000 71449 70510 72154 72647 60960 60720 54453 53968 56729
7976 56729 63393 63788 69032 76245 84887 81669 76015 82844 77950 81837 113211 138252 139967 147188
7962 147188 161020 168509 185397 190114 167986 146882 144667 141569 130727 129652 138330 152885 152471
7949 152471 143417 125819 98450 83410 77780 74256 67812 57728 60829 63342 51159 39186 29792
7936 29792 30708 30655 24268 34478 43456 47104 45669 49581 46386 50230 47404 48270 46330 45443 52313 52604
7920E2604M973K805n384L239p888j582K142N42p384L843j202l074n466M73J0977
7905D9618K893m983m215j8298j1400L854R188l492j0107l553N557j0532o690J0824
7891H664O771r456K194Q08J015R584N570r96Q29j2475R05M640M354q304N033j46
7875A8990k047M2k517o638L072L41q527K41K637K699m573J138r57j21J0499J617
7859A5896m252n12R430l717j4981p189n715k092P54r52l433O110j466k242r13
7844a5274O086J6921k937j7124j4020N484r94p874R243J4428o367L799Q638m182
7830d173j1827q233k475M874K056K1037R60q556l119K496n327m62J2166K095p671
7815f159l061P410R52R63M194K043j4565n136n853O026R280n358N326P449m383
$$ plain form
7920 52604 57577 60382 54998 58237 50349 48767 50909 51451 44067 47910 46708 43634 38168 38641 49618
7905 49618 52511 47528 43313 25015 13615 17469 26657 23165 13058 9505 15062 4530 -2160 8664
7891 8664 15435 5979 8173 8981 9996 19580 25150 24154 24983 12508 13413 18053 22407 14103 19136 18990
7875 18990 16943 16985 14468 7830 10902 11243 2716 2957 5594 8293 3720 4858 3901 3780 14279 15896
7859 15896 11644 11132 20562 16845 1864 -5325 -11040 -13132 -12378 -13330 -16763 -10653 -12119 -14361 -15274
7844 -15274 -9188 7733 4796 -12328 -26348 -20864 -21858 -29732 -20489 -6061 -12428 -8629 9 -4173
7830 -4173 -16000 -24233 -26708 -21834 -19778 1259 2219 -6337 -9456 -6960 -12287 -12749 -583 1512 -6159
7815 -6159 -9220 -1810 -858 105 4299 6342 -8223 -13359 -19212 -13186 -3906 -9264 -3938 3511 -872
7800h72j9171l733J6591J3829Q841j1333n023R969K96L88j3597j3833l748Q323
7786a3073J0487p054j484J1756L623R265P931r948j6809j4450K70N264K997P934
7772c291j484l924K19K196O482R193j3806k859J0691J1259n129j2107r690O940
7758e310J3463l465L689o54p15J2010r84p826K375m739p678k154R55j2444q652
7743b2129L603O385Q472Q383m106r393j0286Q936K091l774k703K747l50l964L182
7728a2906N556L654J739L485k601j835M450j1550r671j915M572Q946L184k93L952
7713a233J134j1378J0173N82J0534J3441j7009j7807n567j009J7501J1235J951
7700A2548n72n670o279L281P709N220m278N891L512l370n642o504L547j758n378
$$ plain form
7800 -872 -20043 -23776 -7185 6644 15485 4152 -871 9098 9394 9782 -3815 -17648 -21396 -13073
7786 -13073 -2586 -9640 -11124 632 4255 13520 21451 11503 -5306 -19756 -19486 -14222 -11225 -3291
7772 -3291 -4775 -8699 -8480 -6284 198 9391 -4415 -7274 3417 14676 9547 -2560 -12250 -5310
7758 -5310 8153 4688 8377 7723 7008 19018 18034 10208 12583 7844 166 -1988 -1033 -13477 -22129
7743 -22129 -18526 -12141 -3669 4714 608 -8785 -19071 -10135 -8044 -11818 -14521 -11774 -12124 -16088 -12906
7728 -12906 -7350 -3696 -1957 1528 -1073 -2908 1542 -10008 -19679 -21594 -17022 -8076 -4892 -5185 -1233
7713 -1233 -99 -11477 -1304 -722 9812 23253 6244 -11563 -17130 -18139 -638 10597 12548
7700 12548 11976 6306 27 3308 11017 16237 11959 17850 21362 17992 12350 5846 9393 7635 2257
7685B257m826p82r573J682N689P105K528J446M460j386m170q73n497r135p502
7670a8577J1276N981m532J483J0432l248r083N536N417O925O317o543j429J215
7656A1170K251m608O214O98j2569k3745p490J0604J0430m331O285J9370j530p014
7642E735P065N466o090o236j7598j1054N22J2657J6158O278l499j0358j471j461
7628c886l922o313L606r366L675Q766l685L060K729k224K788K230j10K067l126
7613c711M151N260N42r66M777K518L951J1056l095o409j4921j1074n529O26M368
7598h456N672n426J564M15R524M717l386j0850M521R329O473p318J562M858j6877
7583c678n84K109N335Q960n488j2720j1438k918J5770m543j4311J4635J5410k336
$$ plain form
7685 2257 -2569 -3351 -12924 -11242 -5553 1552 4080 5526 9986 8600 4430 3557 -1940 -11075 -18577
7670 -18577 -7301 -1320 -5852 -4369 6063 2815 -6268 -732 4685 11610 17927 11384 9955 11170
7656 11170 13421 8813 15027 15725 3156 -20589 -28079 -17475 -7045 -11376 -5091 14279 12749 5735
7642 5735 12800 18266 12176 5940 -11658 -22712 -22190 -9533 6625 12903 9404 -954 -2425 -3886
7628 -3886 -7808 -14121 -10515 -19881 -16206 -7440 -11125 -8065 -5336 -7560 -4772 -2542 -2652 -585 -3711
7613 -3711 440 5700 6242 5276 10053 12571 16522 27578 24483 18074 3153 -7921 -13450 -12824 -8456
7598 -8456 -2784 -8210 -6646 -6231 3293 8010 4624 -6226 -1705 7624 14097 6779 8341 13199 -3678
7583 -3678 -4262 -2153 3182 12142 6654 -6066 -17504 -20422 -4652 -9195 -23506 -8871 6539 4203
7569D203k29J927o214K388m234k555j0580J518P099j4550M591M014o776N284m780
7554a8894M166J1030L955o408j0611m514J293l870o272J2399L047M136m44O063
7540d924R193J796m344R47q34K918J68j679j087p51O261J2304p693n017p594j277
7524a613J474j705o235m515N070M469o290j3400L640N325o84L846M094M841k224
7509c907N984J5951m901j3818m822k717P18m720L062m219O118J0427o348k712
7495e904j905j3517k058J533Q186O548N170O666K89p962l046J76N10j04n588K692
7479h314R418o577j257K062q372j361j336p17n370l204j423O931J8228M760m010
7464e42j0536o134m062P305K985N10L531J932L640L034j28q825O356O225m742
$$ plain form
7569 4203 3974 5901 -313 2075 -2159 -4714 -15294 -13776 -6677 -21227 -16636 -12622 -19398 -14114 -18894
7554 -18894 -14728 -3698 257 -6151 -16762 -21276 -19983 -23853 -30125 -17726 -14679 -10543 -10987 -4924
7540 -4924 4269 6065 1721 2668 1834 4752 4920 3241 2154 1403 7664 19968 12275 7258 -336 -1613
7524 -1613 -139 -1844 -8079 -12594 -7524 -3055 -9345 -22745 -19105 -13780 -14464 -10618 -6524 -1683 -3907
7509 -3907 2077 18028 13127 -691 -5513 -8230 -7512 -12232 -9170 -13389 -7271 3156 -3192 -5904
7495 -5904 -7809 -21326 -23384 -21851 -13665 -7117 -1947 4719 5008 -2954 -6000 -5824 -5314 -5418 -11006 -8314
7479 -8314 1104 -5473 -6730 -4668 -13040 -14401 -15737 -16454 -21824 -25028 -26451 -19520 -1292 3468 -542
7464 -542 -11078 -17212 -21274 -13969 -10984 -10474 -6943 -5011 -1371 1663 1535 -7290 -934 5291 549
7449E49J2246q96n857j1939j9429J0313Q988L185n638m231Q847m870j197R902
7435b7o792o187J426K4605O150p761j1036l66m211n984j0129K854J0137L520q365
7420a2166k324P735M135k078N755K17j054J914R933j2437j9322q332N840P016
7406a5168L296l706R47m324l489n850Q54J7419J6797j589j3676j8847R700j064
7392a8700O621Q394P496n069j3627J1372O800M67r859K801n41N8O24n825j9760
7377b8748l876J4664J539J3118L669K665j0893o497Q106J7544j1866q622J3035
7364C838Q56q007R948R065j1937j2712q860M358J829K211M639k08j131J0832Q425
7349A3146o708m497n219r811o083m141n807n828J2338l713K439J0943J1956n700
$$ plain form
7449 549 12795 11899 6042 -5897 -25326 -15013 -6025 -2840 -8478 -12709 -3862 -8732 -9929 -27
7435 -27 -6819 -13006 -11580 13025 19175 11414 378 12 -4199 -10183 -20312 -17458 -7321 -3801 -12166
7420 -12166 -14490 -6755 -2620 -4698 1057 1274 220 2134 12067 -370 -19692 -28024 -22184 -15168
7406 -15168 -11872 -15578 -14631 -18955 -22444 -28294 -27440 -10021 6776 5187 -8489 -27336 -17636 -18700
7392 -18700 -12079 -3685 3811 -1258 -14885 -3513 3287 3754 -6105 -3304 -3845 -3787 -3163 -8988 -28748
7377 -28748 -32624 -17960 -16421 -3303 366 3031 -7862 -14359 -6253 11291 -575 -9197 3838
7364 3838 4694 -3313 6635 15700 3763 -8949 -17809 -13451 -11622 -9411 -4772 -4980 -6111 4721 13146
7349 13146 6438 1941 -3278 -13089 -19172 -23313 -29120 -34948 -22610 -26323 -23884 -12941 -985 -6685
7335f685o141k802P068o79j4753K740J595Q303R314l572J735n775l858N065J31
7320h314P090j388J048K234l81l158q982k261K86k510Q122M308J2504P457j1332
7305D723K462J658j680K604R271k478J51j3546j3736p32J3914L199O95l94r791
7290c680k65M346m747q256j107L908N338j372o216J0454Q765l906M400Q078l513
7275A2227l775R6j4332l400l385O032M493j0949j295Q337j967j0462k924KN882
7260a5420j364p949O114J2406R381M535o500q57J6419j272o014j3227M158M287
7246D697R34k589K29P170J0495J011K180l74j1181L802q757k748N67J42r29J0883
7230A5532O912r631q892n528j5952o850Q433O111L53K47K935L283O257J086M143
$$ plain form
7335 -6685 -12826 -15628 -8560 -9239 -23992 -21252 -19657 -11354 -2040 -5612 -3877 -9652 -13510 -8445 -8314
7320 -8314 -1224 -2612 -1564 670 289 -2869 -11851 -14112 -13826 -16336 -8214 -3906 8598 16055 4723
7305 4723 7185 8843 7163 9767 19038 16560 16711 3165 -10571 -11303 2611 5810 6505 6111 -3680
7290 -3680 -3945 401 -4346 -12602 -13709 -9801 -4463 -5835 -12051 -1597 7168 3262 7662 15740 12227
7275 12227 8452 8548 -5784 -9184 -12569 -6537 -2044 -12993 -14288 -5951 -7918 -18380 -21304 -21302 -15420
7260 -15420 -16784 -24733 -18619 -6213 3168 7703 1203 346 16765 15493 9479 -3748 410 4697
7246 4697 5631 3042 3271 10441 20936 21947 24127 23753 12572 16374 7617 4869 5436 5578 4649 15532
7230 15532 22444 12813 3921 -1607 -17559 -24409 -15976 -9865 -9512 -9265 -6330 -3047 3210 4296 8439
7215H439q48l430r179J627M612J2605l561m312M096R14p787R848k994j3980M293
7200C43K546o990j574J038K836Q790O788r863p410J023K088j0283R607p07K115
7185C47J5745Q507N20j2621p754L91j789k742q363P264J4982O170R829n447j2381
7170A2658k1813r572P89O302J0169Q82j184o174l91j5972J006K978Q727J1239
7156c56L300n497K903l627k371M796l321r58k704N13o50r982r4P462Q856o148
7140g878n622O634P688N779K398O070q949j0057l77O138Q52J750n233j3323r49
7125a5079J2055M731Q584o574n837P892p384N236M149L623p82j340o571Q639M617
7110A5959m91j276j320o751o319n926r912p410K399N935K011M47J6532p673j459
$$ plain form
7215 8439 7591 4161 -5018 -3391 1221 13826 10265 5953 10049 10963 3176 13024 10030 -3950 343
7200 343 2889 -4101 -5675 -4637 -1801 6989 13777 3914 -3496 -2473 -385 -10668 -1061 -1768 347
7185 347 16092 24599 25119 12498 4744 5135 3346 604 -7759 -495 14487 20657 30486 25039 12658
7170 12658 -9155 -18727 -17938 -11636 -1467 -585 -1769 -7943 -8334 -24306 -23300 -20322 -11595 -356
7156 -356 2944 -2553 350 -3277 -5648 -852 -4173 -5131 -7835 -7322 -7972 -17954 -18048 -10586 -1730 -7878
7140 -7878 -13500 -6866 822 6601 8999 15069 6120 -3937 -4314 1824 2676 4426 -807 -14130 -15079
7125 -15079 -3024 1707 10291 3717 -2120 5772 -1612 3624 7773 11396 10614 9274 2703 11342 15959
7110 15959 15468 14192 12872 6121 -198 -6124 -16036 -23446 -21047 -15112 -13101 -12654 3878 -3795 -5254
7095e254N122J0253l23j3666p021P53m039J2181r13M804q718k158O81k426K796
7080g928M467q300N307P077J104J90O640P45J143l166l235o834l691N131l432
7065d782P06n144k495L73L750Q042J007M09p074P421Q328j33N54J2055L952j3038
7049A3931j1537o300l750l699n881o830P345J0179M718j775J500J565q403o291
7035a5228o209K135Q675k416k886m679J145L626k001J614R096r12N434k663j1513
7020a6782j6786J802M928J2793R045K954J261o37j5167j75J5052L266k070K993
7006B477j2408m553J0027J1879L243p586L107L198j596r055R69J993m421K627
6992i9J0354P271K658n024N50o689k1294P65M474O439n735p081Q755M819M566
$$ plain form
7095 -5254 -132 10121 9798 -3868 -10889 -10136 -14175 -1994 -2907 1897 -6821 -8979 -8298 -10724 -7928
7080 -7928 -3461 -11761 -6454 623 1727 1917 8557 9302 10445 7279 4044 -2790 -6481 -1350 -4782
7065 -4782 -4076 -9220 -11715 -11342 -7592 450 1457 1866 -5208 2213 10541 10408 10962 23017 26969 13931
7049 13931 2394 -3906 -7656 -11355 -17236 -24066 -16721 -6542 -1824 -3599 -2099 -534 -8937 -15228
7035 -15228 -21437 -19302 -10627 -13043 -15929 -20608 -19463 -15837 -17838 -16224 -7128 -8040 -2606 -5269 -16782
7020 -16782 -33568 -31766 -26838 -14045 -5000 -2046 -785 -1422 -16589 -16764 -1712 1554 -516 2477
7006 2477 -9931 -14484 -4457 7422 10665 3079 6186 9384 7788 -1267 -298 1695 -2726 -99
6992 -99 10255 17526 20184 15160 15710 9021 -12273 -11508 -7034 -595 -6330 -13411 -4656 163 4729
6977D729j3607m298n031m487Q330J2520J092N758P40m899j8079J998P964R181
6963A911r287l488m789M121J849k176q112j191J0301q622l277J67L103R168q47
6948a1169p171n941O201J0808j370M514N510O055j437n951K640J0741j0881j1674
6934i125L652O276K2087K477j2093j249j1816n647J0450M737M02j6332l859J754
6920h286P665l017k54M871M785m516l493o732m169L518j4655q414O336L931J5238
6905g192j2723n449Q833j272O390K538J437j4959j2795J5013J1430J362R733k336
6891A0m489p472Q561P139N351L117R8q755r070N392j345Q34M35N82r400K122l493
6874a0383P442O929K482o777r512j110N222q35M179o158L489N525Q237P866n241
$$ plain form
6977 4729 -8878 -13176 -18207 -22694 -14364 -1844 -752 5006 5746 847 -17232 -15234 -7270 1911
6963 1911 -7376 -10864 -15653 -11532 -9683 -11859 -19971 -21162 -10861 -19483 -22760 -22593 -19490 -10322 -11169
6948 -11169 -18340 -24281 -18080 -7272 -8642 -4128 1382 7437 6000 49 2689 13430 2549 -9125
6934 -9125 -5473 803 22890 25367 13274 12025 209 -5438 5012 9749 10151 -6181 -10040 -8286
6920 -8286 -621 -3638 -3892 979 5764 1248 -2245 -8977 -13146 -9628 -24283 -32697 -26361 -22430 -7192
6905 -7192 -19915 -25364 -16531 -17803 -11413 -8875 -7438 -22397 -35192 -20179 -8749 -7387 2346 10
6891 10 -4479 -11951 -3390 3749 9100 12217 12315 3560 -5510 -118 -1463 -629 -194 388 -9012 -6890 -10383
6874 -10383 -2941 3988 6470 -307 -9819 -10929 -5707 -6542 -2363 -8521 -5032 493 8730 16596 11355
6859A1355k5j2907n337k42N79J50N946j993J0153j4587J399J0208K033J105n374
6844B463o490m15J0918J429k934J636L545L322j722q595L96P779L059j3440j0235
6829i284j475m392J437p296p852P162P192J2926L991p076m129O206R744l538j1263
6814g647m16J1608J90j3804j1037j262J2886N114J2367N98r983l684q615k873
6800a6558J8989J1132o314J212n228L277m844j2075R282Q813k615L788l528n414
6786h3N361N30j2086j1197Q956j27P40P833L004r200k105n054m106k856k132o49
6770b3171O268K667R20R377Q291M614n251J273k541m711j985r312N55J486N000
6755f520k232L938R01r666P857R567j4959j0933J473Q729O037L985O122n185p914
$$ plain form
6859 11355 11330 -1577 -6914 -7156 -6577 -6427 -481 -2474 7679 -6908 -5509 4699 6732 7837 2463
6844 2463 -4027 -4442 6476 7905 4971 6607 10152 13474 11752 3157 3553 11332 14391 951 -9284
6829 -9284 -10759 -15151 -13714 -21010 -28862 -21700 -14508 -1582 2409 -4667 -8796 -2590 7154 3616 -7647
6814 -7647 -8063 3545 3735 -10069 -21106 -22368 -9482 -4368 7999 8597 -1386 -5070 -13685 -16558
6800 -16558 2431 13563 7249 8461 3233 6510 1666 -10409 -1127 7686 5071 8859 5331 -83
6786 -83 5278 5808 -6278 -17475 -8519 -8646 -7906 -73 2931 -6269 -8374 -13428 -17534 -20390 -22522 -23171
6770 -23171 -16903 -14236 -13316 -3939 4352 8966 3715 4988 2447 -2264 -4249 -13561 -13006 -11520 -6520
6755 -6520 -8752 -4814 -3913 -13579 -5722 3845 -11114 -22047 -20574 -11845 -5808 -1823 4299 -886 -8800
6740h800J849P711N576k714j6520r29L648J269m720m300J698J0822j047O296j76
6725c37L45Q440P057k073r531n440k717P399O254j7373o423j1981K727O347N167
6710a2139Q03r546J6356P969q233L059j436o251k929q301l939j78J1619P413j327
6695g060j0242O344R895r296m304j97N799P749n242k004O460L735K766R786P94
6680A4983m587k951n83n216M297j423r431p34m976J2101O763N299k481k905j908
6665F248j0704J0597R131j5830J388j304j569J707m945j0032o756M519R09O356
6651a0285O270O916J816m612K93O202Q543O170j0188q436J827J044l838p939q601
6636a4818N956L609j1108p048P303J0465n599K277J0934O639k899j2175o038L49
$$ plain form
6740 -8800 -6951 760 6336 3622 -12898 -13827 -10179 -8910 -13630 -17930 -16232 -5410 -6457 -161 -337
6725 -337 8 8448 15505 13432 3901 -1539 -4256 3143 9397 -7976 -14399 -26380 -23653 -17306 -12139
6710 -12139 -11336 -20882 -4526 3443 -4790 -1731 -3167 -9418 -12347 -20648 -24587 -24765 -13146 -5733 -7060
6695 -7060 -17302 -10958 -1063 -10359 -14663 -14860 -9061 -1312 -6554 -8558 -2098 1637 4403 14189 14983
6680 14983 10396 7445 6862 1646 5943 4520 -4911 -5645 -10621 1480 8243 13542 11061 8156 6248
6665 6248 -4456 6141 15272 -558 830 -474 -2043 -336 -5281 -15313 -22069 -17550 -16641 -10285
6651 -10285 -4015 2901 4717 105 398 6600 15143 21313 11125 2689 4516 5560 1722 -6217 -14818
6636 -14818 -8862 -5253 -16361 -23409 -16106 -5641 -11240 -8963 1971 8610 5711 -6464 -12502 -12153
6622a2153l715j3576L410L082J2601j204j0177J2791M934j2169M001Q342R871
6609F038j0182q073m467m265O48R918J1028P195j030m670P903P117p410j5288
6595e538N114J0653Q089j1263j0888m079l804M055j037P645J8112r54j529P034
6581B1610m215p233j245J178o501l669q357k891N626M009m012o735M557k635P522
6566b991q986l217M725J738l349j497j90p025k94R711O139R651q446j792J0582
6551D759K516M132o732K071K858m662r495O20k243n450M778J747O723m038l056
6536e472Q770Q611r201k118N081m131o32M128j2918o32l06O970R270j5663j0153
6521a8396O995Q795k517M684l331j530R422L425j0842r814j843R86k475r478o71
$$ plain form
6622 -12153 -15868 -29444 -26034 -22952 -10351 -11555 -21732 -8941 -4007 -16176 -12175 -3833 6038
6609 6038 -4144 -12217 -16684 -20949 -20301 -10383 645 7840 6810 2140 10043 17160 9750 -5538
6595 -5538 -424 10229 18318 7055 -3833 -7912 -11716 -7661 -8698 -1053 17059 16105 14576 21610
6581 21610 17395 10162 8917 10095 3594 -75 -8432 -11323 -5697 -1688 -5700 -12435 -7878 -10513 -2991
6566 -2991 -11977 -15194 -10469 -8731 -12080 -13577 -13767 -20792 -21086 -11375 -5236 4415 -4031 -5823 4759
6551 4759 7275 11407 4675 6746 9604 4942 -4553 -3933 -6176 -11626 -6848 -5101 1622 -2416 -5472
6536 -5472 3298 11909 2708 590 5671 1540 908 5036 -7882 -8514 -8820 -1850 7420 -8243 -18396
6521 -18396 -11401 -2606 -5123 -439 -3770 -5300 4122 7547 -3295 -13109 -14952 -13966 -16441 -25919 -26590
6506b6590J6650P165N539j092j3580j950L286K858j2477O138k420K245K8034J0578
6492B4384l281o804r767l251j0762L705J964J646l87L639j1557m305P543j0776
6478a8009k532M235p767N198O537J3018M159p629k953M259l173M967k719j4233
6464a6642j374N328j195O06N822k609m425N202k919M973j332l525O044k939Q754
6449b31p312j1330L098J3964K37j0464o719q868J0101J1351j345k82p765q628
6435b4193J6919J6871j698M51K233J794n225r710o581M192L643p03p11K926m728
6420d520p739k142Q279L952P958N120o720l124o975r455r463J5249Q952k406p290
6405a0324j978j930n340m431q713j2343M126N288P919Q517M065l605K803N392
$$ plain form
6506 -26590 -9940 -2775 2764 1672 -11908 -13858 -10572 -7714 -20191 -14053 -16473 -14228 13806 24384
6492 24384 21103 14299 4532 1281 -9481 -5776 -3812 -2166 -2553 1086 -10471 -14776 -7233 -18009
6478 -18009 -20541 -16306 -24073 -18875 -12338 680 4839 -2790 -5743 -1484 -4657 310 -2409 -16642
6464 -16642 -18016 -12688 -13883 -13277 -7455 -10064 -14489 -9287 -12206 -7233 -8565 -12090 -6046 -8985 -231
6449 -231 -7543 -18873 -15775 -1811 -1574 -12038 -18757 -27625 -17524 -6173 -7518 -7800 -15565 -24193
6435 -24193 -7274 9597 7899 8350 10583 12377 7152 -2558 -9139 -4947 -1304 -2007 -2718 208 -4520
6420 -4520 -12259 -14401 -6122 -2170 5788 10908 4188 1064 -5911 -15366 -24829 -9580 -628 -3034 -10324
6405 -10324 -12302 -14232 -19572 -24003 -32716 -45059 -40933 -35645 -27726 -19209 -15144 -18749 -15946 -10554
6391a0554p45j934J4576J2467k935r517k588r91J4044M341j0680r521l459k127
6377i623l395J4519J4748J0335o684r050L43l173O327N081j1334j0673j610r418
6363a3607j251J0036P980j644k886k660j5319P61j321R115J4052R680r872j218
6349A846J1103q186j0999j405j4729R97K573M788O93j6114J769M425J20R891J6036
6334B808O764p724j6611J253n258r70O437R079l087j694J2211p786j6702j0362
6320c1642L475R794L354J113l58P131m735N669O194L449k31l485P545j554r419
6305c700N969Q076q725j107P646N301p393r923J025p36Q107J2874j107j0496j8401
6290a2590j0881m727R735O178o43J1891m530o046j887J1315K115M699K628P12
$$ plain form
6391 -10554 -11299 -13233 1343 13810 10875 1358 -1230 -2221 11823 16164 5484 -4037 -7496 -9623
6377 -9623 -13018 1501 16249 26584 19900 10850 11193 8020 14347 19428 8094 -2579 -4189 -13607
6363 -13607 -14858 -4822 3158 1514 -1372 -4032 -19351 -18590 -19911 -10796 3256 12936 3064 1846
6349 1846 12949 4763 -6236 -7641 -22370 -21373 -18800 -14012 -13319 -29433 -27664 -23239 -23119 -13228 2808
6334 2808 9572 1848 -14763 -13510 -18768 -19738 -13301 -4222 -7309 -9003 3208 -4578 -21280 -31642
6320 -31642 -28167 -18373 -15019 -13906 -14264 -7133 -11868 -6199 -5 3444 3213 -272 7273 5719 -3700
6305 -3700 2269 10345 1620 513 8159 13460 6067 -3856 -2831 -3567 4540 17414 16307 5811 -12590
6290 -12590 -23471 -28198 -18463 -12285 -12928 -1037 -5567 -11613 -13500 -2185 -70 4629 7257 7969
6276G969j633m901N978k187m246j2925m071k484P699k246q374k056K691O896J3614
6261b76Q486K69o433p814J705N83m476K634p40R23j985l957L270n523P87O124
6245f423k061L235j79O543K674r700P805K46R03L552l941j872N45L247o830j9762
6229b2018N641J2933L894J687m989l899k894j121N468n223o162l640K351P384
6215a0588N078K241Q113m316m576j819N897R401m468o577N657O33j83o413n803
6200g723N730l297m28r014P077M509n230j2343q611J2163J0195J180J920L78K247
6185a247m7N654N239M25K098Q364o903n910j3798j0066Q869j511L093l252R228
6170B36j004K739Q016Q236R664j7772o272o783q326L983N739l013j6646J330J1987
$$ plain form
6276 7969 6336 1435 7413 5226 980 -11945 -16016 -18500 -10801 -13047 -21421 -23477 -20786 -13890 -276
6261 -276 8210 8479 2046 -5768 -4063 -3480 -7956 -5322 -6062 -5139 -7124 -11081 -7811 -13334 -12547 -6423
6245 -6423 -8484 -5249 -5428 1115 3789 -5911 1894 2140 3043 6595 2654 782 1327 4574 -2256 -22018
6229 -22018 -16377 -3444 450 2137 -2852 -6751 -9645 -10766 -5298 -10521 -16683 -20323 -17972 -10588
6215 -10588 -5510 -3269 4844 528 -4048 -5867 30 9431 4963 -1614 4043 4676 4493 -1920 -7723
6200 -7723 -1993 -5290 -5718 -14732 -7655 -3146 -8376 -20719 -29330 -17167 -6972 -5792 -3872 -3494 -1247
6185 -1247 -1294 4360 9599 10024 12122 20486 13583 7673 -6125 -16191 -7322 -8833 -5740 -8992 236
6170 236 -768 1971 9987 18223 27887 10115 3843 -2940 -11266 -7283 -1544 -4557 -21203 -19873 -7886
6155g886O816P572N621J1386j6072m382J032l2l95q720l388J184P05K0196M746
6140A8383j6970n378M122P831k739J0837J2797P67o440j7999j1977q2M218J883
6126g47R415n252k372K866N041M907L511n897n931j0039p802o138J0385P97q10
6111h066o03M566J2137p44O966p311j5270n359p08p253K998J3548N776K640n191
6096a874j1164Q929N654J770r664m286N184Q137P595p505j870K824n725j2234
6082a4229o940O291J871N812k321n380J958j60J3593O598n739l329j0416K347
6068a0044P850Q5L799O072J669q919J996L976q160m965L593M446M807j1878K432
6053c241M955j457O202P039j782j0886r534q326p547n891J1515R9J569R853O316
$$ plain form
6155 -7886 -1070 6502 12123 23509 7437 3055 4087 4055 3660 -5060 -8448 -7264 -6559 13637 18383
6140 18383 1413 -3965 157 7988 5249 16086 28883 29650 23210 5211 -6766 -6848 -2630 -747
6126 -747 8668 3416 1044 3910 8951 13858 17369 11472 5541 -4498 -12300 -18438 -8053 -7256 -8066
6111 -8066 -8669 -4103 8034 7290 14256 6945 -8325 -13684 -14392 -21645 -18647 -5099 677 3317 -1874
6096 -1874 -13038 -4109 1545 3315 -6349 -10635 -5451 2686 10281 2776 906 3730 -1995 -14229
6082 -14229 -21169 -14878 -13007 -7195 -9516 -14896 -12938 -13098 495 7093 1354 -1975 -12391 -10044
6068 -10044 -2194 -2109 1690 7762 9431 512 2508 6484 -1676 -6641 -3048 1398 6205 -5673 -3241
6053 -3241 1714 257 6459 13498 11716 830 -8704 -17030 -24577 -30468 -18953 -18854 -17285 -7432 -1116
6038a116M329P795N520j324L385o684o241P928o793j208m882k997j80j591N107
6023A048J687k462n018L12M311J057K363j0590m345j229K423P402J570R00J877
6008A306q685o607j911J5462O305n643k921j2524J020M078o97j858M601P881J4015
5993A3822L877J092o783k0937p878l206j427M224L926O560P091J549n562M810
5979A158J0250o745m152n430n767J7389j43R98Q099j4427k552J265o494M483J1342
5964I274j297q577O856J2290N495j1679o306j1655k490M653N538p558q4J661K065
5949a814O646J965p873q102q300M701O737n735k880L629Q242J089j2750J405P872
5934e168Q895j227J558K731M184N820J489j1642k867q37K148l176j0059J034P372
$$ plain form
6038 -1116 3213 11008 16528 15204 18589 11905 5664 13592 6799 5591 709 -2288 -2468 -4059 1048
6023 1048 2735 273 -4745 -4433 -122 935 3298 -7292 -11637 -12866 -10443 -3041 -1471 -571 1306
6008 1306 -7379 -13986 -15897 -435 5870 227 -2694 -15218 -14198 -10120 -10817 -12675 -8074 -193 13822
5993 13822 17699 18791 12008 -8929 -16807 -20013 -21440 -17216 -13290 -6730 361 1910 -3652 1158
5979 1158 11408 4663 511 -4919 -10686 6703 6560 7558 15657 1230 -1322 -57 -6551 -2068 9274
5964 9274 7977 -600 6256 18546 24041 12362 6056 -5599 -8089 -3436 2102 -5456 -5540 -3879 -1814
5949 -1814 4832 6797 -1076 -9178 -17478 -12777 -6040 -11775 -14655 -11026 -2784 -1695 -14445 -13040 -5168
5934 -5168 3727 2500 4058 6789 10973 16793 18282 6640 3773 2936 5084 1908 -8151 -7117 255
5919B55N681q991m786M860O274L343j907o73r818j2386j1081o971J9214J2062
5905d924o020L817J4294K615n677M891N215q392k138K95p33k194q363K89Q540
5890A515p18L523j006j8068p338Q715L066P195P249P194q353p991j0061K36n757
5875b0599M889J0928k293m535K261K292p948j165J4P173N011N472J980j8630k011
5860a7161J987R647K358j175Q638J502j364r106p64R917n738q825l8j402Lo481
5844a8002N680O786m494k658o144J2020J4882j2787q455m911K061J2048k038o542
5830a2554K07Q235O751j3058m804J468K485j829K882m560l82J3465R563m671J22
5815C320r727n093J9042p18j0070J7075Q321k481r222o485o938p056k019N1P256
$$ plain form
5919 255 5936 -3055 -7841 -2981 3293 6636 4729 4056 -5762 -18148 -29229 -36200 -16986 -4924
5905 -4924 -10944 -7127 7167 9782 4105 8996 14211 5819 3681 3976 3243 1049 -7314 -7025 1515
5890 1515 797 4320 3314 -14754 -22092 -13377 -10311 -3116 4133 11327 2974 -5017 -15078 -14842 -20599
5875 -20599 -15710 -4782 -7075 -11610 -9349 -7057 -15005 -16170 -16156 -8983 -3972 1500 3480 -15150 -17161
5860 -17161 -15174 -5527 -3169 -4344 4294 5796 4432 -4674 -5438 4479 -1259 -10084 -10122 -11524 -11521 -18002
5844 -18002 -12322 -5536 -10030 -12688 -18832 -6812 8070 -4717 -13172 -18083 -16022 -3974 -6012 -12554
5830 -12554 -12347 -4112 2639 -10419 -15223 -13755 -11270 -13099 -10217 -14777 -15159 -1694 7869 3198 3320
5815 3320 -6407 -11500 7542 6824 -3246 13829 22150 19669 10447 3962 -2976 -10032 -12051 -12000 -4744
5800d744m177L875R185n99j1413p208q278L031R643O430P121O10R391P479q274
5785A2072P301j591j5812j3323o30j148n542j959J0260Q416L974j331M235p942
5771c020j1940M868J938m733L924O634Q966n16N954j654r656o693M737N152n340
5756a379l382o87R620j427q601l960l287n302N981J635p844M616R032J983J0165
5741G163J1976j6037l300o869j1827r78J0448J1311l602r856l518O404J5171M940
5727A1426j814k297j4257j0469K997N407K869L031l565M960L450l702r756N346
5713f374K350O804N060r188m122K355R077n749p91q036p722M202L001J727K661
5698d745j843j895J0273J8234p99k2274n303m900l016o681m522j90J029O755P320
$$ plain form
5800 -4744 -8921 -5046 4139 3540 -7873 -15081 -23359 -20328 -10685 -4255 2866 3476 12867 20346 12072
5785 12072 19373 17782 1970 -11353 -11983 -13131 -18673 -20632 -10372 -1956 2018 687 4922 -3020
5771 -3020 -14960 -10092 -8154 -12887 -8963 -2329 6637 6121 12075 10421 765 -5928 -1191 3961 -1379
5756 -1379 -4761 -5448 4172 2745 -5856 -9816 -13103 -18405 -12424 -10789 -18633 -14017 -4985 -3002 7163
5741 7163 19139 3102 -198 -7067 -18894 -19872 -9424 1887 -1715 -11571 -15089 -8685 6486 11426
5727 11426 9612 7315 -6942 -17411 -14414 -9007 -6138 -3107 -6672 -1712 1738 -1964 -11720 -6374
5713 -6374 -4024 2780 7840 -1348 -5470 -3115 5962 213 -578 -8614 -16336 -12134 -9133 -7406 -4745
5698 -4745 -6588 -8483 1790 20024 19225 -3049 -8352 -13252 -16268 -22949 -27471 -27661 -26632 -19877 -12557
5683a2557N565J2536L970o873m725j6110J155J5610K871j954K628L329o595l582
5669d732J5940q010j1528R509j932r838m123J634J199O481O747R700r946o512
5655e411k249j945L647o203l668m826L022R135K066M806L364k005J1863m854q468
5640a726k914N787j0989q839R334R357K269Q83O714n929j3693O711j1644o289
5626b0968P614L061L587P730J0516m256J037k53p097j1856N900J6270J1871q695
5612A4461j6187k027M370j8675Q61J0251p609J1242J7004o354j2069J3271J4434
5599B2973Q672j5282j4711r980O532K187k500P281j332p743o45j0325L748K0345
5585I220j839j4214m17N883k048J408J743o881R261N06M511r24p501r40J0875
$$ plain form
5683 -12557 -6992 5544 9514 2641 -2084 -18194 -17039 -1429 1442 -512 2116 5445 -1150 -4732
5669 -4732 11208 3198 -8330 1179 -753 -10591 -14714 -13080 -11881 -5400 1347 11047 1101 -5411
5655 -5411 -7660 -9605 -5958 -12161 -15829 -20655 -17633 -8498 -6432 -1626 1738 -267 11596 6742 -1726
5640 -1726 -4640 1147 -9842 -18681 -9347 10 2279 3162 9876 3947 -9746 -3035 -14679 -20968
5626 -20968 -13354 -10293 -6706 1024 11540 7284 8321 8068 971 -10885 -4985 11285 23156 14461
5612 14461 -1726 -3753 617 -18058 -17197 -6946 -14555 -3313 13691 7337 -4732 8539 22973
5599 22973 31645 16363 1652 -8328 -1796 391 -2109 5172 3840 -3903 -4548 -14873 -11125 9220
5585 9220 7381 -6833 -7250 -1367 -3415 -2007 -264 -7145 2116 2622 7133 6209 -1292 -2232 8643
5570H643q17K855j2999o061l734j766J614o849o352k218K421k82O94J2913q293
5555b0231q86J0070M014l038J088l964Q74N809R763M666P134j0927l866J344J130
5540B980q125K813j10l512m146O889J1154O83p378Q995R050k770k1032k183q28
5525g520o014k185J3456m197O67K115J1121M817j0004Q73J983o356k492J632j513
5510c617J633j1574l983Q517R847k339Q480O525l346k4569j2668N844O754k596
5496a7092N741J812R335Q035R38q750k646N867j4488j4964Q103J2187O100J341
5482A519Q809j0456k26n188j809j0251k872J1782J0532j234Q042Q203l649q509
5468D693k30q95j1797J1512j59n016k518P13R608n282j5810m501M459O602L218
$$ plain form
5570 8643 7826 10681 -2318 -8379 -12113 -13879 -12265 -19114 -25466 -27684 -25263 -25545 -24851 -11938 -20231
5555 -20231 -21117 -11047 -7033 -10071 -8983 -12947 -12073 -6264 3499 8165 15299 4372 506 1850 2980
5540 2980 -5145 -2332 -2442 -5954 -10100 -3211 7943 8626 1248 10243 19293 16523 -4509 -6692 -7520
5525 -7520 -13534 -15719 -2263 -6460 -5793 -3678 7443 12260 2256 3129 5112 -1244 -3736 -2104 -3617
5510 -3617 -1984 -13558 -17541 -9024 823 -1516 6964 13489 10143 -14426 -27094 -21250 -14496 -17092
5496 -17092 -11351 -9539 -204 7831 8769 19 -2627 3240 -11248 -26212 -18109 -5922 178 1519
5482 1519 10328 -128 -354 -5542 -7351 -17602 -20474 -8692 1840 606 8648 16851 13202 4693
5468 4693 4463 3568 -8229 3283 3124 -1892 -4410 -3697 5911 629 -15181 -19682 -15223 -8621 -5403
5453e403K814J5602p338L79k24j4522j0996R738J4104N524M96k530j5685L863
5439d178N720o32J1371Q452o615m786m785p014j1569q21M568K507K5p744R088
5424f413l62O88J1689J1315M093j3809m408n941K955J795p760K853N172J1689
5410A3556P834j6365j0253Q31J0792J326M257m087Q94j1083k561J3352J70j8066
5396i403m172J0383Q36J3997P496P644k451j3247m936q536n706O962o642m414
5382a2189M657J4972L792l223r334q269L560l844oO128l853m841L053n190N955
5367h632N643p865J059q68m30K933P276O451M99p350p993K0034J2646j9343r032
5352d972o33m868J158o761o250R479N437Q323R144p002k540j514m668m33J0444
$$ plain form
5453 -5403 -2589 13013 5675 6054 5830 -8692 -19688 -9950 4154 9678 10174 7644 -8041 -4178
5439 -4178 1542 910 12281 20733 14118 9332 4547 -2467 -14036 -14857 -10289 -7782 -7757 -15501 -6413
5424 -6413 -6775 -6087 5602 16917 21010 7201 2793 -3148 -193 1602 -6158 -3305 1867 13556
5410 13556 21390 5025 -5228 -4397 6395 7721 11978 7891 8785 -2298 -4859 8493 8663 -9403
5396 -9403 -13575 -3192 -2356 11641 19137 26781 24330 11083 6147 -2389 -8095 -1133 -7775 -12189
5382 -12189 -7532 7440 11232 8009 -1325 -9594 -6034 -9878 -9884 -3756 -7609 -12450 -9397 -14587 -8632
5367 -8632 -2989 -10854 -9795 -10663 -11093 -8160 -884 5567 6066 -1284 -9277 10757 23403 4060 -4972
5352 -4972 -5605 -10473 -9315 -16076 -22326 -12847 -7410 913 10057 3055 515 -999 -5667 -6100 4344
5337D344M690m546m80o946q358M276L296O185j5597n485o38K139J1612J3603r124
5322a029k0711j3882J0310Q264O979Q839l510j0842j700Q723P300Q638Q241j4042
5308A578j6499M150P721l707J4142M848m219k327L567K490j2265j9114R985J1180
5294A530l03L341k871j4734q417K663Q967j0537J076N170K456J36R483R906K20
5279H086q746k190O661N761J177L558N123J856j602n595o296n930m386R342K619
5264I438r283m659J1079J226k715m533n298J102O892J1621Q878j781j5552j6842
5250a0427M151K739n172J1351O339p751m688q16j916J0228M400o738r03L451k913
5235A335L408r197q264o651J5769N958O488J2329P825j2292j1264k985n526n02
$$ plain form
5337 4344 9034 4488 4008 -2938 -11296 -7020 -3724 2461 -13136 -18621 -19259 -17120 -5508 8095 -1029
5322 -1029 -21740 -35622 -25312 -17048 -10069 -1230 -4740 -15582 -17282 -8559 -1259 7379 15620 1578
5308 1578 -14921 -10771 -3050 -6757 7385 12233 8014 5687 9254 11744 -521 -19635 -9650 1530
5294 1530 1227 4568 1697 -13037 -21454 -18791 -9824 -20361 -19285 -14115 -11659 -11523 -2040 7866 8086
5279 8086 -660 -2850 3811 9572 10749 14307 19430 21286 19684 14089 7793 1863 -2523 6819 9438
5264 9438 155 -4504 6575 7801 5086 553 -4745 -3643 3249 14870 23748 21967 6415 -10427
5250 -10427 -6276 -3537 -8709 2642 8981 1230 -3458 -4274 -6190 4038 8438 1700 797 4248 1335
5235 1335 4743 -4454 -12718 -19369 -3600 2358 8846 21175 29000 16708 5444 2459 -3067 -3569
5221c569Q786j0138j2709j659O186J0012k061n982L749r0j085m825Q855Q220q082
5206d392p933n932m793L191m110K852J4635P041J9401Q708j5552m526J983j2099
5192a526q039n192n817p884J5647J4021k600m448k054J0563K862J712J598K708
5178A1551P430q958j1998K284m445K874K481k788K220q905m63J0341L51r400m238
5163a1663Q162O966L464o94r228r870k434p031j58J3151J6760J1832j3113p755
5149a611p030J3149m91J0099J3769L219p259r682j6316p83J1317J1140J991j0096
5135A1416K204j350p95M308j7047r709J7144P912j5140p657K750J3934k326j1578
5121e934j108k19k850L94k433Q921J5891J2190m320j2892j23J5670j1888l544
$$ plain form
5221 -3569 5217 -4921 -17630 -19289 -13103 -3091 -5152 -11134 -7385 -7475 -8560 -13385 -4530 3690 -4392
5206 -4392 -12325 -18257 -23050 -19859 -23969 -21117 -6482 559 19960 28668 13116 8590 10573 -1526
5192 -1526 -9565 -14757 -20574 -28458 -12811 1210 -1390 -5838 -7892 2671 5533 7245 8843 11551
5178 11551 18981 10023 -1975 309 -4136 -1262 1219 -1569 651 -8254 -8717 1624 1975 -7425 -11663
5163 -11663 -3501 3465 6929 6235 -2993 -12863 -15297 -22328 -22486 -9335 7425 19257 6144 -1611
5149 -1611 -8641 4508 4017 14116 27885 31104 23845 14163 -2153 -2936 8381 19521 21512 11416
5135 11416 13620 12270 11475 15783 -1264 -10973 6171 14083 -1057 -8714 -5964 7970 5644 -5934
5121 -5934 -7042 -7261 -10111 -9717 -12150 -3229 12662 24852 20532 7640 7517 23187 11299 7755
5107G755J810k573M401L715j0366k410j5349m439j099R93j420o00q77Q385O877
5092e197Q58K883m925p832J2803J684J687j699m913L083Q455O433L894j2814m985
5077e85k887P812O652r75n13k697p94j1890j1697J0178J1186P247O636j3175j7857
5062a3359M663L930N024p482l476J1558m319N752r752k984j461O517J232l182
5048g339j1755p78J883O298N386p62Q618J130j0383o679j941M362j185K059R337
5033a749O891J811R57L344q406K289O92l240j0360M04M778j383m681p721L503
5018a2871Q641J672l643l067K458p408K725N522J4534L444n442n57j742p474p845
5003a1053N304o936j4256M216O863K083o67N338K157K061K863J3302J1537n059
$$ plain form
5107 7755 9565 6992 11393 15108 4742 2332 -13017 -17456 -18555 -17562 -18982 -19582 -20459 -12074 -5197
5092 -5197 -4339 -1456 -6381 -14213 -1410 274 1961 262 -4651 -1568 6887 13320 17214 4400 -585
5077 -585 -3472 4340 10992 10017 9504 6807 6013 -5877 -17574 -7396 3790 11037 17673 4498 -13359
5062 -13359 -8696 -4766 258 -7224 -10700 858 -3461 2291 -7461 -10445 -11906 -5389 -4157 -7339
5048 -7339 -19094 -19872 -17989 -11691 -6305 -7067 1551 2681 -7702 -14381 -16322 -11960 -13145 -11086 -1749
5033 -1749 5142 6953 7910 11254 2848 5137 5829 2589 -7771 -7367 -2589 -3972 -8653 -16374 -12871
5018 -12871 -4230 -2558 -6201 -9268 -6810 -14218 -11493 -5971 8563 12007 6565 6008 4266 -3208 -11053
5003 -11053 -5749 -12685 -26941 -22725 -15862 -13779 -14446 -9108 -6951 -4890 -2027 11275 22812 17753
4989A7753j7227n562J1539O033l751L608j80j1281j4517m267O141q16j302r281
4975b3110k25Q784L621k065J65M123P145J801j010n09r535P90J0003J4738m435
4960A0281j413o105r740O669j814R836J3117M31j7866j0738o605j3169L805J6804
4946f507J7596Q213q018r619j172M826R404J990r325K203M361K02k882n12j2284
4931a524j3040r004n60J0828L856k706J1108N309l190o151l858R484P200J0153
4917A7905o478j0567j0288J210Jj1399Q795N816j1546m625J3146J9518r90j0342
4903A56M361K560q277j716Q939J519m828k617P581l343q852M306Q754N848l040
4888A1351j2928r219r178O328R687j162O771j2171n996o377o762M797J5292Q161
$$ plain form
4989 17753 526 -5036 6503 12536 8785 12393 12213 932 -13585 -17852 -11711 -12527 -13829 -23110
4975 -23110 -23335 -14551 -10930 -12995 -12830 -8707 -1562 239 -771 -1280 -10815 -10025 -22 14716 10281
4960 10281 8868 2763 -6977 -308 -2122 7714 20831 21262 3396 -7342 -13947 -27116 -23311 -6507
4946 -6507 11089 19302 11284 1665 493 5319 14723 16713 7388 9591 13952 14154 11272 10760 -1524
4931 -1524 -14564 -23568 -24128 -13300 -9444 -12150 -1042 4267 1077 -5074 -8932 552 7752 17905
4917 17905 11427 860 -9428 -8218 -8217 -19616 -10821 -5005 -16551 -21176 -8030 11488 10498 156
4903 156 4517 7077 -1200 -2916 6023 7542 2714 97 7678 4335 -4517 -211 8543 14391 11351
4888 11351 -1577 -10796 -19974 -13646 -3959 -5121 1650 -10521 -16517 -22894 -29656 -24859 -9567 -1406
4874a406k476l43O908K190R727J765j919m522L060l84j0983j5276k850J641P386
4859g482K648P698J711M221M881O455n760M381m820k305j501m84q874j2770Q034
4844c967P074l745K33J508n834n293q53O972N963O515l987q049j253J88M655p233
4828g106n175R023P628o742k605P749N86Q620l057m408j150j907p470K979N097
4813B062R748M43p770k982k005l348K925Q351o536j903l831k477P33o430j6272
4798b9292L534Q373R647Q527k816j0952r209N85J9183J62j0121j3020j0742J2196
4784b3945K2248L201m602j3004k948R598J6288Q003l515P297O422n279j891o333
4770A1540p80M180q07q650q269l215K718J0995q430K973M694L802l196K981n834
$$ plain form
4874 -1406 -3882 -4225 2683 4873 14600 16365 14446 9924 12984 12600 1617 -13659 -16509 -14868 -7482
4859 -7482 -4834 2864 4575 8796 13677 20132 14372 18753 13933 11628 10127 9643 769 -12001 -3967
4844 -3967 3107 -638 -405 1103 -4731 -10024 -10877 -3905 2058 8573 4586 -3463 -4716 -4528 127 -7106
4828 -7106 -12281 -3258 4370 -2372 -4977 2772 3358 11978 8921 4513 3363 1456 -6014 -3035 2062
4813 2062 11810 12253 4483 1501 -504 -3852 -927 7424 888 -1015 -4846 -7323 -6590 -13020 -29292
4798 -29292 -25758 -17385 -7738 789 -2027 -12979 -22188 -21603 -2420 -2258 -12379 -25399 -36141 -23945
4784 -23945 -1697 1504 -3098 -16102 -19050 -9452 6836 14839 11324 18621 25043 19764 17873 11540
4770 11540 10760 14940 14133 5483 -2786 -6001 -3283 7712 -718 2255 6949 10751 7555 10536 4702
4755D702j4406L347R343j240k89J705P118M272m87j878o902M59L95Q596k116n958
4739F661j2213m165K969n684N243k918k259k638P385J892L593n884n07P689K0931
4724B0095m641m170J910J785p864j3206O404O604p127j1608O924P066N477r282
4710a633j876R397P101M523k655p004K763j1562j6950P032J2011J588p090j7366
4696b1721J648L058L338J2913R419k705l405k835P535L958J0968q011j4659M1
4682d58P92R2J473l733m94O495K125P10r683p570L807J3386J384k211l588o506
4666c979Q594K3516o182j5786o251J798Q03l525O493J452L41L412p893q359l895
4651i461K115M936N102Q6o935K200j741m557K927P463J4096L476J050o070o882
$$ plain form
4755 4702 -9704 -6357 2986 1746 1457 3162 10280 14552 14065 12187 5285 5744 6139 14735 12619 6661
4739 6661 -5552 -9717 -6748 -12432 -7189 -10107 -12366 -15004 -7619 -5727 -2134 -8018 -8525 -836 20095
4724 20095 15454 11284 13194 14979 7115 -6091 313 6917 -210 -11818 -4894 2172 7649 -1633
4710 -1633 -3509 5888 12989 17512 14857 7853 10616 -946 -17896 -10864 1147 2735 -4355 -21721
4696 -21721 -20073 -17015 -13677 -764 8655 5950 2545 -290 7245 11203 22171 14160 -499 -458
4682 -458 334 426 1899 -1834 -2328 4167 6292 7002 -2681 -10251 -6444 6942 8326 6115 2527 -3979
4666 -3979 4615 28131 21949 6163 -88 1710 2513 -1012 5481 6933 7274 10686 2793 -5566 -9461
4651 -9461 -7346 -2410 2692 2778 -4157 -1957 -3698 -8255 -5328 2135 16231 19707 20757 14687 7805
4636G805j841M499O87o275P12R22p345j393Q62O929J994r532q662m625J1414M548
4620F99P491R645L22p049r535N040k432K962J837j0233m664j725J2316J5896L671
4605B4241j2427R10J141p677n462P053k554j0491m208k830j050M111M93M153l619
4590h216n717K4542O037m049M36m293N965j827j3932j210k771r284q539n21O693
4575a6686M292O867J4491P231q396j0738n280L054J5664Q611N042j2347j5610
4562c805m806L613p005R488J1639m062j0549k561M055J519L074L91j009l065j126
4547d209J368O581l751K796r217p885k093M766J0496j32J019n97K464J5347p484
4532I469n074j0591j2125m60M610P787l663J350R264N868j9246N685M534N220
$$ plain form
4636 7805 5964 10463 11150 4875 5587 6509 -836 -2229 -1367 5562 7556 -1976 -10638 -15263 -3849 699
4620 699 8190 17835 18157 11108 1573 6613 4181 7143 8980 -1253 -5917 -7642 4674 20570 24241
4605 24241 11814 12724 13865 6188 726 7779 5225 -5266 -9474 -12304 -13354 -9243 -8750 -4597 -8216
4590 -8216 -13933 10609 16646 12597 13033 8740 14705 12878 -1054 -2264 -5035 -14319 -22858 -23379 -16686
4575 -16686 -12394 -5527 8964 16195 7799 -2939 -8219 -5165 10499 19110 24152 11805 -3805
4562 -3805 -8611 -4998 -12003 -2515 9124 5062 -5487 -8048 -3993 -2474 600 991 -18 -3083 -4209
4547 -4209 -2841 3740 -11 2785 -6432 -14317 -16410 -11644 -1148 -1280 -261 -858 1606 16953 9469
4532 9469 4395 -6196 -18321 -18781 -14171 -6384 -10047 -8697 567 6435 -12811 -7126 -2592 2628
4518B628K154m690P890q401o839M855M610j247n106j1996k105j85J0885J2752
4504E205o325m218O608o853J0132M255N488m922j2559J851M596K735m379k262
4490f48m24j0062K527L021m58Q392J0013K06m191m165m594o655m986j163O532
4475f655j3084R625J7953j1596k494J743n168j3355P201Q222p046J3570k53j0865
4461a2202o091o996L638J4159P118k337J0720l834j2871J806o594P947J2061k225
4447D299l318J2133P815j4523q235o74p25L179q957P52p559k42R842J9428L095
4432A6310K798j2202J793J3972J657j0069q475L9P028o110K119J663j3940N68
4418b849k929j2169M083n84k3k576j739k995P023J491j0601L419J1911j08P729
$$ plain form
4518 2628 4782 92 7982 -419 -7258 -2403 2207 960 -4146 -16142 -18247 -18432 -7547 5205
4504 5205 -1120 -5338 1270 -5583 4549 8804 14292 9370 -3189 -1338 3258 5993 1614 -648
4490 -648 -1072 -11134 -8607 -5586 -6044 2348 12361 12567 8376 4211 -383 -7038 -12024 -13187 -6655
4475 -6655 -19739 -10114 7839 -3757 -6251 -4508 -9676 -23031 -15830 -7608 -14654 -1084 -1337 -12202
4461 -12202 -18293 -25289 -21651 -7492 -374 -2711 8009 4175 -8696 -6890 -13484 -5537 6524 4299
4447 4299 981 13114 20929 6406 -1829 -2503 -3228 -49 -9006 -8254 -15813 -16055 -6213 13215 16310
4432 16310 19108 6906 8699 22671 24328 14259 5784 5823 12851 6741 8860 10523 -3417 -2849
4418 -2849 -5778 -17947 -13864 -14448 -14471 -17047 -18786 -21781 -14758 -13267 -23868 -20449 -8538 -8646 -917
4403i17J3861J5717j6452m929M844L543N555r059j0863o737P779J2411N607o90
4389A9670j3948j0601M99m536K361J3256q50o821K567j851O836q785n945j3942
4375b2090n922j602M276N293K1389l55p557J197L097n106q606N509O128k347o47
4360g343J5719l016o115L320j81q142p481K858J337j1131O743L426R591K86J850
4345A721L133k012j5369Q730Q074j2609p908j618R845P33J2062M158j875n211
4331A854P270Q690q712k833M471L136k485o899Q483q2l378l390O052k741m082
4316E354L468O271J460q723q429j0801O404R371O755m497l918n849k008L700l377
4301d819Q804J5890j781N515m605j845J0407L062j1701q15J623M298m685j9107
$$ plain form
4403 -917 12944 28661 12209 7280 12124 15667 21222 12163 1300 -5437 2342 14753 20360 19670
4389 19670 5722 -4879 -4380 -8916 -6555 6701 5851 -970 1597 -254 6582 -2203 -8148 -22090
4375 -22090 -28012 -29614 -25338 -20045 1344 989 -6568 -5371 -2274 -7380 -15986 -10477 -4349 -6696 -7343
4360 -7343 8376 5360 -755 2565 2384 -5758 -13239 -10381 -9044 -20175 -13432 -10006 -415 -129 1721
4345 1721 4854 2842 -12527 -3797 4277 -8332 -16240 -17858 -8013 -7280 4782 8940 7065 1854
4331 1854 9124 17814 9102 6269 10740 13876 11391 4492 12975 12893 9515 6125 12177 9436 5354
4316 5354 8822 15093 16553 7830 -599 -11400 -4996 4375 11130 6633 2715 -3134 -5142 -1442 -4819
4301 -4819 3985 19875 18094 23609 19004 17159 27566 30628 18927 18112 19735 24033 19348 241
4287B41j6483r074r838J8950K0722j070j2494o6m67j0479L834L251r816k94O859
4272a6224J095J179M469K02J1127p08j0079j316J2930J6304p337r997j958k260
4258b573M921J025P537L443p436m642n693k813J0037j397J164k507k543L074M115
4243E712J557k886j2079j1472J3270M218P498p87q724j538L67J7264J3403n052
4229B0751K265p164j2620k0420k628L825p734P885J5632R37J581L351J867p545
4215a7l914K185m359P403O79q234K6P854Q518J818k42r830N05N975p877N161n629
4198B2o745P553O663M538J941n012J967P785o852l570Q396m709r52l549k2597
4183a5121n179J1550J5656L440N47r12m797k348r370j891J4640J5536J1629j2341
$$ plain form
4287 241 -16242 -25316 -35154 -16204 4518 3448 -9046 -9112 -9579 -20058 -16224 -12973 -22789 -23083 -16224
4272 -16224 -15129 -13950 -9481 -9279 1848 1140 -8939 -10255 2675 18979 11642 1645 -313 -2573
4258 -2573 2348 3373 10910 14353 6917 2275 -3418 -6231 3806 2409 3573 1066 -1477 1597 5712
4243 5712 7269 4383 -7696 -19168 -5898 -1680 5818 5031 -3693 -5231 -4864 12400 25803 20751
4229 20751 23016 15852 3232 -17188 -19816 -15991 -23725 -15840 -208 729 2310 5661 7528 -17
4215 -17 -3931 -1746 -6105 1298 1977 -6257 -6231 1623 10141 11959 11717 1887 2392 8367 490 5651 22
4198 22 -6723 830 7493 12031 13972 8960 10927 18712 11860 8290 16686 11977 11025 7476 -15121
4183 -15121 -20300 -8750 6906 10346 10893 9981 5184 2836 -6534 -8425 6215 21751 33380 21039
4169B1039r499K887L436j40p34n64r771p702k193P438K792r413q836J1425m138
4154c973o150J0332K461p486J424m47N768j1730k707L058n542J1364J0205j541
4140E036j589k696n443m52R305R250q603M627Q155P72p478j3981j3721J248J3804
4125a766K312N471P334m042L597l399k542p678L726j866n732m12O400M151j0230
4110d676K586M444P132O874P412K159k2499j2523P929Q301l803q752p249m476
4096a7141J091m472J1220P343m413j872M504P490N283q177l249K47p385J4854
4082E323O065m747p112m357J492Q851N081J00k469R632j1996j2653o018l603R579
4067f832P116k116K38r676J918q137l720Q185J290m088o285J04Q926K0757J4383
$$ plain form
4169 21039 11540 14427 17863 17723 16989 16425 6654 -1048 -3241 4197 6989 -2424 -11260 165 -3973
4154 -3973 -10123 209 2670 -4816 -3392 -3839 1929 -9801 -12508 -9450 -14992 -3628 6577 5036
4140 5036 3447 751 -4692 -5144 4161 13411 4808 9435 17590 18362 10884 -3097 -16818 -15570 -1766
4125 -1766 546 6017 13351 9309 12906 9507 6965 -713 3013 1147 -4585 -4997 1403 5554 -4676
4110 -4676 -2090 2354 9486 16360 23772 25931 3432 -9091 -1162 7139 3336 -5416 -12665 -17141
4096 -17141 -16050 -20522 -9302 -1959 -6372 -8244 -3740 3750 9033 856 -2393 -2146 -9531 5323
4082 5323 11388 6641 -471 -4828 -3336 5515 10596 10696 8227 17859 5863 -6790 -12808 -16411 -6832
4067 -6832 284 -1832 -1594 -11270 -9352 -17489 -21209 -13024 -11734 -15822 -22107 -22003 -13077 7680 22063
4052B2063k4L635j093n44k3833o749J268q92n939l253J470l22O140J1524K048
4037E499O703R485r890m705j215n888N343R72j1393j2012l938J1011J2296k290
4023b2m952J00J505O894r319l626L042j373j024K339k797L063J3129p849o627
4008g517J849j897j232k440L911r63l068N090l844j70K309j296K688P455j371
3993d96q618k643J4275O028l825r814j976k005J112L595J3064P62k149l377r710
3978e777n80l748L768o82N119P17k966o988P232k45o367k639Q596o480o308N429
3962a1919J966M801K943Q480l9N375k363j6159j2705O291J5161r413p956k214
3948a7751J6481J3856m850L36N21m731k783k909l475n395Q628K786N014q8Q310
$$ plain form
4052 22063 22039 25674 24581 24037 204 -6545 -5277 -6169 -12108 -15361 -13891 -14213 -8073 3451 5499
4037 5499 12202 21687 11797 7092 5877 -11 5332 6304 -5089 -17101 -21039 -10028 2268 -22
4023 -22 -4974 -4874 -3369 3525 -5794 -9420 -6378 -7751 -8775 -6436 -9233 -6170 6959 -890 -7517
4008 -7517 -5668 -7565 -8797 -11237 -7326 -8289 -11357 -6267 -10111 -10281 -7972 -9268 -6580 875 -496
3993 -496 -9114 -11757 2518 8546 4721 -5093 -7069 -9074 -7962 -4367 8697 9459 7310 3933 -5777
3978 -5777 -6357 -10105 -6337 -7019 -1900 -1183 -4149 -11137 -3905 -4150 -10517 -13156 -4560 -11040 -17348 -11919
3962 -11919 -9953 -5152 -2209 6271 6232 11607 9244 -6915 -19620 -13329 1832 -7581 -15537 -17751
3948 -17751 -1270 12586 7736 8072 8593 3862 1079 -1830 -5305 -10700 -2072 714 5728 5640 13950
3933A3950m319L39J1780r250K72L347l15n128j1589O94r170N626J0090O764m680
3918H411m925j6906l960m61m680M205O335n630L423O788O159J5775J4340l961
3904B4913j2304m558n159j6233n370J131M654M474K547O328J9041J2890r097j1837
3890A1420L924j947r430L357q338N384k540o077q220j070Q740K259o946L883J5008
3875I407n87m82j815m344k312J0129k933o597n67p634O693R727k401q174J165
3860g25j291m92k844j568J076N806l071p284J243R017J334J292J893r8N91L30
3844E209o950M435J8824J550j0513r852o657r245q179J223m774r8N67P687N586
3829a1187l941M691J0423M58O088Q266p978j3359J0754j538j1178K823J3604n096
$$ plain form
3933 13950 9631 9970 21750 12500 12772 16119 15804 10676 -913 -219 -9389 -3763 6327 13091 8411
3918 8411 3486 -13420 -17380 -17841 -22521 -18316 -11981 -17611 -14188 -7400 -1241 14534 28874 24913
3904 24913 12609 8051 2892 -13341 -18711 -17580 -12926 -8452 -5905 423 19464 32354 23257 11420
3890 11420 15344 13397 3967 7324 -1014 4370 1830 -4247 -12467 -13537 -4797 -2538 -9484 -5601 9407
3875 9407 8820 8338 6523 2179 -133 9996 7063 466 -101 -7735 -1042 8685 6284 -1890 -725
3860 -725 -2016 -2508 -5352 -6920 -5844 -38 -3109 -10393 -9150 -133 1201 2493 4386 4288 4879 5209
3844 5209 -1741 2694 21518 23068 12555 2703 -3954 -13199 -21378 -20155 -24929 -25027 -24460 -16773 -11187
3829 -11187 -15128 -10437 -14 444 6532 14798 6820 -6539 4215 2677 -8501 -5678 7926 2830
3815B830l535j574j1194M444J4464J7234j0149n367p999j0286J293L972o975n87
3801a3429P161J7365j972l94o799N07p170L176J693N502k829J1145M072N148M195
3786B7371j2912j6646J8466J9231n875j5479J543K801j1450q646K732m003j1006
3773a3873K967P090j092j0305o407J756L919K325M677M043J1272L813l777M761
3759A1169n402k652J767m973o484M593o40q062O947N879M477O602L951J0734m129
3744B3777m262J341k712n164K550p618K178L627R917J635j6004p217N982j072
3730F958k268J1491O169o545o634r105m098J171L405J5629J024j1818j0069j0287
3716a4977N614J0473q285o17K561o61M984o681J356K0634O853k0595q5Q191P400
$$ plain form
3815 2830 -705 -2279 -13473 -9029 5435 22669 12520 7153 -846 -11132 -9839 -5867 -12842 -13429
3801 -13429 -6268 11097 9125 8731 1932 2439 -4731 -1555 138 5640 2811 13956 18028 23176 27371
3786 27371 14459 -2187 16279 35510 29635 14156 15699 18500 7050 -1596 1136 -2867 -13873
3773 -13873 -10906 -3816 -4908 -15213 -21620 -19864 -15945 -13620 -8943 -4900 6372 10185 6408 11169
3759 11169 5767 3115 4882 -91 -6575 -1982 -2622 -10684 -3737 2142 6619 13221 17172 27906 23777
3744 23777 19515 20856 18144 12980 15530 7912 10090 13717 23634 25269 9265 2048 8030 6958
3730 6958 4690 16181 22350 15805 9171 66 -4032 -2861 544 16173 17197 5379 -4690 -14977
3716 -14977 -9363 1110 -7175 -7792 -5231 -5892 -908 -7589 -6233 14401 21254 659 574 8765 16165
3701A6165j0260M628M827q992q406n89N016J6447j0408k2849p680K024N41P576
3687a1960R164k189m986P837R746l90j1937j3155l324K037o342O741K794M742
3673a1222K893k866M544K3109M179j5390k389k177k601L685k063J343L139m93
3659C691J1237J092q59J656n332n852o722j2124K354M551k325p633K265L896m558
$$ plain form
3701 16165 5905 10533 15360 6368 -2038 -2627 2389 18836 8428 -14421 -22101 -20077 -19536 -11960
3687 -11960 -2796 -4985 -9971 -2134 7612 7222 -4715 -17870 -21194 -19157 -25499 -18758 -15964 -11222
3673 -11222 -8329 -11195 -6651 16458 20637 5247 2858 681 -1920 1765 -298 1045 4184 3691
3659 3691 14928 16020 15161 16817 11485 5633 -1089 -13213 -10859 -6308 -8633 -16266 -14001 -10105 -14663
$$ [...]
##END NTUPLES=NMR SPECTRUM
##END=
