##TITLE=Analysis number 320093
Compound Code cc 53239
Book Reference 449/106
Project Code adrs
Chemist Name davee
##JCAMPDX= 6.0         $$ Bruker NMR JCAMP-DX V2.0
##DATA TYPE= NMR SPECTRUM
##DATA CLASS= NTUPLES
##ORIGIN= Bruker BioSpin GmbH
##OWNER= nmr
$$ XWIN-NMR		Version 3.5
$$ Tue Jun 13 10:49:44 2006 GMT Daylight Time (UT+1h)  MAYBRIDGE\nmr@NMR_250MHZ
##.OBSERVE FREQUENCY= 250.131544655141
##.OBSERVE NUCLEUS= ^1H
##.ACQUISITION MODE= SIMULTANEOUS (DQD)
##.ACQUISITION SCHEME= undefined
##.AVERAGES= 16
##.DIGITISER RES= 18
##SPECTROMETER/DATA SYSTEM= dpx250
##.PULSE SEQUENCE= zg30
##.SOLVENT NAME= CDCl3
##.SHIFT REFERENCE= (INTERNAL, CDCl3, 0, 16.522)
##AUDIT TRAIL= $$ (NUMBER, WHEN, WHO, WHERE, WHAT)
$$ ##TITLE= Audit trail, XWIN-NMR		Version 3.5
$$ ##JCAMPDX= 5.01
$$ ##ORIGIN= Bruker BioSpin GmbH
$$ ##OWNER= nmr
$$ C:\u/data/dgb/nmr/ADRS/640/pdata/1/auditp.txt
$$ ##AUDIT TRAIL=  $$ (NUMBER, WHEN, WHO, WHERE, WHAT)
(   1,<2006-06-13 10:48:54.56 +100>,<MAYBRIDGE\nmr>,<NMR_250MHZ>,
      <created by zg, POWCHK disabled, PULCHK disabled
       configuration hash MD5:
       E2 DF 36 D8 04 B2 41 60 5A D7 A3 38 5A 4B D0 FE
       data hash MD5: 64K
       B0 CD 5C 03 AC 14 69 1D 65 1E 1A E7 C1 6E E5 DC>)
(   2,<2006-06-13 10:49:17.18 +100>,<MAYBRIDGE\nmr>,<NMR_250MHZ>,
      <Start of raw data processing
       ef LB = 0.3 FT_mod = 6 PKNL = 1 SI = 32K 
       data hash MD5: 32K
       3B 83 1B 36 5C FD 08 64 2E 62 74 20 25 DC C5 91>)
(   3,<2006-06-13 10:49:19.14 +100>,<MAYBRIDGE\nmr>,<NMR_250MHZ>,
      <apk 
       data hash MD5: 32K
       07 21 2A 7C 6A B6 F1 C4 40 E8 23 0E 48 0E DD 0F>)
(   4,<2006-06-13 10:49:20.54 +100>,<MAYBRIDGE\nmr>,<NMR_250MHZ>,
      <abs ABSG = 5 
       data hash MD5: 32K
       99 F8 5E B1 19 62 D1 5E C4 37 C2 EF 3E FE 31 9A>)
$$ ##END=
$$ 
$$ hash MD5
$$ 17 64 DB 52 58 AA 8D B1 A8 DF 00 57 5C 42 BB 2D
##$RELAX= 
##$RELAX= 
##$RELAX= 
##$RELAX= 
##$RELAX= 
##$RELAX= 
##$RELAX= 
$$ Bruker specific parameters
$$ --------------------------
##$DU= <C:\u>
##$EXPNO= 640
##$NAME= <ADRS>
##$PROCNO= 1
##$TYPE= <nmr>
##$USER= <dgb>
##$AMP= (0..31)
100 100 100 100 100 100 100 100 100 100 100 100 100 100 100 100 100 100 
100 100 100 100 100 100 100 100 100 100 100 100 100 100 
##$AQSEQ= 0
##$AQ_mod= 3
##$AUNM= <au_zg>
##$AUTOPOS= <15 >
##$BF1= 250.13
##$BF2= 250.13
##$BF3= 250.13
##$BF4= 250.13
##$BF5= 500.13
##$BF6= 500.13
##$BF7= 500.13
##$BF8= 500.13
##$BYTORDA= 1
##$CFDGTYP= 0
##$CFRGTYP= 5
##$CHEMSTR= <none>
##$CNST= (0..31)
1 1 145 1 1 1 1 1 1 1 1 1 1 1 1 1 1 1 1 1 1 1 1 1 1 1 1 1 1 1 1 1 
##$CPDPRG= <>
##$CPDPRG1= <>
##$CPDPRG2= <>
##$CPDPRG3= <>
##$CPDPRG4= <mlev>
##$CPDPRG5= <mlev>
##$CPDPRG6= <mlev>
##$CPDPRG7= <mlev>
##$CPDPRG8= <mlev>
##$CPDPRGB= <>
##$CPDPRGT= <>
##$D= (0..31)
0 1 0 0 0 0 0 0 0 0.06 0 0 0 0 0 0 0.0002 0 0 0 0 0 0 0 0 0 0 0 0 0 0 
0 
##$DATE= 1150192131
##$DBL= (0..7)
120 120 120 120 120 120 120 120 
##$DBP= (0..7)
150 150 150 150 150 150 150 150 
##$DBP07= 0
##$DBPNAM0= <>
##$DBPNAM1= <>
$$ [...]
##$SUBNAM7= <"">
##$SUBNAM8= <"">
##$SUBNAM9= <"">
##$SW= 20.6930455092707
##$SWIBOX= (0..15)
0 0 3 0 0 0 0 0 0 0 0 0 0 0 0 0 
##$SW_h= 5175.983436853
##$TD= 65536
##$TD0= 1
##$TE= 295.16
##$TE2= 300
##$TE3= 300
##$TEG= 300
##$TL= (0..7)
0 120 120 120 120 120 120 120 
##$TP= (0..7)
150 150 150 150 150 150 150 150 
##$TP07= 0
##$TPNAME0= <>
##$TPNAME1= <>
##$TPNAME2= <>
##$TPNAME3= <>
##$TPNAME4= <>
##$TPNAME5= <>
##$TPNAME6= <>
##$TPNAME7= <>
##$TPOAL= (0..7)
0.5 0.5 0.5 0.5 0.5 0.5 0.5 0.5 
##$TPOFFS= (0..7)
0 0 0 0 0 0 0 0 
##$TUNHIN= 0
##$TUNHOUT= 0
##$TUNXOUT= 0
##$USERA1= <user>
##$USERA2= <user>
##$USERA3= <user>
##$USERA4= <user>
##$USERA5= <user>
##$V9= 5
##$VALIST= <valist>
##$VCLIST= <CCCCCCCCCCCCCCC>
##$VD= 0
##$VDLIST= <DDDDDDDDDDDDDDD>
##$VPLIST= <PPPPPPPPPPPPPPP>
##$VTLIST= <TTTTTTTTTTTTTTT>
##$WBST= 1024
##$WBSW= 4
##$XGAIN= (0..3)
0 0 0 0 
##$XL= 0
##$YL= 0
##$YMAX_a= 598206
##$YMIN_a= -575036
##$ZGOPTNS= <>
##$ZL1= 120
##$ZL2= 120
##$ZL3= 120
##$ZL4= 120
##$ABSF1= 16.522
##$ABSF2= -4.171173
##$ABSG= 5
##$ABSL= 3
##$ALPHA= 0
##$AQORDER= 0
##$ASSFAC= 0
##$ASSFACI= 0
##$ASSFACX= 0
##$ASSWID= 0
##$AUNMP= <proc_1d>
##$AZFE= 0.1
##$AZFW= 0.1
##$BCFW= 0
##$BC_mod= 0
##$BYTORDP= 0
##$COROFFS= 0
##$CY= 12.5
##$DATMOD= 1
##$DC= 0
##$DFILT= <>
##$DTYPP= 0
##$F1P= 14.0000005364418
##$F2P= -0.99999901652339
##$FCOR= 0.5
##$FTSIZE= 32768
##$FT_mod= 6
##$GAMMA= 0
##$GB= 0
##$INTBC= 1
##$INTSCL= 1
##$ISEN= 128
##$LB= 0.3
##$LEV0= 0
##$LPBIN= 0
##$MAXI= 10000
##$MC2= 0
##$MEAN= 0
##$ME_mod= 0
##$MI= 0
##$NCOEF= 0
##$NC_proc= -3
##$NLEV= 6
##$NOISF1= 0
##$NOISF2= 0
##$NSP= 0
##$NTH_PI= 0
##$NZP= 0
##$OFFSET= 16.522
##$PC= 1
##$PHC0= 171.8212
##$PHC1= 5.410566
##$PH_mod= 1
##$PKNL= yes
##$PPARMOD= 0
##$PSCAL= 4
##$PSIGN= 0
##$REVERSE= no
##$SF= 250.13
##$SI= 32768
##$SIGF1= 0
##$SIGF2= 0
##$SINO= 400
##$SIOLD= 32768
##$SREGLST= <1H.CDCl3>
##$SSB= 0
##$STSI= 32768
##$STSR= 0
##$SW_p= 5175.98343685301
##$SYMM= 0
##$S_DEV= 0
##$TDeff= 65536
##$TDoff= 0
##$TI= <Analysis number 999999
Compound Code 99
Book Reference 9
Project Code 9>
##$TILT= no
##$TM1= 0
##$TM2= 0
##$TOPLEV= 0
##$USERP1= <user>
##$USERP2= <user>
##$USERP3= <user>
##$USERP4= <user>
##$USERP5= <user>
##$WDW= 1
##$XDIM= 32768
##$YMAX_p= 485705852
##$YMIN_p= -104918
$$ End of Bruker specific parameters
$$ ---------------------------------
##NTUPLES= NMR SPECTRUM
##VAR_NAME=  FREQUENCY,     SPECTRUM/REAL,   SPECTRUM/IMAG
##SYMBOL=    X,             R,               I
##VAR_TYPE=  INDEPENDENT,   DEPENDENT,       DEPENDENT
##VAR_FORM=  AFFN,          ASDF,            ASDF
##VAR_DIM=   32768,         32768,           32768
##UNITS=     HZ,            ARBITRARY UNITS, ARBITRARY UNITS
##FACTOR=    0.157963299565203, 1,           1
##FIRST=     4132.6476996994, 0,             0
##LAST=      -1043.33573715361, 0,           0
##MIN=       -1043.33573715361, -104918,     0
##MAX=       4132.6476996994, 485705852,     0
$$ Real data points
##PAGE= N=1
##DATA TABLE= (X++(R..R)), XYDATA
$$ [...]
14760d177M844k7971k468O351O142R393K457l597n105J13J6921n815k5912n9m620
$$ -4177 667 -27304 -29772 -23421 -17279 -7886 -5429 -9026 -14131 -14018 2903 -2912 -28824 -28883 -33503
14745c3503o468J5056K3711L671N573p494K747k491j6189j2849J1446K0183j8310
$$ -33503 -39971 -24915 -1204 2467 8040 546 3293 802 -15387 -28236 -16790 3393 -14917
14732a4917j0220K3609L0450L624o48m160r423o646k0013M143N436j9805j4093
$$ -14917 -25137 -1528 28922 32546 31898 27738 18315 11669 -8344 -4201 1235 -18570 -32663
14719c2663m239J743J4660k1984Q499R767j4082K2506Q178k3920k925J5444R465
$$ -32663 -36902 -35159 -20499 -42483 -33984 -24217 -38299 -15793 -7615 -31535 -34460 -19016 -9551
14706i551j2541J3885J4737k3763l6897k845P460K7902Q202J8717j5028l477N998
$$ -9551 -22092 -8207 6530 -17233 -54130 -56975 -49515 -21613 -13411 5306 -9722 -13199 -7201
14693g201j589K4753L562k3735q696L687K833Q60m734j2486J4671P707K1757J4519
$$ -7201 -8790 15963 19525 -4210 -12906 -9219 -6386 -5526 -10260 -22746 -8075 -368 21389 35908
14679C5908J18j4730j7157j3677j9505K6036n018k1997j423L8279O89j3386K2987
$$ 35908 36026 21296 4139 -9538 -29043 -3007 -8025 -30022 -31445 6834 7523 -5863 17124
14666A7124q760Q125k7567j813J3522L783k1360n883j7930J4364L1003J0782K984
$$ 17124 8364 16489 -11078 -12891 631 4414 -16946 -22829 -40759 -26395 4608 15390 18374
14653A8374j7328k3472j2556L579J6884L7195O364k0217j2804j7171p671m43M810
$$ 18374 1046 -22426 -34982 -31403 -14519 22676 29040 8823 -3981 -21152 -28823 -29266 -24456
14640b4456K680K2929k4541n349L8425p838j6416j1182J3684L683J6604J8723
$$ -24456 -21776 1153 -23388 -28737 9688 1850 -14566 -25748 -12064 -8381 8223 26946
14628B6946J6728k0344j7412k0063K070m130n944J92j0148r332p87K7700L1061
$$ 26946 43674 23330 5918 -14145 -12075 -16205 -22149 -21957 -32105 -41437 -42224 -14524 16537
14615A6537K019k2408J2301K3994j3141k1412j4706j6679L499n181J903K3401
$$ 16537 18556 -3852 8449 32443 19302 -2110 -16816 -33495 -29996 -35177 -33274 -9873
14603i873J2585j7489N845o61L04j028j6195l332Q473j05k364j5439l89N920J3383
$$ -9873 2712 -14777 -8932 -9593 -9289 -10317 -26512 -29844 -21371 -21476 -23840 -39279 -39668 -33748 -20365
14588b0365J6101P80p436O231J3801j3229j6105Q456j5614J5629r59J672n752
$$ -20365 -4264 -3484 -10920 -4689 9112 -4117 -20222 -11766 -27380 -11751 -12710 -11038 -16790
14575a6790O57K054P1j5234o067r119p72j633M0900O072l7791l5251J5328K3024
$$ -16790 -16133 -14079 -14008 -29242 -35309 -44428 -45200 -46833 -5933 139 -37652 -72903 -57575 -34551
14561c4551K144J3907j2055m118n142R356L5146j2208k5380K60R822j8509j3621
$$ -34551 -32407 -18500 -30555 -34673 -39815 -30459 4687 -7521 -32901 -32641 -22819 -41328 -54949
14548e4949J5084K297j8104m30J8381J5127l852j286k3515r300j732K3429L6182
$$ -54949 -39865 -37568 -55672 -56102 -37721 -22594 -26446 -27732 -51247 -60547 -62279 -38850 -2668
14535b668K9364j423k1873J3287J3039j0955P575k4858M232O313j0521j6318J0430
$$ -2668 26696 25273 3400 16687 29726 18771 26346 1488 5720 12033 1512 -14806 -4376
14522d376J5909j1696k0850o209L8959J5764J3362k0345N99j0001J693J3438j1500
$$ -4376 11533 -163 -21013 -27222 11737 27501 40863 20518 21117 11116 12809 26247 14747
14509A4747k7966j2811L4016P704n691K858M575o549K934M241L187L352J0767
$$ 14747 -13219 -26030 7986 15690 9999 12857 17432 10883 13817 18058 21245 24597 35364
14496C5364n429j3742j555m748r174J7240L3943O969j4918l2376M520j4614M892
$$ 35364 29935 16193 14638 9890 716 17956 51899 58868 43950 11574 16094 1480 6372
14483F372M190m085k0063l6467L7660M1615m745j3890j329j9622J4017K659k9116
$$ 6372 10562 6477 -13586 -50053 -12393 29222 24477 10587 9258 -10364 3653 6312 -22804
14470b2804L482K0000j9977j1357M1121L1995K4449p935k0171l250n977j0635
$$ -22804 -19322 678 -19299 -30656 10465 42460 66909 58974 38803 35553 29576 18941
14458A8941j8659j450R331r282j4781j3692k3056K320M5233L1346n189p287L762
$$ 18941 282 -1168 8163 -1119 -15900 -29592 -52648 -50328 -5095 26251 21062 13775 17537
14445A7537r957l6128k287j1440K890K2399P527M620j7690K4123L4811o108m2406
$$ 17537 7580 -28548 -30835 -42275 -39385 -16986 -9459 -4839 -22529 1594 36405 30297 -12109
14432a2109k2479k142k4036K1777M6030r76l272j7636R760K4510R167k8669j6165
$$ -12109 -34588 -36730 -60766 -38989 7041 6065 2793 -14843 -5083 19427 28594 -75 -16240
14419a6240k520l821M056j4485k1878m08r029K789L2305J3299Q140P047Q530J7705
$$ -16240 -18760 -22581 -18525 -33010 -54888 -55296 -64325 -61536 -29231 -15932 -7792 -745 7785 25490
14405B5490j699j8063l6393J4756J9926J8003k3717q540n435q506o83J2493K7315
$$ 25490 23791 5728 -30665 -15909 4017 22020 -1697 -10237 -15672 -24178 -24861 -12368 14947
14392A4947N507m2494R55Q346l400K2848J6018j2049n241N720q356P649J3062
$$ 14947 20454 -22040 -21085 -12739 -16139 6709 22727 10678 5437 11157 2801 10450 23512
14379B3512o175K706L75j7718M927o044l7480j1063J7221O697j6448j2041j0978
$$ 23512 17337 20043 20418 2700 7627 1583 -35897 -46960 -29739 -23042 -39490 -51531 -62509
14366f2509K0374R163j656J7235l1061M718K1079p920p748K2107L189N246K0049
$$ -62509 -42135 -32972 -34628 -17393 -48454 -43736 -22657 -30577 -38325 -16218 -13029 -7783 12266
14353A2266J3124q016J787j3190j8377l449O063O125j7040J7081j4205J7082J8024
$$ 12266 25390 17374 19161 5971 -12406 -15855 -9792 -3667 -20707 -3626 -17831 -749 17275
14340A7275l652K245k586K895k0309k2929k2980J6635J9514j5517j6259N250J5830
$$ 17275 13623 15868 13282 16177 -4132 -27061 -50041 -33406 -13892 -29409 -45668 -40418 -24588
14327b4588Q684j6121J743J0393M2776j9925l1939q321N497Q942K1948J7792r63
$$ -24588 -15904 -32025 -30282 -19889 22887 2962 -28977 -37298 -31801 -22859 -911 16881 15918
14314A5918L7670R041j8924k4043l1532J1607K7637k0687k6804q22j7022r996
$$ 15918 53588 62629 43705 19662 -11870 -263 27374 6687 -20117 -20939 -37961 -47957
14302d7957j3564j4892L8302J0535J1859O324k5565N034J7455K5123K1568j05
$$ -47957 -61521 -76413 -38111 -27576 -15717 -9393 -34958 -29924 -12469 12654 34222 34117
14290C4117k6095j3689K0645R811m1071o970N946r482K6557K5273J1738k753r343
$$ 34117 8022 -5667 14978 24789 -16282 -23252 -17306 -26788 -231 25042 36780 34027 24684
14277B4684L376O095J2459R59k3172l4746P556J770k0276k0273K8066M2743p05
$$ 24684 28060 34155 46614 47573 24401 -10345 -2789 -1019 -21295 -41568 -13502 29241 28536
14264B8536l0058q894N231J1889r963O3J8292M949n313o612k0891j479r250p249
$$ 28536 -1522 -10416 -5185 6704 -3259 -3196 15096 20045 14732 8120 -12771 -14250 -23500 -30749
14250c0749K7395J9355J6496m061k5713k8325J6640K521j037P635q678k4880l2878
$$ -30749 -3354 16001 32497 28436 2723 -25602 -8962 -6441 -7478 157 -8521 -33401 -66279
14237f6279J3892K8302K6122k484j7937l1945K4414L7348J5290k7396j5053j8683
$$ -66279 -52387 -24085 2037 -447 -18384 -50329 -25915 11433 26723 -673 -15726 -34409
14225c4409o021j0425K9150Q905L569J7549l536J2291J462n988r811l56J9286
$$ -34409 -40430 -50855 -21705 -12800 -9231 8318 4782 17073 18535 12547 2736 2380 21666
14212B1666K1655K3933M306j5677j6681p627Q002J5469j9754k5205l888M193m071
$$ 21666 43321 67254 71560 55883 39202 31575 39577 55046 35292 10087 6199 10392 6321
14199F321j8327N737J0701k3749q152M855j1255L4408L0613j8241l1090o677r033
$$ 6321 -12006 -6269 4432 -19317 -27469 -22614 -33869 539 31152 12911 -18179 -24856 -33889
14186c3889P728J7401K2685R515R84l0709j9002R146q858l479J0806R746j5189
$$ -33889 -26161 -8760 13925 23440 24424 -6285 -25287 -16141 -24999 -28478 -17672 -7926 -23115
14173b3115r181j1587l41K4641K7937J7672O123k5227j5900J446K3425j096j3363
$$ -23115 -32296 -43883 -44224 -19583 8354 26026 32149 6922 -8978 -7532 15893 14797 1434
14160A434j5662J2085J8717J7130j7673l444P270j243L829N884j7243k1958O452
$$ 1434 -14228 -2143 16574 33704 16031 12587 19857 18614 22443 28327 11084 -10874 -4422
14147d422L0517j6393P578n727j3526o134L291j002J7540L9222r945l1193j075
$$ -4422 26095 9702 17280 11553 -1973 -8107 -4816 -5818 11722 50944 40999 9806 8731
14134H731k2595j3778M808J3063M577J0567L166J1555j7573j7957K1584Q126m339
$$ 8731 -13864 -27642 -22834 -9771 -5194 5373 8539 20094 2521 -15436 6148 14274 9935
14121I935K1057p608R287L036j2374j8277j3283N490J2778o526O438Q70N336J4350
$$ 9935 30992 23384 32671 35707 23333 5056 -8227 -2737 10041 3515 9953 10823 16159 30509
14107C0509l3792j0496L2215j8160m9293K6595L8718j2488j2235J1505J1053j7798
$$ 30509 -3283 -13779 18436 276 -49017 -22422 16296 3808 -8427 3078 14131 -3667
14095c667p955K3584K5949k0013j815k6374O125j3414q747K7339K2522J970o800
$$ -3667 -11622 11962 37911 17898 16083 -10291 -4166 -17580 -26327 1012 23534 25504 18704
14082A8704q71p691j8811k3437l3460J1897J8393J4440K6571O754m6091k0520
$$ 18704 17833 10142 -8669 -32106 -65566 -53669 -35276 -20836 5735 12489 -33602 -54122
14070e4122L799J1984J4407J81J4574N315k1416k448k228L954J5080K1163j6085
$$ -54122 -50323 -38339 -23932 -23751 -9177 -3862 -25278 -27726 -29954 -26000 -10920 10243 -5842
14057e842j6817n547J3883L7769K3522q274o036j8716j9812j2796J9783r794J3845
$$ -5842 -22659 -28206 -14323 23446 46968 38694 32658 13942 -5870 -18666 1117 -8677 5168
14044E168Q061R292k2022l3124O005L3890K0695J6309O827l7998j8280k813J5731
$$ 5168 13229 22521 499 -32625 -26620 7270 27965 44274 51101 13103 -5177 -7990 7741
14031G741J3347l412j5031J0288R543L383l2515l0604j1186N233R462P625L4873
$$ 7741 21088 17676 2645 12933 22476 25859 -6656 -37260 -48446 -43213 -33751 -26126 8747
14018H747l794k0940K117j2310J3856J4127n364o103k1854p969N800K2758J040
$$ 8747 4953 -15987 -13870 -26180 -12324 1803 -3561 -9664 -31518 -39487 -33687 -10929 -9889
14005i889K872k185j1099L1865J0088K6819J5551k1346j806j0682j7747k1874
$$ -9889 -7017 -9202 -20301 11564 21652 48471 64022 42676 40870 30188 12441 -9433
13993i433j0937j4110j913R016j2982o203k5355k443N1201N313m2563J3405o981
$$ -9433 -20370 -34480 -36393 -27377 -40359 -46562 -71917 -74360 -23159 -17846 -60409 -47004 -53985
13980e3985j764K6932N498K0124L5276L397N97l6246P484n640J5916m49l1931
$$ -53985 -55749 -28817 -23319 -3195 32081 35478 36075 -171 7313 1673 17589 17140 -14791
13967a4791k5846o305L1784Q132K0965K6132m743k320l2398J2400K0917K9009
$$ -14791 -40637 -46942 -15158 -7026 13939 40071 35328 33008 610 13010 33927 62936
13955F2936j4497m7844k827N175k1307j5554J65M225J6041K3023J4105O493l0097
$$ 62936 48439 595 -2232 2943 -18364 -33918 -33753 -29528 -13487 9536 23641 30134 37
13942C7l6784J3651J1822k6033k005O669J4915k2194J0134J4387O807J4215L4363
$$ 37 -36747 -23096 -11274 -37307 -39312 -32643 -17728 -39922 -29788 -15401 -8594 5621 39984
13929C9984J1860j1567m849o51m659l021Q754J7306j7609k2655k435O251K960
$$ 39984 51844 40277 35428 34777 30118 27097 35851 53157 35548 12893 10458 16709 19669
13916A9669o121k3885r698J3257j8110n600K0200j2767R333R36j3870k4601k282
$$ 19669 13548 -10337 -20035 -6778 -24888 -30488 -10288 -23055 -13722 -12786 -26656 -51257 -53539
13903e3539L2958O106k8476K500K1890J9955K712J690R864j398p736J9085l553
$$ -53539 -20581 -14475 -42951 -40451 -18561 1394 4106 5796 15660 14262 6526 25611 22058
13890B2058k5326l8307K7118L8196o442k7947k0901q904J2514j0373j048P018
$$ 22058 -3268 -41575 -14457 23739 17297 -10650 -31551 -40455 -27941 -38314 -39362 -32344
13878c2344l529Q986L2994j248j4836l3166p362j3133J5901K923J3974L2218j477
$$ -32344 -35873 -26887 6107 4859 -9977 -43143 -50505 -63638 -47737 -44814 -30840 1378 -99
13865i9J3743j738J5814J981J3613m743j0487m193P751k8188o374J2450k2384
$$ -99 13644 11906 27720 29701 43314 38571 28084 23891 31642 3454 -2920 9530 -12854
13852a2854K1026L0076j9413j586o820m2j4142m195k5868l095K180j0178J0118
$$ -12854 8172 38248 18835 17249 10429 10387 -3755 -7950 -33818 -36913 -34733 -44911 -34793
13839c4793R817K6916K048l1165j5723N1551K5081k3313l5325J4186K4447k695
$$ -34793 -24976 1940 3988 -27177 -42900 8651 33732 10419 -24906 -10720 13727 11032
13827A1032k7574k8287J3446K3985K0588j0808P068J4779j2774N584K4671k780
$$ 11032 -16542 -44829 -31383 -7398 13190 2382 9450 24229 11455 17039 41710 38930
13815C8930k2978j0248J9633k3076l6660l7598L228L2184P590n118r624J2208
$$ 38930 15952 5704 25337 2261 -34399 -71997 -68769 -36585 -28995 -34113 -43737 -31529
13803c1529J1036N572j7670M882J2565Q402j5498k3035n813R770p30M905K5751
$$ -31529 -20493 -14921 -32591 -27709 -15144 -6742 -22240 -45275 -51088 -41318 -42048 -37143 -11392
13790a1392R009J1443K068Q923l50J6523R385j7503k5924Q638K7172l989k0893
$$ -11392 -2383 9060 11128 20051 19701 36224 45609 28106 2182 10820 37992 34003 13110
13777A3110k2388l0977J0754Q298K0812M543J2641O071j8151o806l6125l09N9058
$$ 13110 -9278 -40255 -29501 -21203 -391 4152 16793 22864 4713 -2093 -38218 -38527 20531
13764B0531K2420N908k0572m2010k7979q499j4045J178N660j1561K0448J2019
$$ 20531 42951 48859 28287 -13723 -41702 -50201 -64246 -63068 -57408 -68969 -48521 -36502
13752c6502j2237k0983K9854M1596j3529j3593K2767L5021L1647J770j1290l620
$$ -36502 -48739 -69722 -39868 1728 -11801 -25394 -2627 32394 64041 65811 54521 50901
13740E0901o501k6868j6526j9726n510K7407j2433j9553M660L5716L6673K4090
$$ 50901 44400 17532 1006 -18720 -24230 3177 -9256 -28809 -24149 11567 48240 72330
13728G2330k8101k3446k2224n663L8180k8912l3702J6147j4307O794J702j2341
$$ 72330 44229 20783 -1441 -7104 31076 2164 -31538 -15391 -29698 -22904 -21202 -33543
13716c3543K1077j6753j5369J450J2328J4141K711m537J1644J4390J9168j0336
$$ -33543 -12466 -29219 -44588 -43138 -30810 -16669 -13958 -18495 -6851 7539 26707 16371
13704A6371K2547J3002j5057j5550k5070j7038l537J5247K4482J8578o03o2894
$$ 16371 38918 51920 36863 21313 -3757 -20795 -24332 -9085 15397 33975 33372 -29522
13692b9522m2327M3501R749j6214r69J1365J9071P946M393K0282k1203m4775o452
$$ -29522 -71849 -28348 -18599 -34813 -35782 -24417 -5346 2600 6993 27275 6072 -38703 -45155
13679d5155J7247R5O662J1371j2843k7300p346J9201K2975J3048p253k5124j7590
$$ -45155 -27908 -27813 -21151 -9780 -22623 -49923 -57269 -38068 -15093 -2045 -9298 -34422 -52012
13666e2012K4740K827K2307K0179J1755M749J9515k6454j4232j1195Q406O970
$$ -52012 -27272 -24445 -2138 18041 29796 34545 54060 27606 13374 2179 10585 17555
13654A7555j6759J4623m051K9443K1735l3034r116k1269j6046j4305L1315j203
$$ 17555 796 15419 11368 40811 62546 29512 20396 -873 -16919 -31224 91 -1112
13642a112n759J4001L293P331J460l2824j0157K3342M425j5354M031K9443o60
$$ -1112 -6871 7130 10423 17754 19214 -13610 -23767 -425 4000 -11354 -7323 22120 21460
13629B1460N779J2484l790j1398k546R148R153J7671j0128k1475O040k3990p215
$$ 21460 27239 39723 35933 24535 21989 31137 40290 57961 47833 26358 32398 8408 1193
13616A193p209J0736K0677q679j2480j8780k6394k6256n630L0014K0536K5178
$$ 1193 -6016 4720 25397 16718 4238 -14542 -40936 -67192 -72822 -42808 -22272 2906
13604B906J0291m074j0889o333r841j1086J0787J7125R942K090n382l854O379
$$ 2906 13197 9123 -1766 -8099 -17940 -29026 -18239 -1114 8828 10918 5536 1682 8061
13591H061R795J0446q419K0746k47k9341J8232l956k4823m6705k5246J6365J8765
$$ 8061 17856 28302 19883 40629 40382 11041 29273 25317 494 -46211 -71457 -55092 -36327
13578c6327K3737k029k2324O035N1525j688j8752J5416l679j0100l606j456m8851
$$ -36327 -12590 -14619 -36943 -30908 20617 18929 177 15593 11914 1814 -1792 -3248 -52099
13565e2099J3038K3505q597J6995L8144r7k2478K3500K2037j1418J8063l1656
$$ -52099 -39061 -15556 -24153 -7158 30986 30889 8411 31911 53948 42530 60593 28937
13553B8937k4240r024k475Q471o03J0430J3875l5754j4887K5985M179k7907L364
$$ 28937 4697 -4327 -6802 1669 1066 11496 25371 -10383 -25270 715 4894 -23013 -19649
13540a9649k7j4407j3401M1777J7125j4356j3244J8443J3942r914O125n098M966
$$ -19649 -19676 -34083 -47484 -5707 11418 -2938 -16182 2261 16203 6289 12414 7316 12282
13527A2282K6433J8354k1769m023K132l1196j2957j405R095J433k4961k373J4595
$$ 12282 38715 57069 35300 31277 33409 2213 -10744 -12149 -3054 -1621 -26582 -28955 -14360
13514a4360j2478r902K8760j2198l545J6279L7954M807k4098j6440R928r788L927
$$ -14360 -26838 -36740 -7980 -20178 -23723 -7444 30510 35317 11219 -5221 4707 -5081 -1154
13501a154J4298r48N726N175j277J216M372p154L215M164k6368q407K4949J9063
$$ -1154 13144 12196 17922 23097 21820 23036 27408 20254 23469 27633 1265 -7142 17807 36870
13487C6870k2144m014j1912L457j6330r72j527K0648L6485j4455k0025m623J7088
$$ 36870 14726 10712 -1200 2257 -14073 -15045 -16572 4076 40561 26106 6081 1458 18546
13474A8546m057J0838k6434l112K2076p930J177J6238K432J7069k2908N231L765
$$ 18546 14489 25327 -1107 -4219 17857 9927 11104 27342 29774 46843 23935 29166 32931
13461C2931J332l340R491q803j5678R879R134m676o923j3238j6429J716k585O525
$$ 32931 34263 30923 40414 31611 15933 25812 34946 30270 23347 10109 -6320 -4604 -7189 -664
13447f64P615Q960j3195q744J9255l664n60m974j7358j6028J0113K7662J4706
$$ -664 6951 15911 2716 -6028 13227 9563 9003 4029 -13329 -29357 -19244 8418 23124
13434B3124O358n463j184M798j49L04O208r97R96L921l3178j1791j3682o647J3632
$$ 23124 29482 24019 22835 27633 27484 27788 33996 32999 33995 37916 4738 -7053 -20735 -27382 -13750
13419a3750j282J0714N6202K3537k3403j0760j5425k5084l0223O666K1361J5420
$$ -13750 -15032 -4318 51884 75421 52018 41258 25833 749 -29474 -22808 -1447 13973
13407A3973Q181n00j200l1726j4445L257J0465o976j3203J2269J4298p711J0201
$$ 13973 22154 21654 20454 -11272 -25717 -22460 -11995 -18971 -32174 -19905 -5607 -13318 -3117
13394c117J2419j6021Q267j624R516K515j6923J2183N861j2733k5440N643J1900
$$ -3117 9302 -6719 1548 -76 9440 11955 -4968 7215 13076 343 -25097 -19454 -7554
13381g554J9225M0252K425N757r678p608k0110r688O317k3636R041K6673J4163
$$ -7554 11671 51923 54348 60105 50427 42819 22709 13021 19338 -4298 4743 31416 45579
13368D5579j5401j9761k5464L993m20o910q984m439J1936K2549p914r23n745K6711
$$ 45579 30178 10417 -15047 -11054 -11474 -18384 -27368 -31807 -19871 2678 -5236 -6159 -11904 14807
13354A4807l444Q075J2284K469p880p253j3045J166j7802j84l810j9239k0757
$$ 14807 11363 19438 31722 34191 26311 19058 6013 7179 -10623 -10807 -14617 -33856 -54613
13341e4613j7650m324L4161J1652j417j0434K0106J0578k243j1655J8076J1761
$$ -54613 -72263 -76587 -42426 -30774 -32191 -42625 -22519 -11941 -14184 -25839 -7763 3998
13329C998J1727j9658K367l174j4473J5701m345k0012J546L0017j5805j7385R521
$$ 3998 15725 -3933 -1566 -4740 -19213 -3512 -7857 -27869 -26323 3694 -12111 -29496 -19975
13316a9975R082R234K4247K3117j4903k1314k1819j3567p121M886q572J5273M267
$$ -19975 -10893 -1659 22588 45705 30802 9488 -12331 -25898 -33019 -28133 -36705 -21432 -17165
13303a7165K2363Q861n4889r288J5754n729O711K8176K3966j235k978j9448M1
$$ -17165 5198 14059 -40830 -50118 -34364 -40093 -33382 -5206 18760 17525 14547 -4901 -4860
13290d860M355k9686k2998J7053J7234r30m2158J109M3555J3480J283o068j1343
$$ -4860 -505 -30191 -53189 -36136 -18902 -19832 -61990 -60881 -17326 -3846 -2563 -8631 -19974
13277a9974j1721j7354K591J7579J1390J4356J1912Ok3042k9553j307L8922m456
$$ -19974 -31695 -49049 -46458 -28879 -17489 -3133 8779 8785 -14257 -43810 -45117 -6195 -10651
13264a0651k2769k0868q705K7928L4729N277l191j7006N675j7201p570R919P532
$$ -10651 -33420 -54288 -62993 -35065 -336 4941 1750 -15256 -9581 -26782 -34352 -24433 -16901
13251a6901P114N239L7957K2021k8075q065j7622l0419r816k865J2389J7524N981
$$ -16901 -9787 -4548 33409 55430 27355 19290 1668 -28751 -38567 -41432 -29043 -11519 -5538
13238e538k591r565Q548m661k2698L745J7232O441j0485k444M470J006j7456J8855
$$ -5538 -8129 -17694 -9146 -13807 -36505 -32760 -15528 -9087 -19572 -22016 -17546 -16540 -33996 -15141
13224a5141J8572P930q96k1810r190l01R510J6026l8658P90L0181J2139r432j0689
$$ -15141 3431 11361 10465 -11345 -20535 -20836 -11326 4700 -33958 -33168 -2987 9152 -280 -10969
13210a0969L197K2912J08k907J7458k938j2386J1992K1975j3538n340O420l672
$$ -10969 -7772 15140 15248 12341 29799 26861 14475 26467 48442 34904 29564 35984 32312
13197C2312k3650k5306J4944L811j6332L94M664L3798K0262l867k1756n9877j8574
$$ 32312 8662 -16644 -1700 2111 -14221 -13827 -9163 24635 44897 41030 19274 -40603 -59177
13184e9177L4974K3013P786K312j1793K0536K3073J2409j645Q092k0996J2266
$$ -59177 -24203 -1190 6596 8908 -2885 17651 40724 53133 51488 59580 38584 50850
13172E0850j6806l7520O817m962j6273q163J1882R141L441J20P354n855n716J8077
$$ 50850 34044 -3476 3341 -1621 -17894 -26057 -14175 -5034 -1593 -1473 5881 26 -5690 12387
13158A2387P691j1070K6180k000k1610R139L358J670M432k4414p74K477j091M458
$$ 12387 20078 9008 35188 33188 11578 20717 24075 25745 30177 5763 4989 7466 6375 10833
13144A0833m340k2500N860P936n02r79l644o345L376P974j1156L02J5161R431
$$ 10833 6493 -16007 -10147 -2211 -2713 -3692 -7336 -13681 -10305 -2331 -13487 -13185 1976 11407
13130A1407j6288J997l447R770K3288O13J0790K0553M364k843l5352n04M824p344
$$ 11407 -4881 -2884 -6331 3439 26727 27340 38130 58683 63047 60204 24852 24348 29172 21828
13116B1828M731j9037n74K9990M484k3847J593J8993N063j290k986K0034l213
$$ 21828 26559 7522 6948 36938 41422 17575 19168 38161 43224 41934 38948 58982 55769
13103E5769o076O077R776j7265l978k4241K388j3958Q776j3555o484J0820K6342
$$ 55769 49693 55770 65546 48281 44303 20062 22450 8492 17268 3713 -2771 8049 34391
13090C4391N875j0107n364k9776l358j1953J0132j5025p148L4357l103N67k5940
$$ 34391 40266 30159 24795 -4981 -8339 -20292 -10160 -25185 -32333 2024 -1079 -512 -26452
13077b6452J2001L2057l77L0116J4138k3048p147N224N479m991k2028L234J7509
$$ -26452 -14451 17606 17229 47345 61483 38435 31288 36512 41991 37000 14972 18206 35715
13064C5715k1020j2144J1433L763l2772j3884L5J1054J6277o470k4053M7368L349
$$ 35715 14695 2551 13984 17747 -15025 -28909 -28874 -17820 -1543 -8013 -32066 15302 18651
13051A8651k5401k98Q401J2857K4822J8381O111l0119l0288k7898K5449J7932
$$ 18651 -6750 -7048 1353 14210 39032 57413 63524 33405 3117 -24781 668 18600
13039A8600J4346J6307j8907j2255n711j6680J7932M76n805k2259N658K0954j3982
$$ 18600 32946 49253 30346 18091 12380 -4300 13632 14108 8303 -13956 -8298 12656 -1326
13026a326K1605K292k2898n590L3286K5186k7387k6178k0050K0180L1035K1425
$$ -1326 20279 22571 -327 -5917 27369 52555 25168 -1010 -21060 -880 30155 51580
13014E1580k2503l7938j1426J5655J145L45K3294j6895k9862o919j6048J1500
$$ 51580 29077 -8861 -20287 -4632 -3487 -3142 20152 3257 -26605 -33524 -49572 -38072
13002c8072L6753K9085o006Q728Q395j4741j0714Q119j4869j1657L363K0059L559
$$ -38072 -1319 27766 21760 30488 38883 24142 13428 21547 6678 -4979 -1616 18443 22002
12989B2002k903J1045l508j9447q510k0665M393J9541J8380r62l647j2498m6413
$$ 22002 19099 30144 26636 7189 -1321 -21986 -17593 1948 20328 19366 15719 3221 -43192
12976d3192r760K2465j8853p876m035K2964K7004J7104m8056m404J6173J1275
$$ -43192 -52952 -30487 -49340 -57216 -61251 -38287 -11283 5821 -42235 -46639 -30466 -19191
12964a9191M417j6989j0864L0635K6725m723J742j2339k2148R960N235K21P196
$$ -19191 -14774 -31763 -42627 -11992 14733 10010 11752 -587 -22735 -12775 -7540 -7319 -123
12951a23O413l226J4255j82p660J702J5566J4885j4112k7437j3673M692q170J30
$$ -123 6290 3064 17319 17137 9477 11179 26745 41630 27518 81 -13592 -8900 -17070 -16940
12937a6940j4879p297l364P860J4326M293k1884q37J3110K3554M443k0106j7046
$$ -16940 -31819 -39116 -42480 -34620 -20294 -16001 -37885 -38722 -25612 -2058 2385 -17721 -34767
12924c4767K4899j2755L297Q175j361K7288J6333j9977j9560j7607J1926m774
$$ -34767 -9868 -22623 -19326 -11151 -12512 14776 31109 11132 -8428 -26035 -14109 -18883
12912a8883m946Q914J7977J8337J4144N021l5765o202M24Q433Q393k8281r297
$$ -18883 -23829 -14915 3062 21399 35543 40564 4799 -1403 -979 7454 15847 -12434 -21731
12899b1731j642l666L646O707K1353J4445l2779j1578q94j653L152l934J6960
$$ -21731 -23373 -27039 -23393 -16686 4667 19112 -13667 -25245 -26139 -27792 -24640 -28574 -11614
12886a1614K7659o39J3135j340l472J6126j4701l2369n457j158l997n459j3384
$$ -11614 16045 15406 28541 27201 23729 39855 25154 -7215 -12672 -13830 -17827 -23286 -36670
12873c6670R995k329R915K9805J5534r232r758l471M131j0721M525l393j0753
$$ -36670 -26675 -29004 -19089 10716 26250 17018 7260 3789 7920 -2801 1724 -1669 -12422
12860a2422R853N719J7629J7211L468j9212k9195j4011J9170K4731R297r706j3713
$$ -12422 -2569 3150 20779 37990 41458 22246 -6949 -20960 -1790 22941 32238 22532 8819
12847H819k91p415L6489R8j9830k0509K007j7562m201Q042j1799R702K0061L261
$$ 8819 8528 1113 37602 37700 17870 -2639 -632 -18194 -22395 -14353 -26152 -16450 3611 6872
12833F872j220m075j6626K0424K379R981j5244j1868J0015J2536k366J20N100
$$ 6872 5652 1577 -15049 5375 7754 17735 2491 -9377 638 13174 10808 10928 16028
12820A6028j1127j9182m2772J3219L8802J4976J3434o446j4303R468j4273P112
$$ 16028 4901 -14281 -57053 -43834 -5032 9944 23378 16932 2629 12097 -2176 4936
12808D936r446k7884K2435r20j5238j6929R301k660J4986K7183K7484O748n159
$$ 4936 -4510 -32394 -9959 -10879 -26117 -43046 -33745 -36405 -21419 5764 33248 39996 34837
12795C4837k057L490r177j5307j3184K0824R981j2055m782o882j5184K6989J8008
$$ 34837 32780 36270 27093 11786 -1398 19426 29407 17352 12570 5688 -9496 17493 35501
12782C5501j3209k229k970J8444k0975j8981l3510j0056K2582J7030J2012Q601
$$ 35501 22292 20063 17093 35537 14562 -4419 -37929 -47985 -25403 -8373 3639 12240
12770A2240m302M263k609j4352j3754P489L1181o640j15j2320M21n090J8719n854
$$ 12240 7938 12201 9592 -4760 -18514 -11025 20156 13516 13401 1081 1502 -3588 15131 9277
12756I277L84k6341k0830n258k1565J0534K8243J1810L784j6880m286p974N129
$$ 9277 9661 -16680 -37510 -42768 -64333 -53799 -25556 -13746 -9962 -26842 -31128 -39102 -33973
12743c3973J9371m2090l2071K9972m0n054J0193K8447J3127K4054l3610r765K4024
$$ -33973 -14602 -56692 -88763 -58791 -58831 -63885 -53692 -25245 -12118 11936 -21674 -31439 -7415
12730g415m67J4694K301l7294N863N755k0467M1601K0605N678R143m571M272j789
$$ -7415 -7882 6812 9113 -28181 -22318 -16563 -37030 4571 25176 30854 39997 35426 39698 37909
12716C7909j8384j6809P432o701j6077j9803K599M5635L5843O049n777j4552k8651
$$ 37909 19525 2716 10148 3447 -12630 -32433 -29834 15801 51644 57693 51916 37364 8713
12703H713k7561J3136K1687n693q957R767J860j012J7960n922r328J256K61j6073
$$ 8713 -18848 -5712 15975 10282 1325 11092 12952 11940 29900 23978 14650 15906 16167 94
12689I4p306R660P694j5866K531K9832L2849J5336j5769m3168m9853J4213L0746
$$ 94 -7212 2448 10142 -5724 -3193 26639 59488 74824 59055 15887 -33966 -19753 10993
12676A0993J9801r053n622M6311p510l0500l4275j0983J5709K2359K5181k4134
$$ 10993 30794 21741 16119 62430 54920 24420 -9855 -20838 -5129 17230 42411 18277
12664A8277l9538M46J992K408K765J0093j3901k3103k5071J0979M3075J4014J0965
$$ 18277 -21261 -20815 -18823 -16415 -13650 -3557 -17458 -40561 -65632 -54653 -11578 2436 13401
12651A3401K6011J9755p414O064j0344k7722j1124j2589k5380m285J1722j3238
$$ 13401 39412 59167 51753 57817 47473 19751 8627 -3962 -29342 -33627 -21905 -35143
12639c5143j3958Q908L4054N532n236K132o365R513p374K509K4981Q212l7888
$$ -35143 -49101 -40193 -6139 -607 -5843 -3711 -10076 -563 -7937 -5428 19553 27765 -10123
12626a0123k3027L5325J611R783j4940L691J9767K8589j6010M145K1379j518j4805
$$ -10123 -33150 2175 3786 13569 -1371 2320 22087 50676 34666 38811 60190 58672 43867
12613D3867j7454k0797j1936L20r773j0901K653L33k6492O162R794m279Q897N829
$$ 43867 26413 5616 -6320 -6000 -15773 -26674 -24021 -23688 -50180 -44018 -34224 -38503 -29606 -23777
12599b3777k195O796J8996n564j8248L4261R866j2962j1793J533L8692j4964m4259
$$ -23777 -25972 -19176 -180 -5744 -23992 10269 20135 7173 -4620 -3087 35605 20641 -23618
12586b3618J4673l776j4733O650J4072R579L2884K9823m624l3239l6328Q469O27
$$ -23618 -8945 -12721 -27454 -20804 -6732 2847 35731 65554 60930 27691 -8637 -168 459
12573D59r230M089K5654M593k4035k5862j4180k181K2752M436l0528k3127N584
$$ 459 -8771 -4682 20972 25565 1530 -24332 -38512 -40693 -17941 -13505 -44033 -67160 -61576
12560f1576P929P097L4040K0024O365j9162k3788l565j1994j680R801K4067O336
$$ -61576 -53647 -46550 -12510 7514 13879 -5283 -29071 -32636 -44630 -46310 -36509 -12442 -6106
12547f106J4995l100p890k4830m397J0592m233L1977K236o596l876j6699j4123
$$ -6106 8889 5789 -2101 -26931 -31328 -20736 -24969 7008 9244 2648 -1228 -17927 -32050
12534c2050L754K8056O114J987j2545o398J3082N340k0612J7882j160j5627J2645
$$ -32050 -28296 -240 5874 7861 -4684 -11082 2000 7340 -13272 4610 3450 -12177 468
12521D68J9133m66R924j6217k5670m345K3197j1988k0645J3327K3423n748J837
$$ 468 19601 19135 29059 12842 -12828 -17173 6024 -5964 -26609 -13282 10141 4393 6230
12508F230m444J067k6321j9811K766L7281k1956J2553J0736J2068l111j2388l259
$$ 6230 1786 2853 -23468 -43279 -40513 -3232 -25188 -12635 -1899 10169 7058 -5330 -8589
12495h589J7818k6006k7515K1498M3329k483n669j0043k3292j9744k011M26K0631
$$ -8589 9229 -16777 -44292 -22794 20535 18052 12383 2340 -20952 -40696 -42707 -42281 -21650
12482b1650J9002K1072J1272o835j3740j8957j6410r06J9524J1212L1843q137
$$ -21650 -2648 18424 29696 22861 9121 -9836 -26246 -27152 -7628 3584 35427 27290
12470B7290k1842J902J4181J6208j8773l7256k843J2888K2348j6375l190l475
$$ 27290 5448 7350 21531 37739 18966 -18290 -21133 -8245 14103 -2272 -5462 -8937
12458h937R428l009m36J8577Q612k2651j6634q480O07R831L8612R201m978j8437
$$ -8937 491 -2518 -2954 15623 24235 1584 -15050 -23530 -22923 -13092 25520 34721 29743 11306
12444A1306J416r261l0017J9627J324L62o789J5353M603K8385Q48l7764K7795
$$ 11306 12722 3461 -26556 -6929 -5605 -5243 -12032 3321 7924 36309 37157 -607 27188
12431B7188K0235k8120k4212K8760J0797N716j6623J2132K5011j5199j6773j865
$$ 27188 47423 19303 -4909 23851 34648 40364 23741 35873 60884 45685 28912 27047
12419B7047O104R153n676j4438p375K0994J2019j0248k4520n144L4095n000j4460
$$ 27047 33151 42304 36628 22190 14815 35809 47828 37580 13060 7916 42011 37011 22551
12406B2551P011j5065m860j32J0074J352R990j2853j9086m471j6541n054K573
$$ 22551 29562 14497 9637 9505 19579 20931 30921 18068 -1018 -5489 -22030 -27084 -24511
12393b4511j481n255K0470K8961p634j6638p916L723Q282r960J3969J7226Q03
$$ -24511 -25992 -31247 -10777 18184 10550 -6088 -14004 -10281 -1999 -11959 2010 19236 20039
12380B0039k5828r747j044K770J8894O42J2390k654k2134k105k629K439J1618
$$ 20039 -5789 -15536 -16580 -13810 5084 5726 18116 15462 -6672 -8777 -11406 -8967 2651
12367B651j4319J4043n653p021l821m525K806P30L4130J4776j9570l6826j108
$$ 2651 -11668 2375 -3278 -10299 -14120 -18645 -15839 -15109 19021 33797 14227 -22599 -23707
12354b3707N1818j6040j8244l1421o486L1694K6758j4118J0649m1422N39J3536
$$ -23707 28111 12071 -6173 -37594 -44080 -12386 14372 254 10903 -30519 -29980 -16444
12342a6444K0191K1321k973j3248J8471l430J6662k9707l855o073K3285L1462
$$ -16444 3747 25068 22095 8847 27318 23888 40550 10843 6988 915 24200 55662
12330E5662m246k6477j1808j9031j7270J0976J2283k0562K0037J064K2660J9608
$$ 55662 51416 24939 13131 -5900 -23170 -12194 89 -20473 -436 628 23288 42896
12318D2896K6560j9837m4615Q64L725K564l270J5741j0159k8015Q730J0960j3063
$$ 42896 69456 49619 5004 5868 9593 12157 8887 24628 14469 -13546 -4816 6144 -6919
12305f919K947J7554p603p979J1714j6125N91N898J2190K5995j117j3885j4422
$$ -6919 -3972 13582 5979 -2000 9714 -6411 -5820 78 12268 38263 37146 23261 8839
12292H839j5515n814k847q637k3660n888K1352J5225k5898l494N949J3129K3882
$$ 8839 -6676 -12490 -15337 -23974 -47634 -53522 -32170 -16945 -42843 -46337 -40388 -27259 -3377
12279c377q31N992k3054k371l6064J618M1257P977P618l3349P943l557Q673J564
$$ -3377 -4208 1784 -21270 -23641 -59705 -58087 -16830 -8853 -1235 -34584 -26641 -30198 -21525 -19961
12265a9961K5095O514J4054r85k0842j6183P498M538j2663P563M0695R655j9490
$$ -19961 5134 11648 25702 24717 3875 -12308 -4810 -272 -12935 -5372 35323 44978 25488
12252B5488J2122J1884k9520j9726p270J524J2449J3487j8399j1592J0762L3009
$$ 25488 37610 49494 19974 248 -7022 -5498 6951 20438 2039 -9553 1209 34218
12240C4218j1849N370j8203j4991K158N705p672l1181L5406L9229K2250j0599
$$ 34218 22369 27739 9536 -5455 -3297 2408 -5264 -36445 -1039 38190 60440 49841
12228D9841j0256r05j6306l215j2138j8836J5255n845J3483K644q630N018j424
$$ 49841 39585 38680 22374 19159 7021 -11815 3440 -2405 11078 13722 5092 10110 8686
12215H686p868J3845N700J6378k5602k3392j6534J9581K6462N44m445L061j9166
$$ 8686 818 14663 20363 36741 11139 -12253 -28787 -9206 17256 17800 13355 16416 -2750
12202b750J7031j2729J3391L3229l711k8703p126M687p891K389l671n693j1261
$$ -2750 14281 1552 14943 48172 44461 15758 8632 13319 5428 7817 4146 -1547 -12808
12189a2808m979Q994k1581K202J0290j3194M719L1092l720l489R808r133K657
$$ -12808 -17787 -8793 -30374 -28172 -17882 -31076 -26357 4735 1015 -2474 7334 -1799 858
12176H58L898k5340J2631J7260r190n752J0503K8391P421k3992k8453J8449Q29
$$ 858 4756 -20584 -7953 9307 117 -5635 4868 33259 40680 16688 -11765 6684 7513
12163G513O860j4479J7205K298L834k1801q393j0875J0509j719j2381j179L7865
$$ 7513 14373 -106 17099 19397 23231 1430 -6963 -17838 -7329 -9048 -21429 -22608 15257
12150A5257J3399j3031Q1K641k097K33k1323J176M5530J5520l256k5980j0944
$$ 15257 28656 15625 15706 18347 16250 16483 -4840 -3664 41866 57386 54130 28150 17206
12137A7206m775J48K1399P009k7642l1063m795Q05J284j3832J7889J3547p459
$$ 17206 12431 12579 33978 40987 13345 -17718 -22513 -21708 -20424 -34256 -16367 -2820 -10279
12124a0279r887O149L8545J9029K451j5088k6737R012K435k3381j5463n51n344
$$ -10279 -20166 -14017 24528 43557 46008 30920 4183 13195 15630 -7751 -23214 -23765 -29109
12111b9109K998K6178K2105j3863J0160p113j0600M18j4173j9187R020J913K3620
$$ -29109 -26111 67 22172 8309 18469 11356 756 1174 -12999 -32186 -23166 -21253 2367
12098B367P998p424j0568M733M582J4172P747j1407j7328l999O063k590k529J8308
$$ 2367 10365 2941 -7627 -2894 1688 15860 23607 12200 -5128 -9127 -3064 -5654 -8183 10125
12084A0125j4861J3281m185k3498J4007n690j5973o026M388K9244l140l670R699
$$ 10125 -4736 8545 4360 -19138 -5131 -10821 -26794 -32820 -28432 812 -2328 -5998 3701
12071C701o84Q491P789n964n441J1206j6180k1879q58j0257l806J3589j0167r498
$$ 3701 3017 11508 19297 13333 7892 19098 2918 -18961 -19819 -30076 -33882 -20293 -30460 -39958
12057c9958J7239R67o739o27J2773N100M559j006J7918K4252l4449k0219n910
$$ -39958 -22719 -21752 -28491 -29118 -16345 -11245 -6686 -7692 10226 34478 29 -20190 -26100
12044b6100K913r63K4050p582k3439l867J0205K4754L344J0112k8075k3610J3052
$$ -26100 -23187 -24150 -100 -7682 -31121 -34988 -24783 -29 3315 13427 -14648 -38258 -25206
12031b5206j726N908j3973m760L618J8350K7142o736k6607K3421L0290q706l6827
$$ -25206 -26932 -21024 -34997 -39757 -36139 -17789 9353 2617 -23990 -569 29721 21015 -15812
12018a5812j129j943p928L1885L1187k0305n160M0868j4656l3390j5729N394O209
$$ -15812 -16941 -18884 -26812 5073 36260 15955 10795 51663 37007 3617 -12112 -6718 -509
12005e09J4350l828k495k4906J4508r359q508m939o133j0577k4165Q254n402K4954
$$ -509 13841 10013 7518 -17388 -2880 -12239 -20747 -25686 -31819 -42396 -66561 -58307 -63709 -38755
11991c8755L3728J0604k6675l736N514J8115J6690K784J3654N837j7726j3129
$$ -38755 -5027 5577 -21098 -24834 -19320 -1205 15485 18269 31923 37760 20034 6905
11979F905M2538L1579M814l8092k3499q471k0118j5025k2386r584J629J5590L5156
$$ 6905 49443 81022 85836 47744 24245 15774 -4344 -19369 -41755 -51339 -49710 -34120 1036
11966A036p577n458J5793J453k4959M3513K5804N013M630k2719k3563k6457j1261
$$ 1036 -6541 -11999 3794 5247 -19712 23801 49605 54618 59248 36529 12966 -13491 -24752
11953b4752M499o568K6824j4752p085J1339K4255j859J934R356K621M665k4844
$$ -24752 -20253 -26821 3 -14749 -21834 -10495 13760 11901 13835 23191 25812 30477 5633
11940E633k2350j490R46j903J4840L311L184J3350K230l5126N554L0769J2483
$$ 5633 -16717 -18207 -17261 -19164 -4324 -1013 2171 15521 17751 -17375 -11821 18948 31431
11927C1431j7301l2961Q691j272L221O242J7785j0448l650O998N648j1930l541
$$ 31431 14130 -18831 -10140 -11412 -8191 -1949 15836 5388 1738 8736 14384 2454 -1087
11914a087J1781J1897j5570j9644m447N614j03j2184l19j300K4281k360n828K7188
$$ -1087 10694 22591 7021 -12623 -17070 -11456 -11559 -23743 -24062 -25362 -1081 -3441 -9269 17919
11900A7919J2200k9776j6485m416l3190K66J6312q93L141J8382J7380P640j8279
$$ 17919 30119 343 -16142 -20558 -53748 -53482 -37170 -38063 -34922 -16540 840 8480 -9799
11887i799K8257O747j0877j7363K052O567M034j7655j2849R205J4219p239R262
$$ -9799 18458 25205 14328 -3035 -983 5584 9618 -8037 -20886 -11681 2538 -4701 4561
11874D561J1151j2298L0781K2194k2615k8628P438p748K3986R598j4268j5651
$$ 4561 15712 3414 34195 56389 33774 5146 12584 4836 28822 38420 24152 8501
11862H501p620J0949Q439l259j7642j3709K5377K781j4883j1391J0439J7730K497
$$ 8501 881 11830 20269 17010 -632 -14341 11036 13817 -1066 -12457 -2018 15712 18209
11849A8209K7889p053k6211j4458K371n171q166k0574L5006J1314k4688k2409
$$ 18209 46098 39045 12834 -1624 747 -4424 -12590 -33164 1842 13156 -11532 -33941
11837c3941J2622J6180n172r269r743R336J5960j588l509J6068J6337k9322O295
$$ -33941 -21319 -5139 -10311 -19580 -29323 -19987 -4027 -5615 -9124 6944 23281 -6041 254
11824B54j3822q99k5526L095p83p246j5402J4755M4879K9596K2424R993Q489J832
$$ 254 -13568 -14467 -39993 -36898 -37681 -44927 -60329 -45574 -695 28901 51325 61318 69807 71639
11810G1639k9442k673r697m2054j2662M2507L0148k0930k1051n098R382J7263
$$ 71639 42197 39524 29827 -12227 -24889 17618 47766 26836 5785 687 10069 27332
11798B7332j5729O924j0710j4326j7560j6301j0572O5748J3269k1756j5332o19
$$ 27332 11603 18527 7817 -6509 -24069 -40370 -50942 14806 28075 6319 -9013 -9632
11786i632K8417J7708j7269j2497k4307J6526J0145j1319k0466K1439P824Q663
$$ -9632 18785 36493 19224 6727 -17580 -1054 9091 -2228 -22694 -1255 6569 15232
11774A5232K067j1938J7370P712k1006l1236p326k6013l183J9630o13J791J3436
$$ 15232 17299 5361 22731 30443 9437 -21799 -29125 -55138 -58321 -38691 -39304 -37513 -24077
11761b4077L3706Q807j9828j4492J441K3661K3914k2302j1214M624m37L476j6764
$$ -24077 9629 18436 -1392 -15884 -14443 9218 33132 10830 -384 4240 3803 7279 -9485
11748i485r829l7744k8534L4318K7536p148J8839L2414o078k0796N55P114J6352
$$ -9485 -19314 -57058 -85592 -51274 -23738 -30886 -12047 20367 14289 -6507 -5952 1162 17514
11735A7514J8546j8650k0198K3518J2232Q040q982l4027L729N061R163Q391r870
$$ 17514 36060 17410 -2788 20730 32962 41002 32020 -2007 1722 6783 15946 24337 14467
11722A4467k7022j053P681j5430k2047J3815N383J5770L3443K0771O689k7718
$$ 14467 -12555 -13608 -5927 -21357 -43404 -29589 -24206 -8436 25007 45778 52467 24749
11710B4749o087J5318q470p409k080q343r646j3627J8313N010K6539J3026K5848
$$ 24749 18662 33980 25510 18101 16021 7678 -1968 -15595 2718 7728 34267 47293 73141
11697G3141k6768l4885j4314M555J5254p070Q010l938P191k436J2723P844n261
$$ 73141 46373 11488 -2826 1729 16983 9913 17923 13985 21176 18740 31463 39307 34046
11684C4046l947J5026k2205o445R857M159k7588n368J0066K1316k3148J0254M4174
$$ 34046 30099 45125 22920 16475 26332 30491 2903 -2465 7601 28917 5769 16023 60197
11671F0197j6067k9548p623K8213q472l1267k8212K1961J2027N781L653k987k851
$$ 60197 44130 14582 6959 35172 26700 -4567 -32779 -10818 1209 6990 10643 7656 4805
11658D805q413L40J0718J6036k0770K64J7263p067k3577m3680J1980K5590K3363
$$ 4805 -3608 -3268 7450 23486 2716 2980 20243 13176 -10401 -54081 -42101 -16511 6852
11645F852K3474m7645k4700J641M413J0665J770J4981K5051N15K707j6868j7402
$$ 6852 30326 -17319 -42019 -40378 -35965 -25300 -23530 -8549 16502 17017 19724 2856 -14546
11632a4546j6900J3443O255m649R548L1828L665k1496P157M253p702j0759l324
$$ -14546 -31446 -18003 -11748 -16397 -6849 24979 28644 7148 14305 18558 10856 97 -3227
11619c227j5832n403j800j8211L4774R399r621l489L924j0154k832M816k1951
$$ -3227 -19059 -24462 -26262 -44473 -9699 -300 -9921 -13410 -9486 -19640 -22472 -17656 -39607
11606c9607l525K6459P870J2628q524k2973j3666k0341K2617K2531p761K99J5392
$$ -39607 -43132 -16673 -8803 3825 -4699 -27672 -41338 -61679 -39062 -16531 -24292 -23993 -8601
11593h601J9898j2107j5163J1125K904j693K0623m197m1748j692M5735L1855q854
$$ -8601 11297 -810 -15973 -4848 -1944 -3637 16986 12789 -28959 -30651 15084 46939 38085
11580C8085j0923R301n285j1758k1115l511o638J9446J2500r069r931m941Q16
$$ 38085 27162 36463 31178 19420 -1695 -5206 -11844 7602 20102 11033 1102 -3839 -3023
11567c023J857R624K055k9267j415Q742K2474J3084J5542O762j258k2330n702
$$ -3023 -1166 8458 10513 -18754 -20169 -11427 11047 24131 39673 46435 45177 22847 17145
11554A7145j350j1037K963l978J2927k7920o172R573m155j2436K021j5763J5258
$$ 17145 15795 4758 7721 3743 16670 -11250 -17422 -7849 -12004 -24440 -22419 -38182 -22924
11541b2924k340J7033q714n417K3185L497j824q001o578k0303J714K1033m19k2368
$$ -22924 -25264 -8231 -16945 -22362 823 4320 2496 -5505 -12083 -32386 -30672 -9639 -10058 -32426
11527c2426l2987q413J4025J3446M3330l548N152J9879r216k2397K0130J1391
$$ -32426 -65413 -73826 -59801 -46355 -3025 -6573 -1421 18458 9242 -13155 6975 18366
11515A8366l162J0171j166K4827Q434j0897j9473j3520j8084L519O012k0237j4917
$$ 18366 15204 25375 24209 49036 57470 46573 27100 13580 -4504 -985 5027 -15210 -30127
11502c0127r018n019J9287J0937q668M009L98J4033m140q139P887J8451J9066
$$ -30127 -39145 -44164 -24877 -13940 -22608 -18599 -18201 -4168 -8308 -16447 -8560 9891 28957
11489B8957J253M260o13k2351l2531o468o92K40K7646N810j3490J1773k7655q048
$$ 28957 30210 34470 33857 11506 -21025 -27493 -28185 -27945 -299 5511 -7979 3794 -23861 -31909
11475c1909K653K6706k3090Q544K2216O301K025K254j7641m203K259J936J6068
$$ -31909 -29256 -2550 -25640 -17096 5120 11421 13446 15700 -1941 -6144 -3885 -1949 14119
11462A4119Q905m55k6162l885L343J7115K7281k944Q244j4100k1002n828j74j4266
$$ 14119 23024 22569 -3593 -7478 -4135 12980 40261 37317 45561 31461 10459 4631 4457 -9809
11448i809K2695J0862O263R854q137l8172P193J5346P375L1179J4446j6540k5631
$$ -9809 12886 23748 30011 39865 31728 -6444 749 16095 23470 54649 69095 52555 26924
11435B6924J313K649p190j0785k993P461n688M418j3336k1153P478j8244k0074
$$ 26924 28237 30886 23696 12911 9918 17379 11691 16109 2773 -18380 -10902 -29146 -49220
11422d9220R863K0676k674m505j6833j2826M3796L0853J2049Q212j5275k5386
$$ -49220 -39357 -18681 -21355 -25860 -42693 -55519 -11723 19130 31179 39391 24116 -1270
11410a270j5056O082J6258L8713r79j5733j1230j5183k6518j0147K3998J423p113
$$ -1270 -16326 -10244 6014 44727 43748 28015 16785 1602 -24916 -35063 -11065 -9642 -16755
11397a6755j0693N151j5357P791K1086j2341m825P571P90R607M61n327K1164p723
$$ -16755 -27448 -22297 -37654 -29863 -8777 -21118 -25943 -18372 -17582 -7975 -7514 -12841 8323 600
11383F00k712j0334q315L5189k3356r441O073J9099K2761J2589o10l4077K008
$$ 600 -2112 -12446 -20761 14428 -8928 -18369 -12296 6803 29564 42153 41543 7466 9474
11370I474J0077J6143n096q795l7260l6411N951L8318j0338k0482J8082J0217
$$ 9474 19551 35694 30598 21803 -15457 -51868 -45917 -7599 -17937 -38419 -20337 -10120
11358a0120o69K87p572p824m917j0829p411R556K1239O692Q130J0433N664j841
$$ -10120 -10789 -10502 -18074 -25898 -30815 -41644 -49055 -39499 -18260 -11568 -3438 6995 12659 10818
11344A0818k907j1475j4393q671l178P293n994j0199m493j3643J3599l973L7105
$$ 10818 7911 -3564 -17957 -26628 -29806 -22513 -28507 -38706 -43199 -56842 -43243 -47216 -10111
11331a0111M2532L146l8629k0498K5981j1973l1680k9843j175K846O452J1844
$$ -10111 32421 35567 -3062 -23560 2421 -9552 -41232 -71075 -72250 -69404 -62952 -51108
11319e1108L0532j0335R54M60l1182J6452J1846n909j9482N288k937N707K761
$$ -51108 -20576 -30911 -29957 -29497 -60679 -44227 -32381 -38290 -57772 -52484 -55421 -49714 -46953
11306d6953Q766o514j0789o69J0285K6416J7656k650J7283k717o587n946j807
$$ -46953 -38187 -44701 -55490 -56159 -45874 -19458 -1802 -4452 12831 10114 3527 -2419 -4226
11293d226q39j3625l664N335K5623K947M957L789J2415o857o925j811n094j9024
$$ -4226 -5065 -18690 -22354 -17019 8604 11551 16508 20297 32712 25855 18930 17119 12025 -6999
11279f999k507M767j690j7959o472l991R051J3743j7664O859J4469k844O848J154
$$ -6999 -9506 -4739 -6429 -24388 -30860 -34851 -25800 -12057 -29721 -22862 -8393 -11237 -4389 -3235
11265c235K6131k1598j0783K1906n597k1147J2266K978J4204j967P107j450j039
$$ -3235 22896 1298 -9485 12421 6824 -14323 -2057 921 15125 13158 20265 18815 17776
11252A7776J601J9749J3540P05k2850k8545O716l042o248J6J526q305j4665k0718
$$ 17776 19377 39126 52666 53371 30521 1976 8692 5650 -598 -582 944 -7361 -22026 -42744
11238d2744L145J6713j6888j1332O1407L9139k1592m2904J3161K7874K4410j6367
$$ -42744 -39599 -22886 -39774 -51106 10301 49440 27848 -15056 -1895 25979 50389 34022
11226C4022M392O235k8363j3578R454R650j3436j5008K333Q655N466j4127J831
$$ 34022 38414 44649 16286 2708 12162 21812 8376 -6632 -4299 4356 9822 -4305 -2474
11213b474Q099K2172R969K0762L575j6210j1332J5581j8907l5745j4499k8550
$$ -2474 5625 27797 37766 58528 62103 45893 34561 50142 31235 -4510 -19009 -47559
11201d7559K8456J7684L371j3853k7508J5954K8544m660Q34l148k0671k0636K3672
$$ -47559 -19103 -1419 1952 -11901 -39409 -23455 5089 429 1263 -1885 -22556 -43192 -19520
11188a9520K5682J5030J8717K6686K1017k2817j6102k637J397p272j1979J8968
$$ -19520 6162 21192 39909 66595 87612 64795 48693 46056 47453 40181 28202 47170
11176D7170j13J470k912j545K974M931J4359j5421k8191l2151J7352J5630j3979
$$ 47170 47057 48527 45615 44070 47044 51975 66334 50913 22722 -9429 7923 23553 9574
11163I574k3529N479J2221k6613o555K0129M421J3699j062R29j60j2939Q75J3421
$$ 9574 -13955 -8476 3745 -22868 -29423 -9294 -4873 8826 7764 8693 8533 -4406 -3531 9890
11149I890j561k700O375q147k791J8537K8781l1427l1701j0032Q244L2856J8543
$$ 9890 8329 5629 12004 3857 1066 19603 48384 16957 -14744 -24776 -16532 16324 34867
11136C4867J7655P166j5665j4635J470k6409j6609J5322K0167N603K1881k7135
$$ 34867 52522 59688 44023 29388 30858 4449 -12160 3162 23329 28932 50813 23678
11124B3678m6200k5206J1256K2997K4494L118r632Q342J4438l678q311K5118R703
$$ 23678 -22522 -47728 -36472 -13475 11019 14137 4505 12847 27285 23607 15296 40414 50117
11111E0117j4460k8019N084n446J1324J3605R261j8867k0372Q397o265q273l05
$$ 50117 35657 7638 12722 7276 18600 32205 41466 22599 2227 10624 4359 -3914 -4219
11098d219J417K5418j3670k4272k444L4300O379l42j3920j7750J5597l929K888
$$ -4219 -2802 22616 8946 -15326 -17770 16530 22909 22567 8647 -9103 6494 2565 5453
11085E453q686Q939L7314K909P994R534k1650l9054j3872Q581l369k0368q989
$$ 5453 -3233 5706 43020 45929 53923 63457 41807 2753 -11119 -2538 -5907 -26275 -35264
11072c5264O173J4030J9081k1409k3449p255L4727J4010j1819K0384J2511l6415
$$ -35264 -29091 -15061 4020 -17389 -40838 -48093 -13366 644 -11175 9209 21720 -14695
11060a4695k8694L927K779J3075M30R358J5079J8501O295r258q412j7533j5652
$$ -14695 -43389 -39462 -36683 -23608 -23178 -13820 1259 19760 26055 16797 8385 -9148 -24800
11047b4800J7216K4580Q673j986j7726l80k6022j3146j0854j1921l475K7872L1208
$$ -24800 -7584 16996 25669 23683 5957 5577 -20445 -33591 -44445 -56366 -59841 -31969 -761
11034g61p621M036K5394R818j0061Q246k8999q199J6738j3795j6236n363j2799
$$ -761 -8382 -4346 21048 30866 20805 29051 52 -8147 8591 -5204 -21440 -26803 -39602
11021c9602j9052O615K9347o522R784J6194J5518k491K1J0756m682j2298J8169
$$ -39602 -58654 -52039 -22692 -29214 -19430 -3236 12282 9791 9812 20568 15886 3588 21757
11008B1757p518K9394j2776j4107J3388J6828r908q632R71j0457p468O194k5154
$$ 21757 14239 43633 30857 16750 30138 46966 37058 28426 29397 18940 11472 17666 -7488
10995g488p879M899k2892J4221O986J9025J1706p554O531o077r650M34Q368K0240
$$ -7488 -15367 -10468 -33360 -19139 -12153 6872 18578 11024 17555 11478 1828 2262 10630 30870
10981C0870k2342l533J0596r20n371j6066l1905J5523K1519n309N562q98l599
$$ 30870 8528 4995 15591 14671 9300 -6766 -38671 -23148 -1629 -6938 -1376 -2274 -5873
10968e873k382K2367J6132l0806K213K8931J6548N737l1271m681R921j8920k0629
$$ -5873 -8255 14112 30244 -562 1651 30582 47130 52867 21596 16915 26836 7916 -12713
10955a2713P12K1511R609j0291r744R794j3397j3096K0509K3270K6821m737q485
$$ -12713 -12001 9510 19119 8828 -916 8878 -4519 -17615 2894 26164 52985 48248 39763
10942C9763j6962J282p393r432K4030K1385j1252k374k8525K061L2868P016j0333
$$ 39763 22801 24083 16690 7258 31288 52673 41421 39047 10522 12583 45451 52467 42134
10929D2134k0480l2655K2708L5098K7872j3365l5782k2475J9631K3185j5821L078
$$ 42134 21654 -11001 11707 46805 74677 61312 25530 3055 22686 45871 30050 33128
10917C3128j5130k8232l267J3950J0853p90K2403K6903M673q025j251k1523j4775
$$ 33128 17998 -10234 -13501 449 11302 10512 32915 59818 64491 56466 55215 33692 18917
10904A8917j1200R280R438N567k3030j9176J9915L385j2897k6700P245K150L558
$$ 18917 7717 16997 26435 32002 8972 -10204 9711 13096 199 -26501 -19256 -17106 -13548
10891a3548j2133j8038O438M041L9303M498O067m358j0658K1584R176k2735P774
$$ -13548 -25681 -43719 -37281 -33240 6063 10561 16628 12270 1612 23196 32372 9637 17411
10878A7411j302o492q624N454n315J1200j3656n560K2783J746r263j8032j9132
$$ 17411 16109 9617 993 6447 1132 12332 -1324 -6884 15899 17645 8382 -9650 -28782
10865b8782m857J7004K3399m877J7511J1381p293k5943j4237J1970K6558J8297
$$ -28782 -33639 -16635 6764 1887 19398 30779 23486 -2457 -16694 -4724 21834 40131
10853D0131l500q837j9478k0395k720K9110J8160M539j7739j323l971k0431k463
$$ 40131 36631 27794 8316 -12079 -14799 14311 32471 37010 19271 17948 13977 -6454 -8917
10840h917K7393P689j7493q894O240L841j9005K0855l815o799j524k679j4472
$$ -8917 18476 26165 8672 -222 6018 9859 -9146 11709 7894 1095 -429 -3108 -17580
10827a7580J1051q87p214J6642R282K72j1410K400L9000J4557j883j819j2931
$$ -17580 -6529 -7416 -14630 2012 11294 11566 156 2556 41556 56113 54230 52411 39480
10814C9480r667l39k398K6415L658l6293k8097M013K7667n180j7912J6324m45
$$ 39480 29813 29474 27076 53491 57149 20856 -7241 -3228 24439 19259 1347 17671 17226
10801A7226j2264o11j5530K339K507J9034J6263K7178k3774m1984J153j3634M021
$$ 17226 4962 4351 -11179 -8840 -6333 12701 28964 56142 32368 -9616 -8463 -22097 -18076
10788a8076K8831K661j5036L294j4411J7385L8168j240P151k6228j5773J492N227
$$ -18076 10755 13416 -1620 1674 -12737 4648 42816 41576 48727 22499 6726 8218 13445
10775A3445J4314k4088n049R027l793k9728M073J8457J7473R917J8644J0175k038
$$ 13445 27759 3671 -1378 7649 3856 -25872 -21799 -3342 14131 24048 42692 52867 50829
10762E0829r81n685J6633j2980p293J381K0116l85k8773j2010L322K6971R282
$$ 50829 49848 44163 60796 47816 40523 41904 62020 61635 32862 20852 24174 51145 60427
10749F0427o881J962j9296m727J5349P058l160m4523k8470J0903K9324n855n857
$$ 60427 53546 55508 36212 31485 46834 53892 50732 6209 -22261 -11358 17966 12111 6254
10736F254j528j5480k21N98J0736J5750J6547j1426k7270k0526p192J2541K8194
$$ 6254 4726 -10754 -10975 -10377 359 16109 32656 21230 -6040 -26566 -33758 -21217 6977
10723F977J6331J4769Q533J6187o166j5676k1229k8280j881p9j0664l831r786
$$ 6977 23308 38077 46610 62797 56631 40955 19726 -8554 -10435 -10514 -21178 -25009 -34795
10710c4795j4823N363J4303K8738l720k760J6785J3367j1883j1898l176J3289
$$ -34795 -49618 -44255 -29952 -1214 -4934 -7694 9091 22458 10575 -1323 -4499 8790
10698H790k5905j1532J0514J3925m245J2206K2424p412K652j8615j9131R1p187
$$ 8790 -17115 -28647 -18133 -4208 -8453 3753 26177 18765 21417 2802 -16329 -16238 -23425
10685b3425O30M080J7494R450J3573o910o624K155J0369K0839p793l9182j971
$$ -23425 -22795 -18715 -1221 8229 21802 14892 8268 10423 20792 41631 33838 -5344 -7315
10672g315J7012l152J196J7081L8179P445l0529j5278l4638R027j8001K623N732
$$ -7315 9697 6545 7741 24822 63001 70446 39917 24639 -9999 -972 -18973 -16350 -10618
10659a0618K106M828K7528M4525r946k8234j3644j0566l201k0813k726K705J4107
$$ -10618 -8512 -3684 23844 68369 58423 30189 16545 5979 2778 -18035 -20761 -18056 -3949
10646c949J6231J4967J0963k9922k3138P908N102N852R729L759L2867O487k1237
$$ -3949 12282 27249 38212 8290 -14848 -6940 -1838 4014 13743 17502 50369 56856 35619
10633C5619j4088j407j8317j840K4746j6155j580j6696J0398J7672j0202k9930
$$ 35619 21531 20124 1807 -33 24713 8558 6978 -9718 680 18352 8150 -21780
10621b1780q74K1563J6510o057P734J8949J9429O698k5366Q078J1945l1302j5761
$$ -21780 -22654 -1091 15419 9362 17096 36045 55474 62172 36806 44884 56829 25527 9766
10608I766j2134k353J4358Q806P712j3165P481O817N443J272j428L547R803J510
$$ 9766 -2368 -4721 9637 18443 26155 12990 20471 27288 32731 34003 32575 36122 45925 47435
10594D7435K574J241J4474o131J271k7606r031j6277J2509r727J6687J9449j489
$$ 47435 50009 51250 65724 59593 60864 33258 24227 7950 20459 10732 27419 46868 45379
10581D5379K317j418l5866M090K223o245k266K9755J2208j4659j3795q431q312
$$ 45379 47696 46278 10412 14502 16725 10480 8214 37969 50177 35518 21723 13292 4980
10568D980k526j4965l888l1722o228K0609J3462K0948K0756R850j862k5588k077
$$ 4980 2454 -12511 -16399 -48121 -54349 -33740 -20278 670 21426 31276 29414 3826 1749
10555A749L665n190K5710J9994J0024m475j0120j4550M276j8584l4959R87R558
$$ 1749 5414 224 25934 45928 55952 51477 41357 26807 31083 12499 -22460 -21473 -11915
10542a1915J1147K79j5035L645K2838o213L461j9116M632J3657j1481k0274J8567
$$ -11915 -768 -489 -15524 -11879 10959 4746 8207 -10909 -6277 7380 -4101 -24375 -5808
10529e808j095p961P908K1320J2042q230j3090P631m962j3079m031K1657o605
$$ -5808 -6903 -14864 -6956 14364 26406 18176 5086 12717 7755 -5324 -9355 12302 5697
10516E697k3486k1048R442K5804P48k7231J747J7038J3959p546l2895J271J4896
$$ 5697 -17789 -38837 -29395 -3591 -2843 -30074 -28327 -11289 2670 -4876 -37771 -36500 -21604
10503b1604O925J2481J3010o885J8876K0426J506J0033j4012j2385R804J1541
$$ -21604 -14679 -2198 10812 3927 22803 43229 44735 54768 40756 28371 38175 49716
10491D9716k1818L61R257r297k3523m753j1659j0320j669L0854M842j5231J1568
$$ 49716 27898 28259 37516 28219 4696 -57 -11716 -22036 -23705 7149 11991 -3240 8328
10478H328J8063k5855OK7420L3277L732Q087J940r234l3399K992J8632M970k3010
$$ 8328 26391 536 542 27962 61239 64971 73058 74998 65764 32365 35357 53989 58959 35949
10464C5949j5448J6190M156J3660R698K0335l910p488l4148j6880R230k4454m972
$$ 35949 20501 36691 40847 54507 64205 84540 80630 73142 38994 22114 31344 6890 1918
10451A918Q413K888m56L011J027r816J3005O319q577K8805J5496O70J632J0009
$$ 1918 10331 13219 12763 15774 16801 6985 19990 26309 17732 46537 62033 62703 64335 74344
10437G4344J0809k5501o129j807J0345K9103k9846k5891k3399j6223K3627J6465
$$ 74344 85153 59652 53523 51716 62061 91164 61318 35427 12028 -4195 19432 35897
10425C5897k071k9196n547N607j2012J04J631K0411j151J480L801k654k2913K0286
$$ 35897 33826 4630 -917 4690 -7322 -7218 -5587 14824 13673 15153 18954 16300 -6613 13673
10411A3673J8143p07P05N817p045q051j3328J7378J5684k45k3343r715m295j4598
$$ 13673 31816 31109 31814 37631 30586 22535 9207 26585 42269 42024 18681 8966 4671 -9927
10397i927m460K2923j714j2488j2986R965j674L1614L6340n058L794K257k8610
$$ -9927 -14387 8536 6822 -5666 -18652 -8687 -10361 21253 57593 52535 56329 58586 29976
10384B9976k4566p39k7387p294J6318N134K3985K7917j3041j9172j1473j0203
$$ 29976 5410 4671 -22716 -30010 -13692 -8558 15427 43344 30303 11131 -342 -10545
10372a0545k1546K0332O227j8556j5217J0376K6618Q394q495J3656j849l6707
$$ -10545 -32091 -11759 -5532 -24088 -39305 -28929 -2311 6083 -2412 11244 9395 -27312
10360b7312J382J3855L6780O117J8694J8923o043j8624r876j4543M1621J5662
$$ -27312 -25930 -12075 24705 30822 49516 68439 62396 43772 33896 19353 60974 76636
10348G6636j5514j4248K2967j1858j3790K3628j7736j6676J0682J0478R374j2259
$$ 76636 61122 46874 69841 57983 44193 67821 50085 33409 44091 54569 63943 51684
10336E1684l4989l262Q795P994J5417q022m1492P965K93J0938j474q974j7431
$$ 51684 16695 13433 22228 30222 45639 37617 -3875 4090 4383 15321 13847 4873 -12558
10323a2558q826K433J8782J8118r038q111k859N010J6001O428k649J3210k6102
$$ -12558 -21384 -18951 -169 17949 8911 800 -2059 2951 18952 25380 22731 35941 9839
10310I839n036K1540J3568l800j817o398j0208K0236M760O042J0891k7287l1036
$$ 9839 4803 26343 39911 36111 34294 27896 17688 37924 42684 48726 59617 32330 1294
10297A294L745J5596K6290j2736j5154j3204Q176J4327J3447j6291p739K338j694
$$ 1294 5039 20635 46925 34189 19035 5831 14007 28334 41781 25490 17751 20089 18395
10284A8395J0701J4818J564O806J4579M364j0850j6903J6995m282p467j9303m186
$$ 18395 29096 43914 45478 52284 66863 71227 60377 43474 60469 56187 48720 29417 25231
10271B5231J2904N813J861k501J7477O743p238k2616r630J3153K5531l306l142
$$ 25231 38135 43948 45809 43308 60785 67528 60290 37674 28044 41197 66728 63422 60280
10258F0280l0941L04Q735j3463j6769Q113j6151p233J0531J5567l380q951N68
$$ 60280 29339 29643 38378 24915 8146 16259 108 -7125 3406 18973 15593 6642 7210
10245G210J5932J9484r259L1608K4479j3112j7012M945k2835l0757n860j3190
$$ 7210 23142 42626 33367 64975 89454 76342 59330 64275 41440 10683 4823 -8367
10233h367R11J1346J4693J536J6562J1758q175N105J0343j8911l5638J1947k4940
$$ -8367 -7456 3890 18583 20119 36681 48439 40264 45369 55712 36801 1163 13110 -11830
10220a1830q198K6265K3287J0074Q047Q931l306l2479k7604j1626L8430J9274
$$ -11830 -20028 6237 29524 39598 47645 56576 53270 20791 -6813 -18439 19991 39265
10208C9265j4855k1528J0432K0933N412k9923j0563K0258J4067J784j2927J8742
$$ 39265 24410 2882 13314 34247 39659 9736 -827 19431 33498 35282 22355 41097
10196D1097J1858K451J6673j8554Q698K4131j6223j7217J0604K646k0850j5104
$$ 41097 52955 55406 72079 53525 62223 86354 70131 52914 63518 66164 45314 30210
10184C0210j3282n826n479p86J4666m322L963N313M732J8753L0585K454j2844
$$ 30210 16928 11102 5623 4837 19503 15181 19144 24457 29189 47942 78527 80981 68137
10171F8137j1783j8301j4328q97L774K5709J6855j0690p263l681P839J3007J6001
$$ 68137 56354 38053 23725 22828 26602 52311 69166 58476 51213 47532 55371 68378 84379
10158H4379K6234j728m3185p067j7151j1501J7252J6568l6p552j0447j2564J3542
$$ 84379 110613 108885 65700 58633 41482 29981 47233 63801 63765 56213 45766 33202 46744
10145D6744J2586j0757J8949J7611k7037J6165M0250L361k2407l7996k5755j4248
$$ 46744 59330 48573 67522 85133 58096 74261 114511 117872 95465 57469 31714 17466
10133A7466r200j1396j8008K2561L2983K607k2070K6566N149j5394j6943l901
$$ 17466 8266 -3130 -21138 1423 34406 37013 14943 41509 46658 31264 14321 10420
10121A0420m295J2247J6964L78L679J7461l654J0600K0466j7951N279j2557l8700
$$ 10420 6125 18372 35336 35714 39393 56854 53200 63800 84266 66315 71594 59037 20337
10108B0337J5452J6166r201k6559P258K8940J6009r966j1215m568k021J9551r50
$$ 20337 35789 51955 42754 16195 23453 52393 68402 58436 47221 42653 40632 60183 59233
10095E9233k2047j1198J3292L1801N88J3108P519j7520J8825j7967j1473m253
$$ 59233 37186 25988 39280 71081 71669 84777 92296 74776 93601 75634 64161 59908
10083E9908M417Q793j3150j1379q900r690J3501J4123j2401n074j5628J6743J5473
$$ 59908 64325 73118 59968 48589 39689 29999 43500 57623 45222 40148 24520 41263 56736
10070E6736J2298K8229J1966l1674j9254o239J540O833j630r525j3148N3617O785
$$ 56736 69034 97263 109229 77555 58301 52062 53602 60435 58805 49280 36132 89749 96534
10057I6534k6745n547p065o012k368P969J5949L6442O069k2507j6166j6452J1742
$$ 96534 69789 64242 57177 51165 48797 56766 72715 109157 115226 92719 76553 60101 71843
10044G1843K0821L335J1726j6833q71j554P050l144J872N391k8804k0051J5213
$$ 71843 92664 95999 107725 90892 90021 88467 95517 92373 94245 99636 70832 50781 65994
10031F5994r155Q438j3773K6752K4755k4649j1358j2931O363J5534J9146j0001
$$ 65994 56839 65277 51504 78256 103011 78362 67004 54073 60436 75970 95116 85115
10019H5115k2652R412p08l5199j4683j0038L304J4224L764K2888L0664K6074J0242
$$ 85115 62463 71875 71167 35968 21285 11247 14551 28775 32539 55427 86091 112165 122407
10006A22407J421L847j1851L038R901K140j0711j3695k8183J6785J3256J803n930
$$ 122407 123828 127675 115824 118862 128763 130903 120192 106497 78314 95099 108355 110158 104228
9993A04228N110p762K7933m318k684j5649J1094j2196r913p473R681J446j7732
$$ 104228 109338 101576 129509 125191 122507 106858 117952 105756 95843 88370 98051 99497 81765
9980H1765j4031r687j0552L629J9131J5492M4322J5029l9600r116M722J0627J0260
$$ 81765 67734 58047 47495 51124 70255 85747 130069 145098 105498 96382 101104 111731 121991
9967A21991r260L580N27j7076l924j1736j5425R834M414j2162K529P600j0660
$$ 121991 112731 116311 116838 99762 95838 84102 68677 78511 82925 70763 73292 80892 70232
9954G0232Q989N056o653L088J0026O556j4263j5057q699k1540K802N2407M7960
$$ 70232 79221 84277 77624 80712 90738 97294 83031 67974 59275 37735 40537 92944 140904
9941A40904j2684k1029l0241J13M008j6009Q252J5875L9281k703l6824l9753l0899
$$ 140904 128220 107191 76950 77063 81071 65062 73314 89189 128470 125767 88943 49190 18291
9928A8291k4504L4575M3623O9l264j0187M825K9908J6894K6522M2455j1979j8180
$$ 18291 -6213 28362 71985 72054 68790 58603 63428 93336 110230 136752 179207 167228 149048
9915A49048Q557j215k0536k9125Q961J1005l7811p676j7519J906J790M485L1211
$$ 149048 157605 156390 135854 106729 115690 126695 88884 81208 63689 65595 67385 71870 103081
9902A03081J781L338P357j870J6995j4543K270j2195J6869L4419l3013l3381J7118
$$ 103081 104862 108200 115557 113687 130682 116139 118409 106214 123083 157502 124489 91108 108226
9889A08226r394k6663L370R005k314J5556J0024L500N227p266k1010M313k1116
$$ 108226 98832 72169 75539 84544 82230 97786 107810 111310 116537 109271 88261 92574 71458
9876G1458j3452J418J7008Q901l1204q045M1584J9303L263J425M684K0889L254
$$ 71458 58006 59424 76432 85333 54129 46084 87668 106971 110234 111659 116343 137232 140486
9863A40486k4275m2101R314L3724K8327J3553N005J9977J0029L4268M7010M1049
$$ 140486 116211 74110 83424 117148 145475 159028 164033 184010 194039 228307 275317 316366
9851C16366R532j8046R136k102j8447j8140p026n5905l7809l707l0438O249J0222
$$ 316366 325898 307852 316988 314886 296439 278299 271273 215368 177559 173852 143414 149663 159885
9838A59885j230k8543j7680J7342r336M193R602K2417m976N688J0950O014K584
$$ 159885 158655 130112 112432 129774 120438 124631 134233 156650 151674 157362 168312 174326 176910
9825A76910J7786m930m4181l1200r709j6143J6456J6588J2149Q887j1593K3216
$$ 176910 194696 189766 145585 114385 104676 88533 104989 121577 133726 142613 131020 154236
9813A54236k384k2941M35j0980N472K2670J6236K89l3240j2317k6457m022J3627
$$ 154236 151852 128911 129346 118366 123838 146508 162744 163033 129793 117476 91019 86997 100624
9800A00624O990k5108j821K6563Q358k2629M21L7834L815j2082Q25L6k4183O081
$$ 100624 107614 82506 80685 107248 115606 92977 93398 131232 135047 122965 123790 123826 99643 105724
9786A05724J0865J1395P844K948K8063J3763L801j2254p542k344j0020j0182P386
$$ 105724 116589 127984 135828 138776 166839 180602 184403 172149 164607 162263 152243 142061 149447
9773A49447j1284O650L9149N1045M1319L2663j5336N981J6751L1495M9336L7252
$$ 149447 138163 144813 183962 235007 276326 308989 293653 299634 316385 347880 397216 434468
9761D34468L9020P2257P8391Q0489Q4649J13896J40706J21047J40574J49230J41466
$$ 434468 473488 545745 624136 704625 789274 903170 1043876 1164923 1305497 1454727 1596193
9750A596193J00599O5108L2965J2098l1834o9188p3094r2164j01012q6168j43208
$$ 1596193 1696792 1761900 1794865 1806963 1775129 1705941 1632847 1540683 1439671 1353503 1210295
9739A210295j40501j02427j02152j17941q0896o2039m1684l6119n9764l7302k0968
$$ 1210295 1069794 967367 865215 747274 666378 604339 562655 526536 466772 429470 408502
9728D08502r700j2383n0864l5621k4669J4687l92o743j3694j9194j0122j2338
$$ 408502 398802 386419 335555 299934 275265 289952 289560 282817 269123 249929 239807 227469
9716B27469k047Q431j1654J8004O555m0464j1258k359L3416K4547k5361m8766
$$ 227469 225422 233853 222199 240203 246758 206294 195036 192677 226093 250640 225279 176513
9704A76513J8310O742J2120O446n641j9910r777K6325K2708O164J3639j3339k2787
$$ 176513 194823 201565 213685 220131 214490 194580 184803 211128 233836 240000 253639 240300 217513
9691B17513M318j1750J9932K1450K839k84k6543k2869j2227J8933j4469m002l486
$$ 217513 221831 210081 230013 251463 254302 254018 227475 204606 192379 211312 196843 192841 189355
9678A89355K05j2868J4157J3257K4647K252l1713k664J4671O625K4236N764j1321
$$ 189355 189560 176692 190849 204106 228753 231005 199292 196628 211299 217924 242160 247924 236603
9665B36603k7342R982q250l4043k0099J7508r289q201P432n423K6779P183k0502
$$ 236603 209261 219243 210993 176950 156851 174359 165070 156869 164301 158878 185657 192840 172338
9652A72338k240K680q975m604P839L9521K7121j2815j3913k1812l0283k22j3030
$$ 172338 170098 172778 163803 159199 167038 206559 233680 220865 206952 185140 154857 154635 141605
9639A41605O539Q834j186K0498o60M173J0130j1394r080K1111j2679k614J9976
$$ 141605 148144 156978 155792 176290 175630 179803 189933 178539 169459 190570 177891 175277 195253
9626A95253O203j2070j3405l196L941Q639o756j1188J0413M2747p572j1504M3103
$$ 195253 201456 189386 175981 172785 176726 185365 178609 167421 177834 220581 213009 201505 244608
9613B44608M1289L8568R300N571K72J1168L4052L7285J6201N0557J2413j9436
$$ 244608 285897 324465 333765 339336 339608 350776 384828 422113 438314 488871 501284 481848
9601D81848j6825J179J2244K0145l8892m4296J2186J5206m4178o0014j4210P585
$$ 481848 465023 466202 478446 498591 459699 415403 427589 442795 398617 338603 324393 331978
9589C31978J8080K5867j1941k0555q070j3617J2643m173O909J0083O687j9091
$$ 331978 350058 375925 363984 343429 335359 321742 334385 330212 337121 347204 353891 334800
9577C34800j9318j5085m836l9604L341K2590k2858j8824N249k1873j3983p842
$$ 334800 315482 300397 295561 255957 259298 281888 259030 240206 245455 223582 209599 201757
9565B01757J0533J657k4695K0836K7740j4633j6556j145J766J6161p748P517L6661
$$ 201757 212290 213947 189252 210088 237828 223195 206639 205494 207260 223421 215673 223190 259851
9552B59851K1247J3186J3455l8216n897r028j9911k3670j5273j8684l8686r5885
$$ 259851 281098 294284 307739 269523 263626 254598 234687 211017 195744 177060 138374 42489
9540D2489o8226n820J1341N3231J9765L709j1285J7590P9532N7142K9050N2154
$$ 42489 -25737 -31557 -20216 33015 52780 56489 45204 62794 142326 199468 228518 280672
9528B80672K1097K2565K4233K2323J3620p351M729K796L294n698K4625L5794R515
$$ 280672 301769 324334 348567 370890 384510 377159 381888 384684 387978 382280 406905 442699 452214
9515D52214J9360M6086K6227K670j4793O118Q416k5926l4437m738K8749J4142
$$ 452214 471574 517660 543887 546557 531764 537882 546298 520372 485935 481197 509946 524088
9503E24088Q91K4876K1004O010K2432Q681M812J2099K3569q254j4835K590k4597
$$ 524088 524979 549855 570859 576869 599301 607982 612794 624893 648462 640208 625373 627963 603366
9490F03366K3642Q642J9031J7725Q991L5857P0030L4016L5990J26529J38025O6461
$$ 603366 627008 635650 654681 672406 681397 717254 787284 821300 857290 983819 1121844 1188305
9478A188305J9720L4971N0341K7142J7639J4140K6048O6000K2154k810n1476o6886
$$ 1188305 1208025 1242996 1293337 1320479 1338118 1352258 1378306 1444306 1466460 1463650 1412174 1345288
9466A345288n8986j3636o835N14J3151k3454k9415J5296L914j6322l0421l2060
$$ 1345288 1286302 1272666 1265831 1266345 1279496 1256042 1226627 1241923 1245837 1229515 1199094 1167034
9454A167034L335j524J5878M26j6529l578J5060K5147L1522R073Q790O776K9282
$$ 1167034 1170369 1168845 1184723 1185149 1168620 1165042 1180102 1205249 1236771 1245844 1254634 1261410 1290692
9441A290692N7336J6376L6984L6462M0811L8044L3421L0050K5945O7106N4939
$$ 1290692 1348028 1364404 1401388 1437850 1478661 1516705 1550126 1580176 1606121 1673227 1728166
9430A728166J2898J1558J3340N3938N2853L8864M3562L4393P924p996R427L3485
$$ 1728166 1741064 1752622 1765962 1819900 1872753 1911617 1955179 1989572 1997496 1989500 1998927 2032412
9418B032412K2486o226P181K6413J9431M5366M2847P1599N5159P4698M6929M6820
$$ 2032412 2054898 2048672 2055853 2082266 2101697 2147063 2189910 2261509 2316668 2391366 2438295 2485115
9406B485115O3519P4321P1475P4106Q7850J27367J30524J26586J36397J33878
$$ 2485115 2548634 2622955 2694430 2768536 2856386 2983753 3114277 3240863 3377260 3511138
9396C511138J63735J72239J41410J50995J37452J77205J88436J59942J75437J92882
$$ 3511138 3674873 3847112 3988522 4139517 4276969 4454174 4642610 4802552 4977989 5170871
9386E170871K09833K22223K51341L30975L76447L50229L67858M11620M45517M91751
$$ 5170871 5380704 5602927 5854268 6185243 6561690 6911919 7279777 7691397 8136914 8628665
9376H628665N97616O89630P82960R10476J036766J171267J356558J631467J934425
$$ 8628665 9226281 9915911 10698871 11609347 12646113 13817380 15173938 16805405 18739830
9367A8739830K335092K785152L264821L836586M501741N363176O606538Q164689
$$ 18739830 21074922 23860074 27124895 30961481 35463222 40826398 47432936 55597625
9359E5597625J0048008J2529119J6435485K2571463L1659757M3823860N4773535
$$ 55597625 65645633 78174752 94610237 117181700 148841457 192665317 247438852
9352B47438852N5043864M1428699K4735469J2337508J461684n116150l907785
$$ 247438852 302482716 343911415 368646884 380984392 382446076 377329926 373422141
9345C73422141j939217j1515443l8089008n8778524n5817945m2217608l0028273
$$ 373422141 371482924 359967481 321878473 263099949 207282004 165064396 135036123
9338A35036123k1547506j5878941j2017410r308710p416256o125526n205219m517061
$$ 135036123 113488617 97609676 85592266 76283556 68867300 62741774 57536555 53019494
9330E3019494m056470l746648l449948l152120k834723k506265k277244k005845
$$ 53019494 48963024 45216376 41766428 38614308 35779585 33273320 30996076 28990231
9322B8990231j755602j530315j366238j276740j209547j097318j008250r35037
$$ 28990231 27234629 25704314 24338076 23061336 21851789 20754471 19746221 18811184
9314A8811184q42707p91861p31678o90561o67883o71017o47932o33821n54544
$$ 18811184 17968477 17176616 16444938 15754377 15086494 14415477 13767545 13133724 12579180
9305A2579180n20728m91898m59685m01762l46452l41243l36064l44861k98214
$$ 12579180 12058452 11566554 11106869 10705107 10358655 10017412 9681348 9336487 9038273
9296I038273k69229k84796k94676k76480k36144k27589k31115j84589j60164j80938
$$ 9038273 8769044 8484248 8189572 7913092 7676948 7449359 7218244 7033655 6873491 6692553
9286F692553j98442j56121j65207j76117j69933j92493j78192j79191k27041j63607
$$ 6692553 6494111 6337990 6172783 5996666 5826733 5634240 5456048 5276857 5049816 4886209
9276D886209j54357j69329j37133j44397j37122j51732j10153o8579j14134j12810
$$ 4886209 4731852 4562523 4425390 4280993 4143871 3992139 3881986 3813407 3699273 3586463
9266C586463q7713o8434n5750p1421q0827p3646r7514q4614q3927q9663q2283
$$ 3586463 3498750 3430316 3374566 3303145 3222318 3148672 3051158 2966544 2882617 2792954 2710671
9255B710671q1446j11833j16002o6393q1422j01080p3306q1222p1058q1822p0854
$$ 2710671 2629225 2517392 2401390 2334997 2253575 2152495 2079189 1997967 1926909 1845087 1774233
9244A774233o9174m5363q9226p5184m3269j8357n3794p3660o5518n7016m7751
$$ 1774233 1705059 1659696 1570470 1495286 1452017 1433660 1379866 1306206 1240688 1183672 1135921
9233A135921j0516l1782j7201K1310J4765p880M7281K8629o926L3557K0700j321
$$ 1135921 1125405 1093623 1076422 1097732 1112497 1104617 1151898 1180527 1173601 1207158 1227858 1226537
9221A226537J0354K3703O695K847M983j6692l1854l4832R536L032L071k9548L462
$$ 1226537 1236891 1260594 1267289 1270136 1275119 1258427 1226573 1191741 1201277 1204309 1207380 1177832 1181294
9208A181294M5964J5211R595N0756K5438J2155L1762K3711N4833J20725J54855
$$ 1181294 1227258 1242469 1252064 1302820 1328258 1340413 1372175 1395886 1450719 1571444 1726299
9197A726299J69771K14076K55678L29084M57394O95871J056560J516354J837487
$$ 1726299 1896070 2110146 2365824 2694908 3152302 3848173 4904733 6421087 8258574
9188H258574J661878J073303O80696L80092N5203J972J40518J69956m14331j515503
$$ 8258574 9920452 10993755 11674451 12054543 12109746 12111718 12252236 12422192 12007861 10492358
9178A0492358j884789j459669j017703p63296o11869n14220m34274l41965l04013
$$ 10492358 8607569 7147900 6130197 5366901 4755032 4240812 3806538 3464573 3160560
9169C160560k74221k32400j69767j09327q7232q5212o5249n4366l1881m3106o1677
$$ 3160560 2886339 2653939 2484172 2374845 2287613 2202401 2137152 2082786 2050905 2007799 1946122
9158A946122p9959l0005j0990l3079j05242j36737j22441j09871m7109m5930j7917
$$ 1946122 1866163 1836158 1825168 1792089 1686847 1550110 1427669 1317798 1270689 1224759 1206842
9147A206842k4689j6109j627k2406m6393n8320o53J8739k2967j2699n058j3196
$$ 1206842 1182153 1166044 1164417 1142011 1095618 1037298 1036645 1055384 1032417 1019718 1014660 1001464
9135A001464m111r115P417r498k6182l2127j9478j8526k6236k7533l0219j6999
$$ 1001464 997353 988238 995655 986157 959975 927848 908370 889844 863608 836075 805856 788857
9123G88857m2389j2630J2963N686j4007l553m971k0348l3493l9113m7851k0874
$$ 788857 746468 733838 746801 752487 738480 734927 729956 709608 676115 637002 589151 568277
9111E68277j3580j0366N241J2688j6606n801o944m6520m839r634R674N885J0134
$$ 568277 554697 544331 549572 562260 545654 539853 532909 486389 481550 471916 481590 487475 497609
9098D97609R767n994r357k3381k2580l877m082k3088q154K5194R009j7576J0728
$$ 497609 507376 501382 492025 468644 446064 442187 438105 415017 406863 432057 441066 423490 434218
9085D34218p364j1391j3499K327k1848J0764J3734j0337j9964j9077Q541K6753
$$ 434218 426854 415463 401964 404291 382443 393207 406941 396604 376640 357563 366104 392857
9073C92857M6k4261k7903j683l260K0692J996j2348Q424K9907O834J6234J4685
$$ 392857 392903 368642 340739 339056 335796 356488 358484 346136 354560 384467 391301 407535 422220
9060D22220k0774j9833J0734K7938r530J799j0382j0117P417K6950K3792L1586
$$ 422220 401446 381613 392347 420285 410755 412554 402172 392055 399472 426422 450214 481800
9048D81800J2816R337N986L6515L7802J1091L9965O2972P0247J2856R027J1629
$$ 481800 494616 503953 509939 546454 584256 595347 635312 698284 768531 781387 790414 802043
9036H02043j7318k5113O317K8083j03m3747m5725n3227k9074p9l049j8837l0913
$$ 802043 784725 759612 765929 794012 793909 750162 704437 651210 622136 622057 619008 600171 569258
9023E69258j8443j4776l0246j995r719J0107r039l349m486j3923M7506R283l8750
$$ 569258 550815 536039 505793 503798 494079 504186 495147 491798 487312 473389 520895 530178 491428
9010D91428k2090k2906j2830J4406K3619j702k6254l5803l2721Q41l38L522K2373
$$ 491428 469338 446432 433602 448008 471627 469925 443671 407868 375147 375988 375650 379172 401545
8997D01545O358m204k0606j6873P10P795J7778j582p932O753o824p586j0980J578
$$ 401545 407903 403699 383093 366220 366930 374725 392503 390921 382989 389742 382918 375332 364352 365930
8983C65930J4982r071n719k0450j1157j7677k9902o4979p9156m9789m6272j7001
$$ 365930 380912 371841 366122 345672 334515 316838 286936 221957 142801 93012 46740 29739
8971B9739K0176J7867J5425K9277L8945P9524Q1534O7680O8082R4357P9315N5181
$$ 29739 49915 67782 83207 112484 151429 230953 312487 380167 448249 542606 621921 677102
8959F77102M6033N7604M2627N4402O6062P6845Q9757J00488J66291J43063J55285
$$ 677102 723135 780739 823366 877768 943830 1020675 1110432 1210920 1377211 1520274 1675559
8948A675559J58873J33337J40760J23950J10419N8520K211j4495o2761o8032r0515
$$ 1675559 1834432 1967769 2108529 2232479 2342898 2401418 2403629 2389134 2326373 2258341 2167826
8937B167826q7724j08499j27499r6818j16908j58102r2441o3701n8233l0661m1759
$$ 2167826 2080102 1971603 1844104 1747286 1630378 1472276 1379835 1316134 1257901 1227240 1185481
8926A185481k4323r089m1942l1679k1597K5340P187P988M8184N6058Q8267J29101
$$ 1185481 1161158 1152069 1110127 1078448 1056851 1082191 1089378 1097366 1145550 1201608 1289875 1418976
8914A418976J15215Q6579R8900P9870O6476L1994L0948J7270K5435J2319J3703
$$ 1418976 1534191 1620770 1719670 1799540 1866016 1898010 1928958 1946228 1971663 1983982 1997685
8903A997685k0655m3316p7517o5818j1902N872O021P393k6612l2379j4159O045
$$ 1997685 1977030 1933714 1856197 1790379 1778477 1784349 1790370 1797763 1771151 1738772 1724613 1730658
8891A730658j6995k2216M445j956p921m6998r832K5840J3176O199K7248N2345
$$ 1730658 1713663 1691447 1695892 1693936 1686015 1639017 1629185 1655025 1668201 1674400 1701648 1753993
8879A753993L2677L9776L8591M5410M5920O4980O6612J10146J23791J86804K63435
$$ 1753993 1786670 1826446 1865037 1910447 1956367 2021347 2087959 2198105 2321896 2508700 2772135
8868B772135L14022K56627J77212Q6723Q4912N4184L4330N0538K8140m6071j89095
$$ 2772135 3086157 3342784 3519996 3606719 3691631 3745815 3780145 3830683 3858823 3812752 3623657
8857C623657k08715j51225j25640j00135q0589n0801j8897l3617o562L3535M7252
$$ 3623657 3414942 3263717 3138077 3037942 2957353 2906552 2887655 2854038 2847476 2881011 2928263
8846B928263O1257O4521O0645R3894J12844J04295R9092J08099J21530J37092
$$ 2928263 2989520 3054041 3114686 3208580 3321424 3425719 3524811 3632910 3754440 3891532
8836C891532J56397J57868J87637K12089J35745J48088J90119K16774K19217K26552
$$ 3891532 4047929 4205797 4393434 4605523 4741268 4889356 5079475 5296249 5515466 5742018
8826E742018K26952K60319K43762K65174K87455K83994K84542L48986L84771M19746
$$ 5742018 5968970 6229289 6473051 6738225 7025680 7309674 7594216 7943202 8327973 8747719
8816H747719M89501N26777N50042N84370O40998P03655P96073R12226J050819
$$ 8747719 9237220 9763997 10314039 10898409 11539407 12243062 13039135 13951361 15002180
8807A5002180J207847J384449J533202J783453K081517K510917K972749L553054
$$ 15002180 16210027 17594476 19127678 20911131 22992648 25503565 28476314 32029368
8799C2029368M197768M902230N718645O634497P873122R608834J1967852J5273711
$$ 32029368 36227136 41129366 46848011 53482508 61355630 70964464 82932316 98206027
8791I8206027K0035273K6876609L6527027M8953542O1126272O5409296N6286258
$$ 98206027 118241300 145117909 181644936 230598478 291724750 357134046 413420304
8784D13420304L9252576K3312276R720696q30685m625244m979818j2070374l3793630
$$ 413420304 452672880 475985156 485705852 484875167 480249923 475270105 463199731 429406101
8776D29406101n9108225o6816655n7656720m4195495l2809261k4503745j8636981
$$ 429406101 370297876 303481221 245824501 201629006 168819745 144316000 125679019
8769A25679019j4419732j1401219r342940p951123o899475o038545n399327m899784
$$ 125679019 111259287 99858068 90515128 82564005 75664530 69625985 64226658 59326874
8761E9326874m442097l983042l602490l237190k895318k574960k246517k010920
$$ 59326874 54884777 50901735 47299245 44062055 41166737 38591777 36345260 34334340
8753C4334340j861362j703002j576386j459591j326479j238635j132414j039308
$$ 34334340 32472978 30769976 29193590 27733999 26407520 25168885 24036471 22997163
8745B2997163j000112r54773r16723q47343q22725q11987p50335o95719o62097
$$ 22997163 21997051 21042278 20125555 19278212 18455487 17643500 16893165 16197446 15535349
8736A5535349o13803n45602m85868n09447n05350m33101l97386m13219l88898
$$ 15535349 14921546 14375944 13890076 13380629 12875279 12442178 12044792 11631573 11242675
8727A1242675l60658l07123k91962k72698k67475k60070k36935k52017k48031
$$ 11242675 10882017 10574894 10282932 10010234 9742759 9482689 9245754 8993737 8745706
8718H745706k44824k37459k48215k33195k37433l01265k60827k57105k46787k35680
$$ 8745706 8500882 8263423 8015208 7782013 7544580 7243315 6982488 6725383 6478596 6242916
8708F242916j84054j68176k15779j90443j87327j78987j54313j30100j08057r8615
$$ 6242916 6058862 5890686 5674907 5484464 5297137 5118150 4963837 4833737 4725680 4627065
8698D627065j02984r5476j08680j25675j34269q9952j23583j25290j38216j31123
$$ 4627065 4524081 4428605 4319925 4194250 4059981 3970029 3846446 3721156 3582940 3451817
8688C451817r8535q8024j23055r7526r8704j12096j26313j38992j07547r0808
$$ 3451817 3353282 3265258 3142203 3044677 2945973 2833877 2707564 2568572 2461025 2370217
8678B370217j06192j15829j13548r2829p1702n6668p8179j10951p8275m4994m8891
$$ 2370217 2264025 2148196 2034648 1941819 1870117 1813449 1735270 1624319 1546044 1501050 1452159
8667A452159p1605n1945q164J2517K455L0194K5545M0106J7568M916R24P842K1414
$$ 1452159 1380554 1328609 1320445 1332962 1335417 1365611 1391156 1431262 1448830 1453746 1454670 1462512 1483926
8654A483926J1603K476J4391K2774p866k2365j5363m9610l4564m8980j9442m2875
$$ 1483926 1495529 1498005 1512396 1535170 1527304 1504939 1489576 1439966 1405402 1356422 1336980 1294105
8642A294105m2831k8682k7143l5261k8522j6172R644k536n0349k7531J832k2248
$$ 1294105 1251274 1222592 1195449 1160188 1131666 1115494 1125138 1122602 1072253 1044722 1046554 1024306
8630A024306q868j8365j9058J032j9978j3894K844l344n73K183j455M751j702
$$ 1024306 1015438 997073 978015 979047 959069 945175 948019 944675 944102 946285 944830 949581 947879
8617I47879J9959L7742R565k1237l1484K2026j7307l122K0686R713n467O27j4361
$$ 947879 967838 1005580 1015145 993908 962424 984450 967143 964021 984707 994420 988953 989580 975219
8604I75219O251P369K8580J3210R931Q4823P5543O647J6765M9155K4453r54k318
$$ 975219 981470 988839 1017419 1030629 1040560 1125383 1200926 1207573 1224338 1273493 1297946 1296992 1294674
8591A294674K1165J2717k1884o6355p9868o2784l3166o6761j6636N344L8424O3104
$$ 1294674 1315839 1328556 1306672 1240317 1160449 1097665 1064499 997738 981102 986446 1024870 1087974
8579A087974R4550Q7368J3870R299R160l4154r688p397m942l8767r4994j01530
$$ 1087974 1182524 1269892 1283762 1293061 1302221 1268067 1258379 1250982 1246040 1207273 1112279 1010749
8567A010749n0757l3232n8777m5209m1704j7369j2457j8239r179j1365l9519m5630
$$ 1010749 959992 926760 867983 822774 781070 763701 751244 733005 723826 712461 672942 627312
8555F27312j2434k8842k9423k3424j5689l8508j6184k7308q223m0635j6333L707
$$ 627312 614878 586036 556613 533189 517500 478992 462808 435500 427277 386642 370309 374016
8543C74016J2871q759p029o302P393l9676K4240M4945j8571j1899l0831k1791
$$ 374016 386887 378128 371099 364797 372190 332514 356754 401699 383128 371229 340398 318607
8531C18607q105j8358k7532R742Q201l1678K096L2001l442m6234j7511J274P28
$$ 318607 310502 292144 264612 274354 282555 250877 252973 284974 281532 235298 217787 219061 219789
8518B19789J2034P451j1383m198L3640L5966p491J3296q90k4284k8592l0186O562
$$ 219789 231823 239274 227891 223693 257333 293299 285808 299104 298214 273930 245338 215152 221714
8505B21714M4365p696j2834j4621Q275m524R789J7490k1370k5791P628L6687J14
$$ 221714 266079 258383 245549 230928 239203 234679 244468 261958 240588 214797 222425 259112 259226
8492B59226k2014p078l314L629Q872M6l530j3195l3722P794J1011m381j302j6747
$$ 259226 237212 230134 226820 230449 239321 239367 235837 222642 188920 196714 207725 203344 202042 185295
8478A85295o602K123j7707Q757J3442J6465j8839J0436k3414R87L1979J5280J3258
$$ 185295 178693 180816 163109 171866 185308 201773 182934 193370 169956 170943 202922 218202 231460
8465B31460m16r117l2085k9716J0484R693j3699j692j3933j1516j0051p902J9154
$$ 231460 231044 221927 189842 160126 170610 180303 166604 164912 150979 139463 129412 121510 140664
8452A40664j3519o783J3247j6055k4099J7423r483n896J7170J2234k0720N939
$$ 140664 127145 120362 133609 117554 93455 110878 101395 95499 112669 124903 104183 110122
8440A10122k783k8080j1331J4791m976L598J3615J5713L3996l411R930R137J3396
$$ 110122 107339 79259 67928 82719 77743 81341 94956 110669 144665 141254 151184 160321 173717
8427A73717O516r599p461r798N938m358q686k490K8726K3381R065r510p197r247
$$ 173717 180233 170634 163173 153375 159313 154955 146269 143779 172505 195886 204951 195441 188244 178997
8413A78997q936p936r004n099o628J4438R501K1510J2938L510K6160m405j0957
$$ 178997 170061 162125 153121 148022 141394 155832 165333 186843 199781 203291 229451 225046 214089
8400B14089k881J5874J0966J6285j5113K7320O7096Q0010O4206O9934R5794J00563
$$ 214089 211208 227082 238048 254333 239220 266540 333636 413646 477852 547786 643580 744143
8388G44143R8699J66048J48464J58320J96904K20674J88381J29692J18117Q7564
$$ 744143 842842 1008890 1157354 1315674 1512578 1733252 1921633 2051325 2169442 2257006
8378B257006P3164J1295o2103o8920j05207j60261j74313j95842j78362j64446
$$ 2257006 2330170 2341465 2279362 2210442 2105235 1944974 1770661 1574819 1396457 1232011
8368A232011j38563j51680r4410q0165n5868o7855p4363m7629m2179k5238m6093
$$ 1232011 1093448 941768 847358 767193 711325 643470 569107 521478 479299 454061 407968
8357D07968j8869r058n610p156k1871k7486n6865k6538m513j5224j2161n059J9433
$$ 407968 389099 380041 374431 367275 345404 317918 261053 234515 230002 214778 202617 197558 216991
8344B16991J2260J4154M726k7477j8938j6240j209N633J1609L28R962K817N405
$$ 216991 229251 243405 248131 220654 201716 185476 184267 189900 201509 201837 211799 214616 220021
8331B20021l7950k9173K1272R284j0833j0173m972j3246r764k3577j351j0210
$$ 220021 182071 152898 174170 183454 172621 162448 157476 144230 134466 110889 109538 99328
8319I9328k2197R407L2976J6882j1758j2850k2194j9982Q459J1590J0980L684
$$ 99328 77131 86538 119514 136396 124638 111788 89594 69612 78071 89661 100641 104325
8307A04325j3212j6991P267R802q872j9512n934L16k1784j1982J3370M9362K3836
$$ 104325 91113 74122 81389 91191 82319 62807 56873 57189 35405 23423 36793 86155 109991
8294A09991n533l0996j3899K9913J9357Q798K07r213l7737L302M838K55O455l2756
$$ 109991 104458 73462 59563 89476 108833 117631 117838 108625 70888 74190 79028 79283 85738 52982
8280E2982R731K0637k8552M094J4999r817j3056k330L770O43j2128L3306K934
$$ 52982 62713 83350 54798 58892 73891 64074 51018 48688 52458 53101 40973 74279 77213
8267G7213q108R960M139K988k4339J6457R636l3714k5807j6919L286N0195K0985
$$ 77213 69105 79065 83204 86192 61853 78310 87946 54232 28425 11506 14792 64987 85972
8254H5972k356m789K1015l2959r792J6223r937P039j7492R013J1851l9591j8331
$$ 85972 83616 78827 99842 66883 57091 73314 63377 70416 52924 61937 73788 34197 15866
8241A5866O352r348n592Q682J2825J6908q477P617L0988N767j207J0426k5211
$$ 15866 22218 12870 7278 15960 28785 45693 37216 44833 75821 81588 80381 90807 65596
8228F5596j1340m018j4454j1539j274J1314J0158o412P270M6748N1480k151k9668
$$ 65596 54256 50238 35784 24245 22971 34285 44443 38031 45301 92049 143529 141378 111710
8215A11710o262J291J1001K860k4365k9617k0975n600j7305k2799M853L4272P80
$$ 111710 105448 106739 117740 120600 96235 66618 45643 40043 22738 -61 4792 39064 39844
8202C9844r671J5243J8433K0365J5796j1512k9812k2985J2191K2622k457o446
$$ 39844 30173 45416 63849 84214 100010 88498 58686 35701 47892 70514 68057 61611
8190F1611l475k0187j6450J2742K9884M550J501k5300q477k6861q748M545K099
$$ 61611 58136 37949 21499 34241 64125 68675 70176 44876 36399 9538 790 5335 7434
8177G434K5958J4476n540P811j136j5784j5950p807M197J0178L1487J4144J6886
$$ 7434 33392 47868 42328 50139 49003 33219 17269 9462 13659 23837 55324 69468 86354
8164H6354L5169K1865L1998M3542O1531M6514J4858J1795r667j8936J8325K3617
$$ 86354 121523 143388 175386 218928 280459 326973 341831 353626 343959 325023 343348 366965
8152C66965p911m9630p1488n8802m3981l2112k6587r054J0662o537j5488j4667
$$ 366965 359054 309424 237936 179134 135153 103041 76454 67400 78062 71525 56037 41370
8140D1370j7731J1109L1556R471M549J2118N920l0184m039O572m661j4350m940
$$ 41370 23639 34748 66304 75775 80324 92442 98362 68178 64139 70711 66050 51700 46760
8127D6760M411L0486K6106l724j0822K7702N8034P2288K7515m898O166M778J5021
$$ 46760 51171 81657 107763 104039 93217 120919 178953 251241 278756 273858 280024 284802 299823
8114B99823q804j5054k4941K7094j9951o5096o9193m5738l2788J038Q629J2538
$$ 299823 291019 275965 251024 278118 258167 193071 123878 78140 45352 46390 55019 67557
8102F7557j5180j7027j9770K6613J5375r950P445M0500k1787Q658q091l8486k2433
$$ 67557 52377 35350 15580 42193 57568 47618 55063 95563 73776 82434 74343 35857 13424
8089A3424K562Q771K3555k1364J4149j483j9580k6550j2319J5827K2558k4081
$$ 13424 15986 24757 48312 26948 41097 39614 20034 -6516 -18835 -3008 19550 -4531
8077d531Q265j1812j5679O034M4652M1758q555j7319q142P54Q352k4931K280Q690
$$ -4531 3734 -8078 -23757 -17723 26929 68687 60132 42813 34671 35425 43777 18846 21126 29816
8063B9816N640K231J9648Q922k5289L391k4814J0367J9544j8180Q054K0067L4
$$ 29816 35456 37687 57335 66257 40968 44359 19545 29912 49456 31276 39330 59397 59431
8050E9431J2673K2125O302j7957l3394j7127K8929q932k0927K6341n458J5723
$$ 59431 72104 94229 100531 82574 49180 32053 60982 52050 31123 57464 52006 67729
8038F7729O016N528J2553j7042j8887J7948L1995j023m51j2233j9565j5987J6172
$$ 67729 73745 79273 91826 74784 55897 73845 105840 104817 104366 92133 72568 56581 72753
8025G2753k1501n170J6937J804k7258K3487J7249J6585k6782o130M0438J7906
$$ 72753 51252 46082 63019 64823 37565 61052 78301 94886 68104 61974 102412 120318
8013A20318r047J298J2594R427M2504L7488J8990L6855k7726n3528p945J9012
$$ 120318 111271 112569 125163 134590 177094 214582 233572 270427 242701 189173 181228 200240
8001B00240J4175j2180m0209J0559K6650K266o847j9917j9342j0671J0549J1333
$$ 200240 214415 202235 162026 172585 199235 201501 194654 174737 155395 144724 155273 166606
7989A66606L2166M023k5086l7807l1314j5477k630K095J0662o83j4686L818p084
$$ 166606 198772 202795 177709 139902 108588 93111 90481 92576 103238 102555 87869 91687 84603
7976H4603j7665l080J5083J2394M577J230p966K516M546N1088O886k2916J3763
$$ 84603 66938 63858 78941 91335 95912 97142 89176 91692 96238 147326 154212 131296 145059
7963A45059L4908L7048J6985K6367R814r522m723m399r528q418l0301M642j3477
$$ 145059 179967 217015 234000 260367 270181 260659 255936 251537 242009 233591 203290 207932 194455
7950A94455l38l0278l2129M1744L5321j3948n2403n1553j5344L204J1251o447
$$ 194455 194117 163839 131710 173454 208775 194827 142424 90871 75527 78731 89982 83535
7938H3535l867R086R372L74o068k3204J8425j7907k8246Q95K0694Q864p475N379
$$ 83535 79668 88754 98126 98500 92432 69228 87653 69746 41500 42395 63089 71953 64478 69857
7924F9857j5378j1697n652M203M3653J2397L0526j2465k6877j1204K212K986j861
$$ 69857 54479 42782 37130 41333 84986 97383 127909 115444 88567 77363 79575 82561 80700
7911H0700j0908j19j321j0491k2745R874L2306J7241J1143k9677j4191l029k2016
$$ 80700 69792 69673 68352 57861 35116 44990 77296 94537 105680 76003 61812 58783 36767
7898C6767M26M383K1525k2663l5174K297l927J2195M130j5600j0897K794J277
$$ 36767 37193 41576 63101 40438 5264 7561 3634 15829 19959 4359 -6538 -3744 -2467
7885b467J6034k891j328K613O140j0083M442P965p851j3408J2895M5233l999k748
$$ -2467 13567 10676 9348 11961 18101 8018 12460 20425 12574 -834 12061 57294 53295 50547
7871E0547m9339j1135K2257N920p811j8098L0354k551m063m877k464j0812l939
$$ 50547 1208 -9927 12330 18250 10439 -7659 22695 20144 16081 11204 8740 -2072 -6011
7858f011P269o113r801k6058M739J7953j3790j0952R183K4593R880R306j6878
$$ -6011 1258 -4855 -14656 -40714 -35975 -18022 -31812 -42764 -33581 -8988 892 10198 -6680
7845f680J1776J4437Q26r842k893j8943l6108L2781J6989r557J1015R212K7384
$$ -6680 5096 19533 20359 10517 7624 -11319 -47427 -14646 2343 -7214 3801 13013 40397
7832D0397J4837k4697l1310j991K0380k9358j481P103m4293J1975J4699J235q237
$$ 40397 55234 30537 -773 -2764 17616 -11742 -13223 -6120 -50413 -38438 -23739 -22504 -30741
7819c0741J3888J0563j6035o388l092M0322N96P976o898l8506J6240M077K0542
$$ -30741 -16853 -6290 -22325 -28713 -31805 8517 9113 17089 10191 -28315 -12075 -7998 12544
7806A2544o979L513L435J8425q891p104k0211o349j3315K4103O004k0527j3596
$$ 12544 5565 9078 12513 30938 22047 14943 -5268 -11617 -24932 -829 5175 -15352 -28948
7793b8948J3542K8636K1483k6749j3800O205M997k6066J6013K732o784J1656l032
$$ -28948 -15406 13230 34713 7964 -5836 369 5366 -20700 -4687 -1955 -8739 2917 -115
7780a15j7611J3434J1148J7003l051p696n373J812k2211k2621j6031r556j8506
$$ -115 -17726 -4292 6856 23859 20808 13112 7739 9551 -12660 -35281 -51312 -60868 -79374
7767g9374L1296J0412r791K4214J3939k822R979j0401L3819k1161o609j2352j9329
$$ -79374 -48078 -37666 -47457 -23243 -9304 -12126 -2147 -12548 21271 110 -6499 -18851 -38180
7754c8180L440J2159K3481J4363q845j1411q845j1808J5628p984O180L1715q876
$$ -38180 -34740 -22581 900 15263 6418 -4993 -13838 -25646 -10018 -18002 -11822 19893 11017
7741A1017k5246K803J3189j7838n105k339r697P230k19L600Q948j2164L7460J002
$$ 11017 -14229 -11426 1763 -16075 -21180 -23519 -33216 -25986 -26205 -22605 -13657 -25821 11639 12641
7727A2641r485j0519j4441q571J6089j628J4953J4350k9642j8141R669K9015l669
$$ 12641 3156 -7363 -21804 -30375 -14286 -15914 -961 13389 -16253 -34394 -24725 4290 621
7714F21j3578k55J1988J165k34N521l454j875J1365Q054p221n636l529k6424q800
$$ 621 -12957 -13212 -1224 -59 -293 5228 1774 -101 11264 19318 12097 6461 2932 -23492 -32292
7699c2292j0511J3379n18M81K0543k121k3076k013O048J9354L1594j4904k0475
$$ -32292 -42803 -29424 -29942 -29461 -8918 -11039 -34115 -36128 -30080 -10726 20868 5964 -14511
7686a4511k5242o418k605Q065k500Q762J6370m807j1318j5794L7779J5443j0065
$$ -14511 -39753 -46171 -48776 -40711 -43211 -34449 -18079 -22886 -34204 -49998 -12219 3224 -6841
7673f841P708L5232j3764J9998K385J5144l2771m1486J2715j5905P196q33K3235
$$ -6841 867 36099 22335 42333 44718 59862 27091 -14395 -1680 -17585 -10389 -11222 12013
7660A2013J5806j1844r209L175K51k9450k5235o436K6845l159J3655m65j5876
$$ 12013 27819 15975 6766 9941 10192 -19258 -44493 -50929 -24084 -27243 -13588 -14053 -29929
7647b9929J084K4585J0098k4267L1802J6068k291O359J5391N678l5653j8227q802
$$ -29929 -28845 -4260 5838 -18429 13373 29441 27150 33509 48900 54578 18925 698 -8104
7634h104J0542J1168J6486K0936k9805j2581l854J7059K6273j9971k8095K4239
$$ -8104 2438 13606 30092 51028 21223 8642 4788 21847 48120 28149 54 24293
7622B4293K2696l0500j6490N375j06r929M832M010n396k3788j7164q195K4075
$$ 24293 46989 16489 -1 5374 5268 -4661 171 4181 -1215 -25003 -42167 -50362 -26287
7609b6287J7391k9036j7583J9011k4180J3162J0152J5560K2696j9387q951o855
$$ -26287 -8896 -37932 -55515 -36504 -60684 -47522 -37370 -21810 886 -18501 -27452 -34307
7597c4307J0361K7652k0960K838r964J7450J3535M899j8944k6748j1516K1970
$$ -34307 -23946 3706 -17254 -14416 -24380 -6930 6605 11504 -7440 -34188 -45704 -23734
7585b3734Q669j7295O288l793J3656j6868k1151J8708M993J6488j991R813j7926
$$ -23734 -15065 -32360 -26072 -29865 -16209 -33077 -54228 -35520 -30527 -14039 -16030 -6217 -24143
7572b4143j9636J385R585O826K3789L923k451N039j7696J3322l700q684K5502
$$ -24143 -43779 -42394 -32809 -25983 -2194 1729 -722 4317 -13379 -57 -3757 -12441 13061
7559A3061p425j7451m154L4381O771k1162J0900j7061j2386K4714P910j2758k002
$$ 13061 5636 -11815 -15969 18412 25183 4021 14921 -2140 -14526 10188 18098 5340 3338
7546C338M824j8370p667L5281Q301k815k7925l3618l6911J6609K9873J0097K8563
$$ 3338 8162 -10208 -17875 17406 25707 22892 -5033 -38651 -75562 -58953 -29080 -18983 9580
7533I580L2659N682l1355j5700L631P471K1657j8866l0024J7840R000o451k7372
$$ 9580 42239 47921 16566 866 4497 11968 33625 14759 -15265 2575 11575 5124 -22248
7520b2248n931j2380J6948J1520j2628J7561M9889L959j5291j3847j8837J0938
$$ -22248 -28179 -40559 -23611 -12091 -24719 -7158 42731 46690 31399 17552 -1285 9653
7508I653O701j112K8134k0277p364j281O818j009j6744j1818K8101r813j5411
$$ 9653 16354 15242 43376 23099 15735 14454 21272 20263 3519 -8299 19802 9989 -5422
7495e422J8250J9795l964j7984p814K6682K1415k1197Q195k6669o035l454O70
$$ -5422 12828 32623 28659 10675 2861 29543 50958 29761 37956 11287 5252 1798 2468
7482B468m6Q273O488K224l7388l0597J1643K4670K7628J9037L704j4902k9216
$$ 2468 2422 10695 17183 19407 -17981 -48578 -36935 -12265 15363 34400 38104 23202 -6014
7469f014m034J2313l205R747J6520M659j2550l799k9767j4224K7220K3620O43
$$ -6014 -10048 2265 -940 8807 25327 29986 17436 13637 -16130 -30354 -3134 20486 21129
7456B1129j5155j4566n541j0040m553Q82K3147J8294J886k2539l5746m859J7891
$$ 21129 5974 -8592 -14133 -24173 -28726 -27844 -4697 13597 15483 -7056 -42802 -47661 -29770
7443b9770J9965o671n70j983p021k1073n368K8901P24Q845o014J6017K1123O022
$$ -29770 -9805 -16476 -17046 -19029 -26050 -47123 -52491 -23590 -22866 -14021 -20035 -4018 17105 23127
7429B3127k0406j4145o110P576o368o674n230O60J2903M1995K6076j1286q384
$$ 23127 2721 -11424 -17534 -9958 -16326 -23000 -28230 -27570 -14667 27328 53404 42118 33734
7416C3734k8638l7666m322l252n634j0980N891K3373L1492M017K946J5199q443
$$ 33734 5096 -32570 -36892 -40144 -45778 -56758 -50867 -27494 3998 8015 10961 26160 17717
7403A7717p663m188j1007j1790J4965m164L863j926p63P171Q066R886N523p993
$$ 17717 10054 5866 -5141 -16931 -1966 -6130 -2267 -4193 -4956 2215 10281 20167 25690 17697
7389A7697O627l5345j306J8246J9311N951K305K6382k7349p547l516n891J2548
$$ 17697 24324 -11021 -12327 5919 25230 31181 33486 59868 32519 24972 21456 15565 28113
7376B8113l536N489L6161j0357j1605K3749m835k7209j9944k3696j2226o485j3728
$$ 28113 24577 30066 66227 55870 44265 68014 63179 35970 16026 -7670 -19896 -26381 -40109
7363d0109L941J2990L1918J2769K38K0451K6119l5908l7730L33q626J0134Q841
$$ -40109 -36168 -23178 8740 21509 21747 42198 68317 32409 -5321 -4988 -13614 -3480 5361
7350E361j0181J0579J4785N715j2086j3978j1846K4443J0774j1288j5138j0035
$$ 5361 -4820 5759 20544 26259 14173 195 -11651 12792 23566 12278 -2860 -12895
7338a2895J8873M317m0503m768m086L372M3355R940K941j4546k7655j018P956
$$ -12895 5978 10295 -30208 -34976 -39062 -35690 7665 17605 20546 6000 -21655 -22673 -14717
7325a4717k0451R970L2372m880q704m424Q809K3071n694q36j9799k9204l6393
$$ -14717 -35168 -25198 7174 2294 -6410 -10834 -2025 21046 15352 14516 -5283 -34487 -70880
7312g0880K4724L6351K2131J2559J2549J266l0015k1531J1936K8401J0721J9433
$$ -70880 -46156 -9805 12326 24885 37434 38700 8685 -12846 -910 27491 38212 57645
7300E7645l6578k2538J1239K0306m461j8722K420j14J6023p907j3454j2600J8219
$$ 57645 21067 -1471 9768 30074 25613 6891 9311 9197 25220 17313 3859 -8741 9478
7287I478n924j3446N768J8911N39k5047R499L486o273P270J4079K5777q36M384
$$ 9478 3554 -9892 -4124 14787 15326 -9721 -222 3264 -3009 4261 18340 44117 43281 47665
7273D7665k268k8144J6826J4804J527m1555K738K2780k9815j8184J0035J0563
$$ 47665 45397 17253 34079 48883 50410 8855 11593 34373 4558 -13626 -3591 6972
7261F972k0768l078J5258k6491J7454R295J3294K6240j3078k3560J306k090k1985
$$ 6972 -13796 -16874 -1616 -28107 -10653 -1358 11936 38176 25098 1538 2844 754 -21231
7248b1231j4658L05m105q889J3299J1958K3397K562J3849L1986k554o685m329
$$ -21231 -35889 -35584 -39689 -48578 -35279 -23321 76 2638 16487 48473 45919 39234 34905
7235C4905k0832J7959M039j6665Q253j2670k5196j6808M113O680j8916J963M8769
$$ 34905 14073 32032 36071 19406 27659 14989 -10207 -27015 -22902 -16222 -35138 -33175 15594
7222A5594K4768N41k3741k9231m369J0247Q513q76m141J0292K8019l863j2652
$$ 15594 40362 40903 17162 -12069 -16438 -6191 2322 1446 -2695 7597 35616 31753 19101
7209A9101j8294Q5Q998Lk116Q593l2073m076J6455J2297J6047K58n748J0O255
$$ 19101 807 892 9890 9893 7777 16370 -15703 -19779 -3324 8973 25020 25278 19530 19540 25795
7194B5795p81j3877P477P645l518k4159k6828l734k37p659R427m707L2433L0339
$$ 25795 25014 11137 18614 26259 22741 -1418 -28246 -31980 -32217 -39876 -30449 -35156 -2723 27616
7180B7616j1887m426k553j7512m350j0554o516M204L7539M066j8487j6330j7024
$$ 27616 15729 11303 8750 -8762 -13112 -23666 -30182 -25978 11561 15627 -2860 -19190 -36214
7167c6214K0000L2639j3942r073j422r817N211J1827K07J0305m891p311o041Q535
$$ -36214 -16214 16425 2483 -6590 -8012 -17829 -12618 -791 -584 9721 4830 -2481 -8522 13
7153A3j1739k0139K833K8788O478j6972N585n523L245P965l835K158K4086K2940
$$ 13 -11726 -31865 -29032 -244 6234 -10738 -5153 -10676 -7431 534 -3301 -1143 22943 45883
7139D5883m2190k5349J6351J0638k422k5125p827R680K5682J2214k1884j1788
$$ 45883 3693 -21656 -5305 5333 2911 -22214 -30041 -20361 5321 17535 -4349 -16137
7127a6137j1356m525J948O044K16K107k9701J674L9442L2508J7739k6606k2426
$$ -16137 -27493 -32018 -30070 -24026 -23810 -21703 -51404 -49730 -10288 22220 39959 13353 -9073
7114i073k0620J5154R581j6948q690K1701J3927J5393K274k2447k3640K437K1579
$$ -9073 -29693 -14539 -4958 -21906 -30596 -8895 5032 20425 22699 252 -23388 -20951 628
7101F28N351l4039k0594L3386J1231j9213K1013l898J5365K5456J3812l985n59
$$ 628 5979 -28060 -48654 -15268 -4037 -23250 -2237 -6135 9230 34686 48498 44513 43954
7088D3954k2572r281N827j179l19j3097j049L5852M832j2060K3114o435J2455
$$ 43954 21382 12101 17928 16749 16430 3333 2284 38136 42968 30908 54022 47587 60042
7075F0042q576l912k0166k0443j3336J2610K8671k7329k5092J381J5830q342N997
$$ 60042 51466 47554 27388 6945 -6391 6219 34890 7561 -17531 -16150 -320 -8662 -2665
7062b665Q676J63j8719j6916j024k1841P890m015L3953L6223J4083L5091k0719
$$ -2665 6011 6174 -12545 -29461 -30485 -52326 -44436 -48451 -14498 21725 35808 70899 50180
7049E0180J98k0220k4380o280l9747j1812L8553J285K5044n951j8430n430j3419
$$ 50180 50378 30158 5778 -502 -40249 -52061 -13508 -12223 12821 6870 -11560 -16990 -30409
7036c0409j3918K1272K4865q713o734j4803n988J1367r522K264J5219J0379p293
$$ -30409 -44327 -23055 1810 -6903 -13637 -28440 -34428 -23061 -32583 -30319 -15100 -4721 -12014
7023a2014q875j128m66L4446J7450L6568j5082l5394j3432L5690j4474o739k19
$$ -12014 -20889 -22017 -22483 11963 29413 65981 50899 15505 2073 37763 23289 16550 16331
7010A6331j2928l4191j2377J4398J9863R971K3807j511k5975m456J9565k4032
$$ 16331 3403 -30788 -43165 -28767 -8904 1067 24874 23363 -2612 -7068 12497 -11535
6998a1535r766j3084K2273l546o784J0771J4862N565J0833O82n620K0694J5987
$$ -11535 -21301 -34385 -12112 -15658 -22442 -11671 3191 8756 19589 20271 14651 35345 51332
6985E1332k3783l7359q613K9644J3284j3204o759K987K5059O03n213r281j9012
$$ 51332 27549 -9810 -18423 11221 24505 11301 4542 7529 32588 33191 27978 18697 -315
6972c15M068K3345O609J3148j9901j9020p077P791p838j089K401k051j7053k3963
$$ -315 3753 27098 33707 46855 26954 7934 857 8648 810 -279 2122 71 -16982 -40945
6958d0945K5870J564j8410J3437J8032o61o571j4898O454J6237K0927J5859J2469
$$ -40945 -15075 -13511 -31921 -18484 -452 -1113 -7684 -22582 -16128 109 21036 36895 49364
6945D9364k5667l6437j8711l735J6346J8768J9303j3208j6587J6629K8831l7591
$$ 49364 23697 -12740 -31451 -35186 -18840 -72 19231 6023 -10564 6065 34896 -2695
6933b695l3178k3692J7525n223J0823L2264J2381M169j5547l1133k0080J5853
$$ -2695 -35873 -59565 -42040 -47263 -36440 -4176 8205 12374 -3173 -34306 -54386 -38533
6921c8533M180j1231q995J3946m294J0029K1753J1221L068K604Q840J3235k8624
$$ -38533 -34353 -45584 -54579 -40633 -44927 -34898 -13145 -1924 1144 3748 12588 25823 -2801
6908b801o513J684O263R253N333Q94j0938j3262j0156o218p968K828K2943M459
$$ -2801 -9314 -7630 -1367 7886 13219 14113 3175 -10087 -20243 -26461 -34429 -31601 -8658 -4199
6894d199M003m229J4624J6115J48J4425J4156k5694m4606j4632J4461O141J9727
$$ -4199 -196 -4425 10199 26314 26462 40887 55043 29349 -15257 -29889 -15428 -9287 10440
6881A0440K7174J4698j3626l2248n096J5866j5916n786j3815k1644Q930k016J8846
$$ 10440 37614 52312 38686 6438 1342 17208 1292 -4494 -18309 -39953 -31023 -33039 -14193
6868a4193K1165J2633O450m627J372L0698k0509k086o440N674J4234j594k7384
$$ -14193 6972 19605 26055 21428 22800 53498 32989 30903 24463 30137 44371 42777 15393
6855A5393k3448k1265j6996M2417J2772l1670k5287K3318K654J1525K3728K2635
$$ 15393 -8055 -29320 -46316 -3899 8873 -22797 -48084 -24766 -22112 -10587 13141 35776
6843C5776k4946j4157k251j0305j3451j4782O583m821L2907n48K515J8366j7967
$$ 35776 10830 -3327 -5578 -15883 -29334 -44116 -37533 -42354 -9447 -9995 -7480 10886 -7081
6830g081k5865j0607l693K8517K9914J2933q654M728P462r025K058k0758l196
$$ -7081 -32946 -43553 -47246 -18729 11185 24118 15464 20192 27654 18629 20687 -71 -3267
6817c267q087j5690k2272L5424J2285j0594J4250O415j7798m467J7332J395k7643
$$ -3267 -11354 -27044 -49316 -13892 -1607 -12201 2049 8464 -9334 -13801 3531 4926 -22717
6804b2717O496P151j3176r297n963J3048K2379P950k8739j4352j8827j6877J3789
$$ -22717 -16221 -9070 -22246 -31543 -37506 -24458 -2079 5871 -22868 -37220 -56047 -72924 -59135
6791e9135K6621M767O480r34J327j457j1221l096J4738m676k673m39p658L4187
$$ -59135 -32514 -27747 -21267 -22201 -20874 -22331 -33552 -36648 -21910 -26586 -29259 -29698 -37356 -3169
6777c169J9820o781l2303K081P501p827q807J285K3030J6528K3516j0634j3665
$$ -3169 16651 9870 -22433 -20352 -12851 -20678 -29485 -28200 -5170 11358 34874 24240 10575
6764A0575L1014K0643o676l8796l5044n586P75Q437O025J4373j48q639j4799J911
$$ 10575 41589 62232 55556 16760 -18284 -23870 -23095 -14658 -8633 5740 5592 -3047 -17846 -15935
6750a5935P175k4631m0440J280J2591K9220K7292J0675J5118k3887o910P967R198
$$ -15935 -8760 -33391 -73831 -72551 -59960 -30740 -3448 7227 22345 -1542 -8452 -485 8713
6737H713p049J0884M8595J4872j3710n263n817J1860Q840j5127n513L581j7536
$$ 8713 1664 12548 61143 76015 62305 57042 51225 63085 71925 56798 51285 54866 37330
6724C7330j7627j9629k9777J6204K4671Q309k970J3192J1742j585p938k9375j8037
$$ 37330 19703 74 -29703 -13499 11172 19481 16511 29703 41445 39860 31922 2547 -15490
6711a5490K305J7737P101j384K7320J6798q130k1616m759J1724l1170k3784R216
$$ -15490 -13185 4552 11653 10269 37589 54387 46257 24641 19882 31606 436 -23348 -14132
6698a4132K153j3053P783J814M119K0585l472J2090j4124o8858n244L2391p338
$$ -14132 -11979 -25032 -17249 -15435 -11316 9269 5797 17887 3763 -65095 -70339 -37948 -45286
6685d5286K3345K2837j282l664K467Q66K0716j5834r943j1281R059l274N70p177
$$ -45286 -21941 896 -386 -4050 -1583 -717 19999 4165 -5778 -17059 -8000 -11274 -10704 -17881
6671a7881k319K7450L49k8985P491K2549J6244L297k243j0670J188k812l1518
$$ -17881 -20200 7250 7599 -21386 -13895 8654 24898 28195 25952 15282 16470 13658 -17860
6658a7860p409o975K0772J4404p779j4640K4498n192j3559r10J5688k0663j8655
$$ -17860 -25269 -32244 -11472 2932 -4847 -19487 5011 -181 -13740 -14650 1038 -19625 -38280
6645c8280j6960K0927K5798L3718j2266j570j35j4736j5407j479j2853M665L05
$$ -38280 -55240 -34313 -8515 25203 12937 11367 11232 -3504 -18911 -20390 -33243 -28578 -28273
6632b8273O341k71n186O600J4003R776j2097Q893j4282J2572k475J7432K7225
$$ -28273 -21932 -22203 -27389 -20789 -6786 2990 -9107 -214 -14496 -1924 -4399 13033 40258
6619D0258j6375M538j2536j1929l2716k3604O602K8019J1541j0269l1675P620
$$ 40258 23883 28421 15885 3956 -28760 -52364 -45762 -17743 -6202 -16471 -48146 -40526
6607d0526J0988Q374j5658J2657J7189K952P173j0226o658J6921j3193l2284J0365
$$ -40526 -29538 -21164 -36822 -24165 -6976 -4024 3149 -7077 -13735 3186 -10007 -42291 -31926
6594c1926K4039k19K00N826k0937k3655j5562R375Q07j3128J9195K319J0598J9156
$$ -31926 -7887 -8106 -7906 -2080 -23017 -46672 -62234 -52859 -52052 -65180 -45985 -43666 -33068 -13912
6580a3912O33J5949J1630K4404m934j3804l0474K348N069l163k1784L266K6784
$$ -13912 -13279 2670 14300 38704 33770 19966 -10508 -8160 -3091 -6254 -28038 -24772 2012
6567B012M2154M619m1232r851j0587J270R613q71l2960n117J7034J1950p254n067
$$ 2012 44166 48785 7553 -2298 -12885 -11615 -2002 -2873 -35833 -40950 -23916 -11966 -19220 -24287
6553b4287K6130J3190M928R9k0781j9885k0608N480J305j1677K7795J8903J1385
$$ -24287 1843 15033 19961 20060 -721 -20606 -41214 -35734 -34429 -46106 -18311 592 11977
6540A1977q165j7330k464J4898K84K3492l183q280k857P82j0879r456n597K0360
$$ 11977 3812 -13518 -15982 -1084 -800 22692 19509 11229 8372 9154 -1725 -11181 -16778 3582
6526C582J8331n600p011q03K1N748k8655k9819r803K7021J0171j8994o074K3057
$$ 3582 21913 16313 9302 8499 8520 14268 -14387 -44206 -54009 -26988 -16817 -35811 -41885 -18828
6512a8828K028L5636K0533q267l363k947n368n314J6976K8331J38l195n2236l815
$$ -18828 -16800 18836 39369 31102 27739 24792 19424 14110 31086 59417 59555 56360 4124 309
6498C09J5707j1564j6554J6704j0197O329j9271k3511J4313J2635K7657K1218
$$ 309 16016 4452 -12102 4602 -5595 734 -18537 -42048 -27735 -15100 12557 33775
6486C3775j8801j0428P102R453j2032j4245K2193L4329m449k1016m833k2550k1960
$$ 33775 14974 4546 11648 21101 9069 -5176 17017 51346 46897 25881 21048 -1502 -23462
6473b3462J2124K5570J103j0656r545n917P280j1418n635K1629J6336o914L3832
$$ -23462 -11338 14232 15335 4679 -4866 -10783 -3503 -14921 -20556 1073 17409 10495 44327
6460D4327o06k8567k2076k4684o381J1970N702j0401K7578K0975m681O178j6947
$$ 44327 43721 15154 -6922 -31606 -37987 -26017 -20315 -30716 -3138 17837 13156 19334 2387
6447B387O504L4568L382l2887l1988J5584n930Q247J8250q529m022L382l621o811
$$ 2387 8891 43459 46841 13954 -18034 -2450 -8380 -133 18117 9588 5566 8948 5327 -1484
6433a484Q007K420k134R156J590l0938M383J4128l0052J4601K3336L0968L3486
$$ -1484 6523 8943 6809 15965 17555 -13383 -9000 5128 -24924 -10323 13013 43981 77467
6420G7467N212k4776m0545k3257j5739R954j7254j0494m918L8634K4372J9401
$$ 77467 82679 57903 17358 -5899 -21638 -11684 -28938 -39432 -44350 -5716 18656 38057
6408C8057j0408l2976k623o217j9033J5682k0188N388K6006j0107o899K1615L275
$$ 38057 27649 -5327 -7950 -14167 -33200 -17518 -37706 -32318 -6312 -16419 -23318 -1703 1572
6395A572L755j5921l847J1764L9107k824n0467k1900p57L1121K3645j3322j7163
$$ 1572 5327 -10594 -14441 -2677 36430 33606 -16861 -38761 -39518 -8397 15248 1926 -15237
6382a5237j255q040j9515J5112K6260J5987j7013k0083p826j0057O557M441R903
$$ -15237 -16492 -24532 -44047 -28935 -2675 13312 -3701 -23784 -31610 -41667 -35110 -30669 -20766
6369b0766K8225K199R759j0856O805Q330m526k1383l1145J1521Q987m8756j3933
$$ -20766 7459 9658 19417 8561 15366 23696 19170 -2213 -33358 -21837 -12850 -61606 -75539
6356g5539L9334Mq618L6336P376j1617k451R21j0737L496K0928K1195K631j057
$$ -75539 -36205 -36201 -44819 -8483 -1107 -12724 -15175 -14254 -24991 -21495 -567 20628 23259 22202
6342B2202j1135j3483M762k3038m502J200k0200J6574L5621J2304n227O816j1956
$$ 22202 11067 -2416 2346 -20692 -25194 -23994 -44194 -27620 8001 20305 15078 21894 9938
6329I938p899K6362k291l4669j2343m535j3910J3096K4531j5636m321J8700N31
$$ 9938 2039 28401 26110 -8559 -20902 -25437 -39347 -26251 -1720 -17356 -21677 -2977 -2446
6316b446j9892J0276L1192j5412J4829J8090l3189M630K3737M405R183r565k7637
$$ -2446 -22338 -12062 19130 3718 18547 36637 3448 8078 31815 36220 45403 35838 8201
6303H201M053J1569o597k7973K1128K1467K122L027k5912r376P912m40k4833n932
$$ 8201 12254 23823 17226 -10747 10381 31848 33970 36997 11085 1709 9621 9181 -15652 -21584
6289b1584j8584j1095l071j788J195N122L5356K4170P931r939k401R637j0985
$$ -21584 -40168 -51263 -54334 -56122 -54927 -49805 -14449 9721 17652 7713 5312 14949 3964
6276C964j996k2939K991q368R857O537j5087R763K4371J1964p607J5449j0097
$$ 3964 1968 -20971 -17980 -26348 -16491 -9954 -25041 -15278 9093 21057 13450 28899 18802
6263A8802l6788M98N217k5316J9749J6022K9094K7116K871k9931k0214j8219j231
$$ 18802 -17986 -17488 -12271 -37587 -17838 -1816 27278 54394 57265 27334 7120 -11099 -12330
6250a2330M360J6249k308k0270r718j1116j3736J4962L0486K215n646L1973J8144
$$ -12330 -7970 8279 5971 -14299 -24017 -35133 -48869 -33907 -3421 -1206 -6852 25121 43265
6237D3265k7949l2891Q224J7377M7547N997l0496k7254o94J249j0720P614J0792
$$ 43265 15316 -17575 -9351 8026 55573 61570 31074 3820 3126 4375 -6345 1269 12061
6224A2061q00o458r672j6034L5950K9971q31j6733m0833j425K2066J3723M1621
$$ 12061 11261 4803 -4869 -20903 15047 45018 44187 27454 -13379 -14804 7262 20985 62606
6211F2606j8034n6521j0620J7172N973J1394J8043j5761O396j4611k2744Q946
$$ 62606 44572 -11949 -22569 -5397 576 11970 30013 14252 20648 6037 -16707 -7761
6199g761Q551J2483J6590j8665K132K429O147J1214j646j2446j9149o396N991
$$ -7761 790 13273 29863 11198 13330 15759 21906 33120 31474 19028 -121 -6517 -526
6186e26J4780J3236J3767k3637k2712K3890R914j5512j1616J1783j9980n188j4245
$$ -526 14254 27490 41257 17620 -5092 18798 28712 13200 1584 13367 -6613 -11801 -26046
6173b6046N524Q289K429J6221N069L4906K109l1435q652M983k580L7990O371j8780
$$ -26046 -20522 -12233 -9804 6417 11486 46392 48501 17066 8414 13397 10817 48807 55178 36398
6159C6398k406J7456r401J5463n462j9745l9047j5365K2944J6499j9402J0949
$$ 36398 33992 51448 42047 57510 52048 32303 -6744 -22109 835 17334 -2068 8881
6147H881J8197J8499m430j6361k1674K1187J7044j3110k5738l2785J2581M457
$$ 8881 27078 45577 41147 24786 3112 24299 41343 28233 2495 -30290 -17709 -13252
6135a3252p856J2751M1156J3508k8385k0012r277J148l0335j5937L8144Q084j743
$$ -13252 -21108 -8357 32799 46307 17922 -2090 -11367 -10219 -40554 -56491 -18347 -10263 -12006
6122a2006k8964J2572K2425L81k7934L91J3058Q055K1059J5015K2207J3659q841
$$ -12006 -40970 -28398 -5973 -5592 -33526 -33135 -20077 -12022 9037 24052 46259 59918 51077
6109E1077J2617j1028r85k828J8018k584j8465J4524k8540j8070j8408j5190N07
$$ 51077 63694 52666 51681 48853 66871 64287 45822 60346 31806 13736 -4672 -19862 -19355
6096a9355J0946P027K449J3691j8348k5702K8243J7402n922N968j425M575k674
$$ -19355 -8409 -1382 1067 14758 -3590 -29292 -1049 16353 10431 16399 14974 19549 16875
6083A6875K12J0685Q539k516k2770j7016R026K296q193R643N708J1717n776j6542
$$ 16875 17087 27772 36311 33795 11025 -5991 3035 5331 -2862 6781 12489 24206 18430 1888
6069A888K2594K7019j4714l4509q087K1416j028l2900n391K7587Q436j8406K8729
$$ 1888 24482 51501 36787 2278 -5809 15607 14579 -18321 -23712 3875 12311 -6095 22634
6056B2634J3203J519k1834M930J0217l5481j3307J108j3244k148O605R449o267
$$ 22634 35837 37356 15522 20452 30669 -4812 -18119 -17011 -30255 -32403 -25798 -16349 -22616
6043b2616j0085r235K9730J9374j0691p976M707j0389r076K618J4949K8926r026
$$ -22616 -32701 -41936 -12206 7168 -3523 -11499 -6792 -17181 -26257 -23639 -8690 20236 11210
6030A1210j1621M408J2963p408P875p508j3918J6788q79J129j4814j8961n523
$$ 11210 -411 3997 16960 9552 17427 9919 -3999 12789 11910 13039 -1775 -20736 -26259
6017b6259m681J5168Q656L719J5101q042k908k7008J805J5689k831k4622K0929
$$ -26259 -30940 -15772 -7116 -3397 11704 3662 754 -26254 -24449 -8760 -11591 -36213 -15284
6004a5284K3025J3748m685J0473j1001j9366K3250K1779j9640K7007k110k9834
$$ -15284 7741 21489 16804 27277 16276 -3090 20160 41939 22299 49306 47196 17362
5992A7362L078L0153j657k2652l0553j6927O149K8656p701j9705K2392M7890k0129
$$ 17362 20440 50593 48936 26284 -4269 -21196 -15047 13609 5908 -13797 8595 56485 36356
5979C6356L245J2096k589J2376N397l8875j4705J74j3977J2283K3874j4416l5476
$$ 36356 39601 51697 49108 61484 66881 28006 13301 13475 -502 11781 35655 21239 -14237
5966a4237p479o478j3483J4062K7227L294j0010K4951L2232K905l0719m002k2410
$$ -14237 -21716 -28194 -41677 -27615 -388 2906 -7104 17847 50079 52984 22265 18263 -4147
5953d147j4143m716j4530j577J7652J6966q121j5994P818N240o097J2869l547
$$ -4147 -18290 -23006 -37536 -39113 -21461 -4495 -12616 -28610 -20792 -15552 -21649 -8780 -12327
5940a2327R389n273J3098j4544j5923j0177M261q689k106K7540J8125j875j2496
$$ -12327 -2938 -8211 4887 -9657 -25580 -35757 -31496 -40185 -42291 -14751 3374 1499 -10997
5927a0997N643K1024j4097J1235K1719r006o698o710k8278M090J5145J6510q951
$$ -10997 -5354 15670 1573 12808 34527 25521 18823 12113 -16165 -12075 3070 19580 10629
5914A0629n600K560j1595K0074K6909J4409R314m862l1299k5058R050j0238K4620
$$ 10629 5029 7589 -4006 16068 42977 57386 66700 61838 30539 5481 14531 4293 28913
5901B8913J5178j5421j9419k0941j770N966o36j3254J1188Q066j3982l1096K1810
$$ 28913 44091 28670 9251 -11690 -13460 -7494 -8130 -21384 -10196 -2130 -16112 -47208 -25398
5888b5398Q787l9241j1657K7851L3302K0225l050j3646k7033j1406K6615J3008
$$ -25398 -16611 -55852 -67509 -39658 -6356 13869 10819 -2827 -29860 -41266 -14651 -1643
5876a643K800K2517j9858l1934L9245K8145j4449l012m278k3327k3098J8266O194
$$ -1643 1157 23674 3816 -28118 11127 39272 24823 21811 17533 -5794 -28892 -10626 -4432
5863d432Q52l603M567P30k5816J3696J7123K00k723P388J8155r372k3620j9058
$$ -4432 -3580 -7183 -2616 -1886 -27702 -14006 3117 3317 594 7982 26137 16765 -6855 -25913
5849b5913J698N427J9603l007J7857j9845q863K7966k0008l4891J0760L0178P779
$$ -25913 -24215 -18788 815 -2192 15665 -4180 -13043 14923 -5085 -39976 -29216 962 8741
5836H741M323L2811L782k5431j3760o4635K022J8776J4758J2253J0308J529j5009
$$ 8741 13064 45875 49657 24226 10466 -54169 -52147 -33371 -18613 -6360 3948 5477 -9532
5823i532O47j2792k8586n690J0449J1183o411o187m409K3705P688J768r475j395
$$ -9532 -8885 -21677 -50263 -55953 -45504 -34321 -40732 -46919 -51328 -27623 -19935 -18167 -27642 -29037
5809b9037L5493K4657o323j8084l176J5709J788k0850n613R833J8510k822m759
$$ -29037 6456 31113 24790 6706 3530 19239 21027 177 -5436 4397 22907 20085 15326
5796A5326q455j5605j060j1062J1710m007K082j3612R29K3658J0721Q801j2112
$$ 15326 6871 -8734 -9794 -20856 -9146 -13153 -11071 -24683 -23754 -96 10625 19426 7314
5783G314j9226J3078L2641J0672k319k2941o032P620o543j8490k732m62r311l3564
$$ 7314 -11912 1166 33807 44479 42160 19219 13187 20807 14264 -4226 -6958 -7420 -16731 -50295
5769e0295j246K5446K3022K84l959j4549j0263p566K102n682J5669m932r232J1454
$$ -50295 -51541 -26095 -3073 -2789 -6748 -21297 -31560 -39126 -37024 -42706 -27037 -31969 -41201 -29747
5755b9747j203N5934J7113j4579j1265j8707n754q378N625j721N004k4341j6271
$$ -29747 -30950 24984 42097 27518 16253 -2454 -8208 -16586 -10961 -12682 -7678 -32019 -48290
5742d8290J0958j5140k53K673K7749L4927j858l66P649O559r139R050K8026k7588
$$ -48290 -37332 -52472 -52725 -50052 -22303 12624 10766 10400 18049 24608 15469 24519 52545 24957
5728B4957l0291P738k710j4827J8096p698j193j463Q215j0237k4463j2994K5140
$$ 24957 -5334 2404 -306 -15133 2963 -4735 -5928 -7391 824 -9413 -33876 -46870 -21730
5715b1730l137j8040l202P661J0026O770J5990J866m951o394J2726j9171j605
$$ -21730 -24867 -42907 -46109 -38448 -28422 -21652 -5662 -3796 -8747 -15141 -2415 -21586 -23191
5702b3191O670j6815k353L6315M3981M099j8637k1661j6549Q76J2401J5674R757
$$ -23191 -16521 -33336 -35689 626 44607 48706 30069 8408 -8141 -7265 5136 20810 30567
5689C0567k2912n553J278K4827j3261r264L961m153J0341P705R943l3427j1312
$$ 30567 7655 2102 3380 28207 14946 5682 9643 5490 15831 23536 33479 52 -11260
5676a1260j676j0282M959J4753K6444N088L097j9068j9386P147j9510k0139J5665
$$ -11260 -12936 -23218 -18259 -3506 22938 28026 31123 12055 -7331 -184 -19694 -39833 -24168
5663b4168R265K2756J6455k8761l2525N146J0383P682j092J0588J1098m021r687
$$ -24168 -14903 7853 24308 -4453 -36978 -31832 -21449 -13767 -14859 -4271 6827 2806 -6881
5650f881k2418K053N681p23p294m69J561O415P772n726J2397R949R273p456k2557
$$ -6881 -29299 -27246 -21565 -22288 -29582 -30051 -28490 -22075 -14303 -20029 -7632 2317 11590 4134 -18423
5635a8423M858j0260p828Q343k678Q364k4643J5819J5598J155j0519K4567l859
$$ -18423 -13565 -23825 -31653 -23310 -25988 -17624 -42267 -26448 -10850 -9695 -20214 4353 494
5622D94k3455K1887J2974m8578k6251K7432p673M542J6709K5082L977k5089Q782
$$ 494 -22961 -1074 11900 -36678 -62929 -35497 -43170 -38628 -21919 3163 7140 -17949 -9167
5609i167L490Q992l959o441j6831k8233L515L3504J6010M4093M869k55K580k1928
$$ -9167 -5677 3315 -644 -7085 -23916 -52149 -48634 -15130 880 44973 49842 49587 52167 30239
5595C0239J7860j9154k5208j7247J6042J7711q826j0658K8447J8878j6790m1043
$$ 30239 48099 28945 3737 -13510 2532 20243 11417 759 29206 48084 31294 -9749
5583i749J3499L5272Q892n725J2552L738j1846r992m121m6230j3892K6244j8137
$$ -9749 3750 39022 47914 42189 54741 58479 46633 36641 32520 -13710 -27602 -1358 -19495
5570a9495K1724M2335j0983k9249k1000k8069o821L6208J6690J2271J178j913
$$ -19495 2229 44564 33581 4332 -16668 -44737 -51558 -15350 1340 13611 14789 12876
5558A2876j7462J3277J567k9091m722J4893J5209j2010o40N005J7149k856j962
$$ 12876 -4586 8691 10258 -18833 -23555 -8662 6547 -5463 -6103 -1098 16051 13195 11233
5545A1233L717j1247k077k1778k795L750p626J0566j5758j3261N513n101J3563
$$ 11233 14950 3703 1626 -20152 -22947 -19197 -26823 -16257 -32015 -45276 -39763 -44864 -31301
5532c1301j290Q864R673L0366P438J6327j5690k5760j2182K501Q207j4970P675
$$ -31301 -32591 -23727 -14054 16312 23750 40077 24387 -1373 -13555 -11054 -2847 -17817 -10142
5519a0142K8890o221P874l7690k6036l928R122Q083k9455M733K4560k7477j3397
$$ -10142 18748 12527 20401 -17289 -43325 -47253 -38131 -30048 -59503 -54770 -30210 -57687 -71084
5506g1084M1166K7611r48K0655n908N374q229J2004J60m646o264J4349N834j6719
$$ -71084 -29918 -2307 -3255 17400 11492 16866 8637 20641 20801 16155 9891 24240 30074 13355
5492A3355O332K4R300p502j861o849l3841j4049P019K0773O320N565j107K97J8007
$$ 13355 19687 19711 29011 21509 19648 12799 -21042 -35091 -28072 -7299 -979 4586 3479 3776 21783
5477B1783L828j0533j8560m0661r330J8193J5661O440j0117j5099M944O276Q934
$$ 21783 25611 15078 -3482 -44143 -53473 -35280 -19619 -13179 -23296 -38395 -33451 -27175 -18241
5464a8241M809R012K8831j7690r001r861N27L011N119M183O805N813L139l7085
$$ -18241 -13432 -4420 24411 6721 -2280 -12141 -11614 -8603 -3484 699 7504 13317 16456 -20629
5450b0629J7379M717l6092Q280L6081K3370L200K1166k921j0688r394l5018L290
$$ -20629 -3250 1467 -34625 -26345 9736 33106 36306 57472 54551 43863 34469 -549 2741
5437B741j1174K525J8368J9153j794k2308k0278j9757J3631J8308n418j9926P076
$$ 2741 -8433 -5908 12460 31613 29819 7511 -12767 -32524 -18893 -585 -6003 -25929 -18853
5424a8853l61R628J4345j4525J2062k6625q395j3362K2557K3664j026O914J0027
$$ -18853 -19214 -9586 4759 -9766 2296 -24329 -32724 -46086 -23529 135 -891 6023 16050
5411A6050j2478k582J2137K676j2272R71j2131j4159Q690J9690J0588r558J0934
$$ 16050 3572 990 13127 15803 3531 4502 -7629 -21788 -13098 6592 17180 7622 18556
5398A8556m17j5613M18O037K6492O237N414j5854o6634k4800K686P994k4891j7104
$$ 18556 18139 2526 2944 8981 35473 41710 47124 31270 -35364 -60164 -57478 -49484 -74375 -91479
5384i1479R310J0684K2902j2069p940L520K8490p552j7894L5423M2411J6765n434
$$ -91479 -82169 -71485 -48583 -60652 -68592 -65072 -36582 -44134 -62028 -26605 15806 32571 27137
5371B7137j3737N568j1218l9669r798N123m652K4851j035K420J9019J551P08k1136
$$ 27137 13400 18968 7750 -31919 -41717 -36594 -41246 -16395 -17430 -15010 4009 5560 6268 -14868
5357a4868o057J6895m389k5006m195J3911K7510M953n144j8969r687J5360J1866
$$ -14868 -20925 -4030 -8419 -33425 -37620 -23709 3801 8754 3610 -15359 -25046 -9686 2180
5344B180n974j3230l115j0779J4576K5070K8440J2317M28j7286j2949Q800k1740
$$ 2180 -3794 -17024 -20139 -30918 -16342 8728 37168 49485 49913 32627 19678 28478 6738
5331F738k2167l392m300K512j7591m095k010P435K5002J142j5519j3426j1986
$$ 6738 -15429 -18821 -23121 -20609 -38200 -42295 -44305 -36870 -11868 -10726 -26245 -39671 -51657
5318e1657J7097J9871R416j7288L963K2540O976q126p624j4165l772J7553J4886
$$ -51657 -34560 -14689 -5273 -22561 -18598 3942 10918 2792 -4832 -18997 -22769 -5216 9670
5305I670k2441N534K920J4566j024r285k6700L627L9141m901j4895j8446k1252
$$ 9670 -12771 -7237 -4317 10249 9225 -60 -26760 -23133 16008 11107 -3788 -22234 -43486
5292d3486K3822J872M646j1538J4036m47J5056j7172j4827K9711K7580l060k3023
$$ -43486 -19664 -17792 -13146 -24684 -10648 -11095 3961 -13211 -28038 1673 29253 26193 3170
5279C170k6269k0008n634J0732K8071J643L99m480K6335j045j9799k0441L3487
$$ 3170 -23099 -43107 -48741 -38009 -9938 -8295 -7896 -12376 13959 12914 -6885 -27326 6161
5266F161j1983q866J2376l879N197o338o346J182K2679K1248J7672k0590o06J3938
$$ 6161 -5822 -14688 -2312 -6191 -994 -7332 -13678 -12496 10183 31431 49103 28513 27907 41845
5252D1845J686j1803j9827l7835j1987K047m739J6047L0159K9589j7664k7470
$$ 41845 43531 31728 11901 -25934 -37921 -35874 -40613 -24566 5593 35182 17518 -9952
5240i952l27j4799M374j70N834K210P335k4570r89K6332L560j1592j1981J1668
$$ -9952 -10279 -25078 -20704 -20874 -15040 -12830 -5495 -30065 -31054 -4722 -1162 -12754 -24735 -13067
5226a3067q372K9676M336j3321M815N25l362L994O570l677N534l355j1228K5283
$$ -13067 -21439 8237 12573 -748 4067 4592 1230 5224 11794 8117 13651 10296 -932 24351
5212B4351R629l412j5520Q977j0981j2308k2858J3443K2479Q384J1335j0021P374
$$ 24351 33980 30568 15048 24025 13044 736 -22122 -8679 13800 22184 33519 23498 30872
5199C0872j0943l4489K7143j513j5310P771p14j1406R210O658k830k2336M34j0115
$$ 30872 19929 -14560 12583 11070 -4240 3531 2817 -8589 621 7279 4449 -17887 -17453 -27568
5185b7568j4388p214L7219o79J983L2388R151O453j8672j2651K23J7470r622l3752
$$ -27568 -41956 -49170 -11951 -12630 -10647 21741 30892 37345 18673 6022 6245 23715 14093 -19659
5171a9659J7949o262K135K3012k233j2507K7745M895j5875j1727j9920j3677J7514
$$ -19659 -1710 -7972 -5837 17175 14942 2435 30180 35075 19200 7473 -12447 -26124 -8610
5158h610K6527J365j2646j3798M765J7924Q790j3417L610l70k2608R476k7236
$$ -8610 17917 19282 6636 -7162 -2397 15527 24317 10900 14510 14140 -8468 1008 -26228
5145b6228n35K3180J700K1560J7211j1733J1379j5272k3053K1004J1893k9098
$$ -26228 -26763 -3583 -1883 19677 36888 25155 36534 21262 -1791 19213 31106 2008
5133B008q889p959L59j9048J3024K3596j6053O304o280k48k565j4927J1207K3421
$$ 2008 -6881 -14840 -14481 -33529 -20505 3091 -12962 -6658 -12938 -13186 -15751 -30678 -19471 3950
5119C950K3380n64j6610j2665m325l378q186k3226J9322L9867J879k3840k4282
$$ 3950 27330 26766 10156 -2509 -6834 -10212 -18398 -41624 -22302 17565 19444 -4396 -28678
5106b8678j1623L7043J2043L964L159J1019K1582l480n725K3933j2279k6443k012
$$ -28678 -40301 -3258 8785 12749 15908 26927 48509 45029 39304 63237 50958 24515 22503
5093B2503k1854k2264L908K2042M2783J2844k7646k7055M602k2612K4744J805
$$ 22503 649 -21615 -17707 4335 47118 59962 32316 5261 9863 -12749 11995 13800
5081A3800J4004K1691j2210k1043l75j7259Q861q348K114K2219J029O963J4149
$$ 13800 27804 49495 37285 16242 15867 -1392 7469 -879 1235 23454 24483 31446 45595
5068D5595L445o689j6796l0653l3634j4047K7855K5731J2814K8322J574l2398
$$ 45595 49040 42351 25555 -5098 -38732 -52779 -24924 807 13621 41943 43517 11119
5056A1119J7158l7713k3749j229K2476J6608K6035N70l7360j4955r766j328J2794
$$ 11119 28277 -9436 -33185 -34414 -11938 4670 30705 31275 -6085 -21040 -30806 -32134 -19340
5043a9340K2256n600J2532k7277N376J5965K4986k69j9862q973K695J0280n867
$$ -19340 2916 -2684 9848 -17429 -12053 3912 28898 28629 8767 -206 2489 12769 6902
5030F902l1324j4253K273l613N936J5638K9488K2228o251k4868q448R706J7572
$$ 6902 -24422 -38675 -36402 -40015 -34079 -18441 11047 33275 27024 2156 -6292 3414 20986
5017B0986j658k2226l32J469K1652k240j6070m170K0540n074L321J6942k710O817
$$ 20986 19328 -2898 -3230 -1761 19891 17651 1581 -2589 17951 12877 16198 33140 30430 37247
5003C7247k7354k3778J1796j3191k1349K8564K9717j7818k0106N16Q72L744K5150
$$ 37247 9893 -13885 -2089 -15280 -36629 -8065 21652 3834 -16272 -15756 -14884 -11140 14010
4990A4010j174M913J7942m794j5606k5468P234o775m533k8968J1346L0780J2822
$$ 14010 12836 17749 35691 30897 15291 -10177 -2943 -9718 -14251 -43219 -31873 -1093 11729
4977A1729j1943n392l614K1104P787Q189N906k28j3737P366j1880m728J9451J1188
$$ 11729 -214 -5606 -9220 11884 19671 27860 33766 33538 19801 27167 15287 10559 30010 41198
4963D1198J627k7319k7855j6719q196K3695K8291K2641k7974k1039l352K7555
$$ 41198 42825 15506 -12349 -29068 -37264 -13569 14722 37363 9389 -11650 -15002 12553
4951A2553J0603j1409m93q78J6737n540J1528r265p262k4821L72J9072l647j9333
$$ 12553 23156 11747 11254 10376 27113 21573 33101 23836 16574 -8247 -7875 11197 7550 -11783
4937a1783k0412l328R211n994j2328M758J6532j7919K2241L0361J500q266O554
$$ -11783 -32195 -35523 -26312 -32306 -44634 -39876 -23344 -41263 -19022 11339 12839 4573 11127
4924A1127J5978R282j362L308K274l638j591j4972L085k9260K1654J0256j3820
$$ 11127 27105 36387 35025 38333 40607 36969 35378 20406 23491 -5769 15885 26141 12321
4911A2321N322j8819j8760r956K3217L1302j8228k9422N327K5265J9757j6946
$$ 12321 17643 -1176 -19936 -29892 -6675 24627 6399 -23023 -17696 7569 27326 10380
4899A0380r471j8997m757L223K797j0337M507J8867J3024k1008k62Q215J1008
$$ 10380 909 -18088 -22845 -19622 -16825 -27162 -22655 -3788 9236 -11772 -12034 -3819 7189
4886G189N138k2547r086k0959P478j6559K802J7713J4442J6598q928n286N315
$$ 7189 12327 -10220 -19306 -40265 -32787 -49346 -46544 -28831 -14389 2209 -6719 -12005 -6690
4873f690J4595l484p190k1695p044L93Q509K9873J2277r054k8863k0187Q503K1517
$$ -6690 7905 4421 -2769 -24464 -31508 -31115 -22606 7267 19544 10490 -18373 -38560 -30057 -8540
4859h540J2023M063j3068j467j7527K666K467q790K376n380K2853K6565L266R56
$$ -8540 3483 7546 -5522 -6989 -24516 -21850 -19383 -28173 -25797 -31177 -8324 18241 21507 22463
4845B2463j3556j7226J6825J6052l341m029k7800j5375J1892J2198j139J6537
$$ 22463 8907 -8319 8506 24558 21217 17188 -10612 -25987 -14095 -1897 -3036 13501
4833A3501L354J51J482J6706j8554k1335J3263N722j4676n043q332J5450J1728
$$ 13501 16855 17006 18488 35194 16640 -4695 8568 14290 -386 -5429 -13761 1689 13417
4820A3417j9316P397j3456j6066J1033K0965K1536k4427o359J1810k286J9206
$$ 13417 -5899 1498 -11958 -28024 -16991 3974 25510 1083 -5276 6534 4248 23454
4808B3454J0159j2114j3565l07j7770j4420j2543m310J7863K6801P547k2423k0725
$$ 23454 33613 21499 7934 7627 -10143 -24563 -37106 -41416 -23553 3248 10795 -11628 -32353
4795c2353k3838K9815K8058j0292m632M671j7160p633R079P224J9963j2563n716
$$ -32353 -56191 -26376 1682 -8610 -13242 -8571 -25731 -33364 -24285 -17061 2902 -9661 -15377
4782a5377j2531K4462J0232m041R941K291k4600J2015K2825L888Q633O261j3000
$$ -15377 -27908 -3446 6786 2745 12686 14977 -9623 2392 25217 29105 37738 43999 30999
4769C0999k6953j3897o08J2367J6915N078q428K5780l4074n4284J4369j023R83
$$ 30999 4046 -9851 -10459 1908 18823 23901 15473 41253 7179 -47105 -32736 -33759 -32776
4756c2776l038L304L1932P981J9815p8P997J5265m306q978j8276l0489N97M39
$$ -32776 -35814 -32510 -578 7403 27218 27140 35137 50402 46096 37118 18842 -11647 -11050 -10611
4742a0611n180Q097N652r25N009K276k4321J916K2120l715o927p375j6607J2254
$$ -10611 -15791 -7694 -2042 -2967 2042 4318 -20003 -18087 4033 318 -6609 -13984 -30591 -18337
4728a8337J3260J4691l8777m0283J9019J6424K4757O056R449M57l7119J719N672
$$ -18337 -5077 9614 -29163 -69446 -50427 -34003 -9246 -3190 6259 6716 -30403 -28684 -23012
4715b3012J7456K7164j0712K644k1553L439j4001j3201r12O265J9711n956j3439
$$ -23012 -5556 21608 10896 13540 -8013 -4574 -18575 -31776 -32688 -26423 -6712 -12668 -26107
4702b6107J3519K9195P1q401j662j0129K09J1195j8986r251O842L2282l1658m7285
$$ -26107 -12588 16607 16678 8277 6615 -3514 -3305 7890 -11096 -20347 -13505 18777 -12881 -60166
4688f0166l825J0888J0680o920j27L6996j673k5363j9405L4245J5256J4176M611
$$ -60166 -63991 -53103 -42423 -49343 -49470 -12474 -14147 -39510 -58915 -24670 -9414 4762 9373
4675I373l1061j0812R283N693o37R667M529L961J491l984J3603j4998k7210K026
$$ 9373 -21688 -32500 -23217 -17524 -18161 -8494 -3965 -4 1487 -2497 11106 -3892 -31102 -29076
4661b9076k1474p493K6311P515p111J8263J2303L4393J8359r274j0154k0115j0425
$$ -29076 -50550 -58043 -31732 -24217 -31328 -13065 -762 33631 51990 42716 32562 12447 2022
4648B022j8345K8658o439k5406j320J9396m94l3094k050L3597K2882j5215k6814
$$ 2022 -16323 12335 5896 -19510 -20830 -1434 -1928 -35022 -37072 -3475 19407 4192 -22622
4635b2622J7120J7838j5850k2994j2708k2363K2344N1235O316n021M993j4518
$$ -22622 -5502 12336 -3514 -26508 -39216 -61579 -39235 12000 18316 13295 18288 3770
4623C770N926K0153r820j9946j2017l902r688L8811L8220l4039l4803K271J4923
$$ 3770 9696 29849 20029 83 -11934 -15836 -25524 13287 51507 17468 -17335 -15064 -141
4610a41K9559j8469k5833J928R360n401M751j8626j9880J4503J3244l642o622
$$ -141 29418 10949 -14884 -12956 -3596 -8997 -4246 -22872 -42752 -28249 -15005 -18647 -25269
4597b5269L113K2651l539K2037J5274K0095l748k8284R114J8306j7510m2199m7775
$$ -25269 -22156 495 -3044 18993 34267 54362 50614 22330 31444 49750 32240 -9959 -57734
4584e7734J2415n649K2400L1104K6534j2601Q951L135j074j0590j0468j7028J2150
$$ -57734 -45319 -50968 -28568 2536 29070 16469 25420 28555 27481 16891 6423 -10605 1545
4571A545K81j2770J2447J7347j35m429j018l1074l999R891J9187P716J9896k0109
$$ 1545 1826 -10944 1503 18850 18715 14286 13268 -17806 -21805 -11914 7273 14989 34885 14776
4557A4776l5233j7261j2951R097j5762p162L8279L1562R283o335k0115k17k9943
$$ 14776 -20457 -37718 -50669 -41572 -57334 -64496 -26217 5345 14628 8293 -11822 -12039 -41982
4544d1982J0103L1029R692r936j1442N045K3860L1034r679k2431R056j4092l3722
$$ -41982 -31879 -850 8842 -1094 -12536 -7491 16369 47403 37724 15293 24349 10257 -23465
4531b3465K010J0747K43M83n500K0210J3351q477L30L646K053M184Q651n793r764
$$ -23465 -21455 -10708 -10465 -9982 -15482 4728 18079 9602 9932 13578 15631 19815 28466 22673 12909
4516A2909L272Q474K2256j6419m1412k1035l649m741R35Q627J7650J7429j1292
$$ 12909 16181 24655 46911 30492 -10920 -31955 -35604 -40345 -39410 -30783 -13133 4296 -6996
4503f996L9564J3946r376r307l0270k4002N182L095N604P620N698q970j7813r228
$$ -6996 32568 46514 37138 27831 -2439 -26441 -21259 -18164 -12560 -4940 758 -8212 -26025 -35253
4489c5253K0074l215k760J9331M349k3923j3514q000j6249M291J708O376L5560
$$ -35253 -15179 -18394 -21154 -1823 2526 -21397 -34911 -42911 -59160 -54869 -53161 -46785 -11225
4476a1225m220n504l496L6188K6530k1161j5205j5004L849L688J8273L257m0817
$$ -11225 -15445 -20949 -24445 11743 38273 17112 1907 -13097 -9248 -5560 12713 15970 -24847
4463b4847K4654L3706K2377n757O322k4540j3074j2508K683O543n287j0463K4754
$$ -24847 -193 33513 55890 50133 56455 31915 18841 6333 9016 15559 10272 -191 24563
4450B4563j0833j8997j5568q91j8030j5891P712Q088J3151R114l446j1246J3050
$$ 24563 13730 -5267 -20835 -21726 -39756 -55647 -47935 -39847 -26696 -17582 -21028 -32274 -19224
4437a9224J7029J5693K8053J8122r784j1363n920L739L925J4242j4316k3651o840
$$ -19224 -2195 13498 41551 59673 49889 38526 32606 36345 40270 54512 40196 16545 9705
4424I705j2931p071N712N216K3937j5600j9914k528R636K7850Q956k3180j0809
$$ 9705 -3226 -10297 -4585 631 24568 8968 -10946 -13474 -3838 24012 32968 9788 -1021
4411a021p991R521j1132r167n336K6932K5532o280l5885n07J3650J5207j5148
$$ -1021 -9012 509 -10623 -19790 -25126 1806 27338 21058 -14827 -15334 -1684 13523 -1625
4398a625K035J7747j4999l5103K5380Q684P767j0331k4239r934J9069M1587J1183
$$ -1625 410 18157 3158 -31945 -6565 2119 9886 -445 -24684 -34618 -15549 26038 37221
4385C7221j2954p989k2096K1350P921k6586k5503P011L7659O130p63K5451K3546
$$ 37221 24267 16278 -5818 15532 23453 -3133 -28636 -21625 16034 22164 21401 46852 70398
4372G0398L034P037l5945k1583l3659j1735j313K2136R722m539Q262q991k0691
$$ 70398 73432 80469 44524 22941 -10718 -22453 -23766 -1630 8092 3553 11815 2824 -17867
4359a7867j3727L1302J3242j3950p341O991J1579J1612j9155k925q936J1271J8983
$$ -17867 -31594 -292 12950 -1000 -8341 -1350 10229 21841 2686 -239 -9175 2096 21079
4346B1079q84J3337j0020k9897j7151m545j373j2905J4627K2294R601J9572j0044
$$ 21079 20195 33532 23512 -6385 -23536 -28081 -29454 -42359 -27732 -5438 4163 23735 13691
4333A3691l2678l8909N179L1857K6447J9358j503j9833k6252l6736N692J9849
$$ 13691 -18987 -57896 -52717 -20860 5587 24945 23442 3609 -22643 -59379 -53687 -33838
4321c3838J2273l790r009N090j7842l029J7465j796n10J2208J2334q607j0129
$$ -33838 -21565 -25355 -34364 -29274 -47116 -50145 -32680 -34476 -34986 -22778 -10444 -19051 -29180
4308b9180n945J2212K1097J2365J0534j1566M502O262K9318m168j9555l7460q002
$$ -29180 -35125 -22913 -1816 10549 21083 9517 14019 20281 49599 45431 25876 -11584 -19586
4295a9586k03j136M133K7336j346k9017J312L7889J5439l0582j9855J0096j412
$$ -19586 -19789 -20925 -16792 10544 9198 -19819 -18507 19382 34821 4239 -15616 -5520 -6932
4282f932k1636R166O527L566K2189J5698k656K279m691l2174j0866K0605K5842
$$ -6932 -28568 -19402 -12875 -9309 12880 28578 25922 28201 23510 -8664 -19530 1075 26917
4269B6917K697p579O265k9956j8601l444N855J3071r406j8K3704p63J8273J0877
$$ 26917 29614 22035 28300 -1656 -20257 -23701 -17846 -4775 -14181 -14199 9505 8742 27015 37892
4255C7892P71j8031l1837j9667L617K4172L166N75j6585Q808j5440o578K0704
$$ 37892 38663 20632 -11205 -30872 -27255 -3083 83 658 -15927 -7119 -22559 -29137 -8433
4242h433R747J520R973q964n524j316N4124J7101o279k8883j2347l1461J3001
$$ -8433 1314 2834 12807 3843 -1681 -2997 51127 68228 61949 33066 20719 -10742 2259
4229B259R44K064q873J629r13K2927L036p180j0357j1688M331m98N222k7714j1676
$$ 2259 3203 5267 -3606 -1977 -2890 20037 23073 15893 5536 -6152 -1821 -2319 2903 -24811 -36487
4214c6487J4387J9655m678j2102K6283K1035M929j7084q263k6027j5489J6181
$$ -36487 -22100 -2445 -7123 -19225 7058 28093 33022 15938 7675 -18352 -33841 -17660
4202a7660N596m788L534M0797J1161L533l411n728k9800l626K1594J6330J5526
$$ -17660 -12064 -16852 -13318 27479 38640 42173 38762 33034 3234 -392 21202 37532 53058
4189E3058l4055k7057Q551M887n201J2592n584j7878p365j0999j1494j993K571
$$ 53058 19003 -8054 497 5384 183 12775 7191 -10687 -18052 -29051 -40545 -42538 -39967
4176c9967J8219q172m198J8758J0421k5786j1794M2637K1554J6050R814l1674
$$ -39967 -21748 -29920 -34118 -15360 -4939 -30725 -42519 118 21672 37722 47536 15862
4164A5862l8095J6187P858k2818k398Q224J659K0219M0794J879Q914r02O839J4497
$$ 15862 -22233 -6046 1812 -21006 -23404 -15180 -13521 6698 47492 49371 58285 57383 64222 78719
4150G8719J5305J6442n5350n574o117p433Q083k7329K2111O761k3599J639l087
$$ 78719 94024 110466 55116 49542 43425 35992 44075 16746 38857 45618 22019 23658 20571
4137B0571j0054k723j3250j2988K740L4944K10k7168J661J3241J3127J2256r33
$$ 20571 10517 7794 -5456 -18444 -15704 19240 19450 -7718 -6057 7184 20311 32567 31634
4124C1634k795Q733j6037k7820j4577j1970j3939l770J136K7142J079m376l4719
$$ 31634 28839 37572 21535 -6285 -20862 -32832 -46771 -50541 -49405 -22263 -21184 -25560 -60279
4111f0279J7951L8166j7400j4951K2610K4617o634j5252j324j4841l524q97J5061
$$ -60279 -42328 -4162 -21562 -36513 -13903 10714 4080 -11172 -12496 -27337 -30861 -31758 -16697
4098a6697Q08L171l220J2784K388O648m9k828j2038R129O902m191J530p066o445
$$ -16697 -15889 -12718 -15938 -3154 -766 5882 5833 3005 -9033 96 6998 2807 4337 -2729 -9174
4083i174M218O741P590O015m197k4604J8231j2147m183J4138K5328q726l2803
$$ -9174 -4956 1785 9375 15390 11193 -13411 4820 -7327 -11510 2628 27956 19230 -13573
4070a3573Q070o663N625J0048j5721M717P995n481L7458j0199Q017O190j5987
$$ -13573 -5503 -12166 -6541 3507 -12214 -7497 498 -4983 32475 22276 30293 36483 20496
4057B0496K898o8l337o725k585m4794j9657J1621O071Q151P143J0083k696L1899
$$ 20496 23394 23326 19989 13264 10679 -34115 -53772 -42151 -36080 -27929 -20786 -10703 -13399 18500
4043A8500R507j8413j670K2695o102j2737l176J1851j4854Q022K030J2236j6773
$$ 18500 28007 9594 7924 30619 24517 11780 8604 20455 5601 13623 15653 27889 11116
4030A1116j9102l691J898j4852m012P20K3665k1163K1137K1497q215k7616J0636
$$ 11116 -7986 -11677 -9779 -24631 -28643 -27923 -4258 -25421 -4284 17213 8998 -18618 -7982
4017g982Q779k0983l489L9211J2877N420l0908j9631J5836J1817n138n031j1944
$$ -7982 797 -20186 -23675 15536 28413 33833 2925 -16706 -870 10947 5809 778 -11166
4004a1166n629n864J2651O269r32J4749P82N390Q304j7869Q353j652k4472l771
$$ -11166 -16795 -22659 -10008 -3739 -4671 10078 10860 16250 24554 6685 15038 13386 -11086 -14857
3990a4857j444n946O397M707o24J0925j4080J6382K0812L263n947J2026M479n945
$$ -14857 -16301 -22247 -15850 -11143 -11767 -842 -14922 1460 22272 25535 19588 31614 36093 30148
3976C0148q603K1626k4841k8195J1962L61j0343J4411q343m3544j8536l753Q688
$$ 30148 21545 43171 18330 -9865 2097 2458 -7885 6526 -1817 -45361 -63897 -67650 -58962
3963e8962J8803J3107N384r382r595K7984Q046J5445j7578K324K6514M199R753
$$ -58962 -40159 -27052 -21668 -31050 -40645 -12661 -4615 10830 -6748 -4424 22090 26289 36042
3950C6042K6094L544k0539m0412q355l2250p781p511P631o8J4271J7829K4301
$$ 36042 62136 65680 45141 4729 -3626 -35876 -43657 -51168 -43537 -43605 -29334 -11505 12796
3937A2796L058l2955j391j855r882o667n46p165K7537K2174K2619k323j1936k2112
$$ 12796 15854 -17101 -18492 -20347 -30229 -36896 -37442 -44607 -17070 5104 27723 25400 13464 -8648
3923h648J8344L0765m136k4105k4628j5724L7098J4544l3171p773J949j0J2418
$$ -8648 9696 40461 36325 12220 -12408 -28132 8966 23510 -9661 -17434 -15485 -15495 -3077
3910c077j180j2875N082j5912q158J8256K0031J3667P998k2684j0824K9571L217
$$ -3077 -4257 -17132 -12050 -27962 -36120 -17864 2167 15834 23832 1148 -9676 19895 23112
3897B3112j3949R934J7937J3401j8617k6879r3J852P94L6945K7268k9191k0012
$$ 23112 9163 19097 37034 50435 31818 4939 4846 6698 7492 44437 71705 42514 22502
3884B2502j8503m073K2749P365j2386j4983J6345P318j8688k9821P132K6568J8570
$$ 22502 3999 -74 22675 30040 17654 2671 19016 26334 7646 -22175 -15043 11525 30095
3871C0095K2018l6889l1923M121K6933k938r370L1839J8388k6189k2633K688j712
$$ 30095 52113 15224 -16699 -12578 14355 11417 2047 33886 52274 26085 3452 6140 4428
3858D428j3165m176m734J756N907k941m403k9586R307L9013K8691N086k637k0010
$$ 4428 -8737 -12913 -17647 -15891 -9984 -12925 -17328 -46914 -37607 1406 30097 35183 32546 12536
3844A2536q841j773j2789q531M328k247j6658j9992k768J6631R729N114l211K579
$$ 12536 3695 1922 -10867 -19398 -15070 -17317 -33975 -53967 -56735 -40104 -30375 -25261 -28472 -25893
3830b5893l919K1838M541j99j3051o886J5676J4701L1484P681k9937j2989o793
$$ -25893 -29812 -7974 -3433 -3632 -16683 -23569 -7893 6808 38292 45973 16036 3047 -3746
3817c746J2375L2275o756l4696k097n22J1484K5826J3774n929m880r18P395L007
$$ -3746 8629 40904 34148 -548 -2645 -3167 8317 34143 47917 41988 37108 36190 43585 46592
3803D6592L331k5590j0178m0186N309Q418k3890m677J8095O398n38j6383J3208
$$ 46592 49923 24333 14155 -26031 -20722 -12304 -36194 -40871 -22776 -16378 -16916 -33299 -20091
3790b0091J5147J2660K8105K7128j8352n3043J2436K3142L3041j6500m683M856
$$ -20091 -4944 7716 35821 62949 44597 -8446 3990 27132 60173 43673 38990 43846
3778D3846j7766n0176k2282j1360r171L3924J6564J3400J4087J5899k036p102
$$ 43846 26080 -24096 -46378 -57738 -66909 -32985 -16421 -3021 11066 26965 24929 17827
3766A7827K598J6569Q007Q48k106L587k9484l5210k5941J6896L9781M105k2424
$$ 17827 20425 36994 45001 45849 43743 47330 17846 -17364 -43305 -26409 13372 17477 -4947
3753d947k3102l3265K5177L0480O825j7888O332p686k8908j1059P216M2036K7436
$$ -4947 -28049 -61314 -36137 -5657 1168 -16720 -10388 -18074 -46982 -58041 -50825 -8789 18647
3740A8647j068k3628L268M498P477M939J2418j6521k0207J9239J6701k4235N224
$$ 18647 17579 -6049 -2781 1717 9194 14133 26551 10030 -10177 9062 25763 1528 6752
3727F752Q307n274K7393m217m4673p927l502P038N344N837L2319J3591j4631k1801
$$ 6752 15059 9785 37178 32961 -11712 -19639 -23141 -16103 -10759 -4922 27397 40988 26357 4556
3713D556j9161P415R170k3575o656j0901j9228J1039K2906J7662R314O693R919
$$ 4556 -14605 -7190 1980 -21595 -28251 -39152 -58380 -47341 -24435 -6773 2541 9234 19153
3700A9153o006j0213l401j1998J0319K990M876R97j3693P836j5328J1133K9408
$$ 19153 13147 2934 -467 -12465 -2146 844 5720 6717 -6976 860 -14468 -3335 26073
3687B6073j6074p548O720M7k4197j4190o72n451j1180j6439K8470K5777J5584
$$ 26073 9999 2451 9171 9218 -14979 -29169 -29841 -35292 -46472 -62911 -34441 -8664 6920
3674F920p929J26J0471j9518L707J6907m393j93J3777J2276j3861j6272J0253
$$ 6920 -1009 -883 9588 -9930 -6223 10684 6291 6098 19875 32151 18290 2018 12271
3661A2271O36l248p50p46l500N993O077J1985k5766k3806r153Q682K818K7817
$$ 12271 12907 9659 8909 8163 4663 10656 16733 28718 2952 -20854 -30007 -21325 -18507 9310
3647I310j7042l172P161Q437K2112j5234M081K032j4662j9928R380J7836J3674
$$ 9310 -7732 -10904 -3743 4694 26806 11572 15653 17685 3023 -16905 -7525 10311 23985
3634B3985j1833J547M78k2054p876o79O564J6819O976j367j2233j1020j4669j0816
$$ 23985 12152 13699 14177 -7877 -15753 -16432 -9868 6951 13927 12560 327 -10693 -25362 -36178
3620c6178m982Q068K9541M332q336J8420k208j2807K247O602j067J997j19j0173
$$ -36178 -41160 -33092 -3551 781 -7555 10865 8657 -4150 -1903 4699 3632 5629 5510 -4663
3606d663R455r227j9188o471j593K753k0559n566J3842N052P214k1184p707O742
$$ -4663 4792 -4435 -23623 -30094 -31687 -28934 -49493 -55059 -41217 -36165 -28951 -50135 -57842 -51100
3592e1100k496m956J7052Q147K1282J7141n264m561k89j0282n486O001L1049K2623
$$ -51100 -53596 -58552 -41500 -33353 -12071 5070 -194 -4755 -5044 -15326 -20812 -14811 16238 38861
3578C8861o812l3873J8560N616k7777j9678j0340J8225J8070j8472p342J5223
$$ 38861 32049 -1824 16736 22352 -5425 -25103 -35443 -17218 852 -17620 -24962 -9739
3566i739K0387K5392j5448j4020R447K0469Q472k126j0916j5885j0054j1471p373
$$ -9739 10648 36040 20592 6572 16019 36488 44960 42834 31918 16033 5979 -5492 -12865
3553a2865j8316M183L9727J2163K0929N466k4089l4002N782K3835K8041M766j742
$$ -12865 -31181 -26998 12729 24892 45821 51287 27198 -6804 -1022 22813 50854 55620 53878
3540E3878l6634l2077K3814N4309j7582k3760k894j7857K2459l341j1464K0092
$$ 53878 17244 -14833 8981 63290 45708 21948 19054 1197 23656 20315 8851 28943
3528B8943J3049m64j636j4862j8410N080k0801K6457j2119j38K1981j2584k2405
$$ 28943 41992 41528 39892 25030 6620 11700 -9101 17356 5237 5099 27080 14496 -7909
3515g909r085p757R926J4905N876Q691m3980l6516o07K807J6555N2919J367j1740
$$ -7909 -16994 -24751 -14825 80 5956 14647 -29333 -65849 -66456 -63649 -47094 5825 7192 -4548
3501d548r021O757J666K959j0117r77l244K322k452r242j9402J1135K4442J8983
$$ -4548 -13569 -6812 -5146 -2187 -12304 -13281 -16525 -14203 -16655 -25897 -45299 -34164 -9722 9261
3487I261q268j2325M435J3790K1179k093l315j5920k8865j4242J1731J7539j1078
$$ 9261 993 -11332 -6897 6893 28072 25979 22664 6744 -22121 -36363 -24632 -7093 -18171
3474a8171j1596p35J6877K2084P59m567K2368m1982P797J6721n721j2839j0734
$$ -18171 -29767 -30502 -13625 8459 9218 4651 27019 -14963 -7166 9555 3834 -9005 -19739
3461a9739k0010J7107L0528J1381M484m7393j0108k975o427J6925J6295K313p887
$$ -19739 -39749 -22642 7886 19267 23751 -23642 -33750 -36725 -43152 -26227 -9932 -7619 -15506
3448a5506M757P787J0093p068O892N401J0382K0006R779k0066j8426K362K0503
$$ -15506 -10749 -2962 7131 63 6955 12356 22738 42744 52523 32457 14031 16393 36896
3435C6896L518o034l524q917Q580Q057n522j9703k0027j8716J4342j0031j9358
$$ 36896 40414 34380 30856 21939 30519 38576 33054 13351 -6676 -25392 -11050 -21081 -40439
3422d0439K2227r738L9014J6236j6860k365J074j0367j8450k1650K3445L6280
$$ -40439 -18212 -27950 11064 27300 10440 8075 9149 -1218 -19668 -41318 -17873 18407
3410A8407M0595k2125r417P156q826j9968l4451o618J9429N90m843K8358p72j7433
$$ 18407 59002 36877 27460 34616 25790 5822 -28629 -35247 -15818 -15228 -20071 8287 7515 -9918
3396i918j6807J8992L2839P403q791j9997k4503J8813q10j9823p876j9207N36
$$ -9918 -26725 -7733 25106 32509 23718 3721 -20782 -1969 -2779 -22602 -30478 -49685 -49149
3383d9149j4105j7403J1339L7564K8950N079M009j8259K881K0061K1863L250l274
$$ -49149 -63254 -80657 -69318 -31754 -2804 2275 6284 -11975 -9094 10967 32830 36080 32806
3370C2806j5330M935j0338j7932P479j0227O075K2021J0157o415k3689k8563J4819
$$ 32806 17476 22411 12073 -5859 1620 -8607 -2532 19489 29646 23231 -458 -29021 -14202
3357a4202k6652j800J0576K361j0231K6296J5883J2600N685l5749k4125M0408
$$ -14202 -40854 -42654 -32078 -29717 -39948 -13652 2231 14831 20516 -15233 -39358 1050
3345A050O85L0964K60m9768j5227K0187P01q984Q238K3260Q478m396J1499l1479
$$ 1050 1735 32699 32959 -16809 -32036 -11849 -11148 -20132 -11894 11366 19844 15448 26947 -4532
3331d532l5464j302L5762M3660K517m084l621l1472l210j8909P387N736K1238
$$ -4532 -39996 -41298 -5536 38124 40641 36557 32936 1464 -1746 -20655 -13268 -7532 13706
3318A3706K415j6355j3096J0852p470j6058Q014J9208P828j2083k0355P318Q14
$$ 13706 16121 -234 -13330 -2478 -9948 -26006 -17992 1216 9044 -3039 -23394 -16076 -15262
3305a5262j492q06J669K945j3298n272O214p431k6914J6835K7173K900m454k5664
$$ -15262 -16754 -17560 -15891 -12946 -26244 -31516 -25302 -32733 -59647 -42812 -15639 -12739 -17193 -42857
3291d2857j8019k460L5012J6818L1432j6426R46J8259J0908J745k0628O452l738
$$ -42857 -60876 -63336 -28324 -11506 19926 3500 4446 22705 33613 35358 14730 21182 17444
3278A7444j3308L134q631j3547K1806j2225k4889J0015L0102j83Q681l933k4703
$$ 17444 4136 7270 -1361 -14908 6898 -5327 -30216 -20201 9901 9718 18399 14466 -10237
3265a0237J991k7128j2813K5429L5959J9615m0211j5767j0289R894K1552p264
$$ -10237 -8246 -35374 -48187 -22758 13201 32816 -7395 -23162 -33451 -23557 -2005 -9269
3253i269J3897J6541k2169o586O582m497l368k439j3801n678P217L1945J3756
$$ -9269 4628 21169 -1000 -7586 -1004 -5501 -8869 -11308 -25109 -30787 -23570 8375 22131
3240B2131q668j1043J634k0453J1464J2697k720J8706j5530k639O58j2310L946
$$ 22131 13463 2420 4054 -16399 -4935 7762 5042 23748 8218 5579 6237 -6073 -2127
3227b127j2354l664j4650k5488K4215J7036M34k4951K847J5687j2689O125J5753
$$ -2127 -14481 -18145 -32795 -58283 -34068 -17032 -16598 -41549 -38702 -23015 -35704 -29579 -13826
3214a3826J1122N973k5235L288K6702j0386j3595j0019q879N325M823K1506J6914
$$ -13826 -2704 3269 -21966 -18678 8024 -2362 -15957 -25976 -34855 -29530 -24707 -3201 13713
3201A3713R715j2333k1014j8J1579J3194R205J2110K142k8l1167P762L8127j910
$$ 13713 23428 11095 -9919 -9937 1642 14836 24041 36151 38293 38265 7098 14860 52987 51077
3187E1077k0427k055P086Q101k1701k7208j9130o759L370o048K870K9380N449
$$ 51077 30650 28595 35681 43782 22081 -5127 -24257 -31016 -27646 -33694 -30824 -1444 4005
3174D005M5731m811J4865j9196j6660q611j4138M283j0466p516q158k307m919
$$ 4005 49736 44925 59790 40594 23934 15323 1185 5468 -4998 -12514 -20672 -22979 -27898
3161b7898j0646J2139J3575p347j1983O18J9918R278j35J5807O921q069M193r97
$$ -27898 -38544 -26405 -12830 -20177 -32160 -31542 -11624 -2346 -2481 13326 20247 12178 16371 15374
3147A5374j1758K3977O932J19k4841J8473M956k3905j2651k3614k4P550M419k0730
$$ 15374 3616 27593 34525 34644 9803 28276 33232 9327 -3324 -26938 -26962 -19412 -14993 -35723
3133c5723J8240J9051j1714n971O423M785L927K4035R749J2849O912m643j2743
$$ -35723 -17483 1568 -10146 -16117 -9694 -4909 -982 23053 32802 45651 52563 47920 35177
3120C5177P190j2088l5085j751L816K110q63J5723M0985J8360l1641j4078J3069
$$ 35177 42367 30279 -4806 -6557 -2741 -631 -1494 14229 55214 73574 41933 27855 40924
3107D0924Q997k6060j2383j2219j170q30q76K86k2229j287q672m319J6673K9182
$$ 40924 49921 23861 11478 -741 -1911 -2741 -3617 -3331 -25560 -26847 -35519 -39838 -23165 6017
3093F017P553L1624j6067k3694n529n345n161R898J5476j8344j0277N880K6319
$$ 6017 13570 45194 29127 5433 -96 -5441 -10602 -704 14772 -3572 -13849 -7969 18350
3080A8350P5n214j4062j9355J594Q497J2827p899J0680J070j6178K069j3587L236
$$ 18350 18425 13211 -851 -20206 -18612 -10115 2712 -5187 5493 6563 -9615 -7546 -21133 -17897
3066a7897r357J4559K567q089J001j8455j2128k61j7196J7537K2242J8480r44
$$ -17897 -27254 -12695 -10128 -18217 -17216 -35671 -47799 -48060 -65256 -47719 -25477 -6997 -7941
3053g941l5652r468K5733N306j5368J1907L3248J4030k153j1512j2630J0426J1632
$$ -7941 -43593 -53061 -27328 -22022 -37390 -25483 7765 21795 19642 8130 -4500 5926 17558
3040A7558O844j0108K2832j2820L235j8307q454J3903J8695J418r612k4596l6282
$$ 17558 24402 14294 37126 24306 27541 9234 780 14683 33378 34796 25184 588 -35694
3027c5694p041J6974K4646J1950Q065K568l1117J1400l021J4463Q526j838Q737
$$ -35694 -42735 -25761 -1115 10835 18900 21468 -9649 1751 -1270 13193 21719 19881 28618
3014B8618N488j5375l0019p725L6305l156j7737K341n128j7144K502L2182J6962
$$ 28618 34106 18731 -11288 -19013 17292 14136 -3601 -1260 -6388 -23532 -21030 11152 28114
3001B8114j6861k043k4504j4359K8971R931J0487J899l066p833L0905j3480k1375
$$ 28114 11253 9210 -15294 -29653 -682 9249 19736 21635 18569 10736 41641 28161 6786
2988F786k8262j1778m96P897K650K845K955j0445n736Q742l035J7208R520p081
$$ 6786 -21476 -33254 -33750 -25853 -23203 -20358 -17403 -27848 -33584 -24842 -27877 -10669 -1149 -8230
2974h230r922j1909P946K594Q296M412R339Q790k430j1222L224j0260k9787j1433
$$ -8230 -18152 -30061 -22115 -19521 -11225 -6813 2526 11316 8886 -2336 888 -9372 -39159 -50592
2960e0592L6623l147j3070n381J6160J112l160j4335K7547K2395k1885J6213K5825
$$ -50592 -13969 -17116 -30186 -35567 -19407 -18295 -21455 -35790 -8243 14152 -7733 8480 34305
2947C4305j3941J1544r911m6498o245p084K0354J6342j1053j3683N41l84j1957
$$ 34305 20364 31908 21997 -24501 -30746 -37830 -17476 -1134 -12187 -25870 -25329 -25713 -37670
2934c7670p512J8446K2108k1420j4174K9326J5390j0154j647j6161j4853O576
$$ -37670 -45182 -26736 -4628 -26048 -40222 -10896 4494 -5660 -7307 -23468 -38321 -31745
2922c1745L7770J9726m820J5252K4739k0018m520j453j6182j8930j3716q325J1405
$$ -31745 6025 25751 20931 36183 60922 40904 36384 34931 18749 -181 -13897 -22222 -10817
2909a0817J5382j009k4657m8684j968M271K7913K0542K5229K159j1271R527o19
$$ -10817 4565 3556 -21101 -69785 -71753 -67482 -39569 -19027 6202 8361 -2910 6617 5998
2896E998J683K1144K506o0216l1628J1270K2521r325L485O567J5110N436R986
$$ 5998 7681 28825 31331 -28885 -60513 -49243 -26722 -36047 -32562 -25995 -10885 -5449 4537
2883D537j628k8688q60J6086K8879P860J6044j7115k3864n108J4768p873P68J0140
$$ 4537 2909 -25779 -26639 -10553 18326 26186 42230 25115 1251 -3857 10911 3038 3806 13946
2869A3946O836J674m024j016j2090m573R15j2020n863J1014j4753j3673K2286
$$ 13946 20782 22456 18432 17416 5326 753 1668 -10352 -16215 -5201 -19954 -33627 -11341
2856a1341J9696k5498N59K1377J2119R675M124n839k661K4360j8181k859j1985
$$ -11341 8355 -17143 -16584 4793 16912 26587 30711 24872 22211 46571 28390 25531 13546
2843A3546l4476j0037J5698J606n37r256l573J1431j5197L1407K8058n026J4147
$$ 13546 -20930 -30967 -15269 -13663 -14200 -23456 -27029 -15598 -30795 612 28670 23644 37791
2830C7791l72J384l3206q385k970j1207K180j3312k6475J3183M920M771j0617
$$ 37791 37419 38803 5597 -2788 -5758 -16965 -14785 -28097 -54572 -41389 -36469 -31698 -42315
2817d2315J3378O855p272o840O830M243J7321k0066k2476J0254J501k4284O490
$$ -42315 -28937 -22082 -29354 -36194 -29364 -25121 -7800 -27866 -50342 -40088 -38587 -62871 -56381
2804e6381J8933J286J270q283O543M022o321k963k493J4521K692J585J6060K197
$$ -56381 -37448 -36162 -34892 -43175 -36632 -32610 -38931 -41894 -44387 -29866 -27174 -25589 -9529 -7332
2790g332j505l453N657P075j2706J6123j2888j3491K508J2602L4867j0478m2824
$$ -7332 -8837 -12290 -6633 442 -12264 3859 -9029 -22520 -20012 -7410 27457 16979 -25845
2777b5845m0963P382L2341K2756J0939K9982N133k0689j7902j1692J3141K9038
$$ -25845 -66808 -59426 -27085 -4329 6610 36592 41725 21036 3134 -8558 4583 33621
2765C3621L1068k2025m1112j1422k5652m2671j2616J8479K5427J2807K3658K4706
$$ 33621 64689 42664 1552 -9870 -35522 -78193 -90809 -72330 -46903 -34096 -10438 14268
2753A4268j2042J0881J3895J8496q461K61j3412J6582j3876j1549r183M121n401
$$ 14268 2226 13107 27002 45498 37037 37298 23886 40468 26592 15043 5860 9981 4580
2740D580j7736j807J0255J6025N704J970P904j6629j776J1649j3976j8093R539
$$ 4580 -13156 -14963 -4708 11317 17021 18991 26895 10266 8490 20139 6163 -11930 -2391
2727b391j824J4043K590q816L023K941j7513k1180K5819K6110k1213k0374J7072
$$ -2391 -4215 9828 12418 3602 6625 9566 -7947 -29127 -3308 22802 1589 -18785 -1713
2714a713j88L22K0262M214j7943O261J432O145O98j924m0654r370l77q122P060
$$ -1713 -1901 -1579 18683 22897 4954 11215 12647 18792 19490 17566 -23088 -32458 -32835 -40957 -33897
2699c3897J5779K9603j7632k1036J4352J1847k7981J3736K1710k6472r717j1663
$$ -33897 -18118 11485 -6147 -27183 -12831 -984 -28965 -15229 6481 -19991 -29708 -41371
2687d1371q882J6691J5420j0084J0649P755p733M375J1300k0187L5969K0526n065
$$ -41371 -50253 -33562 -18142 -28226 -17577 -9822 -17555 -13180 -1880 -22067 13902 34428 29363
2674B9363J2935k2530k5598o531K1640N507q68r419j7929n496J262R433J8630
$$ 29363 42298 19768 -5830 -12361 9279 14786 13918 4499 -13430 -18926 -17664 -8231 10399
2661A0399j7359L0886J0614j6120J3822J1652K0910j0461l3448k561J5520R816
$$ 10399 -6960 23926 34540 18420 32242 43894 64804 54343 20895 18334 33854 43670
2649D3670k5278l2989n673K0167p109K159J7671k6154j9747J9982K520M19L360
$$ 43670 18392 -14597 -20270 -103 -7212 -5053 12618 -13536 -33283 -13301 -10781 -10362 -7002
2636g002k0996K1916L837p693L2880K2103j4j9246R063P770l1662j6433j883P05
$$ -7002 -27998 -6082 -2245 -9938 22942 45045 45031 25785 34848 42618 10956 -5477 -7360 -6655
2622f655K10k0322J7845K8295q944J4230K0601J5643j6160l771r303j9280p164
$$ -6655 -6445 -26767 -8922 19373 10429 24659 45260 60903 44743 40972 31669 12389 5225
2609E225k3584p771l593O889J1287J3012J5021M867r714p354m0592j1821L6056
$$ 5225 -18359 -26130 -29723 -22834 -11547 1465 16486 21353 11639 4285 -36307 -48128 -12072
$$ [...]
##END NTUPLES=NMR SPECTRUM
##END=
