##TITLE=Analysis number 322573
Compound Code cc 53409
Book Reference 503/31/4
Project Code adrs
Chemist Name victoriam
##JCAMPDX= 6.0         $$ Bruker NMR JCAMP-DX V2.0
##DATA TYPE= NMR SPECTRUM
##DATA CLASS= NTUPLES
##ORIGIN= Bruker BioSpin GmbH
##OWNER= nmr
$$ XWIN-NMR		Version 3.5
$$ Fri Sep 29 11:23:37 2006 GMT Daylight Time (UT+1h)  MAYBRIDGE\nmr@NMR_250MHZ
##.OBSERVE FREQUENCY= 250.131544655141
##.OBSERVE NUCLEUS= ^1H
##.ACQUISITION MODE= SIMULTANEOUS (DQD)
##.ACQUISITION SCHEME= undefined
##.AVERAGES= 16
##.DIGITISER RES= 18
##SPECTROMETER/DATA SYSTEM= dpx250
##.PULSE SEQUENCE= zg30
##.SOLVENT NAME= CDCl3
##.SHIFT REFERENCE= (INTERNAL, CDCl3, 0, 16.522)
##AUDIT TRAIL= $$ (NUMBER, WHEN, WHO, WHERE, WHAT)
$$ ##TITLE= Audit trail, XWIN-NMR		Version 3.5
$$ ##JCAMPDX= 5.01
$$ ##ORIGIN= Bruker BioSpin GmbH
$$ ##OWNER= nmr
$$ C:\u/data/dgb/nmr/ADRS/2080/pdata/1/auditp.txt
$$ ##AUDIT TRAIL=  $$ (NUMBER, WHEN, WHO, WHERE, WHAT)
(   1,<2006-09-29 11:23:08.51 +100>,<MAYBRIDGE\nmr>,<NMR_250MHZ>,
      <created by zg, POWCHK disabled, PULCHK disabled
       configuration hash MD5:
       E2 DF 36 D8 04 B2 41 60 5A D7 A3 38 5A 4B D0 FE
       data hash MD5: 64K
       85 95 48 A2 81 D0 FE 12 0C 6E CB B9 AD 1F D5 8C>)
(   2,<2006-09-29 11:23:24.66 +100>,<MAYBRIDGE\nmr>,<NMR_250MHZ>,
      <Start of raw data processing
       ef LB = 0.3 FT_mod = 6 PKNL = 1 SI = 32K 
       data hash MD5: 32K
       03 48 32 E9 5E C5 12 0B A6 09 C0 C7 68 46 0E 9A>)
(   3,<2006-09-29 11:23:26.49 +100>,<MAYBRIDGE\nmr>,<NMR_250MHZ>,
      <apk 
       data hash MD5: 32K
       C5 8B D9 34 F6 C1 28 2C 21 99 6F 2C C0 9E 3B 76>)
(   4,<2006-09-29 11:23:27.29 +100>,<MAYBRIDGE\nmr>,<NMR_250MHZ>,
      <abs ABSG = 5 
       data hash MD5: 32K
       11 88 F3 42 05 8A 63 16 F4 9A 1B 03 A4 9D C5 7B>)
$$ ##END=
$$ 
$$ hash MD5
$$ DA 65 B9 5F 1C 9F 32 6A 5F B2 A9 61 0A 61 65 D1
##$RELAX= 
##$RELAX= 
##$RELAX= 
##$RELAX= 
##$RELAX= 
##$RELAX= 
##$RELAX= 
$$ Bruker specific parameters
$$ --------------------------
##$DU= <C:\u>
##$EXPNO= 2080
##$NAME= <ADRS>
##$PROCNO= 1
##$TYPE= <nmr>
##$USER= <dgb>
##$AMP= (0..31)
100 100 100 100 100 100 100 100 100 100 100 100 100 100 100 100 100 100 
100 100 100 100 100 100 100 100 100 100 100 100 100 100 
##$AQSEQ= 0
##$AQ_mod= 3
##$AUNM= <au_zg>
##$AUTOPOS= <20 >
##$BF1= 250.13
##$BF2= 250.13
##$BF3= 250.13
##$BF4= 250.13
##$BF5= 500.13
##$BF6= 500.13
##$BF7= 500.13
##$BF8= 500.13
##$BYTORDA= 1
##$CFDGTYP= 0
##$CFRGTYP= 5
##$CHEMSTR= <none>
##$CNST= (0..31)
1 1 145 1 1 1 1 1 1 1 1 1 1 1 1 1 1 1 1 1 1 1 1 1 1 1 1 1 1 1 1 1 
##$CPDPRG= <>
##$CPDPRG1= <>
##$CPDPRG2= <>
##$CPDPRG3= <>
##$CPDPRG4= <mlev>
##$CPDPRG5= <mlev>
##$CPDPRG6= <mlev>
##$CPDPRG7= <mlev>
##$CPDPRG8= <mlev>
##$CPDPRGB= <>
##$CPDPRGT= <>
##$D= (0..31)
0 1 0 0 0 0 0 0 0 0.06 0 0 0 0 0 0 0.0002 0 0 0 0 0 0 0 0 0 0 0 0 0 0 
0 
##$DATE= 1159525387
##$DBL= (0..7)
120 120 120 120 120 120 120 120 
##$DBP= (0..7)
150 150 150 150 150 150 150 150 
##$DBP07= 0
##$DBPNAM0= <>
##$DBPNAM1= <>
$$ [...]
##$SUBNAM7= <"">
##$SUBNAM8= <"">
##$SUBNAM9= <"">
##$SW= 20.6930455092707
##$SWIBOX= (0..15)
0 0 3 0 0 0 0 0 0 0 0 0 0 0 0 0 
##$SW_h= 5175.983436853
##$TD= 65536
##$TD0= 1
##$TE= 295.16
##$TE2= 300
##$TE3= 300
##$TEG= 300
##$TL= (0..7)
0 120 120 120 120 120 120 120 
##$TP= (0..7)
150 150 150 150 150 150 150 150 
##$TP07= 0
##$TPNAME0= <>
##$TPNAME1= <>
##$TPNAME2= <>
##$TPNAME3= <>
##$TPNAME4= <>
##$TPNAME5= <>
##$TPNAME6= <>
##$TPNAME7= <>
##$TPOAL= (0..7)
0.5 0.5 0.5 0.5 0.5 0.5 0.5 0.5 
##$TPOFFS= (0..7)
0 0 0 0 0 0 0 0 
##$TUNHIN= 0
##$TUNHOUT= 0
##$TUNXOUT= 0
##$USERA1= <user>
##$USERA2= <user>
##$USERA3= <user>
##$USERA4= <user>
##$USERA5= <user>
##$V9= 5
##$VALIST= <valist>
##$VCLIST= <CCCCCCCCCCCCCCC>
##$VD= 0
##$VDLIST= <DDDDDDDDDDDDDDD>
##$VPLIST= <PPPPPPPPPPPPPPP>
##$VTLIST= <TTTTTTTTTTTTTTT>
##$WBST= 1024
##$WBSW= 4
##$XGAIN= (0..3)
0 0 0 0 
##$XL= 0
##$YL= 0
##$YMAX_a= 485752
##$YMIN_a= -563337
##$ZGOPTNS= <>
##$ZL1= 120
##$ZL2= 120
##$ZL3= 120
##$ZL4= 120
##$ABSF1= 16.522
##$ABSF2= -4.171173
##$ABSG= 5
##$ABSL= 3
##$ALPHA= 0
##$AQORDER= 0
##$ASSFAC= 0
##$ASSFACI= 0
##$ASSFACX= 0
##$ASSWID= 0
##$AUNMP= <proc_1d>
##$AZFE= 0.1
##$AZFW= 0.1
##$BCFW= 0
##$BC_mod= 0
##$BYTORDP= 0
##$COROFFS= 0
##$CY= 12.5
##$DATMOD= 1
##$DC= 0
##$DFILT= <>
##$DTYPP= 0
##$F1P= 14.0000005364418
##$F2P= -0.99999901652339
##$FCOR= 0.5
##$FTSIZE= 32768
##$FT_mod= 6
##$GAMMA= 0
##$GB= 0
##$INTBC= 1
##$INTSCL= 1
##$ISEN= 128
##$LB= 0.3
##$LEV0= 0
##$LPBIN= 0
##$MAXI= 10000
##$MC2= 0
##$MEAN= 0
##$ME_mod= 0
##$MI= 0
##$NCOEF= 0
##$NC_proc= -5
##$NLEV= 6
##$NOISF1= 0
##$NOISF2= 0
##$NSP= 0
##$NTH_PI= 0
##$NZP= 0
##$OFFSET= 16.522
##$PC= 1
##$PHC0= 154.7454
##$PHC1= 9.044984
##$PH_mod= 1
##$PKNL= yes
##$PPARMOD= 0
##$PSCAL= 4
##$PSIGN= 0
##$REVERSE= no
##$SF= 250.13
##$SI= 32768
##$SIGF1= 0
##$SIGF2= 0
##$SINO= 400
##$SIOLD= 32768
##$SREGLST= <1H.CDCl3>
##$SSB= 0
##$STSI= 32768
##$STSR= 0
##$SW_p= 5175.98343685301
##$SYMM= 0
##$S_DEV= 0
##$TDeff= 65536
##$TDoff= 0
##$TI= <Analysis number 999999
Compound Code 99
Book Reference 9
Project Code 9>
##$TILT= no
##$TM1= 0
##$TM2= 0
##$TOPLEV= 0
##$USERP1= <user>
##$USERP2= <user>
##$USERP3= <user>
##$USERP4= <user>
##$USERP5= <user>
##$WDW= 1
##$XDIM= 32768
##$YMAX_p= 402469018
##$YMIN_p= -626743
$$ End of Bruker specific parameters
$$ ---------------------------------
##NTUPLES= NMR SPECTRUM
##VAR_NAME=  FREQUENCY,     SPECTRUM/REAL,   SPECTRUM/IMAG
##SYMBOL=    X,             R,               I
##VAR_TYPE=  INDEPENDENT,   DEPENDENT,       DEPENDENT
##VAR_FORM=  AFFN,          ASDF,            ASDF
##VAR_DIM=   32768,         32768,           32768
##UNITS=     HZ,            ARBITRARY UNITS, ARBITRARY UNITS
##FACTOR=    0.157963299565203, 1,           1
##FIRST=     4132.6476996994, 0,             0
##LAST=      -1043.33573715361, 0,           0
##MIN=       -1043.33573715361, -626743,     0
##MAX=       4132.6476996994, 402469018,     0
$$ Real data points
##PAGE= N=1
##DATA TABLE= (X++(R..R)), XYDATA
$$ [...]
$$ plain form
17772 -144921 -18034 -76426 -121857 -60447 -33589 -44906 -33335 66599 159726 316261 386227
17761 386227 286732 270782 231002 365014 376738 464873 565972 656777 810488 813210 586426
17750 586426 539741 414687 217149 309448 443692 317354 250007 175642 137709 263143
17740 263143 485709 546504 714008 665408 548089 437440 509655 632256 651733 743994
17730 743994 743167 788457 810544 594848 500374 558048 419133 238407 259371 153816 51031
17719 51031 -40643 -49449 109569 102705 -22421 -37115 -22652 11948 -105476 -129490 -150898
17708 -150898 -150738 -5590 196090 236725 46841 34602 84093 111440 194989 150102 141052
17697 141052 234184 202790 112135 -1721 -33496 -16902 171 223420 69401 41629 -62580
$$ packed form
17772a44921J26887n8392m5431O1410K6858j1317J1571R9934R3127J56535O9966
17761C86227r9495j5950l9780J34012J1724Q8135J01099R0805J53711K722k26784
17750E86426m6685j25054j97538R2299J34244j26338o7347p4365l7933J25434
17740B63143K22566O0795J67504m8600j17319j10649P2215J22601J9477R2261
17730G43994q27M5290K2087k15696r4474N7674j38915j80726K0964j05555j02785
17719E1031r1674q806J59018o864j25126j4694J4463L4600j17424k4014k1408
17708a50898J60J45148K01680M0635j89884j2239M9491K7347Q3549m4887r050
17697A41052R3132l1394r0655j13856l1775J6594J7073K23249j54019k7772j04209
$$ plain form
17686 -62580 -31674 117760 329418 291261 231981 143048 251059 221632 314161 265811 89239
17675 89239 87875 -43331 -94102 -55687 -63026 27315 95845 -111080 -197369 22374 -16415
17664 -16415 64036 129966 21544 31582 93379 132907 -20839 -149617 -183715 -231328 -155735
17653 -155735 200460 212952 4399 -127942 26034 214001 207006 207804 29427 82649 42359
17642 42359 -54706 -79023 -160628 -90335 -107767 -159341 -52240 -31993 21386 158632 212344
17631 212344 96492 -54351 142751 140668 -66116 -30673 89594 40761 -54590 81507
17621 81507 160494 25296 7980 157248 133556 173898 270004 264676 125410 -58062 -325352
17610 -325352 -253676 -135033 -110879 63600 122294 127513 124822 226984 335794 333253 252316
$$ packed form
17686f2580L0906J49434K11658l8157n9280q8933J08011k9427R2529m8350j76572
17675H9239j364j31206n0771L8415p339R0341O8530k06925q6289K19743l8789
17664a6415Q0451O5930j08422J0038O1797L9528j53746j28778l4098m7613P5593
17653a55735L56195J2492k08553j32341J53976J87967o995P98j78377N3222m0290
17642D2359r7065k4317q1605P0293j7432n1574J07101K0247N3379J37246N3712
17631B12344j15852j50843J97102k083k06784L5443J20267m8833r5351J36097
17621H1507P8987j35198j7316J49268k3692M0342R6106n328j39266j83472k67290
17610c25352P1676J18643K4154J74479N8694N219k691J02162J08810k541q0937
$$ plain form
17599 252316 209006 131424 -68527 -102185 -5821 67105 71469 133365 268930 325660 261756
17588 261756 178719 140831 127783 -44156 114145 172969 236878 101204 -76524 -109801 -100822
17577 -100822 51857 15105 68169 7865 5213 -16423 -38670 -101744 -156100 -80239 -11471
17566 -11471 165095 220788 -20961 -118177 -121870 -139585 -226924 -280686 -220848 -216191 -48778
17555 -48778 -45990 172458 242556 167299 98486 105860 125235 191296 46050 52305 165659 238535
17543 238535 91615 13343 22533 73159 152641 122982 60070 94484 118223 172476 149477
17532 149477 -68855 -7828 -75118 -40572 -71888 -127431 -72413 9259 52913 154343 147434
17521 147434 205991 64031 -50185 -98630 -47222 -55032 49670 142763 219154 181662 239947
$$ packed form
17599B52316m3310p7582j99951l3658R6364P2926M364O1896J35565N6730o3904
17588B61756q3037l7888j3048j71939J58301N8824O3909j35674j77728l3277Q979
17577a00822J52679l6752N3064o0304k652k1636k2247o3074n4356P5861O8768
17566a1471J76566N5693k41749r7216l693j7715q7339n3762N9838M657J67413
17555d8778K788K18448P0098p5257o8813P374J9375O6061j45246O255J13354P2876
17543B38535j46920p8272R190N0626P9482k9659o2912L4414K3739N4253k2999
17532A49477k18332O1027o7290L4546l1316n5543N5018Q1672M3654J01430o909
17521A47434N8557j41960j14216m8445N1408p810J04702R3093P6391l7492N8285
$$ plain form
17510 239947 243544 255102 218314 258468 219544 135839 129433 245717 189130 97799 103374 22616
17498 22616 -25769 -3174 55713 200320 224998 161000 217905 287898 128744 -23098 -94349
17487 -94349 -100947 -147565 -75862 -5505 62302 28484 -48248 -20308 87717 197045 359052
17476 359052 433483 411895 371970 234257 -22864 -153375 -139104 -32839 -53925 78447
17466 78447 14634 181761 116401 -36059 178848 229716 301429 359170 395729 315673 232018
17455 232018 237077 162854 178164 192624 143870 10015 27049 300124 503067 717127 968930
17444 968930 1226858 1087884 719724 492393 426361 384691 172218 97836 37492 -16203
17434 -16203 -134387 -59998 -71279 70239 176828 69863 -53644 8280 865 68747 105188
$$ packed form
17510B39947L597J1558l6788M0154l8924q3705o406J16284n6587r1331N575q0758
17498B2616m8385K2595N8887J44607K4678o3998N6905O9993j59154j51842p1251
17487i4349o598m6618P1703P0357O7807l3818p6732K7940J08025J09328J62007
17476C59052P4431k1588l9925j37713k57121j30511J4271J06265k1086J32372
17466G8447o3813J67127o5360j52460K14907N0868P1713N7741L6559q0056q3655
17455B32018N059p4223J5310J4460m8754j33855J7034K73075K02943K14060K51803
17444I68930K57928j38974l68160k27331o6032m1670k12473p4382o0344n3695
17434a6203j18184P4389j1281J41518J06589j06965j23507O1924p415O7882L6441
$$ plain form
17423 105188 152574 223029 142188 -104226 -161675 -72381 92857 242263 188560 230042 110857
17412 110857 56346 -29107 1978 -125322 -52638 143129 183384 344 -79754 -91666 -136918
17401 -136918 -5697 164044 102955 47403 32617 47523 -13960 9781 155797 232326 175951
17390 175951 65734 91072 -45552 7819 6800 -61257 -75376 -7524 -49340 34054 122168
17379 122168 105851 123239 92133 51019 -85825 -79800 -98531 8242 92123 72309 29779
17368 29779 35975 2887 19885 -49340 -159738 -19767 115778 241988 268051 148003 55486
17357 55486 61003 73622 -99099 59068 353833 384012 241034 69191 18305 80269 -28
17346 -28 83490 199533 221361 250287 157969 154920 252325 265798 214896 82726 157073 273907
$$ packed form
17423A05188M7386P0455q0841k46414n7449Q9294J65238J49406n3703M1482j19185
17412A10857n4511q5453L1085j27300P2684J95767M0255j83040q0098j1912m5252
17401a36918J31221J69741o1089n5552j4786J4906o1483K3741J46016P6529n6375
17390A75951j10217K5338j36624N3371j019o8057j4119O7852m1816Q3394Q8114
17379A22168j6317J7388l1106m1114j36844O025j8731J06773Q3881j9814m2530
17368B9779O196l3088J6998o9225j10398J39971J35545J26210K6063j20048r2517
17357E5486N517J2619j72721J58167K94765L0179j42978j71843n0886O1964q0297
17346b8Q3518J16043K1828K8926r2318l049R7405J3473n0902j32170P4347J16834
$$ plain form
17334 273907 214691 224906 310515 187063 130864 143043 107333 54151 130271 385806 356103
17323 356103 342197 333783 410331 453349 510861 461086 582476 539388 320974 132133 108012
17312 108012 164865 211103 284598 367044 218394 65564 98075 173430 310556 438065 653774
17301 653774 664998 647647 663132 636626 707852 700479 757382 730619 568325 592221 707116
17290 707116 692497 635889 723549 864114 1027541 1118124 1020148 1030613 982665 930173 1060777
17279 1060777 1233740 1285891 1575944 1607383 1605836 1546968 1766961 1938866 1989634 2164432
17269 2164432 2227012 2278986 2386402 2236230 2057677 2224260 2583378 2766504 3125007 3405554
17259 3405554 3869308 4488569 4947659 5313710 5842787 6780061 8031587 9297016 10646660
$$ packed form
17334B73907n9216J0215Q5609j23452n6199J2179l5710n3182P6120K55535k9703
17323C56103j3906q414P6548M3018N7512m9775J21390m3088k18414j88841k4121
17312A08012N6853M6238P3495Q2446j48650j52830L2511P5355J37126J27509K15709
17301F53774J1224j7351J5485k6506P1226p373N6903k6763j62294K3896J14895
17290G07116j4619n6608Q7660J40565J63427R0583r7976J0465m7948n2492J30604
17279A060777J72963N2151K90053L1439j547n8868K19993J71905N0768J74798
17269B164432O2580N1974J07416j50172j78553J66583L59118J83126L58503K80547
17259C405554M63754O19261M59090L66051N29077R37274J251526J265429J349644
$$ plain form
17250 10646660 12299010 14637367 18078877 23107950 30193480 38908581 48698514 60379916
17242 60379916 75873052 94784567 111137942 117873367 120282752 128967328 142757643
17235 142757643 147732793 133212681 111594336 98566665 92590232 85394659 72459723
17228 72459723 58797404 49177086 43920766 42104677 43286570 47124950 53275529 61195263
17220 61195263 70357185 82125668 98276686 116977751 130812749 134293530 136558550
17213 136558550 146698328 159150960 158115603 137887811 115987075 103870140 97147357
17206 97147357 86984794 70882536 55632358 45126013 38873570 34808820 31861984
17199 31861984 29383004 27395412 25879180 24679450 23472386 22262302 21200444 20239116
$$ packed form
17250A0646660J652350K338357L441510N029073P085530Q715101R789933J1681402
17242F0379916J5493136J8911515J6353375O735425K409385Q684576J3790315
17235A42757643M975150j4520112k1618345j3027671n976433p195573j2934936
17228G2459723j3662319r620318n256320j816089J181893L838380O150579P919734
17220F1195263R161922J1768483J6151018J8701065J3834998L480781K265020
17213A36558550J0139778J2452632j035357k0227792k1900736j2116935o722783
17206I7147357j0162563j6102258j5250178j0506345o252443m064750k946836
17199C1861984k478980j987592j516232j199730j207064j210084j061858r61328
$$ plain form
17191 20239116 19161793 18280899 17505429 17015804 16434362 15926223 15323607 14859864 14520197
17182 14520197 14309922 14095691 13944794 13545378 13090492 12748820 12450491 12051557 11509242
17173 11509242 11025589 10742508 10548740 10188427 9658812 9556668 9482473 9192931 8839089
17164 8839089 8407082 8104412 7908912 7869838 7815172 7673268 7473466 7283923 7112383 6890160
17154 6890160 6504160 6299269 6220513 6073423 5924394 5840355 5542349 5486481 5276650 5106879
17144 5106879 4814273 4686564 4546702 4382492 4337915 4256992 4179309 4112514 4045909 4027195
17134 4027195 3847472 3618701 3512202 3516676 3653914 3646064 3634369 3580475 3483252 3398636 3208072
17123 3208072 3074068 2869016 2749148 2726161 2786157 2648180 2640783 2503728 2415092 2354448
$$ packed form
17191B0239116j077323q80894p75470m89625n81442n08139o02616m63743l39667
17182A4520197k10275k14231j50897l99416m54886l41672k98329l98934n42315
17173A1509242m83653k83081j93768l60313n29615j02144p4195k89542l53842
17164H839089m32007l02670j95500l9074n4666j41904j99802j89543j71540k22223
17154F890160l86000k04891p8756j47090j49029q4039k98006n5868k09831j69771
17144E106879k92606j27709j39862j64210m4577q0923p7683o6795o6605j8714
17134D027195j79723k28771j06499M474J37238p850j1695n3894r7223q4616j90564
17123C208072j34004k05052j19868k2987N9996j37977p397j37055q8636o0644
$$ plain form
17113 2354448 2283528 2232051 2256926 2174690 2169588 2165381 1932097 2030555 2130433 2078150 2077810 1964347
17101 1964347 1975926 1903328 1780658 1674010 1656531 1565488 1473880 1350225 1452652 1437942
17091 1437942 1295604 1138718 1298586 1412048 1485612 1489217 1304437 1063807 827455 792957
17081 792957 920578 1024297 1162568 1164690 1200308 1123178 1088748 1030452 1064605 1003598 966972
17070 966972 1022233 1056074 964746 815413 665974 742621 681500 578958 447792 418823 486426
17059 486426 567301 663375 735154 855210 609499 466036 453057 351153 179644 56505
17049 56505 220395 327255 337154 216114 159842 250137 303116 145040 174455 120446 138097
17038 138097 240303 225540 212156 213267 127979 56780 -11749 168029 294911 250941 165461
$$ packed form
17113B354448p0920n1477K4875q2236n102m207k33284R8458R9878n2283l40j13463
17101A964347J1579p2598j22670j06648j7479r1043r1608j23655J02427j4710
17091A437942j42338j56886J59868J13462P3564L605j84780k40630k36352l4498
17081G92957J27621J03719J38271K122L5618p7130l4430n8296L4153o1007l6626
17070I66972N5261L3841r1328j49333j49439P6647o1121j02542j31166k8969O7603
17059D86426Q0875R6074P1779J20056k45711j43463j2979j01904j71509j23139
17049E6505J63890J06860R899j21040n6272R0295N2979j58076K9415n4009J7651
17038A38097J02206j4763j3384J111q5288p1199o8529J79778J26882m3970q5480
$$ plain form
17027 165461 118387 118336 202840 199698 143810 95351 381743 512782 372711 228362 193559
17016 193559 215606 299117 326563 180211 16115 -3630 143553 277937 337772 246397 199813
17005 199813 181589 272961 147730 114071 180852 246133 256630 147940 102727 136328 240362
16994 240362 259331 28625 -85011 203926 228357 123156 21179 -19571 206407 199929
16984 199929 171707 14907 -83319 -113704 -109292 223809 340535 82013 246331 369670
16974 369670 279529 183578 169706 -11578 170048 315007 198807 151660 132501 136560 134933
16963 134933 -69096 -4461 223716 263981 236900 207330 187788 122461 175897 108668 130691
16952 130691 207755 231088 46447 81757 251812 375673 308247 313267 496573 507765 319085
$$ packed form
17027A65461m7074n1Q4504l142n5888m8459K86392J31039j40071j44349l4803
17016A93559K2047Q3511K7446j46352j64096j9745J47183J34384N9835r1375m6584
17005A99813j8224R1372j25231l3659O6781O5281J0497j08690m5213L3601J04034
16994B40362J8969k30706j13636K88937K4431j05201j01977m0750K25978o478
16984A99929k8222j56800r8226l0385M412L33101J16726k58522J64318J23339
16974C69670r0141r5951j3872j81284J81626J44959j16200m7147j9159M059j627
16963A34933k04029O4635K28177M0265k7081k9570j9542o5327N3436o7229K2023
16952A30691P7064K3333j84641L5310J70055J23861o7426N020J83306J1192j88680
$$ plain form
16941 319085 216038 120072 -37294 69490 168010 206636 168859 61774 69437 264486 203532
16930 203532 109591 16273 73610 114244 119609 98551 26031 -45086 -93948 -103055 -171466 -114123
16918 -114123 57651 174262 174506 -43432 -326490 -216478 -187421 -202319 -134354 -127804 -60476
16907 -60476 8639 53682 83542 -114001 -268949 -104416 -78927 -85766 -119624 -165649 -352802
16896 -352802 -319872 -198859 -54321 -98 -16475 -283054 -460629 -391775 -236885 23364
16886 23364 123784 -36763 -74703 14692 119279 69878 77403 -37291 -89043 -117370 -68899
16875 -68899 28108 -6822 -55582 -220403 -245059 -281970 -246918 -309060 -405141 -459148 -403697
16864 -403697 -262554 -121769 57367 112339 72052 91937 90038 81297 -59573 -92687 46200
$$ packed form
16941C19085j03047r5966j57366J06784R8520L8626l7777j07085P663J95049o0954
16930B03532r3941r3318N7337M0634N365k1058p2520p1117m8862r107o8411N7343
16918a14123J71774J16611K44k17938k83058J10012K9057j4898O7965O550O7328
16907f0476O9115M5043K9860j97543j54948J64533K5489o839l3858m6025j87153
16896c52802L2930J21013J44538N4223j6377k66579j77575O8854J54890K60249
16886B3364J00420j60547l7940Q9395J04587m9401P525j14694n1752k8327M8471
16875f8899R7007l4930m8760j64821k4656l6911L5052o2142r6081n4007N5451
16864d03697J41143J40785J79136N4972m0287J9885j899q741j40870l3114J38887
$$ plain form
16853 46200 147334 -5885 -73529 -69086 -92699 -303864 -280601 -187313 -136659 -50025 44361
16842 44361 68631 -15419 -260350 -257682 -317600 -285979 -210813 -87597 -103412 -109124 -60829 -19455
16830 -19455 -41318 -24835 -52895 -129272 -126805 -95678 -28827 -122470 -81401 123058 205639 91572
16818 91572 -34560 -215642 -146598 -18338 86448 205573 251922 105230 6561 -73524
16808 -73524 -95426 -74127 9869 282017 171517 -43631 52052 80381 212675 239336 234422
16797 234422 226376 268848 319002 237928 701 -73287 64029 46873 46141 -26868 -9661 149686
16785 149686 272162 119949 -67111 5443 -21666 -151781 -109995 9853 35087 90003
16775 90003 188670 133562 -52391 -25615 -30654 -101686 -217915 -116765 90686 106288 211080
$$ packed form
16853D6200J01134j53219o7644M443k3613k11165K3263R3288N0654Q6634R4386
16842D4361K4270q4050k44931K668n9918L1621P5166J23216j5815n712M8295M1374
16830a9455k1863J6483k8060p6377K467L1127O6851r3643M1069K04459Q2581j14067
16818I1572j26132j81082O9044J28260J04786J19125M6349j46692r8669q0085
16808g3524k1902K1299Q3996K72148j10500k15148R5683K8329J32294K6661m914
16797B34422q046M2472N0154q1074k37227p3988J37316j7156p32p3009J7207J59347
16785A49686J22476j52213j87060P2554k7109j30115M1786J19848K5234N4916
16775I0003R8667n5108j85953K6776n039p1032j16229J01150K07451J5602J04792
$$ plain form
16764 211080 226801 141859 240125 219997 212511 185161 -2426 -34326 -57205 -79791 -43804
16753 -43804 -46281 -96397 -144509 -201247 -377178 -232255 -113870 -216031 -174077 -28150 180925
16742 180925 336826 169932 121667 80466 212827 305693 143159 155603 199759 179817 128226
16731 128226 194579 64034 137385 175029 205563 354111 342644 297696 479750 587120 578076
16720 578076 408853 578848 596898 570345 753953 567889 486227 489893 689518 492561
16710 492561 179912 71473 279989 456902 480616 309094 153838 55878 151792 228409
16700 228409 167088 176389 277219 278048 272734 354676 456365 684648 833789 831083 778603 687946
16688 687946 692556 679463 756514 721992 512034 398456 312330 292238 312949 379956 387657
$$ packed form
16764B11080J5721q4942R8266k0128p486k7350j87587l1900k2879k2586L5987
16753d3804k477n0116m8112n6738j75931J44923J18385j02161M1954J45927K09075
16742A80925J55901j66894m8265m1201J32361R2866j62534J2444M4156j9942n1591
16731A28226O6353j30545P3351L7644L0534J48548j1467m4948J82054J07370r044
16720E78076j69223J69995J8050k6553J83608j86064q1662L666J99625j96957
16710D92561l12649j08439K08516J76913K3714j71522j55256r7960R5914P6617
16700B28409o1321R301J00830Q29n314Q1942J01689K28283J49141k706n2480r0657
16688F87946M610j3093P7051l4522k09958j13578q6126k0092K0711O7007P701
$$ plain form
16677 387657 363797 406872 377440 300850 234145 109758 43558 -31683 96196 261908 239868
16666 239868 108909 81825 154737 155367 97708 117155 212039 368944 328091 101665 -99474
16655 -99474 -75294 -103196 -109479 -133248 -25796 130745 21879 -112884 -171919 -3062 219556
16644 219556 252096 106448 -29040 -15192 -79212 -73456 -58543 24296 176832 365672 417242
16633 417242 247896 176690 181811 161267 72824 20834 51837 56318 40208 -1393 74222 -82367
16621 -82367 -106917 -87427 196588 384638 344510 416727 578046 824166 939280 927701 1087533
16610 1087533 1141585 1065255 967368 675852 406394 177970 74887 198498 158987 92675
16600 92675 80191 168360 365418 448861 470899 481080 504872 625748 756479 774706 799737
$$ packed form
16677C87657k3860M3075k9432p6590o6705j24387o6200p5241J27879J65712k2040
16666B39868j30959k7084P2912O30n7659J9447R4884J56905m0853k26426k01139
16655i9474K4180k7902o283k3769J07452J56541j08866j34763n9035J68857K22618
16644B19556L2540j45648j35488J3848o4020N756J4913Q2839J52536J88840N1570
16633D17242j69346p1206N121k0544q8443n1990L1003M481j6110m1601P5615j56589
16621h2367k4550J9490K84015J88050m0128P2217J61319K46120J15114j1579J59832
16610A087533N4052p6330r7887k91516k69458k28424j03083J23611l9511o6312
16600I2675j2484Q8169J97058Q3443K2038J0181K3792J20876J30731J8227K5031
$$ plain form
16589 799737 859800 1057011 987836 999009 1042990 746285 551583 393401 224620 123221
16579 123221 90677 225789 402137 510478 401319 132513 11150 15569 30531 31481 235961
16568 235961 395443 460348 422610 482603 293593 280793 159677 21495 113656 140795 48565
16557 48565 40292 -72802 -174486 -55255 54698 -68098 57848 72257 -7242 -29829 -57033
16546 -57033 -164829 -97349 -181590 -271042 -94533 227234 268250 115560 -4076 -168731
16536 -168731 -93408 43744 48059 75744 103179 256068 288943 231678 103384 48259 -42523
16525 -42523 -28557 -148888 -173587 -88189 23404 -122104 -230168 -256303 -322016 -448895 -525234
16514 -525234 -434715 -462133 -369145 -258592 -179624 -124427 -93932 -79137 -55526 35151 -134189
$$ packed form
16589G99737O0063J97211o9175J1173M3981k96705j94702j58182j68781j01399
16579A23221l2544J35112J76348J08341j09159k68806j21363M419J4962R50K04480
16568B35961J59482O4905l7738N9993j89010j2800j21116j38182R2161K7139r2230
16557D8565q273j13094j01684J19231J09953j22796J25946J4409p9499k2587k7204
16546e7033j07796O7480q4241q9452J76509L21767M1016j52690j19636j64655
16536a68731P5323J37152M315K7685K7435J52889L2875n7265j28294n5125r0782
16525d2523J3966j20331k4699Q5398J11593j45508j08064k6135o5713j26879p6339
16514e25234R0519k7418R2988J10553P8968N5197L0495J4795K3611R0677j69340
$$ plain form
16503 -134189 -125987 -30691 -193679 -306656 -422799 -428591 -328608 -258470 -301621 -298058 -232436
16492 -232436 -297306 -223899 -110818 -93076 -25200 123011 207505 157563 91692 66742 40764
16481 40764 -83430 -85714 -84327 -46881 73614 89428 28950 -92809 -114059 -282588 -292788
16470 -292788 -296679 -293273 -23506 -71474 -162298 -164845 -104399 107806 3676 -85012 2382
16459 2382 -20373 -117419 -157398 -38783 38520 64222 -20935 -20549 77793 90510 104474 5181
16447 5181 -61885 -33174 24189 -124083 -24725 -67047 -21422 139411 17560 -204205 -162128
16436 -162128 -11711 -110989 -190017 -23596 20154 -172217 -154432 160943 300673 77456
16426 77456 -271127 -298008 -261688 -137426 -11015 38883 -74664 -160860 -23299 -2481 -120356
$$ packed form
16503a34189Q202R5296j62988j12977j16143n792R9983P0138m3151L563O5622
16492b32436o4870P3407J13081J7742O7876J48211Q4494m9942o5871k4950k5978
16481D0764j24194k284J387L7446J20495J5814o0478j21759k1250j68529j0200
16470b92788l891L406K69767m7968r0824k547O0446K12205j04130q8688Q7394
16459B382k2755r7046l9979J18615P7303K5702q5157L86R8342J2717J3964r9293
16447E181o7066K8711N7363j48272R9358m2322M5625J60833j21851k21765M2077
16436a62128J50417r9278p9028J66421M3750j92371J7785L15375J39730k23217
16426G7456l48583k6881L6320J24262J26411M9898j13547q6196J37561K0818j17875
$$ plain form
16415 -120356 7927 127013 181994 312887 249857 118425 159070 214135 240452 79255
16405 79255 -93455 -106796 70517 124398 91819 173917 323403 306229 206767 314136 245296
16394 245296 230871 -35151 -241075 -221649 -218055 -154526 -162300 -239539 -208440 56315 83439
16383 83439 -13600 159686 291569 198271 67422 40426 56443 -38651 -12437 38917 -119526
16372 -119526 -248832 -273903 -301605 -174759 -27942 78562 27783 -149534 -17511 142436
16362 142436 103072 112202 158655 100659 222537 169396 -50805 -110990 25060 345724 588870
16351 588870 596536 746187 973161 1285298 1570979 1806589 2012746 2212009 2099353 1684005
16341 1684005 1254711 1010733 843328 721553 545101 467922 350834 164192 140985 288993
$$ packed form
16415a20356J28283J19086N4981J30893o3030j31432M0645N5065K6317j61197
16405G9255j72710j3341J77313N3881l2579Q2098J49486j7174r9462J07369o8840
16394B45296j4425k66022k05924J9426L594O3529p774p7239L1099K64755K7124
16383H3439r7039J73286J31883r3298j30849k6996J6017r5094K6214N1354j58443
16372a19526j29306k5071k7702J26846J46817J06504n0779j77317J32023J59947
16362A42436l9364R130M6453n7996J21878n3141k20201o0185J36050L20664K43146
16351E88870P666J49651K26974L12137K85681K35610K06157J99263j12656m15348
16341A684005m29294k43978j67405j21775j76452p7179j17088j86642k3207J48008
$$ plain form
16331 288993 492010 461747 394891 579501 579677 531667 602162 568066 637104 769514 1059559
16320 1059559 1290267 1590294 1794404 2031386 2184444 2057943 1743889 1342054 890198
16311 890198 691816 510917 445493 558991 507184 407735 305042 273442 361529 449416 346847
16300 346847 216953 280408 293985 389632 221357 154231 211841 373820 283355 317271 363942
16289 363942 306669 156668 79805 100182 56099 11859 132644 128299 45850 -25543 -75332
16278 -75332 69241 137863 125633 67879 66502 68017 62431 106481 38865 92001 73604 -17226
16266 -17226 37503 274548 315366 278653 335318 215274 147670 24017 66798 157950 185117
16255 185117 130083 178367 249440 275979 278216 246598 54706 -154384 -100618 76247 56850
$$ packed form
16331B88993K03017l0263o6856J84610J76m8010P0495l4096O9038J32410K90045
16320A059559K30708L00027K04110K36982J53058j26501l14054m01835m51856
16311H90198j98382j80899o5424J13498n1807r9449j02693l1600Q8087Q7887j02569
16300C46847j29894O3455J3577R5647j68275o7126N7610J61979r0465L3916M6671
16289C63942n7273j50001p6863K0377m4083m4240J20785m345q2449p1393m9789
16278g5332J44573O8622j2230n7754j377J515n586M4050o7616N3136j8397r0830
16266a7226N4729K37045M0818l6713N6665j20044o7604j23653M2781R1152K7167
16255A85117n5034M8284P1073K6539K237l1618j91892k09090N3766J76865j9397
$$ plain form
16244 56850 73982 253114 192819 45755 -84007 -91143 -149366 -146032 -91945 -116987 -89725
16233 -89725 22520 -70715 -45425 83442 -99644 -249770 16255 188123 63490 -53803
16223 -53803 -92143 -141232 -150967 -128963 -164614 24189 38518 -90165 -61617 17326 -11309
16212 -11309 -106447 -9906 97257 6682 20954 -42425 -43856 -3046 16109 -93760 -31162
16201 -31162 71902 287463 457517 419516 402231 295438 267243 405795 332853 337656 406914
16190 406914 174267 13162 80310 121888 143450 -4844 42241 231617 178669 43875
16180 43875 148331 329235 250333 155549 197439 218070 309887 336832 401131 410775 416741 557513
16168 557513 449296 341835 105860 -116604 -14944 25768 132102 241638 161084 59782
$$ packed form
16244E6850J7132J79132o0295j47064j29762p136n8223L334N4087k5042K7262
16233h9725J12245r3235K5290J28867j83086j50126K66025J71868j24633j17293
16223e3803l8340m9089r735K2004l5651J88803J4329j28683K8548P8943k8635
16212a1309r5138R6541J07163r0575J4272o3379j431M0810J9155j09869O2598
16201c1162J03064K15561J70054l8001j7285j06793k8195J38552p2942M803O9258
16190D06914k32647j61105O7148M1578K1562j48294M7085J89376n2948j34794
16180D3875J04456J80904p8902r4784M1890K0631R1817K6945O4299R644N966J40772
16168E57513j08217j07461k35975k22464J01660M0712J06334J09536q0554j01302
$$ plain form
16158 59782 133902 328772 306095 249917 216763 216413 296893 247272 251004 392338 486450 346932
16146 346932 279133 211988 184620 226185 198527 273822 399591 409283 363342 351459 552102
16135 552102 524910 500796 633232 775176 871725 1065496 1270617 1593124 1713538 1700432
16125 1700432 1830613 2013743 2147553 2393843 2471070 2628477 2779121 2644519 2429952 2265872
16115 2265872 2288092 2495302 2915512 3209167 3445520 3812949 4160467 4681031 5271815 5968728
16105 5968728 6815185 7880809 9265311 10918490 12908505 15531871 18998737 24021031
16097 24021031 31307067 42409370 58239058 78998776 103036963 127752994 152765040
16090 152765040 178483836 200298501 206173982 187269216 150117613 110884112 80940441
$$ packed form
16158E9782P4120J94870k2677n6178l3154l50Q0480m9621L732J41334R4112j39518
16146C46932o7799o7145k7368M1565k7658P5295J25769R692m5941j1883K00643
16135E52102k7192k4114J32436J41944R6549J93771K05121L22507J20414j3106
16125A700432J30181J83130J33810K46290P7227J57407J50644j34602k14567j64080
16115B265872K2220K07210M20210K93655K36353L67429L47518N20564N90784O96913
16105E968728Q46457J065624J384502J653179J990015K623366L466866N022294
16097B4021031P286036J1102303J5829688K0759718K4038187K4716031K5012046
16090A52765040K5718796K1814665N875481j8904766l7151603l9233501k9943671
$$ plain form
16083 80940441 61809993 50338588 43497457 39601674 37300974 36248553 36317408 37348106
16075 37348106 39695172 43712908 50368428 60911862 76155568 95830925 118023126
16068 118023126 140618371 163853649 187159796 204265605 203423063 179090889 140581563
16061 140581563 103495632 76632136 59819282 49563276 42915897 38257349 35005400
16054 35005400 32321762 30200303 28431977 26786612 25414942 24138740 22742092 21519136
16046 21519136 20320429 19349243 18449100 17672162 16908114 16268452 15836566 15391144 15052740
16037 15052740 14810378 14580260 14326368 14128063 14015845 13748480 13162799 12677976 12133792
16028 12133792 11678071 11290446 10903151 10691437 10090035 9696202 9417992 9258483 9031501
$$ packed form
16083H0940441j9130448j1471405o841131l895783k300700j052421O8855J030698
16075C7348106K347066M017736O655520J0543434J5243706J9675357K2192201
16068A18023126K2595245K3235278K3306147J7105809q42542k4332174l8509326
16061A40581563l7085931k6863496j6812854j0256006o647379m658548l251949
16054C5005400k683638k121459j768326j645365j371670j276202j396648j222956
16046B1519136j198707r71186r00143p76938p64048o39662m31886m45422l38404
16037A5052740k42362k30118k53892j98305j12218k67365n85681m84823n44184
16028A2133792m55721l87625l87295k11714o01402l93833k78210j59509k26982
$$ plain form
16019 9031501 8956409 8742187 8586462 8383821 8271479 8099057 7954171 7604004 7518761 7445666
16009 7445666 7392104 7360965 7179744 6854464 6463102 6230086 6301421 6204103 5838532 5599192
15999 5599192 5354700 5195426 5029106 4743855 4568757 4533110 4589356 4461090 4319583 4256813
15989 4256813 4187025 3930409 3912712 3891459 3698268 3647191 3563352 3540209 3549574 3482002 3361512
15978 3361512 3169379 3141133 3156081 2881221 2771130 2617114 2518055 2574331 2633370 2725891
15968 2725891 2710567 2657567 2396999 2238472 2364564 2424987 2559890 2505684 2379867 2427646
15958 2427646 2281616 2058226 1950850 1751074 1852354 1832867 1983545 1921174 1659150 1635814
15948 1635814 1564609 1595421 1652770 1408126 1423065 1428446 1202016 1211582 1315940 1300653 1215393
$$ packed form
16019I031501p5092k14222j55725k02641j12342j72422j44886l50167q5243p3095
16009G445666n3562l1139j81221l25280l91362k33016P1335r7318l65571k39340
15999E599192k44492j59274j66320k85251j75098l5647N6246j28266j41507o2770
15989D256813o9788k56616j7697k1253j93191n1077q3839k3143R365o7572j20490
15978C361512j92133k8246J4948k74860j10091j54016r9059N6276N9039R2521
15968B725891j5324n3000k60568j58527J26092O0423J34903n4206j25817M7779
15958B427646j46030k23390j07376j99776J01280j9487J50678o2371k62024k3336
15948A635814p1205L0812N7349k44644J4939N381k26430R566J04358j5287q5260
$$ plain form
15937 1215393 1141609 1181331 1442907 1360765 1443082 1419230 1145792 881841 908768 913879 908127
15926 908127 769756 668933 718057 851258 823821 718947 684844 553931 542000 608341
15916 608341 404010 458935 629083 532647 358959 467671 564326 605187 482184 445332
15906 445332 602331 701843 625611 456000 341421 315027 163179 19712 176882 232737
15896 232737 273338 380720 188831 74731 259385 249719 264450 145328 181045 120110 116449
15885 116449 55909 112779 228821 327063 327808 350539 260864 217198 125658 185596 291814
15874 291814 124064 20576 129737 329365 460304 542875 442207 240584 273556 196019
15864 196019 56734 191919 297454 207596 164031 178936 173794 123167 11989 13523 -52594
$$ packed form
15937A215393p3784L9722K61576q2142Q2317k3852k73438k63951K6927N111n752
15926I08127j38371j00823M9124J33201k7437j04874l4103j30913j1931O6341
15916F08341k04331N4925J70148r6436j73688J08712R6655M0861j23003l6852
15906D45332J56999R9512p6232j69611j14579k6394j51848j43467J57170N5855
15896B32737M0601J07382j91889j14100J84654r666J4731j19122L5717o0935l661
15885A16449o0540N6870J16042R8242P45K2731q9675m3666r1540N9938J06218
15874B91814j67750j03488J09161J99628J30939Q2571j00668k01623L2972p7537
15864A96019j39285J35185J05535q9858m3565J4905n142n0627j11178J534o6117
$$ plain form
15853 -52594 -289859 -173790 65974 158010 19567 48827 -124807 -138955 -63604 -24308 116697
15842 116697 396124 515513 461121 291870 113280 143424 145532 163398 287779 247952 83537
15831 83537 109464 198234 282936 309435 262807 312124 380382 319006 292765 306459 215610 123297
15819 123297 167870 237489 258695 305201 206426 43155 14810 -25822 24201 142440 124040
15808 124040 36671 46285 -17696 -44172 -142316 -28764 151737 158065 8972 -93132 -140547
15797 -140547 -110384 -16232 -92467 -115171 -65118 -28931 75883 120179 201954 128405 295397
15786 295397 345630 201503 116124 87290 -32811 -137011 -16018 53118 58553 82911 -35522
15775 -35522 -71003 -123119 -82881 1699 85259 7828 -43337 -91351 -76755 -115692 12695
$$ packed form
15853e2594k37265J16069K39764R2036j38443K9260j73634j4148P5351L9296J41005
15842A16697K79427J19389n4392j69251j78590L0144K108J7866J24381l9827j64415
15831H3537K5927Q8770Q4702K6499m6628M9317O8258o1376k6241J3694r0849r2313
15819A23297M4573O9619K1206M6506r8775j63271k8345m0632N0023J18239j8400
15808A24040q7369R614o3981k6476r8144J13552J80501O328j49093j02104m7415
15797a40547L0163R4152p6235k2704N0053L6187J04814M4296Q1775p3549J66992
15786B95397N0233j44127q5379k8834j20101j04200J20993O9136N435K4358j18433
15775c5522l5481n2116M0238Q4580Q3560p7431n1165m8014J4596l8937J28387
$$ plain form
15764 12695 -50313 -93308 -131258 -37292 -30609 21617 71674 84574 31440 11700 16601 -192373
15752 -192373 -305553 -365573 -392794 -481735 -396423 -267148 -75635 -158417 -264205 -245934 -309694
15741 -309694 -355719 -482602 -380849 -326118 -251100 -104164 -10170 23138 141156 220602 290035
15730 290035 231707 220174 142678 -97202 -244801 -212238 -18653 123033 161501 2041
15720 2041 -48352 -29542 -64054 -157684 -149743 -111793 -122961 -93484 10594 148489 170144 71154
15708 71154 -204295 -401937 -397954 -338517 -267287 -275986 -314310 -360875 -407448 -319222 -245893 -28900
15696 -28900 177388 135131 57683 123737 188314 126267 147021 110535 45458 -77144 -285564
15685 -285564 -447250 -321615 -195780 -311143 -141699 -160224 -209856 -289290 -412468 -293939
$$ packed form
15764A2695o3008m2995l7950R3966O683N2226N0057J2900n3134j9740M901k08974
15752a92373j13180o0020k7221q8941Q5312J29275J91513q2782j05788J8271o3760
15741c09694m6025j26883J01753N4731P5018J46936R3994L3308J18018P9446O9433
15730B90035n8328j1533p7496k39880j47599L2563J93585J41686L8468j59460
15720B041n0393J8810l4512r3630P941L7950j1168K9477J04078J37895K1655r8990
15708G1154k75449j97642L983N9437P1230q699l8324m6565m6573Q8226P3329K16993
15696b8900K06288m2257p7448O6054O4577o2047K0754l6486o5077j22602k08420
15685b85564j61686J25635J25835j15363J69444j8525m9632p9434j23178J18529
$$ plain form
15675 -293939 -225263 -172699 117549 69759 18737 -81922 -135534 -284700 -413619 -354067 -280147
15664 -280147 -192559 -177299 -38545 55778 -760 -30760 -143356 -178223 -37320 136477 255499
15653 255499 323068 305995 151762 -170111 -279444 -185412 -121957 -95670 142568 84281 -78949
15642 -78949 -195568 -262729 -223358 -237817 -146565 -189751 -227367 -102716 22155 -16307 265189
15631 265189 208904 178424 284448 299357 149680 41386 13992 -147009 -191098 -141752 -162946
15620 -162946 -253397 -27830 38823 -4346 -78656 -102937 -156540 -21692 -58472 -140519 -168015
15609 -168015 -120775 -221048 -122804 34213 37080 -221641 -352386 -150483 -79868 -189705
15599 -189705 -109697 67314 86130 14006 -56192 -40287 99527 -23520 -132711 -81206 6951
$$ packed form
15675b93939O8676N2564K90248m7790n1022j00659n3612j49166j28919N9552P3920
15664b80147Q7588J5260J38754R4323n6538l0000j12596l4867J40903J73797J19022
15653B55499O7569j7073j54233l21873j09333R4032O3455K6287K38238n8287j63230
15642g8949j16619o7161L9371j4459R1252m3186l7616J24651J24871l8462K81496
15631B65189n6285l0480J06024J4909j49677j08294k7394j61001m4089M9346k1194
15620a62946r0451K25567O6653m3169p4310k4281n3603J34848l6780q2047k7496
15609a68015M7240j00273R8244J57017K867k58721j30745K01903P0615j09837
15599a89705Q0008J77011J8816p2124p0198J5905J39814j23047j09191N1505Q8157
$$ plain form
15588 6951 111974 93041 45973 138896 79442 23418 -37783 -116194 -313735 -308405 -229407 -270874
15576 -270874 -224682 -248316 -120167 -152817 -29603 244966 368806 195858 158853 87083
15566 87083 311031 596133 747823 603027 646797 747086 641253 518417 417333 230281
15556 230281 107154 122130 176589 122537 110833 96031 113206 102636 317986 462839 429245
15545 429245 262957 225205 361292 310826 435733 597379 683576 807847 959593 836418
15535 836418 581000 481419 368928 181153 253609 292192 258888 230273 281701 163447 104167
15524 104167 133849 330367 310342 234320 87505 -15982 80123 177792 387619 230973
15514 230973 117985 29521 32920 30662 3733 3879 -91382 -50001 85541 144902 170719 -97909
$$ packed form
15588F951J05023j8933m7068R2923n9454n6024o1201p8411j97541N330P8998m1467
15576b70874M6192k3634J28149l2650J23214K74569J23840j72948l7005p1770
15566H7083K23948K85102J51690j44796M3770J00289j05833j22836j01084j87052
15556B30281j23127J4976N4459n4052j1704j4802J7175j0570K15350J44853l3594
15545D29245j66288l7752J36087n0466J24907J61646Q6197J24271J51746j23175
15535H36418k55418r9581j12491j87775P2456L8583l3304k8615N1428j18254n9280
15524A04167K9682J96518k0025p6022j46815j03487R6105R7669K09827j56646
15514B30973j12988q8464L399k258k6929J46r5261M1381J35542N9361K5817k68628
$$ plain form
15502 -97909 -340023 -182949 180117 267258 214950 115071 -19052 -140020 -34132 56484
15492 56484 104418 216379 249124 253340 160046 221530 251614 150705 137922 189938 80312
15481 80312 18147 -152800 -196017 -83626 -41005 -2140 -37260 -28641 43455 72450 169156
15470 169156 179384 18694 -164452 -227031 -217207 -172907 -287582 -337916 -458922 -492252 -476143
15459 -476143 -424614 -253911 -44019 67464 -63673 -93134 -99625 -57493 -98106 -32230 -2713
15448 -2713 41758 48236 -69744 -316096 -316700 -213864 -248093 -242481 -179516 50085 99312 72441
15436 72441 190906 233181 123953 -6047 -695 645 -65981 -166466 -241397 -161361 -201929
15425 -201929 -121166 -63177 -71338 -67936 -57761 69240 169283 217220 98107 -75385 -288945
$$ packed form
15502i7909k42114J57074L63066Q7141n2308r9879j34123j20968J05888R0616
15492E6484M7934J11961L2745M216r3294O1484L0084j00909j2783N2016j09626
15481H0312o2165j70947m3217J12391M2621L8865l5120Q619P2096K8995R6706
15470A69156J0228j60690j83146o2579R824M4300j14675n0334j21006l3330J6109
15459d76143N1529J70703K09892J11483j31137k9461o491M2132m0613O5876K9517
15448b713M4471O478j17980k46352o04J02836l4229N612O2965K29601M9227k6871
15436G2441J18465M2275j09228j30000N352J340o6626j00485p4931Q0036m0568
15425b01929Q0763N7989q161L402J0175J27001J00043M7937j19113j73492k13560
$$ plain form
15414 -288945 -217324 -57680 -95399 -201967 -85012 45894 43211 81599 107661 62940 -123601
15403 -123601 -136658 -72596 -12729 -25558 30160 48013 -45248 -230384 -180498 -139002 -134570
15392 -134570 -244033 -132428 -88382 -193469 -224723 -130726 -6637 91502 -159096 -205737
15382 -205737 -116564 -146904 -83536 49388 107884 -69995 -151764 42308 -20598 -154513 -331512
15371 -331512 -229460 -52434 57708 -45939 -63629 -81981 -240537 -289597 -213564 -224961
15361 -224961 -179838 -136370 -170827 -174936 -172151 -197387 -254214 -256268 -341974 -412261 -431832 -368799
15349 -368799 -277218 -312732 -411766 -327536 -391100 -270015 -170473 -161541 -138841 -354862 -352249
15338 -352249 -260505 -308570 -293523 -95975 17687 320 -9816 24549 -89578 -96457 -20450
$$ packed form
15414b88945P1621J59644l7719j06568J16955J30906k683L8388K6062m4721j86541
15403a23601j3057O4062N9867j2829N5718J7853r3261j85136M9886M1496M432
15392a34570j09463J11605M4046j05087l1254R3997J24089R8139k50598m6641
15382b05737Q9173l0340O3368J32924N8496j77879q1769J94072o2906j33915j76999
15371c31512J02052J77026J10142j03647j7690j8352j58556m9060P6033j1397
15361b24961M5123M3468l4457m109K785k5236n6827k054q5706p0287j9571O3033
15349c68799R1581l5514r9034Q4230o3564J21085R9542Q932K2700k16021K613
15338c52249R1744m8065J5047J97548J13662j7367j0136L4365j14127o879P6007
$$ plain form
15327 -20450 -86841 -228881 -251029 -123336 -39143 -60939 64178 19651 -180573 -359535 -206105
15316 -206105 73726 110918 7708 958 -31864 -57721 -92567 -236069 -76744 -88200 -190311
15305 -190311 -106503 -168565 -283943 -134175 -160853 -117299 71480 150256 110333 108564 98096
15294 98096 12689 122 -77260 8074 -2545 -175440 -190439 -136000 -177143 -112624 -79148
15283 -79148 -39235 115368 165363 74047 103836 126448 42341 121014 215979 157558 254594
15272 254594 33532 -33117 28119 78572 44130 -3484 -119503 -57408 70362 -71038 -255720
15261 -255720 -301896 -282529 -145731 77292 122492 129857 -97028 -290811 -377557 -204117 -203768
15250 -203768 -145953 -106043 -67386 -99570 -25149 -145476 -239244 -229068 -169932 -30328 -27305
$$ packed form
15327b0450o6391j42040k2148J27693Q4193k1796J25117m4527k00224j78962J53430
15316b06105K79831L7192j03210o750l2822k5857l4846j43502J59325j1456j02111
15305a90311Q3808o2062j15378J49768k6678M3554J88779P8776l9923j769j0468
15294I8096q5407j2567p7382Q5334j0619j72895j4999N4439m1143O4519L3476
15283g9148L9913J54603M9995r1316K9789K2612q4107P8673R4965n8421R7036
15272B54594k21062o6649O1236N0453l4442m7614j16019O2095J27770j41400j84682
15261b55720m6176J9367J36798K23023M5200P365k26885j93783q6746J73440L49
15250b03768N7815L9910L8657l2184P4421j20327r3768J0176N9136J39604L023
$$ plain form
15239 -27305 -33775 -103648 23160 128993 69584 131290 121165 75482 -110 -78040 -93073
15228 -93073 -136801 -147116 -295640 -198346 -54113 -103868 -129879 8022 -32730 51127 76303
15217 76303 13574 -76733 -65435 -101668 -312517 -401351 -386440 -408671 -300572 -159906 -90444
15206 -90444 40816 106058 103503 148067 53424 98991 49433 -49890 -59983 139560 185405
15195 185405 114227 125090 117447 245622 181454 36366 -212402 -205170 -284354 -293978 -284302 -143526
15183 -143526 -100652 -95205 2363 -27789 131349 177530 -26262 -172622 -323046 -232421 -128624
15172 -128624 -68279 62813 -58257 -126610 -8819 8214 -74881 71172 39524 -75713
15162 -75713 -191684 -215883 -81447 64482 51527 188650 133750 70019 -6995 -180126 19934
$$ packed form
15239b7305o470o9873J26808J05833n9409O1706j0125m5683p5592p7930j5033
15228i3073m3728j0315j48524R7294J44233m9755k6011J37901m0752Q3857K5176
15217G6303o2729r0307J1298l6233k10849q8834J4911k2231J08099J40666O9462
15206i0444J31260O5242k555M4564r4643M5567m9558r9323j0093J99543M5845
15195A85405p1178J0863p643J28175o4168j45088k48768P232p9184r624R676J40776
15183a43526M2874N447R7568l0152J59138M6181k03792j46360j50424R0625J03797
15172a28624O0345J31092j21070o8353J17791J7033q3095J46053l1648j15237
15162g5713j15971k4199J34436J45929j2955J37123n4900o3731p7014j73131K00060
$$ plain form
15151 19934 183695 87446 -124657 -217673 -11273 58841 -72569 -78558 -84558 -77675 -76314 -213893
15139 -213893 -300124 -199366 -165752 -169828 -264540 -60435 -30107 -93225 -132748 -71824 -186403
15128 -186403 -332918 -368385 -501401 -436538 -449777 -396305 -170806 14694 -38318 -153646
15118 -153646 -143342 -176419 -79026 -110337 -49893 -26221 -33343 4670 -52320 9339 -17497 -194900
15106 -194900 -340281 -450158 -491831 -430810 -257891 -158365 -192697 -121631 -45203 130416 72894
15095 72894 -111157 -196362 -358241 -291669 -117949 -56660 -54147 -101934 -174995 -66057 -124126
15084 -124126 -33162 -15296 130935 74286 -85676 -139385 -138444 -116881 -38090 -43417 26616 186721
15072 186721 51358 -66286 -89803 -125628 -236271 -238153 -223134 -132354 -19534 92611 27924
$$ packed form
15151A9934J63761r6249k12103r3016K06400P0114j31410n989o000O883J361j37579
15139b13893q6231J00758L3614m076r4712K04105L0328o3118l9523O0924j14579
15128a86403j46515l5467j33016O4863j3239N3472K25499J85500n3012j15328
15118a53646J0304l3077R7393l1311O0444K3672p122L8013n6990O1659k6836j77403
15106a94900j45381j09877m1673O1021J72919R9526l4332P1066P6428J75619n7522
15095G2894j84051q5205j61879O6572J73720O1289K513m7787p3061J08938n8069
15084a24126R0964J7866J46231n6649j59962n3709R41K1563P8791n327P0033J60105
15072A86721j35363j17644k3517l5825j10643j882J5019R0780J12820J12145o4687
$$ plain form
15061 27924 16535 42701 100334 47169 29863 45806 89960 20663 3478 -40246 -51550 -70879
15049 -70879 -87854 -38129 127894 106624 -59914 -21116 12350 6711 73956 -89401 -274397
15038 -274397 -102866 196495 211121 168243 246998 84681 62357 121446 -18641 -36382 -194309
15027 -194309 -216648 -80888 -52685 -41761 45496 272864 192073 -12914 13264 77330 172303
15016 172303 40330 -72067 87136 143085 47103 56766 44228 10564 -26205 49046 184003
15005 184003 59108 -125219 -323821 -332964 -128707 -128757 -31658 130020 154998 76783 -71515
14994 -71515 -109950 -129542 -83518 -36807 642 18710 53862 -13830 -82680 -169745 -156202 -185304
14982 -185304 -157656 -49377 72657 -43172 -122725 94280 177189 96307 -53265 -251951
$$ packed form
15061B7924j1389K6166N7633n3165j7306J5943M4154o9297j7185m3724j1304j9329
15049g0879j6975M9725J66023k1270j66538L8798L3466n639O7245j63357j84996
15038b74397J71531K99361J4626m2878P8755j62317k2324N9089j40087j7741j57927
15027a94309k2339J35760K8203J0924Q7257K27368q0791k04987K6178O4066R4973
15016A72303j31973j12397J59203N5949r5982R663j2538l3664l6769P5251J34957
15005A84003j24895j84327j98602r143K04257n0R7099J61678K4978p8215j48298
14994g1515l8435j9592M6024M6711L7449J8068L5152o7692o8850q7065J3543k9102
14982a85304K7648J08279J22034j15829p9553K17005Q2909q0882j49572j98686
$$ plain form
14972 -251951 -393347 -386852 -368067 -308231 -197765 -63023 -143942 -179407 -46643 6580 70285
14961 70285 21286 16194 -23127 -194515 -276905 -132964 -65033 -219689 -465330 -392743 -253819
14950 -253819 -133282 -17051 34812 -64668 39772 -155713 -71600 52687 -85275 -104517
14940 -104517 -62976 -65957 -139646 -48231 12648 -46980 -6551 -97394 -119806 -135086 -166973 -91836
14928 -91836 14257 -36372 -155940 -278345 -151750 -118003 -289384 -210927 -194056 -119159 -124696
14917 -124696 -173962 -363109 -383926 -283940 -376030 -310139 -200986 -120454 -53289 1870 -15716
14906 -15716 -57830 -44454 -95445 -167111 -135106 101180 238428 170707 -117826 -84593 -54564
14895 -54564 -253640 -348380 -190005 -142262 -132414 -58196 -53639 7777 53904 51403 -92660 -112447
$$ packed form
14972b51951j41396O495J8785N9836J10466J34742q0919l5465J32764N3223O3705
14961G0285m8999n092l9321j71388q2390J43941O7931j54656k45641P2587J38924
14950b53819J20537J16231N1863r9480J04440j95485Q4113J24287j37962j9242
14940a04517M1541k981p3689R1415O0879n9628M0429r0843k2412j5280l1887P5137
14928i1836J06093n0629j19568j22405J26595L3747j71381P8457J6871P4897n537
14917a24696m9266j89147k0817R9986r2090O5891J09153Q0532O7165N5159j7586
14906a5716m2114J3376n0991p1666L2005K36286J37248o7721k88533L3233L0029
14895e4564j99076r4740J58375M7743R848P4218M557O1416M6127k501j44063j9787
$$ plain form
14883 -112447 -19285 -122384 -139438 -62275 -101702 -117833 -18600 129525 117252 127836 56172
14872 56172 -2560 -193719 -184234 -54764 -36010 -204422 -263197 -195888 -58275 -173140 -256069
14861 -256069 -278619 15156 17369 -188110 -328928 -378814 -227365 -92193 -70742 -125177 -302856
14850 -302856 -391215 -259488 -256817 -291105 -264585 -214280 -174643 -122065 -141131 -57851 -63392 -232985
14838 -232985 -277522 -135263 61832 107722 5821 173254 306451 224135 276129 86417
14828 86417 -153363 -244353 -182209 -49887 -41936 44890 -38364 120231 113728 -793 58024
14817 58024 115491 30894 130274 40476 -74978 -177306 -125164 89701 5998 -13208 -64731
14806 -64731 -178384 -192983 -248603 -130013 38967 46883 53498 -6971 -186767 -340900 -399717
$$ packed form
14883a12447R3162j03099j7054P7163l9427j6131R9233J48125j2273J0584p1664
14872E6172n8732j91159R485J29470J8754j68412n8775O7309J37613j14865q2929
14861b56069k2550K93775K213k05479j40818m9886J51449J35172K1451n4435j77679
14850c02856q8359J31727K671l4288K6520N0305L9637N2578j9066Q3280n541j69593
14838b32985m4537J42259J97095M5890j01901J67433J33197q2316N1994j89712
14828H6417k39780r0990O2144J32322P951Q6826q3254J58595o503j14521N8817
14817E8024N7467q4597R9380q9798j15454j02328N2142K14865q3703j9206n1523
14806f4731j13653j4599n5620J18590J68980P916O615o0469j79796j54133n8817
$$ plain form
14795 -399717 -396854 -193769 -167965 -241722 -145758 -78808 -107013 -192301 -245815 40241 111174
14784 111174 2161 -268058 -397818 -377225 -243969 -195067 -116879 -127604 -205354 -347949
14774 -347949 -316345 -298766 -225611 -249590 -153031 -264148 -308512 -240844 -91398 -221744 -256657
14763 -256657 -280637 -341525 -150839 -51164 -11295 152786 206407 207644 147595 143230 167868
14752 167868 47833 41227 58324 -42105 -105905 -70731 -142400 -74586 51684 235832 282244
14741 282244 86414 -286959 -119699 -41746 -21698 -68120 -176628 -154939 9978 52495
14731 52495 185833 274535 136838 5313 -122608 -230660 -268436 -68062 24979 115324
14721 115324 84931 -18506 45039 45400 93711 47533 20122 -31448 -38797 -116521 -178310 -232399
$$ packed form
14795c99717K863K03085K5804p3757R5964O6950k8205q5288n3514K86056P0933
14784A11174j09013k70219j29760K0593J33256M8902P8188j0725p7750j42595
14774c47949L1604J7579P3155k3979R6559j11117m4364O7668J49446j30346l4913
14763b56657k3980o0888J90686R9675L9869J64081N3621J237o0049m365K4638
14752A67868j20035o606J7097j00429o3800L5174p1669O7814J26270J84148M6412
14741B82244j95830l73373J67260P7953K0048m6422j08508K1689J64917M2517
14731E2495J33338Q8702j37697j31525j27921j08052l7776K00374R3041R0345
14721A15324l0393j03437O3545L61M8311m6178k7411n1570p349p7724o1789n4089
$$ plain form
14709 -232399 -306507 -362143 -243323 -117991 -81865 -288591 -374620 -364420 -272336 -92711 -124805
14698 -124805 -271903 -368393 -340888 -277246 -398010 -235169 -250456 -114623 -101769 -161544 -106550
14687 -106550 -18222 -9782 -5557 81768 138804 166424 110707 66066 -16905 -115481 -259282 -246851
14675 -246851 -308777 -327550 -345131 -281723 -109899 -59063 32703 185393 112524 55019 5965
14664 5965 162677 131132 -11600 -49198 33827 -22380 -169921 -174053 -42177 -60912 -249448
14653 -249448 -139086 -155301 -142967 -35502 -252638 -355974 -177782 48726 104991 -157165
14643 -157165 -216241 -178658 -211237 -202186 -373106 -463712 -292729 -249478 -252024 -125659 -1461
14632 -1461 -118334 -190846 -328029 -169436 -5071 -29624 -40614 -246509 -205872 -34016 -13705
$$ packed form
14709b32399p4108n5636J18820J25332L6126k06726q6029J0200R2084J79625l2094
14698a24805j47098r6490K7505O3642j20764J62841j5287J35833J2854n9775N4994
14687a06550Q8328Q440M225Q7325N7036K7620n5717m4641q2971r8576j43801J2431
14675b46851o1926j8773j7581O3408J71824N0836R1766J52690p2869n7505m9054
14664E965J56712l1545j42732l7598Q3025n6207j47541m132J31876j8735j88536
14653b49448J10362j6215J2334J07465k17136j03336J78192K26508N6265k62156
14643a57165n9076L7583l2579R051j70920r0606J70983M3251k546J26365J24198
14632a461j16873p2512j37183J58593J64365k4553j0990k05895M0637J71856K0311
$$ plain form
14621 -13705 -78078 -113828 -119007 -207845 -112985 10884 189853 278683 177329 17881 8985
14610 8985 33726 142900 227442 245897 -9108 -120687 -26114 -47987 -67490 -569 94801
14599 94801 126268 -115098 -185695 -217711 14800 64493 26974 -137119 -277164 -247252 -138651
14588 -138651 -145343 -104872 37585 -38652 -34759 -28392 -7071 -16590 -35963 -103933 -38171 -135382
14576 -135382 -22928 46786 8437 122782 183794 172068 107953 58797 27611 -79765 -101429
14565 -101429 -70575 27915 -131097 -261596 -271960 -72176 -102486 -211950 -96316 63331
14555 63331 90010 68450 115184 134591 3053 -70449 -14954 143457 163684 268625 275349
14544 275349 224374 267680 105099 -112169 -191500 -335783 -386439 -167728 -141466 -73936 38921
$$ packed form
14621a3705o4373l5750n179q8838R4860J23869J78969Q8830j01354j59448q896
14610H985K4741J09174Q4542J8455k55005j11579R4573k1873j9503O6921R5370
14599I4801L1467k41366p0597l2016K32511M9693l7519j64093j40045K9912J08601
14588a38651o692M0471J42457p6237L893O367K1321r519j9373o7970O5762r7211
14576a35382J12454O9714l8349J14345O1012j1726o4115m9156l1186j07376k1664
14565a01429L0854R8490j59012j30499j0364J99784l0310j09464J15634J59647
14555F3331K6679k1560M6734J9407j31538p3502N5495J58411K0227J04941O724
14544B75349n0975M3306j62581k17268p9331j44283n0656K18711K6262O7530J12857
$$ plain form
14533 38921 -5672 -56494 -61579 -75047 -130204 -1338 -6824 -126504 -141302 -242433 -329595
14522 -329595 -335284 -269497 -175788 -43665 -199041 -318049 -261042 -215892 -187492 -78314 114614
14511 114614 69369 5072 76212 171028 168571 236873 287595 298963 143760 68336 -83229
14500 -83229 -156843 -141509 -10304 69854 176903 214261 229991 361858 737784 1045041 1149949
14489 1149949 1274601 1529658 1505157 1401612 1571026 1495590 1382631 1052195 800107 712115
14479 712115 618583 653386 535980 444686 555232 583675 554217 636182 734963 729516 515252
14468 515252 391425 314071 154289 5799 276781 351913 556793 535041 473180 524781
14458 524781 467917 508355 751610 812087 960824 1122986 1554823 1755973 1633868 1619881
$$ packed form
14533C8921m4593n0822n085j3468n5157J28866n486j19680j4798j01131q7162
14522c29595n689O5787R3709J32123j55376j19008N7007M5150K8400J09178J92928
14511A14614m5245o4297P1140R4816k457O8302N0722J1368j55203p5424j51565
14500h3229p3614J5334J31205Q0158J07049L7358J5730J31867L75926L07257J04908
14489A149949J24652K55057k4501j03545J69414p5436j12959l30436k52088q7992
14479G12115r3532L4803j17406r1294J10546K8443k9458Q1965R8781n447k14264
14468E15252j23827p7354j59782j48490K70982P5132K04880k1752o1861N1601
14458E24781n6864M0438K43255O0477J48737J62162M31837K01150j22105j3987
$$ plain form
14448 1619881 1744189 1782388 1640339 1398852 1319152 1118786 788558 594757 370938 337325
14438 337325 346723 238107 165856 78511 113700 172745 198857 190696 170220 166204 198257 223137
14426 223137 218934 179893 79984 51723 24162 77469 242687 453678 417238 172672 174423
14415 174423 220482 223207 285688 302989 290252 44792 -102866 -132675 -79635 127983 326642
14404 326642 335960 325135 329740 222088 -32964 -108682 -159947 -70607 6137 79351 111033
14393 111033 73182 -18492 -149559 -40690 123509 161127 61786 157637 86516 -43370 -109184
14382 -109184 -185219 -164750 -232625 -249483 -7053 163838 208927 187913 249690 269361 66310
14371 66310 9018 -37618 -58081 -80888 72077 224771 331026 357811 95216 -151736 -238817
$$ packed form
14448A619881J24308L8199j42049k41487p9700k00366l30228j93801k23819l3613
14438C37325R398j08616p2251q7345L5189N9045K6112q161k0476m016L2053K4880
14426B23137m203l9041r9909k8261k7561N3307J65218K10991l6440k44566J751
14415A74423M6059K725O2481J7301j2737k45460j47658k9809N3040K07618J98659
14404C26642R318j0825M605j07652k55052p5718n1265Q9340P6744P3214L1682
14393A11033l7851r1674j31067J08869J64199L7618r9341R5851p1121j29886o5814
14382a09184p6035K0469o7875j6858K42430J70891M5089k1014O1777J9671k03051
14371F6310n7292m6636k0463k2807J52965J52694J06255K6785k62595k46952q7081
$$ plain form
14360 -238817 -119775 -74177 -218208 -289594 -246056 -331360 -228512 -234107 -25643 66631 210036
14349 210036 263096 193560 201430 299782 285723 305178 393170 385452 201659 120878 102346 123962
14337 123962 176661 251813 168819 197162 255276 127538 132507 203917 138574 54806 50016 -15503
14325 -15503 125132 196168 -275 68561 237107 179216 93410 52521 2143 51834 -85134
14314 -85134 -243090 -134710 104796 133093 73830 -10726 -123895 -61299 -8419 139359 238723
14303 238723 157590 -24297 -97604 5700 9827 -47060 45770 70662 106179 313228 418977
14292 418977 141962 -43429 -102728 20168 50170 77565 -28594 -60791 41010 88178
14282 88178 26196 83230 176942 162989 141076 30057 -31114 -96458 70049 149063 -1824
$$ packed form
14360b38817J19042M5598j44031p1386M3538q5304J02848n595K08464R2274J43405
14349B10036N3060o9536P870R8352j4059J9455Q7992p718j83793q0781j8532K1616
14337A23962N2699P5152q2994K8343N8114j27738M969P1410o5343q3768m790o5519
14325a5503J40635P1036j96443O8836J68546n7891q5806m0889n0378M9691j36968
14314h5134j57956J08380K39506K8297n9263q4556j13169O2596N2880J47778R9364
14303B38723q1133j81887p3307J03304M127n6887R2830K4892L5517K07049J05749
14292D18977k77015j85391n9299J22896L0002K7395j06159l2197J01801M7168
14282H8178o1982N7034R3712j3953k1913j11019o1171o5344J66507P9014j50887
$$ plain form
14271 -1824 -156628 -71485 64171 93010 97921 151002 116070 88799 695 -108617 -255442
14260 -255442 -363591 -288478 -149155 -115943 204920 174123 9573 -6941 144072 293769
14250 293769 381230 309527 353457 388462 315841 261267 267591 232705 280881 197739 76326
14239 76326 46100 74414 102090 114862 129379 -49317 46258 207663 194504 149529 185633
14228 185633 221441 160753 -36458 -131442 -25169 115123 147849 -49455 -150035 -48306
14218 -48306 161134 29509 -212929 -146101 16948 -97754 -301622 -232586 -194961 -308685
14208 -308685 -289835 -157645 -64866 -62935 -135770 -85333 3266 -108345 -132543 -111480 -96298
14197 -96298 37885 -52022 85161 279097 330811 370324 436137 308851 182925 123029 101848
$$ packed form
14271a824j54804Q5143J35656K8839M911N3081l4932k7271q8104j09312j46825
14260b55442j08149P5113J39323L3212L20863l0797j64550j6514J51013J49697
14250B93769Q7461p1703M3930L5005p2621n4574O324l4886M8176q3142j21413
14239G6326l0226K8314K7676J2772J4517j78696R5575J61405j3159m4975L6104
14228A85633L5808o0688j97211r4984J06273J40292L2726j97304j00580J01729
14218d8306K09440j31625k42438O6828J63049j14702k03868O9036L7625j13724
14208c08685J8850J32190R2779J931p2835N0437Q8599j11611k4198K1063J5182
14197i6298J34183q9907J37183J93936N1714L9513O5813j27286j25926n9896k1181
$$ plain form
14186 101848 126230 67374 -35422 -111658 -98489 40508 70985 -23609 77829 215 -95446
14175 -95446 -44218 -46512 -22694 88227 136757 155631 165361 174200 92243 -85412 -140569 -49202
14163 -49202 71007 221012 285614 238863 99618 139920 213482 217870 201437 182121 253000
14152 253000 336676 244916 121069 176538 73436 271684 306043 245632 220993 71316 -27430
14141 -27430 39108 23061 34470 201395 204646 202742 170995 184373 187031 266732 228325 167880
14129 167880 316556 334392 190999 224467 287297 354238 288807 284748 267769 121908 88077
14118 88077 160056 279094 686858 812441 636584 621067 592306 690825 673533 534211 613477
14107 613477 412426 410345 363794 377631 408776 546069 624095 651382 492553 395919 382091
$$ packed form
14186A01848K4382n8856j02796p6236J3169J38997L0477r4594J01438p7614r5661
14175i5446N1228k294K3818J10921M8530J8874R730Q839q1957j77655n5157R1367
14163d9202J20209J50005O4602m6751j39245M0302P3562M388j6433j9316P0879
14152B53000Q3676r1760j23847N5469j03102J98248L4359o0411k4639j49677r8746
14141b7430O6538j6047J1409J66925L251j904l1747J3378K658P9701l8407o0445
14129A67880J48676J7836j43393L3468O2830O6941o5431m059j6979j45861l3831
14118H8077P1979J19038M07764J25583j75857j5517k8761R8519j7292j39322P9266
14107F13477k01051k081m6551J3837L1145J37293P8026K7287j58829r6634j3828
$$ plain form
14096 382091 524272 375812 539239 727959 625471 733741 757151 832773 1048053 1081875
14086 1081875 1104403 903561 931960 1033874 1325893 1282531 1224592 1249997 1182136 1165541 1333105
14075 1333105 1454331 1615012 1740052 1883844 1986897 1969051 2166342 2303265 2452817 2693170
14065 2693170 2911134 2918495 2814441 2976326 3172000 3625078 4199926 4765132 5279034 5906418
14055 5906418 6309424 6876766 7578466 8465798 9541248 11062007 12711074 14549637 16708910
14046 16708910 19219581 22412336 26598674 32260247 39914972 50418372 64555819 83454266
14038 83454266 106841481 133630527 162865410 195351857 230503444 261488684 277085851
14031 277085851 275081569 265855886 258035942 248600471 228168591 195136795 158958325
$$ packed form
14096C82091J42181j48460J63427J88720j02488J08270K3410P5622K15280L3822
14086A081875K2528k00842K8399J01914K92019m3362n7939K5405o7861j6595J67564
14075A333105J21226J60681J25040J43792J03053j7846J97291J36923J49552K40353
14065B693170K17964P361j04054J61885J95674M53078N74848N65206N13902O27384
14055E906418M03006N67342P01700Q87332J075450J520759J649067J838563K159273
14046A6708910K510671L192755M186338N661573P654725J0503400J4137447J8898447
14038H3454266K3387215K6789046K9234883L2486447L5151587L0985240J5597167
14031B77085851k004282r225683p819944r435471k0431880l3031796l6178470
$$ plain form
14024 158958325 129030950 107638863 92468463 81801387 74132161 68257832 63667518
14017 63667518 60264273 57577339 55573182 54130905 53182391 52384559 52131722 52698342 53926151
14008 53926151 56172758 59473035 64148401 70662547 79608828 92362865 109536787 131363655
14000 131363655 156845774 184663413 214636377 247163247 278098151 296887037 296873220
13993 296873220 284851707 272620835 261363038 242211982 209891532 171235568 136894599
13986 136894599 111790367 94466158 82114730 73131163 66359400 60993193 56546679
13979 56546679 52794193 49366955 46361775 43590290 41061176 38867235 36943687 35222163
13971 35222163 33617125 31996990 30702349 29364413 28240103 27360055 26578848 25742815
$$ packed form
14024A58958325k9927375k1392087j5170400j0667076p669226n874329m590314
14017F3667518l403245k686934k004157j442277r48514p97832k52837N66620J227809
14008E3926151K246607L300277M675366O514146Q946281J2754037J7173922K1826868
14000A31363655K5482119K7817639K9972964L2526870L0934904J8788886j3817
13993B96873220j2021513j2230872j1257797j9151056l2320450l8655964l4340969
13986A36894599k5104232j7324209j2351428q983567o771763n366207m446514
13979E6546679l752486l427238l005180k771485k529114k193941j923548j721524
13971C5222163j605038j620135j294641j337936j124310q80048p81207q36033
$$ plain form
13963 25742815 24836223 24083481 23197359 22461706 21953639 21308020 20698645 20182912 19771950
13954 19771950 19410602 18863366 18351714 17855784 17586179 17197226 16736553 16241769 15942948
13945 15942948 15555940 15301690 15084914 14900948 14716933 14435897 14183805 13784453 13227639
13936 13227639 12894103 12894235 12606158 12259114 11977409 11492300 10962660 10544667 10326800 9852991
13926 9852991 9609795 9484072 9207279 9161329 8961977 8592188 8225882 8061536 7812091 7505290
13916 7505290 7247403 6874990 6800472 6719294 6639974 6627174 6250113 6037246 5971629 5855617
13906 5855617 5738859 5840459 5916869 5633026 5400831 5330449 5202729 5030022 4970518 4892561
13896 4892561 4652552 4708273 4756511 4681578 4490771 4447291 4465755 4292681 4164027 4036192
$$ packed form
13963B5742815r06592p52742q86122p35653n08067o45619o09375n15733m10962
13954A9771950l61348n47236n11652m95930k69605l88953m60673m94784k98821
13945A5942948l87008k54250k16776j83966j84015k81036k52092l99352n56814
13936A3227639l33536J32k88077l47044k81705m85109n29640m17993k17867m73809
13926I852991k43196j25723k76793m5950j99352l69789l66306j64346k49445l06801
13916G505290k57887l72413p4518q1178p9320j2800l77061k12867o5617j16012
13906E855617j16758J01600P6410k83843k32195p0382j27720j72707n9504p7957
13896D892561k40009N5721M8238p4933j90807m3480J8464j73074j28654j27835
$$ plain form
13886 4036192 3932217 3918525 3723627 3569331 3493242 3251118 3130453 3050285 3012723 3018576
13876 3018576 2931514 2717976 2529428 2460679 2433896 2384808 2387212 2140642 2107627 2091422 2011614
13865 2011614 1935404 1824176 1846909 1898463 1942146 1871351 1934655 1971789 1887124 2130931 2086489
13854 2086489 1840789 1765391 1721504 1629667 1566550 1468350 1215355 1014226 972050 933816 1028855
13843 1028855 1118287 1041757 967514 955274 958444 922716 813616 939016 1061013 936108 822407
13832 822407 611288 584373 750800 807845 875884 875466 843907 696579 699403 637603 777580
13821 777580 749403 528413 546774 759550 759015 787595 662256 561891 495357 553186 414736
13810 414736 254800 272975 388914 521949 475548 503016 510251 303338 167861 486526
$$ packed form
13886D036192j03975j3692j94898j54296p6089k42124j20665q0168l7562N853
13876C018576q7062k13538j88548o8749k6783m9088K404k46570l3015j6205p9808
13865B011614p6210j11228K2733N1554M3683p0795O3304L7134q4665K43807m4442
13854B086489k45700p5398m3887r1837o3117r8200k52995k01129m2176l8234R5039
13843A028855Q9432p6530p4243j2240L170l5728j09100J25400J21997j24905j13701
13832H22407k11119k6915J66427N7045O8039m18l1559j47328K824o1800J39977
13821G77580k8177k20990J8361K12776n35K8580j25339j00365o6534N7829j38450
13810D14736j59936J8175J15939J33035m6401K7468P235k06913j35477L18665
$$ plain form
13800 486526 661361 628641 649364 625146 508613 416478 494629 452705 496998 572255 599829
13789 599829 615837 492235 536323 611165 564015 467646 435797 335238 153700 340460 523557
13778 523557 646665 684374 579582 453934 490455 267463 251192 300278 269369 379949
13768 379949 661246 624309 470486 427990 419920 286417 150266 208648 100825 -11521
13758 -11521 92098 -28581 10205 197016 385059 398627 299677 315714 288118 277970 348417
13747 348417 287744 182205 61611 133304 113714 302202 510738 603938 512067 567569 631824
13736 631824 656089 400183 363708 50296 65135 230044 228876 381693 378112 414435 335866
13725 335866 214211 149152 116183 112347 212884 177335 165275 73782 -40178 -101838 -22604
$$ packed form
13800D86526J74835l2720K0723k4218j16533r2135P8151m1924M4293P5257K7574
13789E99829J6008j23602M4088P4842m7150r6369l1849j00559j81538J86760J83097
13778E23557J23108L7709j04792j25648L6521k22992j6271M9086l0909J10580
13768C79949K81297l6937j53823m2496q070j33503j36151N8382j07823j12346
13758a1521J03619j20679L8786J86811J88043J3568r8950J6037k7596j0148P0447
13747C48417o0673j05539j20594P1693j9590J88488K08536R3200r1871N5502O4255
13736F31824K4265k55906l6475l13412J4839J64909j168J52817l581L6323p8569
13725C35866j21655o5059l2969l836J00537l5549j2060r1493j13960o1660P9234
$$ plain form
13714 -22604 104026 -21690 -12316 72727 132425 105328 160043 132042 72595 210726 347420
13703 347420 390051 242711 124039 165284 31839 -102408 -109389 -147926 -228238 -279412 -236556
13692 -236556 -199918 -65560 -92022 -49973 -73426 -13911 -140998 -254606 -211885 -92884 -61572
13681 -61572 -20999 -48280 -255471 -172786 -198893 -111192 1236 26576 -97551 -184599 -175480
13670 -175480 -14630 75054 120838 1581 -91195 -38125 -15165 -221827 -292519 -221987 -97385
13659 -97385 -221701 -137974 -265159 -189986 -37805 -25775 83448 183893 53408 -29750
13649 -29750 107334 171916 149005 106989 -111942 -133858 -228958 -366778 -248470 -125725 -135650
13638 -135650 -157010 -194957 -281282 -258886 -169428 -979 143686 14741 -171317 -226087 -262190
$$ packed form
13714b2604J26630j25716R374Q5043N9698k7097N4715k8001n9447J38131J36694
13703C47420M2631j47340j18672M1245j33445j34247o981l8537q0312n1174M2856
13692b36556L6638J34358k6462M2049k3453N9515j27087j13608M2721J19001L1312
13681f1572M0573k7281k07191Q2685k6107Q7701J12428K5340j24127q7048R119
13670a75480J60850Q9684M5784j19257r2776N3070K2960k06662p0692P0532J24602
13659i7385j24316Q3727j27185P5173J52181J2030J09223J00445j30485q3158
13649b9750J37084O4582k2911m2016k18931k1916r5100j37820J18308J22745r925
13638a35650k1360l7947q6325K2396Q9458J68449J44665j28945j86058n4770l6103
$$ plain form
13627 -262190 -287864 -312369 -170104 -151432 -187811 -151467 -31463 124145 143113 125 -174375
13616 -174375 -95379 -143967 -123797 -112327 -93493 -71009 -23525 29540 75957 45333 -66671
13605 -66671 -226327 -63731 99243 147433 178179 25086 45295 45549 68112 -21976 -67131
13594 -67131 -126256 -72981 152268 140000 20650 -105918 -206963 -156896 -7455 -32487 -192681
13583 -192681 -232516 15161 295066 346527 473168 426884 388266 374813 621235 875577
13573 875577 1039001 1033719 1050738 1078024 1282159 1313602 1280153 1134287 1131226 1102006 911549
13562 911549 621871 482757 398196 280652 299987 420374 242083 73513 74752 24928
13552 24928 14441 69050 3450 -37558 83715 186339 135567 280845 285805 203671 189367
$$ packed form
13627b62190k5674k4505J42265J8672l6379L6344J20004J55608J8968j42988j74500
13616a74375P8996m8588K0170J1470J8834K2484M7484N3065M6417l0624j12004
13605f6671j59656J62596J62974M8190L0746j53093K0209K54K2563r0088m5155
13594f7131n9125N3275K25249j2268j19350j26568j01045N0067J49441k5032j60194
13583a92681l9835K47677K79905N1461J26641m6284l8618j3453K46422K54342
13573H75577J63424n282J7019K7286K04135L1443l3449j45866l061k9220j90457
13562I11549k89678j39114q4561j17544J9335J20387j78291j68570J239m9824
13552B4928j0487N4609o5600m1008J21273J02624n0772J45278M960q2134j4304
$$ plain form
13541 189367 391842 696873 811675 984810 1110312 1052617 1221583 1398650 1463136 1524596
13531 1524596 1278622 1178717 1179526 1146657 1063407 848687 727891 688794 634774 411017 232632
13520 232632 138960 176943 225866 38996 -143644 -109671 -73157 -212585 9304 58712 54819
13509 54819 162859 240532 197719 237010 230792 35295 -49232 58883 205518 292514 346371
13498 346371 223403 110604 -21172 -38315 -26614 -153201 -76700 73336 153672 40864
13488 40864 -122412 -39029 63591 123806 -33079 -175615 -131819 -38724 6952 109506 207578
13477 207578 140909 28088 23492 -42309 76392 -35053 -131434 -247930 -288562 -54599 -33152
13466 -33152 -208290 -290212 -269680 -138260 52587 -85790 -83238 19451 -91313 -46345 -35044
$$ packed form
13541A89367K02475L05031J14802J73135J25502n7695J68966J77067O4486O1460
13531A524596k45974r9905Q09l2869q3250k14720j20796l9097n4020k23757j78385
13520B32632r3672L7983M8923j86870j82640L3973L6514j39428K21889M9408l893
13509E4819J08040P7673m2813L9291o218j95497q4527J08115J46635Q6996N3857
13498C46371j22968j12799j31776j7143J1701j26587P6501J50036Q0336j12808
13488D0864j63276Q3383J02620O0215j56885j42536M3796R3095M5676J02554R8072
13477B07578o6669j12821m596o5801J18701j11445r6381j16496m0632K33963K1447
13466c3152j75138q1922K0532J31420J90847j38377K552J02689j10764M4968J1301
$$ plain form
13455 -35044 -113290 -73618 -61647 -77640 -29472 -44537 -8037 -18070 -135643 -205138 -116472
13444 -116472 -158234 -279088 -226557 -193202 -60779 -113561 -102752 -2395 -78977 -142752 -133694
13433 -133694 -90935 90017 26564 20092 10261 -80732 -230252 -234788 -139654 -64366 -77888 111024
13421 111024 242944 117263 38401 -30206 -19342 -66152 33820 131656 148185 64167 -2534
13410 -2534 46817 61106 55081 137717 32639 42073 -60834 -192827 32203 -43863 -291478
13399 -291478 -286793 -105820 -100597 39270 -16805 -99330 -169963 -177848 60895 163324 35355
13388 35355 55284 96789 222586 339603 359956 284729 162669 16284 -42062 -13195 97998
13377 97998 131410 290254 254521 137014 236977 190409 38778 -35968 -122810 -8054 57050
$$ packed form
13455c5044p8246L9672J1971j5993M8168j5065L6500j0033j17573o9495Q8666
13444a16472m1762j20854N2531L3355J32423n2782J0809J00357p6582o3775R058
13433a33694M2759J80952o3453o472r831r0993j49520m536R5134P5288j3522J88912
13421A11024J31920j25681p8862o8607J0864m6810R9972R7836J6529q4018o6701
13410b534M9351J4289o025Q2636j05078R434j02907j31993K25030p6066k47615
13399b91478M685J80973N223J39867n6075q2525p0633p885K38743J02429j27969
13388C5355J9929M1505J25797J17017K0353p5227j22060j46385n8346K8867J11193
13377I7998L3412J58844l5733j17507R9963m6568j51631p4746q6842J14756O5104
$$ plain form
13366 57050 138715 70273 5014 -120353 -21446 81420 -26040 -150327 -261388 -212504 -159600
13355 -159600 -153435 113148 24287 104957 138341 124343 15067 17128 157674 24029 -74003
13344 -74003 28208 -104964 -179521 -92106 -166562 -169188 172982 122284 8694 -12190 135913
13333 135913 182079 103961 -21632 -8536 10647 -58197 -78270 -43280 35522 60266 81771
13322 81771 135890 150142 109233 128111 -1665 -65662 42535 87422 173861 229676 196093
13311 196093 76105 -116451 -220464 -74358 -38690 -26857 -42532 -74474 -94981 -214212
13301 -214212 -250633 -229300 -180533 43630 53749 -52508 -212837 -307985 -187310 -104296 147345
13290 147345 259059 298970 303523 212456 9062 -59218 50046 228814 168322 -77590 -106888
$$ packed form
13366E7050Q1665o8442o5259j25367R8907J02866j07460j24287j11061M8884N2904
13355a59600O165K66583q8861Q0670L3384j3998j09276K061J40546j33645r8032
13344g4003J02211j33172p4557Q7415p4456k626L42170n0698j13590k0884J48103
13333A35913M6166p8118j25593J3096J9183o8844k0073L4990P8802K4744K1505
13322H1771N4119J4252m0909J8878j29776o3997J08197M4887Q6439N5815l3583
13311A96093j19988j92556j04013J46106L5668J1833j5675l1942k0507j19231
13301b14212l6421K1333M8767K24163J0119j06257j60329r5148J20675Q3014K51641
13290A47345J11714L9911M553r1067k03394o8280J09264J78768o0492k45912k9298
$$ plain form
13279 -106888 -162663 -130286 -14708 266 -18274 49021 -5470 -55056 -8264 18148 65044
13268 65044 -18758 -65089 -90023 -187506 -22273 132696 107437 49272 115857 48893 28350
13257 28350 -10962 65906 111967 117522 113124 7770 -164710 -211447 -250082 -79189 -47500
13246 -47500 -26157 -71122 -142566 -294111 -385676 -330702 -280173 -238336 -178587 -86563 -134181
13235 -134181 -281561 -323735 -340666 -147210 -100516 -17763 43085 -56161 -47708 -35133 11850
13224 11850 -57050 -156278 -194563 -61099 99503 50535 71970 162794 226452 318633 333941
13213 333941 251713 247528 239578 174565 10049 76795 188597 97922 139488 222017 182330
13202 182330 113488 67966 -83141 -150729 -290003 -130585 5967 3054 -26973 -75608 -83824
$$ packed form
13279a06888n5775L2377J15578J4974j8540O7295n4491m9586M6792K6412M6896
13268F5044q3802m6331k4934r7483J65233J54969k5259n8165O6585o6964k0543
13257B8350l9312P6868M6061N555m398j05354j72480m6737l8635J70893L1689
13246d7500K1343m4965p1444j51545r1565N4974N0529M1837N9749R2024m7618
13235a34181j47380m2174j6931J93456M6694Q2753O0848r9246Q453J2575M6983
13224A1850o8900r9228l8285J33464J60602m8968K1435R0824O3658R2181J5308
13213C33941q2228m185p950o5013j64516O6746J11802r0675M1566Q2529l9687
13202A82330o8842m5522j51107o7588j39274J59418J36552k913l0027m8635q216
$$ plain form
13191 -83824 -42772 -116101 -78028 55207 93129 234064 328719 266699 206865 319973 229981
13180 229981 98128 134621 86253 40316 146011 215441 254362 93771 -30507 -92205 227211
13169 227211 507887 614381 700023 815561 1051833 1219696 1312368 1442554 1646763 1635053
13159 1635053 1724731 1700783 1502491 1329938 1166847 967871 870022 785935 987759 1022839
13149 1022839 835648 668133 901761 1108822 1225982 1374526 1326517 1212971 1086804 1044392
13139 1044392 1130219 1232034 1475200 1631074 1642357 1640229 1710822 1868909 2132684 2257445
13129 2257445 2280530 2306711 2317333 1973716 1691276 1561577 1613703 1553413 1547003 1340917 1354013
13118 1354013 1545921 1550918 1276433 1022378 839621 646776 730635 733653 654080 624162 721279
$$ packed form
13191h3824M1052p3329L8073J33235L7922J40935R4655o2020n9834J13108q9992
13180B29981j31853L6493m8368m5937J05695O9430L8921j60591j24278o1698L19416
13169B27211K80676J06494Q5642J15538K36272J67863R2672J30186K04209j1710
13159A635053Q9678k3948j98292j72553j63091j98976r7849q4087K01824L5080
13149A022839j87191j67515K33628K07061J17160J48544m8009j13546j26167m2412
13139A044392Q5827J01815K43166J55874J1283k128P0593J58087K63775J24761
13129B257445K3085K6181J0622l43617k82440j29699N2126o0290o410k06086J3096
13118A354013J91908M997k74485k54055j82757j92845Q3859L018p9573k9918R7117
$$ plain form
13107 721279 943775 1011490 1257724 1350716 1379445 1526196 1868531 2278436 2306459 2165275
13097 2165275 1883623 1519950 1215755 922845 776369 656902 518096 343205 275130 332109
13087 332109 562248 737821 668624 662113 811126 879637 757649 471415 328858 322134 350242
13076 350242 194517 176567 294943 354761 329162 153032 155696 217425 205301 185031 194029
13065 194029 170876 292437 296414 62207 41639 -69326 29976 130789 184852 216223 34798
13054 34798 1951 573 85539 254170 292383 211412 227185 183537 -92472 -132592 27261
13043 27261 199803 159346 175558 299137 285272 398694 411620 158218 218502 319612 256195
13032 256195 201730 337929 408291 404361 274731 211618 128594 116743 197512 297693 66116
$$ packed form
13107G21279K22496O7715K46234R2992K8729J46751L42335M09905K8023j41184
13097B165275k81652l63673l04195k92910j46476j19467j38806j74891o8075N6979
13087C32109K30139J75573o9197o511J49013O8511j21988k86234j42557o724K8108
13076C50242j55725j7950J18376N9818k5599j76130K664O1729j2124k0270Q998
13065A94029k3153J21561L977k34207k0568j10965R9302J00813N4063L1371j81425
13054C4798l2847j378Q4966J68631L8213q0971J5773m3648k76009m0120J59853
13043B7261J72542m0457J6212J23579j3865J13422J2926k53402O0284J01110o3417
13032B56195n4465J36199P0362l930j29630o3113q3024j1851Q0769J00181k31577
$$ plain form
13021 66116 10182 60683 242766 373247 398363 427178 350321 382914 231484 75194 153481
13010 153481 244793 273119 255141 165832 84769 145398 252113 300368 285569 194185 70155
12999 70155 132651 206046 122985 247618 224564 45085 68408 102636 236145 281392 227876
12988 227876 190328 129387 9471 73480 16583 -51674 -66932 32 -66588 15007 41815
12977 41815 57418 162435 202067 141219 58477 183130 222504 202193 162033 126059 148337
12966 148337 179901 211674 266237 378603 394367 428674 332860 388882 317571 335186 379740
12955 379740 306038 348156 357215 423033 352740 147691 18662 -109818 -60492 52342 28118
12944 28118 127502 220966 119857 -47762 86796 99121 73011 120650 210976 203844 238039
$$ packed form
13021F6116n5934N0501J82083J30481K5116K8815p6857L2593j51430j56290P8287
13010A53481R1312K8326j7978q9309q1063O0629J06715M8255j4799r1384j24030
12999G0155O2496P3395q3061J24633k3054j79479K3323L4228J33509M5247n3516
12988B27876l7548o0941j19916O4009n6897o8257j5258O6964o6620Q1595K6808
12977D1815J5603J05017L9632o0848q2742J24653L9374k0311m0160l5974K2278
12966A48337L1564L1773N4563J12366J5764L4307r5814N6022p1311J7615M4554
12955C79740p3702M2118R059O5818p0293k05049j29029j28480M9326J12834k4224
12944B8118R9384R3464j01109j67619J34558J2325k6110M7639R0326p132L4195
$$ plain form
12933 238039 300695 361599 344178 164924 -13464 -103686 167821 315726 93971 -1510
12923 -1510 115997 140038 152164 149665 188548 181504 272222 323606 396758 402216 352058 227400
12911 227400 113900 210488 267617 11033 15260 292189 401673 334889 361697 361554 167104
12900 167104 126260 282310 336376 431385 313878 196041 171149 88926 222936 312136 236807
12889 236807 131614 51749 -70293 -94091 60234 152970 284977 375386 383590 246114 182380
12878 182380 183859 101708 -4604 -102527 -227016 -176098 -58129 132000 285228 263464 308552
12867 308552 293124 292939 184316 243385 316223 123499 41805 170772 164641 165831 190712 235479
12855 235479 177323 227429 161004 160609 179795 321011 478732 530285 685968 546165 274386
$$ packed form
12933B38039O2656O0904j7421j79254j78388r0222K71507J47905k21755r5481
12923a510J17507K4041J2126k499L8883p044R0718N1384P3152N458n0158j24658
12911B27400j13500R6588N7129k56584M227K76929J09484o6784K6808j43j94450
12900A67104m0844J56050N4066R5009j17507j17837k4892q2223J34010Q9200p5329
12889B36807j05193p9865j22042k3798J54325R2736J32007R0409Q204j37476o3734
12878A82380J479q2151j06312r7923j24489N0918J17969J90129J53228k1764M5088
12867C08552j5428j85j08623N9069P2838j92724q1694J28967o131J190K4881M4767
12855B35479n8156N0106o6425l95J9186J41216J57721N1553J55683j39803k71779
$$ plain form
12844 274386 166339 189222 232852 168581 211561 87116 3820 190736 340206 499449
12834 499449 588677 583827 671446 749211 750695 734553 918692 931838 784644 722284 810161
12823 810161 935032 881139 541280 456408 309577 254712 207736 274807 372496 524622 529615
12812 529615 592258 668406 523800 543969 661287 557266 459725 523686 581896 474826 414817
12801 414817 496692 576996 547072 702284 792120 604512 688522 916198 895771 708842 649816
12790 649816 702677 908865 843550 627631 782325 764410 732490 830260 929613 965569 956222
12779 956222 1089979 1238268 1140099 1070238 1057875 1226265 1297102 1282149 1092171 1071499 1094836
12768 1094836 1051345 1156441 1233729 1281696 1406918 1471271 1584138 1549711 1735020 1936028
$$ packed form
12844B74386j08047K2883M3630o4271M2980j24445q3296J86916J49470J59243
12834D99449Q9228m850Q7619P7765J484j6142J84139J3146j47194o2360Q7877
12823H10161J24871n3893l39859q4872j46831n4865m6976O7071R7689J52126M993
12812E29615O2643P6148j44606K0169J17318j04021r7541O3961N8210j07070o0009
12801D14817Q1875Q0304k9924J55212Q9836j87608Q4010K27676k0427j86929n9026
12790F49816N2861K06188o5315k15919J54694j7915l1920R7770R9353L5956r347
12779I56222J33757J48289r8169o9861j2363J68390P0837j4953j89978k0672K3337
12768A094836m3491J05096P7288M7967J25222O4353J12867l4427J85309K01008
$$ plain form
12758 1936028 1983201 2013107 2065610 2076625 2019837 2077282 2218706 2422049 2460085 2528755 2571353
12747 2571353 2889683 3044238 3225786 3587159 3958464 4523861 5057058 5791627 6676671
12738 6676671 7353989 7849550 8492231 9136964 9384903 9674132 10120777 10639155 11349266
12729 11349266 12317302 13247494 14450042 15876216 17790962 20140933 22846762 26140468
12721 26140468 30563163 36480061 44669794 55921670 71552371 92951399 120721833
12714 120721833 154320341 191950036 230357147 267599091 302299019 327984079 331974392
12707 331974392 306778440 262022198 215274615 176267356 147178557 127136215 114564667
12700 114564667 107443229 104792969 106034539 111172877 119828849 131971688 147153336 164425475
$$ packed form
12758A936028M7173K9906N2503J1015n6788N7445J41424K03343L8036O8670M2598
12747B571353L18330J54555J81548L61373L71305N65397N33197P34569Q85044
12738F676671O77318M95561O42681O44733K47939K89229M46645N18378P10111
12729A1349266R68036R30192J202548J426174J914746K349971K705829L293706
12721B6140468M422695N916898Q189733J1251876J5630701K1399028K7770434
12714A20721833L3598508L7629695L8407111L7241944L4699928K5685060L990313
12707C31974392k5195952m4756242m6747583l9007259k9088799k0042342j2571548
12700A14564667p121438k650260J241570N138338Q655972J2142839J5181648J7272139
$$ plain form
12692 164425475 183015616 202162585 220385574 234609466 242719854 246253923 250289093
12685 250289093 258658948 273082930 293267718 317593723 343687211 368963360 388887740
12678 388887740 395934769 383219765 353023974 316416802 284483941 262570176 250466916
12671 250466916 245858243 246006513 248322020 250050386 250071096 247144927 238318239 221806812
12663 221806812 200029242 178464127 161087397 148982416 141707238 139225984 141884620
12656 141884620 150207201 165077308 187333051 216945550 252537228 291394456 329423975
12649 329423975 363656635 390725256 402469018 387438869 343096425 284295733 229783757
12642 229783757 187525345 156728764 134633100 118590117 106576990 97599493 90650217
$$ packed form
12692A64425475J8590141J9146969J8222989J4223892Q110388L534069M035170
12685B50289093Q369855J4423982K0184788K4326005K6093488K5276149J9924380
12678C88887740P047029j2715004l0195791l6607172l1932861k1913765j2103260
12671B50466916m608673J48270K315507J728366K0710k926169q826688j6511427
12663B21806812k1777570k1565115j7376730j2104981p275178k481254K658636
12656A41884620Q322581J4870107K2255743K9612499L5591678L8857228L8029519
12649C29423975L4232660K7068621J1743762j5030149m4342444n8800692n4511976
12642B29783757m2258412l0796581k2095664j6042983j2013127q977497o949276
$$ plain form
12635 90650217 84819746 79771361 75674339 72056024 68484181 65377903 62584740 59898965
12627 59898965 57383141 55206447 53126043 51050398 49279843 47659831 46110715 44797375
12619 44797375 43519259 42207164 40795881 39512499 38482360 37688595 36796335 35876523
12611 35876523 34861749 33832672 33014402 32313108 31602749 30828998 30092586 29268865 28316838
12602 28316838 27637069 26778707 26046866 25477498 24925089 24518372 24014301 23675297 23306465
12593 23306465 22868940 22266508 21727986 21350441 20751797 20284563 19828916 19184666 18528128
12584 18528128 18061576 17646328 17203664 16785555 16411326 16145104 15737618 15325266 14879826
12575 14879826 14599524 14334112 13798807 13216982 12897431 12666625 12183806 12061714 11955195
$$ packed form
12635I0650217n830471n048385m097022l618315l571843l106278k793163k685775
12627E9898965k515824k176694k080404k075645j770555j620012j549116j313340
12619D4797375j278116j312095j411283j283382j030139p93765q92260r19812
12611C5876523j014774j029077q18270p01294p10359p73751p36412q23721r52027
12602B8316838o79769q58362p31841n69368n52409m06717n04071l39004l68832
12593B3306465m37525o02432n38522l77545n98644m67234m55647o44250o56538
12584A8528128m66552m15248m42664m18109l74229k66222m07486m12352m45440
12575A4879826k80302k65412n35305n81825l19551k30806m82819j22092j06519
$$ plain form
12566 11955195 11656535 11521728 11275585 10941579 10686472 10360016 10066602 9913244 9665899
12557 9665899 9680313 9434751 9126731 8900589 8757859 8614805 8332125 8217034 8124445 7866882
12547 7866882 7511902 7272083 7220126 7074988 6983346 6887877 6781958 6751107 6593887 6425377
12537 6425377 6361692 6264386 6186714 6305380 6258306 6229578 6256256 6271127 6077864 5824964 5493155
12526 5493155 5065546 4716261 4553175 4417047 4216311 4122317 4184426 4067068 3915119 3858213
12516 3858213 3770029 3671158 3321428 3251833 3227531 3188307 3289612 3306427 3169269 2981604
12506 2981604 2924364 2914910 2863495 2690126 2722350 2698900 2613620 2488933 2428373 2401590 2320251
12495 2320251 2063972 2183441 2234387 2094546 1989736 1971324 1906656 1884038 1920761 1906359
$$ packed form
12566A1955195k98660j34807k46143l34006k55107l26456k93414j53358k47345
12557I665899J4414k45562l08020k26142j42730j43054k82680j15091r2589k57563
12547G866882l54980k39819n1957j45138r1642r5469j05919l0851j57220j68510
12537F425377o3685r7306p7672J18666m7074k8728K6678J4871j93263k52900l31809
12526E493155m27609l49285j63086j36128k00736r3994O2109j17358j51949n6906
12516C858213q8184r8871l49730o9595k4302l9224J01305J6815j37158j87665
12506B981604n7240r454n1415j73369L2224k3450q5280j24687o0560k6783q1339
12495B320251k56279J19469N0946j39841j04810j8412o4668k2618L6723j4402
$$ plain form
12485 1906359 1864308 1855850 1707227 1621297 1630242 1629950 1524515 1477350 1699542 1763293 1670680
12474 1670680 1668529 1716921 1721920 1557369 1581265 1580995 1593417 1648514 1567951 1439203 1459073 1446356
12462 1446356 1321892 1247583 1205749 1180726 968627 971400 1199298 1304187 1316291 1229565 1185754
12451 1185754 1263610 1345835 1344959 1371948 1313632 1282623 1272231 1283030 1207304 1316550 1384451
12440 1384451 1332782 1396426 1328856 1132082 1176008 1253913 1096684 1071380 1141584 1129009 1171787
12429 1171787 1123138 1052257 1000035 1060113 1021420 1120415 1201418 1202165 1157495 979791 840225
12418 840225 860455 925303 958444 871312 878050 952042 896030 987536 1130929 1122023 1060023 1119593
12406 1119593 1118187 985630 845365 838778 867377 916835 786381 645733 625293 755004 697014
$$ packed form
12485A906359m2051q458j48623q5930Q945k92j05435m7165K22192O3751r2613
12474A670680k151M8392M999j64551K3896k70J2422N5097q0563j28748J9870j2717
12462A446356j24464p4309m1834k5023k12099K773K27898J04889J2104q6726m3811
12451A185754P7856Q2225q76K6989n8316l1009j0392J0799p5726J09246O7901
12440A384451n1669O3644o7570j96774M3926P7905j57229k5304P0204j2575M2778
12429A171787m8649p0881n2222O0078l8693R8995Q1003P47m4670j77704j39566
12418H40225K0230O4848L3141q7132O738P3992n6012R1506J43393q906o2000N9570
12406A119593j406j32557j40265o587K8599M9458j30454j40648k0440J29711n7990
$$ plain form
12395 697014 600860 659289 751534 690539 443343 506749 630265 761425 812463 865601 630191
12384 630191 648185 735438 764396 849372 881102 690771 648725 547368 478374 451347 430585
12373 430585 282430 298341 259571 295066 427803 235483 185691 205485 215097 112265 364811
12362 364811 282274 212870 181326 176488 59091 27694 118473 170068 271965 266052 231523
12351 231523 332128 358072 228316 -60102 -108962 144301 257018 376245 361901 116588
12341 116588 5905 -39098 -68729 -177707 -240607 -115540 18141 97086 212493 343327
12331 343327 338858 379951 295800 207398 247896 247179 149106 66367 59299 79840 126128 189607
12319 189607 206106 276152 295926 303296 390472 467017 526042 512894 353901 405167 266726
$$ packed form
12395F97014r6154N8429R2245o0995k47196O3406J23516J31160N1038N3138k35410
12384F30191J7994Q7253K8958Q4976L1730j90331m2046j01357o8994k7027k0762
12373D30585j48155J5911l8770L5495J32737j92320m9792J9794R612j02832K52546
12362C64811q2537o9404l1544m838j17397l1397R0779N1595J01897n913l4529
12351B31523J00605K5944j29756k88418m8860K53263J12717J19227j4344k45313
12341A16588j10683m5003k9631j08978o2900J25067J33681P8945J15407J30834
12331C43327m469M1093q4151q8402M0498p17r8073q2739p068K0541M6288O3479
12319A89607J6499P0046J9774P370Q7176P6545N9025j3148j58993N1266j38441
$$ plain form
12308 266726 246650 206960 104317 114244 111116 160655 231638 232778 211138 154424 -13993 -9312
12296 -9312 -52392 12600 46144 -35305 5149 188874 275824 222188 193252 173918 348793
12285 348793 420892 503880 643658 633132 543612 351534 212972 192981 230625 145645 189882
12274 189882 434696 445991 228819 91430 -77334 -32967 21574 85549 86383 15495 43013
12263 43013 238688 283884 269294 321659 377129 454237 557926 854608 1157876 1391226 1619801
12252 1619801 1696814 1764153 1723417 1652368 1579313 1577500 1422989 1047324 869716 754063 766932
12241 766932 681402 794962 848950 735419 820716 961216 1035557 1057904 1101797 1099399 1207672
12230 1207672 1256677 1328376 1377475 1421676 1590633 1555620 1661225 1842289 1919851 1941869 2078001
$$ packed form
12308B66726k0076l9690j02643R927l128M9539P0983J140k1640n6714j68417M681
12296i312m3080O4992L3544q1449M0454J83725Q6950n3636k8936j9334J74875
12285C48793P2099Q2988J39778j0526q9520j92078j38562j9991L7644q4980M4237
12274A89882K44814J1295k17172j37389j68764M4367N4541O3975Q34p0888K7518
12263D3013J95675M5196j4590N2365N5470P7108J03689K96682L03268K33350K28575
12252A619801P7013O7339m0736p1049p3055j813j54511l75665j77608j15653J2869
12241G66932q5530J13560N3988j13531Q5297J40500P4341K2347M3893k398J08273
12230A207672M9005P1699M9099M4201J68957l5013J05605J81064P7562K2018J36132
$$ plain form
12219 2078001 2129230 2032231 1861174 1750021 1451867 1229369 1256275 1537673 1616773 1471439
12209 1471439 1324230 1373619 1275729 977920 863986 858526 760130 734005 762776 796649 953745
12198 953745 1016876 933608 882767 894773 1133781 1393434 1649558 1911527 2135511 2361192
12188 2361192 2342779 2075172 1839273 1613003 1371162 1237975 1018681 896958 774059 537254
12178 537254 294242 228988 354662 371759 305088 330109 326562 218719 393612 343740 272075
12167 272075 184726 106128 -3500 -6659 104428 352726 425368 455661 543384 574391 553761
12156 553761 479358 434719 404385 481975 400685 315577 364882 385237 302792 400003 520716
12145 520716 498952 465910 389072 225955 135051 44424 -37497 -102519 -186298 -179580 -104341
$$ packed form
12219B078001N1229r6999j71057j11153k98154k22498K6906K81398P9100j45334
12209A471439j47209M9389r7890k97809j13934n460r8396k6125K8771L3873J57096
12198I53745O3131q3268n0841J2006K39008K59653K56124K61969K23984K25681
12188B361192j8413k67607k35899k26270k41841j33187k19294j21723j22899k36805
12178E37254k43012o5254J25674J7097o6671K5021l547j07843J74893m9872p1665
12167B72075q7349p8598j09628l159J11087K48298P2642L0293Q7723L1007k0630
12156E53761p4403m4639l0334P7590q1290q5108M9305K0355q2445R7211J20713
12145E20716k1764l3042p6838j63117r0904r0627q1921o5022q3779O718P5239
$$ plain form
12134 -104341 5105 90978 163261 81549 -6197 169428 511693 630650 657625 579762 382996
12123 382996 300061 278780 402902 480142 343195 223616 253418 290172 104401 26790 215319
12112 215319 318231 169074 -15000 -30292 61344 108940 103312 50715 30734 68980 172172
12101 172172 391995 389222 462522 389918 43811 -47206 149841 276682 105855 23609 -50236
12090 -50236 12966 119097 33376 -79000 -74912 -77457 203278 197685 122285 -35956 -226855
12079 -226855 -113969 201384 179918 136275 253518 311521 165511 -7337 -24637 106067
12069 106067 284601 454427 521511 198727 76116 124893 241237 314939 236540 144620
12059 144620 117305 180730 225550 115298 43523 -71873 -113193 -74174 -34032 -84413 -76161
$$ packed form
12134a04341J09446Q5873P2283q1712q7746J75625L42265J18957K6975p7863j96766
12123C82996q2935k1281J24122P7240j36947j19579K9802L6754j85771p7611J88529
12112B15319J02912j49157j84074j5292R1636M7596n628n2597j9981L8246J03192
12101A72172K19823k773P3300p2604l46107r1017J97047J26841j70827q2246p3845
12090e0236O3202J06131q5721j12376M088k545K80735n593p5400j58241j90899
12079b26855J12886L15353k1466m3643J17243N8003j46010j72848j7300J30704
12069A06067J78534J69826O7084l22784j22611M8777J16344P3702p8399r1920
12059A44620k7315O3425M4820j10252p1775j15396m1320L9019M0142n0381Q252
$$ plain form
12048 -76161 104175 91468 112152 146935 258685 258719 408454 456771 270798 223933 180786
12037 180786 90210 107481 -6401 30951 290632 394406 327170 259029 60509 111010 241097
12026 241097 410998 461446 349379 341360 340758 248980 108550 195160 138252 141554 177591 341629
12014 341629 417030 356006 273040 206815 399180 511632 500240 494065 210133 121907 259338
12003 259338 384131 379250 324450 328871 456746 688032 806008 931889 1125121 1214785 1344624
11992 1344624 1391621 1703819 1764024 1694456 1715107 1591076 1255223 1071450 1059106 863725
11982 863725 656177 640685 613530 649796 724018 967814 1054453 1221709 1330431 1304527 1532350
11971 1532350 1480479 1274785 1137956 1153045 1100237 1196243 1277860 1346651 1531231 1726147
$$ packed form
12048g6161J80336j2707K0684L4783J11750L4J49735M8317j85973m6865m3147
12037A80786r0576J7271j13882L7352K59681J03774o7236o8141j98520N0501J30087
12026B41097J69901N0448j12067q019o02r1778j40430Q6610n6908L302L6037J64038
12014C41629P5401o1024q2966o6225J92365J12452j1392o175k83932q8226J37431
12003B59338J24793m881n4800M421J27875K31286J17976J25881J93232Q9664J29839
11992A344624M6997L12198O0205o9568K0651j24031l35853j83773j2344j95381
11982H63725k07548j5492k7155L6266P4222K43796Q6639J67256J08722k5904K27823
11971A532350n1871k05694j36829J5089n2808R6006Q1617O8791J84580J94916
$$ plain form
11961 1726147 1991073 2304350 2480575 2353469 2126397 1925061 1873483 1789141 1706761 1821885
11951 1821885 1770810 1670948 1684781 1519968 1233270 1281022 1125171 1029438 875653 832623
11941 832623 653805 627620 890751 935874 839442 885805 991863 1150993 1336784 1564202
11931 1564202 1761786 1941108 1977363 1836123 1832400 1653163 1484983 1375087 1186218 1137212
11921 1137212 911217 794667 869603 997762 982557 927453 1024872 1176856 1310247 1637322
11911 1637322 1817796 2145342 2662217 3244308 3740572 4170834 4385246 4327777 3955884 3479410
11901 3479410 2771266 2200510 1833641 1716892 1749306 1737625 1574316 1320710 1225753 1556987
11891 1556987 1714600 1691301 1806824 1942393 2261989 2533554 2555797 2501022 2593641 2667210
$$ packed form
11961A726147K64926L13277J76225j27106k27072k01336n1578q4342q2380J15124
11951A821885n1075r9862J3833j64813k86698M7752j55851r5733j53785m3030
11941H32623j78818k6185K63131M5123r6432M6363J06058J59130J85791K27418
11931A564202J97584J79322L6255j41240l723j79237j68180j09896j88869m9006
11921A137212k25995j16550P4936J28159j5205n5104R7419J51984J33391L27075
11911A637322J80474L27546N16875N82091M96264M30262K14412n7469l71893m76474
11901C479410p08144n70756l66869j16749L2414j1681j63309k53606r4957L31234
11891A556987J57613k3299J15523J35569L19596K71565K2243n4775R2619P3569
$$ plain form
11881 2667210 2938828 2967365 3085163 3199199 3282505 3749216 4204418 4545289 4772345 4755502
11871 4755502 4565919 4285146 4039620 3623681 3337798 3113641 3104489 3218859 2984876 2694788
11861 2694788 2551022 2485572 2398602 2136052 1938714 1661134 1747995 1690930 1562651 1537874
11851 1537874 1659081 1813467 1754852 1870128 2180672 2683997 3131887 3493863 3885891 4237872
11841 4237872 4402073 4071057 3511788 2747052 2093948 1665242 1476805 1494694 1334967 1195538
11831 1195538 1091611 930079 819757 897321 847222 929891 766959 610456 577817 490787
11821 490787 352855 367303 584104 784017 906480 835176 787799 826286 751227 712479 689742
11810 689742 568597 489636 532983 639387 682142 672818 509305 590782 914308 875370 742846
$$ packed form
11881B667210K71618K8537J17798J14036Q3306M66711M55202L40871K27056j6843
11871D755502j89583k80773k45526m15939k85883k24157r152J14370k33983k90088
11861B694788j43766o5450q6970k62550j97338k77580Q6861n7065j28279k4777
11851A537874J21207J54386n8615J15276L10544N03325M47890L61976L92028L51981
11841D237872J64201l31016n59269p64736o53104m28706j88437J7889j59727j39429
11831A195538j03927j61532j10322P7564n0099Q2669j62932j56503l2639q7030
11821D90787j37932J4448K16801J99913J22463p1304m7377L8487p5059l8748k2737
11810F89742j21145p8961M3347J06404M2755r324j63513Q1477L23526l8938j32524
$$ plain form
11799 742846 504530 306766 280111 444858 703134 748931 437004 333673 205858 187461
11789 187461 195552 282037 428871 395883 311352 373406 502005 605836 563471 484987 448067
11778 448067 406573 488181 585560 639438 637125 628815 634011 674070 672834 436523 267482 241683
11766 241683 238488 268420 236815 218935 68941 71125 193505 272322 388246 360542 349581
11755 349581 359936 488051 410658 273161 360731 419212 513215 489574 377865 335193 193912
11744 193912 229622 279971 234752 72727 23458 2343 59348 11783 -12294 -35913 127325
11733 127325 386827 255887 189413 210191 254203 324388 343716 302199 249475 194958 173836
11722 173836 56521 101875 158194 124594 95030 189473 50546 93853 191530 249308 273216
$$ packed form
11799G42846k38316j97764k6655J64747K58276M5797l11927j03331j27815j8397
11789A87461Q091Q6485J46834l2988q4531O2054J28599J03831m2365p8484l6920
11778D48067m1494Q1608R7379N3878k313q310N196M0059j236k36311j69041k5799
11766B41683l195K9932l1605j7880j49994K184J22380P8817J15924k7704j0961
11755C49581J0355J28115p7393j37497Q7570N8481R4003k3641j11709m2672j41281
11744A93912L5710N0349m5219j62025m9269k1115N7005m7565k4077k3619J63238
11733A27325K59502j30940o6474K0778M4012P0185J9328m1517n2724n4517k1122
11722A73836j17315M5354N6319l3600k9564R4443j38927M3307R7677N7778K3908
$$ plain form
11711 273216 380089 378078 272929 59965 61344 208480 245199 195434 93795 231140 397512
11700 397512 216099 86798 14999 208519 436851 487881 370093 202644 250900 327093
11690 327093 416664 617746 675058 847336 999809 1058250 1084560 1179776 1249481 1120413 1154507
11679 1154507 1174025 1100355 1028007 900592 836802 835623 651544 618190 609484 493387 544750
11668 544750 609538 548813 591461 564557 510082 276382 250403 222876 446542 813472 994664
11657 994664 1107646 950751 874764 703754 623177 610435 672787 792589 706293 700421 533306
11646 533306 510811 657332 784193 824902 1027690 1087422 852486 777982 847307 954859
11636 954859 1122997 941732 869716 872959 1011239 972927 1039740 1144344 1093484 1098599 1212230
$$ packed form
11711B73216J06873k011j05149k12964J379J47136L6719m9765j01639J37345J66372
11700C97512j81413j29301p1799J93520K28332N1030j17788j67449M8256P6193
11690C27093Q9571K01082N7312J72278J52473N8441K6310R5216O9705j29068L4094
11679A154507J9518p3670p2348j27415o3790j179j84079l3354q706j16097N1363
11668E44750O4788o0725M2648k6904n4475k33700k5979k7527K23666L66930J81192
11657I94664J12982j56895p5987j71010q0577j2742O2352J19802q6296n872j67115
11646E33306k2495J46521J26861M0709K02788N9732k34936p4504O9325J07552
11636I54859J68138j81265p2016L243J38280l8312O6813J04604n0860N115J13631
$$ plain form
11625 1212230 1279442 1298158 1256651 1168799 1113916 1147279 1168818 1349911 1534366 1704034 1721418
11614 1721418 1655157 1609415 1722287 1679756 1627119 1642324 1908414 2072158 2004087 2053905 2224476
11603 2224476 2263308 2436981 2742493 2939361 2978054 2981447 3063811 3230440 3520749 3849674
11593 3849674 4152631 4558982 4863677 5208891 5749255 6257874 6871866 7556496 8399852
11584 8399852 9525870 10852857 12187908 13708939 15463143 17615581 20256000 23343219
11576 23343219 27237768 32369956 39102548 48016829 60277792 77193891 99781178 129390891
11568 129390891 165785007 206471153 248069417 288438273 326144061 354395597 360203802
11561 360203802 335554319 288704311 237781677 194600500 162304629 139887518 125511982
$$ packed form
11625A212230O7212J8716m1507q7852n4883L3363K1539J81093J84455J69668J7384
11614A721418o6261m5742J12872m2531n2637J5205K66090J63744o8071M9818J70571
11603B224476L8832J73673L05512J96868L8693L393Q2364J66629K90309L28925
11593C849674L02957M06351L04695L45214N40364N08619O13992O84630Q43356
11584H399852J126018J326987J335051J521031J754204K152438K640419L087219
11576B3343219L894549N132188O732592Q914281J2260963J6916099K2587287K9609713
11568A29390891L6394116M0686146M1598264M0368856L7705788K8251536N808205
11561C60203802k4649483m6850008n0922634m3181177l2295871k2417111j4375536
$$ plain form
11554 125511982 117723717 115093637 117153529 123430945 133252852 146249860 161852212 179832329
11546 179832329 199437745 217672785 230718672 236245716 235060672 230847937 227144063
11539 227144063 227599960 235785072 253618103 279811987 311225675 343802489 373535030
11532 373535030 395219470 401502105 387613654 357105092 320673020 289492271 268894449
11525 268894449 259084252 257322010 259162202 259877245 256333608 246906788 231098136 209839253
11517 209839253 186212365 164482966 148131495 137538410 132246673 131344963 134410952
11510 134410952 141611356 153463240 171259408 195840247 226170916 259232819 291393859
11503 291393859 321094212 347187817 362209630 354462063 319638643 268719739 218957161
$$ packed form
11554A25511982p788265k630080K059892O277416R821907J2997008J5602352J7980117
11546A79832329J9605416J8235040J3045887N527044j185044m212735l703874
11539B27144063M55897Q185112J7833031K6193884L1413688L2576814K9732541
11532C73535030K1684440O282635j3888451l0508562l6432072l1180749k0597822
11525B68894449r810197j762242J840192P15043l543637r426820j5808652k1258883
11517B09839253k3626888k1729399j6351471j0593085n291737r01710L065989
11510A34410952P200404J1851884J7796168K4580839L0330669L3061903L2161040
11503B91393859K9700353K6093605J5021813p747567l4823420n0918904m9762578
$$ plain form
11496 218957161 179524290 150254697 129081056 113808781 102655687 94434474 87749163
11489 87749163 82207861 77225683 72511301 68249241 64603408 61579987 58907208 56575229
11481 56575229 54357789 52277551 50554252 48863124 47202149 45777093 44319912 43066985
11473 43066985 41861433 40621033 39474677 38314695 37425087 36532667 35557146 34429463
11465 34429463 33408408 32619322 31888761 30916123 29967475 29236930 28585427 27693899 26785150
11456 26785150 26232707 25806860 25401848 24785195 24116818 23710738 23351929 22982090 22404915
11447 22404915 21776904 21197724 20762623 20439709 19917978 19600866 19413670 18803866 18214889
11438 18214889 17745756 17048967 16488453 16065858 15581041 15316983 15207243 14887239 14371846
$$ packed form
11496B18957161l9432871k9269593k1173641j5272275j1153094q221213o685311
11489H7749163n541302m982178m714382m262060l645833l023421k672779k331979
11481E6575229k217440k080238j723299j691128j660975j425056j457181j252927
11473D3066985j205552j240400j146356j159982q89608q92420r75521j127683
11465C4429463j021055p89086p30561r72638r48648p30545o51503q91528r08749
11456B6785150n52443m25847m05012o16653o68377m06080l58809l69839n77175
11447B2404915o28011n79180m35101l22914n21731l17112j87196o09804n88977
11438A8214889m69133o96789n60514m22595m84817k64058j09740l20004n15393
$$ plain form
11429 14371846 13927724 13675168 13437894 13131139 12887688 12621857 12246676 11821978 11529269
11420 11529269 11251352 10962738 10634449 10323184 10385166 10237811 9853314 9465764 9291657
11411 9291657 9198966 9033449 8861786 8595651 8371512 8274490 8145295 7931715 7696542 7563172
11401 7563172 7474792 7145929 6979451 6891576 6616373 6473395 6350540 6215541 6111802 6042437
11391 6042437 6069188 6060677 6036895 6044276 5938805 5872340 5945064 5810275 5730219 5638272 5472332
11380 5472332 5261695 4976652 4737762 4513671 4393302 4156031 4110824 3970570 3930752 3917022
11370 3917022 3809484 3616493 3309862 3243079 3130282 3119079 3022012 2758242 2731127 2728069
11360 2728069 2647837 2778305 2849965 2785510 2704056 2613830 2611428 2610785 2358867 2073739 1863641
$$ packed form
11429A4371846m44122k52556k37274l06755k43451k65831l75181m24698k92709
11420A1529269k77917k88614l28289l11265O1982j47355l84497l87550j74107
11411I291657r2691j65517j71663k66135k24139r7022j29195k13580k35173j33370
11401G563172q8380l28863j66478q7875k75203j42978j22855j34999j03739o9365
11391F042437K6751q511k3782P381j05471o6465P2724j34789q0056r1947j65940
11380E472332k10637k85043k38890k24091j20369k37271m5207j40254l9818j3730
11370C917022j07538j92991l06631o6783j12797j1203r7067k63770k7115l058
11360B728069q0232J30468P1660o4455q1454r0226k402o43k51918k85128k10098
$$ plain form
11349 1863641 1821646 1817748 1924175 1944145 1950210 1963737 1972476 1872162 1827243 1845451 1938923
11338 1938923 1690203 1531171 1505109 1554157 1532131 1543305 1746046 1865638 1967459 1808718
11328 1808718 1842217 1911830 1917200 1898123 1830210 1721434 1706826 1642734 1641934 1644430 1582375 1532332
11316 1532332 1488006 1403375 1297563 1182400 1183800 1105893 1231656 1238693 1283302 1364763 1363002
11305 1363002 1482862 1511206 1249843 1105966 1198568 1154241 997804 1053714 1137188 1232994
11295 1232994 1127003 1261100 1242102 1235690 1100212 1021132 1000816 997983 1054022 934655 946940
11284 946940 1075921 1288965 1258526 1086907 1174802 1354379 1282893 1256299 1246434 1216628 1217954
11273 1217954 1202890 1119531 1137331 1214567 1271929 1148277 1157039 1191599 1363215 1411181 1188065
$$ packed form
11349A863641m1995l898J06427J9970O065J3527Q739j00314m4919J8208R3472
11338A938923k48720j59032k6062M9048k2026J1174K02741J19592J01821j58741
11328A808718L3499O9613N370j9077o7913j08776j4608o4092q00K496o2055n0043
11316A532332m4326q4631j05812j15163J400p7907J25763P037M4609Q1461j761
11305A363002J19860K8344k61363j43877R2602m4327j56437N5910Q3474R5806
11295A232994j05991J34097j8998o412j35478p9080k0316k833N6039j19367J2285
11284I46940J28981K13044l0439j71619Q7895J79577p1486k6594r865k9806J326
11273A217954j5064q3359J7800P7236N7362j23652Q762L4560J71616M7966k23116
$$ plain form
11262 1188065 1085366 1046486 910800 757163 763840 691003 581446 565098 569637 658035 708480
11251 708480 601702 568869 543422 508202 657867 698871 818766 814327 806523 712582 527970
11240 527970 312732 275910 380636 567021 581654 448869 548957 548382 434270 379053 416112
11229 416112 399082 243705 236584 100857 263679 315204 125056 77419 96205 144428 277168
11218 277168 210272 284275 439957 440400 329635 15140 -109593 -154826 -133814 -36824 80623
11207 80623 189849 190071 74165 39212 266681 546940 635648 709472 504471 376472 387778
11196 387778 294123 325271 386651 273064 129069 94524 189172 226628 17981 113292 423413
11185 423413 435188 299299 296877 174600 190159 236944 363101 346308 335851 225429 217932
$$ packed form
11262A188065j02699l8880j35686j53637O677p2837j09557j6348M539Q8398N0445
11251G08480j06778l2833k5447l5220J49665M1004J19895m439p804r3941j84612
11240E27970k15238l6822J04726J86385J4633j32785J00088n75j14112n5217L7059
11229D16112j7030j55377p121j35727J62822N1525j90148m7637J8786M8223J32740
11218B77168o6896P4003J55682M43j10765l14495j24733m5233K1012R6990J17447
11207H0623J09226K22j15906l4953K27469K80259Q8708P3824k05001j27999J1306
11196C87778r3655L1148O1380j13587j43995l4545R4648L7456k08647R5311L10121
11185D23413J1775j35889k422j22277J5559M6785J26157j6793j0457j10422p497
$$ plain form
11174 217932 181959 188523 216889 362855 370863 216791 194373 312595 248525 239838 209405
11163 209405 341781 475060 273644 35323 103047 398099 378832 389356 525440 640451
11153 640451 682846 554449 490615 469075 545115 361925 280754 303434 253078 319361 363196
11142 363196 288064 346041 355526 373506 494007 602030 721794 773306 867186 967553 1284329
11131 1284329 1519814 1607767 1704117 1911556 1986480 1763098 1724937 1570992 1305554 1075669
11121 1075669 847782 791935 884497 826155 775508 784140 785878 963603 1131838 1232961 1370445
11110 1370445 1425308 1275639 1179850 1266107 1291385 1367212 1312491 1509003 1616385 1562604 1737015
11099 1737015 2027247 2420884 2510765 2435328 2298784 1970689 1855770 1852682 1783425 1584697
$$ packed form
11174B17932l5973O564K8366J45966Q008j54072k2418J18222o4070q687l0433
11163B09405J32376J33279k01416k38321O7724K95052j9267J0524J36084J15011
11153F40451M2395j28397o3834k1540P6040j83190q1171K2680n0356O6283M3835
11142C63196p5132N7977R485J7980J20501J08023J19764N1512R3880J00367L16776
11131A284329K35485Q7953R6350K07439P4924k23382l8161j53945k65438k29885
11121A075669k27887n5847R2562n8342n0647Q632J738J77725J68235J01123J37484
11110A370445N4863j49669r5789Q6257K5278P5827n4721J96512J07382n3781J74411
11099A737015K90232L93637Q9881p5437j36544l28095j14919l088o9257j98728
$$ plain form
11089 1584697 1456374 1475390 1319636 1246606 1423318 1435714 1291997 1208297 1261534 1040285
11079 1040285 1030378 1052535 1136667 1013782 1075589 1066001 1251030 1628446 1981255 2156144 2087779
11068 2087779 2150403 2156337 2028711 1976254 1869002 1761772 1629245 1335888 1154365 1019023
11058 1019023 935569 779107 577631 467164 479132 543618 638967 610348 504994 499315 465115
11047 465115 430268 371748 433253 442763 467271 395629 441708 482786 426504 500981 393876
11036 393876 361333 365031 518662 444558 443843 536849 642174 700431 546604 515321 518947 467017
11024 467017 453655 441996 277192 278033 503813 569181 450310 467828 497538 402165 423241
11013 423241 360196 410554 497355 444446 265634 295649 315260 344738 260040 128086 188092
$$ packed form
11089A584697j28323J9016j55754p3030J76712J2396j43717q3700N3237k21249
11079A040285r907K2157Q4132j22885O1807r588J85029L77416L52809J74889o8365
11068B087779O2624N934j27626n2457j07252j07230j32527k93357j81523j35342
11058A019023q3454j56462k01476j10467J1968O4486R5349k8619j05354n679l4200
11047D65115l4847n8520O1505R510K4508p1642M6079M1078n6282P4477j07105
11036C93876l2543L698J53631p4104p15R3006J05325N8257j53827l1283L626n1930
11024D67017j3362j1659j64804Q41K25780O5368j18871J7518K9710r5373K1076
11013D23241o3045N0358Q6801n2909j78812L0015J9611K9478q4698j31954O0006
$$ plain form
11002 188092 345239 395527 262670 170903 295854 339162 421222 294959 338652 501813
10992 501813 507337 424627 306677 254174 348587 151606 94939 178258 283531 462673 623465
10981 623465 382618 101781 139225 389850 333390 142787 2626 -29670 49709 87284
10971 87284 56526 191096 176553 90629 157904 34263 -82328 -25232 -15304 3421 177165
10960 177165 216905 190961 180833 370753 403346 168657 126459 263598 163235 200002 238357
10949 238357 34740 63313 277703 397354 366301 329446 247094 251955 282348 191718 111249
10938 111249 157353 362282 371678 341898 366258 315534 91231 79084 292267 434837 403976
10927 403976 309233 285087 268999 152664 31931 105183 103937 78357 249389 379897 279281
$$ packed form
11002A88092J57147N0288j32857r1767J24951M3308Q2060j26263M3693J63161
10992E01813N524q2710j17950n2503R4413j96981n6667Q3319J05273J79142J60792
10981F23465k40847k80837L7444K50625n6460j90603j40161l2296P9379L7575
10971H7284l0758J34570j4543q5924O7275j23641j16591N7096R928J8725J73744
10960A77165L9740k5944j0128J89920L2593k34689m2198J37139j00363L6767L8355
10949B38357k03617K8573K14390J19651l1053l6855q2352M861L0393r0630q0469
10938A11249M6104K04929R396k9780K4360n0724k24303j2147K13183J42570l0861
10927D03976r4743k4146j6088j16335j20733P3252j246k5580J71032J30508j00616
$$ plain form
10916 279281 183378 242877 322194 270934 18696 18101 38303 -113493 -171924 -5273 52264
10905 52264 64857 -89517 -134234 -106360 -87980 2470 139276 232847 261105 165684 74196
10894 74196 224487 281965 284475 117475 159123 195144 233590 169102 135669 226943 185154
10883 185154 106783 105245 37434 44265 93621 86776 -109981 -147622 -26456 22650 123081
10872 123081 176246 207643 189374 103937 51243 165978 130195 98962 150844 179303 68306
10861 68306 23998 14865 -121380 -165764 24402 149403 74001 -156638 -186128 -152178 -212543
10850 -212543 -199568 -211566 -110540 -34939 62515 -70191 -96726 71743 156629 210983 356903
10839 356903 186508 50018 181267 163371 23450 -7707 -43693 70642 126993 112971
$$ packed form
10916B79281r5903N9499P9317n1260k52238n95K0202j51796n8431J66651N7537
10905E2264J2593j54374m4717K7874J8380R0450J36806R3571K8258r5421r1488
10894G4196J50291N7478K510j67000M1648L6021L8446o4488l3433R1274m1789
10883A85154p8371j538o7811O831M9356o845j96757l7641J21166M9106J00431
10872A23081N3165L1397j8269q5437n2694J14735l5783l1233N1882K8459j10997
10861F8306m4308r133j36245m4384J90166J25001p5402k30639k9490L3950o0365
10850b12543J2975j1998J01026P5601R7454j32706k6535J68469Q4886N4354J45920
10839C56903j70395j36490J31249j7896j39921l1157l5986J14335N6351j4022
$$ plain form
10829 112971 199512 341525 381064 339405 300150 112328 186120 183100 164522 94062 126831
10818 126831 370971 331075 217117 222450 278832 192908 162471 117104 211515 207456 282731
10807 282731 298538 246942 92409 119135 19855 147499 110647 68917 -19136 69205 79817
10796 79817 97321 43929 83907 239563 292632 312291 256306 266218 274830 217085 261389 364129
10784 364129 333499 362034 298016 229873 109721 47335 146625 347715 323256 242132 33681
10773 33681 100225 111199 139685 -47891 -117943 -135920 -1932 77478 120366 -50406 -18913
10762 -18913 238498 82451 -143467 -76228 -85396 -10617 34348 97399 260806 166593 158856
10751 158856 212341 231287 186474 260689 396282 470421 466293 202794 159161 217662 294847
$$ packed form
10829A12971Q6541J42013L9539m1659l9255j87822P3792l020j8578p0460L2769
10818A26831K44140l9896j13958N333N6382q5924l0437m5367R4411m059P5275
10807B82731J5807n1596j54533K6726r9280J27644l6852m1730q8053Q8341J0612
10796G9817J7504n3392L9978J55656N3069J9659n5985R912Q612n7745M4304J02740
10784C64129l0630K8535o4018o8143j20152o2386R9290K01090k4459q1124k08451
10773C3681O6544J0974K8486j87576p0052j7977J33988P9410M2888j70772L1493
10762a8913K57411j56047k25918O7239r168P4779M4965O3051J63407r4213p737
10751A58856N3485J8946m4813P4215J35593P4139m128k63499m3633N8501P7185
$$ plain form
10740 294847 296121 157503 167281 175513 17252 67454 87604 106956 -73114 -124239 34386
10729 34386 136691 77865 100127 231962 402214 504686 397625 295874 146680 21346
10719 21346 -143074 -76281 -46728 -73310 -24203 -139912 -196464 -211139 -45188 162326 195210
10708 195210 234688 312536 303608 218587 200813 150679 -46854 28633 130368 89323 71403
10697 71403 121188 209863 100505 -164305 -254474 -174750 -117206 79471 71448 47008 34609
10686 34609 132681 117007 148518 256816 303340 90752 -48985 12827 -51637 -84685 -100976
10675 -100976 -166007 -214859 -243344 -82978 -12205 -77372 -53089 -122665 -89579 -107267 -244005
10664 -244005 -143945 128173 169198 108899 128222 194451 33400 -17763 165507 245550 134381
$$ packed form
10740B94847J274j38618R778Q232j58261N0202K0150J9352j80070n1125J58625
10729C4386J02305n8826K2262J31835J70252J02472j07061j01751j49194j25334
10719B1346j64420O6793K9553k6582M9107j15709n6552j4675J65951K07514L2884
10708A95210L9478P7848q928q5021j7774n0134j97533P5487J01735m1045j7920
10697G1403M9785Q8675j09358k64810r0169P9724N7544J96677q023k4440j2399
10686C4609R8072j5674L1511J08298M6524k12588j39737O1812o4464l3048j6291
10675a00976o5031m8852k8485J60366P0773o5167K4283o9576L3086j7688j36738
10664b44005J00060K72118M1025o0299J9323O6229j61051n1163J83270Q0043j11169
$$ plain form
10653 134381 76352 1569 17502 88718 129338 233357 170654 5639 -55481 -98055 -93545
10642 -93545 -25895 -106267 -245526 -231594 -187104 -68324 -212410 -153646 -141260 -218303 -111743
10631 -111743 33131 -12069 18121 261059 231012 210149 239907 109622 175972 114229 33114
10620 33114 122768 109423 94786 96012 247474 340156 205339 116002 155161 223389 160222
10609 160222 299949 325384 234949 155575 220796 197188 33941 -28641 140547 185282 143940
10598 143940 86718 156197 5119 -204912 -180555 5986 35029 5137 40667 -4139 14369
10587 14369 105530 76828 -20802 10858 -31110 140177 149785 -7888 -79778 102843 285490
10576 285490 330031 41292 -37603 -55362 -120020 21440 109565 128594 48517 -92649 -150146
$$ packed form
10653A34381n8029p4783J5933P1216M0620J04019o2703j65015o1120m2574M510
10642i3545O7650q0372j39259J3932M4490J18780j44086N8764J2386p7043J06560
10631a11743J44874m5200L0190K42938l0047k0863K9758j30285O6350o1743q1115
10620C3114Q9654j3345j4637J226J51462R2682j34817q9337L9159O8228o3167
10609A60222J39727K5435r0435p9374O5221k3608j63247o2582J69188M4735m1342
10598A43940n7222O9479j51078k10031K4357J86541K9043k9892L5530m4806J8508
10587A4369R1161k8702r7630L1660m1968J71287R608j57673p1890J82621J82647
10576B85490M4541k88739p8895j7759o4658J41460Q8125J9029q0077j41166n7497
$$ plain form
10565 -150146 -29384 106202 101081 103266 144004 94835 -106998 -182082 -233411 3515 183980
10554 183980 51081 140886 203259 280700 326240 217838 93866 -54391 -193012 -111746
10544 -111746 67290 310948 200553 20972 -107970 -116153 -81092 -90015 57125 -19850 -32333
10533 -32333 -9368 25971 -25699 -74876 -142414 -144401 -229790 -190714 -86686 116883 203747
10522 203747 195148 167742 -17898 -55722 -24767 -20504 31189 -98 -46284 60491 263550
10511 263550 295582 279045 319036 108854 -60938 -74657 -98611 8344 38807 47471 26414
10500 26414 30106 94613 71635 -194738 -258751 -209908 -367694 -370456 -213983 -119165 -164633
10489 -164633 -55152 25211 -140320 -206326 -289490 -283846 -190323 -143720 -219046 -322510 -265142
$$ packed form
10565a50146J20762J35586n121K185M0738m9169k01833p5084n1329K36926J80465
10554A83980j32899Q9805O2373P7441M5540j08402j23972j48257j38621Q1266
10544a11746J79036K43658j10395j79581j28942q183L5061q923J47140p6975j2483
10533c2333K2965L5339n1670m9177o7538j987q5389L9076J04028K03569Q6864
10522B03747q599k7406j85640l7824L0955M263N1693l1287m6186J06775K03059
10511B63550L2032j6537L9991k10182j69792j3719k3954J06955L0463Q664k1057
10500B6414L692O4507k2978k66373o4013M8843j57786k762J56473R4818m5468
10489a64633J09481Q0363j65531o6006q3164N644R3523M6603p5326j03464N7368
$$ plain form
10478 -265142 -95217 -17460 65853 200108 90096 -6584 -83297 -278472 -279369 -235685 -64963
10467 -64963 90312 38899 54856 126623 194467 218526 141514 4984 9798 139088 181047
10456 181047 140861 -20214 50390 96590 116038 146061 69828 119632 304733 178849 141524
10445 141524 181020 225532 330681 275495 325207 245509 -78321 -69074 20023 58293 74177
10434 74177 110601 173599 90593 16547 43004 78927 115484 93646 58768 114732 144131 155630
10422 155630 259784 403964 365702 161828 240281 303189 190130 134111 199426 136144 -55422
10411 -55422 -137298 -73489 111825 159603 -32492 -77279 -13864 83004 116605 127837 116050
10400 116050 -3254 -75742 -106062 -104001 -100423 -178241 -257645 -169869 -26642 192422 243612
$$ packed form
10478b65142J69925P7757Q3313J34255j10012r6680p6713j95175q97M3684J70722
10467f4963J55275n1413J5957P1767O7844K4059p7012j36530M814J29290M1959
10456A81047m0186j61075P0604M6200J9448L0023p6233M9804J85101j25884l7325
10445A41524L9496M4512J05149n5186M9712p9698l23830R247Q9097L8270J5884
10434G4177L6424O2998q3006p4046K6457L5923L6557k1838l4878N5964K9399J1499
10422A55630J04154J44180l8262k03874P8453O2908j13059n6019O5315o3282j91566
10411e5422q1876O3809J85314M7778j92095m4787O3415R6868L3601J1232j1787
10400A16050j19304p2488l0320K061L578p7818p9404Q7776J43227K19064N1190
$$ plain form
10389 243612 209652 202537 102163 32615 -8731 36854 -58423 -179547 -226977 -80788 -172476
10378 -172476 -52922 64690 33041 -69933 -16397 47673 27669 150154 100764 -51160
10368 -51160 59672 202155 355605 371549 428588 351428 376646 304819 295257 266798 350773
10357 350773 467060 697191 1090613 1485448 1615553 2131981 2922416 3997667 5142321
10348 5142321 6307155 7328850 8256844 9041619 9707456 10032355 9952697 9575445 9103248
10339 9103248 8266666 7217734 6159510 5109770 4300185 3684250 3173469 2543955 2045620
10330 2045620 1803194 1602156 1369303 1162764 1158011 1157570 1190713 1189305 1139711 927733 913841
10319 913841 970264 911961 833169 839881 925792 721452 512444 556665 760444 731302 593554
$$ packed form
10389B43612l3960p115j00374o9548m1346M5585r5277j21124m7430J46189r1688
10378a72476J19554J17612l1649j02974N3536O4070k0004J22485m9390j51924
10368e1160J10832J42483J53450J5944N7039p7160K5218p1827r562k8459Q3975
10357C50773J16287K30131L93422L94835J30105N16428P90435J075251J144654
10348E142321J164834J021695R27994P84775O65837L24899p9658l77252m72197
10339I103248q36582j048932j058224j049740q09585o15935n10781o29514m98335
10330B045620k42426k01038k32853k06539m753m41L3143j408m9594k11978j3892
10319I13841N6423n8303p8792O712Q5911k04340k09008M4221K03779k9142j37748
$$ plain form
10308 593554 461565 388923 500631 633112 635149 573029 668451 787002 629397 476340
10298 476340 424793 437248 462300 284699 257431 272463 497349 606974 497466 419292 596747
10287 596747 751505 860120 744699 634368 601699 628498 573856 457694 447405 306353
10277 306353 352201 516050 564853 646827 449307 427090 442899 550123 423415 384477 335701
10266 335701 234485 258586 66444 -81522 -14473 107582 271822 352174 349503 233465
10256 233465 205354 55437 84677 156373 142422 163047 122174 225248 177003 57109 269662
10245 269662 372006 247004 188511 135534 -75017 -175669 -197243 -116475 -1755 -125314
10235 -125314 -330644 -389093 -192718 -297802 -261519 -100477 -82966 6264 132241 199005
$$ packed form
10308E93554j31989p2642J11708J32481K037o2120R5422J18551j57605j53057
10298D76340n1547J2455K5052j77601k7268J5032K24886J09625j09508p8174J77455
10287E96747J54758J08615j15421j10331l2669K6799n4642j16162j0289j41052
10277C06353M5848J63849M8803Q1974j97520k2217J5809J07224j26708l8938m8776
10266C35701j01216K4101j92142j47966O7049J22055J64240Q0352k671j16038
10256B33465k8111j49917K9240P1696j3951K0625m0873J03074m8245j19894K12553
10245B69662J02344j25002n8493n2977k10551j00652k1574Q0768J14720j23559
10235a25314k05330n8449J96375j05084L6283J61042J7511Q9230J25977O6764
$$ plain form
10225 199005 267456 283810 295689 209357 -21474 -36415 22321 140853 33362 59993 285241
10214 285241 329208 199357 151749 39697 110320 332699 410506 222031 27119 -112074
10204 -112074 -4710 -14233 -96148 21718 60084 87396 209242 189401 180142 99009 44011
10193 44011 98382 567 21708 -123843 -54576 514 16695 82713 167836 89963 8802
10182 8802 611 87762 122206 -66105 -159149 -39593 -38744 89602 146477 124197 22565 -22322
10170 -22322 -96871 8220 -37175 -62409 -136138 -129780 -11096 118652 134318 109865 179325
10159 179325 232638 152869 4412 -78609 139086 218352 179660 93284 -30191 -214521 -297399
10148 -297399 -335173 -231922 49376 71908 19602 -4784 -146627 -325208 -330232 -398770 -342807
$$ packed form
10225A99005O8451J6354J1879q6332k30831j4941N8736J18532j07491K6631K25248
10214B85241M3967j29851m7608j12052P0623K22379P7807j88475j94912j39193
10204a12074J07364r523q1915J17866L8366K7312J21846j9841r259q1133n4998
10193D4011N4371r7815K1141j45551O9267N5090J6181O6018Q5123p7873q1161
10182H802q191Q7151L4444j88311r3044J19556Q49J28346N6875k2280j01632m4887
10170b2322p4549J05091m5395k5234p3729O358J18684J29748J5666k4453O9460
10159A79325N3313p9769j48457q3021K17695P9266l8692q6376j23475j84330q2878
10148b97399l7774J03251K81298K2532n2306k4386j41843j78581n024o8538N5963
$$ plain form
10137 -342807 -245694 -262875 -232059 -111557 21718 25857 12207 -39565 -70459 41646 -93165
10126 -93165 -116704 -154991 -210743 -155656 -130239 -115604 -109996 -104560 -36953 -44803 -169203 -92499
10114 -92499 -180556 -146551 32447 227702 76891 -27497 -70390 -103085 -65133 -210149 -190087
10103 -190087 -108778 -71544 -142658 -130156 -157803 -113224 -78924 64535 87415 -7848 -123044
10092 -123044 -79237 -85049 -248536 -249226 -184789 -89942 -52248 -78836 -143002 -88762 131622 333001
10080 333001 238781 153067 143397 338976 255736 -4192 -113638 -117894 -24274 220856 203475
10069 203475 39652 -53901 -193741 -139350 15413 36055 -106819 17988 179413 192847
10059 192847 223048 210346 156360 227185 215246 158095 301212 388771 443570 475571 316901
$$ packed form
10137c42807R7113j7181L0816J20502J33275M139j3650n1772l0894J12105j34811
10126i3165k3539l8287n5752N5087K5417J4635N608N436O7607p850j24400P6704
10114i2499q8057L4005J78998J95255j50811j04388m2893l2695L7952j45016K0062
10103a90087Q1309L7234p1114J2502k7647M4579L4300J43459K2880r5263j15196
10092a23044M3807n812j63487o90O4437R4847L7694k6588o4166N4240K20384K01379
10080C33001r4220q5714r670J95579q3240k59928j09446m256R3620K45130j7381
10069B03475j63823r3553j39840N4391J54763K0642j42874J24807J61425J3434
10059A92847L0201j2702n3986P0825j1939n7151J43117Q7559N4799L2001j58670
$$ plain form
10048 316901 56469 -130017 6811 100962 168229 209396 36493 -301166 -581100 -413852
10038 -413852 -146244 -60925 -47350 -76525 -64962 -265073 -190104 -74565 28754 270851
10028 270851 254016 265427 166928 224202 195212 19356 -36352 -119155 -9376 143724 165693
10017 165693 191894 218729 75411 -130479 -246244 -238361 -207335 -169856 -141091 49034 9570
10006 9570 77154 30490 -42066 -20480 5656 71351 53920 58577 37286 -49259 -1205 30595
9994 30595 58241 40511 -52016 -211288 -98331 -102657 -113565 63971 21930 52512 67601
9983 67601 263066 303464 203936 -52777 -114233 -110979 -106945 21474 61870 210070 223093
9972 223093 263444 -16691 -62762 -13868 -91173 33287 90593 70495 -88455 -140023 -100801
$$ packed form
10048C16901k60432j86486J36828R4151O7267M1167j72903l37659k79934J67248
10038d13852K67608Q5319J3575k9175J1563k00111P4969J15539J03319K42097
10028B70851j6835J1411r8499N7274k8990j75856n5708q2803J09779J53100K1969
10017A65693K6201K6835j43318k05890j15765P883L1026L7479K8765J90125l9464
10006I570O7584m6664p2556K1586K6136O5695j7431M657k1291q6545M8054L1800
9994C0595K7646j7730r2527j59272J12957m326j0908J77536m2041L0582J5089
9983F7601J95465M0398r9528k56713o1456L254M034J28419M0396J48200J3023
9972B23093M0351k80135m6071M8894p7305J24460N7306k0098j58950n1568L9222
$$ plain form
9961 -100801 -175328 -168720 -252924 -249232 -127656 -60281 -113527 -132924 65325 32716 -46803 -140453
9949 -140453 -97092 -49704 25055 46536 68761 29396 41863 159524 397946 277719 228806
9938 228806 164765 -58766 -147669 -45418 33476 85760 20611 -3134 59643 78830 115997
9927 115997 26281 112583 199129 308093 378732 387188 330878 329134 128439 -153186 -9736
9916 -9736 100133 -84477 -50049 -33674 -55281 -132884 -214726 -105220 -161585 -235575 -207365
9905 -207365 -95750 -87906 51813 142089 110304 103066 -9102 -44160 -31884 -170021 -99746
9894 -99746 -12127 151979 143713 103095 2097 -156972 -120301 -63732 -46181 -47864 -33350 -66537
9882 -66537 -25959 60608 232639 328177 72050 149167 138832 47039 -31448 -68382 94329
$$ packed form
9961a00801p4527O608q4204L692J21576O7375n3246j9397J98249l2609p9519r3650
9949a40453M3361M7388P4759K1481K2225l9365J2467J17661K38422j20227m8913
9938B28806o4041k23531q8903J02251P8894N2284o5149k3745O2777J9187L7167
9927A15997q9716Q6302Q6546J08964P0639Q456n6310j744k00695k81625J43450
9916i736J09869j84610L4428J6375k1607p7603q1842J09506n6365p3990K8210
9905b07365J11615P844J39719R0276l1785p238j12168l5058J2276j38137P0275
9894i9746Q7619J64106q266m0618j00998j59069L6671N6569J7551j683J4514l3187
9882f6537M0578Q6567J72031R5538k56127P7117j0335r1793p8487l6934J62711
$$ plain form
9871 94329 -22268 -53061 1577 -23373 -16477 -16439 -221115 -295406 -296492 -199125 13996 2662
9859 2662 122409 12223 -30966 -47579 8517 -120907 -232979 -307689 -169023 -3943 53272
9848 53272 77559 65787 -47060 -41925 113478 3898 -147646 -49926 23460 -6422 -79813
9837 -79813 -324305 -275973 -227515 -342265 -161321 -163055 -257397 -240891 -155496 -57308 -152838
9826 -152838 -171976 -254900 -305253 -197001 -120912 -74698 -13649 -8454 -72387 -102458 -130476 -7006
9814 -7006 92170 95689 -114152 -107482 -49270 -50352 -8759 -20287 109698 130441 -26902 -169451
9802 -169451 -151505 -148124 -69123 -132922 -147891 -40781 -34919 8032 112638 296693 213147
9791 213147 36129 142850 298669 193783 106681 67696 35154 -82677 -114228 25093
$$ packed form
9871I4329j16597l0793N4638k4950O896L8k04676p4291j086R7367K13121j1334
9859B662J19747j10186m3189j6613N6096j29424j12072p4710J38666J65080N7215
9848E3272K4287j1772j12847N135J55403j09580j51544R7720P3386k9882p3391
9837g9813k44492M8332M8458j14750J80944j734r4342J6506Q5395R8188r5530
9826a52838j9138q2924n0353J08252P6089M6214O1049N195o3933l0071k8018J23470
9814g006R9176L519k09841O670N8212j082M1593j1528J29985K0743j57343j42549
9802a69451J7946L381P9001o3799j4969J07110N862M2951J04606J84055q3546
9791B13147j77018J06721J55819j04886q7102l8985l2542j17831l1551J39321
$$ plain form
9781 25093 54864 -86353 -163061 -38848 -83194 -41631 -36654 -11764 -41999 -50452 -10702 3084
9769 3084 -5770 -133429 -551455 -475574 -361520 -339042 -220348 -371103 -415002 -73288 -20197
9758 -20197 -125447 -93154 154542 213245 193447 329022 231484 10096 72858 89228 19078
9747 19078 108937 96980 161053 201246 15304 -76861 -7570 -8353 -33846 -180652 -312624 -213714
9735 -213714 -122068 -127612 -86048 -90239 31159 -26410 6749 -13039 -100047 -119228 69454 137624
9723 137624 137537 254132 192728 152087 149932 56790 105261 58146 -93838 -211257 -254091 -190703
9711 -190703 -196228 41909 97345 112338 204313 101346 -143487 -215699 -276396 -163899 -142282
9700 -142282 -253562 -207677 -25487 -19015 -130511 -172224 -181815 -165232 -83905 -29606 -82965
$$ packed form
9781B5093K9771j41217p6708J24213m4346M1563M977K4890l0235q453L9750J3786
9769C084q854j27659m18026P5881J14054K2478J18694j50755m3899L41714N3091
9758b0197j05250L2293K47696N8703j9798J35575r7538k21388O2762J6370p0150
9747A9078Q9859j1957O4073M0193j85942r2165O9291p83k5493j46806j31972R8910
9735b13714R1646n544M1564m191J21398n7569L3159j9788q7008j9181J88682O8170
9723A37624q7J16595o1404m0641k155r3142M8471m7115j51984j17419m2834O3388
9711a90703n525K38137N5436J4993R1975j02967k44833p2212o0697J12497K1617
9700a42282j11280M5885J82190O472j11496m1713r591J6583Q1327N4299n3359
$$ plain form
9689 -82965 -141875 2088 -104687 -122624 -119350 -142779 -134464 -57086 -17972 -91850 -301334 -137189
9677 -137189 -99151 -22022 153839 113958 -52724 -111168 -98582 -207950 -121227 -243161 -373173
9666 -373173 -447618 -424021 -250726 -217011 -330128 -274654 -67860 122585 -13522 -89730 85701
9655 85701 112107 -33101 -99065 -66548 -2453 -92907 -73701 -103998 -198732 -148332 20663
9644 20663 35197 20254 39926 -35616 -81428 -109342 -280529 -242051 -139561 -55159 -19634
9633 -19634 12856 -47401 -35135 -61115 -54421 14723 43255 12130 -203302 -380215 -266429
9622 -266429 -272939 -348536 -149346 -76312 -46659 -109078 -129492 -239853 -275551 -198241 38902
9611 38902 40501 5407 94935 57296 -88512 -20606 -31163 -26397 11608 47531 -151804 -114567
$$ packed form
9689h2965n8910J43963j06775j7937L274k3429Q315P7378L9114p3878k09484J64145
9677a37189L8038P7129J75861l9881j66682n8444J2586j09368Q6723j21934j30012
9666c73173p4445K3597J73295L3715j13117N5474K06794J90445j36107p6208J75431
9655H5701K6406j45208o5964L2517O4095r0454J9206l0297r4734N0400J68995
9644B0663J4534j4943J9672p5542m5812k7914j71187L8478J02490Q4402L5525
9633a9634L2490o0257J2266k5980O694O9144K8532l1125k15432j76913J13786
9622b66429o510p5597J99190P3034K9653o2419k0414j10361l5698P7310K37143
9611C8902J599l5094Q9528l7639j45808O7906j0557M766L8005L5923j99335L7237
$$ plain form
9599 -114567 52063 160109 139820 229875 249142 102440 145216 161204 267778 235494 232158
9588 232158 200572 54189 -5971 79078 -27234 -104826 -82890 -117564 -141621 -55629 49998
9577 49998 82896 48429 87667 183829 244261 280908 123951 52609 -42114 -148546 -239360
9566 -239360 -318899 -196184 -131809 107292 207725 167153 144449 36173 132514 -69670 -174665
9555 -174665 -59024 -14379 -43315 -21020 -54598 -297411 -251430 68501 87196 148340 -50669
9544 -50669 -100273 -85610 -32942 -103805 -178171 -132124 44184 132575 18736 -55889 -208295
9533 -208295 -291560 -342666 -337809 -230474 -128750 -166527 12428 151252 181049 224884 186134
9522 186134 82735 23303 70845 170925 84117 103323 215935 351066 282737 341551 251018
$$ packed form
9599a14567J66630J08046k0289R0055J9267j46702M2776J5988J06574l2284l336
9588B32158l1586j46383o0160Q5049j06312p7592K1936l4674k4057Q5992J05627
9577D9998L2898l4467L9238R6162O0432L6647j56957p1342r4723j06432r0814
9566b39360p9539J22715O4375K39101J00433m0572k2704j08276R6341k02184j04995
9555a74665J15641M4645k8936K2295l3578k42813M5981L19931J8695O1144j99009
9544e0669m9604J4663N2668p0863p4366M6047J76308Q8391j13839p4625j52406
9533b08295q3265n1106M857J07335J01724l7777J78955J38824K9797M3835l8750
9522A86134j03399n9432M7542J00080q6808J9206J12612J35131o8329N8814r0533
$$ plain form
9511 251018 233286 199279 106302 51546 -231863 -357118 -298906 -238259 -46510 97428 164096
9500 164096 121939 228874 290946 179498 11456 -15087 63330 138529 58324 -144562 -154332
9489 -154332 -128107 -94971 107391 152283 52051 68010 44578 35333 -74518 -122833 -44179
9478 -44179 1832 -139952 -208780 -34137 8009 182469 371293 265294 179912 133914 212972
9467 212972 224624 75479 -16333 -28253 -18385 -123935 -175331 -216511 -331450 -267619 -157522
9456 -157522 -96202 -93014 39124 29478 -7996 106829 116299 212755 256863 195365 81941 66072
9444 66072 -966 95396 9889 -147882 -117538 -249080 -256690 -210970 -180769 -197533 -116782 -116821
9432 -116821 -63858 73199 -57012 114648 230290 195828 107944 29004 -4079 -60977 10625
$$ packed form
9511B51018j7732l4007r2977n4756k83409j25255N8212O0647J91749J43938O6668
9500A64096m2157J06935O2072j11448j68042k6543P8417P5199q0205k02886r770
9489a54332K6225L3136K02362M4892j00232J5959k3432r245j09851m8315P8654
9478d4179M6011j41784o8828J74643M2146J74460J88824j05999q5382m5998P9058
9467B12972J1652j49145r1812j1920R868j05550n1396m1180j14939O3831J10097
9456a57522O1320L188J32138r646l7474J14825R470R6456M4108o1498j13424j5869
9444F6072o7038R6362q5507j57771L0344j31542p610M5720L0201j6764Q0751l9
9432a16821N2963J37057j30211J71660J15642l4462q7884p8940l3083n6898P1602
$$ plain form
9421 10625 -31361 215975 378349 244811 22689 -49965 -93389 15369 -23812 -71230 -19704
9410 -19704 -151605 -163463 -243996 -283018 -333780 -240177 -100942 -166855 -132890 1082 152203
9399 152203 167164 49569 39780 -31160 624 -2541 33222 102328 133156 -26907 -183721
9388 -183721 27510 78855 125834 95821 211163 218366 175333 177407 127008 147055 245214 281099
9376 281099 288860 139314 136811 123536 79053 78684 154123 171919 271553 356534 361891 312041
9364 312041 183013 86491 101328 -49281 -150594 -138334 124598 269487 333055 347231 377330
9353 377330 308769 252180 278798 360936 341475 336983 256048 248536 357636 471934 646444
9342 646444 652443 509976 477806 469741 437364 495116 634098 838311 1061330 1392266 1556048
$$ packed form
9421A0625m1986K47336J62374j33538k22122p2654m3424J08758l9181m7418N1526
9410a9704j31901j1858q0533l9022n0762R3603J39235o5913L3965J33972J51121
9399A52203J4961j17595r789p0940L1784l165L5763O9106L0828j60063j56814
9388a83721K11231N1345M6979l0013J15342P203m3033K074n0399K0047R8159L5885
9376B81099P761j49546k503j3275m4483l69P5439J7796R9634Q4981N357m9850
9364C12041j29028r6522J4837j50609j01313J2260K62932J44889O3568J4176L0099
9353C77330o8561n6589K6618Q2138j9461m492q0935p512J09100J14298J74510
9342F46444N999j42467l2170q065l2377N7752J38982K04213K23019L30936J63782
$$ plain form
9331 1556048 1647171 1647434 1753708 1964624 2247814 2517651 2760561 3038236 3339918 3994554
9321 3994554 4524082 5244782 6235497 7627819 9073805 11204426 14149006 17752856 22483783
9312 22483783 28854795 36678812 45460274 54263040 62824441 71421409 78865686 82015984
9304 82015984 77382048 66172876 53386240 42883237 35534149 30229834 26415556 23629908
9296 23629908 21329776 19711566 18329302 17188122 16501973 16043977 15573715 15281356 15028739
9287 15028739 15000515 15288874 15653050 16103623 17086432 18695054 20586477 22860361 26164117
9278 26164117 30801920 37316926 46433190 58411694 73682128 91890450 110930771 128643967
9270 128643967 146239788 164603683 177718711 173269404 147904037 116080302 90177628
$$ packed form
9331A556048R1123K63J06274K10916K83190K69837K42910K77675L01682O54636
9321C994554N29528P20700R90715J392322J445986K130621K944580L603850M730927
9312B2483783O371012P824017Q781462Q802766Q561401Q596968P444277L150298
9304H2015984m633936j1209172j2786636j0503003p349088n304315l814278k785648
9296B3629908k300132j618210j382264j141180o86149m57996m70262k92359k52617
9287A5028739k8224K88359L64176M50573R82809J608622J891423K273884L303756
9278B6164117M637803O515006R116264J1978504J5270434J8208322J9040321J7713196
9270A28643967J7595821J8363895J3115028m449307k5365367l1823735k5902674
$$ plain form
9263 90177628 72080479 59561066 50798624 44415849 39810290 36441647 33627978 31261741
9255 31261741 29144760 27380088 25859813 24806013 23804116 22983143 22486148 22332460 22368093
9246 22368093 22241863 22432159 22842339 23616452 24884621 26655310 29252263 32759484 37408667
9237 37408667 43355831 50619474 58647926 66372310 73754509 81041347 86639552 86953826
9229 86953826 79428965 66696515 54079300 44146339 37044533 31851032 28201450 25505778
9221 25505778 23205246 21398764 20032785 18961457 17980090 16834007 16002790 15291013 14601197
9212 14601197 14109041 13572119 13016798 12678021 12434944 12201764 11909151 11450434 11137476
9203 11137476 10630746 10161595 9726033 9480552 9361626 9149406 9080331 8793402 8603643 8457311
$$ packed form
9263I0177628j8097149j2519413q762442o382775m605559l368643k813669k366237
9255C1261741k116981j764672j520275j053800j001897q20973m96995j53688L5633
9246B2368093j26230J90296M10180P74113J268169J770689K596953L507221M649183
9237C7408667N947164P263643Q028452P724384P382199P286838N598205L14274
9229H6953826p524861j2732450j2617215r932961p101806n193501l649582k695672
9221B5505778k300532j806482j365979j071328r81367j146083q31217p11777o89816
9212A4601197m92156n36922n55321l38777k43077k33180k92613m58717l12958
9203A1137476n06730m69151m35562k45481j18926k12220o9075k86929j89759j46332
$$ plain form
9193 8457311 8347662 8043904 7959155 7911411 7664308 7667991 7639348 7524313 7600960 7579454 7446311
9182 7446311 7500098 7638021 7800054 7722566 7966971 8216198 8441554 8537586 8530907 8701079
9172 8701079 9116038 9351442 9714834 10279625 10884415 11641276 12535635 13695939 14994744
9163 14994744 16588465 18652312 21401269 24842229 29135923 34234492 39908939 45597458
9155 45597458 51311959 56343068 60185301 62030053 61074152 57092721 50969518 44386446
9147 44386446 37893219 32560051 28302043 24750401 21709003 19580255 17911481 16342579
9139 16342579 15143301 14030902 13010676 12076233 11296465 10633273 10113445 9620514 9197683
9130 9197683 8786836 8360244 7975178 7719797 7539160 7203800 6976718 6676399 6339508 5940919
$$ packed form
9193H457311j09649l03758q4749m7744k47103L683k8643j15035P6647k1506j33143
9182G446311N3787J37923J62033p7488K44405K49227K25356R6032o679J70172
9172H701079M14959K35404L63392N64791O04790P56861Q94359J160304J298805
9163A4994744J593721K063847K748957L440960M293694N098569N674447N688519
9155D5597458N714501N031109L842233J844752r55901l981431o123203o583072
9147D4386446o493227n333168m258008l551642l041398k128748j668774j568902
9139A6342579j199278j112399j020226r34443p79768o63192n19828m92931m22831
9130I197683m10847m26592l85066k55381j80637l35360k27082l00319l36891l98589
$$ plain form
9120 5940919 5740184 5637487 5616183 5327714 5155872 5029165 4782041 4812826 4924023 4903837
9110 4903837 4576881 4336582 4311027 4284667 4183214 4082040 4066478 3914270 3703390 3790666
9100 3790666 3735071 3681327 3659331 3605036 3477407 3398422 3291430 3207121 3130754 2987838 2979187
9089 2979187 2898837 3025153 3073118 2976591 2761210 2314922 2102609 2154293 2296635 2298509 2245752
9078 2245752 2044040 1951145 1829857 1867910 1774188 1586363 1582663 1659509 1586490 1515740 1511382
9067 1511382 1650362 1752424 1648199 1606754 1742973 1803017 1609349 1570746 1416507 1574066
9057 1574066 1603626 1445827 1181804 1193023 1307542 1378126 1361283 1313512 1060536 972201 930393
9046 930393 1096625 1151319 990595 964807 810574 605431 777911 966720 1026768 943382
$$ packed form
9120E940919k00735j02697k1304k88469j71842j26707k47124L0785J11197k0186
9110D903837l26956k40299k5555k6360j01453j01174j5562j52208k10880Q7276
9100C790666n5595n3744k1996n4295j27629p8985j06992q4309p6367j42916q651
9089B979187q0350J26316M7965r6527k15381m46288k12313N1684J42342J874n2757
9078B245752k01712r2895j21288L8053r3722j87825l700P6846p3019p0750m358
9067A511382J38980J02062j04225m1445J36219O0044j93668l8603j54239J57559
9057A574066K9560j57799k64023J1219J14519P0584j6843m7771k52976q8335m1808
9046I30393J66232N4694j60724k5788j54233k05143J72480J88809O0048q3386
$$ plain form
9036 943382 828859 847883 817239 779781 645619 822494 966846 914063 869778 914622 730806
9025 730806 694611 573360 548723 557570 621968 662690 748383 874463 991604 1011593 962153
9014 962153 1030674 1092247 1096771 1008611 1039253 816255 693330 697830 728054 688652 488733
9003 488733 459502 516643 618887 688409 553109 243222 33681 103008 248749 391128
8993 391128 499970 520546 585512 565147 385983 304305 308327 478079 552873 606359 520105
8982 520105 474404 296187 500722 648148 572814 575083 381355 349557 504043 414492 407583
8971 407583 353249 279361 319857 232510 177925 322564 532380 638895 522199 400880 290343
8960 290343 91687 24689 34470 -38616 21366 109399 79155 3232 6892 -14083 86555 281897
$$ packed form
9036I43382j14523J9024l0644l7458j34162J76875J44352n2783m4285M4844j83816
9025G30806l6195j21251k4637Q847O4398M0722Q5693J26080J17141J9989m9440
9014I62153O8521O1573M524q8160L0642k22998j22925M500L0224l9402j99919
9003D88733k9231N7141J02244O9522j35300l09887k09541O9327J45741J42379
8993C91128J08842K0576O4966k0365j79164q1678M022J69752P4794N3486q6254
8982E20105m5701j78217K04535J47426p5334K269j93728l1798J54486q9551o909
8971D07583n4334p3888M0496q7347n4585J44639K09816J06515j16696j21319j10537
8960B90343j98656o6998R781p3086N9982Q8033l0244p5923L660k0975J00638J95342
$$ plain form
8948 281897 144768 -87882 3746 217850 334149 351806 247402 152354 95110 97658 301154
8937 301154 351567 359800 455098 483496 468670 513299 487814 381866 341176 210998 187362
8926 187362 234185 285872 275534 158335 -103485 -264640 -171257 -89606 -103593 -80890 99877
8915 99877 222459 257966 208507 158899 144856 193733 117020 145277 158286 194901 189838 185562
8903 185562 89079 26529 -15534 -32332 54061 74293 -3080 71490 45756 214562 229113
8892 229113 118794 -34360 -83809 84934 220968 386187 365343 272105 202522 213490 188040
8881 188040 238060 34401 -215704 -273963 -385280 -394994 -283171 -162372 -60406 113030
8871 113030 -5693 -90254 -65121 45986 127179 -28665 -88956 -152591 -189817 -171337 -10994
$$ packed form
8948B81897j37129k32650R1628K14104J16299J7657j04404r5048n7244K548K03496
8937C01154N0413Q233R5298K8398j4826M4629k5485j05948m0690j30178k3636
8926A87362M6823N1687j0338j17199k61820j61155R3383Q1651j3987K2703J80767
8915I9877J22582L5507m9459m9608j4043M8877p6713K8257J3009L6615n063m276
8903A85562r6483o2550m2063j6798Q6393K0232p7373P4570k5734J68806J4551
8892B29113j10319j53154m9449J68743J36034J65219k0844r3238o9583J0968k5450
8881A88040N0020k03659k50105n8259j11317r714J11823J20799J01966J73436
8871A13030j18723q4561K5133J11107Q1193j55844o0291o3635l7226J8480J60343
$$ plain form
8860 -10994 -38561 -112154 -8272 129866 192408 168798 83895 -30695 -36927 94940 98163
8849 98163 68383 189396 196969 153050 77078 51291 -164134 -155574 -112470 118354 16113
8838 16113 -108558 -46632 -69713 14236 -134997 -37419 94394 96468 121656 83758 210927
8827 210927 209581 219612 206027 29903 7816 -55334 72260 6860 -12802 184824 314022
8816 314022 315668 178870 188875 283431 202711 97812 20491 7127 67875 -18670 59220
8805 59220 -23011 -18310 10345 -141468 -228700 -140683 -186134 -35480 260781 282075 288530 218614
8793 218614 55144 -84851 -121007 -10967 63003 57594 112407 168965 53346 72841 72912 132044
8781 132044 -93620 -12170 82591 92076 57109 -75219 -118459 -139573 -128894 -97061 7935
$$ packed form
8860a0994k7567p3593J03882J38138O2542k3610q4903j14590o232J31867L223
8849I8163k9780J21013P573m3919p5972k5787k15425Q560M3104K30824j02241
8838A6113j24671O1926k3081Q3949j49233R7578J31813K074K5188l7898J27169
8827B10927j346J0031j3585j76124k2087o3150J27594o5400j9662J97626J29198
8816C14022J646j36798J0005R4556q0720j04899p7321j3364O0748q6545P7890
8805E9220q2231M701K8655j51813q7232Q8017m5451J50654K96261K1294O455o9916
8793B18614j63470j39995l6156J10040P3970n409N4813N6558j15619J9495P1N9132
8781A32044k25664Q1450R4761R485l4967j32328m3240k1114J0679L1833J04996
$$ plain form
8770 7935 115452 237994 126077 47134 195453 267994 242939 294287 230640 210191 146696
8759 146696 103785 101199 54368 -18371 62092 -98971 -367872 -275785 -111047 -122903 -241690
8748 -241690 -156340 4495 111867 42408 45422 52663 62713 106300 36076 56443 57047 -9252
8736 -9252 -162830 -291059 -125784 228068 197178 107613 112730 -16244 -78904 -125037 -104181
8725 -104181 -124831 -40570 -27806 28249 -26577 103248 91223 -134433 -166401 -141358 -54549
8714 -54549 125752 255183 7748 -76246 -86028 17617 110309 -36320 -32213 -4641 -7464
8703 -7464 2636 17246 97622 -89115 -127794 -69860 -34848 8314 149517 251939 248519 -73822
8691 -73822 -261219 -118092 -142675 -242832 -160898 81410 108634 139328 130440 71866 128774
$$ packed form
8770G935J07517J22542j11917p8943J48319P2541k5055N1348o3647k0449o3495
8759A46696m2911k586m6831p2739Q0463j61063k68901R2087J64738j1856j18787
8748b41690Q5350J60835J07372o9459L014P241J0050M3587p0224K0367O04o6299
8736i252j53578j28229J65275L53852l0890q9565N117j28974o2660m6133K0856
8725a04181k0650Q4261J2764N6055n4826J29825j2025k25656l1968K5043Q6809
8714e4549J80301J29431k47435q3994r782J03645R2692j46629M107K7572k823
8703g464J0100J4610Q0376j86737l8679N7934L5012M3162J41203J02422l420l22341
8691g3822j87397J43127k4583j00157Q1934K42308K7224L0694q888n8574N6908
$$ plain form
8680 128774 169635 145477 165269 425927 386033 200132 40616 104228 -16336 -82034 -88091
8669 -88091 -37248 10114 55888 61166 -116084 -122775 -23345 -110322 -135398 -138725 -73288 146450
8657 146450 133495 62786 130681 85097 96806 175627 280947 298157 228192 176066 165695
8646 165695 354648 449355 336975 279348 109794 -131641 -78711 -69898 39692 105313 17871
8635 17871 14462 -19166 -114257 -155935 3567 58951 85652 196195 249707 247986 134616 -8900
8623 -8900 -90369 -79887 113967 292723 227272 183211 288389 123002 -3271 -26480 79094
8612 79094 197372 67718 7627 119631 233997 259767 140672 -7587 131391 209050
8602 209050 78359 -4560 -71784 -273270 -144156 -118195 -89835 38136 -93455 -43034 -36645
$$ packed form
8680A28774M0861k4158J9792K60658l9894j85901j59516O3612j20564o5698o057
8669h8091N0843M7362M5774N278j77250o691R9430q6977k5076l327O5437K19738
8657A46450j2955p0709O7895m5584J1709P8821J05320J7210o9965n2126j0371
8646A65695J88953R4707j12380n7627j69554k41435N2930Q813J09590O5621q7442
8635A7871l409l3628r5091m1678J59502N5384K6701J10543N3512j721j13370j43516
8623h900q1469J0482J93854J78756o5451m4061J05178j65387j26273k3209J05574
8612G9094J18278j29654o0091J12004J14366K5770j19095j48259J38978P7659
8602B09050j30691q2919o7224k01486J29114K5961K8360J27971j31591N0421O389
$$ plain form
8591 -36645 -45357 118526 184540 241502 337650 318792 218193 131120 183670 168064 162127 61443
8579 61443 -63875 -178704 -63601 -62190 -92942 -74068 115754 343586 352775 259426 -588
8568 -588 -120877 -23380 -172908 -209876 -135090 4532 41586 118563 188158 346892 383133
8557 383133 255287 176716 45270 54266 118885 77782 124215 8713 -42647 99288 32868
8546 32868 -330310 -391617 -194952 988 -23088 -88062 -147190 -59298 -59111 -37007 29515 125336
8534 125336 151583 266691 347355 253212 72413 180223 185801 206665 116597 59022 -115675
8523 -115675 -37640 68384 26929 8168 84773 158097 86540 67490 -210696 -463630 -326173
8512 -326173 -154523 2135 -159250 -169672 -115708 -111213 47158 166533 133832 -7920 41206
$$ packed form
8591c6645q712J63883O6014N6962R6148j8858j00599q7073N2550j5606n937j00684
8579F1443j25318j14829J15103J411l0752J8874J89822K27832R189r3349k60014
8568e88j20289R7497j49528l6968P4786J39622L7054P6977O9595J58734L6241
8557C83133j27846p8571j31446Q996O4619m1103M6433j15502n1360J41935o6420
8546C2868l63178o1307J96665J95940k4076o4974n9128Q7892J87K2104O6522R5821
8534A25336K6247J15108Q0664r4143j80799J07810N578K0864r0068n7575j74697
8523a15675P8035J06024m1455j8761P6605P3324p1557j9050k78186k52934J37457
8512c26173J71650J56658j61385j0422N3964M495J58371J19375l2701j41752M9126
$$ plain form
8501 41206 39293 125797 216411 197708 -98027 -267058 -292160 -290720 -175633 -35939 -23295
8490 -23295 -22517 89018 71142 -101503 -268539 -283776 -22655 94933 30961 10910 34093
8479 34093 -23241 -23738 23809 -46438 -21675 -85218 34092 7333 -74868 10573 22541 -47120
8467 -47120 -42397 16492 81008 75051 5143 -71082 -200261 -153532 24213 113559 28640 -76585
8455 -76585 2915 115776 168617 87136 145294 245063 70618 -21304 -112809 -160661 -182649
8444 -182649 -260276 -254546 -95529 -3185 134915 177095 173790 100209 21404 22271 -43064 -151245
8432 -151245 -171388 -118119 13745 -67599 -112935 -36208 -87940 1667 93809 97908 172340 263237
8420 263237 253855 169648 306321 283587 104841 -49730 36664 108011 135918 292556 161073
$$ packed form
8501D1206j913Q6504R0614j8703k95735j69031k5102J440J15087J39694J2644
8490b3295P78J11535j7876j72645j67036j5237K61121J17588o3972k0051K3183
8479C4093n7334m97M7547p0247K4763o3543J19310k6759q2201Q5441J1968o9661
8467d7120M723N8889O4516n957o9908p6225j29179M6729J77745Q9346q4919j05225
8455g6585P9500J12861N2841q1481N8158R9769j74445r1922r1505m7852k1988
8444a82649p7627N730J59017R2344J38100M2180l305p3581p8805Q67o5335j08181
8432a51245k0143N3269J31864q1344m5336P6727n1732Q9607R2142M099P4432R0897
8420B63237r382q4207J36673k2734j78746j54571Q6394P1347K7907J56638j31483
$$ plain form
8409 161073 -26220 -53103 -4966 -10998 -36748 -141576 -224057 -156774 113785 270721 239515
8398 239515 138276 -30246 144007 116129 97604 95388 32237 -47244 -6854 -112964 -77310
8387 -77310 124818 155132 137080 55186 -2093 -86252 -117345 -121440 -147301 -176453 -142754 -144997
8375 -144997 -15761 162774 363027 253454 173069 110497 -55085 51681 237370 182946
8365 182946 235184 145768 44461 144431 128531 125155 196292 134957 150436 268911 262116 147920
8353 147920 -5641 8054 -103137 -102460 -100754 -7699 76001 178625 265724 307633 231463 60338
8341 60338 -71769 -77380 -54329 -153848 -45559 -105240 -70008 -12556 29392 98975 110707 220443
8329 220443 288981 248980 203338 -53099 -133054 -109328 51404 170376 188398 -75913 -155955
$$ packed form
8409A61073j87293k6883M8137o032k5750j04828q2481O7283K70559J56936l1206
8398B39515j01239j68522J74253k7878j8525k216o3151p9481M0390j06110L5654
8387g7310K02128L0314j8052q1894n7279q4159l1093m095k5861k9152L3699k243
8375a44997J29236J78535K00253j09573q0385o2572j65582J06766J85689n4424
8365A82946N2238q9416j01307R9970j5900l376P1137o1335J5479J18475o795j14196
8353A47920j53561J3695j11191O77J706R3055Q3700J02624Q7099M1909p6170j71125
8341F0338j32107n611K3051r9519J08289n9681L5232N7452M1948O9583J1732J09736
8329B20443O8538m0001m5642k56437p9955K3726J60732J18972J8022k64311q0042
$$ plain form
8318 -155955 -21507 107002 74592 226230 250061 172843 146556 124678 235771 112248 -62304
8307 -62304 -6573 16097 -131262 -83677 111374 169163 41204 29029 81526 229570 273959
8296 273959 338759 180898 -63055 -68512 -130700 -80312 151155 250609 251847 218669 65290
8285 65290 40971 28907 82244 190914 277267 132531 885 50631 15919 -60046 3246
8274 3246 147411 148184 73423 30391 -6492 -24536 -151616 -37107 155689 366920 435213
8263 435213 293644 154922 80489 -37513 -91515 81791 82334 -32278 -22477 69253 13938
8252 13938 -8812 59714 52823 -64486 19302 34798 -82715 -98485 -111378 -195879 -296384
8241 -296384 -59043 162847 251010 225938 209195 151348 -31005 -150452 -115871 -30277 -8824
$$ packed form
8318a55955J34448J28509l2410J51638K3831p7218k6287k1878J11093j23523j74552
8307f2304N5731K2670j47359M7585J95051N7789j27959j2175N2497J48044M4389
8296B73959O4800j57861k43953n457o2188N0388K31467R9454J238l3178j53379
8285F5290k4319j2064N3337J08670Q6353j44736j31646M9746l4712p5965O3292
8274C246J44165P73p4761m3032l6883j8044j27080J14509J92796K11231O8293
8263D35213j41569j38722p4433j18002n4002J73306N43j14612R801R1730n5315
8252A3938k2750O8526o891j17309Q3788J5496j17513j5770j2893q4501j00505
8241b96384K37341K21890Q8163k5072j6743n7847j82353j19447L4581Q5594K1453
$$ plain form
8230 -8824 64530 76420 31711 27866 16878 -55422 -174093 -285510 -310541 -211061 -120322 -33986
8218 -33986 -41053 61675 110199 12614 13609 87914 35050 -39762 -30747 -201367 -123772 -81960
8206 -81960 8452 176419 182195 287841 206816 80286 -185113 -209439 27175 -17519 -45414
8195 -45414 94984 178449 89723 25595 31677 198770 324835 294758 293472 354426 297512 171987
8183 171987 167174 198874 111859 34796 -122082 -196821 -162931 -66023 7500 120321 229304
8172 229304 160266 -59954 -220431 -284050 -152959 37649 71125 -13259 -3805 48851 120264
8161 120264 164594 141854 34569 -29098 -135174 -178151 -174659 -140506 -27533 -144055 -241859
8150 -241859 -189235 -33653 5991 -24279 45046 69896 201452 183156 95697 3623 54692
$$ packed form
8230h824P3354J1890m4709l845j0988p2300j18671j11417k5031R9480R0739Q6336
8218c3986p067J02728M8524r7585R95P4305n2864p4812R015j70620P7595M1812
8206h1960R0412J67967N776J05646q1025j26530k65399k4326K36614m4694k7895
8195d5414J40398Q3465q8726o4128O082J67093J26065l0077j286O0954n6914j25525
8183A71987m813L1700q7015p7063j56878p4739L3890R6908P3523J12821J08983
8172B29304o9038k20220j60477o3619J31091J90608L3476q4384R454N2656P1413
8161A20264M4330k2740j07285o3667j06076m2977L492L4153J12973j16522r7804
8150b41859N2624J55582L9644l0270O9325K4850J31556j8296q7459r2074N1069
$$ plain form
8139 54692 141819 -36513 -45764 31230 6328 -37440 -112505 31432 127644 210568 216864 63800
8127 63800 69362 170048 176333 44211 -24361 -25271 -100152 -177043 -37287 54018 153847 36191
8115 36191 -91325 -168268 58204 54524 -51560 -234120 -261971 -118750 -73523 -172616 -140740
8104 -140740 -115611 -232635 -292895 -188546 -87869 -51328 22311 -85694 -12456 20354 73891
8093 73891 47990 -115154 -183422 -53527 156791 9980 -36645 49171 -60045 -203910 -171797
8082 -171797 -162139 -344070 -213654 -221559 -355130 -277765 -300516 -462236 -390544 -228925 -204521
8071 -204521 -45654 168882 308439 139326 -13575 42711 -47043 -196129 -34948 202181
8061 202181 147297 -15075 4770 -56242 -41890 149345 282154 29549 -371372 -381637 -168312
$$ packed form
8139E4692Q7127j78332r251P6994k4902m3768p5065J43937R6212Q2924O296j53064
8127F3800N562J00686O285j32122o8572r10p4881p6891J39756R1305R9829j17656
8115C6191j27516p6943K26472l680j06084j82560k7851J43221M5227r9093L1876
8104a40740K5129j17024o0260J04349J00677L6541P3639j08005P3238L2810N3537
8093G3891k5901j63144o8268J29895K10318j46811m6625Q5816j09216j43865L2113
8082a71797R658j81931J30416p905j33571P7365k2751j61720P1692J61619K4404
8071b04521J58867K14536J39557j69113j52901N6286q9754j49086J61181K37129
8061B02181n4884j62372J9845o1012J4352J91235J32809k52605m00921j0265K13325
$$ plain form
8050 -168312 -6943 84441 29230 -99615 -150143 -45181 -66231 -146335 -187785 -52378 70132
8039 70132 47728 5861 81662 67691 136724 214893 163290 114261 48555 99916 192967 276881
8027 276881 365801 159824 -42697 -207205 -246275 -209777 -32774 -80249 -296538 -210531 -251191
8016 -251191 -158645 -129776 -141362 17305 -57859 -164995 -100839 127583 298320 137217 -11694
8005 -11694 -84458 18734 209507 309686 284775 170883 93285 166544 216673 144082 85339
7994 85339 206306 159779 95525 118818 125985 91687 84641 208657 110864 173362 295104 267365
7982 267365 149354 153188 157404 189478 183457 153380 59973 -32803 -106606 -92304 63452 165848
7970 165848 279711 275298 29051 -40915 60648 105225 333677 235920 21611 27287 159964
$$ packed form
8050a68312J61369R1384n5211j28845n0528J04962k1050q0104m1450J35407J22510
8039G0132k2404m1867P5801j3971O9033P8169n1603m9029o5706N1361R3051Q3914
8027B76881Q8920k05977k02521j64508l9070L6498J77003m7475k16289Q6007m0660
8016b51191R2546K8869j1586J58667p5164j07136O4156K28422J70737j61103j48911
8005a1694p2764J03192J90773J00179k4911j13892p7598P3259N0129p2591n8743
7994H5339J20967m6527o4254K3293P167l4298p046J24016r7793O2498J21742k7739
7982B67365j18011L834M216L2074o021l0077r3407r2776p3803J4302J55756J02396
7970A65848J13863m413k46247o9966J01563M4577K28452r7757k14309N676J32677
$$ plain form
7959 159964 150283 -7567 -185088 -145931 -63033 102277 98259 75933 81725 53546 16222 78061
7947 78061 141535 -24391 -60816 -124163 -148538 -140699 -128256 -200583 -24455 158779 109951
7936 109951 -11835 -106826 66039 373721 378157 278667 316405 259452 -65617 -185856 -85209
7925 -85209 -302904 -158839 93335 144791 197907 219277 292568 353618 242713 27126 25134
7914 25134 -22520 -94105 -101719 -86690 -79617 4753 107265 58225 8074 -54950 11486 1093
7902 1093 22755 239699 242395 327900 351974 441467 632936 616295 426213 274576 200699
7891 200699 167865 -53429 -57414 191497 325377 167044 213802 170591 181005 258369 126665
7880 126665 138968 58010 30281 225690 358526 481115 497868 263891 315626 520820 407029
$$ packed form
7959A59964r681j57850j77521L9157Q2898J65310m018k2326N792k8179l7324O1839
7947G8061O3474j65926l6425o3347k4375P839J2443p2327J76128J83234m8828
7936A09951j21786r4991J72865L07682M436r9490L7738n6953l25069j20239J00647
7925h5209k17695J44065K52174N1456N3116K1370P3291O1050j10905k15587j992
7914B5134m7654p1585p614J5029P073Q4370J02512m9040n0151o3024O6436j0393
7902A093K1662K16944K696Q5505K4074Q9493J91469j6641j90082j51637p3877
7891B00699l2834k21294l985K48911J33880j58333M6758m3211J0414P7364j31704
7880A26665J2303q0958k7729J95409J32836J22589J6753k33977N1735K05194j13791
$$ plain form
7869 407029 129283 -149045 -271222 -137355 -204980 -226058 -272139 -352186 -370877 -423595 -278224
7858 -278224 -255919 -218120 -190193 -48463 -7870 96120 19885 56717 67327 60312 71264
7847 71264 58013 -41768 52907 -4727 -60896 33164 -6464 -209502 -148798 100534 31900
7836 31900 -10386 24803 229099 37839 -4377 -102175 -319226 -184611 -5002 -110794 -129231
7825 -129231 -104309 -245543 -226949 -279063 -80331 135699 195738 106786 78029 99967 86425
7814 86425 94598 149693 -21523 -71498 -136831 -54988 -37656 -31502 79318 101927 109578 58354
7802 58354 154622 326973 127202 80926 332197 340050 262133 159033 32940 -170400 -273718
7791 -273718 -196244 -102261 175304 157136 64222 -2490 -51786 -179591 23156 129305 151024
$$ packed form
7869D07029k77746k78328j22177J33867o7625k1078m6081q0047j8691n2718J45371
7858b78224K2305L7799K7927J41730M0593J03990p6235L6832J0610p015J0952
7847G1264j3251r9781R4675n7634n6169R4060l9628k03038O0704K49332o8634
7836C1900m2286L5189K04296j91260m2216r7798k17051J34615J79609j05792j8437
7825a29231K4922j41234J8594n2114J98732K16030O0039q8952k8757K1938j3542
7814H6425Q173N5095j71216m9975o5333Q1843J7332O154J10820K2609P651n1224
7802E8354R6268J72351j99771m6276K51271P853p7917j03100j26093k03340j03318
7791b73718P7474R3983K77565j8168r2914o6712m9296j27805K02747J06149K1719
$$ plain form
7780 151024 33612 -26117 -59502 -78688 27905 35455 -13440 -155218 -88046 156338 437906
7769 437906 394759 416148 324688 111532 -183293 -192362 -303569 -258677 -231265 -257572 -37939
7758 -37939 147701 182627 8874 -253985 -274866 -176236 -98061 -146106 -150803 -178436 -169473 -51740
7746 -51740 -128705 -105072 -43816 -179269 -190821 -200742 -25198 -28380 -126731 -218205 -356895 -197092
7734 -197092 -65656 3911 -83968 -60060 -109836 -33818 -106824 -65931 162841 37650 -73158
7723 -73158 24141 -26180 -34661 -124931 -20320 -1704 -86029 140668 273488 190475 96972
7712 96972 77585 -47219 -55442 92048 153116 322422 364698 5051 -136399 -29538 -58417
7701 -58417 -76257 -13394 -42645 -160934 45368 109431 -15836 -208329 -402893 -383273 -282971
$$ packed form
7780A51024j17412n9729l3385j9186J06593P550m8895j41778O7172K44384K81568
7769D37906m3147K1389r1460k13156k94825r069j11207M4892K7412k6307K19633
7758c7939J85640L4926j73753k62859k0881R8630P8175m8045m697k7633Q963J17733
7746e1740p6965K3633O1256j35453j1552r921J75544l182r8351r1474j38690J59803
7734a97092J31436O9567q7879K3908m9776P6018p3006M0893K28772j25191j10808
7723g3158R7299n0321q481r0270J04611J8616q4325K26697J32820q3013r3503
7712I6972j9387j24804q223J47490O1068J69306M2276l59647j41450J06861k8879
7701e8417j7840O2863k9251j18289K06302O4063j25267j92493j94564J9620J00302
$$ plain form
7690 -282971 -83973 -18782 -88302 -131707 -252522 -192421 -45588 151206 110834 38990 -94386
7679 -94386 -43850 49340 99291 42368 16131 -31607 -95687 -96651 -179157 -213047 -146938 -205443
7667 -205443 -178709 -152972 -45359 -74716 -79441 -170846 -99628 30122 -78289 -310881 -285936
7656 -285936 -124069 60894 -17179 -183746 -248452 -142553 -57625 -110683 -190655 -106034 -208656
7645 -208656 -225704 -28931 159619 226116 299185 200476 49694 73496 159323 145916 45033
7634 45033 -49011 -45625 40824 -12585 -31265 -61763 -113198 -185004 -162107 -253245 -205048 -191138
7622 -191138 -92942 -113680 -162605 -260612 -270600 -136786 -27957 -104377 -124474 -24318 155257
7611 155257 92802 34930 155521 70314 -43766 -227827 -410587 -387273 -367620 -161387 -69934
$$ packed form
7690b82971J98998O5191o9520m3405j20815O0101J46833J96794m0372p1844j33376
7679i4386N0536R3190M9951n6923k6237m7738o4080r64q2506l3890O6109n8505
7667b05443K6734K5737J07613k9357m725r1405P1218J29750j08411k32592K4945
7656b85936J61867J84963p8073j66567o4706J05899Q4928n3058p9972Q4621j02622
7645b08656j7048J96773J88550O6497P3069r8709j50782K3802Q5827j3407j00883
7634D5033r4044L386Q6449n3409j8680l0498n1435p1806K2897r1138M8197J3910
7622a91138R8196k0738m8925r8007r988J33814J08829p6420k0097J00156J79575
7611A55257o2455n7872J20591q5207j14080j84061j82760K3314J9653K06233R1453
$$ plain form
7600 -69934 58226 39600 211152 275398 150952 94818 -35983 -140105 -138010 -181691 -161997
7589 -161997 -207687 -177623 -142047 -16965 -13950 -32403 -264289 -416863 -294854 -40906 -117972
7578 -117972 -261735 -193504 -33085 -35415 -240701 -136376 -87936 -115872 -102334 -194179 -170477
7567 -170477 -110002 -131761 -102578 176742 236635 29752 -111321 -150276 -33850 6636 -9747
7556 -9747 33151 18303 -80982 -247604 -107386 133604 87128 -121706 -161702 -28622 -61197
$$ packed form
7600f9934J28160j8626J71552O4246j24446n6134j30801j04122K095m3681J9694
7589a61997m5690L0064L5576J25082L015j8453k31886j52574J22009K53948p7066
7578a17972j43763O8231J60419k330k05286J04325M8440k7936J3538r1845K3702
7567a70477O0475k1759K9183K79320N9893k06883j41073l8955J16426M0486j6383
7556i747M2898j4848r9285j66622J40218K40990m6476k08834l9996J33080l2575
$$ [...]
##END NTUPLES=NMR SPECTRUM
##END=
