##TITLE=Analysis number 320390
Compound Code cc 53973
Book Reference 475/56/8
Project Code adrs
Chemist Name janep
##JCAMPDX= 6.0         $$ Bruker NMR JCAMP-DX V2.0
##DATA TYPE= NMR SPECTRUM
##DATA CLASS= NTUPLES
##ORIGIN= Bruker BioSpin GmbH
##OWNER= nmr
$$ XWIN-NMR		Version 3.5
$$ Fri Jun 30 07:38:59 2006 GMT Daylight Time (UT+1h)  MAYBRIDGE\nmr@NMR_250MHZ
##.OBSERVE FREQUENCY= 250.131544655141
##.OBSERVE NUCLEUS= ^1H
##.ACQUISITION MODE= SIMULTANEOUS (DQD)
##.ACQUISITION SCHEME= undefined
##.AVERAGES= 16
##.DIGITISER RES= 18
##SPECTROMETER/DATA SYSTEM= dpx250
##.PULSE SEQUENCE= zg30
##.SOLVENT NAME= DMSO
##.SHIFT REFERENCE= (INTERNAL, DMSO, 0, 16.522)
##AUDIT TRAIL= $$ (NUMBER, WHEN, WHO, WHERE, WHAT)
$$ ##TITLE= Audit trail, XWIN-NMR		Version 3.5
$$ ##JCAMPDX= 5.01
$$ ##ORIGIN= Bruker BioSpin GmbH
$$ ##OWNER= nmr
$$ C:\u/data/dgb/nmr/ADRS/1910/pdata/1/auditp.txt
$$ ##AUDIT TRAIL=  $$ (NUMBER, WHEN, WHO, WHERE, WHAT)
(   1,<2006-06-30 07:38:24.96 +100>,<MAYBRIDGE\nmr>,<NMR_250MHZ>,
      <created by zg, POWCHK disabled, PULCHK disabled
       configuration hash MD5:
       E2 DF 36 D8 04 B2 41 60 5A D7 A3 38 5A 4B D0 FE
       data hash MD5: 64K
       AF 00 A5 7B 21 8F 40 E8 7C C0 BB 07 BE B6 38 5E>)
(   2,<2006-06-30 07:38:42.08 +100>,<MAYBRIDGE\nmr>,<NMR_250MHZ>,
      <Start of raw data processing
       ef LB = 0.3 FT_mod = 6 PKNL = 1 SI = 32K 
       data hash MD5: 32K
       5F D2 18 9D 38 59 E0 0C 82 12 10 CC DF 0E BF 19>)
(   3,<2006-06-30 07:38:43.80 +100>,<MAYBRIDGE\nmr>,<NMR_250MHZ>,
      <apk 
       data hash MD5: 32K
       A0 CA AB F8 B1 B7 CD 24 A3 BF 39 3B 23 05 1E D6>)
(   4,<2006-06-30 07:38:45.82 +100>,<MAYBRIDGE\nmr>,<NMR_250MHZ>,
      <abs ABSG = 5 
       data hash MD5: 32K
       6A F7 76 7B 45 BE 24 6A A1 0B 6F F8 DB 7F 28 9F>)
$$ ##END=
$$ 
$$ hash MD5
$$ 41 C9 78 68 B8 E8 AE 18 AD 6D 6B 17 EB 56 77 A1
##$RELAX= 
##$RELAX= 
##$RELAX= 
##$RELAX= 
##$RELAX= 
##$RELAX= 
##$RELAX= 
$$ Bruker specific parameters
$$ --------------------------
##$DU= <C:\u>
##$EXPNO= 1910
##$NAME= <ADRS>
##$PROCNO= 1
##$TYPE= <nmr>
##$USER= <dgb>
##$AMP= (0..31)
100 100 100 100 100 100 100 100 100 100 100 100 100 100 100 100 100 100 
100 100 100 100 100 100 100 100 100 100 100 100 100 100 
##$AQSEQ= 0
##$AQ_mod= 3
##$AUNM= <au_zg>
##$AUTOPOS= <21 >
##$BF1= 250.13
##$BF2= 250.13
##$BF3= 250.13
##$BF4= 250.13
##$BF5= 500.13
##$BF6= 500.13
##$BF7= 500.13
##$BF8= 500.13
##$BYTORDA= 1
##$CFDGTYP= 0
##$CFRGTYP= 5
##$CHEMSTR= <none>
##$CNST= (0..31)
1 1 145 1 1 1 1 1 1 1 1 1 1 1 1 1 1 1 1 1 1 1 1 1 1 1 1 1 1 1 1 1 
##$CPDPRG= <>
##$CPDPRG1= <>
##$CPDPRG2= <>
##$CPDPRG3= <>
##$CPDPRG4= <mlev>
##$CPDPRG5= <mlev>
##$CPDPRG6= <mlev>
##$CPDPRG7= <mlev>
##$CPDPRG8= <mlev>
##$CPDPRGB= <>
##$CPDPRGT= <>
##$D= (0..31)
0 1 0 0 0 0 0 0 0 0.06 0 0 0 0 0 0 0.0002 0 0 0 0 0 0 0 0 0 0 0 0 0 0 
0 
##$DATE= 1151649502
##$DBL= (0..7)
120 120 120 120 120 120 120 120 
##$DBP= (0..7)
150 150 150 150 150 150 150 150 
##$DBP07= 0
##$DBPNAM0= <>
##$DBPNAM1= <>
$$ [...]
##$SUBNAM7= <"">
##$SUBNAM8= <"">
##$SUBNAM9= <"">
##$SW= 20.6930455092707
##$SWIBOX= (0..15)
0 0 3 0 0 0 0 0 0 0 0 0 0 0 0 0 
##$SW_h= 5175.983436853
##$TD= 65536
##$TD0= 1
##$TE= 297.16
##$TE2= 300
##$TE3= 300
##$TEG= 300
##$TL= (0..7)
0 120 120 120 120 120 120 120 
##$TP= (0..7)
150 150 150 150 150 150 150 150 
##$TP07= 0
##$TPNAME0= <>
##$TPNAME1= <>
##$TPNAME2= <>
##$TPNAME3= <>
##$TPNAME4= <>
##$TPNAME5= <>
##$TPNAME6= <>
##$TPNAME7= <>
##$TPOAL= (0..7)
0.5 0.5 0.5 0.5 0.5 0.5 0.5 0.5 
##$TPOFFS= (0..7)
0 0 0 0 0 0 0 0 
##$TUNHIN= 0
##$TUNHOUT= 0
##$TUNXOUT= 0
##$USERA1= <user>
##$USERA2= <user>
##$USERA3= <user>
##$USERA4= <user>
##$USERA5= <user>
##$V9= 5
##$VALIST= <valist>
##$VCLIST= <CCCCCCCCCCCCCCC>
##$VD= 0
##$VDLIST= <DDDDDDDDDDDDDDD>
##$VPLIST= <PPPPPPPPPPPPPPP>
##$VTLIST= <TTTTTTTTTTTTTTT>
##$WBST= 1024
##$WBSW= 4
##$XGAIN= (0..3)
0 0 0 0 
##$XL= 0
##$YL= 0
##$YMAX_a= 324472
##$YMIN_a= -522988
##$ZGOPTNS= <>
##$ZL1= 120
##$ZL2= 120
##$ZL3= 120
##$ZL4= 120
##$ABSF1= 16.522
##$ABSF2= -4.171173
##$ABSG= 5
##$ABSL= 3
##$ALPHA= 0
##$AQORDER= 0
##$ASSFAC= 0
##$ASSFACI= 0
##$ASSFACX= 0
##$ASSWID= 0
##$AUNMP= <proc_1d>
##$AZFE= 0.1
##$AZFW= 0.1
##$BCFW= 0
##$BC_mod= 0
##$BYTORDP= 0
##$COROFFS= 0
##$CY= 12.5
##$DATMOD= 1
##$DC= 0
##$DFILT= <>
##$DTYPP= 0
##$F1P= 14.0000005364418
##$F2P= -0.99999901652339
##$FCOR= 0.5
##$FTSIZE= 32768
##$FT_mod= 6
##$GAMMA= 0
##$GB= 0
##$INTBC= 1
##$INTSCL= 1
##$ISEN= 128
##$LB= 0.3
##$LEV0= 0
##$LPBIN= 0
##$MAXI= 10000
##$MC2= 0
##$MEAN= 0
##$ME_mod= 0
##$MI= 0
##$NCOEF= 0
##$NC_proc= -5
##$NLEV= 6
##$NOISF1= 0
##$NOISF2= 0
##$NSP= 0
##$NTH_PI= 0
##$NZP= 0
##$OFFSET= 16.522
##$PC= 1
##$PHC0= 161.0869
##$PHC1= 13.99385
##$PH_mod= 1
##$PKNL= yes
##$PPARMOD= 0
##$PSCAL= 4
##$PSIGN= 0
##$REVERSE= no
##$SF= 250.13
##$SI= 32768
##$SIGF1= 0
##$SIGF2= 0
##$SINO= 400
##$SIOLD= 32768
##$SREGLST= <1H.DMSO>
##$SSB= 0
##$STSI= 32768
##$STSR= 0
##$SW_p= 5175.98343685301
##$SYMM= 0
##$S_DEV= 0
##$TDeff= 65536
##$TDoff= 0
##$TI= <Analysis number 999999
Compound Code 99
Book Reference 9
Project Code 9>
##$TILT= no
##$TM1= 0
##$TM2= 0
##$TOPLEV= 0
##$USERP1= <user>
##$USERP2= <user>
##$USERP3= <user>
##$USERP4= <user>
##$USERP5= <user>
##$WDW= 1
##$XDIM= 32768
##$YMAX_p= 313227887
##$YMIN_p= -950689
$$ End of Bruker specific parameters
$$ ---------------------------------
##NTUPLES= NMR SPECTRUM
##VAR_NAME=  FREQUENCY,     SPECTRUM/REAL,   SPECTRUM/IMAG
##SYMBOL=    X,             R,               I
##VAR_TYPE=  INDEPENDENT,   DEPENDENT,       DEPENDENT
##VAR_FORM=  AFFN,          ASDF,            ASDF
##VAR_DIM=   32768,         32768,           32768
##UNITS=     HZ,            ARBITRARY UNITS, ARBITRARY UNITS
##FACTOR=    0.157963299565203, 1,           1
##FIRST=     4132.6476996994, 0,             0
##LAST=      -1043.33573715361, 0,           0
##MIN=       -1043.33573715361, -950689,     0
##MAX=       4132.6476996994, 313227887,     0
$$ Real data points
##PAGE= N=1
##DATA TABLE= (X++(R..R)), XYDATA
$$ [...]
13559A51975526k389968l737833m974284n847031o020101o398072o637334o676920
$$ 151975526 149585558 145847725 140873441 135026410 129006309 122608237 115970903 109293983
13551A09293983o355265o221384n568717n628794n201183m690119m529619m307463
$$ 109293983 102938718 96717334 91148617 85519823 80318640 75628521 71098902 66791439
13543F6791439l979842l379262k998405k934089k824508k619198k357730k171177
$$ 66791439 62811597 59432335 56433930 53499841 50675333 48056135 45698405 43527228
13535D3527228k128284j842438j794950j528768j594525j797148j369115j060588
$$ 43527228 41398944 39556506 37761556 36232788 34638263 32841115 31472000 30411412
13527C0411412q03912r95294j178903n67047p15340r28254q26083n41313n33235
$$ 30411412 29607500 28612206 27433303 26866256 26150916 25222662 24396579 23855266 23322031
13518B3322031m67000m52014j91638j11079m44600k50412j23665o0366j49836
$$ 23322031 22855031 22403017 22211379 22100300 21655700 21405288 21281623 21221257 21071421
13509B1071421O5701K72643J24228J04207L87957P24274O47663J021122J095262
$$ 21071421 21137122 21409765 21533993 21638200 22026157 22750431 23398094 24419216 25514478
13500B5514478J436581J451117K166902K343689K572061K968355L202921L321839
$$ 25514478 26951059 28402176 30569078 32912767 35484828 38453183 41656104 44977943
13492D4977943L262120K884508K607387K376123J890847J185610M03595k62167
$$ 44977943 48240063 51124571 53731958 56108081 57998928 59184538 59588133 59325966
13484E9325966j193921j461884j831284k442148k338616k113524k091106j940273
$$ 59325966 58132045 56670161 54838877 52396729 50058113 47944589 45853483 43913210
13476D3913210j404986j035389o27953m16939k46333J87340P40352J150323J607634
$$ 43913210 42508224 41472835 40844882 40427943 40181610 40368950 41109302 42259625 43867259
13467D3867259J884073K235254K664588L478244M076348M516821M723862M749701
$$ 43867259 45751332 47986586 50651174 54129418 58205766 62722587 67446449 72196150
13459G2196150M842451M999936M986418M335671L557895L097452K457602J271480
$$ 72196150 77038601 82038537 87024955 91360626 94918521 98015973 100473575 101745055
13451A01745055L00412k40305o66382j369503k084102k360090l140788l904708
$$ 101745055 102045467 101805162 101138780 99769277 97685175 95325085 92184297 88279589
13443H8279589m214007m183757m187211m117796m266398m289289l785204l107456
$$ 88279589 84065582 79881825 75694614 71576818 67310420 63021131 59235927 56128471
13435E6128471k691039k481523k350852j786303j406086r11838l7507K38739O10913
$$ 56128471 53437432 50955909 48605057 46818754 45412668 44500830 44463323 44702062 45312975
13426D5312975Q82170J258979J656524K112012K477809K915346K824850K804253
$$ 45312975 46195145 47454124 49110648 51222660 53700469 56615815 59440665 62244918
13418F2244918K668087K233512J740000J259612J76398p10184j675687k349896
$$ 62244918 64913005 67146517 68886517 70146129 70322527 69612343 67936656 65586760
13410F5586760k532901k802726k907487k581358k161421j318547l42695P72575
$$ 65586760 63053859 60251133 57343646 54762288 52600867 51282320 50939625 51712200
13402E1712200J770767K732983K683643J666221P08537J52607l79225j691265
$$ 51712200 53482967 56215950 58899593 60565814 61274351 61426958 61047733 59356468
13394E9356468l744976n769603o198538n305651m166014l487459k847571k015072
$$ 59356468 55611492 49841889 43643351 38337700 34171686 30684227 27836656 25821584
13386B5821584j554265j282470r62274q45434r14786o75687o80881n18721l47584
$$ 25821584 24267319 22984849 22022575 21177141 20262355 19586668 18905787 18387066 18039482
13377A8039482l39212K870K66538o9272L1230L63784N72801L69195L70738P96702
$$ 18039482 17700270 17703140 17969678 17900406 17931636 18295420 18868221 19237416 19608154 20404856
13367B0404856J041699J144880J418127K151645K759724L597161M877325O653827
$$ 20404856 21446555 22591435 24009562 26161207 28920931 32518092 37395417 44049244
13359D4049244Q941327J1793472J5054558J6796090J5242864J0782757P120228
$$ 44049244 52990571 64784043 79838601 96634691 111877555 122660312 129780540
13352A29780540N708740L661058k242886j2133071j9819039k0159726j5549659
$$ 129780540 135489280 139150338 136907452 124774381 104955342 84795616 69245957
13345F9245957j1143311q068208o039433m551605l217948k830483k362658j938306
$$ 69245957 58102646 50034438 43995005 39443400 36225452 33394969 31032311 29094005
13337B9094005j895477j703654j307927j175329r04258o59246p13277k78295m2860
$$ 29094005 27198528 25494874 24186947 23011618 22107360 21448114 20734837 20456542 20413682
13328B0413682J15139Q0849O9923M58584N78927O08634R78798J207255J593836
$$ 20413682 20528821 20609670 20679593 21138177 21717104 22325738 23304536 24511791 26105627
13319B6105627K176149K837169L515791N011633O692346Q969542J2144081J5382006
$$ 26105627 28281776 31118945 34634736 39646369 46338715 55308257 67452338 82834344
13311H2834344J7127944J5047587J0542597P329541N487481L321158k818540j2853498
$$ 82834344 99962288 115009875 125552472 132882013 138369494 141690652 138872112 126018614
13303A26018614k0467119k0523715j5792006j1249592q316909o212144m472164
$$ 126018614 105551495 85027780 69235774 57986182 49669273 43457129 38984965
13296C8984965l787760l334465k737267k171546j918619j490195j604014j548949
$$ 38984965 35197205 31862740 29125473 26953927 25035308 23545113 21941099 20392150
13288B0392150j175401j042013q60555p58033n81157l23885j52893j76627k4314
$$ 20392150 19216749 18174736 17314181 16556148 15974991 15651106 15498213 15321586 15297272
13279A5297272k08742M9107M86448J75418J86917M86770R43997R96101J604093
$$ 15297272 15088530 15137637 15624085 15799503 15986420 16473190 17417187 18413288 20017381
13270B0017381K049713K472493L635604M718022M686505L958208L236084K078757
$$ 20017381 22067094 24539587 28175191 32893213 37579718 41537926 44774010 46852767
13262D6852767J462390O06870j586383m087743n700629n977355n013517l915480
$$ 46852767 48315157 48922027 47335644 43247901 37547272 31569917 26556400 22640920
13254B2640920k835747k196627j648288j373934j416927j115480r48457p93379
$$ 22640920 19805173 17608546 15960258 14586324 13169397 12053917 11105460 10312081
13246A0312081n61814n36175p31932l80246j62912m70568n80230j33010l72280
$$ 10312081 9750267 9214092 8482160 8101914 7939002 7468434 6888204 6755194 6382914
13237F382914l45144j06279o7222k60921l96036j96270j03844k54864q4484R8763
$$ 6382914 6037770 5931491 5864269 5603348 5207312 5011042 4907198 4652334 4567850 4666613
13227D666613N2899k67991l53466Q9668J2154l27813k94984j28739M4674J9777
$$ 4666613 4719512 4451521 4098055 4187723 4199877 3872064 3577080 3448341 3493015 3512792
13217C512792j62472l09275O5798K69828k63885k42818j14012J75663j4568l20605
$$ 3512792 3350320 3041045 3106843 3376671 3112786 2869968 2755956 2931619 2917051 2596446
13207B596446r3719K68010k9602J44413q1778j07649o0735k30634o8576J77422
$$ 2596446 2502727 2770737 2741135 2885548 2803770 2696121 2635386 2404752 2336176 2513598
13197B513598q0996l33310Q2766j43914o6152P1455k7116q8677J58112K176j85247
$$ 2513598 2432602 2099292 2182058 2038144 1971992 2043447 2016331 1927654 2085766 2087942 1902695
13186A902695j84654k15301k18255k0732o3706k29766j7648k4788O8617K89759
$$ 1902695 1718041 1502740 1284485 1263753 1200047 970281 952633 927845 996462 1286221
13176A286221Q1388j99936k40798J46268J72725K11340J07960m1470l42887j51725
$$ 1286221 1367609 1167673 926875 1073143 1245868 1457208 1565168 1523698 1180811 1029086
13166A029086j68937K1221M7735n5509J99366j41205L4518J80751N2854K7463
$$ 1029086 860149 881370 929105 873596 1072962 931757 966275 1147026 1199880 1227343
13156A227343l98927l51356M7773K83706m7502j53095k76618J94272L71085J57134
$$ 1227343 828416 477060 524833 808539 761037 607942 331324 525596 896681 1053815
13146A053815j03017Q4042k3824j94801k32510j69214J51985K3921K7884n8117
$$ 1053815 950798 1034840 1011016 816215 583705 414491 566476 590397 618281 560164
13136E60164J7679o1530k3823P8355j06900R851n1674j45213K01171J15019k1984
$$ 560164 577843 516313 492490 570845 463945 473796 422122 276909 478080 593099 571115
13125E71115P574J88983l9548J55699K40010n6507j18649n7756J6592q5776j9017
$$ 571115 578689 767672 728124 883823 1123833 1067326 948677 890921 907513 821737 802720
13114H02720P1164L12417l0617j44950o2201k28233n897J05017j1641p9592K25108
$$ 802720 873884 1186301 1155684 1010734 948533 720300 714403 819420 807779 728187 953295
13103I53295J22899l6120m9586j36272K27139M1394p1411r4198j3065R2682L4552
$$ 953295 1076194 1040074 990488 854216 1081355 1122749 1051338 957140 944075 1036757 1071309
13092A071309K37776j49788Q8701J48718k33009k10014j84367N5157P2066k9715
$$ 1071309 1309085 1159297 1247998 1396716 1163707 953693 769326 824483 896549 866834
13082H66834J21652J26440k36231j09420J53411j02598q3336j0944J30190j0897
$$ 866834 988486 1114926 878695 769275 922686 820088 736752 725808 855998 845101
13072H45101L1317j85635J29250J02549n8478J65266J65514j16801r0380Q7976
$$ 845101 876418 690783 820033 922582 864104 1029370 1194884 1078083 987703 1075679
13062A075679K4104q4998k85047m58568J00708P3128j59038j38734J62516K85027
$$ 1075679 1099783 1014785 729738 271170 371878 445006 285968 147234 309750 594777
13052E94777R5113j63744j38484L0827j6373n2048m4551J8428P6937K19398R7330
$$ 594777 689890 526146 387662 418489 402116 350068 305517 323945 400882 620280 717610
13041G17610j87751p691l6447J2758o695q1869j51003L52812J79512j28903j09075
$$ 717610 529859 522168 485721 498479 491784 409915 258912 611724 791236 662333 553258
13030E53258j33629J05289R7769Q732J73110Q6065n3571P793L27717Q5266j53315
$$ 553258 419629 524918 622687 631419 804529 890594 837023 844816 1172533 1257799 1104484
13019A104484l23655j47166q6735j63004k7271l7715q4994K03123q1340j0813
$$ 1104484 780829 633663 546928 383924 356653 318938 233944 437067 355727 344914
13009C44914j50654J61950L10569J3484k74857o8241J14361j66089L5177J47865
$$ 344914 194260 356210 666779 680263 405406 337165 451526 285437 320614 468479
12999D68479M8197J53310o3860O2090J36998j28989j83579j53508n7647J69486
$$ 468479 516676 669986 606126 668216 805214 676225 492646 339138 281491 450977
12989D50977J68505p529q3260k21242k48419j34996J04045L23012R356R4366K5110
$$ 450977 619482 611953 528693 307451 59032 -75964 28081 351093 360449 454815 479925
12978D79925K7534m4703Q512j22627L9042m2092r5413L5697J74392R1917J2014
$$ 479925 507459 462756 471268 348641 387683 345591 250178 285875 460267 552184 564198
12967E64198j62336j28346J37877k2335k02592P8531M7401J5017O6750L9992j69986
$$ 564198 401862 273516 411393 389058 186466 264997 312398 327415 394165 434157 264171
12956B64171k4030m6546n9734R5258P6833n7880j16918j5020m9977P5298J10215
$$ 264171 240141 193595 133861 229119 305952 248072 131154 116134 66157 141455 251670
12945B51670j25769L7778p9483N9687J22344J00228Q3637r689r849j8861j8022
$$ 251670 125901 163679 84196 143883 266227 366455 450092 440403 430554 411693 393671
12934C93671N6137k0636r5046j40997N1972J93623j95611J50825R3425q171l77865
$$ 393671 449808 429172 334126 193129 245101 438724 243113 393938 487363 479192 101327
12923A01327k93336K76394Q4757j49317R1410K40p9580k04807m6036j1685K20478
$$ 101327 -192009 84385 169142 19825 111235 111475 31895 -172912 -218948 -230633 -10155
12912a0155M67828J82393j54329j15165J1566k01939m38863k61954Q6427K14761
$$ -10155 457673 640066 485737 370572 382138 180199 -258664 -520618 -434191 -219430
12902b19430J91326O1078p9391j30587R545J19241M9508N9651j09520n4196L33726
$$ -219430 -28104 32974 -46417 -177004 -167459 -48218 1290 60941 -48579 -102775 230951
12891B30951L19718K98171k34857j24807k25972n8414J61953n8389J20773P6148
$$ 230951 550669 848840 613983 489176 263204 204790 366743 308354 429127 505275
12881E05275J18416R5226k61407l3031J09524o5259j56220p5006K40017j0405
$$ 505275 623691 718917 457510 424479 534003 468744 312524 237518 477535 467130
12871D67130n9738l0117j35698m6436j81579j33147R2029J17069j4631j13335
$$ 467130 407392 377275 241577 195141 13562 -119585 -27556 89513 74882 -38453
12861c8453m5198J55770J66253n8050L306j19443P5813j33362n9965J69594K64283
$$ -38453 -83651 72119 238372 180322 183628 64185 139998 6636 -53329 116265 380548
12850C80548K9072j46503j84995o4821K41237j33605J89311L2249q5263J29205
$$ 380548 409620 263117 78122 13301 254538 120933 310244 342493 257230 386435
12840C86435J55292M1234r2604l7454J64269l5398L686k5560l6903J60094J21967
$$ 386435 541727 582961 490357 452903 617172 581774 585460 559900 522997 683091 805058
12829H05058m4362j43495K27770j76475l10645K9473P2518J9208Q1669p0998j82655
$$ 805058 760696 617201 844971 668496 357851 387324 459842 479050 560719 489721 307066
12818C07066o7091J67365K38706q6381k46329j18637l0703K8265K42960k8868
$$ 307066 239975 407340 646046 559665 313336 194699 163996 192261 435221 406353
12808D06353k02208j18280J750P2388P380k11856L17490L33810j91738j12475
$$ 406353 204145 85865 87615 160003 167383 -44473 273017 606827 415089 302614
12798C02614j39682r5061J61439K26302J04758M7540r9760q5625N739m4360J86268
$$ 302614 162932 67871 229310 455612 560370 607910 508150 422525 428264 383904 570172
12787E70172m0487o279R5365J9193j23167N9211n4531M78m257j27172q9530J27774
$$ 570172 529685 523406 618771 637964 514797 574008 519477 519955 515698 388526 298996 426770
12775D26770k0469M1477j09560j83202q6017K07356Q6571o4509r8211O2704q7113
$$ 426770 406301 447778 338218 155016 68999 276355 362926 298417 200206 262910 175797
12764A75797j26059L8198n8535O7525K13791o3132k176j0228L5651q1185j56410
$$ 175797 49738 87936 29401 96926 310717 247585 245409 235181 270832 189647 33237
12753C3237k1382j9349J16714k7528L21015j8319j15215N0163n7236r7456j7440
$$ 33237 11855 -7494 109220 81692 402707 384388 269173 319336 262100 164644 147204
12742A47204J67718L3099k35556j12484K36806R4141N6803j10252j55971k74330
$$ 147204 314922 348021 112465 -19 236787 330928 387731 277479 121508 -152822
12732a52822j43180q9944J78964L67511L6499Q9170m2917r2950j42085q9548R708
$$ -152822 -296002 -385946 -206982 160529 197028 286198 243281 150331 8246 -81302 -71594
12721g1594J16936J35616J93701N1025j3067p1101Q2397K16555p3495j46398k15271
$$ -71594 45342 180958 374659 425684 412617 341516 423913 640468 566973 420575 205304
12710B05304j20965J64821L1110p5933m8476k3347j18765r199Q3700J56561j45944
$$ 205304 84339 249160 280270 204337 155861 132514 13749 4550 88250 244811 98867
12699I8867j43842p5570j3218j10528k2736L23521K51716n9323j84906J201q5283
$$ 98867 -44975 -120545 -133763 -244291 -267027 56494 308210 248887 63981 65182 -20101
12688b0101l8143j49673r0965J38503N3072J25567o6055j67922J07639J6517m6548
$$ -20101 -58244 -207917 -298882 -160379 -107307 18260 -47795 -215717 -108078 -91561 -138109
12677a38109K30714k1153p3514J35658J14566M6134j38394j36460n3829K8858
$$ -138109 92605 71452 -2062 133596 248162 294296 155902 19442 -34387 -5529
12667e529R4260J36185p4676j20293K24704K51675k06738j61963n001J87281m832
$$ -5529 88731 224916 150240 29947 254651 506326 299588 137625 132624 319905 315073
12656C15073j74825j06840j52668j5628R692m8764J25317K22638J01144q7081
$$ 315073 140248 33408 -119260 -134888 -125196 -173960 -48643 173995 275139 188058
12646A88058j78147Q1790j01358J01830J10995o5022R7288k234M927j41514J20236
$$ 188058 9911 91701 -9657 92173 203168 138146 235434 233200 238127 96613 216849
12635B16849J17851L6188M0809r4832k22643j2524K35677k2970j76363k76685
$$ 216849 334700 370888 411697 316865 94222 81698 317375 294405 118042 -158643
12625a58643J00217J93674J49459m2783q2805M947O0928j73655J14220K5459k00009
$$ -158643 -58426 135248 284707 241924 159119 164066 224994 51339 165559 191018 -8991
12614h991K382J89155K05813q9275j97351l04370m2730P9036K10470Q9839k25162
$$ -8991 -6609 182546 388359 299084 101733 -202637 -245367 -166331 44139 133978 -91184
12603i1184j49961m7368j410Q919J47557Q5496O8874J4569J49419L3892q623o943
$$ -91184 -241145 -288513 -289923 -281004 -133447 -47951 20923 35492 184911 218803 210180 203237
12591B03237j9136Q155o4954k3678M12879J01331O3428j77060m8768m0905k9636
$$ 203237 184101 192256 127302 103624 516503 617834 681262 504202 455434 414529 384893
12580C84893K5081R537K7870M2627p2966j52988j7664p7649o2548L3190m6531
$$ 384893 409974 419511 447381 490008 417042 264054 246390 168741 106193 139383 92852
12569I2852Q4765M056j32854j03360R9811J08481n1011K4581N4857K25721j31356
$$ 92852 177617 181673 48819 -54541 45270 153751 102740 127321 182178 407899 276543
12558B76543j97699j25615q4783J87311L00101J0064j02842m517j32114L6903
$$ 276543 78844 -46771 -131554 55757 355858 365922 263080 258563 126449 163352
12548A63352K19739J12794l6721k16961k23949P2552J38975J25975n2791N8593
$$ 163352 383091 495885 459164 242203 18254 90806 229781 355756 302965 361558
12538C61558r0279p3388J44220j9651J6377n61J29282N8632k02193O4004o2310
$$ 361558 271279 197891 342111 322460 338837 338276 467558 526190 323997 388001 325691
12527C25691P5961k1769q4995m0873j89567N8491K40909K69367j12705K3638J07634
$$ 325691 401652 379883 294888 254015 64448 122939 363848 633215 520510 544148 651782
12516F51782j64790k29669q1883J1404l5273n1130K95925R545j0202M3343J81062
$$ 651782 486992 257323 175440 186844 151571 100441 396366 405911 395709 439052 620114
12505F20114j46563j8237L01753n4205l77001k33910o9370J44506J63517j91317
$$ 620114 473551 455314 757067 702862 325861 91951 22581 167087 330604 139287
12495A39287k52915K9558J35762L37940j7478J58723J37753j75207m6855K57413
$$ 139287 -113628 -84070 51692 389632 372154 530877 668630 493423 446568 703981
12485G03981J6490o5021p0022R6541o2795L69119j09620r5681L50440Q6324l44250
$$ 703981 720471 655450 585428 681969 619174 988293 878673 782992 1133432 1219756 875506
12474H75506L914K08276L4624L4100M5950J37935k963L5390j29382j7455r7159
$$ 875506 879420 1087696 1122320 1156420 1202370 1340305 1337342 1372732 1243350 1225895 1128736
12463A128736k73180o0624K81481N2284j27302j03553M4402Q1649J05567M2322
$$ 1128736 855556 794932 1076413 1128697 1001395 897842 942244 1023893 1129460 1171782
12453A171782J92628K8494o6231J99896m9935k58131j47713J15273j9660N9993
$$ 1171782 1364410 1392904 1326673 1526569 1476634 1218503 1070790 1186063 1166403 1226396
12443A226396J91526K08370R492J12419K19626j44704l65615L7309p9596k8131
$$ 1226396 1417922 1626292 1635784 1748203 1967829 1823125 1457510 1494819 1415223 1387092
12433A387092p2182j30818O2793K06862j4073K60093J93738L5412R8050M2720
$$ 1387092 1314910 1184092 1246885 1453747 1439674 1699767 1893505 1928917 2026967 2069687
12423B069687O526J27929J40049L5314J70387N8438L2894J58846J17101L1679
$$ 2069687 2076213 2204142 2344191 2379505 2549892 2608330 2641224 2800070 2917171 2948850
12413B948850l8163L841R0626J56170J27523J77779R2996n6394J50118J08801
$$ 2948850 2910687 2914528 3005154 3161324 3288847 3466626 3559622 3503228 3653346 3762147
12403C762147J55818P0818n1110j90480L55371K22326J93057L96112L52269L15975
$$ 3762147 3917965 3988783 3937673 3747193 4102564 4324890 4517947 4914059 5266328 5582303
12393E582303n3087l0895L09850L09949L88796M87887M46905M00222N58936L74978
$$ 5582303 5529216 5498321 5808171 6118120 6506916 6994803 7441708 7841930 8400866 8775844
12383H775844L61353N83261P34951M07546N69223P54488Q37128R80230J039114
$$ 8775844 9137197 9720458 10455409 10862955 11432178 12186666 13023794 14004024 15043138
12374A5043138Q84067P87404J011354J005706R92569J523931J698406J741928
$$ 15043138 15927205 16714609 17725963 18731669 19724238 21248169 22946575 24688503
12366B4688503J636817J563049J574122J569553K000484K163805K033543J752259
$$ 24688503 26325320 27888369 29462491 31032044 33032528 35196333 37229876 38982135
12358C8982135J926057J785927J341817J035420R19688N69133J30618l2899r0246
$$ 38982135 40908192 42694119 44035936 45071356 45991044 46560177 46690795 46657896 46567650
12349D6567650j59005k69083l58328l86754n47308l21047J09412J09037l14356
$$ 46567650 46408645 46139562 45781234 45394480 44847172 44526125 44635537 44744574 44430218
12340D4430218O9612L06749N72550J025311J305115J319053J167727J505883J987935
$$ 44430218 44499830 44806579 45379129 46404440 47709555 49028608 50196335 51702218 53690153
12331E3690153J948786J963885J905258K215145K455462K165057J819124J811224
$$ 53690153 55638939 57602824 59508082 61723227 64178689 66343746 68162870 69974094
12323F9974094J772661J496934J234189J115997Q99930O57312P7415Q1n53357
$$ 69974094 71746755 73243689 74477878 75593875 76493805 77151117 77228532 77228613 76675256
12314G6675256q36223q89806j309818j677731j881538k087880k179247k096975
$$ 76675256 75839033 74949227 73639409 71961678 70080140 67992260 65813013 63716038
12306F3716038k042024k167721k158967j760724j909250j453609j308078j102130
$$ 63716038 61674014 59506293 57347326 55586602 53677352 52223743 50915665 49813535
12298D9813535j105671j055171r13778n74649k93562j74887q2899J70725N49502
$$ 49813535 48707864 47652693 46738915 46164266 45870704 45695817 45612918 45783643 46333145
12289D6333145L77038J74927J45658L40468K73944m1058n9037k36583m90350q85226
$$ 46333145 46710183 46885110 47030768 47371236 47645180 47604122 47545085 47308502 46818152 45932926
12279D5932926j160274j232394j129045j263310j637994j583048j745956j823388
$$ 45932926 44772652 43540258 42411213 41147903 39509909 37926861 36180905 34357517
12271C4357517j679754j595036j351996j499742j658512j239674j189969j105462
$$ 34357517 32677763 31082727 29730731 28230989 26572477 25332803 24142834 23037372
12263B3037372j145814r02661j005351p77244j001319q67165o51100n90290q25717
$$ 23037372 21891558 20988897 19983546 19206302 18204983 17337818 16686718 16096428 15270711
12254A5270711p13486n27466o25410l93213m82760n44625m34505o40578m42501
$$ 15270711 14557225 14029759 13404349 13011136 12528376 11983751 11549246 10908668 10466167
12245A0466167m48936m24691l63243j20711m65085k88358m86535k96522k40839
$$ 10466167 10017231 9592540 9229297 9108586 8643501 8355143 7868608 7572086 7331247
12236G331247n26706R0359L1812l76442m66408j10861l0015k85199k01994l47484
$$ 7331247 6804541 6894900 6926712 6550270 6083862 5973001 5942986 5657787 5455793 5108309
12226E108309j35039J8151J09406r7424m41612n9348N2904K3683n9979r8344k91527
$$ 5108309 4973270 4991421 5100827 5003403 4561791 4502443 4555347 4579030 4519051 4420707 4129180
12215D129180j62997k79784J6627J19529p9076j71996r7189K7944l2218j29573
$$ 4129180 3966183 3686399 3703026 3822555 3743479 3571483 3474294 3502238 3470020 3340447
12205C340447J45828j18521l60521j60249K20603Q9327j77836l39686j06936J38125
$$ 3340447 3486275 3367754 3007233 2846984 3067587 3156914 2979078 2639392 2532456 2670581
12195B670581j76200l26967j04876L0922R3257j2398k64062l2299k81706k10834
$$ 2670581 2494381 2167414 2062538 2093460 2186717 2174319 1910257 1877958 1596252 1385418
12185A385418J49362K18064K89876n4785n3981n6268n0763M334J2202l25724j66998
$$ 1385418 1534780 1752844 2042720 1987935 1933954 1877686 1826923 1831257 1843459 1517735 1350737
12174A350737j6805R1652j93636j2744P8617n5976n0738J37947J33995l09251
$$ 1350737 1333932 1425584 1231948 1219204 1297821 1241845 1191107 1329054 1463049 1153798
12164A153798k25433k47587M9892J93727L7970k5582j02118p1889J345L4288J18930
$$ 1153798 928365 680778 730670 924397 962367 936785 834667 762778 764123 798411 917341
12153I17341J09535k44345m1409M5979j27220J36760n6277k08203l6462L65265
$$ 917341 1026876 782531 741122 787101 659881 796641 740364 532161 495699 860964
12143H60964J03127N7719J29168L7195K8512M6419K34609J15323o9900k14077
$$ 860964 964091 1021810 1150978 1188173 1216685 1263104 1497713 1613036 1543136 1329059
12133A329059l47340O0129O9008k91078p4051j8035J61151P2938j84073m043q4407
$$ 1329059 981719 1041848 1110856 819778 745727 727692 888843 961781 777708 773665 689258
12122F89258j30737o9577K03457J41528o1929j84718L9155P2596m6207K8424j82662
$$ 689258 558521 488944 692401 833929 772000 587282 626437 699033 652826 681250 498588
12111D98588M4422L14983q0269N2759j78551j51077j76565j32740L21304K42866
$$ 498588 543010 857993 777724 830483 651932 500855 324290 191550 512854 755720
12101G55720o6300M6479M53555M96351N42258K28404O0054j45931K78294N28475
$$ 755720 689420 735899 1189454 1685805 2228063 2456467 2516521 2370590 2648884 3177359
12091C177359p5758q22625n55568l79444m21494k30420k5603J03867o3045K4041
$$ 3177359 3101601 2278976 1723408 1343964 922470 692050 666447 770314 707269 731310
12081G31310K4473r3997J29456K29598q7840n1230j13098J9772K016J25680k90384
$$ 731310 755783 661786 791242 1020840 933000 881770 768672 788444 790460 916140 625756
12070F25756j55156M789k7258m6920L5376K73113L5662j45732j56366M39238J13140
$$ 625756 470600 475389 448131 401211 436587 709700 745362 599630 443264 882502 995642
12059I95642j44259p5481J02274M433J39999Q2282M50358M26097M10230K44366
$$ 995642 851383 775902 878176 882609 1022608 1104890 1555248 1981345 2391575 2635941
12049B635941J11192J13194l8981m60845n81091o96645m93733k17131J11085Q2540
$$ 2635941 2747133 2860327 2821346 2360501 1779410 1082765 589032 371901 482986 565526
12039E65526k4066o1468j73937j89449l7039J13949M5156P2360R3992n5755j35275
$$ 565526 541460 479992 306055 116606 79567 193516 238672 311032 405024 349269 213994
12028B13994K6060K34117j8352O5271j03547M5567J75073m00238l80666M5603
$$ 213994 240054 474171 455819 521090 417543 463110 638183 237945 -142721 -97118
12018i7118K52978l2143j86545q89K29417J85590J70287J74803o4734K15157L34153
$$ -97118 155860 123717 -62828 -63717 165700 351290 521577 696380 631646 846803 1180956
12007A180956k9658l18642O2761K00082j473K73290l81123k90240l37948k49601
$$ 1180956 1151298 832656 895417 1095499 1094026 1367316 986193 695953 358005 108404
11997A08404n0412k605n5883j64858J74296K39395m3973P1352j65115j78920M500
$$ 108404 57992 55387 -496 -165354 8942 248337 204364 275716 110601 -68319 -63819
11986f3819K15898N8255l1721k38154j65606J46668K66147J68035K0146J16963
$$ -63819 152079 210334 178613 -59541 -225147 -78479 187668 355703 375849 492812
11976D92812Q54j49055R1572j4028j12132J3229m6272j55206j64111m3683n6346
$$ 492812 493666 344611 436183 422155 310023 323252 276980 121774 -42337 -86020 -142366
11965a42366J97609L32612O5105r5368l323M6596q4383L8959P2395j51739k67444
$$ -142366 55243 387855 452960 357592 354269 400865 316482 355441 427836 276097 8653
11954H653n7629N6696J71913J23991j56418j13615J8935O3958Q1981l2445K4082
$$ 8653 -48976 7720 179633 303624 147206 33591 52526 116484 198465 166020 190102
11943A90102j5415l8080j95894l1613K78888J63907k70067j52433J20337P7978
$$ 190102 174687 136607 -59287 -90900 187988 351895 81828 -70605 49732 127710
11933A27710p3299M2406r6997o2485K10535K95253J44382j2598L2902j50896k53550
$$ 127710 54411 96817 -180 -62665 147870 443123 587505 574907 607809 456913 203363
11922B03363l760K37716j94038k19677R548P6718R8640l6507j75559k29427Q6109
$$ 203363 199603 437319 243281 23604 33152 109870 208510 172003 -3556 -232983 -146874
11911a46874K40125J68970P3382k4379m5495o2478n4549J49821R8294q2381j32119
$$ -146874 93251 262221 335603 311224 265729 203251 148702 298523 396817 314436 182317
11900A82317j48756k9637K61818N5431l7910K5963j0414j83413K3310K8443j15190
$$ 182317 33561 3924 265742 321173 283263 309226 298812 115399 138709 167152 51962
11889E1962J7504j6424j57552k26574J90312j22472j4217J5842J45626k7862n9404
$$ 51962 69466 53042 -104510 -331084 -140772 -263244 -277461 -261619 -115993 -143855 -203259
11878b03259j01961J15465L17624J52477m1981Q4115o395j70086K7553J2480K5274
$$ -203259 -305220 -189755 127869 280346 238365 322480 316085 145999 173552 186032 211306
11867B11306j10064j13997K69292n284k18728n9327J74520L2493J73888M4187
$$ 211306 101242 -12755 256537 251253 32525 -26802 147718 180211 354099 398286
11857C98286r850j33413m220K62374L5954L2674K54319l076j76826k02319K5415
$$ 398286 388436 255023 250803 513177 549131 581805 836124 833048 656222 453903 479318
11846D79318n300j63084m8243K97788k7218o3081m1878o4011j65376L4703J08781
$$ 479318 474018 310934 262691 560479 533261 470180 428302 364291 198915 233618 342399
11835C42399j25361J83171j76835P4753M449j88277M2848l4689j12005j33133
$$ 342399 217038 400209 223374 298127 302576 114299 157147 122458 10453 -122680
11825a22680p7266J85817Q9137J65541J97791L6928k36924j52798k4730j62989
$$ -122680 -199946 -14129 75008 240549 438340 475268 238344 85546 60816 -102173
11815a02173j5458L08760K71189Q7747l03122j99215k25209Q5053L71693P8131
$$ -102173 -117631 191129 462318 550065 246943 47728 -177481 -92428 279265 357396
11805C57396p4464J54332J01024L688q9985j12832P4254n8154j34659O4744p6074
$$ 357396 282932 437264 538288 541976 451991 339159 413413 355259 220600 285344 209270
11794B09270p7140M7149j67650j27630l1311K33877J5716j13262j77539L58321
$$ 209270 132130 179279 11629 -116001 -147312 86565 102281 -10981 -188520 169801
11784A69801J57567o1187j12998O9151M6576P9884o4823J27890j4785l82213k32211
$$ 169801 327368 266181 153183 222334 268910 348794 283971 411861 397076 14863 -217348
11773b17348n0194O3257K42203l6044p774j81633r9696J3405L5574N8958M8737
$$ -217348 -267542 -204285 37918 1874 -5900 -187533 -287229 -273824 -238250 -179292 -130555
11762a30555j35954j28381N078o0481L7881J47654J64900J93476N9378K840K7669
$$ -130555 -266509 -394890 -389812 -450293 -412412 -264758 -99858 93618 152996 155836 183505
11751A83505J76629j72746l10045J87482k1989j53411J18762r6666j31699N4214
$$ 183505 360134 187388 -122657 64825 42836 -110575 8187 -88479 -220178 -165964
11741a65964M3977J75402K1929j91769Q9293J10074K00607P9684j80693k19350
$$ -165964 -121987 53415 75344 -116425 -27132 82942 283549 363233 182540 -36810
11731c6810j24538j36936J92135j21092Q6493j6504m9084l54208J42242L57991
$$ -36810 -161348 -298284 -106149 -227241 -140748 -157252 -206336 -560544 -418302 -60311
11721f0311R8389j34545j20110o1483j09718k05530J47877J74222J03818R6758
$$ -60311 38078 -96467 -216577 -278060 -387778 -593308 -445431 -271209 -167391 -70633
11711g0633k9308R1255j05396K28404o6371l01656K0358L4682o3872O9359J25197
$$ -70633 -99941 -8686 -114082 114322 47951 -253705 -233347 -198665 -262537 -193178 -67981
11700f7981j29042K2589K9502j12012J95240J69998k17703q9598l7452n4689j71257
$$ -67981 -197023 -174434 -144932 -256944 -61704 108294 -109409 -199007 -236459 -291148 -462405
11689d62405m6970K90392O4112j30043P2627r0721P7775j3213J11878k4536o6988
$$ -462405 -509375 -218983 -154871 -284914 -212287 -303008 -225233 -238446 -126568 -151104 -218092
11678b18092J9058j99068L2357J78601p9805j29235q2239K81447K09944K57349
$$ -218092 -199034 -398102 -365745 -187144 -266949 -396184 -478423 -196976 12968 270317
11668B70317L4662j39662n5947r1334R4659n789r1696j58688p3092j7491J70041
$$ 270317 304979 165317 109370 18036 112695 106906 15210 -143478 -216570 -234061 -64020
11657f4020J85981l4620K8688j4395j48302O1049l9876j81804J32315K05285l5055
$$ -64020 121961 87341 116029 101634 -46668 14381 -25495 -207299 -74984 130301 95246
11646I5246n5771r4772k78808m3709k4801J71282J05488J20193r2752q4743K60279
$$ 95246 39475 -55297 -334105 -377814 -402615 -231333 -125845 -5652 -98404 -183147 77132
11635G7132P1703j15082j2188L04141j7366j20004j74958k1359Q2740k60087o1814
$$ 77132 148835 33753 21565 325706 308340 188336 13378 -7981 74759 -185328 -247142
11624b47142J11680j12845j23239K03666o9095Q7012J19461J0783J36001o8444
$$ -247142 -135462 -248307 -371546 -167880 -236975 -149963 -30502 -19719 116282 47838
11614D7838n9301m4605K2006j29224j35560q6449k4991J89848J06453M0670R350
$$ 47838 -11463 -56068 -34062 -163286 -298846 -385295 -410286 -220438 -113985 -73315 -63965
11603f3965P5756j10428k43323j31194J26092K10046N6421j60197j25329l3613
$$ -63965 11791 -98637 -341960 -473154 -347062 -137016 -80595 -240792 -366121 -399734
11593c99734J26223P3814L9297j16581o7044R3779J84352J45908J53786J6333
$$ -399734 -273511 -199697 -160400 -276981 -344025 -250246 -65894 80014 233800 250133
11583B50133j11461k0386j9527l3802o2337K8420N4198j5179l3948k47073j65919
$$ 250133 138672 118286 98759 64957 2620 31040 85238 70059 36111 -210962 -376881
11572c76881M8206K83748L2783q1418l7670J83691K08766j4181j57685l62189
$$ -376881 -328675 -44927 -12144 -93562 -131232 52459 261225 247044 89359 -272830
11562b72830k1421l58259R0770L33886j9112l1440k15837M9046o5097n5651K27888
$$ -272830 -294251 -652510 -561740 -227854 -246966 -278406 -494243 -445197 -510294 -565945 -338057
11551c38057K76044r789j12570j05997M6258R3069L1068J56277k519J82219k73490
$$ -338057 -62013 -71802 -184372 -290369 -244111 -151042 -119974 36303 33784 216003 -57487
11540e7487l7213m5168j75571l2044L51408L10705k56669M0385j78397l16802
$$ -57487 -94700 -139868 -315439 -347483 3925 314630 57961 98346 -80051 -396853
11530c96853N4707J70277p3470N3252K09612J20333q3431j98967j15339r7695
$$ -396853 -342146 -171869 -245339 -192087 17525 137858 54427 -144540 -259879 -357574
11520c57574K48103j17039j83896L0556R7972J48656J05832J75335q7080k21007
$$ -357574 -109471 -226510 -410406 -379850 -281878 -133222 -27390 147945 60865 -160142
11510a60142O1546P6612K6512j73651J26494J8735J21711N7340m0961j07596K8002
$$ -160142 -98596 -21984 4528 -169123 -42629 -23894 97817 155157 114196 6600 34602
11499C4602j20690j04585J73393K84451j15127J89104M6391K4160j14327m43152
$$ 34602 -86088 -190673 -17280 267171 152044 341148 387539 411699 297372 -145780
11489a45780k42237J12545K49492j80293j65219j72048n734J01462J37128K37614
$$ -145780 -388017 -275472 -25980 -206273 -371492 -543540 -549274 -447812 -310684 -73070
11479g3070l5533j49498j1846j05018p1565j97602N8099J2561O474J58630L40442
$$ -73070 -108603 -258101 -269947 -374965 -446530 -644132 -586033 -573472 -566998 -408368 -67926
11468f7926J64939N8801o5921r5590K8452L0258k5033k2937m1185k95663J01129
$$ -67926 97013 155814 89893 -5697 22755 53013 27980 5043 -36142 -331805 -230676
11457b30676J87012j63093j73653n4986L7621J98140K44306J28502j13631k72624
$$ -230676 -43664 -206757 -380410 -435396 -397775 -199635 44671 173173 59542 -213082
11447b13082J05133J05148q8945r2360q665J41989J4044Q634j43229Q8429J12633
$$ -213082 -107949 -2801 -91746 -184106 -192771 -50782 -36738 -28104 -171333 -82904 29729
11436B9729j78193k9492K49964l2067j35729j1947N4697L7484J45920m5051l0273
$$ 29729 -148464 -177956 72008 39941 -95788 -107735 -53038 -15554 130366 85315 55042
11425E5042Q677j17181J15585j2811R1133r8287k47555K4744q6494j1339j69517
$$ 55042 63719 -53462 62123 49312 140445 42158 -205397 -180653 -267147 -278486 -448003
11414d48003O381J22912p9137r5075J30752J17708j1464Q3494J18578k7156J00442
$$ -448003 -441622 -318710 -397847 -492922 -362170 -244462 -255926 -172432 -53854 -81010 19432
11403A9432K38513k60689k31147q1417j35205n5158l4316L46434J83354n1906
$$ 19432 257945 -2744 -233891 -315308 -450513 -505671 -539987 -193553 -10199 -62105
11393f2105m7544K15625j35107q8161K00474L24817m00697m97743k94580J02038
$$ -62105 -109649 105976 -29131 -117292 83182 407999 7302 -490441 -785021 -682983
11383f82983M70323j7184k77944j28212O807K75256K42103K37126J64664j29667
$$ -682983 -212660 -229844 -507788 -636000 -629193 -353937 -111834 125292 289956 160289
11373A60289j41534k92961J19867J63461j38115O6354p857k5826K01001k6941
$$ 160289 18755 -274206 -154339 9122 -128993 -62639 -70496 -96322 104679 77738
11363G7738j05628K45961k35799k32421L447p0072o4335K08216m8985L5715J1033
$$ 77738 -27890 218071 -17728 -250149 -246702 -316774 -381109 -172893 -221878 -186163 -175130
11352a75130j2128O6439k4088R3531J78419o6686r9134J45334P814j82579L9213
$$ -175130 -187258 -120819 -144907 -51376 127043 60357 -38777 106557 114371 -68208 -28995
11341b8995O2683k81319k0691L17801K37959r7920o143l17037j00753n4576m5615
$$ -28995 33688 -247631 -268322 49479 287438 189518 183375 -133662 -234415 -288991 -334606
11330c34606l70650j38596L18839L40328K22953j37946l5472j18879J3970q2273
$$ -334606 -705256 -843852 -525013 -184685 38268 -99678 -135150 -254029 -240059 -322332
11320c22332J31950r5425J54752j04766K365J42731l4407k05562j65787K20565
$$ -322332 -190382 -285807 -131055 -235821 -233456 -90725 -125132 -330694 -496481 -275916
11310b75916J41663L2501j15003j77084k23833J13806J92440K03551J10848k20692
$$ -275916 -134253 -101752 -216755 -393839 -617672 -503866 -311426 -107875 2973 -217719
11300b17719p8446J15450K06687J34506j4287k2948m0572m5591k6650j3426p0757
$$ -217719 -296165 -180715 25972 160478 146191 123243 82671 37080 10430 -2996 -73753
11289g3753J40698o8386j71764m3674J78929k16306L0953K62170K45972j20214
$$ -73753 66945 -1441 -173205 -216879 -37950 -254256 -223303 38867 284839 164625
11279A64625j01164j49807j50423O9059l6522J99763N1235k47879j55564j81255
$$ 164625 63461 -86346 -236769 -167710 -204232 -4469 46766 -201113 -356677 -537932
11269e37932J96124K50102j29363Q5373j07743j06678p1203L5067j2518K03378
$$ -537932 -341808 -91706 -221069 -135696 -243439 -350117 -421320 -386253 -398771 -195393
11259a95393K18200j64297j30750m4542J8840Q3058j62141Q2085P1736R8566j96267
$$ -195393 22807 -141490 -272240 -316782 -297942 -214884 -377025 -294940 -223204 -124638 -320905
11248c20905p6197q3160L4752J73793L8391J59172m901o5011n8025K41027J34771
$$ -320905 -397102 -480262 -445510 -271717 -233326 -74154 -79055 -144066 -202091 38936 173707
11237A73707j14057j29620r0779L5687J53375K19818j01708N5531J57288o5271
$$ 173707 59650 -69970 -160749 -125062 28313 248131 146423 201954 359242 293971
11227B93971j0668r6497j43168L4947j44404k46641j16312J88135J37925j23675
$$ 293971 283303 186806 43638 78585 -65819 -312460 -428772 -240637 -102712 -226387
11217b26387j53500l5614J05876R9473J83075Q4094n0467K9753Q9574o1378o2930
$$ -226387 -379887 -415501 -309625 -210152 -27077 57017 6550 36303 125877 64499 1569
11206A569J13170O7699j05795k33719k22354N4552Q2074R0793J20607m7527n48972
$$ 1569 114739 182438 76643 -157076 -379430 -324878 -242804 -152011 -31404 -78931 -627903
11195f27903j15412J67401L95740J97532q7740O9947J15199k26999j55145j02562
$$ -627903 -743315 -575914 -180174 17358 -70382 -435 114764 -112235 -267380 -369942
11185c69942k18780m6388N5092O0518J91831J12024N995M300J72283K21722m4424
$$ -369942 -588722 -635110 -580018 -519500 -327669 -215645 -209650 -205350 -33067 188655 144231
11174A44231M7087m4469j41325j36329r867j90432r5085R8339J41625J00389K5353
$$ 144231 191318 146849 5524 -130805 -140672 -331104 -426189 -327850 -186225 -85836 -60483
11163f0483m7794P3302J06900m9574N4962k6282l18064o4934N005P0904j29906
$$ -60483 -108277 -34975 71925 22351 77313 51031 -267033 -331967 -326962 -256058 -385964
11152c85964q6697r7859J38329K81815K46144K3944q2480l27003K7506l9604J49680
$$ -385964 -472661 -570520 -432191 -150376 95768 119712 37232 -289771 -262265 -301869 -152189
11141a52189J70292P3729j71912k38950q6422O6325O159j645k37623n9063J05657
$$ -152189 18103 91832 -80080 -319030 -405452 -339127 -332968 -334613 -572236 -631299 -525642
11130e25642N8057J16817Q0226M0820K59039R7714r6228r7945j12455J27341n104
$$ -525642 -467585 -350768 -270542 -229722 29317 127031 30803 -67142 -179597 -52256 -57360
11119e7360j2973l1367j16207L5214j70777J72498K02367r8703j16385M3632o7478
$$ -57360 -70333 -101700 -217907 -182693 -353470 -180972 21395 -77308 -193693 -150061 -217539
11108b17539k96667j03516J3055O2749K115Q9705N4148K36793K9335j45617j08839
$$ -217539 -514206 -617722 -604667 -541918 -539803 -450098 -395950 -159157 -129822 -275439 -384278
11097c84278J20976J80686j34425j42519q387j60495k611N7881j0995L68281l0117
$$ -384278 -263302 -82616 -217041 -359560 -367947 -528442 -531053 -473172 -484167 -115886 -146003
11086a46003Q9164J1005L7707J3571K43990j39992j63954J02702j59260k08559
$$ -146003 -56839 -45834 -8127 5444 249434 109442 -54512 48190 -111070 -319629
11076c19629p8632k50612J9431J69101K70675n735o4156j81670n1717L2969r4622
$$ -319629 -398261 -648873 -629442 -460341 -189666 -195401 -259557 -441227 -492944 -459975 -554597
11065e54597K52131K77701j34055o6349l6050p2009N9754K15741o6326q5475k3252
$$ -554597 -302466 -24765 -158820 -225169 -261219 -333228 -273474 -57733 -124059 -209534 -232786
11054b32786R3175K16971R3820j47701Q0818j917R8664K41212R769k44821j58056
$$ -232786 -139611 77360 171180 23479 104297 102380 201044 442256 452025 207204 49148
11043D9148K36906Q1618j07460M3336k7941K69878K73078L04516J89355M691l432
$$ 49148 286054 367672 260212 303548 275607 545485 818563 1123079 1312434 1317125 1313693
11032A313693M556k1263k72865r6128R4867J72339M7550j14837K08822J96469
$$ 1313693 1318249 1296986 1024121 927993 1022860 1195199 1242749 1127912 1336734 1533203
11022A533203l8712J29858k15643l47580k7881n8624k01115j86197K52219K82170
$$ 1533203 1494491 1624349 1408706 1061126 1033245 974621 773506 587309 839528 1121698
11012A121698m3089k7924j6796J28685j14304j98038j78758Q8719J3771q9735
$$ 1121698 1078609 1050685 1033889 1162574 1048270 850232 671474 760193 773964 684229
11002F84229q2769j15214J71223m8824j05336q3531j42563J2852J47449p3271
$$ 684229 601460 486246 657469 608645 503309 419778 277215 290067 437516 364245
10992C64245J9423j36621O513K15007n1120l67335k86344r0129k3094j97107J32689
$$ 364245 383668 247047 253560 468567 417447 50112 -236232 -326361 -349455 -546562 -413873
10981d13873J76529K5106L46166j23942k68001j75615O740J27815K463K52607
$$ -413873 -237344 -212238 133928 9986 -258015 -433630 -426890 -299075 -296612 -44005
10971d4005J28964j34651m8642N9733K509R2885J63243l17159l54896N6604L01796
$$ -44005 84959 -49692 -98334 -38601 -36092 56793 220036 -97123 -452019 -395415 -93619
10960i3619J92623K9886K0931k47643j78577O3791K80815J96294k61212J4551
$$ -93619 99004 128890 149821 -97822 -276399 -212608 68207 264501 3289 17840
10950A7840j31215k36551M3556O0274J32285K53707q1575k01558k27568l7928
$$ 17840 -113375 -349926 -306370 -246096 -113811 139896 58321 -143237 -370805 -408733
10940d08733J72602J48439o601J08618K64011o7346k50309M7543P5889n7201j78409
$$ -408733 -236131 -87692 -94293 14325 278336 210990 -39319 8224 84113 26912 -151497
10929a51497r0974L5862K9487k31660m0073m6692J28977J0587J15895J11635K16
$$ -151497 -242471 -206609 -177122 -408782 -448855 -495547 -366570 -355983 -240088 -128453 -128237
10918a28237j22256j9655Q8707j07669r7850j06574m2909k6560n4939J87291L95919
$$ -128237 -250493 -270148 -181441 -289110 -386960 -493534 -536443 -563003 -617942 -430651 -34732
10907c4732j3998j40782n6150j23116j36640J82859J01089Q1844J0055q8773N8937
$$ -34732 -48730 -189512 -245662 -368778 -505418 -322559 -221470 -139626 -129571 -218344 -159407
10896a59407R7943K60499P8803r0958l34375k21424K85887J14260j46022j14144
$$ -159407 -61464 199035 277838 186880 -147495 -368919 -83032 31228 -114794 -228938
10886b28938o2715L3666j31532m7147J61149K65776J97616J3865j31025k60505
$$ -228938 -291653 -257987 -389519 -436666 -275517 -9741 187875 201740 70715 -189790
10876a89790j05711J22556q7033j0054R0622o8273J6808J15169J09309K46704
$$ -189790 -295501 -172945 -259978 -270032 -179410 -247683 -230875 -115706 -6397 240307
10866B40307L0992l24806k41578j52321Q0772J44850P4297K41481J00390r9406
$$ 240307 271299 -53507 -295085 -447406 -366634 -221784 -147487 93994 194384 94978
10856I4978j19515J6193j10175K17446M3722j200j46774p9311M6789K2810O3602
$$ 94978 -24537 -8344 -118519 98927 142649 141449 -5325 -84636 -37847 -15037 48565
10845D8565J21491J21640K750j52846M8694N8021r1723n8146j79668l6080Q2499
$$ 48565 170056 291696 294446 141600 190294 248315 156592 98446 -81222 -117302 -34803
10834c4803J00378n0848k7296J24175Q0191O3077j64671p0693j30650K6498K02826
$$ -34803 65575 14727 -12569 111606 191797 254874 90203 19510 -111140 -84642 118184
10823A18184K7509k51645J69839m974q0741m91l3448J6253j46116L6076j60154
$$ 118184 145693 -105952 63887 58913 -21828 -22319 -55767 -39514 -185630 -149554 -309708
10812c09708j74445K24693J29265k33888P9087L2829J6231K9896L9180M3130P0459
$$ -309708 -484153 -259460 -130195 -364083 -284996 -252167 -235936 -206040 -166860 -123730 -53271
10801e3271j4322l854j30878L1447K28948K29629k14336k13534M8958j38247k73890
$$ -53271 -67593 -71447 -202325 -170878 58070 287699 73363 -140171 -91213 -229460 -503350
10790e03350k33798R1202N16667L9j31758p1250R2780M334k2841J2603K09981
$$ -503350 -737148 -645946 -129279 -129240 -260998 -332248 -239468 -235134 -257975 -245372 -35391
10779c5391L06792k12064n0940l512m8916m257n0574k61905j06094J49642K09034
$$ -35391 271401 59337 8397 4885 -44031 -48288 -98862 -360767 -466861 -317219 -108185
10768a08185M2249p6986J3065K24306Q7653o0531j66755l52203J23785L67328
$$ -108185 -65936 -142922 -129857 94449 182102 121571 -45184 -397387 -273602 93726
10758I3726P8876j90145j58542K65384N4877j35236j27624n5011j23122k8237
$$ 93726 172602 -17543 -176085 89299 144176 8940 -118684 -173695 -296817 -325054
10748c25054l3381K48107J50695k4274Q963K39685Q3642N9419O2114j6510n3790
$$ -325054 -358435 -110328 40367 16093 25056 264741 348383 407802 469916 453406 399616
10737C99616P0775Q754K265Q1298k98473L9852L63971J29843j28737k20257j09344
$$ 399616 470391 479145 481410 562708 264235 304087 668058 797901 669164 448907 339563
10726C39563O0799K11687l2399j27379K83021J18343O7866j2932k09694K43211
$$ 339563 400362 612049 579650 452271 735292 853635 921501 908569 698875 942086
10716I42086K53356j6378k99882k66396O5219L10999J74741P11J78092o71k58434
$$ 942086 1195442 1179064 879182 612786 678005 989004 1163745 1164456 1342548 1341877 1083443
10705A083443j40203l3310j5594N2290P1287J84837j86032J660j06435n0431J22960
$$ 1083443 943240 909930 894336 946626 1017913 1202750 1016718 1018378 911943 861512 984472
10694I84472q6853m4752j764j24622R0661J03436k42884j31431O8913l0976K87888
$$ 984472 897619 852867 851103 726481 817142 920578 677694 546263 615176 584200 872088
10683H72088L09168j34294l49914j27057J84161R1011n3427P6668J22979j06323
$$ 872088 1181256 1046962 697048 569991 754152 845163 791736 868404 991383 885060
10673H85060j702J91082k8926k31677j32240m4582K28851K51101J94122R9660
$$ 885060 883358 1074440 1045514 813837 681597 637015 865866 1116967 1311089 1410749
10663A410749l5268R156L09241K03073J65000J02186J94555J61952K42357L07127
$$ 1410749 1375481 1384637 1693878 1896951 2061951 2164137 2358692 2520644 2763001 3070128
10653C070128K05177K62969j50468j19506N0218J66805L47820J67189j85875p0380
$$ 3070128 3275305 3538274 3387806 3268300 3318518 3485323 3833143 4000332 3814457 3744077
10643C744077K43976K81423L79496N00391N79510Q10850N84920P25130O87756
$$ 3744077 3988053 4269476 4648972 5149363 5728873 6539723 7124643 7849773 8537529
10634H537529Q40979Q90353R06760R55612R02964R48369J289329J677208K202237
$$ 8537529 9378508 10268861 11175621 12131233 13034197 13982566 15271895 16949103 19151340
10625A9151340K966330L858429N206482O615722Q316479R943263J0847231J0158568
$$ 19151340 22117670 25976099 31182581 37798303 46114782 56058045 66905276 77063844
10617G7063844R010016Q218799O905514M693253K287177J287105K226869N952327
$$ 77063844 86073860 94292659 101198173 105891426 108178603 109465708 111692577 117644904
10609A17644904J1411142J6176443J7709968J6433868J3863602J1730745Q978573
$$ 117644904 129056046 145232489 162942457 179376325 193239927 204970672 213949245
10602B13949245L317737m140446q393049n648381J785823J1001893J7826725K0285226
$$ 213949245 217266982 213126536 204733487 199085106 200870929 211872822 229699547 249984773
10594B49984773J7362930J2763497R085706M129732n112943j6919600k3683865
$$ 249984773 267347703 280111200 289196906 293326638 288213695 271294095 247610230
10587B47610230k0987585j2556168l375043L246843O024497M852913K242283l3679
$$ 247610230 226622645 214066477 210691434 213938277 219962774 224815687 227057970 227024291
10579B27024291l563016j0117864j7408025k1118798j8991261j3105891p322188
$$ 227024291 223461275 213343411 195935386 174816588 155825327 142719436 135397248
10572A35397248l593082j830053j926154k662633l630073n814177q523603j0806228
$$ 135397248 131804166 129974113 128047959 125385326 121755253 115941076 107417473 96611245
10564I6611245j2068502j1213836r646196p618419n675384m544493l589883k784458
$$ 96611245 84542743 73328907 63682711 56064292 50388908 45844415 42254532 39470074
10556C9470074k495978k351791j908772j912860j575964j435685j298977j630437
$$ 39470074 36974096 34622305 32713533 30800673 29224709 27789024 26490047 24859610
10548B4859610j237063q51781r01043q09075q67076p82324q21463r32172o93508
$$ 24859610 23622547 22770766 21869723 21060648 20193572 19411248 18589785 17657613 16964105
10539A6964105o40683p60247o19867m14730l60679k00634k45515k42936o13202
$$ 16964105 16323422 15563175 14943308 14528578 14167899 13967265 13721750 13478814 12865612
10530A2865612o60640m80055n90947m59864j38477m32174j87276k08346k82830
$$ 12865612 12204972 11724917 11133970 10674106 10535629 10103455 9916179 9707833 9425003
10521I425003k27066m8040l46902k03140j30493k53692m43049k99427r6116k07385
$$ 9425003 9197937 9149897 8802995 8599855 8469362 8215670 7772621 7473194 7377078 7169693
10511G169693k22706j95693j10484k69994j02909r5219k87962k16756l50999j25489
$$ 7169693 6946987 6751294 6640810 6370816 6267907 6172688 5884726 5667970 5316971 5191482
10501E191482M7104m7246p7279k04729l21912q5780j09088j55428j17162j7070
$$ 5191482 5238586 5191340 5114061 4909332 4587420 4501640 4392552 4237124 4119962 4102892
10491D102892k85712j75251k58806k38664l6728J36427j02579q7441j03429J18949
$$ 4102892 3817180 3641929 3383123 3144459 3107731 3244158 3141579 3054138 2950709 3069658
10481C069658M196m36231l11139n2373J35561K36296j79248j87450J18432R8166
$$ 3069658 3073854 2637623 2326484 2274111 2409672 2645968 2466720 2279270 2397702 2495868
10471B495868j28281r0326M4481l9476j06901l9245j49637J11573m8242k40831
$$ 2495868 2367587 2277261 2321742 2282266 2175365 2136120 1986483 2098056 2049814 1808983
10461A808983j72467r4159J42486R3192j34756j10876k92751n7502K2089j61903
$$ 1808983 1636516 1542357 1684843 1778035 1643279 1532403 1239652 1182150 1204239 1042336
10451A042336J95143K32236l2784j57567j21739o3395J8883J05763P2229K95287
$$ 1042336 1237479 1469715 1436931 1279364 1157625 1094230 1113113 1218876 1291105 1586392
10441A586392r7129q083j19976j65196K16626L8545k07063j05091l8844p4596
$$ 1586392 1489263 1481180 1361204 1196008 1412634 1451179 1244116 1139025 1100181 1025585
10431A025585j18938j53390N7230J21129M0821l24610P4591J05337J04746j58600
$$ 1025585 906647 753257 810487 931616 972437 647827 722418 827755 932501 773901
10421G73901j83905l8394p0132r5986M7372Q8898J07553K65755R2916j3994k22122
$$ 773901 589996 551602 481470 385484 432856 521754 629307 895062 987978 973984 751862
10410G51862j56015K36686j1327R377j63280J5154K06104J61264k03737P5350
$$ 751862 595847 832533 821206 830583 667303 682457 888561 1049825 846088 921438
10400I21438J26572R143j42018j93445j19729r5622J8000R3895R6638J08104j23471
$$ 921438 1048010 1057153 915135 721690 601961 506339 524339 618234 714872 822976 699505
10389F99505j00155P8979L73426J0857k53378j42825K37981r898j03205M944J9974
$$ 699505 599350 678329 1051755 1062612 809234 666409 904390 894492 791287 796231 816205
10378H16205K32453q4308l32358K6079J44296j3577j11336j46755j14035J56653
$$ 816205 1048658 964350 631992 658071 802367 788790 677454 530699 416664 573317
10368E73317r4418j40240J05279J03604N1260j33329k20708R4816P7219J13609
$$ 573317 478899 338659 443938 547542 598802 465473 244765 339581 416800 530409
10358E30409N0932q5190J88510L4107j03112j28897M8419m3449J517Q7728J74441
$$ 530409 581341 496151 684661 718768 615656 486759 535178 491729 493246 580974 755415
10347G55415J2030m3487P1404J71831j53570r6780J03128j18926k23471j21879
$$ 755415 767445 723958 795362 967193 813623 716843 819971 701045 477574 355695
10337C55695l32182Q0346J66213K0430M9184n4337n1764J64697j00293k80740
$$ 355695 23513 103859 270072 290502 339686 285349 233585 398282 297989 17249
10327A7249Q5160K92321j41041j82523n5742O5238K37443J76084M4024k00551
$$ 17249 102409 394730 253689 71166 15424 80662 318105 494189 538213 337662
10317C37662J5869Q3850n0575O211P2529R0679j48932P1823J20665l46363n2080
$$ 337662 353531 437381 386806 393017 465546 556225 407293 479116 599781 253418 201338
10306B01338N4375l7965R1937J14084K69753k6843j66956k42385j66520l3982
$$ 201338 255713 217748 309685 423769 693522 666679 499723 257338 90818 56836
10296E6836r5320J66023K41889N6071p0198J12745k2212L7632Q9703j37923o4316
$$ 56836 -38484 127539 369428 425499 355301 468046 445834 483466 573169 435246 370930
10285C70930L8978n6630n3730n6269j20105Q1070L85667J8930m47284m25265n5997
$$ 370930 409908 353278 299548 243279 123174 204244 589911 608841 161557 -263708 -319705
10274c19705J69923L73040K44606k4549l04452k06819p7607J20332J53740K8054
$$ -319705 -149782 223258 467864 443315 138863 -67956 -145563 -25231 128509 156563
10264A56563J33189J34360J12923j4947j26317n9993l16338k0427R9661J31021
$$ 156563 289752 424112 537035 522088 395771 335778 19440 -987 98674 229695
10254B29695j47044l3487J0885J27395K5349J2246M2725q8875K24686k0561l8862
$$ 229695 82651 49164 60049 187444 212793 225039 267764 178889 403575 383014 344152
10243C44152M2093M3058j49654n3774K9298K0422J00618o1301j63003l12369l04465
$$ 344152 386245 429303 279649 225875 255173 275595 376213 314912 151909 -160460 -464925
10232d64925L29511L74368J16228k2195K31407R2291j23923j32440N7583P6608
$$ -464925 -135414 238954 355182 332987 564394 656685 532762 400322 457905 534513
10222E34513j54789m01454N9638J85678J45722q7112j71837P1817J00243p8934
$$ 534513 379724 -21730 37908 223586 369308 282196 110359 182176 282419 203485
10212B03485P162j8194N2466Q9341k36554j02684L5372J55099j9502l9832P5694
$$ 203485 210647 192453 244919 334260 97706 -4978 30394 185493 165991 126159 201853
10201B01853l2890R3712O1186Q4468k3492P933r8897j2301k31371j39738k3996
$$ 201853 168963 262675 323861 408329 384837 392770 293873 281572 50201 -89537 -113533
10190a13533J16218P6435O966K27960J38566o3529J392J45006p0595n887O3503
$$ -113533 2685 79120 86086 314046 452612 389083 390475 535481 464886 458999 522502
10179E22502k9604j34852J94606R9684j8037K13759j86520J32651o8270n9969
$$ 522502 492898 358046 552652 652336 634299 848058 661538 794189 725919 665950
10169F65950K21996K21753K03174J05698j54718j48761J57806J02854k30798m0448
$$ 665950 887946 1109699 1312873 1418571 1263853 1115092 1272898 1375752 1144954 1104506
10159A104506M75655P3305J49652K0692k68590j65349J27699L2656k56473j46158
$$ 1104506 1580161 1653466 1803118 1823810 1555220 1389871 1517570 1550226 1293753 1147595
10149A147595r2965M8164J33817L0702o4436L3023j4494p1591k82612k45568j55113
$$ 1147595 1054630 1102794 1236611 1267313 1202877 1235900 1221406 1149815 867203 621635 466522
10138D66522k51909m2817K55267m7976m2005Q8053j13068J12760J91428J0436
$$ 466522 214613 171796 427063 379087 337082 425135 312067 424827 616255 626691
10128F26691K49399O2821k16518k98581j13626j68637p6890J1082l989j98770
$$ 626691 876090 938911 722393 423812 310186 141549 64659 75741 71752 -127018
10118a27018o6931r2639q2490m0648Q532M4332K77298L06507J80616N4613J10898
$$ -127018 -193949 -286588 -369078 -409726 -401194 -356862 -79564 226943 407559 462172 573070
10107E73070k63879l47468R5041j96291m2694N3953N1172m9554O5573R2010J30789
$$ 573070 309191 -38277 56764 -139527 -182221 -128268 -77096 -126650 -61077 30933 161722
10096A61722J50818J23997k18420j67896l2066J34545j86437j93053L59494R3340
$$ 161722 312540 436537 218117 50221 18155 152700 -33737 -226790 132704 226044
10086B26044j00661n9517p1813J10060J00104R0512m2545o1577k52847q8253J13140
$$ 226044 125383 65866 -5947 104113 204217 294729 252184 190607 -62240 -150493 -37353
10075c7353o9379l09168L4139L2929j98820l0532K78523P6723o9552R1595P0570
$$ -37353 -106732 -415900 -381761 -348832 -547652 -578184 -299661 -222938 -292490 -200895 -130325
10064a30325K62126q4133j29888L0732j33212j7179J01202q890j55662L3231K15201
$$ -130325 131801 47668 -82220 -51488 -184700 -201879 -100677 -109567 -265229 -231998 -16797
10053a6797K5759O043o3377k48672k14832K56064J73724k1511K0383J9938L35689
$$ -16797 8962 15005 -48372 -297044 -511876 -255812 -82088 -103599 -83216 -63278 272411
10042B72411J53031K3591l5278j51529r5240k64009k19225J19200Q7394J97901
$$ 272411 425442 449033 413755 262226 166986 -97023 -316248 -197048 -109654 88247
10032H8247K61177k44722k4430O3092j85998l1629J42459j45002j01555O5919
$$ 88247 349424 104702 80272 143364 -42634 -74263 68196 -76806 -178361 -112442
10022a12442J68822K20400R5619k24247j20734l3507J72377J39828j78646K5283
$$ -112442 56380 276780 372399 148152 27418 -6089 166288 306116 127470 152753
10012A52753j44794j63396o4184N7454j7267j33683J32122K26276Q3759j415M9040
$$ 152753 7959 -155437 -219621 -162167 -179434 -313117 -180995 45281 129040 127625 176665
10001A76665k01777j93002N9973K29273p8384j36464k59093k00796N7402L72930
$$ 176665 -25112 -218114 -158141 71132 -7252 -143716 -402809 -603605 -546203 -173273
9991a73273J85562P7432j98914l1174j48279J22579K58397q6984k41054l02600
$$ -173273 12289 89721 -109193 -140367 -288646 -166067 92330 5346 -235708 -538308
9981e38308P7932K94975J13398p9235J63075k2691Q7215j66332j41510o0596m1608
$$ -538308 -460376 -165401 -52003 -131238 31837 9146 96361 -69971 -211481 -272077 -313685
9970c13685P5148J27623J23175j27918n8039L0783j3938J41408J76102J4774M8522
$$ -313685 -238537 -110914 12261 -115657 -173696 -142913 -156851 -15443 160659 175433 223955
9959B23955J7854l21343l54181K4673M5885J3367K01197L37508l8635j74672Q713
$$ 223955 241809 -79534 -433715 -409042 -363157 -349790 -148593 188915 150280 -24392 -15679
9948a5679J01687P3328J0628j495j79111j89919n18Q0918j09077k4089L42968
$$ -15679 86008 159336 169964 168469 -10642 -200561 -201079 -120161 -229238 -253327 89641
9937H9641R6792k75322J3044Q1112K61345N7448j02930o6171k3462j56070L8229
$$ 89641 186433 -88889 -75845 5267 266612 324060 221130 154959 131497 -24573 13656
9926A3656m762J24436q0286j28279j65068J32140J12027j80347j86449J2600J54694
$$ 13656 8894 133330 53044 -75235 -240303 -108163 3864 -176483 -362932 -350332 -195638
9915a95638J58128K5589r9650j35735J43460J05132r5042Q40P0555K6585P8082
$$ -195638 -37510 -11921 -111571 -247306 -103846 1286 -93756 -92916 -22361 4224 82306
9904H2306K44465j31316J37079m2600q7327R7159Q3046k53449k33175q0045m2413
$$ 82306 326771 195455 332534 289934 202607 299766 382812 129363 -103812 -183857 -226270
9893b26270j53293K38169O9511J82529j01379p7752J44755p0483J32081k9982
$$ -226270 -379563 -141394 -71883 110646 9267 -68485 76270 5787 137868 107886
9883A07886p6768K43583L19629j058l25200k92216o7451K29342J21380N354r3193
$$ 107886 31118 274701 594330 593272 268072 -24144 -91595 137747 259127 264481 171288
9872A71288j13228k28647K4212K48803J44111J11362j61767n0080N060k1045m9817
$$ 171288 58060 -170587 -146375 102428 246539 357901 196134 146054 151114 130069 80252
9861H0252r8627j2473J39821J08817j18340k14824j18284K3549J65050J32216
$$ 80252 -18375 -30848 108973 217790 99450 -115374 -233658 -210109 -45059 87157
9851H7157N7781p9961p0259k3595k14420j61434m8493j4015L08976P6581l4361
$$ 87157 144938 64977 -5282 -28877 -243297 -404731 -453224 -467239 -158263 -81682 -116043
9840a16043J43397L42663o0143k82936j95011p7330r9045l6973J90000K12409
$$ -116043 27354 370017 309874 26938 -168073 -245403 -344448 -381421 -191421 20988
9830B0988Q7306j02497m5104j53410J02238m5439k5327J41430j61441j45305r2989
$$ 20988 108294 5797 -39307 -192717 -90479 -135918 -161245 -19815 -181256 -326561 -419550
9819d19550P0138J11217Q6809m4183k57008m9386J16847J75054J19208j12530
$$ -419550 -349412 -238195 -151386 -195569 -452577 -501963 -385116 -210062 -90854 -203384
9809b03384Q5535j08805N8693j09319P2851M54m1129j05979J90986K63497J48742
$$ -203384 -117849 -226654 -167961 -277280 -204429 -203975 -245104 -351083 -160097 103400 252142
9798B52142p8663N1687O3108L4211j33587k09727j60571j35307J71259J91070
$$ 252142 173479 225166 288274 322485 188898 -20829 -181400 -316707 -145448 45622
9788D5622N3756Q0282K60591j03314m49771l05335J18655K87011K39841r5218
$$ 45622 99378 179660 440251 336937 -112834 -418169 -299514 -12503 227338 132120
9778A32120j32227J9146J74549j38638N5936j03422j42879O3004P8254K3408J0640
$$ 132120 -107 19039 193588 54950 110886 7464 -135415 -72411 5843 29251 39891
9767C9891k17187k94240J64988K91362l6776m960M3351l391j75272j16399K76677
$$ 39891 -177296 -471536 -306548 -15186 -51962 -56922 -13571 -16962 -192234 -308633 -31956
9756c1956J47031J44779J87488r7260n3643J1710j01988n2672O9833j6809m3937
$$ -31956 115075 259854 447342 350082 296439 308149 206161 153489 223322 206513 162576
9745A62576j7302q452O9432j77849r7162r1219K9030L57220P2063j19280j36100
$$ 162576 145274 136822 206254 28405 -68757 -159976 -130946 226274 298337 179057 42957
9734D2957k36239j03093j20811p7715L30482M5210L2698n1536R7689J91319K28176
$$ 42957 -193282 -296375 -417186 -494901 -164419 -119209 -86511 -138047 -40358 150961 379137
9723C79137L2367l72195k89132P0479J99389J05890j54005k4533M4657r2484O4947
$$ 379137 411504 39309 -249823 -179344 20045 125935 -28070 -52603 -7946 -100430 -35483
9712c5483j16542k9491O8101J50225O1462O8031n6129J4626j28687j51168O2768
$$ -35483 -152025 -181516 -113415 36810 98272 166303 110174 124800 -3887 -155055 -92287
9701i2287K28869r1335k69316N394J54584L93098n1923j70935J68484J86073j26731
$$ -92287 136582 45247 -224069 -218675 -64091 329007 277084 106149 274633 460706 333975
9690C33975m15282j06071J18083m256L18829J7527J96993j85227j01442k41032
$$ 333975 -81307 -187378 -69295 -73551 245278 262805 459798 274571 173129 -67903
9680f7903j47104J30309J68643J10537j23891K6828J3068k19772J8237J95637
$$ -67903 -215007 -84698 83945 194482 70591 97419 110487 -109285 -91048 104589
9670A04589j15219j76320l6438L19305O5670j35743K73656j04170n0149L6013
$$ 104589 -10630 -186950 -223388 95917 161587 25844 299500 195330 145181 181194
9660A81194j38j45365R1737J4992O1624L31341K35648N6805j06792O2450K22091
$$ 181194 181056 35691 127428 142420 204044 535385 771033 827838 721046 783496 1005587
9649A005587q7297k07833k66414N7942n7096k05611k27024N384P6563j27809j35184
$$ 1005587 918290 710457 444043 501985 444889 239278 12254 17638 94201 -33608 -168792
9638a68792O9609L7046q9268L5015M38484J24260q7263k09955k62487J9039J94244
$$ -168792 -99183 -62137 -151405 -116390 322094 446354 359091 149136 -113351 -94312 99932
9627I9932J83816k07667j09002n784n9441r2275n1347J73255J05619j34688o4815
$$ 99932 283748 76081 -32921 -38705 -98146 -190421 -241768 -68513 37106 -97582 -162397
9616a62397J32039r5392K9531K64701J23127j46408k54307K3126q835L1891k47049
$$ -162397 -30358 -125750 -96219 168482 291609 145201 -109106 -85980 -94815 -62924 -309973
9605c09973n0265M28921o9612O30K63202j85315l80625O316J77143J50131K13000
$$ -309973 -360238 68683 -929 -299 262903 77588 -303037 -296721 -119578 30553 243553
9594B43553K69901J40145k55721k39398q8496r3734j04389j716j49466M7799o776
$$ 243553 513454 653599 397878 158480 69984 -23750 -128139 -129855 -279321 -231522 -238298
9583b38298N0220j02021P6433J5455j44739j4902K3717J38201Q2440N2356o6102
$$ -238298 -188078 -290099 -213666 -198211 -342950 -357852 -334135 -195934 -113494 -61138 -127240
9572a27240j45008K6913m4547Q2011k1540J4629J90555l0483N607m4028j7040
$$ -127240 -272248 -245335 -289882 -207871 -229411 -214782 -24227 -54710 -49103 -93131 -110171
9561a10171j6124p9256O030P2193j29830r8257N2553M7501j1791L65543L11085
$$ -110171 -126295 -205551 -199521 -127328 -257158 -355415 -302862 -255361 -267152 98391 409476
9550D09476j60428p6242K0772j28808J92883J55699j34858k89495k88731Q2829
$$ 409476 249048 172806 193578 64770 257653 413352 278494 -11001 -299732 -216903
9540b16903M9513k0663K11750L4246j6477q7957O0786l7838j93906k33037R9084
$$ -216903 -167390 -188053 23697 57943 41466 -46491 14295 -23543 -217449 -450486 -351402
9529c51402J64253J80347K13007L29j14618o6051j00848J72591o4335n7032N0138
$$ -351402 -187149 -6802 206205 206534 91916 25865 -74983 97608 33273 -23759 26379
9518B6379O6660k50080M0650Q9147k8374l54158J31972K33873R8203J34853P1775
$$ 26379 93039 -157041 -116391 -27244 -55618 -409776 -277804 -43931 54272 189125 260900
9507B60900k51002k17354L5937N5502j38643q3521l3101K1456j2089L37383K23067
$$ 260900 9898 -207456 -171519 -116017 -254660 -338181 -371282 -349826 -361915 -24532 198535
9496A98535J8492n0945j00734q2320q091q878k75555j6101K06771p330l29042
$$ 198535 217027 166082 65348 -16972 -25063 -33941 -309496 -325597 -118826 -126156 -455198
9485d55198L9438O417K58821J19482k85309k32557J10904J44397L6649l5095J65660
$$ -455198 -415760 -409343 -150522 -31040 -316349 -548906 -438002 -293605 -256956 -292051 -126391
9474a26391K31210J7544p9138J12899J2475J55124r1493k36988l00380J28087
$$ -126391 104819 122363 43225 156124 168599 323723 232230 -4758 -305138 -177051
9464a77051K12437l7889O2450N5612m6148r6683k9923n1K4162L060q7848O6849
$$ -177051 35386 -2503 59947 115559 69411 -27272 -57195 -57246 -33084 -30024 -117872 -51023
9452e1023K25168j02660O5152k01761j54285Q2567k9221k8351J82601j2023J25678
$$ -51023 174145 71485 136637 -65124 -219409 -136842 -166063 -194414 -11813 -23836 101842
9441A01842r9598l3022Q8427j53165k9096k27805k28982J63489K22109J38163
$$ 101842 2244 -30778 57649 -95516 -124612 -352417 -581399 -417910 -195801 -57638
9431e7638k642J13180n2716J76916n3005r7943L8344l5718J57073j67775J00171
$$ -57638 -60280 52900 184 177100 124095 26152 64496 28778 185851 18076 118247
9420A18247J59851N3632j45768k8470J909l8625L5150r102m5961J52008k5018
$$ 118247 278098 331730 185962 157492 159401 120776 155926 146824 100863 252871 227853
9409B27853k01901r7780o4565M0685m2687J8495o6354J17911Q7243p1561K7875
$$ 227853 25952 -71828 -136393 -95708 -138395 -119900 -186254 -68343 18900 -52661 -24786
9398b4786J75372j38874k50486J06966J01154q863K27012K7169k73484k24851
$$ -24786 150586 11712 -238774 -131808 -30654 -39517 187495 214664 -58820 -283671
9388b83671M9795n0924j35995j3672K20927J3733K00047J81168j08160j18868
$$ -283671 -233876 -284800 -420795 -434467 -213540 -199807 240 181408 73248 -45620
9378d5620l29874k00812O6370K30458K61889J51714k41079O0181J12982P9442
$$ -45620 -375494 -576306 -509936 -279478 -17589 134125 -106954 -46773 66209 145651
9368A45651j2635j13423O2912Q0649l3402q6215L9516J44478J416j46216k21069
$$ 145651 133016 19593 82505 163154 129752 43537 83053 227531 228947 82731 -138338
9357a38338p3783r6425p2455r8792R3956p5088J46390J02989J91409J76620o6484
$$ -138338 -212121 -308546 -381001 -479793 -385837 -460925 -314535 -211546 -20137 156483 89999
9346H9999j38440p8767l5142j09273j25617j03633K71023J92398j08172j37892
$$ 89999 -48441 -127208 -162350 -271623 -397240 -500873 -229850 -37452 -145624 -283516
9336b83516r741R501J69420K11851J87942J15220J6980k8443j6103k62063P8261
$$ -283516 -293257 -283756 -114336 97515 285457 400677 417657 389214 373111 111048 189309
9325A89309O8800j3980j68408j32546m4915n0592k7819K40449k47014k2488l2918
$$ 189309 258109 244129 75721 -56825 -101740 -152332 -180151 60298 -186716 -209204 -242122
9314b42122o6388R0717J3262L3404j28930k47194P3823K32403L58201k3937q2528
$$ -242122 -308510 -217793 -204531 -171127 -300057 -547251 -473428 -241025 117176 93239 10711
9303A0711j52435j40408j38915O1260J49905J37089p5402k6560Q401k21662N6745
$$ 10711 -141724 -282132 -421047 -359787 -209882 -72793 -148195 -174755 -166354 -388016 -331271
9292c31271J32886J64911o1309k18244J5511p308Q1090J60897N3694M807L9301
$$ -331271 -198385 -33474 -94783 -313027 -297516 -304824 -223734 -62837 -9143 -4336 34965
9281C4965O5627J97874l6526j74401j39780j9117P5046P2161r4773k12806k01484
$$ 34965 100592 298466 261940 87539 -52241 -71358 3688 75849 -18924 -231730 -433214
9270d33214J62430M95548j90759k35607M3512l07175J4049J99259j35939N7223
$$ -433214 -270784 224764 34005 -201602 -158090 -465265 -451216 -251957 -387896 -330673
9260c30673n6841J55094n7577j6051k651q0289j21588J54288K23841K33663r6806
$$ -330673 -387514 -232420 -289997 -306048 -308699 -388988 -510576 -356288 -132447 101216 4410
9249D410j40301J2254J11072o3898R7329K21702j07084k70886j95560K68509O5095
$$ 4410 -135891 -123637 -12565 -76463 20866 242568 135484 -135402 -330962 -62453 2642
9238B642J41677j02336j17628m1556n704j16526J88021K68461k06326k40069k61906
$$ 2642 144319 41983 -75645 -117201 -122905 -239431 -51410 217051 10725 -229344 -491250
9227d91250K1483J20951j00153N9228J64705O7533j25809o6684J2510L7039J34296
$$ -491250 -469767 -348816 -448969 -389741 -225036 -157503 -283312 -349996 -337486 -300447 -166151
9216a66151Q5175j97285j6693O7399J48315L1076k48553j03874L5920j9792j00621
$$ -166151 -80976 -278261 -294954 -227555 -79240 -48164 -296717 -400591 -364671 -384463 -485084
9205d85084J08333k15880M7279K55125L04824L8234j60402N5248N2099J35234
$$ -485084 -376751 -592631 -545352 -290227 14597 52831 -107571 -52323 -224 135010
9195A35010j51334k22205J10657j65316j54184k55897K43315L39816N9750j40672
$$ 135010 -16324 -238529 -127872 -293188 -447372 -703269 -459954 -120138 -60388 -201060
9185b01060l68271J38884J14008K422N9952Q9536J47742R1112l52985K058L2894
$$ -201060 -569331 -430447 -316439 -314017 -254065 -164529 -16787 74325 -278660 -276602 -243708
9174b43708L04446L20895O1500l04719j38411r0925M265N6338P563m7734O9631
$$ -243708 60738 381633 443133 138414 3 -90922 -86657 -30319 -22756 -70490 -859
9163h59M2904j47079n0300q3217N2656K84646J72033n1769k82597R2806R8122
$$ -859 42045 -105034 -155334 -238551 -185895 98751 270784 219015 -63582 29224 127346
9152A27346j0576j16697l7549k59705J54897J32001j8206P6843j30332j45525
$$ 127346 116770 73 -37476 -297181 -142284 -10283 -28489 48354 -81978 -227503
9142b27503m6109j45939J97180K62072j22189J67283J90479k91484j88954K37139
$$ -227503 -273612 -419551 -222371 39701 -82488 84795 275274 -16210 -205164 31975
9132C1975L2282j12418n7954k50312k3548L42610P5241k41870p8483M9995J10987
$$ 31975 64257 -48161 -106115 -356427 -379975 -37365 37876 -203994 -282477 -232482 -121495
9121a21495J34918J9166j5530J26732J2769j12877l1912L02480j28786l51018
$$ -121495 13423 32589 17059 143791 156560 43683 11771 314251 185465 -165553
9111a65553k49277n9625K20858J93372P86l3208n3048J52221N6592j16816l46239
$$ -165553 -414830 -474455 -253597 -60225 -59439 -92647 -145695 6526 63118 -53698 -399937
9100c99937r047J55538p8812K1659o981o8358J09484J91258J16120K7813L6013
$$ -399937 -408984 -253446 -332258 -310599 -317580 -385938 -276454 -85196 30924 58737 94750
9089I4750L210J47142k8765l30277O634J49335K1455l3634j84387J4718J19639
$$ 94750 97960 245102 216337 -113940 -107306 42029 63484 29850 -154537 -139819 -20180
9078b0180j19356j99057o0214J06643K22439q5989K8419J98907M42304J70499
$$ -20180 -139536 -338593 -398807 -292164 -69725 -155714 -127295 71612 513916 684415
9068F84415q9507L0221q882k7371J3295l91257k43866q958L134j54636J64959
$$ 684415 594908 625129 616247 588876 602171 210914 -32952 -41910 -38776 -193412 -28453
9057b8453J34100J07386j12270J0133K60267L0778J49764k7368J62169j07948
$$ -28453 105647 213033 100763 110896 371163 401941 551705 524337 686506 578558
9047E78558k08235p7006p1256o4532j11009P5910P1758O8034K93511p1339q003
$$ 578558 370323 293317 222061 157529 46520 122430 194188 262222 555733 484394 476391
9036D76391j2033R8225l990k49963n9666K15032K44778m4672J64867K89171J44150
$$ 476391 464358 562583 558593 308630 248964 463996 708774 664102 828969 1118140 1262290
9025A262290K02776J57603K01455q9322j20545q7788m46800m40030j11372q7591
$$ 1262290 1465066 1622669 1824124 1734802 1614257 1526469 1079669 639639 528267 440676
9015D40676q5551O7060N132j10744o4341J28071P3953j03387j18443J43317K01699
$$ 440676 355125 422185 427317 316573 252232 380303 454256 350869 232426 375743 577442
9004E77442j86865j13915p1987N3519p195j29220p7972l396k69531q4667N8562
$$ 577442 390577 276662 204675 258194 250999 121779 43807 40411 -229120 -313787 -255225
8993b55225N1887J26811O3923q3847K28185J72684j80315k70613q286K50332L13314
$$ -255225 -203338 -76527 -12604 -96451 131734 304418 124103 -146510 -154796 95536 408850
8982D08850j07512K2112N2239J9792j40726K44308J53904O5983j98633j09482
$$ 408850 301338 323450 375689 395481 254755 499063 652967 718950 520317 410835
8972D10835m0496l16135l75134k40691K11220K23386R6286J38748P9112j46809
$$ 410835 370339 54204 -320930 -561621 -350401 -127015 -30729 108019 187131 40322
8962D0322j36070j23451j20354J95146L06797j33330j41440n8265j73109J8727
$$ 40322 -95748 -219199 -339553 -144407 162390 29060 -112380 -170645 -343754 -325027
8952c25027R9890p1599P5761Q5323m4577R8942j11720J96810M8337j2005R3957
$$ -325027 -225137 -296736 -220975 -135652 -180229 -81287 -193007 3803 52140 40135 134092
8941A34092n5804j25491p0709j2791K06558l7221r7111p6022j01931r1916n3417
$$ 134092 78288 -47203 -117912 -130703 75855 38634 -58477 -134499 -236430 -328346 -381763
8930c81763J73182k33879j03422J01174K3556L47161L2187o3666j4376r4827j38935
$$ -381763 -208581 -442460 -545882 -444708 -421152 -73991 -41804 -105470 -119846 -214673 -353608
8919c53608K02402K56158R9964k50151M3260k7754k97728M6650R3041j4611P2319
$$ -353608 -151206 104952 204916 -45235 -1975 -29729 -327457 -280807 -187766 -202377 -130058
8908a30058J37612J68952R7334J35843r0645p3905J9089Q4404q2073k64204j54003
$$ -130058 7554 176506 273840 409683 319038 245133 264222 348626 266553 2349 -151654
8897a51654j81767j10606N398Q4510K01891p3831k44840J4220K19998K80363J23399
$$ -151654 -333421 -444027 -438629 -354119 -152228 -226059 -470899 -456679 -236681 43682 167081
8886A67081j46082L33699j1358m77820l30517j08314K31570L12048j21648p9929
$$ 167081 20999 354698 343340 -134480 -464997 -573311 -341741 -29693 -151341 -231270
8876b31270j16965j13045K48850J81731j10970L0639J39520k1244q2468o8261
$$ -231270 -348235 -461280 -212430 -30699 -141669 -111030 28490 7246 -75222 -143483
8866a43483k921L7682k04404j46627J29203J87888L5501K3121K20427k7263r9902
$$ -143483 -146404 -108722 -313126 -459753 -330550 -142662 -107161 -84040 136387 109124 9222
8855I222j29138J47948j12720j14070K5908O3634L9273j06908J30221J30842o9162
$$ 9222 -119916 28032 -84688 -198758 -172850 -109216 -69943 -176851 -46630 84212 15050
8844A5050j43849j36545J22111o0312N5027L7247r8367J6024J60200K53750J46643
$$ 15050 -128799 -265344 -143233 -203545 -148518 -111271 -209638 -193614 -33414 220336 366979
8833C66979l0182J47208m0744m50572n61328Q225M5254K52219K18205K43745j49129
$$ 366979 336797 484005 443261 -7311 -568639 -560414 -515160 -262941 -44736 199009 49880
8822D9880k18451r6958k21936J96946J72669j35037k3579K0903J3511P6992J08085
$$ 49880 -168571 -265529 -487465 -290519 -117850 -252887 -276466 -255563 -242052 -165060 -56975
8811e6975J72217l3049j11294p8572j10740L785R3734J85350k7477m0104J36233
$$ -56975 115242 82193 -29101 -107673 -218413 -214628 -120894 64456 36979 -3125 133108
8800A33108o902K13759p8769j1300L23503K52705M3126Q090j03346p0195j20130
$$ 133108 126206 339965 261196 249896 573399 826104 869230 877320 773974 703779 583649
8789E83649j02550j02674K2168J2622K11288R6747O1260M1484J08047q8702k399
$$ 583649 481099 378425 400593 413215 624503 721250 782510 823994 932041 843339 840940
8778H40940j94710k48552O3974k837J6607M6746n2069R8535j10979p6093r1742
$$ 840940 646230 397678 461652 458815 475422 522168 470099 568634 457655 381562 289820
8767B89820P673k05040K09666J49782J23820J00342j95829l8789J583j22019R5945
$$ 289820 297493 92453 302119 451901 575721 676063 480234 441445 443028 321009 416954
8756D16954M22369K04236R574j07470K47852M6783k45591k10642N5601j20123
$$ 416954 839323 1043559 1053133 945663 1193515 1240298 994707 784065 839666 719543
8746G19543j2821K72156N395r2166J72076L87391K20943q0330o8941M1384K5353
$$ 719543 706722 978878 984273 892107 1064183 1451574 1672517 1592187 1523246 1564630 1589983
8735A589983J15889K45690k07530l49966o7453l4617P5698J2885k15191l00644
$$ 1589983 1705872 1951562 1744032 1394066 1326613 1291996 1367694 1380579 1165388 864744
8725H64744k43554k89176K85024n806J41827J75826m5280j89626J12825K39944
$$ 864744 621190 332014 617038 611232 753059 928885 883605 693979 806804 1046748
8715A046748J70720J62444L30774K26568j4042j13692J1774J92894N7468J49024
$$ 1046748 1217468 1379912 1710686 1937254 1923212 1809520 1821294 2014188 2071656 2220680
8705B220680J80113J71309L23883J90503j47974j71905J18809L21661L37377L80526
$$ 2220680 2400793 2572102 2895985 3086488 2938514 2766609 2885418 3207079 3544456 3924982
8695C924982M99420K91097M00077L04855O02985P68509R32255N67560O31175J003317
$$ 3924982 4424402 4715499 5115576 5420431 6023416 6791925 7724180 8291740 8922915 9926232
8685I926232J295435J191320J397970J700850K349911K987885M294347N876528
$$ 9926232 11221667 12412987 13810957 15511807 17861718 20849603 25143950 31020478
8677C1020478Q377404J1996183J6413937J9840827J9746289J5494218J0456268
$$ 31020478 39397882 51394065 67808002 87648829 107395118 122889336 133345604
8670A33345604Q106644N617244j417158j3305371k2198093k2222533j7282246
$$ 133345604 141452248 147069492 145652334 132346963 110148870 87926337 70644091
8663G0644091j2332058q585520o051798m817028l621212k912893k107089j772412
$$ 70644091 58312033 49726513 43674715 38857687 35236475 32323582 30216493 28444081
8655B8444081j629127j556602j132429q91968n32673n13972j74008J97085O1728
$$ 28444081 26814954 25258352 24125923 23233955 22701282 22187310 22013302 22210387 22272115
8646B2272115M59821O38459P34480P81377J240139J312491J187465J796564K615582
$$ 22272115 22731936 23370395 24104875 24886252 26126391 27438882 28626347 30422911 33038493
8637C3038493L365800M180443N110703P323402J0522022J5749913K4043148L5636694
$$ 33038493 36404293 40584736 45695439 53018841 63540863 79290776 103333924 138970618
8629A38970618M6436150M5777382L0127917J8084857J7743119J6087844j479655
$$ 138970618 185406768 231184150 261312067 279396924 297140043 313227887 311748232
8622C11748232l6562481n8181950n0685204l5504480k3978254j6773620j1930083
$$ 311748232 275185751 217003801 166318597 130814117 106835863 90062243 78132160
8615G8132160r091761o902685n344475m356405l714024l343864k896277k602341
$$ 78132160 69040399 62137714 56793239 52436834 48722810 45378946 42482669 39880328
8607C9880328k508610k006077j689459j632795j151143p66467m68253k59952m70431
$$ 39880328 37371718 35365641 33676182 32043387 30892244 30125777 29657524 29397572 28927141
8598B8927141N3969K38466P1786J73497N92963R45301J140976K099007K957657
$$ 28927141 28981110 29219576 29291362 29464859 30057822 31003123 32144099 34243106 37200763
8589C7200763M263130N480227P670879J1240850J5618789J8631880J7877707J2910010
$$ 37200763 41463893 46944120 54614999 65855849 81474638 100106518 117984225 130894235
8581A30894235Q588488O584577L495012m390222j5491493k2823482k1449014j6190142
$$ 130894235 139482723 146067300 149562312 145172090 129680597 106857115 85408101 69217959
8573F9217959j1671871q404532o019213m759717l665696k752443k428543k223756
$$ 69217959 57546088 49141556 43122343 38362626 34696930 31944487 29515944 27292188
8565B7292188j661374j756317j721349j482136j156886j270362j132312r42209
$$ 27292188 25630814 23874497 22153148 20671012 19514126 18243764 17111452 16169243
8557A6169243p59823o03191n83242o75293o87120m66346n94475n61459j37584
$$ 16169243 15409420 14806229 14222987 13547694 12860574 12394228 11799753 11238294 11100710
8548A1100710j84867o85443m47723k27151j91605l32236k47805k43464j22189
$$ 11100710 10915843 10230400 9782677 9555526 9363921 9031685 8783880 8540416 8418227
8539H418227Q0875m0451j90723n35445m85996k81970k2454l01222l98140k54115
$$ 8418227 8499102 8458651 8267928 7732483 7246487 6964517 6942063 6640841 6242701 5988586
8529E988586k50041q110k39412O3538j57673l72831k36102K1558Q1760l29229
$$ 5988586 5738545 5730435 5491023 5554561 5396888 5024057 4787955 4809513 4891273 4562044
8519D562044k66018j01632p5298j10439j81937J46073Q5311l08628l55050n7176
$$ 4562044 4296026 4194394 4119096 4008657 3826720 3972793 4058104 3749476 3394426 3337250
8509C337250J62671K1694k75814k27854J42714P4610R743p6809m02799l66325
$$ 3337250 3499921 3521615 3245801 3017947 3160661 3235271 3245014 3168205 2765406 2399081
8499B399081p3824J00258J77741p2910k81892P9179j69954j97202K42934Q4290
$$ 2399081 2325257 2425515 2603256 2530346 2248454 2327633 2157679 1960477 2203411 2287701
8489B287701m5871q0646J87369p8610l21329n5527k05933J11581K13817j7283
$$ 2287701 2241830 2161184 2348553 2269943 1948614 1893087 1687154 1798735 2012552 1995269
8479A995269n0862o325q408N3698j14490j68837L2705M8794o8960J03383k18762
$$ 1995269 1944407 1938082 1929674 1983372 1868882 1700045 1732750 1781544 1712584 1815967 1597205
8468A597205K1303N3383J9380J86674k52515k85180j13954J69668K47785m7936
$$ 1597205 1618508 1671891 1691271 1877945 1625430 1340250 1226296 1395964 1643749 1595813
8458A595813k09406J05859J9819K744j64368k41246j53462m3543P9010o6022K380
$$ 1595813 1386407 1492266 1512085 1514829 1350461 1109215 955753 912210 991220 925198 927578
8447I27578m2541L19947p9018j4231k2591N4918K13085j4669j23293Q8865m0597
$$ 927578 885037 1204984 1125966 1111735 1089144 1144062 1357147 1342478 1219185 1308050 1267453
8436A267453l54705p4409J2573j13282K26573j9388q8649o0020r7772j22956O6554
$$ 1267453 912748 838339 850912 737630 964203 944815 856166 796146 698374 575418 641972
8425F41972L8593L9185K30323L35440k3565J3525j60454j20828k40878p1897K27509
$$ 641972 680565 719750 950073 1285513 1261948 1275473 1115019 994191 753313 681416 908925
8414I08925j06019j57284p6064K17189r7905k75409J04928J578N7673P1005j49873
$$ 908925 802906 645622 569558 786747 688842 413433 518361 519939 577612 648617 498744
8403D98744Q8439L2340J47300L04959j22298J752K15789k89850l49762l1709K24004
$$ 498744 587183 619523 766823 1071782 949484 951236 1167025 877175 527413 495704 719708
8392G19708p306q3297R0122j0055m7088M052k12234j4993K2989n1514R144j43631
$$ 719708 712402 629105 719227 709172 662084 666136 453902 438909 461898 410384 419528 275897
8380B75897k2770L26962K04191J70778N3518k91817k55413O8202K66602p7119
$$ 275897 253127 580089 784280 955058 1008576 716759 461346 529548 796150 719031
8370G19031p3384k9808j57389q2954J52031K65874J74603L9247k07307k16222
$$ 719031 645647 615839 458450 375496 527527 793401 968004 1007251 799944 583722
8360E83722K66110N4963k20603k15070p7914J21513l7169R2901o9726P536K26369
$$ 583722 849832 904795 684192 469122 391208 512721 475552 568453 498727 506263 732632
8349G32632j17652k6673J05911j6068m7271M73078M56949N34967L59779L33991
$$ 732632 614980 588307 694218 678150 630879 1103957 1560906 2095873 2455652 2789643
8339B789643J11121N9151k07738n80608o66715k52263J13221R6530k24661k87354
$$ 2789643 2900764 2959915 2752177 2171569 1504854 1252591 1365812 1462342 1237681 950327
8329I50327k79303N3576L5568n5866K8135p1848R8380K04973O404j65823k60419
$$ 950327 671024 724600 760168 704302 732437 660589 758969 963942 970346 804523 544104
8318E44104J01946K53529j41099k8227R245k18453j824K63723O2247M7060L8041
$$ 544104 646050 899579 758480 730253 739498 521045 519221 782944 845191 892251 930292
8307I30292o3818J28213K5615j28550p89L24538N14502R33269J022478R47236
$$ 930292 866474 994687 1020302 891752 890963 1215501 1730003 2663272 3685750 4632986
8297D632986L16145p9379M97129L38602k82213j118120j171412r47403o71339
$$ 4632986 4949131 4869752 5366881 5705483 5423270 4305150 3133738 2186335 1514996
8288A514996n06245o2714p6119J9963K49268j27133l28753m9680K61267J34420
$$ 1514996 1008751 946037 869918 889881 1139149 1012016 683263 633583 894850 1029270
8278A029270m7817j76494N861j7997k68716j02154J82734J41766j13663j0305
$$ 1029270 981453 804959 810820 792823 524107 421953 604687 746453 632790 622485
8268F22485L86725L80047j19851N1666K72352n2342k79309j86991k2643J11333
$$ 622485 1009210 1389257 1269406 1321072 1593424 1541082 1261773 1074782 1052139 1163472
8258A163472k1987k2369L62891M00415N14998M33740Q9088P7806k48707j62167
$$ 1163472 1141485 1119116 1482007 1882422 2397420 2831160 2920248 2998054 2749347 2587180
8248B587180n11931n92607m56084j49280P7886O1634J70218j068l13268J19901
$$ 2587180 2075249 1482642 1026558 877278 955164 1016798 1187016 1185948 872680 992581
8238I92581J22706k61992k13198J07620j11823j56543K04033K17253O2246J0293
$$ 992581 1115287 853295 640097 747717 635894 479351 683384 900637 962883 973176
8228I73176m3509K36976L61450P2038J5443o9098L53982L54571l4756j25935k48668
$$ 973176 929667 1166643 1528093 1600131 1615574 1546476 1900458 2255029 2220273 2094338 1845670
8217A845670m88679j07855l59467l55701j30557R7106L06558O4218j60042o4911
$$ 1845670 1356991 1249136 889669 533968 403411 500517 807075 871293 711251 646340
8207F46340N7724J09489j99060j08809O809k6688J18007J08437l05519q4348o3855
$$ 646340 704064 813553 614493 505684 512493 485805 603812 712249 406730 322382 258527
8196B58527J30073P0357J1649l930j80031j01414N1815J60696Q7188j14618j14816
$$ 258527 388600 458957 470606 466676 286645 185231 237046 397742 484930 370312 255496
8185B55496O8006j33931J14708J48193L08047J88360k37481p6289K1484J85893
$$ 255496 323502 189571 304279 452472 760519 948879 711398 635109 656593 842486
8175H42486N0056j03053q5930K9233R1878K9185J05537R000j94193r4022r9026
$$ 842486 892542 789489 703559 732792 824670 853855 959392 968392 774199 680177 581151
8164E81151l24894n0405R3481J33658J59514j4151j19533j78717j11861J36641
$$ 581151 256257 205852 299333 432991 592505 578354 458821 280104 168243 304884
8154C04884j32046M9155N3540n4797o0531m6044r9888m6336k6310K9407N2295
$$ 304884 172838 221993 275533 220736 160205 114161 14273 -32063 -58373 -28966 23329
8143B3329O7094J26472L3650k6798j35286L0979P9499Q380l29382K35269L61554
$$ 23329 90423 216895 250545 223747 88461 119440 198939 207319 -122063 113206 474760
8132D74760N9762m19442l61587L9207k2693o1422N9692K35356K7129K3115J16100
$$ 474760 534522 115080 -246507 -207300 -229993 -291415 -231723 3633 30762 53877 169977
8121A69977K38170L9407j22244j95439q1540K05369L12008m3211o5711J0858p9331
$$ 169977 408147 447554 325310 129871 48331 253700 565708 522497 456786 467644 388313
8110C88313j97078n6445K9987l6822j57346j76751Q4307n7350l5495L18667K3342
$$ 388313 191235 134790 164777 127955 -29391 -206142 -121835 -179185 -214680 103987 127329
8099A27329J13378k59243k41228j04088k7724J72347L30788N290j25872J15519
$$ 127329 240707 -18536 -259764 -363852 -391576 -219229 111559 116849 -9023 106496
8089A06496J83160r5335l23694L9656K62183J68610k57663l1342j35153k1848
$$ 106496 289656 194321 -129373 -89717 172466 341076 83413 52071 -83082 -104930
8079a04930J65311j7433J2454q8510J090o906K8862l5178p9022k12386J26383
$$ -104930 60381 42948 55402 -33108 -32018 -38924 -10062 -45240 -124262 -336648 -210265
8068b10265k896K20135J15570N4768N9364K19837R0865k03643j86181N8732p3276
$$ -210265 -213161 6974 122544 177312 236676 456513 547378 343735 157554 216286 143010
8057A43010Q6755K34469o4047r4254j63624l45850o2108Q3318J37575J28876J91371
$$ 143010 229765 464234 400187 305933 142309 -203541 -265649 -182331 -44756 84120 275491
8046B75491J05434k74408k37488q9485j39208j21714k1759L7542K03290J86414
$$ 275491 380925 106517 -130971 -220456 -359664 -481378 -503137 -465595 -262305 -75891
8036g5891o0112Q3916K8553K14597O7106j93417J55236K02059L6593Q7321K58510
$$ -75891 -136003 -52087 -23534 191063 258169 64752 219988 422047 458640 545961 804471
8025H04471j01999k10707k63375l08458R0996n6234q7930K63140M4704l04096
$$ 804471 702472 491765 228390 -80068 10928 -45306 -133236 129904 174608 -129488
8015a29488Q0373L81282J41475r0901j06517j96490J55748J68678K16075j14002
$$ -129488 -49115 332167 473642 382741 276224 79734 235482 404160 620235 506233
8005E06233l35303j04037k6326l27814j45756K08625J16609m0837o251L1798j7150
$$ 506233 170930 66893 40567 -287247 -433003 -224378 -107769 -148606 -154857 -123059 -140209
7994a40209m784j45496J28909Q1582J43850J80039K25140N3264K4543m2219j89122
$$ -140209 -144993 -290489 -161580 -79998 63852 243891 469031 522295 546838 504619 315497
7983C15497m9588M3878j30723k76393J18172K5261r0801j37619J55372K81627
$$ 315497 265909 309787 179064 -97329 20843 46104 -44697 -182316 -26944 254683
7973B54683q8142k13676j84889O7805J17113O136J3344M5960r3891r0141J15726
$$ 254683 166541 -47135 -232024 -164219 -47106 -40970 -27626 18334 -75557 -165698 -49972
7962d9972P525J77415j09156l7795J60245r7502p1543j53506J16743q4703j28384
$$ -49972 -42447 134968 25812 -11983 148262 50760 -20783 -174289 -57546 -142249 -270633
7951b70633J60903K76153q8707o206j19989k36009K10094K05375R7959n9982j90017
$$ -270633 -109730 166423 77716 71510 -48479 -284488 -74394 130981 228940 168958 -21059
7940b1059M991j90930j90613J98266J31201L8226j9113J04153o6910p3580k6166
$$ -21059 -16068 -206998 -397611 -199345 -68144 -29918 -49031 55122 -11788 -85368 -111534
7929a11534P6500O9049P1226k32824j49211o688j39914L93R8388m1546j90924
$$ -111534 -35034 34015 105241 -127583 -276794 -283482 -423396 -423003 -324615 -366161 -557085
7918e57085K7306J72995K87833J41153j28148j94821J8331J93451m1320O3850
$$ -557085 -529779 -356784 -68951 72202 -55946 -250767 -232436 -38985 -80305 -16455
7908a6455j2095j35064K7348j51591N5146J63093n033n3779J1740P7028M038R5778
$$ -16455 -28550 -163614 -136266 -287857 -232711 -69618 -74651 -128430 -116690 -39662 -35624 60154
7896F0154k04895j19688K15733R9375n7657n0905L7800J45620q4699k29843j7781
$$ 60154 -144741 -264429 -48696 50679 -6978 -57883 -20083 125537 40838 -189005 -206786
7885b06786N8857L5413j21626q0928M2643N3327k0320j07809O7597L30298j64619
$$ -206786 -147929 -112516 -234142 -315070 -272427 -219100 -239420 -347229 -279632 50666 -113953
7874a13953l0173J2321k74110N5845J91955o2654K01331J59855P7600j22318l7634
$$ -113953 -144126 -131805 -405915 -350070 -158115 -220769 -19438 140417 218017 95699 58065
7863E8065R2244j48318j83464O0489Q8384J8350K0495j80023q0609k19426J92415
$$ 58065 150309 1991 -181473 -120984 -32600 -14250 6245 -173778 -254387 -473813 -281398
7852b81398R3793K7961K3366O5033L5343N6624J5228j6235j55475Q3707P8383
$$ -281398 -187605 -159644 -136278 -71245 -35902 20722 35950 19715 -135760 -52053 26330
7841B6330J2129j35151l3314L23280K83480k73951o0247r7143N5766j72319J10906
$$ 26330 38459 -96692 -130006 193274 476754 202803 142556 45413 101179 -71140 39766
7830C9766K60376o1016k12267j7410l92249J19524k0238J44092K05559P9280J6473
$$ 39766 300142 239126 26859 9449 -382800 -263276 -283514 -139422 66137 145417 161890
7819A61890K664r6736j40508J02533L44580l19443j90748Q8533N1785Q5087J49895
$$ 161890 164554 67818 -72690 29843 374423 54980 -135768 -47235 4550 89637 239532
7808B39532j23707j19147J32914Q0195j48057n4338j17806l44317n8523K05000
$$ 239532 115825 -3322 129592 209787 61730 7392 -110414 -454731 -513254 -308254
7798c08254k5601J32466j607J01404J91250J96278j42922j48297K6392j09806
$$ -308254 -333855 -201389 -202996 -101592 89658 285936 143014 -5283 21109 -88697
7788h8697J76675N6287l00046j71178J61607K05322J25639K3888l02402n0727
$$ -88697 87978 144265 -155781 -326959 -165352 39970 165609 189497 -112905 -163632
7778a63632M1673J20954r1848k64268j59785K53637J44434n1824M25435K44110
$$ -163632 -121959 -1005 -92853 -357121 -516906 -263269 -118835 -170659 254776 498886
7768D98886j92970n0418J36491k58175K0059P1880K129L4445j972k19288n1013
$$ 498886 305916 255498 391989 133814 153873 225753 227882 262327 260355 41067 -9946
7757i946J55413J65973O7076o3446o0737j05591j2930J11039J09327q603j26055
$$ -9946 145467 311440 378516 315070 254333 148742 135812 246851 356178 347575 221520
7746B21520l14814j48173p6717Q5827J75620J35732j16104m2617n9367j51001
$$ 221520 -93294 -241467 -318184 -232357 -56737 78995 -37109 -79726 -139093 -290094
7736b90094J06059K05616J45970o232J38301N1552j62740k88292Q1409J6049j65511
$$ -290094 -184035 21581 167551 161319 299620 351172 188432 -99860 -18451 -2402 -167913
7725a67913K1464K78049j79438j94905n3559K87447o8214P6123j32767q7650R0115
$$ -167913 -146449 131600 -47838 -242743 -296302 -8855 -77069 -946 -133713 -221363 -131248
7714a31248Q4268J74917r3171o9047K3696j0260n2138m2153q2566M3695M5909
$$ -131248 -46980 127937 34766 -34281 -10585 -20845 -72983 -115136 -197702 -154007 -108098
7703a08098R6139K97857J09498m430j89647j85748M4423l1541k04749j52311l1794
$$ -108098 -11959 285898 395396 390966 201319 15571 59994 28453 -176296 -328607 -360401
7692c60401K24823o4325O7555J7429K2344m3368L2781K4193N3570P4521j70903
$$ -360401 -135578 -199903 -132348 -114919 -92575 -135943 -103162 -78969 -25399 49122 -121781
7681a21781J21731J34920L6692J37733P2023k82406K1718L41158L3793j51998
$$ -121781 -50 134870 171562 309295 381318 98912 120630 461788 495581 343583
7671C43583k32605j8790K47210l3356Q1945R1643j51940J23940N0129q6494k11635
$$ 343583 110978 92188 339398 306042 387987 479630 327690 451630 501759 415265 203630
7660B03630m7177q2956n8899n5031j37957p342L41117J13296r9154m7122k11106
$$ 203630 156453 73497 14598 -40433 -178390 -185732 155385 268681 169527 122405 -88701
7649h8701j05466j9172R991n2938J06916J83780J63656m297r7765N5773p190o9936
$$ -88701 -194167 -213339 -203348 -256286 -149370 34410 198066 193769 96004 151777 144587 74651
7637G4651P0109J5850j59570p1174J73984M6029N966j84667r4447K17471J43452
$$ 74651 144760 160610 1040 -70134 103850 149879 155845 -28822 -123269 94202 237654
7626B37654p6664P6893K76022j52498O1457j68608j01286M9285J3952q7223M0280
$$ 237654 160990 237883 513905 361407 422864 254256 152970 202255 216207 128984 169264
7615A69264k4178R6796l5251k26312J37700n7805o6458j07433J58273J99243J12883
$$ 169264 145086 241882 206631 -19681 118019 60214 -6244 -113677 44596 243839 356722
7604C56722J86120R5767j18202k57127l10586o4930J38212j18484j77906K2329
$$ 356722 542842 638609 520407 263280 -47306 -112236 25976 -92508 -270414 -248085
7594b48085k25361N9677J90139J56805k5399n1135J76129Q1191m0103r4715j71687
$$ -248085 -473446 -413769 -223630 -66825 -92224 -143359 32770 113961 73858 -20857 -192544
7583a92544J75880K05756J60507j2540j57164K0798j1621M9457J10321j198l12548
$$ -192544 -16664 189092 349599 337059 179895 200693 189072 238529 348850 347652 35104
7572C5104j44944l6379q9902O1899K0603J39882M9540k3565J01648j05034k5234
$$ 35104 -109840 -146219 -236121 -174222 -153619 -13737 35803 12238 113886 8852 -16382
7561a6382J18414J74667P8026p8667j00447j51241J08774k8975k45395m1847j9413
$$ -16382 102032 276699 354725 276058 175611 24370 133144 104169 -141226 -183073 -202486
7550b02486j439J06593J5085J53630m4410R2765j235o3790r9478j66369J1373
$$ -202486 -203925 -97332 -82247 71383 26973 119738 118503 54713 -44765 -211134 -199761
7539a99761L15035K52590J07805L9222k42490j95217j72990k1913J94907m1484
$$ -199761 115274 367864 475669 514891 272401 77184 -95806 -117719 77188 35704
7529C5704O1507q6692j6850L4423j20670O5116o298K7926J08352k8853j40174
$$ 35704 97211 10519 -6331 28092 -92578 -27462 -33760 -5834 102518 73665 -66509
7518f6509J50484q373R013k63174k89446o863J1868J90049J77055j33342j4497
$$ -66509 83975 75602 84615 -178559 -468005 -474868 -463000 -272951 -95896 -229238 -243735
7507b43735Q8584j00312k51058K45184K29453J24158L4366R5043q4500k00196
$$ -243735 -155151 -255463 -506521 -261337 -31884 92274 126640 221683 137183 -63013
7497f3013j09276J06202M5891p7522N5284J32243J58410l8217Q7591o7244j50840
$$ -63013 -172289 -66087 -20196 -97718 -42434 89809 248219 210002 297593 230349 79509
7486G9509n9542j27010K88176K50536q8376M2479k18785j88697m4263l0955P1104
$$ 79509 19967 -107043 181133 431669 343293 385772 166987 -21710 -65973 -96928 -25824
7475b5824l23j5586L7933m8563j44952p5596R0452J85236o4520l1979J03909J50366
$$ -25824 -26147 -41733 -3800 -52363 -197315 -272911 -182459 2777 -61743 -93722 10187 160553
7463A60553m413j99841n898q6476L3962K1719J01847Q4776k29424o4716K09518
$$ 160553 156140 -43701 -49599 -136075 -102113 -80394 21453 106229 -123195 -187911 21607
7452B1607J16305j2916p3422J20849o9216j69061K51145J21960Q3692p2121j81145
$$ 21607 137912 124996 51574 172423 103207 -65854 185291 307251 390943 318822 137677
7441A37677l10395j23k116K16892P1201l0637R788j7051K16267j61725j29253
$$ 137677 -172718 -172841 -174957 41935 113136 82499 92287 75236 291503 129778 525
7430E25j09583J6239M23624J01727j88782l29815r8345r813j30920n3517J45956
$$ 525 -109058 -92819 330805 432532 243750 -86065 -184410 -194223 -325143 -378660 -232704
7419b32704K35486J12762l034J0515K8170n8340j49437L1989k38021n9377J57383
$$ -232704 2782 115544 112510 123025 151195 92855 -56582 -24593 -262614 -321991 -164608
7408a64608N4603r1848K07228r7585M594R6154r6159k15682n5252k0192n8712
$$ -164608 -110005 -201853 5375 -92210 -87616 8538 -87621 -303303 -358555 -378747 -437459
7397d37459K73484J55072r7935q9042J37763K21249p5409K7925R6755k08308o304
$$ -437459 -163975 -8903 -106838 -195880 -58117 163132 87723 115648 212403 4095 -2209
7386b209p7342l93782J73020J44924p8254m0309k7687J28489o1409L2464q3912
$$ -2209 -79551 -473333 -300313 -155389 -233643 -273952 -301639 -173150 -234559 -202095 -286007
7375b86007J5834J60087p0285r0379K23583J27234K2605p6688J51762j87316k61335
$$ -286007 -270173 -110086 -180371 -270750 -47167 80067 102672 25984 177746 -9570 -270905
7364b70905J9868O6698J41335L4584j47562J94282K16751P2405K09308J82938
$$ -270905 -251037 -184339 -43004 -8420 -155982 38300 255051 327456 536764 719702
7354G19702j45557l53528M1634l4838J37697j89917k54126K5548J78800m4838
$$ 719702 574145 220617 262251 227413 365110 175193 -78933 -53385 125415 80577
7344H0577O8612L8664q3881r0358p5011Q3411r9125j43612J8002J82051K15460
$$ 80577 149189 187853 103972 13614 -61397 22014 -77111 -220723 -202721 -20670 194790
7333A94790K42434N9708J08832l82518j78345J20210J2288p0608J6847k41196
$$ 194790 437224 496932 605764 223246 44901 165111 177399 106791 123638 -117558
7323a17558r5643j10545O0967r2882j88046J53275J63688K48854o8848L1595J76757
$$ -117558 -213201 -323746 -262779 -355661 -543707 -390432 -226744 22110 -46738 -15143 161614
7312A61614J32689p2995J3566j84346j84319p4087j11419J22537K52476N6269
$$ 161614 294303 221308 234874 50528 -133791 -207878 -319297 -196760 55716 111985
7302A11985k26636L8315J94938K4627p2509J2609J07249m8691p3294J39794j33225
$$ 111985 -114651 -76336 118602 143229 70720 83329 190578 141887 68593 208387 75162
7291G5162j85978P2478P4415k12030J66625L31532M5736k55974l6353j23801N9672
$$ 75162 -110816 -38338 36077 -175953 -9328 322204 367940 111966 75613 -48188 11484
7280A1484K06326j81315r531o227Q828j25598p3574j12431N8526K16558l2520
$$ 11484 217810 36495 26964 20737 29565 -96033 -169607 -282038 -223512 -6954 -39474
7269c9474J1238j5118k4392m614j6242k6567J28026J57396J01807n500m0833k42766
$$ -39474 -28236 -43354 -67746 -72360 -88602 -115169 12857 170253 272060 266560 225727 -17039
7257a7039k55542N4728K80819L11723j62865J10072m7975m4523k89889k5446r7450
$$ -17039 -272581 -217853 62966 374689 211824 321896 273921 229398 -60491 -85937 -183387
7246a83387j16715N4947J91906M88q0713K40692J39458m3667L2245j138k48679
$$ -183387 -300102 -245155 -53249 -52761 -133474 107218 246676 203009 235254 234116 -14563
7235a4563l1585P2515J03329J7908R872p3075Q6710K50050j26861j40351m4461
$$ -14563 -46148 26367 129696 147604 157476 84401 171111 421161 294300 153949 109488
7224A09488L2592L1623R5186q4864J60753K16230j16729k46757J0506j1635j17869
$$ 109488 142080 173703 268889 184025 344778 561008 444279 197522 208028 196393 78524
7213G8524j5870r3043r8690l282j56102j25502J30141J17923m7824k21249l4836
$$ 78524 62654 -30389 -129079 -132361 -288463 -413965 -283824 -165901 -213725 -434974 -469810
7202d69810J45703n4099K2585N4711P0457l9698L22733K34385M1886r0464P9568
$$ -469810 -324107 -378206 -355621 -300910 -230453 -270151 52582 286967 328853 238389 317957
7191C17957K4716j52028j4534j92403j1788j19674j71686M9617j61347j45571
$$ 317957 342673 190645 176111 -16292 -28080 -147754 -319440 -269823 -431170 -576741
7181e76741O5345L45411J60470J15968p487m7730N180j28197O1870K395J26924
$$ -576741 -511396 -165985 -5515 110453 102966 55236 60416 -67781 -5911 -3516 123408
7170A23408J19287J0105l9262l10269k72474J09170p0174J75205p1533O5599K03792
$$ 123408 242695 252800 213538 -96731 -369205 -260035 -330209 -155004 -226537 -160938 42854
7159D2854Q0702J1292L108J26349lk64515N3875Q4660j0705J87266j56206j34042
$$ 42854 123556 134848 137956 264305 264302 -213 53662 138322 127617 314883 158677 24635
7147B4635k2623L0056J11408R8226P1044j6263j86830l26369j03272K80202K73033
$$ 24635 2012 32068 143476 241702 312746 296483 109653 -216716 -319988 -39786 233247
7136B33247L26266j64434l54893q4367q0041j66527J9572N3054o9644k00628J64819
$$ 233247 559513 395079 40186 -44181 -124222 -290749 -271177 -218123 -287767 -488395 -323576
7125c23576M9422K83504J67738m2722m9222K63893j16093j81472n0406Q7607R1096
$$ -323576 -274154 9350 177088 134366 85144 349037 232944 51472 1066 88673 179769
7114A79769O7472p6300j57810l05276r4677J84489J54837K11542n6729k20494
$$ 179769 247241 170941 13131 -292145 -386822 -202333 -47496 164046 107317 -113177
7104a13177j55382J16260K58097J76352L3351n1448l64283k08970m6701j11080
$$ -113177 -268559 -152299 105798 282150 315501 264053 -100230 -309200 -355901 -466981
7094d66981L2037J60218J54604m7124L4042L20947o761k88803o8870Q5697m8478
$$ -466981 -434944 -274726 -120122 -167246 -133204 187743 180982 -107821 -176691 -90994 -139472
7083a39472J6745J01305J29000M1898j20318j30702J34898P4026k20127r8128
$$ -139472 -122727 -21422 107578 149476 29158 -101544 33354 107380 -112747 -210875
7073b10875K8341r5689L9094N0070K79382K9838k34756K673O7814k6604j88287
$$ -210875 -182534 -278223 -239129 -189059 90323 120161 -114595 -111922 -44108 -70712 -258999
7062b58999j88951J0144K44967K86578k0702j81323j48594n5180N1300J73182
$$ -258999 -447950 -437806 -192839 93739 73037 -108286 -256880 -312060 -260760 -87578
7052h7578K95678j6312L2552j97999J32270J18377j57706k14636j4794p6072P725
$$ -87578 208100 191788 224340 26341 158611 276988 119282 -95354 -110148 -186220 -178495
7041a78495k07008m0622L38297K38648k44685l18951R3880R3656J9955k12915
$$ -178495 -385503 -426125 -87828 150820 -93865 -412816 -318936 -225280 -205325 -418240
7031d18240K07865K87634J98012n1751j02114J63812J59143j35172n1308l1211
$$ -418240 -210375 77259 275271 223520 121406 285218 444361 309189 257881 226670
7021B26670O2606Q402j21145J8383K08674J4958P8977j73756j30830Q7594L8055
$$ 226670 289276 297678 176533 194916 403590 418548 497525 323769 192939 280533 318588
7010C18588k3024j33104o4194P1143j61737L7665O0196l4234p8722Q411o4403
$$ 318588 295564 162460 98266 169409 7672 45337 105533 71299 -7423 988 -63415
6999f3415k19407n2548J19889M7495J39083J48565R0478J69919N8573K12114J37852
$$ -63415 -282822 -335370 -215481 -167986 -28903 119662 210140 380059 438632 650746 788598
6988G88598l39092j81364l1109J61N9297m3382j09879j94023l7910O7728n2150
$$ 788598 449506 268142 237033 237194 296491 253109 143230 -50793 -88703 -20975 -73125
6977g3125n8495K28692j2216j53036J91980j02225k70172j98488O5095M0281j0278
$$ -73125 -131620 97072 84856 -68180 123800 21575 -248597 -447085 -381990 -341709 -351987
6966c51987k7971R0876J67067L61837O1827j03525k82628j98758k11675K60763
$$ -351987 -379958 -289082 -122015 239822 301649 198124 -84504 -283262 -494937 -234174
6956b34174K11412K56319J8446k49398o6169m9857p145M5837K15075m258p2484
$$ -234174 -22762 233557 252003 2605 -63564 -113421 -120566 -74729 140346 136088 63604
6945F3604Q2358M0644J47773P6007k50355l7054o7905M7743k19706N9003l2887
$$ 63604 145962 186606 334379 410386 160031 122977 55072 102815 -116891 -57888 -90775
6934i0775j59265K96765J52594o3862J33191k02156l56296k30688J38636J47565
$$ -90775 -250040 46725 199319 135457 268648 66492 -289804 -520492 -381856 -234291
6924b34291J0848K02263n9342J45510L02365j94918l03082L6729k3349m068m8062
$$ -234291 -223443 -21180 -80522 64988 367353 172435 -130647 -93918 -117267 -121335 -169397
6913a69397J44034J30553p9095m8001R4206J0071J29295k17218n2686P7796j7173
$$ -169397 -25363 105190 26095 -21906 72300 82371 211666 -5552 -58238 19558 2385
6902B385n7542P609O102J29079J6368j25755n0619O2747q6240K003J91102J51774
$$ 2385 -55157 -47548 -41446 87633 104001 -21754 -72373 -9626 -95866 -93863 97239 249013
6890B49013Q7963j80512j13819J10153j38271k57203j56535K01783J41306K0692
$$ 249013 336976 156464 42645 152798 14527 -242676 -399211 -197428 -56122 -35430
6880c5430q9616j57997K55779J60513k23623j17354K5424n2442q0156J39222n2549
$$ -35430 -125046 -283043 -27264 133249 -90374 -207728 -182304 -234746 -314902 -175680 -228229
6869b28229o2519l2344J74514J68623J25962n9805J09699n992P7865j62492R4120
$$ -228229 -290748 -323092 -148578 20045 146007 86202 195901 189909 267774 105282 199402
6858A99402j52950J33258j14841j56751j57485P6896J40982q9232r8396n9419
$$ 199402 46452 179710 64869 -91882 -249367 -172471 -31489 -120721 -219117 -278536
6848b78536J59201K26908L01009r6635k63032j03344j67091j12737J97305K55410
$$ -278536 -119335 107573 408582 311947 48915 -54429 -221520 -334257 -136952 118458
6838A18458J49511j0p6792j03893r5531j26077j0158K38334K13665L918N9297
$$ 118458 267969 267959 191167 87274 -8257 -134334 -144492 93842 307507 311425 370722
6827C70722n2746o5349L760j49859j70746j92760J75602l17m0619Q6143P8054
$$ 370722 317976 252627 256387 106528 -64218 -256978 -81376 -81693 -122312 -36169 41885
6816D1885J06781l75947j68178J43246J81918J48526J68931K7502l47694j21417
$$ 41885 148666 -227281 -395459 -252213 -70295 78231 247162 274664 -73030 -194447
6806a94447K15705j8093r0388O4127K81389R6596k9948j5923m4068j30013j01061
$$ -194447 21258 3165 -87223 -23096 258293 354889 324941 309018 264950 134937 33876
6795C3876K8364J38750p7184j40343n5150J62830J15724k15970m8998J62082L7297
$$ 33876 62240 200990 123806 -16537 -71687 91143 206867 -9103 -58101 103981 141278
6784A41278j42338K09307m1044k01407j46617j30083j6465K57352K33446j34532
$$ 141278 -1060 208247 167203 -34204 -180821 -310904 -327369 -70017 163429 28897
6774B8897k38766K79357J33459j00074q8803n9777j41514r524n8431o0086L2632
$$ 28897 -209869 69488 202947 102873 14070 -45707 -187221 -196745 -255176 -315262 -282630
6763b82630J2330N3260K52795N3205p4494k41103l0738Q9409M3674M2513k81754
$$ -282630 -270300 -217040 35755 88960 14466 -226637 -257375 -167966 -124292 -81779 -363533
6752c63533J06357J3097j67078J08560K52954r087q7261K66621J03899L650K05144
$$ -363533 -257176 -244079 -411157 -302597 -49643 -58730 -145991 120630 224529 228179 433323
6741D33323j17073r9802Q1478m03493l4572J45156K1393M3453L6471j58765j94257
$$ 433323 316250 216448 297926 -105567 -140139 5017 26410 69863 106334 -52431 -246688
6730b46688j77288L4597J72488k0326K83036O4923j69835r0185j02959R7345J02433
$$ -246688 -423976 -389379 -216891 -237217 45819 110742 -59093 -149278 -252237 -154892 -52459
6719e2459J9264R5919K984j48205K5908J25446O1676K7354J22743k02046j01924
$$ -52459 -33195 62724 65708 -82497 -56589 68857 130533 157887 280630 78584 -23340
6708b3340N1210j06455K2066J40776L5025j92793j33198m6895K4178O0762O9618
$$ -23340 27870 -78585 -56519 84257 119282 -73511 -206709 -253604 -229426 -168664 -99046
6697i9046j35344k2362P7218L7485J64754M1323j49092l64704J7721J24204Q4128
$$ -99046 -234390 -256752 -179534 -142049 22705 64028 -85064 -449768 -432047 -307843 -223715
6686b23715L67473K38745j29227m2116J02331p174k17819r8741k263M8040l0293
$$ -223715 143758 382503 253276 211160 313491 306317 88498 -10243 -12506 35534 5241
6675E241Q0888r5397j24432j62098O4725Q7792k49566L5929J80640J19806O194
$$ 5241 86129 -9268 -133700 -295798 -231073 -143281 -392847 -356918 -176278 -56472 -50278
6664e0278N4584j00787q7019m8960O3116J83632J61440j05508j61128P1563L4869
$$ -50278 4306 -96481 -183500 -232460 -169344 14288 175728 70220 -90908 -19345 15524
6653A5524L9978r9081J20533j01084n7820J11681J00823M0231J76249k970k3834
$$ 15524 55502 -43579 76954 -24130 -81950 29731 130554 170785 347034 344064 320230
6642C20230J31049M6330k53770j58634j26599N4541Q9122q5528n9071k07347o5608
$$ 320230 451279 497609 243839 85205 -41394 13147 102269 16741 -42330 -249677 -315285
6631c15285J08548K23757J66896l1021J8212j01526N5693J20642j90143J9272
$$ -315285 -206737 17020 183916 152895 171107 69581 125274 245916 55773 75045
6621G5045J03906J86062K3738j32132p4712l24139q7228K52564K00014J03880
$$ 75045 178951 365013 388751 256619 181907 -142232 -229460 23104 223118 326998
6611C26998j86599j87755K32079J02337L1649j15074j53776o5516K36818l33071
$$ 326998 140399 -47356 184723 287060 318709 203635 49859 -15657 221161 -111910
6601a11910m16760O3404J97230J36960N6700K59909L7396j39109R8292R6384j35497
$$ -111910 -528670 -465266 -268036 -131076 -74376 185533 222929 83820 182112 278496 142999
6590A42999r8030P3983M7294K02050K28101m871K351j39221k85258l15728q5271
$$ 142999 44969 118952 166246 368296 596397 591526 593877 454656 169398 -146330 -231601
6579b31601J01369L9576n9268Q9809R8434j39803k3317K23052O2231p494l2327
$$ -231601 -130232 -90656 -149924 -60115 38319 -101484 -124801 98251 160482 152988 120661
6568A20661J63816p2294K75198J94072j43278j77949k51558j27534j53690j73659
$$ 120661 284477 212183 487381 681453 538175 360226 108668 -18866 -172556 -346215
6558c46215O6491P6412j28634r0895J31476R9785J99886Q2890J9084p7162j96157
$$ -346215 -279724 -203312 -331946 -422841 -291365 -191580 8306 91196 110280 33118 -163039
6547a63039n8645N494p7335J00292Q5608K8144j83766j68520J23961K80437k6011
$$ -163039 -221684 -216190 -293525 -193233 -107625 -79481 -263247 -431767 -307806 -27369 -53380
6536e3380k86610R1409J63766J25270J4797R2385J12033k25498l53689L7351K4953
$$ -53380 -339990 -248581 -84815 40455 55252 147637 259670 34172 -319517 -282166 -257213
6525b57213j93625J78002l7908k5470R5957K47143k65369K3160J58819l8994k14837
$$ -257213 -450838 -272836 -310744 -336214 -240257 6886 -258483 -235323 -76504 -115498 -330335
6514c30335o9326J94384K95271P4094k27293k58893q6229J49681K79095o4381
$$ -330335 -399661 -205277 89994 164088 -63205 -322098 -408327 -258646 20449 -43932
6504d3932j87338k02557J01035M36749J29503K24949k25333l77050m9074J57125
$$ -43932 -231270 -433827 -332792 103957 233460 458409 233076 -143974 -193048 -35923
6494c5923n7391J6612P6547j95085k61234J20091L44555J72542q158k121k6738
$$ -35923 -93314 -76702 -155 -195240 -456474 -336383 8172 180714 172556 170435 143697
6483A43697N0079j61292j29236J17741j26958R4838l4797N7683Q846J35654n8979
$$ 143697 193776 32484 -96752 20989 -105969 -11131 -45928 11755 20601 156255 97276
6472I7276M1615q0667r3888j49006l8364K45665J06731j29067J49215N9219k1765
$$ 97276 138891 58224 -35664 -184670 -223034 22631 129362 295 149510 208729 186964
6461A86964j53400k01742k46013q2571K24741K96498J04709J59271j81020j25385
$$ 186964 33564 -168178 -414191 -496762 -272021 24477 129186 288457 107437 -17948
6451a7948L2677J38020J97676j92203k83974m590O0487k2912M2957J47680o5803
$$ -17948 14729 152749 350425 158222 -125752 -130342 -69855 -92767 -49810 97870 32067
6440C2067r3627j09351l73400J94070L96537R9779j60806p3159K46096J48960
$$ 32067 -61560 -170911 -544311 -350241 46296 146075 -14731 -87890 158206 307166
6430C07166J16255K15616o0921j15037K4444j73639j84754k79297j20033J33045
$$ 307166 423421 639037 578116 463079 487523 313884 129130 -150167 -270200 -137155
6420a37155J88733n3313P1969j12866p7643Q6725J57173K0431k28215N8088O207
$$ -137155 51578 -1735 70234 -42632 -120275 -33550 123623 144054 -84161 -26073 -19866
6409a9866K0907j64174k33489j85319K21961R8999L57484L12283R6652k60510
$$ -19866 1041 -163133 -396622 -581941 -359980 -260981 96503 408786 505438 244928
6399B44928o7696k07424o8484K43621J66430P9042j84481l70284m9656K43011
$$ 244928 177232 -30192 -98676 144945 311375 390417 205936 -164348 -214004 29007
6389B9007j9292J22616j5178j86408m2751n6485n2674m8611Q8390l7281j80083
$$ 29007 9715 132331 117153 -69255 -112006 -168491 -221165 -269776 -181386 -218667 -398750
6378c98750J66665J19249J4586J54019J99691J12210j57778j04658J84035j72658
$$ -398750 -232085 -112836 -98250 55769 255460 367670 209892 105234 289269 116611
6368A16611n783j8456j40267L0180k8502R5922Q2508L8p6223o6197J377j04681
$$ 116611 110828 92372 -47895 -17715 -46217 49705 132213 132251 56028 -10169 -8792 -113473
6356a13473K58794L9553k01883j03352L0218R9055j317j34873m4413r360k90350
$$ -113473 145321 184874 -17009 -120361 -90143 8912 7595 -127278 -171691 -181051 -471401
6345d71401O0431j28718P8275K01627K59052J98209j2311j24758k33150k07099
$$ -471401 -410970 -539688 -461413 -259786 -734 197475 185164 60406 -172744 -379843
6335c79843j81313P8381j52024N0770L14479K13912j60861j72012j66442J86739
$$ -379843 -561156 -482775 -634799 -584029 -269550 -55638 -216499 -388511 -554953 -368214
6325c68214N2032J95054L51221P4891r3536p4924J57033l2169j14488K47597K20423
$$ -368214 -316182 -121128 230093 304984 211448 136524 293557 261388 146900 394497 614920
6314F14920O5307j39520k05777j17572j74548r0601J58318J39368j45005k98728
$$ 614920 680227 540707 334930 217358 42810 -47791 110527 249895 104890 -193838
6304a93838j04570M940K21466J06934m8431J63807Q3954n9703R6652J31548k16902
$$ -193838 -298408 -293468 -72002 34932 -13499 150308 234262 174559 271211 402759 185857
6293A85857k76534J34776j72594q6709L9764p1968m9013M9785J27508o1142K4150
$$ 185857 -90677 44099 -128495 -215204 -175440 -247408 -296421 -246636 -119128 -180270 -156120
6282a56120R0999K25320j33506l7229j12763J16630L66734j01892o4126k9240
$$ -156120 -65121 160199 26693 -10536 -123299 -6669 360065 258173 194047 164807
6272A64807R1309j8304j92217p2400j14521J76434K40570J31948k83O6831k52799
$$ 164807 256116 237812 45595 -26805 -141326 35108 275678 407626 407343 474174 221375
6261B21375j15905J22771L1982J31069p1425j3682J31432K0303m9860j482j36835
$$ 221375 105470 228241 260223 391292 319867 306185 437617 457920 408060 406578 269743
6250B69743l06521N3589q0036K2342K08347J87445r706k40953J95178P6314l97050
$$ 269743 -36778 16811 -63225 -40883 167464 354909 345203 104250 299428 375742 -21308
6239b1308j87745r6383L57685R7635K795M082k82711j85613J92443K01219K20990
$$ -21308 -209053 -305436 52249 149884 152679 156761 -125950 -311563 -119120 82099 303089
6228C03089J9784j44489j24634J48189j02909r3247j03243n7693k57978k0855
$$ 303089 322873 178384 53750 201939 99030 5783 -97460 -155153 -413131 -433986
6218d33986l5554m4090L32387L62001m39o7050J11263k00203j67019O2030j12654
$$ -433986 -469540 -513630 -181243 180758 180319 113269 224532 24329 -142690 -80660 -193314
6207a93314P0916l3530L1828J77053O7338p9129J9010J48213N3299J21620j17765
$$ -193314 -122398 -155928 -124100 52953 120291 41162 60172 208385 261684 383304 265539
6196B65539m92977j55937J89291J5903N7495P7464j09006j49789k196j2123j33734
$$ 265539 -227438 -383375 -194084 -178181 -120686 -43222 -152228 -302017 -304213 -316336 -450070
6185d50070L4371J43624J55734l2276j65195J19077K2115J35187Q3857K60419
$$ -450070 -415699 -272075 -116341 -148617 -313812 -194735 -172620 -37433 46424 306843
6175C06843r9976k53983m3310p4849Q4210l7761j66522n8295J83940R0151j17370
$$ 306843 206867 -47116 -90426 -165275 -81065 -118826 -285348 -343643 -159703 -69552 -186922
6164a86922J13383P7248k7041k10822J3943j0592j08400Q0510K75149q2964O2069
$$ -186922 -73539 3709 -23332 -234154 -220211 -230803 -339203 -258693 16456 -66508 -4439
6153d439r824k3204j57280k87131P5861N2212M06188J94319k1024r5807j73548
$$ -4439 -14263 -37467 -194747 -481878 -406017 -353805 52383 246702 225678 129871 -43677
6142d3677j78778J35180L61087Q1276j08560q9253Q502L4784K7596j89492l3978
$$ -43677 -222455 -87275 273812 355088 246528 157275 165777 200561 228157 38665 4687
6131D687J74865L0340k51447j7341J54221q519O475M4782N0945j23325p2839K8953
$$ 4687 179552 209892 -41555 -58896 95325 86806 93281 138063 189008 65683 -7156 21797
6119B1797J236j08146r2272p4095n2721L4482P8071N8231L6826p5505j16139R8791
$$ 21797 23033 -85113 -177385 -251480 -304201 -269719 -191648 -133417 -96591 -172096 -288235 -189444
6107a89444j14367j37619o0507K42483L64426J550o3943o6535J2745o4867j3315
$$ -189444 -303811 -441430 -501937 -259454 104972 106522 42579 -23956 -11211 -76078 -89393
6096h9393J1070J88899R8733K35535q648j26384l41771j55129q3003K08499K53689
$$ -89393 -78323 110576 209309 444844 436196 309812 -31959 -187088 -270091 -61592 192097
6085A92097J75336J16135j62214n7609l3365j26061j90342L5787j2160L4467k71250
$$ 192097 367433 483568 321354 263745 230380 104319 -86023 -50236 -62396 -27929 -299179
6074b99179n7456R1678O1751o6203k07875n616J48513K71451N1748j07638l193
$$ -299179 -356635 -264957 -203206 -269409 -477284 -482900 -334387 -62936 -11188 -118826 -122019
6063a22019J1761J5667l3791j01439K09658p9526j2178j07225J13027J77675J5759
$$ -122019 -110258 -94591 -128382 -229821 -20163 -99689 -111867 -219092 -106065 71610 87369
6052H7369q2231j38236l5211J03350J27459K3703j37153j77693R4931k05621J61316
$$ 87369 5138 -133098 -168309 -64959 62500 86203 -50950 -228643 -133712 -339333 -178017
6041a78017R504j14397k4780k33940K39096L15165J70521p0913j49458O863L7621
$$ -178017 -168513 -282910 -307690 -541630 -302534 12631 183152 112239 -37219 -30356 7265
6030G265J13250Q6161J40440j43979n4772K20484Q4686j41548k73154L342p8089
$$ 7265 120515 206676 347116 203137 148365 368849 453535 311987 38833 42175 -35914
6019c5914O7421j29571k73802M8401J77152O038j00582k7299J73006l1500K55726
$$ -35914 31507 -98064 -371866 -323465 -146313 -140275 -240857 -268156 -95150 -126650 129076
6008A29076l0702j35746N8846O1599q6691J15215J52578K11959j29699j41013
$$ 129076 98374 -37372 21474 83073 -3618 111597 264175 476134 346435 205422
5998B05422j01174k29675n1933J09844j81179r8651K35445K08685m755n5951J56402
$$ 205422 104248 -125427 -177360 -67516 -248695 -347346 -111901 96784 92029 36078 192480
5987A92480K76151l99206j42114J03479m753j34061q2104j62077J06248K39928
$$ 192480 468631 69425 -72689 30790 26037 -108024 -190128 -352205 -245957 -6029
5977f029L77170J37514k29112k83737K2876l9559N7982k4809k95529l23427Q4893
$$ -6029 371141 508655 279543 -4194 18682 -20877 37105 12296 -283233 -606660 -521767
5966e21767K99608p225k45996J51910L01264j45120j46049j62415P2441K28474
$$ -521767 -222159 -229384 -475380 -323470 -22206 -167326 -313375 -475790 -403349 -174875
5956a74875K36411m7988N6244j24093m335Q6682J16430R0947o0224n2924j57612
$$ -174875 61536 13548 69792 -54301 -58636 28046 144476 235423 175199 122275 -35337
5945c5337l7531j12543j64853p265J75006R3662j11293J02250K40364M9025j23750
$$ -35337 -72868 -185411 -350264 -357529 -182523 -88861 -200154 -97904 142460 191485 67735
5934F7735k05940k14651K16278J72376K44826k62677n8769k9810J96015r5488
$$ 67735 -138205 -352856 -136578 35798 280624 17947 -40822 -70632 125383 29895
5924B9895K9579J36429n7178r5608O5033L833q2244j06557J02743P5857K1574
$$ 29895 59474 195903 138725 43117 108150 111983 29739 -76818 25925 101782 123356
5913A23356J4928J1250q6323k8020j097k11744k41196R7016K14638k3410l7002
$$ 123356 138284 149534 63211 35191 34094 -177650 -418846 -321830 -107192 -130602 -167604
5902a67604J22960j57518m2171J12547K48670P1035R1085m7402k39771M5617N8645
$$ -167604 -44644 -202162 -244333 -131786 116884 187919 279004 231602 -8169 37448 96093
5891I6093M5470J2114Q7306n106n4731r8880j41875l5496q778o2534J81374N0588
$$ 96093 141563 153677 240983 235877 181146 82266 -59609 -95105 -103883 -166417 14957 65545
5879F5545j03013L209O0271k38025l0952o0399J39726Q6697J13171J2959j32250
$$ 65545 -37468 -34259 26012 -212013 -242965 -303364 -163638 -76941 36230 49189 -83061
5868h3061J90861P3563k12774k2144J46986R2180J5931j24875q7614L0900p2531
$$ -83061 107800 181363 -31411 -53555 93431 185611 201542 76667 -10947 19953 -52578
5857e2578n4334J8598m3434j00975m2873K86444J13729j2439q9105j81132J2897
$$ -52578 -106912 -88314 -131748 -232723 -275596 10848 124577 112138 23033 -158099 -145202
5846a45202L6945o1682J76420M9766R5481k44160q0453K35262K86641j20234j71321
$$ -145202 -108257 -169939 6481 56247 151728 -92432 -172885 62377 349018 228784 57463
5835E7463J10951p3044j30941J82328K60422J2848J01844k13440m02724j31668
$$ 57463 168414 95370 -35571 146757 407179 420027 521871 308431 -94293 -225961
5825b25961J62482J64317p6976j0786q0162J16955J09315K01892P820j54802j62754
$$ -225961 -63479 100838 23862 13076 -67086 49869 159184 361076 368896 214094 51340
5814E1340k6736M7211J99462j24495k09368q6922p4629K31656L39816J27306j12166
$$ 51340 24604 71815 271277 146782 -62586 -149508 -224137 7519 347335 474641 362475
5803C62475k18578k17645N819J23026j43133O6109k5417q6089r0675R0346P3689
$$ 362475 143897 -73748 -67929 55097 -88036 -21927 -47344 -133433 -224108 -133762 -60073
5792f0073J72746m7579o00391j44888L06736K43224K78962p8657J50602Q4158
$$ -60073 112673 65094 -535297 -680185 -373449 -130225 148737 70080 220682 304840
5782C04840p3431o2152l7812j696l5153j24954k51239k2728o1015O4835K3010
$$ 304840 231409 169257 131445 129749 94596 -30358 -281597 -304325 -365340 -300505 -277495
5771b77495r4346J99662R1939L4615K51973J73915k16380P0958J46085j8865j94489
$$ -277495 -371841 -172179 -80240 -45625 206348 380263 163883 234841 380926 362061 167572
5760A67572k87171J93708J57798p3967k383k80077q4261L573l08775p069L5678
$$ 167572 -119599 74109 231907 157940 155557 -124520 -208781 -205208 -513983 -521052 -485374
5749d85374J1526j88860L3035R1810j27845J90457J57969J67724J46583j36797
$$ -485374 -473848 -662708 -629673 -537863 -665708 -475251 -317282 -149558 -2975 -139772
5739a39772j44778O7156K16177o1776j31506J31371K8276J7060k9851p6922J20618
$$ -139772 -284550 -217394 -1217 -62993 -194499 -63128 -34852 -17792 -47643 -124565 -3947
5728c947P0743j32736j23911n5329J12920K9416p164J44886K5403J51502J2441
$$ -3947 66796 -65940 -189851 -245180 -132260 -102844 -110008 34878 60281 211783 224224
5717B24224o6660o9121K3125j15389k6429j05828J94856P2579q9101l56263N7154
$$ 224224 157564 88443 111568 -3821 -30250 -136078 58778 131357 42256 -314007 -256853
5706b56853P5367j45183j38980l8927L4678N9992J73828R2696j58249J47194J44195
$$ -256853 -181486 -326669 -465649 -504576 -469898 -409906 -236078 -143382 -301631 -154437 -10242
5695a0242n5918R0415J35466O1785L1292J94465P8799l05389j77952m3556j2938
$$ -10242 -66160 24255 159721 221506 252798 447263 526062 220673 42721 -835 -13773
5684a3773j28011r1860m070L09823N9897J4018O1604J69694r0105j63274j07856
$$ -13773 -141784 -233644 -237714 72109 132006 146024 207628 377322 287217 123943 16087
5673A6087k25006j54303J59862L9585m215q5976J19920O1375j43057q8564P0433
$$ 16087 -208919 -363222 -203360 -163775 -167990 -253966 -134046 -72671 -215728 -304292 -233859
5662b33859J40776J19683q6749N8538K6413n9744J89399J61503J98181J67729
$$ -233859 -93083 26600 -60149 -1611 24802 -34942 154457 315960 514141 681870
5652F81870J22108k08825k72754j8037r1267J05623p2572K687L2599r4499k9902
$$ 681870 803978 595153 322399 304362 213095 318718 246146 248833 281432 186933 157031
5641A57031j5163J00249P7157j7287j22740l22099M1295Q7649j12578l21622m5193
$$ 157031 141868 242117 319274 301987 179247 -142852 -101557 -13908 -126486 -448108 -493301
5630d93301L1868M58572M07774m37808l15440k5877J44490J53400J12338p8459
$$ -493301 -461433 -2861 404913 -32895 -348335 -374212 -229722 -76322 36016 -42443
5620d2443o9885m2036n1270L26230K10008j42957m2600M614j13171r9199K0456
$$ -42443 -112328 -154364 -205634 120596 330604 187647 145047 149661 36490 -62709 -42253
5609d2253K83902Q5507O7388N3254l7791m9284M5916l5182L232j6973j21832j66664
$$ -42253 241649 327156 394544 447798 410007 360723 406639 371457 374689 357716 235884 69220
5597F9220L44760q4088k39063k32658j40675n2360K60885J86024n614j06693j1254
$$ 69220 413980 329892 90829 -141829 -282504 -334864 -73979 112045 106431 -262 -11516
5586a1516M807N6233Q7357J12711k10925N122j75206k54319p2250R406o7813L336
$$ -11516 -6709 49524 136881 249592 38667 43789 -131417 -385736 -457986 -448580 -516393 -513057
5574e13057Q9340M6804K77802O7569p1039j35289J64213K37025l9565p1310O0401
$$ -513057 -423717 -376913 -99111 -31542 -102581 -237870 -73657 163368 123803 52493 112894
5563A12894l5036o485j56247n1034J18899J09314N7431j33117q7924J61848j16978
$$ 112894 77858 71373 -84874 -135908 -17009 92305 149736 16619 -71305 90543 -26435
5552b6435l81288l6529J09469j67103P974Q1295J78239K18646K72425l4403j41845
$$ -26435 -407723 -444252 -334783 -501886 -493912 -412617 -234378 -15732 256693 222290 80445
5541H0445k14777k51753K00354n9291O1747k12088k0225Q9030L68092J27568o2142
$$ 80445 -134332 -386085 -185731 -245022 -183275 -395363 -415588 -326558 41534 169102 106960
5530A06960l0926Q6830j02365J0656N5351p4929r9132j03151N6023J17918J27051
$$ 106960 76034 162864 60499 71155 126506 51577 -47555 -150706 -94683 23235 150286
5519A50286k36760j2966j6662J7116J36210n4637j16067J78681J61740N3477k52347
$$ 150286 -86474 -99440 -116102 -98986 37224 -17413 -133480 45201 206941 260418 8071
5508H071k7896K475n3803k08002N6161j15442O7239K45919K13019o0775k20648
$$ 8071 -19825 -17350 -71153 -279155 -222994 -338436 -271197 -25278 187741 126966 -93682
5497i3682P3831j90120J5497P5046Q1949k5705K7655R2854r6811j38039j18332
$$ -93682 -19851 -209971 -194474 -119428 -37479 -63184 -35529 57325 -39486 -177525 -295857
5486b95857N9359O2341K50127m2900o8724J33214O84L4333o5526l00782k71236
$$ -295857 -236498 -174157 75970 33070 -35654 97560 98244 132577 67051 -233731 -504967
5475e04967M7128m8441j61529K24737K33529R3402k06462K07599N8788M2880R471
$$ -504967 -457839 -506280 -667809 -443072 -209543 -116141 -322603 -115004 -56216 -13336 -3865
5464c865J05237j26252R9036J85528j62911P9585M2916k95323l37356P0247J91456
$$ -3865 101372 -24880 74156 259684 96773 176358 219274 -76049 -413405 -343158 -151702
5453a51702L43627k0458j59638O208j5162J32489L3827j8153k18072l55854N28
$$ -151702 191925 171467 11829 18037 2875 135364 169191 151038 -67034 -422888 -422360
5442d22360K82485R0385N7072n0197P5860Q9144R900k19570J152K85347o7333
$$ -422360 -139875 -49490 7582 -42615 33245 122389 132289 -87281 -86129 199218 131885
5431A31885k28423J02297j92015k4361j11614P6287k9310p7040M5166K1980N1228
$$ 131885 -96538 5759 -186256 -210617 -322231 -245944 -275254 -352294 -307128 -285148 -233920
5420b33920k9283r8899j93077l4429J62711J98721k3735K8527J87861K5569q1368
$$ -233920 -263203 -362102 -555179 -589608 -426897 -228176 -251911 -223384 -35523 -9954 -91322
5409i1322J48398k1007n8968k28027M4321O5832Q2425j01265k4l7700K4605M6189
$$ -91322 57076 36069 -22899 -250926 -206605 -140773 -58348 -159613 -159637 -197337 -172732 -126543
5397a26543J37180J03569J967q5069j59341R9636j20001O8195P8785R4413m1336
$$ -126543 10637 114206 116173 31104 -128237 -28601 -148602 -80407 -1622 92791 51455
5386E1455l6387m4655Q4517K21901R8504k740k42453j88809J23793R0710j00260
$$ 51455 15068 -29587 54930 276831 375335 372595 130142 -58667 65126 155836 55576
5375E5576n8644n7053l8583k2163j14356l3862j01373K04611K24007j05652j52807
$$ 55576 -3068 -60121 -98704 -120867 -235223 -269085 -370458 -165847 58160 -47492 -200299
5364b00299j84046n3436K41345J98450n2155p3556j35788L3466O016m1641K42020
$$ -200299 -384345 -437781 -196436 2014 -50141 -123697 -259485 -226019 -220003 -261644 -19624
5353a9624J69241L7201N5597j48418j69846n0536K01768J88374M09272o7980k95822
$$ -19624 149617 186818 242415 93997 -75849 -126385 75383 263757 673029 605049 309227
5342C09227j07853j30133k9959P068Q2902p1309k67510k44860K50828M50303P9247
$$ 309227 201374 71241 41282 48350 131252 59943 -207567 -452427 -201599 248704 327951
5331C27951j51750o6125L6856n2001J44268j66394j72867L10164J75825j83671
$$ 327951 176201 110076 146932 94931 239199 72805 -100062 210102 385927 202256
5321B02256j04328k73212j02646J91369o1496J63941j75178o6148p2872r4291
$$ 202256 97928 -175284 -277930 -86561 -148057 15884 -159294 -225442 -298314 -392605
5311c92605O8757m1951K28899K82251o6987k32027p4007M678O7988R1433J44687
$$ -392605 -323848 -365799 -136900 145351 78364 -153663 -227670 -222992 -155004 -63571 81116
5300H1116J03769K0176J2746J0318Q4626k04621J12885K60449o505r6455j85498
$$ 81116 184885 205061 217807 228125 312751 108130 221015 481464 474959 378504 193006
5289A93006j39850j71812K2026J15033j56242K2185k7584k0416J39911k2271q3690
$$ 193006 53156 -118656 -96630 18403 -137839 -115654 -143238 -163654 -23743 -46014 -129704
5278a29704j34900J01417K20722r4288l04034n2306J0317K3818J78474J38952
$$ -129704 -264604 -163187 57535 -36753 -340787 -393093 -382776 -358958 -180484 -41532
5268d1532p4007q9001k3754j2837j0581K72883J63500j62176j04378K5385O1576
$$ -41532 -115539 -204540 -228294 -241131 -251712 21171 184671 22495 -81883 -56498 5078
5257E078k7954J42672Q1011N4070j95289l49485R2364p218J48601j43090J8076
$$ 5078 -22876 119796 200807 254877 59588 -289897 -197533 -204751 -56150 -199240 -181164
5246a81164J46424J44509j09906m29995j78770L08192K89207J07653J2693J739
$$ -181164 -34740 109769 -137 -430132 -608902 -300710 -11503 96150 108843 110582
5236A10582j74096J08105K55918K4256j77443k16701j43410J62485K29022K0565
$$ 110582 -63514 44591 300509 324765 147322 -69379 -212789 -50304 178718 199283
5226A99283j44093O9505J8034p6476n0762q4699L8240J02697l1707j20359Q7561
$$ 199283 55190 124695 142729 66253 15491 -69208 -30968 71729 40022 -80337 7224
5215G224K14763P7658k08220j22123k41493k93814K43880k5666j7184J35492N6013
$$ 7224 221987 299645 91425 -30698 -272191 -566005 -322125 -347791 -364975 -229483 -173470
5204a73470J01593R2758p526J96548N1794m2593k07779k43594k12325j6304Q8985
$$ -173470 -71877 20881 13355 209903 261697 219104 11325 -232269 -444594 -460898 -371913
5193c71913l3670J27614K6927J56116L28096J02311r8697J53797j19770j44307
$$ -371913 -405583 -277969 -251042 -94926 233170 335481 236784 390581 270811 126504
5183A26504Q8112q9048l25870n4162P1551M3147J81709J58265j83841j55890O9963
$$ 126504 214616 125568 -200302 -254464 -182913 -139766 41943 200208 16367 -139523 -69560
5172f9560J00925L3464r0626J76215o7267j48610j02278L53531J53340j62254
$$ -69560 31365 64829 -25797 150418 83151 -65459 -167737 185794 339134 176880
5162A76880j84828j86759J07193J22360j9913J01724k13598K4237j10613Q13P9254
$$ 176880 -7948 -194707 -87514 34846 14933 116657 -96941 -72704 -183317 -182504 -103250
5151a03250M7387n2817Q5316L7293r934j0742K94648l2522j44293j71522r5421
$$ -103250 -55863 -108680 -23364 13929 3995 -6747 287901 255379 111086 -60436 -155857
5140a55857J31624J41234J8839J935j33869j70511L09896J03543R5786j46131
$$ -155857 -24233 117001 135840 137775 3906 -166605 143291 246834 342620 196489
5130A96489k75079k10848K07197J21570j88047p6664k71813J09803L33588L55743
$$ 196489 -78590 -289438 -82241 39329 -148718 -225382 -497195 -387392 -53804 301939
5120C01939M0982Q7297m5372k10121k38657q2880j6212o2366K62324J73651M5190
$$ 301939 342921 430218 384846 174725 -63932 -146812 -163024 -225390 36934 210585 255775
5109B55775l04993N9686j11898N7625J9403M7460j38614k27513n0363o4276M5633
$$ 255775 -49218 10468 -101430 -43805 -24402 23058 -115556 -343069 -393432 -457708 -412075
5098d12075J40308R7589o2306j6451J4005L7332N9670M01427J42968K201K4999
$$ -412075 -271767 -174178 -236484 -252935 -238930 -201598 -141928 259499 402467 404668 429667
5087D29667J00015P8927m6512R7748l5332p7123k20939l14048j06984j33708J48828
$$ 429667 529682 608609 562097 659845 624513 547390 326451 12403 -94581 -228289 -79461
5076g9461J24224m5459O8253p13j46254l7601m4892q2042J25165k117l7562M3688
$$ -79461 44763 -696 67557 66844 -79410 -117011 -161903 -243945 -118780 -120897 -158459 -114771
5064a14771L52537K31367P5015J38753k39937k98444k43250R1304J27974k6206
$$ -114771 237766 469133 544148 682901 442964 144520 -98730 -7426 120548 94342
5054I4342k95068q3765j6809j26135m052n3300j41079N3604J27250J58300O1132
$$ 94342 -200726 -284491 -301300 -427435 -431487 -484787 -625866 -572262 -445012 -286712 -225580
5043b25580j52264R4663k0433J27408n0526n8902K15081O8075O8625k30316N3066
$$ -225580 -377844 -283181 -303614 -176206 -226732 -285634 -70553 -2478 66147 -164169 -111103
5032a11103J05374k27959j91242R3842L11761j51993n1975K04451J69366J2162
$$ -111103 -5729 -233688 -424930 -331088 -19327 -171320 -223295 -18844 150522 162684
5022A62684l5214k94819O630j4519K24287M9558j71839j52076J25560R9754J50665
$$ 162684 127470 -167349 -160719 -175238 49049 98607 -73232 -225308 -99748 6 150671
5011A50671r6563j70408N5316J8343P555k27160r009L3297j42776P9420J83193
$$ 150671 54108 -116300 -60984 -42641 -35086 -262246 -271255 -237958 -380734 -301314 -118121
5000a18121K98701q959k12870r8524n1539L8281K04822L83429K39145r3291k76913
$$ -118121 180580 171621 -41249 -139773 -191312 -153031 51791 435220 674365 581074 304161
4989C04161k88327l1624Q6974P2j9428J18231j01411J05247p2604l03253j75596
$$ 304161 15834 -15790 71184 71256 51828 170059 68648 173895 101291 -201962 -377558
4978c77558O4185L5607J83292r6567l68457j21708L15173K2929m76L7515J98579
$$ -377558 -313373 -277766 -94474 -191041 -559498 -681206 -366033 -343104 -343580 -306065 -107486
4967a07486l7635O0120N0054K16972n8715k5501M3178r9957l5258N2767K11165
$$ -107486 -145121 -85001 -34947 182025 123310 97809 140987 41030 5772 58539 269704
4956B69704k82420n2055L41785K50517k15518k86859l9544K4468K28791M3140
$$ 269704 -12716 -64771 277014 527531 312013 25154 -14390 10078 238869 282009
4946B82009j11485k28779K418K26723J00369L4724k2178n3449K0075p1188p1234
$$ 282009 170524 -58255 -55837 170886 271255 305979 283801 230352 250427 179239 108005
4935A08005N8377J11648k01757j94216J15556M901J44123J11651K43610n2897
$$ 108005 166382 278030 76273 -117943 -2387 2514 146637 258288 501898 449001
4925D49001j49769J0584j57718l19890k41841K1236J63916J34707N7992j65581
$$ 449001 299232 309816 152098 -167792 -409633 -388397 -224481 -89774 -31782 -197363
4915a97363j32649P1711K28672l1362k00599m5838p9597k43058O7373M9500K03536
$$ -197363 -330012 -258301 -29629 -60991 -261590 -307428 -387025 -630083 -562710 -513210 -309674
4904c09674L7791j49421K53419L35794K9226J60985j35135k35155j17432m3021
$$ -309674 -271883 -421304 -167885 167909 197135 358120 222985 -12170 -129602 -172623
4894a72623k3276j15229O9074l1437k8600J26374J44103J57724N0867K9733j59453
$$ -172623 -195899 -311128 -242054 -273491 -302091 -175717 -31614 126110 176977 206710 47257
4883D7257j23967Q8910R9936J74565j19761p3891p1338p7915r4818O583K41958
$$ 47257 -76710 12200 112136 286701 166940 93049 21711 -56204 -151022 -144439 97519
4872I7519J13476q5785o3347P8959M0729r2847J06749j0104M5156J22882L6334
$$ 97519 210995 125210 61863 140822 181551 88704 195453 185349 230505 353387 389721
4861C89721j72609q5602j42748q5475J17357j68208J14022n7134R3040m6551p9622
$$ 389721 217112 131510 -11238 -96713 20644 -147564 -33542 -90676 2364 -44187 -123809
4850a23809n4955O7915N6743p8348J50837K86959M3548j00710q9791k54285l1416
$$ -123809 -178764 -110849 -54106 -132454 18383 305342 348890 248180 158389 -95896 -127312
4839a27312J96493Q0473O3850J094J8045k25057k08267O112M09178O5291k96888
$$ -127312 69181 149654 213504 214598 232643 7586 -200681 -194569 214609 279900 -16988
4828a6988n2124j42533k47879J09194Q2775L6809p1333O3036M9443J75928P416
$$ -16988 -69112 -211645 -459524 -350330 -267555 -230746 -302079 -239043 -189600 -13672 -6256
4817f256P2302O231O0028K48779j55054r0723J74154o0667l4817p4311n7002K52133
$$ -6256 66046 72277 132305 381084 226030 135307 309461 248794 213977 139666 82664 334797
4805C34797q4589k28345j62347q7444J81643q985m0070n4866K4102j72605j56281
$$ 334797 250208 21863 -140484 -227928 -46285 -55270 -95340 -150206 -126104 -298709 -454990
4794d54990J47079M08814M5648j45442k06818P7427K01318P7817M9184k33559
$$ -454990 -307911 100903 146551 1109 -205709 -128282 73036 150853 200037 -33522
4784c3522n3496Q3796O7651K19755J91896R2654j47413j97265m01098O5025L43803
$$ -33522 -87018 -3222 64429 284184 476080 568734 421321 224056 -177042 -112017 231786
4773B31786N8372q1856r751J4289J234j5127P3528J84291J33227j12584j63939
$$ 231786 290158 208302 198551 212840 214074 198947 272475 456766 589993 477409 313470
4762C13470j63277j46802j02494p86K89267K53061k12010l33356l32424M6854
$$ 313470 150193 3391 -99103 -99889 189378 442439 230429 -102927 -435351 -388497
4752c88497J8202J21909K71953M4850J8947n1995j21424J9268j54388n989Q7740
$$ -388497 -370295 -248386 23567 68417 87364 35369 -86055 -66787 -221175 -227164 -139424
4741a39424p3671N5164J35310N0486n6002j02459p9760K0413K79334L07589j90495
$$ -139424 -213095 -157931 -22621 27865 -28137 -130596 -210356 -189943 89391 396980 206485
4730B06485r2079q7608J9684k7046m0002J44385k7552q6224k35415j89829L13008
$$ 206485 114406 26798 46482 19436 -20566 123819 96267 10043 -225372 -415201 -102193
4719a02193K30842R7291L7277J21364p8412j89534o6761k24999j26778j60020
$$ -102193 128649 225940 263217 384581 306169 116635 49874 -175125 -301903 -461923
4709d61923m1007J23271K51357K11574o8679p6982P7789R6459K58379q7303j95323
$$ -461923 -502930 -379659 -128302 83272 14593 -62389 15400 111859 370238 282935 87612
4698H7612k31376l2328L9726Q6289L2616q3261p1637J540k9085O6383j11359J28857
$$ 87612 -143764 -176092 -136366 -50077 -17461 -100722 -172359 -170819 -199904 -133521 -244880 -116023
4686a16023J26419j892j0257J33443R1880p5482J28803R6301o1609k91549r6052
$$ -116023 10396 8504 -1753 131690 223570 148088 276891 373192 311583 20034 -76018
4675g6018l9172N219k3588P2503J89338k51891j85497k1180K35062M8138Q8790
$$ -76018 -115190 -109971 -133559 -61056 128282 -123609 -309106 -330286 -95224 -47086 41704
4664D1704j61463j31063k8560j9521N735o6201J49135J23452J21136j57894k55007
$$ 41704 -119759 -250822 -279382 -298903 -293168 -359369 -210234 -86782 34354 -123540 -378547
4653c78547J15405M5271P1355J05394P6649p1544R7926l7134o9725J348j15338
$$ -378547 -263142 -217871 -146516 -41122 35527 -36017 61909 24775 -44950 -43602 -158940
4642a58940j10571j6808q3154K25710L25539J64248J03764K6847k96431r9617
$$ -158940 -269511 -286319 -369473 -143763 181776 346024 449788 476635 180204 80587
4632H0587M9560j4280j24022k85305R9953K20042k4891p9608j43330J1841J8962
$$ 80587 130147 115867 -8155 -293460 -193507 26535 1644 -77964 -221294 -209453 -190491
4621a90491j36484J31713k3909P5648j638j25858j81878r4639M6249M26777K20617
$$ -190491 -326975 -195262 -219171 -143523 -145161 -271019 -452897 -547536 -501287 -74510 146107
4610A46107q3981J77422J7954r496m88262j01248K12680J50036j36130o0709j31400
$$ 146107 62126 239548 257502 248006 -240256 -341504 -128824 21212 -114918 -175627 -307027
4599c07027J37336J32210o9400n2612O7530j56422J04698q4790j4311K56446P3846
$$ -307027 -169691 -37481 -106881 -159493 -91963 -248385 -143687 -228477 -242788 13658 87504
4588H7504j08700j87471l5221N4525j37593K29877q8177r2349J74087L105J60873
$$ 87504 -21196 -208667 -243888 -189363 -326956 -97079 -185256 -277605 -103518 -100413 60460
4577F0460M2995r902r2820j73588L65391P2389j69210k31891j07435J83402m7398
$$ 60460 103455 93553 733 -172855 192536 264925 95715 -136176 -243611 -60209 -107607
4566a07607n9684K65644K15420k31655j03631J02893j54622j61564j00550n2521
$$ -107607 -167291 98353 313773 82118 -21513 81380 -73242 -234806 -335356 -387877
4556c87877K6395J75179K89119J80492O0425j35443l72688j81072j11526l7968
$$ -387877 -361482 -186303 102816 283308 343733 208290 -164398 -345470 -456996 -494964
4546d94964K07151Q2851l4443K0959o6396K28537Q2558j08727j95316j22149j3957
$$ -494964 -287813 -204962 -239405 -218446 -284842 -56305 26253 -82474 -277790 -399939 -413896
4535d13896O8082j36032m9117J64671J78633M01583J1447j93038J0894J6270o3057
$$ -413896 -345814 -481846 -530963 -366292 -187659 213924 225371 32333 43227 59497 -3560
4524c560J46934M7612J11115k1911O0818O9324j66611j07911N3627l09514j39541
$$ -3560 143374 190986 302101 280190 341008 410332 243721 135810 189437 -120077 -259618
4513b59618R4535j35008k44358M995J94271J17236J55333J41676J6954j17238
$$ -259618 -165083 -300091 -544449 -539454 -345183 -227947 -72614 69062 86016 -31222
4503c1222O5650L4249m2593j10830J80727L9575k07298j03391R3767J01622L37224
$$ -31222 34428 68677 26084 -84746 95981 135556 -71742 -175133 -81366 20256 357480
4492C57480J05955l72540k00398j56653j1114J49228J57764R7880J52241j84508
$$ 357480 463435 90895 -109503 -266156 -277270 -128042 29722 127602 279843 95335
4482I5335J18106J1293j77597p4400K3490Q0339j89602J2445P5395K22280r5134
$$ 95335 213441 224734 47137 -27263 -3773 76566 -113036 -100591 -25196 197084 101950
4471A01950l34150n4280j55242J81587L74147M2003O9054j15251j71741l08815
$$ 101950 -232200 -286480 -441722 -260135 114012 156015 225069 109818 -61923 -370738
4461c70738K3754J7466N4566p8186K39123K74198k03240j01571O5837p8791j67183
$$ -370738 -346984 -329518 -274952 -353138 -114015 160183 -43057 -144628 -78791 -157582 -324765
4450c24765K08383L01250R956r3916j45268k62333J74709r4629J25161k1186j30136
$$ -324765 -116382 184868 194824 100908 -44360 -306693 -131984 -226613 -101452 -122638 -252774
4439b52774k27040j65428M6507P6195J66416J63724L808j19731o9870K52181M2679
$$ -252774 -479814 -645242 -598735 -522540 -356124 -192400 -188592 -308323 -378193 -126012 -83333
4428h3333K8226j05745q2159j00898P8269M64722Q0659k24038j89747m1439l2791
$$ -83333 -55107 -160852 -243011 -343909 -265640 199082 279741 55703 -134044 -175483 -208274
4417b08274N8802j52782K01277J90294l12239j22736R7540K05551l8163N9835
$$ -208274 -149472 -302254 -100977 89317 -222922 -345658 -248118 -42567 -80730 -20895
4407b0895k28277r4454J33157L42931N3423l12037o9189M6130J89126j07323j40162
$$ -20895 -249172 -343626 -210469 132462 185885 -126152 -195341 -149211 39915 -67408 -207570
4396b07570L4580M9560R1434k10809J00293K78083N2871k24301j93601P8250n7093
$$ -207570 -172990 -123430 -31996 -242805 -142512 135571 188442 -35859 -229460 -151210 -208303
4385b08303K0917M5842J99032q2182o2534o9723n44o0944j27150J25676J87010
$$ -208303 -187386 -141544 57488 -24694 -87228 -156951 -157495 -218439 -345589 -219913 -32903
4374c2903j6380k53556k44545q7666K72641n1946R6328M8532M5170J08865M4987
$$ -32903 -49283 -302839 -547384 -635050 -362409 -414355 -318027 -269495 -224325 -115460 -70473
4363g0473L4669K8365J13447J36912l5109j0257j60188j12893M0758O4550j27834
$$ -70473 -35804 -7439 106008 242920 207811 197554 37366 -75527 -34769 29781 -98053
4352i8053j16168P5751K04853J04399j9851Q1271L0923J3315j08293J46287R1265
$$ -98053 -214221 -138470 66383 170782 150931 232202 263125 276440 168147 314434 405699
4341D05699k72654j46432K18630r2330k26479J49515J01281k74706j63113k2175
$$ 405699 133045 -13387 205243 112913 -113566 35949 137230 -137476 -300589 -322764
4331c22764J35848J30453k2522J67152J51747M0466m9531j41035j17714J62716
$$ -322764 -186916 -56463 -78985 88167 239914 280380 230849 89814 -27900 134816
4321A34816M3431R915N1759j11034O5334J9883Q6614j50028k98095m3223j40l0287
$$ 134816 178247 188162 239921 128887 194221 214104 300718 150690 -147405 -190628 -190768 -221055
4309b21055J54466j7584k08430P3196K63120j22765k67371K347J98742J62544
$$ -221055 -66589 -84173 -292603 -219407 43713 -79052 -346423 -344076 -145334 17210
4299A7210M7700O0855n4826M8918j30496M0721L6697k32854k2619K58978K4946
$$ 17210 64910 125765 70939 119857 -10639 30082 66779 -166075 -188694 70284 95230
4288I5230j44089j2745j880j44598j69420O2523J3293R5476J9952p5004P450J61386
$$ 95230 -48859 -61604 -63484 -208082 -377502 -314979 -301686 -206210 -186258 -261262 -253812 -92426
4276i2426Q4400j57654J1727j63262p7133K40839K66024q7081J49682J34431L5330
$$ -92426 -8026 -165680 -153953 -317215 -394348 -153509 112515 25434 175116 309547 344877
4265C44877l46862k2516K03220J99640j59574j6569m4707j11353k82351j41077
$$ 344877 -1985 -24501 178719 378359 218785 202216 157509 46156 -236195 -377272
4255c77272L4060J72582J21304L2121O758k70681o4865J90487J15763l4071j12302
$$ -377272 -343212 -170630 -49326 -17205 -10447 -281128 -345993 -155506 -39743 -73814 -186116
4244a86116O4273k5291J16780J27621o4321j17388J10357n7246l3263N1047k5733
$$ -186116 -121843 -147134 -30354 97267 32946 -84442 25915 -31331 -64594 -13547 -39280
4233c9280k7833j50010j64492K5876J09857R5133o260k109k25663l4688L9585
$$ -39280 -67113 -217123 -381615 -355739 -245882 -150749 -157009 -159118 -384781 -419469 -379884
4222c79884K12066J21984J22159K64601r1129q3773n503k25061j9208P3585m3036
$$ -379884 -167818 -45834 76325 340926 249797 166024 160521 -64540 -83748 -10163 -53199
4211e3199j7002m0530r697M7411P5878j5409k7062p6115l13652m5657J14112J61952
$$ -53199 -70201 -110731 -120428 -73017 2861 -12548 -39610 -115725 -429377 -475034 -360922 -198970
4199a98970P6748J66595k60525J51634M1151j63019o8111J86375R900k57811p8568
$$ -198970 -122222 44373 -216152 -64518 -23367 -186386 -254497 -68122 -58222 -316033 -394601
4188c94601L24264J57318R5343J001L1319P4570m8159L1542Q8371j33267P429
$$ -394601 -70337 86981 182324 183325 214644 289214 241055 272597 360968 227701 235130
4177B35130O4688q3797j10214j32858J8624L4972N1533k5411J53846r3402l89326
$$ 235130 299818 216021 105807 -27051 -8427 26545 78078 52667 206513 113111 -276215
4166b76215j43485O7808N5548j64160L13042P1928j54968O7698J71193N4932l4001
$$ -276215 -419700 -351892 -296344 -460504 -147462 -75534 -230502 -162804 8389 63321 29320
4155B9320O2935J59057k7462l06879R6259L65593K79430k06805L544j13263j25775
$$ 29320 92255 251312 223850 -83029 13230 378823 658253 451448 454992 341729 215954
4144B15954j64628m33762m7933K65598M0426j8128n7856j45375K27566j49169
$$ 215954 51326 -382436 -430369 -164771 -124345 -142473 -200329 -345704 -118138 -267307
4134b67307l07528N365J93391J50085r6453L880K55333p3111k751r3266R7552
$$ -267307 -574835 -569470 -376079 -225994 -322447 -318567 -63234 -136345 -139096 -232362 -134810
4123a34810Q5728j33872Q7334J55189k3722j4101j04005j90044j0012M5734j735
$$ -134810 -49082 -182954 -95620 59569 35847 21746 -82259 -272303 -282315 -236581 -238316
4112b38316K21343J04869p1873j12487J48875K7188l58668j8511q6254K9396K20626
$$ -238316 -16973 87896 16023 -96464 52411 79599 -279069 -297580 -383834 -354438 -133812
4101a33812L34765K28020j90305m8601J15674K65872m4076k14217j70173j59300
$$ -133812 200953 428973 238668 190067 305741 571613 527537 313320 143147 -16153
4091a6153J26524J93460Q7060j17076j66009m8605m2246J27141l7600P4586J17157
$$ -16153 110371 303831 390891 273815 107806 59201 16955 144096 106496 181082 298239
4080B98239l6972k23648m2020m4661N7197J07569Q8434n1767O49K7519k95716
$$ 298239 261267 37619 -4401 -49062 8135 115704 204138 152371 153020 180539 -115177
4069a15177r5812J37447J78998o4985j25973k393Q5177R6761q1356k1453J06559
$$ -115177 -210989 -73542 105456 40471 -85502 -87895 -2718 94043 12687 -8766 97793
4058I7793j16780J46851L56062j1535j71482k62373m72308P1526J69565J24028
$$ 97793 -18987 127864 483926 472391 300909 38536 -433772 -362246 -192681 -68653
4048f8653O0401K8422J73422m268n6961k5782k3183k32002J2040L3612j50454
$$ -68653 -8252 20170 193592 189324 132363 106581 83398 -148604 -136564 -102952 -253406
4037b53406p3183L0845J47260J46218o1276j5939j72966k01850j9046K95801j05612
$$ -253406 -326589 -295744 -148484 -2266 -63542 -79481 -252447 -454297 -473343 -177542 -283154
4026b83154o5033M3494K9340j49101N6123J80376J37997R7129j90605n953m1958
$$ -283154 -348187 -304693 -275353 -424454 -368331 -187955 -49958 47171 -143434 -149387 -191345
4015a91345l2978J41711Q6094P7330J11212k01034j62911O1542K8503q9801K5519
$$ -191345 -224323 -82612 3482 80812 192024 -9010 -171921 -110379 -81876 -171677 -146158
4004a46158L14351J97583P4603j13649k72719l68212r8214M969P2108L14888L64524
$$ -146158 168193 365776 440379 326730 54011 -314201 -412415 -407446 -335338 -20450 344074
3993C44074q4356J34106J03610n8562j27973j44421j21420N5544J61188j46596
$$ 344074 259718 393824 497434 438872 310899 166478 45058 100602 261790 115194
3983A15194j12077J18784L9218j4840O0506n204r8914j65573O9584M2485q735
$$ 115194 3117 121901 161119 146279 206785 201581 102667 -62906 6678 49163 40428
3972D0428M8974j47270J97507P2680m32452j86771k8176K25209l8579p141O7504
$$ 40428 89402 -57868 139639 212319 -220133 -406904 -435080 -209871 -248450 -255591 -188087
3961a88087k56041K0836K60101R1187M2270p4629k58976Q8984L31555M1437j8230
$$ -188087 -444128 -423292 -163191 -72004 -29734 -104363 -363339 -274355 57200 98637 80407
3950H0407n2787j7366k3564j34726j31654K12865J16697r1065k916J7229j99817
$$ 80407 27620 10254 -13310 -148036 -279690 -66825 49872 -41193 -44109 -26880 -226697
3939b26697j34674J81649K77996q6692K77587J946k21412k680j6783O0399j16183
$$ -226697 -361371 -179722 98274 11582 289169 291115 69703 67023 50240 110639 -5544
3928e544j24536P1411J16295l0279o6971P2013J55275J10823l1167j58884P3738
$$ -5544 -130080 -58669 57626 27347 -39624 32389 187664 298487 267320 108436 182174
3917A82174L4693J14357k08934j43675q454k26118m0657J07538Q0220Q2857j99555
$$ 182174 216867 331224 122290 -21385 -29839 -255957 -296614 -189076 -108856 -25999 -225554
3906b25554K2484J63310J21856j73723k45110p4169K79425M7725J04797Q9074
$$ -225554 -203070 -39760 82096 -91627 -336737 -410906 -131481 -83756 21041 110115
3896A10115J64r7531j6755L10925R3600l02880j29749O2396o6553J01598k13551
$$ 110115 110279 12748 -4007 306918 400518 97638 -32111 30285 -36268 65330 -148221
3885a48221p5345L05502Q3828L1370J01460q3723m32110l68855K29730J20355
$$ -148221 -223566 81936 165764 197134 298594 214871 -217239 -586094 -356364 -236009
3875b36009Q1252L20511P5535k49642O5666K3202o4137j74211m1075O8178l4N4354
$$ -236009 -154757 165754 241289 -8353 57313 80515 16378 -157833 -198908 -130730 -130764 -76410
3863g6410K05996r1076r2721J17314P0287j55914P7010J57648j1317J77902k3152
$$ -76410 129586 38510 -54211 63103 133390 -22524 54486 212134 200817 378719 355567
3852C55567k64963M2376j01125l32313q4798L6126o3749L17436K66048j16955
$$ 355567 90604 132980 31855 -300458 -385256 -349130 -412879 -95443 170605 53650
3842E3650J9592K8006J09124J79261n7316k62954j66021K73455K63805j16222
$$ 53650 73242 101248 210372 389633 332317 69363 -96658 176797 440602 324380
3832C24380p941q9669P3495m4587j00997j56815j65901N0574N4151j53563l0232
$$ 324380 316439 226770 300265 255678 154681 -2134 -168035 -117461 -63310 -216873 -247105
3821b47105K10204j1557j10598M720K23889j49321j10783K73881J44845k47584
$$ -247105 -36901 -48458 -159056 -154336 69553 -79768 -190551 83330 228175 -19409
3811a9409m801m753l3949J59174n2775k30852O1717j54949P7931p3286J30303
$$ -19409 -24210 -28963 -62912 96262 43487 -187365 -125648 -280597 -202666 -275952 -145649
3800a45649l4814k30999J46493J46896j77551J3022J75290J79704K56649O5954
$$ -145649 -180463 -411462 -264969 -118073 -295624 -282602 -107312 72392 329041 394995
3790C94995j844j11550j83701k03660J2510j46801o0801k0528k9471J03271M46537
$$ 394995 393151 281601 97900 -105760 -93250 -240051 -300852 -321380 -350851 -247580 198957
3779A98957k04882N5518J17098J20352k12280k82670J97218L9804J13444j42507
$$ 198957 -5925 49593 166691 287043 74763 -207907 -10689 29115 142559 52
3769E2j75726L5639j18005j20239M288q3059K3449J44283L13820M0044j71470
$$ 52 -175674 -140035 -258040 -378279 -373991 -457050 -433601 -289318 24502 64546 -106924
3758a06924N0609N9845k09002j5858K05108K08294j56475j62266p4764J14353
$$ -106924 -56315 3530 -205472 -221330 -16222 192072 35597 -126669 -201433 -87080
3748h7080J06690P0612J79401j5691l9074m9453K2253P7775r6729R400k2656l13575
$$ -87080 19610 90222 269623 253932 214858 165405 187658 265433 168704 178104 155448 -158127
3736a58127j42568P0915J43846Q3294K4904o1817N8755M0396l6859k32646J89181
$$ -158127 -300695 -229780 -85934 -2640 22264 -39553 19202 59598 22739 -209907 -20726
3725b0726J11107l22270R5074J23197K3348K02748j55063k37510M607l8209l3466
$$ -20726 90381 -231889 -136815 -13618 9730 212478 57415 -180095 -175488 -213697 -247163
3714b47163o7165N24099K06607O2108P8915j62301j36973o3479J83082j02981
$$ -247163 -314328 209771 416378 478486 557401 395100 258127 194648 377730 274749
3704B74749k26602q7577m3014k01456j96487J19660L28402K57952J51493j22521
$$ 274749 48147 -39430 -82444 -283900 -480387 -360727 -32325 225627 377120 254599
3694B54599l31620j80178K53087J73982n2066L14546K72077l38013k64034k17544
$$ 254599 -77021 -257199 -4112 169870 117804 432350 704427 366414 102380 -115164
3684a15164J42668L08353P3161l15323k56047O7728n3971J17732j5373l0984J72002
$$ -115164 27504 335857 409018 93695 -162352 -94624 -148595 -30863 -46236 -77220 94782
3673I4782J47139j77590m9150Q8798J25794j09181r9005N9135M5204o1610K23916
$$ 94782 241921 64331 15181 103979 229773 120592 21587 80722 125926 64316 288232
3662B88232l133j95626Q4179Q4355j90158p5724L1342l3828k51669j04449L7406
$$ 288232 285099 89473 173652 258007 67849 -7875 23467 -10361 -262030 -366479 -329073
3651c29073o7304o2767L0742P0242K0031L5924O3734J07895M8574N8042j88498
$$ -329073 -396377 -459144 -428402 -358160 -338129 -302205 -238471 -130576 -82002 -23960 -212458
3640b12458j7062K58146J90792n7089j35755M8758j9011N4231P8145J09364N3394
$$ -212458 -229520 28626 219418 162329 26574 75332 56321 110552 188697 298061 351455
3629C51455k56396k90599j18717O9465R8935N8322p3890P4475j23262K1318J07545
$$ 351455 95059 -195540 -314257 -244792 -145857 -87535 -161425 -86950 -210212 -188894 -81349
3618h1349p3845K9339j37601j90440n8020L78158L780N5106l541J15488L6710
$$ -81349 -155194 -125855 -263456 -453896 -511916 -133758 -129978 -74872 -78413 37075 73785
3607G3785J34996n5006l22187k05426q7990q9296o3365o043L09849K66467m7557
$$ 73785 208781 153775 -168412 -373838 -461828 -551124 -614489 -620532 -310683 -44216 -91773
3596i1773o4269K56463Q3736j16458J04830J70502q7940j95388J6416J74029k7282
$$ -91773 -156042 100421 184157 67699 172529 343031 255091 59703 76119 250148 222866
3585B22866j64766j25708j002L1023j97797j1598q9640o8402n3053J62307J18778
$$ 222866 58100 -67608 -68610 -37587 -235384 -246982 -336622 -405024 -458077 -295770 -176992
3574a76992J58997O4879j24539K55900L05410m3705j85212q0922j024J70924j23114
$$ -176992 -17995 46884 -77655 178245 483655 439950 254738 173816 172792 343716 220602
3563B20602J1620j37306k55764J2073L84065j15626J59997l4958j42880J46664
$$ 220602 232222 94916 -160848 -148775 235290 119664 279661 244703 101823 248487
3553B48487J98701k01466j18902k0553Q9678L5129l04425k18231j28675M9220
$$ 248487 447188 245722 126820 106267 195945 231074 -73351 -291582 -420257 -371037
3543c71037P4276O9902o4987J89902L92148m7948l59427j76557j54916K00129
$$ -371037 -296761 -226859 -291846 -101944 290204 242256 -117171 -293728 -448644 -248515
3533b48515K16407Q5778j2342R0218J7874J7277j65582k5533J22393L6490j78456
$$ -248515 -32108 53670 41328 131546 149420 166697 1115 -24418 97975 134465 -43991
3522d3991k02080j97601j1908K65150K68056J66697L2360j90582k49897l64861
$$ -43991 -246071 -443672 -455580 -190430 77626 244323 276683 86101 -163796 -528657
3512e28657l7681K91022L08477R8467J9850j21963r6592n086o2215r6115M2269
$$ -528657 -566338 -275316 33161 131628 151478 29515 -67077 -72163 -134378 -230493 -188224
3501a88224J47909J49354J65672r4784J40935q8717N7102k07476n4260J00453
$$ -188224 -40315 109039 274711 179927 320862 232145 289247 81771 27511 127964
3491A27964n5241k39738k37545K50475O3502q899k28651j2889J57586j17902j24690
$$ 127964 72723 -167015 -404560 -154085 -90583 -99482 -328133 -341022 -183436 -301338 -426028
3480d26028J25535K62429l2254m8345J39796K34151k62N9796j04002k15063n2847
$$ -426028 -300493 -38064 -70318 -118663 21133 255284 255022 314818 210816 -4247 -57094
3469e7094N6133j12471L3993J399K6891J67256k33894j40794j14706J36153K90885
$$ -57094 -961 -113432 -79439 -78040 -51149 116107 -117787 -258581 -373287 -237134 53751
3458E3751Q831j06401n131k2648K2283J4401J88575J5418j76060q2557k24159
$$ 53751 62582 -43819 -48950 -71598 -49315 -34914 153661 169079 -6981 -89538 -313697
3447c13697l937O8541K1720K72921q1183j26432K19943j85j26728P721Q5808K1083
$$ -313697 -317634 -249093 -227373 45548 -35635 -162067 57876 57691 -69037 -61316 24492 45575
3435D5575o8856k33482Q8845K80346N08232j67108k72477l91993j17611L77139
$$ 45575 -23281 -256763 -167918 112428 620660 453552 181075 -210918 -328529 48610
$$ [...]
##END NTUPLES=NMR SPECTRUM
##END=
