##TITLE=Analysis number 321690
Compound Code cc 54703
Book Reference 439/177/37
Project Code adrs
Chemist Name ronp
##JCAMPDX= 6.0         $$ Bruker NMR JCAMP-DX V2.0
##DATA TYPE= NMR SPECTRUM
##DATA CLASS= NTUPLES
##ORIGIN= Bruker BioSpin GmbH
##OWNER= nmr
$$ XWIN-NMR		Version 3.5
$$ Tue Aug 22 14:16:30 2006 GMT Daylight Time (UT+1h)  MAYBRIDGE\nmr@NMR_250MHZ
##.OBSERVE FREQUENCY= 250.131544655141
##.OBSERVE NUCLEUS= ^1H
##.ACQUISITION MODE= SIMULTANEOUS (DQD)
##.ACQUISITION SCHEME= undefined
##.AVERAGES= 16
##.DIGITISER RES= 18
##SPECTROMETER/DATA SYSTEM= dpx250
##.PULSE SEQUENCE= zg30
##.SOLVENT NAME= CDCl3
##.SHIFT REFERENCE= (INTERNAL, CDCl3, 0, 16.4538)
##AUDIT TRAIL= $$ (NUMBER, WHEN, WHO, WHERE, WHAT)
$$ ##TITLE= Audit trail, XWIN-NMR		Version 3.5
$$ ##JCAMPDX= 5.01
$$ ##ORIGIN= Bruker BioSpin GmbH
$$ ##OWNER= nmr
$$ C:\u/data/dgb/nmr/ADRS/1410/pdata/1/auditp.txt
$$ ##AUDIT TRAIL=  $$ (NUMBER, WHEN, WHO, WHERE, WHAT)
(   1,<2006-08-22 14:16:05.21 +100>,<MAYBRIDGE\nmr>,<NMR_250MHZ>,
      <created by zg, POWCHK disabled, PULCHK disabled
       configuration hash MD5:
       E2 DF 36 D8 04 B2 41 60 5A D7 A3 38 5A 4B D0 FE
       data hash MD5: 64K
       0F 59 FD E2 8B B4 58 F1 EE 17 7B EE 92 A4 FC 45>)
(   2,<2006-08-22 14:16:21.10 +100>,<MAYBRIDGE\nmr>,<NMR_250MHZ>,
      <Start of raw data processing
       ef LB = 0.3 FT_mod = 6 PKNL = 1 SI = 32K 
       data hash MD5: 32K
       75 CF AA 69 7D 57 0C 62 14 F8 EA 0A 00 AE D0 43>)
(   3,<2006-08-22 14:16:22.69 +100>,<MAYBRIDGE\nmr>,<NMR_250MHZ>,
      <apk 
       data hash MD5: 32K
       6E 0A 71 31 FA 4F 33 83 29 71 EB C9 AF D1 F3 26>)
(   4,<2006-08-22 14:16:23.46 +100>,<MAYBRIDGE\nmr>,<NMR_250MHZ>,
      <abs ABSG = 5 
       data hash MD5: 32K
       E2 C1 E6 01 DB 56 AB 85 AD 22 BD 98 C7 B3 98 C4>)
$$ ##END=
$$ 
$$ hash MD5
$$ FD 73 89 32 9D 80 1E 17 3E 15 99 7D 60 37 B9 15
##$RELAX= 
##$RELAX= 
##$RELAX= 
##$RELAX= 
##$RELAX= 
##$RELAX= 
##$RELAX= 
$$ Bruker specific parameters
$$ --------------------------
##$DU= <C:\u>
##$EXPNO= 1410
##$NAME= <ADRS>
##$PROCNO= 1
##$TYPE= <nmr>
##$USER= <dgb>
##$AMP= (0..31)
100 100 100 100 100 100 100 100 100 100 100 100 100 100 100 100 100 100 
100 100 100 100 100 100 100 100 100 100 100 100 100 100 
##$AQSEQ= 0
##$AQ_mod= 3
##$AUNM= <au_zg>
##$AUTOPOS= <42 >
##$BF1= 250.13
##$BF2= 250.13
##$BF3= 250.13
##$BF4= 250.13
##$BF5= 500.13
##$BF6= 500.13
##$BF7= 500.13
##$BF8= 500.13
##$BYTORDA= 1
##$CFDGTYP= 0
##$CFRGTYP= 5
##$CHEMSTR= <none>
##$CNST= (0..31)
1 1 145 1 1 1 1 1 1 1 1 1 1 1 1 1 1 1 1 1 1 1 1 1 1 1 1 1 1 1 1 1 
##$CPDPRG= <>
##$CPDPRG1= <>
##$CPDPRG2= <>
##$CPDPRG3= <>
##$CPDPRG4= <mlev>
##$CPDPRG5= <mlev>
##$CPDPRG6= <mlev>
##$CPDPRG7= <mlev>
##$CPDPRG8= <mlev>
##$CPDPRGB= <>
##$CPDPRGT= <>
##$D= (0..31)
0 1 0 0 0 0 0 0 0 0.06 0 0 0 0 0 0 0.0002 0 0 0 0 0 0 0 0 0 0 0 0 0 0 
0 
##$DATE= 1156252564
##$DBL= (0..7)
120 120 120 120 120 120 120 120 
##$DBP= (0..7)
150 150 150 150 150 150 150 150 
##$DBP07= 0
##$DBPNAM0= <>
##$DBPNAM1= <>
$$ [...]
##$SUBNAM7= <"">
##$SUBNAM8= <"">
##$SUBNAM9= <"">
##$SW= 20.6930455092707
##$SWIBOX= (0..15)
0 0 3 0 0 0 0 0 0 0 0 0 0 0 0 0 
##$SW_h= 5175.983436853
##$TD= 65536
##$TD0= 1
##$TE= 296.16
##$TE2= 300
##$TE3= 300
##$TEG= 300
##$TL= (0..7)
0 120 120 120 120 120 120 120 
##$TP= (0..7)
150 150 150 150 150 150 150 150 
##$TP07= 0
##$TPNAME0= <>
##$TPNAME1= <>
##$TPNAME2= <>
##$TPNAME3= <>
##$TPNAME4= <>
##$TPNAME5= <>
##$TPNAME6= <>
##$TPNAME7= <>
##$TPOAL= (0..7)
0.5 0.5 0.5 0.5 0.5 0.5 0.5 0.5 
##$TPOFFS= (0..7)
0 0 0 0 0 0 0 0 
##$TUNHIN= 0
##$TUNHOUT= 0
##$TUNXOUT= 0
##$USERA1= <user>
##$USERA2= <user>
##$USERA3= <user>
##$USERA4= <user>
##$USERA5= <user>
##$V9= 5
##$VALIST= <valist>
##$VCLIST= <CCCCCCCCCCCCCCC>
##$VD= 0
##$VDLIST= <DDDDDDDDDDDDDDD>
##$VPLIST= <PPPPPPPPPPPPPPP>
##$VTLIST= <TTTTTTTTTTTTTTT>
##$WBST= 1024
##$WBSW= 4
##$XGAIN= (0..3)
0 0 0 0 
##$XL= 0
##$YL= 0
##$YMAX_a= 471775
##$YMIN_a= -505417
##$ZGOPTNS= <>
##$ZL1= 120
##$ZL2= 120
##$ZL3= 120
##$ZL4= 120
##$ABSF1= 16.45385
##$ABSF2= -4.239323
##$ABSG= 5
##$ABSL= 3
##$ALPHA= 0
##$AQORDER= 0
##$ASSFAC= 0
##$ASSFACI= 0
##$ASSFACX= 0
##$ASSWID= 0
##$AUNMP= <proc_1d>
##$AZFE= 0.1
##$AZFW= 0.1
##$BCFW= 0
##$BC_mod= 0
##$BYTORDP= 0
##$COROFFS= 0
##$CY= 12.5
##$DATMOD= 1
##$DC= 0
##$DFILT= <>
##$DTYPP= 0
##$F1P= 14.0000005364418
##$F2P= -0.99999901652339
##$FCOR= 0.5
##$FTSIZE= 32768
##$FT_mod= 6
##$GAMMA= 0
##$GB= 0
##$INTBC= 1
##$INTSCL= 1
##$ISEN= 128
##$LB= 0.3
##$LEV0= 0
##$LPBIN= 0
##$MAXI= 10000
##$MC2= 0
##$MEAN= 0
##$ME_mod= 0
##$MI= 0
##$NCOEF= 0
##$NC_proc= -2
##$NLEV= 6
##$NOISF1= 0
##$NOISF2= 0
##$NSP= 0
##$NTH_PI= 0
##$NZP= 0
##$OFFSET= 16.45385
##$PC= 1
##$PHC0= 151.6641
##$PHC1= 9.683535
##$PH_mod= 1
##$PKNL= yes
##$PPARMOD= 0
##$PSCAL= 4
##$PSIGN= 0
##$REVERSE= no
##$SF= 250.130017045056
##$SI= 32768
##$SIGF1= 0
##$SIGF2= 0
##$SINO= 400
##$SIOLD= 32768
##$SREGLST= <1H.CDCl3>
##$SSB= 0
##$STSI= 32768
##$STSR= 0
##$SW_p= 5175.98343685301
##$SYMM= 0
##$S_DEV= 0
##$TDeff= 65536
##$TDoff= 0
##$TI= <Analysis number 999999
Compound Code 99
Book Reference 9
Project Code 9>
##$TILT= no
##$TM1= 0
##$TM2= 0
##$TOPLEV= 0
##$USERP1= <user>
##$USERP2= <user>
##$USERP3= <user>
##$USERP4= <user>
##$USERP5= <user>
##$WDW= 1
##$XDIM= 32768
##$YMAX_p= 305754259
##$YMIN_p= -120805
$$ End of Bruker specific parameters
$$ ---------------------------------
##NTUPLES= NMR SPECTRUM
##VAR_NAME=  FREQUENCY,     SPECTRUM/REAL,   SPECTRUM/IMAG
##SYMBOL=    X,             R,               I
##VAR_TYPE=  INDEPENDENT,   DEPENDENT,       DEPENDENT
##VAR_FORM=  AFFN,          ASDF,            ASDF
##VAR_DIM=   32768,         32768,           32768
##UNITS=     HZ,            ARBITRARY UNITS, ARBITRARY UNITS
##FACTOR=    0.157963299565203, 1,           1
##FIRST=     4115.60172904993, 0,            0
##LAST=      -1060.38170780308, 0,           0
##MIN=       -1060.38170780308, -120805,     0
##MAX=       4115.60172904993, 305754259,    0
$$ Real data points
##PAGE= N=1
##DATA TABLE= (X++(R..R)), XYDATA
$$ [...]
##PAGE= N=2
##DATA TABLE= (X++(I..I)), XYDATA
$$ plain form
16581 -196188 -168270 -170430 -190318 -188235 -225215 -234598 -204434 -204013 -233039 -236925 -233780 -244254 -272167
16568 -272167 -264692 -231632 -223494 -225245 -220446 -222507 -209308 -222102 -218377 -184083 -177919 -209861 -203530
16555 -203530 -217913 -192953 -159377 -174933 -214610 -234278 -213509 -206592 -201917 -167359 -184197 -224324
16543 -224324 -217651 -217062 -223622 -220862 -223988 -235012 -192537 -184616 -214933 -229400 -213480 -172521 -153897
16530 -153897 -149479 -149417 -149111 -165468 -203317 -253725 -243698 -217106 -216240 -191210 -189200 -205735 -218572
16517 -218572 -228608 -229419 -207606 -186691 -170216 -151603 -154305 -171157 -182540 -199026 -209584 -196445
16505 -196445 -218557 -215980 -223359 -221852 -239455 -242634 -247347 -228290 -207710 -180242 -216417 -242271
16493 -242271 -244345 -267918 -271435 -264337 -260729 -241219 -213265 -208113 -200333 -212801 -212951 -178066 -199133
$$ packed form
16581a96188K7918k160j9888K083l6980r383L0164M21k9026l886L145j0474k7913
16568b72167P475L3060Q138j751M799k061J3199j2794L725L4294O164l1942O331
16555b03530j4383K4960L3576j5556l9677j9668K0769O917M675L4558j6838m0127
16543b24324O673N89o560K760l126j1024M2475P921l0317j4467J5920M0959J8624
16530a53897M418O2L06j6357l7849n0408J0027K6592Q66K5030K010j6535j2837
16517b18572j0036q11K1813K0915J6475J8613k702j6852j1383j6486j0558J3139
16505a96445k2112K577p379J507j7603l179m713J9057K0580K7468l6175k5854
16493b42271k074k3573l517P098L608J9510K7954N152P780j2468j50L4885k1067
$$ plain form
16480 -199133 -217691 -252368 -254637 -230902 -226362 -228832 -244217 -264942 -263406 -254197 -241788 -230152
16468 -230152 -225810 -240173 -214594 -203318 -230172 -216221 -185244 -180682 -197713 -197472 -190003 -198893 -190269
16455 -190269 -183344 -173377 -198501 -206217 -177596 -174074 -169323 -176586 -157799 -141419 -136899 -145975 -145838
16442 -145838 -156349 -177644 -166912 -169220 -190038 -203475 -200215 -188748 -219319 -247970 -222015 -194562
16430 -194562 -193535 -178035 -160333 -162797 -181943 -186108 -184353 -177091 -188468 -199046 -180251 -155336
16418 -155336 -155214 -182344 -199753 -203741 -194694 -161482 -152519 -154045 -159688 -170002 -169474 -191745 -186285
16405 -186285 -156125 -181478 -199797 -171192 -144325 -135726 -195126 -217131 -196768 -171856 -156989 -161713
16393 -161713 -202501 -232091 -227686 -200781 -168888 -158695 -129077 -160874 -170154 -158065 -157543 -157879 -162662
$$ packed form
16480a99133j8558l4677k269K3735M540k470j5385k0725J536R209J2409J1636
16468b30152M342j4363K5579J1276k6854J3951L0977M562j7031K41P469q890Q624
16455a90269O925R967k5124p716K8621L522M751p263J8787J6380M520r076J37
16442a45838j0511k1295J0732k308k0818j3437L260J1467l0571k8651K5955K7453
16430a94562J027J5500J7702k464j9146m165J755P262j1377j0578J8795K4915
16418a55336J22k7130j7409l988R047L3212Q963j526n643j0314N28k2271N460
16405a86285L0160k5353j8319K8605K6867Q599n9400k2005K0363K4912J4867m724
16393a61713m0788k9590M405K6905L1893J0193K9618l1797r280J2089N22l36m783
$$ plain form
16380 -162662 -164831 -165899 -157314 -177330 -170341 -164414 -169788 -145502 -146642 -155149 -162541 -159249 -154244 -167768
16366 -167768 -175915 -169488 -176434 -176725 -174258 -193880 -198262 -180743 -182340 -190133 -203235 -166213 -127127
16353 -127127 -129120 -148680 -126001 -110404 -160333 -164685 -129556 -153523 -164207 -134265 -124232 -157696
16341 -157696 -145074 -151808 -141816 -88091 -80301 -102698 -117474 -145566 -178538 -198788 -177921 -170186
16329 -170186 -153334 -151587 -186102 -218085 -215159 -234302 -241886 -205313 -192192 -197221 -195348 -183698
16317 -183698 -157482 -150454 -184349 -223317 -229937 -178155 -148145 -149873 -120107 -118342 -134366 -135068 -120594
16304 -120594 -161232 -175360 -135054 -143449 -153795 -171607 -174405 -179419 -182169 -171369 -159670 -143644
16292 -143644 -142124 -136897 -118689 -142381 -144407 -112746 -105463 -108122 -111985 -100902 -94149 -114754 -151724
$$ packed form
16380a62662k169j068Q585k0016O989N927n374K4286j140q507p392L292N005j3524
16366a67768q147O427o946k91K467j9622m382J7519j597p793j3102L7022L9086
16353a27127j993j9560K2679J5597m9929m352L5129k3967j0684K9942J0033l3464
16341a57696J2622o734R992N3725P790k2397j4776k8092l2972k0250K0867P735
16329a70186J6852J747l4515l1983K926j9143p584L6573J3121n029J873J1650
16317a83698K6216P028l3895l8968o620N1782L0010j728K9766J765j6024p02J4474
16304a20594m0638j4128M0306q395j0346j7812k798n014k750J0800J1699J6026
16292a43644J520N227J8208k3692k026L1661P283k659l863J1083O753k0605l6970
$$ plain form
16279 -151724 -150074 -180387 -175045 -170457 -168898 -172809 -173629 -159191 -137460 -135261 -123653 -130594 -140418
16266 -140418 -139508 -167119 -186486 -184143 -162700 -175176 -186228 -197190 -213824 -171805 -154487 -158608
16254 -158608 -134177 -133127 -116320 -112135 -148831 -144453 -143763 -169823 -169570 -167482 -147036 -138965 -163005
16241 -163005 -127578 -108459 -115453 -140804 -137393 -104523 -117603 -131652 -142640 -137290 -109180 -108888
16229 -108888 -106385 -111687 -133793 -123835 -135040 -117550 -83744 -98665 -162677 -173907 -172783 -188580
16217 -188580 -166328 -146809 -175520 -172367 -136934 -115141 -121854 -149695 -151223 -81818 -64413 -119768
16205 -119768 -138450 -118121 -105425 -120015 -125802 -124032 -123003 -148655 -161122 -143048 -107411 -132916
16193 -132916 -147087 -147345 -145718 -151303 -156378 -142588 -135469 -167197 -136251 -117570 -164660 -166142 -163228
$$ packed form
16279a51724J650l0313N342M588J559l911q20J4438K1731K199J1608o941r824
16266a40418R10k7611j9367K343K1443j2476j1052j0962j6634M2019J7318m121
16254a58608K4431J050J6807M185l6696M378O90k6060K53K088K0446Q071k4040
16241a63005L5427J9119o994k5351L411L2870j3080j4049j0988N350K8110K92
16229a08888K503n302k2106R958j1205J7490L3806j4921o4012j1230J124j5797
16217a88580K2252J9519k8711L153L5433K1793o713k7841j528O9405J7405n5355
16205a19768j8682K0329J2696j4590n787J770J029k5652j2467J8074L5637k5505
16193a32916j4171k58J627n585n075J3790P119l1728L0946J8681m7090j482K914
$$ plain form
16180 -163228 -155512 -114055 -86997 -98736 -142239 -158048 -131560 -117008 -107488 -120051 -112510 -117216
16168 -117216 -136106 -143902 -137084 -124466 -122004 -128748 -115398 -88647 -106411 -81698 -87958 -105821
16156 -105821 -120199 -125036 -112007 -88611 -90595 -100859 -126272 -135425 -123352 -107380 -85693 -70330
16144 -70330 -76996 -100858 -118896 -141621 -128513 -112906 -121236 -129208 -127743 -122843 -105760 -112097 -103594
16131 -103594 -116199 -133079 -147883 -161829 -160253 -147025 -113973 -137191 -138581 -112395 -126788 -131333
16119 -131333 -94549 -88544 -144337 -185334 -176575 -180169 -161049 -130839 -126593 -96207 -108692 -119595
16107 -119595 -139608 -140846 -120792 -129393 -121726 -88361 -77607 -70819 -68721 -67669 -74953 -107055 -143048
16094 -143048 -156716 -173941 -197074 -201821 -178820 -127918 -107944 -114129 -147143 -154042 -120716 -112797
$$ packed form
16180a63228P716M1457K7058j1739m3503j5809K6488J4552R520j2563P541m706
16168a17216j8890p796O818J2618K462o744J3350K6751j7764K4713o260j7863
16156a05821j4378m837J3029K3396j984j0264k5413r153J2073J5972K1687J5363
16144g0330o666k3862j8038k2725J3108J5607q330p972J465M900J7083o337Q503
16131a03594j2605j6880j4804j3946J576J3228L3052k3218j390K6186j4393m545
16119a31333L6784O005n5793m0997Q759l594J9120L0210M246L0386j2485j0903
16107a19595k0013j238K0054q601P667L3365J0754O788K098J052p284l2102l5993
16094a43048j3668j7225k3133m747K3001N0902J9974o185l3014o899L3326P919
$$ plain form
16082 -112797 -92025 -79813 -86038 -105964 -69059 -83162 -95419 -100986 -88989 -100156 -102692 -91675
16070 -91675 -81993 -68151 -54779 -42090 -51662 -67675 -88903 -82921 -89133 -78058 -57884 -74210
16058 -74210 -86801 -118828 -156151 -139062 -109445 -108607 -124270 -114034 -93525 -54446 -81427 -105042
16046 -105042 -75830 -46037 -23801 -20840 -35110 -38714 -63866 -90409 -81997 -65306 -68925 -109090
16034 -109090 -114203 -115860 -88218 -89453 -126334 -155350 -135277 -130274 -134678 -131584 -150561 -148811 -147671
16021 -147671 -140416 -91171 -73183 -98063 -93362 -89704 -115239 -102155 -85716 -65745 -68346 -93207
16009 -93207 -85688 -85488 -94611 -93517 -93353 -127257 -137051 -105673 -106275 -98700 -106640 -67414 -57547 -74988
15995 -74988 -95446 -82225 -70197 -88642 -93114 -109729 -94907 -100682 -97620 -100590 -76866 -87162
$$ packed form
16082a12797K0772J2212o225j9926L6905j4103j2257n567J1997j1167k536J1017
16070i1675R682J3842J3372J2689r572j6013k1228N982o212J1075K0174j6326
16058g4210j2591l2027l7323J7089K9617Q38j5663J0236K0509L9079k6981k3615
16046a05042K9212K9793K2236K961j4270l604k5152k6543Q412J6691l619m0165
16034a09090n113j657K7642j235l6881k9016K0073N003m404L094j8977J750J140
16021a47671P255M9245J7988k4880M701L658k5535J3084J6439J9971k601k4861
16009i3207P519K00r123J094J64l3904r794L1378o02P575p940L9226R867j7441
15995g4988k0458J3221J2028j8445m472j6615J4822n775L062k970K3724j0296
$$ plain form
15983 -87162 -92981 -69337 -56064 -87646 -110390 -110904 -77296 -83344 -91703 -146638 -165207 -158436 -109403
15970 -109403 -98189 -106385 -107233 -98482 -102875 -107588 -106527 -90268 -106891 -119047 -119163 -104077 -96047
15957 -96047 -106001 -102448 -110120 -108104 -126381 -111145 -82246 -98470 -95971 -85515 -101190 -113667 -86211
15944 -86211 -54638 -37908 -65701 -80850 -89908 -75419 -62398 -69637 -93046 -66126 -50429 -49167
15932 -49167 -35757 -38513 -50694 -51174 -34210 -36775 -60943 -83944 -106271 -105729 -113684 -101280 -106328
15919 -106328 -96215 -86369 -83481 -54646 -45090 -69436 -68421 -99928 -122562 -123424 -117451 -107123 -106782
15906 -106782 -114605 -113165 -78652 -45872 -40971 -52180 -67030 -80752 -110974 -120000 -122618 -126083 -91229
15893 -91229 -76841 -116530 -127697 -129443 -103512 -105881 -91267 -57190 -36137 -58434 -50258 -56617
$$ packed form
15983h7162n819K3644J3273l1582k2744n14L3608o048q359n4935j8569O771M9033
15970a09403J1214q196q48Q751m393m713J061J6259j6623j2156j16J5086Q030
15957i6047r954L553p672K016j8277J5236K8899j6224K499J0456j5675j2477K7456
15944h6211L1573J6730k7793j5149r058J4489J3021p239k3409K6920J5697J262
15932d9167J3410k756j2181m80J6964k565k4168k3001k2327N42p955J2404n048
15919a06328J0113R846K888K8835R556k4346J015l1507k2634q62N973J0328L41
15906a06782p823J440L4513L2780M901j1209j4850j3722l0222r026k618l465L4854
15893i1229J4388l9689j1167j746K5931k369J4614L4077K1053k2297Q176o359
$$ plain form
15881 -56617 -70007 -86267 -98014 -93908 -121414 -116192 -87415 -61850 -67722 -62150 -77224 -73079 -48845
15868 -48845 -41117 -55037 -72287 -75254 -68785 -75305 -48957 -48377 -53236 -49427 -51450 -39393 -6876
15855 -6876 -2958 -39083 -45655 -22039 -41923 -90691 -96740 -104132 -87029 -43212 -33141 -51819 -76546
15842 -76546 -92140 -80170 -74969 -70893 -68600 -45761 -75945 -91698 -92838 -66208 -53218 -52245 -81023
15829 -81023 -111162 -106674 -96205 -61270 -78822 -111361 -98971 -66142 -63741 -40670 -60712 -58082
15817 -58082 -39945 -48595 -63004 -62064 -68287 -84649 -102558 -106557 -102375 -97683 -64594 -77996 -99703
15804 -99703 -98829 -62882 -60542 -44859 -57976 -72910 -67945 -50324 -40558 -36069 -40325 -28537 -20403
15791 -20403 -50408 -71302 -53632 -34098 -18773 -34149 -55586 -67783 -57395 -27247 -41821 -50265
$$ packed form
15881e6617j3390j6260j1747M106k7506N222K8777K5565n872N572j5074M145K4234
15868d8845P728j3920j7250k967O469o520K6348N80m859L809k023J2057L2517
15855f876L918l6125o572K3616j9884m8768o049p392J7103M3817J0071j8678k4727
15842g6546j5594J1970N201M076K293K2839l0184j5753j140K6630J2990R73k8778
15829h1023l0139M488J0469L4935j7552l2539J2390L2829K401K3071k0042K630
15817e8082J8137q650j4409R40o223j6362j7909l999M182M692L3089j3402k1707
15804i9703Q74L5947K340J5683j3117j4934M965J7621R766M489m256J1788Q134
15791b0403l0005k0894J7670J9534J5325j5376k1437j2197J0388L0148j4574q444
$$ plain form
15779 -50265 -41604 -49009 -61440 -61090 -34576 -32923 -44367 -45282 -19185 -25029 -40830 -33927 -26606 -27701
15765 -27701 -28096 -37772 -37918 -54861 -46356 -43811 -47754 -57666 -76896 -50540 -27700 -49475 -73588
15752 -73588 -88857 -105907 -81325 -50217 -28306 -35897 -65278 -53633 -32244 -46007 -53309 -63395
15740 -63395 -46798 -18512 -11668 -36671 -48917 -41232 -41631 -16384 -36760 -51836 -71229 -54246
15728 -54246 -34517 -68551 -92697 -62777 -64611 -70840 -78039 -49939 -38570 -64276 -63624 -39896 -59176
15715 -59176 -65884 -101513 -113168 -89320 -74420 -61160 -64121 -38018 -6743 -26848 -680 -1778
15703 -1778 -35158 -58699 -45498 -52155 -75812 -67590 -34971 -43651 -54675 -50127 -57819 -40865 -34361
15690 -34361 -31703 -41135 -29218 -32915 -42034 -56313 -51451 -66798 -55254 -50526 -9255 690 -11598
$$ packed form
15779e0265Q661p405j2431L50K6514J653j1444r15K6097n844j5801O903P321j095
15765b7701l95r676j46j6943Q505K545l943r912j9230K6356K2840k1775k4113
15752g3588j5269j7050K4582L1108K1911p591k9381J1645K1389j3763p302j0086
15740f3395J6597K8286O844k5003j2246P685l99K5247k0376j5076j9393J6983
15728e4246J9729l4034k4146K9920j834o229p199K8100J1369k5706O52K3728j9280
15715e9176o708l5629j1655K3848J4900J3260k961K6103L1275k0105K6168j098
15703a778l3380k3541J3201o657k3657Q222L2619q680j1024M548p692J6954O504
15690c4361K658r432J1917l697r119j4279M862j5347J1544M728M1271R945j2288
$$ plain form
15677 -11598 -45952 -44020 -24725 -18670 -9927 -32910 -45859 -47787 -77727 -78127 -66515 -23296 -16209
15664 -16209 -13944 2501 -24648 -60456 -60321 -48928 -48430 -27808 -37103 -15962 1141 -12040 -9990
15651 -9990 -7884 -16410 -23702 -35546 -52127 -60394 -24749 -5077 -22386 -28217 -28161 -36055 -62413 -67235
15637 -67235 -33885 -22801 -50062 -52724 -56775 -52723 -45710 -48578 -48004 -55413 -33851 -18620 17563
15624 17563 -7701 -43811 -83104 -94397 -84966 -84170 -87941 -76796 -83506 -73050 -48672 -18922 -33836
15611 -33836 -66880 -56033 -46587 -15290 -20452 -24232 -23309 -28508 -29360 -12530 -19199 -18444 -19434 -36446
15597 -36446 -17456 -23035 11503 7891 -48331 -42933 -49514 -18735 -29744 -34830 -28150 -43280 -43495
15584 -43495 -9929 20485 32953 15751 14073 8288 -6354 -28562 -54520 -46187 -29101 -12845
$$ packed form
15677a1598l4354J932J9295O055Q743k2983j2949j928k9940m00J1612M3219P087
15664a6209K265J6445k7149l5808J35J1393M98K0622r295K1141J7103j3181K050
15651i990K106q526p292j1844j6581q267L5645J9672j7309n831N6p894k6358m822
15637f7235L3350J1084k7261k662m051M052P013k868N74p409K1562J5231L6183
15624A7563k5264l6110l9293j1293R431P96l771J1145o710J0456K4378K9750j4914
15611c3836l3044J0847R446L1297n162l780R23n199q52J6830o669P55r90j7012
15597c6446J8990n579L4538l612n6222N398o581L0779j1009n086O680j5130k15
15584d3495L3566L0414J2468j7202j678n785j4642k2208k5958Q333J7086J6256
$$ plain form
15572 -12845 35552 65219 42954 25560 18864 -11151 -13086 -17429 -49158 -42879 -9427 -12462 -5822
15559 -5822 -12237 -15731 -26959 11701 22800 5296 9663 13717 17421 18189 5962 6192 31918 19565
15545 19565 -1239 29696 56511 27452 27812 22851 7383 1958 10968 16772 -3146 -12653 -8524
15532 -8524 -1388 27275 37623 13094 -341 -21751 -15083 -2996 -15495 -36487 -39142 -10897
15520 -10897 -10900 -36285 -62567 -54635 -39392 8156 26883 2577 11683 7958 18922 23871 -12300
15507 -12300 -29356 -12786 9394 28614 33765 45818 33651 6767 175 -26311 -41690 -54838
15495 -54838 -42013 -42644 -45307 -48538 -48088 -34820 -9426 8431 10859 -14207 -18324 -16966 -20965 -31357
15481 -31357 -42313 -46549 -38291 -25973 -22526 -15191 -10807 2213 22558 38997 32284 43782 6224
$$ packed form
15572a2845M8397K9667k2265j7394o696l0015j935m343l1729O279L3452l035O640
15559e822o415l494j1228L8660J1099j7504M367M054L704P68j2227K30K5726j2353
15545A9565k0804L0935K6815k9059L60m961j5468n425R010N804j9918r507M129
15532h524P136K8663J0348k4529j3435k1410O668J2087j2499k0992k655K8245
15520a0897lk5385k6282P932J5243M7548J8727k4306R106l725J0964M949l6171
15507a2300j7056J6570K2180J9220N151J2053j2167k6884o592k6486j5379j3148
15495e4838J2825o31k663l231M50J3268K5394J7857K428k5066m117J358l999j0392
15481c1357j0956m236Q258J2318L447P335M384J3020K0345J6439o713J1498l7558
$$ plain form
15468 6224 -183 15256 13478 -4185 -12668 130 20959 42354 30965 25238 50114 53204 19720
15455 19720 -1323 -1911 10230 51474 36960 2884 -18697 -35822 -20974 -5290 -27267 -30082
15443 -30082 -28239 -15797 -4379 -24069 -31482 -21328 -3608 37768 29914 11183 -35495 -51114
15431 -51114 -37810 -13428 -25226 -23009 -13130 -9955 -17965 -6753 15861 20219 3440 -2781 3356
15418 3356 9045 37482 56176 40877 13689 13929 20717 14238 -7500 -10033 14609 34081 59640
15405 59640 54752 51681 33298 36303 44638 13159 3232 -5070 8860 28201 22043 10185 16612
15392 16612 -19589 -36940 -31723 -28830 -42093 -33512 -15025 -29200 3356 53808 35391 6593
15380 6593 -25184 -19473 -27397 -16715 -27767 -9146 7416 -7260 -6617 -10906 -16307 -8786 1377
$$ packed form
15468F224o407J5439j778j7663q483J2798K0829K1395j1389n727K4876L090l3484
15455A9720k1043n88J2141M1244j4514l4076k1581j7125J4848J5684k1977k815
15443c0082J843J2442J1418j9690p413J0154J7720M1376p854j8731m6678j5619
15431e1114J3304K4382j1798K217R879L175q010J1212K2614M358j6779o221O137
15418C356N689K8437J8694j5299k7188K40O788o479k1738k533K4642J9472K5559
15405E9640m888l071j8383L005Q335l1479r927q302J3930J9341o158j1858O427
15392A6612l6201j7351N217K893j3263Q581J8487j4175L2556N0452j8417k8798
15380F593l1777N711p924J0682j1052J8621J6562j4676O43m289n401P521J0163
$$ plain form
15367 1377 14875 -11383 -17219 24843 60969 40203 27542 41191 48765 39950 45817 45789 49814
15354 49814 84793 84431 83168 107037 136275 102060 42202 -19857 -14076 4537 33292 39583 63849
15341 63849 51761 42500 53809 24344 19556 41551 51407 48319 20938 367 10717 9792 -26234
15328 -26234 -36998 17308 9000 9154 22626 29315 22173 39816 23556 20869 -1677 6352 13666
15315 13666 34948 35957 35440 32563 29457 48388 69920 68470 43611 14201 7347 27737 10057
15302 10057 -7216 -23568 -34301 -48994 -27660 -2029 45961 28533 27825 18850 -13393 -15531
15290 -15531 -30705 -7600 6642 9684 -6013 15255 26356 50868 34318 15394 34546 46880
15278 46880 15132 29821 57153 66039 58391 78329 48840 21206 -885 2887 6583 7759 -10826
$$ packed form
15367A377J3498k6258n836M2062L6126k0766j2661J3649P574q815N867k8M025
15354D9814L4979l62j263K3869K9238l4215n9858o2059N781J8613K8755O291K4266
15341F3849j2088r261J1309k9465m788K1995R856l088k7381k0571J0350r25l6026
15328b6234j0764N4306q308J54J3472O689p142J7643j6260k687k2546Q029P314
15315A3666K1282J009n17k877l106J8931K1532j450k4859k9410o854K0390j7680
15302A0057j7273j6352j0733j4693K1334K5631M7990j7428p08q975l2243k138
15290a5531j5174K3105J4242L042j5697K1268J1101K4512j6550j8924J9152J2334
15278D6880l1748J4689K7332Q886p648J9938k9489k7634k2091L772L696J176j8585
$$ plain form
15265 -10826 -7813 -1889 -7181 4483 3031 2105 9267 -24479 -21198 5336 15831 35959 49638
15252 49638 49359 28929 14597 9259 45040 62335 48221 35619 58169 52906 46338 67094 40258
15239 40258 20931 15231 4072 24833 43737 50951 58323 31225 15529 18706 55723 46151 33439
15226 33439 26238 14301 28123 1087 11248 35802 45646 43316 23545 -11857 -18677 674
15214 674 24032 55744 69647 68358 57656 45053 63550 70857 88065 97266 73700 62306 52092
15201 52092 49808 40531 29757 27696 32563 45128 48477 52876 53795 662 -6661 -11228 9104 28387
15187 28387 68024 72974 36898 47809 63287 57211 35823 19245 -13399 4675 41208 43882
15175 43882 17790 9656 18753 4728 -967 34175 32636 27986 39616 45700 42059 45758 42812
$$ packed form
15265a0826L013N924n292J1664j452r26P162l3746L281K6534J0495K0128J3679
15252D9638k79k0430j4332n338L5781J7295j4114j2602K2550n263o568K0756k6836
15239D0258j9327n700j1159K0761J8904P214P372k7098j5696L177L7017r572j2712
15226C3439p201j1937J3822k7036J0161K4554R844k330j9771l5402o820J9351
15214F74K3358L1712J3903j289j0702j2603J8497P307J7208R201k3566j1394j0214
15201E2092k284r277j0774k061M867J2565L349M399R19n3133p323m567K0332J9283
15187B8387L9637M950l6076J0911J5478o076k1388j6578l2644J8074L6533K674
15175D3882k6092q134R097j4025n695L5142j539m650J1630O084l641L699k946
$$ plain form
15162 42812 15733 20919 54817 76733 59110 56225 66560 54653 76707 85915 79226 77243 80072
15149 80072 57537 44780 35730 36558 49311 33264 31485 4914 7291 33647 12250 16341 -3002
15136 -3002 17350 33371 56045 64815 67364 58323 59885 61428 71365 61776 58132 97006 131794
15123 131794 135908 118568 105420 71347 67045 61475 83392 93873 117470 100344 90104 70247
15111 70247 42153 22699 28634 33831 55991 68871 35095 24143 36703 51813 34710 16278
15099 16278 15416 13336 33041 66133 80953 86875 69173 44363 51901 54738 74067 97650 100054
15086 100054 95117 63561 68128 87992 70217 35106 53223 63907 87544 102895 92873 74123
15074 74123 85746 95781 104817 92262 83798 91529 97362 90987 70293 84452 96700 93017 76755
$$ packed form
15162D2812k7079N186L3898K1916j7623k885J0335j1907K2054R208o689j983K829
15149H0072k2535j2757r050Q28J2753j6047j779k6571K377K6356k1397M091j9343
15136c002K0352J6021K2674Q770K549r041J562J543R937r589l644L8874L4788
15123A31794M114j7340j3148l4073m302n570K1917J0481K3597j7126j0240j9857
15111G0247k8094j9454N935N197K2160J2880l3776j0952J2560J5110j7103j8432
15099A6278q62k080J9705L3092J4820N922j7702k4810P538K837J9329K3583K404
15086A00054m937l1556M567J9864j7775l5111J8117J0684K3637J5351j0022j8750
15074G4123J1623J0035R036j2555q464P731N833o375k0694J4159J2248l683j6262
$$ plain form
15061 76755 86505 79315 54548 52082 73450 74790 88042 109526 76939 72634 87148 101481 90514
15048 90514 105566 108822 78322 70252 96209 71083 69347 54400 54346 64804 72913 70643 100825
15035 100825 132512 140076 106600 97270 67273 41540 26514 54116 83385 74410 80648 101489
15023 101489 105725 124963 142923 124111 98552 84353 78135 67234 76435 125900 137119 136697
15011 136697 101117 70273 55188 61479 72277 85294 97348 119810 113779 121456 101420 83149
14999 83149 66977 60839 51928 47614 29677 30972 23631 36228 50352 20405 46806 69749 32913
14986 32913 61240 86421 108302 120724 116608 131676 112701 102046 134944 144864 157924 149449
14974 149449 107633 89741 103729 123650 132917 142981 147502 135213 113817 81433 74633 86332
$$ packed form
15061G6755R750p190k4767k466K1368J340J3252K1484l2587m305J4514J4333j0967
15048I0514J5052L256l0500q070K5957k5126j736j4947n4J0458Q109k270L0182
15035A00825L1687P564l3476r330k9997k5733j5026K7602K9269q975O238K0841
15023A01489M236J9238J7960j8812k5559j4199o218j0901R201M9465J1219m22
15011A36697l5580l0844j5085O291J0798J3017J2054K2462o031P677k0036j8271
14999H3149j6172o138q911m314j7937J295p341J2597J4124k9947K6401K2943l6836
14986C2913K8327K5181K1881J2422m116J5068j8975j0655L2898R920J3060q475
14974A49449m1816j7892J3988J9921R267J0064M521j2289k1396l2384o800J1699
$$ plain form
14962 86332 81892 95206 102307 109730 87852 96397 94335 54736 37457 53807 49520 25728 36322
14949 36322 27052 46333 54224 54858 80408 108855 112420 81912 59265 98386 121609 92271 98102
14936 98102 111993 110261 113101 104937 117829 111577 78931 84398 100348 97619 90168 98838 123401
14923 123401 95322 71989 90760 109391 62144 57840 96746 118364 142520 133595 111478 95084
14911 95084 66970 72939 94085 91231 99057 98140 87204 92388 110891 93746 77724 81982 80998
14898 80998 55034 40254 69194 66018 57913 40962 2977 5082 35404 38969 38906 68435 83721
14885 83721 69146 73039 92311 86892 80139 102752 100665 96423 107848 99250 97399 100475 56878
14872 56878 28233 57777 98725 119413 141014 119213 99352 102825 91841 92162 104440 105391 117461
$$ packed form
14962H6332m440J3314P101P423k1878Q545k062l9599j7279J6350m287k3792J0594
14949C6322r270J9281P891O34K5550K8447L565l0508k2647L9121K3223k9338N831
14936I8102J3891j732K840q164J2892o252l2646N467J5950k729p451Q670K4563
14923A23401k8079k3333J8771J8631m7247m304L8906K1618K4156q925k2117j6394
14911I5084k8114N969K1146k854P826r17j0936N184J8503j7145j6022M258r84
14898H0998k5964j4780K8940l176q105j6951l7985K105L0322L565o3K9529J5286
14885H3721j4575L893J9272n419o753K2613k087m242J1425q598j851L076m3597
14872E6878k8645K9544M0948K0688K1601k1801j9861L473j0984L21J2278R51J2070
$$ plain form
14859 117461 124499 91848 97517 93382 112843 118190 112865 107094 140408 133395 103228 86394 109158
14846 109158 97999 109326 136762 123924 97674 100688 106858 110785 103061 100014 92685 99553 72416
14833 72416 56279 59466 52756 57145 92019 120860 121359 117897 136798 128170 97820 107792 111877
14820 111877 100029 85142 86640 86898 74563 80436 93805 100640 104135 85202 52942 81332 95433
14807 95433 116146 124857 134427 142353 132922 134671 154429 137250 114026 105491 119397 117484 95328
14794 95328 105088 139321 157354 141089 131192 112478 104084 88125 77789 97607 100539 86610
14782 86610 78102 85302 109736 133520 142015 136489 112988 126381 143547 137544 114988 107614 111603
14769 111603 118173 115560 116960 135335 145983 139883 137341 117284 100260 133481 150004 102915
$$ packed form
14859A17461P038l2651N669m135J9461N347n325n771L3314p013l0167j6834K2764
14846A09158j1159J1327K7436j2838k6250L014O170L927p724l047p329O868k7137
14833G2416j6137L187o710M389L4874K8841M99l462J8901q628l0350R972M085
14820A11877j1848j4887J498K58j2335N873J3369O835L495j8933l2260K8390J4101
14807I5433K0713Q711R570P926r431J749J9758j7179k3224q535J3906j913k2156
14794I5328R760L4233J8033j6265r897j8714q394j5959j0336J9818K932j3929
14782H6610q508P200K4434K3784Q495n526k3501J3393J7166o003k2556p374L989
14769A11603O570k613J400J8375J0648o100k542k0057j7024L3221J6523m7089
$$ plain form
14757 102915 80120 70549 55386 35431 79213 82631 93503 35319 15038 51976 95911 79326
14745 79326 73775 82342 98314 142813 172556 145940 103029 94910 107609 131501 160426 176599
14733 176599 154475 118893 114717 160351 175513 168689 157612 160299 168216 160589 172761 197230
14721 197230 164240 126607 136634 126887 140837 146228 134795 129201 109766 133995 160601 131428
14709 131428 88847 82645 91315 102946 106305 104077 96095 107941 138978 174868 176521 149910 98313
14696 98313 75978 73292 82284 62992 64106 90643 90916 94016 107707 112717 119137 107708 103032
14683 103032 103489 109751 123296 143734 125755 135917 136774 113904 97892 106802 144500 151589 162636
14670 162636 150244 149706 143331 125790 111855 119511 141486 128929 136521 120968 96609 95593 108669
$$ packed form
14757A02915k2795r571j5163j9955M3782L418J0872n8184k0281L6938M3935j6585
14745G9326n551Q567J5972M4499K9743k6616m2911q119J2699K3892K8925J6173
14733A76599k2124l5582m176M5634J5162o824j1077K687P917p627J2172K4469
14721A97230l2990l7633J0027r747J3950N391j1433n594j9435K4229K6606k9173
14709A31428m2581o202Q670J1631L359k228p982J1846L1037L5890J653k6611n1597
14696I8313k2335k686Q992j9292J114K6537K73L100J3691N010O420j1429m676
14683A03032M57O262J3545K0438j7979J0162Q57k2870j6012Q910L7698P089J1047
14670A62636j2392n38o375j7541j3935P656K1975j2557P592j5553k4359j016J3076
$$ plain form
14657 108669 108692 116108 129970 128895 137028 139116 149461 138324 134196 128295 101132 97336 98268 119177
14643 119177 110666 72189 50774 89236 125960 136380 146228 133892 132854 125540 144227 160237
14631 160237 192493 158503 141041 167180 168264 136758 108392 137411 151597 161802 179251 182267
14619 182267 183525 154924 124342 142388 150331 159793 141461 121434 96933 86108 83834 123655
14607 123655 143899 107798 82582 109065 136433 114365 124168 115728 105451 118943 152230 138235
14595 138235 144335 150051 152483 161331 169294 190378 197976 191413 190832 214539 199087 177328 197529
14582 197529 165771 137605 160528 158572 158996 167436 165312 158578 153635 149285 147806 170483 179311
14569 179311 178352 153523 164062 166617 163192 176673 179216 188543 197379 180889 166756 138545 124929
$$ packed form
14657A08669K3P416J3862j075Q133K088J0345j1137m128n901k7163l796R32K0909
14643A19177q511l8477k1415L8462L6724J0420R848j2336j038p314J8687J6010
14631A60237L2256l3990j7462K6139J084l1506k8366K9019J4186J0205J7449L016
14619A82267J258k8601l0582J8046P943R462j8332k0027k4501j0825k274L9821
14607A23655K0244l6101k5216K6483K7368k2068R803q440j0277J3492L3287j3995
14595A38235O100N716K432Q848P963K1084P598o563n81K3707j5452k1759K0201
14582A97529l1758k8166K2923j956M24Q440k124o734m943m350j479K2677Q828
14569A79311r59k4829J0539K555l425J3481K543R327Q836j6490j4133k8211j3616
$$ plain form
14556 124929 158612 169409 170800 159930 125483 107403 137465 139463 147668 153070 146118 141832 140353
14543 140353 177103 184374 190651 205004 181257 132093 149596 154919 146521 159629 173998 197549
14531 197549 202186 214782 199342 191698 178651 170931 171217 170618 184508 170790 156915 165388 184466
14518 184466 203329 211138 193722 182387 190245 192906 203070 206467 204863 181064 166494 158891 121915
14505 121915 142157 164828 137574 143075 149287 159147 176670 172753 180543 191271 172401 137422
14493 137422 122512 149817 158923 147614 158964 178137 145626 108669 97063 104383 93226 115770
14481 115770 159375 155867 142468 138968 143228 132578 139586 164862 177144 164859 193975 212262
14469 212262 212945 192253 181911 169746 149289 186599 213177 213176 202228 230764 249529 240985 224270
$$ packed form
14556A24929L3683J0797J391j0870l4447j8080L0062J998Q205N402o952m286j479
14543A40353L6750P271O277J4353k3747m9164J7503N323q398J3108J4369K3551
14531A97549M637J2596j5440p644j3047p720K86n99J3890j3718j3875Q473J9078
14518A84466J8863P809j7416j1335P858K661J0164L397j604k3799j4570p603l6976
14505A21915K0242K2671k7254N501O212R860J7523l917P790J0728j8870l4979
14493A37422j4910K7305R106j1309J1350J9173l2511l6957j1606P320j1157K2544
14481A15770M3605l508j3399l500M260j0650P008K5276J2282j2285K9116J8287
14469B12262O83k0692j0342j2165k0457L7310K6578jj0948K8536J8765q544j6715
$$ plain form
14456 224270 200584 170083 199517 182163 190289 168243 144578 144516 155387 165202 155574 143918 135851
14443 135851 130511 120919 122210 144221 162984 158584 162692 178495 178136 154537 159626 119918 127165
14430 127165 169779 171305 166090 167096 178688 182516 171750 152281 142103 147423 173058 181180 171974
14417 171974 180280 184915 172570 173570 210550 201259 209483 189871 175873 153603 166191 161000 147690
14404 147690 138564 159652 176716 207667 220279 227880 233238 242800 250430 198287 164718 168248 170390
14391 170390 177918 189849 180450 174810 202704 206833 189323 204630 222027 219648 213335 213567 200505
14378 200505 173219 186370 188105 173449 124270 146962 200901 211251 228858 243190 244637 224330
14366 224330 187517 187067 192171 215561 186682 161183 190277 189645 159585 156022 169931 190787 196298
$$ packed form
14456B24270k3686l0501K9434j7354Q126k2046k3665o2J0871R815r628j1656q067
14443A35851n340r592J291K2011J8763m400M108J5803l59k3599N089l9708P247
14430A27165M2614J526n215J006J1592L828j0766j9469j0178N320K5635Q122r206
14417A71974Q306M635j2345J000L6980r291Q224j9612j3998k2270J2588n191j3310
14404A47690r126K1088J7064L0951J2612P601N358R562P630n2143l3569L530K142
14391A70390P528J1931r399n640K7894M129j7510J5307J7397k379o313K32j3062
14378B00505k7286J3151J735j4656m9179K2692N3939J0350J7607J4332J447k0307
14366B24330l6813m50N104K3390k8879k5499K9094o32l0060l563J3909K0856N511
$$ plain form
14353 196298 180385 161182 135756 136514 145106 168005 190974 211375 194319 185101 203634 208746
14341 208746 222573 223623 211723 207280 202388 205168 203362 188880 157615 150547 150086 157373 182890
14328 182890 208676 189893 183558 187408 190005 190969 200259 218471 203497 203382 207036 215922 233433
14315 233433 226544 201925 212539 217389 206060 205168 224415 251006 241505 244814 224559 209042 236207
14302 236207 233858 216105 210830 199290 190762 199023 200135 192405 232803 233555 205244 204165 173958
14289 173958 181150 202390 227054 224239 205285 192569 206207 214055 242751 258439 269258 255267
14277 255267 243798 237939 227910 243104 232720 206076 203528 207610 197463 212224 268002 284609
14265 284609 239657 200947 177377 196869 229389 230743 251225 254385 213339 199530 211636 214022
$$ packed form
14353A96298j5913j9203k5426P58Q592K2899K2969K0401j7056r218J8533N112
14341B08746J3827J050j1900m443m892K780j806j4482l1265p068m61P287K5517
14328A82890K5786j8783o335L850K597R64R290J8212j4974j15L654Q886J7511
14315B33433o889k4619J0614M850j1329q92J9247K6591r501L309k0255j5517K7165
14302B36207k349j7753n275j1540q528Q261J112p730M0398P52k8311j079l0207
14289A73958P192K1240K4664k815j8954j2716J3638P848K8696J5688J0819j3991
14277B55267j1469n859j0029J5194j0384k6644k548M082j0147J4761N5778J6607
14265B84609m4952l8710k3570J9492L2520J354K0482L160m1046j3809J2106K386
$$ plain form
14253 214022 194855 203557 200632 186615 169201 156958 176784 174930 205785 235349 210378 216349
14241 216349 245647 236174 207945 205366 192620 207491 214251 223790 230466 212916 211455 230945 232258
14228 232258 225714 194985 175851 173154 195752 218450 224907 220188 214833 241200 256923 252371 233779
14215 233779 211025 213515 218124 241833 255965 261301 245921 230640 227487 246888 241418 222201
14203 222201 185793 180267 197959 199144 192300 199820 239347 265246 261898 248282 225532 187493
14191 187493 216652 243978 256478 255458 268052 246347 220069 192487 179137 180542 180515 178192 186168
14178 186168 223931 222342 225206 235529 245503 267579 257947 247183 249062 242283 244876 236486 234426
14165 234426 252932 263761 273506 274935 277653 276153 254676 217116 207181 229737 237407 242732 244863
$$ packed form
14253B14022j9167Q702k925j4017j7414j2243J9826j854L0855K9564k4971N971
14241B16349K9298r473k8229k579j2746J4871O760R539O676j7550j461J9490J313
14228B32258o544l0729j9134k697K2598K2698O457m719n355K6367J5723m552j8592
14215B33779k2754K490M609K3709J4132N336j5380j5281l153J9401n470j9217
14203B22201l6408n526J7692J185o844P520L9527K5899l348j3616k2750l8039
14191A87493K9159K7326J2500j020J2594k1705k6278k7582j3350J405k7k323P976
14178A86168L7763j589K864J0323R974K2076r632j0764J879o779K593q390k060
14165B34426J8506J0829R745J429K718j500k1477l7560r935K2556P670N325K131
$$ plain form
14152 244863 254337 247691 222264 199215 204258 219762 233592 207181 186401 185751 188656 217849 202767
14139 202767 210943 235132 243024 227078 220570 246979 253037 205578 215993 238584 238961 215380 189035
14126 189035 193922 244514 270915 257543 224882 229090 217669 194636 192874 213034 224904 227120
14114 227120 239162 235114 266912 293188 282750 266149 255441 245384 241864 257536 285629 267864
14102 267864 266108 268574 241470 232441 222271 244657 276783 268395 260995 241145 250801 282462 279645
14089 279645 269210 259284 238263 224932 244543 269175 267113 288296 292541 275948 249308 248215
14077 248215 286323 295995 285935 300066 324080 322744 295888 264648 247765 240506 222379 242806
14065 242806 250226 246167 228674 226264 226117 201985 198530 200272 206888 189270 208569 260967 242977
$$ packed form
14152B44863R474o646k5427k3049N043J5504J3830k6411k0780o50K905K9193j5082
14139B02767Q176K4189P892j5946o508K6409O058m7459J0415K2591L77k3581k6345
14126A89035M887N0592K6401j3372l2661M208j1421k3033j762K0160J1870K216
14114B27120J2042m048L1798K6276j0438j6601j0708j0057l520J5672K8093j7765
14102B67864j756K466k7104r029j0170K2386L2126q388p400j9850R656L1661k817
14089B79645j0435r926k1021j3331J9611K4632k062K1183M245j6593k6640j093
14077B48215L8108R672j0060J4131K4014j336k6856l1240j6883p259j8127K0427
14065B42806P420m059j7493k410j47k4132l455J742O616j7618J9299N2398j7990
$$ plain form
14052 242977 218926 228312 237724 220805 248479 243491 272172 261148 220119 214305 223375 244218
14040 244218 243532 263152 275018 261697 274916 309625 322134 304668 296283 291739 277091 290580
14028 290580 293709 300862 275619 243837 251594 291762 288146 279045 274570 287294 302125 301558 288285
14015 288285 287402 276946 290369 310441 284009 266707 250594 234337 234000 227487 224117 218032 232871
14002 232871 272246 276850 225007 216158 207476 209693 216768 225897 212673 221603 250099 255406 248410
13989 248410 247524 256199 259515 235612 221475 235578 237615 231657 229992 221133 251649 273853 296206
13976 296206 290291 276077 261108 273718 249603 223691 230121 243826 243277 281436 301383 307888
13964 307888 293443 262464 235698 232831 233600 267899 264993 251406 256876 285093 295339 305287 285453
$$ packed form
14052B42977k4051R386R412j6919K7674m988K8681j1024m1029n814R070K0843
14040B44218o86J9620J1866j3321J3219L4709J2509j7466q385m544j4648J3489
14028B90580L129P153k5243l1782P757M0168l616r101m475J2724J4831n67j3273
14015B88285q83j0456J3423K0072k6432j7302j6113j6257l37o513l370o085J4839
14002B32871L9375M604n1843q849q682K217P075R129j3224Q930K8496N307o996
13989B48410q86Q675L316k3903j4137J4103K037n958j665q859L0516K2204K2353
13976B96206n915j4214j4969J2610k4115k5912O430J3705n49L8159J9947O505
13964C07888j4445l0979k6766k867P69L4299k906j3587N470K8217J0246R948j9834
$$ plain form
13951 285453 257933 272631 270083 274965 312681 317735 295107 264892 262739 268294 255009 250452 242388
13938 242388 247433 228632 239137 274393 292937 312185 307399 307714 299998 302930 281767 280366 280011
13925 280011 273120 294072 308657 325464 313868 309945 292363 309630 289929 269421 278266 303483
13913 303483 300022 308164 299215 289584 260796 236953 235150 253476 221199 212209 195233 204936 228685
13900 228685 238483 216711 227193 263528 271091 267172 258006 245803 258159 264914 261584 293602 263916
13887 263916 233980 240999 273675 302258 291718 276222 280506 287903 270808 232635 229259 252393
13875 252393 280087 282738 278479 289486 291000 293394 265932 278286 269922 291225 295440 267335 271631
13862 271631 287701 283222 268634 267065 284869 305881 314272 306415 293197 275623 271159 297721
$$ packed form
13951B85453k7520J4698k548M882L7716N054k2628l0215k153N555j3285m557q064
13938B42388N045j8801J0505L5256J8544J9248m786L15p716K932k1163j401l55
13925B80011o891K0952J4585J6807j1596l923j7582J7267j9701k0508Q845K5217
13913C03483l461Q142q949r631k8788k3843j803J8326l2277q990j6976R703K3749
13900B28685R798k1772J0482L6335P563l919r166j2203J2356O755l330L2018k9686
13887B63916k9936P019L2676K8583j0540j5496M284P397j7095l8173l376K3134
13875B52393K7694K651m259J1007J514K394k7462J2354q364K1303M215k8105M296
13862B71631J6070m479j4588j569J7804K1012Q391p857j3218j7574m464K6562
$$ plain form
13850 297721 274809 252184 244637 246239 250395 264585 312216 327113 338048 339428 326373 337550
13838 337550 338520 326612 328214 314777 306459 313820 336018 314448 299180 287937 228305 254595
13826 254595 285191 276969 219463 236273 264657 260334 249225 258774 267918 270390 302415 279641
13814 279641 264896 242850 259747 305379 319948 296668 266059 300592 349135 346898 341915 313736
13802 313736 307697 324665 318069 305529 304157 308122 305682 310027 290208 273297 254963 262640 283222
13789 283222 292525 347052 360698 336173 288816 293865 318217 329804 315667 306026 319585 303730
13777 303730 271574 287851 313589 307666 337243 325203 292241 317901 334510 325028 327001 332357
13765 332357 306673 275870 314515 345004 320360 321483 352682 377325 354822 315275 300049 300992
$$ packed form
13850B97721k2912k2625p547J602M156J4190M7631J4897J0935J380j3055J1177
13838C37550R70j1908J602j3437q318P361K2198k1570j5268j1243n9632K6290
13826B54595L0596q222n7506J6810K8384m323j1109R549R144K472L2025k2774
13814B79641j4745k2046J6897M5632J4569k3280l0609L4533M8543k237m983k8179
13802C13736o039J6968o596j2540j372L965k440M345j9819j6911j8334P677K0582
13789B83222R303N4527J3646k4525m7357N049K4352J1587j4137r641J3559j5855
13777C03730l2156J6277K5738n923K9577j2040l2962K5660J6609r482J973N356
13765C32357k5684l0803L8645L0489k4644J123L1199K4643k2503l9547j5226R43
$$ plain form
13753 300992 324560 321049 315350 347167 347371 335618 312491 302446 312646 346595 344380 309082
13741 309082 303082 325005 283722 299807 316626 305404 285687 263834 286468 323194 331434 326439
13729 326439 308980 320249 311599 332159 360188 359527 367190 346001 339568 349241 350768 348258 369502
13716 369502 394390 373760 355776 349376 368791 365542 346576 336700 322967 347386 365607 329745
13704 329745 326086 323660 353255 394303 391657 370817 367339 340042 320622 318658 342679 361475
13692 361475 367663 374027 333785 335886 344042 345262 317517 312095 325075 340908 355071 356239 344385
13679 344385 311974 326479 351554 340941 330392 329233 305866 305698 311196 345400 376872 411369
13667 411369 410629 395158 391887 390856 403743 381618 366837 342365 332183 360573 371161 347458
$$ packed form
13753C00992K3568l511n699L1817K04j1753k3127j0045J0200L3949k215l5298
13741C09082o000K1923m1283J6085J6819j1222j9717k1853K2634L6726Q240m995
13729C26439j7459J1269q650K0560K8029o61P663k1189o433R673J527k510K1244
13716C69502K4888k0630j7984o400J9415l249j8966r876j3733K4419J8221l5862
13704C29745l659k426K9595M1048k646k0840l478k7297j9420j964K4021J8796
13692C61475O188O364m0242K101Q156J220k7745n422J2980J5833J4163J168j1854
13679C44385l2411J4505K5075j0613j0549j159k3367j68N498L4204L1472L4497
13667D11369p40j5471l271j031J2887k2125j4781k4472j0182K8390J0588k3703
$$ plain form
13655 347458 322978 316937 325872 341771 370141 380357 392701 416032 407240 389715 393248 359045
13643 359045 340358 347815 364654 405696 409707 416859 416338 381513 382269 387965 359505 353823 372339
13630 372339 350884 352993 361649 354233 369345 367653 354541 354360 354927 323057 296629 284979 290294
13617 290294 297446 296499 284144 296503 317676 351209 367946 382100 371160 388604 381369 382012 378053
13604 378053 370658 357497 327686 324028 351175 338208 342679 341736 378788 396985 377889 370495 371331
13591 371331 373637 345924 334640 330633 305221 332410 387212 425535 410192 402968 394590 391451
13579 391451 400738 389458 378584 358576 379378 371538 349007 366243 347203 359742 377413 415574
13567 415574 415729 387228 399412 405045 416854 421869 402003 380095 355881 342290 347460 375779
$$ packed form
13655C47458k4480o041Q935J5899K8370J0216J2344K3331q792j7525L533l4203
13643C59045j8687P457J6839M1042M011P152n21l4825P56N696k8460n682J8516
13630C72339k1455K109Q656p416J5112j692j3112j81N67l1870k6428j1650N315
13617B90294P152r47j2355J2359K1173L3533J6737J4154j0940J7444p235O43l959
13604C78053p395j3161k9811l658K7147j2967M471r43L7052J8197j9096p394Q36
13591C71331K306k7713j1284m007k5412K7189N4802L8323j5343p224q378l139
13579C91451R287j1280j0874k0008K0802p840k2531J7236j9040J2539J7671L8161
13567D15574J55k8501J2184N633J1809N015j9866k1908k4214j3591N170K8319
$$ plain form
13555 375779 410911 413857 410885 419601 409198 395037 398018 377993 350814 358507 352780 367567 391805
13542 391805 375951 375971 381354 386558 413733 443739 419550 404505 399234 409668 407272 390456 409775
13529 409775 409404 429089 417708 404702 395026 383606 400705 421820 421956 432292 410827 429142
13517 429142 420385 383655 391873 405552 388824 411313 453910 431111 402931 379006 383103 396392
13505 396392 423582 430869 447031 443243 406344 397429 417748 408521 388169 388473 415963 424965 414156
13492 414156 401887 397515 408149 409429 401100 404001 408144 424409 432951 431647 424258 413561 414228
13479 414228 441177 456789 445221 432332 414909 409046 416703 408239 440251 443123 444564 439485 406815
13466 406815 383194 421180 432594 439675 427386 400078 427911 442340 428010 416324 426993 455972
$$ packed form
13555C75779L5132K946k972Q716j0403j4161K981k0025k7179P693n727J4787K4238
13542C91805j5854K0N383N204K7175L0006k4189j5045n271J0434k396j6816J9319
13529D09775l71J9685j1381j3006r676j1420J7099K1115J36J0336k1465J8315
13517D29142q757l6730Q218J3679j6728K2489M2597k2799k8180k3925M097J3289
13505C96392K7190P287J6162l788l6899q915K0319r227k0352L04K7490R002j0809
13492D14156j2269m372J0634J280q329K901M143J6265Q542j304p389j0697O67
13479D14228K6949J5612j1568j2889j7423n863P657q464L2012K872J441n079l2670
13466D06815k3621L7986J1414P081j2289k7308K7833J4429j4330j1686J0669K8979
$$ plain form
13454 455972 464073 452125 435541 449156 474437 462643 439937 417021 409376 394340 394982 434757
13442 434757 443888 403566 382466 379383 414206 464116 464994 443024 420857 406700 425967 426820 409033
13429 409033 443338 427852 425504 431910 392001 362380 379255 406044 432779 438000 458694 463215
13417 463215 447935 411560 409917 409624 404474 391380 429961 460523 436712 420667 400644 418981
13405 418981 443655 433471 417348 440605 469840 456520 442345 445441 445681 425796 431637 416818
13393 416818 424488 425727 421828 425352 408830 407395 447853 459531 489084 486639 420901 394730 410890
13380 410890 435514 436012 405206 403236 421815 437756 442998 435773 441721 439736 420314 411174 412649
13367 412649 406699 395978 431093 481432 493588 458289 450243 452468 463145 491494 494841 452244
$$ packed form
13454D55972Q101j1948j6584J3615K5281j1794k2706k2916p645j5036O42L9775
13442D34757R131m0322k1100l083L4823M9910Q78k1970k2167j4157J9267Q53j7787
13429D09033L4305j5486k348O406l9909k9621J6875K6789K6735N221K0694M521
13417D63215j5280l6375j643k93n150j3094L8581L0562k3811j6045k0023J8337
13405D18981K4674j0184j6123K3257K9235j3320j4175L096K40j9885N841j4819
13393D16818P670J239l899L524j6522j435M0458J1678K9553k445o5738k6171J6160
13380D10890K4624M98l0806j970J8579J5941N242p225N948j985j9422r140J475
13367D12649n950j0721L5115N0339J2156l5299q046K225J0677K8349L347m2597
$$ plain form
13355 452244 451914 469287 474431 463616 437898 433319 439876 446980 443322 474430 457878 449449 470882
13342 470882 463889 473863 502547 499798 465067 443551 432025 451166 482513 462882 427265 427456
13330 427456 438396 448724 423894 419485 447092 438025 442043 451675 463725 475096 481459 482806 487461
13317 487461 473216 461348 452398 484964 474376 436315 431619 458340 454832 477195 507468 527594
13305 527594 535489 527254 514422 514207 495997 511415 506136 481440 465844 451453 452637 474742 504962
13292 504962 522271 509821 487713 503544 483184 479681 470871 492866 502406 524902 533063 503477
13280 503477 474727 490026 504269 491274 479207 486041 492633 486984 482432 491544 475663 467262 472380
13267 472380 461988 433636 439349 464450 492357 511612 495665 475304 482226 492870 545861 559605
$$ packed form
13355D52244l30J7373N144j0815k5718m579O557P104l658L1108j6552q429K1433
13342D70882o993R974K8684k749l4731k1516j1526J9141L1347j9631l5617J91
13330D27456J0940J0328k4830m409K7607r067M018R632J2050J1371O363J347M655
13317D87461j4245j1868q950L2566j0588l8061m696K6721l508K2363L0273K0126
13305E27594P895q235j2832k15j8210J5418n279k4696j5596j4391J184K2105L0220
13292E04962J7309j2450k2108J5831k0360l503q810K1995R540K2496Q161k9586
13280E03477k8750J5299J4243j2995j2067O834O592n649m552R112j5881q401N118
13267D72380j0392k8352N713K5101K7907J9255j5947k0361O922J0644N2991J3744
$$ plain form
13255 559605 548533 511474 494328 475919 442796 420502 432314 443792 438376 448825 464858 455628
13243 455628 450218 458718 466449 453810 454408 465912 468040 446496 423419 406761 429441 460568 479525
13230 479525 465579 465483 474826 447375 459516 489804 474797 448035 440091 450977 460290 450293 464732
13217 464732 449901 428343 417085 449953 448696 470071 491354 481026 476216 476874 487713 503767
13205 503767 484701 492034 502438 503899 482620 485177 494775 484772 464698 466218 444738 445482 445420
13192 445420 448568 454405 448941 445756 457390 480942 492566 489347 491674 461815 439383 422371 441514
13179 441514 454958 490323 497248 475133 462584 451543 445051 458311 485179 489611 477358 468861
13167 468861 476289 483694 490979 505307 526973 522675 502921 480876 488744 463399 450781 480119
$$ packed form
13255E59605j1072l7059j7146j8409l3123k2294J1812J1478n416J0449J6033r230
13243D55628n410Q500P731j2639N98J1504K128k1544k3077j6658K2680L1127J8957
13230D79525j3946r6R343k7451J2141L0288j5007k6762p944J0886R313r997J4439
13217D64732j4831k1558j1258L2868j257K1375K1283j0328m810O58J0839J6054
13205E03767j9066P333J0404J461k1279K557R598j0003k0074J520k1480P44o2
13192D45420L148N837n464l185J1634K3552J1624l219K327k9859k2432j7012J9143
13179D41514J3444L5365O925k2115j2549j1041o492J3260K6868M432j2253q497
13167D68861P428P405P285J4328K1666m298j9754k2045P868k5345j2618K9338
$$ plain form
13155 480119 495498 485730 476234 471644 479068 469806 461591 436579 437995 482730 492237 491514 498544 475636
13141 475636 458682 446596 426341 449407 489886 504130 489088 512771 530990 502544 495714 529152
13129 529152 522421 521189 539312 524812 546704 547334 537146 554177 548516 523801 495315 495406 537495
13116 537495 548176 508950 505438 518326 504637 487232 473512 476255 523783 524271 505888 515905
13104 515905 527702 513289 502303 504543 511474 544048 562329 548901 575207 591463 595465 596088
13092 596088 589275 581470 568464 577695 571816 515195 532788 548512 562334 598345 589070 552048
13080 552048 536900 518636 549703 538226 530835 543267 566005 534559 504405 510737 514666 508032
13068 508032 500069 501867 499984 496230 512085 516968 511265 499092 530777 554646 565473 555935 549279
$$ packed form
13155D80119J5379r768r496m590P424r262q215k5012J416M4735R507p23P030k2908
13141D75636j6954j2086k0255K3066M0479J4244j5042K3683J8219k8446o830L3438
13129E29152o731j232J8123j4500K1892O30j0188J7031n661k4715k8486R1M2089
13116E37495J0681l9226l512J2888j3689j7405j3720K743M7528M88j8383J0017
13104E15905J1797j4413j0986K240O931L2574J8281j3428K6306J6256M002O23
13092E96088o813p805j3006R231n879n6621J7593J5724J3822L6011r275l7022
13080E52048j5148j8264L1067j1477p391J2432K2738l1446l0154O332L929o634
13068E08032p963J798j883l754J5855M883n703j2173L1685K3869J0827r538o656
$$ plain form
13055 549279 549448 554971 574086 575693 548248 556815 571603 579236 583415 586082 552740 555146 577092
13042 577092 553857 551411 555353 574873 570695 552033 562196 561610 555518 545708 545770 525469 536186
13029 536186 546683 554582 560270 560927 562770 586224 589467 574048 575066 585555 566322 545770 567294
13016 567294 573939 577874 600926 592701 574420 585206 580331 570607 587518 599647 594942 570672 571734
13003 571734 570012 564364 566368 565227 563358 557969 544459 542663 566288 549648 541416 549261 575371
12990 575371 583389 606084 609133 622961 630719 615897 593923 566158 562902 562212 594625 612227 607179
12977 607179 608727 614579 609823 614163 606677 588402 581202 567160 571905 550287 549286 567068 590460
12964 590460 581246 576318 592708 585568 605507 620711 602317 602606 582437 557745 565335 583089 581580
$$ packed form
13055E49279J69N523J9115J607k7445Q567J4788P633M179K667l3342K406K1946
13042E77092k3235k446L942J9520m178j8662J0163n86o092r810O2k0301J0717
13029E36186J0497P899N688O57J843K3454L243j5419J018J0489j9233k0552K1524
13016E67294O645L935K3052q225j8281J0786m875r724J6911J2129m705k4270J062
13003E71734j722n648K004j141j869n389j3510j796K3625j6640q232P845K6110
12990E75371Q018K2695L049J3828P758j4822k1974k7765l256o90L2413J7602n048
12977F07179J548N852m756M340p486j8275p200j4042M745k1618j001J7782K3392
12964E90460r214m928J6390p140J9939J5204j8394K89k0169k4692P590J7754j509
$$ plain form
12951 581580 579932 613547 639071 615322 596202 593648 595496 601749 602529 599472 632104 622444 614779
12938 614779 595056 624068 651790 608529 579422 579362 577109 571999 587837 607937 622831 637677
12926 637677 619274 608827 621183 653303 647603 651559 658672 640508 606717 592356 613296 647912
12914 647912 646998 604280 586381 600890 622143 626023 630227 596758 615660 641523 647393 627830
12902 627830 644244 649640 633670 639205 611426 595899 593842 638091 675403 682223 644863 621670
12890 621670 658119 653562 650097 633881 611297 621674 630012 635871 659408 676234 689147 664273
12878 664273 648060 629231 627254 620143 621137 653175 649443 616467 611920 621661 627312 602240 605697
12865 605697 607481 619350 656398 691992 673874 646745 640021 621912 614789 634611 653461 625011
$$ packed form
12951E81580j648L3615K5524k3749j9120k554J848O253P80l057L2632r660p665
12938F14779j9723K9012K7722m3261k9107o0k253n110J5838K0100J4894J4846
12926F37677j8403j0447J2356L2120n700L956P113j8164l3791j4361K0940L4616
12914F47912r14m2718j7899J4509K1253L880M204l3469J8902K5863N870j9563
12902F27830J6414N396j5970N535k7779j5527k057M4249L7312O820l7360k3193
12890F21670L6449m557l465j6216k2584J0377Q338N859K3537J6826J2913k4874
12878F64273j6213j8829j977p111R94L2038l732l2976m547R741N651k5072L457
12865F05697J784J1869L7048L5594j8118k7129o724j8109p123J9822J8850k8450
$$ plain form
12853 625011 632878 657808 637404 646860 655601 671832 695701 672873 676694 692414 684584 681734 667426
12840 667426 674425 707544 702715 704354 681187 674015 686975 703582 695820 711784 714330 703901 707921
12827 707921 672450 637274 653961 684497 688395 707049 684535 664663 652983 625479 630317 652367
12815 652367 657480 641872 658294 698978 698035 692555 673827 649693 663871 678620 678161 662563 673292
12802 673292 680383 668746 631846 639925 646428 662902 686975 679307 664449 646262 635341 654584
12790 654584 678790 662189 652973 669934 686649 676341 650159 642898 647885 651143 667831 679432
12778 679432 726230 738727 734210 700894 688262 692403 715012 702570 710734 700184 658241 648881
12766 648881 667490 669317 681934 688846 687648 692162 714521 724845 734611 707499 693292 704958
$$ packed form
12853F25011P867K4930k0404R456Q741J6231K3869k2828L821J5720p830k850j4308
12840F67426O999L3119m829J639k3167p172J2960J6607p762J5964K546j0429M020
12827G07921l5471l5176J6687L0536L898J8654k2514j9872j1680k7504M838K2050
12815F52367N113j5608J6422M0684r43n480j8728k4134J4178J4749m59j5598J0729
12802F73292P091j1637l6900Q079O503J6474K4073p668j4858j8187j0921J9243
12790F54584K4206j6601r216J6961J6715j0308k6182p261M987L258J6688J1601
12778F79432M6798J2497m517l3316j2632M141K2609j2442Q164j0550m1943r360
12766F48881J8609J827J2617O912j198M514K2359J0324R766k7112j4207J1666
$$ plain form
12754 704958 736741 724930 713630 709797 725147 737730 724866 717305 703437 688805 690688 733911
12742 733911 752243 723757 718694 732881 744288 738055 731793 758397 766002 754981 744303 749854
12730 749854 716285 703654 714207 719566 725126 750604 778719 770175 744727 731936 729561 748678
12718 748678 734448 721473 748746 729239 709365 686817 660824 699993 755636 772320 760903
12707 760903 730289 718948 733170 744290 754711 736101 723959 730983 757861 773252 756150 726515
12695 726515 736959 766581 798359 809218 803039 761941 728125 737099 770393 761688 763382 775291
12683 775291 791705 827049 838426 802722 786631 778134 805515 839726 794136 751458 752409 739763
12671 739763 748692 765669 741553 734661 733677 758664 763192 770973 808986 815744 816823 774663 752389
$$ packed form
12754G04958L1783j1811j1300l833J5350J2583j2864p561j3868j4632J883M3223
12742G33911J8332k8486n063J4187J1407o233o262K6604P605j1021j0678N551
12730G49854l3569j2631J0553N359N560K5478K8115q544k5448j2791k375J9117
12718G48678j4230j2975K7273j9507j9874k2548k5993L9169N5643J6684j1417
12707G60903l0614j1341J4222J1120J0421j8610j2142P024K6878J5391j7102k9635
12695G26515J0444K9622L1778J0859o179m1098l3816Q974L3294q705J694J1909
12683G75291J6414L5344J1377l5704j6091q497K7381L4211m5590m2678R51j2646
12671G39763Q929J6977k4116o892r84K4987M528P781L8013O758J079m2160k2274
$$ plain form
12658 752389 753117 774826 797865 793609 783627 793218 792070 797975 823373 831864 843513 819993 811221
12645 811221 805043 795347 787919 773909 778139 807581 812250 777601 741580 727322 744923 750828 756743
12632 756743 760885 795723 820441 819897 791998 819085 835396 825051 828841 818733 812471 779102
12620 779102 752169 750744 760986 776043 815333 823899 804319 798799 804576 808906 826815 827290 837838
12607 837838 844880 853066 845199 802536 800757 816060 818346 811535 828802 844167 827889 839556 854913
12594 854913 850371 835333 797540 784337 792709 799918 831065 836322 818122 794544 830489 837397
12582 837397 829782 836098 853544 851874 840068 843903 847996 862043 865726 845724 840666 814549 809331
12569 809331 804717 810896 849924 841820 847303 854441 846513 858092 850547 854657 839091 808129 815359
$$ packed form
12658G52389P28K1709K3039m256r982R591j148N905K5398Q491J1649k3520q772
12645H11221o178r696p428j4010M230K9442M669l4649l6021j4258J7601N905N915
12632G56743M142L4838K4718n44k7899K7087J6311j0345L790j0108o262l3369
12620G79102k6933j425J0242J5057L9290Q566j9580n520N777M330J7909M75J0548
12607H37838P042Q186p867m2663j779J5303K286o811J7267J5365j6278J1667J5357
12594H54913m542j5038l7793j3203Q372P209L1147N257j8200k3578L5945O908
12582H37397p615O316J7446j670j1806L835M093J4047L683k0002n058k6117n218
12569H09331m614O179L9028q104N483P138p928J1579p545M110j5566l0962P230
$$ plain form
12556 815359 820918 822651 800467 799566 803124 824215 831948 836610 853010 874460 864304 847096 834251
12543 834251 824640 855169 870254 857979 848194 845512 857721 886939 891454 882847 877746 871768 893892
12530 893892 904232 886216 854238 863072 895450 883783 868841 851222 854408 899887 902482 914021
12518 914021 917716 906287 915033 915946 912912 913991 923264 909897 884951 879621 898271 917511 933331
12505 933331 927993 931901 903683 903062 947303 938384 878782 836849 853418 859336 886746 900980 894070
12492 894070 877928 891765 912532 901523 893869 888749 898905 938102 936124 948808 954989 938556
12480 938556 943848 944296 912738 932405 943503 937504 935117 958997 948626 975163 978382 967423 982846
12467 982846 970535 973847 994701 970952 961472 964988 959299 942063 940820 959575 952536 953067 938091
$$ packed form
12556H15359N559J733k2184r01L558K1091P733M662J6400K1450j0156j7208j2845
12543H34251r611L0529J5085j2275r785k682J2209K9218M515q607n101n978K2124
12530H93892J0340j8016l1978Q834L2378j1667j4942j7619L186M5479K595J1539
12518I14021L695j1429Q746R13l034J079R273j3367k4946n330J8650J9240J5820
12505I33331n338L908k8218o21M4241q919n9602m1933J6569N918K7410J4234o910
12492H94070j6142J3837K0767j1009p654n120J0156L9197j978J2684O181j6433
12480I38556N292M48l1558J9667J1098n999k387K3880j0371K6537L219j0959J5423
12467I82846j2311L312K0854k3749r480L516n689j7236j243J8755p039N31j4976
$$ plain form
12454 938091 919330 934328 972165 969834 952047 954112 984790 972452 931131 938418 956935 943769
12442 943769 932911 927311 968264 954423 938013 931152 942362 951165 950874 954859 986233 1028413 1021661
12429 1021661 984843 972920 961058 971316 984330 1015976 1052779 1034475 998826 992803 991540 1008127
12417 1008127 1002283 970031 952606 958821 959318 995034 1015702 1005884 1012482 1017205 982994 965665 989556
12404 989556 996585 999514 1011156 1020396 1004962 999402 1012703 996841 982296 982740 986766 978454 951675
12391 951675 985709 987621 985188 976721 975817 980449 991797 977192 996588 1007135 973064 968324 999166
12378 999166 1031202 1038239 1029795 1018279 1001318 988078 1003994 996999 989811 1009628 1010715 986089
12366 986089 991087 985502 1013118 1024228 1004392 980456 957244 955128 965808 977620 994174 1017785
$$ packed form
12454I38091j8761J4998L7837k331j7787K065L0678j2338m1321P287J8517j3166
12442I43769j0858n600M0953j3841j6410o861J1210Q803k91L985L1374M2180o752
12429A021661l6818j1923j1862J0258J3014L1646L6803j8304l5649o023j263J6587
12417A008127n844l2252j7425O215M97L5716K0668r818O598M723l4211j7329K3891
12404I89556P029K929J1642R240j5434n560J3301j5862j4545M44M026q312k6779
12391I51675L4034J912k433q467r04M632J1348j4605J9396J0547l4071m740L0842
12378I99166L2036P037q444j1516j6961j3240J5916o995p188J9817J087k4626
12366I86089M998n585K7616J1110j9836k3936k3212k116J0680J1812J6554K3611
$$ plain form
12354 1017785 1005930 962791 975580 1017385 1028568 1048769 1036545 1034264 1063300 1062354 1052361 1030525
12342 1030525 1007993 1009246 1043954 1062056 1030339 1044046 1038135 1024920 1034185 1025567 1046335 1080279
12330 1080279 1079871 1047897 1043636 1083285 1089270 1073798 1093111 1090119 1103455 1139926 1136575 1120458
12318 1120458 1098422 1068259 1046915 1058422 1093656 1113037 1107337 1125318 1136591 1162338 1156728 1116834
12306 1116834 1117399 1098377 1107392 1116172 1086221 1101431 1083694 1045894 1046001 1064586 1080204 1084589 1086957
12293 1086957 1096641 1089750 1083400 1112133 1098840 1075750 1037533 1035927 1036433 1053388 1052056 1056224 1086939
12280 1086939 1065248 1062344 1089164 1124632 1123342 1128989 1140629 1121101 1082436 1078165 1115863 1112588
12268 1112588 1116351 1120347 1129934 1146482 1171932 1169346 1131556 1147532 1198097 1195649 1165079 1143937
$$ packed form
12354A017785j1855m3139J2789M1805J1183K0201j2224k281K9036r46r993k1836
12342A030525k2532J253L4708J8102l1717J3707n911j3215R265q618K0768L3944
12330A080279m08l1974m261L9649N985j5472J9313k992J3336L6471l351j6117
12318A120458k2036l0163k1344J1507L5234J9381n700J7981J1273K5747n610l9894
12306A116834N65j9022R015Q780k9951J5210j7737l7800J07J8585J5618M385K368
12293A086957R684o891o350K8733j3293k3090l8217j606N06J6955j332M168L0715
12280A086939k1691k904K6820L5468j290N647J1640j9528l8665m271L7698l275
12268A112588L763L996R587J6548K5450k586l7790J5976N0565k448l0570k1142
$$ plain form
12256 1143937 1118873 1112547 1125566 1105496 1094706 1105482 1123586 1137127 1166241 1174883 1179283 1189057
12244 1189057 1199111 1206379 1209671 1221639 1216120 1206148 1149091 1116512 1100567 1135681 1186491 1162853
12232 1162853 1147917 1162311 1196843 1188448 1169556 1164008 1129442 1135810 1162050 1185621 1218281 1229267
12220 1229267 1211457 1206902 1206953 1206859 1235342 1275083 1256984 1214694 1198382 1224275 1209398 1195565 1217999
12207 1217999 1224822 1204012 1232892 1238469 1229346 1230215 1218006 1207424 1238332 1239406 1232811 1228095 1230828
12194 1230828 1251232 1275045 1284908 1286181 1277389 1261587 1241831 1236135 1272380 1276623 1258116 1243616
12182 1243616 1250750 1255598 1238318 1238547 1232011 1260422 1259209 1275918 1255708 1247496 1236349 1226142 1201777
12169 1201777 1216453 1230654 1264360 1252537 1239288 1266553 1278457 1285603 1313849 1314832 1310260 1337906
$$ packed form
12256A143937k5064o326J3019k0070j0790J0776J8104J3541K9114Q642M400R774
12244A189057J0054P268L292J1968n519r972n7057l2579j5945L5114N0810k3638
12232A162853j4936J4394L4532q395j8892n548l4566O368K6240K3571L2660J0986
12220A229267j7810m555N1r4K8483L9741j8099m2290j6312K5893j4877j3833K2434
12207A217999O823k0810K8880N577r123Q69j2209j0582L0908J074o595m716K733
12194A230828K0404K3813R863J273q792j5802j9756n696L6245M243j8507j4500
12182A243616P134M848j7280K29o536K8411j213J6709k0210q212j1147j0207k4365
12169A201777J4676J4201L3706j1823j3249K7265J1904P146K8246R83m572K7646
$$ plain form
12157 1337906 1327590 1312063 1318044 1313832 1316078 1327368 1342315 1356676 1350801 1336120 1369250 1361906
12145 1361906 1333560 1322660 1316745 1330880 1368408 1355618 1324735 1303137 1293899 1313435 1318703 1336197
12133 1336197 1358057 1353250 1335436 1349034 1351044 1345811 1358192 1361143 1382769 1420385 1431463 1439870
12121 1439870 1397436 1380306 1353355 1335012 1341598 1379271 1412356 1417683 1431051 1414917 1407834 1398458
12109 1398458 1355472 1331842 1330732 1337169 1370323 1351989 1344263 1354391 1372607 1381956 1384274 1402772
12097 1402772 1415758 1419457 1427585 1444439 1438631 1412294 1402413 1397196 1398797 1390541 1394232 1387122 1399807
12084 1399807 1425942 1434052 1430213 1437368 1433945 1390760 1389673 1433172 1426152 1447928 1462102 1468141 1464138
12071 1464138 1454095 1473378 1465864 1457591 1440205 1443533 1456697 1474148 1472950 1474731 1484437 1492783 1472517
$$ packed form
12157A337906j0316j5527N981m212K246J1290J4947J4361n875j4681L3130p344
12145A361906k8346j0900n915J4135L7528j2790l0883k1598r238J9536N268J7494
12133A336197K1860m807j7814J3598K010n233J2381K951K1626L7616J1078Q407
12121A439870m2434j7130k6951j8343O586L7673L3085N327J3368j6134p083r376
12109A398458m2986k3630j110O437L3154j8334p726J0128J8216R349K318J8498
12097A402772J2986L699Q128J6854n808k6337r881n217J601q256L691p110J2685
12084A399807K6135Q110l839P155l423m3185j087M3499p020K1776J4174O039m003
12071A464138j0043J9283p514q273j7386L328J3164J7451j198J781R706Q346k0266
$$ plain form
12058 1472517 1479226 1510484 1522152 1527714 1515210 1512643 1491622 1482899 1457286 1454999 1481862 1500014
12046 1500014 1507671 1509467 1523682 1518452 1530499 1537423 1559008 1548741 1518292 1550378 1555673 1543351
12034 1543351 1533979 1530514 1550219 1537125 1528958 1552600 1538581 1515888 1524307 1534806 1550487 1564039
12022 1564039 1560106 1561574 1584038 1597540 1586773 1553916 1573690 1617585 1610552 1620473 1618386 1593416
12010 1593416 1624344 1646974 1638744 1662328 1653711 1670622 1683997 1650590 1614926 1587217 1558283 1563656
11998 1563656 1592937 1634432 1653437 1642677 1647345 1637560 1646429 1656936 1646233 1652430 1651403 1650863 1674710
11985 1674710 1673150 1684875 1699782 1704611 1692704 1674887 1669020 1689499 1679492 1694913 1696076 1689394
11973 1689394 1673987 1686105 1706924 1693775 1694025 1689036 1697719 1713214 1737739 1730289 1691591 1706391
$$ packed form
12058A472517O709L1258J1668N562j2504k567k1021q723k5613k287K6863J8152
12046A500014P657J796J4215n230J2047O924K1585j0267l0449L2086N295j2322
12034A543351r372l465J9705j3094q167K3642j4019k2693Q419J0499J5681J3552
12022A564039l933J468K2464J3502j0767l2857J9774M3895p033R921k087k4970
12010A593416L0928K2630q230K3584q617J6911J3375l3407l5664k7709k8934N373
11998A563656K9281M1495J9005j0760M668r785Q869J0507j0703O197j027n40K3847
11985A674710j560J1725J4907M829j1907j7817n867K0479j0007J5421J163o682
11973A689394j5407J2118K0819j3149K50m989Q683J5495K4525p450l8698J4800
$$ plain form
11961 1706391 1728628 1710654 1711742 1726878 1741187 1746874 1749863 1741669 1754239 1747091 1739131 1736103 1763992
11948 1763992 1770941 1803818 1812467 1800155 1787393 1780861 1781046 1753455 1769519 1804594 1773418 1766430
11936 1766430 1786465 1813760 1798301 1812897 1808842 1823995 1836795 1832148 1844744 1843444 1838653 1859838
11924 1859838 1878952 1872354 1848592 1844665 1858597 1874159 1867260 1856551 1847333 1845378 1858675 1872044
11912 1872044 1870870 1857511 1852183 1871565 1905235 1910591 1900892 1901392 1862927 1846781 1854656 1896559 1921448
11899 1921448 1909788 1904050 1900083 1896816 1891441 1870738 1851351 1828529 1843522 1880847 1918479 1948195
11887 1948195 1969247 1976858 1972456 1973893 1963298 1939220 1925915 1925482 1939542 1941787 1930188 1920375 1962810
11874 1962810 1994330 1984941 2002380 2007124 2000283 1995109 1995934 1991365 1991754 1991803 2008223 2010202 1980385 1998551
$$ packed form
11961A706391K2237j7974J088J5136J4309N687K989q194J2570p148p960l028K7889
11948A763992O949L2877Q649j2312j2762o532J85k7591J6064L5075l1176o988
11936A766430K0035K7295j5459J4596m055J5153J2800m647J2596j300m791K1185
11924A859838J9114o598k3762l927J3932J5562o899j0709r218j955J3297J3369
11912A872044j174j3359n328J9382L3670N356r699N00l8465j6146P875M1903K4889
11899A921448j1660n738l967l267n375k0703j9387k2822J4993L7325L7632K9716
11887A948195K1052P611m402J437j0595k4078j3305m33J4060K245j1599r813M2435
11874A962810L1520r389J7439M744o841n174Q25m569L89M9J6420J979k9817J8166
$$ plain form
11860 1998551 2018818 2029203 2026867 2035498 2022054 1989461 1972560 1979215 2022477 2044443 2074718 2098141
11848 2098141 2106188 2097191 2088643 2110898 2102264 2099935 2106589 2126071 2148233 2131393 2097616 2094683 2120320
11835 2120320 2129683 2134489 2135870 2156662 2136710 2143135 2173399 2167300 2155923 2147243 2130547 2100313
11823 2100313 2106398 2118091 2113394 2133450 2158526 2183547 2206036 2184902 2172224 2174515 2220950 2236979
11811 2236979 2254891 2261223 2276575 2284034 2278233 2247570 2239556 2249828 2255683 2281080 2293469 2267046
11799 2267046 2282357 2289741 2256006 2270222 2302918 2326990 2328750 2348854 2347615 2354591 2358098 2355230
11787 2355230 2352277 2350859 2368371 2372964 2361447 2371796 2395052 2424631 2435724 2428938 2422329 2396378
11775 2396378 2387829 2380833 2397566 2384370 2387711 2424647 2438013 2437937 2455372 2477318 2478501 2480191 2452376
$$ packed form
11860A998551K0267J0385k336Q631j3444l2593j6901O655M3262K1966L0275K3423
11848B098141Q047q997q548K2255q634k329O654J9482K2162j6840l3777k933K5637
11835B120320R363M806J381K0792j9952O425L0264o099j1377q680j6696l0234
11823B100313O085J1693m697K0056K5076K5021K2489k1134j2678K291M6435J6029
11811B236979J7912O332J5352P459n801l0663q014J0272N855K5397J2389k6423
11799B267046J5311P384l3735J4216L2696K4072J760K0104j239O976L507k868
11787B355230k953j418J7512M593j1517J0349K3256K9579J1093o786o609k5951
11775B396378q549o996J6733j3196L341L6936J3366p6J7435K1946J183J690k7815
$$ plain form
11762 2452376 2466062 2485075 2468993 2463483 2449935 2449626 2470230 2510410 2536747 2539658 2532150 2564093
11750 2564093 2586124 2569719 2537109 2504701 2528843 2562697 2597652 2581467 2573604 2578543 2597941 2625052
11738 2625052 2653507 2623820 2603865 2600933 2622396 2620325 2632653 2624191 2613960 2629200 2660716 2661947
11726 2661947 2658593 2675546 2694566 2684126 2718248 2767053 2783149 2788880 2772249 2765711 2765246 2798456
11714 2798456 2828324 2841409 2822271 2795917 2813623 2850960 2860214 2881993 2871413 2875739 2877956 2880194
11702 2880194 2877894 2901442 2924624 2960872 2974843 2978439 3007271 3033405 3055255 3089581 3074181 3085103
11690 3085103 3118983 3133063 3151684 3163027 3179896 3224215 3278066 3303366 3291011 3317217 3387793
11679 3387793 3456517 3521953 3592865 3683688 3786378 3914139 3980236 3825972 3389439 2887682
$$ packed form
11762B452376J3686J9013j6082n510j3548l09K0604M0180K6337K911p508L1943
11750B564093K2031j6405l2610l2408K4142L3854L4955j6185p863M939J9398K7111
11738B625052K8455k9687j9955k932K1463k071J2328q462j0231J5240L1516J231
11726B661947l354J6953J9020j0440L4122M8805J6096N731j6631o538m65L3210
11714B798456K9868J3085j9138k6354J7706L7337R254K1779j0580M326K217K238
11702B880194k300K3548K3182L6248J3971L596K8832K6134K1850L4326j5400J0922
11690C085103L3880J4080J8621J1343J6869M4319N3851K5300j2355K6206P0576
11679C387793O8724O5436P0912R0823J02690J27761O6097j54264m36533n01757
$$ plain form
11669 2887682 2549115 2432375 2439360 2473375 2511108 2526912 2550720 2557135 2575469 2619156 2664384
11658 2664384 2692691 2717440 2753434 2773657 2780201 2808639 2813547 2800569 2816643 2834876 2856629 2872662
11646 2872662 2866977 2885129 2926577 2961527 2970809 2994606 3020726 3043859 3042729 3037286 3053128 3059579
11634 3059579 3052476 3066923 3070764 3071751 3100639 3116231 3125581 3113619 3107756 3117292 3157259 3210798 3245864
11621 3245864 3266885 3302404 3310637 3284295 3277295 3326151 3358805 3348425 3333371 3358862 3364469 3360386
11609 3360386 3348047 3372037 3401286 3437825 3453922 3417139 3402278 3418300 3466466 3493397 3494017 3506891
11597 3506891 3527362 3552374 3595486 3613087 3622596 3637721 3620388 3586828 3589377 3622021 3626178 3641616
11585 3641616 3677780 3699802 3711673 3726221 3701871 3730107 3759621 3773259 3808534 3805835 3776783
$$ packed form
11669B887682l38567j16740O985L4015L7733J5804K3808O415J8334M3687M5228
11658B664384K8307K4749L5994K0223O544K8438M908j2978J6074J8233K1753J6033
11646B872662n685J8152M1448L4950R282K3797K6120K3133j130n443J5842O451
11634C059579p103J4447L841R87K8888J5592R350j1962n863R536L9967N3539L5066
11621C245864K1021L5519Q233k6342p000M8856L2654j0380j5054K5491N607m083
11609C360386j2339K3990K9249L6539J6097l6783j4861J6022M8166K6931O20J2874
11597C506891K0471K5012M3112J7601R509J5125j7333l3560K549L2644M157J5438
11585C641616L6164K2022J1871J4548k4350K8236K9514J3638L5275k699k9052
$$ plain form
11574 3776783 3788254 3793959 3830799 3839221 3821897 3772202 3768709 3806172 3861514 3892299 3907988 3901373
11562 3901373 3910377 3940426 3949125 3959695 3977372 3983053 3999639 4032090 4065930 4102418 4104468 4126340
11550 4126340 4120201 4139792 4185185 4195434 4194671 4204034 4224036 4250002 4237598 4260627 4278325 4275653
11538 4275653 4292931 4336729 4382151 4417471 4416078 4416645 4402902 4421560 4466223 4480711 4495090 4561515
11526 4561515 4583350 4582645 4576746 4591899 4616045 4630122 4658784 4693596 4754654 4800061 4827943 4853414
11514 4853414 4855832 4873349 4891042 4850086 4841351 4847871 4801459 4767548 4755874 4748392 4760212 4754901
11502 4754901 4801326 4814338 4802655 4833276 4837361 4827680 4846466 4913801 4981562 5023379 5008320 5025558
11490 5025558 5059096 5084292 5097278 5100137 5126627 5175382 5241385 5268481 5265984 5287929 5327864 5370140
$$ packed form
11574C776783J1471N705L6840Q422j7324m9695l493L7463N5342L0785J5689o615
11562C901373R004L0049Q699J0570J7677N681J6586L2451L3840L6488K050K1872
11550D126340o139J9591M5393J0249p63R363K0002K5966j2404K3029J7698k672
11538D275653J7278M3798M5422L5320j393N67j3743J8658M4663J4488J4379O6425
11526D561515K1835p05n899J5153K4146J4077K8662L4812O1058M5407K7882K5471
11514D853414K418J7517J7693m0956q735O520m6412l3911j1674p482J1820n311
11502D754901M6425J3012j1683L0621M085r681J8786O7335O7761M1817j5059J7238
11490E025558L3538K5196J2986K859K6490M8755O6003K7096k497K1945L9935M2276
$$ plain form
11478 5370140 5416922 5454914 5460333 5464990 5493260 5552946 5616150 5645763 5625333 5649945 5671670 5730435
11466 5730435 5756101 5782371 5808088 5841993 5836849 5845553 5856728 5881183 5920367 5956848 5981170 6017823
11454 6017823 6068154 6092118 6112026 6165051 6206919 6281015 6329431 6366708 6362356 6391877 6429161
11443 6429161 6479906 6549140 6601283 6632390 6663697 6655258 6641223 6678398 6742229 6770068 6808295
11432 6808295 6879598 6926208 6963302 6992052 7044095 7076554 7097375 7132124 7178623 7228999 7293091
11421 7293091 7349409 7397342 7459067 7526922 7554567 7602386 7662483 7725408 7754034 7787823 7830560
11410 7830560 7859277 7948787 8033286 8077208 8141680 8194932 8224564 8254796 8321905 8378144 8411378
11399 8411378 8476744 8551575 8596959 8664253 8716057 8767172 8849321 8908394 8978161 9025083 9051162
$$ packed form
11478E370140M6782L7992N419M657K8270N9686O3204K9613k0430K4612K1725N8765
11466E730435K5666K6270K5717L3905n144Q704J1175K4455L9184L6481K4322L6653
11454F017823N0331K3964J9908N3025M1868P4096M8416L7277m352K9521L7284
11443F429161N0745O9234N2143L1107L1307q439j4035L7175O3831K7839L8227
11432F808295P1303M6610L7094K8750N2043L2459K0821L4749M6499N0376O4092
11421G293091N6318M7933O1725O7855K7645M7819O0097O2925K8626L3789M2737
11410G830560K8717Q9510Q4499M3922O4472N3252K9632L0232O7109N6239L3234
11399H411378O5366P4831M5384O7294N1804N1115Q2149N9073O9767M6922K6079
$$ plain form
11388 9051162 9069702 9105449 9202902 9348505 9469396 9535346 9594560 9689311 9795236 9863894 9927374
11377 9927374 9984282 10041819 10144983 10238048 10298184 10362073 10435378 10542011 10610478 10679621 10775173
11366 10775173 10875927 10965752 11057978 11144466 11237748 11359011 11492506 11618273 11791366 11905648
11356 11905648 12003542 12115128 12221224 12332574 12493301 12658488 12765239 12867895 12989683
11347 12989683 13144276 13334517 13494925 13648837 13783743 13906994 14081769 14242904 14367097
11338 14367097 14530669 14707296 14878582 15060500 15255275 15444207 15636396 15818978 16005597
11329 16005597 16207297 16431628 16640773 16869527 17127947 17403507 17655852 17912232 18181076
11320 18181076 18446045 18724277 19006015 19344320 19694558 20000246 20281802 20600373 20953737
$$ packed form
11388I051162J8540L5747R7453J45603J20891O5950N9214R4751J05925O8658O3480
11377I927374N6908N7537J03164R3065O0136O3889P3305J06633O8467O9143R5552
11366A0775173J00754Q9825R2226Q6488R3282J21263J33495J25767J73093J14282
11356A1905648R7894J11586J06096J11350J60727J65187J06751J02656J21788
11347A2989683J54593J90241J60408J53912J34906J23251J74775J61135J24193
11338A4367097J63572J76627J71286J81918J94775J88932J92189J82582J86619
11329A6005597K01700K24331K09145K28754K58420K75560K52345K56380K68844
11320A8181076K64969K78232K81738L38305L50238L05688K81556L18571L53364
$$ plain form
11311 20953737 21332572 21768090 22217879 22670865 23164889 23687755 24181048 24673121 25190678
11302 25190678 25744300 26344527 26950261 27587896 28272667 29014232 29785101 30533352 31325733
11293 31325733 32205634 33143635 34155667 35232341 36365362 37537574 38773802 40135135
11285 40135135 41570089 43029960 44371405 45674929 47175995 49031444 51210185 53681302
11277 53681302 56412897 59444800 62932120 66877674 71352357 76376343 82063363 88664815
11269 88664815 96457642 105860731 117496241 132076100 150127330 171156110 190419814
11262 190419814 191818657 150189081 63154372 -30558189 -84066496 -99174597 -99026595
11255 -99026595 -96121992 -93921009 -91547719 -88553967 -85246840 -81895097 -78398428 -74668993
$$ packed form
11311B0953737L78835M35518M49789M52986M94024N22866M93293M92073N17557
11302B5190678N53622O00227O05734O37635O84771P41565P70869P48251P92381
11293C1325733Q79901R38001J012032J076674J133021J172212J236228J361333
11285D0135135J434954J459871J341445J303524J501066J855449K178741K471117
11277E3681302K731595L031903L487320L945554M474683N023986N687020O601452
11269H8664815P792827R403089J1635510J4579859J8051230K1028780J9263704
11262A90419814J398843m1629576q7034709r3712561n3508307j5108101J48002
11255i9026595K904603K200983K373290K993752L307127L351743L496669L729435
$$ plain form
11247 -74668993 -70870449 -67254085 -63940263 -60981546 -58347217 -55902229 -53500552 -51156898
11239 -51156898 -48906199 -46877781 -45167036 -43870415 -42794112 -41612092 -40349444 -39117944
11231 -39117944 -37998899 -36993580 -36055097 -35198514 -34491028 -33844786 -33192944 -32496577 -31815464
11222 -31815464 -31126772 -30488386 -29845473 -29224187 -28605133 -27987147 -27393781 -26811280 -26246974
11213 -26246974 -25698425 -25187836 -24710385 -24248514 -23746697 -23247279 -22747341 -22267955 -21808179
11204 -21808179 -21330347 -20840344 -20421448 -20023095 -19729537 -19640950 -19815930 -20147857 -20370671
11195 -20370671 -20402619 -20269623 -20048250 -19773537 -19494320 -19180696 -18857485 -18562762 -18289607
11186 -18289607 -17978472 -17670686 -17346200 -17060168 -16808584 -16539675 -16291294 -16031919 -15758902
$$ packed form
11247g4668993L798544L616364L313822K958717K634329K444988K401677K343654
11239e1156898K250699K028418J710745J296621J076303J182020J262648J231500
11231c9117944J119045J005319R38483Q56583P07486O46242O51842O96367O81113
11222c1815464O88692O38386O42913O21286O19054O17986N93366N82501N64306
11213b6246974N48549N10589M77451M61871N01817M99418M99938M79386M59776
11204b1808179M77832M90003M18896L98353K93558Q8587j74980l31927k22814
11195b0370671l1948J32996K21373K74713K79217L13624L23211K94723K73155
11186a8289607L11135L07786L24486K86032K51584K68909K48381K59375K73017
$$ plain form
11177 -15758902 -15470119 -15191006 -14854452 -14493079 -14117197 -13682108 -13216130 -12694671 -12148885
11168 -12148885 -11784505 -12033690 -13127079 -14715935 -16000164 -16529142 -16493349 -16317483 -16154084
11159 -16154084 -15987905 -15803222 -15596103 -15427749 -15276950 -15117897 -14955239 -14739176 -14504897
11150 -14504897 -14308077 -14117405 -13934775 -13758469 -13555673 -13395822 -13253762 -13110142 -12987972
11141 -12987972 -12854803 -12697997 -12555230 -12387522 -12243038 -12120019 -11997521 -11919598 -11914849 -11885651
11131 -11885651 -11802049 -11699399 -11580377 -11461087 -11351271 -11245778 -11160710 -11098904 -11022896 -10972982
11121 -10972982 -10887487 -10787067 -10735665 -10675451 -10619210 -10543095 -10451975 -10317373 -10212135 -10155659
11111 -10155659 -10094253 -10017075 -9951409 -9863889 -9751948 -9671237 -9604431 -9548172 -9472396 -9400066 -9318163
$$ packed form
11177a5758902K88783K79113L36554L61373L75882M35089M65978N21459N45786
11168a2148885L64380k49185j093389j588856j284229n28978L5793J75866J63399
11159a6154084J66179J84683K07119J68354J50799J59053J62658K16063K34279
11150a4504897J96820J90672J82630J76306K02796J59851J42060J43620J22170
11141a2987972J33169J56806J42767J67708J44484J23019J22498P7923M749K9198
11131a1885651Q3602J02650J19022J19290J09816J05493Q5068O1806P6008M9914
11121a0972982Q5495J00420N1402O0214N6241P6115R1120J34602J05238N6476
11111a0155659O1406P7178O5666Q7520J11941Q0711O6806N6259P5776P2330Q1903
$$ plain form
11100 -9318163 -9221578 -9157446 -9098217 -9045166 -8952043 -8887129 -8821713 -8778314 -8715030 -8617717 -8545836
11089 -8545836 -8470376 -8443333 -8421784 -8361798 -8252507 -8172486 -8109151 -8055723 -8001027 -7921220 -7852428
11078 -7852428 -7820466 -7773585 -7705257 -7669548 -7640088 -7602654 -7553304 -7511245 -7481890 -7467509 -7463866
11067 -7463866 -7413993 -7348124 -7267512 -7204622 -7193719 -7151352 -7105265 -7075185 -7042832 -6998978 -6951785
11056 -6951785 -6927262 -6847211 -6794085 -6773765 -6731489 -6715148 -6681057 -6649032 -6601225 -6547733 -6547610 -6540461
11044 -6540461 -6532727 -6461278 -6389566 -6336995 -6307867 -6279592 -6258405 -6248513 -6232390 -6203113 -6183079 -6162261
11032 -6162261 -6128488 -6132517 -6126068 -6089941 -6063742 -6026174 -5975602 -5953208 -5927720 -5886373 -5847333 -5825718
11020 -5825718 -5795342 -5758826 -5727119 -5707461 -5705205 -5678436 -5665538 -5658612 -5610864 -5547910 -5520626 -5484821
$$ packed form
11100i318163R6585O4132N9229N3051R3123O4914O5416M3399O3284R7313P1881
11089h545836P5460K7043K1549N9986J09291Q0021O3335N3428N4696P9807O8792
11078g852428L1962M6881O8328L5709K9460L7434M9350M2059K9355J4381L643
11067g463866M9873O5869Q0612O2890J0903M2367M6087L0080L2353M3854M7193
11056f951785K4523Q0051N3126K0320M2276J6341L4091L2025M7807N3492J23P149
11044f540461P734P1449P1712N2571K9128K8275K1187R892J6123K9277K0034K0818
11032f162261L3773m029O449L6127K6199L7568N0572K2394K5488M1347L9040K1615
11020e825718L0376L6516L1707J9658K256K6769J2898O926M7748O2954K7284L5805
$$ plain form
11008 -5484821 -5452719 -5452684 -5447097 -5406812 -5383651 -5338971 -5306981 -5313831 -5290488 -5265182 -5233601 -5224001
10996 -5224001 -5212118 -5190692 -5164015 -5145140 -5159859 -5189665 -5158910 -5110949 -5064037 -5038249 -5029986
10985 -5029986 -4986164 -4961005 -4940922 -4941386 -4935104 -4909306 -4868986 -4865174 -4880556 -4874447 -4867876 -4849730
10973 -4849730 -4843798 -4822488 -4791804 -4743685 -4718696 -4695074 -4694332 -4692874 -4647028 -4636728 -4606994 -4573368
10961 -4573368 -4552862 -4556711 -4553164 -4523839 -4525548 -4509882 -4516199 -4509403 -4503463 -4506419 -4497918 -4434288 -4403957
10948 -4403957 -4372579 -4379586 -4355542 -4336233 -4326561 -4307076 -4296477 -4266924 -4240539 -4224340 -4201722 -4204969
10936 -4204969 -4203469 -4170881 -4147305 -4146802 -4147066 -4124199 -4093370 -4061943 -4049936 -4050830 -4033126 -3998461 -3984920
10923 -3984920 -3962042 -3936167 -3926142 -3918495 -3922319 -3905147 -3848111 -3838135 -3873141 -3862059 -3833810 -3804708
$$ packed form
11008e484821L2102L5N587M0285K3161M4680L1990o850K3343K5306L1581R600
10996e224001J1883K1426K6677J8875j4719k9806L0755M7961M6912K5788Q263
10985e029986M3822K5159K0083m64O282K5798M0320L812j5382O109O571J8146
10973d849730N932K1310L0684M8119K4989K3622P42J458M5846J0300K9734L3626
10961d573368K0506l849L547K9325j709J5666o317O796N940k956Q501O3630L0331
10948d403957L1378p007K4044J9309R672J9485J0599K9553K6385J6199K2618l247
10936d204969J500L2588K3576N03k64K2867L0829L1427J2007q94J7704L4665J3541
10923c984920K2878K5875J0025P647l824J7172N7036R976l5006J1082K8249K9102
$$ plain form
10911 -3804708 -3790167 -3800252 -3807317 -3787208 -3762351 -3751746 -3733357 -3720079 -3702251 -3719316 -3719100 -3702926
10899 -3702926 -3667208 -3642408 -3616706 -3625813 -3617130 -3584481 -3582549 -3553067 -3532804 -3542772 -3537807 -3510322
10887 -3510322 -3508737 -3513944 -3480742 -3460259 -3461239 -3488455 -3457921 -3434429 -3432114 -3414569 -3373255 -3352729
10875 -3352729 -3326988 -3303653 -3270195 -3265031 -3248200 -3219074 -3188151 -3188337 -3165849 -3163870 -3142293 -3098247
10863 -3098247 -3060411 -3049753 -3049470 -3026755 -2990724 -2972956 -2988988 -2961308 -2899659 -2846503 -2805989 -2769323
10851 -2769323 -2713277 -2615054 -2498451 -2365914 -2276618 -2239992 -2316579 -2630282 -3115997 -3499500
10841 -3499500 -3644112 -3666157 -3658877 -3654749 -3662367 -3644101 -3630769 -3610326 -3590025 -3576259 -3534940 -3497276
10829 -3497276 -3480939 -3446908 -3415296 -3404058 -3365080 -3333943 -3316430 -3307282 -3323973 -3303743 -3262899
$$ packed form
10911c804708J4541j0085p065K0109K4857J0605J8389J3278J7828j7065K16J6174
10899c702926L5718K4800K5702r107Q683L2649J932K9482K0263r968M965K7485
10887c510322J585n207L3202K0483r80k7216L0534K3492K315J7545M1314K0526
10875c352729K5741K3335L3458N164J6831K9126L0923j86K2488J979K1577M4046
10863c098247L7836J0658K83K2715L6031J7768j6032K7680O1649N3156M0514L6666
10851b769323N6046R8223J16603J32537Q9296L6626p6587l13703m85715l83503
10841c499500j44612k2045P280M128p618J8266J3332K0443K0301J3766M1319L7664
10829c497276J6337L4031L1612J1238L8978L1137J7513R148j6691K0230M0844
$$ plain form
10818 -3262899 -3226440 -3217498 -3240588 -3211682 -3187732 -3188713 -3196555 -3163702 -3140040 -3115679 -3109030 -3092485
10806 -3092485 -3068776 -3073297 -3102221 -3119183 -3147339 -3113612 -3068777 -3025704 -2987824 -2969578 -2974926 -2976321
10794 -2976321 -2965797 -2977522 -2986694 -2982885 -2979420 -2998056 -3002716 -2986492 -2993968 -2995738 -2963098 -2940440
10782 -2940440 -2919340 -2889103 -2872387 -2900906 -2911425 -2887441 -2846285 -2823567 -2824648 -2800021 -2772292
10771 -2772292 -2759991 -2754296 -2816739 -2868420 -2881053 -2872938 -2850124 -2856948 -2881116 -2863121 -2859499 -2845858
10759 -2845858 -2809899 -2782778 -2778544 -2770494 -2764849 -2737621 -2738887 -2746107 -2720986 -2718821 -2716483 -2715908 -2726300
10746 -2726300 -2696275 -2677198 -2690032 -2709491 -2698685 -2668604 -2652573 -2649424 -2643486 -2647260 -2650686 -2654190
10734 -2654190 -2669239 -2674407 -2647994 -2646088 -2635323 -2600628 -2587496 -2585104 -2592913 -2633473 -2620614 -2605830
$$ packed form
10818c262899L6459Q942k3090K8906K3950r81p842L2853K3662K4361O649J6545
10806c092485K3709m521k8924j6962k8156L3727M4835M3073L7880J8246n348j395
10794b976321J0524j1725r172L809L465j8636m660J6224p476j770L2640K2658
10782b940440K1100L0237J6716k8519j0519K3984M1156K2718j081K4627K7729
10771b772292J2301N695o2443n1681j2633Q115K2814o824k4168J7995L622J3641
10759b845858L5959K7121M234Q050N645K7228j266p220K5121K165K338N75j0392
10746b726300L0025J9077j2834j9459J0806L0081J6031L149N938l774l426l504
10734b654190j5049n168K6413J906J0765L4695J3132K392p809m0560J2859J4784
$$ plain form
10722 -2605830 -2583154 -2547709 -2533659 -2556922 -2598164 -2592424 -2579218 -2582977 -2572623 -2545566 -2549755 -2568292
10710 -2568292 -2556596 -2557873 -2563367 -2538709 -2487823 -2497007 -2516750 -2539386 -2531440 -2504344 -2465902 -2452733
10698 -2452733 -2455127 -2437926 -2436684 -2476692 -2486107 -2477808 -2470629 -2452158 -2417249 -2400710 -2422676 -2422278 -2416509
10685 -2416509 -2407362 -2392159 -2387771 -2363432 -2332868 -2336559 -2330533 -2352683 -2349021 -2317741 -2321851 -2354077
10673 -2354077 -2364036 -2352081 -2343134 -2317137 -2303019 -2292721 -2305986 -2293543 -2303462 -2334313 -2308875 -2291705
10661 -2291705 -2283574 -2274412 -2263107 -2273281 -2265130 -2232220 -2249812 -2257975 -2255945 -2266048 -2287621 -2277694
10649 -2277694 -2250508 -2255174 -2249100 -2249941 -2254256 -2244953 -2226151 -2223909 -2216935 -2236210 -2232840 -2207427 -2185122
10636 -2185122 -2192172 -2205250 -2208482 -2220287 -2205745 -2176017 -2155545 -2188421 -2217239 -2212574 -2211027 -2194026
$$ packed form
10722b605830K2676L5445J4050k3263m1242N740J3206l759J0354K7057m189j8537
10710b568292J1696j277n494K4658N0886r184j9743k2636P946K7096L8442J3169
10698b452733k394J7201J242m0008r415Q299P179J8471L4909J6539k1966L98N769
10685b416509R147J5203M388K4339L0564l691O026k2150L662L1280m110l2226
10673b354077r959J1955Q947K5997J4118J0298j3265J2443r919l0851K5438J7170
10661b291705Q131R162J1305j0174Q151L2910j7592q163K030j0103k1573R927
10649b277694K7186m666O074q41m315R303J8802K242O974j9275L370K5413K2305
10636b185122p050j3078l232j1805J4542K9728K0472l2876k8818M665J547J7001
$$ plain form
10624 -2194026 -2147857 -2152124 -2146472 -2146604 -2143127 -2143014 -2138114 -2142395 -2140266 -2134757 -2114898 -2106757 -2086946 -2090872
10610 -2090872 -2097879 -2117902 -2135829 -2129342 -2125068 -2140712 -2148466 -2110911 -2077838 -2072155 -2071170 -2098991 -2116249
10597 -2116249 -2114399 -2118274 -2116129 -2094425 -2101973 -2109354 -2110662 -2117666 -2114987 -2117301 -2110963 -2108222 -2084358
10584 -2084358 -2059919 -2061450 -2062405 -2040896 -2047891 -2052575 -2051812 -2087006 -2094341 -2056372 -2036660 -2035547 -2043958
10571 -2043958 -2065317 -2074667 -2079970 -2062193 -2036159 -1992488 -1979718 -2022422 -2031423 -1991881 -1958618 -1962738
10559 -1962738 -1986374 -1983814 -1991018 -1998992 -1998566 -1973980 -1962499 -1947710 -1917866 -1921255 -1955735 -1965965
10547 -1965965 -1951927 -1948461 -1933974 -1938190 -1920828 -1906021 -1915357 -1909692 -1909006 -1910758 -1909697 -1906536 -1949304
10534 -1949304 -1929950 -1918277 -1905506 -1877459 -1889368 -1918149 -1927999 -1926137 -1921435 -1895475 -1880748 -1864500
$$ packed form
10624b194026M6169m267N652j32L477J13M900m281K129N509J9859Q141J9811l926
10610b090872p007k0023j7927O487M274j5644p754L7555L3073N683R85k7821j7258
10597b116249J850l875K145K1704p548p381j308p004K679k314O338K741K3864
10584b084358K4439j531r55K1509o995m684P63l5194p335L7969J9712J113q411
10571b043958k1359r350n303J7777K6034M3671J2770m2704r001L9542L3263m120
10559a962738k3636K560p204p974M26K4586J1481J4789K9844l389l4480j0230
10547a965965J4038L466J4487m216J7362J4807r336N665O86j752J061L161m2768
10534a949304J9354J1673J2771K8047j1909k8781r850J862M702K5960J4727J6248
$$ plain form
10522 -1864500 -1850384 -1836280 -1825321 -1850807 -1876165 -1875443 -1899115 -1892310 -1887979 -1882050 -1888752 -1902928
10510 -1902928 -1897363 -1905823 -1889093 -1852162 -1864409 -1879820 -1859108 -1856769 -1870677 -1874168 -1853216 -1846290
10498 -1846290 -1862905 -1887767 -1885614 -1872843 -1876357 -1874602 -1823609 -1818736 -1820817 -1808720 -1803778 -1808833 -1820593
10485 -1820593 -1817579 -1826356 -1830763 -1826016 -1819065 -1815053 -1795148 -1758783 -1758024 -1768493 -1766481 -1754525 -1765676
10472 -1765676 -1762259 -1762557 -1756867 -1777507 -1797168 -1779814 -1794751 -1802784 -1769175 -1775168 -1798577 -1813105
10460 -1813105 -1801703 -1777013 -1772510 -1779067 -1774035 -1770829 -1789760 -1795096 -1804932 -1772164 -1737248 -1729496 -1745172
10447 -1745172 -1767442 -1745734 -1730243 -1724886 -1716693 -1740800 -1727041 -1701846 -1710286 -1722416 -1743691 -1790558
10435 -1790558 -1785261 -1760614 -1746745 -1752461 -1760464 -1765383 -1775678 -1770982 -1760417 -1766741 -1792637 -1790660 -1781340
$$ packed form
10522a864500J4116J4104J0959k5486k5358P22k3672O805M331N929o702j4176
10510a902928N565q460J6730L6931j2247j5411K0712K339j3908l491K0952O926
10498a846290j6615k4862K153J2771l514J755N0993M873k081J2097M942n055j1760
10485a820593L014q777m407M747O951M012J9905L6365P59j0469K012J1956j1151
10472a765676L417k98N690k0640j9661J7354j4937q033L3609n993k3409j4528
10460a813105J1402K4690M503o557N032L206j8931n336r836L2768L4916P752j5676
10447a745172k2270K1708J5491N357Q193k4107J3759K5195q440j2130k1275m6867
10435a790558N297K4647J3869n716q003m919j0295M696J0565o324k5896J977R320
$$ plain form
10422 -1781340 -1780164 -1763685 -1722381 -1703529 -1717569 -1693547 -1671847 -1660344 -1679256 -1704337 -1732791
10411 -1732791 -1719090 -1695890 -1715323 -1708224 -1709895 -1690787 -1669290 -1648187 -1658420 -1677606 -1690806 -1664209
10399 -1664209 -1642392 -1663514 -1660732 -1671814 -1674653 -1664123 -1637051 -1614354 -1637440 -1653559 -1675511 -1690092
10387 -1690092 -1667173 -1655208 -1677057 -1703843 -1709222 -1717641 -1691461 -1672956 -1658226 -1684917 -1687183 -1653594
10375 -1653594 -1611804 -1617155 -1622028 -1614125 -1638098 -1643758 -1642936 -1650423 -1686070 -1673657 -1648836 -1638640 -1616697
10362 -1616697 -1602293 -1584451 -1609654 -1610846 -1584576 -1550981 -1531222 -1559753 -1584512 -1581138 -1570457 -1544922
10350 -1544922 -1536227 -1522981 -1542913 -1587375 -1605728 -1643818 -1667488 -1646892 -1620317 -1644949 -1663592
10339 -1663592 -1642243 -1614573 -1618587 -1635052 -1636713 -1638009 -1652379 -1633149 -1600226 -1578474 -1563110 -1572541
$$ packed form
10422a781340J176J6479M1304J8852j4040K4022K1700J1503j8912k5081k8454
10411a732791J3701K3200j9433P099j671J9108K1497K1103j0233j9186j3200K6597
10399a664209K1817k1122K782j1082k839J0530K7072K2697k3086j6119k1952j4581
10387a690092K2919J1965k1849k6786n379q419K6180J8505J4730k6691k266L3589
10375a653594M1790n351m873P903k3973n660Q22p487l5647J2413K4821J0196K1943
10362a616697J4404J7842k5203j192K6270L3595J9759k8531k4759L374J0681K5535
10350a544922Q695J3246j9932m4462j8353l8090k3670K0596K6575k4632j8643
10339a663592K1349K7670m014j6465j661j296j4370J9230L2923K1752J5364r431
$$ plain form
10327 -1572541 -1596366 -1620718 -1616247 -1605733 -1631173 -1630107 -1585008 -1583377 -1597839 -1604701 -1591630 -1587110
10315 -1587110 -1587946 -1578932 -1573800 -1573737 -1564027 -1552252 -1559555 -1561101 -1543056 -1564599 -1574634 -1557882 -1551635
10302 -1551635 -1547419 -1542121 -1564885 -1577477 -1569887 -1573171 -1551328 -1552109 -1546179 -1517136 -1545295 -1564908 -1548834
10289 -1548834 -1505472 -1497074 -1520614 -1516346 -1501019 -1477837 -1482794 -1489605 -1506239 -1513391 -1520033 -1514485 -1487839
10276 -1487839 -1462881 -1484466 -1533231 -1575371 -1562188 -1528364 -1513692 -1519465 -1494562 -1484300 -1526403
10265 -1526403 -1541364 -1532907 -1540652 -1592840 -1562439 -1482376 -1464797 -1435973 -1422335 -1452752 -1483314 -1490715
10253 -1490715 -1522552 -1500586 -1519406 -1505814 -1511561 -1526824 -1500929 -1491088 -1485215 -1468870 -1465246 -1478691
10241 -1478691 -1490694 -1492636 -1474641 -1445310 -1444612 -1486736 -1501459 -1499633 -1512269 -1495973 -1498250 -1488279
$$ packed form
10327a572541k3825k4352M471J0514k5440J066M5099J631j4462o862J3071M520
10315a587110q36R014N132O3R710J1775p303j546J8045k1543j0035J6752O247
10302a551635M216N298k2764j2592P590l284K1843p81N930K9043k8159j9613J6074
10289a548834M3362Q398k3540M268J5327K3182m957o811j6634p152o642N548K6646
10276a487839K4958k1585m8765m2140J3183L3824J4672n773K4903J0262m2103
10265a526403j4961Q457p745n2188L0401Q0063J7579K8824J3638l0417l0562p401
10253a490715l1837K1966j8820J3592n747j5263K5895R841N873J6345L624j3445
10241a478691j2003j942J7995K9331O98m2124j4723J826j2636J6296k277R971
$$ plain form
10229 -1488279 -1496399 -1500065 -1522072 -1501763 -1509852 -1476449 -1443154 -1431418 -1420069 -1404581 -1445939 -1452252
10217 -1452252 -1428081 -1446429 -1447934 -1454706 -1468827 -1483259 -1505796 -1484866 -1474690 -1445403 -1444253 -1429483
10205 -1429483 -1404051 -1438847 -1467752 -1447180 -1414427 -1423844 -1449156 -1437414 -1448340 -1470338 -1479711 -1465835
10193 -1465835 -1403932 -1383872 -1393078 -1398150 -1417757 -1415211 -1415563 -1439000 -1460919 -1455982 -1464410 -1451638 -1416707
10180 -1416707 -1391380 -1401120 -1414018 -1409961 -1411732 -1430558 -1428804 -1422888 -1423316 -1403749 -1374194 -1373996 -1398692
10167 -1398692 -1396018 -1346599 -1350662 -1363184 -1354186 -1369307 -1411383 -1405212 -1380546 -1371524 -1362295 -1399986
10155 -1399986 -1439683 -1411367 -1388708 -1396881 -1386763 -1407363 -1405688 -1397541 -1392971 -1389435 -1393179 -1382904
10143 -1382904 -1387397 -1400904 -1415267 -1403615 -1405538 -1425376 -1417263 -1428632 -1429285 -1392095 -1368956 -1371616
$$ packed form
10229a488279q120l666k2007K0309q089L3403L3295J1736J1349J5488m1358o313
10217a452252K4171j8348j505o772j4121j4432k2537K0930J0176K9287J150J4770
10205a429483K5432l4796k8905K0572L2753r417k5312J1742j0926k1998r373J3876
10193a465835O1903K0060r206n072j9607K546l52k3437k1919M937q428J2772L4931
10180a416707K5327r740j2898M057j771j8826J754N916m28J9567K9555J98k4696
10167a398692K674M9419m063j2522Q998j5121m2076O171K4666R022R229l7691
10155a399986l9697K8316K2659q173J0118k0600J675Q147M570L536l744J0275
10143a382904m493j3507j4363J1652j923j9838Q113j1369o53L7190K3139k660
$$ plain form
10131 -1371616 -1372968 -1403163 -1418618 -1386141 -1359612 -1333953 -1334929 -1324491 -1313373 -1309497 -1309887 -1324698
10119 -1324698 -1359502 -1384752 -1353070 -1312160 -1351389 -1364066 -1333813 -1309281 -1324656 -1330230 -1336272 -1354214
10107 -1354214 -1380165 -1372503 -1362638 -1326142 -1301842 -1262736 -1243963 -1294192 -1305231 -1288402 -1272609 -1267458
10095 -1267458 -1273560 -1296515 -1313668 -1301204 -1277238 -1260642 -1251108 -1245979 -1231306 -1230187 -1263107 -1266554
10083 -1266554 -1247082 -1262637 -1282262 -1267068 -1261033 -1244548 -1244456 -1237144 -1211561 -1218590 -1225443 -1236298 -1241629
10070 -1241629 -1251604 -1285606 -1271830 -1242784 -1231943 -1214962 -1189868 -1199512 -1208494 -1195982 -1182637 -1214291
10058 -1214291 -1237743 -1200127 -1155110 -1157251 -1170058 -1172908 -1188363 -1218333 -1182258 -1174880 -1177434 -1150613
10046 -1150613 -1134637 -1139424 -1161016 -1176301 -1180426 -1186702 -1198864 -1195974 -1192320 -1178391 -1130041 -1098980
$$ packed form
10131a371616j352l0195j5455L2477K6529K5659r76J0438J1118L876l90j4811
10119a324698l4804k5250L1682M0910l9229j2677L0253K4532j5375n574o042j7942
10107a354214k5951P662R865L6496K4300L9106J8773n0229j1039J6829J5793N151
10095a267458o102k2955j7153J2464K3966J6596R534N129J4673J119l2920l447
10083a266554J9472j5555j9625J5194O035J6485R2P312K5583p029o853j0855n331
10070a241629r975l4002J3776K9046J0841J6981K5094r644q982J2512J3345l1654
10058a214291k3452L7616M5017k141j2807k850j5455k9970L6075P378k554K6821
10046a150613J5976m787k1592j5285m125o276j2162K890L654J3929M8350L1061
$$ plain form
10034 -1098980 -1064904 -1104161 -1128179 -1131152 -1168249 -1180413 -1138227 -1105485 -1090550 -1097934 -1114715 -1124187
10022 -1124187 -1112970 -1120985 -1094683 -1090108 -1078458 -1062618 -1069377 -1054963 -1041198 -1060288 -1091706 -1087794
10010 -1087794 -1056114 -1032152 -1006328 -1020429 -1024999 -1008833 -993653 -1004307 -1015409 -1006230 -975974 -949927
9998 -949927 -959167 -938121 -926944 -934763 -941806 -947897 -974163 -994688 -981347 -948473 -904831 -898090 -901630
9985 -901630 -909184 -913775 -897025 -903448 -915174 -875113 -820323 -790358 -794410 -794210 -752506 -732235 -696274
9972 -696274 -709236 -686794 -650152 -607256 -551825 -496893 -492487 -490567 -455852 -402779 -350530 -270600
9960 -270600 -178891 -87324 10242 86349 163552 321807 507864 733784 1023135 1381998 1769351
9949 1769351 1758989 866288 -740088 -2183163 -2710449 -2752340 -2660287 -2621695 -2625647 -2580128
$$ packed form
10034a098980L4076l9257k4018k973l7097j2164M2186L2742J4935p384j6781r472
10022a124187J1217q015K6302M575J1650J5840o759J4414J3765j9090l1418L912
10010a087794L1680K3962K5824j4101m570J6166J5180j0654j1102R179L0256K6047
9998i49927r240K1046J1177p819p043o091k6266k0525J3341L2874M3642O741l540
9985i01630p554m591J6750o423j1726M0061N4790K9965m052K00M1704K0271L5961
9972f96274j2962K2442L6642M2896N5431N4932M406J920L4715N3073N2249P9930
9960b70600R1709R1567R7566P6107P7203J58255J86057K25920K89351L58863L87353
9949A769351j0362q92701j606376j443075n27286m1891R2053L8592l952M5519
$$ plain form
9939 -2580128 -2568224 -2542274 -2486571 -2402687 -2337396 -2291319 -2239722 -2173710 -2116717 -2084373 -2055070
9928 -2055070 -2012375 -1975662 -1915542 -1881498 -1885968 -1868528 -1825986 -1816524 -1831470 -1796769 -1753034 -1720613
9916 -1720613 -1706556 -1735193 -1747544 -1711872 -1676897 -1675117 -1681690 -1670562 -1665356 -1669922 -1665199 -1638066
9904 -1638066 -1632454 -1642976 -1634064 -1629418 -1614142 -1607484 -1606311 -1590470 -1580549 -1571302 -1545458 -1539983 -1538060
9891 -1538060 -1523199 -1518024 -1499888 -1487952 -1478984 -1471930 -1483176 -1506093 -1522795 -1518037 -1510390 -1503987 -1521173
9878 -1521173 -1502742 -1519398 -1517831 -1492853 -1457798 -1430484 -1422284 -1414425 -1432375 -1422815 -1396918 -1421205
9866 -1421205 -1432314 -1437207 -1417326 -1397737 -1392004 -1401724 -1408985 -1393254 -1384796 -1377784 -1360276 -1352959 -1343691
9853 -1343691 -1369697 -1395421 -1387000 -1386125 -1365660 -1359143 -1374376 -1402893 -1413346 -1400164 -1401158 -1405128 -1406536
$$ packed form
9939b580128J1904K5950N5703Q3884O5291M6077N1597O6012N6993L2344K9303
9928b055070M2695L6713O0120L4044m470J7440M2542R462j4946L4701M3735L2421
9916a720613J4057k8637j2351L5672L4975J780o573J1128N206m566M723K7133
9904a638066N612j0522Q912M646J5276O658J173J5841R921R247K5844N475J923
9891a538060J4861N175J8136J1936Q968P054j1246k2917j6702M758P647O403j7186
9878a521173J8431j6656J567K4978L5055K7314Q200P859j7950R560K5897k4287
9866a421205j1109m893J9881J9589N733r720p261J5731Q458P012J7508P317R268
9853a343691k6006k5724Q421Q75K0465O517j5233k8517j0453J3182r94l970j408
$$ plain form
9840 -1406536 -1414252 -1386834 -1351814 -1356974 -1344085 -1327126 -1350646 -1381606 -1362850 -1325924 -1337684 -1344029
9828 -1344029 -1344756 -1340112 -1314534 -1284863 -1273995 -1271651 -1287783 -1323884 -1317129 -1323238 -1309862 -1310983 -1313462
9815 -1313462 -1320063 -1293319 -1285579 -1281624 -1288611 -1320707 -1333110 -1312550 -1276363 -1246314 -1228654 -1221577
9803 -1221577 -1241774 -1241980 -1257619 -1247163 -1262967 -1292683 -1288437 -1276825 -1259091 -1265472 -1261112 -1285026
9791 -1285026 -1304695 -1271969 -1253351 -1235718 -1236030 -1261373 -1254922 -1228548 -1230980 -1236951 -1245153 -1261779 -1283501
9778 -1283501 -1280887 -1250509 -1240144 -1227758 -1207385 -1208392 -1205413 -1207583 -1226728 -1227479 -1186078 -1169743 -1191315
9765 -1191315 -1186193 -1181400 -1204566 -1239673 -1244355 -1228264 -1195285 -1209885 -1221015 -1201646 -1217760 -1238928
9753 -1238928 -1241411 -1230626 -1231894 -1220464 -1206736 -1207924 -1218494 -1236545 -1239205 -1227252 -1209450 -1205873
$$ packed form
9840a406536p716K7418L5020n160J2889J6959k3520l0960J8756L6926j1760o345
9828a344029p27M644K5578K9671J0868K344j6132l6101O755o109J3376j121k479
9815a313462o601K6744P740L955o987l2096j2403K0560L6187L0049J7660P077
9803a221577k0197k06j5639J0456j5804k9716M246J1612J7734o381M360k3914
9791a285026j9669L2726J8618J7633l12k5343O451K6374k432n971q202j6626k1722
9778a283501K614L0378J0365J2386K0373j007K979k170j9145p51M1401J6335k1572
9765a191315N122M793k3166l5107m682J6091L2979j4600j1130J9369j6114k1168
9753a238928k483J0785j268J1430J3728j188j0570j8051k660J1953J7802L577
$$ plain form
9741 -1205873 -1207020 -1221168 -1246353 -1232530 -1209993 -1204864 -1207351 -1160043 -1170357 -1186567 -1192458 -1181591
9729 -1181591 -1175897 -1152181 -1164959 -1188871 -1163693 -1165739 -1189098 -1197222 -1173658 -1186460 -1220689 -1218963
9717 -1218963 -1206045 -1192594 -1191452 -1182363 -1181331 -1189760 -1194783 -1194705 -1202909 -1225052 -1204534 -1170596 -1183844
9704 -1183844 -1179770 -1147324 -1139571 -1114648 -1117800 -1160194 -1166240 -1150070 -1165123 -1190726 -1210882 -1214339
9692 -1214339 -1195282 -1179130 -1175373 -1179236 -1156090 -1114818 -1105818 -1088071 -1107098 -1143951 -1155607 -1137075
9680 -1137075 -1135812 -1150166 -1177055 -1199271 -1179290 -1166523 -1137318 -1125221 -1135094 -1136300 -1116901 -1086507
9668 -1086507 -1065292 -1073277 -1051958 -1064948 -1104715 -1108278 -1099382 -1091910 -1081976 -1082769 -1073450 -1104883 -1092429
9655 -1092429 -1055859 -1027510 -1042070 -1065640 -1096606 -1113427 -1128659 -1137214 -1134212 -1142988 -1140338 -1120799
$$ packed form
9741a205873j147j4148k5185J3823K2537N129k487M7308j0314j6210n891J0867
9729a181591N694K3716j2778k3912K5178k046k3359q124K3564j2802l4229J726
9717a218963J2918J3451J142R089J032q429n023P8q204k2143K0518L3938j3248
9704a183844M074L2446P753K4923l152m2394o046J6170j5053k5603k0156l457
9692a214339J9057J6152L757l863K3146M1272R000J7747j9027l6853j1656J8532
9680a137075J263j4354k6889k2216J9981J2767K9205J2097r873j206J9399L0394
9668a086507K1215p985K1319j2990l9767l563Q896P472R934p93R319l1433J2454
9655a092429L6570K8349j4560k3570l0966j6821j5232q555L002q776K650J9539
$$ plain form
9643 -1120799 -1108199 -1110911 -1120074 -1111792 -1105556 -1083972 -1064166 -1085081 -1098743 -1111659 -1115907 -1081994
9631 -1081994 -1079262 -1072784 -1057282 -1092880 -1127495 -1110659 -1093664 -1114600 -1107645 -1072414 -1064588 -1057571
9619 -1057571 -1027047 -1012467 -1029526 -1045802 -1061930 -1080958 -1098654 -1095054 -1088810 -1079223 -1073717 -1078019
9607 -1078019 -1087910 -1081418 -1082154 -1078355 -1079309 -1067595 -1051356 -1044931 -1070522 -1096995 -1086397 -1077131 -1077270 -1058716
9593 -1058716 -1051471 -1045256 -1039520 -1032311 -1041248 -1068083 -1029832 -1021125 -1055804 -1091450 -1061447 -1054107 -1056595
9580 -1056595 -1032702 -1046407 -1062824 -1046589 -1058790 -1054335 -1023558 -1045934 -1100511 -1125450 -1100739 -1079027
9568 -1079027 -1049996 -1049241 -1070402 -1074017 -1065921 -1073144 -1078279 -1058897 -1018677 -1013679 -1023352 -1012281 -1034312
9555 -1034312 -1051238 -1013695 -1002507 -1015625 -1017015 -1022495 -999529 -998119 -1009127 -1006119 -995907 -988784
$$ packed form
9643a120799J2600k712r163Q282O236K1584J9806k0915j3662j2916m248L3913
9631a081994K732O478J5502l5598l4615J6836J6995k0936O955L5231P826P017
9619a057571L0524J4580j7059j6276j6128j9028j7696L600O244R587N506m302
9607a078019r891O492p36L799r54J1714J6239O425k5591k6473J0598R266j39J8554
9593a058716P245O215N736P209q937k6835L8251Q707l4679l5646L0003P340k488
9580a056595K3893j3705j6417J6235j2201M455L0777k2376n4577k4939K4711K1712
9568a079027K9031P55k1161l615Q096p223n135J9382M0220M998r673J1071k2031
9555a034312j6926L7543J1188j3118j390n480K2966J410j1008L008J0212P123
$$ plain form
9543 -988784 -992164 -1012432 -1043695 -1027762 -1004683 -1000623 -998375 -975718 -983098 -1029604 -1061309 -1065618 -1056237
9530 -1056237 -1044851 -1030889 -1008841 -996647 -1016253 -1035462 -1025072 -998875 -1008113 -982826 -993776 -1010541
9518 -1010541 -1033992 -1017537 -978428 -976275 -995923 -1029210 -1027732 -1021981 -1014757 -1017243 -1030065 -1033900 -1028158
9505 -1028158 -1008530 -1022684 -1043307 -1012456 -986732 -988048 -985056 -1006093 -1019872 -1026699 -1017528 -999805
9493 -999805 -1007845 -1006782 -1033218 -1065939 -1067911 -1065350 -1046421 -1030401 -1027809 -1023869 -991272 -1009840 -1053374
9480 -1053374 -1020122 -973863 -962243 -961309 -995955 -1008666 -1015554 -1031513 -1037368 -1029327 -1006224 -997656 -990838
9467 -990838 -1014585 -1022671 -1029139 -1016039 -986822 -968479 -968085 -982608 -1011427 -1018856 -986144 -980573 -962168
9454 -962168 -976404 -963764 -981925 -987840 -974161 -979078 -972265 -967741 -969402 -961252 -959981 -974193 -962096
$$ packed form
9543i88784l380k0268l1263J5933K3079M060K248K2657p380m6506l1705m309R381
9530a056237J1386J3962K2048J2194j9606j9209J0390K6197r238K5287j0950j6765
9518a010541k3451J6455L9109K153j9648l3287J478N751P224k486j2822l835N742
9505a028158J9628j4154k0623L0851K5724j316K992k1037j3779o827R171J7723
9493i99805q040J063k6436l2721j972K561J8929J6020K592L940L2597j8568m3534
9480a053374L3252M6259J1620R34l4646j2711o888j5959n855Q041K3103Q568O818
9467i90838k3747q086o468J3100K9217J8343L94j4523k8819p429L2712N571J8405
9454i62168j4236J2640j8161n915J3679m917O813M524j661Q150J271j4212J2097
$$ plain form
9441 -962096 -947495 -947770 -975817 -983255 -974465 -957458 -951327 -966731 -950143 -937750 -917468 -908450 -917677
9428 -917677 -924873 -957663 -968428 -917338 -921326 -937816 -929334 -914680 -925811 -951834 -965317 -966427
9416 -966427 -977177 -964341 -975908 -962797 -897402 -880072 -902159 -926356 -931164 -921295 -928378 -923169
9404 -923169 -903114 -905170 -907588 -924427 -897639 -861891 -865362 -874121 -896412 -883031 -862819 -873508
9392 -873508 -910672 -941551 -964380 -955769 -942202 -946769 -950500 -966868 -975983 -973077 -966960 -952767 -934287
9379 -934287 -921663 -900279 -902233 -924678 -934147 -898967 -884992 -884875 -887452 -884235 -896258 -936520 -935893
9366 -935893 -914815 -885881 -897942 -933162 -932674 -907265 -914378 -917352 -925783 -912952 -900706 -912181 -940300
9353 -940300 -924468 -888370 -902520 -917655 -926232 -920751 -913325 -898149 -899943 -918478 -911385 -907162 -922704
$$ packed form
9441i62096J4601k75k8047p438Q790J7007O131j5404J6588J2393K0282R018r227
9428i17677p196l2790j0765N1090l988j6490Q482J4654j1131k6023j3483j110
9416i66427j0750J2836j1567J3111O5395J7330k2087k4197m808R869p083N209
9404i23169K0055k056k418j6839K6788L5748l471q759k2291J3381K0212j0689
9392h73508l7164l0879k2829Q611J3567m567l731j6368r115K906O117J4193J8480
9379i34287J2624K1384j954k2445r469L5180J3975J17k577L217j2023m0262O27
9366i35893K1078K8934j2061l5220M88K5409p113k974q431J2831J2246j1475k8119
9353i40300J5832L6098j4150j5135q577N481P426J5176j794j8535P093M223j5542
$$ plain form
9340 -922704 -920266 -950948 -954726 -933462 -899254 -843555 -841633 -866791 -860155 -874403 -873751 -867601 -862027
9327 -862027 -888593 -901653 -902595 -900166 -879150 -882050 -864794 -860834 -867796 -902945 -930023 -945514 -924806
9314 -924806 -923436 -922716 -902279 -890000 -891601 -892192 -874905 -895967 -901020 -871781 -879975 -891090 -874426
9301 -874426 -905131 -901333 -878161 -860736 -888276 -890951 -900797 -895014 -866501 -878393 -887323 -890050 -894487
9288 -894487 -887333 -851157 -847435 -825085 -839315 -852114 -862840 -874703 -877684 -886546 -864199 -824704
9276 -824704 -836480 -848067 -842251 -845311 -844503 -869425 -887829 -874682 -874639 -868743 -867827 -832000 -818168 -837384
9262 -837384 -854491 -886130 -895409 -911494 -926416 -904235 -871678 -837032 -820727 -855963 -874293 -859747
9250 -859747 -834456 -811316 -811902 -850823 -866084 -852655 -860143 -831494 -820447 -832778 -831830 -811325 -808510
$$ packed form
9340i22704K438l0682l778K1264L4208N5699J922k5158O636j4248O52O150N574
9327h62027k6566j3060r42K429K1016k900J7256L960o962l5149k7078j5491K0708
9314i24806J370P20K0437J2279j601n91J7287k1062n053K9239q194j1115J6664
9301h74426l0705L798K3172J7425k7540k675r846N783K8513j1892q930k727m437
9288h94487P154L6176L722K2350j4230j2799j0726j1863k981q862K2347L9495
9276h24704j1776j1587N816l060Q08k4922j8404J3147M3N896R16L5827J3832j9216
9262h37384j7107l1639r279j6085j4922K2181L2557L4646J6305l5236j8330J4546
9250h59747K5291K3140n86l8921j5261J3429p488K8649J1047j2331R48K0505K815
$$ plain form
9237 -808510 -814375 -819942 -847058 -854139 -869166 -876209 -885961 -871276 -839749 -813753 -795235 -805129 -818252
9224 -818252 -813145 -808331 -812713 -850900 -879469 -861047 -822869 -805171 -839383 -844133 -838766 -825202 -810805
9211 -810805 -836430 -835852 -814353 -799222 -819324 -844270 -841988 -854124 -864097 -888612 -896677 -859397 -818890
9198 -818890 -817344 -823602 -815839 -785164 -794518 -813511 -827479 -832988 -851606 -843314 -792713 -770835 -766444
9185 -766444 -802802 -864013 -857128 -834644 -837962 -837805 -819995 -832557 -842656 -832400 -818439 -820160 -832445
9172 -832445 -813785 -798203 -831549 -845103 -851422 -821011 -818934 -780507 -783641 -835489 -851734 -871268
9160 -871268 -864226 -848583 -836070 -808241 -807805 -792030 -782559 -791410 -797415 -818141 -814855 -845471 -859649
9147 -859649 -836986 -831685 -789943 -755551 -762231 -781785 -816230 -850038 -869362 -864473 -854922 -818973
$$ packed form
9237h08510n865n567k7116p081j5027p043r752J4685L1527K5996J8518r894j3123
9224h18252N107M814m382l8187k8569J8422L8178J7698l4212m750N367J3564J4397
9211h10805k5625N78K1499J5131k0102k4946K282j2136r973k4515q065L7280M0507
9198h18890J546o258P763L0675r354j8993j3968n509j8618Q292N0601K1878M391
9185g66444l6358o1211O885K2484l318J57J7810j2562j0099J0256J3961j721j2285
9172h32445J8660J5582l3346j3554o319L0411K077L8427l134n1848j6245j9534
9160h71268P042J5643J2513K7829M36J5775R471q851o005k0726L286l0616j4178
9147h59649K2663N301M1742L4392o680j9554l4445l3808j9324M889R551L5949
$$ plain form
9135 -818973 -825241 -818491 -817343 -796213 -795334 -794384 -818704 -830479 -829046 -849500 -806309 -776884 -801091
9122 -801091 -822053 -779897 -761518 -778765 -791787 -804111 -820210 -821469 -798493 -793008 -775687 -761988
9110 -761988 -740674 -734070 -751670 -770100 -757545 -755073 -762302 -757413 -766007 -756855 -756428 -789403 -809622
9097 -809622 -791282 -768430 -784333 -778602 -781894 -762823 -772051 -781587 -790246 -828060 -825808 -796072 -809776
9084 -809776 -807538 -793629 -798111 -784876 -766952 -784060 -814313 -812160 -799512 -830451 -833926 -836304 -814746
9071 -814746 -799234 -770543 -774066 -745483 -719973 -739495 -754780 -746713 -751226 -747855 -765042 -786218
9059 -786218 -799513 -796868 -781167 -784610 -803710 -806263 -802317 -774434 -780685 -777715 -787330 -783876 -802834
9046 -802834 -797264 -774322 -783809 -817679 -789576 -752391 -752216 -766241 -765374 -786852 -774300 -803693 -777051
$$ packed form
9135h18973o268O750J148K1130Q79R50k4320j1775J433k0454M3191K9425k4207
9122h01091k0962M2156J8379j7247j3022j2324j6099j259K2976N485J7321J3699
9110g61988K1314O604j7600j8430J2555K472p229M889q594R152M27l2975k0219
9097h09622J8340K2852j5903N731l292J9071r228r536q659l7814K252K9736j3704
9084h09776K238J3909m482J3235J7924j7108l0253K153J2648l0939l475k378K1558
9071h14746J5512K8691l523K8583K5510j9522j5285Q067m513L371j7187k1176
9059g86218j3295K645J5701l443j9100k553L946K7883o251K970r615L454j8958
9046h02834N570K2942r487l3870K8103L7185J75j4025Q67k1478J2552k9393K6642
$$ plain form
9033 -777051 -762222 -760943 -774053 -777887 -791252 -801035 -769185 -744437 -707948 -714240 -714580 -737527 -765289
9020 -765289 -796296 -821835 -797837 -772885 -758042 -753494 -772588 -798851 -771596 -767108 -776080 -772489
9008 -772489 -774569 -776133 -792028 -779690 -768447 -769402 -760864 -774643 -754981 -739762 -733835 -762998 -775302
8995 -775302 -748262 -709369 -687705 -716706 -752691 -783846 -795450 -790711 -775572 -795808 -776122 -753468
8983 -753468 -759184 -752352 -736262 -736708 -722493 -708107 -712231 -715262 -697813 -705418 -717649 -727472 -712058
8970 -712058 -699254 -698988 -704918 -744183 -753129 -732043 -742107 -731165 -738082 -743285 -753380 -750911 -775192
8957 -775192 -767195 -753291 -735086 -721382 -711434 -689618 -663473 -696292 -713549 -718305 -739961 -755002
8945 -755002 -755777 -742173 -727535 -705536 -699583 -688267 -709837 -710654 -712866 -724852 -733155 -719618 -685832
$$ packed form
9033g77051J4829J279j3110l834j3365r783L1850K4748L6489o292l40k2947k7762
9020g65289l1007k5539K3998K4952J4843M548j9094k6263K7255M488q972L591
9008g72489k080j564j5895J2338J1243r55Q538j3779J9662J5219N927k9163j2304
8995g75302K7040L8893K1664k9001l5985l1155j1604M739J5139k0236J9686K2654
8983g53468n716O832J6090m46J4215J4386m124l031J7449p605j2231r823J5414
8970g12058J2804K66n930l9265q946K1086j0064J0942o917n203j0095K469k4281
8957g75192P997J3904J8205J3704R948K1816K6145l2819j7257m756k1656j5041
8945g55002p75J3604J4638K1999N953J1316k1570q17k212j1986q303J3537L3786
$$ plain form
8932 -685832 -682455 -671191 -656199 -671681 -663929 -636850 -653084 -678557 -696698 -703922 -688557 -702210
8920 -702210 -707002 -722731 -698642 -689272 -716659 -734697 -727886 -708869 -710746 -695704 -697951 -674609 -674716
8907 -674716 -700907 -729025 -729627 -714437 -689729 -687979 -679745 -691365 -686505 -680359 -676927 -668353 -671782
8894 -671782 -673325 -672678 -659155 -626305 -632778 -672128 -685870 -696604 -701042 -675040 -664624 -670696 -683824
8881 -683824 -652071 -622479 -639803 -660791 -664376 -659638 -654711 -655871 -663842 -642590 -628636 -602580 -596400
8868 -596400 -621223 -635282 -638479 -663052 -679407 -663042 -648721 -628623 -636667 -643559 -625548 -625935 -623807
8855 -623807 -614423 -601932 -580380 -586781 -611548 -635151 -654501 -683105 -687367 -674044 -668002 -678099
8843 -678099 -671195 -667238 -649170 -651987 -656158 -674090 -703127 -726322 -708254 -682480 -656437 -672063
$$ packed form
8932f85832L377J1264J4992j5482P752K7079j6234k5473j8141p224J5365j3653
8920g02210m792j5729K4089R370k7387j8038O811J9017j877J5042k247K3342j07
8907f74716k6191k8118o02J5190K4708J750Q234j1620M860O146L432Q574l429
8894f71782j543O47J3523L2850o473l9350j3742j0734m438K6002J0416o072j3128
8881f83824L1753K9592j7324k0988l585M738M927j160p971K1252J3954K6056O180
8868e96400k4823j4059l197k4573j6355J6365J4321K0098q044o892J8011l87K128
8855f23807R384J2491K1552o401k4767k3603j9350k8604m262J3323O042j0097
8843f78099O904L957J8068k817m171j7932k9037k3195J8068K5774K6043j5626
$$ plain form
8831 -672063 -691033 -723100 -745442 -735773 -669077 -636708 -625057 -637304 -635915 -607293 -597830 -599093
8819 -599093 -602939 -617052 -647038 -670080 -684468 -662978 -641707 -638011 -621517 -596650 -587805 -581120
8807 -581120 -573906 -545348 -516164 -529544 -583092 -569953 -544596 -573284 -598643 -593039 -601600 -602443 -583344
8794 -583344 -581943 -604454 -624955 -650695 -652546 -625120 -617640 -626193 -623529 -582885 -578952 -537478 -518528
8781 -518528 -539295 -555545 -553552 -536136 -528532 -536495 -518144 -505777 -516038 -510537 -512486 -501277 -491517
8768 -491517 -481071 -441641 -437426 -444723 -415568 -416031 -453039 -467121 -473899 -468555 -436025 -435204 -429591
8755 -429591 -433627 -400944 -355646 -334211 -333050 -339393 -320194 -268963 -229680 -190024 -158820 -121962
8743 -121962 -107348 -126093 -190548 -349252 -532929 -677104 -758469 -789726 -789425 -827413 -914140
$$ packed form
8831f72063j8970l2067k2342R669O6696L2369J1651j2247J389K8622R463j263
8819e99093l846j4113k9986k3042j4388K1490K1271L696J6494K4867Q845O685
8807e81120P214K8558K9184j3380n3548J3139K5357k8688k5359N604q561q43J9099
8794e83344J401k2511k0501k5740j851K7426P480q553K664M0644L933M1474J8950
8781e18528k0767j6250J993J7416P604p963J8351J2367j0261N501j949J1209R760
8768d91517J0446L9430M215p297K9155m63l7008j4082o778N344L2530Q21N613
8755d29591m036L2683M5298K1435J161o343J9199N1231L9283L9656L1204L6858
8743a21962J4614j8745o4455j58704j83677j44175q1365l1257L01l7988q6727
$$ plain form
8732 -914140 -948378 -982420 -953723 -926347 -924615 -958790 -965189 -961000 -944164 -930262 -916455 -925129
8720 -925129 -919689 -891786 -898634 -892982 -899744 -872753 -824933 -826673 -824513 -813726 -798669 -804901 -802412
8707 -802412 -786458 -773483 -781807 -787490 -815791 -818133 -799893 -804424 -798724 -773722 -776563 -787305 -814173
8694 -814173 -835555 -811815 -795506 -784986 -744191 -715813 -699123 -688422 -701313 -718130 -734874 -746504
8682 -746504 -744349 -761304 -743430 -716251 -723601 -736394 -734917 -742325 -738994 -714221 -709679 -691334 -667933
8669 -667933 -671394 -682600 -701572 -706130 -692559 -679701 -669478 -687739 -678930 -667297 -677609 -680697
8657 -680697 -664279 -657952 -647039 -624861 -657159 -672949 -638269 -619238 -624897 -636370 -652136 -656684
8645 -656684 -645188 -643345 -680155 -709998 -679424 -645552 -598864 -579334 -598680 -603095 -606878 -586096
$$ packed form
8732i14140l4238l4042K8697K7376J732l4175o399M189J6836J3902J3807q674
8720i25129N440K7903o848N652o762K6991M7820j740K160J0787J5057o232K489
8707h02412J5954J2975q324n683k8301k342J8240m531N700K5002k841j0742k6868
8694h14173k1382K3740J6309J0520M0795K8378J6690J0701j2891j6817j6744j1630
8682g46504K155j6955J7874K7179p350j2793J477p408L331K4773M542J8345K3401
8669f67933l461j1206j8972m558J3571J2858J0223j8261Q809J1633j0312l088
8657f80697J6418O327J0913K2178l2298j5790L4680J9031n659j1473j5766m548
8645f56684J1496J843l6810k9843L0574L3872M6688J9530j9346m415l783K0782
$$ plain form
8633 -586096 -600292 -618465 -620729 -619133 -619492 -614114 -587222 -582137 -529176 -493379 -531028 -563192 -583035
8620 -583035 -596814 -600617 -613191 -654065 -671136 -651170 -634102 -631258 -615624 -621550 -606306 -574238
8608 -574238 -579316 -599858 -587850 -598011 -588929 -527287 -505532 -496084 -512735 -553476 -557802 -523025
8596 -523025 -521855 -518024 -490751 -459258 -430427 -430014 -468991 -482305 -461095 -482302 -498898 -526781
8584 -526781 -599739 -663454 -735167 -792497 -836493 -911377 -921475 -921126 -938379 -945476 -962318 -1009862
8572 -1009862 -1024294 -1022609 -995684 -981518 -992788 -1008313 -997791 -1010464 -1019852 -996585 -965918 -937976
8560 -937976 -951676 -943752 -928229 -909978 -895031 -914417 -957832 -956804 -953487 -967138 -982052 -987383
8548 -987383 -963958 -913533 -902161 -924222 -920765 -913783 -921371 -923934 -928500 -926196 -923060 -934309 -929341
$$ packed form
8633e86096j4196j8173k264J596l59N378K6892N085N2961L5797l7649l2164j9843
8620e83035j3779l803j2574m0874j7071J9966J7068K844J5634n926J5244L2068
8608e74238n078k0542J2008j0161R082O1642K1755R448j6651m0741m326L4777
8596e23025J170L831K7273L1493K8831M13l8977j3314K1210k1207j6596k7883
8584e26781p2958o3715p1713n7330m3996p4884j0098L49j7253p097j6842m7544
8572a009862j4432J685K6925J4166j1270j5525J0522j2673r388K3267L0667K7942
8560i37976j3700P924J5523J8251J4947j9386m3415J028L317j3651j4914n331
8548i87383K3425N0425J1372k2061L457O982p588k563m566K304L136j1249M968
$$ plain form
8535 -929341 -910089 -905395 -910001 -896331 -899992 -916483 -938171 -909193 -899048 -926471 -930716 -917753
8523 -917753 -903029 -887520 -864100 -848765 -872026 -895122 -880765 -876103 -853540 -834213 -841428 -856660
8511 -856660 -838116 -827720 -814159 -831893 -820622 -854455 -864567 -848224 -873555 -853076 -827994 -810512
8499 -810512 -798317 -781411 -772994 -792406 -801784 -785777 -810601 -831877 -823883 -817979 -819915 -808677 -802288
8486 -802288 -821853 -816409 -784355 -791649 -796563 -789973 -773273 -785927 -772657 -780429 -771273 -769156 -779001
8473 -779001 -755538 -748377 -760132 -758012 -740120 -744106 -750164 -744279 -748512 -777628 -786324 -798441 -798263
8460 -798263 -776221 -773764 -813147 -815224 -807304 -787208 -791967 -784849 -767259 -767098 -800116 -834493 -806066
8447 -806066 -779678 -778847 -806205 -828768 -797697 -790285 -787759 -788029 -743307 -732507 -767479 -778828 -771560
$$ packed form
8535i29341J9252M694m606J3670l661j6491k1688K8978J0145k7423m245J2963
8523i17753J4724J5509K3420J5335k3261k3096J4357M662K2563J9327p215j5232
8511h56660J8544J0396J3561j7734J1271l3833j0112J6343k5331K0479K5082J7482
8499h10512J2195J6906Q417j9412r378J6007k4824k1276P994N904j936J1238O389
8486h02288j9565N444L2054p294m914O590J6700j2654J3270p772R156K117r845
8473g79001K3463P161j1755K120J7892l986o058N885m233k9116q696j2117J78
8460g98263K2042K457l9383k077P920K0096m759P118J7590J61l3018l4377K8427
8447h06066K6388Q31k7358k2563L1071P412K526k70M4722J0800l4972j1349P268
$$ plain form
8434 -771560 -753143 -736660 -718771 -736422 -766413 -766011 -751918 -723558 -708025 -720639 -737725 -727172
8422 -727172 -701712 -713853 -759090 -779256 -762287 -743579 -734885 -738059 -747805 -756323 -751853 -750375 -727829
8409 -727829 -715266 -707142 -711064 -729588 -739654 -743526 -742139 -723540 -731492 -710533 -730502 -737952 -727795
8396 -727795 -726470 -737352 -722499 -726232 -729149 -726072 -733067 -754555 -768296 -774400 -737878 -716229 -705929
8383 -705929 -718992 -692306 -671250 -690895 -698610 -699552 -689493 -686876 -714360 -733744 -726406 -710596 -735374
8370 -735374 -751327 -747101 -730573 -730285 -726564 -715268 -734153 -728612 -721231 -722852 -727411 -740745 -744211
8357 -744211 -741945 -746596 -761047 -730565 -689353 -656500 -663298 -696432 -715094 -737183 -718296 -685156
8345 -685156 -676032 -687158 -714109 -707367 -729933 -739539 -727950 -723388 -721698 -715518 -746946 -749396 -717564
$$ packed form
8434g71560J8417J6483J7889j7651k9991M02J4093K8360J5533j2614j7086J0553
8422g27172K5460j2141m5237k0166J6969J8708Q694l174r746q518M470J478K2546
8409g27829J2563Q124l922j8524j0066l872J387J8599p952K0959j9969p450J0157
8396g27795J325j0882J4853l733k917L077o995k1488j3741o104L6522K1649J0300
8383g05929j3063K6686K1056j9645p715r42J0059K617k7484j9384P338J5810k4778
8370g35374j5953M226J6528K88L721J1296j8885N541P381j621m559j3334l466
8357g44211K266m651j4451L0482M1212L2853o798l3134j8662k2089J8887L3140
8345f85156R124j1126k6951O742k2566r606J1589M562J690O180l1428k450L1832
$$ plain form
8332 -717564 -702665 -689102 -654743 -644087 -680196 -701427 -710818 -709281 -683079 -669826 -642152 -653894
8320 -653894 -652968 -681357 -699394 -700286 -717104 -704720 -665222 -634212 -646297 -676087 -682561 -627081 -640844
8307 -640844 -667988 -687773 -692948 -684553 -631649 -621885 -636355 -641114 -659077 -657516 -668754 -686156 -688392
8294 -688392 -677772 -665275 -656253 -674515 -687646 -708499 -672257 -652645 -677773 -680460 -672074 -671193 -662314
8281 -662314 -626456 -615882 -628220 -633906 -652104 -658948 -705267 -676247 -657786 -640189 -634877 -640051
8269 -640051 -659169 -667516 -697339 -716090 -683307 -646579 -633993 -649025 -686718 -707475 -667969 -652009
8257 -652009 -653105 -634856 -642510 -632901 -627989 -653179 -667282 -636592 -616481 -623944 -637399 -649049 -650916
8244 -650916 -652847 -665696 -677981 -656360 -636883 -641812 -651004 -650434 -662286 -649739 -656576 -654227 -665480
$$ packed form
8332g17564J4899J3563L4359J0656l6109k1231r391J537K6202J3253K7674j1742
8320f53894R26k8389j8037q92j6818J2384L9498L1010j2085k9790o474N5480j3763
8307f40844k7144j9785n175Q395N2904R764j4470m759j7963J561j1238j7402k236
8294f88392J0620J2497R022j8262j3131k0853L6242J9612k5128k687Q386Q81Q879
8281f62314L5858J0574j2338n686j8198o844m6319K9020J8461J7597N312n174
8269f40051j9118q347k9823j8751L2783L6728J2586j5032l7693k0757L9506J5960
8257f52009j096J8249p654R609M912k5190j4103L0690K0111p463j3455j1650j867
8244f50916j931j2849j2285K1621J9477m929r192N70j1852J2547o837K349j1253
$$ plain form
8231 -665480 -668463 -669937 -654228 -625911 -621239 -637285 -639089 -633575 -650426 -607613 -586047 -610838 -616117
8218 -616117 -619754 -642110 -659749 -661804 -660647 -639014 -631893 -640535 -654347 -650532 -661881 -696481 -720724
8205 -720724 -720641 -694370 -699947 -719162 -695066 -660274 -674313 -650962 -643438 -625612 -607071 -621739 -641673
8192 -641673 -632044 -623240 -621955 -606572 -616515 -633275 -642843 -649350 -649831 -639262 -652659 -666477 -663726
8179 -663726 -630878 -614048 -650430 -662708 -678155 -686308 -681270 -695128 -709714 -727554 -712917 -678349
8167 -678349 -672267 -679787 -666036 -680416 -673063 -653982 -643941 -631726 -632759 -632396 -641751 -626059 -632075
8154 -632075 -627484 -634137 -631084 -623203 -644244 -649473 -628147 -608780 -612146 -626545 -634551 -618793 -617804
8141 -617804 -597960 -613402 -632280 -643197 -619903 -602547 -622105 -622890 -639434 -643034 -645319 -632318
$$ packed form
8231f65480k983j474J5709K8317M672j6046j804N514j6851M2813K1566k4791n279
8218f16117l637k2356j7639k055J157K1633P121q642j3812L815j1349l4600k4243
8205g20724Q3K6271n577j9215K4096L4792j4039K3351P524J7826J8541j4668j9934
8192f41673R629Q804J285J5383r943j6760r568o507m81J0569j3397j3818K751
8179f63726L2848J6830l6382j2278j5447q153N038j3858j4586j7840J4637L4568
8167f78349O082p520J3751j4380P353J9081J0041J2215j033L63r355J5692o016
8154f32075M591o653L053P881k1041n229K1326J9367l366j4399q006J5758R89
8141f17804J9844j5442j8878j0917K3294J7356j9558p85j6544l600k285J3001
$$ plain form
8129 -632318 -602667 -593459 -598615 -624732 -631607 -621761 -630107 -645701 -601764 -588571 -624477 -640863 -637274
8116 -637274 -636566 -626256 -621804 -596097 -602390 -598668 -602425 -590577 -588414 -602297 -641326 -644110 -661885
8103 -661885 -673013 -669733 -641939 -630661 -614849 -639339 -641456 -621166 -645385 -612586 -581201 -585459
8091 -585459 -604931 -611451 -632374 -638986 -650520 -649959 -644666 -640483 -657414 -636318 -607146 -599902 -629071
8078 -629071 -631454 -614880 -599041 -597909 -616634 -625831 -605001 -608419 -600830 -592160 -569801 -562672 -575582
8065 -575582 -579330 -592356 -605573 -587452 -590765 -608713 -612725 -618124 -613738 -625768 -596152 -570431 -544561
8052 -544561 -538493 -556721 -577854 -606381 -599958 -590734 -598149 -614446 -584233 -557391 -554347 -572363 -582410
8039 -582410 -593130 -553343 -550987 -582467 -601966 -574280 -567927 -572269 -574060 -565015 -571135 -589956 -577518
$$ packed form
8129f32318K9651R208n156k6117o875R846q346j5594M3937J3193l5906j6386L589
8116f37274P08J0310M452K5707o293L722l757J1848K163j3883l9029k784j7775
8103f61885j1128L280K7794J1278J5812k4490k117K0290k4219L2799L1385m258
8091e85459j9472o520k0923o612j1534N61N293M183j6931K1096K9172P244k9169
8078f29071k383J6574J5839J132j8725r197K0830l418P589Q670K2359P129j2910
8065e75582l748j3026j3217J8121l313j7948m012n399M386j2030K9616K5721K5870
8052e44561O068j8228k1133k8527O423R224p415j6297L0213K6842L044j8016j0047
8039e82410j0720L9787K356l1480j9499K7686O353m342j791R045o120j8821J2438
$$ plain form
8026 -577518 -550417 -526621 -522313 -519985 -529312 -523179 -527392 -555737 -573441 -560163 -535781 -533696 -545653
8013 -545653 -553187 -542321 -567169 -599370 -615921 -621851 -609437 -598829 -569292 -573890 -598019 -584703
8001 -584703 -598062 -578091 -554688 -549116 -514413 -513314 -546194 -564508 -565639 -578054 -552309 -550130
7989 -550130 -574910 -605059 -614960 -640830 -653268 -626367 -629571 -614509 -600029 -599467 -610077 -631249
7977 -631249 -629090 -608878 -558658 -528276 -533199 -531257 -544615 -541081 -585751 -623746 -613587 -603604 -569648
7964 -569648 -585310 -570691 -580462 -621308 -627841 -598698 -543144 -545964 -555562 -565159 -569104 -573592 -548744
7951 -548744 -535392 -542663 -566501 -591278 -594208 -591698 -598711 -602819 -595947 -635888 -631713 -628968 -612961
7938 -612961 -588427 -596776 -603420 -607797 -597055 -601903 -629871 -622399 -622006 -638586 -657429 -655362 -631101
$$ packed form
8026e77518K7101K3796M308K328r327O133m213k8345j7704J3278K4382K085j1957
8013e45653p534J0866k4848l2201j6551n930J2414J0608K9537m598k4129J3316
8001e84703j3359J9971K3403N572L4703J099l2880j8314j131j2415K5745K179
7989e50130k4780l0149r901k5870j2438K6901l204J5062J4480N62j0610k1172
7977f31249K159K0212N0220L0382m923J942j3358L534m4670l7995J0159R983L3956
7964e69648j5662J4619r771m0846o533K9143N5554k820r598r597l945m488K4848
7951e48744J3352p271k3838k4777k930K510p013m108O872l9941M175K745J6007
7938f12961K4534q349o644m377J0742m848k7968P472L93j6580j8843K067K4261
$$ plain form
7925 -631101 -618905 -609181 -600049 -600807 -619404 -644478 -634848 -612279 -601876 -624770 -617211 -578181 -540928
7912 -540928 -564368 -567427 -568975 -604432 -628903 -625799 -630806 -634596 -629949 -621123 -607655 -619515 -612089
7899 -612089 -626521 -678879 -683938 -671402 -653146 -649384 -645928 -624417 -654205 -656492 -649437 -661238 -662899
7886 -662899 -682803 -679247 -644787 -620677 -633783 -671766 -662459 -610294 -617175 -619731 -632573 -637672 -627451
7873 -627451 -631399 -637628 -623481 -610027 -589522 -587891 -602065 -595028 -606020 -625636 -663560 -661699 -634274
7860 -634274 -627183 -596263 -597289 -621365 -617842 -631236 -615296 -583887 -596625 -603304 -615968 -614475 -601288
7847 -601288 -593020 -642438 -671654 -671552 -689507 -653306 -631728 -635396 -623528 -592103 -610654 -639725
7835 -639725 -641485 -648852 -622833 -587027 -591583 -600421 -615041 -630998 -646734 -641586 -651838 -638935 -643222
$$ packed form
7925f31101J2196R724R132p58j8597k5074R630K2569J0403k2894P559L9030L7253
7912e40928k3440l059j548l5457k4471L104n007l790M647Q826J3468j1860P426
7899f12089j4432n2358n059J2536J8256L762L456K1511k9788k287P055j1801j661
7886f62899j9904L556L4460K4110j3106l7983R307N2165o881k556j2842n099J0221
7873f27451l948o229J4147J3454K0505J631j4174P037j0992j9616l7924J861K7425
7860f34274P091L0920j026k4076L523j3394J5940L1409j2738o679j2664J493J3187
7847f01288Q268m9418k9216J02j7955L6201K1578l668J1868L1425j8551k9071
7835f39725j760p367K6019L5806m556q838j4620j5957j5736N148j0252J2903m287
$$ plain form
7822 -643222 -664536 -638931 -634497 -638608 -636194 -603547 -624838 -656774 -652636 -648573 -659069 -636642 -627722
7809 -627722 -618401 -601686 -617484 -616597 -638738 -662970 -638621 -623622 -661223 -657008 -647457 -660524 -667820
7796 -667820 -618990 -579851 -584954 -610860 -629344 -636750 -618821 -621784 -645620 -638978 -628860 -608510
7784 -608510 -585593 -568397 -555832 -543613 -557089 -559915 -589541 -609137 -643636 -644035 -599623 -577966
7772 -577966 -589076 -616917 -622603 -588844 -587788 -614433 -646136 -656120 -672105 -672397 -639175 -612454 -574515
7759 -574515 -567430 -581633 -585309 -563399 -556058 -575880 -599589 -600497 -633087 -602436 -582082 -583159 -592695
7746 -592695 -603538 -595384 -594513 -609823 -601679 -587116 -595241 -614206 -581398 -570932 -584956 -610030 -623443
7733 -623443 -604790 -591458 -603177 -594285 -602257 -624187 -618704 -607916 -600283 -613409 -616719 -616539 -595290
$$ packed form
7822f43222k1314K5605M434m111K414L2647k1291l1936M138M063j0496K2427Q920
7809f27722R321J6715j5798Q87k2141k4232K4349J4999l7601M215R551j3067p296
7796f67820M8830L9139n103k5906j8484p406J7929k963k3836O642J0118K0350
7784f08510K2917J7196J2565J2219j3476k826k9626j9596l4499l99M4412K1657
7772e77966j1110k7841n686L3759J056k6645l1703r984j5985k92L3222K6721L7939
7759e74515P085j4203l676K1910P341j9822k3709r08l2590L0651K0354j077r536
7746e92695j0843Q154Q71j5310Q144J4563q125j8965L2808J0466j4024k5074j3413
7733f23443J8653J3332j1719Q892p972k1930N483J0788P633j3126l310J80K1249
$$ plain form
7720 -595290 -603519 -647102 -607113 -592303 -583331 -603692 -645295 -635575 -648327 -663377 -650742 -618096
7708 -618096 -637290 -646086 -656797 -649371 -613731 -611311 -619501 -613533 -605577 -607704 -617687 -604593 -609684
7695 -609684 -604371 -600535 -617191 -612934 -585799 -576114 -572150 -604795 -595729 -601823 -620581 -645325 -612823
7682 -612823 -602058 -599963 -602243 -626457 -637699 -631616 -608178 -575834 -573452 -596129 -608129 -586184
7670 -586184 -577894 -594822 -581239 -589305 -608786 -632366 -638317 -600582 -584059 -569714 -611655 -602066
7658 -602066 -607411 -592529 -588019 -542676 -537221 -558649 -578672 -551491 -527506 -517316 -544467 -546070
7646 -546070 -553832 -560503 -555645 -555248 -570087 -608333 -605398 -577904 -564394 -574041 -576971 -553938 -574435
7633 -574435 -608327 -599594 -568788 -582290 -596272 -587062 -551628 -528356 -531335 -552342 -564450 -592323
$$ packed form
7720e95290q229m3583L9989J4810Q972k0361m1603R720j2752j5050J2635L2646
7708f18096j9194q796j0711P426L5640K420q190N968P956k127r983J3094n091
7695f09684N313L836j6656M257K7135R685L964l2645R066o094j8758k4744L2502
7682f12823J0765K095k280k4214j1242O083K3438L2344K382k2677j2000K1945
7670e86184Q290j6928J3583q066j9481k3580n951L7735J6523J4345m1941R589
7658f02066n345J4882M510M5343N455k1428k0023K7181K3985J0190k7151j603
7646e46070p762o671M858L97j4839l8246K935K7494J3510r647k930K3033k0497
7633e74435l3892Q733L0806j3502j3982R210L5434K3272k979k1007j2108k7873
$$ plain form
7621 -592323 -566774 -552440 -555324 -590069 -581668 -573238 -553920 -553143 -577000 -590187 -563744 -533739 -552208
7608 -552208 -582580 -574367 -608912 -626481 -631542 -610094 -579010 -569187 -573152 -589511 -597276 -597316 -626272
7595 -626272 -613779 -577698 -534598 -524020 -537536 -572091 -580421 -570075 -568243 -575597 -574074 -565934 -552435
7582 -552435 -530208 -527768 -545622 -559287 -547916 -547104 -574553 -601184 -577917 -552020 -534253 -547446
7570 -547446 -569639 -578980 -554138 -557784 -539247 -550318 -549130 -545338 -570142 -558659 -540897 -533249 -534906
7557 -534906 -518668 -509965 -544788 -563799 -558106 -545635 -552929 -581167 -593981 -560708 -519818 -511003
7545 -511003 -507634 -521476 -548852 -542190 -538990 -557468 -570136 -568723 -545580 -570293 -615756 -600054
7533 -600054 -583266 -562378 -542801 -560978 -586317 -584062 -577461 -554045 -564968 -551539 -543002 -575795
$$ packed form
7621e92323K5549J4334k884l4745Q401Q430J9318P77k3857j3187K6443L0005j8469
7608e52208l0372Q213l4545j7569n061K1448L1084R823l965j6359p765m0k8956
7595f26272J2493L6081M3100J0578j3516l4555q330J0346J832p354J523Q140J3499
7582e52435K2227K440j7854j3665J1371Q12k7449k6631K3267K5897J7767j3193
7570e47446k2193r341K4842l646J8537j1071J188L792k4804J1483J7762P648j657
7557e34906J6238Q703l4823j9011N693J2471p294k8238j2814L3273M0890Q815
7545e11003L369j3842k7376O662L200j8478j2668J413K3143k4713m5463J5702
7533f00054J6788K0888J9577j8177k5339K255O601K3416j0923J3429Q537l2793
$$ plain form
7521 -575795 -597016 -573292 -589446 -595490 -595608 -617954 -619322 -613916 -590604 -557795 -564416 -562592 -576014
7508 -576014 -558304 -553838 -573973 -562629 -547227 -515070 -514235 -537790 -561189 -564838 -555145 -549686 -546921
7495 -546921 -548300 -526078 -524370 -526504 -549063 -551760 -563068 -569998 -559549 -533301 -521207 -541753 -557508
7482 -557508 -547748 -580168 -586047 -562790 -551747 -520193 -517401 -526574 -543496 -534888 -561378 -559888 -553498
7469 -553498 -524203 -512047 -531886 -564956 -550214 -528076 -541641 -546698 -566765 -582526 -555388 -526085
7457 -526085 -530053 -571346 -586598 -537712 -539648 -564169 -564709 -549125 -541308 -547104 -548025 -536721 -542709
7444 -542709 -525940 -510696 -509670 -482411 -505734 -537743 -528587 -519835 -534708 -550336 -544389 -506825
7432 -506825 -506232 -497641 -507160 -534578 -528791 -519678 -521101 -533398 -531011 -532839 -519381 -541964 -552095
$$ packed form
7521e75795k1221K3724j6154o044j18k2346j368N406K3312L2809o621J824j3422
7508e76014J7710M466k0135J1344J5402L2157Q35k3555k3399l649R693N459K765
7495e46921j379K2222J708k134k2559k697j1308o930J0449K6248J2094k0546j5755
7482e57508R760l2420n879K3257J1043L1554K792r173j6922Q608k6490J490O390
7469e53498K9295J2156j9839l3070J4742K2138j3565n057k0067j5761K7138K9303
7457e26085l968m1293j5252M8886j936k4521n40J5584P817n796r21J1304n988
7444e42709J6769J5244J026K7259k3323l2009R156Q752j4873j5628N947L7564
7432e06825N93Q591r519k7418N787R113j423j2297K387j828J3458k2583j0131
$$ plain form
7419 -552095 -550320 -556174 -573206 -567126 -558959 -559816 -562549 -559843 -558823 -499895 -498514 -498407 -525298 -533405
7405 -533405 -512622 -509106 -489821 -492198 -504416 -526329 -533238 -515678 -523978 -545658 -552626 -553983 -528074
7392 -528074 -531649 -549126 -532826 -532939 -519334 -541009 -563646 -546497 -517022 -535269 -566650 -570740
7380 -570740 -557407 -562714 -551123 -534747 -577496 -574900 -546413 -535766 -546579 -562824 -555622 -573514
7368 -573514 -603008 -581282 -537049 -518535 -493889 -491423 -523747 -513939 -513133 -534913 -533532 -515799 -500921
7355 -500921 -537145 -545077 -537872 -547503 -588165 -589801 -559876 -539442 -508289 -494634 -532613 -527749 -499415
7342 -499415 -472040 -456534 -487748 -514543 -522266 -478324 -468495 -480166 -494613 -498403 -508003 -513628 -537807
7329 -537807 -559927 -567533 -557163 -555211 -537181 -487724 -457662 -455767 -478816 -475945 -503365 -519287
$$ packed form
7419e52095J775n854j7032O080Q167q57k733K706J020N8928J381J07k6891q107
7405e33405K0783L516J9285k377j2218k1913o909J7560q300k1680o968j357K5909
7392e28074l575j7477J6300j13J3605k1675k2637J7149K9475j8247l1381m090
7380e70740J3333n307J1591J6376m2749K596K8487J0647j0813j6245P202j7892
7368e73514k9494K1726M4233J8514K4646K466l2324R808Q06k1780J381J7733J4878
7355e00921l6224p932P205r631m0662j636K9925K0434L1153J3655l7979M864K8334
7342d99415K7375J5506l1214k6795p723M3942R829j1671j4447l790r600n625k4179
7329e37807k2120p606J0370J952J8030M9457L0062J895k3049K871k7420j5922
$$ plain form
7317 -519287 -503303 -506776 -543930 -543408 -520545 -515142 -524066 -530938 -494271 -491294 -499948 -502846 -498311 -488060
7303 -488060 -521851 -574812 -576982 -543967 -528354 -545244 -518713 -484601 -476226 -467864 -483179 -488397
7291 -488397 -533498 -532379 -503380 -500870 -450395 -456250 -518444 -532616 -517498 -518853 -562779 -580018
7279 -580018 -555230 -524382 -486227 -496321 -522403 -522060 -525102 -534083 -531889 -514492 -505339 -516347 -511554
7266 -511554 -493619 -487856 -479515 -531181 -544612 -539244 -547535 -564523 -545783 -547688 -561150 -533760 -516082
7253 -516082 -488455 -475981 -480121 -506800 -560235 -561544 -537951 -522829 -504736 -500718 -518242 -533861
7241 -533861 -536565 -542973 -546508 -551723 -546914 -526642 -522001 -522297 -530617 -526941 -523119 -538999 -531628 -550323
7227 -550323 -552601 -549238 -556919 -535375 -526588 -491833 -463526 -459330 -457069 -478785 -516469 -526567 -523382
$$ packed form
7317e19287J5984l473l7154N22K2863N403q924o872L6667K977q654k898M535J0251
7303d88060l3791n2961k170L3015J5613j6890K6531L4112Q375Q362j5315n218
7291d88397m5101J119K8999K510N0475n855o2194j4172J5118j355m3926j7239
7279e80018K4788L0848L8155j0094k6082L43l042q981K194J7397R153j1008M793
7266e11554J7935N763Q341n1666j3431N368q291j6988J8740j905j3462K7390J7678
7253e16082K7627J2474m140k6679n3435j309K3593J5122J8093M018j7524j5619
7241e33861k704o408l535n215M809K0272M641k96q320L676L822j5880P371j8695
7227e50323k278L363p681K1544Q787L4755K8307M196K261k1716l7684j0098L185
$$ plain form
7214 -523382 -514939 -523643 -528178 -505108 -467348 -447734 -472218 -501468 -513082 -516950 -522295 -525649 -536341
7201 -536341 -527257 -521448 -513600 -509940 -493212 -484296 -489788 -524154 -566310 -562591 -530333 -522690 -541115
7188 -541115 -536625 -511000 -479677 -469600 -499806 -521465 -508833 -507824 -516560 -503220 -507867 -528591
7176 -528591 -571950 -562655 -547309 -528328 -494141 -486848 -479658 -477907 -521914 -534293 -536241 -540492 -521952
7163 -521952 -507337 -529356 -553970 -562552 -567383 -531195 -489834 -473977 -478856 -474051 -483847 -505220 -509801
7150 -509801 -499343 -515573 -517531 -504110 -505356 -510546 -490111 -481915 -491349 -507009 -485803 -472075 -498444
7137 -498444 -504370 -513806 -530925 -507847 -481683 -472422 -474661 -497128 -526393 -511466 -471282 -479687 -452056
7124 -452056 -459298 -472109 -476685 -484222 -486816 -491479 -500550 -494546 -498247 -491850 -472608 -455349 -443682
$$ packed form
7214e23382Q443q704m535K3070L7760J9614k4484k9250j1614l868n345l354j0692
7201e36341R084N809P848L660J6728Q916n492l4366m2156L719L2258P643j8425
7188e41115M490K5625L1323J0077l0206k1659J2632J009q736J3340m647k0724
7176e28591m3359R295J5346J8981L4187P293P190J751m4007j2379j948m251J8540
7163e21952J4615k2019k4614q582m831L6188M1361J5857m879M805r796k1373m581
7150e09801J0458j6230j958J3421j246n190K0435Q196r434j5660K1206J3728k6369
7137d98444n926r436j7119K3078K6164R261k239k2467k9265J4927M0184q405K7631
7124d52056p242j2811m576p537k594m663r071O004l701O397J9242J7259J1667
$$ plain form
7111 -443682 -445155 -473088 -493314 -496624 -499131 -475092 -503808 -503514 -522351 -540294 -549345 -544394 -525582
7098 -525582 -526869 -540328 -520149 -490315 -463813 -459074 -488552 -507623 -503794 -511032 -494965 -505486
7086 -505486 -535398 -528664 -517347 -523133 -515200 -510034 -520238 -484780 -472793 -486810 -490644 -477569 -493418
7073 -493418 -522712 -534234 -546329 -539995 -518189 -485920 -478053 -506959 -540559 -533317 -515132 -496451
7061 -496451 -493432 -494807 -476242 -479214 -487105 -480526 -467497 -487634 -522840 -531388 -547169 -545901 -528197
7048 -528197 -518145 -492183 -483342 -500381 -492338 -490217 -503591 -491820 -508776 -522911 -511975 -485155
7036 -485155 -478817 -472827 -477323 -531763 -534580 -536775 -513881 -492674 -463931 -473090 -496862 -504224 -498475
7023 -498475 -513805 -520151 -512751 -495340 -505361 -505530 -517508 -523196 -504640 -502254 -525812 -517728 -480649
$$ packed form
7111d43682j473k7933k0226l310k507K4039k8716K94j8837j7943r051M951J8812
7098e25582j287j3459K0179K9834K6502M739k9478j9071L829p238J6067j0521
7086e05486k9912O734J1317n786P933N166j0204L5458J1987j4017l834J3075j5849
7073d93418k9294j1522j2095O334K1806L2269P867k8906l3600P242J8185J8681
7061d96451L019j375J8565k972p891O579J3029k0137l5206q548j5781J268J7704
7048e28197J0052K5962Q841j7039Q043K121j3374J1771j6956j4135J0936K6820
7036d85155O338N990m496n4440k817k195K2894K1207K8743r159k3772p362N749
7023d98475j5330o346P400J7411j0021j69j1978n688J8556K386k3558Q084L7079
$$ plain form
7010 -480649 -459904 -442566 -459916 -474796 -485558 -462461 -462661 -467501 -446513 -428246 -442965 -510985
6998 -510985 -532564 -525454 -504608 -486945 -495098 -503040 -526795 -520244 -557400 -597838 -567752 -499705
6986 -499705 -483912 -479676 -509249 -493743 -515392 -491844 -450546 -445174 -464995 -477170 -508447 -514263
6974 -514263 -519572 -518214 -515896 -484946 -454853 -451365 -464923 -489326 -482384 -462746 -463254 -484185 -477751
6961 -477751 -471906 -512654 -517946 -512919 -486937 -493148 -488909 -464763 -454514 -456288 -456878 -451123 -486084
6948 -486084 -507535 -502528 -493622 -490358 -457892 -447229 -475749 -492510 -481874 -488398 -503765 -496242 -490844
6935 -490844 -489236 -479049 -477854 -488620 -491149 -469897 -472883 -469277 -460131 -470917 -467737 -438806 -422489
6922 -422489 -440319 -471786 -493665 -479649 -444469 -451322 -484491 -508518 -516657 -503833 -475785 -463643
$$ packed form
7010d80649K0745J7338j7350j4880j0762K3097k00m840K0988J8267j4719o8020
6998e10985k1579P110K0846J7663q153p942k3755O551l7156m0438L0086O8047
6986d99705J5793M236k9573J5506k1649K3548M1298N372j9821j2175l1277n816
6974e14263n309J358K318L0950L0093L488j3558k4403O942J9638n08k0931O434
6961d77751N845m0748n292N027K5982o211M239K4146J0249j774n90N755l4961
6948d86084k1451N007Q906L264L2466J0663k8520j6761J0636o524j5367P523N398
6935d90844J608J0187J195j0766k529K1252k986L606R146j0786L180K8931J6317
6922d22489j7830l1467k1879J4016L5180o853l3169k4027q139J2824K8048J2142
$$ plain form
6910 -463643 -454873 -442068 -481103 -512305 -528105 -501820 -471563 -493380 -494440 -472775 -490074 -475834
6898 -475834 -445624 -454410 -453427 -456513 -467459 -460928 -451610 -452294 -463440 -494574 -510940 -493158 -444525
6885 -444525 -439262 -416629 -393610 -404366 -444206 -441024 -454678 -470007 -463499 -463897 -455907 -451661 -460148
6872 -460148 -442289 -430421 -414932 -415549 -435384 -436736 -438705 -451334 -462960 -469383 -463466 -461542 -475734
6859 -475734 -489569 -465061 -450032 -457292 -454120 -459902 -461968 -452206 -482181 -484889 -462742 -450472 -441813
6846 -441813 -467465 -475515 -480286 -474043 -456943 -438637 -450363 -447431 -460817 -479748 -454353 -455840 -483330
6833 -483330 -494311 -473231 -453316 -448552 -441021 -434545 -448827 -478171 -477784 -466715 -451669 -436379 -446141
6820 -446141 -459495 -461833 -451329 -426599 -424626 -456782 -475580 -490093 -495444 -497053 -495231 -514859 -509098
$$ packed form
6910d63643Q770J2805l9035l1202j5800K6285L0257k1817j060K1665j7299J4240
6898d75834L0210q786R83l086j0946O531R318o84j1146l1134j6366J7782M8633
6885d44525N263K2633K3019j0756l9840L182j3654j5329O508l98P990M246q487
6872d60148J7859J1868J5489o17j9835j352j969j2629j1626o423N917J924j4192
6859d75734j3835K4508J5029p260L172n782k066R762k9975k708K2147J2270Q659
6846d41813k5652q050m771O243J7100J8306j1726K932j3386j8931K5395j487k7490
6833d83330j0981K1080J9915M764P531O476j4282k9344L87J1069J5046J5290r762
6820d46141j3354k338J0504K4730J973l2156j8798j4513n351j609J822j9628N761
$$ plain form
6807 -509098 -485976 -472589 -454811 -445377 -476541 -472963 -471110 -470574 -451326 -444524 -436818 -445677 -437426
6794 -437426 -455647 -475901 -496082 -490664 -482130 -468439 -480939 -466606 -465834 -470801 -477101 -472343 -464749
6781 -464749 -469918 -470449 -467673 -480480 -482596 -498322 -483147 -463024 -461270 -464706 -468599 -440697 -404615
6768 -404615 -419132 -427720 -451989 -467603 -458617 -438240 -428938 -425666 -405223 -400270 -408471 -402369 -420021
6755 -420021 -428411 -430772 -425162 -422138 -431334 -426484 -437795 -433637 -395098 -407752 -431466 -424631 -408374
6742 -408374 -409524 -429437 -449156 -449881 -431648 -378566 -384515 -415833 -415706 -420775 -417737 -403702 -404549 -377727
6728 -377727 -356965 -393407 -413633 -367210 -324417 -293662 -301295 -308158 -284041 -227357 -244875 -241419
6716 -241419 -221995 -275334 -342253 -431412 -544327 -580516 -589080 -593673 -605807 -608713 -566642 -539816
$$ packed form
6807e09098K3122J3387J7778R434l1164L578J853N36J9248O802P706q859Q251
6794d37426j8221k0254k0181N418Q534J3691j2500J4333P72m967o300M758P594
6781d64749n169n31K776j2807k116j5726J5175K0123J754l436l893K7902L6082
6768d04615j4517q588k4269j5614Q986K0377R302L272K0443M953q201O102j7652
6755d20021q390k361N610L024r196M850j1311M158L8539j2654k3714O835J6257
6742d08374j150j9913j9719p25J8233N3082n949l1318J27n069L038J4035q47K6822
6728c77727K0762l6442k0226M6423M2793L0755p633o863K4117N6684j7518L456
6716b41419J9424n3339o6919q9159j12915l6189q564m593j2134k906M2071K6826
$$ plain form
6704 -539816 -549073 -573913 -603647 -596950 -583324 -568591 -572695 -585188 -567093 -553547 -544178 -504444
6692 -504444 -485964 -495234 -488439 -481604 -479455 -466217 -505557 -517124 -522929 -511481 -481305 -479530 -466552
6679 -466552 -492053 -493803 -482627 -441703 -448928 -476556 -466767 -429041 -411495 -459097 -487106 -469368
6667 -469368 -455207 -471006 -493809 -479757 -442070 -464534 -476342 -465392 -495966 -518664 -540670 -526469
6655 -526469 -499493 -496456 -481997 -470152 -467805 -460394 -435143 -427988 -448573 -454775 -454879 -442490 -445020
6642 -445020 -446158 -453610 -461963 -445655 -433807 -454570 -478489 -451216 -452124 -480215 -471069 -468303 -468553
6629 -468553 -467186 -449419 -449123 -469456 -467940 -469248 -495240 -500711 -503612 -492940 -482882 -488305 -489546
6616 -489546 -475879 -451637 -439272 -424576 -449714 -441904 -435926 -453884 -452537 -463950 -485626 -464392
$$ packed form
6704e39816r257k4840k9734O697J3626J4733m104j2493J8095J3546R369L9734
6692e04444J8480r270O795O835K149J3238l9340j1567n805J1448L0176J775J2978
6679d66552k5501j750J1176M0924p225k7628R789L7726J7546m7602k8009J7738
6667d69368J4161j5799k2803J4052L7687k2464j1808J0950l0574k2698k2006J4201
6655e26469K6976L037J4459J1845K347P411K5251P155k0585o202j04J2389k530
6642d45020j138p452q353J6308J1848k0763k3919K7273r08k8091R146K766k50
6629d68553J367J7767K96k0333J516j308k5992n471k901J0672J0058n423j241
6616d89546J3667K4242J2365J4696k5138P810N978j7958J347j1413k1676K1234
$$ plain form
6604 -464392 -465318 -448545 -444234 -424752 -424395 -471699 -462212 -467505 -492806 -503546 -480323 -463005 -467676
6591 -467676 -466575 -445984 -442502 -436297 -463190 -488533 -494997 -517026 -520755 -526485 -528333 -509780 -500857
6578 -500857 -518597 -488104 -445304 -441537 -461275 -442758 -402886 -380798 -401011 -396586 -416289 -439275
6566 -439275 -445414 -448289 -429559 -433162 -448395 -471172 -490125 -495853 -473011 -456853 -478476 -470542 -457956
6553 -457956 -444833 -442798 -454909 -485287 -528382 -516514 -484655 -443179 -401920 -421119 -424370 -423804
6541 -423804 -441785 -449557 -465545 -456639 -431376 -439221 -486971 -471682 -469504 -475699 -468426 -464377 -470814
6528 -470814 -442687 -410736 -406677 -420412 -451485 -455414 -457280 -444101 -464897 -486469 -487111 -470376 -469614
6515 -469614 -463020 -450514 -441504 -457332 -463649 -442015 -432518 -411899 -424858 -438056 -440610 -450184 -461591
$$ packed form
6604d64392r26J6773M311J9482L57m7304R487n293k5301j0740K3223J7318m671
6591d67676J101K0591L482O205k6893k5343o464k2029l729n730j848J8553Q923
6578e00857j7740L0493M2800L767j9738J8517L9872K2088k0213M425j9703k2986
6566d39275o139k875J8730l603j5233k2777j8953n728K2842J6158k1623P934J2586
6553d57956J3123K035j2111l0378m3095J1868L1859M1476M1259j9199l251N66
6541d23804j7981p772j5988Q906K5263p845m7750J5289K178o195P273M049o437
6528d70814K8127L1951M059j3735l1073l929j866J3179k0796k1572o42J6735P62
6515d69614O594J2506R010j5828o317K1634R497K0619j2959j3198k554r574j1407
$$ plain form
6502 -461591 -482808 -452269 -444769 -480131 -470320 -474963 -498221 -500578 -475574 -469741 -470799 -446748 -433513
6489 -433513 -425802 -423788 -395125 -405525 -399496 -430765 -452753 -446196 -489628 -511172 -511435 -459839 -431540
6476 -431540 -412844 -385633 -405545 -446002 -451249 -431466 -398364 -404557 -417419 -424086 -413505 -398324
6464 -398324 -436633 -447917 -439107 -426112 -428041 -445706 -471633 -465447 -455602 -423528 -415993 -446214 -435763
6451 -435763 -434966 -448772 -456680 -440314 -423375 -422967 -435429 -421147 -387922 -395602 -416544 -453667 -409757
6438 -409757 -395955 -422695 -471563 -529880 -514991 -463672 -433931 -428915 -454713 -443683 -449102 -434201
6426 -434201 -450507 -467959 -494316 -499437 -479092 -477733 -471053 -444179 -444416 -423941 -411775 -419411 -400547
6413 -400547 -384091 -387583 -390499 -403169 -436880 -427536 -418289 -431869 -416349 -394801 -394241 -413716 -434426
$$ packed form
6502d61591k1217L0539P500l5362R811m643k3258k357K5004N833j058K4051J3235
6489d33513P711K014K8663j0400O029l1269k1988O557m3432k1544k63N1596K8299
6476d31540J8696K7211j9912m0457n247J9783L3102o193j2862o667J0581J5181
6464c98324l8309j1284Q810J2995j929j7665k5927O186R845L2074P535l0221J0451
6451d35763P97j3806p908J6366J6939M08j2462J4282L3225p680k0942l7123M3910
6438d09757J3802k6740m8868n8317J4889N1319K9741N016k5798J1030n419J4901
6426d34201j6306j7452k6357n121K0345J359O680K6874k37K0475J2166p636J8864
6413d00547J6456l492k916j2670l3711R344R247j3580J5520K1548N60j9475k0710
$$ plain form
6400 -434426 -446184 -443566 -444774 -445496 -436013 -447030 -466783 -459989 -453019 -468885 -473378 -449092 -433392
6387 -433392 -418970 -436638 -424229 -412283 -408278 -425140 -429580 -408320 -421921 -457130 -494772 -475007
6375 -475007 -475854 -475174 -460044 -444066 -447233 -445323 -423432 -403672 -425926 -433606 -397534 -383933 -392798
6362 -392798 -428680 -449703 -456431 -480290 -463701 -448620 -456285 -461716 -452618 -470241 -487486 -488831 -502158
6349 -502158 -488123 -462443 -442626 -449684 -451898 -448541 -450465 -424046 -384867 -387467 -400023 -419011 -435464
6336 -435464 -424706 -412386 -396718 -404245 -394515 -377041 -389608 -413642 -410187 -433106 -462208 -472398
6324 -472398 -473325 -465213 -451288 -445665 -444188 -389697 -347682 -365735 -419769 -416292 -428905 -433740 -430849
6311 -430849 -420400 -422276 -450008 -439595 -415955 -405329 -402130 -406695 -411003 -394583 -402784 -408225 -398050
$$ packed form
6400d34426j1758K618j208p22R483j1017j9753O794O970j5866m493K4286J5700
6387d33392J4422j7668J2409J1946M005j6862m440K1260j3601l5209l7642J9765
6375d75007q47O80J5130J5978l167J910K1891J9760k2254p680L6072J3601q865
6362c92798l5882k1023o728k3859J6589J5081p665n431R098j7623j7245j345j3327
6349e02158J4035K5680J9817p058k214L357j924K6419L9179k600j2556j8988j6453
6336d35464J0758J2320J5668p527R730J7474j2567k4034L455k2919k9102j0190
6324d72398r27Q112J3925N623J477N4491M2015j8053n4034L477j2613m835K891
6311d30849J0449j876k7732J0413K3640J0626L199m565m308J6420q201n441J0175
$$ plain form
6298 -398050 -404305 -419424 -418487 -427534 -434708 -443003 -443737 -424987 -427307 -453998 -451824 -461950 -472722 -451660
6284 -451660 -444831 -436886 -438640 -443969 -444446 -426417 -414698 -405901 -405001 -425421 -420767 -437755 -441651 -424622
6270 -424622 -415936 -444252 -461465 -450608 -455962 -458271 -421689 -436175 -440481 -432709 -414976 -388416 -373429
6257 -373429 -361976 -357049 -396099 -403753 -398942 -405400 -413300 -430756 -444229 -455465 -494183 -503949 -476465
6244 -476465 -452301 -469626 -463914 -458512 -438697 -416302 -392733 -391495 -407605 -384318 -381970 -420395
6232 -420395 -413171 -414029 -405887 -413776 -437654 -430328 -423915 -435035 -433808 -447767 -475502 -453140 -437482
6219 -437482 -427373 -399617 -394937 -441972 -449689 -456943 -452409 -450817 -434839 -412185 -431204 -439595 -420713
6206 -420713 -430552 -467054 -463464 -446017 -443884 -430610 -432695 -429418 -415817 -430898 -439505 -424117 -386300
$$ packed form
6298c98050o255j5119R37r047p174q295p34J8750k320k6691K174j0126j0772K1062
6284d51660O829P945j754n329m77J8029J1719Q797R00k0420M654j6988l896J7029
6270d24622Q686k8316j7213J0857n354k309L6582j4486m306P772J7733K6560J4987
6257c73429J1453M927l9050p654M811o458p900j7456j3473j1236l8718r766K7484
6244d76465K4164j7325N712N402J9815K2395K3569J238j6110K3287K348l8425
6232d20395P224q58Q142p889k3878P326O413j1120J227j3959k7735K2362J5658
6219d37482J0109K7756M680m7035p717p254M534J592J5978K2654j9019q391J8882
6206d20713r839l6502L590J7447K133J3274k085L277J3601j5081q607J5388L7817
$$ plain form
6193 -386300 -382563 -369919 -381648 -368697 -385077 -405409 -431608 -436587 -422431 -414191 -412093 -409729 -417169
6180 -417169 -403238 -400514 -394082 -408603 -407119 -422722 -428633 -414730 -397829 -393900 -427819 -435906 -439621
6167 -439621 -406435 -389194 -421309 -430203 -385208 -393515 -425600 -437937 -433792 -438577 -447706 -415234 -386233
6154 -386233 -400680 -428816 -433059 -432163 -410359 -380481 -385861 -405482 -409925 -436590 -455978 -443865 -460369
6141 -460369 -433109 -419235 -438471 -444363 -431119 -437448 -428271 -424125 -408614 -391472 -406415 -407739 -381143
6128 -381143 -385902 -382808 -380134 -381770 -402677 -401332 -409279 -405423 -394812 -419739 -422034 -383762 -384461 -393229
6114 -393229 -398450 -422195 -431935 -452164 -442683 -438143 -454518 -433709 -419503 -411061 -439870 -443454 -456058
6101 -456058 -434111 -427445 -456628 -483414 -465191 -452791 -429064 -433375 -440318 -436428 -409547 -400999 -429636
$$ packed form
6193c86300L737J2644j1729J2951j6380k0332k6199m979J4156Q240K098K364p440
6180d17169J3931K724O432j4521J484j5603n911J3903J6901L929l3919q087l715
6167d39621L3186J7241l2115q894M4995q307l2085j2337M145m785r129L2472K9001
6154c86233j4447k8136m243Q96K1804K9878n380j9621m443k6665j9388J2113j6504
6141d60369K7260J3874j9236n892J3244o329R177M146J5511J7142j4943j324K6596
6128c81143m759L094K674j636k0907J345p947L856J0611k4927k295L8272o99q768
6114c93229n221k3745r740k0229R481M540j6375K0809J4206Q442k8809l584j2604
6101d56058K1947O666k9183k6786J8223J2400K3727m311o943L890K6881Q548k8637
$$ plain form
6088 -429636 -427564 -398762 -428791 -443867 -423174 -397050 -396582 -428261 -435195 -397826 -406652 -407474 -417324
6075 -417324 -420579 -431428 -434186 -436085 -448370 -455365 -428432 -433933 -444687 -407385 -416138 -422449 -411017
6062 -411017 -416478 -428076 -421865 -408739 -424772 -417003 -422963 -420900 -394623 -393000 -410006 -434034 -458951
6049 -458951 -443674 -390258 -382905 -421867 -425725 -403197 -394311 -399028 -385945 -382506 -393157 -399095 -399822
6036 -399822 -420251 -427675 -407318 -394804 -390738 -387197 -386530 -393537 -401933 -446678 -454979 -446532 -460423
6023 -460423 -473773 -454086 -432160 -399316 -364601 -351900 -348718 -352527 -364715 -386757 -393371 -390274
6011 -390274 -407168 -430574 -450434 -446613 -444598 -431324 -396383 -381036 -389320 -411103 -416838 -383428
5999 -383428 -387314 -406074 -413945 -413041 -410736 -428837 -425081 -430313 -414010 -403968 -379034 -398272 -428449
$$ packed form
6088d29636K072K8802l0029j5076K0693K6124M68l1679o934L7369q826q22r850
6075d17324l255j0849k758j899j2285o995K6933n501j0754L7302q753o311J1432
6062d11017n461j1598O211J3126j6033P769n960K063K6277J623j7006k4028k4917
6049d58951J5277N3416P353l8962l858K2528Q886m717J3083L439j0651n938p27
6036c99822k0429p424K0357J2514M066L541O67p007q396m4745q301Q447j3891
6023d60423j3350J9687K1926L2844L4715J2701L182l809j2188k2042o614L097
6011c90274j6894k3406j9860L821K015J3274L4941J5347q284k1783n735L3410
5999c83428l886j8760p871R04K305j8101L756n232J6303J0042K4934j9238l0177
$$ plain form
5986 -428449 -436449 -424107 -417637 -413575 -418437 -421012 -451982 -476273 -448644 -438390 -450304 -474272 -452978
5973 -452978 -409914 -410288 -417535 -410265 -416229 -394060 -388284 -427446 -439742 -445947 -437703 -421887 -426040
5960 -426040 -447303 -459564 -445351 -438334 -417476 -408085 -407555 -404995 -403863 -412029 -433775 -440780 -418937
5947 -418937 -428937 -405997 -378641 -388532 -399938 -416314 -413129 -411808 -435546 -488605 -453503 -414675
5935 -414675 -414711 -414592 -430599 -437284 -443503 -440390 -458886 -463683 -453321 -436326 -420779 -422973 -424151 -436716
5921 -436716 -438341 -420668 -413520 -420855 -416142 -387714 -406277 -409465 -413628 -415941 -410087 -402465 -405231 -397591
$$ packed form
5986d28449q000J2342O470M062m862k575l0970k4291K7629J0254j1914k3968K1294
5973d52978M3064l74p247P270n964K2169N776l9162j2296o205Q244J5816m153
5960d26040k1263j2261J4213P017K0858R391N30K560J132q166k1746p005K1843
5947d18937j0000K2940K7356r891j1406j6376L185J321k3738n3059L5102L8828
5935d14675l6J19j6007o685o219L113j8496m797J0362J6995J5547k194j178j2565
5921d36716j625J7673P148p335M713K8428j8563l188m163k313N854P622k766P640
$$ [...]
##END NTUPLES=NMR SPECTRUM
##END=
