##TITLE=Analysis number 320541
Compound Code cc 54714
Book Reference 439/151/33
Project Code adrs
Chemist Name ronp
##JCAMPDX= 6.0         $$ Bruker NMR JCAMP-DX V2.0
##DATA TYPE= NMR SPECTRUM
##DATA CLASS= NTUPLES
##ORIGIN= Bruker BioSpin GmbH
##OWNER= nmr
$$ XWIN-NMR		Version 3.5
$$ Thu Jun 29 10:14:26 2006 GMT Daylight Time (UT+1h)  MAYBRIDGE\nmr@NMR_250MHZ
##.OBSERVE FREQUENCY= 250.131544655141
##.OBSERVE NUCLEUS= ^1H
##.ACQUISITION MODE= SIMULTANEOUS (DQD)
##.ACQUISITION SCHEME= undefined
##.AVERAGES= 16
##.DIGITISER RES= 18
##SPECTROMETER/DATA SYSTEM= dpx250
##.PULSE SEQUENCE= zg30
##.SOLVENT NAME= CDCl3
##.SHIFT REFERENCE= (INTERNAL, CDCl3, 0, 16.522)
##AUDIT TRAIL= $$ (NUMBER, WHEN, WHO, WHERE, WHAT)
$$ ##TITLE= Audit trail, XWIN-NMR		Version 3.5
$$ ##JCAMPDX= 5.01
$$ ##ORIGIN= Bruker BioSpin GmbH
$$ ##OWNER= nmr
$$ C:\u/data/dgb/nmr/ADRS/1770/pdata/1/auditp.txt
$$ ##AUDIT TRAIL=  $$ (NUMBER, WHEN, WHO, WHERE, WHAT)
(   1,<2006-06-29 10:13:57.57 +100>,<MAYBRIDGE\nmr>,<NMR_250MHZ>,
      <created by zg, POWCHK disabled, PULCHK disabled
       configuration hash MD5:
       E2 DF 36 D8 04 B2 41 60 5A D7 A3 38 5A 4B D0 FE
       data hash MD5: 64K
       B4 C2 AD 50 84 F2 BB 66 DD E2 8F 4D 1A 1D 38 49>)
(   2,<2006-06-29 10:14:14.20 +100>,<MAYBRIDGE\nmr>,<NMR_250MHZ>,
      <Start of raw data processing
       ef LB = 0.3 FT_mod = 6 PKNL = 1 SI = 32K 
       data hash MD5: 32K
       49 C4 33 B1 19 B3 6A 23 FA 7F 63 BE 3C BC EC 85>)
(   3,<2006-06-29 10:14:15.78 +100>,<MAYBRIDGE\nmr>,<NMR_250MHZ>,
      <apk 
       data hash MD5: 32K
       F8 22 B5 23 C0 DB 87 DB 3C B4 0A 98 1B A7 CD 56>)
(   4,<2006-06-29 10:14:16.49 +100>,<MAYBRIDGE\nmr>,<NMR_250MHZ>,
      <abs ABSG = 5 
       data hash MD5: 32K
       2A 59 8A 73 2B 0A 36 89 D2 46 2C AE 82 A2 E1 77>)
$$ ##END=
$$ 
$$ hash MD5
$$ 69 37 71 D4 4C 96 E6 28 0D 89 F5 75 4E F2 6D 0F
##$RELAX= 
##$RELAX= 
##$RELAX= 
##$RELAX= 
##$RELAX= 
##$RELAX= 
##$RELAX= 
$$ Bruker specific parameters
$$ --------------------------
##$DU= <C:\u>
##$EXPNO= 1770
##$NAME= <ADRS>
##$PROCNO= 1
##$TYPE= <nmr>
##$USER= <dgb>
##$AMP= (0..31)
100 100 100 100 100 100 100 100 100 100 100 100 100 100 100 100 100 100 
100 100 100 100 100 100 100 100 100 100 100 100 100 100 
##$AQSEQ= 0
##$AQ_mod= 3
##$AUNM= <au_zg>
##$AUTOPOS= <13 >
##$BF1= 250.13
##$BF2= 250.13
##$BF3= 250.13
##$BF4= 250.13
##$BF5= 500.13
##$BF6= 500.13
##$BF7= 500.13
##$BF8= 500.13
##$BYTORDA= 1
##$CFDGTYP= 0
##$CFRGTYP= 5
##$CHEMSTR= <none>
##$CNST= (0..31)
1 1 145 1 1 1 1 1 1 1 1 1 1 1 1 1 1 1 1 1 1 1 1 1 1 1 1 1 1 1 1 1 
##$CPDPRG= <>
##$CPDPRG1= <>
##$CPDPRG2= <>
##$CPDPRG3= <>
##$CPDPRG4= <mlev>
##$CPDPRG5= <mlev>
##$CPDPRG6= <mlev>
##$CPDPRG7= <mlev>
##$CPDPRG8= <mlev>
##$CPDPRGB= <>
##$CPDPRGT= <>
##$D= (0..31)
0 1 0 0 0 0 0 0 0 0.06 0 0 0 0 0 0 0.0002 0 0 0 0 0 0 0 0 0 0 0 0 0 0 
0 
##$DATE= 1151572436
##$DBL= (0..7)
120 120 120 120 120 120 120 120 
##$DBP= (0..7)
150 150 150 150 150 150 150 150 
##$DBP07= 0
##$DBPNAM0= <>
##$DBPNAM1= <>
$$ [...]
##$SUBNAM7= <"">
##$SUBNAM8= <"">
##$SUBNAM9= <"">
##$SW= 20.6930455092707
##$SWIBOX= (0..15)
0 0 3 0 0 0 0 0 0 0 0 0 0 0 0 0 
##$SW_h= 5175.983436853
##$TD= 65536
##$TD0= 1
##$TE= 296.16
##$TE2= 300
##$TE3= 300
##$TEG= 300
##$TL= (0..7)
0 120 120 120 120 120 120 120 
##$TP= (0..7)
150 150 150 150 150 150 150 150 
##$TP07= 0
##$TPNAME0= <>
##$TPNAME1= <>
##$TPNAME2= <>
##$TPNAME3= <>
##$TPNAME4= <>
##$TPNAME5= <>
##$TPNAME6= <>
##$TPNAME7= <>
##$TPOAL= (0..7)
0.5 0.5 0.5 0.5 0.5 0.5 0.5 0.5 
##$TPOFFS= (0..7)
0 0 0 0 0 0 0 0 
##$TUNHIN= 0
##$TUNHOUT= 0
##$TUNXOUT= 0
##$USERA1= <user>
##$USERA2= <user>
##$USERA3= <user>
##$USERA4= <user>
##$USERA5= <user>
##$V9= 5
##$VALIST= <valist>
##$VCLIST= <CCCCCCCCCCCCCCC>
##$VD= 0
##$VDLIST= <DDDDDDDDDDDDDDD>
##$VPLIST= <PPPPPPPPPPPPPPP>
##$VTLIST= <TTTTTTTTTTTTTTT>
##$WBST= 1024
##$WBSW= 4
##$XGAIN= (0..3)
0 0 0 0 
##$XL= 0
##$YL= 0
##$YMAX_a= 449701
##$YMIN_a= -586802
##$ZGOPTNS= <>
##$ZL1= 120
##$ZL2= 120
##$ZL3= 120
##$ZL4= 120
##$ABSF1= 16.522
##$ABSF2= -4.171173
##$ABSG= 5
##$ABSL= 3
##$ALPHA= 0
##$AQORDER= 0
##$ASSFAC= 0
##$ASSFACI= 0
##$ASSFACX= 0
##$ASSWID= 0
##$AUNMP= <proc_1d>
##$AZFE= 0.1
##$AZFW= 0.1
##$BCFW= 0
##$BC_mod= 0
##$BYTORDP= 0
##$COROFFS= 0
##$CY= 12.5
##$DATMOD= 1
##$DC= 0
##$DFILT= <>
##$DTYPP= 0
##$F1P= 14.0000005364418
##$F2P= -0.99999901652339
##$FCOR= 0.5
##$FTSIZE= 32768
##$FT_mod= 6
##$GAMMA= 0
##$GB= 0
##$INTBC= 1
##$INTSCL= 1
##$ISEN= 128
##$LB= 0.3
##$LEV0= 0
##$LPBIN= 0
##$MAXI= 10000
##$MC2= 0
##$MEAN= 0
##$ME_mod= 0
##$MI= 0
##$NCOEF= 0
##$NC_proc= -2
##$NLEV= 6
##$NOISF1= 0
##$NOISF2= 0
##$NSP= 0
##$NTH_PI= 0
##$NZP= 0
##$OFFSET= 16.522
##$PC= 1
##$PHC0= 171.5117
##$PHC1= 6.399007
##$PH_mod= 1
##$PKNL= yes
##$PPARMOD= 0
##$PSCAL= 4
##$PSIGN= 0
##$REVERSE= no
##$SF= 250.13
##$SI= 32768
##$SIGF1= 0
##$SIGF2= 0
##$SINO= 400
##$SIOLD= 32768
##$SREGLST= <1H.CDCl3>
##$SSB= 0
##$STSI= 32768
##$STSR= 0
##$SW_p= 5175.98343685301
##$SYMM= 0
##$S_DEV= 0
##$TDeff= 65536
##$TDoff= 0
##$TI= <Analysis number 999999
Compound Code 99
Book Reference 9
Project Code 9>
##$TILT= no
##$TM1= 0
##$TM2= 0
##$TOPLEV= 0
##$USERP1= <user>
##$USERP2= <user>
##$USERP3= <user>
##$USERP4= <user>
##$USERP5= <user>
##$WDW= 1
##$XDIM= 32768
##$YMAX_p= 279923825
##$YMIN_p= -58357
$$ End of Bruker specific parameters
$$ ---------------------------------
##NTUPLES= NMR SPECTRUM
##VAR_NAME=  FREQUENCY,     SPECTRUM/REAL,   SPECTRUM/IMAG
##SYMBOL=    X,             R,               I
##VAR_TYPE=  INDEPENDENT,   DEPENDENT,       DEPENDENT
##VAR_FORM=  AFFN,          ASDF,            ASDF
##VAR_DIM=   32768,         32768,           32768
##UNITS=     HZ,            ARBITRARY UNITS, ARBITRARY UNITS
##FACTOR=    0.157963299565203, 1,           1
##FIRST=     4132.6476996994, 0,             0
##LAST=      -1043.33573715361, 0,           0
##MIN=       -1043.33573715361, -58357,      0
##MAX=       4132.6476996994, 279923825,     0
$$ Real data points
##PAGE= N=1
##DATA TABLE= (X++(R..R)), XYDATA
$$ [...]
17220C46267r301j0069j4160j7664j9697j2373r385K499k047o330l056j3382j6626
17207B14676j3945J2202q58r460k715j2585L107j675o899M683k3262k3403O797
17194A46663K0618P313R408J929L428k063j3469j6593j3101o431k291j0576r699
17181A15136m874Q559j310j278j315N373O177Q051N337M028o309n901j9605n666
17167A06403j680k3162o564l356j374O555J3309M044L911l971j2914n920n562
17154F9719L973N132Q036l173Q137K805p178j875q950p852O592M522L138J4867
17140I7893L043j0478n542k1652j8450J115J146j6862J0297Q492l063J466j0688
17127C6717O058J26P357L369r832J44L291M785k025N967J2098J6010j0160j7885
$$ y = [346267, 336966, 326897, 312737, 295073, 275376, 263003, 253618, 256117, 254070, 247740, 244684, 231302, 214676, 200731, 212933, 212075, 202615, 199900, 187315, 190422, 188747, 181848, 186531, 163269, 139866, 146663, 167281, 174594, 184002, 185931, 189359, 187296, 173827, 157234, 144133, 137702, 135411, 124835, 115136, 110262, 118821, 117511, 116233, 114918, 120291, 126468, 134519, 139856, 143884, 137575, 131674, 112069, 106403, 104723, 81561, 74997, 71641, 70267, 76822, 90131, 94175, 98086, 94115, 81201, 75281, 69719, 73692, 78824, 86860, 83687, 91824, 94629, 87451, 85576, 76626, 68774, 75366, 79888, 83026, 97893, 100936, 90458, 84916, 63264, 44814, 45929, 47075, 30213, 40510, 49002, 45939, 47405, 36717, 42775, 42901, 50258, 53627, 43795, 43939, 47230, 52015, 49990, 55957, 68055, 84065, 73905, 56020]
17113E6020r870M674p828j5576l264J8523J663j5259o147J4725J0704p568J1179
17100E1976j2503q890o59J666K078K191o610O061J1075O840p090o193M436j6479
17086B7899o943J0542j596L560r943K588R145P989n095j105M669m407J098J854
17072D0255l966j443q617L039q223o780N890Q54j543m911m114O745j3223n21M879
17057H321m709O347J2775J6683L577j1908p181j1965J0205J871j8682K150J9155
17044B6639l311o042J2435j858j190o473n391l380o676q205O053N506M801r149
17030C759j0957N67K98P460r952L576L929n481m325m881l945J8763K6981Q836
17016C4628p386j8923j1408J2518P680k90j0237o758J811L26k648k967N914m1
$$ y = [56020, 46150, 50824, 42996, 27420, 24156, 42679, 44342, 29083, 22936, 37661, 48365, 40797, 51976, 39473, 30583, 29924, 31590, 33668, 35859, 29249, 35310, 46385, 53225, 46135, 39942, 44378, 27899, 20956, 31498, 29902, 33462, 23519, 26107, 35252, 43241, 38146, 37041, 41710, 37303, 38401, 40255, 36289, 34846, 26229, 29268, 21045, 14265, 20155, 21009, 19466, 14555, 10441, 17186, 3963, 3442, 8321, 3612, 9959, 22734, 39417, 42994, 31086, 23905, 11940, 22145, 24016, 5334, 7484, 26639, 23328, 17286, 29721, 27863, 26673, 20200, 14809, 11429, 4753, -3452, 2601, 8107, 12908, 3759, -7198, -6631, -6333, 1127, -8825, -5249, -1320, -6801, -11126, -16007, -19952, -1189, 25792, 34628, 27242, 8319, -3089, 9429, 17109, 16819, 6582, -176, 1635, 1961, -687, -3654, 2260, 2219]
17002B219l45N250N886N783n773l640j233o249J1427p39J1141r847j4141O01k582
16987b242NM673J7318j0085K104p330j5092m408o325k792K735o413N750J6521
16973e581R353n138R72j036Q650M700Q552k951j1523l954K139M581J777p674p559
16958d692K549N721J6695n319j542M31J4252L855j6583j4668j080M273N20j372
16944C040L457J4193j1813J130J6767P961J054q547N492j2523r683q088J647J2067
16930A6154L535j3204j2875j4164R073M521J718k042r641q279M962K4589K4393
16917B8740k1723k0861o964K98K278P143m081N58R103J4946P8p969P901j537J0056
16902A7966Q785P505l696j4492j0172j2161J154J5429q11r614J1790J0579j037
$$ y = [2219, 1874, 7124, 13010, 18793, 13020, 9380, 8147, 1898, 13325, 12586, 23727, 13880, -261, 340, -2242, -2237, 2436, 19754, 9669, 11773, 4443, -10649, -15057, -21382, -24174, -21439, -27852, -22102, -5581, 3772, -1366, -394, -1430, 7220, 11920, 20472, 17521, 5998, 2044, 4183, 8764, 10541, 2867, -4692, -2143, 3578, 20273, 14954, 13412, 13843, 28095, 31950, 15367, 699, -381, 3892, 4412, 3040, 6497, 20690, 8877, 10007, 26774, 34735, 35789, 27242, 32734, 20211, 10528, 2440, 4087, 16154, 19689, 6485, -6390, -20554, -11481, -6960, -5242, -7284, -16925, -25204, -20242, 4347, 28740, 7017, -13844, -20808, -20510, -18232, -11089, -15170, -14612, -5509, 9437, 9515, 1546, 9447, 7910, 17966, 26751, 34256, 30560, 16068, 5896, -6265, -5111, 10318, 9507, -107, 11683, 22262, 21225]
16889B1225K197M945J1904J0387J4407J9353L9201J5377m515k2273q635k1203
16877H2370k1142j1657K715q501M515K3698J9718J3713J9002K6950J0250J610
16865A63241l7039m2947j6964R023j1745r789j0724L41J153j7944k1076Q424J6668
16852C0622K024N020j995k388P087k459j5414K298Q300m058K521M062L170q346
16838C0444j8318J142P544R323J0093J0167O840J2438K8110L0806J5084J456r319
16825A35810k0951k4752j7828n059p562j1693J056J3551J5425R692J6741J7515
16813A21945J6412K1892j9632m8016l5371k3785o014O036m342N30Q490M609N189
16800D7943n218j5063o491M89j0089k455k68j2477M399P513J1598j826j145O5
$$ y = [21225, 23422, 28367, 40271, 50658, 65065, 84418, 123619, 138996, 134481, 112208, 103573, 82370, 61228, 49571, 52286, 43785, 48300, 71998, 91716, 105429, 124431, 151381, 161631, 163241, 126202, 83255, 66291, 75314, 63569, 53780, 43056, 43397, 44550, 26606, 5530, 13954, 30622, 32646, 37666, 35671, 33283, 40370, 37911, 22497, 24795, 33095, 29037, 31558, 35620, 38790, 30444, 12126, 13268, 20812, 30135, 40228, 50395, 57235, 69673, 97783, 128589, 143673, 145129, 135810, 114859, 90107, 72279, 67220, 59658, 47965, 49021, 62572, 77997, 87689, 104430, 121945, 138357, 160249, 140617, 92601, 57230, 33445, 27431, 33467, 29125, 29655, 38145, 42754, 47943, 42725, 27662, 21171, 21660, 11571, 9116, 8848, -3629, 770, 8283, 19881, 18055, 16910, 16975]
16786A6975n230R224R317j4237j8003Q819L631j9473J2010P959m625o46l790n157
16772c226r041J0786Q719L67K1304J7723j2793q959j0904n048O100M995l770r134
16758G119j580K23m311n201j519J6K1624R154L545j0989j5257K719Q223j4022
16744b56J21j0982o816M373O200M759J459m093R927O933J2220q071j1399l201
16730A174R389L166o555k696m775m126j993j686L308k222j1206l232J0321J8425
16716G292l741j0591o031J503P463m374J895J0973J6167j3189J569q249j4743
16703a4056k318J9529Q72q056k5088k617Q124k794N629Q148K2037Q350j7888j5120
16689a5248L656k079j8165P115J1185K2168J1033m808p369j1784O250N774j3168
$$ y = [16975, 11745, 20969, 30286, 16049, -1954, 6865, 10496, -8977, 3033, 10992, 6367, 5721, 1931, -3226, -12267, -1481, 7238, 7605, 28909, 46632, 33839, 24880, 13976, 8928, 15028, 20023, 16253, 7119, 5539, 5762, 1451, -3750, -5269, -5253, 16371, 25525, 29070, 18081, 2824, 5543, 13766, -256, -135, -11117, -17933, -13560, -7360, -2601, -1142, -5235, 4692, 11625, 23845, 15774, 4375, 1174, 10563, 13729, 7174, 4478, -297, -4423, -6416, -8102, -4794, -7016, -18222, -21454, -11133, 7292, 3551, -7040, -13071, -11568, -4105, -8479, -6584, 4389, 20556, 7367, 8936, 687, -14056, -16374, 3155, 4027, -4029, -29117, -31734, -23610, -26404, -20775, -12627, 9410, 17760, -128, -15248, -11592, -13671, -31836, -24721, -13536, 8632, 19665, 14857, 7488, -4296, 1954, 7728, -5440]
16676e440l35L726m081N117o90P177o408P558J3036j7670j1844m215j9223J561
16662c1731J4438M907J242L159J006R556M743L904p993k929M112P113m546K340
16648I321j751l818j0080j355j1734m600Q368L623J8532J809P371L530j2783p870
16634a437O587J3204q303r298L502L66L171K285o227m875q715q426P247J7336
16620F417J42r512J3521L217p58N840j1957o067j1041q909J809M881R673J6809
16606A4065j339m868K202N216J935j746j2094j717J832p416k321o556R521k365
16592e651M42n54M755J0990j3238j0002m837o849j0522j4470J1523J0681P219
16579b0513L217J2398O19m195r296N880Q697j172L335M478p45N69r850M335K92
$$ y = [-5440, -5775, -2049, -6130, -1013, -1703, 5474, -934, 6624, 19660, 1990, -9854, -14069, -33292, -31731, -17293, -12386, -11144, -7985, -6979, 2577, 7320, 11224, 3231, 302, 4414, 11527, 6981, 9321, 7570, 3752, -6328, -7683, -19417, -24017, -15649, -12026, 6506, 8315, 15686, 19216, 6433, -1437, 5150, 18354, 10051, 753, 4255, 4621, 7792, 10077, 3850, -1025, -9740, -18166, -10919, 6417, 6559, -2953, 10568, 13785, 13027, 18867, 6910, 843, -10198, -19107, -17298, -12417, -2744, 14065, 12726, 7858, 10060, 15276, 17211, 15465, 3371, 1654, 3486, -3930, -6251, -12807, -3286, -5651, -5209, -5763, -1008, 9982, -3256, -13258, -18095, -24944, -35466, -49936, -38413, -27732, -20513, -17296, -4898, -4279, -8474, -17770, -11890, -3193, -4365, -1030, 3448, 2703, 3272, -6578, -2243, -1951]
16564a951Q021N889j1765N644k049J083k285K493j2560k587M133J6106l743j8683
16550a2254q069l323R738J1895q151J056o96m692k838m105M714R488o473J1273
16536b437L066j1071p09J856m329j969o80k238L112J8285J4723j0487m578K017
16522D561N27Q212J5946O448o445j7708n515j068j7591j2037N5M564J1871J1231
16508C051o86l679p77j126L630l667j3342m196Q860J5259n739l587O470N774n4
16493F191r601j2234P151j785M801J141L673l772O660q029q298K621P702r203
16479a2982o25R330n972K564O705J24J171p899n643l817P283J1209Q814Q132P735
16464B6129o390j6334N336J5152r605j1099q84j4035J845J8053m953j1187M448
$$ y = [-1951, 6070, 11959, 194, 5838, 3789, 4872, 2587, 5080, -7480, -10067, -5934, 10172, 6429, -12254, -20323, -23646, -13908, -2013, -10164, -9108, -9804, -14496, -17334, -21439, -16725, -7237, -13710, -2437, 629, -10442, -11151, -9295, -13624, -15593, -16273, -18511, -15399, 2886, 17609, 7122, 2544, 4561, 5088, 13300, 29246, 35694, 29249, 11541, 6026, 4958, -12633, -24670, -24615, -20051, -8180, 3051, 2365, -1314, -2091, -3217, 413, -3254, -16596, -20792, -11932, 3327, -2412, -5999, 471, 6245, 6191, -3410, -15644, -8493, -10278, -5477, -4336, -663, -4435, 2225, -5804, -14102, -11481, -3779, -12982, -13607, -4277, -10249, -7685, -980, -856, 315, -7584, -13227, -17044, -9761, 1448, 10262, 18394, 26129, 19739, 3405, 8741, 23893, 14288, 3189, 2305, -11730, -9885, 8168, 3215, -7972, -3524]
16451c524m314r53J0654J058O602P13n312n974Q512L066l644j3137q770J089J6798
16436B864kj1963m005M439K157k613n149l476K883r450l231J834J7809J2077j6095
16421a1921P042J0292j1380j4521Q662n370J1957j2380M450Q530k613q263j1428
16408b6943q243j4586M630N448K1661K0372j2875j4010J603J967J4610l57L704
16395c019J7732J469J618K214q923R998R67M031j735j3293p704k52j661k831k3089
16380b4478o148q808M924J4255k442l056J0823K3477L71p395N760M495r099j3336
16366a0657q173Q448R610k763J88M58j130l358j695J7570J1839K303j904j3036
16352G700j7841k235R400k728j4576k720L928l972n123J144M713Q752n37j0725
$$ y = [-3524, -7838, -8791, 1863, 2921, 9523, 10236, 4924, -1050, 7462, 10528, 6884, -6253, -15023, -13934, 2864, 2862, -9101, -13106, -8667, -6510, -9123, -14272, -17748, -14865, -24315, -27546, -25712, -7903, 4174, -11921, -4879, 5413, -5967, -20488, -11826, -17196, -5239, -17619, -13169, -4639, -7252, -15515, -26943, -35186, -49772, -45142, -39694, -18033, 2339, -10536, -24546, -22943, -20976, -6366, -6723, -3019, 14713, 16182, 17800, 20014, 11091, 21089, 22056, 26087, 24352, 11059, 3355, 3103, 1442, -1389, -24478, -30626, -39434, -34510, -20255, -22697, -25753, -14930, 8547, 8918, 1523, 7283, 11778, 2679, -10657, -18830, -10382, -772, -3535, -3347, -2889, -4019, -7377, -9072, 8498, 20337, 22640, 20736, 7700, -10141, -12376, -2976, -5704, -20280, -23000, -19072, -23044, -28167, -27023, -22310, -13558, -14095, -24820]
16338b4820L547R620l054J5966l251m608l673J0489N911J6443o910p507r457j3310
16324a4614r843m913m694J7300M611N316J130J2581J823O646Q882m733o170o983
16310F339k584j4337M27J462m738J028q417p851L300Q056j184J5130O590j3214
16296i993j3989J871O244j0940L306J5052R463o043l498O408K4231J1292j0082
16283B3322J302N250L496j674J820l798J193l705j1051M659J731k912j5740j1650
16269g757K825l372m709N348J309o377R611J522j511P186M420n401O987O010K002
16254A8093l541M578o722j5316q897k647j0836j316O233L241L109Q516Q826P537
16240A0858q969J0699j499k6327R399M52n922J2302m086m061j0538j0622j4355
$$ y = [-24820, -21273, -11653, -14707, 1259, -1992, -6600, -10273, 216, 6127, 22570, 15660, 8153, -1304, -14614, -24457, -29370, -34064, -16764, -12153, -6837, -5707, 6874, 8697, 15343, 24225, 19492, 13322, 6339, 3755, -10582, -10155, -8693, -13431, -12403, -20820, -28671, -25371, -17315, -18499, -3369, 3221, -9993, -23982, -22111, -15867, -26807, -23501, -8449, 1014, -5029, -8527, -2119, 22112, 33404, 23322, 24624, 29874, 33370, 31696, 33516, 29718, 30911, 27206, 16155, 20814, 22545, 19633, 3893, -7757, -4932, -8304, -13013, -7665, -6356, -12733, -3122, -1600, -3111, 4075, 8495, 3094, 10081, 16091, 18093, 14552, 19130, 12408, -2908, -11805, -14452, -25288, -26604, -20371, -17130, -14021, -5505, 3321, 10858, 1889, 12588, 11089, -15238, -5839, -5387, -11309, 993, -3093, -7154, -17692, -28314, -42669]
16227d2669p601N189n165P78J9563K9609J4565j4824j3247J1639O719j518r715
16214f677O261M218m866j0545j994J8100N21j0276j5170O678R221L312q109J1615
16200B289L002q26j1074q026k215J1102P771j2358N913N357J0428j1112L890o317
16186b176L324Q575J6948q206q272k415o851q057j653N248q452r097L485N039
16172a2560j701L713R873l430n164k647P69J2597r016o246N548J47M071j419J12
16157e353o578N6K291M273j5652k088J2261l899J07J973n026j633j3661P898O317
16142a8714M168J0309m142J2186q212R677J4480o063o641R387j0483k4982m914
16129b3944J1876K784r621j1364M517J3572j12j1219j1716J0395O889K866j360
$$ y = [-42669, -50270, -45081, -50246, -49468, -29905, -296, 14269, -555, -13802, -2163, 4556, 3038, -6677, -416, 3802, -1064, -11609, -13603, 4497, 5018, -5258, -20428, -13750, -4529, -1217, -9326, 2289, 5291, 4465, -6609, -14635, -16850, -5748, 2023, -10335, -4422, 935, 11363, 251, 4141, -2176, 1148, 9723, 26671, 18465, 10193, 7778, 927, -7130, -8783, -3535, -11987, -21084, -17599, -12560, -14261, -10548, -675, -4105, -9269, -11916, -11147, 1450, -7566, -13812, -8264, -8117, -4046, -5465, -5353, -11931, -11875, -9584, -5311, -20963, -23051, -10790, -14689, -14582, -12609, -17635, -19268, -32929, -25031, -18714, -14546, -4237, -8379, 3807, -4405, 5272, 19752, 13689, 7048, 16435, 5952, -19030, -23944, -12068, -9284, -18905, -30269, -25752, -12180, -12292, -23511, -35227, -24832, -17943, -15077, -16437]
16116a6437J1498j323K43n776p584K31J0036J257j065O847L56M873o4Q573k440
16101I225O04o573r186Q912k233r109J5978R528q688j4018k0891J2345Q878P348
16087B120o992K585O812M659Q715N798j662k2351j2819R784p030j1991L721N477
16073a3174M011N433J212K580J4854J6937N137j6811p158o19M15J111R131l785
16059A9274o753j4634j8123j5621k265J3266L3676j07k797M246M026m193J240
16046A1235K018m817k247M64J4334p069j7421j3133p598k171P045n287J356L385
16032a9906J8317R751j3619M1L553L338P811J473M296m816j7455j0773P016K776
16018h197o28o19P029M326j082K363j1201j3150l25R371K043J6244R364Q531n134
$$ y = [-16437, -4939, -6262, -6019, -11795, -19379, -19148, -9112, -7855, -8920, -2073, -1717, 3156, 3092, 11665, 9225, 9829, 3256, -5930, 2982, 749, -8360, 7618, 17146, 8458, -5560, -26451, -14106, -5228, 2120, -4872, -2287, 4525, 9184, 17899, 23697, 22035, -316, -13135, -3351, -10381, -22372, -18651, -13174, -9163, -3730, -2518, 62, 14916, 31853, 36990, 20179, 13021, 12402, 12817, 13928, 23059, 19274, 12521, -2113, -20236, -35857, -38122, -24856, 8820, 8713, 5916, 10162, 14188, 9995, 11235, 13253, 8436, 6189, 6653, 20987, 13918, -3503, -16636, -24234, -26405, -19360, -24647, -23291, -19906, -1589, 8162, -5457, -5416, -1863, 1475, 9286, 10759, 15055, 10239, -7216, -17989, -10973, -8197, -8825, -9444, -2415, 1911, 829, 3192, -8009, -21159, -21484, -12113, -10070, 6174, 15538, 24069, 18935]
16003A8935o104j0686j0243r12J984N608J8693J7799o419j6049j0826p804o723
15990a2747M453P701j201Q62k883J529K681p940J3161M034j1352j9154J6312L064
15976a480p806M611J744l784N302p288j1094L894N676j804j2450j2396L006J2668
15962b1201J3259R805N109j005J14j4007n411O103n899r915P340J6592j1341k0957
15948c1414J1033J8436R400j0680k826k345j7m553l709J4604o826j0448R108l436
15934a3673j401M209k301Q317Q445j5986k072M534Q745Q208q610m052n691j3224
15920b4552n327J6225R847J0747m893m307J5174J0105j6151p502J217R251p548
15907B286O179J363k6118r718J4460P56m339j150J1739J391K334p128q630j1623
$$ y = [18935, 12831, 2145, -8098, -9010, -7026, -1418, 17275, 35074, 28655, 12606, 1780, -6024, -12747, -8294, -593, -1794, -932, -3815, -2286, 395, -7545, 5616, 9650, -1702, -20856, -4544, -1480, -9286, -4675, -2931, -6715, -1413, -8701, -19795, -15901, -10225, -12029, -24479, -36875, -33869, -21201, -7942, 1863, 6972, 5967, 6081, -7926, -13337, -7234, -13133, -23048, -15708, 884, -10457, -31414, -20381, -1945, 7455, -3225, -6051, -8396, -8413, -12966, -16675, -2071, -8897, -19345, -10237, -13673, -15074, -10865, -13166, -4849, 3596, -12390, -14462, -9928, -1183, 7025, -1585, -5637, -11328, -24552, -29879, -13654, -3807, 6940, 2047, -2260, 12914, 23019, 6868, -634, 583, 9834, 2286, 8465, 9828, -16290, -26008, -11548, -10792, -15131, -16281, -4542, -3151, -817, -7945, -16575, -28198]
15893b8198o38j941O559K711j292M527O096K425L449q462J812j5920N637K3093
15879a42l261j889k522r622o278j476l661O907J2020j2111o360N163Q122J1892
15865c218L283o901j1405o626J333J9679j562k3637J3757J4908L445o273j9468
15852b2685m29P645l599O52J1146j742J2405N537j3809k2776r972M624J8121J3285
15838a597L246r347l014L773K526P269K821m635r416j238P550M463o067l546p982
15823a5194K588P56j115P328J8339l661j688n040O236J680Q45n593j1602L968
15809b153n421k845l285K395K112R946M276P175R544q061r184L628l417j4026
15795i316M164J8855J3252K314j8446j8702m201R05K111N934K595j295L395J7679
$$ y = [-28198, -28836, -30777, -24218, -21507, -22799, -18272, -12176, -9751, -6302, -14764, -12952, -28872, -23235, -142, -3403, -5292, -7814, -17436, -23714, -25190, -28851, -21944, -9924, -22035, -28395, -23232, -15110, -3218, 65, -6836, -18241, -24867, -23534, -3855, -5417, -29054, -15297, -389, 3056, -3217, -22685, -23114, -15469, -19068, -18416, -7270, -9012, 3393, 8930, -4879, -27655, -37627, -33003, -14882, -1597, 1649, -7698, -10712, -6939, -4413, 2856, 5677, 1042, -8374, -9612, -2062, 2401, -3666, -7212, -15194, -12606, -11850, -12965, -5637, 12702, 9041, 7353, 2313, 8549, 10229, 11074, 5481, -6121, -2153, -7574, -10419, -13704, -11309, -9197, 749, 5025, 12200, 21744, 13683, 4499, 8127, 4710, -9316, -5152, 13703, 26955, 29269, 10823, -7879, -12080, -11175, -9064, -3130, -535, -1830, 1565, 19244]
15781A9244O075k7545r425N612l499L001Q074Q448M606j2927j0463N298J0765
15768G264K083J115j1849J079J5876M245l1133l460J061j1786q594l387N959N573
15754b5954M193m288p137K103L296L868O720O35J2251R607j1499q973L190J4488
15740B500j0336j0304k28n253J0299J0510l578j4185K718L906L954k32n392J4812
15726h09Q929J296j0930j1349N857j4126r4J855j1193P318N685r688J3874Q669
15712d706J541q494q102J983J0698j7326M62J1317P954p715j2932J05K299N200
15698a7716K4138K958r169k7082l915J3694j099J0126J3010m673j0691L396L676
15685c347L55M358J624N20K238j3870O308j0009k02j59p883J7056L179r914R852
$$ y = [19244, 25319, -2226, -11651, -6039, -9538, -6537, 1537, 9985, 14591, 1664, -8799, -3501, 7264, 9347, 10462, -1387, -308, 15568, 19813, -11320, -14780, -13719, -25505, -34099, -37486, -31527, -25954, -21761, -26049, -33186, -31083, -27787, -23919, -17199, -16564, -4313, 5294, -6205, -15178, -11988, 2500, -7836, -18140, -18368, -23621, -13322, -2812, -6390, -20575, -17857, -13951, -9997, -10229, -15621, -809, 8120, 9416, -1514, -12863, -7006, -21132, -21226, -19371, -30564, -23246, -17561, -27249, -13375, -4706, -3165, -11659, -19761, -17778, -7080, -24406, -23944, -12627, -4673, -12388, -25320, -25215, -22916, -17716, 6422, 9380, 211, -26871, -30786, -17092, -18191, -8065, 4945, 272, -10419, -7023, -3347, -2992, 1366, 2990, 3510, 5748, -8122, -1814, -11823, -12025, -12184, -20067, -3011, 168, -9746, 106]
15670A06N493k2713m026L260J0630J904j6937p311M762j5842q799J2687K4594
15657a2192j1271N529J8310J131m44r428o742j1823p359J1519J2011j78p640J1128
15643g449J18L267J3735j400j5246o390O174l34o538R973l739K030o877j837n093
15628a9606j631J0485P019M614o18J029j0809j2929k4149Q217K1587N197o45l500
15614a5739O774P926N84p867o044k312N891L793l203K420J0415m591L675n010
15600c288j9205P784P747r055p114j262R389j4900L584K5996N928m382q07N767
15586F182J1041m053q911j6264p449J6031J8318o413r318J3908J401m015j4609
15573d151j5130j433N844J1884J424l300M893J3997p328k7241J5658M702J388
$$ y = [106, 5599, -17114, -21140, -17880, -7250, -5346, -22283, -29594, -24832, -40674, -49473, -36786, -12192, -23463, -17934, 376, 1507, 1063, -8365, -15107, -26930, -34289, -22770, -10759, -10937, -18577, -7449, -7331, -4064, 9671, 8271, -6975, -13365, -7191, -7525, -14063, -4090, -7829, -5799, -12676, -14513, -19606, -21237, -10752, -3733, 881, 263, 1292, -9517, -22446, -46595, -38378, -16791, -11594, -12239, -15739, -8965, -1039, -455, -8322, -14366, -16678, -10787, -6994, -10197, -7777, 2638, -1953, 1722, -3288, -22493, -14709, -6962, -16017, -23131, -24393, -15004, -29904, -26320, -324, 5604, 1222, 415, 6182, 17223, 13170, 4259, -12005, -19454, -3423, 14895, 8482, -836, 13072, 14473, 10458, -4151, -19281, -20714, -14870, -2986, -1562, -4862, 31, 14028, 6700, -20541, -4883, -181, 1207]
15560A207j044K71O515j623j772L372j1690o720R355o074j0205J0473L284o599
15546a1250R033M077k803O885q621r845M252l161k884l746Q41J9430J4042N590
15532B1840O692k826k224j8560J096n379j7910m482j064K811O462M962r078R672
15518g988J9670K967j0240l2773O21R937p726p43J3403M861L667p752N686J3005
15504F595n137n760j0744m517O753O990Q821k30j911k351j7936j5327R065R256
15490a6433l706K456J2013j496n324O934j262N033M491r527m281O779K922j711
15476c112K0904J7472j1236q483k0100k785J2994p930j5825M601R992k020K532
15463b996J695R318P421J908j2063j6002k427Q421J249K033J0758k346p079j6700
$$ y = [1207, 163, 434, 6949, 5326, 3554, 6926, -4764, -11484, -2129, -8203, -18408, -7935, -4651, -11250, -2217, 1860, -943, 5942, -2679, -12524, -8272, -11433, -14317, -18063, -17222, 2208, 16250, 21840, 28532, 25706, 23482, 4922, 6018, 639, -17271, -21753, -22817, -20006, -13544, -8582, -17660, -7988, 11682, 14649, 4409, -28364, -27743, -17806, -25532, -26275, -12872, -8011, -4344, -12096, -6410, 6595, 1458, -4302, -15046, -19563, -12810, -5820, 3001, 2771, 860, -1491, -19427, -34754, -25689, -16433, -20139, -17683, -5670, -7166, -12490, -5556, -6818, -1785, 2706, -6821, -11102, -4323, -1401, -3112, 17792, 35264, 24028, 15545, -4555, -7340, 5654, -2276, -18101, -13500, -3508, -5528, -2996, -1301, 8017, 15438, 17346, 5283, -10719, -13146, -4725, -3476, -1443, 9315, 6969, -110, -16810]
15449a6810q519J4713J420P183j0708k2989q94M944P627J5545J708m132N386R22
15435d604r825R99j841Q25P304K566q616m257O826K840O042K747j417M91r220
15420i140n584M701n910o055Q025j4651o378O989J0000K3838J8216L591j400j7671
15406H571j8047j4154J3960K668n581O627L617j93R377P030k388j7434j252J6298
15392I099R47Q849k039j098j1823q721J1827N341K317j2964r608m72q827M610
15378a2562K4329K086r092Q224J519k141j7649j150p495K790m86k168k3631J2801
15364b4625J6480j913P84j2617J5555M609j2078l725j5412j484J3798l14k2K2052
15350A088K9166l072k5000p262J4366p452j0711L525m605J4917j0182j2243M861
$$ y = [-16810, -25329, -10616, -9196, -2013, -12721, -35710, -36604, -31660, -24033, -8488, -6780, -10912, -5526, -4604, -14429, -13430, -15271, -14446, -7142, -4576, -13192, -17449, -10623, -7783, -1741, 1006, -411, 80, -9140, -14724, -10023, -15933, -21988, -13963, -28614, -34992, -28003, -18003, 5835, 24051, 27642, 26242, 8571, -9476, -23630, -9670, -7002, -12583, -5956, -2339, -2532, 6845, 13875, 11487, -5947, -7199, 9099, 10046, 18895, 16856, 15758, 3935, -4786, 7041, 12382, 14699, 1735, -7873, -8345, -17172, -12562, 11767, 13853, 4761, 12985, 14504, 12363, -5286, -6436, -13931, -11141, -11627, -13795, -37426, -24625, -8145, -10058, -9274, -21891, -6336, -1727, -13805, -17530, -32942, -34426, -20628, -20942, -20964, 1088, 30254, 27182, 2182, -5080, 9286, 1834, -8877, -5352, -9957, 4960, -5222, -17465, -12604]
15337a2604J3045P527R332P941p605n126q809j0523K51J2315J5247N779j3252
15324A3518o754o88k154j3463j1325R68J894J0792J1003J5123j1333n621Q24N45
15310C329o749k0881k2269L479J1622J0789m081r942K365n097J7283K0693j344
15297h03n348M61r085j1620J1659N770J070J9138r616m713M39P022p615J4103
15283A0862J2840L242l429k1928q118N10K118Q325j4860o919j2308j115R801J5745
15269e234P626O540j7959k3452o504J1399J8707Q36M187J847j0905P298o391j0824
15255b2829n044J472m407J008Q782J1783L638Q643K656J1373j7550j4430l184
15242a8089Q894R836Q68r12l088O588N579K198r381j4848j0954l659N789P040
$$ y = [-12604, 441, 7968, 17300, 25241, 17636, 12510, 3701, -6822, -6571, 5744, 20991, 26770, 13518, 6764, 6076, 3922, -9541, -20866, -19898, -18004, -7212, 3791, 18914, 7581, 1960, 2784, 3329, -3420, -24301, -46570, -43091, -31469, -20680, -24761, -34703, -32338, -37435, -20152, 541, -803, -6151, -5690, -14775, -26395, -14736, -8966, -7896, 11242, 1626, -3087, -2648, 4374, -3241, 10862, 23702, 26944, 23515, 1587, -6531, -6021, -3903, 4422, -10438, -17357, -29665, -30780, -20979, -5234, 2392, 8932, -9027, -32479, -38983, -27584, -8877, -8041, -3854, -2007, -12912, -5614, -12005, -22829, -27873, -26401, -30808, -29800, -21018, -9235, -5597, 3046, 5702, 17075, -475, -14905, -18089, -9195, 641, 1509, 597, -2491, 4097, 9676, 11874, 2493, -12355, -23309, -26968, -21179, -14139]
15228a4139J0275n801o913L166l984M87L035k49o832K142o273m513q346p344R005
15213c6284J4084P233r321o78q16J8969N966L112P87k162n978R198J3300R591
15199B7001p202j1679l347j2509J3184o988K549L153J665l846j1768K2615m024
15186H804j0710n558M18J0950j49k068J332j1216o683N264M756k937M836m69j723
15171e153J0537L29n793j3849O021Q368M124L674j8651j1071R023N427n915l294
15157a6223N377r517k762R66m927J875p196l022O76Q547J5714J7237o544J764
15143A965m168o640Q984J387j9024k510O303m066j0041R966J0678M148P67l561
15129e812o957k989k724J3310J316j9972k165L629Q381J8742R6j038p117N659
$$ y = [-14139, -3864, -9665, -16578, -13412, -17396, -16909, -13874, -14123, -20955, -18813, -25086, -29599, -37945, -45289, -36284, -22200, -14967, -24288, -24966, -25782, -6813, -847, 2265, 3052, 890, -5088, 4110, 17410, 27001, 19799, 8120, 4773, -7736, 5448, -1540, 1009, 4162, 5827, 1981, -9787, 12828, 8804, -1906, -7464, -7046, 3904, 3755, 1687, 3019, -8197, -14880, -9616, -4860, -7797, -2961, -3430, -5153, 5384, 5713, -80, -13929, -7908, 460, 4584, 8258, -10393, -21464, -12441, -7014, -12929, -16223, -10846, -20363, -23125, -22159, -27086, -25211, -32407, -35429, -34753, -26206, -10492, 6745, 201, 1965, -2203, -8843, 141, 1528, -17496, -20006, -13703, -17769, -27810, -17844, -7166, -3018, -2251, -5812, -12769, -15758, -18482, -5172, -3856, -23828, -25993, -22364, -13983, 4759, 4855, 3817, -3300, 2359]
15115B359j454N020q21j66J786r532j5868L684J4233k210k079J5345j69q746Q957
15100A0339K885j0597P72l283k550j661j0664j0386O028L961Q168O304j3979o205
15086b0868M133K744R96O964k63P863K170j372p256j9186n536q73L912L0673K4183
15071B8284K146q37l968k420J51k82K772o432k0425k4656l126O092N920J1079
15057e702J0647m417m640n899l437p540r486m759J4456K4168K610Q794J7675j963
15043C0507j7039j5360j7692J1294K746N137p861n25P231p249J720O36r228l359
15029a9042o15K499J6974J3305Q049l111j6923j4056L202n713M382K858J945J0588
15015D342q307O131j0012k270J934J0290Q712Q89m7m740j4932j680l714p365m407
$$ y = [2359, 905, 5925, 5104, 4938, 6724, -2808, -18676, -14992, -759, -2969, -5048, 10297, 10128, 1382, 10339, 13224, 2627, 3399, 116, -2434, -4095, -14759, -25145, -19117, -15156, -6988, -684, -14663, -20868, -16735, -13991, -12995, -6031, -6294, 1569, 3739, 2367, -4889, -24075, -29611, -30484, -26572, 4101, 28284, 30430, 29593, 25625, 23205, 23356, 23074, 25846, 19414, -1011, -25667, -28793, -22701, -16781, -5702, 4945, 528, -4112, -10011, -13448, -20988, -30474, -35233, -20777, 3391, 6001, 14795, 32470, 30507, 13468, -1892, -19584, -8290, -5544, -407, -8268, -8793, -1562, -8811, -7091, -6455, -15683, -19042, -19657, -17158, -184, 13121, 21170, 18059, 1136, -12920, -9718, -15431, -11049, -8191, -6246, 4342, -3965, 2166, -7846, -10116, -8182, 2108, 10820, 11709, 11662, 6922, -8010, -9690, -13404, -20769, -25176]
15000b5176r366l504P448J0156R639J2230N170K884q565n226q014K455M328j345
14986f886J0849k968j9984j0656o151N566J4384O45j639j704L463r240J554Q008
14972a4759M425J5434L69j5611K233J8528m405n631m141N257O691O570M728j3720
14958E968j7579K840m136l267l037k551o213P003P546J5208J5682p552p731k0504
14944a8323n022O576L176j2992m884M192M024Q801p955J3042m298l601K396L067
14930a1801P82L19Q124j6466o20N657j0024J3273J8068M582N392q975M912r04
14916A2319Q446j271j7694k710j892j5119k485M556J0464O073M652Q491l600k0329
14902a0099K575K5017N863j9076j3254j5003K420j291K393J9230R780j6841q590
$$ y = [-25176, -34542, -38046, -30598, -20442, -10803, 1427, 6597, 9481, 916, -4310, -12324, -9869, -5541, -6886, 3963, 995, -18989, -29645, -35796, -30230, -15846, -15201, -16840, -18544, -15081, -24321, -22767, -14759, -10334, 5100, 5469, -10142, -7909, 10619, 6214, 583, -3558, 1699, 8390, 14960, 19688, 5968, -11611, -8771, -12907, -16174, -19211, -21762, -27975, -20972, -13426, 1782, 17464, 9912, 2181, -18323, -23345, -16769, -13593, -26585, -31469, -27277, -23253, -14452, -22407, -9365, -13663, -17264, -14868, -11801, -11019, -10700, -2576, -19042, -19662, -14005, -24029, -10756, 7312, 11894, 17286, 8311, 13223, 12319, 20765, 19494, 1800, -910, -2802, -17921, -20406, -15850, -5386, 687, 5339, 13830, 10230, -10099, -7524, 17493, 23356, 4280, -8974, -23977, -21557, -22848, -20455, -1225, 8555, -8286, -16876]
14889a6876N436Q276p567N90J3431r96l48k5n324R548j177q845M305K584M5j8906
14873a5849K601J0227l517L35Q996O451j2860j1707J614N211n88k536q309J0278
14859i653p30l930j4575J3728J340n558j1650J1794K4239J2486j2134j3119j6923
14846b4685k640j415n730M511J3373n211m163K2636l92j6230k110J3701J1199
14833B844J986j0643l391p105L795M803Q960P735k751q121q279Q66o64j468q83
14818a2316r344J2635Q064o655j439k845r239k61J8283O554j589p077k180j6940
14804b4349j598P524J1414M233k0290j0675R878O810J0210j692p781M711N883
14791e722m747O697n984j6769M380j1179j0888J9431M263Q463M280L517O996J6022
$$ y = [-16876, -11440, -3164, -10731, -10141, 3290, 2294, 1946, 1921, -3403, 6145, 4968, -3877, 428, 3012, 3057, -15849, -13248, -3021, -6538, -6203, 2793, 9244, -3616, -15323, -13709, -8498, -9086, -11622, -19931, -9653, -10383, -14313, -28888, -15160, -13820, -19378, -31028, -19234, 5005, 17491, 5357, -7762, -24685, -27325, -28740, -34470, -29959, -16586, -21797, -25960, -3324, -3716, -19946, -22056, -8355, 2844, 4830, -5813, -9204, -16309, -12514, -7711, 1249, 8984, 6233, -1888, -10167, -9301, -9965, -11433, -12316, -21660, -9025, -961, -7616, -9055, -11900, -21139, -21400, -3117, 3437, 1848, -5229, -7409, -24349, -25947, -18423, -7009, -2776, -23066, -33741, -23863, -17053, -6843, -8535, -16316, -11605, -5722, -10469, -3772, -9756, -26525, -22145, -33324, -44212, -24781, -20518, -12055, -7775, -4258, 2738, 18760]
14777A8760O432k3220n729J151j062P252J853J496J0428O885j3178q375J137N269
14763I099o585j854l507j0522N480J7297k326q990O561m716k954j464J2104Mr935
14748b308K209J1834q800j0075J0166Q088j9294q9O129J1885p583j0806p699O361
14734i982P159J1771O23j5710Q49O77Q428l268q567K203Q249O600O500j3075n807
14719c350r748P926J4520j2634q213O130Q310M079r982l208l128j6468j4538J4768
14705b5536J7675J4211P442K346R5p509j2604j2056k318p398J2048J0512J7420
14692A4328K1486p874O09j0890j6640j8621L131J310J1200n549p202k059R074
14679g697Q999M898L611r861K39r358q069J1914J3515J1773O80p323k239J670
$$ y = [18760, 25192, 1972, -3757, -2606, -3668, 3584, 5437, 6933, 17361, 24246, 11068, 2693, 3830, 9099, 2514, 660, -2847, -13369, -7889, 9408, 7082, -1908, 4653, -63, -3017, -4481, 7623, 7627, -2308, -99, 11735, 2935, -7140, 3026, 11114, -8180, -8269, -2140, 9745, 2162, -8644, -16343, -9982, -2823, 8948, 9571, -6139, -5290, -4613, 3815, 547, -8020, -5817, 2432, 9032, 15532, 2457, -3350, -13098, -5172, 9348, -3286, -11499, -5369, 2941, 7020, -2962, -6170, -9298, -25766, -40304, -25536, -7861, 6350, 13792, 16138, 16233, 8724, -3880, -15936, -18254, -25652, -13604, -3092, 14328, 35814, 27940, 28549, 17659, 1019, -17602, -14471, -13161, -1961, -7510, -14712, -16771, -7697, 1302, 6200, 9811, -50, 189, -9169, -17238, -5324, 8191, 19964, 20644, 13321, 11082, 12752]
14665A2752j965M711K528j6812K779O678j0100o652o53m740J7509p210k3551K399
14651b2327J5757J715O124L198J3480j709l3105j7612M854Q662m646Q623J6291
14638f95j144o984j836m334j263p299R727P422m884K25J0333P949q906k672n648
14623a0009M411n397J2208J0634j3161p483N634L93k359Q034j0312k412O216j8038
14609b1641N216J1895q819m047m300L733R817K7725L80n658o79j1781n831j602
14595e592N144j3570K901P240k098o211J62o933K877J6356J0488l729l892j3179
14581a0036J0999K738p222K625N414J580J382j1076j3127O654K4913R185j057
14568B2972K269N036j4512M062o683j3260l266o18r721k46P114m321J621p54K744
$$ y = [12752, 10787, 15498, 18026, 1214, 3993, 10671, 571, -6081, -6734, -11474, 6035, -1175, -24726, -22327, -6570, -4855, 1269, 4467, 17947, 16238, -16867, -34479, -29625, -20963, -25609, -16986, -695, -1839, -8823, -10659, -14993, -16256, -23555, -13828, -6406, -11290, -11065, -732, 7217, -1689, -4361, -10009, -5598, -10995, 1213, 11847, -1314, -8797, -3163, -2770, -5129, 2905, -7407, -9819, -3603, -21641, -16425, -4530, -13349, -17396, -21696, -17963, -8146, 19579, 19959, 14301, 13622, 1841, -3990, -5592, -448, -14018, -11117, -3877, -5975, -12186, -12024, -18957, -16080, 276, 10764, 7035, 3143, -10036, 963, 3701, -3521, -896, 4518, 6098, 7480, -3596, -16723, -10069, 14844, 24029, 22972, 25241, 30277, 15765, 19827, 13144, -116, -3382, -4000, -13721, -13967, -6853, -11174, -9553, -10307, -7563]
14553g563O632P052o29j3637N174J2147j0008q845N564j1544q212K642N620p057
14539b2664l15k611K4379J8662j2229j1768K827M126J292n01R60L739K824j4845
14525f124q465P530r59n591M935K974p780l513n281M824J4712k137l136r953J047
14510a6917J331N172Q462q864j2581Q737J5049n000Q674P764q620p545j3422k710
14496b0470J7743R073L81j462n36P1j4490K292K051r719L996q1M831M200k923
14481e043k690P316n346r82J1654j5481n027O384J3121N788p085l936o316k249
14467i892J4708J5838n27k1207j8074j288L251j0484n035L374O18K695J7738O934
14453a351M295L013M014j6075o60n012O28r075k713J0499Q92j7416p360J5010
$$ y = [-7563, -931, 6121, 5492, -8145, -2971, 9176, -832, -9677, -4113, -15657, -23869, -21227, -15607, -22664, -22979, -25590, -1211, 17451, 5222, -6546, -3719, 407, 1699, 1198, 2158, 5897, 8721, -6124, -14589, -7059, -8018, -13609, -8674, -5700, -13480, -16993, -22274, -17450, -2738, -4875, -8011, -17964, -16917, -15586, -10414, -1952, -10816, -23397, -14660, 389, -4611, 4063, 11827, 3207, -4338, -17760, -20470, -2727, 6346, 6727, 5265, 4729, 4800, -9690, -7398, -5347, -15066, -11070, -11151, -6320, -2120, -5043, -7733, -417, -5763, -6745, 4909, -10572, -15599, -9215, 3906, 9694, 2609, -1327, -7643, -9892, 4816, 20654, 20127, -1080, -19154, -20442, -17191, -27675, -32710, -29336, -28718, -26023, -8285, -1351, 2944, 5957, 9971, -6104, -6764, -11776, -11148, -20223, -22936, -12437, -11545, -28961, -36321, -21311]
14439b1311K0303K061l727J2302j2428j8579j182Q75l052J1189J3778j3700n194
14426a8665P858J8228J9450J1643k3670j7871J2413L853l11Q440J1520k4668q565
14413c45l399q084Q770J076K538k51Q61j6205L746J0447M923l590M570j3327J5773
14398G503p272j3082J800m503P284J0432K977N919O561j1263k896L280j0042M215
14384I13M302l211m176M498J434n971j6634j0267Q394J5113K878P396N256l539
14370F386J3217Q759q389k551L648r047o223L42q702j1456Q766J1452l51n248
14356F03J180Q738J866l958K855l854N429Q407j5182j8469j358J9503J0032L924
14342A9716O650j5185n272J006q349j696N12N162J3388m433j6423k0708L397K0715
$$ y = [-21311, -1008, 1053, -2674, 9628, -2800, -21379, -22561, -21686, -24738, -13549, 229, -13471, -18665, -10807, 7421, 26871, 38514, 14844, -3027, 9386, 13239, 12928, 21368, 32888, 8220, -345, -3744, -11828, -3058, -1982, 556, 305, 1166, -15039, -11293, -846, 4077, 487, 5057, -8270, 7503, 231, -12851, -11051, -15554, -8270, 2162, 5139, 11058, 17619, 6356, 3460, 6740, -3302, 913, 5215, 2004, -2172, 2326, 3760, -2211, -18845, -29112, -20718, -5605, -2727, 4669, 9925, 6386, 19603, 28362, 19973, 17422, 21070, 12023, 5800, 6142, -2560, -14016, -5250, 6202, 5851, 603, 1783, 10521, 12387, 8429, 11284, 7430, 12859, 21266, 6084, -12385, -13743, 5760, 15792, 19716, 26366, 11181, 5909, 6915, -1434, -3130, -2618, 2544, 15932, 11499, -4924, -25632, -22235, -1520]
14328a520k959r225j0517n765o747P580J46l600j232J6940J9984K301o087j0371
14314a1072m632J6939j241k389J1203J551j4774M001M525K364j7918q155m59q61
14300b0918K934k71J218J716j792Q576P283j0991K017l895J28O767J990P353j6967
14285a4852J604L766O045R870m222J0446Q824j1509j7186j2511J934l956J1343
14272a0404L250N106l571J457j4p292J2735Q138j2407m033j1649k648J9147J0229
14258H044r767n751o022P032K4713J279m21O40n29j1235m106p581k875l228r97
14243a0804L024m50M126k702j0941K707J0054J2821P40J6071O73p763j4896l476
14229h16j2596k266l666P486K425o55O748J835l870m385K042o89o753N708J3096
$$ y = [-1520, -4479, -13704, -24221, -29986, -36733, -29153, -29007, -32607, -33839, -16899, 3085, 5386, -701, -11072, -15704, 1235, -6, -2395, 8808, 10359, -4415, -414, 4111, 6475, -11443, -19598, -20057, -20918, -17984, -18255, -17037, -15321, -17113, -8537, -1254, -12245, -10228, -14123, -13995, -7228, -5238, 2115, -14852, -13248, -9482, -3437, 6433, 2211, 12657, 21481, 9972, -7214, -19725, -17791, -21747, -10404, -7154, -2048, -5619, -4162, -4176, -11468, 1267, 9405, -3002, -7035, -18684, -21332, -2185, 8044, -1723, -7474, -13496, -6464, 18249, 19528, 19107, 19747, 19218, 7983, 3877, -3704, -6579, -9807, -10804, -7780, -8230, -4104, -6806, -17747, -15040, -4986, 7835, 8575, 24646, 25319, 17556, 2660, -816, -13412, -15678, -19344, -11858, -9433, -10088, -3340, -1505, -5375, -9760, -7718, -8407, -15160, -9452, 3644]
14214C644l244r50j4476l014m294j2245P018J1987O706o495Q082L316M071o410
14200f304j7781q036J901J2512J5304l492J145j508m275K181q0m126O504N403
14186f52J7621J501j9907r399Q730J2596j3352j0004P210M294J9795L013O089
14173B7535n155j6805J11n42P081J6638J743j0692j7013n132J154j638k561k14
14159e490j8684j657J1950P913n229j2112p833K9R544P058n278J4571J9062j6131
14145b287K368J7651j0387J775j3495n322p717Q569K155N700K332n18q779O462
14131a493J0218o80J4770p554p386P604r133j952J6220L491p291M126Q89j3120
14117H709k0199j763m571J922mJ9769J2717j6241q03p018q989J6858J3661k861
$$ y = [3644, 400, -550, -15026, -18040, -22334, -34579, -27561, -15574, -8868, -15363, -7281, -3965, 106, -6304, -24085, -32121, -30220, -17708, -2404, -5896, -4751, -6259, -10534, -8353, -8433, -12559, -6055, -652, 16969, 18470, -1437, -10836, -2106, 10490, -2862, -12866, -5656, -1362, 18433, 21446, 27535, 22380, 5575, 5686, 5144, 12225, 28863, 30606, 19914, 2901, -2231, -1077, -2715, -5276, -5490, -24174, -25831, -13881, -5968, -11197, -23309, -31142, -31113, -21569, -14511, -19789, -5218, 13844, -2287, 81, 17732, 7345, 9120, -4375, -9697, -17414, -8845, -6690, -990, 1342, 824, -7955, -1493, 8725, 8045, 22815, 15261, 7875, 15479, 6346, 4394, 20614, 24105, 16814, 20940, 21829, 8709, -11490, -13253, -17824, -15902, -15906, 3863, 16580, 339, -464, -7482, -16471, 387, 14048, 11187]
14103A1187j2564j903N594l247j0798o32K712j2642l343P368M225N130J0163L940
14089E190r545o226M570p627P165P910k927P07M323M400J0088J802j2484j4140
14075f794k661k859N397n660O745K432o536r406m3M458L909O44K524J5103J601
14060H854L384o378p273L313N69J0803j2109N309j372j0379n806q805K262k747
14046b0375N208J7739J4867J1616p817r593o049m5M766j4447m755l818K3085J0867
14032B1249J603k205l065j2135j3012J992Q486P832m599o996P051J487o055K11
14018A844O794r551r227R705k315j1652K841J6390J3205l383l781k901Q04l074
14004E699M592J5323k681j892J472N707j2042k1370L69k152R111n135R867J1152
$$ y = [11187, -1377, -3280, 2314, -933, -11731, -12363, -9651, -22293, -25636, -18268, -14043, -8913, 1250, 5190, -4355, -10581, -6011, -13638, -6473, 1437, -1490, -783, 3540, 7940, 18028, 19830, 7346, -6794, -9455, -12314, -6917, -12577, -5832, -3400, -9936, -19342, -19385, -14927, -11018, -10374, -7850, 7253, 8854, 12238, 5860, -1413, 1900, 2469, 13272, 1163, 6472, 5100, -5279, -11085, -19890, -17628, -20375, -15167, 2572, 17439, 29055, 21238, 11645, 5596, 5551, 10317, -4130, -8885, -12703, 10382, 21249, 22852, 20647, 17582, 5447, -7565, -5573, 2913, 10745, 6146, -850, 6201, 7688, 1633, 1844, 8638, -913, -10140, -435, -2750, -14402, -11561, 4829, 18034, 14651, 10870, 7969, 8773, 5699, 10291, 25614, 22933, 21041, 22513, 28220, 16178, -5192, -4823, -6975, 2136, -2999, 6868, 18020]
13990A8020J538n354p691j558N307k683O61n955r122J5633J5419q346J0568j447
13976B4990n499o227j1748N296J4007O331M27j5303q123l288N863r092j473j2355
13962a6194k155J8245L779K423M525M997n261j0177j5568O137J3398J3483m10
13949A7222j0074j7732j8292j3772O812J7227M745j600p177K0528J802o151m870
13936a1332j150R620l294R787J2616N385M398O828l82j9836j6606L331J7905J2380
13922B9650j6098j9756J2791J2024l697n525J784m385j0977j3256O777K6921L927
13909B0180q975P621J3295n242j4020J066j0668j0685r392K107j64R77R490j3382
13895a7792J4594K0498L206j2659k563k842J2352J0528n307j7675l904K0253J0300
$$ y = [18020, 19558, 14204, 6513, 4955, 10262, 7579, 8240, 2285, -6837, 8796, 24215, 15869, 26437, 24990, 19491, 13264, 1516, 6812, 20819, 27150, 27577, 12274, 4151, 863, 6726, -2366, -3839, -16194, -18349, -104, 3675, 6098, 10623, 15620, 10359, 182, -15386, -9249, 4149, 17632, 17222, 7148, -10584, -28876, -42648, -35836, -18609, -13864, -15464, -22641, -2113, -311, -6462, -11332, -12482, -2862, -6156, 3631, 16247, 21632, 26030, 32858, 32476, 12640, -3966, -635, 17270, 29650, 13552, -6204, 6587, 18611, 14914, 9389, 11173, 6788, -4189, -17445, -10668, 16253, 20180, 11205, 18826, 32121, 26879, 12859, 13925, 3257, -7428, -16820, -14713, -14877, -13900, -4410, -17792, -3198, 17300, 20506, 7847, 5284, 2442, 14794, 25322, 20015, 2340, -1564, 18689, 28989]
13882B8989L455J751j7756K302J1244l611j3044n268l969k456M007J8609J645
13869B5898K671O614M650l448k1740r661j6857J3685k789m809Q413Q743q196l491
13855c17m745J035J4765J605m598J0712M077k0379P162J8476k648N719m949q240
13841A7675J772k124j5098j5235M67R950K3820j479j9019j725L169J2523o961
13828G735o54N856j41j2573j704R219J7239K59j0326M162o067j3779o051K3341
13814A6516q318r216k208k546J560M840J6463m728j3586q341J5630j690l1631
13801b7255J421J6518K827j4455J379J2849P146J1883O638j608m979J235r146
13788D453q983J0769J1717J253k1819j2640J2100Q860p87n929r238m853o636J1390
$$ y = [28989, 32444, 34195, 16439, 18741, 29985, 26374, 13330, 8062, 4093, 1637, 5644, 24253, 25898, 28569, 35183, 39833, 36385, 14645, 4984, -11873, 1812, -977, -5786, 2627, 11370, 3174, -317, -5062, -4027, 10738, 12343, 7745, 18457, 22534, 2155, 9317, 27793, 25145, 30864, 25915, 17675, 19447, 17323, 2225, -13010, -12543, -2593, 21227, 19748, 729, -996, 2173, 14696, 7735, 7081, 12937, 12796, 223, -1481, 7738, 24977, 25236, 14910, 19072, 13005, -774, -6825, 16516, 8198, -1018, -3226, -5772, -4212, 628, 17091, 12363, -1223, -9564, 6066, 4376, -27255, -25834, -9316, -6489, -20944, -19565, -6716, 430, 12313, 18951, 17343, 12364, 13599, 4453, -4530, 6239, 17956, 19209, -2610, -15250, -3150, 5710, 4923, -1006, -10244, -15097, -21733, -10343]
13774a0343J6391K94p766l836J4005J476n49l256j2786j8956J3343L1963M486
13761B4466j2334j5152r09n076J5834J4417K20o973j1330n291p497m640k132J0581
13747e816K0574m290o531N418q186q363l954N269j630L900J1400l604j4883l861
13733a4557O741J965n188O644K165J2628J8678j7439r606M268n344j5009P458
13720f596J4542J550j8650p942L541r52J6243J0816J374O556j8098j9400O333
13707a0683R772Q939J0647P396K198n13j3733j8998k0648J5854J0660J3396O195
13694B0482q432K761P679p21J0315p686l881J6968L280k146O565l171l242l509
13680C5262j2527k853p268p469q280k13P65o912N209J2594l786n82R475o610J1270
$$ y = [-10343, 6048, 6342, -1424, -5260, 8745, 10221, 9672, 6416, -6370, -25326, -11983, 19980, 24466, 12132, -3020, -3929, -9005, 6829, 21246, 21466, 14493, 3163, -2128, -9625, -14265, -16397, -5816, 14758, 10468, 3937, 9355, 1169, -7194, -11148, -5879, -7509, -3609, 7791, 4187, -10696, -14557, -7816, -5851, -11039, -4395, -2230, 10398, 29076, 11637, 2031, 6299, 955, -14054, -6596, 7946, 9496, -9154, -17096, -13555, -14507, 1736, 12552, 13926, 20482, 2384, -17016, -10683, -911, 8028, 18675, 26071, 28269, 27756, 14023, -4975, -25623, -9769, 891, 14287, 20482, 12050, 14811, 22490, 21769, 32084, 24398, 20517, 37485, 40765, 38619, 45184, 42013, 38771, 35262, 22735, 19882, 12614, 5145, -3135, -3348, -2583, -9495, -4286, 8308, 4522, 3940, 13415, 6805, 18075]
13665A8075J401p763n185M733J0945K140P968p088q887Q287J0416q578L419j0259
13651A9624j5847R04k770P40j3828J6755K0728L424j091K002J091j3684j2157
13638E891k189R935K9427n752j2039j2612o17l877n826P881J2857p355n273o303
13624D148N960P590O706N521j456R261J1258N392r28j0631j9999q268K814k369
13610A4999Q68L662m288j2638r079m71Q032o189m684m194K852J2873N099J7969
13596B4811p621M708o617p104k657Q35k561m546l844k561J925N064k095J0029
13582G766K566j1133l386N845J1582j2019j2533N110K2800J3599L725M327J837
13569D0086k2491k1097J6709N873p097k0957R041J93q703J4603R342M057J0857
$$ y = [18075, 19476, 11713, 6528, 11261, 22206, 24346, 32314, 25226, 16339, 24626, 35042, 26464, 29883, 19624, 3777, 4681, 1911, 2651, -11177, 5578, 26306, 29730, 28639, 30641, 31732, 18048, 5891, 3702, 13637, 43064, 37312, 25273, 12661, 12044, 8167, 2341, 10222, 23079, 15724, 10451, 4148, 10108, 17698, 24404, 29925, 28469, 37730, 48988, 54380, 53452, 42821, 22822, 14554, 17368, 14999, 15867, 19529, 15241, 2603, -6476, -6947, 1085, -5104, -9788, -13982, -11130, 1743, 6842, 24811, 17190, 21898, 15281, 8177, 5520, 6355, 3794, -752, -4596, -7157, -5232, -168, -2263, 7766, 10332, -801, -4187, 1658, 13240, 1221, -11312, -6202, 16598, 30197, 33922, 38249, 40086, 17595, -3502, 13207, 19080, 11983, -8974, 67, 260, -8443, 6160, 15502, 19559, 30416]
13556C0416r202k4207j028M948J7075N049k916L49m790r346L25N191N844l919
13542A3789J570r425n331j8892K163J4296J0075P691R339K071q303l172J7260
13529C3131j2457j0704J8595J1486l044r243q463j236p160j0556j4732o863l487
13516b4733R218K1769J4422k231J249m722K739k467n834j0362J140P381o127l299
13502a857N845p763k704J5233J1604K595j7505o680l022o773J8581J1790O864
13489B6208j525j8831J460O9o8N541O494p682m758R379m548j461j0600J0701K997
13474A3376M46J102m899k561R614P39N366l710o544n365k478m126p268J4416K1796
13459B9904n078N914o437K539m431j766J7575O694j029p993r652j4119j056p509
$$ y = [30416, 21214, -2993, -4021, 927, 18002, 23051, 20135, 20484, 15694, 6348, 6673, 11864, 17708, 13789, 15359, 5934, 603, -18289, -16126, -1830, 8245, 15936, 25275, 27346, 19043, 15871, 33131, 20674, 9970, 28565, 40051, 37007, 27764, 19301, 18065, 10905, 349, -14383, -21246, -24733, -15515, 6254, 20676, 18445, 19694, 14972, 17711, 15244, 9410, -952, 188, 7569, 1442, -1857, 3988, -3775, -6479, 8754, 20358, 22953, 5448, -1232, -4254, -11027, 7554, 19344, 26208, 24683, 5852, 7312, 7381, 7313, 12854, 19348, 11666, 6908, 16287, 11739, 10278, -322, 10379, 13376, 13822, 14924, 10025, 7464, 17078, 17817, 23183, 19473, 12929, 7564, 5086, 960, -6308, 8108, 29904, 24826, 30740, 24303, 26842, 22411, 20645, 38220, 44914, 43885, 35892, 26240, 12121, 11065, 3556]
13445C556j7941Q482J8053O762l389j0537O626J5017J5613J7491o479j7880r667
13432B5707n920K13R46O683k005J037k090J927r440q725J4805J1606m468j3195
13418A7081j062j460q725J3862J1640K556L200j1424J4912J3363j0898m422m856
13405C3767L285j5787N582O650q437j004q52n014j967K168N177j0424l598J0321
13391A9867J342P344p17j1685J3606J068j695O776N612J4716L174j8570j7630
13378B3208j8241m470K35Q929Q391M051k484J4991K1313n757k0762n467J344Q009
13364C3290Q66M152j216n855j1460n58l969Q919J389K095J3114j4927O510N574
13350C7924N5o161l769L297L440l200L378r156j394J4307J9477O236r523Q5O465
$$ y = [3556, -14385, -5903, 12150, 18912, 15523, 4986, 11612, 26629, 42242, 59733, 53254, 35374, 25707, 19787, 20000, 20946, 27629, 25624, 26661, 24571, 26498, 17058, 8333, 23138, 34744, 30276, 17081, 16019, 14559, 5834, 19696, 31336, 33892, 37092, 25668, 40580, 53943, 43045, 38623, 33767, 37052, 21265, 26847, 33497, 25060, 24056, 23204, 18190, 16223, 18391, 23568, 13144, 9546, 19867, 21209, 28553, 27836, 16151, 29757, 30825, 29130, 35906, 41518, 56234, 59408, 40838, 23208, 4967, 497, 732, 9661, 18052, 22103, 19619, 34610, 55923, 50166, 29404, 23937, 25281, 33290, 34156, 38308, 37092, 31237, 19777, 19219, 15250, 24169, 25558, 27653, 40767, 25840, 32350, 37924, 37979, 31818, 28049, 31346, 34786, 31586, 34964, 25808, 24414, 38721, 58198, 64434, 54911, 54996, 61461]
13335F1461k035r206m808p463j769O559l318j0325Q642N480l363q409N040j1306
13321B5180j2326L418P052k283n384P335k01L119M533m555J3983R298L722l033
13307D9858J533l268p364m6K087Q823j0385n021N492M396P260M349j2144q506
13293C7064n339l774Q518m57j437J3572M595j923m422O729O462O937p469M0j5492
13278D3604q723N069J218N86M359Q095R847j356N088J1559M608j4469n448N750
13264F9787O222M193J726p203j2668p997j897O162j6439J7410K1879j053k4656
13251E5466o037O191L744j0234J117J987M699n903J0393l813j0977P360k605j4819
13237C6569N147j36p321M435J0779k638J9167N995j6402m693q198M221O725m328
$$ y = [61461, 59426, 50220, 45412, 37949, 36180, 42739, 39421, 29096, 37738, 43218, 39855, 31446, 36486, 25180, 12854, 16272, 23324, 21041, 15657, 22992, 22791, 25910, 30443, 25888, 39871, 49169, 52891, 49858, 51391, 48123, 40759, 40713, 42800, 51623, 41238, 36217, 41709, 46105, 53365, 57714, 45570, 37064, 31725, 27951, 36469, 36012, 34575, 48147, 52742, 50819, 46397, 53126, 59588, 66525, 59056, 59096, 43604, 34881, 39950, 41168, 41754, 46113, 54208, 64055, 62699, 67787, 79346, 83954, 69485, 64037, 69787, 76009, 80202, 81928, 74725, 62057, 54060, 52163, 58325, 41886, 59296, 81175, 80122, 55466, 49429, 55620, 59364, 49130, 50247, 52234, 56933, 51030, 61423, 57610, 46633, 53993, 51388, 36569, 41716, 41580, 34259, 38694, 49473, 46835, 66002, 71997, 55595, 50902, 42704, 46925, 53650, 49322]
13223D9322j3383o941J2044R498R203J4289Q659R139P498p325j8210j1513j3306
13210D8974n201r751M766J6053l20O234j631L764m663M436R935J4740J4766K0451
13196A22553Q552Q137q651r381j1166j5871k0841O492Q987n2K716j0049J822M124
13182H7372q72L6n29m215j0527M827l69j9123o109O391N808Q775R220N783j6832
13167F9636k122P390K440L355M507m477M553l19K194j412J7320J9902P417K3217
13153A53601L1437K7935K3562J2772n25j5038l2091k8528k8367j7704q367j5895
13141A02792J0663N335k450j7591l013K11q062O027Q507q433r785Q40K0870L27
13127A06238j4779P757j3250O682O57Q53L42j7340j0501J285K3042k075j169Q987
$$ y = [49322, 35939, 28998, 41042, 50540, 59743, 74032, 82691, 91830, 99328, 92003, 73793, 62280, 48974, 43773, 34022, 38788, 54841, 54521, 60755, 59124, 62888, 58225, 62661, 72596, 87336, 102102, 122553, 131105, 139242, 130591, 121210, 110044, 94173, 73332, 79824, 88811, 88759, 91475, 81426, 83248, 87372, 86500, 86536, 86007, 81792, 71265, 76092, 75723, 56600, 50491, 56882, 62690, 71465, 80685, 86468, 69636, 67514, 74904, 77344, 80699, 85206, 80729, 85282, 84963, 87157, 85745, 103065, 122967, 130384, 153601, 185038, 212973, 236535, 249307, 248782, 233744, 201653, 173125, 144758, 127054, 118687, 102792, 113455, 118790, 116340, 98749, 95736, 95947, 87885, 93912, 102419, 93986, 84201, 85041, 105911, 106238, 91459, 99216, 85966, 92648, 93305, 94158, 94500, 77160, 66659, 67944, 90986, 88911, 87742, 96729]
13113I6729p918K558J0751K5611K0944L2564M1423M2494N3015K7272k3379n7751
13101B64313n1914k8608j7020j2434n763j0835m098j1372k0192M010n628k674
13089I7785j4493k802J8201J0864q394m436J2413J458p44L958m394J988L591k249
13075A12746l075j6642J957Q896L699O572j140n389o543m07J7276Q530K0308K0561
13061A67349M009J0066Q147l457j5528k0074q880m586j4034O22R722K761k097
13048A34020n594j5363m611Q697P390N624j1463j1151j1866M761J0699o145O708
13035A11706J4690M487l266M541o88j357j9442j3537Q016O165L043M735N354L467
13021A27914o161O265O1p512j4046j4309l665J3288J2941K436r287L142O209J3440
$$ y = [96729, 88811, 91369, 102120, 127731, 148675, 181239, 222662, 265156, 318171, 345443, 322064, 264313, 212399, 183791, 166771, 154337, 148574, 137739, 133641, 122269, 102077, 106087, 100459, 97785, 83292, 80490, 98691, 109555, 101161, 96725, 109138, 110596, 109852, 113810, 109416, 111404, 114995, 112746, 109671, 93029, 94986, 103882, 107581, 114153, 113013, 107624, 101081, 100674, 117950, 126480, 146788, 167349, 171358, 181424, 189571, 186114, 170586, 150512, 141632, 137046, 123012, 123634, 133356, 136117, 134020, 128426, 113063, 108452, 117149, 124539, 130163, 118700, 107549, 95683, 100444, 111143, 104998, 111706, 126396, 130883, 127617, 132158, 131470, 130113, 110671, 97134, 105150, 111315, 114358, 119093, 124447, 127914, 121753, 128018, 128079, 120567, 106521, 92212, 88547, 101835, 114776, 117212, 107925, 111067, 117276, 130716]
13007A30716l107l591Q031m708j1761k37q52K561n105q867j3804M860J8145p976
12993A04305J3146J9522N735J1819p71o511k1246q400n597M569K0554O073K443
12980A45641O783k156j3948J854p235j1458R70Q836O183J0654q314K247l339j0147
12966A26571J2889J5625n781J1877J0632o730q748M477r585N515J6568j374k633
12953A69303P324J2160j421j4814J568N575n394K526J15k5653j183K453Q932K400
12939A63891O420L039j0073K055o888L542J962K0318K6396k837p41l895m185M679
12925B03683q329j058q38Q345J629Q028K695o252j3286R305Q723J086o056q055
12911A99620P310J4108J221l207o421L46j455N52J8205O186k979k0274o071J8169
$$ y = [130716, 127609, 124018, 132049, 127341, 115580, 115343, 114491, 117052, 111947, 103080, 89276, 94136, 112281, 104305, 117451, 136973, 142708, 154527, 153756, 147245, 125999, 117599, 112002, 116571, 137125, 143198, 145641, 152424, 150268, 136320, 138174, 130939, 119481, 120451, 129287, 135470, 146124, 137810, 140057, 136718, 126571, 139460, 155085, 149304, 161181, 171813, 165083, 156335, 160812, 151227, 156742, 173310, 171936, 169303, 176627, 188787, 187366, 172552, 174120, 179695, 174301, 176827, 176942, 151289, 150106, 152559, 161491, 163891, 170311, 173350, 163277, 165332, 158444, 161986, 163948, 184266, 210662, 207825, 207084, 203189, 199004, 203683, 195354, 194296, 193458, 201803, 203432, 211460, 214155, 207903, 194617, 203922, 212645, 213731, 207675, 199620, 206930, 221038, 222259, 219052, 212631, 212977, 211522, 212074, 230279, 236465, 233486, 213212, 207141, 225310]
12897B25310j447J2649K5671J6225p093j0752M72n178M28J0428j9224j3918J1669
12884B45240K3074n345M959O0j99J1563j074k428o263J1997J392N768R691K505
12870C00940o799N448p942k61K303j183P467J6967m515n475k066K4659M536n400
12856C28679J11j7180r355J613J1910J6502K549P811J6614J3273J3458J595k5671
12843C61909J5024K4589K053P568l123K137K1150K2228R937M938J4191n546k243
12830D74812N645J2113q60N812j116m329m200Q831k096K879P427k3795k407l305
12816D75411J8184J5431n862r312q39j0325j168M832j178n245M704J3111Q419
12803E06163j104J2228J7880m189j3666J2936J4872l97L195M759J2400J521K0990
$$ y = [225310, 223863, 236512, 262183, 278408, 271315, 260563, 261035, 255857, 256285, 266713, 247489, 233571, 245240, 268314, 262969, 267928, 267988, 267789, 279352, 278278, 275850, 269587, 281584, 282976, 288744, 298435, 300940, 294141, 299589, 291647, 291386, 293689, 292506, 299973, 316940, 312425, 306950, 304884, 329543, 334079, 328679, 328790, 311610, 302255, 303868, 315778, 332280, 334829, 342640, 359254, 372527, 385985, 387580, 361909, 376933, 401522, 403575, 411143, 408020, 410157, 431307, 453535, 463472, 468410, 482601, 477055, 474812, 480457, 492570, 491710, 497522, 496406, 492077, 487877, 496708, 494612, 497491, 504918, 481123, 478716, 475411, 493595, 509026, 503164, 493852, 493013, 482688, 481520, 486352, 485174, 479929, 484633, 497744, 506163, 505059, 517287, 535167, 530978, 517312, 530248, 545120, 544723, 547918, 552677, 565077, 566598, 587588]
12790E87588K098j3573n344k0629L80K8520J6846J924l869P166J1240j38J1504
12777F23713J5384k331K89K5805J4808p793j645o221R149P961Q788P59O314K2150
12763G17130q526Q37J4395J1595J9008Q410K0916O345K922N413J5258Q201J7371
12750H39275J0014L380J7210J8145J1086J7741J3255P173P333J3408J6284J650
12738I75954j4521J0515K4173J3900L1183J7747K489K4919Q07J1989K0398J1765
12726A131318J1232J2271O859K0235J9094J2622J2648R282K8308K8261K1462R859
12714A323451J1074K9069K1294K5554J6180Q727K5835L2531K1629J4069J2038
12703A541451J2321L0003L4635K3446K3297K6235J8808K5279K2444K1706L3102
$$ y = [587588, 589686, 576113, 570769, 550140, 550520, 579040, 595886, 597810, 593941, 601107, 612347, 612209, 623713, 639097, 636766, 637055, 662860, 677668, 669875, 668230, 662009, 671158, 679119, 687907, 688666, 694980, 717130, 708604, 709441, 723836, 735431, 754439, 762849, 783765, 790110, 793032, 798445, 813703, 821904, 839275, 849289, 852669, 869879, 888024, 899110, 916851, 930106, 937279, 944612, 958020, 974304, 975954, 961433, 971948, 996121, 1010021, 1041204, 1058951, 1061440, 1086359, 1087166, 1099155, 1119553, 1131318, 1142550, 1154821, 1161680, 1181915, 1201009, 1213631, 1226279, 1235561, 1263869, 1292130, 1313592, 1323451, 1334525, 1363594, 1384888, 1410442, 1426622, 1435349, 1461184, 1493715, 1515344, 1529413, 1541451, 1553772, 1583775, 1618410, 1641856, 1665153, 1691388, 1710196, 1735475, 1757919, 1779625, 1812727]
12692A812727L8414L6697J2866K7650L4071K7962M0435K5743L8988N3114L7311
12681B185978M0789M9377L0752M4462M1559M4911N3092N7056N6861L8927M1109
12670B684873N6068M9138N8335L9496N7782M9945M4228O5677O3259N4450P6226
12659C299477Q5877Q6439O7888O6480Q6771J08910J00059R1461R0120R4434J14189
12648D292105J18104J04688J07616J20733J25413J22572J35306J40758J55249
12639E422544J49535J48400J65825J69764J77477J67996J69275J68406K16393
12630F955615K15958K16080K14353K21305K43585K57004K52837K64767K65071
12621I106575K97925L25334L15943L10276L19700L57465L58192L56540L56132
$$ y = [1812727, 1851141, 1887838, 1900704, 1928354, 1962425, 1990387, 2030822, 2056565, 2095553, 2148667, 2185978, 2226767, 2276144, 2306896, 2351358, 2392917, 2437828, 2490920, 2547976, 2604837, 2643764, 2684873, 2740941, 2790079, 2848414, 2887910, 2945692, 2995637, 3039865, 3105542, 3168801, 3223251, 3299477, 3385354, 3471793, 3539681, 3606161, 3692932, 3801842, 3901901, 3993362, 4083482, 4177916, 4292105, 4410209, 4514897, 4622513, 4743246, 4868659, 4991231, 5126537, 5267295, 5422544, 5572079, 5720479, 5886304, 6056068, 6233545, 6401541, 6570816, 6739222, 6955615, 7171573, 7387653, 7602006, 7823311, 8066896, 8323900, 8576737, 8841504, 9106575, 9404500, 9729834, 10045777, 10356053, 10675753, 11033218, 11391410, 11747950, 12104082]
12612A2104082M09910M13087M01603M11319M19652M33394M50991M32320M51538
12603A5927896M68035M75054M71788M69716M51891M30029M25571M25993M13623
12594A9959596L81754L64916L42495L27999K79364K49366K35087K02946J42312
12585B2485835Q4584N1593K0122j3381o1998p8026j18972j68293k00629k26804
12575B1774031k58740k60326k88901l24650l38875l55018l60996l76895m05506
12566A8804124l92723l79049l91100m04854l78796l84423l91743l91669l78022
12557A5311745l67642l65616l72194l48666l48634l35812l23530l09833l08781
12548A2231037l17142l05876k87136k81709k73856k46757k45136k72180k44497
$$ y = [12104082, 12513992, 12927079, 13328682, 13740001, 14159653, 14593047, 15044038, 15476358, 15927896, 16395931, 16870985, 17342773, 17812489, 18264380, 18694409, 19119980, 19545973, 19959596, 20341350, 20706266, 21048761, 21376760, 21656124, 21905490, 22140577, 22343523, 22485835, 22570419, 22622012, 22642134, 22628753, 22566755, 22488729, 22369757, 22201464, 22000835, 21774031, 21515291, 21254965, 20966064, 20641414, 20302539, 19947521, 19586525, 19209630, 18804124, 18411401, 18032352, 17641252, 17236398, 16857602, 16473179, 16081436, 15689767, 15311745, 14944103, 14578487, 14206293, 13857627, 13508993, 13173181, 12849651, 12539818, 12231037, 11913895, 11608019, 11320883, 11039174, 10765318, 10518561, 10273425, 10001245, 9756748]
12539I756748k28520k37145k35541k04907k15720k07817j95677j92923j90306
12530G848192j79335j80151j79031j57271j74934j68906j65318j29576j55091
12521F358579j56158j39523j21040j24250j40946j30504j13217j17202j06209
12512E209530j01590j04101r7705r7369j09261j00462r7450q5247q6693r2949
12502D236703p7118p4820q3929r5732p7450p2819p0657n4970o0854q3547o8843
12491C415964p0250p4100o2205n2721n9067n6984n5363o6087n0689m9697m2669
12480B776132m2145m2778o0722m3896l7936k5577m2440m5482m7284m4612l3956
12469B309304n4071l1465k9632l5306k3123m1425m9310l4406m2603l1403j5231
$$ y = [9756748, 9528228, 9291083, 9055542, 8850635, 8634915, 8427098, 8231421, 8038498, 7848192, 7668857, 7488706, 7309675, 7152404, 6977470, 6808564, 6643246, 6513670, 6358579, 6202421, 6062898, 5941858, 5817608, 5676662, 5546158, 5432941, 5315739, 5209530, 5107940, 5003839, 4906134, 4808765, 4699504, 4599042, 4501592, 4416345, 4329652, 4236703, 4159585, 4084765, 4000836, 3905104, 3827654, 3754835, 3684178, 3629208, 3568354, 3484807, 3415964, 3345714, 3271614, 3209409, 3156688, 3097621, 3040637, 2985274, 2919187, 2868498, 2818801, 2776132, 2733987, 2691209, 2630487, 2586591, 2548655, 2523078, 2480638, 2435156, 2387872, 2343260, 2309304, 2255233, 2223768, 2194136, 2158830, 2135707, 2094282, 2044972, 2010566, 1967963, 1936560, 1921329]
12458A921329m1252k5036k5423j8796k6679l5805k9169k0347k3316j0946l1442
12447A633118k9916k7570l9508l0466j0148q189p564j6559l0020j8937k0830l5801
12435A357610k0000J047j3596j9966k4916j7875o213j3008j8613j4576j4962l2756
12423A162176r886j4639k3134k0985j9867p461m600k2574j5069j8310k5835n337
12411I74479j0733J262k315J366j6651l0054k0345l767q988j2842l636k0631j5137
12398H32008J1341L998n186j8909p704n586l6012j4614j2744p011m57l035K537
12385G38626o496j6719J2990j5478j3887m681j7077j4099j02p284L390q423P261
12372F58021J4604j8290j8507J677j1328j7303k1951P051o84K592P534o723r488
$$ y = [1921329, 1880077, 1855041, 1829618, 1810822, 1784143, 1748338, 1719169, 1698822, 1675506, 1664560, 1633118, 1603202, 1575632, 1536124, 1505658, 1495510, 1487321, 1479757, 1463198, 1433178, 1414241, 1393411, 1357610, 1337610, 1338657, 1325061, 1305095, 1280179, 1262304, 1256091, 1243083, 1224470, 1209894, 1194932, 1162176, 1152290, 1137651, 1114517, 1093532, 1073665, 1066204, 1061604, 1039030, 1023961, 1005651, 979816, 974479, 963746, 965008, 962693, 964059, 947408, 917354, 897009, 893242, 884254, 871412, 867776, 847145, 832008, 843349, 847347, 842161, 823252, 815548, 809962, 773950, 759336, 746592, 739581, 739124, 736089, 738626, 732130, 715411, 728401, 712923, 699036, 694355, 677278, 663179, 663077, 655793, 659183, 650760, 658021, 672625, 654335, 635828, 637505, 626177, 608874, 586923, 593974, 593290, 595882, 603416, 596693, 587205]
12359E87205j4424o110J1638J1496k1k0629j5787N65n411L327J0584p886k4826
12346E29721p619l447p134k893J2096J0517J2198L799n506q323L730L299p954
12333E32484j2190Q469J5079N91j2467k1267k8388j8855o500J765N733N578k103
12320D67929k325p353L42k5589k0745M572R603p790n493J906j7088k856Q43j1765
12306C84191k6385q943J434Q187k336k155n841J90j2043m361Q97j210j7893j672
12292C12060J9684O509M258r23o730J663j0434J293J9753j3479j6270L267L450
12279C24101p842j7755L163m027j736j4113o823n083r502k071r963K160R215r75
12265B58749q911O207R590J045j0421r518P507K694k4137j7304J2719P193K201
$$ y = [587205, 572781, 566671, 578309, 589805, 589784, 569155, 553368, 553933, 548522, 551849, 562433, 554547, 529721, 522102, 518655, 511521, 508628, 520724, 531241, 543439, 547238, 541732, 533409, 537139, 540438, 532484, 520294, 528763, 543842, 544433, 531966, 510699, 482311, 463456, 456956, 458721, 464454, 470032, 467929, 465604, 458251, 458593, 433004, 412259, 416831, 426434, 418644, 413151, 415057, 397969, 395113, 395956, 384191, 357806, 348863, 350297, 358484, 356148, 353993, 348152, 348342, 336299, 331938, 332835, 331625, 313732, 312060, 331744, 338253, 342511, 341588, 334858, 336521, 326087, 327380, 347133, 333654, 317384, 320651, 324101, 316259, 298504, 301667, 297640, 295904, 281791, 274968, 269885, 260383, 258312, 248349, 250509, 259724, 258749, 249838, 256045, 265635, 266680, 256259, 246741, 254248, 256942, 232805, 215501, 228220, 235413, 237614]
12252B37614L289p494N189Q294K705q133p554M53N180k439q906m43J5946l767
12238B39934j925j774j1930J728m465j3141r661K759R784j5906n283j4185J047
12225A76982J2993O685O163K003p679q745N172J2379n423j052j1006o184l577
12212A78711q714K716O184M88J0987l316j7419k1695j1070J937J1317J2669L760
12199A66555M65r535J3855K1818j6362k2601O4N039p29j1503m448K916o033J0587
12185A50088l543q81m46N262n280q86j6026j4558j509J1818J9355k89P485o712
12171A43878Q986m90M9j4254j1342J2059l311j1981l438J3296P996o241o750k480
12157A25977J0745nK189O110J1491L889Q006Q433j8308j8708l05Q687j1992L327
$$ y = [237614, 240903, 233409, 238598, 246892, 249597, 241464, 233910, 234363, 239543, 237104, 228198, 227755, 243701, 239934, 238009, 236235, 224305, 226033, 221568, 208427, 198766, 201525, 211309, 195403, 190120, 175935, 176982, 189975, 196660, 202823, 204826, 197147, 188402, 193574, 205953, 200530, 199478, 188472, 182288, 178711, 169997, 172713, 178897, 179385, 190372, 187056, 169637, 147942, 136872, 138809, 150126, 162795, 166555, 167020, 157485, 171340, 193158, 176796, 154195, 154259, 159298, 158569, 147066, 142618, 145534, 139501, 150088, 146545, 145664, 145218, 150480, 145200, 144314, 128288, 113730, 112221, 124039, 143394, 143105, 150590, 143878, 152864, 152374, 152423, 138169, 126827, 138886, 135575, 123594, 120156, 133452, 141448, 135207, 128457, 125977, 136722, 136717, 138906, 145016, 156507, 160396, 168402, 176835, 158527, 139819, 139514, 148201, 136209, 139536]
12143A39536P034o812j0445j851j2898m666M918L985P66k1207o305K3895Q638
12130A24588j0270N747k09j409Q238L11j7299o387j966p44R918K001J337P692
12116A21548p365O120P248j6762r01J734j3285j1217l473M537L660O442q637N651
12102I5300P334q805l760R273N100K217p92j3805o751J342O037K2232m653k4451
12088H5818M920l258q919m670m860k2762p385K6472K1912J900K2076L726P45j0229
12074A05486L91P148q326k1325J0594K568q390k2102L654J1121N880L341n144
12061H4896j3403L572J1616j272q850L686J3591J166j8186o321P518J9579q665
12048H8927j2222j1774M404J9251M543M86L926m433k1029J8833J2289j6065P124
$$ y = [139536, 146570, 139758, 129313, 127462, 114564, 109898, 114816, 118801, 119567, 98360, 92055, 115950, 124588, 114318, 120065, 119856, 118447, 126685, 126996, 109697, 103310, 101344, 100600, 110518, 112519, 113856, 121548, 114183, 120303, 127551, 110789, 109888, 111622, 98337, 87120, 83647, 88184, 91844, 98286, 89649, 95300, 102634, 93829, 90069, 99342, 104442, 106659, 105867, 92062, 85311, 86653, 92690, 114922, 110269, 85818, 90738, 87480, 78561, 73891, 69031, 46269, 38884, 65356, 87268, 89168, 111244, 114970, 115715, 105486, 105877, 113025, 104699, 83374, 93968, 96536, 88146, 66044, 69698, 80819, 86699, 90040, 84896, 71493, 75065, 86681, 85409, 76559, 80245, 93836, 95002, 76816, 70495, 78013, 97592, 88927, 76705, 64931, 69335, 88586, 93129, 93615, 97541, 93108, 72079, 90912, 103201, 87136, 94260]
12035I4260K041j0956p792j872J0271P714M109j3359j724j203J925j0687L519
12022G6246m677O003j1367j4492J958J5490J7323P643J326l984j3082l834N451
12009H0004R987j3043k928J9383K973j3354n495K725j8268n700P223K303n220
11996F0590J2283J3045n244n129j3549l418R535P486J1427J106j2016j1949m859
11983E9308j875L875k409j689k9485j7072Q716Q202K1665N955j6497N519R450
11970E3663p206J1781R403j579l27K095O05l030l060p489P659L205m578p20l821
11955E6601m3m191n92J06K837R952j8245n807N252K511j930n646O053J0556j4684
11940D2730L63K3352l882j7219q476r607M548R867K260J1215J4689o106r927j3421
$$ y = [94260, 96301, 85345, 77553, 75681, 85952, 93666, 97775, 84416, 82692, 81489, 83414, 72727, 76246, 71569, 77572, 66205, 51713, 53671, 69161, 86484, 94127, 95453, 91469, 78387, 74553, 80004, 89991, 76948, 74020, 93403, 96376, 83022, 77527, 80252, 61984, 56284, 63507, 65810, 60590, 72873, 85918, 80674, 75545, 61996, 58578, 68113, 75599, 87026, 88132, 76116, 64167, 59308, 57433, 61308, 58899, 57210, 27725, 10653, 19369, 27571, 49236, 55191, 38694, 44213, 53663, 46457, 58238, 67641, 66062, 65735, 67830, 68435, 65405, 62345, 54856, 62515, 65720, 61142, 60422, 56601, 56558, 52367, 51775, 51881, 54718, 64670, 46425, 40618, 45870, 48381, 46451, 40805, 46858, 57414, 42730, 43093, 66445, 62563, 45344, 36868, 27261, 31809, 41676, 43936, 55151, 69840, 63734, 53807, 40386]
11926D0386J130r829n820K0452J4951n089J337o436N30O697L531N027j4233p96
11912E1838O716L818r320m140l184j0222J787M412K080j1382j2724o843R953J4693
11898C7482j892k0259O516J2949O514O12L587m986R68M349j2349M841M884p95
11884D2421J555j269k753J630J832J0199r965j6290m093j793M820L630m0R729
11870C9613J1609q398r661k235J772k056o54q492m826K465J6168J3219J1999J2198
11856G2721l660j530j8151k0739n510J849P207o148M498o43J1P702J4033r517
11842D2123k7197n857J3078M685K993m442j5308l877K201J2516J6499l893j268
11829C2253J2260n198o039R681J5395P293K990l795j0587o505J41j4119o151J2842
$$ y = [40386, 41516, 31687, 25867, 46319, 61270, 56181, 57518, 51082, 51612, 58309, 61840, 66867, 52634, 51838, 58554, 62372, 53052, 48912, 45728, 35506, 37293, 41705, 43785, 32403, 19679, 12836, 22789, 37482, 35590, 15331, 21847, 34796, 41310, 41922, 45509, 40523, 41491, 45840, 33491, 38332, 43216, 42421, 43976, 42707, 39954, 41584, 43416, 53615, 43650, 27360, 23267, 21474, 26294, 29924, 29884, 39613, 51222, 42824, 33163, 30928, 32700, 30644, 29990, 21498, 16672, 19137, 35305, 48524, 60523, 72721, 69061, 67531, 49380, 28641, 23131, 24980, 32187, 26039, 30537, 29894, 29905, 37607, 51640, 42123, 14926, 9069, 22147, 26832, 29825, 25383, 10075, 6198, 8399, 20915, 37414, 33521, 32253, 44513, 39315, 33276, 42957, 58352, 65645, 68635, 64840, 54253, 47748, 47889, 33770, 27619, 40461]
11815D0461N140q079l81n626N928L079o837J090m613K055m452j0280J0567P488
11801C5540O129q537p945J215N695J1673J835M900j6925k3911K166J1392Q199
11788C1426J3680K428j0802J0514K1565r62l023r236k7508N02p841j0685j526
11775H532J3098J0927j1434m248J5675l67n946k2J0492j1733k1k206J6554j601
11761C7700j841P482Q903j0856j1981K385r427p290J8415m019M105N9L014N237
11747D1886o250l151J1043l911J1432k660r381p720J1302K0013j4977j1056O092
11734D2662N300p422j9142n712J4389K2417O87j1585j1857O26k215N307Q227m667
11720C7015O35K8q930k1566K026J9822J2976m511q208N837l081j9032o116J3423
$$ y = [40461, 45601, 37522, 37141, 31515, 37443, 40522, 33685, 34775, 30162, 32217, 27765, 17485, 28052, 35540, 41669, 33132, 25187, 26402, 32097, 43770, 45605, 50505, 33580, 9669, 11835, 23227, 31426, 45106, 47534, 36732, 47246, 68811, 67849, 64826, 55590, 28082, 28584, 20743, 10058, 8532, 21630, 32557, 21123, 16875, 32550, 32183, 26237, 26215, 36707, 24974, 24953, 22747, 39301, 37700, 35859, 43341, 52244, 41388, 29407, 31792, 22365, 15075, 33490, 29471, 33576, 33635, 36649, 41886, 35636, 32485, 43528, 39617, 51049, 48389, 39008, 31288, 42590, 62603, 47626, 36570, 42662, 47962, 40540, 21398, 15686, 30075, 52492, 53179, 41594, 29737, 30363, 28148, 33455, 41682, 37015, 37650, 37678, 28748, 7182, 9208, 29030, 42006, 37495, 29287, 35124, 32043, 13011, 6895, 20318]
11706B0318J0075n564l855J4113J3028j0221m048Q867k034j077k0223J0255k728
11693B6906J577J32J1691R605j1851j1605j0919m157j3769m663n134L966J3843
11680E622O304k741J5893K0800Q717J943j2876p739l464J4421k866j244O86j8920
11666B4536P75n400m183K031N664N75K375o212k437R362K134r468O024j3464n384
11651F928J2732M983o358P791N28j2774l420R673J3390q509l93J5836M127j3117
11637C1417n108j718J0599O932m585p606k277j266l772k205Q526J1796K1411K196
11623F4340k1208j3442j3445R722M210R52R343Q18j3313O960K930J610j3981M180
11609B9676J5507j3302j0519j3103Q135J1162j3790q557K655n469M578P562K518
$$ y = [20318, 30393, 24829, 20974, 35087, 48115, 37894, 33846, 42713, 40679, 39602, 19379, 29634, 26906, 28483, 28615, 40306, 49911, 38060, 26455, 15536, 11379, -2390, -7053, -12187, -8221, 5622, 11926, 9185, 25078, 45878, 54595, 56538, 43662, 35923, 32459, 46880, 44014, 42770, 43456, 24536, 25311, 19911, 15728, 17759, 23423, 23998, 26373, 20161, 17724, 27086, 29220, 19752, 25776, 12312, 6928, 19660, 24643, 18285, 26076, 26604, 13830, 10410, 20083, 33473, 24964, 24571, 40407, 44534, 31417, 26309, 24591, 35190, 42122, 37537, 29931, 27654, 26388, 22616, 20411, 28937, 40733, 62144, 64340, 43132, 29690, 16245, 25967, 30177, 31129, 40472, 41290, 27977, 34937, 37867, 39477, 25496, 29676, 45183, 31881, 21362, 8259, 16394, 27556, 13766, 5209, 7864, 2395, 6973, 14535, 17053]
11596A7053K1048q125j4546j597m968P460j809Q410n862j12L871m998K745J3870
11582C2440m970j0145q040q93J2412n923k700l506L437J7831k15n163j1204p837
11568E524j204k302l160J2047J3393K193j39q885r787N913J4995J0874O219k3366
11554B2315M037Q140j1903l692j609J3939j142m702J1207r021j1824P788j691
11541B1842n498q374M020l901Q873O926K826j2788L103N880O881n029j676Q7L408
11526B6580k279J295M772N012J058o68n36l385K935j0210k314j0622r65p426J3375
11511A6622J4553m119j1886n79J1627J0242Q75j0723j6021L19N969R436O115J116
11497C3546j2477j0196o922j0640J107K1567Q983p050j215p894J2915K0571j96
$$ y = [17053, 38101, 29976, 15430, 13833, 8865, 16325, 14516, 22926, 17064, 16952, 20823, 15825, 18570, 32440, 27470, 17325, 9285, 8392, 20804, 14881, 12181, 8675, 12112, 29943, 29728, 24565, 13361, 5524, 4320, 2018, -1142, 10905, 24298, 26491, 26352, 17467, 7680, 13593, 28588, 39462, 45681, 22315, 26352, 34492, 22589, 18897, 17288, 31227, 30085, 25383, 36590, 27569, 15745, 23533, 21842, 16344, 7970, 11990, 8089, 16962, 23888, 26714, 13926, 17029, 22909, 29790, 24761, 23085, 23172, 26580, 24301, 25596, 30368, 35380, 36438, 35770, 35234, 31849, 34784, 24574, 22260, 11638, 10673, 3247, 16622, 31175, 27056, 15170, 14591, 26218, 36460, 37335, 26612, 10591, 10910, 16879, 26315, 32430, 33546, 21069, 10873, 3951, -6689, -5582, 15985, 24968, 17918, 16703, 8809, 21724, 42295, 42099]
11484D2099n433j0476j1374j0121L403J143j9700L322J7545J111l698p290R486
11471A0017n478N311J6482o765L859K02R55N240j0884J464o74O75o462K196m529
11456A1609P925j1779r756J5602J8636n292J460o414K703M27k482J5084L398j4710
11442B6411R19J0730J1411M219k214o76j2856k104J4525j213R003m89o516m406
11428D6744q596q50n425J0544l603j8024p823J2383P441l998m975P675N419o63
11414C6249k220q715J0680J1318o60o356r34n699r566m129J707m30j2639l35O473
11399A4744N016Q534j0689j643j841P404J0658K07k614j764P442J0930J7266K566
11385F6216r327m613O741J0741k4J4211J2157L210O40J2287K8883L3988L6255
$$ y = [42099, 36666, 26190, 14816, 4695, 8098, 9241, -10459, -7137, 10408, 11519, 7821, 531, 10017, 4539, 9850, 26332, 19567, 23426, 23628, 24583, 29823, 18939, 20403, 19729, 20404, 13942, 16138, 11609, 19534, 7755, -2001, 13601, 32237, 26945, 28405, 21991, 24694, 25121, 22639, 37723, 41121, 26411, 27330, 38060, 49471, 53690, 51476, 50800, 37944, 35840, 50365, 49152, 58155, 57666, 51150, 46744, 38148, 37298, 31873, 42417, 38814, 20790, 12967, 25350, 32791, 28793, 23818, 31493, 36912, 36249, 34029, 25314, 35994, 47312, 46652, 40296, 39362, 33663, 24097, 19968, 21675, 21245, 8606, 8271, 14744, 19760, 28294, 17605, 15962, 14121, 21525, 32183, 32390, 29776, 28012, 35454, 46384, 63650, 66216, 56889, 52276, 59017, 69758, 69734, 83945, 96102, 99312, 99952, 112239, 141122, 175110, 211365]
11372B11365M9468O7460R5101J87777K74194K81229K30799J24775m7247k42500
11362A232421l05611k24352j54364j03319o3129o2703m4493j8618k1708l3386
11352B00738j0376m173m771j4860n068O477j3405l386j0241j3963K713j5001j0753
11339A03931j153N396L245l386j0982j709l281m318K578j1914M445R9o168R67
11325G7750l727l813o564J402j1315o013j7047P275K392J7279R79j3208O899P879
11311F0168k806l480L228p679j2952J228R47m006L385r912j137J0028J6117N666
11297E8795l598j2865K083j3799o84L075P636J1028q97k549j3883J4950o30j39
11283D8523K188k3352j2654O904L114P967J5310j171m613J5395R694m860n179
$$ y = [211365, 260833, 328293, 423394, 611171, 885365, 1166594, 1397393, 1522168, 1474921, 1232421, 926810, 702458, 548094, 444775, 381646, 318943, 274450, 255832, 234124, 200738, 190362, 186189, 181418, 166558, 161490, 167967, 154562, 151176, 140935, 126972, 129685, 114684, 103931, 102778, 108174, 111419, 108033, 97051, 95342, 92061, 87743, 90321, 78407, 82852, 82951, 76783, 77750, 74023, 70210, 63646, 65048, 53733, 47720, 30673, 37948, 40340, 57619, 58598, 45390, 52289, 60168, 57362, 53882, 57110, 49431, 36479, 37707, 38654, 34648, 38033, 28121, 26984, 37012, 53129, 58795, 55197, 42332, 44415, 30616, 29932, 33007, 40643, 51671, 50774, 48225, 34342, 49292, 48662, 48523, 50711, 27359, 14705, 21609, 24723, 32690, 48000, 46829, 42216, 57611, 67305, 62445, 57266]
11270E7266j9902j5401L966J9126J4160J5879l262j4345k503j8873j4636n325
11258A6150P004J1796Q325j5167j9270O904J8384K952r541q383J1741K2909P214
11245F1018J61j0822q857N181l373p325L568j0938n964m789p333J6662R414J7876
11231E4479P850j3057k033J0930L706j2731K305N120P334J6728L0702K6214J677
11218A39224K30J3783R266J4697k105r352q116O503M7631L3851J0789q212k8120
11205B20069l7536k3575k0381M272j689n744o43j0093n946J0274Q688J8411K7447
11192A83554Q145j4992j933J0597k1j2811j0633j3507m110J6701J1747P187K123
11179A82047j2149j3308n158j0922j2300k641j243K371j1370j2475m77j6405r882
$$ y = [57266, 37364, 21963, 25929, 45055, 59215, 75094, 71832, 57487, 54984, 36111, 21475, 16150, 23154, 34950, 43275, 28108, 8838, 15742, 34126, 37078, 27537, 19154, 30895, 53804, 61018, 61179, 50357, 41500, 46681, 43308, 35983, 39551, 28613, 22649, 17860, 10527, 27189, 36603, 54479, 62329, 49272, 47239, 58169, 61875, 49144, 51449, 56569, 63903, 80631, 111333, 137547, 139224, 139454, 153237, 162503, 177200, 175095, 165743, 157627, 164130, 211761, 245612, 256401, 248189, 220069, 182533, 158958, 138577, 142849, 141160, 135416, 134773, 124680, 118734, 129008, 137696, 156107, 183554, 191699, 176707, 174774, 185371, 185350, 172539, 161906, 148399, 144289, 160990, 172737, 179924, 182047, 169898, 156590, 151432, 140510, 128210, 125569, 124326, 126697, 115327, 102852, 102375, 85970, 76088]
11166G6088p139j1677M514q944M994N459j1755j8226p570l312M394n608j3351
11153G867P400j184n742k0013j7237L0723N2072Q9656Q9015K6834k5051k5153
11141B09187j9831k6844j7478J347r669n166J6747J3142K0288K496M482Q082m156
11128A92627j2287j3956Q346j0250l363q751K434O152P236L851j2896n516j1827
11115A41800k343K7611L1891j0733M26O680j6279k6171N699j561m770j0674J8500
11102A60076J8674Q368J9279K3310L6861M9369L1931R487K3485q611j3005m783
11090C54441K095J7227M6586N8674L0739l99j845j7825m9726n2869l8358K797
11078C51537J9016K3417K3657K2844J2006n502J155j2540k470J7341J3231J4838
$$ y = [76088, 68949, 57272, 61786, 52842, 57836, 63295, 51540, 33314, 25744, 22432, 26826, 21218, 7867, 15267, 14083, 8341, -11672, -28909, 1814, 53886, 143542, 232557, 259391, 234340, 209187, 189356, 162512, 145034, 146381, 136712, 131546, 148293, 161435, 181723, 184219, 188701, 196783, 192627, 180340, 166384, 174730, 164480, 161117, 152366, 154800, 160952, 168188, 172039, 159143, 153627, 141800, 139457, 167068, 198959, 188226, 188652, 195332, 179053, 152882, 158581, 157020, 152250, 141576, 160076, 178750, 187118, 206397, 229707, 266568, 315937, 347868, 357355, 380840, 372229, 359224, 354441, 356536, 373763, 420349, 479023, 509762, 509363, 507518, 489693, 439967, 387098, 348740, 351537, 370553, 393970, 417627, 440471, 452477, 446975, 448130, 435590, 433120, 450461, 463692, 478530]
11066D78530Q961l290q333L761n282p935k485m865j2542Q683j3699k2615j0678
11053D08211o783K249l474j5841o689J3867r50L850K5738J1269M365J6894j525
11040D51181P939J728J3341J4218J2755J245P628K2033P833J0685j569p537P507
11027E48987J2188J5696Q037J5526Q219J9275R943K9312L7417K7091J3284O162
11015G51137J4428J5976J6081K7617O8838J08416J46484J76454J48408R0597L6936
11004A601372l5740o1609l3087K530K6342M7339L5218N0336M8819Q5111J10087
10993A876718J10959R4373Q0302Q3839J41266J84381K30585K91587L48798M31145
10983C873953N52177O60346O71625O05134M90640L17758K42708L51174N68432
$$ y = [478530, 487491, 484201, 475868, 479629, 474347, 466412, 463927, 459062, 446520, 455203, 441504, 418889, 408211, 401428, 403677, 400203, 384362, 377673, 391540, 390590, 394440, 420178, 431447, 435812, 452706, 451181, 459120, 460848, 474189, 488407, 501162, 502407, 510035, 532068, 539901, 550586, 549017, 541480, 548987, 561175, 576871, 584908, 600434, 608653, 627928, 637871, 667183, 704600, 731691, 744975, 751137, 765565, 781541, 797622, 825239, 894077, 1002493, 1148977, 1325431, 1473839, 1564436, 1601372, 1565632, 1504023, 1470936, 1473466, 1499808, 1547147, 1582365, 1632701, 1681520, 1766631, 1876718, 1987677, 2082050, 2162352, 2246191, 2387457, 2571838, 2802423, 3094010, 3442808, 3873953, 4426130, 5086476, 5758101, 6363235, 6853875, 7171633, 7414341, 7765515, 8333947]
10974H333947Q29794J077842J321759J568095J867690K261601K777934L430868
10966B3469530M375785N884719Q465546J3028016K0978175L3771421M9014955
10959A58988147N4399210M3202596K3333872q749244m6132528n7909514m3783237
10952A23349302k8401146j8748909j2833814r039546o537303m910130l871165
10945C9007289l142512k603078k202927j934077j743827j609746j462153j290718
10937B3018251j130217r65685q30934p35875p18492p63926r23376j017122r63512
10928A4969112q48678p30372o41779n91741n52047n41162m83979m07165l39971
10919I832218l18639l20813l53211l64384l49987l20291k90957k52717k32893
$$ y = [8333947, 9163741, 10241583, 11563342, 13131437, 14999127, 17260728, 20038662, 23469530, 27845315, 33730034, 42195580, 55223596, 76201771, 109973192, 158988147, 213387357, 256589953, 279923825, 271174581, 225042053, 167132539, 123349302, 94948156, 76199247, 63365433, 54325887, 47788584, 42878454, 39007289, 35864777, 33261699, 31058772, 29124695, 27380868, 25771122, 24308969, 23018251, 21888034, 20922349, 20091415, 19355540, 18637048, 17873122, 16949746, 15932624, 14969112, 14120434, 13390062, 12748283, 12156542, 11604495, 11063333, 10579354, 10172189, 9832218, 9513579, 9192766, 8839555, 8475171, 8125184, 7804893, 7513936, 7261219, 7028326]
10910G028326k14653k14368k24499k24739j99604j82343j73855j66569j75511
10901E252185j76651j58420j61447j56750j22222j21233j11957j00625j11085
10892D031795j30463j18035q8548p7359q4866q3110r0681j06965r8244q5616p4368
10881B993540q6364r4910q7408n8081n1304m4764q3056p3894p5700o2490p0742
10870B204827n6022n8995o4054p3357n1272n6746m9263l7930l9099n0077n3320
10859A614692m3093m9797n2049l7738n2029m0564m1265n2849l9417m0137l6092
10848A129662j2863j3488j1589k9969l3724j8456k0529k4901j8811p640q315j9077
10836I10300j2369J248k1704k7511k8344l9850m2014l2100k1129o727n996k3J7910
$$ y = [7028326, 6813673, 6599305, 6374806, 6150067, 5950463, 5768120, 5594265, 5427696, 5252185, 5075534, 4917114, 4755667, 4598917, 4476695, 4355462, 4243505, 4142880, 4031795, 3901332, 3783297, 3694749, 3617390, 3532524, 3449414, 3358733, 3251768, 3153524, 3067908, 2993540, 2907176, 2812266, 2724858, 2666777, 2615473, 2570709, 2487653, 2413759, 2338059, 2275569, 2204827, 2148805, 2089810, 2025756, 1952399, 1901127, 1844381, 1795118, 1757188, 1718089, 1668012, 1614692, 1571599, 1521802, 1469753, 1432015, 1379986, 1339422, 1298157, 1245308, 1205891, 1165754, 1129662, 1116799, 1103311, 1091722, 1061753, 1028029, 1009573, 989044, 964143, 945332, 937692, 929377, 910300, 897931, 899179, 877475, 849964, 821620, 781770, 739756, 707656, 686527, 679800, 673804, 673781, 691691]
10823F91691J59j1928J359J885m706J7960Q67j8874J065k0596j9363J3639J943
10810F55101J455j6206p757L398l8473m1308r308q420j4819k6802k5145O51k3637
10797D48730j5068j0047l3411k0877j5245k5233l125J9682j0497j9262j1316k13
10785C04118j2150k5754k9308k5881l378K1045M010j486k211n708l7446l4579
10773A51272l1405m1150k8697j3970J1383P2667Q6249O8322L4452L893r795j1545
10761B91676j8319m544j3793j6942j144l927j1985L72o295N717J139L412l85L90
10747B25372j0265k327J0222Q888j7246j6856m909p033M097J1540P756J604J14
10734B10957J449k5074l1258j624m950K8844K5655J6534m029N830L630k3821j1564
$$ y = [691691, 691850, 679922, 681281, 683166, 678460, 696420, 697287, 678413, 679478, 658882, 639519, 653158, 655101, 656556, 640350, 632593, 635991, 597518, 556210, 546902, 538482, 523663, 496861, 471716, 472367, 448730, 433662, 423615, 390204, 369327, 354082, 328849, 325724, 345406, 334909, 315647, 304331, 304118, 291968, 266214, 236906, 211025, 207647, 228692, 232702, 231216, 229005, 223297, 185851, 151272, 119867, 78717, 50020, 36050, 47433, 120100, 206349, 274671, 309123, 313016, 303221, 291676, 273357, 268813, 255020, 238078, 236934, 233007, 221022, 221394, 215099, 220816, 221955, 225367, 224982, 225372, 215107, 212780, 223002, 231890, 214644, 197788, 192879, 185846, 189943, 201483, 209239, 210843, 210957, 212406, 187332, 156074, 154450, 149500, 178344, 203999, 220533, 216504, 222334, 225964, 202143, 190579]
10721A90579j7809k154J1935j3675j1866L879j5806j3630L747J2076l047o839
10709A37390j0675R746K889m134o043K980j1764m883R648k660j2393M742O608
10696A21451k715l397J264Q070J7502P787Q008j3178j2404n082M52L751l374j2370
10682A15765K066J4130j3952m308J8959M272m238j3605j604k1671R655M786m144
10669A06111J4845J6347l225j2828m918j2025r811L019P109Q71J372k163kO317
10655A11019q962j240q313j6214j8613j4535j0149o130J2758J424J788J768P97
10642D5398j5522j244K646L414m89N99M351K173Q943L951n605p778l588K816Q215
10627D8280J2709J290j4291n99J8192J3422M269n886q602o088k02q650k883n928
$$ y = [190579, 172770, 170616, 182551, 168876, 157010, 160889, 145083, 131453, 135200, 147276, 144229, 137390, 126715, 136461, 139350, 135216, 129173, 132153, 120389, 115506, 125154, 122494, 110101, 114843, 121451, 118736, 115339, 116603, 124673, 142175, 149962, 157970, 144792, 132388, 127306, 127758, 131509, 128135, 115765, 117831, 131961, 118009, 113701, 132660, 136932, 132694, 119089, 117485, 95814, 105469, 110255, 106111, 120956, 137303, 134078, 121250, 116332, 104307, 94496, 97515, 104624, 105495, 106867, 104704, 104702, 111019, 102057, 100817, 92504, 76290, 57677, 43142, 32993, 26863, 39621, 41045, 42833, 44601, 45398, 29876, 28632, 31278, 34692, 34203, 34802, 39153, 41326, 50269, 54220, 48615, 40837, 37249, 40065, 48280, 60989, 62279, 47988, 47389, 65581, 79003, 83272, 77386, 68784, 62696, 62494, 53844, 50961, 45033]
10613D5033n864M586R80L719l375j1724j493j5828j1976M792k754J2316Q432K6637
10599E3481J5607Q03j7694q395p660j5390P33K2862J1154M491q222M087K29J1030
10585F7116R167p333j0451q833Q94L047j691O308P986L515m143k0338N466k171
10571D8539K518M556m190J684K0596k174r869K340O577q08P206O414J0409K636
10557I6434J5395J6382J6485K0160J3575L1183M5599N8139Q8272J29609K14633
10546G45866K85133K72673J87985O9267j34117l02220k81904k00860j38465p3003
10536D30355p4169m1106k7059k2931k648p009j4812o968k4239j7021j6075k3396
10524A52922k0511K334k494l512M213M146j1206p07J611j482J612q907l478k3340
$$ y = [45033, 39169, 43755, 44735, 48454, 45079, 33355, 31862, 16034, 4058, 8850, 6096, 18412, 26844, 53481, 69088, 69891, 52197, 43802, 36142, 20752, 21485, 44347, 55501, 59992, 51770, 55857, 56086, 67116, 76283, 68950, 58499, 49666, 50560, 53607, 51916, 58224, 66210, 69725, 65582, 45244, 50710, 48539, 51057, 55613, 51423, 53107, 73703, 71529, 61660, 64000, 70577, 69769, 76975, 83389, 93798, 96434, 111829, 128211, 144696, 164856, 178431, 209614, 255213, 313352, 401624, 531233, 745866, 1030999, 1303672, 1491657, 1560924, 1426807, 1124587, 842683, 641823, 503358, 430355, 356186, 315080, 288021, 265090, 262442, 255433, 240621, 233653, 209414, 192393, 176318, 152922, 132411, 134745, 132251, 128739, 132952, 137098, 125892, 125185, 126796, 125314, 126926, 118019, 114541, 91201]
10510I1201j5173o66r677j0056m070M534J5582K154J3109J8461j7646j4129R08
10497G4532m681K209J0363j086k2473k4600q24Q197K309J0188J5670j3239j6245
10484D0320p938r550K42K0444R672r459M246j206K345r57j4504n730P904N162
10470D0991L616J4747K879j9802j7639J089O617O458q494p428K820j647J1268
10457C5475J4087p239l338R947n621o276j0989k418r684n656P064O129L972Q80
10443B6333N55o916m769n29N50J1075p972o046n394M048j348P637K3286P60K18
10428D1488J433j4731j53P904l16p540r640L089J1355n701K691r584M350J1357
10414C6002K0306o355r086r728M117R557J0412L446n373j240j7706m03L528j6891
$$ y = [91201, 76028, 75362, 65685, 55629, 51559, 56093, 71675, 73829, 86938, 105399, 87753, 73624, 74532, 69851, 72060, 82423, 81337, 58864, 34264, 33440, 41637, 43946, 54134, 69804, 56565, 40320, 32382, 22832, 23074, 43518, 53190, 43731, 47977, 46771, 49116, 48159, 33655, 27925, 35829, 40991, 44607, 59354, 62233, 42431, 24792, 25881, 32498, 38956, 30462, 23034, 25854, 24207, 35475, 49562, 42323, 38985, 48932, 43311, 37035, 26046, 23628, 13944, 8288, 15352, 21481, 25453, 26333, 26888, 19972, 15203, 14674, 15224, 26299, 18327, 12281, 6887, 10935, 9587, 17224, 40510, 41270, 41488, 42921, 28190, 28037, 35941, 35625, 28085, 18445, 21534, 32889, 27188, 29879, 20295, 24645, 36002, 56308, 49953, 40867, 31139, 35256, 44813, 55225, 58671, 53298, 52058, 34352, 33949, 37477, 20586]
10400B0586j2507k309J668J3146J1344l130n590J551j1924N321k284j6786N512
10387D598N479j2386l232K968J7287L377j3419Q87P571o269m504M747O832k1048
10373g112j0401J4601P361K520j9187j7670M286L0382n111O154J3738L904Q662
10360C2127r693j6543l628J7196m624m525Q375p324k387l243J1758k650n655j0407
10346a223m981L192j2165l805N165K6630R46J381n939L440O114J3780m422J1174
10332C9287k782K520j1884k556R601n564j2903q040m79l157J035J0327J7198q186
10318B4417j2443J969M729m492k565L019O77j460N642r04j6121j3986L92J4416
10304C290K890J4907L861L615m740p121L173N910J0081K897k4610j0076p989o113
$$ y = [20586, 8079, 5770, 7438, 20584, 31928, 28798, 23208, 24759, 12835, 18156, 15872, -914, 4598, 10077, -2309, -5541, -2573, 14714, 18091, 4672, 5559, 13130, 6861, 2357, 7104, 13936, -7112, -17513, -2912, 4449, 6969, -12218, -29888, -25602, 4780, -331, 5823, 19561, 23465, 32127, 22434, 5891, 2263, 19459, 14835, 10310, 18685, 11361, 8974, 5731, 17489, 14839, 9184, -1223, -6204, -3012, -15177, -18982, -13817, 12813, 13759, 15140, 9201, 12641, 18755, 32535, 28113, 39287, 36505, 39025, 27141, 24585, 34186, 28622, 15719, 7679, 7200, 4043, 5078, 15405, 32603, 24417, 11974, 13943, 18672, 14180, 11615, 14634, 15311, 13851, 19493, 18589, 2468, -11518, -11126, 3290, 6180, 21087, 24948, 28563, 23823, 16702, 19875, 25785, 35866, 38763, 14153, 4077, -3912, -10025]
10290a0025O328q514l489j624J616k558r092k488R483K4132l871j171K590j080
10276B37K718K387o459L869k766J5047J581r01K565j7601j8930M160J2385M161
10262B453n395j0099J1153K953n526k039K106L276J7993J866j2725l164J8556
10249B1408M055j4611j1838J744R062l483J670J2546p352o940K906l18j668J787
10235H968m286J3518J4267n6j3165N96j3629q773R089J7427K651P382q16r630
10221B3543M793N730k290K587K992L321p511j1924k544J1846n136o090R655O744
10207C5716q610q359p631r323l264J7752J2331Q25j6377k2976N798N835r013j014
10193h310l21j995P560K0280J1324k1244j2259q38Q387k394L3r88j0505M428N519
$$ y = [-10025, -3697, -12211, -15700, -17324, -15708, -18266, -27358, -29846, -20363, 3769, -102, -1273, 1317, 237, 2955, 5342, -1117, 2752, -14, 15033, 16614, 15713, 18278, 677, -18253, -14093, -1708, 2453, -2942, -13041, -1888, 1065, -4461, -6500, -4394, -1118, 16875, 18741, 6016, 2852, 21408, 25463, 10852, -986, 758, 9820, 6337, 8007, 20553, 13201, 6261, 9167, 8849, 7181, 8968, 4682, 18200, 32467, 32411, 19246, 19842, 6213, -2560, 6529, 23956, 26607, 33989, 33173, 23543, 28336, 34066, 31776, 34363, 37355, 40676, 33165, 21241, 18697, 30543, 25407, 19317, 28972, 35716, 27106, 18747, 11116, 1793, -1471, 16281, 28612, 29437, 13060, -9916, -4118, 1717, -7296, -8310, -8631, -10626, -3066, 17214, 28538, 7294, -4965, -5803, 2584, 190, 223, -765, -11270, -6842, -1323]
10178a323n130J2175n315q397K827j9922l704K1765K9849R074j1312k245k461
10165A5881j2437J095O252O061j4429j5111R355K709n077j2896j0959N745J2009
10152a1802J8073j544n276r88N157M379P237o676L925j887M862q2j1057j0918
10138f597L108M639N261R46n543p605J7744j380m748p399N024J8480j87p978j424
10123A2341j547n938n031L96O521J7771n635j7593j0881L950J610J5668J7926
10110B9558J2258j7089j2815o473J3699P850J746M26q431l410r658m678l356j3496
10096a3869K2559J5461J366o859n577J712r126j6059p454J7769L535j4528Q922
10083b148O521m857n462n078O19K2880m082J24J1553j4848l688P129O92N550M04
$$ y = [-1323, -6453, 5722, 407, -7990, -5163, -25085, -28789, -7024, 22825, 31899, 20587, 18342, 15881, 3444, 4539, 10791, 16852, 2423, -12688, -3333, -624, -5701, -18597, -29556, -23811, -11802, 6271, 4727, -549, -1537, 3620, 7999, 15236, 8560, 12485, 10598, 15460, 15378, 4321, -6597, -3489, 1150, 6411, 7357, 1814, -5791, 11953, 10573, 5825, -1574, 3450, 21930, 21743, 13765, 12341, 10794, 4856, -175, 221, 6742, 24513, 18878, 1285, -9596, -5646, -4036, 11632, 29558, 41816, 24727, 11912, 5439, 19138, 26988, 28734, 29160, 20729, 17319, 7661, 2983, -373, -13869, 8690, 24151, 25517, 18658, 13081, 14793, 5667, -10392, -17846, -77, 3458, -11070, -2148, 4373, -484, -5946, -11024, -10405, 12475, 8393, 8517, 20070, 5222, 1534, 8663, 9355, 14905, 15309]
10068A5309R444l96k3581m323N201m543J4414Q814K569L837N491n488q768O372
10054B4352q314n489o903r174R550m494J220J3505M115O806L653l682k0853J1956
10040A6248j943J969J1234J5085J8779k01J0246K094j5176k4145k201M48n917
10027B6520K852k373J224j6188o958O973P296q55l817L008J2402L301J4658L446
10013E1489k1646l260J374o420o550l233R660j5918p528p419j4J4822Q724j425
9999A2656p66Q213K358j890j5328q16R925M854J833j0012Q869K117l702J2103
9985C0414J2605p288r757r792J028J0508L451p781L938O161j0790J994n418l803
9971A5470J0547P285j1181o633m34J924Q710L123o337O67j6683q092J7997P567
$$ y = [15309, 24753, 24357, 776, -3547, 1654, -2889, 11525, 20339, 22908, 26745, 32236, 26748, 17980, 24352, 16038, 10549, 3646, -5528, 4022, -472, 748, 14253, 18368, 25174, 28827, 25145, 4292, 16248, 14305, 16274, 27508, 42593, 61372, 61171, 71417, 73511, 58335, 34190, 31989, 32437, 26520, 29372, 26999, 28223, 12035, 5077, 12050, 19346, 18491, 14674, 17682, 30084, 33385, 48043, 51489, 29843, 26583, 27957, 21537, 14987, 11754, 21414, 5496, -2032, -9451, -9465, 5357, 14081, 12656, 11890, 20103, 22461, 20571, 5243, 4427, 14352, 19206, 21039, 11027, 19896, 22013, 18311, 30414, 43019, 35731, 25974, 16182, 17210, 27718, 31169, 23388, 27326, 33487, 22697, 24691, 19273, 15470, 26017, 33302, 22121, 15488, 15054, 16978, 25688, 28811, 22474, 23141, 6458, -1634, 16363, 23930]
9957B3930J2416N738o807N93O856k4700j5552O923K210M775P036N882j0477N502
9943B4325M505M711m243j7483o809L694J2149o762j2140N363Q932j0870p162m782
9929f572p515K3232R651M990j0964j9819N533L662O606J1871J454Q47o034l942
9915A3000j933N286J1438M393j0174M9Q640Q043O253K64j1388p077j1239N424
9901B0979r538o944J1964J6340K110l921O19j631r227p556M228J124m744P508
9887B1311l132J2884J0629k1138j0841m761R270J0755n689q352K625K506N847
9874B1914j7454O605j1968k1777L950M693N323J4986j698j118n980P354P260P489
9860A9579p08p076L776J384O966J886Q484Q758O363P269R644K1465J5268K1414
$$ y = [23930, 36346, 42084, 35277, 35870, 42726, 18026, 2474, 9397, 11607, 16382, 23418, 29300, 18823, 24325, 28830, 33541, 29298, 11815, 5006, 8700, 20849, 14087, 1947, 7310, 16242, 5372, -1790, -6572, -14087, 9145, 18796, 23786, 12822, -6997, -1464, 2198, 8804, 20675, 22129, 22976, 16942, 13000, 11067, 16353, 27791, 32184, 22010, 22059, 30699, 38742, 44995, 45259, 33871, 26794, 15555, 20979, 11441, 4497, 16461, 32801, 34911, 30990, 31609, 29978, 20751, 13195, 17423, 18547, 13803, 21311, 18179, 31063, 41692, 20554, 9713, 4952, 14222, 24977, 19288, 10936, 13561, 16067, 21914, 4460, 11065, -903, -22680, -18730, -14037, -8714, 6272, 4574, 3456, -2524, 4830, 12090, 19579, 18871, 11795, 15571, 16955, 23921, 25807, 34291, 43049, 49412, 56681, 66325, 87790, 103058, 124472]
9846A24472M6415R6477J38011J84988J87393J45749O3597p4344j78779k12553
9836E21426j44469q5920n0048k4213l0630l1570j3192N160j8098j5008K718q939
9824A07217O124l004j1290j053j1770j2818j003L236K0575Q71k1892j7208o799
9811E1186O831Q375J459l682j1863n669K032r177J521P676p127r824p521p961
9797A6256p05J7283m080M453q568n34J031K887r229O366Q28l120n469p895J8053
9782B7557n407o646K650P697L779Q047j4098P464R507n309n501Q310O018O062
9768E0130j393j4528J273j6015m625L052k565m518k540M097P814K04M853L898
9754B9137j4380k0689l096l839M42l574K0131J1378n682k167k106R782J1631j1575
$$ y = [124472, 170887, 267364, 405375, 590363, 777756, 923505, 987102, 912758, 733979, 521426, 376957, 291037, 240989, 216776, 186146, 154576, 141384, 146544, 128446, 113438, 116156, 107217, 113341, 110337, 99047, 97994, 86224, 73406, 72403, 75639, 96214, 97085, 75193, 57985, 51186, 58017, 66392, 67851, 64169, 52306, 46637, 48669, 39492, 41013, 48689, 41562, 31738, 24217, 16256, 15551, 32834, 28754, 33207, 24639, 24105, 25136, 28023, 18794, 25160, 25988, 22868, 17399, 9504, 27557, 22150, 15504, 18154, 25851, 29630, 37677, 23579, 31043, 40550, 35241, 29740, 38050, 44068, 50130, 48737, 34209, 35482, 19467, 14842, 17894, 15329, 10811, 8271, 12368, 20182, 20386, 25239, 29137, 14757, -5932, -9028, -12867, -12425, -15999, 4132, 15510, 9828, 7661, 5555, 15337, 26968, 15393]
9740A5393l842r86j4897j627K49J161N922K0210P998l581l596J5483L218q528
9726C2577N18j4412k497J4062k64k2924l170J1144o091J008l038j3052j0719r799
9712b6657J0611j794m92M794J9807K3623K765J4321q56j5098j1544l269l212q218
9698D781N39n85q373M019Q277l90m187j445p950n423P978j605k611P20J3039J0577
9682A7361N7j1366j1532J6783P801O685j8447j1165J0620R489j0831L880K179
9669A1514M685O75M417j4773j3767j57J384m76j5996J376J0939J2342L806J4830
9655B0799m345j0412J0324N358N710O038q600j783J928j0714j0649L021j33J6663
9641B3205Q348p32o816O417N712n351j5704k2411j410J5271J8060R901J402l851
$$ y = [15393, 11551, 10565, -4332, -5959, -5710, -4549, 1373, 21583, 29581, 26000, 22404, 37887, 41105, 32577, 33095, 18683, 16186, 30248, 29984, 7060, 3890, 15034, 8943, 9951, 6913, -6139, -16858, -26657, -16046, -17840, -18332, -13538, 6269, 29892, 32657, 46978, 46122, 31024, 19480, 16211, 12999, 4781, 5320, 4735, -3638, 381, 8658, 8268, 4081, 2636, -5314, -10737, -2759, -4364, -6975, -6255, 6784, 17361, 17418, 6052, -5480, 11303, 19104, 25789, 7342, -3823, 6797, 16286, 5455, 9335, 11514, 16199, 16874, 21291, 6518, -7249, -7406, -6022, -6498, -22494, -21118, -10179, 2163, 5969, 20799, 16454, 6042, 16366, 21724, 27434, 33472, 24872, 23089, 25017, 14303, 3654, 6675, 6542, 23205, 31553, 30821, 24005, 30422, 36134, 30783, 15079, -7332, -8742, 6529, 24589, 34490, 35892, 32041]
9627C2041Q69J0112j0216P53L328m262q573p819L543k838Q908j495N348M476J4357
9612D8532Q330p590j1888j2764k173j3576j6361m736J1644J6353J4426J6349J2566
9599E9112l413K267j424m560J531l25l166K75n025l370q053q826m4o401q446N155
9583A5287J328m760R748J7422q797R56N649N658o824m872l664N251R172K606o983
9568C7177q938j185K4897K1007k448o692j4351m952K0450R097p872j2318N616
9555E9488J7481J089Q144j2086o314p013O509J8154J3355J3922K1854n94J197
9542A35186q160j2537r35J6720n38J787J1646J2633J7184J1897J2365O774K167
9529B06189Q052J1686L3993K2040O132l011J6319K1542K2582L1681L1737K1452
$$ y = [32041, 32910, 43022, 32806, 33559, 36887, 32625, 24052, 16233, 19776, 16938, 25846, 24351, 29699, 34175, 48532, 56862, 49272, 37384, 24620, 22447, 8871, -7490, -12226, -582, 15771, 30197, 46546, 59112, 55699, 57966, 56542, 51982, 53513, 53188, 50022, 50297, 45272, 41902, 33849, 25023, 24979, 18578, 10132, 15287, 16615, 11855, 21603, 39025, 30228, 31184, 36833, 42491, 35667, 30795, 27131, 32382, 41554, 44160, 37177, 28239, 27054, 51951, 72958, 70510, 63818, 49467, 44515, 64965, 74062, 66190, 53872, 59488, 76969, 78058, 86202, 74116, 67802, 60789, 67298, 85452, 98807, 112729, 134583, 133989, 135186, 127026, 114489, 113554, 130274, 129736, 131523, 143169, 155802, 172986, 184883, 197248, 204022, 206189, 214241, 225927, 259920, 281960, 288092, 285081, 301400, 322942, 345524, 377205, 408942, 430394]
9517D30394J3139K9050M7481L1786M5163M3160M6881O3671P8350Q6455R8173Q8773
9505A102476R7662J17242J34728J48579J61534J70113J85317J94376J91842J79994
9495B683863J60519R0595M1172j5152o1415j00619j11173j34764j62077j50317
9485B240632j40454j54823j43548j32909j19066j02393q8696q3404p8082p6279
9475A120978n8271o2518o5420n4836m6327n2378l9939k5308l8243l4445l0668
9464F12625l3907j9102j5403j5825p427j7253j9273j1898j3588j7951l6893k3022
9452C81083k443j0665k9679l1079j5894p347O577j5219j5850J671n026k1638j2606
9439B21885K3558Q53n452l2560m083J3037q266j7950j0028O39R55n728n453n6
$$ y = [430394, 443533, 472583, 520064, 551850, 597013, 640173, 687054, 750725, 829075, 915530, 1013703, 1102476, 1200138, 1317380, 1452108, 1600687, 1762221, 1932334, 2117651, 2312027, 2503869, 2683863, 2844382, 2934977, 2976149, 2960997, 2899582, 2798963, 2687790, 2553026, 2390949, 2240632, 2100178, 1945355, 1801807, 1668898, 1549832, 1447439, 1358743, 1275339, 1197257, 1120978, 1062707, 1000189, 934769, 879933, 833606, 781228, 741289, 715981, 677738, 643293, 612625, 578718, 559616, 544213, 528388, 520961, 503708, 484435, 472537, 458949, 440998, 404105, 381083, 378640, 367975, 338296, 307217, 291323, 283976, 290553, 275334, 259484, 261155, 256129, 234491, 221885, 245443, 246296, 240844, 208284, 204201, 217238, 208972, 191022, 180994, 181633, 182588, 176860, 171407, 171351]
9425A71351Q8j2785j6760N070L588L764R35l032r897r829j0093j4Q792N586o421
9410A30343M647q237k0837j3265M074Q587N769j2379j8485j540R683N575R880
9397A03815N533j5925j0779j0513j288J4057M796o947N14K476j4447j9715l778
9384D7799q738M604o594j3749J3011K8761M694o938K376j4758k1997k629J6062
9371D1904J6677Q909P09k4755j3330N272j001O129O43M895m129P921n8k787O188
9356E3187j0089l866O129J804j5208j0364J1678J0883Q672p834k5394o980K977
9343A5595N046J2270K560p242M67L080q416j656N940K3276q278j7773M706P773
9329C7348k572j0276j0260r445o644J4627O214k355R1Q144M942L817K987j567
$$ y = [171351, 171439, 158654, 141894, 146964, 150552, 154316, 155251, 152219, 142322, 132493, 122400, 122386, 131178, 136764, 130343, 134990, 126753, 105916, 92651, 96725, 105312, 111081, 98702, 80217, 78677, 88360, 93935, 103815, 109348, 93423, 82644, 72131, 70843, 84900, 89696, 82749, 83263, 85739, 71292, 51577, 47799, 39061, 43665, 37071, 23322, 36333, 65094, 69788, 62850, 65226, 50468, 28471, 25842, 41904, 58581, 67490, 68199, 43444, 30114, 35386, 34385, 40514, 41157, 46052, 41923, 49844, 49786, 46999, 53187, 43098, 39232, 45361, 47165, 31957, 21593, 33271, 44154, 52826, 44992, 19598, 12618, 15595, 20641, 32911, 35471, 28229, 28696, 31776, 23360, 21704, 27644, 50920, 42642, 24869, 29575, 37348, 34776, 24500, 14240, 4795, -1849, 12778, 18992, 16637, 16728, 24872, 29814, 33631, 36618, 35051]
9315C5051r551j4121K72k632m293k580M79N79J1279l543J4346J2576J4256k477
9301D9641j1043j2201r374r797p358R560j0830Q955r176m467M120L1194K437j506
9287C0155q640n857o767J2043N191r717m623M542p90q618K2604j999j6828p779
9273B917P237O449M721j5782L943O812k1082r327K426N638N132O486R749J0464
9259B5783j9933j7437L269J1142N476K0758J5943r672j0271o564j877o227L323
9246A3713L531K894m531m404N088O271M438Q80n745j2635k673L153p730L604J3404
9231A9258j1125p633j0820k12J9725J0231M750n548L390P485j3998n297r8r325
9217G83j5788K110R008q767n42Q21J0458L655l128R391j1708p45q519Q307P360
$$ y = [35051, 25500, 11379, 11651, 9019, 4726, 2146, 2625, 3204, 14483, 10940, 25286, 37862, 52118, 49641, 38598, 26397, 17023, 7226, -132, 9428, -1402, 7553, -1623, -6090, -1970, 29224, 31661, 30155, 21515, 15658, 8891, 20934, 26125, 16408, 11785, 16327, 15537, 6919, 29523, 27524, 10696, 2917, 10154, 16603, 21324, 5542, 9485, 16297, -4785, -14112, -11686, -6048, -916, 5570, 15319, 25783, 5850, -11587, -8318, 2824, 8300, 29058, 45001, 35329, 25058, 18494, 16617, 10390, 13713, 17244, 20138, 15607, 11203, 16291, 22562, 27000, 27880, 22135, 9500, 6827, 9980, 2250, 5854, 19258, 8133, 500, -10320, -10532, 9193, 19424, 24174, 18626, 22016, 29501, 15503, 10206, 10108, 783, -15005, -12895, -3887, -12654, -13196, -12375, -1917, 1738, -1390, 8001, -3707, -4452, -12971, -4664, 2696]
9202B696m661j065O572O946j4026M836K5961o870k6965l297P206P178o559o098
9188h146J7749J282n508m912K557q684q803J118m485O991Q165o413k0980Q633
9174b1436J6453J75m102K28l41J1571j252O342M363L550q917j2897k090K768Q407
9159B822N723n171k6052L98P362o317k550J1337J1666P288j371j7860j1750M906
9145a9569J824J9219J3366k443P17R686J774O04j1798J14P961n924k466j6215
9131c150n696J6939o094r952j1146l534J0761J4846J422m308k792K453j891j0974
9117a3116Q491J3470p1m177r254r638n403K334Q367M889l974p198O890O603j93
9102a980K560m970p083R440R530L329j2880n531m416K1949Q481l270M70O951P174
$$ y = [2696, -1965, -3030, 3542, 10488, -3538, 1298, 27259, 20389, -6576, -9873, -2667, 4511, -2048, -8146, 9603, 10885, 5377, 465, 3022, -5662, -14465, -13347, -17832, -10841, -2676, -9089, -30069, -21436, -4983, -4808, -8910, -8682, -9023, 2548, 1296, 7638, 12001, 15551, 6634, -6263, -8353, -5585, 2822, 8545, 3374, -22678, -22280, -14918, -21235, -23785, -12448, -782, 6506, 5135, -12725, -24475, -19569, -17745, 1474, 14840, 12397, 13114, 22800, 24574, 25178, 13380, 13494, 21455, 15531, 13065, -3150, -8846, 8093, 1999, -7953, -19099, -22633, -11872, 2974, 4396, 88, -2704, -251, -2142, -13116, -4625, 8845, 8774, 4597, -4657, -14295, -19698, -17364, -8997, -4108, -8082, -15280, -8390, -1787, -1980, 580, -4390, -11473, -2033, 7497, 10826, -2054, -7585, -12001, 9948, 18429, 15159, 15629, 22580, 29754]
9087B9754k406m254j7409m742K2062N665R639r296j7150R184J1450q618j7200
9074F679j1458p009M00O724o384J3298O514M68M505J6423R509o060L707m469o95
9059C2152o65j2305r662K341K5153r059j8434j5830K708o93m903p020r395K178
9045b3434R339p709J042M357j2738O161L491R826j038K074Q393K300J132O666
9031I862j38J2343j1425j1614r695p621j3451J855J3325J6457J346k054J821j73
9017H38R4j3820m702K74r891J794J262l95J3362R141J6275k501j4122l182Q213
9002B640N048j6594j4725J3400L7909l733o346r37j3210n085J1607J0094j336
8989A8732p464r265m461J2159J940l33o591N335J3064k405k2839K616k3092L441
$$ y = [29754, 27348, 23094, 5685, 943, 23005, 28670, 38309, 29013, 11863, 21047, 32497, 23879, 6679, -4779, -11788, -11388, -4664, -11048, 2250, 8764, 9232, 13737, 30160, 39669, 33609, 37316, 32847, 32152, 31487, 19182, 9520, 11861, 37014, 27955, 9521, -6309, -3601, -4294, -9197, -16217, -25612, -23434, -14095, -21804, -20762, -16405, -29143, -22982, -19491, -9665, -10703, -8629, -236, 2064, 3196, 9862, 9724, 22067, 10642, -972, -10667, -18288, -31739, -29884, -16559, -102, 1244, -810, 1011, 838, 932, -12888, -17590, -17316, -27207, -25413, -24151, -24546, -11184, -2043, 14232, 11731, -2391, -5573, 2640, 7688, -8906, -23631, -10231, 27678, 23945, 17599, 16662, 3452, -1633, 9974, 20068, 18732, 11268, 2003, -2458, 9701, 11641, 11308, 4717, 10052, 23116, 20711, -2128, 488, -22604, -19163]
8975a9163M218J9990o627j461m152j5379m478J9882J3288M037J5930k303j0601
8962A3181j3745l965n543l842O699J2621j359J997J1782P044q807j0213Q180r710
8948D320m587R745K664p980l150K350M545P677m258n377j2104r9n32K59R00L794
8932a833R448J128Q306m211N812N291k453j7027j3252K455K0862M249m580j131
8918A3064q655J0329p411q680j957J1863O675m769j542M170k205N516r538j7260
8904a0400m571L150l271j686M304k244j4235l832J4712J1823J0851P85j6137J53
8890a0598Q125m211K349R67j980P527L079k454P018O699j0944j2132P109J2450
8876A3004q082l893q810j0049o147L351N648Q134q669J202n664k868J3364O55
$$ y = [-19163, -14945, 5045, -1582, -3043, -7195, -22574, -27052, -7170, 6118, 10155, 26085, 23782, 13181, -564, -4529, -10072, -13914, -7215, 5406, 4047, 6044, 17826, 24870, 16063, 5850, 14030, 4320, -267, 9478, 12142, 4162, 1012, 3362, 7907, 15584, 11326, 5949, -6155, -6254, -6786, -6527, -5627, -1833, 7615, 8743, 17049, 12838, 18650, 23941, 21488, 4461, -8791, -6336, 14526, 18775, 14195, 13064, 4409, 14738, 7327, -1353, -3310, 8553, 15228, 10459, 8917, 13087, 10882, 16398, 6860, -10400, -14971, -11821, -15092, -16778, -12474, -14718, -28953, -32785, -18073, -6250, 4601, 5386, -10751, -10598, -2473, -6684, -4335, -3368, -5348, 2179, 5258, 2804, 9822, 16521, 5577, -6555, 554, 13004, 4922, 1029, -7781, -17830, -23977, -20626, -14978, -6844, -15513, -14311, -19975, -22843, -9479, -8824]
8862h824o888o809K087J0203J2604J0981O656k947p958j1775K141j5644M319R85
8848a0869K5750J563j1831k146l0j823J2770q894p87o132m198J7169J3574n228
8834A8888p586k613j2779p093J4251N287j2312l09R791K332r495j5947L432Q727
8820e426O838Q153m038K3900n143j5916J583q859J226R220R510k661j8941j4897
8806a5451p699P579J6348L39L678J1001m244k2446o066p546K927O468o456N54
8792b1014L854J6380P842n750L771j2136q545N33R168q873q213k404R740j5060
8778c0707P85L378R326j1773j7276P984J2110M931O638J032o045j973j539k532
8764b5661K7q36l852O250j2463M053J6113L142o093o413N89J0676J0835K427N576
$$ y = [-8824, -15712, -22521, -20434, -10231, 2373, 13354, 20010, 17063, 9105, -2670, -529, -16173, -11854, -10869, 14881, 16444, 4613, 2467, 2437, 614, 13384, 4490, 3703, -2429, -6627, 10542, 24116, 18888, 11302, 8689, -4090, -11183, 3068, 8355, -3957, -4266, 5525, 7857, -1638, -17585, -14153, -5426, 1412, 9565, 5527, 29427, 24284, 8368, 9951, 1092, 2318, 11538, 21048, 18387, -554, -15451, -23150, -15571, 777, 1116, 4794, 15795, 11551, -10895, -16961, -24507, -21580, -15112, -21568, -21014, -17160, -780, 7062, 1312, 5083, -7053, -15598, -15065, -5897, -14770, -22983, -25387, -15647, -30707, -29922, -26544, -17218, -28991, -46267, -38283, -26173, -21242, -14604, -13572, -19617, -21590, -23129, -25661, -25634, -26470, -30322, -24072, -36535, -32482, -16369, -13227, -19320, -25733, -25144, -14468, -3633, -1206, 4370]
8749D370R666M109N423Q39N92j1980r806k690o190p307M825L872O762M513m012
8734B986j1500k904p790J5597J6436l876Q713L491j3661j5782J1440k823N982
8721F309n903k40M388q20j0011O215J4927J3035m316p847n718r250O588j3912
8707f555n448K101J2121J6852N235j5089j2731j669l245m195L951Q539j0213L24
8693a0022J0115K560J4577K011p014j0502p262L020m760K2857J2653O40p191k3440
8679a758n503Q103n278P98R262L544p546P81q839P859J060j0585j3213J293l061
8664b3083N47J5833K2770J3742P180j7084q705o509n896M534k84Q05L291j0183
8650c042o296j869O64j900J4182J8166K4662K3344K2802M6825O4102M3560J5880
$$ y = [4370, 14036, 18145, 23568, 24407, 24999, 13019, 3213, 523, -5667, -12974, -8149, -4277, 2485, 6998, 2986, -8514, -11418, -19208, -3611, 12825, 8949, 17662, 21153, 7492, -8290, 3150, 327, 6309, 406, 166, 4554, 3734, -6277, -62, 14865, 27900, 23584, 15737, 10019, 769, 7357, -6555, -12003, -9902, 2219, 19071, 24306, 9217, -3514, -5183, -8428, -12623, -8672, -133, -10346, -10022, 93, 2653, 17230, 19241, 12227, 1725, -5537, -2517, -7277, 15580, 28233, 28873, 21682, -1758, -7261, 842, -4436, -3638, 5624, 9168, 1622, 2403, -6436, 1423, 2483, -8102, -21315, -20022, -23083, -22536, -6703, 16067, 29809, 36989, 19905, 11200, 4691, -1205, 3329, 3045, 3850, 7141, -3042, -9338, -11207, -10543, -12443, 1739, 19905, 44567, 67911, 90713, 137538, 201640, 245200, 261080]
8637B61080J71m7716n6309m1237l1773l4029j2999p777P284R414j7000j3227r264
8624F618N724R766J5429k476K89Q910L692p856r912j759q256N13N698o06Q042
8609C3816l538k814M092j3068J517K3399L181J7944N016J7032J8505J8045P5475
8596A98602Q8789R6243Q4522M9948K3283r0135j31330o6389o1099n0621j9505
8585A22308j5035r679M508l218p406r477j2800r069L557l267p061J0870l096M503
8571F5638n767j8552N417J0229J839J0511o768n928J973L066Q437k98M141J3191
8557H7129j256o722j0139k0488K638L2723L5224N7360M7918J6341J0622j9444
8545B31906n9853m6217l2065r016n633k6664j5571J0369j775j1975L373L406o069
$$ y = [261080, 261251, 213535, 157226, 115989, 84216, 50187, 37188, 29411, 36695, 46109, 29109, 15882, 6618, 12342, 22108, 37537, 35061, 35350, 44260, 47952, 40096, 30184, 28425, 20169, 20682, 26380, 25774, 33816, 30278, 27464, 31556, 18488, 20005, 43404, 46585, 64529, 69545, 86577, 105082, 123127, 198602, 287391, 383634, 468156, 518104, 541387, 451252, 319922, 253533, 192434, 141813, 122308, 107273, 97594, 102102, 98884, 91478, 82001, 69201, 60132, 63689, 60422, 53361, 64231, 61135, 65638, 59871, 41319, 46736, 56965, 58804, 69315, 62547, 56619, 58592, 61658, 70095, 69797, 73938, 87129, 85873, 79151, 69012, 48524, 51162, 83885, 119109, 176469, 224387, 240728, 251350, 231906, 172053, 125836, 93771, 84755, 79122, 52458, 36887, 47256, 45481, 33506, 36879, 40285, 34216]
8532C4216r635p548L094n12K283q631O510K488N485j160r386K797M472r241o729
8517H503N706n558Q740j327r112j199O562J0571k462j343n444J099R970J788o966
8502A9528K427l441n707j860j1457j2452n57R564o51q125K994o915J2515K1424
8488A7287j85n278j338j5477q110M238M502P882J8632J0368k1636n062J030L699
8474A0552n9m742J1723k055m575r557M163m57n953J185L823n745o876l874Q940
8459c507l728j974N605j2518j1191J177K192J9874J719n551q35Q271l540J0544
8445F538j4424j7791M620K4081N784k203K423k463j315k724J9543L616j2364j1410
8431A911J5154N281J0950k112K163m677k289r794j1404j337r4l832o727M846p303
$$ y = [34216, 24581, 17033, 20127, 19615, 21898, 13267, 19777, 22265, 27750, 26590, 17204, 20001, 24473, 15232, 8503, 14209, 8651, 17391, 16064, 6952, 5753, 12315, 22886, 20424, 19081, 13637, 14736, 24706, 26494, 19528, 21955, 18514, 12807, 10947, -510, -12962, -13519, -3955, -4606, -12731, -9737, -16652, -4137, 17287, 17102, 11824, 10486, -4991, -13101, -8863, -4361, 3521, 22153, 32521, 10885, 5823, 6853, 10552, 10493, 5751, 17474, 15419, 10844, 1287, 5450, 4993, -960, 225, 4048, -1697, -8573, -12447, -3507, -7235, -9209, -3604, -16122, -27313, -26136, -23944, -4070, -2351, -7902, -8737, -466, -4006, 6538, -7886, -25677, -21057, 3024, 8808, 6605, 9028, 6565, 5250, 2526, 22069, 25685, 13321, 1911, 17065, 22346, 33296, 31184, 33347, 28670, 26381, 16587, 5183, 3846, 3752, -80, -6807, -1961, -9264]
8416i264J2294J3094m958j4795J046P342j409J0524N077k1667j6094l219J6730
8403e299J988r442j849P705J2350k052m067O778k036q14j0497m201j405j2895
8389b5736J0834J0043L249J1938j0670J3935J5454r874j8313p698k206J277j774
8376i541k481O583Q199R704m622n423o356n057r90N34M070P689K889N691N51j3112
8360a672j2458j692r154L088O86r501j0466N470J9703J5379j132p928n305n35
8346a5517M820P082q525o833n706J045j6257J457J5743J9072q286O434K779J0670
8332G978p350j598l078N78M155n311j0803m114M034J4953J2513k088j5863o775
8318a2769P346n1R20n129m347N355q051M640L142j1112n553r053o663J001Q898
$$ y = [-9264, 3030, 16124, 11166, -3629, -2583, 4759, 3350, 13874, 18951, -2716, -18810, -22029, -5299, -3311, -12753, -14602, -6897, 5453, 3401, -666, 6112, 4076, 3262, -7235, -11436, -12841, -25736, -14902, -4859, -1610, 10328, -342, 13593, 29047, 19173, 860, -6838, -9044, -7767, -9541, -12022, -5439, 2760, 12464, 7842, 2419, -3937, -8994, -9984, -9450, -5380, 2309, 5198, 10889, 11440, -1672, -14130, -15822, -24976, -21888, -21202, -30703, -41169, -35699, -15996, -617, -1749, -9677, -14982, -15517, -10697, -3615, -12140, -18973, -24679, -23634, -39891, -38434, -22691, -3619, -11905, -5471, -2692, 7978, 628, -970, -4048, -3470, 685, -4626, -15429, -19543, -15509, -556, 11957, 9869, -5994, -12769, -5423, -5474, -4554, -9683, -14030, -8675, -16726, -12086, -8944, -20056, -25609, -34662, -41325, -40324, -31426]
8303c1426J684P533J1994J4849J6489L998r927r60j621J0915l236l848O306j9697
8289C053p315R702o705j5526N521M674J479K0790l252p662k873k732n083N73q533
8274a3889K947N032J3367L575r846K574j512L76l41Q057J0438k4121K875J3231
8260A2763j4556j2502N135J0848M551l39l703n596p382N129Q670q5q001q8Q968
8245C812l991j3516j0929J4777Q006K179j472j296M193o841J8973M846r544j5032
8231e835K543q761j0004p610N386M772n24m508J4J438L098n252Q147O687l739
8216a4148R158q009O066J48m817n442O098J4673L381j2797n980M305R397P460
8202I493R874J5789j1514o795j3911k275o651n400M178M483J603N080J2374l967
$$ y = [-31426, -29742, -22209, -10215, 4634, 21123, 25121, 15194, 14234, 12613, 23528, 20292, 16444, 22750, 3053, -4262, 5440, -1265, -16791, -11270, -6596, -5117, 15673, 12421, 4759, 1886, -846, -5929, -5356, -13889, -10942, -5910, 7457, 11032, 1186, 3760, 2248, 2624, 2283, 10340, 20778, -3343, -468, 12763, -1793, -14295, -9160, 1688, 6239, 5900, 2197, -3399, -10781, -5652, 3018, 2933, -5068, -5156, 3812, -179, -13695, -24624, -9847, -1841, 338, -1134, -2430, 1763, -5078, 13895, 18741, 9197, -5835, -3292, -12053, -22057, -29667, -24281, -19509, -20033, -24541, -24527, -23089, -19991, -25243, -17096, -10409, -14148, -4990, -12999, -6933, -6785, -11602, -17044, -10946, 3727, 7108, -5689, -11669, -7364, 2033, 9493, 19367, 35156, 23642, 16847, 2936, 661, -5990, -11390, -7212, -2729, -1126, 3954, 16328, 12361]
8188A2361j2707M40J4969Q392p44l627j0443p333K251Q292k979j1493j3452Q986
8174g087O852q70r372r52P869M561J70J752Q817j4720l639o959r03P023J9438
8159A1980p705q317K849r723j2545p786j105J5539J9544L409r097O70n06O891
8145D098J0273O634j3252P12O906p450m613k728L400j655Q178j6951j3042l96
8131a9886J1097J3306q728O303O555J405L237j512j5208j0842j0146j7951M797
8118c7573R448N32R227M699O620M147p618k894j2761O18N614j654P452J5766L379
8103E002L096M916N538r669k2041j1881R753Q97J1884j956m739J2780J7963q070
8089A3473j3990j135l162j0004O241l643J0182J2347k641k300M261n828L677L419
$$ y = [12361, -346, 94, 15063, 23455, 22711, 19084, 8641, 1308, 3559, 11851, 8872, -2621, -16073, -7087, -235, -1105, -10477, -11429, -3560, 1001, 1171, 2923, 11740, -2980, -6619, -13578, -14481, -7458, 11980, 4275, -4042, -1193, -10916, -23461, -31247, -32352, -16813, 2731, 6140, -2957, -2287, -2793, 4098, 14371, 21005, 7753, 8465, 15371, 7921, 3308, 580, 3980, 2325, 10503, -6448, -19490, -19886, -8789, 4517, -4211, 2092, 8647, 10052, 13289, 11777, -3431, -14273, -24419, -42370, -37573, -28125, -27593, -18366, -13667, -7047, -2900, -10518, -13412, -26173, -25555, -19941, -21595, -14143, 1623, 5002, 8098, 13014, 18552, 8883, -13158, -25039, -15286, -14389, -2505, -4461, -9200, 3580, 21543, 13473, -517, -1652, -4814, -14818, -8577, -12220, -2038, 10309, 7668, 5368, 9629, 3801, 7478, 10897]
8075A0897j129p996K752J826J4749N91j3303p473j6454k114P20M232P604j4740
8061a9838j2389J9249K3480J6548K541P23q118j5363r845p301j2036P842J0483
8048d024O641o14j2270J24j238l003N493J919l925N645m180Q957R330p857p74
8033B24L760L977j2063n030l907m023j0320l921J544J0924J8903K154n013k845
8019e636K453L942J3831P550o888j2863j1805j6606l768Q183K615J2867O414o564
8005f275R736J2733m089j0864J0719P807n026n370o408l500j2002o626P242J8181
7991F258l02o797l455J2560o18R988o03J700j6861l543L94r28o851j3593J3698
7976h953J3438k843n665O314j859q877Q698R511o22P248Q58q710Q84m852j1995
$$ y = [10897, 9768, 1772, 4524, 6350, 21099, 21690, 8387, 914, -15540, -17654, -16934, -12702, -5098, -19838, -32227, -12978, 10502, 27050, 29591, 30314, 22196, 6833, -3012, -10313, -22349, -14507, -4024, 2617, 2003, -10267, -10143, -11381, -14384, -8891, -6972, -10897, -5252, -9432, -475, 8855, 998, 224, 3984, 7961, -4102, -9132, -13039, -17062, -27382, -31303, -29759, -18835, 68, 2222, -2791, -5636, -3183, 759, 14590, 22140, 15252, 2389, -9416, -26022, -29790, -21607, -18992, -6125, 289, -6275, 3461, 16194, 12105, 1241, 11960, 19767, 14741, 9371, 2963, -537, -12539, -19165, -11923, 6258, 5956, -841, -4296, 8264, 7646, 17634, 17031, 18731, 1870, -1673, -1279, -2207, -9058, -22651, -8953, 4485, 1642, -4023, 2291, 432, -8445, 253, 9764, 9142, 16390, 17248, 8538, 9422, 4570, -7425]
7961g425M572J4244N603n445p118j1238J3921Q100M786J2743m353j9433n748J2239
7947A5448M749K89j1384n220J336j4539n383n83M495p354J2430p450n109R820
7933h455Q646K86l043R99O508M589m127j69K797j1631m653P578O311Q40J467K092
7917A0035N755N883L788k487j6154q015Q430N891j344O7J265M990P607M481K694
7902C2886p206P58o619q863L063p748o141j2638o844J3647J8113j20k920K004
7888A1372j431K050R958N253K17J563j9782k1908l838J0840J0066M554r465O909
7874F358pj0320J1290m23p0L893J0197N551K961p80J424R252j8009j7281P833
7859A1869R857l13m878M456L212L73j4403k608N522j6576j4158Q749P657j500
$$ y = [-7425, -2853, 11391, 16994, 11549, 4431, -6807, 7114, 15214, 20000, 32743, 28390, 8957, 3209, 15448, 20197, 20486, 9102, 3882, 5218, -9321, -14704, -15287, -10792, -18146, -5716, -13166, -18275, -8455, 191, 477, -2566, -1567, 4941, 9530, 5403, 5234, 8031, -3600, -8253, -675, 5636, 6476, 7943, 10035, 15790, 21673, 25461, 22974, 6820, -1195, 7235, 13126, 11782, 11849, 13114, 18104, 25711, 30192, 32886, 25680, 26438, 19819, 10956, 14019, 6271, 130, -12508, -19352, -5705, 12408, 12288, 9368, 11372, 9941, 11991, 21949, 27202, 27419, 28982, 9200, -12708, -16546, -5706, 4360, 8914, -551, 6358, 6351, -3969, 7321, 6898, 6828, 10721, 20918, 26469, 29430, 28650, 30074, 39326, 21317, 4036, 11869, 21726, 21413, 16535, 20991, 24203, 24576, 10173, 7565, 13087, -3489, -17647, -8898, -1241, -2741]
7845b741j738R822j2170o989r913O077K923n218Q773p64M371R65j110L311J0748
7830F347J0600L25r113n87l10K4j5219N603J4940p60r828q677R060r89L062J1456
7814A5934J0300J385m960j5067p0l399p388O199L214k1687O593K0064Q395j1169
7800H344r234M682l445P843J0274r410j5496p787O933Q847J9207k183M321m599
7786A8297j2165p450q623j2234j3686J0987K731j607J5552N520j1361j579O880
7773h738M208j4456k45P854J2138J525L533J2584K139J864j5477m470N698o265
7759A892k3541j552M284K179K935N493j3092j0789J0526O833O218J332J9007N694
7745A7419j2872n822r281n783Q010J9116M173m017j1802p430k2421R657K3447
$$ y = [-2741, -4479, 5343, -6827, -13816, -23729, -17652, -14729, -19947, -11174, -11938, -7567, -6602, -7712, -4401, 6347, 16947, 17272, 8159, 7572, 7262, 7286, -7933, -2330, 12610, 11850, 2022, -6655, 2405, 1416, 4478, 15934, 26234, 27619, 22659, 7592, 7522, 4123, -3265, 2934, 6148, -15539, -8946, 11118, 19513, 8344, -890, 3792, 347, 8190, 18464, 9054, -6442, -14229, -7296, 1551, 20758, 18575, 22896, 18297, 6132, -1318, -9941, -22175, -35861, -24874, -22143, -23750, -8198, -2678, -14039, -15618, -8738, -4530, -18986, -19231, -11377, 761, 2286, 5819, 18403, 20542, 22406, 6929, 2459, 8157, 1892, -21649, -23201, -18917, -16738, -13803, -8310, -21402, -32191, -21665, -14832, -8614, -7282, 11725, 17419, 4547, -1275, -10556, -16339, -8329, 10787, 14960, 10943, -859, -8289, -30710, -21053, 2394]
7732B394j2976j1986M783l156m474N75l81o240J3874J7470K502N663q815k442
7718c209M542K848j092M397l3J1702O800j2537j0912r601O213L545p370k463J3096
7703E926N038j8185m026l279J848L934q538l272n116J5J1425L185M270j964k6979
7688c5718R863J2310J0686R227P121j0896k061k813Q966m563L317R773J0392n547
7674B0057j0258j071M759k1127j1034J0676N115O268J407j0139j2834j2323P526
7661b2978N128r801Q176N122Q75J44L672M598p511N36J4019N5J3746Q645M021
7646B8447n669k1705M504O072o288j1652J0400M703j1560K592n591o421K882J2388
7632C102K4987K69j3423j6380L948R106k8j1010M580N083j0914l735R879N506
$$ y = [2394, -10582, -22568, -17785, -20941, -25415, -24840, -25221, -31461, -17587, -117, 2385, 8048, -767, -3209, 1333, 4181, 3089, 7486, 7453, 19155, 25955, 13418, 2506, -7095, -882, 2663, -4707, -7170, 5926, 10964, -7221, -11247, -14526, -12678, -8744, -17282, -20554, -25670, -25655, -14230, -11045, -6775, -8739, -35718, -25855, -13545, -2859, 6368, 13489, 2593, 532, -2281, 6685, 2122, 5439, 15212, 25604, 20057, 9799, 8728, 13487, -7640, -18674, -7998, -2883, 3385, 4792, -5347, -18181, -30504, -22978, -17850, -27651, -19475, -14353, -13478, -13334, -9662, -5064, -12575, -12039, 1980, 2035, 15781, 24426, 28447, 22778, 1073, 5577, 11649, 5361, -6291, 4109, 8812, -2748, -156, -5747, -12168, -9286, 3102, 28089, 28358, 14935, -1445, 2503, 11609, 11581, 571, 5151, 10234, -680, -4415, 5464, 10970]
7618A0970q441J091j327j3369j984L485K005J6160k679o164N89K795j129j8259
7604a6257m698R945P927J1881J4483l926j3399l150n798j3407N830N805J2484
7591G720R249o353P659J1298L430j6525j6375j8243k892J0358J1487O459m564
7578B708k6571p142J3732k74K996o03j86J6978P121j4364j3637r131P874L138
7564a7361N068K1q008Q598J3218O217j827j8199j5572p57M621J1991M587J8951
7550A1548J0186n252j8662m496Q984n796j091j2174L52L849J2803p353m419m427
7536a5948q152n117J1563P106K19o630p183N089K93P080k132k3658m928J3425
7522b8973J826l55M060K602J146O572J7421j931q25j6697L433O999J1722L399
$$ y = [10970, 2529, 3620, 2293, -11076, -13060, -9575, -7570, 8590, 5911, -253, 336, 3131, 2002, -16257, -20955, -11010, -3083, 8798, 23281, 19355, 5956, 2806, -2992, -16399, -10569, -4764, 7720, 16969, 10616, 18275, 29573, 33003, 16478, 103, -18140, -21032, -10674, 813, 7272, 2708, -23863, -31005, -17273, -17547, -14551, -15154, -15340, 1638, 8759, -5605, -19242, -28373, -20499, -17361, -12293, -12272, -20280, -11682, 1536, 7753, 5926, -12273, -27845, -28602, -23981, -11990, -7403, 11548, 21734, 16482, -2180, -6676, 2308, -3488, -4579, -16753, -16401, -12552, 251, -7102, -11521, -15948, -24100, -29217, -17654, -10548, -10329, -16959, -24142, -19053, -18760, -11680, -13812, -37470, -42398, -28973, -27147, -27502, -23442, -20840, -19694, -13122, 4299, 2368, 1543, -15154, -11721, -4722, 7000, 10399]
7508A0399q562j7689j0869P912K0511k319j0975o856R196N76P47N708r279l788
7494a5288J479Q897j542L354m681j1231J1043J7540J3231q440q183j9845n098
7481a8764R830J0538n19K21J1421j0367l847j188j5431m813K530J7769J1220J161
7467I761j645k556n975L798Q189j0284r886N025J5231o749o919q546r41O004K084
7452c409M300M392o336q504J0215J0507j0483j9532L863J1697J7402l33j4385
7439f06O667J762j2964p973l956j148O286J2092R357l276j1948m406P19L290k0507
7424b6611j2137J4841j1562k394J9771R272O503L549j8377o855J1956o851k83
7411a9178j276j178P877M437j5473J5008J7095m281m861l142j2843R181J0937
$$ y = [10399, 1837, -15852, -26721, -18809, 1702, -617, -11592, -18448, -9252, -8676, -7929, -2221, -11500, -15288, -13809, -4912, -6454, -3100, -7781, -19012, -7969, 9571, 22802, 14362, 6179, -13666, -18764, -8934, 1604, 1085, 1306, 12727, 2360, -1487, -2675, -18106, -22919, -20389, -2620, 8600, 9761, 8116, 5560, -415, 3383, 11572, 1288, -8598, -3573, 11658, 4909, -2010, -10556, -11497, -5493, -3409, 891, 5283, -1053, -9557, 658, 11165, 682, -18850, -14987, -3290, 14112, 13779, -606, 6061, 7823, -5141, -13114, -17070, -18218, -11932, 160, 9517, 6241, -5707, -10113, -9394, -6104, -26611, -38748, -23907, -35469, -37863, -18092, -8820, -2317, 1232, -17145, -24000, -12044, -18895, -19178, -20454, -21632, -13755, -9318, -24791, -9783, 7312, 3031, -1830, -4972, -17815, -8634, 2303]
7398B303J823k827m834o075p51m17J8305J1335n840j8816j2043j3857r037o04
7384d1335j19J8699J4218K199R301q014l333o704p5J3791q652m089k680J397l425
7369a8821P361L1653L142j3086k3612r741o689N41O454J2057K0104q701M211K235
7355G108n119q572j0569P967J1339l168J0654L10j395j3096O78o013p514j885
7341a9275N408N042J8045J2171L977j9290k5093M264Q498j1167j418k640L622
7328a7856J5875J6242L428p207j1497o049k44J0679K102j3331K468N822j61J0635
7314A0906j6811j3205O02j061j1137o351O609K2294J350N255L062M713J0410O834
7300B3470o212j704p771j0311Q385P569O49k268K32m230p334j321k722o502R38
$$ y = [2303, 4126, 1299, -3535, -9610, -10361, -10778, 7527, 18862, 13022, -5794, -17837, -31694, -40731, -41335, -41454, -22755, -8537, -6338, 2963, -5051, -8384, -15088, -15163, -1372, -10024, -14113, -16793, -15396, -18821, -11460, 20193, 23335, 10249, -13363, -23104, -29793, -29252, -22798, -10741, 9363, 662, 4873, 7108, 1989, -6583, -17152, -9185, 2154, -1014, 9640, 9950, 8555, -4541, -3863, -9876, -17390, -19275, -13867, -8825, 9220, 21391, 25368, 6078, -19015, -14751, -6253, -17420, -18838, -21478, -17856, -1981, 14261, 17689, 10482, -1015, -7064, -7308, 3371, 5473, -7858, -5390, 432, 271, 10906, -5905, -19110, -18508, -19569, -30706, -37057, -30448, -8154, -6804, -1549, 1513, 6226, 16636, 23470, 17258, 15554, 7783, -2528, 5857, 13426, 14075, 11807, 12039, 7809, 475, -846, -3568, -10070, -9132]
7285i132M879M722j4354M621K4170J099l663P692j0764q11O840K830j2328r904
7271d103J4715j969j1434o076Q811l061J9039P115j1257r65L23l697M258Q037
7257A9736O07q766l102L129r201j560K075N392J1691M108m396k271k920R668L153
7242B7343o967Q391O242j5745j6942p270o006j898L259J6031l627j1647J950J5690
7228H804l343j2727j600K875l211j3310L155J0108M0q910K366N392j3815j754
7214b5930q34K6572J1273j3961j5875N148k019m693R753J0111k135M620j4937
7201a2907j510M634K611J6049p481j1204J3036M112J837O038K66j8742j2842P126
7187h977O477j337M909j0552j4281M358n139n724J0607Q405N020K554N241q157
$$ y = [-9132, -4253, 469, -13885, -9264, 14906, 16005, 12342, 20034, 9270, 8459, 15299, 18129, 5801, -4103, 10612, 8643, -2791, -8867, -56, -3117, 15922, 23037, 11780, 10815, 11138, 7441, 11699, 19736, 20343, 11577, 8475, 11604, 2403, 843, 2918, 8310, 20001, 24109, 19713, 17442, 14522, 24190, 27343, 20376, 28767, 35009, 19264, 2322, -4948, -10954, -12852, -9593, 6438, 2811, -8836, -6886, 8804, 5461, -7266, -8866, -5991, -9202, -22512, -19357, -9249, -9209, -18119, -15753, -10361, -24176, -25930, -26764, -192, 11081, -2880, -18755, -13607, -15626, -20319, -10566, -455, -2590, 2030, -12907, -14417, -9783, -7172, 8877, 1396, -9808, 3228, 7340, 9177, 15215, 15481, -3261, -16103, -8977, -2500, -3837, 1072, -9480, -23761, -19403, -24542, -30266, -19659, -11254, -6234, -3680, 1561, -6596]
7173f596j0528m940q30O068j79j7541o77L852J7968O414p483P685J3044J0151
7159A6408m147J853M145n911J565M048n010j4031p24P744o229q825m894K217q204
7144a9995M018P251N611P355J653j4876m144O05l211J864J387O533j3487m610
7130b4046J0673O991N098j960L345j996j7063j3161J0902J5997J3874N934k964
7117A1624o491Q096K336J12m765j1409N209J3560k469l936J264q163j0281J0967
7103E654j2961r744J8886r426q513J4178J6629l640k919K476n342K36K937Q066
7089A6517j636K324l017j977k7762j3008J8790K1876J739k3409n256P689P106
7076b4J2019N081j5798j347K0107q50l8594j8978j157J1348L0336j3733l153m642
$$ y = [-6596, -17124, -22064, -22894, -16826, -17005, -34546, -35223, -31371, -13403, -6989, -14472, -6787, 6257, 16408, 12261, 14114, 18259, 12348, 13913, 17961, 12951, -1080, -1804, 5940, -289, -9114, -14008, -11791, -19995, -15977, -8726, -3115, 4240, 5893, -8983, -13127, -12522, -15733, -13869, -12482, -5949, -19436, -24046, -13373, -6382, -1284, -3244, 101, -1895, -18958, -32119, -21217, -5220, 8654, 14588, 11624, 5133, 13229, 15565, 15677, 10912, -497, 4712, 18272, 15803, 11867, 13131, 4968, -5313, 5654, -7307, -17051, 1835, -7591, -16104, -1926, 14703, 11063, 8144, 10620, 5278, 5514, 8451, 16517, 14881, 17205, 14188, 12211, -15551, -28559, -9769, 12107, 13846, -9563, -14819, -7130, -24, 11995, 17076, 1278, -69, 20038, 19188, -19406, -38384, -39541, -28193, 2143, -11590, -14743, -19385]
7062a9385k612J3464K828J051n54j7539j92P545Q775N519J0455j460k3417j3102
7048b8624p380Q91Q723Q373N654Q160J6333K096j6060J1481M010j2991q026J982
7034e378j5416M573K612J1673J5410j108j0043j8877r906J5341J545L089r61L062
7020d384J119J2273m361j9370K588J8244N288R74j2260j5124L903J8141J4583
7007B1614l451j2926k1112j4392j650O091P731J7578J536q562Kj1360J1468M511
6993b922J1973Q506L977N925k058k0722J862J3272j2067j4561j1018l706K240
6980a9299p967N773Q718N933J468K223Q133k105q506R757n784K656J3330l282
6966A1048j7385p078J4861r96K731p521O30K06R506J1279J7966q388k8398k361
$$ y = [-19385, -21997, -8533, -5705, -4654, -5208, -22747, -22939, -15394, -6619, -1100, 9355, 7895, -15522, -28624, -36004, -35113, -26390, -18017, -12363, -4203, 12130, 14226, -1834, 9647, 13657, 666, -7360, -5378, -20794, -16221, -13609, -1936, 13474, 12366, 2323, -16554, -26460, -11119, -9574, -6485, -7446, -4384, -3265, 9008, 4647, -14723, -12135, 6109, 11397, 12371, 111, -15013, -11110, 7031, 21614, 18163, 5237, -15875, -30267, -31917, -25826, -18095, -517, 1019, -7543, -7541, -18901, -7433, -2922, 9051, 17557, 21534, 27459, 25401, 4679, 6541, 19813, 7746, -6815, -17833, -21539, -19299, -27266, -21493, -12775, -6842, -5374, -3151, 4982, 2877, -5629, 4128, -1656, 1000, 14330, 11048, -6337, -13415, 1446, 450, 3181, -4340, -3710, -3504, 6002, 17281, 35247, 26859, -1539, -3900]
6952c900Q53R900R746j8146k7692k1514L791J5384J9139J9869M222p831J1295
6939A5116l579M301l307r79m892j484O383J671j0036p54K995j366J0335m62n152
6924H790P812p092j0856j0143M534q96p5O860q940k2697j1599J3465O088o098
6910c0847J2439L072j6277J65K4907J0419o816r243k11O275p802j5552J6433K705
6896a0333q083n180r837Q562Q364J280J7498J3835r798O737P688n293l644j6865
6882e069p993J226L523N209J9001N796j3971j5282j1556n522O879K495j0891P520
6868a8635J4429m871n96q43n091J7572L587J5633Q967l337j0663q799p232n819
6854e698J533O171J0064j0483j3487l172j477J4497J3783j2451m168J0196J2590
$$ y = [-3900, -3047, 6853, 16599, -1547, -29239, -50753, -46962, -31578, -12439, 7430, 11652, 3821, 15116, 11537, 15838, 12531, 11552, 6660, 5176, 11559, 13230, 3194, 2440, 5435, 4069, 14404, 13942, 8790, 16602, 9510, -1346, -11489, -6955, -7851, -7926, -1066, -10006, -32703, -44302, -30837, -24749, -30847, -18408, -15336, -31613, -31448, -6541, 3878, -2938, -12181, -12392, -6117, -13919, -29471, -13038, -10333, -18416, -23596, -33433, -24871, -16507, -15227, 2271, 16106, 6308, 13045, 20733, 15440, 11796, -5069, -13062, -11836, -8313, -3104, 15897, 21693, 7722, -7560, -19116, -24638, -17759, -15264, -26155, -18635, -4206, -9077, -9673, -10516, -15607, 1965, 5552, 21185, 30152, 26815, 16152, 7353, 121, -5698, -4165, 2006, 12070, 1587, -11900, -15072, -16549, -2052, 11731, -720, -4888, 5308, 17898]
6841A7898K580j7280m478J014o077j02K475p883k87K592M422K752j0348n212K6836
6826H902J4607k341j9656N602J097j829N895j67P777k907o98j7156m300P872J3859
6811A6557j787J421r66n600j015J1772M775q278n203K5j0689j25N581M733j0147
6796A054O546m294J25J4575J101m639k662j2239j1096q851O319L066o1J1499J1105
6781A1548n265J2337J371j9807m353N074l973O594P065J407q528o409j1470j4518
6767b8927m580j2599r466Q023J7422J0636m0J3776K6879r897j793O652j0303j7438
6753a1655q771P343Q079q308O663M836j946P148J0180j9791L273l536l87N817
6739a055M824m586R828j55q536p942k0160j428Q290K1522J6803M531J42K951M846
$$ y = [17898, 20478, 3198, -1280, -266, -6343, -6445, -3970, -11853, -12140, -9548, -5126, -2374, -12722, -17934, 8902, 23509, 21168, 1512, 7114, 8211, 6382, 12277, 12110, 19887, 16980, 16282, -874, -5174, 2698, 16557, 14770, 16191, 15225, 9625, 8610, 20382, 25157, 16879, 11676, 11701, 1012, 887, 6468, 11201, 1054, 7600, 3306, 3431, 18006, 19107, 14468, 11806, -433, -11529, -20380, -14061, -10995, -11056, 443, 11548, 6283, 18620, 19991, 184, -4169, 905, -3068, 3526, 10591, 11998, 3470, -2939, -14409, -28927, -33507, -46106, -55572, -47549, -30127, -19491, -19531, -5755, 21124, 11227, 9434, 16086, 5783, -11655, -20426, -13083, -5004, -13312, -6649, -1813, -3759, 3389, 13569, -6222, -2949, -6485, -6872, -1055, 3769, -817, 9011, 8856, 320, -7622, -27782, -29210, -20920, 602, 17405, 21936, 22078, 25029, 29875]
6724B9875K764M789J3367k731J5197j8719j1504j4077j5413K819l489K636O513
6711A2027m380q978M024P06n622J0807J3760J403p246k822N255k732l136j758
6697A1308j4431q055m20l110j0886q19M376p183k5O462J061o291M939J1956J2904
6682A786R669o799j4858j1282m761Q858J4515P335o49M030k921j1181k0871K709
6668b4420Q342N351O832O014l744o893J4185m875o110l065P827Q434q489j0784
6654a1395R626K403L368J2986j305k679L253j2691k55k230L392m21j0907j0248
6640a7103J39N692k747r346R72N584K479Q621Q088k886j529k914K884O119r895
6625e842j6859j312J5735J4946k576p189J084L457J6417J3140k1395k2969m398
$$ y = [29875, 32639, 37428, 50795, 48064, 63261, 44542, 33038, 18961, 3548, 6367, 2878, 5514, 12027, 7647, -1331, 2693, 3399, -2223, 8584, 22344, 23747, 16501, 13679, 18934, 16202, 13066, 11308, -3123, -11178, -11598, -14708, -25594, -26413, -22037, -29220, -29245, -22783, -21722, -28013, -23074, -11118, 1786, 11455, 4656, -10202, -21484, -26245, -17387, -2872, 4463, 3814, 7844, 4923, -6258, -27129, -24420, -16078, -10727, -3895, 2119, -1625, -8518, 5667, 792, -5318, -8383, -556, 7878, -611, -11395, -1769, 634, 4002, 16988, 15683, 13004, 16257, 3566, 3311, 1081, 4473, 4052, -6855, -17103, -16964, -11272, -14019, -23365, -22393, -16809, -14330, -5709, 2379, -507, -2036, -4950, -2066, 4053, -5842, -22701, -24013, -8278, 6668, 4092, -3097, -2013, 1444, 17861, 31001, 9606, -13363, -17761]
6612a7761j49O716O444L165p164p241n800j0524P992l45j076N496N881l670J1118
6597f918Q122M381o388J3710K072m928j3237N331Q792q216M068O653n625j3325
6583e508p757M102L428M687P748m928r577r40K09j1033L615Q513P256N728J412
6568F955j3493n92J6030P550r025j658O28p900j4962K579R501R184M049j8132
6554i286k708J1279O074j8479j0354L03J5414J5214M755j8155j2042j1912k3674
6541e3571m786J4303J4071q56R315J6781N160M481m786j7958J6189k185j0968
6528a4810k287N026J1834j0731j1900j4773k982l61J2595J4364j401n544J6493
6515d477J4137r740j0673Q20L677K356m431N341k910j8482q405Q893N846J6576
$$ y = [-17761, -17910, -11194, -4750, -1585, -8749, -15990, -21790, -32314, -24322, -24667, -25743, -20247, -14366, -18036, -6918, 1204, 5585, -803, 12907, 14979, 10051, -3186, 2145, 10937, 2721, 6789, 13442, 7817, -5508, -13265, -9163, -5735, -1048, 6700, 1772, -7805, -8745, -8536, -19569, -15954, -7441, -185, 5543, 6955, -6538, -7130, 8900, 16450, 7425, 5767, 6395, -1505, -16467, -13888, -4387, 4797, 8846, -9286, -11994, -715, 5359, -13120, -23474, -23171, -7757, 7457, 12212, -5943, -17985, -29897, -53571, -58357, -44054, -29983, -30839, -21524, -4743, 417, 4898, 112, -17846, -1657, -3842, -14810, -17097, -12071, -237, -10968, -22868, -37641, -40623, -40984, -28389, -14025, -15426, -20970, -4477, 9660, -80, -10753, -9933, -6256, -3900, -8331, -2990, -5900, -24382, -32787, -23894, -18048, -1472]
6501a472N802J0246j995q612r998q00J7986J1536q23p095q331J4217j25p340J4332
6486B7528r039j0492o011J698O717J3330m152j2576j4543m44M987J3194n68o867
6472B762j001R583q03k0620j7201J3818K3999J1931N492p562p984Q708j1401j7021
6458g300k673m124k501K0767O456j698j5226n999o386k501Q807j2139p675J2045
6444b0147Q978N341K92O80j954n330j693O308P175L781p750j1403j0710N947P854
6429a2631O603m027o083j3601R260J5756N5J132J6334N3j0912K375J176n803o591
6414f904O196k220j5867J2623J1880j0457l250Q758M296j6124j2609J1395J8022
6401E739q324j4857J828K802j178n678mk726p996P421N886R853J842n967N907
$$ y = [-1472, 4330, 14576, 12581, 3969, -6029, -6829, 11157, 22693, 21870, 14775, 6444, 20661, 20536, 13196, 27528, 18489, 7997, 1986, 3684, 10401, 23731, 19579, 7003, -7540, -7984, -2997, 10197, 9629, 2762, 1761, 11344, 10541, -10079, -27280, -13462, 10537, 22468, 27960, 20398, 12414, 21122, 9721, -7300, -9973, -14097, -16598, 4169, 10625, 8927, -6299, -12298, -18684, -21185, -12378, -24517, -32192, -20147, -11169, -5828, -5536, -4856, -6810, -12140, -13833, -7525, -350, 3431, -4319, -15722, -26432, -20485, -12631, -6028, -10055, -16138, -29739, -20479, -4723, -4668, -3536, 12798, 12851, 1939, 4314, 5490, -313, -6904, -708, -2928, -18795, -6172, 5708, -4749, -7999, 759, 5055, -11069, -23678, -12283, 5739, -2585, -17442, -15614, -12812, -13990, -19668, -19672, -22398, -30394, -22973, -17087, -7234, -5392, -11359, -5452]
6386e452J4084o69k2313J976n091O366J2669k941M799O423j1405n186J2807J129
6372G196q340m273m450r369O070J6475J3818p529j5253j897L078J6627M631k026
6358A4758j671Q372P784Q240o039j5575l48r017L295N803j192o695q784k4151
6344b5220j5925j448J9962K0831O526K117j3770L728K8775m451o706k641q913
6331B865m771m098J1559m517L549m334j5308l389j4989J0005R147J4454L272m64
6317B981Q65n225m41J0543R691N842m103n42j1007r99M226J896p220Q928M520
6302A9955N479Q529o048j6275K090J137j6442L956J0901j5907q531k326j471k193
6288a7146j140J3983p806r774n756J0731N383L487N398O775J536o214j1324J4093
$$ y = [-5452, 8632, 7963, -14350, -12374, -17465, -11099, 1570, -1371, 3428, 9851, -1554, -6740, 6067, 7196, -1144, -5417, -9867, -19236, -13166, 3309, 17127, 9598, -5655, -7552, -4474, 12153, 16784, 14758, 13087, 21459, 29243, 37483, 31444, 15869, 15521, 6504, 9799, 15602, 14410, 7715, -1069, -25220, -41145, -42593, -22631, -1800, 4726, 6843, -6927, -3199, 25576, 21125, 14419, 11778, 2865, -1906, -6004, 5555, 1038, 4587, 253, -15055, -18444, -33433, -23428, -14281, 173, 3445, 2981, 3846, -1379, -1820, 8723, 18414, 24256, 20153, 19611, 8604, 7605, 11831, 13727, 6507, 15435, 19955, 25434, 33963, 27915, 11640, 13730, 14867, -1575, 2381, 13282, -2625, -11156, -13482, -14953, -17146, -18286, -4303, -12109, -21883, -27639, -16908, -11525, -8038, -2640, 4135, 5671, -543, -11867, 2226]
6274B226m664N73M347p670l71K561n056L273J10Q050L745l04N509N763M178m938
6258A7332k485k175j875j601n713m332J0683J0549p011m053R79J7541p275k9322
6244h758q811o788N818K5354J6944j2366j1289K062o286L696M013L924l455J121
6230E179j3510j0696j5135J8452Q93o795J6198J4630K640j4862j0813o939M044
6217a6714N806J0713M164P661K798K90q652o956j0149o152n354J2830K3208k914
6203A0579k1151J0416M606J911j3596j0365j2951L390P467K49O079L940p470J2059
6189d837J0989q405M912Q113M96j1983M657J2734n443j1567O072L857j6P624j641
6174A5562j8460j7720J443n553J397l304L077J1612J1940M794j878p579q562O92
$$ y = [2226, -2438, -1865, 2482, -5188, -5559, -2998, -8054, -4781, -4671, 3379, 7124, 6820, 12329, 18092, 22270, 17332, 14847, 12672, 10797, 9196, 3483, -849, 9834, 20383, 13372, 9319, 10298, 27839, 20564, -8758, -17569, -24357, -18539, 6815, 23759, 11393, 104, 2166, -4120, -424, 3589, 7513, 4058, 5179, -8331, -19027, -34162, -15710, -14817, -21612, -5414, 9216, 11856, -3006, -13819, -20758, -16714, -10908, -195, 3969, 11630, 14428, 14718, 6066, -890, -11039, -17191, -22545, -9715, 13493, 10579, -10572, -156, 4450, 6361, -7235, -17600, -30551, -27161, -19694, -19445, -13366, -9426, -16896, -4837, 6152, -2253, 2659, 10772, 11268, -715, 3942, 16676, 11233, -334, 5738, 9595, 9579, 17203, 15562, -2898, -20618, -19175, -24728, -23331, -26635, -23558, -11946, -6, 4788, 2910, -4669, -13231, -12539]
6160a2539O756J26J679l309k711M871J0279R5j554k219j0103r058n030j2795p469
6145d2981J1621N417l495J048O767K6884J939J0140k551l522O995O562j3189p625
6131D010n57j4651k1821j2833M949P666P553O44K667K504k951o436P674K334m942
6116b4190O031k67O665m913p508L987O824j0916j572J0050O963K070l514Q566
6102a724J3159R080K367p642M496o22j6861J403R329L189l895L293r03M459j9012
6087A16j1754M289O120J639K922J2437n72J5704N861r250j1141j3413q060Q57
6073d245m152m339j0404M723m788R76J346n788l470l817K2476K2589J2966r477
6059A4596j4890j490J945J9028J7472j1972r585k426M744p508j4936q6J6797K134
$$ y = [-12539, -5783, -5657, -3978, -7287, -9998, -5127, 5152, 5247, 3693, 1474, -8629, -17687, -22717, -35512, -42981, -31360, -25943, -29438, -28390, -21623, 5261, 7200, 17340, 14789, 11267, 18262, 24824, 11635, 4010, 3453, -11198, -33019, -45852, -40903, -33237, -25684, -25040, -22373, -19869, -22820, -29256, -21582, -19248, -24190, -18159, -18426, -11761, -16674, -24182, -20195, -13371, -24287, -25859, -15809, -8846, -6776, -10290, -1724, 11435, 20515, 22882, 15240, 19736, 19114, 2253, 3656, 12985, 16174, 12279, 15572, 14669, 19128, 116, -11638, -7349, -1229, 410, 3332, 15769, 15197, 30901, 36762, 27512, 16371, 2958, -5102, -4245, -8397, -12736, -23140, -18417, -23205, -22229, -20883, -26671, -30141, -33958, -11482, 11107, 24073, 14596, -294, -1784, 161, 19189, 36661, 24689, 15104, 12678, 17422, 9914, -5022, -5108, 11689, 13823]
6045A3823j7168m880r438J233P376N081j8597j1150J6880J8218k50p647o041L828
6031h732P498M14j3279j1004M98Q539J327r967L896q059J1879L133j973Q58r289
6016b4261Q831J5159j2r106j0098N295L302M026j5480K961M399J2337O91q548
6002a0504l530n152r329m549K887l400J2505J027N480J5950k23k558L29J996M813
5987E742M173k463j5584j6515L068M78j6004l161K8725J0665q062j1020o846k926
5973b9730M334O067J7909l672o92K61j5505j4473J6615L362l287J4384j4131J2916
5959e642J2409o78J40j354j524r061j3148M019K585n330j167P1N466J8449N279
5944A0514K155Q03k4020j0793P897O216K320L612Q410M218q107K450j3620Q98
$$ y = [13823, -3345, -8225, -17663, -16430, -9054, -3973, -22570, -33720, -16840, 1378, 1128, -6519, -12560, -8732, -1234, -820, -14099, -25103, -24605, -16066, -14739, -24706, -20810, -28869, -16990, -13857, -15830, -14972, -24261, -15430, -271, -283, -9389, -19487, -14192, -10890, -6864, -22344, -19383, -14984, -2647, -1956, -10504, -14034, -19186, -28515, -33064, -30177, -33577, -21072, -20045, -14565, 1385, 1162, -1396, -1067, 929, 5742, 9915, 7452, -8132, -24647, -21579, -21101, -37105, -40266, -11541, -876, -8938, -19958, -26804, -29730, -25396, -19329, -1420, -5092, -5784, -5523, -21028, -35501, -18886, -15524, -18811, -4427, -18558, -5642, 6767, 6089, 6229, 4875, 3351, -5710, -18858, -14839, -12254, -17584, -18751, -18680, -13214, 5235, 10514, 12669, 13472, -10548, -21341, -13444, -7228, -4908, -1296, 7114, 11332, 3225, 5675, -7945, -7047]
5930g047q980l431J0553kj42j1018p785K700L520k048O72J253l830M28J8633m302
5914a0826K733q145Q38M125J122M763k908r070j4879K33K8548Q786j871P898N467
5899A6814j1141n288k171n5p945m440K596O957N820J8470r21k337J0235m828k395
5884A9371N977j5547j2948O777P316N613R813j5540j9162K03M559Q091R002l893
5870I632m204n724m479J3812j039j5223m041M221j3927j578L332Q106m579K21
5856a5470L008K523k994J1210K293J3163m42O060O929j0623j1523Q760P018n075
5842A4837N252k165j0857M318J2582j4377k2075j5637p418P412J4134K0491R249
5829A5746k462J018j298p347m65j879l82q30m862r642J1691j750K190n677m216
$$ y = [-7047, -16027, -19458, -8905, -8907, -9049, -20067, -27852, -25152, -21632, -23680, -23008, -21755, -25585, -25157, -6524, -10826, -8093, -16238, -15400, -11275, -10153, -5390, -8298, -17368, -32247, -32014, -3466, 5320, 3449, 11347, 16814, 5673, 385, -1786, -1841, -9786, -14226, -11630, -4673, 1147, 19617, 18696, 16359, 26594, 21766, 19371, 25348, 9801, -3147, 3630, 10946, 16559, 26372, 10832, -8330, -8127, -3568, 4523, 13525, 9632, 5428, -296, -4775, 9037, 7998, -7225, -11266, -7045, -20972, -22550, -19218, -11112, -15691, -15470, -12462, -9939, -12933, -1723, 570, 13733, 13291, 19351, 26280, 15657, 4134, 12894, 19912, 14837, 20089, 17924, 7067, 11385, 23967, 9590, -12485, -28122, -35540, -28128, -13994, 6497, 15746, 13284, 14302, 13004, 5657, 5192, 3313, 2931, 2101, -2761, -12403, -712, -2462, -272, -5949, -10165]
5814a0165l214M72j5604j5565Q322j29J521J3254J4082P536p364o701L007J7187
5800F639J5029L099j3596j558o58n885k717N343o053k0745m020k749J986O502
5786a9383L846m88n957J0933K1483j5421n893L061j489j1244o375R902N208P709
5772d108P794j3117r280q002K935J2539J563L993J618j9661o420J2566L178J8526
5758D124R68l806j3364n604l132k913P244J0987J4217l85j2531N369m078J819
5744a085j489J368l693j06J0013k514j3374j8110m654J4592M177J3724R40m586
5730d797j8377o912L974j476J1183m679J7915N336J5586R317k420l886L01j4921
5716F144n842L715K3409j9184j773J9148j0610j2034q201p566O165l814j0724
$$ y = [-10165, -13379, -12907, -28511, -44076, -35754, -35883, -34362, -21108, -7026, 510, -6854, -13555, -10548, 6639, 21668, 24767, 11171, 9613, 8955, 3070, 353, 5696, -357, -21102, -25122, -27871, -25885, -19383, -15537, -16025, -21982, -11049, 10434, -4987, -10880, -7819, -9308, -20552, -26927, -17025, -11817, -4108, 3686, -9431, -18711, -26713, -23778, -11239, -9676, -5683, -4065, -23726, -30146, -17580, -14402, 4124, 5092, 1286, -12078, -17682, -20814, -23727, -16483, -5496, 8721, 8336, -4195, 1174, -2904, -1085, -2574, -1206, -4899, -5005, 5008, 2494, -10880, -28990, -33644, -19052, -14875, -1151, -211, -4797, -23174, -30086, -26112, -27588, -16405, -21084, -3169, 2167, 17753, 27070, 24650, 20764, 21065, 6144, 302, 4017, 27426, 8242, 6469, 25617, 15007, 2973, -5228, -12794, -6629, -10443, -21167]
5703b1167J2212M254j5761J212O288J3833j0912j6637j0802J3235N853J0901O518
5690i73j789r370N837J655O47K554q890M814J3148l343m761K553P893J1076j6348
5675D703j0114O298N882j2930M562M141j812O258m283j4317O087l675Q966J0075
5661I841l587J737k631j2491j0664n483K268K464M248j0123N151L434p736q411
5647c1983j6354K1646K2000Q545j519J0961Jk998M282m270r776j1934J45R591
5633a663M315j0447l757R824o451j9240J1947M855l073M176O46q859J2584O922
5619A779k4694j1383J5117J1279J0956r143p629P570P645Q720J0214J1406m874
5606B6963o369q391K546Q599k010L483n602n982q923k030p750N021O152l599j0638
$$ y = [-21167, -8955, -4701, -20462, -19250, -12962, 871, -10041, -26678, -37480, -24245, -18392, -7491, -973, -2762, -12132, -6295, -4640, -3993, -1439, -10329, -5515, 7633, 4290, -471, 2082, 9975, 21051, 4703, -5411, 887, 6769, -6161, -1599, 2542, 730, 6988, 2705, -11612, -5525, -9200, -234, 9841, 6254, 7991, 5360, -7131, -17795, -23278, -21010, -18546, -14298, -24421, -19270, -15836, -23572, -31983, -48337, -26691, -4691, 3854, 2335, 13296, 13297, 10299, 14581, 10311, 535, -11399, -11254, -1663, 2652, -7795, -11552, -1728, -8179, -27419, -15472, -10617, -13690, -9514, -8868, -17727, -5143, 1779, -22915, -34298, -19181, -7902, 3054, -6089, -13718, -6148, 1497, 10217, 20431, 31837, 26963, 20594, 12203, 14749, 23348, 21338, 24821, 19219, 13237, 4314, 2284, -5466, -445, 5707, 2108, -8530]
5591h530M672k17l266M477L083o165k638m393O448M429k738l087l792J2216J2271
5576A2770j014j0589j4021j596j3084J801J9399J3325L450q663k501q609Q22J1167
5562B657R671m477j4194k16J0427O752j0332r702N472P402l463j3792o876R128
5548a1543J2804J6062R467j7557j1284L445N79l433J0514k867j0151l778J5805
5535H063M306j4045l865j791k125R110k655p859M034N638k734l175M148q958J0600
5520a308k36Q903O190j5871j6961L834j939j398p281K2049j019j3516l643j807
5506b4003O399O587K917J2167m676j3243p594N128Q177Q451O262p65r162l440
5492f795J726o681L761n111p931K314P881j620j1739k272N197L399J0933R085
$$ y = [-8530, -3858, -4075, -7341, -2864, 219, -5946, -8584, -12977, -6529, -2100, -4838, -7925, -11717, 499, 12770, 11756, 1167, -12854, -14450, -27534, -25733, -6334, 6991, 10441, 1778, -723, -9332, -8510, 2657, 12328, 7851, -6343, -6559, 3868, 10620, 288, -9414, -3942, 3460, -3, -13795, -20671, -11543, 1261, 17323, 26790, 9233, -2051, 1394, 1973, -1460, 9054, 6187, -3964, -7742, 8063, 12369, -1676, -5541, -7332, -9457, -347, -3002, -10861, -6827, -1189, -3923, -7098, -2950, -11908, -1308, -1544, 7359, 13549, -2322, -19283, -15449, -17388, -18786, -26067, -4018, -5037, -18553, -22196, -24003, -17604, -11017, -8100, 4067, -609, -13852, -21446, -16318, -8141, 310, 6572, 5807, -3355, -6795, -5069, -11750, -7989, -13100, -21031, -18717, -10836, -12456, -24195, -26467, -21270, -17871, -6938, 2147]
5478B147j4584j1788J836j5755r859K2733P623O313l978q011M838N310J0202j015
5464c988k276R495k365l242q605J2876Q866J2960n693M1J0056j344k202L714L974
5449C2267l814j7322q930j4014q76R371J5341p251k2069j3757N263J0147o67k557
5435a8868J6021N595o985o731J123J6408k27l405M620j966j0664p331J404k024
5421a3030K772N538P052P26M570q920o011J798P812K806P134M142P646j877M377
5406B6535m456n266K83n832l629M347j333Q152l951j5808o719R273l233n797J152
5391f282k155J3855K0701p960j0931p893L042n119N83K668J225J4113r15r922
5377E010P318J08l33K525n176q112L817j2045j3137k205N793l162L621L866m590
$$ y = [2147, -12437, -24225, -22389, -38144, -48003, -25270, -17647, -11334, -15312, -23323, -18485, -13175, -2973, -3988, -6264, 3231, 866, -2376, -10981, 1895, 10761, 23721, 18028, 18069, 28125, 26781, 24579, 28293, 32267, 28453, 11131, 2201, -11813, -12689, -3318, 12023, 4772, -17297, -31054, -25791, -15644, -16311, -18868, -2847, 2748, -4237, -10968, -9845, 6563, 6336, 2931, 7551, 5585, -5079, -12410, -11006, -13030, -10258, -4720, 2332, 3058, 7628, -1292, -7303, -5505, 2307, 5113, 12247, 16389, 24035, 22158, 26535, 22079, 16813, 17096, 11264, 7635, 11982, 10649, 18801, 14850, -958, -7677, 1596, -1637, -7434, -6282, -8437, 5418, 26119, 18159, 7228, -665, 2377, -2742, -2159, 509, 1734, 15847, 14932, 5010, 12328, 12436, 12103, 14628, 9452, 1340, 5157, -6888, -20025, -22230, -16437, -19599, -15978, -12112, -16702]
5362a6702O514L601Q129P579q614j2672l9r63k014l430J124M568L236p007m390
5347b1080J207p353N178J2130L977k278j978L835m537j2777q982o47L517K748
5333b7040O751J873m910R81J3998J5467j1039m332J3718L368m781o172j3474J0251
5319e341J5164o180m739k884L818L866k773j451j0154j6920r439J5455L491K309
5305a5778k211R003L851Q124o041o557J281q715r650J1971O902K343o453J504
5291a0426J2016K05n132q915k745J6852J5190l387p246k523j160M261o381o843
5277f234j3755Q089Q614L400J723L696j0100J2385L886j6559n713P552J9306m045
5263A2245r882N271N138m751m871L866K388m690j2931J823K781P152j2734q377
$$ y = [-16702, -10188, -6587, 1542, 9121, 507, -12165, -12204, -13167, -15181, -18611, -17487, -12919, -9683, -16690, -21080, -19873, -27226, -22048, -9918, -5941, -8219, -10197, -6362, -10899, -23676, -32658, -33305, -29788, -27040, -20289, -18416, -23326, -22345, -8347, 7120, -3919, -8251, 5467, 8835, 4054, -2118, -15592, -5341, 9823, 3643, -1096, -3980, -162, 3704, 931, -520, -10674, -27594, -37033, -21578, -18087, -15778, -17989, -8986, -5135, 2989, -3052, -9609, -8328, -17043, -26693, -14722, -7820, -5477, -11930, -10426, 1590, 1795, -3337, -12252, -14997, 1855, 17045, 13658, 6412, 3889, 2729, 6990, 609, -6234, -19989, -11900, -3286, 114, 1837, 5533, -4567, 7818, 11704, -4855, -10568, -3016, 16290, 12245, 2363, 7634, 12772, 8021, 3150, 7016, 9404, 4714, -8217, -6394, -3613, 3539, -9195, -17572]
5249a7572O652J7349O699k0738j4515J7739J2372j43r74j145N866P314n60M845
5235B3189k3199n893m880q008l816J540Q644M902k826O612k972m647j0491J153
5221b0692J0831M661j9674n246M062J5775R600j0510o949k961Q984J0891o754
5208g982J94Q168k903K975o254n881N385M849P97j1264l139j2927P924J1942l747
5193a1863Q096n518k366j956J540L62J0699J1926N593j0666O403j2715j8013N179
5179a3299j1580M81J1418l772j680O914J905J318j5056k303m315L237R754K0097
5165C119L161l391j3607K313M865N667p927j1347O402J459K344o178k737P761
5151h096J1204j1289l93P342J2362q422j6864K485J5081l914M871n926q941m394
$$ y = [-17572, -10920, 6429, 13128, -7610, -22125, -4386, 7986, 7843, 6869, 5724, 11590, 18904, 18344, 23189, -10, -5903, -10783, -18791, -22607, -21067, -12423, -7521, -10347, -3735, -6707, -11354, -21845, -20692, -9861, -5200, -24874, -30120, -26058, -10283, -683, -11193, -18142, -21103, -12119, -1228, -7982, -7788, 380, -2523, 452, -5802, -11683, -6298, -1449, -652, -11916, -15055, -27982, -20058, -8116, -11863, -3767, -9285, -11651, -13607, -12067, -11705, -1006, 10920, 16513, 5847, 12250, -465, -18478, -13299, -24879, -24398, -12980, -16752, -18432, -11518, -9613, -8295, -23351, -25654, -29969, -26732, -16978, 3119, 6280, 2889, -10718, -8405, -3540, 2127, -5800, -17147, -10745, -9286, -6942, -13120, -15857, -8096, 3108, -8181, -8574, -1232, 11130, 2708, -14156, -11671, 3410, -504, 4367, -1559, -10500, -14894]
5137a4894o072O830n948P970j749P704j362J4566k617M681K390j5294o848K0n262
5122a5885Q931O863N779Q288J5467p956o619k409q443L3M006L214m383j6368n528
5107a5010J2204J3892M939m904j655K29Q687j0329J434J4494j3852j4743q410
5094a3024j23O292N985j0711J255N095j2652k278q46o068J6162Q347K258j526
5080a834O682m376l275K1955J0581n103m321r426p932J6728n27j484J515j8241
5066I42j1093K497J4922L190L78o105l956N228p439M189L875M543j34L109M8j5770
5050a576k684L741l906j863P552K3055l116k0516k6158O7R925L343R835j3681
5036a5982q275P07Q805J5590m801j0879O277K1412j01j0439o430j6198J5252J0215
$$ y = [-14894, -20966, -14136, -20084, -12114, -13863, -6159, -7521, 7045, 4428, 9109, 11499, -3795, -10643, -10623, -15885, -6954, -91, 5688, 13976, 29443, 21487, 14868, 12459, 4016, 4049, 8055, 11269, 6886, -9482, -15010, -2806, 11086, 16025, 11121, 9466, 9695, 18382, 8053, 9487, 23981, 10129, -4614, -13024, -13147, -6855, -870, -11581, -10326, -5231, -17883, -20161, -21007, -27075, -10913, -2566, -308, -1834, 4848, 472, -2803, 19152, 29733, 24630, 20309, 10883, 2951, 19679, 19152, 17668, 19183, 942, -10151, -7654, 7268, 10458, 10836, 4731, 775, 6003, -1436, 2753, 6628, 11171, 11037, 14146, 14194, -1576, -4260, -519, -4425, -6288, 1264, 24319, 21203, 687, -25471, -25404, -15479, -12136, -2301, -15982, -24257, -23550, -14745, 845, -3956, -14835, -8558, 12854, 12753, 2314, -4116, -20314, -5062, 5153]
5022E153p49M599J0124K283q924j9454j2640M146l307k859J0236P662L126n517
5008f121P760O408J6897L456j1589r867N68R400j0153j3137l834o825j0112J0873
4994a6276Q820J4854P770O211k546P485j1774j1949N13j1829j8198L32q88k344
4980b9819Q274J7036n41n82J142j6751N707j1414l559J2270J0051N541q0J5590
4966A2865K099j2872q794l108n475L349K7904J7101J5440o49q691p098j6202r253
4952F616J288k452k1008q480L761J0188L349l94o291n648O764J0329p187q794
4938a7959q24k780J4955Q101R012j2181K830J3049R458O060J937m713j1559n084
4924A0302k925q56o804K032j6562j752J1789R592k0800j2456J5045O837M232N43
$$ y = [5153, 4404, 9003, 19127, 21410, 12486, -6968, -19608, -15462, -18769, -21628, -11392, -3730, -604, -6121, 1639, 8047, 24944, 28400, 16811, 6944, 7512, 16912, 6759, -6378, -10212, -17037, -27149, -16276, -7456, 7398, 15168, 21379, 18833, 26318, 14544, 2595, 3108, -8721, -26919, -26587, -27475, -29819, -21545, -4509, -5050, -5632, -4490, -21241, -15534, -26948, -30507, -18237, -8186, -2645, -2725, 12865, 14964, 2092, -6702, -9810, -15285, -11936, 15968, 33069, 48509, 47860, 39169, 32071, 15869, 6616, 7904, 5452, -15556, -24036, -20275, -10087, -6738, -7132, -13423, -19071, -12307, -1978, -9165, -17959, -18783, -21563, -6608, 1493, 10505, -1676, 1154, 14203, 23661, 29721, 31658, 26945, 15386, 10302, 7377, 6521, -283, 1749, -14813, -16565, -4776, 4816, -15984, -28440, -13395, -6558, -2326, -1783]
4910a783n266k739m437l003Q178l280K250K567J0114J2003M277m478o435O604
4896A4572j629j7978q653j655K381k2479J0356K4204K7627l5o719o836o36l1n594
4881F895o363n213L843k416L104J4878l303j8616j0563K084J4245l79j3367r370
4867b4541K033N250m914J0768J9673o643m446r028q235M544J5722o82o583N419
4853a663P135r920M665p366k246L752J7l649L961K119p183q775M626Q439j0345
4838a6433P223J8130K308j1034j516o67q995j706J3668r530J4189P341j690j8120
4824f832j0956P731J1722J648n577P655L678o082N656Q157O834j5698q173J765
4810A528O906m092j2251l256l141M789Q237j603j7336o830J2340J3723J4103J5921
$$ y = [-1783, -7049, -9788, -14225, -17228, -9050, -12330, -10080, -7513, 2601, 14604, 18881, 14403, 7968, 14572, 12943, -5035, -13688, -15343, -12962, -35441, -25085, -881, 26746, 26711, 19992, 13156, 12520, 12489, 6895, 532, -4681, -838, -3254, -150, 14728, 11425, -7191, -17754, -15670, -1425, -1804, -15171, -24541, -22508, -17258, -22172, -11404, 8269, 1626, -2820, -11848, -20083, -15539, 183, -499, -7082, -1663, 5472, -4448, 217, -7149, -9395, -5643, -5626, -9275, -5314, -3195, -10378, -19153, -14527, -6088, -16433, -9210, 8920, 11228, 194, -1322, -1989, -10984, -12690, 978, -8552, 5637, 12978, 11288, -6832, -17788, -10057, 1665, 3313, -2264, 5391, 9069, 2987, 8643, 16800, 23634, 7936, -237, 1528, 8434, 4342, -7909, -11165, -14306, -9517, -1280, -2883, -20219, -27049, -14709, -986, 13117, 29038]
4796B9038K625m103r172p567n301Q540J2498O220j999p487J3376j4490l1576j9206
4782b8604j5267J0399j557N589J4278o73O473L042o67m137J4304J4434K747j4155
4768F206q359l191J503N547j1618l153j2080P686J4513L414j0213o645r39J0826
4754f503L301j0886J829K664j4062J30J0544o737o379P271N441k271L699R466
4740b493R861k511K699M461j17r880j5101o6Q904J2672q6p53J379j4626j547L773
4724c431Q441k78j6547R87J1405p101J3120J1285J517k960Q24j1911j9590N977
4710h262J322j4622l241P144N246P267P432L292R803j1295n972Q912R626M611
4696B1263l865j1138l405P688n551j0664j2063Q170J6094k48r700j642L863J0566
$$ y = [29038, 31663, 27560, 18388, 10821, 5520, 14060, 26558, 32778, 30779, 23292, 36668, 22178, -9398, -28604, -43871, -33472, -35029, -29440, -15162, -15835, -9362, -6320, -6987, -11124, 3180, 17614, 20361, 6206, -2153, -5344, -3841, 1706, -9912, -13065, -25145, -17459, -2946, 468, -9745, -16390, -17329, -6503, -3202, -14088, -12259, -9595, -23657, -23527, -12983, -19720, -26099, -18828, -13387, -15658, -11959, -2493, 7368, 4857, 7556, 12017, 11900, 2020, -13081, -13147, -4243, 8429, 8343, 7590, 8969, -5657, -7204, -3431, 5010, 4732, -11815, -10828, 577, -6524, 6596, 17881, 19398, 16438, 17262, 5351, -14239, -8262, -6940, -21562, -24803, -17659, -12413, -5146, 2286, 5578, 15381, 4086, -1886, 7026, 16652, 21263, 17398, 6260, 2855, 10543, 4992, -5672, -17735, -9565, 6529, 6281, -3419, -5061, -1198, 9368]
4682I368n831j5424j1220p76J6142Q750j954j1790p288R930j646j386J983P878
4668c264O609J0301j0506j3792L677K969n879l836j246m341J2812P935j2174K636
4654h099M130J0370k391M09M969j780P86l055P470J4473J969r15k0413q109K741
4639B555l0o26o597k783O100M329m717j2408N216m783m523J6J5397j35J297P025
4623E333L605n879j8001j2028k032Q633M576j267K558N557J904Q065N971r454
4609b459Q120J4644J1212j3750j6320r38J5729J8436J922r780K208k0607k3441
4596a5024k68K5133O309J528o432l993K814r549o202M173K50R769j1484n533j1493
4581b0002m228l152N291Q851m574J876O201p336r15k95J236n50j571K1459M952
$$ y = [9368, 3537, -11887, -23107, -23883, -7741, 1009, -945, -12735, -20023, -10093, -11739, -13125, -11142, -3264, 3345, 13646, 3140, -10652, -6975, -4006, -9885, -13721, -14967, -19308, -6496, 1439, -10735, -8099, -3969, 6401, 4010, 4419, 9388, 7608, 8394, 5339, 12809, 27282, 29251, 28336, 7923, -186, 2555, 2525, 1899, -4698, -7481, -1381, 2948, -1769, -14177, -8961, -13744, -18267, -18251, -2854, -2989, -1692, 5333, 8938, 3059, -14942, -26970, -29002, -20369, -15793, -17060, -14502, -8945, -7041, 1024, 6995, -2459, 5661, 20305, 31517, 17767, 1447, 509, 16238, 34674, 36596, 26816, 29024, 8417, -15024, -15292, 9841, 16150, 17678, 11246, 7253, 10067, 518, -5684, -1511, -1261, 8508, -2976, -8509, -20002, -24230, -27382, -22091, -13240, -17814, -15938, -9737, -17073, -17988, -18283, -17047, -17597, -19168, 2291, 7243]
4566G243j3073j1075n979J2313N83p484L408J091N569J722j5634l458M396p798
4552b8176N191O020J1581m963L849R071O97p722N92M759n424m253K554q415M863
4537i776N496j5236n778N025L47Q721O173j0471L363J0236m946Q221k153O601
4523E823n026k0657n698M068M965P446J6113N879j672m199l087j553l998M063
4509B467J3147L466q105j3348j1442Q075J2871P6Q544N752j7461k6024K121Q451
$$ y = [7243, -5830, -16905, -22884, -10571, -9988, -17472, -14064, -12973, -7404, -5682, -21316, -24774, -20378, -28176, -22985, -16965, -5384, -10347, -6498, 2573, 3270, -4452, -3860, 899, -4525, -8778, -6224, -14639, -9776, -4280, -19516, -25294, -20269, -19922, -11201, -5028, -15499, -12136, -1900, -6846, 1375, -778, 5823, 797, -19860, -25558, -21490, -16525, -9079, 7034, 12913, 11241, 7042, 3955, 2402, -1596, 2467, 15614, 19080, 10975, -2373, -13815, -5740, 7131, 7207, 15751, 21503, 4042, -21982, -19861, -11410]
$$ [...]
##END NTUPLES=NMR SPECTRUM
##END=
