##TITLE=Analysis number 322294
Compound Code cc 54801
Book Reference 486/47/1
Project Code adrs
Chemist Name simons
##JCAMPDX= 6.0         $$ Bruker NMR JCAMP-DX V2.0
##DATA TYPE= NMR SPECTRUM
##DATA CLASS= NTUPLES
##ORIGIN= Bruker BioSpin GmbH
##OWNER= nmr
$$ XWIN-NMR		Version 3.5
$$ Wed Sep 20 12:13:55 2006 GMT Daylight Time (UT+1h)  MAYBRIDGE\nmr@NMR_250MHZ
##.OBSERVE FREQUENCY= 250.131544655141
##.OBSERVE NUCLEUS= ^1H
##.ACQUISITION MODE= SIMULTANEOUS (DQD)
##.ACQUISITION SCHEME= undefined
##.AVERAGES= 16
##.DIGITISER RES= 18
##SPECTROMETER/DATA SYSTEM= dpx250
##.PULSE SEQUENCE= zg30
##.SOLVENT NAME= DMSO
##.SHIFT REFERENCE= (INTERNAL, DMSO, 0, 16.522)
##AUDIT TRAIL= $$ (NUMBER, WHEN, WHO, WHERE, WHAT)
$$ ##TITLE= Audit trail, XWIN-NMR		Version 3.5
$$ ##JCAMPDX= 5.01
$$ ##ORIGIN= Bruker BioSpin GmbH
$$ ##OWNER= nmr
$$ C:\u/data/dgb/nmr/ADRS/1050/pdata/1/auditp.txt
$$ ##AUDIT TRAIL=  $$ (NUMBER, WHEN, WHO, WHERE, WHAT)
(   1,<2006-09-20 12:13:30.65 +100>,<MAYBRIDGE\nmr>,<NMR_250MHZ>,
      <created by zg, POWCHK disabled, PULCHK disabled
       configuration hash MD5:
       E2 DF 36 D8 04 B2 41 60 5A D7 A3 38 5A 4B D0 FE
       data hash MD5: 64K
       D1 20 20 71 DC 73 2F 10 DD 8F E9 FE E1 4D 86 78>)
(   2,<2006-09-20 12:13:45.01 +100>,<MAYBRIDGE\nmr>,<NMR_250MHZ>,
      <Start of raw data processing
       ef LB = 0.3 FT_mod = 6 PKNL = 1 SI = 32K 
       data hash MD5: 32K
       29 79 56 63 21 9F D8 70 C7 56 6C C5 17 F8 F4 39>)
(   3,<2006-09-20 12:13:46.67 +100>,<MAYBRIDGE\nmr>,<NMR_250MHZ>,
      <apk 
       data hash MD5: 32K
       56 CB 76 1A 6B F5 3A 10 0F 5C 9A 08 6A 3E 6A FC>)
(   4,<2006-09-20 12:13:47.56 +100>,<MAYBRIDGE\nmr>,<NMR_250MHZ>,
      <abs ABSG = 5 
       data hash MD5: 32K
       25 7E 7E BC 37 35 33 6A 6B 43 3F 94 BA ED CD 55>)
$$ ##END=
$$ 
$$ hash MD5
$$ 3E 6C 4D 80 FA E2 7D 1C E8 82 77 8C D5 25 E4 01
##$RELAX= 
##$RELAX= 
##$RELAX= 
##$RELAX= 
##$RELAX= 
##$RELAX= 
##$RELAX= 
$$ Bruker specific parameters
$$ --------------------------
##$DU= <C:\u>
##$EXPNO= 1050
##$NAME= <ADRS>
##$PROCNO= 1
##$TYPE= <nmr>
##$USER= <dgb>
##$AMP= (0..31)
100 100 100 100 100 100 100 100 100 100 100 100 100 100 100 100 100 100 
100 100 100 100 100 100 100 100 100 100 100 100 100 100 
##$AQSEQ= 0
##$AQ_mod= 3
##$AUNM= <au_zg>
##$AUTOPOS= <20 >
##$BF1= 250.13
##$BF2= 250.13
##$BF3= 250.13
##$BF4= 250.13
##$BF5= 500.13
##$BF6= 500.13
##$BF7= 500.13
##$BF8= 500.13
##$BYTORDA= 1
##$CFDGTYP= 0
##$CFRGTYP= 5
##$CHEMSTR= <none>
##$CNST= (0..31)
1 1 145 1 1 1 1 1 1 1 1 1 1 1 1 1 1 1 1 1 1 1 1 1 1 1 1 1 1 1 1 1 
##$CPDPRG= <>
##$CPDPRG1= <>
##$CPDPRG2= <>
##$CPDPRG3= <>
##$CPDPRG4= <mlev>
##$CPDPRG5= <mlev>
##$CPDPRG6= <mlev>
##$CPDPRG7= <mlev>
##$CPDPRG8= <mlev>
##$CPDPRGB= <>
##$CPDPRGT= <>
##$D= (0..31)
0 1 0 0 0 0 0 0 0 0.06 0 0 0 0 0 0 0.0002 0 0 0 0 0 0 0 0 0 0 0 0 0 0 
0 
##$DATE= 1158750809
##$DBL= (0..7)
120 120 120 120 120 120 120 120 
##$DBP= (0..7)
150 150 150 150 150 150 150 150 
##$DBP07= 0
##$DBPNAM0= <>
##$DBPNAM1= <>
$$ [...]
##$SUBNAM7= <"">
##$SUBNAM8= <"">
##$SUBNAM9= <"">
##$SW= 20.6930455092707
##$SWIBOX= (0..15)
0 0 3 0 0 0 0 0 0 0 0 0 0 0 0 0 
##$SW_h= 5175.983436853
##$TD= 65536
##$TD0= 1
##$TE= 296.16
##$TE2= 300
##$TE3= 300
##$TEG= 300
##$TL= (0..7)
0 120 120 120 120 120 120 120 
##$TP= (0..7)
150 150 150 150 150 150 150 150 
##$TP07= 0
##$TPNAME0= <>
##$TPNAME1= <>
##$TPNAME2= <>
##$TPNAME3= <>
##$TPNAME4= <>
##$TPNAME5= <>
##$TPNAME6= <>
##$TPNAME7= <>
##$TPOAL= (0..7)
0.5 0.5 0.5 0.5 0.5 0.5 0.5 0.5 
##$TPOFFS= (0..7)
0 0 0 0 0 0 0 0 
##$TUNHIN= 0
##$TUNHOUT= 0
##$TUNXOUT= 0
##$USERA1= <user>
##$USERA2= <user>
##$USERA3= <user>
##$USERA4= <user>
##$USERA5= <user>
##$V9= 5
##$VALIST= <valist>
##$VCLIST= <CCCCCCCCCCCCCCC>
##$VD= 0
##$VDLIST= <DDDDDDDDDDDDDDD>
##$VPLIST= <PPPPPPPPPPPPPPP>
##$VTLIST= <TTTTTTTTTTTTTTT>
##$WBST= 1024
##$WBSW= 4
##$XGAIN= (0..3)
0 0 0 0 
##$XL= 0
##$YL= 0
##$YMAX_a= 208960
##$YMIN_a= -377515
##$ZGOPTNS= <>
##$ZL1= 120
##$ZL2= 120
##$ZL3= 120
##$ZL4= 120
##$ABSF1= 16.522
##$ABSF2= -4.171173
##$ABSG= 5
##$ABSL= 3
##$ALPHA= 0
##$AQORDER= 0
##$ASSFAC= 0
##$ASSFACI= 0
##$ASSFACX= 0
##$ASSWID= 0
##$AUNMP= <proc_1d>
##$AZFE= 0.1
##$AZFW= 0.1
##$BCFW= 0
##$BC_mod= 0
##$BYTORDP= 0
##$COROFFS= 0
##$CY= 12.5
##$DATMOD= 1
##$DC= 0
##$DFILT= <>
##$DTYPP= 0
##$F1P= 14.0000005364418
##$F2P= -0.99999901652339
##$FCOR= 0.5
##$FTSIZE= 32768
##$FT_mod= 6
##$GAMMA= 0
##$GB= 0
##$INTBC= 1
##$INTSCL= 1
##$ISEN= 128
##$LB= 0.3
##$LEV0= 0
##$LPBIN= 0
##$MAXI= 10000
##$MC2= 0
##$MEAN= 0
##$ME_mod= 0
##$MI= 0
##$NCOEF= 0
##$NC_proc= -6
##$NLEV= 6
##$NOISF1= 0
##$NOISF2= 0
##$NSP= 0
##$NTH_PI= 0
##$NZP= 0
##$OFFSET= 16.522
##$PC= 1
##$PHC0= 138.3277
##$PHC1= 10.10988
##$PH_mod= 1
##$PKNL= yes
##$PPARMOD= 0
##$PSCAL= 4
##$PSIGN= 0
##$REVERSE= no
##$SF= 250.13
##$SI= 32768
##$SIGF1= 0
##$SIGF2= 0
##$SINO= 400
##$SIOLD= 32768
##$SREGLST= <1H.DMSO>
##$SSB= 0
##$STSI= 32768
##$STSR= 0
##$SW_p= 5175.98343685301
##$SYMM= 0
##$S_DEV= 0
##$TDeff= 65536
##$TDoff= 0
##$TI= <Analysis number 999999
Compound Code 99
Book Reference 9
Project Code 9>
##$TILT= no
##$TM1= 0
##$TM2= 0
##$TOPLEV= 0
##$USERP1= <user>
##$USERP2= <user>
##$USERP3= <user>
##$USERP4= <user>
##$USERP5= <user>
##$WDW= 1
##$XDIM= 32768
##$YMAX_p= 371388951
##$YMIN_p= -1324158
$$ End of Bruker specific parameters
$$ ---------------------------------
##NTUPLES= NMR SPECTRUM
##VAR_NAME=  FREQUENCY,     SPECTRUM/REAL,   SPECTRUM/IMAG
##SYMBOL=    X,             R,               I
##VAR_TYPE=  INDEPENDENT,   DEPENDENT,       DEPENDENT
##VAR_FORM=  AFFN,          ASDF,            ASDF
##VAR_DIM=   32768,         32768,           32768
##UNITS=     HZ,            ARBITRARY UNITS, ARBITRARY UNITS
##FACTOR=    0.157963299565203, 1,           1
##FIRST=     4132.6476996994, 0,             0
##LAST=      -1043.33573715361, 0,           0
##MIN=       -1043.33573715361, -1324158,    0
##MAX=       4132.6476996994, 371388951,     0
$$ Real data points
##PAGE= N=1
##DATA TABLE= (X++(R..R)), XYDATA
$$ [...]
15491e29515p1709Q6719J43592K15562l4853K68882n6710k36557k25196N7871
$$ -529515 -601224 -514505 -370913 -155351 -190204 78678 21968 -214589 -439785 -381914
15481c81914L20618J15300l34196j09802L09491J66792k85910k54876K21739O7729
$$ -381914 -61296 54004 -280192 -389994 -80503 86289 -199621 -454497 -232758 -165029
15471a65029q1060m5212J18794m3907k36024p2815K52282n0633J75894J18983
$$ -165029 -246089 -291301 -172507 -216414 -452438 -525253 -272971 -323604 -147710 -28727
15461b8727n3458o2321J94925l7122j61120j25169j24489J01156l4301n02219
$$ -28727 -82185 -144506 50419 13297 -147823 -272992 -397481 -296325 -330626 -832845
15451h32845n3938K46906L90762j04511Q3160m7721o9570K66908n3002L979K23805
$$ -832845 -886783 -639877 -249115 -353626 -270466 -318187 -387757 -120849 -173851 -169872 53933
15440E3933r9396P2363L12151k49773m70199K53618L48694R7000q6337l25554
$$ 53933 -45463 26900 339051 89278 -380921 -127303 221391 318391 232054 -93500
15430i3500j77761R2969J04069k1804J49102k67284o1390K44040q8669k65912
$$ -93500 -271261 -178292 -74223 -96027 53075 -214209 -275599 -31559 -120228 -386140
15420c86140o5138P139J75889J60729L64541O2794l59992j00680O1975j3719L15563
$$ -386140 -451278 -444139 -268250 -107521 257020 319814 -40178 -140858 -78883 -92602 222961
15409B22961j04144m07266l74215j04850J16957k8559n6531L34824J47944K06142
$$ 222961 118817 -288449 -662664 -767514 -650557 -679116 -735647 -400823 -252879 -46737
15399d6737K30691k31356j33947J32411O7647k04149n5371K26090J31414j62845
$$ -46737 183954 -47402 -181349 -48938 18709 -185440 -240811 -14721 116693 -46152
15389d6152k85076j23775K30287J38005P2556k42454j14111N3010P1256J21596
$$ -46152 -331228 -455003 -224716 -86711 -14155 -256609 -370720 -317710 -246454 -124858
15379a24858k0006k96471K03612J62581N1016q0348m1287M37223K66217j03956
$$ -124858 -144864 -441335 -237723 -75142 -24126 -104474 -145761 291462 557679 453723
15369D53723k53760N3028l71794l66760L6215J25396j3572L2718N9862k62371
$$ 453723 199963 252991 -118803 -485563 -449348 -323952 -337524 -304806 -244944 -507315
15359e07315k03656J29115k1568J56001L65743L3495j08648l9852L5430L00868
$$ -507315 -710971 -581856 -603424 -447423 -81680 -48185 -156833 -196685 -161255 139613
15349A39613Q1474k21850j23739M4999m1143O0797r2724R0624l27993N9325N87152
$$ 139613 221087 -763 -124502 -79503 -120646 -59849 -152573 -61949 -389942 -330617 256535
15338B56535K09860J49919N315n17397k52803K5301J58841q0277j22797K58512
$$ 256535 466395 616314 621629 104232 -148571 -123270 35571 -44706 -167503 91009
15328I1009j93169l57794n6902j1688R4962J99307K51068m0020J96987j14061
$$ 91009 -102160 -459954 -516856 -528544 -433582 -234275 16793 -23227 173760 59699
15318E9699J02682q2991o6047J32704j93264k32546j12372k06695r1859Q9303
$$ 59699 162381 79390 13343 146047 -47217 -279763 -392135 -598830 -690689 -601386
15308f01386M6925P0485M16213j47343p0442L94815Q9787r4787j29283J90670
$$ -601386 -554461 -483976 -67763 -215106 -285548 109267 199054 104267 -25016 165654
15298A65654j00608J87065R3369k85279j70526j63385J94351J02682l78552R1696
$$ 165654 65046 252111 345480 60201 -110325 -273710 -79359 23323 -355229 -263533
15288b63533K51679l67918j04969K21222L97730j878l55898n1179o3965P7621
$$ -263533 -11854 -379772 -484741 -263519 134211 132333 -223565 -274744 -338709 -261088
15278b61088J6988j10720k73280j28516k6839K37440L00080j53435J18312K14263
$$ -261088 -244100 -354820 -628100 -756616 -783455 -546015 -245935 -399370 -281058 -66795
15268f6795P4490k44058j54758n9809J46877k24223K6992j18423R6566L14978
$$ -66795 7695 -236363 -391121 -450930 -304053 -528276 -501284 -619707 -523141 -208163
15258b08163k80659n1415K35165q0137j57065Q3761J45250N01826M92457k01152
$$ -208163 -488822 -540237 -305072 -385209 -542274 -458513 -313263 188563 681020 479868
15248D79868k89695k32539J34504n3621k47322K80855J62485j73391l87500J8941
$$ 479868 190173 -42366 92138 38517 -208805 72050 234535 61144 -326356 -307415
15238c07415k9668K0105r6255L00590K28125j33107m20055k26825K39859N36829
$$ -307415 -337083 -316978 -413233 -112643 115482 -17625 -437680 -664505 -424646 112183
15228A12183J79514r1484j52187J91850K54127J34494J40732l45942l45477m29736
$$ 112183 291697 200213 48026 239876 494003 628497 769229 423287 77810 -351926
15218c51926K41242K40099J02471k6594J88293n0631k53312k30608K16323J91202
$$ -351926 -110684 129415 231886 205292 393585 342954 89642 -140966 75357 266559
15208B66559J4124j55867j18277j31831j60962J11225k7956l40869K66721L36561
$$ 266559 280683 124816 6539 -125292 -286254 -175029 -202985 -543854 -277133 59428
15198E9428K99283j28966k42839k6105J3059k45788r7548J14012J97027J61620
$$ 59428 358711 229745 -13094 -39199 -26140 -271928 -369476 -255464 -58437 103183
15188A03183p9380k25200j21552p516J77181k51719n3915P4433J57359J61229
$$ 103183 23803 -201397 -322949 -330465 -153284 -405003 -458918 -384485 -227126 -65897
15178f5897O2628k87870j29273L7384K44309L21709L3575P4579n2039j86187M2529
$$ -65897 -3269 -291139 -420412 -383028 -138719 182990 216565 291144 239105 52918 95447
15167I5447J25549r4947q9436N5832p6636k77860p3435L2009o7708k18407K0501
$$ 95447 220996 126049 36613 92445 15809 -262051 -335486 -303477 -371185 -589592 -569091
15156e69091M45304m5538j32635j24982p5690q057R6675J29545K49266K8946N4200
$$ -569091 -123787 -169325 -301960 -426942 -502632 -510689 -414014 -284469 -35203 -6257 47943
15145D7943l0423k88824k54098j58744J25033M77591L36355J57116k2609m63208
$$ 47943 17520 -271304 -525402 -684146 -559113 -81522 254833 411949 389340 -73868
15135g3868m72615r2607J19899j14105K22626K06023j91757j64863J82485K0663
$$ -73868 -546483 -639090 -519191 -633296 -410670 -204647 -396404 -561267 -378782 -358119
15125c58119K34242J07612M17860k70544j94491Q8133l4404r5455N38582P8969
$$ -358119 -123877 -16265 401595 131051 -63440 24693 -9711 -105166 433416 512385
15115E12385l14756m41659J26114R5723m6210p617l3807m5805J69010J37269m70762
$$ 512385 197629 -244030 -117916 -22193 -68403 -76020 -109827 -155632 13378 150647 -320115
15104c20115q3874k039J33353M23138J13939j35082q5820J15544O2094j46946
$$ -320115 -403989 -406028 -272675 150463 264402 129320 43500 159044 221138 74192
15094G4192m0549j81887j15260K32990K6605k70113k73839J12133Q7338j40315
$$ 74192 33643 -148244 -263504 -30514 -3909 -274022 -547861 -435728 -348390 -488705
15084d88705o7439M1994R5723M35423K37699k77571j94042K9162p278J44969o0597
$$ -488705 -556144 -514150 -418427 16996 254695 -22876 -216918 -187756 -195034 -50065 -110662
15073a10662n9607n80803J25786K58574K57308r8867P2922j39682n2820j34144
$$ -110662 -170269 -751072 -625286 -366712 -109404 -208271 -135349 -275031 -327851 -461995
15063d61995Q3376k63056K07875K52976R1826j03961j18636j19487j56783L41092
$$ -461995 -378619 -641675 -433800 -180824 -88998 -192959 -311595 -431082 -587865 -246773
15053b46773J38425k93132N937M15635L74458k10487j68737j7392R4779J08528
$$ -246773 -108348 -401480 -395543 20092 394550 184063 15326 -2066 92713 201241
15043B01241P6254L7000k70222J33634l9858L526K10024K11282K48541L3887m03978
$$ 201241 277495 314495 44273 177907 138049 141575 351599 562881 811422 845309 441331
15032D41331j76402m28352m70243L76591L13781o122l31478L7158K72767J75031
$$ 441331 264929 -163423 -633666 -257075 56706 50584 -280894 -243736 29031 204062
15022B04062j21506k19448j40177K78597m5367J43061K28281j12041j66832k00989
$$ 204062 82556 -136892 -277069 1528 -43839 99222 327503 215462 48630 -152359
15012a52359j30692K40140M89630k52782j01950j08497r99j79462N819m5345j4995
$$ -152359 -283051 -42911 446719 193937 91987 -16510 -17509 -196971 -191152 -236497 -251492
15001b51492K0287K24106L1513k22680O7015k7953q9179n0433M9161J66553K09015
$$ -251492 -231205 -7099 24414 -198266 -131251 -159204 -248383 -298816 -249655 -83102 125913
14990A25913K38562j40885k7171j34317Q7711K27988p0368k05946k47520l24497
$$ 125913 364475 223590 196419 62102 149813 377801 307433 101487 -146033 -470530
14980d70530K54074R2951k99466j20652L26707J43287k24012k15495k41659L53871
$$ -470530 -216456 -123505 -422971 -543623 -216916 -73629 -297641 -513136 -754795 -400924
14970d00924K59747K33223j77831j50366k66398L02527n0290J34699r2857j45232
$$ -400924 -141177 92046 -85785 -236151 -502549 -200022 -250312 -115613 -208470 -353702
14960c53702j00650K2549L03776J69055k00020K12999j43490M3176R8314J31938
$$ -353702 -454352 -431803 -128027 41028 -158992 54007 -89483 -46307 52007 183945
14950A83945J99539J3807l35214j85713k45764J00833J28408J98408O9108j39307
$$ 183945 383484 397291 62077 -123636 -369400 -268567 -140159 58249 127357 -11950
14940a1950l47221O4780J66640k26616N30529L47621k47955l89547j56205N48654
$$ -11950 -359171 -294391 -127751 -354367 176162 523783 275828 -113719 -269924 278730
14930B78730P8682j47826k73681J56178M5011N271k59365k73755L02647J45251
$$ 278730 357412 209586 -64095 92083 137094 142365 -117000 -390755 -88108 57143
14920E7143O359j57487j92575P4831k9848l61699K00140L76923Q9112k62772p5981
$$ 57143 63502 -93985 -286560 -211729 -241577 -603276 -403136 -26213 62899 -199873 -275854
14909b75854J23371j92095j40019Q1329o874J16218p8745P4068P4921j3336J02649
$$ -275854 -152483 -344578 -484597 -403268 -410142 -293924 -372669 -298601 -223680 -237016 -134367
14898a34367K76148j6486m96470k36455K60085L12211j26103j1584J78958j4979
$$ -134367 141781 125295 -371175 -607630 -347545 -35334 -161437 -173021 5937 -9042
14888i042j31050k92958k4279J57962K91187j36099j18200R8257j51012j30812
$$ -9042 -140092 -433050 -457329 -299367 -8180 -144279 -262479 -164222 -315234 -446046
14878d46046j07751J57582q9949k89322k48242K35332R6737j2220L94017K33447
$$ -446046 -553797 -396215 -486164 -775486 -1023728 -788396 -691659 -703879 -309862 -76415
14868g6415L56288L00454j61950n05410l41202k26641J31111K17932J49929K75836
$$ -76415 279873 580327 418377 -87033 -428235 -654876 -523765 -305833 -155904 119932
14858A19932j4573l7107K97115r4181k74984l87276j16295K445J12145N7689j62059
$$ 119932 105359 68252 365367 271186 -3798 -391074 -507369 -504924 -392779 -335090 -497149
14847d97149j35539Q9734j12325P1836J19022J59740j63853l9804r4022K20464
$$ -497149 -632688 -542954 -655279 -583443 -464421 -304681 -468534 -508338 -602360 -381896
14837c81896K81628j42238j45826R8423r2705J30329L78249K23038N1351l19617
$$ -381896 -100268 -242506 -388332 -289909 -382614 -252285 125964 349002 400353 80736
14827H0736j6133O6795M5843k97669o3266J7663j23624P8849J29042K11834J21073
$$ 80736 64603 131398 177241 -120428 -183694 -166031 -289655 -210806 -81764 130070 251143
14816B51143Q4012l11149J34067J28862k69084k2090J2426L98234J99668m77045
$$ 251143 335155 24006 158073 286935 17851 -4239 8187 406421 606089 129044
14806A29044k34401K802n7007K82684k300L51673k40354l30921Q6392r4040K47288
$$ 129044 -105357 -102555 -159562 123122 120822 472495 232141 -98780 -12388 -106428 140860
14795A40860J66539r5614j82486K35534k2629k68962j81928k17298K78019K13038
$$ 140860 307399 211785 29299 264833 242204 -26758 -208686 -425984 -147965 65073
14785F5073k39922k44490K68821J64282K9336k07473k49529j50035k26367P9474
$$ 65073 -174849 -419339 -150518 13764 43100 -164373 -413902 -563937 -790304 -710830
14775g10830K60999J94713l5024r2203M54958k0022j19652j77854j18013j19768
$$ -710830 -449831 -255118 -290142 -382345 72613 52591 -67061 -244915 -362928 -482696
14765d82696j01436M09291L91119P2088j90473Q4670l47928k95750l4632J75851
$$ -482696 -584132 -174841 216278 288366 97893 182563 -165365 -461115 -495747 -319896
14755c19896n6214J03279P6235K65315L11415J42038j29713J33395J74980l23110
$$ -319896 -376110 -272831 -196596 68719 380134 522172 392459 525854 700834 377724
14745C77724l48805m899j71697j78883Q1404m2372k01309j51187K74868Q7516
$$ 377724 28919 24020 -147677 -326560 -245156 -287528 -488837 -640024 -365156 -277640
14735b77640k30376K09786L78893m9583L6195n5345k09016O6732r1834J77017
$$ -277640 -508016 -298230 80663 31080 67275 11930 -197086 -130354 -222188 -45171
14725d5171J73571n9178q0366k24103R3474L83081J14339j86864l78542k6175
$$ -45171 128400 69222 -11144 -235247 -141773 241308 355647 168783 -209759 -235934
14715b35934K62685k37782l55853O2558L15520j4165l6837o349p5705J90446R4662
$$ -235934 26751 -211031 -566884 -504326 -188806 -202971 -239808 -246157 -321862 -131416 -36754
14704c6754L50649J17953J2069l68182n6341l68758l37119K98435K81115L25797
$$ -36754 313895 431848 443917 75735 19394 -349364 -686483 -388048 -106933 218864
14694B18864K0783K6493l93754j75534K10158N36981k76383k45208N1210J07582
$$ 218864 239647 266140 -127614 -303148 -92990 443991 167608 -77600 -26390 81192
14684H1192j2339j71689J10393k642m30426j47982O2996j43811R351J15628K34520
$$ 81192 68853 -102836 7557 4915 -425511 -573493 -510497 -654308 -644957 -529329 -294809
14673b94809K26190J33372J1273l85807j20277J67133J85677J3424j83486j72219
$$ -294809 -68619 64753 76026 -309781 -430058 -262925 -77248 -63824 -247310 -419529
14663d19529j09359K51858K0530L41599k04365k56909n1842K78575L7251j15327
$$ -419529 -528888 -277030 -256500 85099 -119266 -376175 -428017 -149442 -112191 -227518
14653b27518j21175J7654J75907k40193J55224o2796J90269P0362r7731k8701
$$ -227518 -348693 -331039 -155132 -395325 -240101 -302897 -112628 -42266 -139997 -168698
14643a68698k7751j35270p2449K03690J23720j83275n3706K50680Q5872j7263
$$ -168698 -196449 -331719 -404168 -200478 -76758 -260033 -313739 -63059 22813 5550
14633E550K27965j77253j3383q9167k23286O0112O4003k3498k48757R1878m31920
$$ 5550 233515 56262 42879 -46288 -269574 -209462 -145459 -168957 -417714 -325836 -757756
14622g57756k01591p3594P2899L07838K03316J27707n0653j35732K56531N2271
$$ -757756 -959347 -1032941 -960042 -652204 -448888 -321181 -371834 -507566 -251035 -198764
14612a98764j67808k18747J20425L70370K72000l310m4152j34492m28685n5125
$$ -198764 -366572 -585319 -464894 -94524 177476 174166 130014 -4478 -433163 -488288
14602d88288J0911J2485M8424j12870L48091J10805O4381K63118k4360k27550
$$ -488288 -477377 -464892 -416468 -529338 -181247 -70442 -6061 257057 232697 5147
14592E147J68079L07252j02378j64677l87793l08264n7353k17581j7759J93066
$$ 5147 173226 480478 378100 213423 -174370 -482634 -539987 -757568 -775327 -582261
14582e82261L36303L3005R7133J93151J73464j63981O734Q9217j85980N4651k7429
$$ -582261 -245958 -212953 -115820 77331 250795 86814 93548 182765 -3215 51436 24007
14571B4007J18750J09152m6795k42992j42245J60913J87499n172L6196Q2526K28822
$$ 24007 142757 251909 205114 -37878 -180123 -19210 168289 163117 199313 281839 510661
14560E10661R248l30055l02531P6000J36001R1620j51547k79171J89446M36507
$$ 510661 519909 189854 -112677 -36677 99324 190944 39397 -239774 -50328 386179
14550C86179K2034m72634l22660K68539J75170k53385r310K24810J49317j99005
$$ 386179 408213 -64421 -387081 -118542 56628 -196757 -206067 18743 168060 -30945
14540c0945K6714K76053R6384k01042j26181k62080Q7413j43j23269O930K46595
$$ -30945 -4231 271822 368206 167164 40983 -221097 -133684 -133827 -257096 -250166 -3571
14529c571J51767J43541P9788m2285j50202k85945n9016J97129N89r9015Q4370
$$ -3571 148196 291737 371525 329240 179038 -106907 -165923 31206 31795 -67220 17150
14518A7150k41354j60427j98146L06778K27734q4579K86921K6747j95391J03477
$$ 17150 -224204 -384631 -582777 -275999 -48265 -132844 154077 180824 -14567 88910
14508H8910L87699J46112l36628l40625m8302j51934J03273J87063J87260j17848
$$ 88910 476609 622721 286093 -54532 -102834 -254768 -151495 35568 222828 104980
14498A04980j8903j87714J15182J39009J50422k96262l9250L91824K3259l49396
$$ 104980 86077 -101637 13545 152554 302976 6714 -32536 359288 382547 33151
14488C3151j67276o9427n1888L02587K37899o5251m268k82761j57910K04527K63571
$$ 33151 -134125 -203552 -255440 47147 285046 219795 215527 -67234 -225144 -20617 242954
14477B42954N1250J42264P4660n5570k41461j69272J53248k973k24018l14185
$$ 242954 294204 436468 511128 455558 214097 44825 198073 195100 -28918 -343103
14467c43103K22582M54912J57354k74488j15605j53574l31246K77461J98205j3883
$$ -343103 -120521 334391 491745 217257 101652 -51922 -383168 -105707 92498 78615
14457G8615R5576l14341J09296k26045j82048q191K19697K21293k25663J20218
$$ 78615 174191 -140150 -30854 -256899 -438947 -447138 -227441 -6148 -231811 -111593
14447a11593j56576J36177j33036M7987J45028o3793n7694j9464m52716j44002
$$ -111593 -268169 -131992 -265028 -217041 -72013 -135806 -193500 -212964 -665680 -809682
14437h09682J14707O49827N4543j9181r2125K56058K16379j7153o621k77449j79978
$$ -809682 -694975 -45148 9395 -9786 -101911 154147 370526 353373 346752 69303 -110675
14426a10675R7570J79998j43086j91990k77631K75039j48453k22661J53751o5875
$$ -110675 -13105 166893 23807 -168183 -445814 -170775 -319228 -541889 -388138 -454013
14416d54013l51809J51363J12160M0612P4519M43288K11248K08304j92317k5264
$$ -454013 -805822 -654459 -542299 -501687 -427168 16120 227368 435672 243355 218091
14406B18091q1742l26042k10455L05023L26074o9494k60394m36045K88704K55098
$$ 218091 136349 -189693 -400148 -95125 230949 161455 -98939 -534984 -246280 8818
14396H818L31125L68508j23769n4495N2463J88878L4501l84145k86175k33235
$$ 8818 339943 708451 584682 530187 582650 771528 806029 421884 135709 -97526
14386i7526K91917L43779k69773j93367K35761j16367k41560J04631k12997J55366
$$ -97526 194391 538170 268397 75030 310791 194424 -47136 57495 -155502 -136
14376a36K24566j98018k7205n7251K7329j63083j58489J75458N7803m0453o87306
$$ -136 224430 26412 -793 -58044 -30715 -193798 -352287 -176829 -119026 -159479 -846785
14365h46785l24012l7460L04596M28049m1048K75488J68047j83195k60184J72189
$$ -846785 -1170797 -1208257 -903661 -475612 -516660 -241172 -73125 -256320 -516504 -344315
14355c44315J48611m7698J2378R8789K48124o134k58083j56457l7324j7573j23752
$$ -344315 -195704 -243402 -231024 -132235 115889 109755 -148328 -304785 -342109 -359682 -483434
14344d83434L2862l29227M3425K52577J32196Q3162j70040j48213r9847J45009
$$ -483434 -450572 -779799 -736374 -483797 -351601 -268439 -438479 -586692 -686539 -541530
14334e41530K7695k37077K35507J71773m9448k40057k7098m0710P7970j14139
$$ -541530 -513835 -750912 -515405 -343632 -393080 -633137 -660235 -700945 -622975 -737114
14324g37114L06581M5002J74868J04949Q8366l03337l52554L73182K14193k70285
$$ -737114 -430533 -385531 -210663 -105714 -17348 -320685 -673239 -300057 -85864 -356149
14314c56149Q1871J95008J98907j00934J61979J10885j38381j08360o094p2282
$$ -356149 -274278 -79270 119637 18703 180682 291567 153186 44826 38732 -33550
14304c3550j071K9058l49896R2096K91380J91106K484n5269R0060l30843k47369
$$ -33550 -34621 -5563 -355459 -263363 28017 219123 221607 166338 256398 -74445 -321814
14293c21814L0007M80602p3308k59674K8712j63973J4216K058j48214l40006K71763
$$ -321814 -291807 188795 115487 -144187 -115475 -279448 -265232 -263174 -411388 -751394 -479631
14282d79631N11136n7579k82304l3427K9662o6225j96520k23891j84509J46211
$$ -479631 31505 -26074 -308378 -341805 -312143 -378368 -574888 -798779 -983288 -837077
14272h37077M59777K04471K38849K77927k77566k21963j19231L26442K12900j0530
$$ -837077 -377300 -172829 66020 343947 66381 -155582 -274813 51629 264529 253999
14262B53999N8342L16344p778n99988k29015K5863R6946O7654R8967j08775j86979
$$ 253999 312341 628685 620907 20919 -208096 -182233 -85287 -17633 81334 -27441 -214420
14251b14420l1878l81163j7927K74771n1142N2005P5412O8164J8881J1785L37606
$$ -214420 -246298 -627461 -645388 -370617 -421759 -369754 -294342 -226178 -207297 -195512 142094
14240A42094J36431j02237j32566P6665J09471l47796j45386J251j20145J86759
$$ 142094 278525 176288 43722 120387 229858 -117938 -263324 -262073 -382218 -195459
14230a95459J49495j69949j22967o2910J02164L35947J81264J95369k83347l11323
$$ -195459 -45964 -215913 -338880 -401790 -299626 36321 217585 412954 129607 -181716
14220a81716k61700j06534q5773j951Q1945M05567L76518L05970k2371j89146
$$ -181716 -443416 -549950 -635723 -637674 -555729 -150162 226356 532326 509955 320809
14210C20809m21258L7611o186o6640J15825k01466l01313q21R8506K04510l5467
$$ 320809 -100449 -62838 -69024 -135664 -19839 -221305 -522618 -523439 -424933 -220423 -255890
14199b55890j71203L58119P0417j93905r3086n022Q8835J77284j53139n5304p2002
$$ -255890 -427093 -68974 1443 -192462 -285548 -290570 -201735 -24451 -177590 -232894 -304896
14188c04896M69761M81732l00411n32279r1774J62322k06564N3875K26664O4518
$$ -304896 164865 646597 346186 -186093 -277867 -115545 -322109 -268234 -41570 22948
14178B2948m0441j45768j96486j74361k7224J70019K23868K50495J70754j67445
$$ 22948 -17493 -163261 -359747 -534108 -561332 -391313 -167445 83050 253804 86359
14168H6359j15684K15402R4254k27563j67377j50202J04585P2168j96835o591
$$ 86359 -29325 186077 280331 52768 -114609 -264811 -160226 -88058 -284893 -291484
14158b91484R1706M5478k9002q1749n1981m8313J16531L75958M9114k8531N1313
$$ -291484 -199778 -154300 -183302 -265051 -317032 -365345 -248814 127144 176258 147727 199040
14147A99040j71124j40524K44235M0072J2922Q4903J55900J31123o8243l59953
$$ 199040 27916 -112608 131627 171699 184621 269524 425424 556547 488304 128351
14137A28351l336J28031l09273k89742K96629J7523P4418O1374k33089q0923J13824
$$ 128351 125015 253046 -56227 -345969 -49340 -31817 42601 103975 -129114 -210037 -96213
14126i6213j18991m3550k57130j3673K49417J40253J91651J14705o7764r0119
$$ -96213 -215204 -258754 -515884 -529557 -280140 -139887 51764 166469 98705 8586
14116H586R7299q2471r7959N26460K19973l82245J53439K98488L4233m00177l88806
$$ 8586 105885 23414 -74545 451915 671888 289643 443082 741570 775803 375626 -13180
14105a3180J6054K48917p8570M9103J22011j86835j20542o6403J1402m315O1398
$$ -13180 2874 251791 173221 222324 344335 157500 36958 -29445 -18043 -22358 39040
14094C9040J52020k53329k03402L6366J17377o0495o5346k09651j00450L18314
$$ 39040 191060 -62269 -265671 -229305 -111928 -172423 -237769 -447420 -547870 -229556
14084b29556p2779q4600j50235J36155M06106N3934Q2390k26777k00552J53333
$$ -229556 -302335 -386935 -537170 -401015 5091 59025 141415 -85362 -285914 -132581
14074a32581M40891j36122j52606j95216J34734K04947m4692j13958L05304R8168
$$ -132581 308310 172188 19582 -175634 -40900 164047 119355 5397 310701 408869
14064D08869m59801k90100m7402L27138L62356J4716k06350j71858M27659J35928
$$ 408869 -50932 -341032 -388434 -61296 301060 315776 109426 -62432 365227 501155
14054E01155m25780j57064N829M8008P2277J68575N5330k18813J17043k43459
$$ 501155 75375 -81689 -75860 -27852 44425 213000 268330 49517 166560 -76899
14044g6899p356j49050J55670K69630Q5640K30979k85791l02762n1029J71248
$$ -76899 -84255 -233305 -77635 191995 277635 508614 222823 -79939 -130968 40280
14034D0280k09517j61273m2036m4797L08732k8127k84493J38671K86114K1205
$$ 40280 -169237 -330510 -372546 -417343 -108611 -136738 -421231 -282560 3554 24759
14024B4759k53189k70883j50421K7152J60202K77352J37952J74729k52063j10084
$$ 24759 -228430 -499313 -649734 -622582 -462380 -185028 -47076 127653 -124410 -234494
14014b34494k18287K3751J58180Q2376K5693r6936n1557n3411J53635K9880L40695
$$ -234494 -452781 -429030 -270850 -188474 -162781 -259717 -311274 -364685 -211050 -181170 159525
14003A59525J13152J63678p9909m48002k5950J90598J44982j29048k2474k16987
$$ 159525 272677 436355 356446 -91556 -117506 73092 218074 89026 66552 -150435
13993a50435J09356K51858j22537k0740j26185j6049L204m2461n2666J24228J19637
$$ -150435 -41079 210779 88242 67502 -58683 -74732 -71528 -113989 -166655 -42427 77210
13982G7210l1970r6055M5479J03949k19125j32687K42092M80055J12221K295j36748
$$ 77210 45240 -50815 -5336 98613 -120512 -253199 -11107 468948 581169 583464 446716
13971D46716j89680m73727k22029J86311L68352J26173j42845J25518m7054j28347
$$ 446716 257036 -216691 -438720 -252409 115943 242116 99271 224789 177735 49388
13961D9388M7314o0637J23243M0204k49370r9718m2844P9733K22644J07856j6299
$$ 49388 96702 36065 159308 199512 -49858 -149576 -192420 -112687 109957 217813 201514
13950B01514o3241J96047j3613k66490m65982k14232L31746L14949K9315J34067
$$ 201514 138273 334320 320707 54217 -411765 -625997 -294251 20698 50013 184080
13940A84080N063q2794K0831n8576k8230m9612J4225N9490k13007J71439L78804
$$ 184080 189143 106349 127180 68604 40374 -9238 4987 64477 -148530 22909 401713
13929D01713K39472k48298j67495K38682J06444k91645j52564o8177J83557J15045
$$ 401713 641185 392887 225392 464074 570518 278873 126309 58132 241689 356734
13919C56734O3539L0723m43018j32481J74037K50848N195O7156l39131l52164
$$ 356734 420273 450996 7978 -124503 49534 300382 305577 372733 33602 -318562
13909c18562j24121j60343L40293L36476J36112K92212Q0417l9744l21299n5005
$$ -318562 -442683 -603026 -262733 73743 209855 502067 582484 542740 221441 166436
13899A66436j98637j72887N2763o4918j67975k40594L76937k5485K52729K06517
$$ 166436 -32201 -205088 -152325 -217243 -385218 -625812 -248875 -274360 -21631 184886
13889A84886J0566M1795j43233L70037J20177j58203N7625j89299k14377J77019
$$ 184886 195452 237247 94014 464051 584228 426025 483650 294351 79974 256993
13879B56993l0144j48148J77384O7300J01307p2642j06435m04240J58701M8639
$$ 256993 226849 78701 256085 323385 424692 352050 245615 -158625 76 48715
13869D8715M0148N402Q7941r2509k94107r4068o2649O2903l9321k91436j96266
$$ 48715 88863 94265 182206 89697 -204410 -298478 -361127 -298224 -337545 -628981 -825247
13858h25247j7853J74277J86172J56887K62911j45829k34258K07718M19460L9167
$$ -825247 -843100 -668823 -482651 -325764 -62853 -208682 -442940 -235222 184238 223405
13848B23405j00709J14900j06016m3121k76220j35965K64105K49351m89278K7142
$$ 223405 122696 237596 131580 88459 -187761 -323726 -59621 189730 -299548 -272406
13838b72406P0931j43133K2895L08506N2579K98845r9093m0925l11964L7631R3487
$$ -272406 -201475 -344608 -321713 -13207 39372 338217 239124 198199 -113765 -76134 17353
13827A7353K3726L2350R40k98562M0295R0699Q3308R6121j78071k10545K45316
$$ 17353 41079 73429 74369 -224193 -183898 -93199 -9891 86230 -91841 -302386 -57070
13816e7070J67437r2197J751L2866p6683m0648k10191J76026j01204j33204O4292
$$ -57070 110367 18170 19921 52787 -23896 -64544 -274735 -98709 -199913 -333117 -268825
13805b68825J24966M70332J55117k8054p3147k64711j65372o1352k33140m6022
$$ -268825 -143859 326473 481590 453536 380389 115678 -49694 -111046 -344186 -390208
13795c90208O0806Q0406K25984O0846j44277j3595J03832k33783j62136L21631
$$ -390208 -329402 -248996 -23012 37834 -106443 -120038 -16206 -249989 -412125 -90494
13785i0494J66364r2036o9627O3498o5789j708M4474j26393l52533J41792n8026
$$ -90494 75870 -16166 -85793 -22295 -88084 -89792 -45318 -171711 -524244 -382452 -440478
13774d40478L95407J68652p910K1541R9516k16327n18985K93757J54711m6862
$$ -440478 -45071 123581 115671 137212 236728 20401 -498584 -204827 -50116 -96978
13764i6978K23091J17088j83068l58093N6440L06211K9057k39296j01716j2053
$$ -96978 126113 243201 60133 -297960 -241520 64691 93748 -145548 -247264 -259317
13754b59317j54231j00984N829J94839R2656N74922O0675k22428J63498L15524
$$ -259317 -413548 -514532 -508703 -313864 -221208 353714 414389 191961 355459 670983
13744F70983k7481l03583j73098J73179j37764o00675k88515L37318K19415J598
$$ 670983 643502 339919 166821 340000 202236 -398439 -686954 -349636 -130221 -128623
13734a28623k12901p0604Q5327R7889j20704J30502M36065J13394k28988Q5792
$$ -128623 -341524 -412128 -326801 -228912 -349616 -219114 216951 330345 101357 187149
13724A87149J49675k74909J83404n40k35342p3864J60184L03552j72702k01981
$$ 187149 336824 61915 245319 244779 9437 -64427 95757 399309 226607 24626
13714B4626K01192o0092K31056n0053k47250j24085l02468m32728L72360J43399
$$ 24626 225818 165726 396782 346729 99479 -24606 -327074 -759802 -387442 -244043
13704b44043r4302J01090p8848L22910L82549k52390k53382K14690j95492j88479
$$ -244043 -338345 -237255 -316103 6807 389356 136966 -116416 98274 -97218 -285697
13694b85697L24711r006m0193m1015q331J28161L60333K38991j88567l18009P1413
$$ -285697 39014 30008 -10185 -51200 -59531 68630 428963 667954 479387 161378 232791
13683B32791K60361l98921k16201j24691N2244O9949J35942J28994M033r5428
$$ 232791 493152 94231 -121970 -246661 -194417 -124468 11474 140468 144501 49073
13673D9073m8055J6008J37516J6033k33236J73202J13379j04787P3287O2405k32353
$$ 49073 1018 17026 154542 170575 -62661 110541 223920 119133 192420 254825 22472
13662B2472J10347n7214K9898J11140m6879j06400k07958J41107j48628k57200
$$ 22472 132819 75605 105503 216643 169764 63364 -144594 -3487 -152115 -409315
13652d09315K22924J84016j30821P676L54190M26896J2089j74433j60162j9147
$$ -409315 -186391 -2375 -133196 -125520 228670 655566 667655 493222 333060 313913
13642C13913J51532k38806l86445k41148M12795J52820r7202J41375P1822o0835
$$ 313913 465445 226639 -159806 -400954 11841 164661 67459 208834 280656 219821
13632B19821l36721k71394Q6033J05329J77788o7938k7033J29025m01675l95425
$$ 219821 -116900 -388294 -302261 -196932 -19144 -87082 -114115 14910 -386765 -782190
13622g82190J91758L37660L28844K41191k58995j32010R9077K5389k91193r8365
$$ -782190 -590432 -252772 76072 317263 58268 -73742 25335 50724 -240469 -338834
13612c38834l8584k5541J61077m062K91074J46833O66963j43m23997k09700o9290
$$ -338834 -377418 -402959 -241882 -245944 45130 191963 858926 858783 434786 225086 155796
13601A55796N8334J50129N3780j2611K23490K37638O8225j42121m1945k52434
$$ 155796 214130 364259 418039 405428 628918 866556 934781 792660 750715 498281
13591D98281l70409k29047P425o4706L36253K6236j29392M0768N52878l51778
$$ 498281 127872 -101175 -93750 -158456 177797 204033 74641 115409 668287 316509
13581C16509n50960j82012R9633k5796l8415q1279R1644K71221J54370R2523L9359
$$ 316509 -234451 -416463 -316830 -342626 -381041 -462320 -370676 -99455 54915 147438 186797
13570A86797n8718k8295K95600j4026l75146m04495k6956K95335M8018O9268K3942
$$ 186797 128079 99784 395384 381358 6212 -398283 -425239 -129904 -81886 -12618 11324
13559A1324J33423J32101j49068k26240q9850M90216K16824n1286k78616P0277
$$ 11324 144747 276848 127780 -98460 -188310 301906 518730 467444 188828 259105
13549B59105J40046j15511k50089j43028k60695j27194Q5974J29317j27515J93221
$$ 259105 399151 283640 33551 -109477 -370172 -497366 -411392 -282075 -409590 -216369
13539b16369N300J18105J21972j66400L66080J82328J41106j27665o22977L4928
$$ -216369 -211069 -92964 29008 -137392 228688 411016 552122 424457 -198520 -163592
13529a63592L69502K32248k37946j82641j96514n9787J8186o4366j5721J29738
$$ -163592 205910 438158 200212 17571 -178943 -238730 -220544 -284910 -300631 -170893
13519a70893r4756m928J28305J14411M1144j44769k08690r3929j86288J44663
$$ -170893 -265649 -270577 -142272 -27861 13283 -131486 -340176 -434105 -620393 -475730
13509d75730l4750J69966L94696N17225j90570k35412k2356R0769J87063j40425
$$ -475730 -510480 -340514 54182 571407 380837 145425 123069 213838 400901 260476
13499B60476q2547K1017r0628l5060J61001l19419j23319L4645J57457K9167J13997
$$ 260476 177929 198946 108318 73258 234259 -85160 -208479 -173834 -16377 12790 126787
13488A26787Q205Q5133p0586R5273K42103j69925j53099L1095l43595k93309L62814
$$ 126787 134992 220125 149539 244812 486915 316990 163891 194986 -148609 -441918 -79104
13477g9104M7326J26600o4285L495j72780j64889L37085j00089m7201k1602N8751
$$ -79104 -31778 94822 30537 34032 -138748 -303637 33448 -66641 -113842 -135444 -76693
13466g6693J42412q2044q9844j27168j31650m2069O9537p3890Q7425K23266K74257
$$ -76693 65719 -16325 -106169 -233337 -364987 -407056 -337519 -411409 -323984 -100718 173539
13455A73539l54926j49294l02717J92079L39332j93835J73822K13308M02282o1159
$$ 173539 -181387 -330681 -633398 -441319 -101987 -295822 -122000 91308 493590 432431
13445D32431J48359k03248j80594j91825K34550J67883K83957l66418r9849J1315
$$ 432431 580790 377542 196948 5123 239673 407556 691513 325095 225246 236561
13435B36561m4308l4377j86189M2537J1726J56468J34806K09384n9889k07036
$$ 236561 192253 157876 -28313 14224 25950 182418 317224 526608 466719 259683
13425B59683l71242j65766K34645M00883q9055j22172k89782l02114N84p7826
$$ 259683 -111559 -277325 -42680 358203 269148 146976 -142806 -444920 -444336 -522162
13415e22162J36598L56111K43082J66612m1994k54570M2343J81559p6090j04431
$$ -522162 -385564 -29453 213629 380241 338247 83677 126020 307579 231489 127058
13405A27058r7907N625p0663J4814K75302p1399k2723j47444r477K39565j06797
$$ 127058 29151 34776 -35887 -21073 254229 182830 160107 12663 3186 242751 135954
13394A35954j67332J03470P0104k02612k67951Q8579k0347q93j65108R5979L33616
$$ 135954 -31378 72092 142196 -60416 -328367 -239788 -260135 -261028 -426136 -330157 3459
13383C459k31042l75485q448J57097K74244L42154j30106k6442m8375j08584J17767
$$ 3459 -227583 -603068 -611516 -454419 -180175 161979 31873 5431 -42944 -151528 -33761
13372c3761k47306o5772J41844O5629L17824O9778j27765j82920m31346J64148
$$ -33761 -281067 -346839 -204995 -139366 178458 248236 120471 -62449 -493795 -329647
13362c29647L78193P6581L8352j23725j20263J90991o0548J92922n3747m3870
$$ -329647 48546 125127 163479 39754 -80509 110482 49934 242856 189109 145239
13352A45239j27248j50569K5726P0085J42462K6410J55459k60585l71332p5389
$$ 145239 17991 -132578 -106852 -36767 105695 132105 287564 26979 -344353 -419742
13342d19742k20870K93155K40166J13988K97710n7619j10188k15418j24831L05812
$$ -419742 -640612 -347457 -107291 6697 304407 246788 136600 -78818 -203649 102163
13332A02163O5297O2094o6245O2643k22529m61507o1050J61876K10679L30946
$$ 102163 167460 229554 163309 225952 3423 -458084 -519134 -357258 -146579 184367
13322A84367r4022l55460j32624J98707J26618j48200J52723K23236j59575k52427
$$ 184367 90345 -265115 -397739 -199032 -72414 -220614 -67891 155345 -4230 -256657
13312b56657L7064j2966j0443n0454j32574J46194J08233M6174K63076l01443
$$ -256657 -219593 -232559 -243002 -293456 -426030 -279836 -171603 -125429 137647 -163796
13302a63796r2932K49957L32780p6095k55680R3841J69754j15003J94480k00058
$$ -163796 -256728 -6771 326009 249914 -5766 88075 257829 142826 337306 137248
13292A37248m51530R6204L61546J14394p0708M6331j45538m92178J39222K10437
$$ 137248 -314282 -218078 143468 257862 187154 233485 87947 -404231 -265009 -54572
13282e4572j06511N943J65299M76017O6501j86730K1048p2758Q4449r4623o8706
$$ -54572 -161083 -155140 10159 486176 552677 365947 386995 314237 398686 304063 235357
13271B35357J05039K78782P960l62119l16824N5718K10036k54154J24548K04017
$$ 235357 340396 619178 627138 265019 -51805 3913 213949 -40205 84343 288360
13261B88360j69951k20319j69847K8396K37578J81577P4383k4384L7152j74243
$$ 288360 118409 -101910 -271757 -243361 -5783 175794 250177 225793 262945 88702
13251H8702Q9789M0586k71616k74628j24932R0021J86570L42296J67800j5004
$$ 88702 178491 219077 -52539 -327167 -452099 -362078 -175508 166788 334588 319584
13241C19584O5971K29380k74962k10972L4794K32207j34889k57928J74339m44278
$$ 319584 385555 614935 339973 129001 163795 396002 261113 3185 177524 -266754
13231b66754Q3450L62278Q5603j16967m19076j47966J7210l4421J42898L28789
$$ -266754 -183304 178974 264577 147610 -271466 -419432 -402222 -436643 -293745 35044
13221C5044j18294R9293K60921j98493J27339J24494L2702K29768K09426l84697
$$ 35044 -83250 16043 276964 78471 205810 330304 363006 592774 802200 417503
13211D17503m35668j04794K42061J15082J45101M480j45538J26782L59082m0858
$$ 417503 -18165 -122959 119102 234184 379285 383765 238227 365009 724091 683233
13201F83233j71229k09664J34498N1225l2215J08806m27008J32681J68689M2562
$$ 683233 512004 302340 436838 488063 455848 564654 137646 270327 439016 481578
13191D81578j33163P6123r4120J33514j20132L35570J867l75757l64792j54978
$$ 481578 348415 424538 330418 463932 343800 679370 681237 305480 -59312 -214290
13181b14290m04508P496N4723K81351K51194j55187M3111N6938M13022p357J57337
$$ -214290 -618798 -611302 -556579 -275228 -24034 -179221 -136110 -79172 333850 326493 483830
13170D83830o0743m6315m5746k134J073J36835J50779P6805l13862m40207j75460
$$ 483830 423087 376772 331026 328892 329965 466800 617579 694384 380522 -59685 -235145
13159b35145o9523K04076L98874L77813J11865J38133k51413j71194j49247j27157
$$ -235145 -304668 -100592 298282 676095 787960 926093 674680 503486 354239 227082
13149B27082L21280J61172j1965n2887J32862J11330R835l33124k18702P4233
$$ 227082 548362 709534 697569 644682 777544 888874 898709 565585 346883 421116
13139D21116j39255J3861M7071m59228P3111K61207j18316O1658K34717J23896
$$ 421116 281861 295722 342793 -116435 -43324 217883 99567 161225 395942 519838
13129E19838j61878J33214r1563K3761K9004m57897j53183j223L8242L66276J26883
$$ 519838 357960 491174 399611 423372 452376 -5521 -158704 -159927 -121685 244591 371474
13118C71474R8746n1660k13789L9167k5506J76641R7274P7680j46068j5621k35444
$$ 371474 470220 418560 204771 243938 218432 395073 492347 570027 423959 408338 172894
13107A72894j39248J81952O7284j31162j01322L87118l47l24996o6637L47523
$$ 172894 33646 215598 282882 151720 50398 437516 437169 112173 45536 393059
13097C93059J65944r8009L8625l16184q2483O8656K3565J04474J77668K10547
$$ 393059 559003 460994 499619 183435 100952 169608 193173 297647 475315 685862
13087F85862l08626m07425n2342J76183K91708K85501M17719l84127m56058P1751
$$ 685862 377236 -30189 -82531 93652 385360 670861 1088580 704453 248395 320146
13077C20146K13185J02106j95938j13363L09008q1213k22999n4741J93501k21827
$$ 320146 533331 635437 439499 326136 635144 553931 330932 276191 469692 247865
13067B47865J75921J63470j11366J02992j43957k76649k38936j00539K84257j07138
$$ 247865 423786 587256 475890 578882 434925 158276 -80660 -181199 103058 -4080
13057d080j9022L85825K89755l89701n17311J57709L46903K16271l67940K0162
$$ -4080 -23102 362723 652478 262777 -254534 -96825 250078 466349 98409 118571
13047A18571K57708l203j62318J82658j22046k78552R0110j60043l1259K06440
$$ 118571 376279 373076 210758 393416 271370 -7182 82928 -77115 -108374 98066
13037I8066L54985K88423K98131K42206j52689j17349j87995R3180K49258O7027
$$ 98066 453051 741474 1039605 1281811 1129122 1011773 823778 916958 1166216 1233243
13027A233243J16112N38239K31006j60830m18573m34081j59462l95544k35259
$$ 1233243 1349355 1887594 2118600 1957770 1539197 1105116 945654 550110 314851
13018C14851K37916K91901k72628k44723l289R4026r5567P6398j00303j0992J75638
$$ 314851 552767 844668 572040 327317 324028 418054 322487 398885 298582 287590 463228
13007D63228J82942J67575k07937m1900o600j58576l30773N2879K0022M64813
$$ 463228 646170 813745 605808 563908 557308 398732 67959 120838 140860 605673
12997F05673J58138k10449j29532k02917P1016J09342j27279k5567j50663j33333
$$ 605673 763811 553362 423830 220913 291929 401271 273992 248425 97762 -35571
12987c5571L72788M46563K02379r910r3695J85364J06485M88060R242K7982j85924
$$ -35571 337217 783780 986159 976249 882554 1067918 1174403 1662463 1671705 1699687 1513763
12976A513763n62405j55562J25223J21409J15384J69605l08270k17480J94890
$$ 1513763 951358 795796 921019 1042428 1157812 1327417 1019147 801667 996557
12967I96557m9217k62314n29109J70918O5947M4786O3240Q1230j25045o4256p037
$$ 996557 947340 685026 155917 326835 392782 437568 500808 582038 456993 392737 385700
12956C85700L767l09497J53963K73724j3215j86212J42251J98710m3683p5081
$$ 385700 389467 79970 233933 507657 494442 308230 450481 649191 605508 530427
12946E30427L2305j38867N6952J37046j28636J04288R4157J13922l27238r4754
$$ 530427 562732 423865 480817 617863 489227 593515 687672 801594 474356 379602
12936C79602L34406K0713k31442K9254L4533j7202J65541k06061l64938L4123
$$ 379602 714008 734721 503279 532533 567066 549864 715405 509344 144406 178529
12926A78529K84113J30055m9562Q5669k45255n7561k92223J44617L90825j61333
$$ 178529 462642 592697 543135 628804 383549 325988 33765 178382 569207 407874
12916D07874k28968J0228O4218K16402j05780p9681j01559M700Q4219N0482J07839
$$ 407874 178906 189134 253352 469754 363974 284293 182734 187434 271653 322135 429974
12905D29974r3412J9344L18452K12563L30735K4873k04313j42829l39896k51922
$$ 429974 336562 355906 674358 886921 1217656 1242529 1038216 895387 555491 303569
12895C03569l72540J80889j18719j31379r1969R3480N3191K22782J93233J48004
$$ 303569 -68971 111918 -6801 -138180 -230149 -136669 -83478 139304 332537 480541
12885D80541j20646Q854r5380l30481R4495R1622J97934K24642l0444Q3730k24852
$$ 480541 359895 368749 273369 -57112 37383 129005 326939 551581 521137 604867 380015
12874C80015n05853j11412N24514M00965M3236O2789P8282O1071k07623k90260
$$ 380015 -125838 -237250 287264 688229 731465 794254 872536 933607 725984 435724
12864D35724J71356J23912m49862k87519r552K65159j30164J97899L21177l8626
$$ 435724 607080 730992 281130 -6389 -15941 249218 119054 316953 638130 599504
12854E99504K2893j29567J716L04786k59988j43590K13175J52921J18986j67512
$$ 599504 622397 492830 494546 799332 539344 395754 608929 761850 880836 713324
12844G13324J5646Q8743k09215p9325l69899m24155J28445M49727K92216k69886
$$ 713324 728970 817713 608498 529173 159274 -264881 -136436 313291 605507 335621
12834C35621m4420J79876K77056Q2350J49314L42878K09698j64695l06034l07710
$$ 335621 291201 471077 748133 830483 979797 1322675 1532373 1367678 1061644 753934
12824G53934j03396O8836l54807r5121K04408K93175L74071L66711k00132l03131
$$ 753934 650538 719374 364567 269446 473854 767029 1141100 1507811 1307679 1004548
12814A004548K66085r414l82794l98172m5965O1197M0324l1839n4406k82177p5793
$$ 1004548 1270633 1261219 878425 480253 434288 495485 535809 503970 449564 167387 91594
12803I1594K25697j9149j32713J33060P18221K62306R3015j10499r5818P5225
$$ 91594 317291 298142 165429 298489 1016710 1279016 1372031 1261532 1165714 1240939
12793A240939J99611m3723J10621J04730N30622M28666j76621l40750l99248K10793
$$ 1240939 1440550 1396827 1507448 1612178 2142800 2571466 2394845 2054095 1654847 1865640
12783A865640J42029p66315k45833l00808k78289J36970J04259J1455J72347J7773
$$ 1865640 2007669 1241354 995521 694713 416424 553394 657653 669108 841455 859228
12773H59228k15840J39837r533j99228j60185q6511k88466K93164L1512j50777
$$ 859228 643388 783225 773692 574464 414279 327768 39302 332466 363978 213201
12763B13201K0731K24241k04753r327P3426K31936P0377J99993k66280P4616o7292
$$ 213201 233932 458173 253420 244093 317519 549455 619832 819825 553545 628161 560869
12752E60869q553k68075m9785L29654K1793j7212j97279J30464J512j2105L27055
$$ 560869 552316 284241 234456 564110 585903 568691 371412 501876 503388 491283 818338
12741H18338L39524L4033j68884n85540k21579p6912K71328J87724l1605J84021
$$ 818338 1157862 1191895 1023011 437471 215892 138980 410308 598032 566427 750448
12731G50448R3337k96677j13437j42352j83586j40632L00848L67881K8716j26172
$$ 750448 843785 547108 433671 291319 107733 -32899 267949 635830 664546 538374
12721E38374R0418N6331K06416j32123l41480j37570j72361L62341J31358J42106
$$ 538374 628792 685123 891539 759416 417936 280366 108005 470346 601704 743810
12711G43810j64462Q9582J69249L24859P5647l5136k33539j70376k95588k27899
$$ 743810 579348 668930 838179 1163038 1238685 1203549 970010 799634 504046 276147
12701B76147l3500L65748K08964k14532K45033O9544l38441J26498j73683j10703
$$ 276147 242647 608395 817359 602827 847860 917404 578963 705461 531778 421075
12691D21075J26578J86145K04817K15756J65731N2000k52156k84744J05209J89343
$$ 421075 547653 733798 938615 1154371 1320102 1372102 1119946 835202 940411 1129754
12681A129754j58153J09728R3616q2744n4257j7333m6233n5293n1839j81829k68358
$$ 1129754 971601 1081329 1174945 1092201 1037944 1020611 974378 919085 867246 685417 417059
12670D17059j49148K92793J06637r9925L45968q769j91224K20333J80768K17668
$$ 417059 267911 560704 667341 567416 913384 904615 713391 933724 1114492 1332160
12660A332160j02751j59661k41679k78056P0304J26239K18132j34757j91998K00627
$$ 1332160 1229409 1069748 828069 550013 620317 746556 964688 829931 637933 838560
12650H38560J56160N1141k2414K15387L8698k11914k26057R2206J92309K3636
$$ 838560 994720 1045861 1023447 1238834 1277532 1065618 839561 931767 1124076 1147712
12640A147712l75920m47623k0311L38928K26490p9103K8801J45568J46139K11797
$$ 1147712 771792 324169 303858 642786 869276 790173 818974 964542 1110681 1322478
12630A322478J20808l14629L4790J39398p751n0394k58610j79333n145M0685r84
$$ 1322478 1443286 1128657 1163447 1302845 1295094 1244700 986090 806757 801612 842297 841313
12619H41313P554K90239l0806m1866P8987J38554N760q3379M2811m7295k347L46340
$$ 841313 848867 1139106 1108300 1066434 1145421 1283975 1289735 1206356 1249167 1201872 1199525 1545865
12607A545865L4389l05916l9482k51220n88689J29670M28735K26444J74720j16907
$$ 1545865 1580254 1274338 1234856 983636 394947 524617 953352 1179796 1354516 1237609
12597A237609r6019J72220K3345j12668L46223K84041j67505j84225k36780K1670
$$ 1237609 1141590 1313810 1337155 1224487 1570710 1854751 1687246 1503021 1266241 1287911
12587A287911j564j44298k7437L7566K63954l5318J92255k03962r7143J3247n7362
$$ 1287911 1286347 1142049 1114612 1152178 1416132 1380814 1573069 1369107 1271964 1285211 1227849
12576A227849j09583M75561l1965l85931l24137O349k0558l52082j2760J79795
$$ 1227849 1118266 1593827 1561862 1175931 851794 858143 837585 485503 472743 652538
12566F52538J4053K08415K02117M18629n2393l59502l28861q8488K10010J17152
$$ 652538 666591 875006 1077123 1495752 1443359 1083857 754996 666508 876518 993670
12556I93670M00482O1711l57943k87551j46784K8338K18423K80634L40583L8111
$$ 993670 1394152 1455863 1097920 810369 663585 691923 910346 1190980 1531563 1569674
12546A569674j64535j87719J2841K30235P506q0712K37621j57200n2349K4526
$$ 1569674 1405139 1217420 1230261 1460496 1468002 1387290 1624911 1467711 1415362 1439888
12536A439888L48061N6778j24626l78529J34294m9892j75586K2446K30627R7475
$$ 1439888 1787949 1844727 1720101 1341572 1475866 1425974 1250388 1272834 1503461 1600936
12526A600936k52769l49609j78622P422p3159K06915J58521L89391L84219M8925
$$ 1600936 1348167 998558 819936 827358 754199 961114 1119635 1509026 1893245 1942170
12516A942170l50097J31641K66722l04001j57374k98888m7335R1679n9551j00705
$$ 1942170 1592073 1723714 1990436 1686435 1529061 1230173 1182838 1274517 1214966 1114261
12506A114261k1716J48813K05391l592R3761j66704J40584J41113j79777R8562
$$ 1114261 1092545 1241358 1446749 1443157 1536918 1370214 1510798 1651911 1472134 1570696
12496A570696K22245K636l4283j00114k39091m8378J14851J6138P4562l0856l10407
$$ 1570696 1792941 1795577 1761294 1661180 1422089 1373711 1488562 1504700 1579262 1548406 1237999
12485A237999J55542M02166M9158o0847m3599J30710K63341J80399K8067k94055
$$ 1237999 1393541 1795707 1844865 1784018 1740419 1871129 2134470 2314869 2342936 2048881
12475B048881k60068k80315o6053J37033K28009j34564j21526J16958L06031j67101
$$ 2048881 1788813 1508498 1442445 1579478 1807487 1672923 1551397 1668355 1974386 1807285
12465A807285l15240j31971p9711Q9692K26147K71285K009j05506R7714n5176
$$ 1807285 1492045 1360074 1280363 1370055 1596202 1867487 1869496 1763990 1861704 1806528
12455A806528P4708N22090k30377r2943Q1240j75287j50509j46383j31971n9480
$$ 1806528 1881236 2403326 2172949 2080006 2161246 1985959 1835450 1689067 1557096 1497616
12445A497616J94389K74317r7515n6709J17349J35283Q2974R9692K48805l61912
$$ 1497616 1692005 1966322 1868807 1812098 1929447 2064730 2147704 2247396 2496201 2134289
12435B134289k62317j4394k68707o6579m5081k21125j1732K16604n1488K34662
$$ 2134289 1871972 1857578 1588871 1522292 1477211 1256086 1244354 1460958 1409470 1644132
12425A644132L88176q3134k33062O9091M3483J84691k900m59156L74952K16854
$$ 1644132 2032308 1949174 1716112 1785203 1828686 2013377 2010477 1551321 1926273 2143127
12415B143127J00011j85709j16230J32358K91761J61539L05960j15747o2077m17669
$$ 2143127 2243138 2057429 1941199 2073557 2365318 2526857 2832817 2717070 2654993 2237324
12405B237324R9435J65380j10827m07648R4580q9291P1550K84952j86142J03414
$$ 2237324 2336759 2502139 2391312 1983664 2078244 1988953 2060503 2345455 2159313 2262727
12395B262727M08020l70951l98860l80377j72219M79405L87415O4760j11282n6335
$$ 2262727 2670747 2299796 1900936 1520559 1348340 1827745 2215160 2279920 2168638 2112303
12385B112303J18010J44747J52403m17962k08071j05128n3952M54613J90348R7389
$$ 2112303 2230313 2375060 2527463 2109501 1901430 1796302 1742350 2196963 2387311 2484700
12375B484700P723l86706m9156J12361J58224J66897K77153j91791j69621k1379
$$ 2484700 2492423 2105717 2056561 2168922 2327146 2494043 2771196 2579405 2409784 2388405
12365B388405l8990J28830Q4291L56247R9818j26216p0275m4749M2113R3754L06719
$$ 2388405 2349415 2478245 2562536 2918783 3018601 2892385 2822110 2777361 2819474 2913228 3219947
12354C219947K35384n1526k7748l05496J5555O868j2498k37042k30969l23552
$$ 3219947 3455331 3403805 3376057 3070561 3086116 3092984 3080486 2843444 2612475 2288923
12344B288923P818J06139R1205J36585K13828P398j27488j1362J42913j66153
$$ 2288923 2296741 2402880 2494085 2630670 2844498 2851896 2724408 2713046 2855959 2689806
12334B689806j70040M052K01333k5572K36711J17219M0019O9152J2656J48788
$$ 2689806 2519766 2523818 2725151 2699579 2936290 3053509 3093528 3162680 3175336 3324124
12324C324124Q9055k1308l48525L8514J50606j22532j41897j03697J98530k26160
$$ 3324124 3413179 3391871 3043346 3081860 3232466 3109934 2968037 2864340 3062870 2836710
12314B836710j54822p9056J50242K38228M89013j6581N2163M2184K16555p2608
$$ 2836710 2681888 2602832 2753074 2991302 3480315 3463734 3515897 3558081 3774636 3702028
12304C702028j5717q2165q1918p4222P5494O6116M1860l29884k87287L90634K09185
$$ 3702028 3686311 3604146 3522228 3448006 3523500 3589616 3631476 3301592 3014305 3404939 3614124
12293C614124O1579m48042k71984R112M34216J35402Q1778N3926n1861K12342
$$ 3614124 3675703 3227661 2955677 2964789 3399005 3534407 3616185 3670111 3618250 3830592
12283C830592L1058l00228j69556L35708K82209R1490J21602n92979j44950K20760
$$ 3830592 3861650 3561422 3391866 3727574 4009783 4101273 4222875 3629896 3484946 3705706
12273C705706L14887L04191N0148J10789k7953l4773k30464j57872J08741j93334
$$ 3705706 4020593 4324784 4374932 4485721 4457768 4422995 4192531 4034659 4143400 3950066
12263C950066K0100K69375M87712N5435j27322K66894n4981j37053k8255O7665
$$ 3950066 3970166 4239541 4727253 4782688 4655366 4922260 4867279 4730226 4701971 4769636
12253D769636l28105k66163M7618n1594o2836K36658M5788r2523J65781N49404
$$ 4769636 4441531 4175368 4222986 4171392 4108556 4345214 4391002 4298479 4464260 5013664
12243E013664L58414n7037j13669K9073J64754J25233j54898k26553m01109K2409
$$ 5013664 5372078 5315041 5201372 5230445 5395199 5520432 5365534 5138981 4737872 4760281
12233D760281K70775L18712K28000k92109l47168k97985R7404M49456R084l19291
$$ 4760281 5031056 5349768 5577768 5285659 4938491 4640506 4737910 5187366 5196450 4877159
12223D877159k54920K98845L57274R3796P9309J53848Q330J45833K34989J37610
$$ 4877159 4622239 4921084 5278358 5372154 5451463 5605311 5613641 5759474 5994463 6132073
12213F132073J85680l74847l93461L6011L27701K53681k9250l60339J94199K07713
$$ 6132073 6317753 5942906 5549445 5585456 5913157 6166838 6137588 5777249 5971448 6179161
12203F179161J60522l4371j91830J52506K65486L05739q3859j31471j03001j87383
$$ 6179161 6339683 6305312 6113482 6265988 6531474 6837213 6753354 6621883 6518882 6331499
12193F331499l7884L87678L40175k45333o8506K98978K3101J35010L9387j96569
$$ 6331499 6293615 6681293 7021468 6776135 6707629 7006607 7029708 7164718 7204105 7007536
12183G007536j26056L5190J378J81343j35959l2754M32348J13498Q9993Q0476
$$ 7007536 6881480 6916670 6918048 7099391 6963432 6930678 7363026 7476524 7566517 7646993
12173G646993k9736J73942K49043K45033j1749j06152K8609k63266L83183J20793
$$ 7646993 7617257 7791199 8040242 8285275 8273526 8167374 8195983 7932717 8315900 8436693
12163H436693J39142r7491K30008J22747j29943P2199K24927L7976K60880J55086
$$ 8436693 8575835 8478344 8708352 8831099 8701156 8773355 8998282 9036258 9297138 9452224
12153I452224m24186k42482j19782M18367L84606R3676l40317L1077J31849L60839
$$ 9452224 9028038 8785556 8665774 9084141 9468747 9562423 9222106 9253183 9385032 9745871
12143I745871N42055Q2618j82107j83118J96260L3310m0051K94056k35663k75422
$$ 9745871 10287926 10370544 10188437 10005319 10201579 10234889 10194838 10488894 10253231 9977809
12133I977809J63938J29023M04333M62298K7251k03118j24390J52308J92981j2589
$$ 9977809 10141747 10270770 10675103 11137401 11164652 10961534 10837144 10989452 11182433 11169844
12123A1169844J45943K5864J18497K81155J36802K56633K03458p7512J61641J25942
$$ 11169844 11315787 11341651 11460148 11741303 11878105 12134738 12338196 12260684 12422325 12548267
12113A2548267n6407L6909K23702M0667m8743R6566q124M696K96213Q9746M3263
$$ 12548267 12491860 12528769 12752471 12793138 12744395 12840961 12832837 12837533 13133746 13223492 13266755
12102A3266755J5011k7820M2173k0863O5334J23407M29405N19625O3864l06702
$$ 13266755 13281766 13253946 13296119 13275256 13340590 13463997 13893402 14413027 14476891 14170189
12092A4170189J0940K0128J51694P23901O17121K79572J65804j87675l450J15701
$$ 14170189 14181129 14201257 14352951 15076852 15693973 15973545 16139349 15951674 15948224 16063925
12082A6063925K08446J35243m8478J09514N77938L23430q067J67378K08590J60746
$$ 16063925 16272371 16407614 16359136 16468650 17046588 17370018 17361951 17529329 17737919 17898665
12072A7898665M97611K03953k08888j7490J24642J27997K76543M12019K87390
$$ 17898665 18396276 18600229 18391341 18373851 18498493 18626490 18903033 19315052 19602442
12063A9602442J07050J66350J89785L94970K33065n0215j48289n9980L19992Q82729
$$ 19602442 19709492 19875842 20065627 20460597 20693662 20643447 20495158 20435178 20755170 21637899
12053B1637899L04003M35180J98758r3572k67735L35470O90650K50552j1117K78592
$$ 21637899 21941902 22377082 22575840 22482268 22214533 22550003 23240653 23491205 23480088 23758680
12043B3758680O64288M98948Q4485J24445K64686R5084K83399L44498L13099N06629
$$ 23758680 24422968 24921916 25006401 25130846 25395532 25490616 25774015 26118513 26431612 26938241
12033B6938241J58258j43475J71234L65112K5501M65919P12226O40354J8729j17775
$$ 26938241 27096499 26953024 27124258 27489370 27514871 27980790 28693016 29333370 29352099 29234324
12023B9234324L21099J65342J65872K08821M21617P48212N83700M72286K59672
$$ 29234324 29555423 29720765 29886637 30095458 30517075 31265287 31848987 32321273 32580945
12014C2580945N1867N5037L04305N41034N78422J28586K89620M09003P50645N40340
$$ 32580945 32632812 32687849 32992154 33533188 34111610 34240196 34529816 34938819 35689464 36229804
12004C6229804M17666O43961O09772J10392k9958L25651N28679N53695O22525
$$ 36229804 36647470 37291431 37901203 38011595 37981637 38307288 38835967 39389662 40012187
11995D0012187M10416K24063P8191K17292M21845N77339L52052O71594P01572
$$ 40012187 40422603 40646666 40724857 40942149 41363994 41941333 42293385 42964979 43666551
11986D3666551L80699K35635L53874P41429M17815N90693M10171J90613L70019
$$ 43666551 44047250 44282885 44636759 45378188 45796003 46386696 46796867 46987480 47357499
11977D7357499l0736L67784M62106O20123M07033M78632M73620K09058L59954
$$ 47357499 47326763 47694547 48156653 48776776 49183809 49662441 50136061 50345119 50705073
11968E0705073N42433K08141J60375P69848N76510P6591M57814M07620K68486
$$ 50705073 51247506 51455647 51616022 52385870 52962380 53038971 53496785 53904405 54172891
11959E4172891N86653L66297N36778L22647J91472K57159L24444L02263J36108
$$ 54172891 54759544 55125841 55662619 55985266 56176738 56433897 56758341 57060604 57196712
11950E7196712L96745R06346M62143k65508m5972J56331P048J74969M20759L44199
$$ 57196712 57593457 58499803 58961946 58696438 58650466 58806797 58813845 58988814 59409573 59753772
11940E9753772K00468K86530L3184J16477n2658J46374L17427M15641r6039l06445
$$ 59753772 59954240 60240770 60273954 60390431 60337773 60484147 60801574 61217215 61121176 60814731
11930F0814731j38313K29620M13463k4752k42775K15908k1624k89109n9336o4289
$$ 60814731 60676418 60906038 61319501 61294749 61051974 61267882 61246258 60957149 60897813 60833524
11920F0833524m76213k3821L02542J16354j89926k46229k83056j38634l05852
$$ 60833524 60357311 60333490 60636032 60752386 60562460 60316231 60033175 59894541 59588689
11911E9588689J4021k27096l47556l21209o6156k93805q24179l68561p6794k49810
$$ 59588689 59602710 59375614 59028058 58706849 58640693 58346888 57522709 57154148 57077354 56827544
11901E6827544P1959J69056k72151r21356m28482m40055j75963j02873j4899k41089
$$ 56827544 56899503 57068559 56796408 55875052 55446570 55006515 54830552 54727679 54712780 54471691
11891E4471691k87160n66772m77436m65326m74237n86304k46431k91839l06303
$$ 54471691 54184531 53617759 53140323 52674997 52200760 51614456 51368025 51076186 50769883
11882E0769883n63106o08331n14329j83984q8049m87050k64493m45207o41014
$$ 50769883 50206777 49598446 49084117 48900133 48812084 48325034 48060541 47615334 46974320
11873D6974320l29044j00668n57689m76674m71748k19202l83532o49160l37573
$$ 46974320 46645276 46544608 45986919 45510245 45038497 44819295 44435763 43786603 43449030
11864D3449030n27675p30255l85095k33005l75114k93606r6652l83872l20005
$$ 43449030 42921355 42191100 41806005 41573000 41197886 40904280 40807628 40423756 40103751
11855D0103751J4078m88008m26789k31316m35807m87941o01148k42639l98710
$$ 40103751 40117829 39629821 39203032 38971716 38535909 38047968 37446820 37204181 36805471
11846C6805471k78589n23862n77616l57501l68574j34118n48353m72965l65723
$$ 36805471 36526882 36003020 35425404 35067903 34699329 34565211 34016858 33543893 33178170
11837C3178170n56473k32354l71064l96760l48732q5762l70702k47217o4136l04420
$$ 33178170 32621697 32389343 32018279 31621519 31272787 31187025 30816323 30569106 30504970 30200550
11827C0200550l59278j10584j08854n57019p58553n59476p4265P1009m43029k03444
$$ 30200550 29841272 29730688 29621834 29064815 28306262 27746786 27672521 27743530 27300501 27097057
11817B7097057o0612m17464J86329l36280l33824r2494o44614n71381m40481m59607
$$ 27097057 27036445 26618981 26805310 26469030 26135206 26042712 25398098 24826717 24386236 23926629
11807B3926629p1863k51278J74917j4386n27747j75818j35273O2082l52130k48160
$$ 23926629 23854766 23603488 23778405 23764019 23236272 23060454 22925181 22987263 22635133 22386973
11797B2386973j23501j57237m58725l80732m36578k99040k38621k56432j98210
$$ 22386973 22263472 22106235 21647510 21266778 20830200 20531160 20292539 20036107 19837897
11788A9837897J05563J77597J13234m48187n68368k15140k45051j94518K32664
$$ 19837897 19943460 20121057 20234291 19786104 19217736 19002596 18757545 18563027 18795691
11779A8795691J17459R0750k52166l69437k36962o9522l35831k34485l81733k48300
$$ 18795691 18913150 19003900 18751734 18382297 18145335 18075813 17739982 17505497 17123764 16875464
11769A6875464p5251j62447k14655k34810Q075J33249l5427R495j56326l54870
$$ 16875464 16800213 16637766 16423111 16188301 16196376 16329625 16294198 16303693 16147367 15792497
11759A5792497k64980p77082k04877L90418K50391k85689L6730j5086m76771n13769
$$ 15792497 15527517 14750435 14545558 14935976 15186367 14900678 14937408 14922322 14445551 13931782
11749A3931782P3840K01484r1252j32405p3919j15846l65471j3460j71438k20475
$$ 13931782 14005622 14207106 14115854 13983449 13909530 13793684 13428213 13414753 13243315 13022840
11739A3022840k38998j90273j19285P9677j65450l27195j77622J05352J47022
$$ 13022840 12783842 12593569 12474284 12553961 12388511 12061316 11883694 11989046 12136068
11730A2136068P1134L249J84138j0425j11495k69739j93022l40391q5234p3504
$$ 12136068 12207202 12210451 12394589 12384164 12272669 12002930 11809908 11469517 11384283 11310779
11720A1310779k10324q1516J77365k63677q1591j91598k08669O3967j75865k62067
$$ 11310779 11100455 11018939 11196304 10932627 10851036 10659438 10450769 10514736 10338871 10076804
11710A0076804L04351L42334j73850m14716k63095n07362j26700m3440M77790
$$ 10076804 10381155 10723489 10549639 10134923 9871828 9364466 9237766 9194326 9672116
11701I672116K85175j36550l43737j81358P9920L209L8548l55954o74499O0909
$$ 9672116 9957291 9820741 9477004 9295646 9375566 9378775 9417323 9061369 8386870 8447779
11691H447779O9847L4863K41085j54479J79696j69587l00381q624J45943k61743
$$ 8447779 8517626 8552489 8793574 8639095 8818791 8649204 8348823 8340199 8486142 8224399
11681H224399k12361k6640J54297q017J03769J15158j15832N8058j12098n15388
$$ 8224399 8012038 7985398 8139695 8131678 8235447 8350605 8234773 8292831 8180733 7665345
11671G665345j2661j6394k16295j02995J59449N8060K75265o0315j85869m50399
$$ 7665345 7652684 7636290 7419995 7317000 7476449 7534509 7809774 7749459 7563590 7113191
11661G113191L61320J75902j09112j85352j65550m00374k34914K34240R0477J10802
$$ 7113191 7474511 7650413 7541301 7355949 7190399 6790025 6555111 6789351 6879828 6990630
11651F990630k18260p1187j6618N4251l60953J0261J74948N9081m24194m95361
$$ 6990630 6772370 6701183 6684565 6738816 6377863 6388124 6563072 6622153 6197959 5702598
11641E702598j27965M43288K47955J8599j60254K27904p7355j39678j19896j08968
$$ 5702598 5574633 6017921 6265876 6284475 6124221 6352125 6274770 6135092 6015196 5906228
11631E906228J07671J21446J06069K1413k36805j45270j39556l58523k66982K42626
$$ 5906228 6013899 6135345 6241414 6262827 6026022 5880752 5741196 5382673 5115691 5358317
11621E358317p9486n8922j08445j11581L6908J40852o4215l91560q4780n9237
$$ 5358317 5278831 5219909 5111464 4999883 5036791 5177643 5113428 4721868 4637088 4577851
11611D577851m2179j38697k4144K55708J96950P8762j65985Q1369L73499k36595
$$ 4577851 4535672 4396975 4372831 4628539 4825489 4904251 4738266 4819635 5193134 4956539
11601D956539m9415j70845l04472j79934k36652L55604P06256Q4565l76898k26214
$$ 4956539 4907124 4736279 4431807 4251873 4015221 4370825 5077081 5161646 4784748 4558534
11591D558534m0350k80788m1478J82638M8339j19658J40868K37481l63605n45281
$$ 4558534 4518184 4237396 4195918 4378556 4426895 4307237 4448105 4685586 4321981 3776700
11581C776700N4519J41243j75286j38840K23180j00808l578J23088K89062K21606
$$ 3776700 3831219 3972462 3797176 3658336 3881516 3780708 3777130 3900218 4189280 4410886
11571D410886l5261k50683k0166K35338K68880J20014J66596k91508m96245j12269
$$ 4410886 4375625 4124942 4104776 4340114 4608994 4729008 4895604 4604096 4107851 3995582
11561C995582M0335q6694j46696M5286q3701M9860K16758P9096P211j3050m16900
$$ 3995582 4035917 3949223 3802527 3847813 3764112 3813972 4030730 4109826 4117037 4103987 3687087
11550C687087l14218q0619L03874o9761q7216o4415K53141J03710R7802k16380
$$ 3687087 3372869 3292250 3596124 3526363 3439147 3374732 3627873 3731583 3829385 3613005
11540C613005l53691J02579L86308J11715o6171K15851j54638J69572K84407k8427
$$ 3613005 3259314 3361893 3748201 3859916 3793745 4009596 3854958 4024530 4308937 4280510
11530D280510L11269n8628m77021l76987q1377J80347K7903j25302j52348j75293
$$ 4280510 4591779 4533151 4056130 3679143 3597766 3778113 3806016 3680714 3528366 3353073
11520C353073l44921J26454K48376p3366j03153o3361J49587J47050l16843k95743
$$ 3353073 3008152 3134606 3382982 3309616 3206463 3143102 3292689 3439739 3122896 2827153
11510B827153j01614M34226K096o9252N900j43267q9906J09910J24468n1763K78972
$$ 2827153 2725539 3159765 3161861 3092609 3098509 2955242 2865336 2975246 3099714 3047951 3326923
11499C326923K7526l44924j31571K33730J21243L944l61989j68549j10709o8279
$$ 3326923 3354449 3009525 2877954 3111684 3232927 3236871 2874882 2706333 2595624 2527345
11489B527345L97627L58625k01176j23391n3023j27749j12574j96416l71388o7089
$$ 2527345 2924972 3283597 3082421 2959030 2906007 2778258 2665684 2469268 2097880 2030791
11479B030791L79743K46214J25702K34891K22373q2291j28636j50354J85582P1252
$$ 2030791 2410534 2656748 2782450 3017341 3239714 3157423 3028787 2878433 3064015 3135267
11469C135267l56037m57995k1301J05071P6529K17860j73663l35146j9564m9204
$$ 3135267 2779230 2321235 2299934 2405005 2481534 2699394 2525731 2190585 2171021 2121817
11459B121817J51474n5258k46890J19828K26489K25803j74304l9866l9444l0780
$$ 2121817 2273291 2218033 1971143 2090971 2317460 2543263 2368959 2329093 2289649 2258869
11449B258869L2042j7126K8039J29977q9464j74830o6336R736P839O0481N8189
$$ 2258869 2290911 2273785 2301824 2431801 2342337 2167507 2101171 2110907 2118746 2179227 2237416
11438B237416J23404J44734r2376k10611l03853N2196j58135k81724J120N17984
$$ 2237416 2360820 2505554 2413178 2202567 1898714 1950910 1792775 1511051 1512171 2030155
11428B030155K72518J37212k08455n9702M5680K8926J31780n29857l13319p3888
$$ 2030155 2302673 2439885 2231430 2171728 2217408 2246334 2378114 1848257 1534938 1461050
11418A461050J9682J04167m4024j81289J59850K83816o9272k1770p4376k54536
$$ 1461050 1480732 1584899 1540875 1359586 1519436 1803252 1733980 1712210 1637834 1383298
11408A383298j12182J30925k0313j10077K92054J2055M336k1683P2977j55629
$$ 1383298 1271116 1402041 1381728 1271651 1563705 1575760 1580096 1558413 1631390 1475761
11398A475761k9097J4156J27116K09566k82137j99792L15002j90630M6074K47706
$$ 1475761 1446664 1460820 1587936 1797502 1515365 1315573 1630575 1439945 1486019 1733725
11388A733725K45989J34139l04795l20058p8051J04105J30803j90019j88781j68478
$$ 1733725 1979714 2113853 1809058 1489000 1410949 1515054 1645857 1455838 1267057 1098579
11378A098579K49098J73271P6666j02128K01855k6264K24972Q3852j75106R4667
$$ 1098579 1347677 1520948 1597614 1495486 1697341 1671077 1896049 1979901 1804795 1899462
11368A899462J24013k35375n6927j16144p7392j07961K9997J34556L19156k4588
$$ 1899462 2023475 1788100 1731173 1615029 1537637 1429676 1459673 1594229 1913385 1888797
11358A888797J80506l39373l38376k29412K02992M96206K11335k17059k85520
$$ 1888797 2069303 1729930 1391554 1162142 1365134 1861340 2072675 1855616 1570096
11349A570096j83703j00301m0756J45802J70354j05907m14373N7433M45309k75783
$$ 1570096 1386393 1286092 1245336 1391138 1561492 1455585 1041212 1098645 1543954 1268171
11339A268171j84577K48174P5184j68382l28268M2198M57701K04728K5534P5985
$$ 1268171 1083594 1331768 1406952 1238570 910302 952500 1410201 1614929 1640463 1716448
11329A716448j44477R6158J4773k04557j66280j45915j10331K19185L0950N5053
$$ 1716448 1571971 1668129 1682902 1478345 1312065 1166150 1055819 1275004 1305954 1361007
11319A361007K14596L0557j18208M5292P2742R3537j49840n90299l21521o3278
$$ 1361007 1575603 1606160 1487952 1533244 1605986 1699523 1549683 959384 637863 574585
11309E74585J56219J69897L64143M6762J32729l09291K1595R2826L1810O6178
$$ 574585 730804 900701 1264844 1311606 1444335 1135044 1156639 1249465 1281275 1347453
11299A347453M7650J25771J31624l5660l5371p4369l90070R1180J94074J72851
$$ 1347453 1395103 1520874 1652498 1616838 1581467 1507098 1117028 1208208 1402282 1575133
11289A575133l30342k31404K73135l20443M613J0238K3129K29265J91474j48198
$$ 1575133 1244791 1013387 1286522 966079 970692 980930 1004059 1233324 1424798 1276600
11279A276600N8014l13157j96789K02109K84901J06284N9270j72851n67173l24263
$$ 1276600 1334614 1021457 824668 1026777 1311678 1417962 1477232 1304381 737208 412945
11269D12945K6106J79818N4596j6754P7039M6029K6792L68750L20473j15612k68462
$$ 412945 439051 618869 673465 656711 733750 779779 806571 1175321 1495794 1380182 1111720
11258A111720k6981j52339o3461o221m8085k8098K3402K1120O255J41341j16386
$$ 1111720 1084739 932400 868939 862718 814633 786535 809937 831057 837312 978653 862267
11247H62267K17933K87347k42404j15948L3625P5291L0196L3900J68895j79542
$$ 862267 1080200 1367547 1125143 1009195 1042820 1118111 1148307 1182207 1351102 1171560
11237A171560k15193q0845J8362R5245n6982k34287J71970R4338l42027J90829
$$ 1171560 956367 875522 893884 989129 932147 697860 869830 964168 622141 812970
11227H12970J88148l62732k372K38099l2982j12173K94340r3944j01408p6268
$$ 812970 1001118 638386 636014 874113 841131 728958 1023298 929354 827946 751678
11217G51678p3487O2083J29291n9427k15120j5654J49024j32334K14813J39927
$$ 751678 678191 740274 869565 810138 595018 579364 728388 596054 810867 950794
11207I50794j66032j08981k1609j477r9599N3831K59755K13820q0764k57382n4197
$$ 950794 784762 675781 654172 652695 553096 606927 866682 1080502 999738 742356 688159
11196F88159L18010o032j28812j725q5309r3873k90550J14629J21755l42870k3613
$$ 688159 1006169 1000137 871325 869600 784291 690418 399868 514497 636252 293382 269769
11185B69769Q0890k44901N8041K51338J35868M3801K80730K20218j46936J40466
$$ 269769 350659 105758 163799 415137 551005 594806 875536 1095754 948818 1089284
11175A089284J41170k99791l52237N6653J85935L0743j83026M3742k22524m27618
$$ 1089284 1230454 930663 578426 635079 821014 851757 668731 712473 489949 62331
11165F2331L47239N47512j01312j63243j98942p0619Q5724j07431J42863Q8438
$$ 62331 409570 957082 855770 692527 493585 422966 508690 401259 544122 632560
11155F32560r7700j61959J25809J78625j38387J6870l6323K02979L05188j73650
$$ 632560 534860 372901 498710 677335 538948 555818 519495 722474 1027662 854012
11145H54012l68734l33138K37733K13981J08159K9965k08825k05992j04484k4142
$$ 854012 485278 152140 389873 603854 712013 741978 533153 327161 222677 198535
11135A98535O9595Q1953r1840k77271K22080K2726j09536J19452q9102N2227K01921
$$ 198535 268130 350083 258243 -19028 203052 225778 116242 235694 146592 198819 400740
11124D00740J74109j75628k26651K41782M31227l3187r0409m097O2556J44974
$$ 400740 574849 399221 172570 414352 845579 812392 721983 717886 780442 925416
11114I25416J21421l9712j69810J89061j10837N1184m5502m752K7350j1548n7665
$$ 925416 1046837 1007125 837315 1026376 915539 966723 921221 916469 943819 932271 874606
11103H74606l26239j59332p9651K54058L62131n1832k19927j3285K50443j59459
$$ 874606 548367 389035 309384 563442 925573 873741 653814 640529 890972 731513
11093G31513o4256J19473o4926J294J40501j88056k16029J49448m1150k02867
$$ 731513 667257 786730 721804 723098 863599 675543 459514 608962 567812 364945
11083C64945M20754M53206J43851n62799k10303j6721J25269M0242k04753L2962
$$ 364945 785699 1238905 1382756 819957 609654 592933 718202 758444 553691 586653
11073E86653L6751J41053l41012k6999K50801n5849k29911Q3919M8983m9447K65068
$$ 586653 623404 764457 423445 396446 647247 591398 361487 445406 494389 444942 710010
11062G10010M9364K0494j76142k01570K24866K65067q657j54820k54908J15105
$$ 710010 759374 779868 603726 402156 627022 892089 883432 728612 473704 588809
11052E88809l8505K48907N15267l9074k73749k73550r2584M58147j03347O4439
$$ 588809 550304 799211 1314478 1275404 1001655 728105 635521 1093668 990321 1054760
11042A054760K67575L86303L75716r3660k11781j52615Q5400K04911N471K77928
$$ 1054760 1322335 1708638 2084354 1990694 1778913 1626298 1711698 1916609 1922080 2200008
11032B200008N3243J48441k51838n2191j69876K81236K81293R0566N8237J4426
$$ 2200008 2253251 2401692 2149854 2097663 1927787 2209023 2490316 2580882 2639119 2653545
11022B653545K5248j65312l21840j79917j96591k02714l2902J39882r8812M3669
$$ 2653545 2678793 2513481 2191641 2011724 1815133 1612419 1579517 1719399 1620587 1664256
11012A664256K34773L48361j43404n3687L2908l06044k24708j21853j49697K23001
$$ 1664256 1899029 2247390 2103986 2050299 2083207 1777163 1552455 1430602 1280905 1503906
11002A503906o6563k54361J54135M00697j29728k69553j23560r5328k29215K00114
$$ 1503906 1437343 1182982 1337117 1737814 1608086 1338533 1214973 1119645 890430 1090544
10992A090544K20704K6621m10054k66824m41923j45372L22404L8613j6522J91851
$$ 1090544 1311248 1337869 927815 660991 219068 73696 396100 434713 418191 610042
10982F10042J52724N4044L3782J28246k34634M7603j611j50597j542J52059m6023
$$ 610042 762766 816810 850592 978838 744204 791807 790196 639599 638057 790116 744093
10971G44093J57457j00141k7806o0652l62054j17595K19161P7628k54716j89019
$$ 744093 901550 801409 773603 712951 350897 233302 452463 530091 275375 86356
10961H6356P0614N29568K83574P6352l1662l39526J06739m7576k4935j54310m36366
$$ 86356 156970 686538 970112 1046464 1014802 675276 782015 734439 709504 555194 118828
10950A18828j7415K10883J83585K93330K57927k21454k76956j9913K49724O9425
$$ 118828 101413 312296 495881 789211 1047138 825684 548728 528815 778539 847964
10940H47964k13841j65823q7728J36750j61560j80589k13390L45769P9733m0761
$$ 847964 634123 468300 380572 517322 355762 175173 -38217 307552 387285 346524
10930C46524K44835L98040J22986l73430R4227l23097o45149J04937L46959K01897
$$ 346524 591359 989399 1112385 738955 833182 510085 -135064 -30127 316832 518729
10920E18729M5984k96821j87566J06651J15030J14372L4692k45766l46293M92827
$$ 518729 564713 267892 80326 186977 302007 416379 451071 205305 -140988 351839
10910C51839p5641k43049J86820L26206M6189m19004m06688j94942K82039J21743
$$ 351839 276198 33149 219969 546175 592364 173360 -233328 -428270 -146231 -24488
10900b4488J02374j4606J66538L0579L31479M9739k90718k25110l7059O6689j24302
$$ -24488 77886 63280 229818 260397 591876 641615 350897 125787 88728 155417 31115
10889C1115J12154o7482K01945r8117j74723k88171O3187K96256K16241O3259
$$ 31115 143269 75787 277732 179615 4892 -283279 -220092 76164 292405 355664
10879C55664M8616K7263n0359j69000k91711J5815n0119j79429J79136K93935
$$ 355664 404280 431543 381184 212184 -79527 -63712 -113831 -293260 -114124 179811
10869A79811K90499j07581j65830l16954j16486K71911K14800J97237j37339l3197
$$ 179811 470310 362729 196899 -120055 -236541 35370 250170 447407 310068 276871
10859B76871J48505n08288j55072J64447K17818N747J29110L68195o3860o8578
$$ 276871 425376 -82912 -237984 -73537 144281 150028 279138 647333 583473 514895
10849E14895q3621j27131J78021l10030j7200K74728l8291k76744M2008M72280
$$ 514895 431274 304143 482164 172134 154934 429662 391371 114627 156635 628915
10839F28915j6524j96012k11989L8264j96892r2463M6685L3626J39324j10591
$$ 628915 612391 416379 204390 242654 45762 -46701 -16 33610 172934 62343
10829F2343K48201j36374k74443K3000J70762J6079n14924J28930J87155O1540
$$ 62343 310544 174170 -100273 -77273 93489 109568 -405356 -276426 -89271 -27731
10819b7731j32029K49633P0859k8876o4653J38309M26785m1760j66301j10315
$$ -27731 -159760 89873 160732 131856 67203 205512 632297 590537 424236 313921
10809C13921k09618K07511j45067j57582j89126J36070j1449j17806K68551n8379
$$ 313921 104303 311814 166747 9165 -179961 -43891 -55340 -173146 95405 37026
10799C7026j11982j96154L57026K10992m21314l55553j00462M10171P6996k3399
$$ 37026 -74956 -271110 85916 296908 -124406 -479959 -580421 -170250 -93254 -116653
10789a16653L49929K38240R3354J50691Q7997R4094J75499j68221k05737l7352
$$ -116653 233276 471516 564870 715561 803558 897652 1073151 904930 699193 661841
10779F61841M7880k04694j61644j1435K33752L99828K61362J45716L19628M22477
$$ 661841 709721 505027 343383 331948 565700 965528 1226890 1372606 1692234 2114711
10769B114711k19317j12440P6025L59957L3651l0337l65013K33284K42271K17172
$$ 2114711 1895394 1782954 1858979 2218936 2252587 2222250 1857237 2090521 2332792 2549964
10759B549964J849l05301j30305P1781J25315m2781k09991k98132k72011j58891
$$ 2549964 2551813 2246512 2116207 2187988 2313303 2270522 2060531 1762399 1490388 1331497
10749A331497o8779M1829o7475K09185j0354k45986j82836j18244o2135m51065
$$ 1331497 1262718 1304547 1237072 1446257 1435903 1189917 1007081 888837 826702 375637
10739C75637j01717L1818K25170k8625j04939k77068n2047L56214L37758J2526
$$ 375637 273920 305738 530908 502283 397344 120276 68229 424443 762201 774727
10729G74727p2557m7188K8919j71388k5859J86890L50869K32473j9905J95771
$$ 774727 702170 654982 683901 512513 486654 673544 1024413 1256886 1236981 1432752
10719A432752j71554l10332k52200m10009J66602K17853m14710L51835K69144
$$ 1432752 1261198 950866 698666 288657 455259 673112 258402 610237 879381
10710H79381n635q7836L38731M28941J65386j89660j26082j08416k83517K89012
$$ 879381 873746 785910 1124641 1553582 1718968 1529308 1403226 1294810 1011293 1300305
10700A300305K66687k07478l58918k1318k29743J26260M0137L1187j9201l41274
$$ 1300305 1566992 1359514 1000596 979278 749535 875795 915932 947119 927918 586644
10690E86644k55215J21768P4968J32612N12281j59082l01201j80981J50705K43003
$$ 586644 331429 453197 528165 660777 1173058 1013976 712775 531794 682499 925502
10680I25502j39761j17517O4395J96610J39641L8528K35715j3075K69169L23362
$$ 925502 785741 668224 732619 929229 1068870 1107398 1343113 1330038 1599207 1922569
10670A922569K2292L82473J5864L55107J82133L79904R02913J840116L559816
$$ 1922569 1944861 2327334 2343198 2698305 2880438 3260342 4163255 6003371 9563187
10661I563187N952167P574990N246777J33873n90138K864739P231192R201416
$$ 9563187 15515354 23090344 28337121 28470994 27880856 30745595 37976787 47178203
10653D7178203N524639j0297663j5391123q683104m461977k299773j884648j641768
$$ 47178203 52702842 42405179 27014056 18330952 13868975 11569202 9684554 8042786
10645H042786o28214n57070k89456o55738j69327K32938J02767O0461J51184K02044
$$ 8042786 7414572 6857502 6568046 5912308 5742981 5975919 6078686 6139147 6290331 6492375
10635F492375M27161M82689R06836Q80905J155357Q73262R66745J578250K923365
$$ 6492375 6919536 7402225 8309061 9189966 10345323 11218585 12185330 13763580 16686945
10626A6686945L590540M782543O722537Q306424J0037301J0532761R981971R488721
$$ 16686945 20277485 25060028 31782565 40088989 50126290 60659051 70641022 80129743
10618H0129743R796805J1146072J1859026R838666O037750L886490N221814R189617
$$ 80129743 89926548 101072620 112931646 122770312 128808062 132694552 137916366 147105983
10610A47105983J3509098J4478777J2959710J2702271J5063228J9342073K0567826
$$ 147105983 160615081 175093858 188053568 200755839 215819067 235161140 255728966
10603B55728966J4611037K470886o406051n147951K866964J0463706J3067593
$$ 255728966 270340003 272810889 266404838 261256887 264123851 274587557 287655150
10596B87655150J1424467J1004006J5296841K0178168J8881291O949028j3151453
$$ 287655150 299079617 310083623 325380464 345558632 364439923 371388951 358237498
10589C58237498k7411285k7160691j7717116q745394l954647k792754p90650L419347
$$ 358237498 330826213 303665522 285948406 277203012 273248365 270455611 269664961 273084308
10581B73084308O763795M852150m104479j7839253k6486396k5021246j8162758
$$ 273084308 279848103 284700253 280595774 262756521 236270125 211248879 193086121
10574A93086121j2081676q544562o680291m555895k678085j767385l248843p062592
$$ 193086121 181004445 172459883 165779592 161223697 158545612 156778227 153529384 146466792
10566A46466792j2387919j6039874j5570728j2867840r560658p742793o151593
$$ 146466792 134078873 118038999 102468271 89600431 80039773 72296980 66145387
10559F6145387n243753m341547l376491k610557k510755k250323k025576j792007
$$ 66145387 60901634 56560087 53183596 50573039 48062284 45811961 43786385 41994378
10551D1994378j328184j401055j584605j278586j293990j442049j242280q25703
$$ 41994378 40666194 39265139 37680534 36401948 35107958 33665909 32423629 31597926
10543C1597926j136552q74870q34547r99295q78952r26121m51095r14771n59210
$$ 31597926 30461374 29586504 28751957 27752662 26873710 25947589 25496494 24581723 24022513
10534B4022513m43684r95059p73421n35029l78900n15514p87286p69328n22224
$$ 24022513 23578829 22583770 21810349 21275320 20896420 20380906 19593620 18824292 18302068
10525A8302068k07413o13298m59551k98296o16691n02359k94720l35392n94613
$$ 18302068 18094655 17481357 17021806 16723510 16106819 15604460 15309740 14974348 14379735
10516A4379735j76147k83180k93067p4925n68755n64736m41801l87320j22465
$$ 14379735 14203588 13920408 13627341 13552416 12983661 12418925 11977124 11589804 11467339
10507A1467339k7624p9755O3158j84753k26756m17275n37627k89087k82252j27788
$$ 11467339 11439715 11359960 11423118 11238365 11011609 10594334 10056707 9767620 9485368 9357580
10497I357580n0491N7717K1464j93691l81019m22723j47821l13197m47377l12479
$$ 9357580 9307089 9364806 9386270 9192579 8811560 8388837 8241016 7927819 7480442 7167963
10487G167963k52905Q918M1796k15355p6169j68560J3331l7127l34897l43113
$$ 7167963 6915058 6923976 6965772 6750417 6674248 6505688 6519019 6481892 6146995 5803882
10477E803882j14806J18702j87392l11761k63079j3046q0656P5802j25120P6031
$$ 5803882 5689076 5807778 5620386 5308625 5045546 5032500 4951844 5027646 4902526 4978557
10467D978557n6227k4216j38779L91151P6558J16843j23803m53437j5213m4817
$$ 4978557 4922330 4898114 4759335 5150486 5227044 5343887 5220084 4766647 4751434 4706617
10457D706617j98969j91191r0814p7680K42129K38462m4169q2668R4199M5047
$$ 4706617 4507648 4316457 4225643 4147963 4390092 4628554 4584385 4501717 4595916 4640963
10447D640963m08127p27034k92042q3296K1618J08264K74559k08563l23854j66265
$$ 4640963 4232836 3505802 3213760 3130464 3152082 3260346 3534905 3326342 3002488 2836223
10437B836223J39882N2561j12361n4520p1845k73625p0799Q2760m904l35394p1767
$$ 2836223 2976105 3028666 2916305 2861785 2789940 2516315 2445516 2528276 2523372 2187978 2116211
10426B116211m3713L1585K91688m2396k91557p7805Q9819j25161k97274L3390
$$ 2116211 2072498 2104083 2395771 2353375 2061818 1984013 2073832 1948671 1651397 1684787
10416A684787q575j34848R8647q8392o6528J15407K41979q155j21450l0061M9487
$$ 1684787 1676212 1541364 1640011 1551619 1485091 1600498 1842477 1834322 1712872 1682811 1732298
10405A732298l7122J53129K592k73485J9457j59053j26037L90614j19036k16711
$$ 1732298 1695176 1848305 1850897 1577412 1596869 1437816 1311779 1702393 1583357 1366646
10395A366646m4854K72776j6777k7682J74731L9823j89193k21997J72262L48290
$$ 1366646 1321792 1594568 1577791 1550109 1724840 1764663 1575470 1353473 1525735 1874025
10385A874025j92666l13337L7456L61522L33683j92020k40600l43013J84095j17237
$$ 1874025 1681359 1368022 1405478 1767000 2100683 1908663 1668063 1325050 1509145 1391908
10375A391908k31331j97665n1361n203K10895k71508j33901N38939K26650j78659
$$ 1391908 1160577 962912 911551 906348 1117243 845735 711834 1250773 1477423 1298764
10365A298764m7910m4232j81831P7603K20428l14037J0293K19492J45208m415
$$ 1298764 1250854 1206622 1024791 1102394 1322822 1008785 1019078 1238570 1383778 1379363
10355A379363j00526k84512j68510k237R3051K1666j12752L00128J350J5674R7286
$$ 1379363 1278837 994325 825815 823578 916629 938295 825543 1125671 1127021 1142695 1239981
10344A239981j2342j70133J75787q5101k89432M28394L08475K80580P2580l94558
$$ 1239981 1227639 1057506 1233293 1148192 858760 1287154 1595629 1876209 1948789 1554231
10334A554231j26132J59017p1844N4058J95094J25643j8509m31780k56486j10401
$$ 1554231 1428099 1587116 1515272 1569330 1764424 1890067 1871558 1439778 1183292 1072891
10324A072891n0355p6209J46266K28220N1816p6372k14975R4064o06426j31368
$$ 1072891 1022536 946327 1092593 1320813 1372629 1296257 1081282 1175346 568920 437552
10314D37552K89090K27476M779M7523K62943K37778L51905l29635l98320J6240
$$ 437552 726642 954118 958897 1006420 1269363 1507141 1859046 1529411 1131091 1147331
10304A147331j5394j32322k43110K13716j05066j02013R5958K337K44497k71641
$$ 1147331 1131937 999615 756505 970221 865155 763142 859100 861437 1105934 834293
10294H34293q0971K59801j69428J6210j68022k14351j9346o7158N8122M3684J20757
$$ 834293 753322 1013123 843695 859905 691883 477532 458186 391028 449150 492834 613591
10283F13591K03936k939M1577o6143k05659R3469J99936j89247m2689j32054l02973
$$ 613591 817527 814588 856165 790022 584363 677832 877768 688521 645832 513778 210805
10272B10805Q8948L60397k5497J40848M5008J40920k82286o83120J61459R8653
$$ 210805 299753 660150 634653 775501 820509 961429 679143 -3977 157482 256135
10262B56135r0162k34440L00319J15160j59111j23396m6019M11051J68719j18002
$$ 256135 165973 -68467 231852 347012 187901 64505 18486 429537 598256 480254
10252D80254J05195k63009m13221k2922L2446K30756J24753J35662o7769R4301
$$ 480254 585449 322440 -90781 -113703 -81257 149499 274252 409914 342145 436446
10242D36446l58056m8036J47839N30169m3041l71141j89046j04913K40765K21623
$$ 436446 78390 30354 178193 708362 665321 294180 105134 221 240986 462609
10232D62609m7437K287q2446J08145J4794J42312J04179r0347l12657q2029K57693
$$ 462609 415172 417459 335013 443158 457952 600264 704443 614096 301439 219410 477103
10221D77103P6582K42162k53794k34288q487k99928N0277M32211J09710J42801
$$ 477103 553685 795847 542053 307765 299278 -650 49627 481838 591548 734349
10211G34349j05608j36725l24245L7654R061K1683p6995M7494L27707M2855k173
$$ 734349 628741 492016 167771 205425 214486 236169 159174 206668 534375 577230 575057
10200E75057K3072K9513J63837o7918n6081k85551J07497J85635j28923L37796
$$ 575057 598129 627642 791479 723561 667480 381929 489426 675061 546138 883934
10190H83934j13899m90528j13853J19176L7610j46330q9332K27096K08248L08714
$$ 883934 770035 279507 165654 284830 322440 176110 86778 313874 522122 830836
10180H30836q6706K65566m5846l23761K71740n8345l77332M84336N67681J42464
$$ 830836 744130 1009696 963850 640089 911829 853484 476152 960488 1528169 1670633
10170A670633J65580j55978l71301m2684J74496K0597J10690N54022j04898K1895
$$ 1670633 1836213 1680235 1308934 1266250 1440746 1461343 1572033 2126055 2021157 2043052
10160B043052j4081J88951M9872Q7170J31762j99836q58l11901o64729O3712P542
$$ 2043052 2028971 2217922 2267794 2354964 2486726 2286890 2286032 1974131 1309402 1373114 1380656
10149A380656k04572J45506L89243L69977L86797L3963R8145O7240l38361p37453
$$ 1380656 1176084 1321590 1710833 2080810 2467607 2501570 2599715 2666955 2328594 1591141
10139A591141k89348n0391R0108l1299k7734j13863R3175k31586n1383L0823K41548
$$ 1591141 1301793 1251402 1341510 1310211 1282477 1168614 1261789 1030203 978820 1009643 1251191
10128A251191K73163l95100k70095k86320o8091J48818m4456R0191k00910k22612
$$ 1251191 1524354 1129254 859159 572839 504748 653566 609110 699301 498391 275779
10118B75779k49698O2931L72879k6131j78086q9660Q4106L55053K89094N946k61067
$$ 275779 26081 89012 461891 435760 257674 168014 252120 607173 896267 902213 641146
10107F41146l30335Q7249K68118k4783O5056l4983k91144k86507J65993L60836
$$ 641146 310811 398060 666178 641395 706451 671468 380324 93817 259810 620646
10097F20646O6617l92379j20462m643K99052N07496j8695m59600k35674J32706
$$ 620646 687263 294884 174422 169779 468831 976327 957632 498032 262358 395064
10087C95064j80227m26665Q8982J51198J46989J95721l1723q0554K34965j28079
$$ 395064 214837 -211828 -122846 28352 175341 371062 339339 258785 493750 365671
10077C65671l32218j83151J04317J372L99567R2802l01558l90447j61774M44052
$$ 365671 33453 -149698 -45381 -44009 355558 448360 146802 -243645 -405419 38633
10067C8633j39648J45705L98627J41052l69880k11559J09827n4351L08416J04148
$$ 38633 -101015 44690 443317 584369 214489 2930 112757 58406 366822 470970
10057D70970J2515n2424K91720K5775k65725k2946K27787J48153q4826k06275
$$ 470970 483485 431061 722781 748556 482831 459885 687672 835825 750999 544724
10047E44724k96100k52049k85971k3247K4373O4072K55093k44838L1021L32770
$$ 544724 248624 -3425 -289396 -312643 -288270 -224198 30895 -213943 -182922 149848
10037A49848M15527J62396k54926m47841J02058N19879K60351j4780Q1147k28419
$$ 149848 565375 727771 472845 25004 127062 646941 907292 892512 973659 745240
10027G45240j51172L58321M8833l09662p3837O5150k40310j39502J84154J08952
$$ 745240 594068 952389 1001222 691560 617723 682873 442563 303061 487215 596167
10017E96167j893P3417J89108r7531m23418k8327p0413L28879J33741j46553k19962
$$ 596167 594274 667691 856799 759268 335850 307523 237110 565989 699730 553177 333215
10006C33215k00368J32581L2346N1062K57261l00281L7870l26853J51639J60877
$$ 333215 132847 265428 297774 348836 606097 305816 343686 16833 168472 329349
9996C29349J5604J73787K5940k79689J49069J57706J73102l5181k12233k47608
$$ 329349 344953 518740 544680 264991 414060 571766 744868 709687 497454 249846
9986B49846L5700q0080j18692J73403J60378K2142J0799J04652m88840J0253m3552
$$ 249846 285546 205466 86774 260177 420555 442697 453496 558148 69308 79561 36009
9975C6009K35970p3500K07052n0016J17202l6097O4809k01284k6542M36718K95181
$$ 36009 271979 198479 405531 355515 472717 436620 501429 300145 273603 710321 1005502
9964A005502k56263j04331j48070j63065K26853K84837k76434k45912l06534P6921
$$ 1005502 749239 644908 496838 333773 560626 845463 569029 323117 16583 93504
9954I3504J38779j13446j0297L11089R3543o0848L5121j62402L1384J84655K27062
$$ 93504 232283 118837 108540 419629 513172 452324 487445 325043 356427 541082 768144
9943G68144J33606L5150m2162m48638l79907K61324O88545J92828L98368O45457
$$ 768144 901750 936900 894738 446100 66193 327517 1016062 1208890 1607258 2252715
9933B252715K84766l0176L73509J305257J198787L63028q75575j868505j169336
$$ 2252715 2537481 2507305 2880814 4186071 5384858 5747886 4872311 3003806 1834470
9924A834470l58507j56591r7049N9815J21750l22632m67261k69390P7597k35989
$$ 1834470 1475963 1319372 1222323 1282138 1403888 1081256 613995 344605 422202 186213
9914A86213p9251O9276J72428j81804J44879J34725j37588j49285k56653K62528
$$ 186213 106962 176238 348666 166862 311741 446466 308878 159593 -97060 165468
9904A65468j50806P1352M10840J70928k97683k87427R6602L08556q4714n62079
$$ 165468 14662 86014 496854 667782 370099 82672 179274 487830 403116 -158963
9894a58963j58252L53058K28783J39560l23002k92918K32016K22601j57435m18504
$$ -158963 -317215 35843 264626 404186 81184 -211734 20282 242883 85448 -333056
9884c33056K42010J20300m09369k74425M42330J52715j32361K24341K87949O9169
$$ -333056 -91046 29254 -380115 -654540 -212210 -59495 -191856 32485 320434 389603
9874C89603K02656k991k87682J5358k41829M2680j47504K37670L39872r8288m44438
$$ 389603 592259 589268 301586 316944 75115 117795 -29709 207961 547833 449545 5107
9863E107j03148J56915M12961k13837l17485R5378M25513p0922Q1414K6908O1391
$$ 5107 -98041 58874 471835 257998 -59487 35891 461404 390482 471896 498804 560195
9852E60195J6553J63984j66254l89575l07149K12940J98828k06942Q7756K59763
$$ 560195 576748 740732 574478 184903 -122246 90694 289522 82580 170336 430099
9842D30099J9856k34678M2969K9126k88892p3949j35643r8380k37341J80982J35313
$$ 430099 449955 215277 258246 287372 -1520 -75469 -211112 -309492 -546833 -365851 -230538
9831b30538Q4249k9935J46832K43709J40763j83415J7372P0849L6197j24009K27736
$$ -230538 -146289 -176224 -29392 214317 355080 171665 189037 259886 296083 172074 399810
9820C99810p9754L915J19944m5304k14878p4705K0473J27091J61737o1079j57897
$$ 399810 320056 323971 443915 398611 183733 109028 129501 256592 418329 357250 199353
9809A99353J74597L0484j43229l337k1701q5751J03598l4932l20876j60077L10421
$$ 199353 373950 404434 261205 257868 236167 150416 254014 219082 -101794 -261871 48550
9798D8550P0791m74116q4754L63786J40297K9799J34681L9041j97706M7458K23736
$$ 48550 119341 -354775 -439529 -75743 64554 94353 229034 268075 70369 117827 341563
9787C41563K02030K57400n7800K00693M33427P76346M92557L19497J72766j6495
$$ 341563 543593 800993 743193 943886 1377313 2153659 2646216 2965713 3138479 3121984
9777C121984L71535J092750Q86259J02126o78373j149752j257973o05477k23538
$$ 3121984 3493519 4586269 5472528 5574654 4896281 3746529 2488556 1883079 1659541
9768A659541J20678k89033o83084k93662K40096J13746K44808l38837r8295L42393
$$ 1659541 1780219 1491186 808102 514440 754536 868282 1113090 774253 675958 1018351
9758A018351j61471J0272J23888l3076o4753k71632k68034M26291N53698k10209
$$ 1018351 856880 867152 991040 957964 893211 621579 353545 779836 1333534 1123325
9748A123325k15749j36304k80785q9694m0025J10739K81025Q8681j85067K09309
$$ 1123325 907576 771272 490487 400793 360768 471507 752532 841213 656146 865455
9738H65455K09375J17899l57192m21951j89640J78182P4592j66685J49055l95152
$$ 865455 1074830 1192729 835537 413586 223946 402128 476720 310035 459090 63938
9728F3938l24129L7424k60163K38979L87807J94534L34526j25270l11213l08686
$$ 63938 -260191 -222767 -482930 -243951 143856 338390 672916 547646 236433 -72253
9718g2253J71386K6279j2756j04755l00796N8075L40010J38565k84405J80810
$$ -72253 99133 125412 112656 7901 -292895 -234820 105190 243755 -40650 140160
9708A40160m00960l43683M83202M30763j46674r2807R9798j78190N3687L64179
$$ 140160 -260800 -604483 -121281 309482 162808 70001 169799 -8391 45296 409475
9698D09475n22715j90584K19144N09052K70148p7679Q3676r3844k33257j57065
$$ 409475 -113240 -303824 -84680 424372 694520 616841 700517 606673 373416 216351
9688B16351J15240K20161l3143j86209k86598j12786K35927J94869K28042M5359
$$ 216351 331591 551752 518609 332400 45802 -66984 168943 363812 591854 637213
9678F37213n6390l25749j79512q2070R631K77047m004L9424Q4996L1453N4400
$$ 637213 580823 255074 75562 -6508 3123 280170 276166 315590 400586 432039 486439
9667D86439p3537K43323j9559k97847j89147l6701o3422K37974M59343M11861
$$ 486439 412902 656225 636666 338819 149672 112971 49549 287523 746866 1158727
9657A158727J61773k95726m03933M54898J87891J23655j00951k65655j79707j36566
$$ 1158727 1320500 1024774 620841 1075739 1263630 1387285 1286334 1020679 840972 704406
9647G04406j57623j19267p7222L8033J4767N5191l7532p7708k07334m4364L4794
$$ 704406 546783 427516 350294 388327 403094 458285 420753 343045 135711 91347 126141
9636A26141r1946J25346K83714k80738J7905M7345j10242j98487J71101J95837
$$ 126141 34195 159541 443255 162517 180422 227767 117525 -80962 90139 285976
9626B85976j60089j55198l45051J36559M34409K72010p0293j55751J49943J25214
$$ 285976 125887 -29311 -374362 -237803 196606 468616 398323 242572 392515 517729
9616E17729l4111M0588m13704m55158K41989M82394P7495n4884j6723N0181K58481
$$ 517729 483618 524206 110502 -344656 -102667 379727 457222 402338 385615 435796 694277
9605F94277Q4786l44667o34490j04769L99616K51164L09461r5900J33190j1915
$$ 694277 779063 434396 -200094 -304863 94753 345917 655378 559478 692668 680753
9595F80753k04750q2588l27j18444j88628R3090j29703j61264o5576K96610L71917
$$ 680753 476003 393415 393088 274644 86016 179106 49403 -111861 -177437 119173 491090
9584D91090K12564k5677j76966k56284j09715j49375k75452j777J52091J52116
$$ 491090 703654 677977 501011 244727 135012 -14363 -289815 -291592 -139501 12615
9574A2615J49657J35838j44600k49214j7475L61863J19337M43481J0222l51084
$$ 12615 162272 298110 153510 -95704 -113179 248684 368021 811502 821724 470640
9564D70640j05705K48394j44118n9411o1663K257k1360J09908L62230L8487j71442
$$ 470640 364935 613329 469211 409800 348137 350394 329034 438942 801172 839659 668217
9553F68217l46425M3633M61815j46094n22408k0209K85881O7601j92211J32096
$$ 668217 321792 365425 827240 681146 158738 138529 424410 492011 299800 431896
9543D31896J96518k68534J753r6934o8902l5678j44384J47648M80401J31323r547
$$ 431896 628414 359880 361633 264699 195797 160119 15735 163383 643784 775107 765560
9532G65560K57412l1564m3712N1019J36921l9661k82319k84168l99744j04029
$$ 765560 1022972 991408 947696 998715 1135636 1095975 813656 529488 129744 25715
9522B5715m26095K52954K28603l49323J52754J72179J75922O6489K38000K31023
$$ 25715 -400380 -147426 81177 -268146 -115392 56787 232709 299198 537198 768221
9512G68221n4091L9720j11779l22508l25686r3653p5457K7624M44934J31347k18945
$$ 768221 714130 753850 642071 319563 -6123 -99776 -175233 -147609 297325 428672 209727
9501B09727j67641j40405L85257J82896m4148K39348k85598o12277P0378K80512
$$ 209727 42086 -98319 286938 469834 425686 665034 379436 -232841 -162463 118049
9491A18049j59676p5357K87895O4094j35192j20755L7668l9483j24840j59499
$$ 118049 -41627 -116984 170911 235005 99813 -20942 16726 -22757 -147597 -307096
9481c07096Q2919K25546j09499J65840L73460J49581n1288j99798o4742j20606
$$ -307096 -224177 1369 -108130 57710 431170 580751 529463 329665 264923 144317
9471A44317p0386L45176R0032q432m4967m1527P0015K5991l7766j88378J02064
$$ 144317 73931 419107 509139 500707 455740 414213 484228 510219 472453 284075 386139
9460C86139M6917j63189n8960k41227o317J51725J44259m4221l39736J3718J73829
$$ 386139 433056 269867 210907 -30320 -36637 115088 259347 215126 -124610 -110892 62937
9449F2937q2484m6989j02453K70807M09977j97520k91731P9474K84179r5k14627
$$ 62937 -19547 -66536 -168989 101818 511795 314275 22544 102018 386197 386102 171475
9438A71475J99183p2333l46077K26683L86549j97477k47988P0897k3626L4919
$$ 171475 370658 298325 -47752 178931 565480 368003 120015 190912 167286 202205
9428B02205M0574q3338l23120p9482j16702o3500J81628r8001M79837L42013M287
$$ 202205 242779 159441 -163679 -243161 -359863 -423363 -241735 -339736 140101 482114 486401
9417D86401j70542j99128N3203N8790L65914O8561k79309j88987n6523J90399
$$ 486401 315859 116731 169934 228724 594638 663199 383890 194903 138380 328779
9407C28779J84614k57110k31551l33499k59514N368J24913M18156k2044J35568
$$ 328779 513393 256283 24732 -308767 -568281 -562913 -438000 -19844 -41888 93680
9397I3680M5725l65639m3180L53314Q5762J20383j94209J71487j36811k14613
$$ 93680 139405 -226234 -269414 83900 169662 290045 95836 267323 130512 -84101
9387h4101j71731R7489j2742j34524L7363k34606j33829P6690L44620K06072k08302
$$ -84101 -255832 -158343 -171085 -305609 -268246 -502852 -636681 -559991 -215371 -9299 -217601
9376b17601j71107R0916J74967j04184l21491j52076J29921K71337q1515K7184
$$ -217601 -388708 -297792 -122825 -227009 -548500 -700576 -570655 -299318 -380833 -353649
9366c53649J34633M62140M90725k7380k41870j25891o70n00556j75532J82061
$$ -353649 -219016 243124 733849 706469 464599 338708 338038 -162518 -338050 -155989
9356a55989J35072m094k26805K3346K5968J54908K34570k7089k54120j67175J90006
$$ -155989 -20917 -25011 -251816 -228470 -202502 -47594 186976 159887 -94233 -261408 -71402
9345g1402o630j40681K1326K22689M39899L98888j63256l07193P7630N2530P5231
$$ -71402 -78032 -218713 -197387 25302 465201 864089 700833 393640 471270 523800 599031
9334E99031m3749l47773j75906Q274O550K38114J0970k89117n9190M2046Q4351
$$ 599031 555282 207509 31603 39877 46427 284541 295511 6394 -52796 -10750 73601
9323G3601j34427r561J94369k9325L96728k32062l81870j20993K39291j18039
$$ 73601 -60826 -70387 123982 94657 491385 259323 -122547 -243540 -4249 -122288
9313a22288r7788L03118J18922N1082k5280j37626K13641K03481L54879k48346
$$ -122288 -220076 83042 201964 253046 227766 90140 303781 507262 862141 613795
9303F13795l19894j83127k38835l41772P2122K98512K7361j54589J90368r8366
$$ 613795 293901 110774 -128061 -469833 -397711 -99199 -71838 -226427 -36059 -134425
9293a34425j189k85947K14382K19550p7344j33593q7058N6175R2768j86707P9220
$$ -134425 -135614 -421561 -207179 12371 -64973 -198566 -285624 -229449 -136681 -323388 -244168
9282b44168K06449k6028J87951M40408j8011j05801j83754j4826K00429J09316
$$ -244168 -37719 -63747 124204 564612 546601 440800 257046 242220 442649 551965
9272E51965j52878l98019m22559J2957O3193M42649M80716J60977j97762j19570
$$ 551965 399087 1068 -421491 -408534 -345341 97308 578024 739001 541239 421669
9262D21669l28849j70855Q8078o9898r7876n219J37023K41227M5250j78098J12660
$$ 421669 92820 -78035 10043 -59855 -157731 -162950 -25927 215300 260550 82452 195112
9251A95112l42554N665L87968J82711N17798j42532r3814n6124P1124k42763j94837
$$ 195112 -147442 -141777 246191 428902 946700 804168 710354 654230 725354 482591 287754
9240B87754j13490l42711j62256J32109K0736J80790K8339K24892K8500p2476
$$ 287754 174264 -168447 -330703 -198594 -177858 2932 31271 256163 284663 212187
9230B12187l04939j05117O8677L61330K39819k2322J96141j90331k01583L6045
$$ 212187 -92752 -197869 -129192 232138 471957 449635 645776 455445 253862 289907
9220B89907o9721j80594K89082j87323l63516l11968j10318L21269j45174r3905
$$ 289907 220186 39592 328674 141351 -222165 -534133 -644451 -323182 -468356 -562261
9210e62261p6880j8681k2386L27289L09644J71716L21857J76539n3628l75789
$$ -562261 -639141 -657822 -680208 -352919 -43275 128441 450298 626837 573209 197420
9200A97420q5879k62385l45339q0588n938m1388J31198L94558O70968J69839j47264
$$ 197420 111541 -150844 -496183 -576771 -582709 -624097 -492899 -98341 572627 742466 595202
9189E95202k48034m52213k36575J31591L70257K43121n0910j16236k57570j07765
$$ 595202 347168 -105045 -341620 -210029 160228 403349 352439 236203 -21367 -129132
9179a29132K90206J6590l86914M7076J14115K0267M0114J06512L01430M3800j72600
$$ -129132 161074 177664 -209250 -162174 -48059 -27792 12322 118834 420264 464064 291464
9168B91464K9283k11304l28212P6448P0878q6477j20422P1240P7773P4736j67514
$$ 291464 320747 109443 -218769 -142321 -71443 -157920 -278342 -207102 -129329 -54593 -222107
9157b22107O1506Q3299j41092J61114K49488J43150k35191k21782J24368o8583
$$ -222107 -160601 -77302 -218394 -57280 192208 335358 100167 -121615 2753 -65830
9147f5830n8186j74499k77780j7005L51056K62308r9485J14357R7242n3791k82753
$$ -65830 -124016 -298515 -576295 -593300 -242244 20064 -79421 34936 132178 78387 -204366
9136b04366Q825J07753p7050O6186O4820O8182L5368K5669K5592k34289N3732
$$ -204366 -195541 -87788 -164838 -98652 -33832 34350 69718 95387 120979 -113310 -59578
9125e9578q8027Q28J16826j3737K33610j49084L0098j82777m4494m13863J00360
$$ -59578 -147605 -146777 -29951 -43688 189922 40838 70936 -111841 -156335 -570198 -469838
9114d69838J7775j05164M30786L65309j697j3861j18369J75559J96209K19316
$$ -469838 -452063 -557227 -126441 238868 237171 223310 104941 280500 476709 696025
9104F96025J09955k62296q7290L7572p5095l33359q9251j13832K95638P1399j70023
$$ 696025 805980 543684 456394 493966 418871 85512 -3739 -117571 178067 249466 79443
9093G9443K4544r8646P6154l58050l06935O098J14271K00052J74798M6853J28214
$$ 79443 103987 5341 81495 -276555 -583490 -577392 -463121 -263069 -88271 -41418 86796
9082H6796K24781l41612l88858R615J35191J04633J04177K84464q5623l9443l7366
$$ 86796 311577 -30035 -418893 -409278 -274087 -169454 -65277 219187 133564 94121 56755
9071E6755M09643j97715j74176J49617j39900J31853L56217N4704n3277j06746
$$ 56755 466398 268683 94507 244124 104224 236077 592294 646998 593721 486975
9061D86975k24281q1018J3637p2506j29784K21282K60358J83771k44769j38290
$$ 486975 262694 181676 195313 122807 -6977 214305 474663 658434 413665 275375
9051B75375k29135j53522m8089k2120L2493Q1359K28349m4210N8664q1445j48398
$$ 275375 46240 -107282 -155371 -177491 -144998 -63639 164710 120500 179164 97719 -50679
9040e0679Q8373r3312L2773O8074M0977k63432K6891K1978J92156j77397q922
$$ -50679 37694 -55618 -22845 45229 86206 -177226 -150335 -128357 63799 -113598 -122520
9029a22520O5023M7591j74909O1766Q8289L21084J30679K73247j97609l49215
$$ -122520 -57497 -9906 -184815 -123049 -34760 286324 417003 690250 492641 143426
9019A43426p8192J75183p7758j28362l0948P9289K07289k31900r8533p8885k08181
$$ 143426 65234 240417 162659 34297 3349 82638 289927 58027 -40506 -119391 -327572
9008c27572j62158l904m44313L84812M35329j4811R8369K60511J06419J48518
$$ -327572 -489730 -493634 -937947 -553135 -117806 -132617 -34248 226263 332682 481200
8998D81200j26065l64122j36530j10501J76790m0112k58137L58534Q0777J39170
$$ 481200 355135 -8987 -145517 -256018 -79228 -119340 -377477 -18943 61834 201004
8988B01004r5882p8112K33101K38913j27446k62891k51202J91353K63560j9359
$$ 201004 105122 27010 260111 499024 371578 108687 -142515 48838 312398 293039
8978B93039n47133j08069J46280l56304j47847L4725L83601K35446K29959Q7259
$$ 293039 -254094 -362163 -215883 -572187 -720034 -685309 -301708 -66262 163697 250956
8968B50956r5194J35848j17052j79749J17362O4552O4255k48060k57967j28247
$$ 250956 155762 291610 174558 -5191 112171 176723 240978 -7082 -265049 -393296
8958c93296Q3415K34988M07018L40077k27669m51069L9557L81821J55106j75130
$$ -393296 -309881 -74893 332125 672202 444533 -6536 33021 414842 569948 394818
8948C94818j75067r4136O0506j96325n2367k12881L40858R1401j42810l4300N7076
$$ 394818 219751 125615 186121 -10204 -62571 -275452 65406 156807 13997 -20303 36773
8937C6773K37446M4694K3291j16925m99013J13893M28771o1424j00247k09853
$$ 36773 274219 318913 342204 225279 -273734 -159841 268930 207506 107259 -102594
8927a02594k08954l50875j75761L84460M16440P9880m51793J2678K61621k75495
$$ -102594 -311548 -662423 -838184 -453724 -37284 42596 -409197 -396519 -134898 -410393
8917d10393Q8425K22939J00472R8322O8833J77456L9540J8130l32875K54675J54242
$$ -410393 -321968 -99029 1443 99765 168598 346054 385594 403724 70849 325524 479766
8906D79766P5952j80981j20294M1379j68411j50355R1503J76641J68816j12160
$$ 479766 555718 374737 254443 295822 127411 -22944 68559 245200 414016 301856
8896C01856l54132k57960K69460r401q8272J34085K57669j14656k05662J30650
$$ 301856 -52276 -310236 -40776 -50177 -138449 -4364 253305 138649 -67013 63637
8886F3637K10310o3605l70526l1851P7905J2486j93975J22164j24116r3765J1492
$$ 63637 273947 210342 -160184 -192035 -114130 -101644 -295619 -173455 -297571 -391336 -379844
8875c79844L79407K40650k21838q3919j26770P437M50192p1149r0975O1194l40088
$$ -379844 -437 240213 18375 -65544 -192314 -184877 265315 194166 103191 164385 -175703
8864a75703k35280L82848K65244J07934J24192m83138N3425L04179K54439o5615
$$ -175703 -410983 -28135 237109 345043 469235 -13903 39522 343701 598140 532525
8854E32525l66350j4846j0547P3745j193j10986J12227L9271K45958K46548j66329
$$ 532525 166175 151329 140782 214527 213334 102348 214575 253846 499804 746352 580023
8843E80023k61348k59056j17745j81381k06885j69596J53469L31006K04702o6372
$$ 580023 318675 59619 -58126 -239507 -446392 -615988 -462519 -131513 73189 6817
8833F817M9850Q7861O0087j36113n6351j35225j03929j25512l05043K36073L66378
$$ 6817 56667 144528 204615 68502 12151 -123074 -227003 -352515 -657558 -421485 -55107
8822e5107l79418r6313m0915j52313k13603J03863n0184L52075J90048P4341k44073
$$ -55107 -434525 -530838 -571753 -724066 -937669 -833806 -883990 -531915 -341867 -267526 -511599
8811e11599n6632J91858l4515K1720K27531L91877L21307j51728l35166j4668
$$ -511599 -568231 -376373 -410888 -389168 -161637 230240 551547 399819 64653 49985
8801D9985J72974k9123O5175L51361J05072l29542j91117K15389k52401q5258
$$ 49985 222959 193836 259011 610372 715444 385902 194785 410174 157773 72515
8791G2515j12665r6792K23963N30580j61259m88877j56457n0427k09128J23471
$$ 72515 -40150 -136942 87021 617601 456342 -32535 -188992 -239419 -448547 -325076
8781c25076J65228j22993K16386N78802L03953O9757n4258l74121k29204j70621
$$ -325076 -159848 -282841 -66455 512347 816300 886057 831799 457678 228474 57853
8771E7853k58719r2134P1261K89929L86980J91589l60422j23146P7758J12550
$$ 57853 -200866 -293000 -221739 68190 455170 646759 286337 163191 240949 353499
8761C53499l77907M0677J04958o5817k53139j754k06701K05578m8340j04848K54897
$$ 353499 -24408 16269 121227 55410 -197729 -199483 -406184 -200606 -248946 -353794 -98897
8750i8897l6618l3990K55091K21177R9633M5188k37182l04530k05277j4202J19810
$$ -98897 -135515 -169505 85586 306763 406396 451584 214402 -90128 -295405 -309607 -189797
8739a89797j9504p6958j82263k70220J6084J82225K49764J32753j96536j50511
$$ -189797 -209301 -286259 -468522 -738742 -722658 -540433 -290669 -157916 -354452 -504963
8729e04963k19682M9547K94892L76041J93082N264k05310j08078K21444l6067
$$ -504963 -724645 -675098 -380206 -4165 188917 194181 -11129 -119207 102237 66170
8719F6170n3590J94203k48224p9321J404J95190k22034l50442K9669L6408K75833
$$ 66170 12580 206783 -41441 -120762 -119358 75832 -146202 -496644 -466975 -430567 -154734
8708a54734K93553m958N6483L49912K25486j96845m00234j49475j28384l40437
$$ -154734 138819 133861 190344 540256 765742 568897 168663 19188 -109196 -449633
8698d49633k30228K32712K01357J61592L3186k83058k71274p148J96396M795J86762
$$ -449633 -679861 -447149 -245792 -84200 -51014 -334072 -605346 -612494 -416098 -411303 -224541
8687b24541k1297K7181K36857J85644j15580k42570j2187J62544q5532N5915k06333
$$ -224541 -245838 -218657 18200 203844 88264 -154306 -166493 -3949 -89481 -33566 -239899
8676b39899m1673K38089r863j46138l14332o7556L08577J69895k02037K55412
$$ -239899 -281572 -43483 -53346 -199484 -513816 -581372 -272795 -102900 -304937 -49525
8666d9525p8774j95240j42315J94805N4201J88174M6013j09752k83127J15833
$$ -49525 -128299 -323539 -465854 -271049 -216848 -28674 17339 -92413 -375540 -259707
8656b59707L8238L04150J58395K56738o2687k56103n9941k82234K08855L54732
$$ -259707 -221469 82681 241076 497814 435127 179024 119083 -163151 45704 400436
8646D00436k12649k59274K42557J72951J3325O6727l26421J0555J32375j58165
$$ 400436 187787 -71487 171070 344021 357346 424073 97652 108207 240582 82417
8636H2417n1445K12936l3917k6070N0162j20113l32091q2796J89747K59569M33135
$$ 82417 30972 243908 209991 183921 234083 113970 -218121 -300917 -111170 148399 581534
8625E81534K8870j436j50526k40338j92106j10773j19113l0791r910J66375K50616
$$ 581534 610404 608968 458442 218104 25998 -84775 -203888 -234679 -244589 -78214 172402
8614A72402L9276j38576Q5385L53803j09526O6372O7731j97745M0157j38979p7670
$$ 172402 211678 73102 158487 512290 402764 469136 536867 339122 379279 240300 162630
8603A62630l169j30989J06545K57417j37895l380l26423l86793J52903L11185
$$ 162630 159461 28472 135017 392434 254539 251159 -75264 -462057 -309154 2031
8593B031J26852k98853k05282O8898L27100M03953K46225j33022o5265m15248
$$ 2031 128883 -169970 -375252 -306354 20746 424699 670924 537902 472637 57389
8583E7389l96654J7943R3076K31432J68249R143j43292K5302K2201p0233L14154
$$ 57389 -339265 -321322 -228246 3186 171435 180578 37286 62588 84789 14556 328710
8572C28710j03908k96039j97434j70629K27681L74963K04563O678j62252j04521
$$ 328710 224802 -71237 -268671 -439300 -211619 163344 367907 374585 212333 107812
8562A07812J76311P1914k81223p9202J74317K35248j50214o2468j68616j85640
$$ 107812 284123 356037 74814 -4388 169929 405177 254963 192495 23879 -161761
8552a61761l36892J52899P3875k59445K67500K86009j21783m0711R7804J44732
$$ -161761 -498653 -345754 -271879 -531324 -263824 22185 -99598 -140309 -42505 102227
8542A02227k2326J00975l7556K49306j6477l44323j01882j17087N0951J49802
$$ 102227 79901 180876 143320 392626 376149 31826 -70056 -187143 -136192 13610
8532A3610K88935J53566J20676L44213M9559K21098M15780j51121k76668p50296
$$ 13610 302545 456111 576787 921000 970559 1191657 1607437 1456316 1179648 429352
8522D29352o45211j60841k6680J55631N0560K27275L50416j07336O2073l76154
$$ 429352 -215859 -376700 -403380 -247749 -197189 30086 380502 273166 335239 -40915
8512d0915j58617K39114K15556k7874k1979L8918l00723m27485n642L2380l9206
$$ -40915 -199532 39582 255138 227264 205285 244203 -56520 -484005 -489647 -457267 -496473
8501d96473J2319M72310L58190J16883q5615j37916j23473j00440m27389q4358
$$ -496473 -484154 -11844 346346 463229 377614 239698 116225 15785 -411604 -495962
8491d95962K59576L41113N86623M82449L0481j57838l3409M78293P11305P67853
$$ -495962 -236386 104727 691350 1173799 1204280 1046442 1013033 1491326 2202631 2970484
8481B970484L38120o16707p49891o52273l44283L19155l75386m03612j3825O7477
$$ 2970484 3308604 2691897 1942006 1289733 945450 1264605 889219 485607 471782 539259
8471E39259l19951J39557J61591O3192M4037j22805j3136Q5652n7979l38826J55787
$$ 539259 219308 358865 520456 583648 627685 504880 491744 577396 519417 180591 336378
8460C36378M6202m7267j11880l4104J15847j70526m72883M94967L01108l7464
$$ 336378 382580 335313 223433 189329 305176 134650 -338233 156734 457842 420378
8450D20378L9420K83910p5454O5080Q735J54509o7977K6951L60300N8661n2845
$$ 420378 459798 743708 668254 733334 742069 896578 828601 855552 1215852 1274513 1221668
8439A221668K32805K39732J21571k44894k94013o87201l06985r2177L46689L04295
$$ 1221668 1454473 1694205 1815776 1570882 1276869 589668 282683 190506 537195 841490
8429H41490k82792m90585n65234j80128L05086L67133N87326J60799O3259l12305
$$ 841490 558698 68113 -497121 -677249 -372163 -5030 582296 743095 806354 494049
8419D94049l03879n58211J31338K65563m4372M30782J01154l11604m03417J07122
$$ 494049 190170 -368041 -236703 28860 -15512 415270 516424 204820 -198597 -91475
8409i1475L28672K44782M5364l41637O3248K28655m77111j43056K9521R7080j79155
$$ -91475 237197 481979 527343 185706 248954 477609 498 -142558 -113037 -15957 -195112
8398a95112Q1905K15016L34370j12777k55019M9370n27473j33306K06579R8680
$$ -195112 -113207 101809 436179 323402 68383 117753 -409720 -543026 -336447 -237767
8388b37767j64467K8908L54175O3380j3512q3398K89094K28933J02276l02659
$$ -237767 -402234 -373326 -19151 44229 30717 -52681 236413 465346 567622 264963
8378B64963k37110j1484p1545k37699K59020L73427j04793J64692O8806K7187
$$ 264963 27853 16369 -55176 -292875 -33855 339572 234779 399471 468277 495464
8368D95464J74861l22279l96230k45770o2160m9488M52322O4757j08026L30117
$$ 495464 670325 348046 -48184 -293954 -356114 -405602 46720 111477 3451 333568
8358C33568J40404J16996p8360l58698J050j72161n1467L8855J47854M08101l11025
$$ 333568 473972 590968 512608 153910 154960 -17201 -68668 -29813 118041 526142 215117
8347B15117l84815j02732J78652j44596r1053K45164J90416r285K19203j5979
$$ 215117 -169698 -272430 -93778 -238374 -329427 -84263 106153 96868 316071 300092
8337C00092l2001J35359p7690k87703J7361k97431n2283n1227N136q1510M701
$$ 300092 268091 403450 325760 38057 55418 -242013 -294296 -345523 -340387 -421897 -417196
8326d17196J71490K62314j02379m76388k09257r1314N69117M93323J46659k47905
$$ -417196 -245706 16608 -85771 -562159 -771416 -862730 -293613 199710 346369 98464
8316I8464j7398K2782o6035J47998J91865M6658l78374k26181L12683K70878l8704
$$ 98464 81066 103848 37813 185811 377676 424334 45960 -180221 132462 403340 364636
8305C64636m8614o4175m1778r3830j07241j48925l7640j53099K23335j6040J40563
$$ 364636 316022 251847 210069 116239 8998 -139927 -177567 -330666 -107331 -123371 17192
8294A7192j56207j57810o8084j01414M22953M12420j24937k4149O7284P4235M22553
$$ 17192 -139015 -296825 -364909 -466323 -43370 369050 244113 219964 287248 361483 784036
8283G84036o0879o00701k00152J62933K71750k51143k02031K3295M48526K47470
$$ 784036 723157 122456 -77696 85237 356987 105844 -96187 -72892 375634 623104
8273F23104j19552j96108j52116j53154j83509m65225M9485L31608J83637k25562
$$ 623104 503552 307444 155328 2174 -181335 -646560 -597075 -265467 -81830 -307392
8263c07392K22093J38397P6189J47034j90443l59493L94912M45601j29735l83434
$$ -307392 -85299 53098 129287 276321 85878 -273615 121297 566898 437163 53729
8253E3729k43251J37206j56320J78965J54733O8719K98762j9919j67868o01823
$$ 53729 -189522 -52316 -208636 -29671 125062 193781 492543 472624 304756 -297067
8243b97067j84583K04033k27753K81546J87809J9682m87491N0007J59360K52376
$$ -297067 -481650 -277617 -505370 -223824 -36015 -16333 -503824 -453817 -294457 -42081
8233d2081K03687k08878j50322k31734J3521j38295p0339K79297k60139J31643
$$ -42081 161606 -47272 -197594 -429328 -415807 -554102 -624441 -345144 -605283 -473640
8223d73640L41104J0596k0964L31809K53142M0017j10139l9728k88283K609j24224
$$ -473640 -132536 -121940 -142904 188905 442047 482064 371925 332197 43914 46523 -77701
8212g7701j42308j7667K1977R2753J51464K03604M0586R0539k89435N695J27064
$$ -77701 -220009 -237676 -215699 -122946 28518 232122 272708 363247 73812 79507 206571
8201B06571j09915m7958j36012l37072n2678j5949M6138m01938J74806L90457
$$ 206571 96656 48698 -87314 -424386 -477064 -493013 -446875 -848813 -674007 -283550
8191b83550K79510j22012j2293K03772L3519K23882j17850k67500l33422n0711
$$ -283550 -4040 -126052 -138345 65427 98946 322828 204978 -62522 -395944 -446655
8181d46655j7254R5088n8615m9470Q7440J06918L4976j19768J74066J71581r2969
$$ -446655 -463909 -368821 -427436 -476906 -389466 -282548 -247572 -367340 -193274 -21693 -114662
8170a14662k34223L52204J02382r5748j03947k42112k16834N7409J1928L836L15526
$$ -114662 -348885 3319 105701 9953 -93994 -336106 -552940 -495531 -483603 -479767 -164241
8159a64241J29852m6651J69418J04997j59503o95M20429K50782j08985q6926J09742
$$ -164241 -34389 -81040 88378 193375 33872 33177 453606 704388 595403 508477 618219
8148F18219j99298k68811n53131j09806K59787N07316l0245l1413n7683k68209
$$ 618219 418921 150110 -403021 -512827 -253040 254276 224031 192618 134935 -133274
8138a33274K32330K05622L8275K57748P2406n5065k76810j37103q0494j66999
$$ -133274 99056 304678 342953 600701 673107 618042 341232 204129 123635 -43364
8128d3364J33725k08523o7073j4588k60515J96197L61125L89291k21972o9660
$$ -43364 90361 -118162 -185235 -199823 -460338 -264141 96984 486275 264303 194643
8118A94643P3840K87319L1387j97901j37474l37204k85422j48164l8024J82660
$$ 194643 268483 555802 587189 389288 251814 -85390 -370812 -518976 -557000 -374340
8108c74340l7687N20461K19885l2750k20306k01915j87610j10028j35082K33325
$$ -374340 -412027 108434 328319 295569 75263 -126652 -314262 -424290 -559372 -326047
8098c26047M4992j62433j14873q406J43906R1500p8091J23090j34692k24203R8089
$$ -326047 -281055 -443488 -558361 -566767 -422861 -331361 -409452 -286362 -421054 -645257 -547168
8087e47168j92348K7327K83929N6875N4667k49118j95482J34005L25085L32483
$$ -547168 -739516 -712189 -428260 -371385 -316718 -565836 -761318 -627313 -302228 30255
8077C0255J95367l0142q6879l1715m72681k79663L26578K23677K36779Q9750Q5277
$$ 30255 225622 195480 108601 76886 -395795 -675458 -348880 -125203 111576 201326 286603
8066B86603K2522j8723M1238J00983J39286j18226j82987M770N7849o7598r4012
$$ 286603 309125 290402 331640 432623 571909 453683 270696 275466 333315 265717 171705
8055A71705k23981j1894J97832K28065N7113R1142k56185k09019L68893O1622
$$ 171705 -52276 -64170 133662 361727 418840 509982 253797 44778 413671 475293
8045D75293k77471j80916L91971J35128l38052l52931J45052M9573J9817J2701
$$ 475293 197822 16906 408877 544005 205953 -146978 -1926 47647 67464 80165
8035H0165J18927k95366k46859K43190k03365J25824J90047r4522J93820J23528
$$ 80165 199092 -96274 -343133 -99943 -303308 -177484 12563 -81959 111861 235389
8025B35389k72788m1438j58393L03875K11264r2879J25425N3048J74987l5520
$$ 235389 -37399 -78837 -237230 66645 277909 185030 310455 363503 538490 502970
8015E02970l52659k9479J51654k28383j35097k7950k39012j84396J33338L8947
$$ 502970 150311 120832 272486 44103 -90994 -118944 -357956 -542352 -409014 -370067
8005c70067j42308J00293K56948k3900j27506j11137K69453J1194p7663J60958
$$ -370067 -512375 -412082 -155134 -179034 -306540 -417677 -148224 -137030 -214693 -53735
7995e3735l15627J44365M38325M10053k1895n62633M7415j91409j47006J70235
$$ -53735 -369362 -224997 213328 623381 601486 38853 86268 -105141 -252147 -81912
7985h1912K01413N3240l25375M356J98819Q7436m0724k38086J90654J95665o6774
$$ -81912 119501 172741 -152634 -148278 50541 137977 97253 -140833 49821 245486 178712
7974A78712M0863K84771M0677K914j36419j09181J1170J98916j5434O0612M8019
$$ 178712 219575 504346 545023 547937 411518 302337 313507 512423 496989 557601 605620
7963F05620J7501o770R3982p8912M3132j34915m53307l12565N11254M91054k81976
$$ 605620 623121 616351 710333 631421 674553 539638 86331 -226234 285020 776074 494098
7952D94098m03788m72447L6076J76997j6961K60766J82172j91165j22923R2749
$$ 494098 90310 -382137 -346061 -169064 -186025 74741 256913 65748 -57175 35574
7942C5574n5674R8745R9649J72273K0083N8397J82890j78994j40393K34973k32633
$$ 35574 -20100 78645 178294 350567 370650 429047 611937 432943 292550 527523 294890
7931B94890l31049L2812k40318J30563L20161k84314m29030K86983M28046L25320
$$ 294890 -36159 -3347 -243665 -113102 207059 -77255 -506285 -219302 208744 534064
7921E34064j28227j16108l89074j98695J61321M49666k90171k81348J09220k1200
$$ 534064 405837 289729 -99345 -298040 -136719 312947 22776 -258572 -149352 -170552
7911a70552K3541J82339L16612j4873j60418r085L39730r372p8141K5215l5099
$$ -170552 -147011 35328 351940 337067 176649 167564 507294 497922 419781 444996 409897
7900D09897K73544l53522k19101k1113M838K31735n3400j66814k13871m94649
$$ 409897 683441 329919 110818 89705 94543 326278 272878 106064 -107807 -602456
7890f02456O2412Q2788k1973M24578J24300k71420p5731L34670K45954m55199
$$ -602456 -540044 -457256 -479229 -54651 69649 -201771 -277502 57168 303122 -152077
7880a52077j98820J16309P9517K08201R9027k61595l30775N7549M59158K22861
$$ -152077 -350897 -234588 -155071 53130 152157 -109438 -440213 -382664 76494 299355
7870B99355J4346q8660j39004j61945J19447M24187m35950m11205j73692K36463
$$ 299355 313701 225041 86037 -75908 43539 467726 31776 -379429 -553121 -316658
7860c16658K6046J3458j22501K96738M52067k16220r5582k22927k5551J2197R0120
$$ -316658 -290612 -277154 -399655 -102917 349150 132930 37348 -185579 -211130 -198933 -108813
7849a08813K03199j86911J53949j65480l25492K14313J15822k61863K41505K91822
$$ -108813 94386 -92525 61424 -104056 -429548 -215235 -99413 -361276 -119771 172051
7839A72051j10030j92622R7018K54109k8829m88636N1882L48548n3975k31941
$$ 172051 62021 -130601 -33583 220526 191697 -296939 -245057 103491 49516 -182425
7829a82425n9902K5648j45060J44544J39649r4961j24994K36812J17263P1163
$$ -182425 -242327 -216679 -361739 -217195 -77546 -172507 -297501 -60689 56574 127737
7819A27737k84568J73528K98465k87790l82402K06317K08556Q2909l65879j2496
$$ 127737 -156831 16697 315162 27372 -355030 -148713 59843 142752 -223127 -235623
7809b35623L29640J16314k29010j60962L7875q7108Q5864Q4239Q6006m187j84204
$$ -235623 94017 210331 -18679 -179641 -141766 -228874 -143010 -58771 27235 23048 -161156
7798a61156K2975j75169O3189P80J70086j8733n04918J2362K25583O1011r6030
$$ -161156 -138181 -313350 -250161 -249381 -79295 -98028 -602946 -590584 -365001 -303990 -400020
7787d00020j38615M84659K01269o33339k59311K82397K27874K36349K17810j04631
$$ -400020 -538635 -53976 147293 -486046 -745357 -462960 -235086 1263 219073 114442
7777A14442J28708l1151j3178p5059j07002q4643J98155l67857m68934J58609
$$ 114442 243150 211999 198821 123762 16760 -67883 130272 -237585 -706519 -547910
7767e47910J67388P627M33076K17833k71892l27575k18770j81487K6835J56537
$$ -547910 -380522 -372895 60181 278014 6122 -321453 -540223 -721710 -694875 -538338
7757e38338K00833J30869P285o3684j92146k10076J261K18737J74921o028n0246
$$ -538338 -337505 -206636 -199351 -263035 -455181 -665257 -663996 -445259 -270338 -276366 -326612
7746c26612J6122L1911N8732j20281m30336N2160M13042J01884J69766P0240J29822
$$ -326612 -310490 -278579 -219847 -340128 -770464 -718304 -305262 -203378 -33612 36628 166450
7735A66450j13551j03539j20692J19991K70938j29190m50510m35011l12519N34304
$$ 166450 52899 -50640 -171332 -51341 219597 90407 -360103 -795114 -1107633 -573329
7725e73329L56104P9438M1189j23136j89560J87518J45548J22891J03211j1652
$$ -573329 -217225 -137787 -96598 -219734 -409294 -221776 -76228 46663 149874 138222
7715A38222p0409K706R540N7188l2493j45159p0123J94405M407m68783k55109
$$ 138222 67813 70519 80059 137247 104754 -40405 -110528 83877 88284 -380499 -635608
7704f35608j8693M30497j45558R141J97818K0709l06918L49548r2868j27715l86074
$$ -635608 -654301 -223804 -369362 -360221 -162403 -141694 -448612 -99064 -191932 -319647 -705721
7693g05721L90325R0539k09985k53677K39515M13057n5346j89213J04125q2499
$$ -705721 -315396 -224857 -434842 -688519 -449004 -35947 -91293 -280506 -176381 -258880
7683b58880N4988K35969r4826k79836N588L94690J11868j25645q9500j23271k23538
$$ -258880 -203892 32077 -62749 -342585 -336997 57693 169561 43916 -45584 -168855 -392393
7672c92393k8538J65504J8594K2314n5098M7556L74717L9570o2420j57513r8137
$$ -392393 -420931 -255427 -236833 -214519 -269617 -222061 152656 192226 129806 -27707 -125844
7661a25844J99960O4108R5082l7885j18399k17668J438N8547j0328Q438P9583
$$ -125844 74116 138224 233306 195421 77022 -140646 -139208 -80661 -90989 -82551 -2968
7650b968m48221q4073J8724j3149J34842L64829k6776k51056r1174P8660R5273
$$ -2968 -451189 -535262 -516538 -529687 -394845 -30016 -56792 -307848 -399022 -320362 -225089
7639b25089L82674K33368n8959k24991k29178j71929K77677J63466J4876R0978
$$ -225089 157585 390953 331994 107003 -122175 -294104 -16427 147039 161915 252893
7629B52893J13328J03485L935L6663m36794o2612k12743n79417P0665J71313J85946
$$ 252893 366221 469706 473641 510304 73510 10898 -201845 -781262 -710597 -539284 -353338
7618c53338J47419P8406J24048l07J02461j18881k3551J3827M4738K8485o9126
$$ -353338 -205919 -127513 -3465 -3772 98689 -20192 -43743 -29916 14822 43307 -25819
7607b5819P6020o5023q7705k08824l29403q1532k21118L13182P1997j0276K16508
$$ -25819 50201 -14822 -102527 -311351 -640754 -722286 -943404 -630222 -558225 -568501 -351993
7596c51993L13244J91416J66351j48033K0823j67255M6608Q9730p4363k4358o2547
$$ -351993 -38749 152667 319018 170985 191808 24553 71161 160891 86528 62170 -377
7585c77K9333K7365k75235m52272l4640k7695J73180p7500R9463K7922o6270j77888
$$ -377 28956 56321 -218914 -671186 -705826 -733521 -560341 -637841 -538378 -510456 -576726 -754614
7573g54614N583J79593N9856j2813Q6883N6084R0J40984q6778M8867J95629R0355
$$ -754614 -749031 -569438 -509582 -522395 -435512 -379428 -379338 -238354 -325132 -276265 -80636 9719
7561I719R889J42849K28247O2959l91947m12045l60398K3319J50290K36465L6738
$$ 9719 19608 162457 390704 453663 61716 -350329 -710727 -687408 -537118 -300653 -263915
7550b63915J07908K36856N5944p0777k31377O6188J75793j14462j30087j68483
$$ -263915 -156007 80849 136793 66016 -165361 -99173 76620 -37842 -167929 -336412
7540c36412K4208J49625j95626J30157L25057j68493q8636K78774J05558k56619
$$ -336412 -312204 -162579 -358205 -228048 97009 -71484 -160120 118654 224212 -32407
7530c2407j10109K04468K45438K36075l48178m51032n1277Q1331J55740M8967
$$ -32407 -142516 61952 307390 543465 195287 -255745 -307022 -225691 -69951 -20984
7520b0984l01269l29688j11018K3452K88381K07627k5139L4995J21316j19522
$$ -20984 -322253 -651941 -762959 -739507 -451126 -243499 -268638 -233643 -112327 -231849
7510b31849j63446j51064j14789K63001J03199l28280k45432J89432j24622N3347
$$ -231849 -395295 -546359 -661148 -398147 -294948 -623228 -868660 -679228 -803850 -750503
7500g50503M01505J61419j30807j17195P7863Q7614L22645j96180j32038J72785
$$ -750503 -348998 -187579 -318386 -435581 -357718 -270104 52541 -143639 -275677 -102892
7490a02892J44374n6359r3536l67453k58140O4746M57899J45566j18336J0295
$$ -102892 41482 -14877 -108413 -475866 -734006 -669260 -211361 -65795 -184131 -173836
7480a73836L19329J45294J35799J78366J76604k69061n53591j4326K45431K7445
$$ -173836 145493 290787 426586 604952 781556 512495 -41096 -55422 190009 217454
7470B17454k79399l43820L19625O4429O1447k2282J15843q7969p2441j83047J32811
$$ 217454 -61945 -405765 -86140 -21711 39736 17454 133297 45328 -27113 -210160 -77349
7459g7349K30402K26219L2977k331j5906L52400k22147l61961k8609R7392K43678
$$ -77349 153053 379272 412249 409918 394012 746412 524265 162304 133695 231087 474765
7448D74765j32549q9808j17821j53054J82344p6930j72291m3149J27664k346l59846
$$ 474765 342216 252408 134587 -18467 163877 86947 -85344 -128493 -829 -3175 -363021
7437c63021j69795M2491M05293L03377j58852Q862J70011k798o0525k68422k44965
$$ -363021 -532816 -490325 -85032 218345 59493 68355 238366 235568 175043 -93379 -338344
7426c38344k75442N33191O3033P210O6701k50466K14318j85851k13170K12940
$$ -338344 -613786 -80595 -17562 -10352 56349 -194117 20201 -165650 -378820 -165880
7416a65880j05511p7122L96450K08712l5120j83046k14670k41135k06638L90203
$$ -165880 -271391 -348513 47937 256649 221529 38483 -176187 -417322 -623960 -233757
7406b33757O8771j97103P6015p0549J44259J51082j40614j44674n4044P0437l5219
$$ -233757 -164986 -362089 -286074 -356623 -212364 -61282 -201896 -346570 -400614 -330177 -365396
7395c65396J1574p2449r8532M8935K34163K62528j3290P0014R8434m3842K1199
$$ -365396 -353822 -426271 -524803 -475868 -241705 20823 7533 77547 175981 132139 153338
7384A53338m4593k36514k40831N73965L17004K3074l33623k76580K89934K95770
$$ 153338 108745 -127769 -368600 205365 522369 545443 211820 -64760 225174 520944
7374E20944k04565k77612k38346k90801J60914L8744J59247J95607J20844m69853
$$ 520944 316379 38767 -199579 -490380 -329466 -290722 -131475 64132 184976 -284877
7364b84877J48423P9447p4961l55535K45494K47302K03580P3362k04589m66462
$$ -284877 -136454 -57007 -131968 -487503 -242009 5293 208873 282235 77646 -388816
7354c88816j24922K30584M15535M8165j74234j22227P2256L93372Q2923m15753
$$ -388816 -513738 -283154 132381 180546 6312 -115915 -43659 349713 432636 16883
7344A6883m30654o0463N1479R6555j08869k9574P3927j99052k23759J51648J75997
$$ 16883 -413771 -474234 -422755 -326200 -435069 -464643 -390716 -589768 -813527 -661879 -485882
7333d85882J19317k7258l30623j30118L43720L82251K93628l4720Q1653R1876
$$ -485882 -366565 -393823 -724446 -854564 -510844 -128593 165035 130315 211968 303844
7323C03844o2981P2108j35128j07323j96911k20530Q0522K55289o9905K0400L14922
$$ 303844 240863 312971 177843 70520 -126391 -346921 -266399 -11110 -81015 -60615 254307
7312B54307L55673k05274k76782k01375q1170J9771L15837p7419R2848J46982
$$ 254307 609980 404706 127924 -73451 -154621 -134850 180987 103568 196416 343398
7302C43398J3798j86651j56905M8084n2875l14346k05826p1915m4653Q0570M0670
$$ 343398 357196 170545 13640 61724 8849 -305497 -511323 -583238 -627891 -547321 -506651
7291e06651K1508j5238p1170m068K37330K29769L54239O2357j38670r3794J09703
$$ -506651 -485143 -500381 -571551 -575619 -338289 -108520 245719 308076 169406 75612 185315
7280A85315j41126j72902k6665J70593j25234m3550J28582j09518n58031j19300
$$ 185315 44189 -128713 -155378 15215 -110019 -153569 -24987 -134505 -692536 -811836
7270h11836N26594J32985j20636j01095L58382L46080Q9991k31214L299R8907
$$ -811836 -285242 -152257 -272893 -373988 -15606 330474 420465 189251 192550 291457
7260B91457J16153k20562k80519K4583j74954k79817q4233O749j77197L32997
$$ 291457 407610 187048 -93471 -68888 -243842 -523659 -607892 -601143 -778340 -445343
7250d45343O1982j32039r9316R5935o7193J89615M1820l06179j58758K95239J37785
$$ -445343 -383361 -515400 -614716 -518781 -585974 -396359 -354539 -660718 -819476 -524237 -386452
7239c86452K55296L5198m13155R481L70188L16380P5514l46223j4188m0685q7074
$$ -386452 -131156 -95958 -509113 -499632 -129444 186936 262450 -83773 -97961 -138646 -225720
7228b25720K27296J76902R6225J4383p4911p7508Q8424k71567J0455O5558j05272
$$ -225720 1576 178478 274703 289086 214175 136667 225091 -46476 -36021 29537 -75735
7217g5735j40815j49485J05142L00763J90098k269N9859k09663m1157L5456N3295
$$ -75735 -216550 -366035 -260893 39870 229968 227699 287558 77895 36738 72194 125489
7206A25489k41795n04374j48526J09954K00028m0256P3370L59450j22994k49683
$$ 125489 -116306 -620680 -769206 -659252 -459224 -499480 -426110 -66660 -189654 -439337
7196d39337r5442J68146K21709J0987j38904O8434J1775K07397J91408j00492
$$ -439337 -534779 -366633 -144924 -133937 -272841 -204407 -192632 14765 206173 105681
7186A05681L921l86875j57035O1951L128N9364Q6350L17261q0206J23897J82813
$$ 105681 109602 -277273 -434308 -372357 -369229 -309865 -223515 93746 13540 137437 320250
7175C20250n6979k09214k5888l66692j14311o1759O7181j11447j88766P6508K61509
$$ 320250 263271 54057 28169 -338523 -452834 -514593 -447412 -558859 -747625 -671117 -409608
7164d09608l645j04090N3771M34052n4309k74805j54148J30823K26452j78470
$$ -409608 -413253 -517343 -463572 -29520 -83829 -358634 -512782 -381959 -155507 -333977
7154c33977j10967J64106m7237K3994o2432Q0074K86564l85944j6867J9802N5283
$$ -333977 -444944 -280838 -328075 -304081 -366513 -286439 125 -385819 -402686 -382884 -327601
7143c27601J41902J70358p9419k24242J52500N1519m21528m0871J52070j32089
$$ -327601 -185699 -15341 -94760 -319002 -166502 -114983 -536511 -577382 -425312 -557401
7133e57401j09901n441N58524P8547n9276J12949j5998o656l11432r3272K23882
$$ -557401 -667302 -672743 -114219 -35672 -94948 18001 2003 -4653 -316085 -409357 -185475
7122a85475R9091l43352j44881K35349K64366K68939J55645j85301J3899j91380
$$ -185475 -86384 -429736 -574617 -339268 -74902 194037 349682 164381 178280 -13100
7112a3100l0242j08655m4175k8164p1196j32444R5249K44281J78483k5374k1948
$$ -13100 -43342 -151997 -196172 -224336 -295532 -427976 -332727 -88446 90037 64663 42715
7101D2715J26968Q9964p8231Q0019K11155j19655j09116k05914k3521j2688j96436
$$ 42715 169683 259647 181416 261435 472590 352935 243819 37905 14384 1696 -194740
7090a94740J60371n9953J21708J10669l3836j61434j82752J6574J13232L02593
$$ -194740 -34369 -94322 27386 138055 104219 -57215 -239967 -223393 -110161 192432
7080A92432j40958L8380L87836Q0880K31746k98629n07856l21963J9515j15740
$$ 192432 51474 89854 477690 558570 790316 491687 -16169 -338132 -318617 -434357
7070d34357l93757O1641M70039m9625j8898K98527M9924M8908k9277j69265J1060
$$ -434357 -828114 -766473 -296434 -346059 -364957 -66430 -16506 32402 3125 -166140 -155080
7059a55080K56231J03736j16726R5831l7828J97149j66198m18769m1388J48913
$$ -155080 101151 204887 88161 183992 146164 343313 177115 -241654 -283042 -134129
7049a34129n8157l78551l6237r0928J04312N14878K11394k4530k81602l2937J84703
$$ -134129 -192286 -570837 -607074 -698002 -593690 -78812 132582 108052 -173550 -206487 -21784
7038b1784M9045j02422l7325L40468k47216n7476K22786R2671K63605M8026P1321
$$ -21784 27261 -75161 -112486 227982 -19234 -76710 146076 238747 502352 550378 621699
7027F21699l23019j55657j29J94799L839k78685r4890N5261o9702J13248j01806
$$ 621699 298680 143023 142894 337693 341532 62847 -32043 23218 -46484 66764 -35042
7016c5042K4377l26348o2984L83808j18726k16406L6613L21393K55126J86963
$$ -35042 -10665 -337013 -399997 -16189 -134915 -351321 -314708 6685 261811 448774
7006D48774l5409k63109k36496Q8970m2717l41413J0914J15415J72261L67578
$$ 448774 413365 150256 -86240 2730 -39987 -381400 -370486 -255071 -82810 284768
6996B84768P13q3740k27988J53002j2038m51339K5038L7861K7815K7219O999m2449
$$ 284768 285481 201741 -26247 126755 114717 -336622 -311584 -273723 -245908 -218689 -211690 -254139
6984b54139N1366J68093k0827k8273N724j44196Q5774q0005j44113k2541K04855
$$ -254139 -202773 -34680 -55507 -83780 -78056 -222252 -136478 -216483 -360596 -383137 -178282
6973a78282J50687K7286J71251L6207J85931l08241l69763r2550n2950j27678
$$ -178282 -27595 -309 170942 207149 393080 84839 -284924 -377474 -430424 -558102
6963e58102J79297j14871n0208k4431J50898K20042l37228P7615J13704j61748
$$ -558102 -378805 -493676 -543884 -568315 -417417 -197375 -534603 -456988 -343284 -505032
6953e05032j38423J84949J16748P4510O7762L63282o573J39307m79199p3754J52226
$$ -505032 -643455 -458506 -341758 -267248 -199486 163796 157223 296530 -182669 -256423 -104197
6942a04197j69187n6140R4053J48751K23010J01758k32592l05485J26576K48793
$$ -104197 -273384 -329524 -235471 -86720 136290 238048 5456 -300029 -173453 75340
6932G5340k04129j64896k8301j43384k73055J500K91644L20855K18266q7158J14092
$$ 75340 -128789 -293685 -321986 -465370 -738425 -736925 -445281 -124426 93840 6682 120774
6921A20774j24084J47162K49873k54303l55772K61027L6216j78565J9083m2600
$$ 120774 -3310 143852 393725 139422 -216350 44677 80893 -97672 -78589 -121189
6911a21189J43213j06156J69383j82724k46165k4459L10570J73877q4272j08582
$$ -121189 22024 -84132 85251 -97473 -343638 -368097 -57527 116350 32078 -76504
6901g6504j27072j72037L0754R5765O5293N53628j15468o23342M0063J21660Q207
$$ -76504 -203576 -375613 -344859 -249094 -183801 369827 254359 -368983 -328920 -207260 -199053
6890a99053o420O095L14092M48773k76024l71158j20886j94493j5108P9587J21238
$$ -199053 -205473 -199378 114714 563487 287463 -83695 -204581 -399074 -414182 -334595 -213357
6879b13357N35757J8529k14165N3461K7069L6532p1506o1074O4912j84793l22104
$$ -213357 322400 340929 126764 180225 207294 243826 172320 111246 176158 -8635 -330739
6868c30739P5125J90596J17982K97443O238l46633l4006K54472K09907o10877
$$ -330739 -255614 -65018 52964 350407 356645 10012 -23994 230478 440385 -170492
6858a70492n5681M13800K72209r2727r7120L2908k07029k64876j96525K14867
$$ -170492 -226173 187627 459836 367109 269989 302897 95868 -169008 -365533 -150666
6848a50666o9446J00099J36820k46268j34080k99901l04484J09858P3944l8097
$$ -150666 -220112 -120013 16807 -229461 -363541 -663442 -967926 -858068 -784124 -822221
6838h22221J11618M2296M70095L12980l9361j68675j17602Q7601l9216r0764k84425
$$ -822221 -710603 -668307 -198212 114768 75407 -93268 -210870 -123269 -162485 -253249 -537674
6827e37674J87286R52979k27204m03594k88985j87345K75079r3109p2987K82661
$$ -537674 -350388 602591 375387 -28207 -317192 -504537 -229458 -322567 -395554 -112893
6817a12893K12076j03682k2679q3721m99434j40378j97500L47963K71517M00485
$$ -112893 99183 -4499 -27178 -110899 -610333 -750711 -948211 -600248 -328731 71754
6807G1754j74424K799J50757l20335j40524L28031J22743k46944n1877K67353
$$ 71754 -102670 -99871 50886 -269449 -409973 -81942 40801 -206143 -258020 9333
6797I333Q9023j68516k13999r3175j08983K86798J00898r6596j77866J8722O1882
$$ 9333 98356 -70160 -284159 -377334 -486317 -199519 -98621 -195217 -373083 -354361 -292479
6786b92479k32165K55954K73120J66296j8075k52273o6714j18759O4155N27637
$$ -292479 -524644 -268690 4430 170726 152651 -99622 -166336 -285095 -220940 306697
6776C06697K31364j71043k87208j67953k78512p4710M1686J47787J88695N4029
$$ 306697 538061 367018 79810 -88143 -366655 -441365 -399679 -251892 -63197 -9168
6766i168n8170l0502j87665l1156K43535K01294k32316m6864K38202j79440k07949
$$ -9168 -67338 -97840 -285505 -316661 -73126 128168 -104148 -151012 87190 -92250 -300199
6755c00199J96868J57477j65219j63048r1150K64650R3639n7002K7408L09893
$$ -300199 -103331 54146 -111073 -274121 -365271 -100621 -6982 -63984 -36576 273317
6745B73317P4818j99247j45323j62940k23856j41582n3214K96534L49356k00825
$$ 273317 348135 148888 3565 -159375 -383231 -524813 -578027 -281493 67863 -132962
6735a32962k9240J1481J44973k8447k22742m3348L91251J41624j25143J6332J6264
$$ -132962 -162202 -150721 -5748 -34195 -256937 -300285 90966 232590 107447 123779 140043
6724A40043J56172j7043j70991l11585o3314R1346o0031p2322k1347M32J27785
$$ 140043 296215 279172 108181 -203404 -266718 -175372 -235403 -307725 -329072 -328640 -200855
6713b00855k15090J07145J60220j12612K6574k68756o0786J9091J79540J80747
$$ -200855 -415945 -308800 -148580 -261192 -234618 -503374 -564160 -545069 -365529 -184782
6703a84782K5553J08575j43451k34184J83071K67353j17057O1985R3009l1746
$$ -184782 -159229 -50654 -194105 -428289 -245218 22135 -94922 -32937 60072 28326
6693B8326l2363q5919M12399K21553r6851l43977l16993j24240K31390M3457O2106
$$ 28326 -4037 -89956 322443 543996 447145 103168 -213825 -338065 -106675 -63218 -1112
6682a112q2306m95131l19435R2475K00541J1675J5091K14435o9790J2157j39047
$$ -1112 -83418 -578549 -897984 -805509 -604968 -593293 -578202 -363767 -433557 -421400 -560447
6671e60447m5420K39479R4748J57658j0134m42631Q6076K20358K09328K25414
$$ -560447 -605867 -366388 -271640 -113982 -124116 -566747 -480671 -260313 -50985 174429
6661A74429M2425j56575L58001J22799n35504k89817J25248J88225k24023n786
$$ 174429 216854 60279 418280 541079 5575 -284242 -158994 29231 -194792 -200578
6651b00578O2442J20733J79693k39602j48354K70245L96701N6042k73326k81708
$$ -200578 -138136 -17403 162290 -77312 -225666 44579 441280 497322 223996 -57712
6641e7712j2159N2141k76309j8264N6284K22486R9150R5318J21193j75306k64775
$$ -57712 -69871 -17730 -294039 -312303 -256019 -33533 65617 160935 282128 106822 -157953
6630a57953j9329K78727N06481J30986n13407q05369l39862N00880J95240m1766
$$ -157953 -177282 101445 607926 738912 225505 -579864 -919726 -418846 -223606 -265372
6620b65372L4162N8014o0586l1202O2367J45931k12575m9090R5451j20438k19922
$$ -265372 -231210 -173196 -233782 -264984 -202617 -56686 -269261 -318351 -222900 -343338 -563260
6609e63260k7365j58165Q9619K34635n7181J77285J91746o7827l35759j22627
$$ -563260 -590625 -748790 -659171 -424536 -481717 -304432 -112686 -180513 -516272 -638899
6599f38899K21275J52800j17068J1291Q5645p4674l7031M452k67655j08218r309
$$ -638899 -417624 -264824 -381892 -370601 -284956 -359630 -396661 -392209 -659864 -768082 -777391
6588g77391L9434K77897L11358O9900k62680K00895l5701j3059L256j60515j76869
$$ -777391 -737957 -460060 -148702 -78802 -341482 -140587 -176288 -189347 -186091 -346606 -523475
6577e23475j23455J12220L51405J15616K34599J06593j47420P0958j02030J48663
$$ -523475 -646930 -534710 -183305 -67689 166910 273503 126083 197041 95011 243674
6567B43674l32864n78209K7521R3014k4831j3599L49668p484r0053k67684k82269
$$ 243674 -89190 -667399 -639878 -546864 -571695 -585294 -235626 -243110 -333163 -600847 -883116
6556h83116K18555J49308K37978Q1373P8641J28589j16665k67156o0805j26869
$$ -883116 -664561 -515253 -277275 -195902 -117261 11328 -105337 -372493 -433298 -560167
6546e60167K94188K52424k83176N9293R1643n0961Q7154J93670K732j36987j92222
$$ -560167 -265979 -13555 -296731 -237438 -145795 -196756 -109602 84068 86800 -50187 -242409
6535b42409q4232J55593Q1760L62963q7669j33938l11437k09444m206J08154L64135
$$ -242409 -326641 -171048 -89288 273675 186006 52068 -259369 -468813 -473019 -364865 -730
6524g30L25669J28624k81218m73845o86899l35759J23490M40839N3177J71800
$$ -730 324939 453563 172345 -301500 -988399 -1324158 -1200668 -759829 -706652 -534852
6514e34852L45759K71825K74150l0695J8681j01435j73603k9660k49768j86255
$$ -534852 -189093 82732 356882 326187 344868 243433 69830 40170 -209598 -395853
6504c95853L76361N9037k73055J42780j40824l9845J64390L786j33601j63601
$$ -395853 -19492 39545 -233510 -90730 -231554 -271399 -107009 -103223 -236824 -400425
6494d00425R1126l41514p9742P2852J67608o8694J35195J25797J24393J85824
$$ -400425 -309299 -650813 -730555 -657703 -490095 -558789 -423594 -297797 -173404 12420
6484A2420M03026j93493m32952M7587K97847L93551j52085j70864j3085K9739
$$ 12420 415446 221953 -210999 -163412 134435 527986 375901 205037 191952 221691
6474B21691j23320k33957l4949j18804K3964R7913R7598L4905P8059P3389L5048
$$ 221691 98371 -135586 -170535 -289339 -265375 -167462 -69864 -34959 43100 116489 151537
6463A51537l96467m4969L85273o9145k75470L8328o4552J39271K10968K7209l3506
$$ 151537 -244930 -289899 95374 26229 -249241 -210913 -275465 -136194 74774 101983 68477
6452F8477j7988l31879M5251K36632J24861P0160J56755Q2966N6920j34349j09890
$$ 68477 50489 -281390 -236139 493 125354 195514 352269 435235 492155 357806 247916
6441B47916J95106N425o2305j56818k54610n3968o0539J40765M45488j00049r8886
$$ 247916 443022 448447 386142 229324 -25286 -79254 -139793 972 446460 346411 247525
6430B47525J08905L07284k15802j01682j55914R4236k34005O0371j95199l46955
$$ 247525 356430 663714 447912 346230 190316 284552 50547 110918 -84281 -431236
6420d31236q0572j61535M50677O4091p8570K74769M34707j02088l50771j70920
$$ -431236 -511808 -673343 -222666 -158575 -237145 37624 472331 370243 19472 -151448
6410a51448k7869K07441k6574k20850R4168R5759K38043J60433Q4395k01120m9866
$$ -151448 -179317 28124 1550 -219300 -125132 -29373 208670 369103 453498 252378 202512
6399B02512l07961l1886K59310j59451k37632J56703L8496r8813k26171j8978
$$ 202512 -105449 -137335 121975 -37476 -275108 -118405 -79909 -178722 -404893 -423871
6389d23871J03894J33018L87359m3572o17445j04042J34282P5407J92808K14473
$$ -423871 -319977 -186959 200400 156828 -460617 -564659 -430377 -354970 -162162 52311
6379E2311j71389m19190J68515M19230K73499m4755k97731O4644L08518n8305
$$ 52311 -119078 -538268 -369753 49477 322976 278221 -19510 45134 353652 295347
6369B95347k84712L27198J9734m36229k72293j66275r3182L98872L03042k14045
$$ 295347 10635 337833 357567 -78662 -350955 -517230 -610412 -211540 91502 -122543
6359a22543j34803M07486J55563p5889j41977K57096R8612l15086m8297k3529
$$ -122543 -257346 150140 305703 229814 87837 344933 443545 128459 80162 56633
6349E6633J11932k6789l85574R7309n8840L16903J75193k41950N0708J94709J62306
$$ 56633 168565 141776 -243798 -146489 -205329 111574 286767 44817 95525 290234 452540
6338D52540K0117K06755k83486n65470l3785J07558K43226J39420r4561m6263
$$ 452540 472657 679412 395926 -169544 -203329 -95771 147455 286875 192314 146051
6328A46051Q5315K42137j05938m75554j97497q131J92875K25950k86822r9179
$$ 146051 231366 473503 367565 -107989 -305486 -313617 -120742 105208 -181614 -280793
6318b80793K66850J41985j11446J12041r1162j09654N4148N4957p7469r7251N4927
$$ -280793 -13943 128042 16596 128637 37475 -72179 -18031 36926 -40543 -137794 -82867
6307h2867J82661K5395M0176K77767k23244l65119J13331J76481k02469n1964
$$ -82867 99794 125189 165365 443132 219888 -145231 -31900 144581 -57888 -109852
6297a09852j17512O805L78376j9879l20094L982j9533j2931R7752K43822j21459
$$ -109852 -227364 -220559 157817 137938 -182156 -178174 -197707 -210638 -112886 130936 9477
6286I477r7705j0095L24663o2070O8206Q4590j94463J4580M5482K3853k6652l5651
$$ 9477 -88228 -98323 226340 164270 232476 317066 122603 137183 182665 206518 179866 144215
6274A44215k8136J77714N2762k05843J69510P7204n99294q7383L42637N2543k6235
$$ 144215 116079 293793 346555 140712 310222 387426 -211868 -299251 43386 95929 69694
6263F9694l51228o2542P0694K55905L63495R9759k56614j19301j21975j1612j92655
$$ 69694 -281534 -344076 -273382 -17477 346018 445777 189163 69862 -52113 -63725 -256380
6252b56380j83973k26013l7064K28557K81188K4937l9540P2390k65392K35142
$$ -256380 -440353 -666366 -703430 -474873 -193685 -168748 -208288 -135898 -401290 -166148
6242a66148K34953K5689J09447Q9054m71891l66645J75067j48303j20087J0642
$$ -166148 68805 94494 203941 292995 -178896 -545541 -370474 -518777 -638864 -628222
6232f28222K11696M45546J64872M7045J54981M7525k72077l18362o779P5598K10295
$$ -628222 -416526 29020 193892 240937 395918 443443 171366 -146996 -153775 -78177 132118
6221A32118p122j27465j73225j78901q966L12827L00724K7288p6014J03208p4144
$$ 132118 124996 -2469 -175694 -354595 -363561 -50734 249990 277278 201264 304472 230328
6210B30328k80876n5345L6328k03595j409K46819R641k24017j1002K08341L04433
$$ 230328 -50548 -105893 -69565 -273160 -274569 -27750 -18109 -242126 -253128 -44787 259646
6199B59646K24237j17470o85400n5117N54545j12207l05840J81383J86379K08101
$$ 259646 483883 366413 -318987 -374104 180441 68234 -237606 -56223 130156 338257
6189C38257m5020k50126j54868n9296M7016K64411K38648j5654O2349J00901n5385
$$ 338257 293237 43111 -111757 -171053 -124037 140374 379022 363368 425717 526618 471233
6178D71233k73252p907q4469L8926j39051m7283J47312K79208Q2162k82294m63680
$$ 471233 197981 190074 105605 144531 5480 -41803 105509 384717 466879 184585 -279095
6167b79095K6443j77034K57023J84934Q7569j5638p5569J42835k48160n44314
$$ -279095 -252652 -429686 -172663 12271 99840 84202 8633 151468 -96692 -641006
6157f41006p8494M43829K56501n5562j0329n8071k6270N924p0585j03514j78155
$$ -641006 -719500 -275671 -19170 -74732 -85061 -143132 -169402 -163478 -234063 -337577 -515732
6146e15732L43680J01081l57685n1857L11635Q4040J9137k35900j6766K41434
$$ -515732 -172052 -70971 -428656 -480513 -168878 -84838 -65701 -301601 -318367 -76933
6136g6933K91171K2446K74076L89744j67761l41866j74100L7580j08247j95463
$$ -76933 214238 236684 510760 900504 732743 390877 216777 254357 146110 -49353
6126d9353L3369J69370j18588N7197J61349n61773m52215L54749L06233J05184
$$ -49353 -15984 153386 34798 91995 253344 -308429 -760644 -405895 -99662 5522
6116E522P7825j80575l45027k04316J38787j59675Q1040J1368J86899J4125l66776
$$ 5522 83347 -97228 -442255 -646571 -507784 -667459 -586419 -575051 -388152 -374027 -740803
6105g40803m5684L47880L18154J04908r2456p6613o5848K48215r4J30935k3510
$$ -740803 -786487 -438607 -120453 -15545 -108001 -184614 -250462 -2247 -2341 128594 105084
6094A05084k23029l61499J05178K14845j3614L709j65594M61732J45692l59896
$$ 105084 -117945 -479444 -374266 -159421 -173035 -169326 -334920 126812 272504 -87392
6084h7392j269j33101r7515R0330J15550k10987O9865O5953O1117j08349o851
$$ -87392 -88661 -221762 -319277 -228947 -113397 -324384 -254519 -188566 -127449 -235798 -242649
6073b42649J02948Q2038K34079K47679L0576j87373l30072j13615k59199o9291
$$ -242649 -139701 -57663 176416 424095 454671 267298 -62774 -176389 -435588 -504879
6063e04879K64469K82070K13097l63171n23914K82031j0363J04881m4473Q3531
$$ -504879 -240410 41660 254757 -108414 -632328 -350297 -360660 -255779 -300252 -216721
6053b16721J63941n1183L30064q3887K5019l668j34394r3076K2506l0706J64267
$$ -216721 -52780 -103963 226101 142214 167233 163565 29171 -63905 -41399 -72105 92162
6042I2162k8874K37693p9821m2881p8112n06097P3591L10486J76685m258O7000
$$ 92162 63288 300981 221160 178279 100167 -405930 -332339 -21853 154832 150574 217574
6031B17574m8258N06604J94321k6541j44954m29417l74927j2053p6080J81862
$$ 217574 169316 675920 870241 843700 698746 269329 -105598 -117651 -193731 -11869
6021a1869K21037j62717j1548n5190j2521m9678J10756J50261l7710m68084k87464
$$ -11869 209168 46451 34903 -20287 -32808 -82486 28270 178531 140821 -327263 -614727
6010f14727J23932K23212R2712j64614j8911J61419k04924j34999J50939L43075
$$ -614727 -490795 -267583 -174871 -339485 -358396 -196977 -401901 -536900 -385961 -42886
6000d2886M37923l67662m81245j41185j33277L97163Q1708P2449P5590M4439m917
$$ -42886 395037 27375 -453870 -595055 -728332 -331169 -249461 -177012 -101422 -56983 -61900
5989f1900J38931j63093p6608j69746j69986L24396J96530o1322J8923J73028
$$ -61900 77031 -86062 -162670 -332416 -502402 -178006 18524 -42798 -23875 149153
5979A49153O3541Q9257N3749Q8594j87673R6445j45821k30710l14584J34585L5168
$$ 149153 212694 301951 355700 444294 256621 353066 207245 -23465 -338049 -203464 -168296
5968a68296j7624J7425J88308J76247j43244k25677m8739K30820K23737k26522
$$ -168296 -185920 -168495 19813 196060 52816 -172861 -221600 9220 232957 6435
5958F435j59930j15682k59412J11566J42428P8370k63703J53754K88021j58461
$$ 6435 -153495 -269177 -528589 -417023 -274595 -196225 -459928 -306174 -18153 -176614
5948a76614J16117K01284J01933j17648k3454J86183L71918j61644k95955l2031
$$ -176614 -60497 140787 242720 125072 101618 287801 659719 498075 202120 170089
5938A70089l27415J15485K84507J56723l06159l39902L25458J75087k25819m77684
$$ 170089 -157326 -41841 242666 399389 93230 -246672 78786 253873 28054 -449630
5928d49630K13699J17646k95064k23792q35J18417j7836J96641K26036O5615j85143
$$ -449630 -235931 -118285 -413349 -637141 -637976 -519559 -537395 -340754 -114718 -49103 -234246
5917b34246M8736J54487M5439j79669j23945k12126r0330r7824P6574k4499J65536
$$ -234246 -185510 -31023 14416 -165253 -289198 -501324 -591654 -689478 -612904 -637403 -471867
5906d71867K34793L35077p0163l98301K75525M07581J22429j92206p5072K72149
$$ -471867 -237074 98003 27840 -370461 -94936 312645 435074 242868 167796 439945
5896D39945j26068j13546k83819K04283P1615J221J69183R6109l37864k95742
$$ 439945 313877 200331 -83488 120795 192410 193631 362814 458923 121059 -174683
5886a74683K35063J77817l31390r1510M5087J09642K55433j98504k54289r642
$$ -174683 60380 238197 -93193 -184703 -139616 -29974 225459 26955 -227334 -236976
5876b36976J39398j86552K45403L05361q6521j75744L1081N7224j10233L5450
$$ -236976 -97578 -284130 -38727 266634 180113 4369 35450 92674 -17559 17891
5866A7891k7873j05647K36334L49883j43491k34967k29383l2717p213K5316K57552
$$ 17891 -9982 -115629 120705 470588 327097 92130 -137253 -169970 -177183 -151867 105685
5855A05685K89695k64202j05732J77238J15275j50727k44417j88228J20808O9653
$$ 105685 395380 131178 25446 202684 317959 167232 -77185 -265413 -144605 -74952
5845g4952k86969k39914k6174K51397L92456K57017j95404J10020m6778j68089
$$ -74952 -361921 -601835 -628009 -376612 15844 272861 77457 187477 140699 -27390
5835b7390J59347p1858k36210R7433K08118p0053r9808l9897q0720J12555J94719
$$ -27390 131957 60099 -176111 -78678 129440 59387 -40421 -80318 -161038 -48483 146236
5824A46236Q5610k7371n53364n43705L33001K86690L0716L67571M5694l71364
$$ 146236 231846 204475 -348889 -892594 -559593 -272903 -242187 125384 171078 -200286
5814b00286k55640o853J7574M54653n5643m71895K8913O09356k71397j45681p142
$$ -200286 -455926 -462779 -445205 9448 -46195 -518090 -489177 120179 -151218 -296899 -304041
5803c04041O9424K10283m0466k43217k11193j66792P1839m369L10862L08100J15270
$$ -304041 -234617 -24334 -64800 -308017 -519210 -686002 -614163 -618532 -307670 430 115700
5792A15700n0788l49676m65526k00729L87562L82308O9328k08142j42650O7121
$$ 115700 64912 -284764 -750290 -951019 -563457 -181149 -111821 -319963 -462613 -395492
5782c95492j54907J18874L46093J4217J16405l4306l79338j71159k04608K41052
$$ -395492 -550399 -431525 -85432 -71215 45190 10884 -368454 -539613 -744221 -503169
5772e03169p5747l35982j4674M22277L46305L08630m9503l82159k52355O7937
$$ -503169 -578916 -914898 -929572 -507295 -160990 147640 98137 -284022 -536377 -468440
5762d68440L35117L2230j21950j12193K25318m19196j97774j08760K82480L19144
$$ -468440 -133323 -101093 -223043 -335236 -109918 -529114 -726888 -835648 -553168 -234024
5752b34024j19555p7824P462j32622J62542j08493J96824Q0770K24783J01300
$$ -234024 -353579 -431403 -423941 -556563 -394021 -502514 -305690 -224920 -137 101163
5742A01163k8256j16219j30165k03627j18258J23037J83922J89928J79531J70294
$$ 101163 72907 -43312 -173477 -377104 -495362 -372325 -188403 1525 181056 351350
5732C51350k8534k9007j33555k83012O2223J71965J34148L28412k36111l56389
$$ 351350 322816 293809 160254 -122758 -60535 111430 245578 573990 337879 -18510
5722a8510O5196J27949j08218p1569L9380k45897j01138K66920L86832j23681
$$ -18510 46686 174635 66417 -5152 34228 -211669 -312807 -45887 340945 217264
5712B17264j12510j0492J70833N1904j59131l69706r8156k16973L0702m762k4740
$$ 217264 104754 94262 265095 316999 157868 -211838 -309994 -526967 -496265 -501027 -525767
5701e25767n051M99769J37029m274j12427q1584K04824j94950k60750J69193K84325
$$ -525767 -530818 -31049 105980 101706 -10721 -92305 112519 -82431 -343181 -173988 110337
5690A10337r4170j28429K22505K73155M8483m02118J26875P9161k66783m70383
$$ 110337 16167 -112262 110243 383398 431881 29763 156638 235799 -30984 -501367
5680e01367O8228J23027J57447J01057N8905k47039J2289N5213L1597r1016n5171
$$ -501367 -433139 -310112 -152665 -51608 7297 -239742 -227453 -172240 -140643 -231659 -286830
5669b86830n3591L08740J85971k48982J46470M26553p4667n0357j50511l09633
$$ -286830 -340421 -31681 154290 -94692 51778 478331 403664 353307 202796 -106837
5659a06837J06694m9042J32742p4918L80679q8168J17107q1224k32521l29656
$$ -106837 -143 -49185 83557 8639 389318 301150 418257 337033 104512 -225144
5649b25144N3463R4077k5716p5509J85593J31739M280k24003L0216o940p4969
$$ -225144 -171681 -77604 -103320 -178829 6764 138503 142783 -81220 -51004 -57944 -132913
5638a32913k7147J68230J32557l51132k40262o8361J96822K25894P7672j20171
$$ -132913 -160060 8170 140727 -210405 -450667 -519028 -322206 -96312 -18640 -138811
5628a38811R885j93760p2101R2061p4618P0639M1233n4064N3093K51337J80159
$$ -138811 -128926 -322686 -394787 -302726 -377344 -306705 -265472 -319536 -266443 -15106 165053
5617A65053q1782j78743J62490O2345k99715k6392R4062J65312j73935j29904
$$ 165053 83271 -95472 67018 129363 -170352 -196744 -102682 62630 -111305 -241209
5607b41209J30205K31890L07259J12321j41979L7915j13951l87643j40023M681
$$ -241209 -111004 120886 428145 540466 398487 436402 322451 -65192 -205215 -200534
5597b00534k15164O0498L11766J06707k40253J88578J65395j92493l57298l25765
$$ -200534 -415698 -355200 -43434 63273 -176980 11598 176993 -15500 -372798 -698563
5587f98563L07499J51737m2669j68396N8505J22184n9018L4360J8419J17453K77102
$$ -698563 -391064 -239327 -281996 -450392 -391887 -269703 -328721 -294361 -275942 -158489 118613
5576A18613j6232l31407J37986K09781J4558j3935j00643j61200N4767K235J47265
$$ 118613 102381 -229026 -91040 118741 133299 119364 18721 -142479 -87712 -85477 61788
5565F1788L73150l4688k82966k86722O6407l21425k3426J30002m4868L45966M59936
$$ 61788 434938 400250 117284 -169438 -103031 -424456 -447882 -317880 -362748 -16782 443154
5554D43154j27784m23930j5336n1532J63075J95039k70117j86958k9400j5820
$$ 443154 315370 -108560 -123896 -175428 -12353 182686 -87431 -274389 -303789 -319609
$$ [...]
##END NTUPLES=NMR SPECTRUM
##END=
