##TITLE=Analysis number 321632
Compound Code cc 54816
Book Reference 458/184
Project Code adrs
Chemist Name stevem
##JCAMPDX= 6.0         $$ Bruker NMR JCAMP-DX V2.0
##DATA TYPE= NMR SPECTRUM
##DATA CLASS= NTUPLES
##ORIGIN= Bruker BioSpin GmbH
##OWNER= nmr
$$ XWIN-NMR		Version 3.5
$$ Fri Aug 18 14:11:01 2006 GMT Daylight Time (UT+1h)  MAYBRIDGE\nmr@NMR_250MHZ
##.OBSERVE FREQUENCY= 250.131544655141
##.OBSERVE NUCLEUS= ^1H
##.ACQUISITION MODE= SIMULTANEOUS (DQD)
##.ACQUISITION SCHEME= undefined
##.AVERAGES= 16
##.DIGITISER RES= 18
##SPECTROMETER/DATA SYSTEM= dpx250
##.PULSE SEQUENCE= zg30
##.SOLVENT NAME= CDCl3
##.SHIFT REFERENCE= (INTERNAL, CDCl3, 0, 16.522)
##AUDIT TRAIL= $$ (NUMBER, WHEN, WHO, WHERE, WHAT)
$$ ##TITLE= Audit trail, XWIN-NMR		Version 3.5
$$ ##JCAMPDX= 5.01
$$ ##ORIGIN= Bruker BioSpin GmbH
$$ ##OWNER= nmr
$$ C:\u/data/dgb/nmr/ADRS/1200/pdata/1/auditp.txt
$$ ##AUDIT TRAIL=  $$ (NUMBER, WHEN, WHO, WHERE, WHAT)
(   1,<2006-08-18 14:10:39.05 +100>,<MAYBRIDGE\nmr>,<NMR_250MHZ>,
      <created by zg, POWCHK disabled, PULCHK disabled
       configuration hash MD5:
       E2 DF 36 D8 04 B2 41 60 5A D7 A3 38 5A 4B D0 FE
       data hash MD5: 64K
       E8 81 8A A3 91 F6 5C F7 53 91 B7 02 F9 64 4C E8>)
(   2,<2006-08-18 14:10:52.22 +100>,<MAYBRIDGE\nmr>,<NMR_250MHZ>,
      <Start of raw data processing
       ef LB = 0.3 FT_mod = 6 PKNL = 1 SI = 32K 
       data hash MD5: 32K
       47 63 7D 76 9A 01 D0 7A F5 0C CE 09 2F E9 67 91>)
(   3,<2006-08-18 14:10:53.83 +100>,<MAYBRIDGE\nmr>,<NMR_250MHZ>,
      <apk 
       data hash MD5: 32K
       91 DD E3 91 FD AD 17 6D D1 6D 19 0E BE FA A6 E6>)
(   4,<2006-08-18 14:10:54.77 +100>,<MAYBRIDGE\nmr>,<NMR_250MHZ>,
      <abs ABSG = 5 
       data hash MD5: 32K
       38 3B AF 48 BC 99 C4 59 AD F0 EC FE CA 0E CC 81>)
$$ ##END=
$$ 
$$ hash MD5
$$ 06 36 1A A7 CC 40 F4 57 26 08 8A 83 E9 00 13 33
##$RELAX= 
##$RELAX= 
##$RELAX= 
##$RELAX= 
##$RELAX= 
##$RELAX= 
##$RELAX= 
$$ Bruker specific parameters
$$ --------------------------
##$DU= <C:\u>
##$EXPNO= 1200
##$NAME= <ADRS>
##$PROCNO= 1
##$TYPE= <nmr>
##$USER= <dgb>
##$AMP= (0..31)
100 100 100 100 100 100 100 100 100 100 100 100 100 100 100 100 100 100 
100 100 100 100 100 100 100 100 100 100 100 100 100 100 
##$AQSEQ= 0
##$AQ_mod= 3
##$AUNM= <au_zg>
##$AUTOPOS= <41 >
##$BF1= 250.13
##$BF2= 250.13
##$BF3= 250.13
##$BF4= 250.13
##$BF5= 500.13
##$BF6= 500.13
##$BF7= 500.13
##$BF8= 500.13
##$BYTORDA= 1
##$CFDGTYP= 0
##$CFRGTYP= 5
##$CHEMSTR= <none>
##$CNST= (0..31)
1 1 145 1 1 1 1 1 1 1 1 1 1 1 1 1 1 1 1 1 1 1 1 1 1 1 1 1 1 1 1 1 
##$CPDPRG= <>
##$CPDPRG1= <>
##$CPDPRG2= <>
##$CPDPRG3= <>
##$CPDPRG4= <mlev>
##$CPDPRG5= <mlev>
##$CPDPRG6= <mlev>
##$CPDPRG7= <mlev>
##$CPDPRG8= <mlev>
##$CPDPRGB= <>
##$CPDPRGT= <>
##$D= (0..31)
0 1 0 0 0 0 0 0 0 0.06 0 0 0 0 0 0 0.0002 0 0 0 0 0 0 0 0 0 0 0 0 0 0 
0 
##$DATE= 1155906638
##$DBL= (0..7)
120 120 120 120 120 120 120 120 
##$DBP= (0..7)
150 150 150 150 150 150 150 150 
##$DBP07= 0
##$DBPNAM0= <>
##$DBPNAM1= <>
$$ [...]
##$SUBNAM7= <"">
##$SUBNAM8= <"">
##$SUBNAM9= <"">
##$SW= 20.6930455092707
##$SWIBOX= (0..15)
0 0 3 0 0 0 0 0 0 0 0 0 0 0 0 0 
##$SW_h= 5175.983436853
##$TD= 65536
##$TD0= 1
##$TE= 296.16
##$TE2= 300
##$TE3= 300
##$TEG= 300
##$TL= (0..7)
0 120 120 120 120 120 120 120 
##$TP= (0..7)
150 150 150 150 150 150 150 150 
##$TP07= 0
##$TPNAME0= <>
##$TPNAME1= <>
##$TPNAME2= <>
##$TPNAME3= <>
##$TPNAME4= <>
##$TPNAME5= <>
##$TPNAME6= <>
##$TPNAME7= <>
##$TPOAL= (0..7)
0.5 0.5 0.5 0.5 0.5 0.5 0.5 0.5 
##$TPOFFS= (0..7)
0 0 0 0 0 0 0 0 
##$TUNHIN= 0
##$TUNHOUT= 0
##$TUNXOUT= 0
##$USERA1= <user>
##$USERA2= <user>
##$USERA3= <user>
##$USERA4= <user>
##$USERA5= <user>
##$V9= 5
##$VALIST= <valist>
##$VCLIST= <CCCCCCCCCCCCCCC>
##$VD= 0
##$VDLIST= <DDDDDDDDDDDDDDD>
##$VPLIST= <PPPPPPPPPPPPPPP>
##$VTLIST= <TTTTTTTTTTTTTTT>
##$WBST= 1024
##$WBSW= 4
##$XGAIN= (0..3)
0 0 0 0 
##$XL= 0
##$YL= 0
##$YMAX_a= 269191
##$YMIN_a= -435655
##$ZGOPTNS= <>
##$ZL1= 120
##$ZL2= 120
##$ZL3= 120
##$ZL4= 120
##$ABSF1= 16.522
##$ABSF2= -4.171173
##$ABSG= 5
##$ABSL= 3
##$ALPHA= 0
##$AQORDER= 0
##$ASSFAC= 0
##$ASSFACI= 0
##$ASSFACX= 0
##$ASSWID= 0
##$AUNMP= <proc_1d>
##$AZFE= 0.1
##$AZFW= 0.1
##$BCFW= 0
##$BC_mod= 0
##$BYTORDP= 0
##$COROFFS= 0
##$CY= 12.5
##$DATMOD= 1
##$DC= 0
##$DFILT= <>
##$DTYPP= 0
##$F1P= 14.0000005364418
##$F2P= -0.99999901652339
##$FCOR= 0.5
##$FTSIZE= 32768
##$FT_mod= 6
##$GAMMA= 0
##$GB= 0
##$INTBC= 1
##$INTSCL= 1
##$ISEN= 128
##$LB= 0.3
##$LEV0= 0
##$LPBIN= 0
##$MAXI= 10000
##$MC2= 0
##$MEAN= 0
##$ME_mod= 0
##$MI= 0
##$NCOEF= 0
##$NC_proc= -5
##$NLEV= 6
##$NOISF1= 0
##$NOISF2= 0
##$NSP= 0
##$NTH_PI= 0
##$NZP= 0
##$OFFSET= 16.522
##$PC= 1
##$PHC0= 155.3877
##$PHC1= 1.543352
##$PH_mod= 1
##$PKNL= yes
##$PPARMOD= 0
##$PSCAL= 4
##$PSIGN= 0
##$REVERSE= no
##$SF= 250.13
##$SI= 32768
##$SIGF1= 0
##$SIGF2= 0
##$SINO= 400
##$SIOLD= 32768
##$SREGLST= <1H.CDCl3>
##$SSB= 0
##$STSI= 32768
##$STSR= 0
##$SW_p= 5175.98343685301
##$SYMM= 0
##$S_DEV= 0
##$TDeff= 65536
##$TDoff= 0
##$TI= <Analysis number 999999
Compound Code 99
Book Reference 9
Project Code 9>
##$TILT= no
##$TM1= 0
##$TM2= 0
##$TOPLEV= 0
##$USERP1= <user>
##$USERP2= <user>
##$USERP3= <user>
##$USERP4= <user>
##$USERP5= <user>
##$WDW= 1
##$XDIM= 32768
##$YMAX_p= 387055139
##$YMIN_p= -1266473
$$ End of Bruker specific parameters
$$ ---------------------------------
##NTUPLES= NMR SPECTRUM
##VAR_NAME=  FREQUENCY,     SPECTRUM/REAL,   SPECTRUM/IMAG
##SYMBOL=    X,             R,               I
##VAR_TYPE=  INDEPENDENT,   DEPENDENT,       DEPENDENT
##VAR_FORM=  AFFN,          ASDF,            ASDF
##VAR_DIM=   32768,         32768,           32768
##UNITS=     HZ,            ARBITRARY UNITS, ARBITRARY UNITS
##FACTOR=    0.157963299565203, 1,           1
##FIRST=     4132.6476996994, 0,             0
##LAST=      -1043.33573715361, 0,           0
##MIN=       -1043.33573715361, -1266473,    0
##MAX=       4132.6476996994, 387055139,     0
$$ Real data points
##PAGE= N=1
##DATA TABLE= (X++(R..R)), XYDATA
$$ [...]
27679 -360838 -349568 -1014 135367 108948 77196 125765 90421 -38345 -24434 -150769 84774
27668 84774 102147 85392 -136766 -505793 -627363 -610343 -402568 -160416 -196920 11974
27658 11974 110981 -31804 45957 80656 -14287 -212801 -274114 -241698 -256004 -122555 -156816
27647 -156816 -211018 3847 62975 -74473 -219461 -240517 -323859 -196622 -207304 -333519
27637 -333519 -37183 569036 363723 189819 210297 270899 -49315 -175579 -411403 -432135
27627 -432135 100799 46910 -56268 90062 -36998 -16480 161440 192727 268806 -30646
27617 -30646 38152 65505 209767 440022 396883 279223 -378047 -345392 -362295 -311010 -407336
27606 -407336 -503631 -288617 -417562 -523123 -263095 12712 -315015 -454760 -382395 -447355
27596 -447355 -699360 -621061 -521433 -688117 -633567 -461588 137451 -179591 -517375 -707119
27586 -707119 -282045 -34372 165123 115351 -347623 -109786 76976 283029 330456 495143
27576 495143 817133 719373 442820 594849 612819 820994 599769 312213 107961 -29159
27566 -29159 68641 -53952 -274425 -20952 94738 139602 85826 -79813 196587 224694
27556 224694 -75327 30605 46619 -28420 -151855 -139072 108506 253276 233710 202396
27546 202396 87032 147408 -56416 -257826 -4329 229626 182499 105295 -273539 -305544
27536 -305544 -312367 -275572 -509167 -309979 -221184 -79223 151419 -25810 -165308 -16587
27526 -16587 207900 393026 467161 631316 620225 539350 498135 179845 -247385 -184558 242371
27515 242371 520000 489785 521790 201250 106392 42163 299135 435944 242938 -4837
27505 -4837 175778 336298 -62903 -191989 -141445 66319 349172 414740 342588 280050 -112894
27494 -112894 -249239 126202 188489 43939 309193 102848 -1667 -88563 -179745 -124814
27484 -124814 50340 16216 336011 726342 840423 744898 365578 156588 -86551 -249002
27474 -249002 -70594 36031 351552 748432 689927 313317 399085 285768 231662 165224
27464 165224 15514 -312845 -249074 -8400 -198042 -338025 -129640 461702 423206 179208
27454 179208 -163307 -346292 -107848 180755 -180747 -203570 198868 258283 200900 288324
27444 288324 303945 137361 51543 42158 18698 -116915 -27269 92971 -221937 -265368 -166723
27433 -166723 -183963 -149846 2358 -98918 -244663 -331876 -265363 -506024 -535385 -292019
27423 -292019 30855 -114057 -141888 -165474 -117541 173778 -41925 -116458 -91930 -208850
27413 -208850 -404096 -296593 -223378 -364382 -290431 5481 310946 298772 235089 348380
27403 348380 44419 -127494 -381301 -395636 -206864 -285842 -154305 9842 79913 -75331
27393 -75331 -72967 -256437 -183445 84534 135580 15360 -32807 -318953 -533774 -526063 -424655
27382 -424655 -349436 -299233 207916 725102 453824 287033 196779 155483 110326 32989 170420
27371 170420 162712 -12482 112896 -50907 -209852 -231607 -87625 -17448 -39421 10956 493454
27360 493454 451290 193315 -217894 -515038 -339228 -254728 -447219 -437189 -298354 -135660
27350 -135660 214082 310005 212120 49706 -361982 -534958 -334692 -541262 -802419 -554334
27340 -554334 -244238 -113959 122201 25451 56817 -87568 -347223 -494215 -186480 133674
27330 133674 76963 87397 -145790 -219980 -384761 -314174 109844 99431 36943 -13883 48603
27319 48603 -41699 -226808 -312308 -190431 -412819 -264102 -51379 288460 678508 679343 381951
27308 381951 -203398 -366706 151652 219403 -51138 -211111 45105 95170 291096 380953
27298 380953 349499 500869 622018 446257 380196 234028 75434 -155053 -491976 -485529
27288 -485529 -230684 -350361 -449753 -332465 -56609 338084 665750 921016 612290 -19897
27278 -19897 -254586 -276080 204986 377019 288449 5110 175858 536364 662586 370526
27268 370526 -76165 -350868 -453262 -806703 -505120 -208437 -221585 -389914 -534977 -793530
27258 -793530 -710517 -583029 -346289 -194269 -333375 69406 211190 49213 1775 109736
27248 109736 -245632 -623457 -517042 -465053 -556607 -793205 -865297 -516897 -305567 -275358
27238 -275358 -275876 -399457 -293051 -229692 38732 87312 -84609 -168957 -89566 -84574 127821
27227 127821 163234 151164 59531 72771 12092 -97452 61495 -82858 4451 159356 167376
27216 167376 230182 258674 -29033 -370518 -235178 -43087 -189930 -442573 -536588 -411703
27206 -411703 -576486 -563171 -585606 -262753 31608 152795 131720 107957 291891 96815
27196 96815 -213733 -390971 -657860 -550034 -157345 18702 -33887 -172892 -294857 -458349
27186 -458349 -575899 -405484 -479718 -392414 -50431 131573 350691 328196 362397 417661
27176 417661 647585 794251 760820 499100 223821 61020 186428 22881 -168384 -183435
27166 -183435 98947 257956 377168 225175 33505 120948 425933 446122 100695 178378
27156 178378 203126 234931 203889 -94012 -255311 -527707 -464151 -467155 -258631 -127138 -145327
27145 -145327 -408990 -398272 -98298 55892 64620 101577 148274 73819 -243022 -548718 -385662
27134 -385662 -161061 60867 44524 -224472 -30495 158617 -155336 -425290 -80723 215838
27124 215838 152711 164538 133626 -143883 -296497 -58206 -35992 44903 21093 42130 85125
27113 85125 147425 307497 339967 287661 59382 41523 3932 -302739 -492753 -445043 -120200
27102 -120200 -165592 -304144 -147473 -216123 -118749 -148651 134282 159646 -252032 -416888
27092 -416888 -279847 -500106 -284285 442668 559850 407226 352107 94373 -291434 -384542
27082 -384542 -123671 215619 -48157 -241253 -325024 -114626 -375625 -789299 -691698 -374525
27072 -374525 -184525 -293212 -17118 209011 538927 109653 -143896 53372 -41913 -18199
27062 -18199 6962 -88576 -124588 50018 -279115 -489873 -540782 -709684 -686708 -423293 -290515
27051 -290515 11663 126225 239644 202032 -259062 -209464 -358249 -544786 -364088 -114475
27041 -114475 -291780 -225862 -28223 -324472 -208351 -239168 -433524 -630337 -573096 -397284
27031 -397284 -234711 -359941 -178109 56311 125537 -44146 -296406 -301282 -173314 -268006
27021 -268006 -235239 133590 279619 -235296 -372938 -410454 -179431 54692 -152068 -172704
27011 -172704 14481 -31415 86000 -62864 -75069 -404874 -148235 390440 684431 461913
27001 461913 302207 455712 389889 346894 261593 202868 87723 15485 -42560 293092 491048
26990 491048 276915 31471 14853 -410162 -593167 -126286 -26997 81714 -346089 -443440
26980 -443440 -417299 -246135 -105742 57571 -94414 8701 48770 -68991 64389 234146
26970 234146 253416 -145793 -229051 -427467 -474103 -273345 -420040 -509183 -332321 -411982
26960 -411982 -520416 -256738 81984 -172136 -314348 -449886 -672971 -364363 -72608 145438
26950 145438 12122 -168635 -429804 179264 126216 156061 336698 53745 -125650 -150774
26940 -150774 -372696 -537503 -567122 -418817 -137067 -130433 -189293 -212566 -280762 -226182 -46478
26929 -46478 328829 872205 788919 630769 693388 842166 658051 393212 389713 243714
26919 243714 83655 -186638 -231413 -454419 -824257 -763044 -496575 -319451 -110301 269448
26909 269448 267957 58730 144735 223150 112308 -56240 44772 237849 351001 371574
26899 371574 551920 571891 471394 331050 14448 -386690 -322755 -283732 -532900 -365941
26889 -365941 50816 189226 132710 143905 -198765 -320887 -204953 -184828 41031 17715
26879 17715 -49545 -147605 -228895 242690 502718 246166 10627 -115982 -307509 -150559
26869 -150559 106495 -160457 -13149 -203915 23929 14349 -251805 174550 520419 554907
26859 554907 442603 441600 250093 201033 -105932 -301382 -361759 -312043 -218247 32572 243667
26848 243667 419306 386545 141680 -116746 -183880 -230715 -85223 75760 5514 -219540
26838 -219540 -417402 -227991 -32195 -51656 46489 -251246 -415016 -423353 -431391 4008 -104014
26827 -104014 -370643 -251016 -79338 92049 -92305 -286608 -217059 -106564 65311 239741
26817 239741 186221 42358 -57725 189426 246087 262997 193290 -48410 -283381 223273
26807 223273 373154 664477 606361 216801 -61859 226116 226632 44413 -120968 -13406
26797 -13406 97179 23361 -187697 -22136 -49374 -135617 -238378 -113180 387049 455564
26787 455564 302776 434468 272616 211019 -144743 -99006 186987 157017 -84686 -241671
26777 -241671 -162341 -132583 116037 481269 666718 857731 675546 724583 482363 295265
26767 295265 133418 -260365 -27529 247224 679380 773634 965168 737306 441636 676197
26757 676197 650172 407466 -55477 -360311 -420664 -289277 -20613 6474 74891 -272760
26747 -272760 -155191 242050 523291 181049 -166395 -268089 -139140 -340266 -187402 -290495
26737 -290495 -302150 68015 -33888 35523 330415 211050 -55519 -448695 -193083 226339
26727 226339 36471 -65230 179046 287313 219875 -97386 -491209 -519567 -644983 -669421
26717 -669421 -265361 28055 409460 651879 507166 215795 294861 142461 -288004 -278683
26707 -278683 9324 48611 287030 225516 428446 373208 409775 483929 394066 218317 167096
26696 167096 -135668 -310540 -130996 -88317 211487 -149953 -519643 -391091 -403352 -434907
26686 -434907 -141430 -28226 -103689 63941 -31550 -54631 -80769 -317610 -431173 -677983
26676 -677983 -741343 -783799 -823354 -793427 -776178 -632798 -540001 -435727 -370439 -166056 43700
26665 43700 301068 351016 153010 128352 185621 406863 478733 251250 -56510 -204584
26655 -204584 -236727 -122271 23444 -106613 280705 568537 492915 182960 -79106 119643
26645 119643 196175 456325 223753 -229012 -246845 -246963 37518 150064 -43947 -217141
26635 -217141 -190760 137264 402796 68226 268870 430543 238373 139185 -67411 -345252
26625 -345252 -297929 -200763 118622 189449 -149929 -318159 -382947 -412265 -171175 44763
26615 44763 493944 479853 668320 598041 295515 127062 45142 289401 586412 832526
26605 832526 887794 578214 317403 225902 337617 225721 342722 238941 -31136 24631
26595 24631 421236 491442 638630 457760 129572 -312367 -689824 -598784 -395536 -319779
26585 -319779 -279717 -177004 121087 136849 19366 78731 -77072 -281879 -696104 -702774
26575 -702774 -631986 -468581 -463874 -497318 -427695 -625481 -604145 -297826 -216754 -217321 -234391
26564 -234391 -285854 -231742 -180821 -282529 -97372 -285598 -236336 -425876 -410926 -170810
26554 -170810 -49199 -39977 -19600 -121884 -244656 -330271 -130864 -331057 -647009 -590847
26544 -590847 -149253 -136608 51430 147492 -212658 50933 457251 388184 503940 377383
26534 377383 267248 108121 64500 336677 147482 659 23279 280464 679866 680111
26524 680111 711219 700868 666545 678817 200220 -160083 -174840 -95778 -275412 -220817 -156710
26513 -156710 -385480 -481527 -102055 463231 646088 613120 360869 362325 562953 289176
26503 289176 273741 298947 451057 722441 274920 144517 57270 75982 19750 -48109 -68019
26492 -68019 -196636 -489211 -546588 -85788 58976 -139156 -283291 -197294 -332647 -211196
26482 -211196 -255688 -55497 -70387 -227571 -547696 -590252 -260943 -30453 -239586 -188920
26472 -188920 -150711 -210220 -289742 -315416 -200150 75152 85421 180600 152713 339153 666730
26461 666730 555597 557295 32510 -36044 -135755 -396150 -363362 -54092 102 -75810 185916
26450 185916 -84481 -289039 -328815 -383951 -370997 -446587 -20273 206554 84944 -13350
26440 -13350 -305788 -616500 -702256 -702314 -700752 -332756 -82535 -415751 -655496 -570944 -294011
26429 -294011 -355295 -420806 -30305 74252 222797 314382 107945 238881 15915 49079
26419 49079 -4740 315149 282103 -12801 -329498 -27853 309472 485649 520174 855742
26409 855742 786245 459338 114771 -237543 -315670 -576141 -706061 -671885 -249034 94329
26399 94329 154144 21134 -36787 2924 -182302 -138998 206275 191929 -135926 -89093 284965
26388 284965 388506 443638 525316 604983 440903 -51035 -35473 -103983 -268353 93182
26378 93182 488614 346971 573824 642667 -15267 -263199 -249585 -311128 -264409 49928
26368 49928 -93395 -391108 -72052 290299 523690 636809 444848 -136168 -147429 -545654
26358 -545654 -587217 -35923 437375 367772 221918 -3479 -115750 180074 296962 -223075
26348 -223075 -597978 -371502 45843 164580 377075 404488 35235 -200137 -248684 -274409
26338 -274409 -339804 -71656 72982 -65423 -110096 24821 -77367 -343601 -615301 -457610
26328 -457610 -323826 -175479 354081 175652 281874 364189 48539 96028 148099 369784
26318 369784 -130190 -48420 260416 464260 331288 -209273 -220581 -118079 120953 24645
26308 24645 200090 112743 210476 244044 146006 495696 728799 451365 394308 668212 727090
26297 727090 430246 269102 -21530 -54544 -71777 -306562 -414328 -83117 164339 331292
26287 331292 313155 38279 -204610 -43707 210729 246132 266503 271363 223594 -65599 -417335
26276 -417335 -569710 -440616 -454629 -189298 173422 -136614 -173515 101086 43863 -114199
26266 -114199 -215784 -563954 -673214 -615018 -475251 36144 363666 482677 265141 404008
26256 404008 586703 340902 321564 613974 632669 447624 162204 322289 284130 688030
26246 688030 446907 348358 49969 -397558 -650827 -568071 -207691 253202 48481 -59329
26236 -59329 -153474 -99949 -46488 73034 571981 800294 494515 286981 216219 37600
26226 37600 92780 431779 506592 -35713 -49418 321988 711063 918110 789855 409903
26216 409903 -366832 -554959 -403005 -439198 -667734 -685902 -653133 -474816 -447067 -288728
26206 -288728 -220549 -222457 -310343 -48045 183841 232214 157433 246544 384010 -155391 -84877
26195 -84877 -326250 -635653 -535511 -280679 -233891 -198479 -478450 -313677 -278005 -305430
26185 -305430 -279556 -380417 -459351 -706588 -675430 -466294 -488428 -447505 -391323 -140744 478077
26174 478077 863200 411052 32547 -416569 -565400 -306486 -204344 -142697 -70213 -474899
26164 -474899 -473111 -566871 -698011 -682243 -854847 -726571 -482383 -221361 -383335 -538014
26154 -538014 -517509 -315777 -161613 -339106 -561991 -728151 -863087 -1002801 -1063744 -672038
26144 -672038 -478340 -14970 -171133 -293174 -447628 -472129 -125112 92203 162108 177968
26134 177968 -69435 -86546 -133747 -407044 -260980 -117959 6168 209226 23494 -57167
26124 -57167 8494 -64857 -297041 -14071 410941 361408 458857 173726 -64001 42071
26114 42071 -34728 -59980 -6666 -92324 52125 108938 65327 318068 395811 513132 859641
26103 859641 916572 642729 624785 560044 274171 527056 856784 1057517 717386 300041
26093 300041 83824 -105095 -161024 241 66362 -268552 -327582 -257533 -24341 84945
26083 84945 360042 414197 255631 303238 358797 281964 -14643 89219 194999 -101821
26073 -101821 -270953 -169964 71555 343862 196003 99866 -255586 -819687 -570335 -399981
26063 -399981 -406672 -345601 -113227 48817 155128 245629 -115454 -356067 52750 -154728
26053 -154728 -279495 -535270 -1023728 -815134 -180084 79259 250151 -42020 -276071 -144462
26043 -144462 195142 436591 505212 232738 -17553 -250027 -246060 -33690 -160239 14299
26033 14299 197775 276527 -182400 -125031 -65182 -246882 -210594 -162100 -240788 5497 249892
26022 249892 208035 -94099 -122394 -101203 -211120 -480579 -601525 -75683 263335 265069
26012 265069 48345 -52859 270682 313767 307596 460588 664562 422074 176520 74183
26002 74183 155069 234534 521322 611155 415293 103367 -103020 -52467 -134601 -63866 -273239
25991 -273239 -639964 -838785 -716974 -418551 -158220 33034 -24101 -173889 -461882 -395068
25981 -395068 -53048 219609 -11135 -323863 -534154 -384005 -195908 -105243 -270026 -100510
25971 -100510 61847 383868 521862 339102 72126 -194658 138787 433865 327500 114507
25961 114507 -103940 -120570 -98271 -222716 -203117 -305997 -612368 -700477 -308480 -449885
25951 -449885 -594804 -474791 -467880 -161747 309966 456195 473574 416857 206479 204713 159368
25940 159368 17618 313675 241482 -92011 241975 363716 286645 59265 -110995 182757
25930 182757 312317 108433 367445 461464 252327 1591 -139915 133509 227877 64935
25920 64935 -5869 134982 411888 580285 757271 364589 40692 145767 -87213 61035
25910 61035 488456 541740 295223 388649 562862 645706 387294 -351078 -323737 -258000 -255026
25899 -255026 -202613 -376932 -322786 -165790 -23135 -24981 124001 279273 187797 214611 217611
25888 217611 -145352 -223982 11635 231231 332827 569525 641745 661714 437276 504295
25878 504295 448966 61119 -275259 -249217 157597 767275 825922 632531 566901 740627
25868 740627 793337 722137 448583 118308 1155 -210146 -284959 -247000 -88145 155568
25858 155568 -99946 -341992 -98227 439984 456717 115431 -60107 167817 -14596 -17810
25848 -17810 -91903 -371724 -422521 -362034 -256273 -183024 172319 192313 215653 345941 339080
25837 339080 163295 52461 214491 637755 625536 567878 412898 291781 174073 250830
25827 250830 392707 329880 -7560 -201996 124433 78862 -175152 -207677 -148558 -474783
25817 -474783 -436440 191270 763298 413179 -167528 -288109 -343580 -444003 -256192 -458145
25807 -458145 -565673 -501705 -550376 -469465 -248024 17280 -34428 22764 -116385 -238172
25797 -238172 -410803 -88372 249725 216078 421968 660873 327702 -80267 -50173 49234
25787 49234 126970 53043 101778 -252881 -585779 -288603 131716 -192874 -377243 -332478
25777 -332478 -134096 -77824 59210 110281 113065 216878 58984 -239532 -488842 -250448
25767 -250448 -136243 37812 179696 413052 397455 115968 -12024 158841 313981 186785
25757 186785 -32144 -43339 73084 -8044 -209567 -262294 -413584 -309202 -559848 -339938
25747 -339938 -347551 -24237 397295 527130 288575 -48795 -158655 178480 109531 -141957
25737 -141957 -96818 145098 113114 -7520 -315649 -298984 -9010 181635 439895 311895
25727 311895 154019 150325 363655 504978 679045 403320 -4960 -21396 398738 178773
25717 178773 55050 173539 230420 -157820 -422523 -186055 -13555 374225 705601 595121
25707 595121 365012 -68637 -164572 -195575 -193586 -20708 278779 283081 100542 -230734 -197900
25696 -197900 395642 748631 561304 527926 601777 396479 446930 518562 230939 -248595
25686 -248595 -140734 236804 220701 89429 -271139 -262532 96356 259530 97402 -149728
25676 -149728 -454337 -513470 -581406 -301817 201966 206771 180513 -142033 -216874 -45402 -76166
25665 -76166 -75998 -248819 -552273 -678174 -618513 -459354 -538405 -366804 33252 255367 117048
25654 117048 160467 285205 259042 237508 299788 83437 -187745 167648 1698 44411
25644 44411 -228450 -278658 -339485 -373045 175835 457090 258952 470809 206034 258896
25634 258896 237830 144823 333378 120358 -64746 78275 125346 313433 577080 679302
25624 679302 576260 567035 735977 490239 36276 49937 -374856 -393994 -141540 32724
25614 32724 -68987 -6525 288166 150769 42074 22387 238083 412286 106714 -72978
25604 -72978 -45098 -189079 -131997 -33234 -222481 -119104 213227 255982 234191 123431 -73446
25593 -73446 101169 -346006 -377577 -191255 -284929 -509456 -288371 -386975 -327382 87626
25583 87626 11169 68430 179290 427054 825638 731464 448578 321242 246051 116238
25573 116238 131105 253611 418867 163123 -137244 -328303 -392367 -429173 -315509 -321581
25563 -321581 -167252 -33165 -71785 43715 113495 177857 267361 84036 -113431 -150290
25553 -150290 -234205 -297986 -331789 -178943 -303056 -45164 -435055 -517221 -181151 -144604
25543 -144604 103784 -76946 32312 136161 -50865 -386351 -114469 -136035 -381073 -197703
25533 -197703 -251812 -431293 -248566 99247 405340 732486 840127 800747 140478 -201719
25523 -201719 -496449 -357602 -106886 31720 166400 19621 -234181 -133706 24254 387152
25513 387152 342046 237080 97314 -4719 356555 374408 379187 265036 270332 209330 49708
25502 49708 83987 23516 64728 7070 -22149 227795 139948 65449 -40930 398664 244047
25491 244047 178576 233459 34125 -179462 -104392 -75632 -69150 -322138 -76802 -237237 -223431
25480 -223431 14902 257317 189985 -68614 -207724 -369502 -404323 -417247 -475067 -518300
25470 -518300 3027 132530 56124 -179337 107280 494053 646770 324185 131784 -65792
25460 -65792 -134775 -141458 -101089 -152691 -74239 2081 -17419 -68998 3913 189692 166869 196870
25448 196870 402809 414070 330032 65956 -94083 -98087 64786 -42548 -200867 -232479
25438 -232479 -74542 306218 284608 29744 -136013 -178340 -13796 170502 319024 93100
25428 93100 -320152 -680432 -392549 -8860 -354315 -744204 -550898 24376 -18458 -94042
25418 -94042 -182923 -120486 -195422 -168045 -78580 -46779 -251215 35708 352953 142136 237521
25407 237521 241676 264999 403927 404923 298677 -117980 -230090 -431175 -575284 -245457 22359
25396 22359 264081 213983 -16519 -466652 -573996 -210101 -45494 -479596 -612666 -341619
25386 -341619 121260 224605 184899 -103280 -318263 -322009 -233586 -474911 -541615 -389344
25376 -389344 -263794 -159576 228294 418029 149271 -99619 -333814 -413208 -276703 -147716
25366 -147716 -349187 -485165 -311720 -133534 258648 573195 260270 -119415 -60522 -57789
25356 -57789 77161 169127 228893 -4746 -47351 -27631 345580 302125 55767 -140896 40249
25345 40249 421230 261290 216664 645072 550216 260663 46374 185393 331667 122906
25335 122906 -404996 -175637 117701 -86906 -134981 218222 149104 188280 209868 60293
25325 60293 -58167 -80220 -70691 125305 85402 153467 172233 -107792 -215649 182906 491634
25314 491634 440039 357215 336134 327553 161905 -57544 -265902 -279024 -425420 -803208 -864111
25303 -864111 -440097 88707 18819 52200 -299713 -282699 -396946 -483401 -113033 -319945
25293 -319945 -780402 -681179 -563058 -337788 127819 485609 293690 168768 282876 332138
25283 332138 233882 46588 17455 150121 38205 161537 53957 -188583 -466622 -762946
25273 -762946 -667189 -451211 -522519 -500029 -717868 -887626 -727611 -874483 -735255 -235250
25263 -235250 -36482 -185976 -240934 -350651 -346259 -452322 -365626 -317395 -299887 -552986 -437819
25252 -437819 -427294 38223 489699 229931 -67883 -145496 -245070 -110538 56587 -36093
25242 -36093 -277684 -387164 -458200 -294088 -83253 134270 120569 118182 312809 239820 40800
25231 40800 -288000 -680000 -559095 -419459 -750133 -1056378 -823245 -738837 -464339 23099
25221 23099 34020 250946 328224 54476 -148531 -401319 -535136 -549343 -654075 -523506
25211 -523506 -198389 -58081 40432 -109924 -176935 5885 -26607 -128420 -33131 -22230
25201 -22230 -199295 -97819 -83612 -198972 -514376 -537345 -573174 -346567 -197713 -209352
25191 -209352 31245 138158 14025 90716 41952 21392 -40764 14543 -85908 -31671 -135159
25180 -135159 -369245 -253067 86654 155236 228657 341224 586464 223272 88751 303072
25170 303072 321455 326926 345520 343159 396049 76433 -3450 -22691 -406860 -427867 -6656
25159 -6656 157762 66193 152477 39101 -30743 335379 228068 40416 285144 446082
25149 446082 32685 -91341 -123039 -274903 -136314 -140250 -403515 -336572 -423859 -471083 -656921
25138 -656921 -481579 -255647 -94443 25404 -15453 -93446 -21482 -47318 -45497 37545 239180
25127 239180 126404 -14204 -133887 233506 229639 261378 658113 711965 252066 -97410
25117 -97410 124825 342676 256480 -2209 64810 127166 418859 306550 439983 334553
25107 334553 381155 284006 422360 650271 434535 263542 12633 -165105 -274264 -128808
25097 -128808 288123 430942 205302 -121972 -98251 -81564 -305907 -108195 -11887 274958
25087 274958 463223 479656 539431 392767 197358 219224 307714 149656 132625 297454
25077 297454 271811 377287 342356 -102032 -258806 -476422 -336679 -165076 -136535 -266567
25067 -266567 -329001 -286328 -90166 -381479 -426030 -477013 -452528 -824903 -912264 -760897 -376539
25056 -376539 -449436 -157275 -185887 -219803 -9590 -257958 -917716 -993922 -732415 -775104
25046 -775104 -676299 -301362 324244 318288 325037 277206 343855 690417 856707 790526 660888
25035 660888 352382 -210120 -134846 -5275 -31828 1913 108291 288525 119643 192420
25025 192420 302878 -162638 -423148 -350977 -512369 -445342 -436119 -310100 -171373 -261413
25015 -261413 -438838 -669526 -481410 -386388 -85828 86802 56514 370516 538999 232282
25005 232282 78469 14620 195146 276360 89313 -182034 -96051 294232 286461 406476
24995 406476 403866 133651 74257 -101068 -302976 -514020 -326956 -109360 66521 328052
24985 328052 235669 -41038 -313095 -251831 170552 664749 553527 -244647 -883619 -791244
24975 -791244 -515167 -463648 -428991 6971 297453 239011 168713 129550 162882 -7519 115979
24964 115979 158318 268995 510535 511516 142914 -70513 -58446 59174 413189 633677
24954 633677 722711 311129 -116840 -247663 -183527 84849 -17192 79463 173168 118685
24944 118685 -421115 -252722 -145947 -2602 181797 161830 -28785 -58979 45218 356383
24934 356383 242469 217378 -82758 200678 -19691 47271 177491 131767 24253 -156047
24924 -156047 -376053 -624723 -164876 298258 261079 192023 51107 -145589 -368632 -322197
24914 -322197 -321079 -210295 -272514 -266093 -520894 -290371 -46500 -69319 -106936 -150589 -108764
24903 -108764 354451 403637 285827 285359 610111 653788 505445 268031 76999 103812 35922
24892 35922 85623 321313 321124 -51153 -310317 -342166 -150313 1763 174840 271199 131
24881 131 -198325 -215405 13692 -27589 -37796 218835 -84818 -265740 -208649 82436 342408
24870 342408 92604 -120377 -97950 122461 231793 244739 293332 315614 292726 364407 198714
24859 198714 248243 -66460 -145097 -99750 -154126 9498 -62675 -270530 -317196 -148140 -19978
24848 -19978 230080 158750 31356 19711 -68749 -113412 -175446 33339 19471 -12249 -103097
24837 -103097 -322780 -198952 -269493 -273425 -381693 -437103 -187044 258905 589389 718437
24827 718437 603587 357804 79062 120004 95980 -259879 -161895 -168990 -499520 44227
24817 44227 292052 477833 311137 32095 -30257 131410 -307979 -373270 -79925 172073
24807 172073 196570 71179 -124126 -90365 -64780 -57485 441643 584056 121412 -171052
24797 -171052 -85066 -109921 -62773 502 223443 254056 708378 851443 630034 422983
24787 422983 305416 185713 91336 -66784 -168459 -276329 -300680 -278602 -331767 -139038
24777 -139038 196038 607081 802713 425515 364573 280004 179070 216545 133798 -192180
24767 -192180 34589 363131 355833 398247 88269 43756 152255 241880 397322 376967 241773
24756 241773 107332 15923 48134 142367 20613 -136587 -6151 16831 -246782 -383686
24746 -383686 -125577 162364 46587 -90355 -111661 -73014 8385 301413 371633 347672
24736 347672 272396 84221 238086 565884 595436 469198 581104 522328 142083 122157
24726 122157 278150 218049 -352384 -513484 -325155 -487042 -289496 121991 369237 373269
24716 373269 278903 194396 63914 261594 276355 96740 -301489 -143880 361712 254399
24706 254399 249129 445808 416693 290292 -57388 11511 224321 246403 319548 229167 -98468
24695 -98468 -128965 -92756 5553 -18056 -34901 182645 78979 154729 87610 -113709 -155730
24684 -155730 -277990 -402544 -433551 -577911 -51248 204400 245775 181169 36314 -266019
24674 -266019 -48259 226790 129451 111361 122055 166512 70440 242859 -34362 -305046
24664 -305046 -282687 -285872 -198908 -148932 -314033 -225683 95402 -181644 -420181 -687652 -900596
24653 -900596 -715987 -366774 -378094 -251866 -62591 -54165 -364114 -617773 -313730 37649
24643 37649 -19251 -96133 98724 247911 404551 175763 13348 220805 -40813 -88609
24633 -88609 423886 814367 501796 -146230 -446547 -218182 -383060 -233766 -189814 -200891
24623 -200891 64169 31050 63073 104160 184135 522162 312522 382743 -11646 -411871
24613 -411871 -456633 -119261 30764 -26953 126840 -4022 -43331 103181 223590 224427 87478
24602 87478 -300286 -448274 -172085 917 -41207 -187596 213859 386292 521226 358360
24592 358360 380869 573299 186667 -100906 -173156 -135327 29800 451408 48582 14167
24582 14167 287089 45526 -184929 -84082 -104676 -32875 450311 681223 417749 302128
24572 302128 399289 261309 -112380 -255791 -624857 -701343 -416257 -310611 -255215 -26013
24562 -26013 250065 116146 -187065 -202767 -435693 -493683 24127 321934 360416 468456
24552 468456 601302 250111 -185457 -166830 -172686 -168307 -157991 -156943 165911 310744 298670
24541 298670 215027 111231 265033 201094 -64769 32041 150242 205886 235036 -101366
24531 -101366 -87298 58150 110565 22761 130226 320163 161881 -166474 -63646 302937
24521 302937 190697 207378 -95957 -298644 212851 637393 800458 591809 581713 695225
24511 695225 542811 453791 179086 -83575 -84555 -86468 -298832 -339905 -242826 -274781 -62252
24500 -62252 -114952 34628 225820 238102 -103859 -103692 41833 68272 -274967 -110680 290014
24489 290014 186561 -65366 -336485 -437665 -274716 -96701 -255681 -631537 -560144 -385136
24479 -385136 -422667 -482925 -455851 -79979 -361067 -161507 -215632 -313728 -195028 -259738 -226805
24468 -226805 -213241 -146264 -214262 -61616 -136956 95784 -67537 -188034 29290 127582
24458 127582 100126 129046 -267049 -192547 1242 -241604 -741521 -739647 -543430 -57107
24448 -57107 286979 301130 325040 340222 510149 527711 381523 370395 -110394 -297897 -217418
24437 -217418 16668 -267473 -420119 -348338 -637157 -551446 -275401 -42901 44393 -23591
24427 -23591 -103856 -129594 -4825 -55576 -115758 -134853 -169120 -243453 -369435 -504412 -256733
24416 -256733 66486 417033 597133 286794 -186753 -164697 -21667 105379 197728 517002
24406 517002 505615 564028 588003 300349 -46368 255366 283776 1085 -292078 -198024
24396 -198024 -123526 71899 -104610 -231021 121404 190601 -47178 -149326 4230 266102
24386 266102 229483 -173154 -67330 637954 928723 764694 681999 248809 -49149 -549713
24376 -549713 -623281 -266518 94356 203771 123107 -102657 -45537 174920 159680 268643
24366 268643 118520 127304 117472 -92066 -141490 -171207 -172647 -65666 31617 258210 131186
24355 131186 149182 194201 -77379 -154622 216145 266453 45470 136498 43676 272682 420440
24344 420440 518817 398314 91416 117068 57698 -30584 28650 72885 121985 24677 -150037
24333 -150037 -291906 -432607 -148012 -152898 -259767 -315140 -228833 -139427 177702 585593
24323 585593 450108 -31040 -94691 -242653 -165403 5230 167637 287167 317794 315281
24313 315281 214428 277554 -7531 -188692 -127494 -20171 -48265 -440031 -149359 -140189
24303 -140189 -154846 -300735 -22533 227977 101751 229978 194224 -86776 -22227 187336
24293 187336 102264 37004 218926 -47376 3798 77139 14419 -24023 107654 309688 368980
24282 368980 582899 503682 257022 -65291 43928 -18937 -211477 -514854 -367648 145719
24272 145719 87567 -91660 -86843 -125670 -50357 162460 -73527 -181095 -416294 -767909
24262 -767909 -789918 -382191 -190009 -71560 -29438 -513258 -566609 -310081 -194566 -363731
24252 -363731 -335641 -114956 -421019 -623942 -688008 -696042 -454377 20760 65211 -259684
24242 -259684 -321798 -159441 -323530 -218214 287232 423137 325774 -43289 22113 289745
24232 289745 -257137 -290022 -66503 31139 395261 243147 207032 153445 352045 311090
24222 311090 -74471 19921 166746 4638 -265929 110250 713485 620521 360061 275978
24212 275978 200138 199657 49676 90564 -93603 -322550 -547010 -566445 -306572 -171033 -49056
24201 -49056 49058 47512 -119424 -342237 -283372 -420246 -135608 74370 -21875 20564 487945
24190 487945 690992 652079 539325 328557 307227 350477 256629 262021 -230729 -625452 -245450
24179 -245450 47913 -109986 -313538 -296824 5982 39397 153469 285305 243563 -38412
24169 -38412 -137225 -91468 -172573 -334802 -317652 -320451 -180790 -22507 -169698 -282517 -15638
24158 -15638 -8996 -279094 -415775 -434785 -323789 -252838 127625 278273 155158 82315 -197911
24147 -197911 -305776 96234 -171338 -624447 -743495 -840278 -606050 -302070 -233450 -474693
24137 -474693 -323426 -272898 -98054 38119 53891 44301 -47700 -113146 -340907 -302620 -5872
24126 -5872 296196 14893 -44989 255152 246936 248035 63445 33752 -282530 -633341 -429110
24115 -429110 -232124 -231509 -249 128322 -154495 -555664 -540815 -421878 -410731 -410891 -472304
24104 -472304 -330188 -252290 -534740 -445985 -303461 -330423 -429798 -455214 -492835 -55194 -51433
24093 -51433 -235490 -156168 -106933 -264814 -129351 -101388 -131633 -274633 -411579 -206413
24083 -206413 -75299 -43686 90353 230603 597214 639639 399931 30961 -254626 -592898
24073 -592898 -381342 -145678 -317952 -32791 283780 433160 440071 323213 51683 241643
24063 241643 290848 425523 239632 288994 273595 269072 228597 411858 135433 18220 210788
24052 210788 -47187 -182251 -278472 -221407 -122867 -169462 -371840 -439857 -142046 -73697 207726
24041 207726 282090 117195 -166536 -495290 -470248 -93485 -79251 -133228 -424545 -216125
24031 -216125 88432 299350 -157108 -210158 -282513 -143112 278781 281434 326411 402782 113393
24020 113393 130300 -186724 -427489 -518134 -161037 111771 14129 -248965 -231977 -363260
24010 -363260 -450690 -41079 -66556 -217965 -16779 -12741 -74849 -74973 171505 193085 206849
23999 206849 43340 5135 232668 252546 105259 77016 177244 282855 22091 -105660
23989 -105660 -33276 151909 38167 -307059 -388287 -426267 -250334 -331387 -259695 -351799 -128705
23978 -128705 120710 495665 607562 232299 -180228 -165979 -173640 -120768 -115473 -88635 33574
23967 33574 5711 -179859 -100594 126522 165995 255302 143629 -381079 -565791 -161643
23957 -161643 -70955 -46322 68861 2386 237498 120351 187282 476058 -99259 -396019
23947 -396019 -290607 -293943 -513176 -260171 113836 -21005 135976 351973 334577 77797
23937 77797 168692 52770 -39801 67065 398787 663160 547602 388727 -74878 -157648
23927 -157648 -193307 -65214 91612 336909 572103 506045 122039 -182723 -150920 -149741
23917 -149741 -428262 -435694 -217182 161367 247802 202123 295521 353934 174320 7327 445405
23906 445405 600550 289586 87518 57859 116907 48788 -72239 -242942 -254589 61434
23896 61434 8645 -320525 -592862 -631008 -595373 -427638 -94242 63673 241061 -15611
23886 -15611 -309727 -324096 -132411 39203 337041 248915 355084 376750 -108282 -211268
23876 -211268 81018 254870 170013 160891 65568 228497 -27619 -306523 -571408 -537241
23866 -537241 -185692 -175116 -176403 -355918 -620694 -564936 -606842 -342950 57664 183578
23856 183578 9198 -259572 -145100 -103315 147841 108376 -89314 -306094 -480403 -742002
23846 -742002 -581228 -549604 -611284 -451634 -251722 -378058 -327143 -310230 -24420 -18523 15160
23835 15160 -67560 249592 535226 210926 -60067 -9263 270103 280065 238109 -102600 -129139
23824 -129139 264476 550272 475143 211215 -127329 112902 215012 175396 228727 305195
23814 305195 -99637 -296943 -285528 -199209 -274657 -278654 -394989 -496058 -335488 224199
23804 224199 433404 172379 -143671 -106826 -378421 -914764 -929639 -631595 -485657 -138053
23794 -138053 26954 309229 196985 82841 139236 175295 -12140 -276992 -250424 232198
23784 232198 406374 205739 -79945 -356634 -703355 -756040 -498961 -473925 -457650 -142141
23774 -142141 -403179 -356038 -106199 -434442 -348096 -333302 -283544 -172790 -289335 -371415
23764 -371415 -464164 -92505 229584 181727 159107 110911 264979 122527 247801 433577
23754 433577 289981 247573 523785 369433 129699 -41936 -181773 -291935 -515621 -663128
23744 -663128 -485222 6160 538144 661045 563322 413940 224840 118601 269641 558830
23734 558830 468664 253790 -150029 -75681 -17829 21917 -239981 -460511 -717248 -951682
23724 -951682 -889063 -356440 154379 266475 311267 412830 295437 218566 20102 -259846
23714 -259846 -59576 -106687 -146215 -139925 -385607 -246411 -46618 -103842 72032 94646 41343
23703 41343 -58980 -21491 96571 -138916 -450732 -361505 -114658 -128230 -242437 -145176
23693 -145176 -34219 -97199 10644 103417 169900 -65866 -192686 123674 81874 -10642
23683 -10642 99397 357348 484973 616858 405444 222425 246148 546907 429419 198291
23673 198291 164323 173258 177374 366788 576932 736524 736602 490836 272152 -118128 -687253
23662 -687253 -925304 -602047 -139187 -66279 -68796 240396 544154 724999 726638 603287
23652 603287 665802 438748 303921 160276 -230309 16690 446827 552845 127336 195077
23642 195077 284301 428206 740530 401721 37137 -177456 68831 459225 138509 -167954
23632 -167954 -71455 -82603 46348 67443 -103442 -26423 -79290 -2958 -144382 87954 216774
23621 216774 439653 645635 635298 472154 36517 -428761 -293931 17708 58924 -24962
23611 -24962 123336 279126 410238 453248 269325 133976 354862 371658 230053 368427
23601 368427 222260 54081 40078 -135304 63820 89875 -185453 28039 269183 104264
23591 104264 18445 -27578 -95653 -406268 -423878 -236195 -159632 -202962 -139539 -134908 -476724
23580 -476724 -525106 -247885 -226221 -242185 -356279 -573266 -508544 -618607 -614770 -563108 -276820
23569 -276820 -316749 -187804 -96681 -251020 -271993 66445 81500 1661 517499 820988
23559 820988 1010843 768994 176698 116876 126895 25293 -18486 -133592 235238 117310
23549 117310 -9828 286892 179921 14792 -239632 -207137 -309957 -209277 169796 213491
23539 213491 182451 -12605 -53064 -166820 -406036 -717549 -798201 -117895 420384 628352
23529 628352 688917 409590 178868 117093 83250 -153846 -15852 85285 -78453 -202218
23519 -202218 -235474 -65425 -86193 92002 -109247 -504384 -354825 23344 -219769 -161140
23509 -161140 -95063 -143807 -121433 91045 330349 493263 362859 128308 236938 174631
23499 174631 193887 -107848 -25907 68210 -204391 -363619 -3111 180966 4707 23379
23489 23379 46280 -188023 -13881 209800 30639 -228609 -208839 -160904 -75021 253722
23479 253722 326053 251712 133653 -6385 -79122 23937 369554 597755 623642 551908
23469 551908 344244 333180 483 140382 311204 573122 563020 588252 96611 37562
23459 37562 233538 186677 71558 156211 197057 154289 90659 161536 -104123 -154846 119108
23448 119108 330343 283163 306421 186702 213510 384984 304554 270910 533603 469887 195482
23437 195482 -55478 -305060 -245169 -63800 47568 -303969 -442063 -280404 -180964 -101501
23427 -101501 104463 155373 23402 -143765 6815 25724 -430651 -506881 -299446 -190373
23417 -190373 207818 501488 495619 592820 467167 91510 205532 477733 357026 278133
23407 278133 587228 414514 87346 403259 415941 332283 93150 -219988 -234248 -213310
23397 -213310 -181624 -453993 -556730 -468012 -214053 -214202 -271115 -117765 85668 210763 419529
23386 419529 394821 251904 277180 339962 167202 -30240 -117516 -106770 -124053 -36761 16984
23375 16984 -1343 -234333 -51329 61362 370375 97015 -223427 -229427 182023 125921
23365 125921 -18433 -229717 -271297 16912 162960 -138357 -141189 -314735 -427737 -301131
23355 -301131 232757 340374 79280 -83947 196713 476599 337799 330277 27129 -411823
23345 -411823 -650859 -441659 -300559 -296267 -17482 -162535 76691 159298 -145661 -401223
23335 -401223 -152834 327628 219029 28632 -309940 -435683 -122795 13207 179014 657943
23325 657943 610099 167719 -42075 -558745 -614078 -472959 -252704 -154889 -136577 -331442
23315 -331442 -382261 -275230 -51224 -10221 -92793 -228082 -293019 -746125 -1009296 -556142
23305 -556142 15622 149183 75432 28356 -26924 -197644 107856 188606 162898 42541
23295 42541 190509 160586 69116 198846 -206416 -161209 -316213 -171835 -6175 192614
23285 192614 442869 522304 371503 258786 166757 -271860 -253571 -48546 66941 152652
23275 152652 205052 276905 3263 -40693 55277 -64692 -178994 -4044 457177 381112
23265 381112 199179 129460 342526 429922 219040 -108363 -231592 83085 11699 -249760
23255 -249760 -186478 -79049 -86346 -188661 -390682 -589391 -808583 -416496 -134884 58021
23245 58021 164796 278907 65663 69820 102662 -77172 -131305 -148951 202850 102090 241060
23234 241060 370871 178854 160053 588620 817751 742709 359544 -158839 -141009 148028
23224 148028 98704 -86288 -352592 -496312 -298376 100052 262703 172585 152721 -73973
23214 -73973 -180712 -203532 -139128 -242324 21920 -47643 -124177 -34620 155698 25753 -272389
23203 -272389 -415174 -262726 -181665 -109890 -216811 -145831 -67876 387608 230540 -132540
23193 -132540 -349905 -219760 -40760 35289 -39544 -103022 75168 224761 91549 39100
23183 39100 197643 -23337 189024 556471 697934 547123 186562 27182 7019 -163316
23173 -163316 -396139 -574348 -662186 -199331 -36998 -139008 -123661 -400269 -246084 -233913
23163 -233913 -236503 245000 436402 -49958 -477982 -335200 -340846 -562999 -553381 -453197 -415812
23152 -415812 -318552 -511182 -449440 -113315 94162 -172394 13929 94415 187450 22293
23142 22293 40437 297682 251299 13672 118297 524356 330049 299596 519865 692809
23132 692809 483707 380237 311150 119381 224272 185377 254149 507757 549454 60833
23122 60833 -150208 -30970 68292 88599 -294331 -488260 -401957 -56711 -169966 200087
23112 200087 306996 412654 506577 409611 -32598 -113439 -137826 -208743 -173191 -526065 -573840
23101 -573840 -344857 -582080 -563697 -380333 -56565 125633 30732 34428 32353 -115795 -158762
23090 -158762 -346952 -130066 -363343 -595191 -525920 -396490 -663942 -816675 -689287 -586552
23080 -586552 -401693 -551798 -288304 176443 432669 611785 426216 179986 89103 84558
23070 84558 155603 345917 383179 322098 29433 229542 450634 371259 75399 8333 -199496
23059 -199496 -35411 194995 278770 478519 343116 402075 605260 85578 -366603 -381316
23049 -381316 -44332 369831 506723 388666 478336 470224 416839 496834 222760 3946
23039 3946 171601 24822 84072 -94342 -502002 -662006 -241613 135804 343734 381401
23029 381401 251834 37357 -309243 -429482 -299597 -466711 -283130 -43327 -293071 -501974
23019 -501974 -688473 -702216 -331798 239089 25238 -56482 15147 20063 252642 565666
23009 565666 234722 148610 53723 -355686 -511352 -473362 -531075 -255002 24049 203497
22999 203497 643724 831517 556050 275640 311265 521743 503422 289362 68730 -115178
22989 -115178 -315465 -121130 -178263 -492918 -506073 -241536 -102765 208087 298297 99868
22979 99868 -135028 -272572 -323296 -136720 -8861 61053 -71277 -260568 -153499 143268
22969 143268 -5527 -240588 -383075 -415810 -397077 -525852 -462685 -260794 -114465 -5977
22959 -5977 148741 -77985 -175062 -48709 -244319 -488358 -197969 -77789 -148942 -69980
22949 -69980 -256957 -435831 -275608 394555 102638 -253051 -641898 -475128 -158850 -115512
22939 -115512 -150327 36373 115335 317382 313768 -80597 -186530 -258209 -209108 34306 -110309
22928 -110309 -392814 -415476 -279163 -344903 -391503 -276628 -206310 27121 -129164 -295042
22918 -295042 -232013 -91105 81344 -131670 -450902 -254865 15024 372093 160955 -38805
22908 -38805 286613 34059 80559 85146 256253 -91479 -30564 -222595 -8891 19209 38307
22897 38307 -53942 -88490 -762185 -774708 -494912 -324332 -414580 -349572 -205801 -49316 183124
22886 183124 454433 251569 -111795 -28140 -361700 -426515 -432033 -383464 -371911 -220692 -308586
22875 -308586 -541588 -710229 -776088 -545567 -383293 -314795 -115985 -6862 21824 -74241
22865 -74241 -277851 -319142 -316886 -356546 173480 370302 346308 260643 528693 793331 503006
22854 503006 161516 -108120 -187217 188857 118812 146408 -50210 -46330 -45385 233531 313300
22843 313300 106995 -338644 -261184 -301655 -477333 -488322 -483000 -501006 -424446 -230897 -63062
22832 -63062 -139127 -389976 -178969 213178 144309 -93594 -492944 -379626 -21691 146414
22822 146414 91179 271037 163344 -331737 -505509 -613722 -652166 -410041 -287425 -336724
22812 -336724 -96185 16471 -139748 80959 17856 -395022 -455447 -318667 -293703 -279421
22802 -279421 -434465 -177114 31498 -12306 -161194 -448522 -685360 -599934 -342214 121471
22792 121471 303692 102980 233128 743079 746756 435810 394290 336769 266352 107837
22782 107837 -150876 -83415 169445 -129880 -152004 -65941 138608 163711 269108 153715
22772 153715 48587 27506 162386 367706 255791 285065 288813 552283 678963 608395
22762 608395 461439 395164 624944 873126 957807 472611 101694 -50734 -145127 -293435
22752 -293435 -319568 -268149 -231979 26293 33789 385683 426974 378073 122421 82182 190498
22741 190498 312946 256376 -73808 2044 -164926 140965 792844 707823 104320 8436
22731 8436 84409 336232 290744 103165 -254002 -244847 -332519 -395587 -404788 -143148 -184365
22720 -184365 -337309 -254123 -199055 -154643 39872 -5307 140775 -27844 16267 -53227 -30725
22709 -30725 95750 239549 93814 94395 510571 422244 -69451 -451807 -324561 26104
22699 26104 -149429 -325066 -114578 4015 35924 81606 132999 -82894 -141614 -176837 -313513
22688 -313513 -286337 -77823 439705 103621 -193331 -569820 -437917 -305957 -377103 -240770
22678 -240770 -13929 -37041 -246937 -425918 -470497 -427642 -368466 -43438 -111091 -64260 -40326
22667 -40326 -47821 40321 155154 277198 263256 168069 26699 -376737 -698302 -508582 -326438
22656 -326438 122209 271574 86042 216966 28850 108152 365409 196256 87489 -3691
22646 -3691 -88553 -272341 -222681 192836 176682 9629 83725 -18997 -278293 -262216 -144126
22635 -144126 -342516 -371014 -462732 -433942 -563132 -666275 -363355 -108980 25031 -91484
22625 -91484 -203628 -13425 44039 -113328 -234913 -122763 89579 201206 38535 53589
22615 53589 -251807 78245 192358 305469 242675 115400 154689 152353 -83574 -269886
22605 -269886 -434216 -241316 -178747 -116651 -295704 105002 258373 369769 175547 82475
22595 82475 -116093 -21968 83387 -319499 -118372 237773 268359 5248 -373940 -167172
22585 -167172 -292292 -487922 -257900 17222 87438 78014 -45081 -91105 -108865 21390
22575 21390 147143 66619 48068 130552 363831 307504 206096 163850 -69860 -228349 -28267
22564 -28267 110434 235856 543870 418930 107940 43254 -24607 -191401 -414395 -352345
22554 -352345 -249121 -327854 -487428 -613692 -684147 -304280 -16158 357057 407306 295302
22544 295302 214317 556843 136532 42541 -71800 -213005 -255567 -160393 76956 295641
22534 295641 381973 500171 435646 276641 -10880 68454 139560 -20877 -197200 -260455
22524 -260455 19174 -77100 -67719 298791 408105 136715 -16972 -159558 -132890 241428
22514 241428 248304 166602 78584 240179 175661 96489 -120269 -405459 -260873 -36561 -18715
22503 -18715 -446658 -610216 -470235 -174695 -189151 -415003 -365386 -126764 218768 81538
22493 81538 -44623 124983 99462 91713 89257 18258 -207820 -288700 -356665 -547605 -393604
22482 -393604 -347675 -82480 -5969 -297433 -137913 23843 205339 416526 283438 170354
22472 170354 196717 225592 509070 378261 218784 259078 222619 -159489 -539528 -665333
22462 -665333 -475312 -311056 -349819 -687797 -606390 -574828 -703168 -301412 -188666 -28093
22452 -28093 226245 -124718 -125399 320135 388079 224868 -178596 -367863 -166243 270461
22442 270461 392968 89996 207468 355992 513052 -97027 -397465 -358504 -480494 -235361
22432 -235361 -413514 -690542 -453440 -174589 42390 376535 293847 230991 139018 -4316
22422 -4316 -518590 -183030 12113 -254415 -339166 -50433 550211 637175 39609 172220
22412 172220 416774 234864 142800 215882 -66640 -452740 -267411 114864 207682 276245
22402 276245 388418 187499 303942 384378 172702 157471 -206567 -154209 -195401 -392838
22392 -392838 -226708 -40530 390956 806306 596151 320396 334512 377350 323600 261293
22382 261293 150684 189064 235364 345150 248156 150023 335311 -165539 -663689 -351345
22372 -351345 -205497 -284886 -318791 -522828 -683130 -623627 -255266 -69732 -293144 -646902
22362 -646902 -595728 -259380 89499 222573 445998 371018 -51672 39192 287935 35265
22352 35265 -19218 284002 568475 301209 260250 345127 497841 546644 306983 73146
22342 73146 36873 122633 13525 259592 468704 453264 -335080 -940089 -781076 -106048
22332 -106048 443522 626539 720126 606154 589849 740126 206393 -76626 118336 120025
22322 120025 28664 -110467 -239989 -291797 -408678 -243197 -54533 -161056 -200478 -138364
22312 -138364 -177171 -80778 -169605 64599 336207 171986 -135219 -509818 -829786 -938294
22302 -938294 -848927 -277802 -249214 -381232 140179 215569 -67193 -20507 551445 837289
22292 837289 640383 319671 360067 439010 277257 202119 262094 310951 -204034 -383662
22282 -383662 -353903 -335324 -454267 -647542 -392496 433905 764833 767972 666692 450260
22272 450260 147211 303379 550169 496363 95244 -102429 -82200 137213 279552 338558
22262 338558 -100630 -192024 80753 32655 -54312 -240106 -603643 -543680 -521766 -539824 -262596
22251 -262596 -163286 -51482 -82175 -367099 -804057 -673684 -859153 -626093 -353223 -237442
22241 -237442 -97006 -54483 102197 312283 324490 79410 -60784 288185 300136 131319
22231 131319 -36979 -47550 177017 106637 64107 153509 207099 180825 492782 611226 19357
22220 19357 -273908 -542457 -606443 -523865 -425519 -123275 7253 -318814 -301800 -135131
22210 -135131 -224713 -335893 -247341 49911 468502 659238 658942 330152 -75282 -116261 -9956
22199 -9956 -45049 16310 -66800 -227552 -87725 -1321 -188473 -160576 27150 52561 51502
22188 51502 -25149 205460 -13334 102705 68767 33677 -161919 -445558 -331446 27917
22178 27917 217373 391650 232472 111747 140272 -7790 -59864 -250340 -191553 -152436
22168 -152436 -576305 -507186 -181359 -95167 -338033 -584746 -448029 -274402 -59227 -431726
22158 -431726 -273994 86719 -22418 140545 65372 142327 107274 -180601 -462230 -469583
22148 -469583 -236911 -1281 76315 78737 -53940 -82093 53321 -166564 -92984 239888
22138 239888 270884 22709 244562 461005 201515 -72322 -369903 -580478 -684766 -733812
22128 -733812 -742472 -754485 -571033 -375961 -48283 160427 82383 24570 -60210 93895 179731
22117 179731 -45987 27765 343638 337618 -149669 27684 91275 -145482 -58094 177134
22107 177134 374595 305484 21317 -306506 -486742 -343679 -128564 -176530 -151736 13613
22097 13613 -113135 -138078 -120520 -439522 -383441 -599797 -250697 -89284 -178985 -191123 -70543
22086 -70543 -286413 -437820 -678839 -599636 -363503 -496179 52012 116407 -10651 -125206
22076 -125206 -321088 27649 309642 255236 126115 147165 -3159 51721 307949 249622
22066 249622 124737 -222711 -399539 -517863 -496289 -604638 -507185 -440327 -200253 -38883
22056 -38883 347683 559925 524953 423580 -76292 -283518 -162914 -78219 70680 202354
22046 202354 427077 360252 170846 157587 43135 -293508 -391150 -395849 -261733 -27577
22036 -27577 315768 261368 503789 682396 344790 273049 485420 61345 -172776 -344899
22026 -344899 -275017 -25783 209472 466992 600695 195860 -65035 -94247 12806 -370681
22016 -370681 -557637 -312554 -15188 65332 -36607 -165549 -255429 -349718 -221231 82036
22006 82036 299333 -36750 -309152 -457992 -88804 -32708 -93251 78480 267978 211482
21996 211482 360999 141882 94495 -109957 -103032 2421 -258873 -5549 17863 -324632
21986 -324632 -506355 -248325 -16016 -116726 -112807 -245744 -332994 -425557 -525563 -252350
21976 -252350 117163 447062 454585 353606 138815 -34061 -61668 -301910 -208948 -330061
21966 -330061 -308790 -235737 -159304 -135801 -33428 233405 494610 420793 -5609 -174764
21956 -174764 -15541 159455 -278731 -498940 -254528 -236899 -133173 -24076 252686 125384
21946 125384 -105573 168 5857 142569 301328 305705 -76833 -5512 201411 255599 427152
21935 427152 221707 -8696 164241 407134 382551 139337 191881 374308 350129 189761
21925 189761 -353888 -319715 -38807 -29305 123853 505398 476922 145272 -35366 -90700
21915 -90700 -113913 -20106 145437 -98285 -412925 -127435 268404 557155 93511 -564884
21905 -564884 -559490 -111313 -57589 17518 157918 315762 162221 101020 289060 358877 522748
21894 522748 614384 927654 680389 446365 328343 261166 445934 547825 136675 -193528
21884 -193528 -283545 -156784 -153727 -181379 -217231 4223 276566 244789 173631 95788 388484
21873 388484 605366 631566 454473 146784 -133801 -265944 -201388 58718 27438 -28224
21863 -28224 -178325 -199821 -57743 -2703 113464 234343 136237 -55538 -37423 221103
21853 221103 739557 1080769 1026605 651926 392020 345476 55872 -307365 -337223 -191345
21843 -191345 5110 -35879 -136238 -180311 65864 144597 87024 -13067 -287544 -591247
21833 -591247 -464120 -365030 -245135 45450 71086 -49497 -83835 67645 -4387 -34722
21823 -34722 82296 228284 464273 503101 509776 140136 254997 207016 183999 122054 -127360
21812 -127360 43022 387980 505126 300370 122937 -4110 -309005 -245264 -35095 -100119
21802 -100119 -182949 -182283 180564 6554 -14447 -199005 -158410 13240 -338870 -447058 -343110
21791 -343110 -247009 -187895 -424108 -486357 -479788 -348440 23713 70106 120007 152899 -7335
21780 -7335 41854 97065 -69879 -47563 -177717 -281353 -49554 28448 -284618 -625880 -648087
21769 -648087 -689039 -19715 248335 -171692 -380287 -383287 -453791 -471543 -225754 135950
21759 135950 4445 68705 215053 56170 88879 194781 -125837 -319232 -298908 185524
21749 185524 203623 -139266 -380164 -461582 -365975 -381115 -225225 -7719 142410 -237356
21739 -237356 -164126 355127 313374 121516 133931 172609 60580 -150402 -255723 -191804
21729 -191804 -81823 228838 357892 286814 120425 -52590 -504691 -325952 -144496 67164
21719 67164 -159773 -580393 -802711 -578205 -146349 35063 -50504 131217 488955 468495
21709 468495 331147 -113962 -273940 -385021 -42375 279814 217095 297202 384751 155818
21699 155818 -328527 -484480 -420044 -493860 -371455 8655 177863 99731 41835 -226207
21689 -226207 -129529 -141520 -174070 154707 -1166 -86143 -158633 -1125 38586 -183681 -420264
21678 -420264 -234781 -257218 -45218 131496 -17284 -177920 -8006 223267 385143 114139
21668 114139 -118519 -496014 -504189 -577988 -308278 -74722 -27379 -193263 -59282 16562
21658 16562 83651 138902 254218 218988 193949 15894 85061 180002 309777 335450 396618
21647 396618 271886 88200 -36735 -46499 -292376 -136355 129000 316009 166854 232743
21637 232743 13757 -646557 -581264 -5967 181947 370086 613042 518201 280323 -88959
21627 -88959 -501922 -209441 183148 302126 225165 -43830 -122665 -117097 -8243 118665
21617 118665 152526 109452 -84774 -377385 -349267 -190095 -127793 264111 561603 632707
21607 632707 295098 -221607 -376523 -271920 -63342 -409539 -456006 -15905 -8540 -236015
21597 -236015 -284777 -318218 -543802 -522967 -463708 -360744 -368327 -137226 -177136 -403468 -534729
21586 -534729 -608126 -231273 97059 -265213 -328015 -284693 -203468 -101984 36517 -80770
21576 -80770 -135068 -139946 -256222 -54943 176335 471308 385265 108758 99579 169754 303247
21565 303247 417260 506997 320880 62299 -18238 -353677 -372157 -268720 -291459 -210021
21555 -210021 -55434 -163473 -354623 -549023 -415912 -243690 -146377 90280 147486 -16978
21545 -16978 -170762 -157128 -48978 -68896 -171916 -47233 104201 174902 111171 29532 -114492
21534 -114492 33027 144413 73740 -155560 -244579 -236023 -477047 -452166 -444201 -310577 -14745
21523 -14745 97647 147229 307190 78524 -341520 -461276 -351931 -99080 -231583 -615168
21513 -615168 -394797 -254159 -247019 -214808 -33499 -97939 -52391 -260014 -385314 -228934
21503 -228934 350820 264323 -52346 189102 -86441 -297835 -369390 -175712 -376531 19853
21493 19853 223154 83827 -67292 -227551 -81138 -128137 37749 273995 443524 -30184
21483 -30184 -518537 -623446 -564564 -290831 -227989 -63705 185065 193502 113025 43285 377515
21472 377515 183611 29861 22135 140234 153709 309192 111630 117029 173380 446716 478390
21461 478390 -44645 -307715 -363064 -494538 -268164 -32954 -121305 58953 -75224 -145315
21451 -145315 -363470 -113303 46886 141715 168516 16975 -98347 58732 -190782 -234575
21441 -234575 -15707 113623 7397 -31160 82114 19215 26029 -17386 -273848 -293882 129639
21430 129639 156575 41453 -343490 -606011 -583368 -74007 45213 164062 135440 214348
21420 214348 -36238 -76406 162811 222076 228124 130954 -164711 -455537 -350431 -210679
21410 -210679 125502 296707 97644 520305 769260 728583 499587 383303 159918 161497
21400 161497 51968 204499 661106 878117 480119 41806 -127850 -134216 45623 141574
21390 141574 -15239 -331790 -42084 294965 286548 303167 -170017 -465727 -609472 -573507
21380 -573507 -460477 -368948 -288916 -157162 -13591 -75844 -418610 -249514 -275487 -204419
21370 -204419 -414630 -922028 -879821 -502995 -248535 -384671 -330528 -148620 94645 110082
21360 110082 156058 500817 310176 -59697 152140 309689 337063 55572 -382620 -502214
21350 -502214 -382458 -384497 -237699 -94834 211452 209372 -47344 -231096 -268437 82470
21340 82470 -124210 -390176 -257950 -203753 -356995 -319991 43814 268292 349136 233091
21330 233091 225977 166710 30470 -248749 -401169 -229879 -158937 244038 298206 -194785
21320 -194785 -84226 266111 489976 75531 -142075 53838 40115 129851 86789 -346967
21310 -346967 -521119 -101143 -186671 -418423 -455357 -161282 173473 182097 208095 -25209
21300 -25209 -393936 -256559 -243471 -266189 -334587 -514836 -271516 9634 239817 373592
21290 373592 297061 258758 169358 63749 283467 408415 391178 480940 193412 -216107
21280 -216107 -262600 -87140 273945 440650 289684 395907 376554 253281 432436 376054
21270 376054 79370 -149002 54576 113572 -152824 -272942 -248675 -107627 4729 -90077
21260 -90077 928 223462 185646 191629 95166 -87490 -42083 -2109 48414 148002 257951
21249 257951 515887 614994 487882 78262 -56308 -193639 -531727 -441667 -71357 103072
21239 103072 -198314 -98286 425743 277497 -40116 -36086 -155032 -130610 -230547 -94422
21229 -94422 -1030 13718 349061 563737 377958 96589 -96042 -149222 -54846 51037
21219 51037 303042 236948 24414 -60289 117747 320271 369185 469715 170479 30236
21209 30236 -133997 -316301 -195378 352093 430897 135246 24086 -154357 -22816 -26448
21199 -26448 -106652 -208527 -120565 -70619 -16868 -174580 -111680 21612 100826 -243344 -328925
21188 -328925 -77575 262111 -11219 228374 68609 25199 -13984 -69053 -130588 -443418
21178 -443418 -588993 -492586 -83233 211726 269459 178611 -137456 124443 267024 125520
21168 125520 85409 -151373 -202188 47665 13828 16049 249873 525419 398357 125478
21158 125478 -10789 37102 450483 706484 527982 218854 11948 -208611 -141834 82131
21148 82131 376767 709003 590977 847478 870481 832337 1221030 1378339 1373965 1024858
21138 1024858 1268286 1608227 1247775 1346890 1569698 1432347 971483 950650 1399692 1922530
21128 1922530 2043735 1680043 1471684 1501486 1632445 1553931 1556997 1388785 1017200 802396
21118 802396 1123762 987509 582710 467891 299403 108313 272856 827808 1097462 726773
21108 726773 586482 314377 481074 244625 172303 388225 479963 242561 -53023 -190348
21098 -190348 -196757 -66014 21692 -270237 -244804 -80583 -451468 -611204 -496187 -477280
21088 -477280 -299649 -531579 -521656 -436327 -314289 -75868 424784 747174 628813 483659
21078 483659 260162 447959 162887 -256344 -382364 -422755 -467424 -446999 -34073 150353
21068 150353 388103 562473 611478 337165 120905 11018 -61094 3095 -183777 -426744
21058 -426744 -92397 -39583 29038 209364 601262 324861 200472 271169 71386 236203
21048 236203 289008 349015 542570 501404 343373 446464 481501 486733 276187 -113806 -54639
21037 -54639 -5227 -186037 -328133 -132878 -54695 25241 125528 199875 318305 137487
21027 137487 424170 577337 454436 170509 236218 505042 511045 576324 656519 956704
21017 956704 1196799 1191858 951646 770051 504670 328940 203735 18245 -141768 137558
21007 137558 111354 124503 -16442 -230636 -233165 -254777 -104043 -276823 -392477 6687
20997 6687 83899 70812 289719 288476 288406 159989 -90598 -159968 -356802 -219032 -84929
20986 -84929 -430122 -364701 -533968 -364211 17875 -58079 -68124 -213711 -169530 206728
20976 206728 206817 -265636 -147474 23755 -83092 -241261 -134892 -223025 -469935 -405076 -143801
20965 -143801 -51472 -295081 -287145 180658 115688 126832 268871 181185 311991 470619 515298
20954 515298 672899 414848 11659 -220183 -81896 142827 -14057 -85492 1936 22087
20944 22087 -238926 -780700 -910428 -485462 -342959 -482639 -282184 -71532 -55631 -125176
20934 -125176 -118845 111775 69082 -222074 -287207 -86753 290756 413684 339367 -254308
20924 -254308 -719902 -402893 -486 142940 -145930 -79455 -176873 -229429 -52421 481127
20914 481127 510986 581128 553039 471467 152789 -217552 -278375 -334733 -57894 162486 222127
20903 222127 6340 84220 198196 146926 144067 77084 142749 329075 399247 153220 -187298
20892 -187298 -572444 -144253 351732 569415 150646 -124641 21541 14025 181762 226923
20882 226923 178023 225200 464065 242500 10516 -310898 -441944 -476470 -359468 -273690
20872 -273690 -469305 -481793 -597367 -645064 -479010 -494909 -424910 23341 358974 222964
20862 222964 28096 -59272 151603 448175 291610 49554 182446 108365 45639 417496
20852 417496 211465 -20146 -151859 -18313 -256966 -393327 -591907 -451851 -53447 242809
20842 242809 179407 -178581 -135172 38028 220761 118211 94000 24305 3803 31321 -21727
20831 -21727 -375264 -140017 85756 -102138 -222891 -148153 -467720 -523068 -265743 -189269
20821 -189269 -142080 -112293 151257 236991 463951 774907 759379 856191 905482 710824 717701
20810 717701 458522 106079 -72518 -170053 -435626 -4776 459570 33348 -147854 -70335
20800 -70335 -356897 -83158 279774 518918 587804 560073 763774 687384 719087 471554
20790 471554 55955 -113557 40311 -223436 -159140 -39919 27138 76602 319233 210598
20780 210598 107697 87344 201092 275806 257587 496918 545661 292111 568850 727495
20770 727495 921716 631481 494014 525600 410222 284114 276438 368509 427851 21321
20760 21321 -123575 -137439 -39172 -43109 260430 410170 500782 374994 449822 657514 175674
20749 175674 41208 611 49002 247216 297959 341808 455394 477971 637275 829060
20739 829060 545150 628795 672439 478912 254931 158902 263927 391901 244069 165138
20729 165138 261985 551129 527265 403157 189709 -203366 -137956 22702 148005 253639
20719 253639 104536 -144680 -100115 -428711 -494058 -250736 -246904 -282716 -76051 171493
20709 171493 111104 -11645 -90980 8762 -1906 47072 -240069 -314898 10276 107522 312003
20698 312003 489682 431165 490852 415692 130540 516194 760898 644560 240572 101449
20688 101449 69941 229614 343784 4696 -54647 -115086 264106 561486 436773 224454
20678 224454 -52161 -1608 -111186 -125888 -204338 104975 158310 -19432 98560 286456
20668 286456 504647 673766 462532 420496 132883 175465 47028 -28111 210692 549831
20658 549831 340121 228810 31346 241389 617530 870360 862201 772868 972234 990244
20648 990244 1235252 1206359 937915 794695 1063976 1095780 1135581 1326374 1116042 800878
20638 800878 866333 972382 987068 666618 559862 942789 885010 667775 515185 364017
20628 364017 383818 191179 278884 642260 854032 1170894 1285302 980854 1101083 1220744
20618 1220744 1284023 1107579 936495 970995 1242676 1430069 1352224 1180550 885502 519742
20608 519742 755997 869210 846758 941616 1155060 1591388 1906415 2097448 2027455 1810164
20598 1810164 1872995 2344788 2846988 2889471 2783468 2799364 2958428 3089822 3412655 3636632
20588 3636632 3709334 3802181 4131528 4703786 4669719 4665442 4842992 5351805 5935111 6708121
20578 6708121 7350313 7661571 7782225 7997194 8864390 9828742 10644428 11754530 12683047
20569 12683047 13365780 14605671 16596601 18908298 21373358 24346487 28415214 34880221
20561 34880221 44170866 57566695 77129434 104944788 137172939 161431045 167614596
20554 167614596 163187348 163967039 176799573 196235500 206610822 198827110 180840076
20547 180840076 166877231 163868583 173403189 193377668 215033548 223723656 215231696
20540 215231696 202808211 200574832 210363092 221283167 216961720 194273190 165558605
20533 165558605 141172469 122890792 108586777 96143207 85975770 78515450 72170079
20526 72170079 65969036 60337335 55622285 52026583 48846389 46115602 43619625 41428925
20518 41428925 39473279 37182805 35416004 34287853 33028012 31816225 30315810 28976342
20510 28976342 27516956 26609921 26031684 25367274 24642342 23552908 22483465 21769501 21373261
20501 21373261 20978090 20101032 19298216 18690406 17922741 17406006 16792868 16111929 15521591
20492 15521591 15022340 14662196 14002052 13246741 13021061 12966289 12645661 12419943 12047057
20483 12047057 11708826 11186981 10597088 10470815 9947792 9303458 9216024 9263921 9206056 9041336
20473 9041336 8527996 8072228 7837247 7683520 7466086 7315890 7228107 7133702 7081205 6933033
20463 6933033 6786321 6601773 6269254 6125383 5940997 5625750 5688033 5761287 5556758 5510986
20453 5510986 5293782 4693777 4294891 4359639 4338044 4205585 4059782 3913641 3853228 3813218
20443 3813218 3545809 3369228 3726861 4200994 4171968 4141045 3990044 3816260 3775658 3648388
20433 3648388 3106956 2925986 3073716 3176433 3070643 3045686 2960146 2729352 2724113 2729279
20423 2729279 2492107 2296487 2246105 2299719 2120901 2151344 2719251 2563950 2084699 2080022
20413 2080022 2052818 2319830 2132321 1765027 1610815 1647933 1925306 1470153 1535562 1801971
20403 1801971 1674573 1656252 1706864 1593152 1718552 1680449 1396446 767471 938028 1125073
20393 1125073 1074296 1043004 1014546 657898 520814 542209 594595 272610 375063 810113
20383 810113 954950 696452 324787 56326 81189 177341 439046 307865 636773 774850
20373 774850 691314 776341 1056895 736831 559991 607492 347878 140324 166509 153610
20363 153610 221172 661425 380745 114597 368931 482421 523338 565873 345614 -7784
20353 -7784 -425418 -252851 11318 185083 282238 384737 288595 147151 315329 220393
20343 220393 547855 581234 185672 415257 447252 461218 449801 445810 340882 178927 121518
20332 121518 538768 441153 172760 421579 369771 -43467 -167025 -206159 -321269 -215187
20322 -215187 351526 754857 748554 577794 810844 871266 879682 752892 722623 490811 533905
20311 533905 599874 300880 417992 736212 505390 435571 497991 424655 549485 505880
20301 505880 251073 -16246 -180207 -30444 -36815 209923 21213 -66343 414039 569653
20291 569653 855642 1038515 1319349 1323950 1106028 641972 516174 694176 719430 534603
20281 534603 579875 361562 -62623 -65731 -125733 -82625 196771 348903 208966 -48037
20271 -48037 242175 361285 220210 327670 435867 583726 384522 72756 184909 287254
20261 287254 -47834 101627 553465 619056 510075 321499 447154 251726 190919 53191
20251 53191 -29871 124029 151083 405952 570441 441220 360623 401283 292645 359758 496472
20240 496472 513639 336312 441395 554717 514288 100577 -202008 -46521 97339 92698
20230 92698 81111 78898 397049 874178 687838 414488 225504 74516 -5766 130900
20220 130900 -65175 -100781 448708 580260 296096 101084 -30242 201796 492683 371256
20210 371256 72210 -210433 -20636 293648 185406 200849 249166 254023 -185478 -341446
20200 -341446 -62378 58301 -216402 -474251 -477688 -272850 -302587 -279956 -169149 31175
20190 31175 -62931 71974 360162 538382 513814 725569 675642 540330 366161 6151
20180 6151 74933 20479 -400868 -562214 -98894 445048 617581 893248 563568 468125
20170 468125 415119 201838 312826 302560 169655 274705 195724 269212 -93438 -247341
20160 -247341 -351854 -406548 -264256 -8193 260401 -4589 -330460 -476315 -660296 -485748
20150 -485748 -463342 -366751 -210953 110484 -44180 -232885 -527057 -470576 -173960 -202217
20140 -202217 -133035 -284313 -342162 -171550 324826 287747 177490 163150 248302 175635 202656
20129 202656 314458 417400 419990 633403 699181 111926 -172740 -252135 -308142 -210395 -305167
20118 -305167 -197433 -357125 -577125 -307292 -115652 80260 500568 607405 582670 440933
20108 440933 54915 130766 -90488 -464496 -48888 632731 587620 480941 764383 575536
20098 575536 593743 414018 236978 355276 808101 769402 317806 226527 59838 19860
20088 19860 -175282 -242780 -263321 193620 302734 439728 142996 137683 270650 78625
20078 78625 138625 -280069 -124841 429389 430367 244585 301523 201158 -28696 -168716 -122523
20067 -122523 -26596 37641 307257 247871 -64468 -37940 77156 96271 287784 435667
20057 435667 235157 139899 170752 5568 11121 262589 204770 458492 721843 1027097
20047 1027097 1031484 674682 251228 200791 358834 534668 317685 15404 202803 453355
20037 453355 166208 -33509 -51537 274434 450134 392998 542893 663769 466729 484483
20027 484483 494273 193767 317328 285731 -42701 -262143 -154420 29103 231675 327964
20017 327964 -30001 -1527 236346 104772 -132633 38025 37574 58400 64811 78486 3594
20006 3594 -497571 -410488 -81448 363408 198440 86464 351896 137958 -35013 -93375
19996 -93375 -44752 41389 95492 -146706 -212001 -82345 -186572 53095 350839 430538 374297
19985 374297 219708 -35385 138333 302276 454541 148695 165937 177817 92240 333208
19975 333208 277999 352634 294018 301240 499066 225158 -119250 -278168 -267511 14111 268273
19964 268273 452849 564013 985651 942318 515279 580575 958664 1531000 1604355 1223009
19954 1223009 984621 905404 899724 1048946 1565564 1406299 985284 1186051 1179195 1513654
19944 1513654 1505746 1361274 1263224 1208991 1553556 1402960 1373756 1375465 1121139 936818 999471
19933 999471 804544 430652 366727 250113 225153 253049 169036 -89693 46053 404629
19923 404629 736631 707924 809738 577589 118010 45185 256181 577169 572776 459096
19913 459096 477653 362652 16180 -83481 -27517 -118709 13430 242001 152366 96610 139774
19902 139774 33239 253013 66697 233041 455597 463258 359550 155456 208722 -109799
19892 -109799 -405799 -269237 163977 382772 559255 584997 386889 184959 -39911 69182
19882 69182 164735 300410 560172 538220 646450 587154 406335 -42712 -368918 -121001
19872 -121001 -210451 -170470 2128 199331 223108 406402 633139 600628 119421 17510
19862 17510 90574 -149942 -90126 -79520 71870 320707 6768 -93138 -215549 -97325
19852 -97325 57335 263289 134837 200630 210653 -34909 -150692 -391787 -364507 -178701
19842 -178701 5652 46245 55838 45303 264856 441641 354184 322017 261768 -142532 18001
19831 18001 527982 743659 689609 513832 182008 131490 -40322 -212515 -358493 91213
19821 91213 418943 491739 288784 337110 260567 -101163 236864 332739 509147 454176 305800
19810 305800 116928 90470 -88868 300542 635163 585918 716990 804868 438745 24592
19800 24592 -189531 8635 -181377 -446268 -391542 -323522 -85840 -216387 -333539 -583306
19790 -583306 -712154 -637812 -153962 82272 342285 328021 -6897 -71604 98445 116966
19780 116966 51622 98140 290268 122195 -241917 10590 304073 227421 351343 349833
19770 349833 120577 62718 205582 218207 319574 568625 667861 479610 339919 184863
19760 184863 -150484 -234458 194089 416247 699336 429068 216518 -22889 125168 113958
19750 113958 98430 254474 178283 134159 -8879 304806 558251 683364 711421 548915
19740 548915 256084 231240 52821 -98303 240754 386659 309506 419470 293856 481519
19730 481519 713790 568955 429547 284636 23717 -5395 101710 101711 310652 430225 408522
19719 408522 230433 37485 282567 519141 444478 906244 1340406 1428342 1207009 1017939
19709 1017939 1164703 1183360 977585 603320 502867 363651 376699 161391 377763 695692
19699 695692 1170211 1395824 1085651 900832 853549 740472 193871 60279 5738 24796
19689 24796 316969 349973 501013 460102 126543 124613 332725 373539 237575 154826 30682
19678 30682 142742 532169 875753 477410 381165 457513 222606 -178161 -259767 -67766
19668 -67766 -164779 -24285 210295 712669 821518 671285 916770 1293714 1327891 1264486
19658 1264486 1549058 1543262 1277467 713214 405999 528957 834610 978009 648015 414243
19648 414243 686714 839141 1122818 1253091 1301916 731682 605477 670295 404814 372044
19638 372044 408429 560545 566389 545855 666525 693461 469940 198554 320132 280740 248257
19627 248257 340389 213286 206230 243760 300482 -51450 -248730 -438959 -561749 90039
19617 90039 383187 443263 337213 487086 743591 847720 1088825 1235535 1014998 719064
19607 719064 404906 299157 124377 -19294 126599 323616 234353 64027 113352 149024
19597 149024 415252 618038 446378 269622 133105 51478 -30269 -179663 -61115 11710
19587 11710 272849 549489 420746 60585 -388825 -240829 121960 -10783 -103276 -115083
19577 -115083 91206 234804 104467 284825 192754 174681 22084 384735 458083 311026
19567 311026 -10335 -452284 -514890 -209665 486982 679924 414851 147444 -121963 -107803
19557 -107803 358175 307927 193259 350878 539295 563427 385603 281508 162315 -142676
19547 -142676 -659674 -333100 -7987 100905 106077 -22903 -105125 -265034 -390662 -335595
19537 -335595 -197777 -308788 -472103 -516170 -556332 -252325 -135756 -51078 52932 -132978
19527 -132978 -320820 -148964 10088 113347 271575 146929 190555 475920 120698 -147379
19517 -147379 -130890 -329039 -418457 -454240 -369906 -114016 197884 429274 280218 -102456
19507 -102456 157120 317933 350464 218419 287821 587628 825593 773692 542492 278334
19497 278334 -12316 -15750 -91169 206737 321361 249421 114421 36633 119366 9832 185988
19486 185988 208304 11301 58657 -190201 -269832 194743 436794 435365 576245 293305
19476 293305 36903 23176 468664 662444 986110 849402 416599 178195 294758 802144
19466 802144 944546 821634 526932 636220 784740 561014 12714 -298128 36780 361661
19456 361661 451717 360679 126250 111299 122917 209069 602964 486243 281642 -97074
19446 -97074 -127878 145633 175203 393950 475839 486226 433990 532704 411860 254311 529047
19435 529047 758600 740925 263884 313906 472939 558970 178121 202420 394005 401960 458909
19424 458909 702182 599863 475278 605074 745562 658432 181608 32680 93992 261676
19414 261676 268385 92242 397742 730145 827209 729383 595628 1011514 1121581 902257
19404 902257 817768 938996 1224914 1380097 1412713 1311749 840674 825920 646596 525164
19394 525164 180258 -81657 29959 92056 -45843 -103901 -138985 -77553 329569 546125
19384 546125 248816 304385 313757 436875 296715 103754 -84796 -15907 105325 314954
19374 314954 293413 300478 590154 705192 498838 465605 605388 841234 737009 833729
19364 833729 771466 720820 325281 726785 764430 725635 851706 543434 363217 609358
19354 609358 956758 1167895 1584588 1960805 2310267 2196879 2075847 2256714 2343651 2361121
19344 2361121 2283355 2165966 2082028 2280972 2404863 2136754 1626042 1296102 1354591 1495417
19334 1495417 1404676 1336984 1302106 1110702 756245 706204 919262 1184157 1342564 1577021
19324 1577021 1815780 1969416 1945254 1887339 1424445 679019 856084 847721 983100 1090029
19314 1090029 812875 1081471 1323191 1189272 1109842 965330 1068417 1069137 1300639 1127086
19304 1127086 1123115 986635 829356 1021269 968718 671699 729914 489076 501027 530849
19294 530849 472014 773055 1114892 1131340 1161743 1263298 1109716 955805 986457 782708
19284 782708 468709 550307 397239 317298 701295 847338 1006340 1249235 1134626 1029441
19274 1029441 1316743 1365364 1048168 1004953 862127 579257 532651 911505 1299698 1223317
19264 1223317 1210765 908076 643787 798214 1076730 1249224 985525 971892 1351604 1516643
19254 1516643 1076107 675298 573089 605627 678103 891546 1157692 1197716 1374398 1351777
19244 1351777 1178867 1029289 1019305 1332121 1546881 1659117 1755893 1744894 1343615 1334501
19234 1334501 1522759 1264014 1153568 1437114 1537404 1297424 1272039 1395512 1414048 1591121
19224 1591121 1735437 1810143 1879949 1819682 1555445 1676471 2146640 2289827 2306723 2295041
19214 2295041 2285788 2665498 2784310 2761686 3058230 3405391 3670777 3834889 4352040 4858416
19204 4858416 5010176 5274571 5642329 5737735 5943746 6321839 6886253 8300576 9465211
19195 9465211 10849617 12484357 14664352 17882992 23097705 30856213 43184903 64480796
19187 64480796 97277618 130214405 140007773 121215489 95638389 78432594 68402462
19180 68402462 61852507 56935937 55059080 56192631 61225720 72954557 95595786 127146582
19172 127146582 149271407 143702016 117832808 94158698 78503013 68000137 59398471
19165 59398471 51988911 46526928 42398695 38676632 35454507 32829256 30579006 28794245
19157 28794245 27681188 27105534 26440191 25212368 23977918 23570910 23576176 23194578 23314317
19148 23314317 23208909 22426324 22451268 22686102 23385391 24240125 25553949 27311694 30187653
19139 30187653 34664125 41348967 52236785 69594849 99183845 144695733 189780370
19132 189780370 202805738 176798126 140922983 116204718 101466158 91772644 84960160
19125 84960160 81926778 83858193 91925155 108538988 140322400 184900948 215994156
19118 215994156 208297583 171083184 136542486 114034078 98641789 85915420 75501482
19111 75501482 67545708 60959487 55208452 49820645 45434782 42131307 38897164 36408092
19103 36408092 34455624 32385981 30332458 28659557 27194634 26058635 25254833 24477371
19095 24477371 23066801 21661824 20487041 19507245 18739714 18020059 17352963 16500783 15776536
19086 15776536 15182878 14628307 14404957 14036763 13639808 13189120 12582819 11982014 11665252
19077 11665252 11458480 11279664 11468493 11253369 10906737 10638035 9907755 9759059 9782796
19068 9782796 9249708 9008330 9049253 8740421 8625499 8289831 8129115 8058625 7954464 8016962
19058 8016962 7658292 7434218 7169569 6768673 6221794 5928057 5765108 6205692 6297185 6082795
19048 6082795 5453766 5074758 5053230 4935749 4943981 4957757 4778025 4727256 4709922 4770158 4569608
19037 4569608 4191526 3774429 3733957 3556914 3827271 3842514 3713623 3533716 3537128 3315296
19027 3315296 3185402 3120156 3296120 3604805 3615713 3498326 3529794 3273326 2950222 2771069
19017 2771069 2659405 2736450 2737178 2389874 1828627 1984768 2480568 2598744 2674570 2720937
19007 2720937 2746774 2537995 2682594 2746064 2564261 2203680 1576412 1381414 1746037 1663436
18997 1663436 1878417 2097498 2169418 2193029 2241663 2302253 2527546 2382154 2359508 2210960
18987 2210960 2208625 2345994 2055062 1907760 2171854 2206250 1922331 1629579 1498527 1465415
18977 1465415 1487579 1797383 1737100 1671912 2107106 2072980 1996721 1851132 1664524 1466401
18967 1466401 1234465 1095938 1348850 1582730 966056 1011624 1068177 1423942 1966899 1799899
18957 1799899 1802870 1646633 1303285 798932 853676 924110 938102 1077844 1303743 1553683
18947 1553683 1642045 1812628 2027393 2109056 2147449 2063221 1716302 1740553 1767263 2024688
18937 2024688 2088594 1992250 1865390 1721028 1973621 2087019 2127272 1999802 1952193 1878599
18927 1878599 1761642 1996411 1956739 1939525 2383862 2403115 2225633 2080993 2165240 2254800
18917 2254800 2387833 2851861 2911934 2895144 3117437 2980948 2683871 2933908 3417030 3530894
18907 3530894 3809453 3986231 4085834 4313110 4736927 4712459 5253869 5799748 6368585 6378024
18897 6378024 6450436 6985755 7745651 7921654 8236557 8634213 9330849 9898372 10864650 12245583
18887 12245583 13802956 15710888 18802479 22819696 27767824 34695844 44856522 60330952
18879 60330952 85200813 124629340 173910325 210863313 216011213 200036524 191714586
18872 191714586 206145192 235222879 251833587 235746436 196792568 159180192 132241563
18865 132241563 113247628 98449134 86699713 77133881 69089368 62320991 56450572
18858 56450572 51798917 47894236 44419824 41446436 39241958 37183638 35147207 33455522
18850 33455522 32199900 31502798 30697539 29956888 29479735 28891301 28121123 27817690 27781728
18841 27781728 27152527 27026239 27295130 27713821 28482446 29672346 31470933 33552083 36410565
18832 36410565 39500803 43889058 50355620 58682433 70390986 88861471 118894900 167694271
18824 167694271 236236885 303505321 332780982 315597950 287151241 283471168 307080038
18817 307080038 339590336 360738805 354533589 317852749 264550331 218579826 186565169
18810 186565169 164448170 147368185 134010340 123879324 116181316 111278015 108764107
18803 108764107 110211538 118342788 137257026 170291687 209929768 230425949 219187826
18796 219187826 193106841 177330969 180136472 201836715 233638052 251264938 235529024
18789 235529024 196445869 161163199 137469637 121490373 108392777 97430855 88732450
18782 88732450 81605246 75340774 69617992 65087353 61719161 57989102 54300039 50832653
18774 50832653 47624597 45006472 43401395 41786392 39831752 38250792 36845979 35772404
18766 35772404 34513917 33442839 32564704 31463080 30150486 28933547 28252202 27622827
18758 27622827 26548261 25359667 24465275 23921437 23135770 22253792 21835721 21139621 20618473
18749 20618473 20179367 19369517 18785186 18239480 17642093 17480927 16694451 15920087 15259381
18740 15259381 14876221 14883625 14796834 14264574 13555242 13066368 13019812 12725336 12714758 12367642
18730 12367642 11749711 11228262 11185662 11435460 11052287 10368281 9909831 9619803 9232940
18721 9232940 8464462 8004824 7876864 8023111 7964876 7914369 7681742 7379351 7302652 7428062
18711 7428062 7378565 7010535 6924678 7088993 6825506 6588503 6567664 6942850 6703835 6356937
18701 6356937 6057494 5924763 6163150 6039866 6102796 5654396 5027554 4933437 4916113 4968503
18691 4968503 4878356 4494540 4452854 4695047 4792656 5031562 5059867 4423278 3949971 3853614
18681 3853614 3895738 4087266 4050595 3822531 3446217 3381318 3155006 2809745 2865917 3059226
18671 3059226 2965098 3076880 3562169 3871914 3596440 3137875 2952389 2717298 2716479 2520050
18661 2520050 2482110 2551784 2616189 2311496 2465456 2450475 2592949 2694303 2115085 1842835
18651 1842835 1870658 2042265 2408203 2515379 2321772 2288922 2592855 3011597 3103510 2704751
18641 2704751 2446159 2185451 2315733 2086619 1903619 1846801 1831409 2126353 2367133 2631581
18631 2631581 3214169 3281343 2962421 2567420 2117174 2088772 2109780 1995768 2065870 2471233
18621 2471233 2972901 2822687 2626975 2596741 2306552 2173864 2428486 2770047 2937908 2773358
18611 2773358 2745907 2997599 3221882 3173982 2635018 2824589 3093125 3255450 3241071 3515212
18601 3515212 3732706 3814059 3619568 3962538 4505593 4757921 4853713 5218564 5592798 6129087
18591 6129087 6610949 6742962 6967562 7215844 7589204 8116222 8895030 9452405 10330141
18582 10330141 11340166 12518766 13749676 15946824 18712818 22513772 27816704 35769215
18574 35769215 48510593 70434299 104586374 143750702 167111255 162162751 142188003
18567 142188003 128942108 131025903 149229576 175375805 190193796 178035469 148061850
18560 148061850 119430696 99704906 86789559 76545411 68391391 62045022 57024371
18553 57024371 53140631 49598774 46804626 44950003 43738869 43225294 43620790 45225300
18545 45225300 47986636 52884228 60873894 74775868 98274853 135433609 178230107
18538 178230107 202360019 194695112 170681944 154918047 157222107 176867060 204539100
18531 204539100 218969401 204063692 169872178 137708565 115361474 100225705 87965890
18524 87965890 78015142 69870026 63172233 57826671 52961891 48824684 45251230 42392755
18516 42392755 39930001 37725187 35645918 33359181 31264692 29617340 28428088 27306008
18508 27306008 25850875 24478734 23180913 22019384 21364637 20879484 19963431 19380519 18805892
18499 18805892 18023148 17191682 16387345 15972964 15719619 15647928 15244891 15215527 14608350 13907253
18489 13907253 13158511 12837803 12246230 11802285 11683673 11641057 11533373 11380906 11125260
18480 11125260 10593919 10198813 9707867 9581039 9506051 9318066 8938947 8813468 8269799
18471 8269799 8165623 8233001 7726919 7232668 6932766 6693987 6754525 6923485 6794636 6678276
18461 6678276 6461443 6643388 6461484 5922234 5520425 5558845 5479456 5199618 5332410 5149133
18451 5149133 5072146 4913686 4846648 4976218 4706148 4422204 4315242 4338331 4380659 4090867
18441 4090867 4039977 4154709 4029656 3716118 3709100 3795032 3392820 3206058 3133483 2911264
18431 2911264 2923799 2936676 2713129 2690744 2635605 2372538 2262851 2296131 2525823 2763334
18421 2763334 2699537 2263745 1915317 1877205 2083279 2024139 1951369 1802587 1888040 1900288
18411 1900288 1998382 1727762 1513978 1475766 1599390 1653050 1575875 1529665 1581591 1722367
18401 1722367 1541253 1127320 1116170 1234816 1356375 1432705 1303371 1422793 1298883 1264421
18391 1264421 975234 596222 713790 852002 759597 848902 1111630 1278383 1280983 791900
18381 791900 773930 922778 1273813 1266972 1070265 1127499 1002474 691282 896402 987669
18371 987669 817844 1151617 1189280 895300 663359 888567 985444 1013555 1018148 1230782
18361 1230782 1407608 895817 395163 330512 248947 380448 727174 1144653 987531 994792
18351 994792 1153507 1403671 1994741 1611401 1534866 1258166 961996 933109 906679 1181927
18341 1181927 1223520 1045819 1167164 1058255 798075 631850 873528 922881 716370 607317
18331 607317 776434 921025 1023135 950461 535938 514912 538709 609686 763368 702767
18321 702767 472393 427771 735006 855928 738317 745061 777686 913927 765752 664965
18311 664965 519981 734592 663296 419442 763077 861503 690330 697672 689669 1137683 1148579
18300 1148579 1216899 1534099 1929960 2001242 2043469 2079124 2196202 2306984 2169606 2125876
18290 2125876 2041929 2194422 1836743 1911146 2028348 2075977 1739554 1091027 867536 1126519
18280 1126519 1192248 1057631 960309 599743 500317 881837 1118070 1095694 1024890 1264860
18270 1264860 1354463 1379031 1523174 1612511 1473042 1279142 1219338 1333042 1438240 1462330
18260 1462330 1508060 1094927 880962 901531 946028 888493 1076023 1307299 1004543 520119
18250 520119 394040 309795 431502 569751 759791 1054863 796748 552834 722363 1286452
18240 1286452 1431017 1230249 1298316 926639 703891 1151498 992583 445313 655000 870794
18230 870794 725727 188515 42940 95463 453128 747797 474078 389328 424232 675037
18220 675037 859121 979047 1145657 1497798 1279637 982097 670736 736130 1555882 1879400
18210 1879400 1489932 820883 677935 906961 984333 727348 500999 466048 707393 822717
18200 822717 864368 901675 1171139 1141356 1043985 1095790 860516 698911 672131 883863 997828
18189 997828 815828 942134 1144606 1246402 1130658 1131596 1221147 1270328 1403847 1386586 1141474
18178 1141474 1257158 1157081 1051301 1284959 1479672 1296269 1102467 1096284 1215223 1273399
18168 1273399 1338632 1360419 1303313 1247858 1434398 1475788 1267133 1294534 1622184 1704347 1754703
18157 1754703 1658344 1426512 1433269 1429792 1874836 2045309 1886610 1791013 2001718 1968857 1869344
18146 1869344 1675809 1484016 1512451 1512833 1534347 1588470 2004936 2279481 2068912 2161313 2213501
18135 2213501 2264990 2442174 2847359 2991714 3096285 3019359 3474850 4027828 4502317 4971148
18125 4971148 5434062 5867976 6536365 7005345 7583825 8843493 10202864 11983296 13811251
18116 13811251 16357363 20221882 24749092 30325841 38151253 50187535 69631000 102283620
18108 102283620 161244987 258960625 359288560 387055139 323976295 240101889 185206921
18101 185206921 153196788 130361977 110408415 94746063 83519009 74622185 66402919
18094 66402919 59101511 52957730 48082208 43985557 39922318 36313039 33319990 31288556
18086 31288556 29575559 27887445 26136454 24670406 23443348 22642540 21362449 20319947
18078 20319947 19449324 18734599 18427001 18106325 17666591 17478444 17153059 16927964 16867170
18069 16867170 16897396 16637864 16306397 15978627 15451128 14883428 14593793 14218340 13894716
18060 13894716 13512265 12903076 12338098 11896732 11454797 11029798 10926439 10584019 10279756
18051 10279756 10469617 10519795 10335547 9965417 9689997 9218102 8974522 9029408 9030866 8885797
18041 8885797 8672306 8584120 8397868 8058863 7968296 7787923 7484397 7218474 7029190 6867717
18031 6867717 6691400 6550342 6449721 6235953 6032848 6050373 6270567 6593180 6617064 6757498
18021 6757498 6723840 6445843 6211820 6026660 6427719 6545466 6927599 7128159 7185497 7174084
18011 7174084 6897510 6727350 6669101 7086217 7949272 8548293 8506745 8688039 8976247 8987628
18001 8987628 9183103 9470779 9637044 10248522 11568603 13179024 15019406 17658075 21518238
17992 21518238 27075073 35181463 48372161 70828674 108005465 153882435 180478632
17985 180478632 168904716 134591024 105984637 87813913 76085900 66427403 58385635
17978 58385635 52877928 48511318 44810394 42357909 40518686 38831280 38035502 38312744
17970 38312744 39500769 41921197 46314094 54158188 67470736 89724127 126416851 169234065
17962 169234065 191675920 179201225 150680252 131474612 126947601 136276591 159912313
17955 159912313 192358014 209508154 193826181 158685504 128678742 108840391 95136779
17948 95136779 84282938 75546831 69047280 63865948 59020115 54781731 51039902 48323040
17940 48323040 46512021 45233074 45322326 46582914 49938638 56434238 67508851 87017017
17932 87017017 118661286 155756933 172718208 156533908 125040768 100762224 85216672
17925 85216672 74601374 65378166 57472335 51296982 46689625 42895473 39330878 36166481
17917 36166481 33469507 31211614 29055480 27429443 25846835 24581850 23392657 22952029
17909 22952029 22062238 21246989 20169593 19105079 18275339 17473061 16986526 16960890 16830263
17900 16830263 16212115 15381954 14712671 14225742 13689917 13118629 12225442 11676884 11310504
17891 11310504 11004821 10507410 10153602 10212794 10072364 9976265 9573066 9113677 8959248 8294244
17881 8294244 7400376 7281387 7421776 7448491 7550497 7467410 7036532 6834847 6671984 6312404
17871 6312404 6106883 5908132 5624992 5599401 5410106 5558894 5577511 5624460 5658721 5389691
17861 5389691 5171791 5142639 4794434 4684640 4631789 4742101 4325920 4544628 4463022 4100346
17851 4100346 3886543 3750713 3656461 3948806 4098583 4428778 4622478 4767283 4484140 4267096
17841 4267096 3992609 3528777 3368420 3370654 3287735 3235805 3152082 3060335 2494874 2325249
17831 2325249 2460574 2599401 2787672 2906105 2869161 2595940 2300214 2358290 2503738 2691964
17821 2691964 2740382 2574028 2378269 2052835 1686363 1607912 1790907 2045187 2401011 2503627
17811 2503627 2588349 2668602 2373821 2416446 2358433 1980006 2187722 2154966 2003830 1710402
17801 1710402 1725652 1861745 1861637 1837191 1587113 1738440 1656352 1820295 1848548 1763250 1929958
17790 1929958 1681599 1225822 1141911 1211460 1300060 1096531 723984 531058 1049346 1255581
17780 1255581 1023171 783996 796229 847509 994078 1062591 1070917 1112162 1109366 1068040 928625
17769 928625 777971 578290 747923 918890 848188 639662 461026 432590 690299 953790
17759 953790 1038343 958299 1199642 1182117 1381627 1348788 1269088 1175758 1446331 1408873 1023759
17748 1023759 912030 578522 519231 598063 736778 768309 549438 302976 639270 874171
17738 874171 911406 1003200 883847 569933 225432 212391 629328 686662 792153 658868
17728 658868 388769 823469 908530 1059089 1002070 692374 457530 655650 590603 510540
17718 510540 464370 -42749 -23944 -38758 -310098 -295047 -223922 102621 -479 2637 217225
17707 217225 100316 417021 742991 747908 688347 607252 447878 514141 466267 449989 450782
17696 450782 206931 -127204 -50165 189848 204908 72455 -144113 -286372 -423325 -336023
17686 -336023 77969 130045 191215 344183 420464 405073 159526 253145 -199703 -206540 -103320
17675 -103320 -199979 -6053 -105176 141144 437957 310198 128620 511892 562164 254637
17665 254637 78206 -123358 -99799 -399682 -561441 -187196 262740 404198 451105 379437
17655 379437 367332 363142 155552 -207643 -162659 282405 563117 518561 249904 -39653
17645 -39653 58829 -308865 -362448 -119964 51485 -42386 189017 146810 -171261 -278081
17635 -278081 -406876 -329367 -282444 -164146 -324516 -504457 -256425 66099 23010 238710
17625 238710 406873 -92181 -281082 -35368 84513 -137824 -290909 -229358 -2416 -93107
17615 -93107 -141591 -115284 -150961 -120412 42535 166700 44817 -122788 -63909 386304 384760
17604 384760 67560 304415 258491 -13139 38009 116585 103548 147516 198875 173707 206404
17593 206404 -17990 -506774 -814127 -797914 -828131 -509924 -71918 131878 -179094 -52012
17583 -52012 86325 -84700 14924 -19723 70573 404891 402461 245915 109055 -228349 -145289
17572 -145289 -299766 -252016 4736 89238 -164991 -362825 -532230 -275821 -167926 16275
17562 16275 -21587 247305 474570 291681 201769 3253 -94402 -231297 -493912 -609688
17552 -609688 -440968 -43115 171818 163048 159859 369560 88551 -37263 -140645 -341027
17542 -341027 -160976 11401 -338130 -411844 -768484 -1256526 -1158334 -1051584 -837494 -448673
17532 -448673 -237000 -6253 400569 476485 338383 328841 398904 304095 431825 196220
17522 196220 155982 106995 -28911 102114 317177 228822 73827 -23837 -351142 -362414
17512 -362414 -77680 173080 150384 333129 38189 -186981 67515 252048 -150948 -370124
17502 -370124 -533227 -593225 -160281 17725 -329732 -352976 22292 53421 -174883 -33136
17492 -33136 228936 590200 777545 387605 -100449 -178363 -7306 371040 257808 65131
17482 65131 67122 65285 -291489 -566420 -631543 -664402 -119868 -93083 -465529 -208294 55356
17471 55356 238105 320531 597930 575980 611111 613906 678539 467583 283722 267421 380368
17460 380368 451290 442457 250068 329012 182544 157160 14131 -242835 102752 810877
17450 810877 772887 631992 806785 679273 970511 984308 673308 386916 1012176 2193277
17440 2193277 2844690 3086968 2389569 1757142 1376367 1356243 1132257 930033 1032691 1036153
17430 1036153 705895 1023435 1015588 743851 537326 620760 851343 1240055 1393171 1112953
17420 1112953 729627 840382 941246 840175 1342076 1512376 1330254 1164232 1098561 919127
17410 919127 806317 1011023 673193 799056 755039 921660 444143 214337 388403 473378
17400 473378 489331 452082 83639 -220065 -28924 485917 509037 460034 895057 1307030
17390 1307030 1120147 668018 761708 1023264 932132 723980 143111 127125 524095 958184
17380 958184 801245 527690 439082 250041 43956 -70599 44053 -349292 -666936 -667134
17370 -667134 -488190 -332176 -379147 -285215 -235933 -262006 -393623 -477923 -607118 -649679 -490782
17359 -490782 -193153 -127604 -90706 104369 192525 165688 -2347 -55237 -98470 16489 230169
17348 230169 238487 167277 89378 43224 90594 279908 362388 500749 418348 267435 41605
17337 41605 -72344 51923 74160 -365917 -484784 -32078 420199 305721 59415 147388
17327 147388 142181 -9414 -386569 -410395 -2988 248587 345273 167168 -30598 -414396
17317 -414396 -671896 -524665 -121319 42043 115245 215372 51164 301231 513719 676350
17307 676350 374508 105356 28623 58899 176593 129508 281276 377305 202576 -73436
17297 -73436 -41940 275851 465954 440108 445914 503674 58734 -444660 -356855 -102208 432501
17286 432501 741497 717974 652654 595031 976312 1226716 1302001 1349377 1166407 875958
17276 875958 861227 852884 984188 1033453 758116 761018 501439 544994 402495 650355 656645
17265 656645 456888 837754 755467 375981 -154877 -256211 313423 649240 904279 1000717
17255 1000717 1160930 1234110 1236408 1441719 1224953 853162 1130747 1316620 1064546 835251
17245 835251 1071471 1167297 867060 752147 633568 555301 581005 1153150 1040552 891500
17235 891500 954400 891858 884753 1197704 1266936 1134571 1017173 1055048 1072508 901781 424205
17224 424205 352120 532703 673671 217385 540481 708219 161416 147589 461952 635136
17214 635136 720861 428893 434442 789968 781929 782961 863990 855116 779805 665386 712138 729014
17202 729014 640363 488631 561789 1030769 1192408 989285 537363 479749 537639 506171
17192 506171 474309 554880 506220 301693 347635 137402 -114564 -372420 -59745 -245253
17182 -245253 -536325 -303225 -218130 -324824 -270670 -147810 -198285 -201271 -153911 -264762 -315217
17171 -315217 -690012 -678138 -814311 -814837 -688456 -595252 -591739 -438172 -93185 136878 198516
17160 198516 -163394 -178004 -138776 -242139 -421346 -478339 -294388 112330 140622 155775
17150 155775 -29655 -132627 -336058 -118684 20777 42953 16342 -138417 -183192 -168763
17140 -168763 8548 -62823 -56281 153931 269640 261207 286051 -213326 -342604 -229848 -207141
17129 -207141 -248805 -184219 -132544 -207228 30849 -47749 37509 469481 552354 291805 189916
17118 189916 48432 -40783 -263085 -399499 -470669 -333054 143199 390703 84463 103389
17108 103389 -150401 -405897 -234214 -34831 471138 675314 566269 85242 -111481 -167463
17098 -167463 -173603 -166079 -167729 -146113 106409 105570 -131160 -250644 -238682 -191141 -394649 -525476
17086 -525476 -376831 -604624 -910404 -964449 -857181 -265521 -1095 -15034 347889 514738
17076 514738 143736 -24888 83666 104031 -61336 -416625 -383697 -317808 -381876 -110031
17066 -110031 -49494 -346577 -451734 -368106 -38496 374070 726114 555675 78720 83628
17056 83628 200084 -453010 -792365 -472716 12667 -50159 -277213 -75439 -199108 -380991
17046 -380991 -277248 -399010 -348604 -258383 -51191 -3404 376160 521075 221837 -46532
17036 -46532 267982 581151 826749 803968 611757 562291 237005 214185 175411 50053
17026 50053 27069 -270992 -436320 -235649 -566806 -543005 -430565 -360115 -598824 -507576
17016 -507576 -229911 -9569 435669 578444 568830 373922 220951 186015 161874 488471
17006 488471 484259 -155028 -352353 -218248 -192242 -131636 122343 225852 277682 420261
16996 420261 365256 589847 737774 715989 338256 317710 82007 -66905 -112367 -197999
16986 -197999 -325899 -361723 -120308 151366 131137 257777 291118 151723 454783 722843
16976 722843 335691 278127 392678 668628 556594 33478 11911 125803 37034 71775
16966 71775 -5095 -87840 -156444 -429672 -394983 -130021 -362567 -409005 -833879 -854932 -723917
16955 -723917 -511768 -407038 -399596 -145954 -88464 -37472 232504 113727 39289 183705
16945 183705 -32965 -239646 -262788 -482568 -254692 -314426 -55028 424972 556115 151199
16935 151199 -274369 -371518 -89911 263105 245826 -79001 74488 634334 746328 435786
16925 435786 193448 -9847 -156414 -63924 220529 439666 437852 299969 371717 570272
16915 570272 763482 718026 864708 845982 659940 481013 407881 678999 319170 205804
16905 205804 140772 204848 -195944 -270197 -237842 -116231 -122176 -27890 76064 452928 460816
16894 460816 641987 547965 163968 -223517 -474037 -16256 403558 546427 262743 371576
16884 371576 281227 174646 264732 130813 60811 151606 224200 104175 99582 224767 170541
16873 170541 172981 215763 168055 -27806 -39410 69693 5779 294196 526280 440081 513980
16862 513980 194411 -34431 241078 517374 303048 -141533 -599361 -574055 -506676 -378954
16852 -378954 -162003 167898 515799 588362 790953 454305 631298 656101 181452 -156537
16842 -156537 50782 -326696 -264460 -14772 146059 -121344 -56088 232221 253473 -8091
16832 -8091 -304255 -464446 -510319 -470869 -384242 -535595 -541364 -376902 -223790 -308507 -177165
16821 -177165 208998 335758 307358 436202 520770 377672 346759 257274 281754 88682
16811 88682 75656 -81598 -144088 -195848 -113223 111504 54161 -353419 -309175 -81614 -28681
16800 -28681 184880 624826 669422 386342 237103 291562 108187 -209158 -132560 123097
16790 123097 239920 264798 56083 -144818 -55119 242081 147790 -123247 -471932 -324565
16780 -324565 -248679 -310168 -34137 68882 228160 32551 -444094 -490969 -150239 304142
16770 304142 288840 393906 251741 423660 320491 60693 108437 190006 -103597 -442690
16760 -442690 -325863 129079 161686 206045 714448 944255 555132 331498 363051 124330
16750 124330 -228328 -551647 -406237 -258400 -137109 -225182 -427936 -401764 -139053 27348
16740 27348 59080 13810 -442221 -702257 -694049 -454433 -441019 -228872 5744 25139 -86795
16729 -86795 -147458 -304369 -752538 -921412 -1072498 -610374 -115523 -209428 -317765 -538939
16719 -538939 -447742 -391472 -537529 -449098 -576034 -626047 -206017 275456 216438 41601
16709 41601 131743 -45112 177125 474168 333025 306013 406283 293890 554541 643150
16699 643150 872755 575984 419799 161986 -226974 -530443 -575830 -332212 -228140 -208278
16689 -208278 -297095 -890 334848 706820 768767 211435 4619 -156179 -352695 -196514
16679 -196514 -45455 -2484 53742 -25925 -535049 -659277 -493362 -287829 -82999 -508198
16669 -508198 -698937 -604546 -332322 -260339 -244030 -439074 -551408 -617953 -616538 -794195 -937889
16658 -937889 -949010 -796726 -598109 16364 302152 57746 -311506 -444005 -498424 -303915
16648 -303915 -45386 -43953 -331597 -577443 -565548 -639025 -722972 -558277 -623438 -519486 -414492
16637 -414492 -324164 -202129 227169 479625 564840 49374 -59891 9184 453033 417757
16627 417757 210979 -65226 -15376 -5654 -68983 -26382 -15342 -92796 -152013 -410345 -289387
16616 -289387 -154379 -189646 -496027 -549783 -430168 -692692 -456939 -100126 -64698 -138709
16606 -138709 -185377 -270708 -196831 35990 201430 202550 5302 -666214 -905108 -547918
16596 -547918 -381756 -276276 -330052 -209074 153288 104812 -165174 -351394 -451170 -391793
16586 -391793 -513891 -275912 10067 88669 214865 713060 901025 660850 351736 -287223
16576 -287223 -508878 -408183 -380195 -461738 -530076 -949917 -720866 -341487 -478322 -375724
16566 -375724 -110150 -218372 -284454 -157352 -34511 118884 313198 316161 -27975 -130434
16556 -130434 -196731 -304462 -98084 207763 671529 643979 122214 150002 72000 -7696
16546 -7696 125690 -346665 -649158 -579134 -62167 -202406 -479614 -565561 -495909 -524580 -384408
16535 -384408 -115773 -156394 -134426 37129 79266 -170187 -26560 -253767 -378916 -291047
16525 -291047 -263648 -98735 -136858 -380337 -584968 -459442 -634154 -782346 -648536 -693111
16515 -693111 -774247 -474072 -517706 -667555 -566129 -383620 -182868 66309 88353 12985
16505 12985 -149851 -58786 -192295 -321359 -180836 34350 -32399 123906 145323 -73871
16495 -73871 -86786 355074 427175 -188365 -350582 -56366 -202593 -463309 -369962 -180403
16485 -180403 250931 351965 64557 144932 95884 2035 -201195 -375309 -356561 -97644
16475 -97644 3199 -387883 -247908 129528 58094 -20093 222566 437183 360658 433201
16465 433201 110690 -157908 173610 312235 335426 321763 107240 55858 -132675 38186
16455 38186 253642 131258 -131400 -112392 -415723 -276086 -159342 10135 -232192 -530007
16445 -530007 -583576 -124607 -79565 26573 -83448 -38936 -53419 38024 98290 73956 49792
16434 49792 -149882 -174985 -136400 159675 228570 132354 -147882 -4391 120087 140935 200737
16423 200737 41682 -72655 -56789 -272231 -64238 -122509 77638 186213 280173 634723
16413 634723 735806 597902 1225 -83376 182514 208942 -177655 -208782 -379698 -202772
16403 -202772 214803 -30632 -99505 101786 -87719 -379834 -254221 -52852 -193269 -511329
16393 -511329 -241359 -154446 -258774 -218073 23673 38733 197181 107676 -144801 -54654
16383 -54654 -52935 -110046 -61704 133240 779073 726018 605322 307558 -168093 -168090 351054
16372 351054 555999 379551 241681 96407 -273898 -222847 59976 71611 -21639 27915
16362 27915 228713 542909 509388 420342 364665 9209 -417308 -683740 -566936 -451858
16352 -451858 -298367 -264532 43613 376734 275516 109311 -124128 -318397 -228110 -437073
16342 -437073 -432058 -429150 -519874 -115882 193164 180556 237974 270855 155544 -75061 134882
16331 134882 239589 363952 468797 449514 -182408 -215870 39039 226772 254510 -92048
16321 -92048 -381734 -467002 -343073 -188902 -73768 59082 -134239 -407498 -299926 -464603
16311 -464603 -365502 -139022 62224 90718 42660 -74084 -216937 -537919 -704534 -636916
16301 -636916 -396178 -160822 -100934 -74104 -164917 -241336 -59747 -312305 -497600 -208698
16291 -208698 21619 104357 331406 292535 145019 95074 44387 62540 -11861 -314606 -443031
16280 -443031 -508285 -353270 -31907 -260079 -577255 -538411 -324690 -21291 596503 493297
16270 493297 176068 265601 308435 476482 712420 797723 558546 103515 3644 -71586
16260 -71586 -288770 -275878 -391047 -208477 -130667 -244864 -181094 -80784 -42825 -365050
16250 -365050 -389470 -189287 8234 -219194 -75601 -13615 160318 164895 217595 -45868
16240 -45868 -385029 -222962 -234211 -163621 72364 204138 173316 -61557 -169024 34271
16230 34271 161453 69445 -73076 -313960 -500017 -121937 -51752 -198258 -139125 152820
16220 152820 42886 -29659 -493992 -260987 -65968 -108058 -286452 -353372 -79252 -32
16210 -32 -276525 -198692 -84458 -170601 -184468 -65101 471464 497424 442569 356978 247147
16199 247147 273452 -64023 -442712 -213362 -108381 -83217 -16581 2153 110596 -294928
16189 -294928 -214284 3574 27997 75288 364155 525472 445360 282235 169493 -51921
16179 -51921 -145348 -358962 -255344 176415 549362 739154 552525 -12921 -597508 -720416
16169 -720416 -642023 -367094 -300443 -286292 -509743 -599871 -43256 -138756 -553597 -276757
16159 -276757 -185891 -99038 -186014 -509546 -555274 57527 -26045 -561265 -467738 -375114 -120885
16148 -120885 118287 38878 -5766 -175889 -123425 111487 546516 205145 207146 284109 241665
16137 241665 145612 -96456 -109075 -229438 59796 30819 -333533 -575848 -229652 -267324
16127 -267324 -289120 -74261 -54081 -361071 -579069 -278895 -349775 -575921 -581039 -683540
16117 -683540 -591008 -308971 -75416 290685 136843 -21099 99830 206435 46905 -158943
16107 -158943 -158817 -26529 -55428 51681 -35366 139775 276859 186365 214998 348443 486263
16096 486263 54900 275880 325496 311802 403219 44481 -25007 -64915 -17541 -182249 -409039
16085 -409039 -647614 -851269 -636632 -482347 -187288 262406 187127 -227870 -339966 -259473
16075 -259473 -115198 -256411 -227973 -149815 -413052 -221283 -134092 -389519 -206606 -55361
16065 -55361 -43201 -347987 -674546 -680397 -435897 -187014 -74152 -16587 -148581 -181766 -237057
16054 -237057 -539122 -650912 -74672 87345 -170490 -256951 -169880 -182539 -95571 257896
16044 257896 8344 -91422 210911 496885 669253 382986 284036 445076 248365 256453
16034 256453 -178354 -460085 -197937 150400 255185 433409 490322 216623 -24074 -184876
16024 -184876 182887 48428 -176297 -345154 -517457 -455271 -172502 15318 249816 449436
16014 449436 498630 153333 34954 30632 66796 64404 79136 146408 -17960 -58713 -142905
16003 -142905 -107133 169648 404214 436797 288974 381482 279954 22006 7805 92647
15993 92647 86181 69826 21403 -307335 -508717 -342979 -4255 249054 237390 165352 -219733
15982 -219733 -536979 -588228 -313417 178832 502868 656348 632725 750501 697437 635609
15972 635609 562982 174369 -29528 -241371 -330463 -371789 -247172 18983 69052 168463
15962 168463 21533 -241187 -218808 -407242 4432 366948 84594 226905 260710 143030
15952 143030 522957 671123 599798 544755 146046 -176151 -2905 101331 17068 -213669
15942 -213669 -353207 -246589 -109082 -303545 -413493 -537822 -306135 -54022 -251903 -275318
15932 -275318 52353 129610 -218494 -342614 -415696 -138982 226955 666956 604888 743070
15922 743070 414410 200975 -77450 -216482 -375797 -791184 -839961 -356812 -171536 -206246
15912 -206246 -509387 -365581 -275486 -566958 -708258 -429615 -491069 -108076 389066 131636
15902 131636 61780 34342 -109401 -333768 -479010 -120611 -5892 145825 316936 -20215
15892 -20215 -428012 -496968 -277197 -264534 -131974 179306 272344 -72091 -214910 -216695 -69836
15881 -69836 -179458 -221455 -209632 -134175 -156548 -162266 13679 138964 73341 105495 -278786
15870 -278786 -540648 -458537 -272749 -237106 -478960 -495894 -219306 -297711 -484514 -543201
15860 -543201 1982 208211 -44066 -267159 -258201 -41591 85164 211382 -153562 -480127
15850 -480127 -343363 -162564 88020 287149 224571 -257 14389 63116 -110906 325716
15840 325716 455383 162942 165364 18027 -56433 -147396 -227584 127627 473718 510793 -28276
15829 -28276 -270198 -198413 212324 364358 64476 79225 158771 216805 371450 296205 103116
15818 103116 83648 56568 9489 -47425 -91379 -9015 254883 169640 174962 108853 -91764
15807 -91764 -21719 199800 -113814 -295812 59885 124109 320811 578886 532760 335902
15797 335902 69456 -40450 302625 222866 370584 256105 -22107 -49725 -157973 -248243
15787 -248243 41654 -73878 -177789 -661364 -742262 -400100 -465094 -510584 -174918 189146
15777 189146 92899 -137317 -297152 -125234 85145 251394 150859 100772 268442 109589
15767 109589 -40478 -105214 -94757 -79458 -87526 99006 214279 278792 308515 -142879 -243267
15756 -243267 395620 579704 383602 -227856 -101171 -116677 -515753 -848366 -590708 -96199
15746 -96199 -217391 -102630 103891 -6872 -180718 56934 124302 -20458 -225646 -397640
15736 -397640 -690703 -759221 -634742 -703768 -548664 -269445 -332998 -263155 -279499 -154854
15726 -154854 -33105 -25951 -225076 -447741 -237596 -254953 -98094 -104947 -166136 -255719 -321822
15715 -321822 -28453 219248 488840 592283 152834 -222338 -29860 65949 59483 203386
15705 203386 211353 105903 118576 -263537 -900652 -884399 -770358 -575978 -405911 -83969
15695 -83969 208642 140059 363929 281870 200998 446417 504169 525950 225482 -342095 -345868
15684 -345868 -304453 -288417 -201772 -63744 -579 116888 219564 93780 40300 -250504
15674 -250504 -328486 -420464 -121913 254236 76964 -141339 -820002 -688184 -287577 -143051
15664 -143051 -68166 -43833 -103850 6865 319922 309581 -146885 -565614 -1016631 -728530
15654 -728530 -508518 -568432 -508258 -37894 296519 26421 17447 184725 357941 437116
15644 437116 428102 160684 32908 223518 391445 157194 -175598 -518388 -416478 -557378
15634 -557378 -716666 -490176 -608438 -713124 -186703 -179825 -2799 36878 -338672 -650166
15624 -650166 -456453 -266996 -416662 -251542 -9854 29145 238644 178159 -6694 -224038
15614 -224038 -290644 -60642 -130056 -9680 294737 164843 192306 99684 -36517 -247704
15604 -247704 -422677 -353257 -413976 -517811 -4714 361401 307173 206853 24504 -340780
15594 -340780 -535922 -576635 -381581 -44957 -30242 -22442 -313731 -119452 -34570 -114011 -89050
15583 -89050 -214915 -458501 -421875 -345261 -427184 -86988 176672 -249510 -603164 -462500
15573 -462500 -178790 -189093 -343772 -272643 -158851 -70077 -178910 -181145 -168361 -222022 -346274
15562 -346274 -81548 -28147 80047 -90914 -174138 -90935 214951 166056 268200 219408
15552 219408 309519 419179 103580 375748 455875 348282 326159 182252 298767 338203
15542 338203 244535 534519 301708 -96118 -258180 -247776 27412 195736 378432 321504
15532 321504 35370 -257346 -47741 264098 62207 102392 343458 72594 353561 685833
15522 685833 542340 511951 393621 278281 -30742 -360710 -84555 185793 -60463 -106473
15512 -106473 104966 -121622 -207079 77755 383187 554968 396476 198883 23263 176480
15502 176480 74966 -104363 -216644 -344476 -228531 -190759 -303188 79892 284838 312327
15492 312327 64084 -41301 -5948 -61969 -116860 -198035 -264699 -164273 373601 53101
15482 53101 -96578 341631 312807 257372 63844 -87888 -205100 -382975 -367938 -101900
15472 -101900 -78207 131799 382955 125772 -113887 7207 -211578 -273424 -240211 -482719
15462 -482719 -431998 -53030 42875 278067 340551 155980 316976 122026 -235013 -138014
15452 -138014 64358 -16085 -247251 -114100 -10151 146523 120865 -153087 -356254 -853991
15442 -853991 -904569 -368380 -269230 -165716 104622 409872 315787 318155 231060 108632 -50339
15431 -50339 -195133 -526930 -512211 -364739 -109685 -180894 -79506 -69166 -122119 -140416 -199224
15420 -199224 -591309 -533403 -207631 -261620 -634212 -612301 -507545 -228647 92387 -160178
15410 -160178 -346930 -82652 -258916 -200505 -132218 -333665 -598302 -401734 -516869 -514966
15400 -514966 -542847 -456632 -201145 -18613 195444 -37090 -289329 -442557 -619671 -557916
15390 -557916 -229173 95426 186097 313928 187737 146669 149691 190183 211575 213103 247016
15379 247016 360065 494489 461451 418802 82522 -123460 -74645 168652 329119 596258
15369 596258 283481 132404 42386 235373 182922 138581 350071 136775 -198075 -215569
15359 -215569 -226727 -267210 -385998 -683942 -570607 -460352 -538498 -444097 -449798 -313160 -69722
15348 -69722 -247239 -246056 -189608 41696 241994 225919 -8846 41895 -137766 -249599 -162279
15337 -162279 -1519 246220 461518 416541 321857 315449 -30645 -30902 376937 633019 969283
15326 969283 1000937 749126 199405 -53141 -118074 -266502 -478144 -28802 192319 387540
15316 387540 324595 156087 455465 185417 122882 61447 -15524 -261755 -412770 -96719
15306 -96719 155451 346531 507346 544731 515143 336922 75685 -106784 -27086 -52920
15296 -52920 -184586 -201799 -181827 -422169 -544425 -497109 -294082 -176349 -188714 208837
15286 208837 455553 270995 292960 305340 -65606 -107037 -16852 285832 313410 53250
15276 53250 -151437 -408398 -240204 -60330 -98829 59829 355491 375868 -35465 -138414
15266 -138414 4399 -27782 101783 -151852 -630573 -428944 11083 -86224 -99327 -29758
15256 -29758 -7982 -106203 -88351 41483 -314450 -362776 -79724 -143338 -257932 -431677 -281075
15245 -281075 -417160 -286785 -326391 -107751 25471 -106083 49822 148776 247710 -44876
15235 -44876 -286696 -213730 -230803 -314329 -371471 -155043 -139597 -327258 -262559 -10286 277489
15224 277489 333998 192791 -160260 -224580 -400574 -276081 -376967 -341885 -298210 -78916
15214 -78916 47527 -153572 -45811 -14100 -142025 -60731 -33953 -162819 -329094 -188022
15204 -188022 -272634 -34573 414607 607671 239818 92635 -127316 -230182 -58840 -209958
15194 -209958 -484698 -573769 -363135 92906 151401 67382 31754 208816 97963 13921
15184 13921 -304125 -924972 -941628 -585224 -61234 313173 613372 455474 183398 -44173
15174 -44173 -197763 -254102 -201699 -135207 -110536 142624 250266 220069 -57575 -272377 -362682
15163 -362682 -160356 -54396 101698 110594 -66831 -264824 -90307 -161308 -333747 -697846
15153 -697846 -803308 -809585 -761452 -650895 -340169 -272584 -91686 -161685 -243243 -416448 -266420
15142 -266420 -39430 -126071 184701 217329 135266 -63309 -220501 -250320 -232346 319403
15132 319403 587365 265993 -104193 -268863 -383667 -413768 -122868 -5534 184905 -104773
15122 -104773 6743 -85425 18417 253847 282777 157381 223797 228227 86053 -184860
15112 -184860 -61043 37146 -118643 -169011 45258 20759 -184013 245025 420139 230405
15102 230405 462596 450409 230984 82790 -87468 -104320 357219 267733 -193699 -107779
15092 -107779 64405 310389 310441 290685 426508 586178 650533 218899 -6035 323937 486240
15081 486240 589550 367243 121183 261077 305951 -83625 -196149 -216956 -275644 -187128
15071 -187128 -61474 33169 -53074 -29608 -57250 105173 -131156 47548 527155 442401
15061 442401 272068 -75648 -46900 -131701 -365447 -480658 -630029 -857576 -744974 -410964
15051 -410964 -276271 -264711 -376638 -525632 -433201 -431446 -826991 -638566 -606106 -534574 -549988
15040 -549988 -325451 -360340 -370003 -475849 -712624 -460634 -102648 5722 121689 14553
15030 14553 -31307 -424574 -403431 -404089 -198154 -162445 -492142 -573115 -578684 -351488 33395
15019 33395 73519 -32567 -268091 -150227 114286 340894 398803 475177 97252 -62409
15009 -62409 182717 379715 366111 284848 234857 176603 -105277 -164702 -90234 -346509 -426702
14998 -426702 48067 155266 -232619 -386274 -310773 175124 373640 299810 307329 309209 22535
14987 22535 -133084 228670 466489 298177 321432 294274 443615 718779 550039 222090
14977 222090 206231 -51839 46387 215592 216308 -195979 -283615 -126278 -203856 -530737 -354964
14966 -354964 -329737 -400550 -329883 -251334 103946 37024 324197 342182 279413 117862 134546
14955 134546 41382 -81046 -113932 -41652 -143979 -505258 -576073 -334026 -90906 -340830
14945 -340830 -101997 -67432 -41063 -144425 -197712 158928 404664 503947 170497 -209467
14935 -209467 -141598 -82789 -209496 -113655 -52667 -19057 423496 608838 418607 361054 65408
14924 65408 -13049 387645 431575 219591 -183848 -82300 72783 -230553 -137229 -153319
14914 -153319 -32931 133611 280408 202657 144066 140786 -33821 -230171 -182461 -309929
14904 -309929 -145723 89768 136507 154920 -62882 -80157 233039 278018 339067 146876
14894 146876 -78167 101881 -140947 -587666 -760960 -368128 261758 422726 354903 537151
14884 537151 212509 -138550 101381 475832 687447 604118 450713 450313 169888 210220
14874 210220 93834 -173152 -524654 -575021 -320070 -242798 -299533 -34785 -33070 -11115 -33451
14863 -33451 535 59577 -274085 -222975 -324356 -572919 -367021 280040 387675 426803
14853 426803 -175704 -616122 -698622 -506291 -510643 -282085 -193050 -48607 105030 163078
14843 163078 22643 81339 102014 248339 183500 105463 120788 148375 15582 82443 53061
14832 53061 -238562 33670 140005 80187 43911 35671 124452 84823 119999 61209 -236068
14821 -236068 50088 -146442 -395220 -498917 -455166 -148812 168548 485799 265346 369773
14811 369773 202176 -18460 -289682 -339077 -169805 -203708 -117612 -101826 -304838 -22865
14801 -22865 193313 -85937 -326176 -284743 -391194 -231556 -288585 -238605 -249461 -208388 -315789
14790 -315789 -284677 7637 103217 -182305 -273140 -254353 73734 176396 250751 -229191
14780 -229191 -233526 197369 86142 -83818 -129414 -362635 -575131 -529327 -407837 -224171
14770 -224171 -294102 21541 113827 -31673 66502 382256 230826 125378 107464 -68457
14760 -68457 221351 -75282 -289116 -318503 -202917 -155041 -103063 -263876 -339495 -212255
14750 -212255 36372 17034 -55367 140147 127645 -132229 -322933 -222959 -220942 -176999 -61400
14739 -61400 506095 731123 667728 485920 399249 434343 324292 254311 33369 62186 176337
14728 176337 138497 -70716 11172 51252 -173535 -23464 33832 190022 140327 -18503
14718 -18503 -253563 -484850 -783287 -878187 -468049 14600 292796 271245 124865 -16716
14708 -16716 97924 528255 378128 225417 12562 -390948 -710368 -659774 -489879 -226466
14698 -226466 -352879 -392075 -260437 -288945 -119806 38809 23938 205063 412309 344140
14688 344140 -65431 -418328 -524096 -374692 35829 54527 50524 152255 44095 -316817
14678 -316817 -395602 -390241 -458407 -474234 -527477 -201182 5543 294888 636591 393502 79915
14667 79915 101176 346812 757323 602867 520167 368249 237248 176070 218860 -37425
14657 -37425 -285001 -121948 41980 -62100 40566 119055 182258 217289 -9376 162897
14647 162897 356525 231901 575336 509859 359864 559996 716638 377757 126998 33380
14637 33380 303864 272189 63044 24170 -7430 -113413 -72070 -194164 -185407 150695 326146
14626 326146 224846 12987 137278 237384 354503 197499 -67530 199343 -44671 -286509
14616 -286509 -327218 -373656 -85474 98170 473861 52640 -297892 -142820 53889 162489
14606 162489 -258505 -500349 17511 258268 142285 207647 294519 424237 67973 -185690
14596 -185690 -327302 -155663 107550 195699 425189 366797 364520 50675 -548786 -744725
14586 -744725 -500088 -192388 -240897 -98527 230819 133884 -129493 -485967 -267294 68432
14576 68432 -71546 61585 139464 11111 -21540 71518 -312934 -236131 -130481 -344189
14566 -344189 -173365 408069 351482 25379 -20367 597 -71507 -16573 166378 321609
14556 321609 378714 -125831 -158304 183392 -40043 -243792 -294991 -112913 -103344 -86391 -344966
14545 -344966 -413596 -773516 -476508 -608776 -514478 -350676 -491731 -517189 -431350 -234568
14535 -234568 -32013 42540 -95335 -233879 -169706 -310331 -138600 145548 323385 521162
14525 521162 211304 54681 231093 338727 246040 -26706 -447568 -286376 -57465 74728
14515 74728 413346 322879 166629 561975 722945 795175 630701 436835 155596 -167664
14505 -167664 -208669 138517 301695 307766 5981 -184464 -87244 -42212 -101328 -169782 -422386
14494 -422386 -397675 -22718 180929 251674 230735 206585 34318 -381064 -418917 -384420 -357272
14483 -357272 -493282 -480302 -383502 -356056 -230198 -182524 19409 80744 220871 131013 155867
14472 155867 253050 96713 -136877 -153461 186210 186332 -111640 -169282 -363396 -59478 37268
14461 37268 -3532 85975 51640 181819 451916 720359 304338 189431 136674 -2880
14451 -2880 -20754 382564 603836 379751 9333 -110483 -72131 -168026 41843 178042
14441 178042 353878 382565 321659 289152 286033 26793 67572 -150422 -200996 -155714 -320665
14430 -320665 -269118 -111486 100009 220402 598967 447001 238531 61427 124110 201742
14420 201742 18920 -184064 -109443 116713 355100 422637 -115462 -528701 -277353 -2258
14410 -2258 201811 359503 574282 739979 904132 994854 991611 892938 860354 671147 731321
14399 731321 685165 770227 790625 465529 278503 107430 -50354 44151 94136 -34929
14389 -34929 184091 433891 194539 91937 35687 20918 150284 136038 -311160 -309934 -253617
14378 -253617 -27497 300018 180996 -49112 -97599 -319923 -379897 145538 418397 556624
14368 556624 514215 744724 693804 305334 30856 -130866 331869 661539 499394 271139
14358 271139 9850 -329118 -198062 90721 94780 157937 145134 198853 350914 535423
14348 535423 424169 241977 151695 -267775 -51065 -309070 -291024 -131208 -146597 90127
14338 90127 -267742 -626147 -530088 -365482 -12183 600761 584073 192386 512676 498491
14328 498491 548940 466277 222934 231580 180719 -67806 -221399 -179211 -136748 -220574 -414034
14317 -414034 -363766 -495072 -537595 -148077 -34065 38233 -58680 -5630 -36264 -6472 -284974
14306 -284974 -475265 -355413 -260737 -380617 -247873 68166 -236894 -231673 34946 -73938
14296 -73938 -324051 -215543 -81146 35120 -118349 -22606 46379 162997 117961 -237481
14286 -237481 -380669 -386252 -104224 -70932 200907 373147 482066 228079 -6126 402466
14276 402466 714420 391791 -69146 90163 176272 125081 390 146798 552432 364033
14266 364033 140973 233420 -84670 -240897 -321145 -213777 222695 399628 651846 720131
14256 720131 664112 849158 850349 860401 652422 13931 -88029 -180205 -158231 -258334 -257052
14245 -257052 -154437 -342688 -391470 -304172 -701835 -685232 -600441 -497886 -229241 46559
14235 46559 50871 126041 111602 81613 209099 403051 592466 325997 205275 234153 328918
14224 328918 319704 163812 -3190 -292167 -459507 -448120 -272516 -185040 -379127 -113210
14214 -113210 149886 103925 276084 430245 382892 418924 667597 584911 711276 819020
14204 819020 564988 333590 87626 -79391 -45494 225356 97672 -88677 -480175 -583557
14194 -583557 -168175 219827 520227 369080 157323 294418 215260 202758 -443068 -786786
14184 -786786 -159001 -143101 -265277 -54255 196519 -140921 -265106 -82192 391451 413903
14174 413903 518867 288252 15449 -65870 185734 456490 428522 259643 303160 130845
14164 130845 217172 73563 -138792 -184720 -269843 -116090 -205692 -57585 -109050 -299753
14154 -299753 -171742 -138393 -303591 -118107 138531 125619 -62611 124874 106630 95782
14144 95782 182231 264629 -9366 108998 47497 -440621 -655795 -487569 -375028 141400
14134 141400 105961 -51837 -236245 -345491 -286641 -236572 -183303 -6981 464127 757911
14124 757911 258803 32532 -164753 -319087 -176289 -177809 -404284 -591420 -152615 282634
14114 282634 189804 225651 97903 -8421 42022 -71436 -410710 -414005 -83058 172589
14104 172589 270482 170704 101336 -425521 -326503 65645 -31193 -205526 -187195 71314 195468
14093 195468 256196 91164 98373 322380 222652 -92769 -169376 -105700 87981 135929 74742
14082 74742 18084 -252653 -389306 13538 178535 27870 -291137 -330759 -31101 112732
14072 112732 129012 -99362 -132070 -228611 -476200 -392163 -273461 -201024 75955 -107181
14062 -107181 23857 38230 105972 -48107 256654 422129 165300 68324 -285576 123144
14052 123144 584937 329795 234534 497328 470633 394286 114822 99096 182689 131370 -94341
14041 -94341 -198907 -36598 -307386 -254837 118474 312842 11049 -342274 -489680 -262367
14031 -262367 139793 220811 233987 111762 -174725 -320064 -191501 -250914 -94341 71254
14021 71254 -49792 -219565 -341363 -181735 -288666 -640705 -844798 -596238 -404428 -146784
14011 -146784 46323 305151 512194 658066 356187 12492 235883 1338 -25494 -7294
14001 -7294 103513 87871 20360 102195 221896 163884 322711 388250 53987 145466 325968
13990 325968 264817 170255 97517 -86103 -189972 123183 140443 11237 -224759 -207018
13980 -207018 -484541 -463457 -1362 -29905 -450843 -696037 -799625 -833444 -775819 -660623
13970 -660623 -591026 -362852 -316209 -108948 263500 293439 189937 172929 399743 337739
13960 337739 26477 -29678 415610 678490 338150 48564 -136170 -285289 -192949 -146327
13950 -146327 54287 115751 139604 86928 74909 22971 -230420 -593896 -797148 -847565 -674986
13939 -674986 -508302 -464604 -143992 -313444 -41160 304273 398463 49134 -284064 -89862
13929 -89862 205543 254581 -84333 115408 122167 167170 665450 647631 364226 -17700 -76584
13918 -76584 97309 -47145 -189103 -237364 -232869 67145 18454 -218054 -88471 -72068 -354328
13907 -354328 -246907 -55764 -50372 -248307 -775405 -478908 172019 343168 424950 -190854
13897 -190854 -639514 -510774 -82466 272139 343471 241501 -20843 -226809 -246059 -30663
13887 -30663 -162138 -119342 58698 33863 213357 149564 -348485 -697071 -619488 -413133
13877 -413133 -221399 -380371 -632727 -594747 -214168 -177150 -268502 -393280 -291933 -205783
13867 -205783 -71390 -15321 30412 211856 459986 545468 265649 -75344 -164924 49723
13857 49723 2003 -233379 -100956 -207335 -60602 -4286 285067 603435 704357 704279 685046
13846 685046 929720 1100190 1345883 1881543 2250048 2009650 1435025 1091802 639328 621630
13836 621630 617994 565892 464969 499213 455893 366120 105562 148112 404685 429511 479684
13825 479684 525228 161120 113113 173762 173303 286493 344790 86341 -195375 -47790 -252342
13814 -252342 -355986 -101270 -226765 -341946 -388527 -297835 -434830 -84153 141409 123885
13804 123885 341030 479647 302675 -152245 -316078 -167012 122045 -20113 -159648 7491
13794 7491 232942 161074 -22756 208535 155141 31472 33753 -189523 -236450 -182822 -13906
13783 -13906 10602 -181005 -155530 -55901 -160561 -222917 -230921 -174976 -125886 -143276 -519222
13772 -519222 -588950 -442648 -461543 -547019 -486518 -306072 -508561 -500103 -408688 -480766 -493394
13761 -493394 -365906 -237779 -239311 -342968 -57804 107760 -179335 -271483 -236259 -301871
13751 -301871 -572404 -373644 90886 66210 -127967 53329 34315 -84283 222379 476888
13741 476888 397501 264540 -107286 -102356 436359 636656 798264 1057302 884137 703108
13731 703108 625485 219707 145970 335933 534649 445361 471222 591936 513781 547811 563812
13720 563812 569826 117523 -18057 -315863 95395 220326 126651 -199511 -257462 -249396 -209633
13709 -209633 -394856 -223531 -288877 -180210 -3275 -44879 217568 21165 -119394 -90445
13699 -90445 246673 -118478 -565764 -534516 29470 117910 20024 -160492 -194733 186203
13689 186203 481868 -361548 -809624 -442195 -257237 -136700 44248 -39403 76774 2444
13679 2444 82917 34790 -32980 83025 521379 396318 -187738 -295257 -7160 131553
13669 131553 345784 165089 218137 349681 307664 276226 279114 269676 104651 -22436 -457380
13658 -457380 -494663 -408644 -572650 -667666 -427920 -290538 -157077 -16516 -85247 -291275
13648 -291275 -138912 -42455 233079 373015 392133 39682 -217694 -314850 -74005 -51840
13638 -51840 -301368 -339709 -231977 -16989 -141254 -362302 -154157 -142517 -353892 -163572
13628 -163572 -68963 -244280 -355920 -442789 -499952 -621986 -671686 -515680 -461255 -438344 -242550
13617 -242550 -368107 -330138 -351069 -222013 -56442 30282 72422 111151 348235 330875 -86554
13606 -86554 -335977 -421411 -97622 124933 275530 190581 84513 16421 70582 -71034
13596 -71034 -46693 -5537 11557 152582 445823 199816 -48431 -293897 -15591 50451
13586 50451 -97009 -497991 -332158 -190952 -544964 -452520 -110873 463605 368790 144287
13576 144287 57327 76114 -36969 70780 -30098 -270066 -289737 -527759 -541044 -327643
13566 -327643 38367 111390 -12820 101455 16180 -121232 -34268 139876 579914 675511
13556 675511 173784 195623 147210 -41140 295404 240283 140199 189370 -122414 -241483
13546 -241483 -43583 -136982 201815 303330 553799 624948 215487 -109841 175381 403757
13536 403757 274960 -12217 -368259 -61943 328294 76154 -105002 -196763 -25917 224087
13526 224087 350973 647383 559669 177902 47151 263569 233417 13151 -22841 2564
13516 2564 85968 33517 -17730 41117 -536688 -893651 -814137 -539673 -406044 -460110 -205526
13505 -205526 81389 83255 10491 -102039 -518135 -308522 -145445 293421 266194 200282
13495 200282 2137 110045 250314 323146 43744 217408 451428 357611 298726 361880
13485 361880 285433 216539 234436 245486 467908 546116 543848 495936 518692 5143 -483368
13474 -483368 -715332 -467027 -202463 -194323 -487843 -395754 -382811 -565677 -305394 -475004
13464 -475004 -408516 -344249 -375507 -183545 302294 192543 307902 12017 -157133 50854
13454 50854 -85646 -479857 -658745 -448399 -338055 -658933 -572438 -414183 -324368 21545
13444 21545 227304 42808 37771 280340 426621 334499 153532 331914 358587 409494 635060
13433 635060 880350 520463 -11580 -460786 -434975 -110826 -8153 -111619 145014 132149
13423 132149 -205240 -189948 280805 552782 668139 934972 940288 799122 667924 724570
13413 724570 411111 -196109 -621142 -752266 -961577 -451222 201574 276514 -34641 -190399
13403 -190399 -78700 5931 -150834 -24176 57452 -66262 -441999 -380027 -297773 -158792
13393 -158792 -94291 -243411 -378327 -149979 133 281109 495754 297963 -98220 -526066
13383 -526066 -191017 538691 673501 270789 -51322 -1988 -59344 -216030 -237884 -189710
13373 -189710 179931 295150 330565 269086 422375 536393 120009 -419864 -98303 -90652
13363 -90652 -106852 -277940 -303344 -140744 114287 146742 249264 238293 -48792 -334979
13353 -334979 -255607 -138409 -183402 -142237 103204 244295 502667 450288 282674 239194
13343 239194 87972 -66642 61363 -308725 -87820 195408 -15162 11653 389009 367134
13333 367134 -110056 -353777 24806 200689 -73582 84362 294965 238126 152719 40885
13323 40885 -19852 -96787 -109363 -90798 -113422 -281977 -9546 -95260 86952 -71538 -263532
13312 -263532 -495857 -585959 -527446 -651540 -633125 -364775 -359363 -295810 -355068 -329249 -190459
13301 -190459 22126 -76322 -265190 -272453 -295468 -67371 -51075 14521 219560 250270 508093
13290 508093 482949 395403 329512 -229119 -453626 -568848 -761038 -228211 -24882 -82925
13280 -82925 -200381 -417472 -612108 -537475 -252095 -29171 -182578 -248315 -117957 46658
13270 46658 -98283 -71003 -113818 197706 282916 159229 161254 -171316 -212236 66794 197929
13259 197929 106851 -98879 -256281 -207782 -61450 -18207 -254990 -297798 -344897 -402508 -65354
13248 -65354 -228115 -231482 -312462 -366837 140227 517853 267048 -78549 -119032 -39537 -137258
13237 -137258 -77319 242509 136275 -65524 170091 285320 -3378 -177789 -39408 -144067
13227 -144067 -132860 30353 -241485 -368122 -297137 60136 126283 38750 -226041 9906
13217 9906 105040 235145 391489 310122 264066 -67473 -205814 40483 224518 -112926
13207 -112926 -321978 -478184 -611258 -623914 -504424 -149644 142171 -165171 -250373 -247354
13197 -247354 -174824 -161439 -303232 -347680 -207286 -216350 -349485 -365345 -479712 -203196 -232028
13186 -232028 -458173 -393109 -141645 153992 -93006 -415749 -475057 -253593 -355711 -226122
13176 -226122 -90391 33488 -332711 -540704 -393999 -87732 78794 -128456 -162969 -313240
13166 -313240 -37492 121499 21194 -81341 -295038 -364768 -383514 -93585 101382 -51063
13156 -51063 238180 540918 652422 411840 512119 450038 257839 632630 968765 645592
13146 645592 457794 371116 321832 342085 324247 201284 40194 323502 404271 330195 449057
13135 449057 12697 -21976 250968 240068 105626 -9221 84237 -54845 -318053 -534404
13125 -534404 -348285 135755 197267 275365 68238 -156661 -120496 185168 380399 256191
13115 256191 329182 268488 68576 97447 374293 637958 552353 448057 328620 -24366
13105 -24366 -376314 -376519 -169783 -95993 -182129 150999 421275 505461 565823 505959 321165
13094 321165 123484 212835 172806 74088 -210688 -57287 -37323 -347695 -419939 -174139
13084 -174139 115352 248454 195843 111984 98554 -161789 23815 -83503 -381425 -388163
13074 -388163 -315572 -536388 -805217 -1004292 -606036 -533620 -176280 152086 297833 76075
13064 76075 -21070 367974 579120 311495 -176134 -291785 -16583 -186344 -188967 -166420
13054 -166420 -316880 208444 717508 691130 480678 61130 -58704 -114991 -128643 -715993
13044 -715993 -652852 -693158 -146265 -90541 -505912 -629372 -714273 -517958 -210526 -166938
13034 -166938 78700 33117 -59908 31972 125274 187425 245682 42357 138101 152138 329919
13023 329919 253228 265405 53836 -6934 -70502 -254352 -478002 -315206 51939 369970
13013 369970 -51575 -347452 -110455 -125865 -104343 78596 163357 -36887 -87363 -223705
13003 -223705 -73842 139835 258312 158874 314579 290612 184645 -256665 -187414 116220
12993 116220 3575 -196982 243162 278293 -11408 222158 250037 130431 -230065 -332153
12983 -332153 -555915 -569860 -403655 -503577 -630321 -365800 -11136 -156679 -65341 4458
12973 4458 -169340 -548656 -807816 -771060 -282878 -207881 -188547 -128176 38439 98608 -20173
12962 -20173 109664 390676 343148 405200 -34225 -527428 -346746 17655 91177 -42569
12952 -42569 -245692 -258464 -163963 44887 -4711 74789 -98604 -198094 21877 -157898 -440905
12941 -440905 -284981 -21327 -71726 -329459 -603761 -217264 106176 -204589 -274611 -254998
12931 -254998 -41339 -104318 -345513 -150396 -22549 -103845 -109798 -204147 -348018 23472
12921 23472 278944 64894 -60839 -292402 -18433 -80298 -388169 -596393 -621313 -303583
12911 -303583 -293766 -248406 116701 238349 125095 128868 -83550 -21152 130273 -29423 -11449
12900 -11449 -228780 -235468 176465 78795 -230195 -256898 -405879 -207222 242459 249212 143822
12889 143822 -91538 -232158 -309896 -101460 -59181 -369671 -598067 -166169 69129 53489
12879 53489 -28938 -164289 -159288 119485 271634 19036 88337 -34042 -260938 -507621
12869 -507621 -533274 -603181 -474530 -358851 -507992 -642669 -200393 -226404 17454 336608
12859 336608 356223 262069 439613 399307 214633 497842 560777 439410 109264 -137332
12849 -137332 63102 358921 433552 278258 100769 72180 38114 -397778 -572592 -413901
12839 -413901 -3420 195320 344914 323781 202243 309154 509172 467095 54905 -52906
12829 -52906 -40721 -162924 -120179 -168072 -346690 -389681 -158482 -30391 217170 90539
12819 90539 -288234 -320099 -592592 -783972 -617134 -225454 60825 -56718 -87032 -126499
12809 -126499 -11839 -166561 -76565 -90519 -243748 -204781 -116352 -79633 -316592 -707235
12799 -707235 -751097 -688013 -476339 -378684 -22784 112886 -29897 -360387 -437030 -407013
12789 -407013 -446744 -661723 -410259 -171443 -158938 -159982 -248459 -124267 43949 13935 85028
12778 85028 252859 228647 61943 69912 441770 576336 87258 -187120 -427331 -59648
12768 -59648 -199990 -284107 29043 99847 33724 -479600 -479707 107820 127059 181066 -151002
12757 -151002 -245899 -57380 68656 191954 -7575 240099 332525 16049 43573 285573
12747 285573 351464 397066 442478 357853 77922 -394139 -376802 -292285 -170914 -429051 -415264
12736 -415264 -356549 -331161 -409887 -307987 -531166 -536186 -515906 -311994 -16710 -184174 -138209
12725 -138209 20731 312617 97040 -434932 -621209 -568515 -204932 -221834 -107987 75882
12715 75882 163293 -21071 -213281 -86559 81791 381593 825219 440017 357217 381931
12705 381931 389179 223861 67094 45860 57928 394994 563762 649625 509627 245179
12695 245179 10306 -177495 -247066 78353 87283 -45378 -62144 29397 122718 33961 154314
12684 154314 103143 -50159 -405733 -353091 -275237 -146351 -49824 -122697 -288325 -315010 -69675
12673 -69675 185273 123208 -122713 -269445 -445219 -457581 -465209 -434670 -264054 -40821 -145899
12662 -145899 -112837 -189028 -433181 -621614 -741245 -652583 -219069 -388884 -148822 -56395
12652 -56395 73764 236599 601947 551246 103237 -78183 66297 37620 -152518 25054
12642 25054 102786 -379520 -412470 -139699 13517 134779 99223 139411 -32163 -55387 45853
12631 45853 -78636 -121776 106053 179999 286498 150114 241801 320796 582820 477848
12621 477848 587753 507618 200464 23744 79390 125375 65342 -75962 84559 153232
12611 153232 108012 239046 313596 78799 115299 -38310 -282668 -207790 -37514 30521
12601 30521 -183037 -279711 -280667 174899 18545 -141490 95885 165819 177410 -59551 -306212
12590 -306212 -444599 -419746 -277352 -282650 -290653 -90022 204758 277179 306071 125397 -54579
12579 -54579 -18390 -48382 22774 61770 110679 103248 279738 67661 30563 26560 124816 99396
12567 99396 -60156 -130898 -304631 -232872 -169290 19451 64833 -34687 -159204 6054 -97047
12556 -97047 -39577 -161986 -21648 131890 -145839 -251898 54347 45708 290452 393603
12546 393603 303495 225530 104136 291156 -16397 -202699 -8010 -151436 -214682 70109
12536 70109 110605 287467 155479 -26139 -165439 -29382 125911 127580 199403 33733
12526 33733 34877 165966 195168 -250874 -347650 -176582 132778 344854 80480 -60768
12516 -60768 -46684 285112 456686 469726 313539 94276 -143896 -375095 -632451 -897365
12506 -897365 -642278 -58957 86044 16572 105990 339140 266718 243134 -43910 -417799
12496 -417799 -336155 -337372 -500417 -492685 -336386 -322755 -238519 -125637 -20513 237205 326497
12485 326497 582352 348226 320010 435564 452164 608733 515260 374021 259459 -93785
12475 -93785 -83021 -274794 77618 290003 398549 612968 755405 283559 193451 32218
12465 32218 -246421 -343562 -320720 -143508 347045 573893 587762 376773 113087 153577
12455 153577 526222 755994 262733 -87375 161238 -161042 -57404 10072 312965 155725
12445 155725 -20759 -303806 -252894 43735 -108991 -269586 -141084 59098 48383 -265421
12435 -265421 -414214 -201464 -101175 -99292 -278707 -228036 18461 82946 436963 293532
12425 293532 159182 154705 -137874 -301958 -669596 -387368 -5942 -209095 -226632 -284556
12415 -284556 -569113 -335918 18036 92273 196063 289525 422122 404330 145961 -122391
12405 -122391 -559886 -216691 365797 202838 -75181 -209043 -317750 -437941 -532939 -372348
12395 -372348 -16230 204156 325701 -134622 -49504 257137 335840 207072 -3613 -272036
12385 -272036 -456916 -377476 -35342 -224137 -363357 161441 554695 484839 290195 202909
12375 202909 196104 116428 -55491 149166 357639 -165253 -161053 56147 122167 77946 169739
12364 169739 -127539 -268983 -427785 -326183 -103717 -91056 67458 297608 569087 200063
12354 200063 -994 -228689 -312609 -239975 131992 178574 72719 96944 561058 820261
12344 820261 711867 623977 321755 139789 327897 365324 284029 -15031 -365807 -78813
12334 -78813 155420 144556 209799 519669 46230 -282416 212178 324440 -23073 64008
12324 64008 -107882 9128 259299 123128 110990 311471 157284 147510 493145 259226
12314 259226 -404810 -380257 114126 -28064 151305 554457 479046 75048 158218 246285
12304 246285 64902 113768 57563 246764 631644 796711 566741 94550 143222 329150
12294 329150 271024 462061 550567 156391 -55161 -105764 -219536 -308276 -227439 -273996 -161071
12283 -161071 -95791 -93432 147371 333679 217562 336147 227224 173577 193369 415657
12273 415657 312907 268371 299253 238336 -17567 -149759 -68949 -370035 -536653 -337432
12263 -337432 -110674 -119450 87559 459 -184382 -377996 -689220 -786364 -415134 39958
12253 39958 1619 -114868 167510 349130 150508 -127356 -57861 -121861 -330916 61963
12243 61963 339220 84195 -279536 -215851 197154 434816 422771 299990 184492 255483
12233 255483 538652 828376 580772 330781 248470 168350 171140 272973 139452 -113218
12223 -113218 -118793 -179582 73682 300493 364786 156588 -67822 -291097 -281266 -165734 -413879
12212 -413879 -53972 379579 305439 199012 186881 265674 254197 38758 54938 263089
12202 263089 200636 407780 748685 657748 467270 162617 -29471 377279 375593 115654
12192 115654 170101 123555 -62565 -151315 -179467 -201687 -189769 -239371 108358 58804 -115727
12181 -115727 114556 56103 -296835 -328921 -101385 342469 571407 285107 176808 -228661
12171 -228661 -548167 -364770 -118088 376097 515864 852847 634677 280570 223188 514833
12161 514833 725470 472711 156489 -287969 -106678 411830 242998 24258 -88462 -200355
12151 -200355 -194930 93537 347906 509523 285736 66132 -178923 -477542 -461852 -272158
12141 -272158 -151580 -152224 -79216 49246 110568 -210907 -339502 -506857 -365985 -197393
12131 -197393 -173136 -150004 307175 726348 864659 946209 969850 445982 393714 673201
12121 673201 586398 525866 456231 209040 369803 244386 81160 96354 -93748 -193940
12111 -193940 -280897 -287774 -273818 -294934 -445064 -252465 -259880 -267032 -598636 -443714 -388447
12100 -388447 -630082 -778522 -564259 -165615 -426335 -460112 -324482 -260127 68304 157840
12090 157840 289346 -81235 -405389 -26166 279100 -50133 -437330 -622940 -593051 -250604
12080 -250604 -214303 -257656 -68026 -138732 81388 106773 -173266 -412981 -547376 -786815
12070 -786815 -806068 -723319 -633123 -624813 -479307 -542274 -395776 -297031 -41030 -43993 121379
12059 121379 416592 558346 435981 380435 368688 243825 -33864 -87215 42974 -14136
12049 -14136 -221474 -167031 111828 -76825 -390920 -29111 280807 394527 501695 263049
12039 263049 -110301 -25540 16563 -212106 -621668 -892464 -685994 -106375 -77648 -123159
12029 -123159 -247255 -163545 -46233 -185650 -271702 -418697 -736600 -1051570 -931942 -611758
12019 -611758 -506519 -501746 -329588 -532065 -528572 -481460 -254915 -367801 -508393 -551952 -502330
12008 -502330 -530495 -291957 -51457 78251 139773 300860 343811 125642 -185299 -438899
11998 -438899 -72448 119207 98996 -309897 -393720 -483155 -386478 -285625 -235863 -282324 -311493
11987 -311493 -468380 -271298 -123585 -231537 -420626 -445608 -453468 -420953 -280308 -233694
11977 -233694 -367511 -565738 -654470 -245576 -61466 -58736 -91528 -328963 -282262 5032
11967 5032 145031 252598 371113 34902 -180771 -59742 273115 500574 639380 406086
11957 406086 201367 104677 273143 491833 529955 560772 468155 9916 -29945 -215618
11947 -215618 -647256 -700845 -353564 -192123 73653 289512 149735 260625 281846 419881
11937 419881 230980 69937 -207409 -297115 -261986 349807 579414 496998 544169 635862
11927 635862 940513 641043 99257 -237553 -194476 55574 -159696 274 336129 449643
11917 449643 176053 28015 -264438 -114653 16060 -276399 -399227 -407589 -42393 -341332
11907 -341332 -325193 -74961 -457528 -162245 269069 83772 217118 617896 473689 90852
11897 90852 219581 324421 155923 308420 177112 40799 -137545 -162363 -17663 -74583
11887 -74583 -219151 -189322 -14904 -92336 -287347 -242799 458326 539158 171557 -262215
11877 -262215 -496776 -637651 -420654 -378764 -443531 -239367 -29736 -119213 108274 -25849
11867 -25849 -450310 -173181 75648 145715 144990 207004 293089 457067 421633 287370 499880
11856 499880 559014 214777 -99581 -220636 -577558 -760057 -307954 -160423 174559 118158
11846 118158 -232698 -371966 45765 188492 226535 110465 47 -122452 -256414 -441165
11836 -441165 -290485 -169819 117584 9052 -165797 -126593 -188037 -256994 -445341 -431208
11826 -431208 -113582 -247800 -270717 -530533 -899620 -843929 -547470 -733911 -577541 -245932
11816 -245932 -241205 -13915 318946 237491 446036 766324 556080 599004 609659 324142
11806 324142 230724 202876 162908 -179731 -199243 -14498 -177278 -39116 -15973 -129895
11796 -129895 -65735 349756 403954 -202358 -452740 -458961 -471221 -182600 -115020 -304437 -303947
11785 -303947 -487572 -488008 -498757 -312508 -75391 -31564 -350932 -522137 166257 530226
11775 530226 874521 810976 373038 -98207 105589 308218 668191 1106830 1134826 1010879
11765 1010879 748540 484491 375492 557554 356760 -44362 -56732 -220250 -294073 -231100
11755 -231100 -32630 120608 1109 -155933 -428126 -432079 -436161 -53762 228210 92853
11745 92853 96746 -47163 21267 -114481 -93890 -92246 64193 6803 193079 521572 362339
11734 362339 198654 258516 250334 278002 307875 118460 -89474 -361881 -466254 -200431
11724 -200431 -200154 -103404 165768 87500 -10770 290579 648444 623059 433687 151641 366229
11713 366229 75803 213777 399486 421418 217815 -114807 -481481 -321344 -372431 -424878
11703 -424878 -269718 -83944 -261022 -82848 73863 132594 -78944 -582368 -343918 -359266
11693 -359266 -449108 -347875 -131696 8068 97401 260135 532019 226529 -174792 -199048
11683 -199048 -200691 -240773 -232743 -157402 -69122 61997 104071 60924 224541 209184 208987 131099
11671 131099 43044 -34051 -251237 93130 442576 258473 181695 121060 -138399 -303387
11661 -303387 -240691 -279052 -76286 86838 -85177 30369 304765 410392 182797 -182958
11651 -182958 13952 125492 126590 192918 -82564 -336979 -391144 153658 218624 34880
11641 34880 22024 132527 -447 21958 15445 -186755 -638365 -501014 -206490 -184205 -59721
11630 -59721 346850 192510 46571 50909 112436 224266 176770 -357921 -552964 -324528
11620 -324528 -438297 -361306 -354124 -291714 82687 195114 -78759 -366010 -320444 -208634
11610 -208634 108525 205957 -245923 -463431 -84099 80129 23262 -87067 -89496 -282814
11600 -282814 -214076 -278801 7450 240769 -15138 -263559 -279387 -122675 195242 517041
11590 517041 433679 616305 362241 -29739 -225844 -229261 -141820 -215237 239023 261975 -107877
11579 -107877 -273868 -150090 167729 319672 340583 79136 344584 420155 225275 -53556
11569 -53556 369598 494403 294632 90413 1862 253795 253675 96374 -332935 -180633
11559 -180633 -145192 -115663 -8785 76096 54526 80464 59920 -91651 -204865 -191286 -282746
11548 -282746 -410551 -293300 -340684 -303861 -143088 205086 577837 636688 528387 340485
11538 340485 485719 240414 -190033 -522947 -312950 -94550 138787 353565 485141 198772
11528 198772 148798 106718 144996 187905 124986 270474 578526 530026 414080 427957 148132
11517 148132 -11406 205285 588289 712896 341102 -309755 -503468 -77237 269644 459142
11507 459142 540286 738100 433463 47905 -693400 -546155 -274762 27123 436338 411799
11497 411799 -218033 -512315 -300692 166568 278661 249558 -149797 -317909 117166 325339
11487 325339 82987 -85261 101279 447304 543836 432035 410603 454563 321566 -164129
11477 -164129 -371288 -151265 -65912 -323719 -42885 122210 227392 482674 462929 299460
11467 299460 236836 94701 91420 -116975 -128538 190921 268816 -113179 -266898 -472878
11457 -472878 -399071 -22150 176210 231037 277384 349829 547609 473027 75525 138873 -147962
11446 -147962 -409075 -203500 12664 228640 224426 249336 479066 527271 34968 -313856
11436 -313856 -80660 18487 -9914 4350 175042 339372 286300 167315 346820 810729
11426 810729 656733 606806 654055 490743 434518 439792 39407 -293793 -182357 -422372
11416 -422372 -488561 -132982 189215 203231 -28769 -193367 -488241 -647584 -735456 -868452
11406 -868452 -757338 -528900 -340762 13616 405017 422757 138214 -3131 -556441 -633775
11396 -633775 -484733 -503908 -719480 -1061178 -1119533 -1023531 -754930 -370836 -162776 -408376
11386 -408376 -273681 -267030 -327421 -344752 -469287 -509029 -708401 -924871 -1081215 -958580
11376 -958580 -536220 -306361 -464056 -147357 294735 583322 624788 404049 12665 -319149
11366 -319149 -468132 -167044 -61438 -109944 -305990 -33065 63258 417 302159 354174
11356 354174 190198 73139 -279966 -292763 58727 -295205 -592181 -349554 -223128 -297684
11346 -297684 -95978 59190 130789 212987 250295 -7239 103419 348953 316876 137689
11336 137689 33401 56282 345971 519936 382663 105399 -28325 -174414 -113595 -71646
11326 -71646 -261619 -197392 -34900 43560 362913 497235 -42490 -257507 107747 188948
11316 188948 85371 278666 -107784 -33959 37937 -46049 -32577 -181897 -192030 -383452
11306 -383452 -311728 68133 76497 -332914 -288029 245997 131647 147274 -391943 -518676
11296 -518676 -206833 -503058 -495610 -258910 -22615 334375 359878 336206 54861 -442673
11286 -442673 -417235 -506744 -326425 43929 76220 220454 279184 243100 306780 235592 162743
11275 162743 348910 525686 597348 360425 178883 359060 335416 52646 116749 262565
11265 262565 132411 -274553 -605376 -343837 -340263 -382873 -491127 -460003 -135824 293580
11255 293580 353963 233487 130166 67316 329321 207907 190780 157227 33183 -28032
11245 -28032 -41410 -168271 -174871 79340 150329 131734 344537 276459 148418 -66728 214099
11234 214099 300588 248907 461714 698874 454217 73107 273866 572077 456991 363126
11224 363126 224158 183859 -207196 -70754 -9231 -140075 86326 245736 272158 362212
11214 362212 64568 -427147 -501967 -259765 -287679 -156539 -50363 -68874 -399305 -444695
11204 -444695 -202295 -347453 -263018 -125788 -172904 291298 367989 260547 -37678 -166810
11194 -166810 -127214 -118272 -630820 -538948 -76341 -203342 -316817 307769 746540 514898
11184 514898 155856 -16928 32197 217986 116909 150261 509970 558510 335492 79554
11174 79554 -79366 125213 59557 -352016 -57414 -229445 -55738 21986 67475 176418
11164 176418 132588 381380 81471 -326036 -149910 -112398 -154442 1149 -25943 31948
11154 31948 333495 174660 275298 440742 244878 323259 334546 392648 676783 608817
11144 608817 516518 238194 191016 304573 -41237 -88438 220467 218145 257185 274137 249163
11133 249163 317282 474346 374704 206955 246563 180938 -166436 34303 219739 349075
11123 349075 262737 -159293 -62834 326803 362768 556829 767637 549515 212402 115785
11113 115785 -59098 -179193 45634 -31741 -131221 -269880 -590792 -661710 -636819 -206864
11103 -206864 -123658 -243535 -171573 -385053 -336375 -351670 -233637 -304808 -232427 -94093 -105405
11092 -105405 -51733 -401062 -209210 -134043 -198133 -233900 -791 94068 -138245 49984
11082 49984 237720 -175865 24925 363382 376240 144390 -113057 -280554 -253930 -186825
11072 -186825 -300154 -166102 -166275 109254 85874 26814 114223 -27491 6292 100866 -1627
11061 -1627 -38750 14047 52105 231226 374706 428905 242335 -15337 -250113 -247702 -50601
11050 -50601 -245564 -250228 -17693 155287 -159341 132231 245021 28750 -530945 -369572
11040 -369572 45302 -6373 -401538 235845 505371 -75980 -268520 -303006 -222568 -425141
11030 -425141 -341868 -112393 -126644 -350613 -275058 -326543 -269053 -140406 -122652 -289053 -36415
11019 -36415 510751 371924 97139 -149348 -47415 2392 -163488 -403650 -54772 -180429
11009 -180429 -361283 -354867 -407737 -209793 -202414 -151942 -37467 -103261 -345728 -553121 -438365
10998 -438365 -351241 -288797 -365782 -455646 -289660 -344511 -201913 -105076 -19816 -8401 187055
10987 187055 330126 595880 482946 132622 42332 317626 408738 55950 -129881 36022
10977 36022 -16940 -245676 26902 198823 71559 -298998 -547467 -921121 -837555 -507565
10967 -507565 -198852 112402 164497 -86069 -146975 44503 -228090 -189110 396948 385599
10957 385599 291445 78739 -342245 -347963 -247869 205101 421200 331565 535279 369059
10947 369059 174630 -319982 -452406 -43970 -214777 -98582 6474 -20595 46357 -25610
10937 -25610 -5684 596560 840981 463050 64910 -31002 -104282 -158944 -167894 -71162 -261976
10926 -261976 -219189 -209094 -147155 -380541 -416495 -629468 -576919 -305952 -19136 263534
10916 263534 63778 196362 205862 83001 -441349 -657101 -807028 -751897 -603752 -651589
10906 -651589 -705184 -646068 -655188 -717614 -768626 -653804 -654243 -622251 -510238 -461551 -349984
10895 -349984 -117224 -221963 -383764 -369104 -259278 -294741 -141074 -117241 -50151 411768
10885 411768 453250 250085 183782 407809 317211 -13147 -312098 -107837 -151505 33547
10875 33547 176962 196640 200770 15043 -400015 -318536 -586052 -493555 153876 333801 297181
10864 297181 364840 254359 354440 179994 251687 43584 53340 89083 -270149 -383710
10854 -383710 -335804 -326584 -8063 -335829 -228957 -101684 -78330 301843 579722 622499
10844 622499 -41441 -696993 -649715 -541519 -393726 -350133 -133015 -473946 -685086 -348929
10834 -348929 -10432 200509 -37014 -271788 -338943 -609235 -746349 -525681 -302817 -253005
10824 -253005 -235630 -88990 -244276 -444878 -470948 -225526 76939 184816 320493 226342
10814 226342 97612 -38197 212925 41397 -41912 -200210 -141703 -99132 242634 378496
10804 378496 101263 -314598 -184985 143893 363357 619626 1069844 942359 393776 54846
10794 54846 -38936 33663 140196 187797 -123487 197039 -5152 -226797 -337857 -116695
10784 -116695 -53084 -286705 -260362 -86374 80353 65500 -203086 -593086 -273481 -127474
10774 -127474 145152 -58441 -278783 -164925 -116584 -201338 -90331 -23384 -292835 -385273
10764 -385273 -225838 -35664 312551 248095 -62991 217399 107500 -42975 365250 456377
10754 456377 106972 -403746 20614 336059 350989 370149 452651 419732 406353 422136 238103
10743 238103 179866 109083 -21693 114040 234005 34391 -164252 -269256 -388099 -266889
10733 -266889 -160294 -195828 -381238 -306062 -201962 -302809 -281556 -367948 -630855 -766684
10723 -766684 -918981 -809590 -286484 -30822 406 88964 9083 142740 398573 181972
10713 181972 88400 179965 291384 161113 223382 196968 -173293 -462513 -217650 92961
10703 92961 286595 20393 -170881 -274130 -39640 210865 17199 -116612 -87448 -101203
10693 -101203 -50027 135650 178922 127017 173997 294375 -67571 -379449 -326380 78582
10683 78582 236399 445236 530650 482326 249632 79795 216039 272786 281047 4601 -195214
10672 -195214 -127513 33383 121777 -115558 -270852 -274723 -300789 -345754 -294423 -124284 160901
10661 160901 28298 -312783 -179920 -89025 22906 253797 395268 -29217 -194359 -96486
10651 -96486 -289098 -307585 -9728 75283 -52386 -158559 137319 608384 960755 885246
10641 885246 511447 209998 -209760 -283395 43684 -3670 -216244 -121785 -53350 -351716
10631 -351716 -2567 406203 249320 148548 162404 23889 -29018 -25201 -230774 -467606
10621 -467606 -522717 -340169 -24296 -310129 -241241 -152610 33952 260700 218085 225153 265744
10610 265744 327545 34168 -329303 -310240 -513324 -701384 -516912 -320407 52419 146542
10600 146542 -46767 -44882 136479 500879 903330 774681 224191 13796 -66016 -246639
10590 -246639 -448076 -285435 -188005 -153257 -330692 -305872 -271776 -165860 190047 218152
10580 218152 98013 44926 -124517 -228081 -3442 148746 251315 242000 -127076 111700
10570 111700 145931 158376 418444 647271 709418 580174 792157 940256 562643 538810
10560 538810 634969 1053211 1133125 1342311 1155135 773153 737612 699264 1115284 1313349
10550 1313349 901324 629424 444259 18098 -158035 -7718 408593 407930 124512 -22225
10540 -22225 -74144 -331038 -69690 -2621 318824 469109 273937 310230 377892 361856 272697
10529 272697 193460 11945 191179 232938 334782 383695 322930 187218 -216107 -306821
10519 -306821 -152259 -51622 -166415 37171 107646 280111 519766 356844 655805 773335
10509 773335 398649 198148 -42026 -1777 -133798 55479 126536 -166041 -40196 -164525
10499 -164525 -111591 -172820 5230 208011 221462 -62225 262082 378219 479139 232706
10489 232706 314595 311319 292720 367682 223176 -151825 73444 249996 132989 262852
10479 262852 92697 105101 12076 142473 287617 356030 148817 -130013 -217236 283151
10469 283151 538213 636461 751392 627508 353406 245226 421875 385039 16997 12823
10459 12823 -391915 -199199 49877 171916 260929 -36499 -44437 -247642 -338612 -750031
10449 -750031 -913036 -898801 -708805 -521825 -345008 -325385 21286 109715 6048 212430
10439 212430 140029 -16984 130917 52038 -111495 356000 619069 482943 217642 95704
10429 95704 155253 198963 193914 545958 584724 600901 520090 687351 866868 611187 316799
10418 316799 -8735 -70313 501073 727575 470447 337939 386823 387319 432923 750951 999254
10407 999254 1165961 1590845 1908456 2183281 2306703 2543409 2879864 3599364 4261707 5142075
10397 5142075 6206644 7421251 8047857 8639815 8530341 8529795 8709411 9155196 9429294 9368158
10387 9368158 9204394 9098182 8910448 8597301 7997024 7278318 6605280 5788879 5188033
10378 5188033 4848932 4312616 3535657 3165396 3119686 2934130 2658875 2570475 2376877 1942473
10368 1942473 1559804 1429833 1468397 1203265 848802 955505 1007874 1041955 972348 1016107
10358 1016107 1202242 1366280 988566 661179 715184 538428 385657 784994 289854 207128
10348 207128 489054 752278 790061 491312 213262 256056 592368 695335 525811 307477
10338 307477 521642 501381 551956 684154 446320 -32232 -270829 -279173 163959 535450
10328 535450 460414 144399 42881 -54758 19627 216783 409786 424250 268923 431665
10318 431665 160755 -62361 -18525 96133 150941 118365 431463 611796 343143 98384
10308 98384 -42631 317566 307539 198115 416629 253458 195208 -45067 -120980 -237886
10298 -237886 -38777 214962 44512 -117097 -40252 -58400 -329330 -285092 -303019 -335369
10288 -335369 53586 56308 13538 -57729 45402 42231 203937 195933 59827 56856 424705
10277 424705 967399 939848 541052 357797 54323 582700 744685 358661 404252 500572
10267 500572 632268 310045 115776 98933 154815 189132 -94982 -326135 47508 140596
10257 140596 -52174 -78806 679086 821839 182849 -139607 13137 -67666 -97358 114957
10247 114957 -64551 -351000 -384040 -160128 -112446 26990 52200 96915 323684 420197
10237 420197 301383 245170 244758 131080 223426 175382 234922 -25051 20903 306747 464819
10226 464819 394186 199081 58840 310817 344747 417358 236280 -102296 -190273 -103476
10216 -103476 -131272 -370928 -453965 -95660 -153455 -245131 -326000 -240566 -218998 113941 612935
10205 612935 712978 757498 667093 222970 10978 -146062 -78679 -208648 -70784 -98341
10195 -98341 -84542 223503 301143 239824 408350 506864 257715 -115260 55340 314838
10185 314838 288890 312003 702791 484892 -121474 -320207 -34381 -81497 -198176 -359839
10175 -359839 -429061 -349704 -429421 -634122 -587971 -176166 217498 340590 259743 152519
10165 152519 -1210 83948 334103 223828 239679 326638 -72880 92445 219649 205942
10155 205942 134143 -254117 -120715 -1386 -1400 300334 417367 559345 610622 377064 221739
10144 221739 367062 344257 87619 -149693 -14750 148259 482375 594015 654036 503397
10134 503397 289844 70045 234414 166790 118092 362392 715989 660386 257971 258729 371323
10123 371323 170296 -198551 -224678 -87869 166452 225075 84087 308425 14814 -195845
10113 -195845 -94418 25921 383184 483613 166458 341059 412366 147473 212404 294400
10103 294400 84763 -258591 -423336 -57404 126477 -71846 -229647 -141024 -143719 -121319
10093 -121319 -12168 72302 20571 90205 -295867 -356349 -260897 -219779 6988 98601 262133
10082 262133 237427 285294 602590 503919 242615 147647 173089 -173334 -194520 17815 -122376
10071 -122376 -551222 -824061 -829585 -675434 -621379 -462015 -504784 -450116 -472299 -747824 -855829
10060 -855829 -902237 -674556 -308157 -23084 -246483 -197349 11071 227064 638356 601662
10050 601662 454797 401291 185850 203558 516643 278751 55641 178055 300147 195893
10040 195893 121834 229752 -162515 -253951 -57156 256950 151184 -53333 203976 401024
10030 401024 578931 344528 243247 154295 474762 679458 254205 138630 137104 261654
10020 261654 135049 -174790 46680 86019 175662 427323 64008 -22164 31990 -165821
10010 -165821 -262934 -508391 -666136 -524168 -31951 -79556 -214530 -226118 -347707 -558331
10000 -558331 -578415 -485733 -119234 148166 250690 -228420 -560142 -425437 -428763 -275091
9990 -275091 104904 539142 586026 265114 188868 562526 312754 -3547 -163173 141610
9980 141610 183699 164628 99139 -83481 -376480 -174539 83742 293105 110008 119914 -162056
9969 -162056 -533543 -447185 -96268 -168210 -80749 -98895 46206 -261425 50179 437368
9959 437368 441056 138810 -83547 40244 265839 342942 316294 235333 296734 155212 263364
$$ [...]
##END NTUPLES=NMR SPECTRUM
##END=
