##TITLE=Analysis number 322318
Compound Code cc 54916
Book Reference 461/64
Project Code adrs
Chemist Name toml
##JCAMPDX= 6.0         $$ Bruker NMR JCAMP-DX V2.0
##DATA TYPE= NMR SPECTRUM
##DATA CLASS= NTUPLES
##ORIGIN= Bruker BioSpin GmbH
##OWNER= nmr
$$ XWIN-NMR		Version 3.5
$$ Thu Sep 21 08:19:56 2006 GMT Daylight Time (UT+1h)  MAYBRIDGE\nmr@NMR_250MHZ
##.OBSERVE FREQUENCY= 250.131544655141
##.OBSERVE NUCLEUS= ^1H
##.ACQUISITION MODE= SIMULTANEOUS (DQD)
##.ACQUISITION SCHEME= undefined
##.AVERAGES= 16
##.DIGITISER RES= 18
##SPECTROMETER/DATA SYSTEM= dpx250
##.PULSE SEQUENCE= zg30
##.SOLVENT NAME= CDCl3
##.SHIFT REFERENCE= (INTERNAL, CDCl3, 0, 16.4506)
##AUDIT TRAIL= $$ (NUMBER, WHEN, WHO, WHERE, WHAT)
$$ ##TITLE= Audit trail, XWIN-NMR		Version 3.5
$$ ##JCAMPDX= 5.01
$$ ##ORIGIN= Bruker BioSpin GmbH
$$ ##OWNER= nmr
$$ C:\u/data/dgb/nmr/ADRS/1090/pdata/1/auditp.txt
$$ ##AUDIT TRAIL=  $$ (NUMBER, WHEN, WHO, WHERE, WHAT)
(   1,<2006-09-21 08:19:26.34 +100>,<MAYBRIDGE\nmr>,<NMR_250MHZ>,
      <created by zg, POWCHK disabled, PULCHK disabled
       configuration hash MD5:
       E2 DF 36 D8 04 B2 41 60 5A D7 A3 38 5A 4B D0 FE
       data hash MD5: 64K
       9D A9 4E 45 1D EB 1D 52 60 64 F9 F1 E7 74 FE AA>)
(   2,<2006-09-21 08:19:45.75 +100>,<MAYBRIDGE\nmr>,<NMR_250MHZ>,
      <Start of raw data processing
       ef LB = 0.3 FT_mod = 6 PKNL = 1 SI = 32K 
       data hash MD5: 32K
       17 BD 5C C3 45 15 22 2F 15 F6 27 FD 2C 08 76 E9>)
(   3,<2006-09-21 08:19:47.73 +100>,<MAYBRIDGE\nmr>,<NMR_250MHZ>,
      <apk 
       data hash MD5: 32K
       20 F4 08 47 91 7C 57 7D D2 B1 0A 91 CB 03 E5 F1>)
(   4,<2006-09-21 08:19:48.62 +100>,<MAYBRIDGE\nmr>,<NMR_250MHZ>,
      <abs ABSG = 5 
       data hash MD5: 32K
       28 86 98 63 D4 CE 68 F3 D9 63 78 C1 AD D2 3C 52>)
$$ ##END=
$$ 
$$ hash MD5
$$ D9 E8 CB FB 89 E5 B8 3A 6F 77 D9 FB 03 89 D2 DD
##$RELAX= 
##$RELAX= 
##$RELAX= 
##$RELAX= 
##$RELAX= 
##$RELAX= 
##$RELAX= 
$$ Bruker specific parameters
$$ --------------------------
##$DU= <C:\u>
##$EXPNO= 1090
##$NAME= <ADRS>
##$PROCNO= 1
##$TYPE= <nmr>
##$USER= <dgb>
##$AMP= (0..31)
100 100 100 100 100 100 100 100 100 100 100 100 100 100 100 100 100 100 
100 100 100 100 100 100 100 100 100 100 100 100 100 100 
##$AQSEQ= 0
##$AQ_mod= 3
##$AUNM= <au_zg>
##$AUTOPOS= <32 >
##$BF1= 250.13
##$BF2= 250.13
##$BF3= 250.13
##$BF4= 250.13
##$BF5= 500.13
##$BF6= 500.13
##$BF7= 500.13
##$BF8= 500.13
##$BYTORDA= 1
##$CFDGTYP= 0
##$CFRGTYP= 5
##$CHEMSTR= <none>
##$CNST= (0..31)
1 1 145 1 1 1 1 1 1 1 1 1 1 1 1 1 1 1 1 1 1 1 1 1 1 1 1 1 1 1 1 1 
##$CPDPRG= <>
##$CPDPRG1= <>
##$CPDPRG2= <>
##$CPDPRG3= <>
##$CPDPRG4= <mlev>
##$CPDPRG5= <mlev>
##$CPDPRG6= <mlev>
##$CPDPRG7= <mlev>
##$CPDPRG8= <mlev>
##$CPDPRGB= <>
##$CPDPRGT= <>
##$D= (0..31)
0 1 0 0 0 0 0 0 0 0.06 0 0 0 0 0 0 0.0002 0 0 0 0 0 0 0 0 0 0 0 0 0 0 
0 
##$DATE= 1158823164
##$DBL= (0..7)
120 120 120 120 120 120 120 120 
##$DBP= (0..7)
150 150 150 150 150 150 150 150 
##$DBP07= 0
##$DBPNAM0= <>
##$DBPNAM1= <>
$$ [...]
##$SUBNAM7= <"">
##$SUBNAM8= <"">
##$SUBNAM9= <"">
##$SW= 20.6930455092707
##$SWIBOX= (0..15)
0 0 3 0 0 0 0 0 0 0 0 0 0 0 0 0 
##$SW_h= 5175.983436853
##$TD= 65536
##$TD0= 1
##$TE= 295.16
##$TE2= 300
##$TE3= 300
##$TEG= 300
##$TL= (0..7)
0 120 120 120 120 120 120 120 
##$TP= (0..7)
150 150 150 150 150 150 150 150 
##$TP07= 0
##$TPNAME0= <>
##$TPNAME1= <>
##$TPNAME2= <>
##$TPNAME3= <>
##$TPNAME4= <>
##$TPNAME5= <>
##$TPNAME6= <>
##$TPNAME7= <>
##$TPOAL= (0..7)
0.5 0.5 0.5 0.5 0.5 0.5 0.5 0.5 
##$TPOFFS= (0..7)
0 0 0 0 0 0 0 0 
##$TUNHIN= 0
##$TUNHOUT= 0
##$TUNXOUT= 0
##$USERA1= <user>
##$USERA2= <user>
##$USERA3= <user>
##$USERA4= <user>
##$USERA5= <user>
##$V9= 5
##$VALIST= <valist>
##$VCLIST= <CCCCCCCCCCCCCCC>
##$VD= 0
##$VDLIST= <DDDDDDDDDDDDDDD>
##$VPLIST= <PPPPPPPPPPPPPPP>
##$VTLIST= <TTTTTTTTTTTTTTT>
##$WBST= 1024
##$WBSW= 4
##$XGAIN= (0..3)
0 0 0 0 
##$XL= 0
##$YL= 0
##$YMAX_a= 221565
##$YMIN_a= -404568
##$ZGOPTNS= <>
##$ZL1= 120
##$ZL2= 120
##$ZL3= 120
##$ZL4= 120
##$ABSF1= 16.45063
##$ABSF2= -4.242542
##$ABSG= 5
##$ABSL= 3
##$ALPHA= 0
##$AQORDER= 0
##$ASSFAC= 0
##$ASSFACI= 0
##$ASSFACX= 0
##$ASSWID= 0
##$AUNMP= <proc_1d>
##$AZFE= 0.1
##$AZFW= 0.1
##$BCFW= 0
##$BC_mod= 0
##$BYTORDP= 0
##$COROFFS= 0
##$CY= 12.5
##$DATMOD= 1
##$DC= 0
##$DFILT= <>
##$DTYPP= 0
##$F1P= 14.0000005364418
##$F2P= -0.99999901652339
##$FCOR= 0.5
##$FTSIZE= 32768
##$FT_mod= 6
##$GAMMA= 0
##$GB= 0
##$INTBC= 1
##$INTSCL= 1
##$ISEN= 128
##$LB= 0.3
##$LEV0= 0
##$LPBIN= 0
##$MAXI= 10000
##$MC2= 0
##$MEAN= 0
##$ME_mod= 0
##$MI= 0
##$NCOEF= 0
##$NC_proc= -5
##$NLEV= 6
##$NOISF1= 0
##$NOISF2= 0
##$NSP= 0
##$NTH_PI= 0
##$NZP= 0
##$OFFSET= 16.45063
##$PC= 1
##$PHC0= 147.1852
##$PHC1= 11.49496
##$PH_mod= 1
##$PKNL= yes
##$PPARMOD= 0
##$PSCAL= 4
##$PSIGN= 0
##$REVERSE= no
##$SF= 250.130017851508
##$SI= 32768
##$SIGF1= 0
##$SIGF2= 0
##$SINO= 400
##$SIOLD= 32768
##$SREGLST= <1H.CDCl3>
##$SSB= 0
##$STSI= 32768
##$STSR= 0
##$SW_p= 5175.98343685301
##$SYMM= 0
##$S_DEV= 0
##$TDeff= 65536
##$TDoff= 0
##$TI= <Analysis number 999999
Compound Code 99
Book Reference 9
Project Code 9>
##$TILT= no
##$TM1= 0
##$TM2= 0
##$TOPLEV= 0
##$USERP1= <user>
##$USERP2= <user>
##$USERP3= <user>
##$USERP4= <user>
##$USERP5= <user>
##$WDW= 1
##$XDIM= 32768
##$YMAX_p= 366522485
##$YMIN_p= -1260296
$$ End of Bruker specific parameters
$$ ---------------------------------
##NTUPLES= NMR SPECTRUM
##VAR_NAME=  FREQUENCY,     SPECTRUM/REAL,   SPECTRUM/IMAG
##SYMBOL=    X,             R,               I
##VAR_TYPE=  INDEPENDENT,   DEPENDENT,       DEPENDENT
##VAR_FORM=  AFFN,          ASDF,            ASDF
##VAR_DIM=   32768,         32768,           32768
##UNITS=     HZ,            ARBITRARY UNITS, ARBITRARY UNITS
##FACTOR=    0.157963299565203, 1,           1
##FIRST=     4114.79642259007, 0,            0
##LAST=      -1061.18701426295, 0,           0
##MIN=       -1061.18701426295, -1260296,    0
##MAX=       4114.79642259007, 366522485,    0
$$ Real data points
##PAGE= N=1
##DATA TABLE= (X++(R..R)), XYDATA
$$ [...]
22967a47244N30482k10040l26894M29503j9049k33792j16440J18662K68803l39958
22957d5967O4788L1090j46464r2421K6286J7366k44789L17351K85517k50205j27302
22946a64750J1622j87271J40329R8800j23676k83312k46477L2767J30951J91901
22936c99116m6706O4604j56614N5621J71726o5825j61985k86390K54237L17804
22926b52644M33820l1647l49764J67687R4617j51168j36190J4060j36515l87185
22916g34929q7423K85039J87015K68923K5980l05801n4193J9086n3763L76163
22906g3903J20484J12889P3676Q0808l61526n8049J71062j92487l14537J04899
22896c36684J64926O385l9763P5548j15243J74812R6731R1171j86766J12436n9057
$$ plain form
22967 -147244 383238 173198 -153696 275807 256758 22966 -93474 25188 293991 -45967
22957 -45967 18821 49911 -96553 -188974 -162688 -145322 -390111 -72760 212757 -37448 -164750
22946 -164750 -153128 -340399 -200070 -101270 -224946 -508258 -754735 -721968 -591017 -399116
22936 -399116 -445822 -381218 -537832 -482211 -310485 -376310 -538295 -824685 -570448 -252644
22926 -252644 181176 149529 -200235 -32548 62069 -89099 -225289 -211229 -347744 -734929
22916 -734929 -822352 -537313 -350298 -81375 -55395 -361196 -415389 -396303 -450066 -73903
22906 -73903 46581 159470 233146 313954 -47572 -105621 65441 -127046 -441583 -336684
22896 -336684 -171758 -165373 -205136 -129588 -244831 -70019 26712 117883 -68883 43553 -15504
22885a5504J20513n9494k71105R9542J50880j03659N663j50091O3243M74142m45498
22874a31368k47327L35235L82731J05381k34999k91458k06668o3232n0463k39639
22864f41807P0166M20336j51867j537Q0940K09196k04651l9177K84254J72569
22854A98422J162J34993J44513j39973j41891L4905K3241L4796m67835q0545K4791
22843b33421J78833k08036j08686j14762L405M18922L83124n7149j64913j67079
22833f9762N9972L2578L5322k65376j47073m4469J81913L19565J02144Q7465J13200
22822D05479N9991j18763j63493j58623J53426k7976P7885j65789k26018K17767
22812E3886Q5224k45968l76533j97417J9524P8713o189j8165J82788L47333k77068
$$ plain form
22885 -15504 105009 45515 -225590 -126048 24832 -78827 -73164 -223255 -160012 314130 -131368
22874 -131368 -378695 -43460 339271 444652 209653 -81805 -288473 -351705 -402168 -641807
22864 -641807 -571641 -151305 -303172 -304709 -223769 -14573 -219224 -258401 25853 198422
22854 198422 199584 334577 479090 339117 197226 232131 255372 290168 -177667 -258212 -233421
22843 -233421 -54588 -262624 -371310 -486072 -482667 -63745 319379 262230 97317 -69762
22833 -69762 -9790 22788 58110 -207266 -354339 -398808 -216895 102670 204814 292279 405479
22822 405479 465470 346707 183214 24591 178017 150041 227926 62137 -163881 53886
22812 53886 139110 -106858 -483391 -680808 -661284 -582571 -588760 -606925 -424137 -76804 -353872
22801c53872l33524j64712p8762J40467L25656K91282J4539J50524j5791r0345
22791a14538j43760L1247J77943l74888k31229M2439M1463J5724j68459J08551
22781f15507N30006N90451l13232k74451J01488J12388O32483N3559j95964l216
22771F18005l82421k38771j21076r0244K45089K00761P0329k2961j90696k70227
22761a82212K60721j45554j59549Q7026j68468o7981m84630k40841J22803M26673
22751e52012J02106j09635J34151r6978J7653K62856N5881K88189K31951o0853
22741B73309l91537j59526J6025K9525J19171J21886k95373M04949Q9673n1531
22731A56571J78956k0077J79481r8726n63010j82282k806L99410j75406j61772
$$ plain form
22801 -353872 -687396 -852108 -930870 -790403 -464747 -173465 -158926 -8402 -24193 -114538
22791 -114538 -258298 -227051 -49108 -423996 -655225 -612786 -571323 -555599 -724058 -615507
22781 -615507 -85501 504950 191718 -82733 18755 131143 763626 817185 621221 618005
22771 618005 235584 -3187 -124263 -214507 30582 231343 301672 278711 88015 -182212
22761 -182212 78509 -67045 -226594 -139568 -308036 -376017 -860647 -1101488 -978685 -552012
22751 -552012 -449906 -559541 -425390 -522368 -504715 -241859 -185978 102211 334162 273309
22741 273309 -118228 -277754 -261729 -232204 -113033 8853 -286520 118429 208102 156571
22731 156571 335527 315450 494931 396205 -166805 -349087 -351893 47517 -127889 -289661
22721b89661J77400J92125n7605m49298r078K84213n6718j4393r5763n9664O679
22710c71763K22984K90530o9466l40403P6286Q031K65107k2691J67823K5540l353
22699B48625k07845j95153M49799L96459j13738m04413j96277k72845K3285J76377
22689i5726O8847J07959l59058j38642J0109K08045N34502M83952n26221j86705
22679A07062R6677J07078J27450j9729N6448L65190j72844n11266k91692J83402
22669D7776J40990j7243J97305l55393q6232J03296J68056O4573j36183j80924
22659e3979q0063J86695j66216N0803J330J83078L62920j1406l80016j85174j21589
22648b13617j56518K26373L33107N17347j03349n21161n14160j93674N8792K50140
$$ plain form
22721 -289661 -112261 79864 22259 -427039 -436117 -151904 -208622 -223015 -318778 -378442 -371763
22710 -371763 -148779 141751 72285 -268118 -191832 -183801 81306 58615 226438 251978 248625
22699 248625 40780 -154373 295426 691885 578147 173734 -22543 -295388 -272103 -95726
22689 -95726 -26879 81080 -277978 -416620 -406511 -198466 336036 819988 293767 107062
22679 107062 203739 310817 438267 418538 474986 840176 667332 156066 -135626 47776
22669 47776 188766 171523 368828 13435 -72797 30499 198555 263128 126945 -53979
22659 -53979 -134042 52653 -113563 -62760 -61430 121648 484568 473162 93146 -92028 -213617
22648 -213617 -370135 -143762 189345 706692 603343 82182 -431978 -625652 -566860 -316720
22638c16720n3421k34149j8270N8480M90507J15515j22697k8387l54992J70736
22628b93398K03189M10564q3092j84494j45577L7166R8439j30188J65149k69930
22618a92172M49053O6131j32841Q9931k52854k98799L6141J98513j25124k05026
22608c67047K58576J62977k26079j8116j60586j02694k6199l6621J13971l157
22598d04975K09300O77J15634J6888j79296n2987p4474k5404L28065l16665L1023
22587c52214O1443k3578k95706l70192J45965M72639J72903J76113J16289l48286
22577b44624k57315K71308K63467J35973j19991j37774j25780J09584M14084j1085
22567B97847l43253j40713L107l7088K3090m3010J04793o2880k10149j56500K52465
$$ plain form
22638 -316720 -370141 -604290 -622560 -564080 -73573 41942 -80755 -109142 -464134 -293398
22628 -293398 -90209 320355 237263 52769 -92808 -55642 42797 -87391 77758 -192172
22618 -192172 256881 323012 190171 280102 27248 -271551 -235410 -36897 -162021 -367047
22608 -367047 -108471 54506 -171573 -189689 -350275 -452969 -479168 -515789 -401818 -404975
22598 -404975 -195675 -194998 -79364 -62476 -241772 -294759 -369233 -394637 -66572 -383237 -352214
22587 -352214 -290771 -314349 -610055 -980247 -834282 -361643 -188740 -12627 103662 -244624
22577 -244624 -501939 -230631 32836 168809 48818 -88956 -214736 -105152 308932 297847
22567 297847 -45406 -186119 -183012 -220100 -197010 -240020 -135227 -198107 -408256 -564756 -312291
22556c12291k26J72348m2504k10186L7235N95005K1496k66491j62169j38092n2763
22545c58638K28112k73879k39845J22591J81369J56592J68758P4980L25335K05761
22535E91136m02052m95074j35966O6943k86276K03465R8856Q0158j29061j38598
22525e46469J79039K49950J93958K65159j07442l8948J45308M5479k63815l5266
22515H6953l43046k71190K30749J85959l1554L80230J67817k03765j72146l23477
22505b93470N3324R1212j57894L5596L66011J00626K14710J2504k51075Q8644
22495B60188n0939K10419j96020m10358k72525R5592R738j10532K15573P6138
22485a72726K43163J18107j49539l12687l17927J25076j84172K19556j07703J99641
$$ plain form
22556 -312291 -312517 -140169 -182673 -392859 -355624 239381 260877 -5614 -167783 -305875 -358638
22545 -358638 -130526 -404405 -644250 -521659 -340290 -183698 -14940 60040 385375 591136
22535 591136 189084 -305990 -441956 -375013 -661289 -457824 -358968 -278810 -407871 -546469
22525 -546469 -367430 -117480 76478 341637 234195 195247 340555 386034 122219 86953
22515 86953 -256093 -527283 -296534 -110575 -142129 238101 405918 202153 30007 -293470
22505 -293470 -240146 -148934 -306828 -271232 94779 195405 410115 422619 171544 260188
22495 260188 209249 419668 223648 -186710 -459235 -363643 -353905 -464437 -248864 -172726
22485 -172726 70437 188544 39005 -273682 -591609 -466533 -650705 -431149 -538852 -339211
22475c39211L47315j58362O8807K43674J2984J88114n6176j61154O4134J49797
22465C59922j09974K1189k50081J05640K68191j71738j15432l83870n25178R7151
22455g04180L45041N08922J42614j42361j41291L28725j40473m25019J81590J17061
22445G0629K11556m64432p2791Q5547j67498R0299L80932K24947k51381l47242
22435b39434j23538K51279J11947J91972k71296l26632R3240K08929J79264j35392
22425e9661l94220J05023N55596K1848J10056P0282R6877J74524l74295j0987
22415B95043K5006k93328k37734K00833Q2921N4619K60508J3347k79532j0646
22405A11037L00519J18810r0881j65328k18236L5771j08178l85573j90207J4501
$$ plain form
22475 -339211 8104 -150258 -81451 162223 175207 363321 307145 145991 210125 359922
22465 359922 249948 271137 21056 126696 394887 223149 107717 -276153 -801331 -704180
22455 -704180 -359139 149783 292397 150036 8745 337470 196997 -228022 -46432 70629
22445 70629 282185 -182247 -255038 -169491 -336989 -246690 134242 359189 107808 -239434
22435 -239434 -362972 -111693 254 192226 -79070 -405702 -312462 -103533 75731 -59661
22425 -59661 -453881 -348858 206738 228586 338642 408924 505801 680325 306030 295043
22415 295043 320049 26721 -211013 -10180 72741 127360 387868 401215 121683 111037
22405 111037 411556 530366 439485 274157 55921 91692 -16486 -402059 -592266 -577765
22395e77765l5738L80041L9895M2180J94770J97798j99269l45655R804O8769j04785
22384c29955k37436k0146K75640K05320K92110K5202l45497J5760J57034J36328
22374A74360m14127k1210O7067r2240J81637j36210K15234K01597l3529r4470
22364D8109l5510j23740j81710L37488J15282j71647l2874j34338l08493l3882
22354e21315K76296L92264O9743P714r7437j12124k6159K36690R9632k88157l12072
22343b74925J28230k116J28111K1039l14323M4331p2667j80129J35291J24601
22333b62557P61013K15197n60977k36628k75333M7067M42542j72674j52071j14568
22323c08989J38926L00889P6092j07477P151j22948q6865j21761q2734J45806
$$ plain form
22395 -577765 -613503 -233462 -193567 -151387 43383 241181 41912 -303743 -293939 -225170 -329955
22384 -329955 -567391 -587537 -311897 -106577 185533 210735 -134762 -119002 38032 174360
22374 174360 -239767 -260977 -193910 -286150 -104513 -240723 -25489 176108 142579 48109
22364 48109 12599 -111141 -292851 44637 159919 -11728 -44602 -178940 -487433 -521315
22354 -521315 -245019 147245 216988 224702 127265 15141 -11018 225672 325304 37147 -274925
22343 -274925 -146695 -148811 -20700 339 -313984 -269653 -342320 -522449 -387158 -262557
22333 -262557 498456 713653 152676 -83952 -359285 -312218 130324 -42350 -194421 -308989
22323 -308989 -170063 130826 206918 99441 106592 -16356 -103221 -224982 -307716 -161910
22313a61910R1517J0687j31525k43627n4653J41029N3696N9153q7790J40521N32214
22302C49312J79757M1289k87032l22412j95302m4303l6615L16771J73278k56673
22292h1930J25746R3280o4439Q4515K69048k29428J15816j63204P1175k28914
22282h335m50387J00496M0264j53764J14462K02922P3119J53062l2461k48971
22272b09593J46593j46126k0026N5674J05926l00369J27305L06618M6162j11888
22262B76M1088J90490j43418J43113L58344j92978r0903k81638q3363r6215r1673
22251b46877p4209L9561J08942J60774K07357J6730k09072k2341M011l49227m14056
22240g78407o4410o5662p3014K5332K10893J42742L78381K56325j0404k24617
$$ plain form
22313 -161910 -70393 -59706 -191231 -434858 -489511 -348482 -294786 -235633 -323423 -182902 349312
22302 349312 529069 570358 283326 -39086 -234388 -278691 -315306 1465 174743 -81930
22292 -81930 43816 137096 72657 157172 426220 196792 312608 149404 220579 -8335
22282 -8335 -458722 -358226 -317962 -471726 -357264 -154342 -81223 71839 39378 -209593
22272 -209593 -63000 -209126 -229152 -173478 -67552 -367921 -240616 66002 112164 276
22262 276 41364 231854 88436 231549 589893 396915 306012 24374 -58989 -155204 -246877
22251 -246877 -321086 -281525 -172583 -11809 195548 212278 3206 -19135 -15124 -364351 -778407
22240 -778407 -842817 -908479 -981493 -956161 -745268 -602526 -224145 32180 21776 -202841
22230b02841N5149K5873j68427M4079k5859J3038R9404j69930j2540R3225Q1156
22219a67673P6863j90211j40474J59772L27074j4639m35341j07349M30431J92060
22209A30513j14849p8190L69768R9193M6579m8565j46077m144j27845l008k60582
22198a37207J2108J53990R3409n1272j23823k25872l70249J0337L3425J71955
22188d33199j2757m4266o6015o4562L78784K82579J89929j40155j6818j01594
22178b8074l41n5504o78956J40264K41299J425M86477M22128j44350m40480K0018
22167c6094j17161j10274P6246J27543J5086q9109p2544j27157o8722K61216o5270
22156b06240l36777M0555K65746J6300K5179q2828L734M04619P2095p4091J84586
$$ plain form
22230 -202841 -147692 -121819 -290246 -246167 -272026 -258988 -159584 -329514 -342054 -248829 -167673
22219 -167673 -90810 -281021 -421495 -261723 65351 50712 -384629 -491978 -61547 130513
22209 130513 15664 -62526 307242 406435 453014 404449 258372 254228 126383 123375 -137207
22198 -137207 -125099 28891 122300 71028 -52795 -278667 -648916 -638579 -605154 -433199
22188 -433199 -445956 -490222 -556237 -620799 -242015 40564 230493 90338 73520 -28074
22178 -28074 -28415 -83919 -762875 -622611 -381312 -379887 106590 528718 384368 -56112 -36094
22167 -36094 -153255 -263529 -187283 -59740 -44654 -133763 -206307 -333464 -402186 -140970 -206240
22156 -206240 -543017 -502462 -236716 -220416 -195237 -278065 -274331 130288 202383 128292 312878
22145C12878r8649k87787j67737N9264J11432p0998k8925m6135K41864j53286
22135a28079l36755L31345J09200l75970j86256J56379j593N5353J63306P7219
22125a35851J46173K80305j32932j15831L15178J48119J40533k64961l24577o28483
22115e72327q01L99319l1294J6118J51414q8237j4688j07143j99358J23701M289
22104c19007N4418p8317L17964K62476k21532j99470j58293l9404L63332L18372
22094C00539k77678l61984k30559M2518K05356m2095l17084r6797M68459L15789
22084F464j63515j63511J5730k5511K83612M90563m1398j95443j93583j50036
22074a36628O985j96835j25320J10304J01991r7925m3564K14869K74259O1642
$$ plain form
22145 312878 214229 -73558 -241295 -182031 -70599 -141597 -170522 -216657 25207 -128079
22135 -128079 -464834 -133489 -24289 -400259 -586515 -430136 -431729 -376376 -213070 -135851
22125 -135851 10322 290627 157695 41864 357042 505161 645694 380733 56156 -572327
22115 -572327 -573128 -173809 -205103 -188985 -37571 -125808 -140496 -247639 -446997 -323296 -319007
22104 -319007 -264589 -342906 -24942 237534 16002 -183468 -341761 -381165 -17833 300539
22094 300539 22861 -339123 -569682 -527164 -321808 -363903 -680987 -777784 -309325 6464
22084 6464 -157051 -320562 -304832 -330343 -46731 443832 402434 206991 13408 -136628
22074 -136628 -129643 -326478 -451798 -341494 -239503 -337428 -380992 -166123 108136 169778
22064A69778k8052L32704j41476j86093k59889k12803K38317N32843K60802j42533
22054E63598m81863l38896Q7109L89278L47435k15159l18409j00728K09058m7377
22044I4046j82073j46770K57j6117J03517P9731j45368k86099j58264J13172O10144
22033F6176J92706l30636k37944k96670J90764K47868j22415j30993K48094P6431
22023i6619k56473J40238p1837M2478J75335K02149l3709R844k42616m5603p8211
22012b55024J16555K30231J34982n8689j7597K31912j8840k57330o4483J51598
22002A93315K50815K29192O3m99459R3102K01833j92055L4363J40072J27007o50992
21991g2744k10375L53893J16941j85926l1025j57252k57673L35540m2k20307J26054
$$ plain form
22064 169778 141726 474430 332954 146861 -113028 -325831 -87514 445329 706131 563598
22054 563598 81735 -257161 -170052 219226 566661 351502 33093 -67635 141423 94046
22044 94046 -88027 -234797 -234540 -250657 -147140 -67409 -212777 -498876 -657140 -543968 66176
22033 66176 258882 -71754 -309698 -606368 -415604 -167736 -290151 -421144 -173050 -96619
22023 -96619 -353092 -212854 -284691 -242213 -66878 135271 101562 111406 -131210 -176813 -255024
22012 -255024 -138469 91762 226744 168055 150458 382370 363530 106200 41717 193315
22002 193315 444130 673322 673385 173926 267028 468861 276806 311169 451241 578248 -72744
21991 -72744 -283119 70774 187715 1789 -29236 -186488 -444161 -108621 -108663 -328970 -202916
21980b02916o5890r0681p6600p4588q6857j70588K04368K29959L53796O7720j63693
21969g5970j9363M34882R0758j92912N6577L25164N8l70087k19507r7420J90326
21958A22506j13027j24743O1766J9579k04690j62718Q2436J2873R8297J81416
21948b6305k5309j07386Q4351j40114L82745J19841j5166n6048o0562j45998P6643
21937H6692K19486L8211K2363l05022l88364j26572J34412M9748J96489K48517
21927A75960j92155J32680j77062l02791L22961K5724j26507o2510J47050L42178
21917B85528Q5969l4445m08395j41478M10160K1343k82873P2480K20762o5485
21907A63566k86339R5888j54284J22609J30076K966k84696n487N4479K60862p0557
$$ plain form
21980 -202916 -268806 -359487 -436087 -510675 -597532 -768120 -563752 -333793 20003 87723 -75970
21969 -75970 -95333 339549 430307 237395 293972 619136 619194 249107 29600 -67820 122506
21958 122506 9479 -115264 -53498 -33919 -238609 -401327 -318891 -306018 -207721 -26305
21948 -26305 -51614 -159000 -74649 -214763 167982 287823 272657 216609 156047 10049 86692
21937 86692 306178 344389 366752 61730 -326634 -453206 -318794 -269046 -72557 175960
21927 175960 -16195 116485 -60577 -363368 -40407 -14683 -141190 -203700 -56650 285528
21917 285528 371497 337052 -71343 -212821 197339 218682 -64191 8289 229051 163566
21907 163566 -122773 -26885 -181169 -58560 71516 74482 -210214 -215701 -161222 99640 29083
21896B9083R6081j03118j58571K22208P4007j03047j06602k50282k51495k7276
21886e79012L76969L71410N0474J38412l7823j32038l6130Q0160j68082J28239
21876A92579l12833k33875P3018K74141j96966j26596L34877J70037m02873m09226
21866f37717J46150K06444j9342k1150O2986j01643l05653J07121J87989L5560
21856c39255j23479n13324J20348Q9306M7303K81615M65557K89702k26961k1780
21846F9032m7251j20186j83406J00206L94866M26132j77304r5277m62739L0199
21836f5728J36594J0515k55359J09179Q4200L78299q0046m19073k05279M6915
21826b59783j35242k28660L13587M65903l69352k16935K69329J38207N062k65
$$ plain form
21896 29083 125164 22046 -136525 85683 159690 56643 -49959 -300241 -551736 -579012
21886 -579012 -202043 169367 219841 358253 320430 188392 152262 232422 64340 192579
21876 192579 -120254 -354129 -281111 -6970 -203936 -330532 4345 174382 -228491 -637717
21866 -637717 -491567 -285123 -304465 -325615 -262629 -364272 -669925 -562804 -374815 -339255
21856 -339255 -462734 -976058 -855710 -766404 -719101 -437486 28071 317773 90812 69032
21846 69032 21781 -98405 -281811 -181605 213261 639393 462089 366812 -95927 -65728
21836 -65728 70866 81381 -173978 -64799 19401 397700 317654 -101419 -306698 -259783
21826 -259783 -395025 -623685 -310098 155805 -213547 -430482 -161153 -22946 -17884 -18149
21816a8149J86328m6813R0032K18841j85066j65002l02198k2551K01755J87068
21806A44245k36196o2734j55234j46126M3805R800q0186l6225J42152K17288N17772
21795C58361j20779j03978j04628l55186J56497j53374n1223j3122M6070L18129
21785b3233L48550L7593j65624j24825j75827k36792n6007L06112J78835k69471
21775a80689l24757j41387K36710L263J93906J88049J85909j63038j97807J54710
21765d5131J33717j23597k956R6460N14966J8459r1845o8747k04665m8805j66804
21754A1052L24906L84862q3201m05206k21526j17083N57426J15444j99539m00280
21744c3145r2234n2082m0895L15541p8486j09917K36674l41243r2629K64583M40595
$$ plain form
21816 -18149 168179 121366 211398 430239 245173 80171 -222027 -244578 -42823 144245
21806 144245 -91951 -154685 -309919 -456045 -412240 -402440 -482626 -518851 -376699 -159411 358361
21795 358361 237582 133604 28976 -326210 -169713 -323087 -374310 -387432 -341362 -23233
21785 -23233 325317 362910 197286 72461 -103366 -340158 -396165 -90053 88782 -180689
21775 -180689 -505446 -646833 -410123 -406860 -212954 -24905 161004 -2034 -199841 -45131
21765 -45131 88586 -35011 -37967 58493 573459 591918 500073 431326 226661 177856 11052
21754 11052 335958 720820 637619 232413 10887 -106196 451230 566674 367135 -33145
21744 -33145 -125379 -177461 -218356 97185 18699 -91218 145456 -195787 -288416 -23833 416762
21733D16762j85217k17297M4871j41029n46523P6240q2641M62311J48246k62879
21723b87156J47313J97255m443k79384J050M16974R3465R710r1275p1937j38980
21712g408P7305j4212j15372J58373j52509j95193K55536l3191J27102R4165K51366
21701D45962j36990k12134k97494n5380K11681Q1135m35163M3588J16169J15445
21691a23181J20194k69825p6965J97751J72385o0168p0384K78393K21163K03781
21681E93144J1298r02j11550k82833K06025j9847j33454j18704K83980j45339
21671B81818N4358J46362k32062k78437l13746K4934O1148L95842j12931m99825
21661d72539k78554l6653M25885L99685j50740k13564J94966N6927k01886j43456
$$ plain form
21733 416762 231545 14248 59119 -81910 -628433 -552193 -634834 -172523 -24277 -287156
21723 -287156 -139843 57412 52969 -226415 -225365 191609 285074 294784 203509 131572 -7408
21712 -7408 69897 55685 -59687 98686 -53823 -249016 6520 -26671 100431 194596 445962
21701 445962 308972 96838 -200656 -256036 -44355 36780 -398383 -354795 -238626 -123181
21691 -123181 -2987 -272812 -349777 -152026 20359 -39809 -110193 168200 389363 593144
21681 593144 604442 603540 491990 209157 415182 395335 261881 143177 427157 281818
21671 281818 336176 482538 250476 -27961 -341707 -316773 -255625 140217 27286 -472539
21661 -472539 -751093 -787746 -361861 37824 -112916 -326480 -131514 -74587 -276473 -419929
21651d19929L09987j27874N0510O5923J60948R3115K6693m33038R355L04552N1706
21640I1948j44299K52561r054j40242j39619l85468L5772K13548L32503K80591
21630C88241j02847O5666q6381k14188J79437k52809Q8972L45392R2292J71467
21620F75242j32555l9280N2099k78687j86690o2653k54470k12287m4356k03528
21610f87165l9191L34276J79685L43956K44208j93233j11094l6970j65811N5418
21600g5921J10628L29980L43181l01224m12768J77449p5669l01765J84200K14618
21590A92709k19858K9338P5678J73554j43889k12466J78009j69148J98721P7767
21580A80415J95505K13912o1495m95789m60162K4082L85808j31034J3503o6819
$$ plain form
21651 -419929 -109942 -237816 -187306 -121383 39565 132680 159373 -273665 -264310 40242 91948
21640 91948 -52351 200210 191156 50914 -88705 -474173 -438401 -224853 107650 388241
21630 388241 285394 351060 264679 50491 229928 -22881 66091 411483 503775 675242
21620 675242 542687 503407 555506 276819 90129 27476 -226994 -439281 -483637 -687165
21610 -687165 -726356 -392080 -212395 131561 375769 182536 71442 34472 -131339 -75921
21600 -75921 34707 364687 707868 406644 -6124 171325 95656 -206109 -21909 192709
21590 192709 -27149 2189 77867 251421 107532 -104934 73075 -96073 102648 180415
21580 180415 375920 589832 528337 32548 -427614 -403532 -17724 -148758 -135255 -202074
21570b02074J06050M21737J59182j21821j76123k36966j72974J83139K15965q4462
21560I1653N0635l2583K06627J72059k45739j19451P327O4787m3196Q2136J93668
21549D27923k50196J40586R7128q5769j43648m08177m61113m6188o6800K1316
21539g74938k0178K20845M32256J29622J2186k55298k81373J41636M5058J82088
21529a68096J2463k04773m90880K78253L39060L16851K88066J52943o9415k46881
21519B07591l33206n9667r1325r3679P4352n9193J02677K73849K54606J24644
21509D00649R6057K75531j53915n44080k11236J15764N9802q6377j00092j92678
21499c40575R0843K39235L98230J49674M0084k18546J1114K1892R3856j46689
$$ plain form
21570 -202074 -96024 325713 484895 363074 186951 -50015 -222989 -39850 176115 91653
21560 91653 142288 109705 316332 488391 242652 123201 130528 195315 152119 234255 427923
21549 427923 177727 318313 415441 329672 186024 -222153 -683266 -729454 -796254 -774938
21539 -774938 -795116 -574271 -142015 -12393 -207 -255505 -536878 -395242 -350184 -168096
21529 -168096 -155633 -360406 -851286 -573033 -233973 82878 370944 523887 454472 207591
21519 207591 -125615 -185282 -276607 -370286 -295934 -355127 -252450 21399 276005 400649
21509 400649 496706 772237 618322 74242 -136994 -21230 38572 -47805 -147897 -340575
21499 -340575 -249732 -10497 387733 537407 577491 358945 370059 391951 485807 339118
21489C39118l09811j95497l35241O5302K35758l43701j36945j45146K72918M38558
21479a14687K93667P0162n4211j27737q8202j51971O9092M49492J51164k79199
21469B17570k55874J44123J04008N9667L6534L33628j19697j67116j42935L4813
21459B44721n8316k5704J74585j3441J29192K32557j12639k10457J45873j64229
21449C42142o13919j77491o7508l9827J0735K92104J66646j30559j47516J02731
21439b62462j0899N6381j06360j19152J54813L85912M44899n3229j92664k2531
21429B74708l0816j97165l86627k38434J82778J93019M4982J69985k472P1524
21419H1482k22624k71353K22097P1582j27011m8943J122J70029K22432K46095
$$ plain form
21489 339118 29307 -166190 -501431 -436129 -200371 -544072 -681017 -826163 -553245 -114687
21479 -114687 178980 249142 194931 67194 -21008 -172979 -103887 345605 496769 217570
21469 217570 -38304 105819 209827 269494 306028 639656 519959 352843 209908 244721
21459 244721 186405 160701 335286 321845 451037 683594 570955 360498 506371 342142
21449 342142 -271777 -449268 -516776 -556603 -545868 -253764 -87118 -217677 -365193 -262462
21439 -262462 -273361 -216980 -323340 -442492 -287679 98233 543132 489903 297239 274708
21429 274708 243892 46727 -339900 -578334 -395556 -202537 -157555 12430 9958 81482
21419 81482 -141142 -412495 -190398 -118816 -245827 -294770 -293648 -123619 98813 344908
21409C44908q785j56932k26065j24440O7495k4391L0399k36894K58218J83076
21399A06589J02071j70628j69238r7509J79485L49987l95393K38705k0538j30263
21389f732L1906J31918P7460k77917l9755j0178m644P5092J60333l6243k98887
21378a97647J76663k0945j8422q4699p3840M995j2551N1415K7577K64437L07277
21367D24260k56498m24534J47452L90621j19495K27297q440l61811l61736m0014
21357c82898M52450K93744r81j55643j55609K1790l76635P3051j85933J80838
21347b35826K62007q1105P6765J74789L0571j08368J72503K13950N38002L54153
21337A397441l08684m77202k48011k10943J46569q5543k51748J78411l58277k84846
$$ plain form
21409 344908 336123 179191 -46874 -171314 -103819 -128210 -97811 -334705 -76487 106589
21399 106589 208660 38032 -131206 -228715 -49230 300757 -94636 144069 123531 -6732
21389 -6732 25174 157092 234552 -43365 -83120 -93298 -97942 -22850 137483 101240 -197647
21378 -197647 -20984 -41929 -60351 -145050 -218890 -213895 -226446 -175031 -147454 116983 424260
21367 424260 167762 -256772 -109320 281301 161806 389103 380663 18852 -342884 -382898
21357 -382898 69552 363296 362315 206672 51063 72853 -303782 -230731 -416664 -235826
21347 -235826 26181 -54924 21841 196630 227201 118833 291336 505286 1043288 1397441
21337 1397441 1088757 611555 363544 152601 299170 213627 -38121 140290 -217987 -502833
21327e02833j04962M62007M61823J51848p8844n85643Q2507J47150K5631L0400
21317H9084K88550N7515j47168r9472j17981k0673j91773L4987J32495K66603
21307B92167M03312k59701l4937j46046j79198K30907J61154J76481L1169k11518
21297D63790j29807p43095j79785P1915p6417O1079K32749J91186N0603J07808
21287E0026P2260j15753r1235K39296K72607q4496o77209J25911M47850M2962
21277B82219o3488K09214J50843q0077m69387l82707R1523J63224L95673m025
21267B93012J57273L198l33533J4494K61369p8816j00080k7428k46857j70059
21257b27427m6876J17562J44735O2872n7239m9876K31883P6849L7316j54638J05347
$$ plain form
21327 -502833 -607795 -145788 316035 467883 389039 -196604 -114097 33053 58684 89084
21317 89084 377634 435149 287981 188509 70528 49855 -141918 -106931 25564 292167
21307 292167 695479 435778 400841 254795 75597 306504 467658 644139 675308 463790
21297 463790 333983 -409112 -588897 -516982 -593399 -532320 -299571 -108385 -57782 50026
21287 50026 122286 6533 -84702 154594 427201 342705 -334504 -208593 239257 282219
21277 282219 218731 427945 578788 498711 29324 -353383 -261860 -98636 297037 293012
21267 293012 450285 453483 119950 134444 395813 316997 216917 189489 -57368 -227427
21257 -227427 -274303 -156741 -12006 50866 -6373 -56249 175634 252483 289799 135161 240508
21246B40508l3482k46702l41609M0269L17733M74178O2486j99687m18764k21300
21236c26370L51148L651O2129M6294j38285m1837m4830K45194J49323j3088j72991
21225A20338j21764o9649j49001J72588j43850l91770J10525l2153j17254K83342
21215c38648j5090K44880Q3149n3271j01026K8063K49780J22791J12014j5160
21205C17482J35813J34913l41563k3240K95497m98596p6195L6063M47958J23088
21195E51220j55551K60892P0683j64044K12849K77005m05578j04024k79765K9057
21185B92744J7362j6718J11514q7565j55766J19511L21991q9966j04653K43983
21175F52437Q0463R599P6040M5332J92656J28309Q3630J85337j33513P0785K85414
$$ plain form
21246 240508 207026 -39676 -381285 -341016 -23283 450895 513381 313694 -105070 -326370
21236 -326370 24778 28429 90558 136852 -1433 -43270 -88100 157094 306417 293329 120338
21225 120338 -1426 -71075 -220076 -47488 -191338 -583108 -472583 -504736 -621990 -338648
21215 -338648 -353738 -108858 -25709 -78980 -180006 -151943 97837 220628 332642 317482
21205 317482 453295 588208 246645 223405 518902 20306 -55889 -19826 428132 551220
21195 551220 395669 656561 727244 563200 776049 1053054 647476 543452 263687 292744
21185 292744 310106 293388 404902 317337 161571 281082 603073 513107 408454 652437
21175 652437 732900 742499 818539 863871 1056527 1184836 1268466 1453803 1320290 1391075 1676489
21164A676489K3871l44279k27790J54676J78508J6436n5195p1457L71149N24568
21154B246976J65503J73087L33476m9174k76557j58650n0167K52135K7803l58554
21144B305878q9591j31482J21157L0569J30296K81082N9093k96477j48624k00990
21134B060911J10457J51968j70722q0549O0708l36716p24354j05377J76547k212
21124A140661j721j41188l81337k17977j14972J63465J71805k55389M400j28230
21114B39517J95119k12549M9187L23756j27514r053J06437n5256P4825J53657
21104G38126j01627n964j08818m34882k03544k43231J35928L20948K98725O5131
21094D60792l9154O6571N8286r6600J28306P8954l37070j91241o7226J79372k38208
$$ plain form
21164 1676489 1700360 1356081 1128291 1282967 1461475 1477911 1422716 1351259 1722408 2246976
21154 2246976 2412479 2585566 2919042 2869868 2593311 2434661 2384494 2636629 2664432 2305878
21144 2305878 2216287 2084805 2205962 2236531 2366827 2647909 2707002 2410525 2261901 2060911
21134 2060911 2171368 2323336 2152614 2072065 2132773 1796057 1071703 966326 1142873 1140661
21124 1140661 1138940 997752 616415 398438 283466 446931 618736 363347 367747 239517
21114 239517 434636 222087 271274 595030 467516 458463 564900 509644 584469 738126
21104 738126 636499 630535 521717 86835 -116709 -359940 -224012 96936 395661 460792
21094 460792 421638 488209 546495 449895 578201 657155 320085 128844 61618 240990 2782
21083B782k34531Q8132O9206N14126J12001j57345j55919j69869J16657N20221
21073G05461J62756N1722K6248l70676j05269K22545J62166l369l01746j33818
21063D16020l14543O6420O4753k09187o16981j29597K88158M49107m7114j77118
21053b10082k1230r2528l17002J17104M26743J56630K4932M6542n2365J0438N9458
21042A48640J03774J6697k71241k96922J67232M15957J12264k9267j20245l39324
21032i2435j25428L23245K96329J6562l40850k48552o4633L45166J75744k63221
21022B1927k0703L5815k4642k2481J44271j8883n4625M98753J70107r5011o8566
21011E65962K19180m4353n32125l17383O9848J46132k09835L7396L1768j05467
$$ plain form
21083 2782 -231749 -143617 -74411 439715 551716 394371 238452 68583 185240 705461
21073 705461 868217 919939 946187 575511 470242 692787 854953 851584 549838 416020
21063 416020 101477 167897 232650 23463 -593518 -723115 -434957 14150 -32964 -210082
21053 -210082 -231312 -323840 -640842 -523738 -96995 59635 84567 131109 78744 89182 148640
21042 148640 252414 269111 -2130 -299052 -131820 284137 396401 367134 246889 -92435
21032 -92435 -217863 105382 401711 418273 77423 -171129 -235762 109404 285148 21927
21022 21927 1224 37039 12397 -10084 134187 115304 60679 559432 729539 634528 565962
21011 565962 785142 740789 208664 -108719 -38871 107261 -102574 -65178 -33410 -138877
21001a38877o1809l5310R4806M13785r2368k76931l11112j72163M00677M41466
20991B62164J71729j22206j7887j10652o0914m7520j62673k35210k22928R8138
20981d47959o0073K03434j05831j89067L38245l0519j88152K3996O8801n3602
20971d40727j31121l9847J27942L54041J08511K04451j09433n13354j88041J83461
20961d44117L72635P0806k65894k65702j27722K2060K61157n359k29048K55409
20951c55775M09984K37404L32775l2900k85942K07466J64574n26314j24288M9226
20941G6210L42704j47873k17705l6605J51987L14828l7661m69508j40875K45189
20931H0691j99315o6096k26297j2936K23248Q1790j29010L66183J83623K87631
$$ plain form
21001 -138877 -200686 -235996 -141190 272595 180227 -96704 -407816 -579979 -179302 262164
20991 262164 433893 311687 293800 183148 122234 74714 -87959 -323169 -546097 -447959
20981 -447959 -508032 -304598 -410429 -599496 -261251 -291770 -479922 -455926 -387125 -440727
20971 -440727 -571848 -611695 -483753 -129712 -21201 183250 73817 -439537 -627578 -444117
20961 -444117 -71482 -676 -266570 -532272 -659994 -637934 -376777 -382136 -611184 -355775
20951 -355775 54209 291613 624388 591488 305546 513012 677586 151272 26984 76210
20941 76210 418914 271041 53336 16731 168718 483546 445885 -23623 -164498 80691
20931 80691 -118624 -184720 -411017 -423953 -200705 -118915 -247925 118258 301881 589512
20921E89512J26437m05852k68824r2558o8155J09875q7602O5891P1388J03557
20911A43669J56289k14235l21804m7089j16791K19279K57565m1402J46014J87967
20901C69462j9905j00035o106j29146J99715l10451l94029K94165J08930J65866
20891A78466j42670n29860Q264L08773L83606K76282j92618j39257L30223M37700
20881I18909m6343m48426n25425j86495J25832Q7063j22255J61088J29470l20753
20871b27335J65142K24121M22739K0218k5771q6282l38120l05381J21948L68036
20861C39315m2220j40459j33963k42197K74113L62654J85555q8609N7474J26317
20851F97980j90397j48207N2065l8829k41816j2990o8193K94373M14189q799j95002
$$ plain form
20921 589512 715949 310097 41273 -51285 -119440 -9565 -97167 -31276 40112 143669
20911 143669 299958 85723 -236081 -283170 -399961 -180682 76883 35481 181495 369462
20901 369462 349557 249522 243416 114270 313985 3534 -390495 -96330 12600 178466
20891 178466 35796 -494064 -485800 -177027 206579 482861 290243 150986 481209 918909
20881 918909 872566 424140 -101285 -287780 -161948 -74885 -197140 -36052 93418 -227335
20871 -227335 -62193 161928 584667 604885 579114 492832 154712 -150669 -28721 339315
20861 339315 297095 156636 22673 -219524 54589 417243 602798 514189 571663 697980
20851 697980 507583 359376 411441 372612 130796 117806 49613 343986 758175 749376 554374
20840E54374J6666j20172k67009J04379K56696J5168K24707n7556j10065J33356
20830G50544j75417J25014n2238j23981L87014K27035K42196J19066n8558O7637
20820A508312L07564K86450k70769k9080O212J69535M93311N6024l46935q9778
20810B090846J75148K87009L01465P3767K58214L67849k27021l77201r9633K5909
20800B876352l05790k36543J200k07512n43846k36583l92550j3899o0487J51071
20790A031413K87261l87499p7526q9969m80328j51305R5719J77298o0161j77253
20780A67650J3031J42687J25562j0001K25952K41961r9443j8277L3163L0270j17268
20769G35287k68393M4862L31364q4791m20027J48890o833k41587j1031L0948n2349
$$ plain form
20840 554374 571040 450868 183859 288238 544934 560102 784809 727253 617188 750544
20830 750544 575127 700141 647903 523922 910936 1137971 1380167 1499233 1440675 1508312
20820 1508312 1815876 2102326 1831557 1802477 1808689 1978224 2471535 2527559 2180624 2090846
20810 2090846 2265994 2553003 2854468 2928235 3186449 3554298 3327277 2950076 2850443 2876352
20800 2876352 2570562 2334019 2335219 2127707 1583861 1347278 954728 940829 880342 1031413
20790 1031413 1318674 931175 853649 763680 283352 132047 227766 405064 344903 167650
20780 167650 180681 323368 448930 438929 664881 906842 807399 789122 822285 852555 735287
20769 735287 466894 511756 843120 758329 338302 487192 480359 238772 227741 258689 206340
20758B06340k30284m3191K36547J31770o1417k5865q8668j95535j40583L59661
20748A48775L74654j16619j2556k23655J22342p0269r6893O7111Q033M35434j79695
20737D56662L02674Q3282m30978J23147L78780N2923P3119j82464L1631j61824
20727G26952P0678j0202j55542k58790K42999J8281m49493J6635J59873M03013
20717G64404K95390j20653K1078J66778R2284o7385k05882J1225K1119j40660
20707H37698P435M3754K74480j21828l29589O9393L8575K59244m9193j55208k05371
20696F69390k88554j72864k0619J89531J58500L66910K98306J81220J76328k39875
20686A318273q1715l94848j16389K29060K90471J66685k85980o17623J94967M92827
$$ plain form
20758 206340 -23944 -67135 169412 301182 239765 213900 125232 -70303 -210886 148775
20748 148775 523429 406810 394254 170599 292941 222672 125779 192890 200923 636357 456662
20737 456662 759336 842618 411640 534787 913567 966490 1039609 857145 888776 726952
20727 726952 797630 787428 631886 373096 616095 634376 184883 201518 361391 764404
20717 764404 1059794 939141 960219 1126997 1219281 1151896 946014 957239 978358 837698
20707 837698 845133 888887 1163367 1041539 711950 781343 819918 1079162 1029969 874761 669390
20696 669390 380836 207972 187353 376884 535384 902294 1200600 1381820 1558148 1318273
20686 1318273 1236558 841710 725321 954381 1244852 1411537 1125557 507934 702901 1195728
20676A195728K53018j58170N2091Q0691n370j90189p5582J18680J08544j00209
20666A279232J23430l591j74964k2566R6699o6119J31786J97768j0196Q6172J70631
20655A808282K48559p5293j26816l03866q2854M02762R9734k5490j29618R0613
20645A906013J04132K12833n547n0518N4837K93328j74069m04374J17961J91561
20635B246157k7529J88670J82880J33066m1528K86753O35010K1171k66338J49272
20625C507584M37351N99841M81406K67322M4942J79120N9989K5458q1669J56409
20615E677753L90945N00243Q4766N19553J183792O89111L28465N50733P17033
20606A0642394O51275R04087J045070J039212P54980J220824J767891K229410
$$ plain form
20676 1195728 1448746 1290576 1342667 1423358 1417988 1227799 1152217 1270897 1379441 1279232
20666 1279232 1402662 1399071 1224107 1201541 1298240 1232121 1363907 1561675 1551479 1637651 1808282
20655 1808282 2056841 1981548 1854732 1550866 1468012 1870774 1970508 1945018 1815400 1906013
20645 1906013 2010145 2222978 2217431 2166913 2221750 2515078 2341009 1936635 2054596 2246157
20635 2246157 2218628 2407298 2590178 2723244 2681716 2968469 3603479 3624650 3358312 3507584
20625 3507584 3944935 4544776 5026182 5293504 5338446 5517566 5577555 5603013 5521344 5677753
20615 5677753 6068698 6568941 6653707 7173260 8357052 9046163 9374628 9925361 10642394
20606 10642394 11293669 12197756 13242826 14282038 15037018 16257842 18025733 20255143
20598B0255143K985183L538690M631175O109347Q763229J2302407J6051331J7867649
20590I2504154J7450978J8855150K1357333J4125349K21034l876022p84337N330603
20582A65184242Q843920k70469j1789206j0011275p07604N133707Q373413J3836393
20574A78593121J3424147k41937j0712569r521184m138907J817981j830876j8116480
20566A49273296k6543129k2586559j5653464j1005826q484017o636846n515296
20559E2848159l953392l585465l177159k824187k291788j862356j441240j176972
20551C2535600j443664j745989j136457j180920j108597p04433r84452j168659
20543B3062429j190887o85544n62619r22668r00108k64099R5498n73217q47435
$$ plain form
20598 20255143 23240326 26779016 31410191 37519538 46282767 58585174 74636505 92504154
20590 92504154 109955132 128810282 150167615 164292964 164513998 160637976 159853639 165184242
20582 165184242 174028162 173757693 161968487 151957212 151249608 156383315 164756728 178593121
20574 178593121 192017268 191775331 181062762 171541578 167402671 169220652 167389776 149273296
20566 149273296 122730167 100143608 84490144 73484318 65000301 58363455 52848159
20559 52848159 48894767 45309302 42132143 39307956 37016168 35153812 33712572 32535600
20551 32535600 31091936 29345947 28209490 27028570 25919973 25215540 24231088 23062429
20543 23062429 21871542 21185998 20623379 19700711 18800603 18536504 18632002 18058785 17211350
20534A7211350n69773l07063p38405p35938o16890m26540m63046p33861j87253
20525A2432581l33329m23009n83225j96226j859l16557l17287k70686n7831J26237
20515A0058809n72677m03851k67761k77547m01675l42373m34932o17967k35306
20506F504720j70856J39391J597k40782l44005n6697m29379P7241J17133l5781
20496E562582l80193j97965M8873j5115j32850o6565M1955k63924k08975q5608
20486D302215N5389L46287j5292l62465k56268l96994l6740l27836m8491L3612
20476C293417Q203J78988J34128p8728m82575J49187p7269k03170k52545l60517
20466B309119J431K85919j87976O3762m4186l19555k70683R9104j70013N2231
$$ plain form
20534 17211350 16641577 16334514 15596109 14860171 14243281 13816741 13353695 12619834 12432581
20525 12432581 12099252 11676243 11093018 10896792 10894933 10578376 10261089 9990403 9932572 10058809
20515 10058809 9486132 9082281 8814520 8536973 8135298 7792925 7357993 6740026 6504720
20506 6504720 6333864 6473255 6474852 6234070 5890065 5833368 5403989 5481230 5598363 5562582
20496 5562582 5182389 4984424 5033297 5018182 4885332 4818767 4860722 4596798 4387823 4302215
20486 4302215 4357604 4703891 4688599 4326134 4069866 3672872 3636132 3308296 3259805 3293417
20476 3293417 3301620 3480608 3614736 3536008 3053433 3202620 3125351 2922181 2669636 2309119
20466 2309119 2310550 2596469 2408493 2472255 2428069 2108514 1837831 1936935 1766922 1819153
20456A819153J15229j35905J09455J14029k51473J97453j90900m0944j52198j94338
20446A389561r8645k57863p4295M67151J84225l57386k83129J54133k17335l2981
20436H73436M3416K44442j21077k52606j66539j33056j34331o0007k21678J80279
20426B52279J59024O2207j26148q1399j56257j15661n5549L14801M71912r3537
20416F31672k89657l43744J87819R4404O4527J20651n0056j88907K60045M7317
20406E34071m8554J09332n5723K90177L16902j68147J39401j96078m55944q1859
20396C83578K0252L3149l78837k82258K74809q3808k67878M75358J87117j28886
20386B32596k81489j89755J2945M00355K77765k70735R7430L17537P5844J92563
$$ plain form
20456 1819153 1934382 1798477 1907932 2021961 1770488 1967941 1777041 1736097 1583899 1389561
20446 1389561 1290916 1033053 958758 1425909 1610134 1252748 969619 1123752 906417 873436
20436 873436 916852 1161294 1040217 787611 621072 488016 353685 293678 72000 252279
20426 252279 411303 473510 347362 265963 109706 -5955 -61504 253297 725209 631672
20416 631672 342015 -1729 186090 280494 345021 465672 415616 226709 486754 534071
20406 534071 485517 594849 539126 829303 1146205 978058 1117459 921381 465437 383578
20396 383578 403830 436979 58142 -224116 50693 -33115 -300993 174365 361482 232596
20386 232596 -48893 -238648 -225703 174652 452417 181682 279112 596649 672493 865056
20376H65056j64731p2825j1862o4054j9537l738m004R4759j93626J64614O2710
20365F52762j46373o481m14331k45356K61748O8646M1046K83777j95164j23935
20355A76339K21072L12050o3436k70484k3819K31026J67870R5513j50504j55015
20345E40612j80805j16237J42883R9125K06667r837l25543l40936J29613R0965
20335B36507k90132K5100J62524Q1925k7000K27546J02288M9417K50842K08264
20325A027281K77691K76652L5528j40850O8444o0274M66844J7614o9585r7803
20315A801542m3891L71725K67789n82463k66516j60276k9731l74400l3021j31804
20305H18954L76791j52272k67576k58585j11516k3600K0669J36532p6242J92899
$$ plain form
20376 865056 700325 627500 615638 551584 532047 528309 524305 619064 425438 590052 652762
20365 652762 506389 499908 85577 -159779 101969 170615 211661 495438 300274 176339
20355 176339 397411 709461 646025 375541 351722 582748 750618 846131 695627 540612
20345 540612 359807 243570 386453 485578 692245 682408 356865 15929 145542 236507
20335 236507 -53625 -28525 133999 215924 188924 416470 518758 568175 819017 1027281
20325 1027281 1304972 1581624 1617152 1476302 1544746 1484472 1951316 1968930 1899345 1801542
20315 1801542 1757651 2129376 2397165 1814702 1548186 1387910 1358179 983779 950758 818954
20305 818954 1195745 1043473 775897 517312 405796 382196 402865 539397 463155 656054
20295F56054n28380N9609L29970j46686l7246l975N6058p5024j09198j80964J54935
20284A75153L49706r4741j77766j61532K6797L54507n6810K2974q8780j49868
20274A99640k32741J28839P78593M28647K98307L16607L19908K29061M66623J00622
20264C034106n4645l48212n75485r2486l32227m67031j00613k54663J40957q990
20254I40711k05955k94599N9189J71576O629k84010j75524j75085j19395J12386
20244C5923Q3958N97810J86106k37359l05139l1746o8685j70942j82274J14786
20234B2438o1710o9611j22947k14552L74187j68318j92018K04346M9343o6815
20224b45657N7826M07594J21081j00144j60417N7559m36381l01592P4650L86772
$$ plain form
20295 656054 127674 187283 517253 370567 333321 329346 385404 310380 201182 20218 175153
20284 175153 524859 430118 252352 90820 117617 472124 415314 438288 349508 199640
20274 199640 -33101 95738 874331 1302978 1601285 1917892 2237800 2466861 2933484 3034106
20264 3034106 2979461 2631249 2055764 1963278 1631051 1164020 1063407 808744 949701 940711
20254 940711 734756 440157 499346 670922 677551 393541 218017 42932 -76463 35923
20244 35923 119881 717691 903797 666438 361299 329553 260868 89926 -92348 22438
20234 22438 -39272 -108883 -231830 -446382 -72195 -240513 -432531 -228185 -178842 -245657
20224 -245657 -187831 219763 340844 240700 80283 137842 -298539 -600131 -525481 -138709
20214a38709J93783l69788L52984j5251r818j11171M37576O9056l03381M5834
20204A51115K28443j75811p3677J25268J47525k07224o9681L26394m14525j84803
20194a46976J37285j23593j28626l6483j95913j81471K4723K39890r618J8443
20184d02339L37187M73450j06838m8174Q7955j56324J08871j13774j81481l29207
20174c30674K74864J492k63160K43437J54358N4958R7770J7320J44104k14486
20164A79983j07676R4869K78809R2902j84675L91194Q7641j09532k00560Q7272
20154F10227N61015j08158n53099K3813m14464k02053J98419J46752O7424j06730
20144B23146m1092K16119k06805p4798k06879k11156J57208M23799P2773j66905
$$ plain form
20214 -138709 55074 -314714 38270 23019 13201 -97970 339606 408662 105281 151115
20204 151115 379558 203747 130070 255338 402863 195639 125958 452352 37827 -146976
20194 -146976 -9691 -133284 -261910 -298393 -494306 -675777 -651054 -411164 -420782 -402339
20184 -402339 -65152 408298 301460 253286 341241 184917 293788 180014 -1467 -330674
20174 -330674 -55810 -54318 -317478 -74041 80317 135275 233045 250365 394469 179983
20164 179983 72307 167176 445985 538887 354212 745406 833047 723515 522955 610227
20154 610227 1171242 1063084 509985 533798 119334 -82719 115700 262452 329876 223146
20144 223146 182054 398173 191368 116570 -90309 -301465 -144257 279542 352315 185410
20134A85410j19412k63405j95158J3609K69379M67708j70630k99093m05275j52433
20124f69300L83027M06458j11236l9700K85263J68266J94253j15898n34636j24816
20114a58319j5035J25857J40590J1762L14817J15489k71113r7168r1312K19777
20104B95345J11804j65455j41667k53885k88177M12653J79395m73696O5457K82290
20094B4064q0728l33166J47536R9352j34014k77248J59915J22704J71854k80397
20084c80128R6472L14618p4615k43643l95263M45435J3651J90938L925N8726j60696
20073a30580J30024Q0191N1854J1826j89237n2930J02799p9351P6838L42221L4505
20062C78160J53939K66781L3782K9634K7297k67787k66065n65501l70728J24847
$$ plain form
20134 185410 65998 -197407 -392565 -378956 -109577 358131 187501 -111592 -516867 -669300
20124 -669300 -286273 120185 8949 -30751 254512 422778 617031 501133 -33503 -158319
20114 -158319 -173354 -47497 93093 104855 419672 535161 264048 166880 75568 295345
20104 295345 407149 241694 100027 -153858 -442035 -29382 150013 -323683 -258226 24064
20094 24064 -56664 -389830 -242294 -142942 -276956 -554204 -394289 -271585 -99731 -380128
20084 -380128 -283656 30962 -43653 -287296 -682559 -237124 -223473 -32535 -28610 30116 -130580
20073 -130580 -556 79635 131489 143315 -45922 -98852 3947 -75404 1434 343655 378160
20062 378160 532099 798880 832662 862296 889593 621806 355741 -209760 -580488 -455641
20052d55641J59968M66348J75967P5902J796j45816J43869K85678l69440l43367
20042d736j43563L51086j278N4764K46225j04839j43989L9795j45408N6042j97397
20031F702j57246J83177J79922L1662J8839J41645K80628K33030j20432k24765
20021E73162l54514R7139j882j14617j07870j08585M7408M06167K193m33265k03223
20010a97887J83656l42205l27263Q5945L39902K89383P6481J98554O1648L5269
20000D03483j70720k37936J22541N3749N06676N91422K4800r3196j55015j35664
19990I10140J46717j60449j25805j7245j75360l0241K82947M73850K22336n6408
19980A470482j04962k15562k81634L6780l7343J61821J48107q2246m90117m30531
$$ plain form
20052 -455641 -295673 170675 346642 422544 424340 278524 422393 708071 338631 -4736
20042 -4736 -148299 202787 201509 256273 502498 397659 253670 293465 148057 204099 6702
20031 6702 -150544 32633 212555 244217 263056 404701 685329 918359 797927 573162
20021 573162 218648 315787 313905 199288 91418 -17167 30241 436408 438601 5336 -197887
20010 -197887 -14231 -356436 -683699 -597754 -257852 31531 108012 306566 368214 403483
20000 403483 232763 -5173 117368 171117 677793 1269215 1294015 1200819 1045804 910140
19990 910140 1056857 896408 770603 753358 577998 547757 830704 1304554 1526890 1470482
19980 1470482 1365520 1149958 868324 905104 867761 1029582 1177689 1095443 605326 174795
19970A74795J31115K09647N5066n868l4838j6611k97074R9415J83321r8227l11463
19959H9278J2805J12877L54576L0390j75821q6384K18910p1404j12927o0954P9760
19948C91106n4222n6087L1484n3515p3764k34526M8309J33406r551p381K11545
19937C26804j63594l57937M33003j20602j49829k29407K97121K27045J71245K22536
19927F56385k2188k49534p5640K61876P0013M4491J01277K05469J33671k11761
19917I14059k91091R6954J24447k47616p6305k45725J46222J06901O4199n73767
19907A8278k92670P1791J33942j34553j27885L02689L64171k23191J90295L1525
19897C34392k32384J79462O8700P8832j08454j22880N5229P4197K07103J16289
$$ plain form
19970 174795 305910 515557 570623 564755 529917 513306 216232 315647 498968 400741 89278
19959 89278 102083 214960 569536 599926 424105 337721 556631 485227 372300 311346 391106
19948 391106 336884 280797 312281 258766 185002 -49524 -1215 132191 122640 115259 326804
19937 326804 163210 -194727 238276 117674 -32155 -261562 35559 262604 433849 656385
19927 656385 634197 384663 309023 570899 640912 685403 786680 992149 1125820 914059
19917 914059 622968 719922 844369 596753 520448 274723 420945 527846 592045 18278
19907 18278 -274392 -202601 -68659 -203212 -331097 -28408 335763 112572 302867 334392
19897 334392 102008 281470 350170 429002 320548 197668 252897 327094 534197 650486
19887F50486m22918m83857J89096k71008M7573K43845r033K5716q6210O144l87409
19876d97575J31916M16358N34708R8250l67708l33171J6916M00329J28392O768
19866E35183k2837k35137l16709j23386J52833J11225k02049q6995J3998J63453
19856a0421k5617J1554L48425J24614Q7037L6317J6376K3053j10398p5243O7369
19845D93066J5887J44080l6208O3897j707m5438P9443j09405k21551k1097l02912
19834E8055L77056J74729p0392K998k8094o2001k93839l26494p0085l3028L91335
19823A20240L05255j73674m52009j67945J69943L6364J89305J13149J82528l15916
19813G240L7197N34794M02451J53732l2379m02287j44928O5244R9154L5742K42234
$$ plain form
19887 650486 227568 -256289 -67193 -338201 -290628 -46783 -55816 -30100 -116310 -110166 -497575
19876 -497575 -365659 50699 585407 683657 315949 -17222 -306 400023 528415 535183
19866 535183 512346 277209 -39500 -162886 -10053 101172 -100877 -187872 -173874 -10421
19856 -10421 -36038 -24484 323941 448555 535592 571909 588285 611338 500940 425697 493066
19845 493066 508953 653033 616825 680722 679015 633577 713020 603615 382064 360967 58055
19834 58055 435111 609840 539448 542446 514352 452351 158512 -167982 -238067 -271095 120240
19823 120240 425495 251821 -200188 -368133 -198190 -161826 27479 140628 323156 7240
19813 7240 44437 579231 981682 1135414 1103035 700748 555820 621064 720218 755960 998194
19802I98194L47738L11590J7230j84357l80944j39143j22506J15844l29377k65826
19792C68443J69319L47318K77032J98883J46874j30757K30091j27916n93698k72034
19782F13555k9957O5986m1522r945J61976J04716k12875q4100L34672L10866L1931
19771A245303l52206o2606J19972m9355O6826j49670j13289Q5425n0892l8145
19761G01363M70112K56860J37206j50850L4631J26288O0250J39101m645j49871
19751A620445n138K95767M57579K19249O9660o72864o96715m66066o5547L44511
19741A100881P1379k23760n6223K74909M64770L58321j29997J1675p0354n50727
19731A250874m53970J73249j28595j93613n3001m3698j95436j71437K10186L27962
$$ plain form
19802 998194 1345932 1657522 1674752 1490395 1109451 970308 847802 963646 634269 368443
19792 368443 537762 885080 1162112 1360995 1507869 1377112 1607203 1479287 885589 613555
19782 613555 583598 649584 608062 598117 760093 864809 651934 567834 902506 1213372 1245303
19771 1245303 893097 830491 950463 901108 967934 818264 704975 790400 739508 701363
19761 701363 1171475 1428335 1565541 1414691 1449322 1575610 1635860 1774961 1770316 1620445
19751 1620445 1615307 1911074 2368653 2587902 2657562 1984698 1287983 821917 756370 1100881
19741 1100881 1172260 948500 892277 1167186 1631956 1990277 1860280 1871955 1801601 1250874
19731 1250874 796904 970153 841558 647945 594944 551246 355810 184373 394559 722521
19721G22521j46549J42613M70087J09284L6616j79803r8423k61277l49644j53109
19711B92316k8026J76089J25472J21665n6565Q3566K68696l52916k91444J29353
19701D68206l00758k29613P555K56483M12325K9268l92240k26887K10207K56422
19691D90968L17231J19j52628N0338p9638K90069k62317m53560j03675J50399
19681B47306J67621q0287j13583L56972Q4487j28771k37293j77427L12324k50348
19671A81001m09012O7128K28528n6999j6230l9679L7427j7007L17897Q7707k58293
19660A22468L6792M66491K686k38720m35529j73413K3851j65786o9978N70317
19650A39179M07156k26733L14705J90477j25761k93176j67782Q3521j36041j91018
$$ plain form
19721 722521 575972 718585 1188672 1297956 1334572 1154769 1056346 795069 445425 292316
19711 292316 264290 440379 565851 687516 630951 714517 983213 630297 338853 468206
19701 468206 167448 -62165 -54610 201873 614198 643466 251226 24339 234546 490968
19691 490968 808199 808318 655690 706028 626390 916459 654142 200582 96907 247306
19681 247306 414927 334640 221057 578029 662516 533745 296452 119025 431349 181001
19671 181001 -228011 -160883 67645 10646 -5584 -45263 -7836 -24843 293054 380761 122468
19660 122468 159260 625751 628437 389717 -45812 -219225 -195374 -361160 -431138 139179
19650 139179 546335 319602 634307 824784 699023 405847 238065 321586 185545 -5473
19640e473P6742P1149N4530j91785q6933j40420l6297J14462J21703K05028m940
19629A77766o0226J5091q0705J47740K50431k92297l07608J2700L90675L80218
19619F33785J90850k28666m53995l09512q3235L31217J18165l4091J17659m32857
19609a50680q0925J40097J53640j4586K88759J55059j58108m02004j27620P4321
19599a22047j04949J40610n4138O8105K11431R1345j44717N29814m54360k57453
19589i6359J25905P307j56494j72463k41447K48742p4301K53771q588r3357L50201
19578A42917j05525J40903J476m18278j74347M2764j87273R8857M69567J22113
19568A33174J00027N83325M64066o94293j43113l5914j22944J48426l62110l75214
$$ plain form
19640 -5473 71269 142418 196948 5163 -81770 -222190 -258487 -144025 -22322 182706 177766
19629 177766 117540 132631 51926 199666 450097 157800 -149808 -137108 253567 633785
19619 633785 824635 595969 141974 -167538 -250773 80444 198609 164518 282177 -150680
19609 -150680 -231605 -91508 62132 47546 336305 491364 333256 -68748 -196368 -122047
19599 -122047 -226996 -86386 -140524 -72419 139012 230357 85640 615454 161094 -96359
19589 -96359 29546 36853 -119641 -292104 -533551 -284809 -359110 -105339 -113927 -207284 142917
19578 142917 37392 178295 179771 -238507 -412854 -370090 -557363 -458506 11061 133174
19568 133174 233201 816526 1280592 586299 443186 407272 284328 432754 70644 -304570
19558c04570M9031j60498J3094L16299K49975J69206J76538R8958M8975r7144
19548E59864j42890m6371J4438l28869j60265J55384J86050k63426J0896M21056
19538D05867K40563M2940K27272K37466J69122r071j61463N63499L07499l96826
19528A626868o26885j986n4136j54426q1607J5072q0271K01142J06085J88614
19518A138470M8134k2915J30515k44069k20100J68427J44588J20677k49925j25643
19508H88159k64042j78743j71593o1789J45182k35270o6033J10536L46727J35023
19498F48157j93511j05009K50516k97955R4041L86979K09567n55542j93784j84675
19488E8784k7337J67477L64631M53916J09348Q8133M80050K74230n6459J5429
$$ plain form
19558 -304570 -255539 -416037 -402943 -86644 163331 332537 509075 608033 657008 559864
19548 559864 416974 370603 385041 56172 -104093 51291 237341 -26085 -15189 405867
19538 405867 646430 689370 916642 1154108 1323230 1314159 1152696 1716195 2023694 1626868
19528 1626868 999983 997997 943861 789435 707828 722900 642629 843771 949856 1138470
19518 1138470 1186604 1163689 1294204 1050135 830035 998462 1143050 1263727 1013802 888159
19508 888159 624117 445374 273781 211992 357174 121904 55871 166407 513134 648157
19498 648157 454646 349637 600153 302198 396239 783218 992785 437243 243459 58784
19488 58784 31447 198924 563555 1017471 1126819 1214952 1695002 1969232 1912773 1928202
19478A928202p3747k16867K01297q2501p3327r1893Q3661J61052L11355R0766
19468B237998q3418k63128J56134K80953P785l39357k81073k50370o61417m03825
19458D00282K18846n861J71472k10905R5872r9746j42827K76070O6108j88204
19448E81107J80180J29433l25901k54044K98838N20417j08034l18443l3258j38918
19438E31377k57922J71026K29070L897j26295k35071j54023L29739J5875K3458
19428E31131N7036k41231L33047j42025J77660L65643L18038K54659L08940j34463
19418A828435m46633k69629J2951J55671j42557q6187k0020O7591N4993j47615
19408A007000q6245j40461q1532j65176K32229l8937j86942L6258P5981n4495
$$ plain form
19478 1928202 1854455 1637588 1838885 1756384 1683057 1591164 1674825 1835877 2147232 2237998
19468 2237998 2154580 1891452 2047586 2328539 2336324 1996967 1715894 1465524 804107 400282
19458 400282 619128 613267 784739 573834 669706 569960 427133 703203 769311 581107
19448 581107 761287 890720 564819 310775 609613 1130030 1021996 703553 670295 531377
19438 531377 273455 444481 673551 677448 551153 316082 162059 491798 507673 531131
19428 531131 588167 346936 679983 537958 715618 1081261 1399299 1653958 1962898 1828435
19418 1828435 1381802 1112173 1125124 1280795 1138238 1052051 1032031 1099622 1154615 1007000
19408 1007000 920755 780294 698762 533586 765815 726878 539936 576194 652175 597680
19398E97680k37724J88305k04117j91744k1267O2052L1946k25156J57058J26664
19388B83697k93384J60834K53043j24734M1568j70108J01507N09633k5743L1477
19378G67790j3770k41154J00647L5687o7551L71213P4814J0374p713k27674j83396
19367F19267k59697k8121j94125r0927k6726k3858K88062J11567j69691J91773
19357D17524L8370j89727j3654j90675J44647Q6319k05369j20798L9284L04815
19347C10736O7840j25123J1798K86368m5723J14278J90960K88081j7626m2101
19337A039488k9163k12340m01905L95372L44452m18882l67029l07776Q2024P3405
19327A97646L08243L7960K77591j973k07340m7015K54681M22347P8750L42914
$$ plain form
19398 597680 359956 548261 344144 152400 131133 193185 225131 -25 157033 283697
19388 283697 -9687 151147 404190 279456 321024 150916 252423 762056 736313 767790
19378 767790 754020 512866 613513 649200 581649 952862 1027676 1038050 1030337 802663 619267
19367 619267 359570 331449 137324 46397 19671 -4187 283875 395442 225751 417524
19357 417524 455894 266167 252513 61838 206485 292804 87435 -33363 5921 310736
19347 310736 378576 253453 265251 551619 505896 620174 811134 1099215 1081589 1039488
19337 1039488 1010325 797985 396080 791452 1135904 717022 349993 42217 124241 197646
19327 197646 505889 543849 821440 819467 612127 565112 819793 1242140 1320890 1663804
19317A663804J76066P5712J6895J86408J10082L79870J54846K348m5611k1925
19307B698495R6058j71903R338p3388K6431J40078K40448J39899j49815k26566
19297B729075l06236j79260l03272l0524J26555K97271J83050o2159o4410l03432
19287B086658l25791K21264L37474K44502L6283N7706k85780k30481P9993J14272
19277B336100N8807r4994l5030J74829L35467O7811K22718N49089K0951j24336
19267C511412J04795M47283K92626j2237Q3358M45956M48494M69203M82932K23968
19257F497790P20560J012410P49195J173647J469936J500473K190717L702819
19249A9017547N276140Q530416J3418306J6963150J4162212J0676903J6956896
$$ plain form
19317 1663804 1839870 1915582 1932477 2118885 2228967 2608837 2763683 2766031 2720420 2698495
19307 2698495 2794553 2622650 2631988 2558600 2585031 2725109 2965557 3105456 2955641 2729075
19297 2729075 2422839 2243579 1940307 1909783 2036338 2333609 2516659 2454500 2390090 2086658
19287 2086658 1760867 1982131 2319605 2564107 2600390 2658096 2372316 2141835 2221828 2336100
19277 2336100 2394907 2299913 2264883 2439712 2775179 2842990 3065708 3614797 3635748 3511412
19267 3511412 3616207 4063490 4356116 4343879 4427237 4873193 5321687 5790890 6273822 6497790
19257 6497790 7218350 8230760 8979955 10153602 11623538 13124011 15314728 19017547
19249 19017547 24293687 32824103 46242409 63205559 77367771 88044674 105001570
19242A05001570J6974208j1702265k7664019j9864952j0808636m546104r23890
19235D6465912K544708O709200J2278960J3981590R813713J1392917J7737163
19228A20924163K915457k5544623k6050719j6525908r900299o465439m692958
19221C4659674l274217k543797j801515j637815j457078q18067q22557j051672
19213B1252956n93935k38937l55096n72506o82547j44091M60192M63030O2490
19204A9651556J33080N94443P96965R11388J629451K168467L204616N081168P608410
19195D1779544J1742717J8381217K3685388K0072932J5219450K4248222K1668036
19188A76797506j8423004l9186225k7607283j4448838o244158j179491L566559
$$ plain form
19242 105001570 121975778 110273513 82609494 62744542 51935906 47389802 46465912
19235 46465912 49010620 55719820 67998780 81980370 91794083 103187000 120924163
19228 120924163 123839620 98294997 72244278 55718370 45818071 39352632 34659674
19221 34659674 31385457 28841660 27040145 25402330 23945252 23127185 22304628 21252956
19213 21252956 20659021 20420084 20064988 19492482 18809935 18665844 19126036 19589066 19651556
19204 19651556 19784636 20379079 21176044 22087432 23716883 25885350 29089966 34171134 41779544
19195 41779544 53522261 71903478 95588866 115661798 130881248 155129470 176797506
19188 176797506 158374502 119188277 91580994 77132156 70887998 69708507 73275066
19181G3275066J0402020J7258353J9282012J3693001J6212490K4437325P58624
19174A75318891l7476580l6769112k2550691j3681505q918374o577583n330634
19167D4014412m151237l209551k450052j965955k019659k164787j645348j099773
19159B5308050r83814j179418j170962r68282j185197j086440p08305n33172r23395
19150A6569065r11658n96293l98887q31398p47343m16292j19191n46062n9396
19141A1942545J07360n0076o89309m43553l99624O2321n6969n66750k88084k27771
19131I390090j8258l96399l46464k13288l10416K00684k52190n15100q12568j89628
19121F536463O3303J37933K4567j09140j9566r2266q4677j50850k41263k64883
$$ plain form
19181 73275066 83677086 100935439 120217451 133910452 150122942 174560267 175318891
19174 175318891 137842311 101073199 78522508 64841003 55922629 49345046 44014412
19167 44014412 39863175 36653624 34203572 32237617 30217958 28053171 26407823 25308050
19159 25308050 24324236 23144818 21973856 21005574 19820377 18733937 18025632 17492460 16569065
19150 16569065 15657407 15061114 14662227 13830829 13083486 12667194 12548003 12001941 11942545
19141 11942545 12049905 11999829 11310520 10866967 10467343 10529664 10472695 9905945 9617861 9390090
19131 9390090 9371832 8975433 8628969 8415681 8105265 8305949 8053759 7538659 6726091 6536463
19121 6536463 6599766 6737699 6762266 6653126 6633560 6541294 6456617 6305767 6064504 5799621
19111E799621k18745j22569k94021k25316j68156j22663l94581L5824J78093j42677
19101D324810k72175m37850o12515J78188L43419k38168k58150j07505j36363
19092B783691P7504L7138q1412O3117J58313p8751j22782k39461k9499K28151
19082B796009k78916l2914k17417r5349K17054J07727J2508P873l53675j0750
19072B152150J1490J63834j37201J05886K62414k53867j04370P1364M5987k36030
19062B081657n4414j22658L5819m6536q3307j25811J36677j55804j71916J75710
19052A669417J36603K7269j28769J9080p3908l41214k55903K35107Q3773k08504
19042A162951P7300J35984m0922J32112j11530k23952N5571Q5561j36314j46426
$$ plain form
19111 5799621 5580876 5458307 5164286 4938970 4770814 4648151 4253570 4289394 4467487 4324810
19101 4324810 4052635 3614785 3002270 3180458 3523877 3285709 3027559 2920054 2783691
19092 2783691 2861195 2898333 2816921 2880038 3038351 2959600 2836818 2597357 2567858 2796009
19082 2796009 2517093 2484179 2266762 2171413 2388467 2496194 2508702 2516575 2162900 2152150
19072 2152150 2163640 2327474 2190273 2296159 2558573 2304706 2200336 2271700 2317687 2081657
19062 2081657 2027243 1904585 1940404 1893868 1810561 1684750 1821427 1665623 1493707 1669417
19052 1669417 1806020 1833289 1704520 1723600 1649692 1308478 1052575 1287682 1371455 1162951
19042 1162951 1240251 1376235 1335313 1467425 1355895 1131943 1187514 1273075 1136761 990335
19032I90335k53370J03538J39600p9075J06018j2319m558K77802J52092k8707
19022A391356K05342M07223L8774m21725j30188K8595j6304k77797n6225R0087
19012A259138K70524j35329j34878j02202l928J49510M09634K63559r9884k17133
19002A659011j32785m5881J15482J58492J4824M6144o3779r3156K79921K05063
18992B143336j95750l39203o2199L42534J96970J266K70725P8411j68299J08340
18982B376131J34755R7673L72376J89755k06132r4443K18837J80846N6042L7114
18972C362954J32545J72058R2888J41905J73371J74305J14582J79626L90738P86805
18962E721777K47747K50736J87545M34263P07108K76648J81643M59239O81800
$$ plain form
19032 990335 736965 840503 980103 901028 1007046 994727 990169 1267971 1420063 1391356
19022 1391356 1596698 2003921 2042695 1620970 1490782 1519377 1503073 1225276 1169051 1259138
19012 1259138 1529662 1394333 1259455 1157253 1153325 1302835 1712469 1976028 1876144 1659011
19002 1659011 1526226 1480345 1595827 1754319 1769143 1815287 1751508 1658352 1938273 2143336
18992 2143336 1947586 1608383 1546184 1888718 2085688 2086954 2357679 2436090 2267791 2376131
18982 2376131 2510886 2608559 2980935 3170690 2964558 2870115 3088952 3269798 3325840 3362954
18972 3362954 3495499 3667557 3760445 3902350 4075721 4250026 4364608 4544234 4934972 5721777
18962 5721777 5969524 6220260 6407805 6842068 7549176 7825824 8007467 8466706 9148506
18953I148506J209550J346070J466710J870283K836567L325623M463893O040444
18945C1707646Q493987J2672920J7986691K2672139K3944433K4180281K7421227
18938A69079324K5535293R862477o774118j0831190l221596N597457J084815j7435392
18930A72897070l3207255l2786892k2681742j3837314r474982p116797n942363
18923D7849725m852457l888168l583044k698315j984136j859541j779128j236548
18915B5968388j088667n66046l39661k68744m39199j50917k31223o99220k09788
18906B1974923j41617j70241n08001l15021j44600K85477J63720K71282J41586
18897B1557508N60458J205227J896638L111611L917893N907080R109894J2644505
$$ plain form
18953 9148506 10358056 11704126 13170836 15041119 17877686 21203309 25667202 31707646
18945 31707646 40201633 52874553 70861244 93533383 117477816 141658097 169079324
18938 169079324 194614617 204477094 197702976 186871786 183650190 189247647 190332462 172897070
18930 172897070 139689815 106902923 84221181 70383867 60908885 53792088 47849725
18923 47849725 42997268 39109100 35526056 32827741 30843605 28984064 27204936 25968388
18915 25968388 24879721 24313675 23974014 23705270 23266071 23115154 22883931 22184711 21974923
18906 21974923 21833306 21663065 21155064 20840043 20695443 20980920 21144640 21415922 21557508
18897 21557508 22117966 23323193 25219831 28331442 32249335 38156415 47266309 59910814
18889E9910814J5463572J6427954J7250607J9694407J7188099N782128n705235
18882A46012346p924853k217017M077380J05070j3976008k4712211k3277907j5712678
18874F2374122r582773o288495m910459m321582l699942k993341k280179j951110
18866B6346241j371795j403080j426840r70262r85754j016711o28071p94982q71473
18857A6877273m41924J8726j24297k86276j22566m44801o33125n77238p45359
18848A3520413o84895k88464l76537n73276m11299m12497n59909o43484j92128
18839I377924j74610l29133l69948k53454l39069j59586J88942m65435k57103
18830G218528j70676k2128k46354J528k36542m00832l6643r4909p212j57999m495
$$ plain form
18889 59910814 75374386 91802340 109052947 128747354 145935453 151717581 146012346
18882 146012346 138087493 135870476 139947856 140052926 126076918 101364707 78086800 62374122
18874 62374122 52791349 46502854 41592395 37270813 33570871 30577530 28297351 26346241
18866 26346241 24974446 23571366 22144526 21174264 20188510 19171799 18543728 17748746 16877273
18857 16877273 16435349 16454075 16329778 16043502 15920936 15476135 14843010 14265772 13520413
18848 13520413 12835518 12547054 12170517 11597241 11185942 10773445 10213536 9570052 9377924
18839 9377924 9203314 8874181 8504233 8250779 7911710 7752124 7941066 7475631 7218528
18830 7218528 7047852 7025724 6779370 6780898 6544356 6143524 6106881 6011972 6004760 5846761 5842266
18819E842266k66027M6926P3098j59517o8192j67753k8241j37003l93950J5884
18809D757491J1599k62618l73711j79101j63962k57320r6667L93110p4095m293
18799C750433K61042J3962k98517j44820r9989r9768J75825k32264m40137k19986
18789B665781m5196k14978k60580M0030L06327J30843J3665L28287K15427m27310
18779B752296p2065O5107n6270n11997J96017N20924N7015p3610K27668L80035
18769C485120Q6307R7749L02915M45554l38958p29649k07704l64987m40589R1499
18759B427257j57380k22277M82256P7709j99562j3254j55306l66826m15848K1529
18749A478298J26835J56538R6028K29732K30003j70220q1082p7653k33123M0018
$$ plain form
18819 5842266 5576239 5623165 5696263 5536746 5468554 5300801 5272560 5135557 4741607 4757491
18809 4757491 4769090 4506472 4132761 3953660 3789698 3532378 3435711 3828821 3754726 3750433
18799 3750433 4011475 4025437 3726920 3582100 3482111 3382343 3558168 3325904 2885767 2665781
18789 2665781 2620585 2405607 2145027 2185057 2491384 2622227 2635892 2964179 3179606 2752296
18779 2752296 2680231 2745338 2689068 2177071 2373088 2894012 2951027 2877417 3105085 3485120
18769 3485120 3571427 3669176 3972091 4417645 4078687 3349038 3141334 2776347 2335758 2427257
18759 2427257 2269877 2047600 2529856 2607565 2408003 2394749 2239443 1872617 1456769 1478298
18749 1478298 1605133 1761671 1857699 2087431 2317434 2147214 2066132 1988479 1755356 1795374
18739A795374K68229L90487l40548n51921l24253K53813J93323K5766n6521M109
18729A657858K07982k17727p7866K01862J82014J57334n2613k2111O08425K32389
18719B877547k4426N83247L45151j28475K65689J45845O6184J72086J40422j92318
18709D250952J04416N14918K11532p1954L28744P89195K66599L31998P29290J24494
18699G580184m50769k96571L82692O98037K47531K50248N86914N69782P70706
18690A0338754R91787M24897J043376J337478J088019J101544J355699K314048
18682A9995602L306872L948593N507918P934273J2616885J8251485K1649797K0744169
18674A13955594K2549944L1369264K7342463M245125j0441056l255714J2884678
$$ plain form
18739 1795374 2063603 2454090 2113542 1561621 1237368 1491181 1684504 1710270 1653749 1657858
18729 1657858 1865840 1648113 1570247 1772109 1954123 2111457 2058844 2036733 2645158 2877547
18719 2877547 2853121 3436368 3781519 3653044 3918733 4064578 4130762 4302848 4443270 4250952
18709 4250952 4355368 4870286 5081818 5009864 5338608 6127803 6394402 6726400 7455690 7580184
18699 7580184 7129415 6832844 7215536 7913573 8161104 8411352 8998266 9568048 10338754
18690 10338754 11330541 11755438 12798814 14136292 15224311 16325855 17681554 19995602
18682 19995602 23302474 27251067 32758985 40693258 53310143 71561628 93211425 113955594
18674 113955594 136505538 167874802 195217265 199462390 189021334 185765620 198650298
18667A98650298J4898328m556572j4738926p597874L332405J7490912K1232006
18660B28710577Q10328j7886320j4827633o26569K869429j8385963l6799555l2044373
18652A11819921k0708261j2825385q765812o639296n665080m681517l664008k850278
18644D6020284k457035k200751k339807j368811j385677j635143j418824j079481
18636C2134755j069289j207429j287125r96718r13633p09397n83571l05853q80632
18627B4181108p15214o52202l09521n03733j114868r52490o76113p48244q11853
18618A7696870q08770o24531n73744n12630o16717p31718n04577n93606n05474
18609A2225103O1222m9877m02303m62850m34105m14938m52794k43377o33781J02031
$$ plain form
18667 198650298 213548626 208992054 194253128 186655254 189987659 207478571 228710577
18660 228710577 229520905 211634585 196806952 196180383 199049812 180663849 143864294 111819921
18652 111819921 91111660 78286275 69520463 62881167 57216087 52534570 48870562 46020284
18644 46020284 43563249 41362498 39022691 37653880 36268203 34633060 33214236 32134755
18636 32134755 31065466 29858037 28570912 27574194 26660561 25951164 25367593 25061740 24181108
18627 24181108 23465894 22813692 22504171 22000438 20885570 19933080 19256967 18508723 17696870
18618 17696870 16888100 16263569 15689825 15177195 14560478 13828760 13324183 12730577 12225103
18609 12225103 12286325 12236448 11834145 11371295 10937190 10522252 10069458 9826081 9192300 9294331
18599I294331l58803n27610o04194o5466J14534j98776P8965l42803j92446j3273
18589G184459K9919k07897k65093l06172l22294o0178J01939j37515o22320m17549
18579D977299J8494K8196j26204n37843m6464K32721M0363j97051j94362k32423
18569C962726j24915N3013k4587j12641J5632l5715j4719Q3943l91360l33648
18559C077729l3699M30176O4324n1770J1872l74042Q4966j67028k62458q261n6028
18548B715781j00228l25441p4177J2846q2669j28089j8493j34609l13778K25936
18538A777079K49289m84472l90002Q883K5126K2376l0787j47961j21116P7836
18528I86251K19718j76242n49N9683j50950J54105K6079k24388j82456j22182
$$ plain form
18599 9294331 8935528 8407918 7803724 7738258 7852792 7654016 7732981 7390178 7197732 7184459
18589 7184459 7214378 7006481 6741388 6435216 6112922 6052744 6154683 6017168 5394848 4977299
18579 4977299 4995793 5023989 4897785 4359942 4313478 4546199 4586562 4389511 4195149 3962726
18569 3962726 3837811 3890824 3866237 3753596 3769228 3733513 3718794 3802737 3411377 3077729
18559 3077729 3044030 3474206 3538530 3486760 3498632 3124590 3209556 3042528 2780070 2771809 2715781
18548 2715781 2615553 2290112 2215935 2228781 2146112 2018023 1999530 1864921 1551143 1777079
18538 1777079 2026368 1541896 1151894 1160777 1185903 1208279 1177492 1029531 908415 986251
18528 986251 1205969 1029727 1029178 1088861 937911 1092016 1118095 893707 711251 589069
18518E89069M15858l1070m13148n02647q7086L15877l1955r2076O094P7015k665
18507B43266J04594k31919J0140K08084m7632N38632O9482Q4027j08655n3400
18497H16619L9543k98569k68763R4134J91750K47433k54365m46302L56726J38605
18487F16811j53228l87045l25095L04128l988L76612j27262m85045J40931M91488
18477D48307L20569p8707J41406N9712K059k76925k96398j73068m2603L64707
18467D69059K37477J965j42523l21206k22922J23375L31390K83666J6606r307
18457G67580j45321l11099M3588m2964Q8078K53438j62347o4375M9496J1514K552
18446D90140k7198j35505J40625K72966J27131m54090j14906Q1402J54293j07997
$$ plain form
18518 589069 1004927 973857 560709 58062 -29024 286853 254898 162822 168916 245931 243266
18507 243266 347860 115941 126081 334165 286533 825165 894647 978674 870019 816619
18497 816619 856162 557593 288830 382964 574714 822147 567782 121480 478206 616811
18487 616811 463583 76538 -248557 55571 51583 428195 300933 -184112 -43181 448307
18477 448307 768876 690169 831575 891287 893346 616421 320023 146955 104352 469059
18467 469059 706536 708501 565978 244772 21850 145225 476615 760281 776887 767580
18457 767580 622259 311160 354748 311784 399862 653300 490953 426578 476074 487588 490140
18446 490140 462942 327437 468062 741028 868159 414069 299163 380565 534858 426861
18436D26861k06413J21979j19211p482j13780m56479K59051M47896K95656j96183
18426D51895j09242J26716J1956J10994k2508l82199j29054n5889J75728N28910
18416G07307J32632k37316m17176J83949K29071L5196l38363L06638K70490K48221
18406A120649J38639M2160L57677J55257p2757o1037J59600k1312k99924j85004
18396A333948k20904J1059j1564n8527k09533m40516j16358N2303m2568j81089
18386A16251L82203J68813J35128P0760k0889N7357J58266k39575K5074j53507
18376F99881J01961J98157K31481k90342m95787l0539M01533J30347R173k52022
18366G03843l50840j44519l8441k73368j30873K46337J4976l1727K11579R3786
$$ plain form
18436 426861 220448 342427 223216 215734 101954 -354525 -95474 352422 648078 451895
18426 451895 342653 469369 481325 592319 569811 187612 58558 2669 178397 707307
18416 707307 839939 602623 185447 369396 598467 633663 295300 601938 872428 1120649
18406 1120649 1259288 1301448 1659125 1814382 1741625 1680588 1840188 1818876 1518952 1333948
18396 1333948 1113044 1124103 1112539 1054012 844479 403963 287605 339908 297340 116251
18386 116251 498454 667267 802395 873155 852266 909623 1067889 828314 853388 699881
18376 699881 801842 999999 1231480 941138 445351 414812 816345 946692 955865 703843
18366 703843 353003 208484 170043 -103325 -234198 12139 27115 -4612 206967 300753
18356C00753J49760R8811l10125O24434J39840k98909l0246p1554L671K34475
18346H40910j49000l0861M6048J00360p6020J23554L7069q4458l62249j29687
18336C15666P6840j86125j46106k21868N9345J00520L29521N78934J21576o67969
18326C60334K8813K97147K62187L32433j36049o1209j46544m9027N9917j20581
18316H27421k18088N3037J79944J7785j11950k50540J5377j52844M1428M39483
18306H41053k1348q3994J10185m98202o90776K27238J14102J11883R6763j67901
18296C9003o0840J3748L7256J99349j21092j11571J14751L6335K64605j00079
18286C11465l82836L95389L77733j07790p2158J46586r931l69612m87188q4893
$$ plain form
18356 300753 450513 549324 239199 863633 1003473 704564 674318 602764 606435 840910
18346 840910 691910 661049 707097 807457 731437 854991 892060 807602 445353 315666
18336 315666 392506 206381 60275 -161593 -102248 -1728 327793 906727 1028303 360334
18326 360334 389147 686294 948481 1280914 1144865 1083656 937112 888085 948002 827421
18316 827421 609333 662370 842314 860099 748149 497609 512986 360142 401570 841053
18306 841053 819705 735711 845896 347694 -343082 -115844 -1742 110141 206904 39003
18296 39003 -21837 -8089 29167 228516 107424 -4147 110604 146939 411544 311465
18286 311465 -71371 324018 701751 593961 521803 668389 658458 288846 -198342 -283235
18276b83235K39623M054k29765K7592P1472J73211M58717L95525L39289M9874
18266A246357m08830m71764k92589L8393O5140K30566m6262m24443Q7851m2768
18256a8349K04959O281l01368Q2349K23909K36119k51077j64356O3057m8203J11860
18245A45181L49705K33880k53630m0075K97988j33373k69424M8148K20976L48011
18235I47387K72245k98311k16046J20333J31716j58174O4078J5146L2068j85035
18225G25407n812M51079J03472M2457j05782K5702j76901M5172k47781J94612
18215A051625J31631J35334j76899K2122K18006K94898j40367m26814j00544J50211
18205A159203q3745J40690k09727r7605J52372L99818J60231j6472l8827J31149
$$ plain form
18276 -283235 -43612 -39558 -269323 -241731 -170259 2952 461669 857194 1196483 1246357
18266 1246357 837527 365763 73174 111567 176707 407273 361011 -63432 24419 -18349
18256 -18349 186610 192891 -108477 -26128 197781 433900 182823 18467 81524 33321 145181
18245 145181 494886 728766 475136 435061 733049 599676 330252 378400 599376 947387
18235 947387 1219632 921321 705275 825608 957324 799150 863228 878374 910442 725407
18225 725407 719595 1170674 1274146 1316603 1210821 1236523 1059622 1104794 857013 1051625
18215 1051625 1183256 1318590 1141691 1163813 1381819 1676717 1536350 1109536 1008992 1159203
18205 1159203 1075458 1216148 1006421 908816 1061188 1461006 1621237 1604765 1565938 1697087
18195A697087j83700k0462J90404j33128P3973k65519R4345j8537Q302N1679J33675
18184A628119R7258o2112J73727K28524m7822l75967j22478P736k30039j72275
18174A124671L13899M0746Q3474l7499o7720J74712J23270J62281K52076j68420
18164B001490k6867q1859J26482K47457K60200J08195K68343J33674K73890N8052
18154C369057K13196Q5913K6359n2404L11847J6035n8249n1537M36918J05421
18144D402556l09942m42849m2851P04502M44417M5235j66908L09427N71956N27529
18134F043072n8715J51922O00715O83743N27311M11765R47236J185615J104744
18125A1597408J093184J080377J653620K512122K755214L589387M307361N583584
$$ plain form
18195 1697087 1513387 1492925 1683329 1550201 1624174 1358655 1453000 1434463 1442765 1494444 1628119
18184 1628119 1725377 1663265 1836992 2065516 2017694 1641727 1519249 1526985 1296946 1124671
18174 1124671 1438570 1479316 1562790 1525291 1457571 1632283 1755553 1917834 2169910 2001490
18164 2001490 1974623 1892764 2019246 2266703 2526903 2635098 2903441 3037115 3311005 3369057
18154 3369057 3582253 3668166 3694525 3642121 3953968 3970003 3911754 3860217 4297135 4402556
18144 4402556 4092614 3649765 3606914 4311416 4755833 4801068 4634160 4943587 5515543 6043072
18134 6043072 5984357 6136279 6736994 7420737 7948048 8359813 9307049 10492664 11597408
18125 11597408 12690592 13770969 15424589 17936711 20691925 24281312 28588673 34172257
18117C4172257Q416886J2204037J8437572L0073248M5589464N2109757L5067096
18110B36070317L6456551O9183145K4812472q7783151q9251939n1260565k7679074
18103A10547756j5559933r761820o969118n070849k126723J400550M946024Q914637
18095H6320524J4435840J7715688J8027885K0825880K6847197K0886485J674508
18088B06734007j2668807q814676J758072n77949j8734311l1619588k6769502
18081A09307246j6727115r398962n842214l147277r92257J065860M217812R039920
18073H7523013J5011535J8584220J8689765K0886486K7983037K3731702M253857
18066B16663615j3320286j1446406K44526M33685j7243800l2838602l0611870
$$ plain form
18117 34172257 42589143 54793180 73230752 103304000 148893464 201003221 236070317
18110 236070317 272526868 341710013 366522485 278739334 189487395 138226830 110547756
18103 110547756 94987823 85226003 78256885 73186036 71059313 72459863 77405887 86320524
18095 86320524 100756364 118472052 136499937 157325817 184173014 205059499 206734007
18088 206734007 194065200 185250524 187008596 186430647 167696336 136076748 109307246
18081 109307246 92580131 83181169 77338955 74191678 73199421 74265281 78483093 87523013
18073 87523013 102534548 121118768 139808533 160695019 188678056 212409758 216663615
18066 216663615 203343329 191896923 192141449 192575134 175331334 142492732 111880862
18059A11880862k0577747j2846276q428010o590611n572515n235635m317959l061868
18051D5250241k410495k367090k068328k098984j793453j383220j356569j293059
18043C0479043p78793r29068q99357o88564o53178m43812p08157o49035j048252
18034B3680827q86268j013939r09217m92483l50992M4347j34829k15172k75447
18025A9446827o94812o77222r1996j67271l43807o34130n30355p25855o55675
18016A4925704m59840k7198j70644k78321j81898l79889k02795m04998k13460
18007A2606661Q2201K77815m1429l37983n08821n95628m48783k93854p15052o84779
17997I340348m55682n74827l49624m0241m12807k84136K04659j15151k82850J73101
$$ plain form
18059 111880862 91303115 78456839 70028829 63438218 57865703 52630068 48312109 45250241
18051 45250241 42839746 40472656 38404328 36305344 34511891 33128671 31772102 30479043
18043 30479043 29700250 28771182 27871825 27183261 26530083 26086271 25378114 24729079 23680827
18034 23680827 22794559 21780620 20871403 20378920 20027928 20072275 19937446 19722274 19446827
18025 19446827 18752015 18074793 17982797 17815526 17471719 16837589 16307234 15581379 14925704
18016 14925704 14465864 14438666 14268022 13989701 13807803 13427914 13225119 12820121 12606661
18007 12606661 12688862 12966677 12925248 12587265 12078444 11482816 11034033 10740179 10025127 9340348
17997 9340348 8884666 8309839 7960215 7919974 7507167 7223031 7427690 7312539 7029689 7202790
17987G202790j29169l19307m41072n13374k88398n1421p8800j58564l28987j23180
17977D770518j58167p9304k90059m05876P8688K18526J86157M65358p3141l26983
17967D385717l13603l02801k81656k32724j42073k9248k31700o8121Q7562j82676
17957B688677K495j36318j30904J36595l08160o3566R625q4699j16438k05810
17947A791497M7778J15982j66528j42599Q7036K5169j81188j75088J34182M5506
17937A581747n1632Q632O1342K19989j32268m28218Q5528r7080m30287L20965
17927A138718J56653l9086K2151Q8537j82091m57891n12017J93333P06490j39039
17917I75758j62128o3835m7792p897k0489l8993m7689N9654q7369N8867K41871
$$ plain form
17987 7202790 7073621 6754314 6313242 5799868 5511470 5460049 5381249 5222685 4893698 4770518
17977 4770518 4612351 4533047 4242988 3837112 3915800 4134326 4320483 4785841 4712700 4385717
17967 4385717 4072114 3769313 3487657 3254933 3112860 3083612 2851912 2783791 2871353 2688677
17957 2688677 2691172 2554854 2423950 2560545 2252385 2188819 2198444 2113745 1997307 1791497
17947 1791497 1839275 1955257 1788729 1646130 1733166 1758335 1577147 1402059 1536241 1581747
17937 1581747 1530115 1538747 1600089 1820078 1687810 1259592 1345120 1248040 817753 1138718
17927 1138718 1295371 1256285 1278436 1366973 1184882 726991 214974 408307 1114797 975758
17917 975758 813630 749795 702003 694106 673617 634624 586935 646589 559220 618087 859958
17906H59958q1865J3378K15550J40817O3352l06611j71875j11022J44813N1268
17896H17763k80446P8299L89343L95476L26482k75945m37246m82009m68203P1865
17886A35379L61141K48355j48043j87955m1426r0004K33402j29743l34367N4968
17876A01707q7622j95106K36059M19957j6384l17697N1273M26649k06876p34851
17866c22891K27134L16124j46890n4757O59336K46818m85134j14440l61860L48918
17856C12358q2222m05805j99822K29167K87171J79909l68307J42826N10741J96487
17846H02503j20622K20751k07806k73489J40421K55030J50737q7505m96164k09093
17836A74763J0901Q7419J89289k9136p541j46660j99078P2780K47870J34236J22956
$$ plain form
17906 859958 778093 791471 1007021 1147838 1211190 904579 732704 621682 766495 817763
17896 817763 537317 615616 1004959 1400435 1726917 1450972 1013726 531717 63514 135379
17886 135379 496520 744875 596832 408877 367451 277447 510849 381106 46739 101707
17876 101707 14085 -181021 55038 474995 458611 140914 192187 618836 411960 -322891
17866 -322891 -95757 220367 73477 18720 678056 924874 439740 325300 -36560 312358
17856 312358 230136 -175669 -375491 -146324 140847 320756 -47551 95275 606016 802503
17846 802503 681881 902632 694826 421337 561758 816788 967525 880020 383856 174763
17836 174763 185664 273083 462372 433236 425695 279035 79957 152737 400607 534843 657799
17825F57799k1687m00760o301J51263Q362k291p333n8438o7765j0781J98166k60828
17813A79406j9914j8400j47522j3540M5031o8094J54394M7347r6385j88214K31231
17802A05340L03594n7046K55172o7886k45655l01115L2030n0458O3160j55329
17792a18193J55343J02844J03479j36077j62033N0368J15048m3113j95855M5051
17782h3138k21578L3551M48983j41172r6365M07118J57272l8317m91042j78648
17772b03336r3495K17240J93409K02451K81259j22120l52131k07791K49942j85505
17762b0077j27689j29757O5707J24844L11770L7848j73112j71663J96318j8802
17752I5387J49074k11070k91931l47412M63637M16910j81116J74410k15057J04923
$$ plain form
17825 657799 636112 235352 229051 380314 388676 386385 379052 320614 252849 242068 440234 179406
17813 179406 159492 141092 -6430 -19970 25061 -43033 111361 158708 62323 -125891 105340
17802 105340 408934 351888 607060 539174 293519 -7596 24434 -26024 37136 -118193
17792 -118193 37150 139994 243473 107396 -54637 -4269 110779 67666 -128189 -83138
17782 -83138 -304716 -271165 177818 36646 -59719 347399 504671 466354 -24688 -203336
17772 -203336 -296831 -79591 113818 316269 597528 475408 123277 -84514 165428 -20077
17762 -20077 -147766 -277523 -211816 -86972 224798 262646 89534 -82129 114189 95387
17752 95387 244461 33391 -258540 -605952 -142315 274595 93479 267889 52832 157755
17742A57755K57325k25089L2650n2532M5846l19590J60845R4857r7399j88983
17732a34315j43486K98957j49407o6155J22322r8728l07007K4387k14494k02390
17722h70316O0632N74142P2876m4482K54047K83624j59157r4052O3169k21637
17712h1154k28070K32601L43699j53350m21057K1327N0145k25230l9130n3539
17702e53758o4176J29578N23669J27387J04102L9178n2791O1116j03495r7740
17692A13070j89432l56283j04343J42998K09792j91903j69480J66691K86313k05418
17682b97995M520K27234K6202k2935o7067Q274j39163k87052M00559L21717k3165
17671A51129k10112j60290j380L35284M69242k8259l96595k43337l22186j51278
$$ plain form
17742 157755 415080 189991 222641 170109 215955 -103635 57210 152067 54668 -134315
17732 -134315 -277801 21156 -128251 -194406 -72084 -170812 -477819 -453432 -667926 -870316
17722 -870316 -809684 -235542 -162666 -207148 46899 330523 171366 77314 140483 -81154
17712 -81154 -309224 -76623 267076 113726 -307331 -286004 -235859 -461089 -500219 -553758
17702 -553758 -617934 -488356 35313 162700 266802 305980 253189 314305 210810 113070
17692 113070 -76362 -432645 -536988 -393990 -184198 -376101 -545581 -378890 -92577 -297995
17682 -297995 -293475 -66241 -40039 -62974 -130041 -121767 -260930 -547982 -147423 174294 151129
17671 151129 -58983 -219273 -220653 114631 583873 555614 159019 -84318 -406504 -557782
17661e57782J26414J54541o5351J89527l1806K32684k27164j4937K73457K69588
17651C49171l6599k82706k02962j02716j01820r3287J70045K74691J80495Q1782
17641B36094k04895L6434K81464J56684l941r4377K65466K36731n88082k68470
17631E3108K10203L2256K63302R0089K61207k97643l30297K77732M02334l59927
17621F02364n66629L44581O1078K23051P2511J39312K80666N3345k60114k20308
17611G29857L2485l6205j37638k12523l3662L21528J53850j25970Q8411K33677
17601A013810P943l02284k33749k28957J13838O6123J12876k07974k82872K3808
17591H2562O5803K88374j5396j88519J00829J95962Q315j29286o2659K8453j43554
$$ plain form
17661 -557782 -431368 -276827 -342178 -152651 -184457 48227 -178937 -193874 79583 349171
17651 349171 312572 29866 -173096 -275812 -377632 -470919 -300874 -26183 154312 236094
17641 236094 31199 67633 349097 505781 501840 407463 672929 909660 321578 53108
17631 53108 263311 295567 558869 648958 910165 612522 282225 559957 962291 602364
17621 602364 35735 380316 441394 664445 736956 876268 1156934 1210279 950165 729857
17611 729857 762342 726137 588499 375976 342314 663842 817692 691722 780133 1013810
17601 1013810 1021753 719469 485720 256763 370601 436724 549600 341626 58754 82562
17591 82562 148365 436739 421343 232824 333653 529615 537930 408644 345985 374438 230884
17580B30884j60505r8070J99334J9028q4241k48644l06511M47076N30914n2665
17570D76600n12005k33978M0511p2115l24104k0505J19727J62356K81486K99522
17560B17495J32859K2450k19943k2757O6092J12215j54329n59616K14234J94416
17550C116J95554J1747j142p9533L41j07993l13857L93275O3797k58824J40763
17539D7244p1711l20652m67838K57743M51406L63310P1028l82701k339l7963K25956
17528A33483J98086k26396q1707N43791O42165K6919l18822l64484K57110K25710
17518A035855l41785n73239O5206J19982k43690j16239k0438j27378j64026J55187
17508b10565Q7766J62252K60447L93158K51900K38307L43256j75026l38449j84829
$$ plain form
17580 230884 70379 -27691 171643 190671 106430 -142214 -448725 -1649 529265 476600
17570 476600 -35405 -269383 -228872 -300987 -625091 -645596 -525869 -363513 -82027 217495
17560 217495 350354 372804 152861 130104 196196 308411 154082 -405534 -191300 3116
17550 3116 198670 210417 209275 129742 130083 22090 -291767 101508 165305 -93519 47244
17539 47244 -24467 -345119 -812957 -555214 -103808 259502 330530 -52171 -54510 -92473 133483
17528 133483 331569 105173 23466 567257 1209422 1236341 917519 553035 810145 1035855
17518 1035855 694070 120831 186037 306019 62329 -53910 -74348 -201726 -365752 -210565
17508 -210565 -122799 39453 299900 693058 944958 1183265 1526521 1351495 1013046 828217
17498H28217k5809o2803J43380K19719j89980m00698p5357J2114J69319j96268
17488D21834j77791o3648k25899J67808P241l04860r1553n1225K12440R8453p0870
17477g8070r7793j31906N0419J17788K50940J70325m9661o90167n5713L00595
17467b13243K2193k56850P002k62807M3261M02292L89781L65188L8486k39665
17457B95638k37185m9399K92750K29900J30639N8636R6116k11265J20743J06618
17447H33191K05552l901J58931K52812K83140L9476m95297m44167n64644l22978
17437e7885p6357J20309K50807j94620k62790J8839K65473J31057L8360L7831
17427B71024J94758J19131n9908l00426L78864M6840k20891K3310o1406n4404
$$ plain form
17498 828217 802408 739605 882985 1102704 912724 512026 436669 448783 618102 421834
17488 421834 244043 180395 -45504 122304 129545 -175315 -266868 -318093 -105653 -7200 -78070
17477 -78070 -175863 -307769 -257350 -139562 111378 281703 232042 -458125 -513838 -213243
17467 -213243 -191050 -447900 -440898 -703705 -660444 -258152 131629 496817 535303 295638
17457 295638 58453 9054 301804 531704 662343 720979 817095 605830 726573 833191
17447 833191 1038743 1034842 1193773 1446585 1729725 1769201 1273904 829737 265093 -57885
17437 -57885 -134242 -13933 236874 42254 -220536 -201697 63776 194833 233193 271024
17427 271024 465782 584913 525005 224579 603443 650283 429392 452702 391296 336892
17417C36892Q1J36434R0619k05212p1416j82112K30725J0008P4221m9246j55163
17406B15831n1809Q6398j96075L274K34597J93643m43019l36847L32355K63442
17396C01790J60848M3409r1083m60911q4736K1655P1017K00999r56J23198k10351
17385G4879m8883j03543J47522L07568L58100q7173q22336m85473Q5312L04650
17375b69377K64876K52282q3124k59029P0823J84320k9133j19809L22o5949j29756
17364a83554k77599n0156L43679L91156K30289K17109k946m09813j53216j88869
17354h3920k50190o2602K64606J47846R8612O4434k41928m01296j51493P4889
17344e41042m5406J40805L09439R5783k78851L38322J88091n6611k73671P1494
$$ plain form
17417 336892 336973 473407 564026 358814 287398 105286 336011 346019 420240 370994 215831
17406 215831 164022 250420 54345 57619 292216 485859 42840 -294007 38348 301790
17396 301790 462638 506047 414964 -45947 -130683 -109028 -38011 162988 162032 285230 74879
17385 74879 25996 -77547 69975 377543 735643 648470 -173866 -659339 -574027 -269377
17375 -269377 -4501 247781 164657 -94372 -23549 160771 131638 11829 12151 -53798 -183554
17364 -183554 -461153 -511309 -167630 223526 453815 670924 667978 258165 104949 -83920
17354 -83920 -334110 -396712 -132106 15740 114352 178786 -63142 -464438 -615931 -541042
17344 -541042 -586448 -445643 -136204 -40421 -319272 19050 207141 150530 -123141 -51647
17334e1647K67013K75559J10133J6042K02466j31472l90580k09918j27234J4527
17324b5111J64508J84321M070k69786k26085n6434n3369R9081J59337o9373j18388
17313b07229R1884M38835k4654j98041J54424K08071j26456R6689J34048L05780
17303H73351l04629l23975j31864R7974k41801R4814k83190j662K62150j36289
17293i5121J3226J34822L40107L61885q5192N4530j5356K8678J1279o3672o11225
17282G3961k09506M67936J29115N2674J7035k0074j1237j00304k3020j15744K00013
17271D60849P5578j52412k51300j1445m9707k35247K80535j5974k09569J20934
17261A2242K07230j01826n5223K30446J6928m83456o67391N17009p6774j76832
$$ plain form
17334 -51647 215366 490925 601058 617100 819566 688094 297514 87596 -39638 -25111
17324 -25111 139397 323718 327788 58002 -168083 -224517 -277886 -178805 -19468 -88841 -207229
17313 -207229 -115345 323490 298836 100795 255219 463290 336834 433523 567571 873351
17303 873351 568722 244747 112883 210857 -30944 63870 -219320 -220982 41168 -95121
17293 -95121 -81895 52927 393034 754919 669727 724257 708901 737579 748858 685186 73961
17282 73961 -135545 332391 461506 514180 531215 511141 499904 399600 376580 260836 460849
17271 460849 536427 384015 132715 121270 71563 -163684 116851 100877 -108692 12242
17261 12242 219472 117646 62423 292869 309797 -173659 -841050 -324041 -400815 -577647
17251e77647j8790K99189L30295J59896j33452N2059J33828J29017L9255r1859
17241C21791k29644K40579J66855k48776k25653J0365P7312J5647j32789M9056
17231D4743N27145L30822j51368p21303k15532K56574N28957N2945k58900P28
17221C94811J5766j00270J06543j0114Q5j14153J1385K91018l65957k68568N3760
17210A4306J33961o5438J39999J65218M1109J67509M30520J42461n25597k55918
17200C88130j68244k31305K49507K64164J10587j05128q5467J09186j45923K45566
17190F31073j67812k11434P9305r9291k29846n1173J87505L8228j88931k80635
17180b93011O3143M72414L38103J73846n8802q5859M45532M17815l859j56310
$$ plain form
17251 -577647 -596437 -297248 33047 192943 59491 111550 245378 374395 413650 321791
17241 321791 92147 332726 499581 250805 25152 35517 112829 128476 -4313 44743
17231 44743 571888 902710 751342 30039 -185493 71081 600038 652983 394083 394811
17221 394811 410577 310307 416850 406736 406821 292668 304053 595071 229114 -39454 14306
17210 14306 148267 82829 222828 388046 429155 596664 1027184 1169645 644048 388130
17200 388130 219886 -11419 238088 502252 612839 507711 422244 531430 385507 631073
17190 631073 463261 251827 331132 231841 1995 -49178 138327 176555 -12376 -293011
17180 -293011 -229868 242546 580649 754495 695693 609834 1055366 1473181 1469322 1313012
17170A313012m3710n2446k20366o1564k29298j08129l3840N6622M79414M05318
17160A505013K8672k62720l08294o8779P6372m4074j3070m47321r986K63061M64117
17149A182991J32403k6820m0077m1368n0939J51057J85139K95384K9859J0164
17139A827793k4983N8839j05678m30091l16351J06767J10913Q4909k0162l50161
17129I41795j84457k189L67257Q7870K05039K88434n3876J81322P5200J06173
17119B012568j07841n6819M9767J67911M60126M45584L04555J36984l745J64499
17109C573589L09848r9005Q6962K31088K38555K62014L50755L27047M15970M24411
17099F121234M19830J67760o2981N50563P23468P76184O60909J221204J306146
$$ plain form
17170 1313012 1269302 1216856 996490 934926 705628 597499 563659 620281 1099695 1505013
17160 1505013 1533685 1270965 962671 893892 970264 926190 913120 465799 455813 718874 1182991
17149 1182991 1315394 1288574 1248497 1207129 1156190 1307247 1492386 1787770 1817629 1827793
17139 1827793 1802810 1861649 1755971 1325880 1009529 1116296 1227209 1312118 1291956 941795
17129 941795 757338 755149 1122406 1210276 1415315 1703749 1649873 1831195 1906395 2012568
17119 2012568 1904727 1847908 1897675 2065586 2525712 2971296 3275851 3412835 3409090 3573589
17109 3573589 3883437 3784432 3871394 4102482 4341037 4603051 4953806 5280853 5696823 6121234
17099 6121234 6541064 6708824 6645843 7196406 7919874 8696058 9356967 10578171 11884317
17090A1884317J752640K245849K204928L023071M963360P355766J1979942J8265006
17082F3674879K1548281J6547859J6178581K6288344J3817571k5712955l1573817
17075A00768743j7637490o376949L129393J1484966J6451255J3680233J1474055
17068A32974206K1423109J7012958k0414774l4192059k1311382q617038J521282
17061H8396302J0274716J5183693J2371968J1062053K0737762J5421775k1731771
17054A51716498l3727349k1018030q659532n0491Q169941J4620990J2877420Q848781
17046A32778228J7009872J8226365j6339371l7630291k7180483j6524499j0156239
17039F0183582o930664n188748m000654l106373k236119j194715j905689k492886
$$ plain form
17090 11884317 13636957 15882806 18087734 21110805 26074165 33429931 45409873 63674879
17082 63674879 85223160 101771019 117949600 144237944 158055515 132342560 100768743
17075 100768743 83131253 76754304 79883697 91368663 107819918 121500151 132974206
17068 132974206 154397315 171410273 150995499 116803440 95492058 86875020 88396302
17061 88396302 98671018 113854711 126226679 137288732 158026494 173448269 151716498
17054 151716498 117989149 96971119 88311587 88261096 96431037 111052027 123929447 132778228
17046 132778228 149788100 168014465 151675094 114044803 86864320 70339821 60183582
17039 60183582 53252918 48064170 44063516 40957143 38721024 37526309 35620620 33127734
17031C3127734k305460j737986j459269j423671j126212m58130n90848m92631
17023B3533527n08724p82058j280233j092391q94194r29264m08279l37531l57512
17014A6943341l69103j13441k81833k79672p59553n40515n44260p15219p15412
17005A2624333n45820j40172n63084n79489J2537l22044n44945l61828j72711
16996I406777L2611j48005m23463l68110m01631m66157k51003k21528l88947k29438
16986F541106K89045k061k42145j22466k95923n2804k33444k60759j46984j28122
16976E345443j53495R51l3153j3645l56964m49988r1985j06761J26897K6462l47136
16965C946626m84114l2890N5136j53931j68324J36742r560J33100J00425l81631
$$ plain form
17031 33127734 30822274 29084288 27625019 26201348 25075136 24617006 24026158 23533527
17023 23533527 23024803 22242745 20962512 19870121 18975927 18046663 17638384 17300853 16943341
17014 16943341 16574238 16460797 16178964 15899292 15139739 14599224 14054964 13339745 12624333
17005 12624333 12078513 11938341 11375257 10795768 10808305 10486261 9941316 9579488 9406777
16996 9406777 9439388 9291383 8867920 8499810 8098179 7632022 7381019 7159491 6770544 6541106
16986 6541106 6830151 6828090 6585945 6463479 6167556 6114752 5881308 5620549 5473565 5345443
16976 5345443 5191948 5192899 5159746 5146101 4789137 4339149 4247164 4140403 4267300 4293762 3946626
16965 3946626 3462512 3429622 3484758 3330827 3162503 3299245 3289685 3422785 3523210 3141579
16955C141579k90560k51412J53938j8991m57676k62647J97613L3270k73184Q6867
16945B058797L12108J49760j4989k45662O6258L18499O0083m8428m05611k85691
16935A965124n3228q4784j12008n3871l92550N1578p0020m1929k9806k22329k90164
16924F66013J12930j1781L00999l0911k56877j37437n5384k24653L36117J21601
16914H20617j3969j02644j28255J21889J25346J89844j64976j07845J2244k88046
16904D64205k56117k77485J53340L09760j07030j76268q4805O6881K68719J09182
16894D70382K25130l70876k33415j9140J13874J76329N6838n0273o1523M837J4285
16883C26448m16200j09818N27899k73735K06607M86598j69653k88879N069J21982
$$ plain form
16955 3141579 2851019 2599607 2753545 2734554 2276878 2014231 2211844 2245114 1971930 2058797
16945 2058797 2370905 2520665 2505676 2260014 2326272 2644771 2704854 2656426 2250815 1965124
16935 1965124 1911896 1827112 1715104 1661233 1268683 1320261 1250241 1208312 1178506 956177 666013
16924 666013 778943 767162 1068161 1037250 780373 642936 587552 362899 699016 820617
16914 820617 806648 704004 575749 697638 822984 1012828 847852 740007 752251 464205
16904 464205 208088 -69397 83943 393703 286673 110405 25600 92481 361200 470382
16894 470382 695512 324636 91221 72081 185955 362284 419122 368849 307326 312163 326448
16883 326448 -89752 -199570 328329 54594 261201 747799 578146 289267 294336 416318
16873D16318J96525J29703j0384j06698M1374K24099K33958k92227m8719L27067
16863A111016P4308m12475l16015k90828J56023J37235M14767k02323m51925j42028
16853G7755L46445J55795o36932p9034J38128k4070M3064J46868j49393J10712
16843A29338P8331j3345M29348J06847m08428l8322M1915Q9699k25518L6353J20093
16832C46311j4111m7347l7683o987P2555k03384J32246K06815k40841P5974K62583
16821E46131j74239K97250n6000j46886k26361l53376J08956K45613n4227k74952
16811h8091k53883K52864K92725j78461j00339L53313L9418r1525k95236P65l8764
16800a07214M9553r5440j10133J64777J61981J82323k98705n01222j60286M12308
$$ plain form
16873 416318 612843 742546 732162 625464 666838 890937 1124895 832668 783949 1111016
16863 1111016 1185324 772849 456834 166006 322029 459264 874031 671708 219783 77755
16853 77755 424200 579995 -56937 -135971 2157 -21913 21151 168019 18626 129338
16843 129338 207669 194324 623672 730519 322091 283769 325684 415383 189865 226218 346311
16832 346311 332200 284853 247170 240183 312738 109354 241600 448415 207574 283548 546131
16821 546131 371892 669142 613142 466256 239895 -113481 -4525 241088 186861 -88091
16811 -88091 -341974 -89110 203615 25154 -75185 278128 317546 226021 -69215 -68450 -107214
16800 -107214 -57661 -153101 -263234 -98457 63524 245847 -52858 -554080 -714366 -302058
16790c02058J02788j22572K4553J73257j04044M9559J43066J50589j98275j60088
16780b43225J56455j18568j18461M9982J39746l6404j87110K54942j07799l55602
16770e66044L34628K20004j15788k85859J09342l10837j40783K37658j67297Q881
16760f76095N0147M82980L39493k22982P3879K58042k5933K30404k20294j37979
16750A51662q0814l43782j82452R3805j77160Q0816J90900L55156M39004q704
16740E18431R7335K516k37501P1980k9699M9223j45061k57232j37559J34873P8726
16729A46032J6627J21826j71924l47311J08129L58911J6867M6412j22182p249
16719A66138j7319J34053J91826j61734n13161k92589o7127P5701J57340K39144
$$ plain form
16790 -302058 -199270 -321842 -297289 -124032 -228076 -178517 -35451 115138 -83137 -243225
16780 -243225 -86770 -205338 -323799 -273817 -134071 -170475 -357585 -102643 -210442 -566044
16770 -566044 -231416 -11412 -127200 -413059 -303717 -614554 -755337 -517679 -684976 -676095
16760 -676095 -625948 -142968 196525 -26457 47422 305464 279531 509935 289641 151662
16750 151662 70848 -272934 -455386 -361581 -538741 -457925 -267025 88131 527135 518431
16740 518431 615766 618282 380781 452761 423062 472285 327224 69992 -67567 67306 146032
16729 146032 162659 284485 112561 -234750 -126621 232290 249157 295569 173387 166138
16719 166138 148819 282872 474698 312964 -200197 -492786 -559913 -484212 -326872 -87728
16709h7728l40618j80508J22258k66910R6802L56736J29094L3704M1735j29491
16699b24926j9479K9032J19728p4661l7725J29377K68193P6753l14598l04931
16689c53237J20108K21758M669m25123K2873M82770K11256n1318j92424j88995
16679a47663J16960j38975J0802q4305J36238o8001K47401J50693k22784l10041
16669c09675J591j0844m164J82654L79949K9583k63916n41965k95954J84753L07369
16658c40619j9630j0057j0577j30250J61949M37261j80595J9125K51347J28759
16648C06713l04667k15764l4672K85338J00758J9527l14982k07247k7413L86982
16638e427K28702J17139J19895k03025k62520n60054r9877M71240K67513k43171
$$ plain form
16709 -87728 -428346 -608854 -486596 -753506 -656704 -299968 -170874 -137170 -95435 -224926
16699 -224926 -244405 -215373 -95645 -170306 -208031 -78654 189539 266292 -48306 -353237
16689 -353237 -233129 -11371 -6702 -431825 -408952 73818 285074 233756 41332 -147663
16679 -147663 -30703 -169678 -158876 -243181 -106943 -174944 72457 223150 366 -309675
16669 -309675 -308084 -318928 -323092 -140438 239511 269094 5178 -536787 -832741 -647988 -340619
16658 -340619 -360249 -370306 -380883 -511133 -349184 88077 -92518 -73393 177954 306713
16648 306713 2046 -213718 -248390 36948 137706 157233 -157749 -364996 -392409 -5427
16638 -5427 223275 340414 460309 257284 -5236 -565290 -665167 -193927 73586 -169585
16628a69585j10345K50848J77326J1501l3132n2230J50533l43690j58273P024
16618b70023L4926J79854L62169m87348k21015K1449L02889j28977l83370K29343
16608c60103K29403k68916O1862Q2892P741J26109K67568j12316r1667N1809J35446
16597A29828J75124l3244j55322m24922l12491l30398r4638J52832K15975L38285
16587c38971K97035P7893J18551j546L3450l70482p5246m0016L759K68110m4886
16576g2349l24377L9332n3138J93358K38438j89798J22008q8713K85767k55804
16566a05276l30540l881L10818R2372r5380J81662k29584R4335l4102L38868k46536
16555b7244m48835j15803K01336J99829q188L21860l48522J34544l1024K8967
$$ plain form
16628 -169585 -279930 -29082 148244 159745 126613 74383 224916 -118774 -277047 -270023
16618 -270023 -235097 -55243 306926 -180422 -401437 -379988 -77099 -206076 -589446 -360103
16608 -360103 -130700 -399616 -337754 -254862 -247121 -121012 146556 34240 -57427 -5618 129828
16597 129828 304952 271708 116386 -308536 -621027 -951425 -1046063 -893231 -677256 -338971
16587 -338971 -41936 35957 154508 152962 186412 -184070 -259316 -299332 -295573 -27463 -72349
16576 -72349 -396726 -357394 -410532 -217174 21264 -168534 -46526 -135239 150528 -105276
16566 -105276 -435816 -439697 -128879 -36507 -131887 49775 -179809 -85474 -119576 219292 -27244
16555 -27244 -476079 -591882 -390546 -190717 -198905 122955 -225567 -91023 -122047 -93080
16545i3080j14690j14531q3964K61667O5385j97037n6443k33130k80181L45636
16535e00368M33601k17361j71840j44754K13008J63249O1059K45901O68786j20073
16525F31208k57178Q2336j32898l05069r9864O7562N3556K40521M03487L74826
16515A058487J05654j88233j96062l00224l28743q4515N05713N64627o7370k08942
16505H60392K2917m03491j20236R9838K05864j62630N3086O2010N8665J83844
16495H60259j26538m2035L29160L35196n1257k91271j12638j67498o1693l22505
16485C49180K2437J91002J17388J97032q1370p3562M56m78364l81885n6007Q1529
16474a12164J25161r6479j93014K7166K18188P1317m9931o5748j96488L0152L26196
$$ plain form
16545 -93080 -207770 -322301 -406265 -144598 -79213 -276250 -332693 -565823 -846004 -500368
16535 -500368 -66767 -284128 -455968 -600722 -387714 -224465 -163406 82495 751281 631208
16525 631208 374030 456366 323468 18399 -81465 -13903 39653 280174 683661 1058487
16515 1058487 1164141 975908 779846 479622 150879 66364 572077 1136704 1069334 860392
16505 860392 883309 479818 359582 459420 665284 502654 555740 617750 676415 860259
16495 860259 733721 691686 1020846 1356042 1304785 1013514 900876 733378 671685 349180
16485 349180 371617 562619 680007 877039 795669 722107 722563 244199 -137686 -193693 -112164
16474 -112164 12997 -83482 -276496 -249330 -31142 40175 -9756 -75504 -271992 -241840 84356
16463H4356q9355J71291L06561J39181j93009n82306l50868K25416L65508N7258
16453A34033J5099R4936j2681P1822n0219l4252L47793k05883l68239l21623L9906
16442b89308K01379L37508J7183J31456j42658j85694j4197k44300j54880j4651
16432c58162L6645K1925K47054K11799N2740l44645j78117M9162N94721j05808
16422B27314k661l16583j98382j55483P2493K29999J77602N96939k30821m25725
16412b5308p150m2942k41144K79965K87804J34391p5185j42888k29360P6467j50182
16401a35532P7904J98689q2319p750k2083P0855j10146q1385J75755q8933m84056
16390d89001M03995K71714j03839J79385K8788m4742l0701N5370r5248n11094
$$ plain form
16463 84356 -4999 166292 472853 612034 419025 -163281 -514149 -288733 76775 134033
16453 134033 149132 244068 231387 303209 252990 218738 566531 360648 -7591 -329214 -289308
16442 -289308 -87929 249579 266762 398218 255560 69866 55669 -188631 -343511 -358162
16432 -358162 -321517 -299592 -52538 159261 212001 -132644 -310761 -261599 333122 227314
16422 227314 224653 -91930 -290312 -445795 -373302 -143303 34299 631238 400417 -25308
16412 -25308 -32458 -75400 -316544 -36579 251225 385616 310431 167543 -61817 14650 -135532
16401 -135532 -57628 141061 58742 50992 28909 99764 -10382 -91767 83988 -4945 -489001
16390 -489001 -85006 186708 82869 262254 291042 246300 215599 270969 175721 -335373
16380c35373k57468L31847L68975J53376J23169J23302O4334K16138k40747o16237
16370f8684j8156J87403J21117o4343k50372J22916J81811K41878j09384k42758
16360A01428R0298n94450q2427N00239K03054j26717k2932j49687O7491j80429
16350a94132k28463K46558M64612R0630n2610j33337K77946k61138l70545j04660
16340b65139L78567L74606j23358k31572k3986j87637k33686J91123K29614l06271
16330a97739l3095J13885k25102K29593m8039m1626l30116j58380K11519K87775
16320a91325j66639L02731J16421k00495l4235O0022j6204J97975Q7739k994K94837
16309D47833k0837L9099k17841r9340j21494j27672j27709r0950J25236J44648
$$ plain form
16380 -335373 -592841 -260994 107981 261357 384526 507828 572162 788300 547553 -68684
16370 -68684 -86840 100563 221680 157337 -93035 29881 211692 453570 344186 101428
16360 101428 191726 -402724 -485151 15088 218142 91425 68493 -81194 -13703 -194132
16350 -194132 -422595 -176037 288575 379205 326595 193258 471204 210066 -160479 -265139
16340 -265139 113428 488034 364676 133104 109118 -78519 -312205 -121082 108532 -197739
16330 -197739 -230834 -116949 -342051 -112458 -160497 -202123 -532239 -690619 -479100 -191325
16320 -191325 -357964 -55233 61188 -139307 -173542 -113520 -129724 68251 155990 152996 447833
16309 447833 426996 466095 248254 148914 27420 -100252 -227961 -318911 -193675 -49027
16299d9027q4051J80960L77422r8161j28969k13742L958K91382J65119j6086n32140
16288a03335l02549K39663K68197J60482J53593N21490j02881o64176l76952j55948
16278c62416J23732K70697J09862n2056j42722M4N2507j64689k20219j79400m4804
16267f09464J01884K48822M5459n9534O3314K037p0251L3228k38357N3894M17007
16256a1961j53060M58564K91427L54645k48354k15211k4116j85432k18831L0536
16246G8207K59999j36489m0417L99314o7768p51366l71043L0993J84437K12447
16236b01686j78916j97581K85161Q8905k5780m97313j3015M84242N63590n3773
16226B53834j28909j01167k40507k08631J27962K70625O0789k67767J96136J35065
$$ plain form
16299 -49027 -133078 47882 425304 327143 198174 -15568 -11610 279772 444891 428805 -103335
16288 -103335 -405884 -166221 101976 262458 416051 937541 834660 170484 -206468 -362416
16278 -362416 -238684 32013 141875 89819 -52903 -52859 -352 -165041 -385260 -564660 -609464
16267 -609464 -507580 -258758 -213299 -272833 -209519 -207482 -277733 -244505 -482862 -428968 -11961
16256 -11961 -165021 293543 584970 939615 691261 476050 451934 266502 47671 78207
16246 78207 338206 201717 161300 560614 492846 -258520 -629563 -598570 -414133 -201686
16236 -201686 -380602 -578183 -293022 -204117 -229897 -727210 -740225 -255983 307607 253834
16226 253834 124925 23758 -216749 -425380 -297418 -26793 33996 -233771 -37635 97430
16216I7430J33862N3295l30292j85078j05187J50819j6278m07786k63397R9106
16206g73506K31139J23791J99038K99806K7010p5681p8198L14055J62305j97115
16196B32644m6014j5092k90737O8358J0795K05436j05228J19764J67547P0404
16186D17877j47744r5517j21180J20756j39503l77924j89501K47152Q8821m658
16176b01421j32709K6703k60796L25622K01209l15060j76910J6756M44694M17315
16166C45403m92467l52910O3283R8082j01621J12383N27056K31836j8589L3563
16156D46019l70978r4469J2617p4019o1084Q1292o1381K20433M52191L57975j80237
16145G28359n45782k10052L2635J20608p8568k01828R0600K23743Q685l79527
$$ plain form
16216 97430 231292 284587 -45705 -230783 -335970 -185151 -201429 -609215 -872612 -773506
16206 -773506 -542367 -418576 -219538 80268 107278 31597 -46601 267454 429759 232644
16196 232644 186630 171538 -119199 -50841 -40046 165390 60162 179926 347473 417877
16186 417877 270133 174616 53436 174192 34689 -343235 -532736 -285584 -196763 -201421
16176 -201421 -334130 -307427 -568223 -242601 -41392 -356452 -533362 -516606 -71912 345403
16166 345403 -147064 -499974 -436691 -338609 -440230 -327847 199209 431045 412456 446019
16156 446019 75041 -19428 -6811 -80830 -141914 -60622 -122003 98430 550621 908596 728359
16145 728359 182577 -27475 5160 125768 47200 -154628 -64028 159715 168400 -211127
16135b11127k83992J40550L41040J54518L5482k35492m82901k13357J26552K95377
16125c33350k10767P0571K48093J02464j11744n0010L0997j88869l3785j50621
16115f27021J98744O0536l27510n8918L37721J58574K90450r4252o596P6155l20287
16104c12404n0319J85146K4562Q0605M1509r10j12254j16923Q9733l24566N0232
16093d45589K8046L87206K88284k5948Q6919K11121j51014l52717R9401J3840
16083A39549k63518k4647j88558J68911r2135q6029N9278l34969K18432N76700
16073A73014j98947J01813J33627p669k77255k06709K1196K68282L65681k13427
16063A59606m39591J84867K34128K68709Q2284j55413m03688l57345j94169J45525
$$ plain form
16135 -211127 -495119 -354569 -13529 140989 176471 -59021 -541922 -755279 -628727 -333350
16125 -333350 -544117 -473546 -225453 -122989 -234733 -284743 -253746 -442615 -476400 -627021
16115 -627021 -428277 -367741 -695251 -754169 -416448 -257874 32576 -61676 -68272 7883 -312404
16104 -312404 -362723 -177577 -153015 -72410 -30901 -31811 -144065 -260988 -171255 -495821 -445589
16093 -445589 -417543 -30337 257947 231999 318918 530039 379025 26308 125709 139549
16083 139549 -123969 -148616 -337174 -168263 -260398 -346427 -287149 -622118 -403686 173014
16073 173014 -25933 75880 209507 201838 -75417 -282126 -260930 7352 373033 159606
16063 159606 -279985 -95118 139010 407719 490003 334590 -69098 -426443 -620612 -475087
16053d75087L65234K16493K0400p4570L9016J74589l46364l37753l59659l49723
16043a127424k9174N00639M17059O6761J24174O0736m5019j67710k22306J43382
16033b78882N194k17834K70492L46908k79858k6926r6620J43006J91084J27809
16023A84373k65709p1413K0579j341R0280K4325J40258J01705n6545j24906L7251
16012G8857J940Q1351j42016k03069k9228M73680k92306l13077K51227K03280
16002A10639P0041J99335P481N8440m17761J3854J47012Q1097l64134k79582K90234
15991h3344K50769M7803n4994l58169K32149K69308P7147k56239m45355o0683
15981c81608O445P0457K8228R9854J1028k94418J39006L71851K49443j9680K0843
$$ plain form
16053 -475087 -109853 106640 127040 52470 91486 266075 -80289 -418042 -777701 -1127424
16043 -1127424 -1156598 -655959 -238900 -172139 -47965 12771 -32248 -199958 -422264 -278882
16033 -278882 -273688 -491522 -221030 125878 -153980 -180906 -277526 -134520 56564 184373
16023 184373 -81336 -152749 -132170 -133511 -43231 -18906 121352 223057 166512 41606 78857
16012 78857 80797 162148 20132 -182937 -212165 261515 -30791 -343868 -92641 110639
16002 110639 180680 380015 387496 445936 28175 42029 189041 270138 -93996 -373578 -83344
15991 -83344 167425 215228 160234 -197935 34214 303522 380669 124430 -320925 -381608
15981 -381608 -375163 -304706 -276478 -176624 -165596 -460014 -321008 50843 300286 280606 301449
15970C01449j05923j4610r8833L65253K59150k83790l79720k65125P0884Q1356
15960f9909M13j84186J99089J96368j81036J29822k44101l26665J36460L76736
15950C2991J51129K55073P4686n7101J6930J15935K4276j94301k95284Q9569K53222
15939D67125l79278n12901k09458k0062J71225L21287L51147N67382j87558m54479
15929A14430l44890L8920K07747R9694q8752l46160L1882K03183K00025J56351
15919B72430k35150J49929n1053o4474l5789r2026M36743J69466j58280k69298
15909A22498J30814k633j53098j02662l55214l0149K64140M05525J34540l64415
15899D9346j50594k56789K04741M38413M37056m4201n06212j06019k3900J38325
$$ plain form
15970 301449 195526 180916 82083 447336 706486 422696 42976 -222149 -151265 -69909
15960 -69909 -69496 -253682 -54593 141775 -39261 90561 -153540 -480205 -343745 32991
15950 32991 184120 439193 513879 456778 473708 589643 613919 419618 124334 213903 467125
15939 467125 87847 -425054 -634512 -654574 -483349 -162062 189085 756467 568909 114430
15929 114430 -230460 -191540 16207 115901 27149 -319011 -287129 -83946 116079 272430
15919 272430 37280 187209 136156 71682 35893 -56133 380610 550076 391796 122498
15909 122498 253312 250679 97581 -5081 -360295 -390444 -126304 279221 413761 49346
15899 49346 -101248 -358037 -153296 285117 722173 677972 171760 65741 41841 180166
15889A80166N1153R4123N0004J5448k9248l9209r4742j52567l4530p3521j78402
15878b11325M8275Q1864Q2461k90442O5418L26702Q5862k30780j41063n3352l09574
15867e45954j4462L51999M57800L09018j98480P2422m13075k19027J46657L834
15857d9268m13122j38615L68053L00151n6034m84441k76894J85678K76775L11855
15847B4138j07480J40944j48033k42972q4780j51129J72380k42512k22804L07399
15837e54849N20460J27529k30687j6294p4971K07991M85364n4903k89925j27733
15827h018o8154j61745J14965k6494K7480l7722Q1592K19597M02832k24189m47479
15816a27335k34228L160K7030K28981K72029L31021K71704N3564j03960o1030
$$ plain form
15889 180166 231319 325442 375446 390894 361646 322437 227695 75128 40598 -32923 -211325
15878 -211325 -163050 -81186 1275 -289167 -223749 102953 188815 -41965 -183028 -236380 -545954
15867 -545954 -560416 -208417 249383 558401 359921 432343 19268 -199759 -53102 -49268
15857 -49268 -462390 -601005 -232952 67199 11165 -473276 -750170 -564492 -287717 24138
15847 24138 -83342 57602 -90431 -333403 -418183 -569312 -396932 -639444 -862248 -554849
15837 -554849 -34389 93140 -137547 -153841 -228812 -20821 464543 409640 119715 -8018
15827 -8018 -76172 -237917 -122952 -149446 -121966 -159688 -78096 141501 544333 320144 -127335
15816 -127335 -361563 -358403 -331373 -102392 169637 500658 772362 825926 721966 660936
15806F60936j4901k7702m24999l47495L9351J05404P727k39264J48295l9650j86000
15795c18298J05209k13709j94942K47511P0385j31409j09897K10999J94363M402
15785a35386j45747k53455j81118K1667O4554L71472J65227l32523j25412J04830
15775d45891N5965J74232K1073k75231O8815P2175K31345M13653R7032n46085
15765a32917j12401M7653J32680L22489n6909o4293p4036l66678L9765K58015
15755f632o3716J1640j07631J39740k6428J24885r4759j4578P139L3913L06023
15744C09596O5119L87900J63837p5218j27588l42060j53435j13158l10196O2150
15734a33053k51803q9364M11173J21590L88383O9040n56395m94040J75491J46853
$$ plain form
15806 660936 646035 618333 193334 -154161 -114810 -9406 -1679 -240943 -92648 -132298 -318298
15795 -318298 -213089 -426798 -621740 -374229 -303844 -435253 -545150 -334151 -139788 -135386
15785 -135386 -281133 -534588 -715706 -694039 -629485 -258013 -92786 -425309 -550721 -445891
15775 -445891 -389926 -215694 -194621 -469852 -401037 -328862 -97517 316136 413168 -132917
15765 -132917 -245318 -197665 -64985 257504 200595 136302 62266 -304412 -264647 -6632
15755 -6632 -70348 -58708 -166339 -26599 -53027 71858 -22901 -37479 -30340 3573 309596
15744 309596 374715 762615 926452 851234 723646 381586 228151 114993 -195203 -133053
15734 -133053 -384856 -474220 -63047 58543 446926 515966 -40429 -534469 -358978 -212125
15724b12125J78020P6628r2459K66578K03344j82800q3203n7414L2645J84246
15714C13460o0588j22213m03777n7411J74122J3691K58715j53298n9530l7695
15704a34524R935J76558K50025L48270j41028j68419n2007j18844o6522l89181
15694b85737J54282J88648l84372R806L30753L38802k75063Q025m9389k12122
15684a76367k34679J1126M05213M87K54494L3390j16699k33101J29831L6277J97798
15673C07770l4060j82799n4250k82498J89084P8132j83798l40789j87332Q4279
15663f06261J17380J00897j9106M3784N07288J82855m79724j50919K38970J6724
15653d8112K79118m7741J25001k5286j97654l38711l89105R7659M68818L49512
$$ plain form
15724 -212125 -34105 42523 -49936 216642 419986 237186 153983 96569 129214 313460
15714 313460 252872 130659 -273118 -330529 -156407 -142716 115999 -37299 -96829 -134524
15704 -134524 -124589 51969 301994 650264 509236 340817 288810 169966 103444 -285737
15694 -285737 -131455 57193 -327179 -317373 13380 352182 77119 85144 35755 -176367
15684 -176367 -411046 -399920 5293 5780 260274 293664 176965 -56136 73695 109972 307770
15673 307770 273710 90911 36661 -245837 -56753 21379 -162419 -503208 -690540 -606261
15663 -606261 -488881 -387984 -407090 -363306 143982 326837 -152887 -303806 -64836 -48112
15653 -48112 231006 183265 308266 282980 85326 -253385 -642490 -544831 -76013 273499
15643B73499J17880l70096k19820j9034Q0941K32281L3284k65851K43286K16423
15633C22793k28490m18042J02780M35161o3002Q9787M18219J33348k64049k28476
15623C00029K40955k88851o65478J26268J10380o0527j76142J44304k9198K2183
15613b76077Q8747J90637j38189j36627K1924L6017J81536K42073R7433o8332
15603B39142j68692j11234Q0200K55150N6245P6551J50451P1557p6526j43581
15593D29263o1033j18829j30720O4472K34910R2091k61159k73722O3667J90742
15583B29682P7030J99697k16259k13495m30664R2859n3211k87194l8259N82659
15573e7155M27295O1379j87019j54565R1282N834M0961L3871l17963j49234N9996
$$ plain form
15643 273499 391379 21283 -198537 -217571 -136630 95651 128935 -136916 106370 322793
15633 322793 94303 -323739 -220959 214202 151200 240987 659206 792554 528505 300029
15623 300029 540984 252133 -413345 -287077 -176697 -237224 -413366 -269062 -298260 -276077
15613 -276077 -187330 3307 -134882 -271509 -249585 -213568 -32032 210041 307474 239142
15603 239142 70450 -40784 39416 294566 350811 427362 577813 649370 572844 429263
15593 429263 368230 249401 118681 183153 418063 510154 248995 -24727 38940 229682
15583 229682 306712 506409 290150 76655 -354009 -261150 -314361 -601555 -639814 -57155
15573 -57155 370140 431519 244500 89935 181217 187051 228012 261883 -56080 -205314 -145318
15562a45318R4081o1674L77353J93549j16416K06982K64492l95219n32047K9196
15552h5021M51974J49677L6360k68538l25489k87745L79561J66594j35796Q9830
15542A71407K49605J12947j63690k82715m67354q4515L2894K15336k25933j03637
15532e45655j16049J48881M2622l47730N9419L29386J58667J52869Q6952J33934
15522A03296j65248j99427m12292k39856M36491N11257J94322j10761J95022K3878
15512C36682m58677k53319J11931N64981L57529l35044k29856p2355j39615j44711
15502b62454l85906K75737M797m2284L45806l2237J5208K6200k0008J02428K845
15491C0132J7988R4286M9247j2420k96431j05293K76792J14785j28446J38507
$$ plain form
15562 -145318 -51237 -112911 264442 457991 341575 548557 813049 417830 -114217 -85021
15552 -85021 366953 516630 552990 284452 -41037 -328782 50779 217373 81577 171407
15542 171407 421012 533959 370269 87554 -379800 -464315 -431421 -216085 -442018 -545655
15532 -545655 -661704 -512823 -470201 -817931 -758512 -429126 -270459 -117590 -30638 103296
15522 103296 -61952 -261379 -673671 -913527 -477036 34221 228543 117782 312804 336682
15512 336682 -121995 -375314 -263383 301598 659127 324083 94227 21872 -117743 -262454
15502 -262454 -648360 -372623 -367826 -410110 -64304 -96541 -81333 -55133 -75141 27287 30132
15491 30132 48120 142406 191653 179233 -117198 -222491 54301 169086 40640 179147
15481A79147n7688o8641M01443J5602l17539j13723l9110O2742j53757j5139j83415
15470b90078K33063K77022k07127j19584J87999j76316r9963K29988j77509j18416
15460b60921j3078K74460L06326L6843k12782k89504j36319O4599o5507M01129
15450A05246J04536j85007m22599K69370K66686j02750j58347j16726J00526L2676
15440a06389M2658n0978K8178j96020J08789J76460J22807P7891n31073k7744
15430c55421L94592K36230K18109J69603l71268l72087K2026k85506M6586Q9321
15420b07815N3305q205K5647l42745J0119K77529j14363k62154j80055J46258
15410f02479L0961j0561J55545o5026L67579M33185j12416J82435r0115j26235
$$ plain form
15481 179147 121459 52818 454261 469863 152324 38601 -509 62233 -91524 -106663 -290078
15470 -290078 -57015 220007 12880 -106704 81295 -95021 -194984 35004 -142505 -260921
15460 -260921 -273999 461 306787 343630 130848 -158656 -294975 -230376 -295883 105246
15450 105246 209782 24775 -397824 -128454 138232 35482 -122865 -239591 -139065 -106389
15440 -106389 -63731 -114709 -86531 -282551 -173762 2698 125505 203396 -327677 -355421
15430 -355421 39171 275401 493510 663113 291845 -80242 -58216 -343722 -297136 -207815
15420 -207815 -154510 -162715 -137068 -479813 -469694 -192165 -306528 -568682 -748737 -602479
15410 -602479 -571518 -582079 -426534 -491560 -123981 309204 196788 379223 289108 162873
15400A62873J5467K43300J03802j26299O575k86919k02396L6444j66755o3685
15390b77593J27947J4942K75165J71850m93264q2336J73200j57899r0308Q3056
15380b55240j83769K22301L11774k5295j25974J44653J78625j83842j67263M7122
15370c6908K21809J50899j36716N6222l1379L5203j99108l67451q2290M85357
15360I5638J84724j7159k21988n44103j25810k73412K37941K00612L33922L93240
15350B63605j04385k32358p5275n3037J8409L07025m4718j61021j69823o9391
15340c20969j83526j00765J18989K45722k15666k35010P8547L88440K01962p1647
15330i3923k07085Q4906R7345j9295j87632q4818L83273J27331j04698r264j15972
$$ plain form
15400 162873 178340 421640 525442 399143 405718 118799 -83597 -47153 -213908 -277593
15390 -277593 -149646 -134704 140461 312311 -180953 -263289 -90089 -247988 -338296 -255240
15380 -255240 -439009 -216708 95066 69771 -56203 88450 267075 83233 -84030 -36908
15370 -36908 184901 335800 199084 255306 223927 259130 60022 -307429 -389719 95638
15360 95638 280362 263203 41215 -502888 -628698 -902110 -664169 -463557 -129635 263605
15350 263605 159220 -73138 -148413 -201450 -183041 123984 79266 -81755 -251578 -320969
15340 -320969 -504495 -605260 -486271 -240549 -456215 -691225 -612678 -224238 -22276 -93923
15330 -93923 -301008 -216102 -118757 -138052 -325684 -410502 -27229 100102 -4596 -13860 -129832
15319a29832J23714o5312k59696j80486K07366K82985k32697J05998Q296k0542
15309a60206J42063Q6549l97496J88528j89783j84311J86730N46508P911K08614
15299D35107n8775m31629J27206J10316j70776j27362q3693j39457M5737j30483
15289d23809l14567M03795J00469L0729K63915J22348M666M72409L39805l57273
15279F42487k71379L6559o5495o8006n25629j63401j91350j58485J86769M98375
15269g9555n70162j5134L49203J78743J1856K30320j5572m5007K7203J52662k11480
15258A3077p8216O4934L50417l43964j75880L62099q336k21611m55526L5761j03278
15247e60523J46742K03739m6493j05342L0617k56558j00819M26237K01091O984
$$ plain form
15319 -129832 -6118 -71430 -331126 -511612 -304246 -21261 -253958 -147960 -139664 -160206
15309 -160206 -18143 68406 -329090 -140562 -330345 -514656 -327926 218582 226493 435107
15299 435107 376332 -55297 71909 182225 11449 -115913 -199606 -339063 -293326 -423809
15289 -423809 -738376 -334581 -234112 -203383 60532 182880 187546 659955 999760 642487
15279 642487 371108 407667 342172 274166 -251463 -414864 -606214 -764699 -577930 -79555
15269 -79555 -649717 -664851 -315648 -136905 -125049 105271 89699 44692 71895 224557 13077
15258 13077 -65139 -205 350212 6248 -169632 192467 184131 -37480 -493006 -457245 -560523
15247 -560523 -413781 -210042 -256535 -361877 -331260 -587818 -688637 -262400 -61309 -54325
15237e4325k80185J29451K77898J61039J86745p8268j91935j46072K2504K87208
15227C14060J73817l43330J44970L0509J0962M4088J4852j18087k77926j6268
15217b2353k09884J52682Q2309K16753k08652m51570j66125j36109L52054L62890
15207b8005J35889J37272k25308l18954K32312j12700k97627L1806j670K06934
15197b40051J3942j17609J30425J87160k32502L4321k6968L00407r8921k0232
15187g0028q9261K72770L51340l36875k36916K8456J7840K63237k8499J04486
15177B76550O1645k12145q3737J06888O1823j54004k12334Q0886K93255J33546
15167C52373l95405m6207K33453k1865k27482J37174J5129J69940J71107q0457
$$ plain form
15237 -54325 -334510 -205059 72839 233878 420623 342355 150420 4348 26852 314060
15227 314060 487877 144547 289517 320026 330988 375076 389928 271841 -6085 -22353
15217 -22353 -232237 -79555 2754 219507 10855 -440715 -606840 -742949 -390895 -28005
15207 -28005 107884 245156 19848 -299106 -66794 -179494 -477121 -445315 -446985 -240051
15197 -240051 -226109 -343718 -213293 -26133 -258635 -224314 -251282 49125 -49796 -70028
15187 -70028 -159289 113481 464821 127946 -108970 -80514 -62674 200563 172064 276550
15177 276550 338195 126050 42313 149201 211024 57020 -155314 -74428 218827 352373
15167 352373 -43032 -89239 144214 122349 -105133 32041 47170 217110 388217 307760
15157C07760j17999k0018r3080j93990l1115O0021m9501L56869j32918l32901
15147b46872k31411L42422m6274j03503Q2989k76966K37568J96028k88274p04
15137c34997L43777L5536J48010n8759J108J4428J7657k95261J87003L3858l74474
15126b82114j56022K25762k02147l7817J76346K02080q030j55811J63675M2646
15116c1432j1864Q3151J31118j41609P3499l07384K866L71113m5862k69643j46574
15105b92621P3195K04874L55722k1516n67946l81318L24224K14957N7704l1836
15095f4561K26703M20214k08392l10800O9269P5586k23917k96376j49197J48554
15085c12917r5631l59676L39421L17861l7127N4703j4617j85265l73270J32317
$$ plain form
15157 307760 189761 169743 76663 -117327 -148442 -88421 -137922 218947 86029 -246872
15147 -246872 -478283 -135861 -182135 -285638 -202649 -479615 -242047 -46019 -334293 -334997
15137 -334997 8780 44316 192326 133567 134675 149103 166760 -128501 58502 92360 -282114
15126 -282114 -438136 -212374 -414521 -452338 -275992 -73912 -81942 -237753 -74078 -31432
15116 -31432 -43296 39855 170973 29364 102863 -204521 -201655 169458 123596 -146047 -292621
15105 -292621 -219426 -14552 341170 319654 -248292 -629610 -305386 -90429 -32725 -64561
15095 -64561 162142 582356 373964 63164 132433 208019 -15898 -312274 -461471 -312917
15085 -312917 -408548 -768224 -428803 -110942 -148069 -93366 -107983 -293248 -666518 -534201
15075e34201L4950k08105q1679K2433L00297L58679Q6194m0139K45694R2851K15533
15064D92507K58704M75669n40630n29209K19662n4744q2980k17605k38216K93824
15054G6982J0685j82826K46217K74635q1811n8158m9857m60776l43851l60197
15044i28957L95966K10371j88919J41683M44941J81339J32987L5625J45657q3410
15034D87283k26377l03221l3652j24203k41059J58716N04794L96574q5043k05535
15024C28277j67141k82409l2362M7200J40664O4870j15810j02715k36680R9913
15014b56193K07193M29952p248q2538q8799k25341k86592J7774R1336K46974k47391
15003b00873r2649j19727K46450k14594J07177L25087Q7747k21047k85345K19169
$$ plain form
15075 -534201 -499251 -707356 -789035 -766602 -466305 -107626 -21432 -61571 184123 276974 492507
15064 492507 751211 1226880 686250 157041 376703 321959 238979 21374 -216842 76982
15054 76982 87667 -95159 151058 425693 343882 285724 235867 -224909 -568760 -928957
15044 -928957 -532991 -322620 -511539 -369856 75085 256424 389411 425036 570693 487283
15034 487283 260906 -42315 -75967 -200170 -441229 -282513 222281 618855 533812 328277
15024 328277 161136 -121273 -153635 -106435 34229 99099 -16711 -119426 -356106 -256193
15014 -256193 -49000 380952 373704 291166 202367 -22974 -309566 -291792 -200456 46518 -200873
15003 -200873 -293522 -413249 -166799 -381393 -274216 50871 138618 -82429 -367774 -148605
14993a48605j50932r3669M31303L10721R5128R1756J4340J09901n5179k31651
14983C73113l25093l03673O8928K21223j20209l25783j79364K31899L83185j09222
14973h4996k26572k17908J64216M9533J9048J00797o4796M6305K11351o6696l32267
14962d01985r5681M31168j3162j51268l3884j43768K69438K70459m2067j59405
14952g0155q3919J09845N20753q777m58906j85489Q5145J89744p5009m215J58042
14941A77059l4886m23146J94195L7598j26323Q9002K50393r6496l49350m77888
14931g59842k20230J51503M7413O2143L0415j47777M50676n7326K22359M3468
14921a77198q1142q9829j0281J09969J72010L7133J09386k5969M1633P0015j00412
$$ plain form
14993 -148605 -299537 -393206 38097 348818 443946 535702 550042 659943 604764 373113
14983 373113 48020 -255653 -186725 34498 -85711 -411494 -590858 -358959 24226 -84996
14973 -84996 -311568 -529476 -365260 -315727 -296679 -195882 -260678 -214373 -3022 -69718 -401985
14962 -401985 -497666 -66498 -79660 -230928 -264812 -408580 -139142 131317 89250 -70155
14952 -70155 -154074 -44229 476524 467747 8841 -176648 -91503 98241 23232 19017 177059
14941 177059 142173 -280973 -86778 -49180 -175503 -86501 163892 67396 -281954 -759842
14931 -759842 -980072 -828569 -781156 -719013 -688598 -836375 -385699 -443025 -220666 -177198
14921 -177198 -258340 -348169 -358450 -248481 -76471 -39338 70048 44079 85712 155727 55315
14910E5315q2265k50515L7907M29542j94229k04037k7282K35185J17573L29829
14900D47023J07893o6498l74643j18643J98809j91534j87504K2971p4704n487
14890b42317q4841k50135j0271J76987L08076J00585o6363k36611l43705m63285
14880a111880j02952M48863J59916J35721m7956L12061o4618k55597N8481M83926
14870A5965J86237l36844k30946K51800k59246m77451K39368K17009j6776l16930
14860g27814L01918P3923j57551n0952L49305K99992R0562m11021j99222M5238
14850c85622J90007J04649l37387K36288j28682k94217R6714K35939N68769J59109
14840D45567K4498J5462k06577L025j17720M9343j7195j10187P9757q0563j63484
$$ plain form
14910 55315 -26950 -277465 -239558 189984 -4245 -208282 -235564 -379 117194 447023
14900 447023 554916 488418 113775 -4868 193941 2407 -185097 -162126 -236830 -242317
14890 -242317 -327158 -577293 -587564 -410577 -102501 -1916 -68279 -304890 -648595 -1111880
14880 -1111880 -1214832 -765969 -606053 -470332 -518288 -206227 -270845 -526442 -467961 15965
14870 15965 202202 -134642 -365588 -113788 -373034 -850485 -611117 -394108 -410884 -727814
14860 -727814 -425896 -351973 -509524 -560476 -211171 88821 179383 -231638 -430860 -385622
14850 -385622 -195615 -90966 -428353 -192065 -320747 -614964 -518250 -282311 286458 445567
14840 445567 470065 485527 278950 281975 164255 213598 196403 86216 165973 85410 -78074
14829g8074k37641l2707k0463M2296J17373j45627K00512J45125k11536m0161
14819b60903q8667m36425j40501J06756J62420l7438L42403M42042N4916p0763
14809G3840m80832j09378M04617J68191j417J91591l7356r696j91727j7225M7456
14798C8064j9016J45401O3831K65133L0826J68218j38047k52814k0851K8198k11049
14787I7894K11581L43650j12852l518r7994J82987j33407j48365o5366j6476o3730
14776A94404l48041M6364K87241L06750r7563m79627k52192p9123L42412M07023
14766C27648J06403k83470J33453N2425j96304j49525j04643j0238M24315K21237
14756E21301j96837j51398r6103L6979P6252j29469j07186q972J9323l3058j43257
$$ plain form
14829 -78074 -315715 -348422 -368885 -326589 -209216 -354843 -154331 -9206 -220742 -260903
14819 -260903 -349570 -785995 -926496 -819740 -657320 -694758 -352355 89687 144603 73840
14809 73840 -406992 -516370 -111753 56438 55021 246612 209256 199560 7833 -9392 38064
14798 38064 19048 164449 228280 493413 524239 692457 554410 301596 280745 308943 97894
14787 97894 309475 653125 540273 536755 438761 621748 488341 339976 274610 258134 194404
14776 194404 -153637 -107273 179968 486718 389155 -90472 -342664 -421787 -79375 327648
14766 327648 434051 150581 284034 336459 140155 -9370 -114013 -124251 300064 521301
14756 521301 324464 173066 76963 113942 190194 60725 -46461 -55433 -36110 -69168 -212425
14745b12425K37459J55567m56463l3807K66380K75625o04J11919K6331k52353
14735A17629J50367l6570j05493O6894j79295j78197k1332J01139O9733P2957
14725E7832J12892q2028j78222j08692j46198L25417J05029m39336l25478K5852
14715f52932j7930J56205J64009M5910l2556j81176m8376K40139O6132Q5904K06679
14704C2008J45047K67268L9568m6504j66198L6758l38907j92761M4931J58607
14694b0183p8458J1578j07625k8398l2704K42066J36706K73443M3558J32232l58700
14683B13515k42745r1824l12326j50376K51969n3451j86484j86050J34299L40236
14673b83237K43248J91692M3115l15043l03677m2357R3954k4802K60861M7379
$$ plain form
14745 -212425 25034 180601 -275862 -309669 -43289 232336 231732 343651 369982 117629
14735 117629 267996 231426 125933 192827 13532 -164665 -185997 -84858 -15125 57832
14725 57832 170724 88696 -89526 -198218 -344416 -18999 86030 -353306 -678784 -652932
14715 -652932 -670862 -514657 -350648 -304738 -337294 -518470 -566846 -326707 -260575 -174671 32008
14704 32008 177055 444323 483891 437387 271189 307947 -30960 -223721 -178790 -20183
14694 -20183 -98641 -87063 -194688 -223086 -255790 -13724 122982 396425 439983 572215 213515
14683 213515 -29230 -121054 -433380 -583756 -331787 -385238 -571722 -757772 -623473 -283237
14673 -283237 -39989 151703 194818 -120225 -423902 -466259 -372305 -397107 -136246 -88867
14663h8867J54773q6708J46726J10705m41142j81461R194L01814L54298K354j01125
14652A80561j96383j33869J20301J37132j12714j69057K33941J70540j81579N1903
14642A00776J72047j00606j68128q3315j59427J44577j2808J42591j63782p0746
14632a98821q771P3777Q6178M0122J22201k09347J9002K90706M65864l3466M5063
14621F92508k5421J03357O1671j13223l19693k64517l17355K5331N4658r2079
14611a94763J84314L9125k74485N4100j8515r4003J63453L26188M3802k83342
14601e4126n1129J77602j78140j9911l31931j63057L49669J93453N3214k16342
14591b40698j94922J3496J03651j04233O298K26403K36038J3330m36027p7509
$$ plain form
14663 -88867 65906 -20802 125924 236629 -204513 -385974 -376780 -74966 279332 281686 180561
14652 180561 -15822 -149691 -29390 107742 -4972 -174029 59912 230452 48873 100776
14642 100776 272823 172217 4089 -79226 -238653 -94076 -106884 35707 -128075 -198821
14632 -198821 -207592 -133815 -47637 -7515 114686 -94661 -75659 215047 680911 647445 692508
14621 692508 667087 770444 832115 718892 399199 134682 -182673 -157342 -102684 -194763
14611 -194763 -10449 28676 -245809 -191709 -210224 -304227 -140774 185414 229216 -54126
14601 -54126 -105255 72347 -105793 -125704 -457635 -620692 -271023 -77570 -24356 -240698
14591 -240698 -435620 -422124 -318473 -422706 -416408 -190005 46033 59363 -376664 -454173
14581d54173j02179n4199J38322K10355K08054k59192j78171M85907J08768j46629
14571d3137M109P8785J58606j51897n1384k49352j00K00653K11463k20170J10825
14560D8401k99115j29156K91780K87991J07972L1345M7115l70065k70461J85093
14550f9100J35990k33608k86015Q97P3562M50593J14959J64471j92103j96223
14540c6577l5360j49308L1496N8152J27958L10495K18658k71378k26105k98852
14530b70821j72784p251M10168J42972j38603J74567K19133k14203k97945j97748
14520c52515m201Q948j2730k417k67795M07962J63824k2693K8228j91592j39783
14509c84764R8912J79315N26005k39646l33082L0459J47171j17037l02495m6162
$$ plain form
14581 -454173 -556352 -610551 -472229 -261874 -53820 -313012 -491183 -5276 103492 -43137
14571 -43137 -39028 39757 198363 46466 -4918 -254270 -254370 -53717 157746 -62424 48401
14560 48401 -250714 -379870 -88090 199901 307873 339218 386333 16268 -254193 -69100
14550 -69100 66890 -166718 -452733 -451836 -378274 72319 187278 351749 159646 -36577
14540 -36577 -71937 -221245 -189749 -131597 -3639 306856 525514 254136 28031 -270821
14530 -270821 -443605 -450856 -40688 102284 -36319 138248 357381 143178 -154767 -352515
14520 -352515 -356716 -347768 -360498 -362915 -630710 -222748 -58924 -81617 -53389 -244981 -384764
14509 -384764 -285852 -106537 419468 179822 -153260 -122801 24370 -92667 -395162 -441324
14499d41324J15945L77419L00041l13596m76991O9553L64604K75345L77896l13515
14489C35377l17479L12815k10571j38842j00015p3261L01291K29170l5735j31130
14479A71620m0638J7341l47867J53857Q827P257j78451l57317r8254K50388j36867
14468e50104K05601J1354J34739L03321j46849p2298K99528K62240P8569k56536
14458B69565k30498K72647m920J92458J5799l66325L6747j41994k63999q7579
14448c08099K21888K02429q1573k51143K45R9246k97529R7963K42347j28948o974
14437b10148k71704j04111k96547K26227M23252J12211j33053k09786L4071J03364
14427c26224J25379K29289M8243j36198n6463K06197N7155J5031J36836Q5322
$$ plain form
14499 -441324 -325379 52040 352081 38485 -438506 -368953 -4349 270996 648892 335377
14489 335377 17898 330713 120142 -18700 -118715 -191976 109315 338485 302750 171620
14479 171620 130982 148323 -199544 -45687 -36860 -29603 -208054 -565371 -663625 -413237 -550104
14468 -550104 -344503 -333149 -198410 104911 -41938 -114236 185292 447532 526101 269565
14458 269565 39067 311714 306794 499252 515051 148726 185473 43479 -220520 -308099
14448 -308099 -86211 116218 34645 -216498 -216253 -117007 -414536 -316573 -74226 -203174 -210148
14437 -210148 -481852 -585963 -882510 -656283 -233031 -120820 -253873 -463659 -429588 -326224
14427 -326224 -200845 28444 76687 -59511 -115974 90223 147378 162409 299245 384567
14417C84567Q9818j97201n5009J49953o7211m7498r692K27214k52977l87261K23288
14406E7991J67194l00110k65299K60540k127j62471K68563J18111l18330L7039
14396a38899j91801N5049K20357L4082j35890J8602M06822J76987l64777j26322
14386d5790P8650K7395L28685k30159k93178j13345J20086L28486k4038n3530
14376A23262k14338J67631l3967k59949l0761J01477K39170J82590O8980j21360
14366B22735J84445m56243k88472K95005J14971n3131L68137J77553l32888l57352
14356a25240j14367J76643m9307k93823M1107K07444J03716J85428K37920p6553
14346B92968N0785q665l43928l03448o1816L65697p8396k27501L95737M10722
$$ plain form
14417 384567 474385 277184 222175 372128 304917 257419 247727 474941 221964 -165297 57991
14406 57991 225185 -74925 -340224 -79684 -81811 -244282 24281 142392 -175938 -138899
14396 -138899 -330700 -275651 -55294 -21212 -157102 -138500 268322 445309 80532 -45790
14386 -45790 32860 60255 388940 158781 -134397 -247742 -127656 200830 176792 123262
14376 123262 -91076 76555 42588 -217361 -248122 -146645 92525 275115 344095 222735
14366 222735 407180 -49063 -337535 -42530 72441 19310 387447 565000 232112 -125240
14356 -125240 -239607 -62964 -112271 -406094 -364987 -157543 -53827 131601 369521 292968
14346 292968 343753 335088 -8840 -312288 -374104 -8407 -86803 -314304 81433 492155
14336D92155j00647l57977j11319J94720j16915j37822q640L02092O484l04681
14326a42550k97974l355L99328k78648k70693M5014J76496M874K05700K82014
14316A20206J52990n18064o5112K62947J20613L05253j82424N4044j4383n54120
14306c18050l70386L45076J3267K35347L32414l23613l80888K50499K01003j38827
14296a54158k76438J59014n2463k34097L04391P8730J83493J19846m22133J2564
14286b81251R0706m46556J72642J45054M1254q7862k28673J92000M6145J1199
14276c45342K272k49689L42593L65827O7163r7715L7125P958M33981J59655k53656
14265D70172l86231K06910k3976Q3847j28269R5607J00840k69086n41533L896
$$ plain form
14336 492155 391508 33531 -77788 116932 17 -137805 -146445 155647 162131 -142550
14326 -142550 -440524 -443879 -44551 -323199 -593892 -548878 -372382 -367508 -161808 120206
14316 120206 273196 -244868 -309980 -47033 73580 378833 196409 250453 236070 -318050
14306 -318050 -688436 -343360 -330093 -94746 237668 -85945 -466833 -216334 -15331 -154158
14296 -154158 -430596 -271582 -324045 -558142 -253751 -175021 8472 128318 -293815 -281251
14286 -281251 -190545 -637101 -464459 -319405 -278151 -366013 -594686 -402686 -356541 -345342
14276 -345342 -343070 -592759 -250166 115661 182824 85109 122234 130192 564173 723828 470172
14265 470172 83941 290851 266875 350722 222453 318060 418900 149814 -391719 -387823
14255c87823K1521k50740J12076j08129J60236L88671R9109J50595J58233K9487
14245C73236p2498j70329m08565P0194j21964K65177N94776K23437q0833l94433
14235B78198j79931J45589J35004o0962k68876K00983J03001j17986o2946K6319
14225A98393q2535J25811L1467j45825J10343j58443k01362k37721p814K97633
14215g0053m8667J16710K68306J2858o3794k16430j14319l50589j91169Q8200
14205e68947K65369L73189J33090K40314K0514k76265J18378J21817J78032O75
14195F06166m33732k00566k99416l9043L59743J28556n5102K09761K37458j5585
14185D98240k51631j67707P2440R0596J04740N4474R355j86476L81897J24985
$$ plain form
14255 -387823 -366302 -617042 -504966 -613095 -452859 -64188 34921 185516 343749 373236
14245 373236 300738 130409 -278156 -207962 -329926 -64749 530027 753464 672631 278198
14235 278198 98267 243856 378860 317898 49022 250005 353006 235020 172074 198393
14225 198393 115858 241669 273136 127311 237654 79211 -122151 -359872 -367686 -70053
14215 -70053 -118720 -2010 266296 279154 215360 -1070 -115389 -465978 -657147 -568947
14205 -568947 -303578 69611 202701 443015 463529 187264 305642 427459 605491 606166
14195 606166 172434 -28132 -327548 -366591 -6848 121708 66606 276367 513825 498240
14185 498240 246609 78902 151342 241938 346678 401152 410507 224031 605928 730913
14175G30913k50092J26488k30898o50831k06441J45773M10536L17779p0482n67053
14165b44308J2829M20396O2371k21833k22159l64972L7887K41237K31881J35915
14155H9244K001k59414m6667K58551J16881k35373k88071k0489M71327K94490
14145C82480l16455j20569m9598O9165L37972m0547l94292J5764K85101K47290
14135D16311q6146n7695k54676M2402J08856K32311q7169j04714p1401j050j50563
14124a3534J91819K77908k34094O0512Q2196o8086l49212J32649J11835o771j00356
14113H4866l99274K41260L56677R1789j60815j30258m4544l2331K38398k81185
14103c5417r5619J78393n8199j50502l11161l85979J80600J40988J94266M18323
$$ plain form
14175 730913 480821 607309 376411 -274420 -480861 -335088 75448 393227 322745 -244308
14165 -244308 -231479 188917 251288 29455 -192704 -557676 -519789 -278552 -46671 89244
14155 89244 91245 -168169 -214836 43715 160596 -74777 -362848 -383337 87990 382480
14145 382480 66025 -54544 -104142 -34977 302995 262448 -131844 -116080 169021 416311
14135 416311 330165 272470 17794 60196 169052 401363 314194 209480 138079 137029 -13534
14124 -13534 178285 456193 222099 282611 364807 296721 -52491 80158 191993 185222 84866
14113 84866 -314408 -73148 283529 375318 214503 84245 39701 7370 245768 -35417
14103 -35417 -131036 47357 -10842 -161344 -472505 -858484 -677884 -536896 -342630 75693
14093G5693L09226R8720l57340j15027r788J08164J8801k42806J71293M2720j12045
14082a2389K35132J36780j00143j95869j93228k1303L16276k13759o96021j34182
14072h78706K52294M11922J0236J47480K40141L4454l58505R9157K06076K83041
14062D47590K218j61428j37011l08751k22941L29804k8288r1273j94230j51993
14052e16303L41680L38204J01234j59796J08415k20274l51569j26870j71953L36695
14042c20537M98753N3416l20298j7261j45086O5726j11824k87509P867K3450l0084
14031e83387J27251K45651R1780j13243K73384J86311P7550K25536Q454r326l58311
14020A71650j85995k5986k5110K23923L41727j14198l3420p8376j91919k44972
$$ plain form
14093 75693 384919 483639 126299 11272 1484 109648 128449 -114357 56936 99656 -12389
14082 -12389 222743 359523 259380 63511 -129717 -151020 165256 -48503 -744524 -878706
14072 -878706 -626412 -214490 -204254 -56774 183367 217821 -140684 -41527 164549 447590
14062 447590 449808 288380 151369 -157382 -380323 -50519 -78807 -170080 -364310 -516303
14052 -516303 -174623 163581 264815 105019 213434 -6840 -358409 -485279 -657232 -320537
14042 -320537 178216 231632 -88666 -105927 -251013 -185287 -297111 -584620 -576753 -553303 -583387
14031 -583387 -456136 -210485 -118705 -231948 41436 227747 305297 530833 539287 529961 171650
14020 171650 -14345 -40331 -65441 158482 500209 386011 352591 274215 82296 -162676
14010a62676R7389k97239l57102K39443L80566L0954P285M49223L12053o1670
14000F38226j42636j20837l37517K1722k4290p035J20962p4796J03438J99847
13990C77084l40639Q3510j3969n32530j15150J18429L32193j3287l7747J57911
13980A5805l75151l82026J26204K79749J43478J5466P1858O6942L70271L5383
13970C67979r1457r6905k72849L277M51370j49279Q9455K68741J26897p2171P4068
13959F99126J3481n74603l33418m38742O5564O35897R6370k35773r0377o4977
13949b27452K77439K25451o4981J89343l071l74080J04471K25677j03137j5905
13939B33755J7034J13811l00040j22787j91473j01721K45748L14333j70934j21748
$$ plain form
14010 -162676 -65287 -362526 -719628 -480185 -99619 -68665 -61380 387843 699896 638226
14000 638226 495590 374753 37236 58958 34668 27633 148595 73799 177237 377084
13990 377084 36445 119955 105986 -426544 -541694 -423265 -91072 -104359 -142106 15805
13980 15805 -359346 -741372 -615168 -335419 -191941 -176475 -104617 -37675 332596 367979
13970 367979 276522 179617 -93232 -89955 361415 212136 301591 570332 697229 625058 699126
13959 699126 712607 138004 -195414 -634156 -568592 67305 163675 -72098 -162475 -227452
13949 -227452 49987 275438 210457 399800 396729 22649 127120 352797 249660 233755
13939 233755 250789 364600 64560 -58227 -249700 -351421 -105673 208660 37726 -84022
13929h4022M4041J3861R2753N6367j04598k54573L00088N01700r0306k38544j27585
13918A09182k83109R7393j73797j5132J13158j23680l94414m7064N3046j31542
13908g95959K34745L61443k8067m3848K41638O3732l02586j56263p466j29216
13898e61847J97569p513J01162N0982k94176J09336J87412j03520M4958L50556
13888G4919n9972J36370J58617L7246M39201k36032j30729k01101N1202k24245
13878D5476R1930K53723k66276k67845n0308K74508K43079j48521j41902l61822
13868c27958K83699K66659l4497R1126K57810k44526O1053L8812k8146n6510k17439
13857I0083j06064o9698J69275m0997k63914m9336J11406k85158P0941K91581
$$ plain form
13929 -84022 -39981 -26120 66633 123000 18402 -236171 63917 565617 475311 236767 109182
13918 109182 -173927 -76534 -250331 -265463 -152305 -275985 -670399 -717463 -664417 -795959
13908 -795959 -561214 -199771 -227838 -271686 -30048 33684 -268902 -425165 -432631 -561847
13898 -561847 -364278 -371791 -270629 -219647 -513823 -404487 -217075 -320595 -275637 74919
13888 74919 14947 151317 309934 347180 786381 550349 419620 218519 269721 45476
13878 45476 137406 391129 124853 -142992 -193300 81208 324287 175766 33864 -327958
13868 -327958 -44259 222400 187903 279029 536839 292313 353366 392178 364032 307522 90083
13857 90083 -15981 -85679 83596 42599 -221315 -270651 -159245 -444403 -373462 -81881
13847h1881J29102Q4645l06811j28274J21011k90232M3146L59421K15810l5160
13837A10777k73941M46046J26451l24054l58050J10608q7894k6335M7580J67578
13827f1234m1973p2129M38518R3480q3148j68945K7535Q958r0479M36725J14594
13816F01902m71362j99201l32520J81335L34941k905j13458M2459K84702Q9617
13806D15510j01847l41764l16531q0114N8588J97021O8972l823K33026J04233
13796B33271k97613o2421K9366M2101K5074k15535p0460k31433J8586r6529J57592
13785d68001Q3374j08062P8007k3959n7069K05215k68080M8806L54198j5648k25557
13774c96776l96794J19692L09564j18004j09783L15416j26360L723P0072o6422
$$ plain form
13847 -81881 47221 131866 -174945 -303219 -182208 -472440 -429294 -69873 145937 110777
13837 110777 -163164 282882 409333 85279 -272771 -162163 -250057 -276392 -228812 -61234
13827 -61234 -103207 -175336 263182 356662 273514 104569 132104 141062 50583 487308 601902
13816 601902 130540 -68661 -401181 -219846 115095 112190 -1268 41191 325893 415510
13806 415510 313663 -28101 -344632 -424746 -366158 -169137 -100165 -103988 129038 233271
13796 233271 -64342 -126763 -97397 -55296 -30222 -245757 -316217 -547650 -529064 -625593 -468001
13785 -468001 -384627 -492689 -414682 -438641 -495710 -290495 -558575 -509769 -155571 -171219 -396776
13774 -396776 -793570 -673878 -364314 -482318 -592101 -276685 -403045 -399322 -329250 -395672
13764c95672p8582L57505L7440j03974j3390J94200j55440k25839J27762K29378
13754b6612J3808r8092n3793J31353M97941M40096k76379q03896k93917K3805
13744d45686N62305J61590j71169L68253l0154j80983l21747K18708L64681O7061
13734E92859J01749l77419k79666N270j16969j96663Q8794N0921K31432j75322
13724g5014K87926L25041R3593j78347k72799l76278j14210J14906o9708M290
13714b60600l36376j58487J95111J75966K78730j6809Q3262J32572K3987k59445
13704a42089o4024q8752L11369K25346K20692m51785r0655K14184L49375j23640
13694C60021k53338j48357k30909j12448k61648r8593N43716L34882m1126o4289
$$ plain form
13764 -395672 -474254 -116749 -79309 -183283 -196673 -2473 -157913 -383752 -255990 -26612
13754 -26612 -12804 -110896 -164689 -33336 464605 904701 628322 -175574 -469491 -445686
13744 -445686 116619 278209 107040 475293 445139 264156 -57591 161117 525798 592859
13734 592859 694608 317189 37523 42793 -74176 -270839 -182045 -131124 100308 -75014
13724 -75014 212912 537953 631546 453199 180400 -195878 -310088 -195182 -264890 -260600
13714 -260600 -596976 -755463 -560352 -384386 -105656 -122465 -39203 93369 117356 -142089
13704 -142089 -206113 -294865 16504 241850 462542 10757 -79898 134286 483661 360021
13694 360021 106683 -41674 -272583 -385031 -646679 -745272 -201556 133326 92200 27911
13684B7911K73180K90298O8351k32962j05703m8774L69966q6766n29877l11107
13674b85483K08747k25584m55511J32950L34421N3023J56952L19573n9565k58830
13664g9307j44290J57431J31770P0802k49708k01438L79317L39025J74473R8884
13654F76959p6082n16478l83562K1458J66474j3378l89923J81781O55066L22716
13644F45031n47089l17970Q232r9352K86039K49724L26166J05630j26155k12915
13634C17341J1600j6723j67994k50888J9221k14834j74307R6833K27293J82609
13624C0151J02457j81142J08506J70841k06139j88319p5589Q1637K60231k06319
13614a03685P5700P8202J51713o4570r4770R0816Q6570O2899p4271K1552j23015
$$ plain form
13684 27911 301091 591389 659740 426778 321075 272301 642267 555501 25624 -285483
13674 -285483 -76736 -302320 -757831 -624881 -290460 -237437 -80485 239088 179523 -79307
13664 -79307 -223597 -66166 65604 136406 -113302 -314740 64577 403602 578075 676959
13654 676959 600877 84399 -299163 -277705 -111231 -124609 -514532 -332751 322315 645031
13644 645031 97942 -220028 -211796 -311148 -25109 224615 550781 656411 530256 317341
13634 317341 328941 312218 144224 -106664 -87443 -302277 -476584 -379751 -152458 30151
13624 30151 132608 -48534 59972 230813 24674 -163645 -239234 -157597 102634 -103685
13614 -103685 -27985 50217 201930 137360 42590 133406 219976 282875 208604 230156 107141
13603A07141k8633j11663m6261N8331j82919J5817j76101j08928N0532J62217
13593b60467j08714j38577J42984L16704J39955K09599K44669r2666l24280k60884
13583a31677R632J98688l31848l10607k02840M3789L68443L28570O0602R6471
13573A29223K88957M2886j63884k93535p8958j32418J78457J32743J45414r2701
13563A56184O7897j14168Q6147K81497k33499J8977K18572k1840P0505j62080
13553C68192n19748N3422K33560K16534K11998K3698n54475m23552L15390K93660
13543B18679J28697J71571o2234M188j79063r9386j99595j46075L05951L64419
13533E07152j5633Q0771j7120m14263j56813k07467K5071k1637o6547K27504k61096
$$ plain form
13603 107141 78508 -33155 -79416 -21085 -204004 -188187 -364288 -473216 -422684 -260467
13593 -260467 -369181 -507758 -364774 -48070 91885 301484 546153 453487 129207 -131677
13583 -131677 -122045 76643 -255205 -565812 -768652 -724863 -356420 -27850 32752 129223
13573 129223 418180 461066 297182 3647 -75311 -207729 -29272 103471 248885 156184
13563 156184 224081 109913 196060 477557 244058 263035 481607 459767 530272 368192
13553 368192 -151556 -98134 135426 351960 563958 587656 33181 -390371 -74981 218679
13543 218679 347376 518947 456713 460901 281838 182452 -17143 -163218 142733 507152
13533 507152 491519 572290 555170 140907 -15906 -223373 -198302 -219939 -286486 -58982 -320078
13522c20078O199J27414j87215j18176K5776j74525O25486n4247J34015L0267
13512I4916K77138J07917N6648r973k49107J3278j50871n9695P3678p5467J761
13501H0223k47287m0309k84218r3522L67835J20674k65487k43149K05521M70030
13491G0311K47466J27341j62396P3848K3594l08770O9934J80206l65392k81465
13481c25323K99611K40924J11732m9240l32114j16256k72816Q4587j38352k49635
13471g46882p7049L44756M28267J09435N890l62421L4219j40634q3128R7342q1223
13460d71428J21136n6063J01908J10300k08214j44764K39242K84695M03539Q9473
13450D69824j69191j17412j55954j72086K72580K19429j67243l89703P1926J51974
$$ plain form
13522 -320078 -313879 -186465 -373680 -491856 -466080 -640605 -15119 -69366 64649 94916
13512 94916 372054 479971 536619 526646 277539 290817 139946 80251 153929 78462 80223
13501 80223 -167064 -207373 -491591 -585113 -217278 -96604 -362091 -605240 -399719 70311
13491 70311 317777 445118 282722 356570 380164 71394 141328 321534 -43858 -325323
13481 -325323 -25712 215212 326944 277704 -54410 -170666 -443482 -358895 -497247 -746882
13471 -746882 -823931 -479175 -50908 58527 64417 -298004 -263785 -404419 -487547 -390205 -471428
13460 -471428 -350292 -406355 -304447 -194147 -402361 -547125 -307883 -23188 380351 469824
13450 469824 300633 183221 27267 -144819 127761 347190 179947 -209756 -137830 14144
13440A4144K3650Q6081M2425J61447L39612o5527l91448k14048P421K31020O1192
13429B95969q0344O8860K09467k9000m64922M5223n89197n62309K12982K25158
13419f68113J66686K76017r9639k8541K07947J8675k85768K08767j04892J96877
13409a11984m33694l99166J90460L66511K9015k28358j45447R6828L36767J2584
13399b86484J44120K09662J55579m338n5678k18722j64949n1363O9877K02262
13389c4L06095K798R2519P599k73276j45336k72029L4289r3121j63395K70975
13378b32916N8696k1327j43266M9516p4238k33323n3969K85538K63817j39132
13368b40604K6191J63545j62485l01549j53882J12783K43803J40907k8197J42807
$$ plain form
13440 14144 37794 123875 166300 327747 667359 601832 210384 -3664 3757 234777 295969
13429 295969 215625 284485 493952 464952 30 45253 -543944 -1106253 -893271 -668113
13419 -668113 -501427 -225410 -325049 -353590 -145643 -126968 -412736 -203969 -308861 -111984
13409 -111984 -545678 -944844 -754384 -387873 -358858 -587216 -732663 -635835 -299068 -286484
13399 -286484 -142364 67298 222877 218539 162861 -55861 -220810 -272173 -202296 -34
13389 -34 306061 308859 401378 408977 135701 -9635 -281664 -247375 -340496 -503891 -232916
13378 -232916 -174220 -195547 -338813 -289297 -363535 -596858 -650827 -365289 -101472 -240604
13368 -240604 -214413 -50868 -213353 -514902 -668784 -556001 -312198 -171291 -199488 -56681
13358e6681m2180k45306j09006J09348k89648J1917K84601J64551K83884k50613
13348a39133j93383J53371K94874K3479n7457j01590k78177q8373J283K98186
13338h6920j8410j0171J31518j06472l52507L13261M0464J4180n7707j45393k61690
13327e39847J80857n4429l6215J23084L24102K5999M0136l02620J2395j39675
13317c66213j59567K73566L99285M39250J98266j89747l23149l36144J74484N302
13307A15333O7577J23624k09888k34552R8691k4165J71024j83216l98401J40602
13297c33371K95295j01704K3156K29702j95454j56471l8354K02431L65204l06989
13287a6555Q6939L51266r731n8498k77128j40181l3456k73107k49314K34007N3798
$$ plain form
13358 -56681 -98861 -344167 -453173 -343825 -633473 -621556 -336955 -172404 111480 -139133
13348 -139133 -332516 -179145 115729 139208 81751 -19839 -298016 -386389 -385106 -86920
13338 -86920 -105330 -115501 16017 -90455 -442962 -129701 -89237 -75057 -132764 -278157 -539847
13327 -539847 -358990 -413419 -449634 -326550 -2448 23551 63687 -238933 -226538 -366213
13317 -366213 -525780 -252214 147071 586321 784587 594840 271691 -64453 110031 115333
13307 115333 182910 306534 96646 -137906 -39215 -63380 107644 -75572 -473973 -333371
13297 -333371 -38076 -139780 -116624 113078 -82376 -238847 -277201 -74770 290434 -16555
13287 -16555 70384 421650 411919 353421 76293 -63888 -97344 -370451 -619765 -385758 -331960
13276c31960K26177m5944l33242j45916R9492J53182M27290J74132N0279l438
13266B70052J24712J09530J00383K42148k504k31104m74379k66197O0427M4756
13256b2176K91755J14314m56898l06473Q7012J56484L5435K68507l3112j91141
13246e6293J97330J20498j2327l63152j9915O253J02240P176K99836K9502k79706
13235C1442j12867q6718k24675L42116L11097M9240j23741Q9900j31253m24617
13225b80076k94749J9829L80753R3280j66724l1777K33331j46208l7875J10242
13215a19974K6051J92568R9225k77234M233l7663J39406N5133J95010K72938O6217
13204F15910j52891k03666J86833K3805l91430m7228j05574J39042k06919R3224
$$ plain form
13276 -331960 -105783 -151727 -484969 -630885 -531393 -378211 49079 223211 273490 270052
13266 270052 394764 504294 604677 846825 844321 613217 138838 -127359 -66932 -22176
13256 -22176 269579 383893 -73005 -379478 -292466 -135982 -100547 167960 134848 -56293
13246 -56293 141037 261535 249208 -113944 -133859 -127606 -25366 -18190 281646 311148 31442
13235 31442 -81425 -168143 -392818 -50702 260395 309635 185894 275794 144541 -280076
13225 -280076 -574825 -554996 -174243 -80963 -247687 -279464 -46133 -192341 -230216 -119974
13215 -119974 -93923 98645 197870 -79364 -75131 -112794 26612 81745 276755 549693 615910
13204 615910 463019 259353 446186 469991 78561 31333 -74241 64801 -142118 -48894
13194d8894k25442k37363M3661L98821K85921P7452J44736j58442j22179J4664
13184A72935k43249J24116L48647o7450k79168j68572l64228O4726M58442K30398
13174B76597L24216l20888j14738K29704p9523j07916j27675k90849r4698k46055
13164e51825k50571L25658R03908L47467m51484O4072J75239K71895J56747k28613
$$ plain form
13194 -48894 -274336 -511699 -468038 -69217 216704 294156 438892 280450 158271 172935
13184 172935 -70314 53802 402449 334999 55831 -112741 -476969 -412243 46199 276597
13174 276597 600813 279925 165187 394891 315368 207452 79777 -211072 -305770 -551825
13164 -551825 -802396 -476738 427170 774637 323153 387225 562464 834359 991106 762493
$$ [...]
##END NTUPLES=NMR SPECTRUM
##END=
