##TITLE=Analysis number 322570
Compound Code cc 55646
Book Reference 423/106
Project Code adrs
Chemist Name bruced
##JCAMPDX= 6.0         $$ Bruker NMR JCAMP-DX V2.0
##DATA TYPE= NMR SPECTRUM
##DATA CLASS= NTUPLES
##ORIGIN= Bruker BioSpin GmbH
##OWNER= nmr
$$ XWIN-NMR		Version 3.5
$$ Fri Sep 29 10:43:55 2006 GMT Daylight Time (UT+1h)  MAYBRIDGE\nmr@NMR_250MHZ
##.OBSERVE FREQUENCY= 250.131544655141
##.OBSERVE NUCLEUS= ^1H
##.ACQUISITION MODE= SIMULTANEOUS (DQD)
##.ACQUISITION SCHEME= undefined
##.AVERAGES= 16
##.DIGITISER RES= 18
##SPECTROMETER/DATA SYSTEM= dpx250
##.PULSE SEQUENCE= zg30
##.SOLVENT NAME= CDCl3
##.SHIFT REFERENCE= (INTERNAL, CDCl3, 0, 16.522)
##AUDIT TRAIL= $$ (NUMBER, WHEN, WHO, WHERE, WHAT)
$$ ##TITLE= Audit trail, XWIN-NMR		Version 3.5
$$ ##JCAMPDX= 5.01
$$ ##ORIGIN= Bruker BioSpin GmbH
$$ ##OWNER= nmr
$$ C:\u/data/dgb/nmr/ADRS/2070/pdata/1/auditp.txt
$$ ##AUDIT TRAIL=  $$ (NUMBER, WHEN, WHO, WHERE, WHAT)
(   1,<2006-09-29 10:43:10.32 +100>,<MAYBRIDGE\nmr>,<NMR_250MHZ>,
      <created by zg, POWCHK disabled, PULCHK disabled
       configuration hash MD5:
       E2 DF 36 D8 04 B2 41 60 5A D7 A3 38 5A 4B D0 FE
       data hash MD5: 64K
       78 B2 FC B8 74 96 BF D7 78 61 39 23 C2 2E 02 42>)
(   2,<2006-09-29 10:43:31.10 +100>,<MAYBRIDGE\nmr>,<NMR_250MHZ>,
      <Start of raw data processing
       ef LB = 0.3 FT_mod = 6 PKNL = 1 SI = 32K 
       data hash MD5: 32K
       35 BA 03 2F 1A D7 01 32 F5 91 CD C6 F2 71 2B 69>)
(   3,<2006-09-29 10:43:36.12 +100>,<MAYBRIDGE\nmr>,<NMR_250MHZ>,
      <apk 
       data hash MD5: 32K
       9A C5 CE 30 75 80 75 E7 C2 B8 02 19 18 94 F5 41>)
(   4,<2006-09-29 10:43:38.05 +100>,<MAYBRIDGE\nmr>,<NMR_250MHZ>,
      <abs ABSG = 5 
       data hash MD5: 32K
       DD 15 1D 42 37 75 71 74 51 1C FE C1 A1 3E 6C 12>)
$$ ##END=
$$ 
$$ hash MD5
$$ 9D EB D9 D1 92 90 43 4F 71 73 9C 10 BD 50 96 6F
##$RELAX= 
##$RELAX= 
##$RELAX= 
##$RELAX= 
##$RELAX= 
##$RELAX= 
##$RELAX= 
$$ Bruker specific parameters
$$ --------------------------
##$DU= <C:\u>
##$EXPNO= 2070
##$NAME= <ADRS>
##$PROCNO= 1
##$TYPE= <nmr>
##$USER= <dgb>
##$AMP= (0..31)
100 100 100 100 100 100 100 100 100 100 100 100 100 100 100 100 100 100 
100 100 100 100 100 100 100 100 100 100 100 100 100 100 
##$AQSEQ= 0
##$AQ_mod= 3
##$AUNM= <au_zg>
##$AUTOPOS= <15 >
##$BF1= 250.13
##$BF2= 250.13
##$BF3= 250.13
##$BF4= 250.13
##$BF5= 500.13
##$BF6= 500.13
##$BF7= 500.13
##$BF8= 500.13
##$BYTORDA= 1
##$CFDGTYP= 0
##$CFRGTYP= 5
##$CHEMSTR= <none>
##$CNST= (0..31)
1 1 145 1 1 1 1 1 1 1 1 1 1 1 1 1 1 1 1 1 1 1 1 1 1 1 1 1 1 1 1 1 
##$CPDPRG= <>
##$CPDPRG1= <>
##$CPDPRG2= <>
##$CPDPRG3= <>
##$CPDPRG4= <mlev>
##$CPDPRG5= <mlev>
##$CPDPRG6= <mlev>
##$CPDPRG7= <mlev>
##$CPDPRG8= <mlev>
##$CPDPRGB= <>
##$CPDPRGT= <>
##$D= (0..31)
0 1 0 0 0 0 0 0 0 0.06 0 0 0 0 0 0 0.0002 0 0 0 0 0 0 0 0 0 0 0 0 0 0 
0 
##$DATE= 1159522981
##$DBL= (0..7)
120 120 120 120 120 120 120 120 
##$DBP= (0..7)
150 150 150 150 150 150 150 150 
##$DBP07= 0
##$DBPNAM0= <>
##$DBPNAM1= <>
$$ [...]
##$SUBNAM7= <"">
##$SUBNAM8= <"">
##$SUBNAM9= <"">
##$SW= 20.6930455092707
##$SWIBOX= (0..15)
0 0 3 0 0 0 0 0 0 0 0 0 0 0 0 0 
##$SW_h= 5175.983436853
##$TD= 65536
##$TD0= 1
##$TE= 295.16
##$TE2= 300
##$TE3= 300
##$TEG= 300
##$TL= (0..7)
0 120 120 120 120 120 120 120 
##$TP= (0..7)
150 150 150 150 150 150 150 150 
##$TP07= 0
##$TPNAME0= <>
##$TPNAME1= <>
##$TPNAME2= <>
##$TPNAME3= <>
##$TPNAME4= <>
##$TPNAME5= <>
##$TPNAME6= <>
##$TPNAME7= <>
##$TPOAL= (0..7)
0.5 0.5 0.5 0.5 0.5 0.5 0.5 0.5 
##$TPOFFS= (0..7)
0 0 0 0 0 0 0 0 
##$TUNHIN= 0
##$TUNHOUT= 0
##$TUNXOUT= 0
##$USERA1= <user>
##$USERA2= <user>
##$USERA3= <user>
##$USERA4= <user>
##$USERA5= <user>
##$V9= 5
##$VALIST= <valist>
##$VCLIST= <CCCCCCCCCCCCCCC>
##$VD= 0
##$VDLIST= <DDDDDDDDDDDDDDD>
##$VPLIST= <PPPPPPPPPPPPPPP>
##$VTLIST= <TTTTTTTTTTTTTTT>
##$WBST= 1024
##$WBSW= 4
##$XGAIN= (0..3)
0 0 0 0 
##$XL= 0
##$YL= 0
##$YMAX_a= 655390
##$YMIN_a= -702032
##$ZGOPTNS= <>
##$ZL1= 120
##$ZL2= 120
##$ZL3= 120
##$ZL4= 120
##$ABSF1= 16.522
##$ABSF2= -4.171173
##$ABSG= 5
##$ABSL= 3
##$ALPHA= 0
##$AQORDER= 0
##$ASSFAC= 0
##$ASSFACI= 0
##$ASSFACX= 0
##$ASSWID= 0
##$AUNMP= <proc_1d>
##$AZFE= 0.1
##$AZFW= 0.1
##$BCFW= 0
##$BC_mod= 0
##$BYTORDP= 0
##$COROFFS= 0
##$CY= 12.5
##$DATMOD= 1
##$DC= 0
##$DFILT= <>
##$DTYPP= 0
##$F1P= 14.0000005364418
##$F2P= -0.99999901652339
##$FCOR= 0.5
##$FTSIZE= 32768
##$FT_mod= 6
##$GAMMA= 0
##$GB= 0
##$INTBC= 1
##$INTSCL= 1
##$ISEN= 128
##$LB= 0.3
##$LEV0= 0
##$LPBIN= 0
##$MAXI= 10000
##$MC2= 0
##$MEAN= 0
##$ME_mod= 0
##$MI= 0
##$NCOEF= 0
##$NC_proc= -3
##$NLEV= 6
##$NOISF1= 0
##$NOISF2= 0
##$NSP= 0
##$NTH_PI= 0
##$NZP= 0
##$OFFSET= 16.522
##$PC= 1
##$PHC0= 151.2314
##$PHC1= 5.344594
##$PH_mod= 1
##$PKNL= yes
##$PPARMOD= 0
##$PSCAL= 4
##$PSIGN= 0
##$REVERSE= no
##$SF= 250.13
##$SI= 32768
##$SIGF1= 0
##$SIGF2= 0
##$SINO= 400
##$SIOLD= 32768
##$SREGLST= <1H.CDCl3>
##$SSB= 0
##$STSI= 32768
##$STSR= 0
##$SW_p= 5175.98343685301
##$SYMM= 0
##$S_DEV= 0
##$TDeff= 65536
##$TDoff= 0
##$TI= <Analysis number 999999
Compound Code 99
Book Reference 9
Project Code 9>
##$TILT= no
##$TM1= 0
##$TM2= 0
##$TOPLEV= 0
##$USERP1= <user>
##$USERP2= <user>
##$USERP3= <user>
##$USERP4= <user>
##$USERP5= <user>
##$WDW= 1
##$XDIM= 32768
##$YMAX_p= 322871853
##$YMIN_p= -55459
$$ End of Bruker specific parameters
$$ ---------------------------------
##NTUPLES= NMR SPECTRUM
##VAR_NAME=  FREQUENCY,     SPECTRUM/REAL,   SPECTRUM/IMAG
##SYMBOL=    X,             R,               I
##VAR_TYPE=  INDEPENDENT,   DEPENDENT,       DEPENDENT
##VAR_FORM=  AFFN,          ASDF,            ASDF
##VAR_DIM=   32768,         32768,           32768
##UNITS=     HZ,            ARBITRARY UNITS, ARBITRARY UNITS
##FACTOR=    0.157963299565203, 1,           1
##FIRST=     4132.6476996994, 0,             0
##LAST=      -1043.33573715361, 0,           0
##MIN=       -1043.33573715361, -55459,      0
##MAX=       4132.6476996994, 322871853,     0
$$ Real data points
##PAGE= N=1
##DATA TABLE= (X++(R..R)), XYDATA
$$ [...]
20998 -3889 -4670 -11049 -15049 -22458 -22157 -5849 -7293 -16059 -22123 -13805 -10421 -6985 3314 -3256 -8703
20983 -8703 -4924 -2585 -2551 -20452 -23133 -10803 -8373 -4610 -16735 -12814 1123 -3965 337 2631
20969 2631 3174 3348 -372 7645 13136 7050 -1811 -9728 -16357 -16339 -14107 -8907 -9620 -7645 -7962 -3033
20953 -3033 -662 4276 6812 -8278 -10941 -16842 -23055 -14086 -17728 -16588 -8596 -18254 -21994 -35689
20939 -35689 -24475 -3319 -11185 -31263 -18069 -10245 -16420 -1855 9714 13384 21252 22941 3229
20926 3229 -1667 3110 -11182 -15050 -18902 -22679 -23202 -23567 -35651 -30300 -26180 -17805 -15530 -16143 -22557
20911 -22557 -23485 -23984 -6545 -3955 -2649 5761 -14244 -28629 -23612 -18581 -2455 11387 1081
20898 1081 -19543 -14824 -6154 -7836 9157 8473 -9189 -18989 -11278 7745 14495 4723 3713 8553
20884 8553 -4808 -12059 -7401 -4456 -4700 -9636 -12194 -11152 -7967 -7353 -14391 -15352 -17990 -485 1304
20869 1304 -9540 -5578 -4344 -8033 -12816 -9718 -4750 -11238 -5914 -8943 -1210 -7748 -13305 -14730
20855 -14730 -16431 -5628 13820 10720 3484 -5719 1125 14994 10491 -10337 -7932 -8722 -8313 -102
20841 -102 -6933 612 -5261 -10717 -9336 -1417 -8285 -15124 -22132 -20446 -10257 -6606 -5063 -12853 -14664
20826 -14664 -13687 -20609 -23925 -23843 -22240 -17737 -21305 -22048 -10034 446 -43 9102 8513 17444 14422
20811 14422 3301 6800 4824 6085 -538 -6359 593 5810 14440 7604 2909 -12369 -12999 -19187
20797 -19187 -9504 -7641 -4631 -4301 2108 8511 12600 -4660 -10260 -1216 -1031 -5668 -219 -6340 -23086
20782 -23086 -6890 12053 3131 -1522 2920 4908 -4271 -1198 7993 3297 94 -3669 -1560 8745
20768 8745 12530 6782 1805 -588 -13651 -16057 -4512 -5506 -2637 -2614 -4905 4374 -2516 -15067 -17560
20753 -17560 1095 12196 6225 8061 361 -10696 -17438 -4949 -1506 -478 2315 -5981 -9009
20740 -9009 3338 9228 21778 13082 7580 1730 4964 6304 2558 -16237 -25194 -4426 8664
20727 8664 2539 2102 -3813 -15358 -5858 -3213 -8789 -9334 -14349 1034 8123 21479 14129 1711
20713 1711 -11241 -18293 -9927 -8811 -4940 7600 12921 12137 22207 30710 12719 1040 11539
20700 11539 23069 22453 19844 13473 6672 2419 -10934 -17315 -13007 -7073 -3649 -1479 4264 -11572
20686 -11572 -28328 -24658 -17622 -1942 -4018 -15191 -15323 -25318 -26173 -20304 -12844 1537 5180 545
20672 545 -1521 671 7659 3251 1144 -6699 1350 15516 15942 14583 20746 25743 33306 27385 793
20657 793 -10024 -10482 -6695 -209 -13878 -21468 -2379 17679 22042 6929 -13035 -18257 -15097 -10403
20643 -10403 -18490 -13326 -8288 -11443 -12702 -13484 -6177 -10234 -12523 -19254 -38097 -29526 -17784 -20189
20629 -20189 -5238 -6257 -13781 -20205 -10741 -6458 -5145 1065 -8077 -5302 -9823 -15762 -8006 2332
20615 2332 4685 -11970 -7661 7800 8447 -5735 -15604 -6760 -13418 -1517 13777 8168 -4177
20602 -4177 -1083 21291 22398 7761 21280 26514 20532 -1493 -7923 -7706 -14752 -10180 -4390 -10332
20588 -10332 -13688 -10155 -12452 -12813 -16893 -26998 -23133 -31492 -37851 -32724 -15031 -10917 -9204 -6869
20574 -6869 -4279 -8365 -7713 -8573 -13385 1136 1659 -2485 -3789 5278 26 2441 17308 10283 2964
20559 2964 12512 10227 4474 7539 -5910 -11396 2697 16602 4849 -2382 -9727 -11579 -12113 -13893
20545 -13893 -18910 -20136 -18623 -16466 -9831 3533 5836 -7714 -17403 -9641 -11642 -9720 -3294 7220
20531 7220 -1411 -8931 -14848 -3868 -3316 -8013 -2584 -3543 -5486 -4818 2806 -4469 -17474 -27551 -21373
20516 -21373 -8085 -3797 -5470 -11430 -11332 -15668 -16474 -18626 -18359 -14141 -30313 -36936 -33858 -25186 -22730
20501 -22730 -27619 -29058 -6804 1096 -7763 -10305 -6016 -3716 -18115 -9564 5660 8593 14229 20857
20487 20857 20963 993 -4976 -1320 13109 19701 19900 15964 14978 10542 17762 16678 -43 -11852
20473 -11852 -24858 -24911 -20593 -5483 -6471 -10513 -7465 -989 14408 22063 11843 7553 -10598 -23312
20459 -23312 -16687 -19205 -4871 -5995 -12988 -1711 4414 -5579 -4265 -3239 -1841 6928 15203 16843
20445 16843 4721 -913 2246 2945 7118 9049 4297 1925 -16804 -13885 -1777 6855 6228 -950
20431 -950 -10203 -30032 -17265 -3735 -720 2585 8239 -2090 -8351 -3816 -4326 -9306 6311 -2991
20417 -2991 -13752 -22101 -8567 -10937 -15703 -6153 11565 11163 9251 17771 18433 21902 9116 -12324
20403 -12324 -12313 -3005 -2250 2333 522 -15371 -17489 -11745 -5385 -8463 -21495 -27772 -23655 -19763 -9857
20388 -9857 9051 5959 -7193 -12468 -19984 -9840 -11984 -13846 -11767 -18956 -3071 3022 11776 8777
20374 8777 -9575 -10369 -13825 -7111 10203 -1763 -5293 -12 -7178 -16113 -14022 -20093 -16617 -2670
20360 -2670 1855 -3553 3187 362 -7067 -6038 -25912 -26733 -21319 -17367 -10406 -5253 7143 13721
20346 13721 19792 19116 3450 -7421 -12438 -13779 6945 11492 2362 521 17795 24743 14778 8861
20332 8861 1327 -8468 -19829 -15230 -7265 9 3286 11265 8344 -5467 -14020 -2304 4625 12083
20318 12083 16310 5618 -2549 -6558 -8092 -3803 1528 -1497 5396 -3923 -13300 -8486 -16791 -12433
20304 -12433 1519 9890 12251 8959 20843 21522 11421 2980 2351 6853 8896 7619 6256 7208
20290 7208 8487 7320 2599 11997 9793 -727 -5919 1483 3735 -5188 -9658 5994 14791 14857 10169
20275 10169 7258 10076 11960 -3670 -7864 -13176 -7620 5645 12143 12701 19646 15040 20825 13703
20261 13703 9471 5696 -490 -8815 5318 10704 23224 32504 28021 9896 1308 2989 -1279 -16394
20247 -16394 -3903 586 6810 6827 230 5833 14152 9633 -1617 -12335 -6404 -5958 -4800 -15239
20233 -15239 -5636 -12755 -7311 9965 2645 -2827 -2718 -2313 687 2428 -138 -1342 -4479 -956 1718
20218 1718 3332 115 -6983 -8155 -11137 -12858 -811 -6848 -20123 -17849 -5108 7745 8523 2162
20204 2162 -1585 498 784 4731 -1357 -348 13376 22000 28089 31676 17476 5801 6214 -5155
20190 -5155 1081 15698 14959 18670 17591 -3773 -2686 -28 -10579 -16090 -10430 -1967 8800 20790
20176 20790 14123 771 574 9426 7808 2847 -4175 224 2079 2336 15093 6137 1174 -4417
20162 -4417 -9509 -17130 -18379 -11154 5207 1738 -2869 -3406 -648 12067 22805 26235 23829 27420
20148 27420 22323 8303 5238 14982 27280 25549 13418 8661 11603 8080 2099 -1799 -550 6690
20134 6690 7393 840 -7152 -13082 -7858 -2320 24106 31097 24586 29724 32005 18130 9513 -14346
20120 -14346 -35536 -34251 -21113 -25648 -15100 -3345 -504 -15426 -26390 -40393 -37314 -29097 -17335
20107 -17335 -9251 -7115 -15236 -15022 -25370 -18661 -1298 3415 17460 11618 -2539 -1660 -8760 -25774
20093 -25774 -27211 -24668 -33470 -26410 -26713 -37247 -32291 -18342 -21635 -18611 -10113 -13139 -19777 -14345
20079 -14345 -9584 -6582 1690 6156 -5828 -11876 -3325 -5214 -13455 -11782 357 -1842 -17885 -32759
20065 -32759 -21548 -14510 1750 6421 -6505 -25879 -26227 -15226 -13174 -24012 -10622 3640 -2193
20052 -2193 -4396 -8683 -21842 -24067 -17827 -19465 -11885 -11381 -5759 -5245 -9521 -8129 64 1285 7466
20037 7466 18855 18856 20716 20346 26184 20842 16159 16451 13002 14567 7357 7855 10724 14153 23900 23729
20021 23729 19545 10374 -6746 -9113 -9886 -15817 -8712 7245 6899 -689 -699 -8854 -10770 -13991 -15966
20006 -15966 -9057 -6273 -917 -3403 825 2740 -6103 -17922 -8848 -10297 -34960 -39278 -28535 -17914
19992 -17914 -16753 -10032 -7115 -6632 -6219 -1232 14473 13312 3344 -3921 9070 -780 -18120 -9857
19978 -9857 6666 -2020 -6533 3119 2340 -792 -2021 -8730 -10289 -4877 2504 -7545 2115 14187
19964 14187 6398 10573 7167 -12400 -32745 -36461 -25237 -18660 -17204 -16991 -8005 -178 7151 7863
19950 7863 14582 3859 -15479 -19634 -19406 -13220 -12247 -11541 -6050 48 -1159 -5196 -5780 -5273 -2940
19935 -2940 -903 -5238 -7119 6075 13765 4802 -3866 -15314 -25461 -42426 -50232 -37343 -32878
19922 -32878 -34615 -27014 -23418 -14713 -4693 3480 5896 19746 34905 26394 19523 9951 5007 7451
19908 7451 -9365 -10599 -10301 -15737 -7825 -8998 -21259 -32001 -42469 -33609 -29794 -27571 -23127 -11853
19894 -11853 -12376 -12072 1110 14308 11585 8704 6623 8765 11416 20211 21466 19311 13940 13875 17043
19879 17043 7353 -9997 -10087 1945 9308 10992 5977 6802 -2319 -4187 -7311 -14039 -6017 9720
19865 9720 11778 15499 25881 32191 25484 12999 4085 10044 11956 5243 -10209 -7322 15758 26765
19851 26765 31039 22119 12292 17611 24138 19978 6025 14033 17282 10548 12040 12778 1312 -6649
19837 -6649 -5595 3454 -7927 -23077 -14454 -14110 -4344 -5410 -13876 -16860 -11063 -17330 -2670 6994
19823 6994 3021 -1351 -2738 -23861 -29776 -16719 -12471 -26 -164 7115 -1679 -9070 1235 14753
19809 14753 12242 11682 16920 22883 23071 14861 -8535 -8207 -7516 -3098 -12246 -8866 294 -4394 1699
19794 1699 -10531 -22394 -14550 -13578 -20093 -25760 -26677 -16386 -14635 -6999 9966 13582 236 -7055
19780 -7055 -13285 -12123 -25688 -16296 6266 20155 12368 19083 25663 15479 7774 268 -8318 -20609
19766 -20609 -26055 -19926 -27835 -29797 -17519 -22797 -10079 -1983 1983 1420 -10655 -24292 -24396 -21351
19752 -21351 -31210 -27754 -18332 -18671 -13979 -6988 -14958 -16051 -10252 -934 -4608 -5103 -12639 -24607 -36419
19737 -36419 -28485 -27709 -22964 -8295 -308 -10431 -19927 -21819 -22675 -15500 -8295 -10790 -5418 -740
19723 -740 1454 -10940 -19004 -26976 -29244 -19435 -6543 5150 7235 13595 11390 10075 16479 25125
19709 25125 21016 12930 10465 30692 51686 49330 34969 22303 24255 22612 36544 47605 36617
19696 36617 35595 36272 17055 26863 33935 27769 16576 11163 19633 40662 33345 25443 40336 44365
19682 44365 45724 44392 40318 38700 14936 11131 11236 20981 18801 16902 20955 18610 12328 22797
19668 22797 33028 14297 6551 11381 4665 31 106 -6503 -451 21652 25191 17755 12614 18356
19654 18356 21128 5985 -10559 -2277 11380 7407 -664 -3012 8721 2480 16 -6855 4540
19641 4540 13558 171 -9627 -4042 500 4190 701 1027 9345 15476 11857 5542 7512 -8146
19627 -8146 -14971 -15465 -7021 997 -3531 -12380 -4547 -9059 -10127 -14218 -17566 -24893 -22658 -15434 2592
19612 2592 13340 5717 -4793 -7527 605 1903 3499 4351 -1887 -7391 2974 9206 -3241 -5668
19598 -5668 -1789 -3650 -17474 -18777 -16819 -6445 4980 10151 -7393 -1225 8852 -1596 -14194
19585 -14194 -21178 -17355 -8356 2666 9483 15377 5244 8188 -3342 -849 4926 2447 3662 2097
19571 2097 -17071 -21739 -15310 -12638 -23394 -10482 -1591 9362 13555 7852 -4144 -1449 -5246
19558 -5246 -12038 -15004 -7291 -6175 -12867 1009 -3245 -11138 -8133 -1477 10812 9936 3491 -4154
19544 -4154 -4105 2770 16139 15001 -274 1380 662 17 -11159 -2888 8008 11307 14107 2913
19530 2913 -2837 -12158 -11546 -11282 -3293 -435 -7222 -101 7965 881 5204 5580 -6958 -17819 -16228
19515 -16228 -1616 -6014 -17400 -3240 4856 21104 10502 -8429 -18865 -12354 2401 6422
19503 6422 28781 33454 18748 17835 15400 12183 16449 26640 28776 29673 28331 11441 8619 13025
19489 13025 13192 30916 30644 19371 20059 26026 28812 41859 43238 35614 22855 19636 15296 -3598
19475 -3598 -13198 -15282 -27132 -19118 -11405 -6378 -10847 -24293 -22668 -10458 -5895 7585 5818 -1834
19461 -1834 -3957 12272 21377 15504 11067 10886 10070 1782 4565 15336 21469 15840 11873 5332 6119
19446 6119 13839 33171 42756 54281 72340 78984 95008 90589 86779 85927 84829 56243 33000
19433 33000 36469 48558 45558 41940 27886 11334 -7894 -2230 8478 13610 12481 8206 10514
19420 10514 4945 7969 3454 207 4519 -8577 -16748 -18720 -19691 -10116 -5579 69 3422 3743 6738
19405 6738 29 -6642 6080 5101 4643 5043 2011 2664 -10636 -8729 2317 -667 4757 14330 11182
19390 11182 -3335 -8743 -2729 3978 5982 11969 16020 20978 21530 15817 14070 6700 10709 7659
19376 7659 6414 -1881 -13319 -14226 4178 11632 16517 19507 34378 35781 34544 40092 48234 39417
19362 39417 48786 51970 53616 68380 79081 100955 116947 95078 57571 45570 44909 33677 30178
19349 30178 39839 35010 23037 5522 -5907 3812 10976 27867 45129 38566 26290 27534 13456
19336 13456 3156 -2452 201 9946 19657 17277 21023 23772 19683 13052 11388 3452 6115 5087
19322 5087 6593 -884 -14714 6889 18005 15558 18470 15480 15707 8023 3293 2824 -7449 -264
19308 -264 141 2959 4751 8971 10549 14930 24494 20776 11640 6386 -1785 -4993 -608 6869 6235
19293 6235 11950 13622 6053 3388 -4475 -6921 -7373 884 5947 -5705 -20056 -24425 -16073 327
19279 327 16958 10840 13180 15354 -455 -4779 -2321 -18242 -13503 -1694 -138 -7847 -4784 -1915
19265 -1915 -3876 2779 -5085 -17163 -12962 -3313 -1704 -1531 3669 -3042 -145 -4817 -18296 -6070
19251 -6070 3056 740 -5886 -18966 -4560 6583 4262 1092 -2319 -10972 -5687 -3666 5597 1328
19237 1328 1392 16011 7116 -7186 2036 11177 3460 -2890 118 81 3455 11780 20963 19566 16447
19222 16447 28841 23130 13924 6806 24476 28695 28330 20182 16744 9162 9261 3493 1737 -1973 -3673
19207 -3673 1994 -10741 -12711 -5060 7267 24166 28217 23095 21287 14407 8191 -612 -8480 -8219
19193 -8219 -6456 -10630 -7806 8765 10770 8445 -4134 -8745 -11020 1258 2210 -6377 -14734 -16013
19179 -16013 -11431 -1844 373 -14049 -9267 -13130 -11790 -1543 -5500 -6496 -4188 -1808 591 -5293
19165 -5293 -4694 -10112 -5010 -5165 3190 361 9956 35503 48471 50047 52001 45757 43628 20606
19151 20606 24839 44515 39731 42496 58376 64734 64871 65966 63639 54379 36442 26689 30800 56687
19137 56687 56996 64955 78895 73866 55405 44774 39278 40732 30222 22412 20950 15159 8845 -777
19123 -777 15369 34872 24341 18650 14964 1334 -4848 -9980 -21654 -17835 -5409 2103 3664
19110 3664 11014 27751 33966 43940 32566 36210 52968 68456 71421 52701 26978 13000 16109
19097 16109 34734 39146 37814 45066 65741 76237 70308 75539 76705 64036 36039 10518 -5648
19084 -5648 3293 9501 10827 18547 19802 5391 -5172 -1343 -69 888 -3658 -8782 1220 -5008
19070 -5008 -12104 -5074 -6322 -3794 107 -782 5435 1986 8224 11724 720 -7566 2504 6185
19056 6185 -3792 -4962 9183 12817 7766 -5271 -14078 -8781 -2712 9018 19599 16869 8463 11559
19042 11559 -4775 -10865 -12796 -803 10150 13267 5732 -4554 -1175 -7133 -5479 -5738 -18318
19029 -18318 -19401 -12809 -10859 -12027 -18841 -27771 -19193 -8757 -14374 -9833 -13615 -25184 -25151 -27721
19015 -27721 -24038 -7704 7235 -6045 -6944 -363 9076 7582 2799 -1734 -4091 -7831 -15125 -12088
19001 -12088 890 6945 -6327 -9874 -6672 -999 -6368 -9971 -21227 -29003 -24655 -18529 -2345
18988 -2345 168 -1597 -6502 288 4476 7572 9336 10596 7176 3620 -6496 6038 8195 13350
18974 13350 9020 -2611 1232 -714 9346 9324 14411 9087 15303 12985 5020 967 5139 7420
18960 7420 -14015 -18245 -10490 -6236 -3451 -4006 -16506 -14727 -13436 -6892 -5225 -10621 -17058 -17501 -10221
18945 -10221 3897 15020 16089 9891 -1547 -4165 -4165 -5699 -11582 -8914 -7155 -12451 -4151 -6339
18931 -6339 -18251 -9810 -4759 -8731 -6182 -9470 -10511 -4844 -106 5768 9497 7500 8954 13991
18917 13991 3593 -7163 -9707 304 3182 183 504 10012 12702 4691 -2935 -8049 -12054 -8715
18903 -8715 69 14798 23191 20388 10042 1251 -3945 -10064 -2270 -7046 -259 -4701 -6778 5357
18889 5357 17736 9032 745 4369 797 -4322 8715 1481 -17969 -18063 6172 8970 8834 15549
18875 15549 12623 -7547 -15613 2381 6777 1601 6321 11079 13168 -5427 -24236 -23015 -13329
18862 -13329 -17271 -23604 -6663 7063 11665 19368 25781 26256 15316 3622 7754 -980 -2280 -7309
18848 -7309 -12555 -22095 -17949 -9456 -8312 -9251 -19104 -26111 -20574 -14097 -15727 -1607 5712 14168 15140
18833 15140 13146 13319 13045 9365 -4140 -12221 -13211 -4783 -1505 4349 6883 3897 -3804 5740 20782
18818 20782 24016 13005 7829 8641 26223 14286 -844 4675 9212 13796 15151 9345 16279 7310
18804 7310 3873 14618 5646 11528 8473 10700 14501 14345 12873 4047 9631 21833 15784 22903
18790 22903 30980 45017 36423 13121 -7473 -7760 -627 8533 22881 22372 21196 21620 16720 -9961
18776 -9961 -18179 6542 37166 44101 51373 74220 89979 100497 84840 54997 58484 58043 60013
18763 60013 47367 33434 28041 32999 30876 25701 23836 29234 16640 7446 23552 26778 21590
18750 21590 22403 21814 28357 34158 32990 38176 40317 39540 32751 41449 43118 40464 32173 32430 33441
18735 33441 27615 28865 34389 43068 26053 6298 11485 33185 50258 33500 20261 22266 19926
18722 19926 30221 31027 24127 25474 28472 29004 36217 50625 51266 48536 46890 44122 35118 33848 34766
18707 34766 27944 27277 25305 36137 49465 46862 35048 20657 22281 24256 36345 32457 18630
18694 18630 16432 23941 18950 8053 -5406 -596 13461 17470 31389 34480 27162 21759 27451
18681 27451 32558 42850 47860 34676 24599 26118 24685 41463 69602 93961 111356 124811
18669 124811 156446 182324 219672 234606 259510 296032 336935 371646 392312 403399 390441
18658 390441 365034 352983 331499 334619 340240 341386 321887 322209 340095 344738 326911 304108 287600
18645 287600 268155 238460 210876 201292 173259 150516 138112 143360 150981 139922 137512 142326
18633 142326 141670 158518 181727 179820 160549 165964 160334 165369 180448 203499 228242 262805 281227
18620 281227 314787 366187 419595 458708 470538 506100 549679 588575 644897 711199 773461
18609 773461 807344 845114 890917 911765 903882 854592 776484 703857 658082 593673 538097 491942
18597 491942 442736 404564 359377 326960 292684 263649 250587 248583 241733 227924 218003 216298
18585 216298 210769 216452 227240 231143 206708 176415 174396 178231 182493 192193 194739 181983 186814
18572 186814 201313 217414 239600 253132 287678 310736 320308 328881 340337 357476 356897 348995
18560 348995 336629 325198 335359 348377 349076 341918 346254 337856 345726 359278 350778 337645 334919
18547 334919 330355 302112 282264 255069 229871 207556 181212 149541 143017 130354 122280 113402
18535 113402 118194 118468 121620 104923 103032 110624 101353 98516 103464 101783 91553 89420 82891 79561
18521 79561 87093 99335 102177 99887 83407 71316 56560 50430 55286 63254 72372 78840 80121
18508 80121 74148 70246 78606 81387 80297 82695 73143 66378 68048 73178 66783 60163 59407 47907
18494 47907 35977 42375 39575 39065 39412 42372 54907 67088 59637 53173 59557 61863 49831 49162
18480 49162 52701 69649 84721 85793 80080 77758 72034 61274 53875 55214 56315 58586 51490 39392
18466 39392 35416 31504 28746 37510 29030 26498 37764 42725 46969 54397 54778 53290 54925 38544
18452 38544 39556 42405 47631 54775 38862 24401 33129 48065 50303 51100 52204 48106 36231 50195
18438 50195 67666 62996 46987 48742 46694 53175 48438 42337 49555 48162 66401 91221 107127
18425 107127 126756 147393 152728 157893 185264 224807 278378 322004 353981 394170 418842 398427
18413 398427 373687 360505 341455 307341 273497 259363 239806 217431 203260 200805 210402 204079
18401 204079 190961 186446 175831 163746 148661 133999 129360 118683 120054 119250 115591 119029 123315
18388 123315 129210 121324 114049 120517 123438 136991 152347 179764 192503 211540 224648 225971 220339
18375 220339 220405 220705 223006 233637 230555 239579 259812 280503 300408 325855 344308 343140 353059
18362 353059 368970 380588 376616 352047 325790 325096 317108 291656 263027 241746 231287 236387
18350 236387 222148 202101 174847 167034 165308 170453 188478 197188 200366 208690 190466 175555 149055
18337 149055 122379 123569 119935 116505 125151 129167 130257 131104 128167 134776 143045 142347 138139 119697
18323 119697 112506 125361 131106 144010 143040 132757 117949 112957 120782 117659 104698 114083 105331
18310 105331 99935 115785 124100 126911 129218 138456 135740 134364 125137 112969 112565 115146 115972 121937
18296 121937 122514 128207 136732 143626 142296 145858 168549 179843 173974 161861 162509 157424 149768 144034
18282 144034 161385 182063 185939 169041 164693 176903 175317 172096 170017 168835 171948 174441 169218
18269 169218 175730 187871 183235 177177 171948 170615 184347 186154 181413 176259 166851 162334 169858 181312
18255 181312 192024 188034 184936 176090 172981 179556 175973 173099 171118 179113 184375 180631 179391 167287
18241 167287 170789 191290 202616 200045 206547 211859 222692 237714 237655 240391 232963 229764 252640
18228 252640 269998 278457 283744 292261 295838 308296 331524 348412 360773 376637 396770 415266
18216 415266 416241 428877 456069 477118 495394 511217 523051 532000 553349 567679 592768 637707
18204 637707 671071 688242 728682 774914 827948 897425 969727 1040034 1100882 1181787 1265376
18193 1265376 1351455 1451113 1573376 1712070 1882809 2120267 2426950 2798380 3258883 3829620
18183 3829620 4519979 5406037 6517202 7880328 9517802 11444541 13456831 15202629
18175 15202629 16529539 17249107 16961273 16106155 15281339 14427451 13699697 13036821 12144880
18166 12144880 11201221 10496878 10075573 9987718 10175281 10506355 10842306 11056679 11028374 10706216
18156 10706216 10232472 9737466 9223675 8620988 7995956 7445663 7042459 6857891 6842314
18147 6842314 7010089 7388476 7977264 8796260 9881533 11253001 12881782 14642374 16318152
18138 16318152 17651787 18422137 18512400 18259005 18275089 18951161 20557248 23356365 27613736
18129 27613736 33710970 42095182 53149828 66813395 82219409 98006065 112759068
18122 112759068 124179423 129554786 128676995 123100464 113630732 102440450 92625456 85046372
18114 85046372 79461789 76519034 77604040 82262701 86889060 90706406 98234820 108345092
18106 108345092 118683341 128405718 136137357 139149104 136330594 128794111 116689771 101254778
18098 101254778 85754704 72099534 60684780 51808771 45460275 41162069 38323555
18091 38323555 36543890 35581260 35208214 35153310 35130381 34824976 33917845 32281294 30259443
18082 30259443 28175551 26190421 24445191 22945608 21645402 20538965 19613674 18855784
18074 18855784 18268846 17860817 17639833 17609421 17771800 18094461 18494549 18888954 19229106
18065 19229106 19427882 19401160 19132710 18774997 18515616 18451243 18663439 19160259 19882300 20733892
18055 20733892 21683176 22512441 23134012 23788562 24390775 24670970 24613992 23861060 22146963
18046 22146963 20168955 18232605 16327415 14735312 13538024 12578948 11794710 11139420
18038 11139420 10558308 10038064 9593589 9211432 8896992 8608620 8362381 8133151 7906164
18029 7906164 7696477 7465867 7206308 6954108 6718396 6470190 6227420 6025128 5847634
18020 5847634 5674332 5497598 5332513 5185318 5046998 4927826 4807092 4684277 4573585
18011 4573585 4458888 4354580 4244984 4145209 4030108 3936077 3867726 3795226 3706947 3630589
18001 3630589 3564428 3498433 3436936 3387521 3328381 3272387 3219078 3151125 3089256 3019899 2952804
17990 2952804 2885664 2814251 2734155 2682852 2634648 2577411 2522131 2471597 2424105 2383527 2349075
17979 2349075 2312640 2278452 2244692 2206333 2150117 2101073 2035008 1978315 1921488 1869261 1801871
17968 1801871 1743289 1710324 1684220 1651838 1623916 1611743 1593838 1546647 1525198 1498878 1457244
17957 1457244 1411963 1390591 1367624 1332645 1301762 1277854 1257823 1250316 1232347 1205229 1190755
17946 1190755 1174048 1144289 1124972 1102558 1082688 1074398 1073556 1055701 1033331 1010468 994720 967514
17934 967514 964360 937742 911769 892516 871286 862807 851704 831152 827107 804998 775035 763538
17922 763538 749694 725524 703444 692970 673764 646811 637136 619624 611090 610947 593260 588200
17910 588200 574356 566488 564781 550670 535978 530870 522122 505064 497199 479499 471463 448872 428022
17897 428022 412404 387521 376391 381574 373561 370424 371645 370827 368346 359473 362444 353024 338163
17884 338163 332560 326312 326037 313199 320084 315641 307987 309363 316081 304619 294326 286442 294842 300782
17870 300782 280452 282184 280810 272785 267429 247788 239725 241247 241085 243798 254504 250111 254527 249387
17856 249387 231384 224018 218944 226016 230632 222800 231445 238206 231803 241562 235382 225220 222994 202533
17842 202533 199514 204312 203613 201225 189013 173355 163272 159341 148421 154823 164909 171661 167265
17829 167265 171916 171679 173758 153218 145850 141915 140195 143126 144685 140282 146390 144172 137508 139312
17815 139312 143840 152104 155015 133989 127159 139043 140561 129070 128754 133899 140592 149406 142137 144929
17801 144929 152165 165974 157971 134344 135764 139787 151376 166281 169746 159366 145721 144864 143534
17788 143534 128200 120492 131566 122722 116200 124787 121232 115689 105132 104021 100519 103674 105347
17775 105347 98080 97709 107861 102638 102384 106070 101179 98950 91157 86801 83473 100271 101257 89462
17761 89462 82559 87380 103689 101049 82302 64842 82560 87200 82010 81914 86334 94508 81131 71052
17747 71052 61365 59213 61063 64665 65098 73350 77137 66778 70326 75804 80304 79909 53557 34125
17733 34125 25275 26728 30272 37135 49515 38680 25958 21300 39401 39291 25046 31716 39766
17720 39766 51018 53381 50480 47937 39069 46514 53057 53980 51797 40778 42226 45713 41729 36942
17706 36942 40107 39279 49575 62557 58131 46155 33872 34134 20627 19197 29248 36651 40033
17693 40033 42322 53127 68528 68268 79792 71527 64770 57901 42767 41218 50565 59193 71700
17680 71700 75881 82189 91572 84416 81939 85304 85823 104734 126351 159683 179302 178506 193737 236561
17666 236561 252331 246684 237028 229589 226663 238447 244056 259726 270633 262621 258517 243769 235092
17653 235092 236806 242119 222849 199527 187803 182867 175236 176501 165311 155148 151468 149416 157513
17640 157513 156682 148410 143323 130877 117570 111643 128164 148052 156491 166399 177652 176253 169603
17627 169603 171106 180965 211356 232948 258231 283200 296106 327772 358984 389332 424662 446916
17615 446916 475332 506372 522679 530375 519928 513261 509977 496878 473143 452242 431486 407944
17603 407944 372379 348366 336918 304189 256897 254707 246182 224323 186115 170650 163275 156294
17591 156294 159482 158409 163726 182256 193526 185445 167282 163566 156649 150145 146305 161142 170515
17578 170515 179178 195768 219635 224568 216767 230447 258117 245669 243652 259666 258010 250887 239972
17565 239972 221083 201660 187632 179114 182634 193612 203957 228050 233595 237791 254472 245749
17553 245749 214594 195455 192176 185840 159670 132614 108206 103368 121309 123621 117285 110417 107385
17540 107385 94257 85118 89240 83450 81718 89338 92367 94633 86559 92363 96707 87024 80000 71054
17526 71054 69655 72638 60439 52520 49900 57078 58031 42163 46859 41848 56042 70426 82365
17513 82365 74556 61823 49251 50667 50496 50664 57612 55136 49460 44080 28661 26097 23643 29145
17499 29145 40530 55111 53299 60313 57429 48266 37477 41211 56447 48656 34879 38004 44787
17486 44787 49006 48164 60473 53878 29204 14986 24458 37327 37358 29537 30593 38527 36378 35485
17472 35485 29968 21298 29501 31752 24741 23374 8651 5217 1080 11774 33690 57190 48722
17459 48722 41992 43989 52681 67221 68835 67954 54436 60887 62010 54416 53256 55703 67714 71160
17445 71160 77982 88433 82634 61822 33368 29351 29622 37189 40846 40834 44527 41185 34017 28721
17431 28721 37869 32108 43366 47355 59917 58062 45074 29088 16100 5669 183 6600 12148
17418 12148 15305 16681 19779 30669 30870 26256 32800 27600 22376 9246 1321 9718 15918 13903
17404 13903 10782 20587 38405 31945 36685 34392 27743 28409 35937 43134 34221 16325 10729 23420
17390 23420 37400 34372 30672 20374 10339 13631 18805 28455 23589 22401 44264 54756 46846
17377 46846 37649 30148 24111 29434 37364 31962 27812 28811 14735 17678 21906 23483 19947 25241
17363 25241 24660 18178 20262 26633 22159 14030 -6266 -11770 2495 16044 19896 26004 22038 12009
17349 12009 17830 13082 14063 21479 9793 -11213 -13872 -7976 -1125 3027 -592 -188 16311 20857
17335 20857 25298 43725 40870 26991 26678 20365 -1696 -13977 -13104 -14939 -10198 -6645 -6578 11420
17321 11420 21891 18953 22079 27757 25809 25710 17870 14857 24287 34634 33951 14429 7087 -2167
17307 -2167 -2204 12743 16414 19269 12255 1869 3327 -4318 -5075 -1466 13650 28284 11392 3360
17293 3360 219 10511 25102 19340 17746 8779 -11155 -1167 -14035 -17698 -22613 -18282 -10842 -10554
17279 -10554 -4749 17733 23370 16516 17236 16561 19169 12958 22436 20722 21468 19378 4317 -1471 -13916
17264 -13916 -24155 -18259 -10257 6530 14804 12730 -9077 -6868 -881 9141 15610 21064 32946
17251 32946 19751 10536 18242 9112 3787 -3439 1758 10490 11340 10790 20659 23710 27850 20898 13382
17236 13382 17557 23131 15745 4850 5539 668 15939 19280 23428 16792 11300 12980 13176 6745
17222 6745 422 -3496 -9205 -11539 -4907 -9288 -4248 19315 20034 11708 5267 18756 26597 20848
17208 20848 10421 14506 22669 29581 19530 13179 10985 5902 10499 6519 13087 13247 3409 9964
17194 9964 14399 14532 15459 20600 22241 19729 17891 8613 12669 9822 14235 25128 16166 -496 1449
17179 1449 12127 5112 -269 1966 5603 6448 4582 8937 3614 1417 3616 3248 7721 12405 15298
17164 15298 2064 -3136 1893 868 -1617 -4179 10737 12472 18625 22878 33467 30169 19690
17151 19690 15079 4412 7524 11742 8913 12516 12215 4728 18066 22161 32071 40981 37624 14189
17137 14189 -1239 -241 -9365 971 12972 4297 -17897 -32537 -24073 -8922 -9590 -7675 4587
17124 4587 9203 14701 5078 -2956 3874 12332 10300 22280 15396 -2913 -376 4829 15769 24782
17110 24782 14529 6141 2824 8494 1354 14058 18672 12323 15781 5891 1817 16296 14386 10968
17096 10968 15698 25693 29941 22841 9932 5063 11282 10197 3595 -343 1056 16727 14178 7751
17082 7751 8306 9668 5167 -7528 -9805 2721 2866 276 -13346 -22495 -3544 5235 -5680 -6726
17068 -6726 -5984 5578 3048 -3344 2573 -8484 -6939 -4783 -3725 7520 12313 20498 24200 6790
17054 6790 8722 24874 10635 -3013 4506 5154 10014 21848 20266 8375 -347 4095 4185 -517
17040 -517 5465 7749 15292 14104 3243 7587 7671 17514 27686 25929 26371 9501 -17661 -21487 -7770
17025 -7770 1904 139 -9850 -7962 2475 9417 15827 3969 7738 6243 -2789 3743 6656 1982
17011 1982 5127 12968 12370 1808 14218 11129 7422 19941 16873 4043 -8208 -1004 19665
16998 19665 36508 28647 17445 19341 20435 22905 20268 33812 31870 23876 19663 20176 18469 2538
16984 2538 -9990 -4410 -8188 -11147 -6631 -2795 -3428 8073 -171 -10229 -17508 -18048 -15301 -1103
16970 -1103 28016 32476 24393 27777 30678 26979 20904 11582 9422 9901 6623 5864 4999 -1413 -7290
16955 -7290 -11461 -8410 -7326 -3162 3600 7897 14789 13697 17439 19950 10143 8014 4086 7488 9072
16940 9072 4499 14356 16245 3181 2680 5333 8711 11964 17189 12121 17197 21662 16739 -6390
16926 -6390 -23973 -6292 8889 7640 13415 14608 4638 6146 5818 12676 9560 5164 3717 17264
16912 17264 17089 4884 578 2323 11374 12637 15081 21501 15063 3723 7192 8719 8543 13011
16898 13011 1754 8876 12053 -4600 -12888 -13591 -18555 -24083 -21273 -11751 1080 4888 -7692 -12831
16884 -12831 -19771 -8156 9378 15275 12252 5673 1075 331 -11305 -8432 -4803 -3030 -2227 2898
16870 2898 4607 -3103 -6140 -1548 6502 18533 19192 24398 25117 20394 25410 23247 15551 10835 15489
16855 15489 16641 4458 -9601 -9080 541 -3363 -5025 -3447 4553 -1931 -14888 -7348 -8098 -9397
16841 -9397 1019 4053 -3137 -2976 3398 5021 -16 -20307 -27224 -32995 -18876 165 10826 3540
16827 3540 -10539 -10133 2507 4352 2744 -2309 -7100 -18267 -23092 -6813 -2370 -12822 -12139 -5319
16813 -5319 -9295 -5620 2301 6526 12764 7016 9394 15592 5073 8238 2415 9136 23477 26100
16799 26100 23504 18426 12481 17072 14238 12803 11588 12964 484 4531 2233 -14546 -18246 -8684
16785 -8684 68 2612 387 -4073 -5881 -5421 -4344 -5219 -3501 201 -7219 -10839 -5004 2409 9430
16770 9430 8588 5451 9000 18140 12408 -2698 -11461 -17539 -17099 -16152 -14944 -10525 -9342 6635 13418
16755 13418 10097 -335 -1985 -13678 -8363 -9281 -3523 -5311 -6713 8104 10400 6730 17584 26126
16741 26126 7857 2500 -3198 -8378 -16615 -25349 -11640 -6324 1726 3370 11887 17562 13949 13623
16727 13623 21599 12572 5256 8009 10907 -20735 -33800 -34878 -36608 -30619 -13442 -5971 1053 -2849
16713 -2849 -6470 -20186 -29597 -14906 -5968 2644 -4583 -20055 -12004 -2603 -14792 -12785 -15468 -23937
16699 -23937 -27686 -19052 -19977 -17348 -12054 -6572 -2945 -6546 -17264 -17426 1329 24959 29681 26994
16685 26994 20355 22544 14300 8910 4759 -11457 -18406 -21897 -21994 -10229 -14564 -12564 -10273 -8825
16671 -8825 -8653 -4069 -2041 2708 1405 -11595 -7042 -4497 -1634 -4934 -3529 -17865 -14502 265
16657 265 3858 -5428 -8116 -14117 5112 21709 18711 24037 25286 22065 21805 17697 14976 15429 18627
16642 18627 8783 2275 -3907 -9428 -7909 -1121 -2664 -8680 2313 3047 -2361 9103 14940 14107
16628 14107 -693 -10258 -13951 -2385 -882 -12083 -25294 -23659 -17781 -10856 549 9579 19263
16615 19263 28790 25321 20216 10427 14315 21322 2550 -12860 -9976 1536 9399 -5572 -11015
16602 -11015 5752 12761 -1075 -12903 9522 21778 13707 -5480 -4488 -2129 -11001 -12122 -8972
16589 -8972 -7255 -79 2548 -15631 -26803 -30225 -24331 -11115 -3273 -7301 -2817 1015 -3580 6657
16575 6657 10687 10402 7731 6941 10521 8448 -5127 -15506 -16305 -17361 -15936 -6334 -12873 -10370 -8404
16560 -8404 -8150 -16845 -23285 -20147 -10586 5942 3281 -1112 5140 13194 21116 11767 12298 12756 4319
16545 4319 -4120 -2781 10354 13035 10312 -1747 -6608 -128 -887 -4422 6469 5580 -14618 -22698
16531 -22698 -5216 9985 12442 11309 4230 7149 23080 13303 -7892 -5392 -4436 -1138 3751 -1637
16517 -1637 -9428 -15379 -14259 -532 4713 3620 -3336 -8196 -6345 -12294 -7360 -4151 8812 15176
16503 15176 5011 2414 11699 9782 9346 -1007 -6986 -9723 -12492 -10126 -8556 -22686 -20449 -13633
16489 -13633 -2695 -3218 -11000 -14 5067 -1537 -4732 -12699 -10893 -1831 19404 11035 -11533 -3173
16475 -3173 2794 11216 21987 21357 26637 22238 14263 10058 8673 -9149 -23784 -32406 -24394 -8139
16461 -8139 -3064 143 -17272 -14638 1014 2778 -4472 1557 13011 15188 4754 -7103 -7207 -7634
16447 -7634 -1962 4116 -4424 12490 22265 12890 -351 -2949 -9196 -16135 -518 15631 19676 10393
16433 10393 -7489 -12522 -11933 -6663 4928 10295 2239 6809 8328 1454 -14768 -12720 -13474 -7749
16419 -7749 8165 4272 9650 -13812 -28918 -19989 -9836 -13689 -23077 -33505 -30697 -17485 -25641
16406 -25641 -29481 -28778 -19964 -14837 -3745 -2974 -6541 3229 -21193 -21307 -17648 -21605 3139 15297
16392 15297 13117 25007 28665 28668 19529 17331 4573 -18477 -17466 -10224 -23251 -31290 -20417 -4959
16378 -4959 3264 10469 14921 21758 16498 19349 4331 665 14882 8839 9428 6490 3893 11089
16364 11089 17142 10417 13208 3595 -6977 -1699 11101 4047 -13478 -13399 2861 -7744 -16082 -14337
16350 -14337 -2875 -4876 -12726 -11163 -10947 -17717 -4676 2975 4270 3762 -8658 -15770 -15460 -2146
16336 -2146 -3410 -7247 -726 1607 5029 -1715 -725 2229 -1516 2285 11574 15896 473 -15033
16322 -15033 -12789 -2557 -11517 -16530 -3778 2801 -93 3487 10090 16285 5278 1070 15746
16309 15746 14255 10698 11216 -2227 -21843 -18787 2566 4067 -1988 -6324 -3939 7004 11363 17195
16295 17195 13357 10875 12627 15669 11489 3245 2483 4166 -2264 -9679 -11788 -17202 -16842 -23634 -22789
16280 -22789 -1541 9849 2680 4243 2573 261 -7549 -24786 -18438 -8173 -2552 6697 -244
16267 -244 -14469 -18974 -18990 -17259 -23580 -23991 -1831 -6195 -6378 2806 -5008 -11223 -4430 10450 10108
16252 10108 1350 1892 -1702 1597 -5272 -16229 -22226 -12805 7008 14560 725 -10114 -19761 -11730
16238 -11730 -8632 -8945 -2859 1913 -258 -1111 2968 -9118 -9599 -8245 -6078 -1309 -17222 -19810 -15994
16223 -15994 -12000 3590 2302 -8176 -13622 3900 13236 -2679 -7165 4920 14000 7719 -7628
16210 -7628 2408 12075 1538 4820 3732 -2896 11878 12693 6545 -2077 10773 9333 9422 13780
16196 13780 16306 15860 17045 7810 12481 15008 1663 -13397 -5098 -1940 8878 7615 -2143 5441
16182 5441 2168 -14258 -6287 -3467 1255 -5529 -9357 -11668 -7206 5078 6821 25083 24132 14249
16168 14249 -3242 -15111 -25520 -14195 -9460 -15050 -2312 -5145 -9499 2216 747 7579 -4861
16155 -4861 -14211 -20881 -23298 -21451 -3063 4470 2865 821 -3032 -1899 1485 -5541 -2683 -9935
16141 -9935 -25806 -28186 -14910 -5262 -1987 3695 16301 13348 13308 6213 15630 10134 -3726 -15760
16127 -15760 -30492 -36556 -24852 -14783 -8993 -16732 -18253 -4573 22568 12264 -3322 31 -3685
16114 -3685 -18599 -34393 -35808 -33604 -19361 -10670 -3135 -1072 -4177 8932 2347 -2160 -10003 -6148
16100 -6148 -6650 -8360 -8665 -11378 -15989 -11044 -6531 2579 1001 -23973 -34647 -28987 -12946 -10106
16086 -10106 -3819 4689 5903 8747 10847 11122 -2812 -14158 -15355 -10836 1241 -10450 -24233
16073 -24233 -28895 -34905 -29225 -27930 -34871 -32406 -26988 -22397 -15576 -16209 -22980 -24366 -1846 -8441
16059 -8441 -12288 -3752 3484 21312 18387 10196 10657 -6241 -1646 9883 11493 -13372 -18770 -6552
16045 -6552 -15497 -14001 -10893 -6130 -7919 -3623 -4007 -5065 -6578 -5155 932 7166 9429 9270 8485
16030 8485 3910 5364 -2143 37 4430 -994 -5501 -9427 2579 -4111 -15260 -10962 -7836 930
16016 930 -4230 -19494 -32003 -25453 -19188 -11890 -18901 -26085 -17374 -17535 -20768 -19323 -24065 -31003 -21509
16001 -21509 4434 184 -7193 -6024 -14860 -24188 -19727 -7335 -8112 -6993 4537 8846 6824 923
15987 923 6691 11754 3927 -5393 -10512 -31507 -23665 -11432 -8750 -3477 -4741 -3282 -8271 -15068
15973 -15068 -22052 -36223 -26919 -18803 -14181 -11581 -10457 -9375 -14427 -16798 -5508 1784 3054 3985
15959 3985 5135 2841 -9995 -18702 -13790 -7255 -7819 -3385 2705 14728 8570 -1527 1765 -4730
15945 -4730 902 17209 17335 12695 9466 5873 9897 11866 2036 -7080 4897 2688 -2766 720
15931 720 6987 982 -12232 -29820 -27632 -14302 -7967 -18347 -18398 -14023 -7530 -5943 -13334 -12268
15917 -12268 -19003 -27115 -29472 -20603 -19450 -9789 -8496 -5473 506 -6513 -6486 -11856 -8041 -11769 -16089
15902 -16089 -13258 6248 616 -997 11052 17861 7629 1016 4849 -3425 -7833 -18977 -26100
15889 -26100 -22158 -11549 -2200 -447 -11349 -11003 -1411 -8948 -5605 -1530 -2731 -7436 -20366 -26890
15875 -26890 -9831 609 3789 9339 360 -8215 -10206 -12382 -186 6067 -2703 -11875 -15878 -9309
15861 -9309 -19995 -25274 -21951 -19204 -20175 -20004 -13817 -11097 -11592 -10504 -12139 -7869 -6976 -7255 1596 -2629
15845 -2629 -15574 -22867 -22681 -29417 -24059 -14301 -1597 -5396 877 1763 -3455 -5751 -9624 -9800 378
15830 378 -2340 -15297 -14681 -17971 -26572 -17484 -5248 -1735 -3729 -10795 -5389 4076 25111 33390
15816 33390 25796 -312 -24181 -20956 -12531 -4482 1010 2542 1056 16507 5953 -10061 -5039
15803 -5039 -1065 -3645 -6761 -19584 -25792 -28053 -27677 -7785 -8639 -13299 -8394 -9121 -15033 -6158 -24479
15788 -24479 -38155 -23410 -3055 -3046 -606 8968 3709 -13461 -5697 -17561 -29548 -15759 -11272
15775 -11272 -11150 -2241 8282 6011 -7889 -9073 -16636 -22950 -17518 -5386 -11973 -19018 -9154 -10087
15761 -10087 -5687 -2992 6371 10859 13630 2090 -2939 -11286 -7865 -72 10798 10581 13776 1775
15747 1775 -1418 -10218 -20364 -12225 -6052 -27787 -27613 -28551 -28141 -27408 -23948 -29133 -21294 -8664 9530
15732 9530 105 -19402 -7462 -3658 -10733 -10122 -4687 -15394 -24399 -32682 -23464 -21809 -7049 -11111
15718 -11111 -18447 -4280 1483 -307 -3697 -1002 34 -85 1118 -5502 -17904 -21914 -18342 -24752
15704 -24752 -23074 -25269 -15295 -7693 -14764 -26091 -15582 -8495 -4306 -2146 12965 19766 13021 4074
15690 4074 15088 26268 12976 474 -11849 -6051 -522 4055 10439 2215 -6095 -2264 -11394
15677 -11394 -8403 -11217 -747 10811 19151 25699 18871 8736 12 2454 -7076 -3667 -1167 -4834
15663 -4834 7146 2257 8513 7763 647 -2637 -9390 -21717 -31998 -28699 -17730 -17046 -9798 -6544
15649 -6544 -14508 -17677 -21428 -19075 9436 10485 -3316 -301 -9645 -34195 -34708 -25217 -21212 -18309
15635 -18309 -20592 -19760 -17043 -18245 -12370 -20568 -23560 -10104 3658 -677 5043 7755 3314 -4986
15621 -4986 -6583 -4956 -15806 -19156 -9434 -625 543 -8997 -174 -8880 -14321 -20776 -17312 -11352
15607 -11352 -7035 -3561 589 4163 9861 5949 148 -2030 -5889 -10751 -11799 -6908 -652 7750
15593 7750 -3614 -18865 -19925 -12098 -7777 -4750 -18333 -22325 -29802 -29070 -29360 -18001 -9086 -16224
15579 -16224 -13354 -3736 -9873 -28122 -19161 -7926 39 -2550 -12863 -14846 -21247 -17050 -15817 -31148
15565 -31148 -30262 -24591 -24557 -34076 -25304 -25683 -29807 -24068 -23221 -20206 881 11377 -2489 -19390 -25279
15550 -25279 -20387 -21713 -7496 14327 8609 -10761 -15011 -15729 -995 6464 -7384 -25302 -30381
15537 -30381 -31298 -26364 -3435 17416 37210 33209 30800 17784 19159 15665 12939 14762 4314
15524 4314 -10957 -9742 -9381 -20048 -26609 -27951 -34675 -29755 -24513 -18747 -22775 -10877 -7982 -11576
15510 -11576 -12737 -9455 -6465 -5608 -7969 -12587 -12572 -6022 -17375 -10206 9632 18696 11922 -2838
15496 -2838 -6097 -7783 -14512 -7805 -1615 9724 18932 -474 -23891 -35142 -14799 -13242 -19231
15483 -19231 -21644 -20248 -20027 -3544 3454 4003 10832 2894 -4284 -4394 -9262 -148 6466 14001 6182
15468 6182 203 -4244 -7891 -745 8458 -3172 -11416 -17910 -14314 -10953 -8518 -7334 -9084 1998
15454 1998 15070 6592 -23 1476 785 7164 4563 19483 22382 4574 -5339 -1815 1910 -4524
15440 -4524 -21392 -12727 -3825 -15056 -20416 -18337 -13951 -7922 -11310 -16255 -17090 -15231 -22849 -24120
15426 -24120 -14548 -15280 -3881 4137 -8295 -15741 -32171 -39829 -33627 -21224 -20277 -13033 -10914 -15924
15412 -15924 -16249 -17824 -15526 -19286 -14600 -14362 -7729 -4876 -7081 -3594 1510 -2993 -12829 -12661 -19057
15397 -19057 -18495 -18574 -18120 -11985 -5256 -1521 -13886 -8005 6332 14302 6330 -257 -437 4113 14904
15382 14904 5497 -8043 -12010 -23445 -26035 -9301 -961 -2640 14149 715 2259 12647 14497
15369 14497 -6571 -12244 -9009 -7944 -5501 -11520 -4779 5213 10465 8985 10246 13749 -682 -12383
15355 -12383 -17217 -11070 -2960 -4452 -12749 -7308 -3499 -4535 2134 1251 6594 6999 8671 5785 -11014
15340 -11014 -14612 -22832 -3718 -1245 -10677 -23135 -29961 -18685 -10827 3423 13174 6416 -6933
15327 -6933 -12029 -8876 -6322 2079 882 6332 4738 -6989 -14942 -26320 -18898 -8777 -11479 -20058
15313 -20058 -12832 -8667 -11906 -619 6718 -2258 -10239 -18075 -18669 -11667 3851 780 -6621 -16218
15299 -16218 -30711 -35520 -30912 -32083 -22171 -7863 -1145 -1263 -14621 -18378 -15420 -9900 -11633 -10485
15285 -10485 2471 -316 -7823 -24175 -19267 -16514 -4854 -12581 -17616 -26450 -15724 -11218 -8818
15272 -8818 -3569 -5193 -15101 -23901 -15018 -6636 -7702 -6842 -14876 -22012 -12925 -4579 -3856 614 5831
15257 5831 -5668 -29528 -39561 -36323 -21068 -17165 -22326 -20172 -8188 373 -10337 -18657 -17087
15244 -17087 -8557 -12793 -10599 1277 1119 -4314 -8221 -6704 -7599 -15507 -19919 -22408 -19776 -19338 -15664
15229 -15664 -13059 -23967 -11680 -14308 -13336 -18934 -22514 -33160 -46582 -42117 -22402 -8354 -11585
15216 -11585 -6808 -8429 -26986 -36594 -50400 -55459 -44897 -33724 -25984 -17910 -16562 -11734 -6175
15203 -6175 -9051 246 7046 9403 1149 9913 3929 -10324 -17689 -20059 -13856 -19658 -10186 -1652
15189 -1652 8652 10664 9792 -3320 -11017 -19606 -17043 -20878 -18218 -21262 -11892 -9708 -6548 -2801
15175 -2801 1503 -2356 -10761 -6508 -8747 -9268 -13464 -28484 -30331 -23883 -19528 -12245 -17998 -30770
15161 -30770 -27587 -16933 768 295 -3459 -4671 3707 14426 844 5710 15110 8398 -11633
15148 -11633 -27689 -28908 -22330 -9341 -4141 -2807 -361 -11148 -18447 -12276 -10061 -16053 -15899 -18403
15134 -18403 -14805 -25149 -18083 -14954 -22995 -28196 -16843 -9365 2837 3232 844 1503 7031 1659
15120 1659 -4094 -5751 -17684 -24093 -28406 -32747 -30085 -13366 -8507 -13789 -23109 -12907 -1912 -12954
15106 -12954 -2369 -4166 -9348 -4419 -16087 -31973 -28328 -22881 -36194 -40222 -42368 -36638 -43136
15093 -43136 -38060 -23718 -18379 -20924 -22481 -18680 -9752 -15893 -26048 -29190 -23670 -15063 -10747 -2855
15079 -2855 3045 4939 -435 -1857 -6613 -10670 -14283 -24794 -32665 -26886 -16943 -8164 -4225 -2166
15065 -2166 -13118 -12946 -5046 258 -1715 -3626 -4914 -4194 -7172 -10132 -4773 -7139 1117 8627 -3062
15050 -3062 -11836 2817 6652 4436 4857 5 -12439 -18883 -23284 -15840 -9099 -14676 -8725 -9020 -19904
15035 -19904 -30396 -25301 -25268 -25445 -12706 -10986 -22148 -9905 -5009 7779 17412 5433 8042 11625
15021 11625 -1510 -17446 -12639 8076 21611 13030 2145 -4128 -13954 -10865 1946 -2168 -7574
15008 -7574 3801 18208 7042 7545 19414 23163 10989 -7025 -8206 3566 6355 -8091 -13582
14995 -13582 -19678 -19769 -11504 7190 10378 -7193 -16150 -12579 -4106 2107 10868 20673 11319 -4918
14981 -4918 -15895 -11486 367 3722 -5906 -11630 -21376 -22736 -23426 -10662 -7608 -7637 -4716 -1527 -9878
14966 -9878 -15015 -14053 -5323 -6697 -11626 -22157 -27386 -21374 -30127 -37390 -28544 -24507 -18707 -12078 -26164
14951 -26164 -37925 -37375 -24086 -18869 -22179 -20219 -27262 -26118 -11478 -12595 -13456 -16971 -24569 -36489
14937 -36489 -25571 -11402 225 8156 1980 -10873 -17455 -23304 -20951 -23045 -24372 -17569 -5546
14924 -5546 13061 7108 -4542 -17388 -20244 -8666 9289 3558 -4359 -6086 -5057 -9087 -7710
14911 -7710 -16880 -12823 -6624 -6601 -7401 -8251 -12773 -3845 -22677 -31812 -24484 -5672 -10458 -15316 -7504
14896 -7504 -6648 -8852 -16698 -19866 -13655 -12214 -18854 -23503 -17488 -12526 -10747 5206 15444 18496
14882 18496 15862 -4168 -16617 -15458 -34831 -37798 -36242 -29677 -16308 -10204 -19677 -23552 -14170
14869 -14170 -17573 -19692 -19743 -13270 -16061 -27595 -37159 -27353 -14789 -10118 -11238 -15454 -14517 -4274
14855 -4274 10028 4103 -2711 -952 -11436 -14535 -10084 -2769 -8011 -6991 -14322 608 14080 15694
14841 15694 496 -4885 -2576 -5737 -18653 -17064 -20250 -6277 -6468 3540 13389 14770 1599
14828 1599 8008 -1701 -2482 162 -9976 -10131 -8369 651 2821 18105 7363 6890 -13929 -16559
14814 -16559 -17289 -27589 -11851 1762 4079 -4450 -18769 -21360 -11551 -7646 -6191 -625 -14274
14801 -14274 -24342 -17987 -21205 -26248 -30570 -41905 -43338 -32319 -37812 -42658 -40680 -29774 -21896
14788 -21896 -15394 -10513 -23320 -39049 -31366 -22996 -15808 -11701 -3933 -7854 -16020 -16438 -9184 -4781
14774 -4781 -7374 -9149 6694 1942 -15849 -11495 -17074 -20136 -25303 -33468 -37854 -23519 -17543 -20746
14760 -20746 -18141 -13813 -8578 -4621 394 -6669 -2529 -3571 -9572 -23103 -14658 -307 429 13394
14746 13394 7713 -869 6519 -809 -20314 -25966 -27353 -27431 -11051 -5631 -8948 -8911 -16657 -16339 1398
14731 1398 7988 9133 -3104 -11905 -5029 -4080 -24943 -17984 -18174 -20488 -25169 -21423 -23511 -19222 -20201
14716 -20201 -8126 274 567 -8966 -16241 -29347 -31044 -18379 380 -6635 -20177 -16731 -5944
14703 -5944 -4086 -3324 -4591 -16683 -17167 -26992 -26334 -22444 -27526 -20902 -17855 -30429 -33971 -14150 5463
14688 5463 14256 12588 2846 -6883 -10834 -12602 -23338 -12509 299 2140 -717 6268 9148 -1956
14674 -1956 -6901 -10923 -31084 -32323 -21631 -25899 -24478 -12987 -7191 -10722 -13447 -14705 -2387 -2844
14660 -2844 -17365 -28205 -28301 -27667 -23730 -26456 -22169 -10286 75 -7173 -1629 -53 -643 -6042 -183
14645 -183 -6235 6240 13297 12803 3375 10896 4522 265 11217 2720 -738 -5676 -1957 3652 2949
14630 2949 5226 -472 -10324 -4612 7354 10559 4313 -2379 -5395 1128 -7324 -9541 -21195 -10151
14616 -10151 -21355 -20688 -7323 11335 14199 -4601 -8171 -10167 -15679 -13824 -18765 -21247 -19568 -12742
14602 -12742 -14415 -6921 4252 1916 1839 1796 2816 -8089 -11031 -13361 -7310 -12482 -12054 -28777 -23260
14587 -23260 -17026 -10835 -6505 -2944 12982 16919 4885 -2364 3185 1007 -351 -2073 1726 -721
14573 -721 9398 22344 11052 -1998 -7924 -215 -3187 -5624 10909 8827 -15801 -24741 -21898
14560 -21898 -11176 -17672 -18181 -10139 -4636 -11818 -24504 -22099 -13126 -1977 -3461 -12315 -2873 -10364
14546 -10364 -22535 -15815 -6235 -676 -8307 -14414 -16643 -18321 -28905 -30317 -20333 -11251 -13761 -18887
14532 -18887 -20015 -31023 -28696 -22084 -22933 -12024 1772 9951 10876 6314 -4682 -15712 -14242 -13633
14518 -13633 -17357 -2719 -12165 -21573 -26723 -26158 -24734 -19176 -11427 -2838 2711 3794 5761 9058
14504 9058 2490 -12101 -20088 -13624 -13626 -5345 -3679 -6147 6502 22512 24332 10735 5248 1826
14490 1826 -455 574 12143 14757 6610 2491 -13669 -15152 414 9358 -1156 -20173 -20550 5207
14476 5207 14002 9343 -6918 -23601 -19112 -21492 -28293 -23450 -15214 -13456 -15969 -22991 -18108 -3454
14462 -3454 2383 8874 4706 2706 -6829 -15751 -7344 -3435 -1792 433 -7520 -11197 340 10027
14448 10027 3024 1711 1750 4148 12631 21427 27606 16532 -6 -4780 -6706 -13318 -21633 -21954 -16596
14433 -16596 -5189 3163 -5547 -12244 -21343 -25264 -17842 -14795 -21140 -16176 -3258 10776 14767 2883
14419 2883 -23767 -35611 -28113 -23530 -15251 -12815 8456 17427 18267 14988 3548 -11434 -9159 -11822
14405 -11822 -16324 -12454 -12369 -28288 -28320 -20141 -21969 -16098 -22942 -21827 -9136 -13737 -13899 -15285 -6180
14390 -6180 -3973 10078 6979 -4379 -8366 -19016 -24064 -34406 -37350 -32987 -20121 -6918 -10126
14377 -10126 -17014 -14917 -20116 -19827 -21974 -23453 -19203 -4715 -2488 -15115 -15543 -12211 -823 9548
14363 9548 2228 -8253 -10241 -24201 -37185 -30115 -15182 -4790 -4368 -13757 -9585 -8243 -11667 -16470
14349 -16470 -10971 -8425 225 7320 -2957 -17068 -29983 -17301 -3614 -5079 -13965 -23806 -30407
14336 -30407 -28615 -24982 -19199 -15989 -19910 -19132 -13321 -14781 -22513 -27868 -26985 -27485 -32175 -24761 -14196
14321 -14196 -14375 -814 8508 6560 19766 30663 28745 24567 20512 11129 15922 16995 4554 1390
14307 1390 -3556 -12496 -25145 -31014 -28896 -27084 -22758 -15963 -9198 -10188 -5229 -19821 -23273 -20301
14293 -20301 -28865 -23835 -12263 -8674 -16206 -18487 -9938 -11987 -13703 -8808 311 -2704 2497 -7005
14279 -7005 -6885 256 -14052 -33106 -41230 -39278 -28580 -25989 -26074 -15826 -4960 -5664 -1529 -1258 -7415
14264 -7415 -13302 -14226 -10454 -23810 -30958 -27245 -17580 -12284 -11162 -7171 -4142 2111 9204 -9997
14250 -9997 -23934 -20565 -27250 -17356 -10985 -13618 -16219 -8461 3756 4663 2481 -985 75 8284
14236 8284 16766 9563 -6723 -17361 -31097 -24540 -20372 -16616 -22432 -26381 -23169 -19730 -20949 -19928
14222 -19928 -15820 -13338 -18047 -21685 -31318 -25954 -5888 -2434 -5746 -18803 -26681 -27075 -25485 -29966
14208 -29966 -30591 -34693 -31420 -8858 9301 5283 -10126 -15681 -21444 -20410 -19298 -10478 -5358 -14118
14194 -14118 -19789 -18330 -11259 2224 9618 -1068 -1807 -5971 258 6591 3757 -10183 -5803 1163
14180 1163 3223 7768 13046 10218 3367 -2688 -11356 -16508 -18026 -12403 -725 9862 -6552 -22960
14166 -22960 -12692 -1420 -14148 -31063 -28334 -27647 -29021 -17926 -10533 -20572 -20113 -14845 -13429
14153 -13429 -12138 -6507 -11203 -8432 -11502 -7063 -9683 -26369 -33665 -32444 -33456 -33165 -38027 -30150
14139 -30150 -19424 -20462 -34192 -31948 -30145 -25809 -18361 -17065 -24451 -34656 -42850 -48764 -44052 -24787
14125 -24787 -7600 -3225 1641 -1981 -6724 2539 1340 7869 16414 5417 -5840 2450 3331 -8567
14111 -8567 -15446 -20393 -27828 -23438 -9541 3195 19113 24934 14604 -8565 -10166 3216 5419
14098 5419 201 -5401 -8292 -4787 1300 8054 8411 166 -2161 -4633 -17462 -21174 -16477 -5556
14084 -5556 -5639 -5944 -9544 -19102 -15337 -13421 -3312 -8789 -14688 -22297 -18048 -6946 -11645 -16581 3298
14069 3298 8010 20143 22392 699 -22016 -14921 -17754 -23695 -13318 8562 17151 4446 -19545
14056 -19545 -26323 -16839 -5834 -9338 -18423 -19802 -17211 -21117 -23490 -21315 -18701 -12461 -5528 2973
14042 2973 13175 18157 -62 -6534 -5487 -24406 -23441 -20114 -31300 -44032 -40828 -22758 -26412
14029 -26412 -27619 -25900 -28363 -24742 -8388 -10749 -21742 -28802 -18095 -11099 -7097 -2423 -8883 -27933
14015 -27933 -25384 -11028 -5218 -6261 -7936 -3037 -1089 -8311 -7045 -19261 -25505 -22498 -14628 -18950
14001 -18950 -25604 -10444 6944 -1089 -11604 -18565 -8288 -1045 -7304 -11081 -10324 -16832 -9776 -17137
13987 -17137 -18649 -19233 -29790 -14326 -8527 -9278 -8211 -20190 -21792 -17197 -25934 -30674 -24585 -9901
13973 -9901 -9150 -8782 -9769 -7037 -4350 -4752 -5786 -12291 -12751 -16349 -15659 -24127 -36809 -34844 -31551 -17445
13957 -17445 -20370 -23671 -13071 -14278 -13711 -8859 -7472 -18414 -11774 542 -7169 -8553 8070 10136
13943 10136 12238 20635 20293 29307 39869 44620 52651 51170 44182 61877 89714 113392 144061
13930 144061 184126 243771 332910 428109 532876 629928 681214 688126 643199 559389 453283
13919 453283 356961 278046 215389 170113 144847 114650 100924 95690 90342 84912 83037 86524
13907 86524 72135 57230 59620 62033 57510 47291 43050 31988 15451 16646 23387 21559 22921
13894 22921 29965 39758 26470 21601 25315 35048 14957 15937 21685 11724 9550 11552 7743 16833
13880 16833 22211 11512 10040 1370 7834 14029 7253 10511 12563 13171 29574 33127 29014 18598
13866 18598 12469 12856 6284 -887 14318 26616 12670 8661 5225 12588 19787 8273 4769 5079
13852 5079 14001 14973 6826 12318 11551 4200 3482 -1010 -13874 -16898 -4528 -2169 -2390 3909 6785
13837 6785 898 6756 12735 9822 6881 -5450 -12947 -15151 -13137 -8522 -3460 10177 21222 13472
13823 13472 -2440 -10609 -7594 -2554 -1904 4989 16385 5911 -3418 798 3374 1176 -8225 -3369
13809 -3369 3337 6143 9276 -3994 -13956 -10521 -12244 -22720 -16741 -17248 -18799 -11277 -22384 -14829
13795 -14829 571 10082 2184 -8073 -6207 -3339 1193 -11907 -10695 -10111 -6200 5216 8195 -4109
13781 -4109 -4343 -14300 -19027 -20319 -2894 1852 -10670 -11775 -19777 -13033 2456 10647 6637 14440
13767 14440 6383 -820 -697 -1489 -8138 -24402 -29281 -6129 5389 -5103 16625 20175 12117 8109
13753 8109 -2516 -13852 -13652 -2554 -5915 -160 -5426 197 10655 22357 13636 -2209 -6658
13740 -6658 6590 13713 7185 14018 21863 21069 12101 21746 26597 29098 30262 42392 49784 61230
13726 61230 57169 42544 37373 31492 39275 42332 27629 16944 14514 11044 10171 6123 9143 797
13712 797 -11745 -1381 3121 10336 7388 11667 9909 4849 -2866 -551 -13709 -23809 -9222 -5352
13698 -5352 -1735 -2470 -10216 -12921 -108 6342 6151 14160 17824 12872 4185 -7515 -6692 -5997 -11088
13683 -11088 -19173 -13852 -11057 -12459 -6038 224 -5480 -11927 546 2869 -4244 -11238 -11324 -1607 -1581
13668 -1581 8164 12491 18704 17714 18405 14483 21562 19635 16069 20878 17226 15987 12206 -1301 -18280
13653 -18280 -10700 -13387 -9401 -6366 -9949 -7814 -3158 -858 3753 4926 -2790 -15351 -22919 -21088
13639 -21088 -22253 -21550 -14217 -1962 13104 7845 -11857 -15144 -1806 -8938 -2055 -4082 -13082 -11713
13625 -11713 8994 16551 2986 -10017 -5851 8180 17227 15463 24059 22529 -1141 802 2929
13612 2929 -5127 -7416 -3132 7638 16620 12885 16864 25178 36087 48783 46739 43162 45553 61711
13598 61711 66542 61713 55807 41954 12074 17481 26532 35750 36326 43067 26831 18394 7260 2972
13584 2972 10303 20725 13023 4412 -6095 -13572 -10221 -11182 -13562 -12814 -2387 -6013 -12436 -3462
13570 -3462 -5445 -6511 -4005 7909 -1452 -6452 -3403 -3826 -7044 2473 30230 48471 36445 36027
13556 36027 39704 58351 61870 66434 62983 48491 37175 32592 24097 38683 64036 95862 93877
13543 93877 91123 75046 48294 29855 39910 35777 30407 29627 35175 29660 15108 7920 11686
13530 11686 12476 14654 21026 22412 14293 10426 9748 22783 18654 23853 32174 49103 54108 33666
13516 33666 37240 35571 45339 56093 44311 35411 38565 36072 34987 30415 26035 39557 51788
13503 51788 45275 45036 51776 73166 90262 94229 87028 69825 63566 49194 32958 32080 19306
13490 19306 2011 -14110 -15906 -11439 -5933 4618 -7889 -819 4518 7366 8318 20867 12703
13477 12703 17323 16576 3480 -7366 -2278 -16950 -17744 -7236 -5976 6977 11609 6115 20343
13464 20343 16581 -7537 -7224 -1369 -2019 -14591 -25590 -31742 -16178 3528 8840 7765 2902 14190
13450 14190 15778 9251 2387 -7355 -12213 -6250 -10564 -5118 -2629 7912 18473 8710 3455 -1715
13436 -1715 -17718 -3856 5437 -2753 -10756 -4230 -514 749 5151 5053 -3815 -8587 -13178 -5484 4728
13421 4728 -2599 -11883 -11991 -7808 -16458 -18454 -19524 -23435 -22513 -23557 -6383 -4542 -9409 -10741 5863
13406 5863 -3517 -18032 -22610 -10857 -3446 -11517 -17840 -12738 -13623 -17325 -16321 -17748 -17587 -14593 -2645
13391 -2645 -5324 -14049 -15021 -15840 -14651 -25175 -17862 -14877 -11609 -21743 -12385 -13781 -26694 -28911
13377 -28911 -37642 -32278 -25833 -23719 -23448 -25306 -15006 -14448 -3773 -3856 -5808 -5945 -1290 -5408 954
13362 954 -5036 -3578 2854 -6729 -8991 -2197 7534 4465 3565 -6927 -20902 -14597 -9100 -15019 -9800
13347 -9800 -9225 -8929 -4336 -10095 -16030 -17282 -24736 -34635 -22315 -27650 -25435 -27914 -28950 -22863 -31840
13332 -31840 -35806 -28088 -7631 -3862 -8495 -5713 351 3655 6329 -5596 -11805 -9743 6329 18964
13318 18964 7083 -8825 -7932 -13293 -16302 -18655 -5770 9079 6675 1398 -22876 -54198 -49762
13305 -49762 -29701 -38827 -38151 -21016 -20658 -13949 -7738 -23718 -37225 -42438 -26628 -15662 -11886
13292 -11886 -17958 -14381 -15726 -12579 -18983 -26134 -20076 -4836 -1214 13240 17512 16027 11982 -1031
13278 -1031 -13407 -16054 -26739 -25212 -17831 -17836 -6973 -5140 -16054 -15475 -23591 -31258 -11564 -9485
13264 -9485 -14438 2779 8276 2838 -6082 -13096 -8651 5501 -32 1712 5420 -7157 -3129 9950
13250 9950 478 -12623 -25303 -12402 -4821 -8226 11967 11225 -21299 -23880 -14366 -23554 -29224 -34425
13236 -34425 -33345 -12816 2347 3849 -2434 -17581 -18607 -13266 -6676 -6380 -14841 -18394 -11221 -16893
13222 -16893 -12016 -11413 -17053 -12785 -1952 2981 -2105 -10797 -10270 -14836 -11350 -2033 -13434 -5032
13208 -5032 -4266 -9892 -5339 -947 -1579 -12195 -9124 -2960 -11229 -17027 -25241 -20262 -12980 -16700 -24665
13193 -24665 -25777 -12513 2051 5104 975 -6050 -14860 -1321 -1665 -4507 3854 13670 3009 -11830
13179 -11830 -15711 -13053 -11445 -5964 -2653 6307 9429 9563 1800 -9385 -8458 -2269 7209 10439 6289
13164 6289 13124 18185 10563 3015 -8238 -18173 -14389 -14701 -5634 -6552 -5628 8931 19304 23325 21582
13149 21582 16176 11050 3549 2545 4052 -7929 -10210 -2130 -7595 -9975 -824 -2495 -8603 -7756
13135 -7756 4645 2579 -1023 -2498 496 -16170 -14518 -8093 -9162 -8653 -4903 8907 -2187 -14716
13121 -14716 -23426 -14047 -7908 886 -4554 -1085 -6627 5560 13508 4477 8400 9811 802 -4953
13107 -4953 -4592 -2205 -1582 -10306 -3501 -10103 -12872 -5415 6853 7591 -13266 -30890 -20671 -8069
13093 -8069 -3828 -11275 -24259 -17609 -10744 -7396 -5641 -12413 -6583 5554 19116 18392 5080 -8074
13079 -8074 -26827 -15961 -9867 -3052 -4355 -29000 -30104 -20115 -15062 -17545 -5439 -4661 -1286 -1269
13065 -1269 -6888 -9416 -12616 -12692 -4689 -6702 -10871 -7048 -10724 -17145 -16717 2347 5819 2827 6886
13050 6886 5354 2731 11470 21693 29539 8735 3332 9446 20948 20376 8209 -3513 7821
13037 7821 12679 10465 10843 14830 7263 2153 4610 4768 13307 14302 10079 11887 5466 -2126 -2026 12513
13021 12513 17576 8699 -7916 -12904 -10492 -5264 2683 876 11984 5094 336 6279 16654 8998
13007 8998 -5623 -2750 -5035 -12109 -19789 -25676 -28144 -12861 -7943 -3972 727 845 -13240 -14520
12993 -14520 -6177 10663 12688 9413 3435 762 1123 -2843 132 5079 16438 28683 26996 26332
12979 26332 26149 15608 15983 19505 9419 16343 20582 -3689 -16377 -7219 -8988 -9429 -35 11097
12965 11097 21033 29094 40123 37661 33516 30351 34895 36923 41414 55270 51223 46382 57092 51403
12951 51403 49274 51174 53251 48734 46221 49002 57772 68016 62616 72132 83853 87888 85582 78448
12937 78448 96664 114349 125269 129303 157251 200483 231713 268462 326604 391932 469688 576153
12925 576153 674841 756894 800955 799649 754492 681702 591736 504039 416634 353995 286584 239408
12913 239408 200208 177921 166853 141827 129752 128722 124368 116731 112455 102901 106456 104719 104587
12900 104587 98952 89382 82822 92172 91482 87397 90547 84643 76110 75812 67603 58305 60058 66637 67663
12885 67663 70801 61890 67228 65698 53784 52817 40700 36627 41754 35317 41939 54933 55136 49241
12871 49241 51043 49017 43226 39989 46654 39240 37480 40902 44844 43763 26488 18095 26057 23502
12857 23502 21754 18033 22123 33616 44308 44315 22513 20545 17563 22938 15449 27091 33546 27252
12843 27252 8534 10580 13079 12698 10714 9955 15225 20554 23910 17597 4101 9857 32887 43009
12829 43009 41180 24303 8926 18079 30270 10096 1835 18200 20860 4938 14780 18755 23771
12816 23771 27092 29878 22436 14036 16041 19823 22209 23598 29835 30027 34152 31136 33156 48423
12802 48423 50444 52463 50015 62708 65854 66755 70932 60870 47383 44414 59267 65765 68832 68938
12788 68938 54785 57412 45791 39858 42181 38521 37844 40646 34424 36006 38644 30514 33370 27778
12774 27778 15537 25864 40894 42886 30173 30990 34882 52628 53083 50192 65882 85949 114622
12761 114622 129589 115179 122169 119794 112414 122213 125890 126608 129885 130752 128490 133788 121369 99401
12747 99401 85759 81857 88915 78473 77859 74622 71170 67599 74388 88083 99013 103798 104341 103711
12733 103711 108542 102215 98396 104686 110189 105792 115860 131526 132722 139544 143016 142772 152281 174268
12719 174268 181915 187964 216794 253481 309545 386437 465537 563018 675915 759522 821396 865449
12707 865449 864597 808399 736730 654072 566666 466148 373516 306779 259422 240181 223527 218911
12695 218911 208470 201318 198542 206557 223804 225071 225967 233499 229755 224449 226861 210841 210279 209968
12681 209968 194373 190225 178545 179048 177874 163299 153992 145631 146739 141381 124531 118676 111244
12668 111244 109711 122935 139098 153042 158766 157659 156193 147016 138492 138766 124257 129160 136826
12655 136826 131674 125008 124251 112188 121542 123887 113545 116924 136030 148098 152586 162309 146578
12642 146578 137230 136858 138109 133436 123783 113601 116203 113365 101550 100188 102359 95545 85328 78995
12628 78995 85153 89423 109322 110875 108616 108026 102121 105576 121269 130676 140344 144520 165864 186455
12614 186455 196704 209190 214048 225142 225734 231785 241988 261627 259524 245254 236401 234108 242860
12601 242860 258796 273768 291485 318857 325385 322980 323860 326755 330081 338117 350786 353847 339674
12588 339674 353572 367913 376797 383538 397038 401590 409609 418418 441691 461547 467780 457953 481448
12575 481448 516596 525854 518977 529636 516637 499159 478448 473395 476451 470123 487913 500947
12563 500947 520067 544832 583241 627526 660255 684039 713471 752038 792975 835976 879862
12552 879862 917244 941723 968711 992434 1014142 1048469 1088677 1126435 1170225 1226109 1290740
12541 1290740 1353617 1416448 1497176 1598751 1696411 1798626 1893632 2007396 2140340 2284925
12531 2284925 2461291 2671498 2928521 3241489 3618344 4081964 4635422 5300623 6097047
12522 6097047 7007085 8065738 9277083 10596865 12048131 13677093 15621287 18062719
12514 18062719 21323861 25828041 32074505 40604190 51894422 66149000 83145103 101851800
12506 101851800 120232414 135623653 145691509 149004850 145110100 134619390 119317275
12499 119317275 101648011 83968736 68194570 55442686 45855535 38996952 34202195
12492 34202195 30777629 28258957 26294155 24673886 23243308 21928401 20701359 19540210
12484 19540210 18464281 17475957 16569165 15748545 15010067 14317812 13670014 13044355 12468534
12475 12468534 11923593 11395186 10899215 10449204 10034836 9649198 9286784 8939848 8633760
12466 8633760 8356938 8090233 7840821 7592960 7364595 7144896 6942319 6747549 6570061
12457 6570061 6403218 6234002 6079130 5917020 5753682 5607005 5486185 5380700 5290562 5204337
12447 5204337 5109272 5007273 4917309 4833299 4738518 4626377 4521702 4425050 4332616 4230646
12437 4230646 4132007 4031992 3930653 3841705 3751008 3671009 3581426 3493981 3422071 3346576 3256994
12426 3256994 3164211 3069963 2979654 2878905 2784528 2710487 2632257 2545322 2482102 2433560 2393136
12415 2393136 2343837 2295413 2261636 2226903 2179301 2140029 2103554 2063697 2044687 2027766 2009337
12404 2009337 1996081 1988366 1978224 1969136 1953409 1918271 1895536 1904595 1917708 1921548 1930032 1969355
12392 1969355 2026939 2087497 2132743 2176716 2208836 2209029 2177679 2130307 2051474 1969780 1896716 1827133
12380 1827133 1762783 1700697 1654482 1613020 1565267 1535078 1511834 1465545 1425778 1394725 1372062
12369 1372062 1346185 1333211 1322202 1305067 1308310 1302451 1282059 1245565 1224464 1201504 1171364 1155823
12357 1155823 1130171 1115021 1105346 1107037 1109959 1104580 1125242 1159646 1178700 1200652 1220579 1237776
12345 1237776 1254084 1270905 1297340 1323917 1328580 1330750 1344897 1372086 1391472 1418135 1436876 1467874
12333 1467874 1516218 1590458 1658967 1712950 1793533 1869832 1962077 2059718 2145355 2249743 2357959
12322 2357959 2501979 2676235 2876478 3136242 3457525 3847379 4347065 4948427 5667017
12313 5667017 6541962 7545339 8674539 9931192 11302203 12807659 14479219 16425891
12305 16425891 18856226 22080721 26551774 32856817 41658904 53594863 69015810 87627393
12297 87627393 108255233 128715880 146026674 157352522 160702612 155318737 142258794
12290 142258794 123864586 102985296 82678469 65517947 52632996 43692264 37693024
12283 37693024 33626301 30792369 28709912 27077496 25668279 24342644 23024468 21693014
12275 21693014 20354780 19061584 17887959 16876420 16004047 15239787 14540112 13894534 13280880
12266 13280880 12674923 12097832 11563972 11063059 10603841 10189045 9810386 9448764 9108805
12257 9108805 8789197 8504661 8237701 7979579 7740920 7525296 7321575 7104519 6899861
12248 6899861 6723266 6565276 6386755 6217686 6061568 5906470 5757150 5623257 5515241
12239 5515241 5405620 5283853 5182641 5085074 4983289 4880109 4796393 4723516 4627863 4526677
12229 4526677 4430183 4332223 4224132 4124350 4014190 3907163 3806864 3704727 3616556 3527884
12219 3527884 3448835 3369988 3285915 3206864 3129766 3045496 2946530 2853870 2772581 2707871 2652227
12208 2652227 2578966 2506066 2442531 2373066 2308660 2254543 2211678 2167759 2120029 2080367 2045594
12197 2045594 2004618 1970100 1937440 1920460 1892039 1847404 1810604 1784292 1741322 1709628 1690321
12186 1690321 1659048 1608220 1565666 1531464 1490941 1467298 1440734 1416312 1402979 1386226 1352853
12175 1352853 1327165 1316788 1297561 1280762 1279996 1278681 1286058 1287402 1284131 1282472 1266007 1212387 1174557
12162 1174557 1145839 1109742 1080239 1052397 1013194 980729 961886 950525 948489 930147 906454
12151 906454 876746 858939 838480 819840 792403 762363 744296 729531 723962 723405 705627 693930
12139 693930 694654 707995 700657 692630 700561 706778 715013 729109 764419 785568 811165 846278 887791
12126 887791 907199 906746 900253 867767 839900 811197 775181 735601 697718 672261 673366 661968
12114 661968 644127 633700 622498 602412 584807 553828 515291 493632 471875 449219 443835 438973
12102 438973 451594 447312 435437 417220 421039 431451 420290 409984 387165 378283 380352 391561
12090 391561 391776 389774 399933 413202 437573 488707 553372 622467 715352 818742 914540 980666
12078 980666 1009165 1001522 956818 877036 793059 711387 623446 550809 489523 453379 400099 359599
12066 359599 346080 315314 301524 294407 278207 286637 281408 255719 248446 241575 233587 236276 224334
12053 224334 205795 187968 171806 164701 165419 179113 189474 187208 168563 158874 164653 178653 173932
12040 173932 186192 192522 189641 200044 207846 186578 170691 170253 177221 182214 175048 171279 178009
12027 178009 183566 192452 188934 172207 165424 158158 170527 171634 177757 174332 155619 155171 153401 158663
12013 158663 172146 152399 150517 152013 153919 158840 176367 184882 173456 170403 181796 191693 194238
12000 194238 203613 230992 251569 265656 287578 310324 326536 375888 438108 495813 585480 711266
11988 711266 880471 1109438 1390953 1715761 2062934 2415992 2724494 2942315 3048652 3014311
11978 3014311 2854236 2590289 2259488 1914824 1600519 1329526 1092809 908391 786769
11969 786769 715393 662621 615620 582820 555717 523279 495393 480366 472030 449306 415771 398805
11957 398805 394828 370320 338979 315375 296993 284834 277752 276289 276068 264627 236595 203720
11945 203720 198061 205066 197903 189870 193623 194792 191938 171314 172236 188619 186634 179077 168518 165204
11931 165204 166386 155927 149536 151140 148710 137569 145337 149182 135148 138746 135190 131037 139213
11918 139213 139528 137569 134377 124706 128894 130418 127680 124441 123726 135085 126551 113644 99915 104204
11904 104204 116715 108727 103807 93970 95285 90581 85452 85501 90713 96947 101995 108983 126723 135242
11890 135242 139068 147866 144590 146713 150359 155595 174652 202898 223857 259399 312702 381995 465215
11877 465215 559428 661619 758947 846809 885826 887791 841317 757353 657917 533689 434787
11866 434787 362613 318295 267711 222375 200617 190129 190949 185571 177506 176533 167237 152594 142310
11853 142310 127524 131784 132735 126464 116806 102889 94364 84608 72697 80141 99692 95189 84786
11840 84786 59011 32936 21220 25291 25878 31591 40280 39436 42689 52469 63785 75637 77947 67417
11826 67417 69713 89054 108811 99468 79193 64302 53284 52286 56011 65048 61442 61547 53224 41536
11812 41536 48836 38070 28670 33115 36609 40415 27642 27434 33159 37136 50801 59109 56588 49268
11798 49268 44936 51930 39786 40398 46821 35974 49554 61198 68231 52969 45463 40742 44319
11785 44319 55179 55594 51739 51912 34176 19649 20407 28290 25244 18513 19083 22499 37131 42250
11771 42250 32765 43905 48236 34756 34825 39841 35432 32727 26335 15556 7097 14117 11375 17564
11757 17564 29113 26782 27319 23948 34887 26237 38338 41106 42011 26157 8159 9522 14527 26007
11743 26007 36524 42933 32071 32091 24296 12255 22405 32798 46110 48627 40788 35365 29291
11730 29291 20314 19351 23172 11901 11548 18837 17145 3997 5467 12027 13264 13242 10596 92 8284
11715 8284 18002 22018 32467 31087 21483 25698 31645 17016 9737 11101 27243 33606 30328 18502
11701 18502 18153 32219 45657 39100 25195 25134 16160 18377 28248 25431 25247 21837 24275 15328 -274
11686 -274 4483 9130 14791 13639 15111 1238 -4622 -9704 3339 11279 15788 23883 28739 28147 31545
11671 31545 32755 35996 47450 36094 18277 22621 32387 23739 22267 19859 16621 17743 14194 17916
11657 17916 14633 21166 20701 6161 -8893 -633 -1159 -2462 -4851 -1216 2676 -7206 207 3458
11643 3458 -672 -17336 -24138 -19150 -10037 11023 9321 15091 22596 23410 20418 19580 29378 32273 16351
11628 16351 8628 25361 32482 24088 13636 13416 17123 4593 -10699 -10756 -3326 11875 25508 25051
11614 25051 12799 3575 6447 7568 11013 -10112 433 11933 14376 19174 22176 25010 18082
11601 18082 27673 32925 23550 17160 15313 18325 11775 -940 -2519 -2709 377 986 -3027 -3590 13230
11586 13230 22568 10179 9656 1423 4589 10150 18294 21591 25167 22239 23341 10432 5270 13021
11572 13021 12753 6046 9745 1932 7020 21747 24669 21477 40853 37138 28293 23576 6835 -1101
11558 -1101 844 8000 -1410 -5877 3922 8367 17941 33386 30486 9839 -5832 -16323 3070
11545 3070 34873 46612 29792 20329 15889 24798 22507 19690 22138 17980 13088 12290 11198 7888
11531 7888 22109 27767 27841 22218 26674 36102 24312 9709 14646 25260 18232 3435 -5151 -9497
11517 -9497 -4313 -7372 -8627 140 -519 7950 28999 20915 17731 26414 22786 17718 18999 13875 13012
11502 13012 6592 17672 26249 24959 30887 34693 27835 11455 4641 -7790 -9978 6409 16446
11489 16446 7224 13948 14836 12840 305 3484 14860 17393 13768 10561 -4899 -12120 -16668 -8372
11475 -8372 -6872 4054 7417 14863 6138 4448 5791 6621 -3041 284 8135 20493 15740 5379
11461 5379 -377 -3081 3821 -2730 -5902 -7298 -599 -9424 -1586 6935 10593 14751 23745 29578 12326
11446 12326 3059 7984 2266 8243 6570 9779 18302 15038 11749 3584 1203 15723 18623 15937
11432 15937 705 -3735 -397 -1999 5779 12210 645 -3193 11329 14724 5704 2334 -9726
11419 -9726 -5177 6826 -2402 -13104 -17335 -10748 10420 32387 43222 36299 21132 17776 14136
11406 14136 18960 20617 15183 11444 14996 16593 530 -4666 2368 5803 6407 6865 18179 21559
11392 21559 24039 31504 20971 6056 3456 10041 7912 7316 9667 13044 16546 9614 -2346 -4677
11378 -4677 -3482 9977 6968 12077 25803 44222 66164 61576 66812 63040 42388 39994 25612
11365 25612 32129 36486 31811 26530 12284 1914 4016 5327 7033 2843 7679 11963 18107 22106
11351 22106 21031 20566 26247 9402 -8309 -7626 -3163 4135 19346 24813 22436 9912 9039 23297
11337 23297 24443 13599 8229 11774 8221 6612 5661 17077 15192 22974 34054 31082 24533 19152
11323 19152 22888 21804 23106 25488 18399 25860 31496 34888 33461 14618 13250 30928 23906 7464
11309 7464 3109 11929 8782 2 2630 11279 9570 4228 2284 11423 3447 3336 10680 18139 18859
11294 18859 20350 18430 10519 11614 6845 21015 27029 27995 21332 10136 2678 12833 -1440 377
11280 377 13237 11877 8509 16369 13836 3775 6551 6906 17457 34703 38262 37051 28425 28678
11266 28678 27505 26862 19991 5006 3002 -1022 6403 8413 4308 13977 8863 15843 18312 25748
11252 25748 34749 21102 12948 23277 36292 29441 28555 30245 44513 42830 29607 36731 34932
11239 34932 23866 18869 9382 18268 18327 28462 35219 38734 29882 27445 17592 6283 6065 13833
11225 13833 18713 29416 43758 46600 38127 29893 38574 47740 50912 41464 31853 39158 58757 52842
11211 52842 49126 51981 48257 47423 50621 65779 68023 60015 57855 58333 77476 96882 98815 64777
11197 64777 43421 38355 38601 54354 55527 52135 60629 71893 70830 60129 62194 52972 43579 45198
11183 45198 49856 52659 56001 54028 55187 53615 61048 65893 53316 52310 52439 66314 64101 61160
11169 61160 64629 66797 72169 84236 80147 75044 65493 64180 63627 61182 59155 51095 49669 47927
11155 47927 35872 32773 36280 35372 33437 44544 55832 70936 69591 59138 58804 58068 57068 53820
11141 53820 51273 63057 67216 55152 57087 54609 64562 61430 68985 76436 73069 63789 43672 52378
11127 52378 68458 83832 101186 98183 96467 90175 81691 72771 65902 61618 81182 96120 88275
11114 88275 83370 86803 80790 68730 76543 84798 89421 85154 83111 81430 87593 86978 84257 80298
11100 80298 82261 83454 81642 79897 83603 82361 76087 73902 69800 71287 81660 93086 110989 114671
11086 114671 122738 136958 138546 130431 129094 123010 110679 104342 90053 77497 67555 62957 55600
11073 55600 67710 67715 69812 65606 66378 67528 59716 56676 71723 77948 77216 76659 60856 55659 48111
11058 48111 34710 36033 49035 60140 65421 66768 70692 55478 59636 72440 88346 75373 54353
11045 54353 65041 84334 87851 81262 79192 84092 82069 92827 90519 82707 76236 73735 74747 72787
11031 72787 80885 82108 80553 89817 97713 115375 141028 167166 184502 209936 235048 267708 275351
11018 275351 265107 251065 235271 228716 233913 232457 226441 228332 231798 244887 247429 251168 260395
11005 260395 264407 269077 277001 284986 310256 332687 355401 373395 380999 381344 365205 344865 330471
10992 330471 310550 295502 284182 273115 259916 279723 313341 350154 375212 398941 440099
10981 440099 478863 511348 542886 586700 601749 582743 554463 507844 467705 445980 425769
10970 425769 401793 397896 384725 374506 369706 383958 381860 386310 381977 368835 362246 355169 351846
10957 351846 343522 327410 306190 296629 291973 286498 270832 270819 273683 265120 270143 292109 306950
10944 306950 310597 322111 334640 338434 345539 340134 342597 344600 342319 343556 343977 336566 310097 287880
10930 287880 281574 274135 257620 228564 207515 208032 211913 215846 212529 206626 214420 225549 227881
10917 227881 219826 211961 213813 220906 228186 252776 292964 326862 342519 396814 467765 553468
10905 553468 696558 871900 1087509 1339495 1581081 1737991 1681041 1420733 1103080 862731
10895 862731 689069 568257 491486 442502 394709 369669 353079 326531 302707 282976 277977
10884 277977 264370 257912 230489 223944 211397 201632 198840 198335 197893 199242 188219 188434 187009 161456
10870 161456 165913 173716 170907 163265 164630 166810 179967 174280 157731 148846 150358 157395 164999 151724
10856 151724 156210 164512 171232 166940 146710 142910 144069 138846 132078 139926 145747 147717 147351 167637
10842 167637 165067 174601 184619 171727 152257 155667 157242 160132 153818 157150 152590 156306 162610
10829 162610 162450 158318 167090 170239 175494 189189 193958 183333 172359 168836 172060 178182 176749 172552
10815 172552 167661 158637 155464 148120 150197 170894 170930 169915 177127 192016 189015 181007 182528 189290
10801 189290 186362 178744 199182 211073 213776 213109 199873 174464 148562 129778 108402 112638 137839
10788 137839 147308 165077 187274 195106 199633 211929 216196 227336 230263 228084 215510 204834 205507
10775 205507 206988 205894 212466 222861 241337 246000 236280 225246 209567 205023 196061 201384 206942
10762 206942 219027 223220 201836 189374 168570 176108 198867 196633 197664 202903 201459 200467 194101
10749 194101 201017 194512 196902 217427 228600 238404 255600 283213 322508 361553 386093 394390
10737 394390 391786 383551 388084 381451 363507 361403 359919 331193 309247 308713 312898 311150 305316 305048
10723 305048 299992 301951 294025 282474 282173 283048 288949 299064 307147 311341 305265 295289 292499 278114
10709 278114 274144 279611 296407 309265 317977 326707 328176 329759 323035 339805 354321 371506 395053
10696 395053 427708 473564 493920 498138 507380 527660 542424 556783 564607 556331 561656 584569
10684 584569 614737 641832 675987 728588 777710 805950 835239 853680 860176 844769 830189 853251
10672 853251 862147 868475 898422 947761 983143 992713 995439 1012983 1037600 1064926 1091207 1135984
10660 1135984 1172731 1191053 1192472 1185909 1191514 1197442 1209001 1204635 1186422 1173210 1188769 1203513
10648 1203513 1207705 1246642 1298908 1358703 1412914 1479725 1564026 1653495 1753961 1866839 2019588
10637 2019588 2156285 2257899 2331901 2399080 2471209 2555624 2656137 2794090 2949556 3126172
10627 3126172 3365846 3659619 4009805 4367961 4697934 4952254 5165430 5363799 5544593
10618 5544593 5708493 5847823 5976897 6096521 6173785 6197388 6154805 6039992 5879839 5776766
10608 5776766 5802628 5978313 6308132 6780010 7405124 8270099 9421318 10981172 13076095
10599 13076095 15820545 19206967 23067292 27128639 30754336 32948838 33161875 31913626
10591 31913626 30277028 29226939 29199157 30095794 31523969 32950882 33932513 34282662 34079444
10582 34079444 33547876 33202799 33405140 34109969 34884198 35300807 35400022 35683556 36589549
10573 36589549 38161721 40193781 42420424 44523414 46175092 47074105 47206571 47044458
10565 47044458 47145059 47841969 49217812 51078202 53093522 55102432 57243002 59584995
10557 59584995 62204148 65641652 70384063 76092717 81851356 86692685 89255252 87784959
10549 87784959 82469509 76236507 71366633 68239526 66326625 65082774 64172038 63505043
10541 63505043 62945413 62258039 61390588 60638422 60225596 59903470 59029708 57210808 54841898
10532 54841898 52497239 50456404 48822873 47590120 46746774 46359404 46353175 46446578 46254182
10523 46254182 45655908 45047138 44986216 45640542 46666720 47476576 47754567 47490175 46762860
10514 46762860 45959151 45763478 46533451 48139881 50120161 51681389 51465859 48447926 43374959
10505 43374959 38194893 34211140 31637050 30158824 29450623 29231973 29297364 29539034 30016454
10496 30016454 30942446 32548661 34943173 38252031 42740409 48892011 57420331 69489774
10488 69489774 86932489 111798885 145200770 185974745 230919364 277173081 316003437
10481 316003437 322871853 280045665 213210472 157579316 120477145 96500344 80568143
10474 80568143 69584695 61618468 55572762 50887456 47258954 44421142 42126123 40171440
10466 40171440 38407335 36782235 35298408 33893289 32526613 31280615 30145984 29041293
10458 29041293 27894967 26735315 25579589 24482292 23481172 22578197 21746803 20961924
10450 20961924 20233472 19561498 18947495 18392188 17861253 17336547 16837697 16385278 15962802
10441 15962802 15549913 15140769 14740501 14360963 14027598 13721747 13415077 13082760 12759776
10432 12759776 12465915 12217714 11998558 11812750 11641859 11464439 11279984 11094515 10871706
10423 10871706 10615869 10338990 10043310 9754197 9473366 9201430 8963573 8766347 8582917
10414 8582917 8378450 8163214 7931063 7711234 7532373 7372529 7205233 7055449 6916303
10405 6916303 6748847 6569323 6405717 6236182 6049658 5867415 5701663 5548167 5421741
10396 5421741 5298500 5182571 5073166 4964561 4855089 4746086 4639326 4529377 4421787
10387 4421787 4316505 4225351 4138243 4058637 3981292 3932319 3889800 3835891 3774649 3703484 3628993
10376 3628993 3544867 3452744 3367432 3282006 3206865 3140406 3077237 3014113 2947698 2887590 2830058
10365 2830058 2780010 2726857 2679617 2642175 2614721 2587767 2551600 2541198 2539829 2546385 2536313 2491781
10353 2491781 2410591 2302430 2218579 2141025 2078494 2006660 1948603 1904643 1866490 1831820 1795626
10342 1795626 1761033 1714671 1666002 1623480 1587186 1559061 1520149 1494342 1459386 1423806 1385396
10331 1385396 1335536 1309029 1299256 1291198 1289794 1286575 1264516 1237332 1221620 1218414 1223407 1217898 1189936
10318 1189936 1166184 1144341 1126675 1099992 1076961 1052511 1024937 1012877 991187 968516 956164
10307 956164 953663 929452 900640 881245 852542 832424 816542 797030 780678 776683 764631 750651
10295 750651 722359 709356 730588 758561 744283 734336 731905 722873 704576 692054 679063 655874
10283 655874 623027 590083 570445 535232 509890 496865 483610 483266 473703 459601 457990 464020
10271 464020 481954 476040 467877 451856 450699 440314 427354 417746 406464 399491 405342 414231 409284
10258 409284 404372 398951 387514 371500 350711 336727 333330 332599 325626 305890 300304 304088 308702
10245 308702 319640 337287 342305 340151 324911 311831 311214 311419 313213 307239 301919 290094 287243
10232 287243 300781 312554 320545 320998 318838 302910 305143 308490 301638 297708 286136 272548 274511
10219 274511 274744 264219 248882 245489 268865 258867 247210 238902 245155 241538 249802 258521 268416
10206 268416 259619 262040 262757 248324 245908 253430 248978 237452 232429 241627 245822 237359 243408 252611
10192 252611 256401 248305 236770 218748 199531 204758 207197 209506 210146 211713 216050 233851 239589
10179 239589 234529 246801 271654 281914 287754 315795 314671 290263 286915 299401 295356 291198 289386
10166 289386 304367 332336 366057 394890 407586 409036 412590 430754 436084 444075 458164 475743
10154 475743 491446 506791 528334 571999 626197 677018 723249 761146 821330 890578 965181
10143 965181 1037373 1153164 1317371 1522257 1827997 2251435 2853314 3712112 4877608 6371652
10133 6371652 8102629 9936106 11593259 12442636 11798205 9772548 7451353 5595158
10125 5595158 4366901 3592479 3077236 2730111 2489532 2324573 2195968 2088081 1991673
10116 1991673 1898681 1815128 1727076 1649070 1570247 1500287 1456500 1396698 1337897 1292400 1274382
10105 1274382 1260088 1242965 1226686 1206496 1196037 1183757 1145330 1091277 1039778 990307 951506
10094 951506 919254 903965 880721 845241 816729 798480 791826 772471 759296 754567 742513 738482
10082 738482 736036 743192 733932 731785 729514 720453 711144 698799 680341 657719 640113 630727 628306
10069 628306 622601 631733 642062 651369 689541 747357 857125 1000563 1176996 1403957 1648169
10058 1648169 1865839 1999367 1935533 1665265 1339170 1081552 910860 795444 710024 646748
10048 646748 609630 583082 557228 523455 502220 499801 504796 513724 514926 514600 528190 547472 565377
10035 565377 593283 623267 620574 605686 563260 507452 469444 433359 399032 380051 355791 328116
10023 328116 307607 285186 281659 277387 290643 312742 336270 349490 336284 311042 301227 301170 304538
10010 304538 305799 308597 296221 283785 284295 275507 277400 277221 275450 268829 270803 275940 287705 315447
9996 315447 335250 351071 389477 434723 464295 483349 478536 435553 384932 345213 311706 263638
9984 263638 233576 225258 222452 218978 227057 222831 220977 212835 228870 230364 222580 193849 184032 181006
9970 181006 170391 164848 168369 154036 144127 142895 152088 151926 153875 155531 145113 145397 163298 152411
9956 152411 145879 133036 118163 127107 132535 122920 114147 122681 123146 128824 144882 147376 129680 120906
9942 120906 130632 131643 131595 134776 126057 120909 120800 110233 110884 106063 118089 142503 150273 153434 154336
9927 154336 143854 148548 149117 153831 169328 191002 209344 224985 237337 249198 223855 203162
9915 203162 198703 197357 190511 176319 178243 190056 205337 217923 220819 225682 231857 233793 226933
9902 226933 218833 190010 170113 168642 152415 143311 142209 145238 149942 157473 138389 136401 149998
9889 149998 159305 154964 156696 161372 173627 201426 225368 238765 260297 279507 286144 279602 282318
9876 282318 287947 303849 313774 323686 341521 355719 358319 350260 328912 287084 255769 241359 214430
9863 214430 192504 186280 191458 191930 208088 196381 173055 178708 176574 181307 199764 211293 215616
9850 215616 220638 215560 217185 210434 210164 214738 209961 203190 204076 214007 248867 274236 294218 314348
9836 314348 320537 337101 322856 321410 334245 330151 332371 336155 343560 338312 346147 369971 396159
9823 396159 396616 389851 383101 368463 350757 339735 340738 344939 340396 329792 319213 308984 310835
9810 310835 301481 302387 302392 301269 306610 300413 284217 270864 253217 244373 249304 260434 269831 285654
9796 285654 318938 346130 372022 409050 432758 450596 463934 497483 492647 452580 419105 389232
9784 389232 363603 351600 354415 371362 393074 423351 436083 440560 447040 438422 426394 399036
9772 399036 361494 329769 299875 287572 272265 259456 240757 234262 246679 249164 247573 231872
9760 231872 218012 192303 178550 187734 185793 178617 174915 184409 199955 205014 195827 178733 164145
9747 164145 143902 125976 121608 130856 147531 170780 167938 161899 162266 173267 183914 199204 219782
9734 219782 241938 254352 243682 250671 256628 252880 234692 203605 189394 170434 168676 178054 187810
9721 187810 170196 149074 131453 132575 128646 132342 133765 144342 149858 159086 171172 177329 180455
9708 180455 186517 187792 188121 186872 195678 192509 195950 187921 168142 173081 176385 189586 194418 183916
9694 183916 169172 163669 172461 182242 186858 173202 165377 170005 170645 169120 178986 184675 183220 173239
9680 173239 158985 149784 147617 158447 148086 137534 149540 164922 163052 163420 179656 191129 189959
9667 189959 187074 191623 189890 186790 187891 198749 207131 205955 199371 188987 189867 179101 175401 173921
9653 173921 169573 177124 179483 176676 171880 179245 186113 188596 192849 207461 221503 228547 224653 226945
9639 226945 235190 230414 220028 223740 228738 228137 234229 241614 225498 202285 188025 187612 189565 209368
9625 209368 217570 215299 215613 210586 213535 207206 200819 208458 213007 201683 192269 204412 206134 199888
9611 199888 203325 200804 183944 173120 179446 176511 179771 187384 196851 201569 197245 188076 197678 217162
9597 217162 233338 239095 253081 248115 236204 230114 227444 232960 230074 223842 218248 215985 219290 229104
9583 229104 226934 211252 211109 218157 222110 221462 216112 238679 252587 253816 253884 260320 264450 272510 267461
9568 267461 267319 274297 284363 287105 304084 323065 321730 333086 350189 367724 365735 362696 369057
9555 369057 382207 393258 408307 423119 427683 444128 482324 516043 534242 573274 632742 692407
9543 692407 741284 770700 787449 818744 876794 927808 980994 1049358 1134489 1216387 1307795 1416916
9531 1416916 1534714 1639818 1723150 1752785 1725062 1650864 1549818 1460554 1398814 1357570 1317280
9520 1317280 1294699 1284630 1287122 1294583 1319467 1360372 1422384 1488057 1574674 1704436 1872240
9509 1872240 2098757 2386552 2734749 3135897 3551467 3920004 4159960 4257345 4214425 4086934
9499 4086934 3906703 3695981 3500524 3347601 3191670 3039965 2913342 2831144 2785072 2768211
9489 2768211 2767015 2794451 2868941 2990142 3128812 3300249 3490425 3727983 4010592 4338304
9479 4338304 4711866 5149880 5661712 6186774 6641023 6901839 6900960 6703159 6439672 6207400
9469 6207400 6074794 6068061 6160122 6380084 6781027 7389958 8249458 9421174 10982368 12989213
9459 12989213 15576881 18834331 22644146 26751064 30891592 34559481 36766005 36588788
9451 36588788 34354344 31501595 29241840 27920811 27443903 27662595 28534006 29974779 31625397
9442 31625397 33087114 34353979 35837402 37865578 40381180 43170314 46072457 48921249
9434 48921249 51242638 52353213 52024989 50851402 49588658 48468909 47305520 45989392
9426 45989392 44775696 43984498 43836234 44432966 45762635 47640063 49744581 51978453 54608701
9417 54608701 58013593 62706793 68968314 76462719 84672003 93173737 100729783 104490015
9409 104490015 101688045 92944215 82156762 72305355 64365982 58519380 54784983 52787423
9401 52787423 51902733 51446870 50814346 49706054 48496753 47846821 48125738 49316881 51127855
9392 51127855 53142529 55096596 56894459 58383616 59300626 59196480 57563136 54469898
9384 54469898 50625373 46769524 43372798 40750788 38987684 37923524 37229953 36502978
9376 36502978 35611402 34769658 34388640 34753183 35839735 37428656 39274312 41010794 42075640
9367 42075640 41671271 39175149 35040337 30566252 26717117 23687494 21350169 19566746
9359 19566746 18172679 17051985 16171051 15490583 14995882 14645614 14411164 14249520 14139404
9350 14139404 14079256 14042337 13985995 13818511 13515744 13043226 12465412 11826176 11236095 10737703
9340 10737703 10337641 9976246 9618831 9297967 9031589 8796944 8567458 8384206 8215066
9331 8215066 8065356 7953935 7855343 7788723 7766809 7775114 7785729 7799572 7827837 7877416 7926336
9320 7926336 7929359 7849640 7638321 7295979 6884270 6466003 6069647 5747074 5501532 5297687
9310 5297687 5137622 5004219 4876323 4752665 4649619 4552591 4447293 4345217 4243698 4159984
9300 4159984 4096387 4056284 4026618 4007707 3994542 3987427 3975451 3974732 3961672 3926329 3840722 3722205
9288 3722205 3579436 3444737 3319123 3220951 3141681 3066819 2993672 2913360 2844135 2761146 2683740
9277 2683740 2612946 2536701 2465230 2396809 2325264 2263542 2205347 2149460 2112666 2070654 2023693
9266 2023693 1971868 1922153 1888929 1857759 1811229 1748590 1717867 1694204 1668593 1643325 1610438
9255 1610438 1574507 1538503 1504435 1484618 1459004 1432640 1405168 1378054 1336110 1329211 1317889 1286113
9243 1286113 1250911 1219391 1205776 1194477 1169323 1153211 1135231 1103690 1073938 1039877 1018216
9232 1018216 997528 979862 960220 941920 933314 892502 876551 877327 866935 854139 827115 818662
9220 818662 816462 800229 789896 784255 766228 755986 733403 715694 706481 689413 657654 633134
9208 633134 613576 622899 635853 643312 621108 594096 573861 564162 559752 559320 552019 542951 537438
9195 537438 540371 535461 530140 531336 509929 486504 476591 475671 482155 467934 460784 464756 457340 445216
9181 445216 436695 427475 411952 402360 405860 409681 414321 405162 395904 392465 385551 376402 382158 388179
9167 388179 385584 383732 376960 358631 354617 365822 364607 370038 367308 361472 355733 347001 355119 346265
9153 346265 324987 340316 341028 322960 319642 320004 317229 304137 299379 295926 300689 301956 290188 279079
9139 279079 277767 286077 289167 305324 318808 310696 306325 300829 304171 315097 308750 288794 276452
9126 276452 277563 291185 284142 275932 275336 277963 293501 301902 294000 280612 291302 301413 301740 293211
9112 293211 290823 290385 293904 297934 303534 307143 287549 282530 290442 290768 293179 289993 280778 282151 281562
9097 281562 292010 302438 297182 295567 288087 294375 299909 311671 327042 336262 356206 368005 368409
9084 368409 384833 378477 368454 364928 356786 368354 363818 349288 332700 320578 321741 321554 325948
9071 325948 306533 301591 313569 302421 294620 291431 290065 290994 294803 300528 311855 326293 338999
9058 338999 350348 353944 349848 360975 364911 356294 365103 376524 377629 368332 371106 382913 395247
9045 395247 411372 438884 483709 527353 559271 584807 585551 578683 561534 542572 521368 508882
9033 508882 491420 468004 455925 444644 445473 442391 442515 438012 441966 435061 426732 442417 456203
9020 456203 456194 442811 438445 429609 420752 429674 429048 420801 433922 447743 449227 444218 453272 463515
9006 463515 462031 471620 471383 479183 482975 482835 491393 505986 539616 574188 579657 581560 607628 622798
8992 622798 606204 591987 586847 601248 604177 599618 602757 612581 609331 617421 647192 649218 641598
8979 641598 611587 588658 585617 565626 549438 533296 517657 510223 495332 476034 485974 498747
8967 498747 496564 499888 504720 515695 510468 503121 490060 491252 497537 497992 492299 494374 510277 511594
8953 511594 515880 530775 550704 557846 566625 586561 623773 656558 670705 675363 679438 686660 692148
8940 692148 690387 698031 702354 702871 712011 712755 706978 689066 649816 639593 644901 630726 626301 628880
8926 628880 640145 633748 633288 635123 634001 620516 628036 641055 656783 663174 665442 658642 661910 673304
8912 673304 694714 695346 698170 713260 723353 726439 724507 730234 762409 786489 786963 802978 834779
8899 834779 850334 851190 865190 882799 895829 919009 946477 964165 978112 977192 945711 931346
8887 931346 936868 940058 949156 964734 973077 977440 982341 998159 1011112 1013364 1030585 1053320 1074230
8874 1074230 1100288 1112478 1121625 1139679 1157757 1178786 1203589 1238220 1265547 1277228 1283513 1291643
8862 1291643 1303425 1321850 1359243 1393560 1417821 1457312 1488469 1515613 1545950 1572762 1608307
8851 1608307 1651096 1709780 1760539 1825356 1899445 1963474 1966968 1944832 1912764 1911284 1947131 1989963
8839 1989963 2020458 2049564 2088493 2125908 2160079 2197532 2249314 2297587 2350648 2423472 2487548
8828 2487548 2541388 2588173 2640376 2700367 2770531 2858156 2940115 3020618 3083239 3152354 3232487
8817 3232487 3316312 3415621 3516977 3609124 3707225 3816349 3932043 4053451 4181410 4313027
8807 4313027 4443336 4586473 4757842 4931730 5108067 5296112 5492036 5680383 5803924 5920853
8797 5920853 6060576 6226687 6406634 6612293 6832349 7058752 7276996 7501652 7732920 7996824
8787 7996824 8267112 8549828 8818993 9075472 9357835 9653006 9959340 10261480 10568936 10869746
8777 10869746 11172547 11468297 11779898 12069463 12353184 12625845 12905088 13172235 13413862
8768 13413862 13631007 13826542 14010184 14166410 14291140 14403232 14493459 14565781 14608429 14635371
8758 14635371 14622832 14585247 14513950 14427538 14295781 14134005 13948226 13754179 13558341 13351376
8748 13351376 13133351 12914736 12675555 12430168 12179828 11923830 11676559 11422607 11170676
8739 11170676 10927146 10696043 10450650 10190945 9942631 9705551 9472382 9231234 9008967
8730 9008967 8812268 8622559 8415140 8195568 8006257 7838047 7659328 7457962 7269187 7105096
8720 7105096 6939433 6770755 6609842 6458731 6319314 6181424 6038252 5902584 5774756 5644968
8710 5644968 5531990 5425503 5306686 5194335 5082227 4969440 4863783 4760826 4665039 4565332
8700 4565332 4478100 4384486 4304137 4211779 4112595 4039045 3962274 3870419 3791423 3716248 3635775
8689 3635775 3564422 3511593 3460379 3417360 3362216 3291290 3227904 3164160 3095628 3024059 2980661
8678 2980661 2955215 2927183 2903233 2853437 2808843 2773981 2748965 2722858 2672825 2611543 2543031
8667 2543031 2471200 2417362 2376176 2337272 2284246 2237294 2194095 2164972 2128364 2102042 2069883
8656 2069883 2034519 1997287 1963841 1925552 1894857 1878311 1850452 1806828 1784108 1753942 1731458
8645 1731458 1715489 1690813 1655210 1625841 1601646 1580086 1565954 1538664 1507706 1481360 1463667
8634 1463667 1449211 1452697 1438653 1401078 1360832 1335656 1306352 1282904 1290358 1290283 1265624 1252953
8622 1252953 1231992 1210491 1193973 1172936 1162122 1145775 1130746 1113678 1101869 1087385 1066493
8611 1066493 1061471 1048176 1033745 1022718 1015227 994593 975967 967724 946687 934565 936532 936444 940913
8598 940913 927571 906402 904074 897418 890400 889014 885245 867953 852537 845937 837589 830149 829056
8585 829056 811324 788649 787878 790229 783936 766369 744712 729958 702725 689423 663321 649921
8573 649921 657819 652274 648420 645098 642875 631803 613429 601720 599096 602505 592863 582834 585421
8560 585421 578086 575712 575694 568625 560709 542816 534109 523958 514738 520459 503708 495787 493094 503141
8546 503141 515484 509126 497208 487065 482900 479333 475698 463547 450276 452739 442357 426729 439262
8533 439262 451318 455118 450502 442070 430037 415247 413629 426699 433894 419951 410857 405066 394922
8520 394922 382579 385285 392445 394383 381524 370771 352523 335831 335172 334243 328932 330854 324443 319956
8506 319956 316387 329881 333076 326572 331151 339898 329340 327589 338529 331091 320333 317544 297751
8493 297751 287060 294080 308959 304153 309504 315385 308899 288341 283822 275613 275778 262086 247425
8480 247425 248383 263365 267590 273078 266840 258178 261726 269328 261478 253310 244170 227765 220279 222815
8466 222815 225466 237456 242431 252334 252680 248710 254280 257135 249056 244092 224947 214699 213608 214905
8452 214905 220504 228443 229758 229472 241540 233670 212923 206123 199546 209104 206292 203784 200872 212792
8438 212792 210764 196038 195224 194598 192277 204614 216759 209274 197916 188991 188610 184818 176886 177303
8424 177303 184754 187188 180737 186015 199739 203193 198814 195326 195816 195784 196142 191461 186556 175082 176115
8409 176115 171375 172461 161671 158470 151304 149911 151879 160301 173066 189232 195276 179847 168069
8396 168069 168144 168517 161667 150412 141682 145632 149616 156973 162199 163289 164800 159002 160983 159638 147736
8381 147736 147949 146776 154852 155774 141622 117242 118260 138453 145134 149034 150186 160119 166237 152060
8367 152060 141152 146672 142945 132697 124211 118020 130767 130552 128919 112598 105869 97784 107925
8354 107925 114390 115016 117133 122824 129574 125371 124446 137570 139104 133315 120339 124048 124884 131618 126365
8339 126365 110848 109297 118457 116371 117308 116105 106245 107917 119267 115905 111160 103831 97543 98667
8325 98667 94998 99785 92835 84488 74425 69507 80567 98433 105232 105298 121002 123287 113048 113395
8311 113395 127248 140504 151960 156856 157350 159944 165177 190635 226552 279966 321233 356549 385113
8298 385113 391347 352826 290792 243391 199658 178691 171774 171124 175719 168006 159706 149001 139129
8285 139129 137768 120775 103410 114615 125016 115310 101251 87863 96606 111031 125170 140008
8273 140008 147494 147904 142581 138640 144495 154835 160733 144644 152255 164959 193658 228527 260094
8260 260094 300598 337271 373081 405668 401557 343077 273165 224791 201085 178484 152974 133395
8248 133395 126717 124545 135844 143587 153118 149422 132355 124940 129922 132377 131887 133159 124116 110296
8234 110296 111056 107355 101743 84838 100037 108408 97851 98218 105208 91868 88092 86912 88088 81187
8220 81187 78040 81248 80239 76938 83348 89629 92783 99241 89359 88791 87946 95681 109768 90668 69349
8205 69349 70569 66137 63483 64906 62985 52811 64841 73937 81221 78428 74950 68365 76034 81727
8191 81727 70980 51393 52994 55024 64215 55520 57860 58365 52636 64772 70283 75510 65160 57418
8177 57418 58936 46314 38242 48330 59339 71761 93763 102639 90297 75163 79945 76984 68703
8164 68703 81534 82686 85611 86299 79410 72043 84760 91075 89534 88279 79870 78244 74189 67517
8150 67517 63870 56063 60254 47907 47150 35833 37903 50646 58451 60587 59738 62630 78495 86390
8136 86390 81233 65464 57012 48499 52450 51469 56316 65552 56592 40708 34047 45310 41222 32901
8122 32901 34670 41878 46999 50866 44051 56007 64605 60161 69052 66868 51869 55901 67452 61763
8108 61763 54518 58594 64437 57291 53915 56174 57253 66573 64576 71737 62717 63282 62296 63032 62990 66835
8092 66835 62522 65426 68284 64186 66356 66084 65164 57541 43184 50523 53575 49777 49036 52038 47573
8077 47573 52122 52961 56281 52763 55484 59995 57714 47880 33444 33328 38533 44043 36193 45297 44717
8062 44717 44416 47809 48598 47732 36632 33194 36022 33236 34829 39530 31949 36434 29056 29879 44226
8047 44226 41679 35715 31123 55201 64608 64272 61268 69051 61451 51721 60216 79055 72533 82143
8033 82143 74175 72996 70032 71023 70354 75031 75622 65715 66980 71619 72207 71850 69467 69454 60377 69278
8017 69278 75084 70696 70379 73711 83305 87926 77966 81239 72589 64723 75042 73933 64100 54782 59379
8002 59379 74181 66185 71597 81589 85655 107639 107978 95045 95181 99474 96215 92382 95945 99568
7988 99568 102747 86667 76501 77999 78978 66175 62663 67525 62662 73360 81535 60298 46694
7975 46694 43348 46294 37108 39738 60235 63166 62130 64124 83274 95533 90550 86490 82852 75038
7961 75038 79727 76507 80540 83969 93827 99919 102889 100262 106842 103201 90126 89442 89417 84915 90605
7946 90605 99578 116602 120736 103944 87163 76943 73087 73428 90506 85585 83085 79040 65302
7933 65302 58812 61150 66942 70637 62769 65674 63470 62049 75969 78948 79588 91731 96070 93159
7919 93159 87448 88776 96652 80033 73958 75543 81305 94189 93259 92752 90522 94913 94065 97805 102269
7904 102269 111322 108258 100435 99432 91718 87143 100455 107039 104357 84590 76724 70305 79045 85631
7890 85631 66867 42244 39487 40971 58834 70333 68352 51855 50515 66974 78501 75223 67689
7877 67689 60410 58892 63579 61829 45486 31062 33165 36506 55246 65480 43454 27556 29461
7864 29461 39926 57612 64671 64990 57718 50066 48315 30864 22631 20052 27497 44847 52372 52614
7850 52614 49563 51392 61658 58762 45714 42462 38216 44702 60496 66620 67840 62644 57340 62241
7836 62241 67688 63222 53208 45175 34347 38038 50108 48941 47687 43991 38092 22948 20186 28948
7822 28948 22179 21687 28977 24620 24475 35534 29179 15268 16585 32496 38558 41771 41796 32078 24652
7807 24652 28961 28855 15276 23707 22712 23473 32289 25715 25889 32947 52273 59739 36788 23377 25263
7792 25263 39554 35418 33607 31961 35049 32538 24556 39042 34665 25269 29029 28597 31375 26472
7778 26472 32446 45370 30943 30243 13993 -473 1433 10073 20557 18039 20839 20630 14226 12179
7764 12179 20508 28850 23031 19467 22308 25971 27317 32702 29386 33051 28092 18656 -2084 -8272
7750 -8272 5746 15286 10250 14161 23554 26326 26547 29240 24462 18204 9726 12807 20403 22482 23515
7735 23515 19800 23459 27444 25997 33197 41903 33218 26624 22378 20047 18773 22440 32870 21809
7721 21809 12923 16451 23730 33296 37785 24220 11567 14155 4160 10171 21495 37403 34058 35105
7707 35105 28944 36073 33711 28331 34205 28687 28925 31798 30889 22246 -133 850 4093 15804 5240
7692 5240 -4383 -7238 -374 5207 14474 31570 38740 41010 45663 43222 34255 20690 13439 18779
7678 18779 31073 44285 43233 46217 41237 48380 43147 32143 12295 21717 30470 26293 28633 28765
7664 28765 19822 321 -15762 -5300 -18337 -39548 -33410 -16046 2626 22848 26808 27455 19900
7651 19900 17611 34317 29441 26961 24284 22193 27385 26029 20314 27319 26978 15286 7741 6542
7637 6542 12246 26557 20419 15388 4581 -4819 947 2868 6988 15731 25236 36807 30137 20888
7623 20888 15619 10957 8386 8857 2207 4803 7411 17429 27649 17126 8966 15979 11980 -6635
7609 -6635 -5753 15769 22796 18345 18012 23114 22562 24681 27418 26907 30743 37188 37095 32959 26021 34311
7593 34311 27374 11025 11882 4206 -5476 -9598 -9692 4882 -5530 -6975 4562 15073 26226 14313
7579 14313 12868 1800 5775 3148 8092 16547 20703 22948 24251 33638 9868 -13674 -13799 -3704
7565 -3704 6689 4838 13697 14426 3940 -294 88 23255 29468 22847 12786 5153 -3267 -3409 9382
7550 9382 -1772 -14969 -13476 -702 15894 24807 14404 6403 3823 2866 9914 18298 11277 3242
7536 3242 9569 6117 3485 -7475 -13521 -8867 -2479 -11767 -21889 -8566 7136 15467 9694 15433
7522 15433 13783 7386 6014 4957 2763 5594 9532 18910 15683 4857 -2275 -5031 9671 19619
7508 19619 25657 20852 16141 18416 16286 27049 34783 26074 21832 13613 10002 6362 22511 33410
7494 33410 23198 17078 24916 20515 25494 20358 8424 6846 2707 10403 1483 2856 2886 4665 10782
7479 10782 18878 11178 12332 14916 16808 14294 2530 -3384 -1692 13453 16490 9151 12504 17185
7465 17185 16897 19109 20756 13618 4391 13277 15805 12427 2446 -4904 -7083 -7556 8056 11032 6397
7450 6397 1492 5504 -1749 -14537 -10539 2192 5839 -8565 -23215 -4674 2154 4992 4979 -1935
7436 -1935 2474 423 1895 901 -1666 143 -9891 889 6267 -1283 792 7845 19490 13775
7422 13775 17766 18274 22525 17021 12381 13791 5374 7312 3566 -1497 7923 5725 11985 2985 330
7407 330 6822 336 -22146 -11216 4053 15020 18791 12591 4084 -2001 5675 15620 8732 -1636
7393 -1636 11361 15341 18932 21230 8912 -2404 -807 2959 10566 129 -4336 -7912 -13645 -9880
7379 -9880 -4630 772 7513 4661 6514 12029 25916 25987 19965 17823 23059 15792 1769 452 2458
7364 2458 6677 8408 4974 -1225 -2249 -1560 7948 7336 -3213 -19990 -37929 -35166 -20805 -18071
7350 -18071 -4045 5004 -2251 -2602 12199 8053 -5998 1929 18555 25463 10825 2606 -1807 -9660
7336 -9660 -14051 -20404 -22237 -9871 15886 16101 14225 1027 2009 1750 -1503 -8557 -12334 -10365 -15358
7321 -15358 -19277 -19384 -11294 7385 9474 -521 -6488 -870 3286 -9576 -5826 6577 10780 9621
7307 9621 3262 -5664 -3152 -7419 -11585 -2581 3518 -78 -2106 7738 8430 7651 -4817 -5278 -8178
7292 -8178 -5832 4266 7516 3989 19475 35590 20661 19891 18153 19017 20695 30006 20847 24559
7278 24559 16866 1200 -1879 17671 31186 32082 17117 4159 10424 10725 1702 3419 -252 4288
7264 4288 7682 11046 21672 10930 4339 6376 13437 6718 1478 2220 -2681 -22573 -21650 -21475 -17844
7249 -17844 1321 17395 15420 10897 2549 12320 14915 14411 11859 17181 30580 34529 14370 1641
7235 1641 -3958 -6456 2437 -343 -9480 -4846 -10795 -6649 1921 10327 7742 11340 7340 792 -6603
7220 -6603 -5490 -246 -10754 -13353 -13443 -16573 -1971 6268 15694 21538 20479 23405 23704 4583 5740
7205 5740 13080 653 -14965 -27319 -26909 -22962 -31195 -37339 -21976 1156 5021 -1922 11154 13423
7191 13423 423 -5561 -905 -10654 -6153 5867 -2379 7391 16189 4010 2497 -2815 -9132 -10223
7177 -10223 2129 13928 6937 14334 10984 64 2078 -1582 -4192 11559 7865 1318 -7675 -8617
7163 -8617 -4916 4819 4309 6727 5413 1255 -2487 2328 8433 13414 15171 11680 4961 -137 -4392
7148 -4392 -8623 -9439 -2924 11132 12212 5741 -3600 -2721 -3494 2664 -2605 -15053 -24906 -17457 -4327
7133 -4327 5534 4730 1984 2778 597 4090 3105 -4071 664 -731 -4416 -12937 -13766 -4004 206 -730
7117 -730 2822 1972 1532 2073 1043 -4237 -12385 -668 18332 12504 21223 24754 10437 2086 18818
7102 18818 16474 15465 17643 7835 5743 8385 -175 12789 23313 20027 15178 15997 16590 5220
7088 5220 6169 6838 -6904 -9318 1881 -16975 -12567 -4026 15591 20768 10598 -1720 -6911 -7086
7074 -7086 3231 2725 -13707 -15134 -8529 5592 32711 42445 26336 14348 16676 25178 16326 18534
7060 18534 21415 17268 15954 9180 7517 3846 -8870 -15591 -13055 -7645 -5172 8405 20588 19659
7046 19659 4517 -7983 -24448 -27667 -23940 -18731 -15845 -11657 -5776 7758 4662 2635 -1925 -15391
7032 -15391 -20925 -17287 -20515 -23688 -14801 -15365 -11268 -1851 8005 5742 -1143 -7682 -17033 -5328 4171
7017 4171 -4560 -15800 -6357 -8275 -16923 -11586 -1730 -5350 -11191 3133 3908 -1700 8154 5223 -19125
7002 -19125 -41382 -42076 -23729 -17672 -9262 -3802 12217 12864 5260 2406 1280 3387 -7014 -16340
6988 -16340 -12311 -6472 11383 13511 -2037 -11081 -15874 -11855 -1563 -723 -3925 5011 12327 12704
6974 12704 13217 6399 10118 10193 10743 673 -10016 -15688 -2185 10285 22219 26359 15110 5213
6960 5213 -863 3020 2632 3837 1936 7165 11572 13375 347 -3100 2136 2515 8994 -2318 -6568
6945 -6568 -10925 -8600 -2160 -2286 7540 20435 20405 13514 7249 -4816 -5225 -1321 -3838 -9302 -20093
6930 -20093 -11847 -4148 -1612 -17792 -18869 -2034 9964 10939 7652 5135 -2806 -3187 -4746 145
6916 145 9136 13929 5869 -3108 -9130 -12446 -8556 -10286 -18835 -10135 -8070 -3583 4162 3588 5380
6901 5380 4253 7157 595 -3615 -8108 -4615 -1221 5127 1766 -8060 -3271 -5048 -6627 -7275 2665
6886 2665 988 -11463 -14606 -15670 -11227 -11119 -10130 -10169 -5070 -7271 1692 20523 29121 17514 6028
6871 6028 -3471 -1154 3077 1025 2440 4227 892 5709 94 8383 14700 15902 -1255 -16878
6857 -16878 -5905 -5325 -8861 -5252 11740 3772 -11456 -5415 218 9627 16925 12608 -19393 -24309
6843 -24309 -12770 -1911 -11227 -25392 -30903 -25051 -8152 -10534 -13431 -2950 -3418 -3680 -510 -13067
6829 -13067 -6556 1673 -10559 -14142 -5126 -5993 1496 9973 2687 -2216 6324 21189 26636 28764
6815 28764 18432 10738 9844 18169 13097 -504 -2016 -9143 -6036 -10132 3230 5489 167 2479
6801 2479 -1725 6775 16362 11447 4219 -1454 -106 -33 1914 -8598 -15077 -2754 -544 -4853 5702
6786 5702 17894 12224 8071 7676 3613 -598 -837 -7403 8129 9674 1685 -441 9011 -2451 -26509
6771 -26509 -24060 -13325 -1103 7745 9641 8242 7838 -4478 -11188 -10621 -1615 5424 1204 1249 -5405
6756 -5405 -6943 -2886 1771 10661 6759 5732 3812 -585 -12218 -9442 -12753 -15331 -9930 5928
6742 5928 25444 20662 14061 7213 8052 13978 12372 9769 12289 2150 2707 -2467 27 17984 17692
6727 17692 14991 7875 1382 6094 24601 29366 9365 5931 12584 20200 20961 22524 28399 22412
6713 22412 21527 9925 2565 -5227 8477 5674 2998 -4072 -22615 -29122 -14958 -6290 -2331 6650
6699 6650 4266 5893 523 -332 2048 9100 7020 9414 9609 6111 3257 9864 12294 10254 2512
6684 2512 1216 -1410 -845 -6391 -1652 -9562 -21346 -27544 -21405 -18545 -7806 -4569 -139 -3924 2300
6669 2300 9032 17575 22831 16039 11930 18482 18526 10682 14885 11965 -1195 -3424 5440 14002 -3333
6654 -3333 -7826 -11398 -4714 4863 -1294 -6420 -11024 -12423 -7172 -21502 -21354 -3852 18653 18752 1771
6639 1771 -4124 -3838 -7413 -18262 -23306 -15992 -5449 -5601 -2212 -992 14438 22497 10367 409
6625 409 -1789 6084 4638 3489 -7542 -18907 -10662 -5327 -13193 -16236 -4300 -11158 -18233 -32723
6611 -32723 -36031 -36561 -17945 -13279 -8705 -13565 -10221 -3507 -2726 -5195 -16655 -13567 -9077 -9600 -10685
6596 -10685 -9458 -2438 9528 16675 19593 8851 508 15388 16578 94 -6569 884 3357 2116
6582 2116 2876 13274 18505 21824 13870 17311 16317 16949 11132 1596 4632 -4583 -17389 -26580 -28324
6567 -28324 -17638 980 4426 13080 20858 567 -2678 8733 16795 1856 -1172 12257 14581
6554 14581 12140 2499 1634 -3503 -5456 -5497 -2503 2553 -10410 -11866 -2007 -1299 -5354 -6324 -17404
6539 -17404 -5776 -91 -4748 -13839 -17865 -10773 -20941 -29304 -24398 -24922 -27508 -25165 -12606 946
6525 946 9401 1557 -2488 7300 12845 4055 13815 13218 16455 11018 5746 -7856 -16064 -11900 2191
6510 2191 -2481 3861 3507 1876 1126 -977 -16384 -15788 -15882 -8890 -4058 -8558 -15409 -11715 -463 8707
6494 8707 5118 3519 7052 670 -10765 -13540 -21483 -19591 -29937 -45659 -34464 -33669 -22170 -6421
6480 -6421 -1771 10973 7511 2928 4123 8128 -892 8207 14957 18188 7054 6780 10142 15463 8647
6465 8647 14035 6381 1898 2549 11184 5934 -9487 -27725 -21514 -7868 8565 4401 -7194 -11445
6451 -11445 -18581 -9488 -6245 -8978 -7045 -14176 -17645 -5983 905 2123 10960 -7767 -19029 -15676
6437 -15676 -19885 -4756 3701 -297 -8772 -7651 -10574 -19883 -8780 5312 9035 7820 9241 12671
6423 12671 73 -4713 -4265 -2897 6239 12061 2595 -4289 -13662 -23748 -19698 -16786 -6829 -1420
6409 -1420 6072 25947 27402 10319 -15284 -20903 -14086 -7229 -3180 2741 7670 1327 2494 269
6395 269 -7181 -11426 -10453 -2987 5345 17061 11251 23037 30612 19052 23703 27976 16751 5240
6381 5240 3081 -3277 -11671 -2255 2119 -16044 -8839 -1996 1613 1749 1750 7464 98 -1611 4108 3840
6365 3840 7948 -1586 2091 484 -4262 -9950 -10831 4416 -2898 -9830 -8909 -2950 -2461 -9584 -11676
6350 -11676 -11166 -15951 -14780 -10990 -10446 -6742 -8795 -4747 -9081 -15754 -665 18339 15376 273
6336 273 9189 20033 13662 9670 -38 -4825 -3508 -6004 826 -3401 -11397 -22433 -5608 5671
6322 5671 11794 18231 25883 17932 14094 7017 1274 4213 -1633 -7101 2628 9448 73 2243 6110
6307 6110 650 -6381 -7679 -8644 -1675 6285 8086 7910 8937 14178 9022 -3269 -8986 -10286 6267
6292 6267 12535 15196 3328 8958 22120 18673 -712 -15675 -7031 6009 5947 -2269 -12257 -12355 -15252
6277 -15252 -16365 -11772 -7595 -7464 -13185 -13002 -10438 3359 7041 2431 -8784 -1200 13857 14720 7831
6262 7831 2692 -1797 -10939 -2937 -732 4240 4336 4055 11733 5136 2085 -2269 -5003 -8352 -37 10935
6246 10935 2693 -9673 -13186 -15665 -3470 -3786 -13197 -834 21926 40773 45410 27916 14523
6233 14523 9631 16059 28135 31615 20763 15752 12566 6496 -27 -10213 3432 15544 9558
6220 9558 -6485 -4181 -8084 -11160 -14457 -10228 -7568 -13220 -30457 -24177 -14359 -12133 -12889 -1174
6206 -1174 11618 1487 -15098 -228 12500 17600 8250 7006 1653 -221 1116 329 14139 11254
6192 11254 1126 -1946 -18731 -18547 -10639 -14488 -15093 -8117 -6932 -3739 230 -9419 -23957 -19375
6178 -19375 -21598 -22347 -11421 5827 9149 2614 -6230 -8389 -4877 6545 163 -9116 -3091 -233
6164 -233 -7092 -15404 -8212 -4907 -4163 6488 4392 -12652 5361 23378 14487 6156 2973 -5240
6150 -5240 -15642 -7306 -6580 9761 344 -13301 -14131 -5815 -3212 -2505 -2521 -10960 -13071 -8221 -9738
6135 -9738 -11039 -5069 12887 19528 11794 4276 8316 17857 14225 -3232 -10089 -10216 -16533 -22269 -20964
6120 -20964 -8758 -2006 -13059 -14936 -22753 -12556 -1844 -8372 -13051 -15159 3275 14088 3011
6107 3011 -13233 -11461 -11322 -5891 -9528 1017 7600 -1955 -1121 -1019 9726 13725 2136 -10087
6093 -10087 -14613 -13565 -18088 -11679 -5903 8366 1725 3458 11028 -2106 -3706 1258 3832 7098
6079 7098 -119 -13076 -19766 -17210 -18178 -12656 -4766 -3005 -12192 4142 7827 11345 -7896 -11146
6065 -11146 -5657 -1396 -17088 -29301 -16240 5778 14087 13767 13964 6578 15719 5656 -8715 -6826
6051 -6826 -12134 -7553 6046 13080 -2167 -20329 -6971 -3673 -14025 -8389 -4692 -30868 -40210
6038 -40210 -34530 -22076 -7682 2070 13189 11455 -4209 -9244 -8623 -20250 -21040 -9046 9347
6025 9347 12064 17186 17064 6144 6240 -1155 -5607 4844 -8755 -4708 3025 -3558 -6387 4216 6416
6010 6416 7712 -5927 -6379 3934 15045 11680 -5911 -22521 -19676 -4850 9486 -6640 -24482
5997 -24482 -10545 -1705 -10702 -11198 -2145 -862 -1714 6725 7825 -319 -9743 -9530 -25226 -27324 -9374
5982 -9374 4406 469 -5410 -19480 -19063 -4652 7468 4289 5615 13836 17463 14084 11137 1392
5968 1392 211 16271 1649 -6255 -1200 -10156 -873 7496 9945 -1753 4989 11414 13344 22374
5954 22374 18264 -139 -3873 3491 -2694 -4815 -5791 -2517 -2872 -12027 -13241 -12079 -17829 -16194 -9176
5939 -9176 -2142 -1219 -6584 -1525 -1638 -4166 -12350 -15218 267 16687 10117 5991 12284 20853 15666
5924 15666 -5296 -5005 -6171 -6583 -1146 -8265 -4799 16529 15598 9181 16472 28540 6919 1655
5910 1655 3340 -3312 -5967 -1600 1024 3834 5655 4506 6262 9317 13497 25159 14522 1205
5896 1205 -9119 -9716 -19603 -10485 -539 204 -13225 -21577 -14770 5935 13977 6161 2246 -5249 -6405
5881 -6405 2600 -1925 4235 7550 12308 13934 1003 -18158 -26737 -21295 -18753 -21344 12507 27324
5867 27324 21016 14048 27568 23578 15254 4888 -4495 -14068 -16355 -7139 -15515 -19450 -18237 -18181 -16849
5852 -16849 -11008 -15491 -3762 2278 2390 3355 4706 10007 5696 -3153 -18725 -31030 -28451 -13671
5838 -13671 1920 6622 -177 -7438 7880 18059 5373 -8097 2047 13593 2365 -9372
5826 -9372 -6237 12147 13355 14069 13801 2299 -15115 -28585 -23543 -16913 -8909 -4903 -12076 -9969
5812 -9969 -16623 -8295 -3754 1940 -3770 -9655 -9718 2089 -2239 -11009 -5612 -5798 -19106 -13074 -3606
5797 -3606 1695 3441 2605 7727 11984 2704 6312 1435 -7770 -13960 -14540 -13118 -4449 -11690 -20005
5782 -20005 -10855 -7758 -4232 -5167 -14042 467 8146 13603 17150 17197 18069 14807 8496 -6472 -12839
5767 -12839 -5840 -20380 -17344 -9276 365 19114 17449 2401 -4649 -9897 -19232 -26512 -31425 -20419
5753 -20419 -25249 -30172 -18834 104 1380 -4899 -16553 -7720 794 -5626 -11339 -18236 -7585 -2040
5739 -2040 1279 -7023 -1465 -450 -11802 -13600 -20949 -20191 -14578 -14290 -14618 -9648 -9732 -18778 -25416 -27285
5723 -27285 -20125 -9391 -6951 3209 5431 -3084 6568 9531 9380 -11299 -22543 -17772 -15140 -7788
5709 -7788 -4577 -11373 2141 4396 -121 3096 14 1739 -989 -8384 -14884 -26924 -16252 1949
5695 1949 15272 9981 -107 -11241 -5670 -4032 -6026 1443 5947 -3555 -3084 14925 7891 -7151
5681 -7151 -839 -6267 5154 13236 -10854 -7389 3745 12105 7296 -5246 -2726 -11721 -16464 -20102
5667 -20102 -20312 -12847 -8031 621 9592 8293 6046 -11373 -33004 -29542 -20145 -11763 -6943 -7142 -10458
5652 -10458 -15644 -22024 -17526 -7118 5993 2210 13446 15156 -2929 -6965 -4488 -3542 -9330 -24951
5638 -24951 -25253 -4896 2259 14996 4047 -1954 2144 7085 3780 -1437 -9057 -16428 -22920 -20253
5624 -20253 -22798 -21978 -26196 -27677 -20395 -17352 -10629 -3754 1999 8967 4682 7510 13390 6472 -9899
5609 -9899 -8208 -5907 8854 -1596 -13489 -18838 -18806 -16899 -9518 -5037 -21805 -23734 -24179 -12133
5595 -12133 -4655 9255 17527 29589 21926 19692 27649 17552 2730 18163 32617 21144 14581
5582 14581 17082 8983 4133 -5979 -17626 -20385 -20846 -17559 -2382 -11900 -5136 6218 4626 6384
5568 6384 3473 67 -8587 -15698 -9713 490 4746 1311 -1979 -4509 -6023 -19349 -33103 -46020
5554 -46020 -41977 -34578 -39136 -39253 -34195 -41974 -42988 -37420 -23107 -10800 -2386 8397 8357 6853 748
5539 748 -2657 -12533 -15348 -18818 -25376 -19810 -4457 5602 -4667 -16353 -10976 -20605 -26572 -21141
5525 -21141 -15042 1662 -348 8789 9075 12006 13277 4791 2047 -2002 -5405 -5226 -980 1277 -9212
5510 -9212 -22749 -22305 -11697 -14979 -12561 -12219 -11779 -15947 -12579 -19192 -16860 -11098 -20081 -22614 -3633
5495 -3633 14162 24039 33127 13053 -2572 -22662 -30477 -10214 694 11674 6315 6498 1592
5482 1592 -20792 -26115 -33341 -25180 -9557 -9718 -18728 -21571 -22891 -22905 -1550 11726 9516 -14478
5468 -14478 -14197 3959 8869 11403 -2309 -14258 -10291 -486 -16 10908 9708 -3801 -11109 -15560
5454 -15560 -18962 -24036 -15624 -18584 -19660 -16095 -5755 -7946 -6316 11344 12633 19973 21947 12775
5440 12775 986 -6791 1560 4455 760 -6115 352 16549 18406 -12846 -32019 -26127 -18347 -20216
5426 -20216 -23193 -5513 6727 -601 -20546 -38770 -32930 -16167 -44 -2589 3604 20549 23082
5413 23082 28691 25177 6194 -12867 -12557 -1925 7063 10388 1840 8745 11339 -306 -10820 -19043
5399 -19043 -22683 -19459 -6354 -16357 -13218 -11685 -7804 -5477 113 12264 16903 3339 6372 -2188
5385 -2188 -600 6676 7607 -4253 -6985 2122 11946 5395 -5823 -3090 -1166 -4812 -1702 -466 -9596
5370 -9596 -23447 -24655 -16411 -12219 -7724 -13295 280 8159 -3796 -5735 -5944 8146 19391 12988
5356 12988 6165 7209 6915 -2998 -13858 -9587 -2677 -10162 -2746 4781 7063 21365 11528 4923
5342 4923 7710 9639 9455 8484 8271 2489 3776 14428 20785 19083 17315 4713 -2035 -19153 -20735
5327 -20735 -6448 -12179 -11600 -17783 -7591 -1944 -13423 -12235 -5661 -11234 -10232 -14083 -8702 2253
5313 2253 11916 12189 12304 6287 -2507 1844 3316 -1520 -5897 -5396 4578 -3875 13754 21294 7379
5298 7379 15123 19740 5867 -2558 -4148 -4014 -2097 -3703 -3796 4462 13952 6277 11344 -1880 -6516
5283 -6516 -15565 -23639 -12258 4197 11439 10960 4152 15169 21735 14727 5871 21558 18981 1675
5269 1675 -9015 -10338 16 1660 -1007 -21314 -20211 -8423 5930 -3707 -14272 -11553 -3720
5256 -3720 28 5426 -2008 -3997 -13827 -22445 -6902 691 -3091 -15096 -20934 -19239 -13815 -13795 -3765
5241 -3765 3275 -8806 -9657 2564 7884 14159 16385 16987 14469 6548 -1473 1734 5278 -5531 -12074
5226 -12074 -7652 -3278 -1807 -455 3142 14036 2937 -11962 4647 15555 7767 9655 8078
5213 8078 -904 -15083 -12700 6978 20675 17068 8597 5024 -249 8756 13468 17448 21527 12946
5199 12946 -1857 -6116 -4445 7630 10457 -4150 -9545 -7724 -18896 -12075 -14880 -20339 -26686 -19532
5185 -19532 -17180 -9605 -1736 -10246 -13452 -12883 -17091 -13729 -14868 -15650 -895 8549 12032 12823 684
5170 684 -9104 -9749 -8210 -11436 -3586 -12509 -12107 -11332 -5302 -5283 -8496 -5332 -9307 385 -187 -9371 -13755
5153 -13755 -16776 -10231 -8442 -2551 -11425 -29813 -28803 -19293 -6736 8453 5909 6030 4972 -1969
5139 -1969 5528 1109 -6840 -12926 -17969 -30700 -35807 -23759 -13785 -9283 -3340 -290 928 4096
5125 4096 -3018 -79 12565 6876 7226 6432 1886 5196 16115 15158 9201 1241 4797 4253 5140 15896
5109 15896 12761 11027 7515 -8186 -26349 -28272 -17688 -20018 -20159 -18763 -13804 -11778 -12037 -12236 -5211
5094 -5211 4012 8694 21734 26556 17107 5010 -10439 -20459 -16699 -3544 1050 -8025 -28345
5081 -28345 -33599 -33222 -10250 4572 8327 -6450 -15290 -15361 -9539 -4366 5930 1704 -2547 -5709
5067 -5709 -8069 -7229 -9443 -9129 -11150 -9601 -777 6890 1917 -2052 -2005 -117 -4301 -12924 -12610 -15171
5051 -15171 -11547 -5188 4565 -1777 3730 20191 22614 19519 3726 -7663 -7787 -9576 -11876 -24532
5037 -24532 -17388 -5581 -4616 -3744 -2488 -1640 -2925 -3837 902 -2212 -13445 -13740 -6543 -8559 -7652 -6648
5021 -6648 6948 5212 4958 7079 11068 2426 2438 6610 22532 11642 3816 -11848 -26570 -17099
5007 -17099 7654 11235 -5901 -11268 -13177 -8929 -22031 -14320 -11045 -8800 -8600 -27298 -25793 -30785
4993 -30785 -22488 -22116 -4424 1448 1710 8834 11114 23757 15626 6137 -3512 -13730 -23011 -24083
4979 -24083 -18642 -3138 -2263 -3146 -20050 -27116 -13867 -13894 -2867 -1175 -7193 -142 7737 746 -7695
4964 -7695 4068 -1610 -10834 -5352 -1370 4525 -13470 -23149 -18987 -240 7585 225 -6898 -7315
4950 -7315 -3592 1210 5436 2944 -2877 2386 12580 20188 14044 5639 7483 11305 -1953 4233
4936 4233 5148 -5504 6833 1249 -8849 -17773 -22086 -7660 5002 -2668 -13089 -9678 -34 -5515
4922 -5515 -1098 -2139 -1315 8035 -2376 -2909 -4236 -11118 -3306 -52 5790 8403 -4185 115 6623
4907 6623 8412 4786 3999 2022 -1216 2746 -6903 -8739 -4992 -7942 -3907 -20634 -16695 -5276 -4188
4892 -4188 -7438 7371 14063 16844 1551 -2810 4917 3939 8061 6035 -13181 -2626 9135 16292
4878 16292 6852 -8456 4030 8534 -336 -19281 -13451 -3465 14989 25322 25392 28924 32790 27951
4864 27951 28283 23605 16266 6987 -1712 -3180 -5843 -27473 -44695 -40422 -41192 -46382 -42410 -35001 -26108
4849 -26108 -8795 -2583 -11834 -20081 -16628 -11679 -1275 11987 12641 5832 5228 10133 8285 -7338
4835 -7338 -15196 -18225 -1396 1914 -14869 -21747 -17486 -15782 -22981 -22939 -15911 -18626 -8444 4026
4821 4026 4760 -5050 -18549 -15206 -4654 -15351 -7933 -4315 -17247 -29834 -24259 -22168 -24937 -12593
4807 -12593 -3404 -2936 -901 -1513 -10467 -21657 -23695 -24520 -26033 -21462 -13034 -12499 -28074 -18918 -3972
4792 -3972 5542 8060 5247 4446 -1073 -15779 -10121 -1144 -2532 3094 -2580 -5725 -7076 -11088 -20981
4777 -20981 -44014 -45622 -31020 -26239 -15954 -5411 -15166 -18386 -5427 6883 10660 -2676 -11843
4764 -11843 -11540 2857 6947 998 -5616 12988 25279 3984 -7854 -2911 2520 5931 644 -11771
4750 -11771 -4492 -5058 -6299 -1955 -6740 -20654 -24205 -18808 -8544 3852 -765 4311 2347 11568
4736 11568 10331 -15722 -14511 -13468 -17492 -22352 -15114 1259 14875 14993 10915 3689 10066 9183
4722 9183 9180 10670 4242 2886 6078 4932 5472 14807 -1374 -2276 -9610 -16010 -16747 -23287 -20289 -20174
4706 -20174 -13514 1191 -5072 -15481 -20045 -16300 -7491 -7959 -497 4579 16464 16376 5075 -598
4692 -598 -13075 -23290 -9871 -11406 -16946 -2144 8116 7562 -4049 -14608 -10712 466 2523
4679 2523 5656 8560 5250 17565 20314 11901 4982 7347 11431 12155 5426 6299 20477 7736 5858
4664 5858 15274 17261 -8184 -5791 385 5684 10460 18461 22972 13831 -4577 -5187 -4227 -11354 -7347
4649 -7347 -10865 -7373 -18518 -15916 -10056 1378 662 9111 8655 -15101 -23539 -15538 -5840 -11094 -7941
4634 -7941 -7277 -18363 -5563 -1660 -5039 14216 11067 4382 -19708 -19310 -19648 -22846 -10503 -3812
4620 -3812 -10458 -26228 -43031 -37305 -26803 -28219 -17919 -3701 3718 -2523 -4611 372 2822 -6751
4606 -6751 -14071 -21398 -18553 -16134 -22782 -16000 -6957 -3117 485 3725 5841 7740 5746 -7886 -6969
4591 -6969 -17909 -19037 -8278 -2304 -2944 -4048 -8485 -4360 -9214 -16310 -11440 -2876 -1476 -15828
4577 -15828 -6640 5010 6297 -103 -10509 -14614 -14614 -7614 -600 15676 15374 12259 13413 16556 19776
4562 19776 21425 25987 15730 3341 -7892 -12840 -21418 -12600 1467 11709 3967 2372 8180
4549 8180 8314 591 2244 1993 -11990 -9864 -18991 -8698 7691 12378 9659 723 1462 8367 11833
4534 11833 -4854 -9292 -7098 -11631 -12993 -13999 -3624 1444 -10211 -4758 5280 -3846 -6022 -10687
4520 -10687 -18055 -17712 -16781 -1498 14038 9524 12224 13570 10473 23179 35143 32907 13563 -1025
4506 -1025 32 -2395 -10950 -4858 6068 -659 -4015 1650 9817 -5901 -6320 -3265 2649 -6628 -15645
4491 -15645 -19236 -6549 -5584 -3967 -6296 -12737 -3957 3663 9960 4244 5180 4668 -15903 -27773 -24857
4476 -24857 -20284 -19633 -25967 -23257 -15204 -15512 -8405 8566 3749 -9597 -14321 -8083 -1866 -1600 -9915
4461 -9915 -10151 -4319 11020 12746 -2231 4733 -1673 -7152 -7366 -14917 -27137 -18397 -22120 -26456 -14829
4446 -14829 -12490 -21084 -28739 -8894 3135 -5561 896 -77 5376 5652 4352 12234 7038 11951 22885
4431 22885 27798 19168 34 68 2934 -4327 -2874 -9455 -24123 -28044 -24939 -11852 -13336 2009
4417 2009 5044 -11121 -3866 -8222 -22626 -32028 -22983 -22106 -13969 -13073 -20192 -8011 -2530 -11860 -29763
4402 -29763 -35380 -18516 -19196 -26559 -17098 -12198 -12776 -15659 -11454 233 -3565 5256 3281 4054 20220
4387 20220 22744 14662 7244 -2578 -4875 4476 10215 -4936 -15576 -24081 -21846 -18000 -4024 5434
4373 5434 310 -6755 -8194 -24685 -27981 -24831 -21275 -20407 -17172 -13064 -15513 -14530 -11371 -15527 -5848
4358 -5848 8255 9504 9024 11837 8713 -5122 -10123 -22480 -21343 -25286 -24308 -22819 -15559 -678
4344 -678 -4418 -13254 -19871 -24415 -21309 -12778 -16153 -9200 -5636 13004 18639 6315 1069 761 -3403
4329 -3403 9443 10181 17274 22436 5319 -4104 3216 12234 5642 9181 -4076 -23897 -22634 -15483
4315 -15483 -10639 -4434 -5916 -11324 -17258 -6048 -10230 -26310 -17193 -6770 -5571 1804 1794 -6322
4301 -6322 -3096 -5175 -1118 963 11964 11948 -12252 -21263 -15027 -21754 -18698 -9185 -4980 -9648 -1890
4286 -1890 11635 -11978 -25269 -19897 -15205 -7618 -10389 -17685 -15044 -17129 -10484 -10807 -435 -3761
4272 -3761 -582 -2220 -9875 2355 7895 -8098 -1381 4358 7673 13556 11402 -10803 -14353 -12512
4258 -12512 -13604 1738 9784 -5544 -9983 -9449 -9235 -17148 -25538 -19014 -17630 -7548 -17726 -27122
4244 -27122 -20756 -6235 5158 8816 2713 11476 15156 15525 16549 16956 13915 16369 10985 1659 4287
4229 4287 -3169 -13670 -5193 -1063 3889 16456 12375 -2288 2406 4427 2201 -3104 4230 -2190
4215 -2190 -24443 -13490 5806 18721 19853 10874 4869 9336 12167 6662 -7816 -12045 -16349 -27146
4201 -27146 -41211 -34180 -18939 5517 8799 2598 -1375 -15482 -18738 -11238 -9169 -12031 -19611 -22305
4187 -22305 -11078 -1794 -5076 -3254 -1940 1021 435 8274 7470 5387 6584 -5218 -9314 -9775 -9634
4172 -9634 2266 12610 1300 -10077 -14732 -5065 -1023 10913 11641 7572 1588 4008 2081 -3325
4158 -3325 -2238 -11282 -14468 -7961 -12343 -10257 -12909 -10204 3410 2437 -10591 -22846 -13206 -13002 -11400
4143 -11400 -493 3474 -7217 -7081 -12452 -25726 -8630 -65 -8253 -16029 -17905 -20655 4329 15892
4129 15892 15053 3460 -3099 2687 20646 28272 8199 -12621 -14443 -8748 -150 264 -5940 -6646
4115 -6646 3991 -3758 -7846 -10144 -4913 -4046 -13576 -20637 -13621 927 646 -18329 -25286 -23366 -16675
4100 -16675 -15722 -12002 -3356 -1181 -9150 -5471 4206 6729 1139 -9075 -4512 968 9575 17758 6616
4085 6616 -2950 3799 16672 16633 1694 -5548 -6952 -17092 -14018 -2969 9051 5403 -3918 -25236
4071 -25236 -19663 -9027 5069 7953 4733 6201 9450 2397 13680 9569 -6476 -1113 -1261 -13296
4057 -13296 -10761 420 7977 16223 7368 1042 -4805 1418 -8037 -5260 -296 -2725 -1175 2660
4043 2660 -6744 -10465 -19767 -6701 -614 -17803 -10437 -269 13350 -1954 -15082 -10270 -6524
4030 -6524 -11412 -19849 -20277 -29362 -36285 -13980 -5321 -10109 -10769 -12317 -6204 4796 9506 12984 4316
4015 4316 12371 944 -17011 -11140 -3823 -10870 -27333 -29483 -19471 -20022 -1729 10422 2303 -14173
4001 -14173 -12992 2055 8974 7192 -994 -3935 -5466 -13174 1779 12590 307 -2248 2796 11552
3987 11552 237 -670 501 6373 7051 5795 11094 11632 9888 2468 3301 13656 14331 10941 11140 6552
3971 6552 -10422 -21767 -23137 -27428 -22231 -23426 -30344 -28818 -27492 -17074 -7722 -8292 -1485 -3992
3957 -3992 -2551 -6602 4705 12078 14011 5390 38 1622 2301 -4587 -11302 -820 3437 5197 5657
3942 5657 -5666 -13910 -22417 -20173 8984 24950 19290 20159 9621 -3332 -14772 -15286 -2421 9093
3928 9093 6405 -5149 7156 13598 14984 -3601 -27389 -34755 -36145 -27858 -12556 -22097 -32717
3915 -32717 -30596 -27197 -33935 -30798 -18492 -24292 -15813 -2930 12816 19812 17418 3714 -997 3158
3901 3158 9560 -3888 -16321 -5608 7169 17253 1114 -15402 -32822 -31895 -23709 -8423 10427
3888 10427 7354 215 -4064 -138 -4590 -4335 -13295 -6187 -8519 -21154 -10274 -6924 -12500 -19621
3874 -19621 -27791 -21646 -12931 -8880 -31144 -32899 -16493 -13772 -17845 -8110 -7204 -12797 -27463 -29793
3860 -29793 -21071 -16825 -11311 -9523 -5033 15892 22587 10527 5468 8577 -6372 -27209 -26194 -20610
3846 -20610 -19567 -11711 -9576 -5261 1488 -1516 -9695 -15036 -16906 -16843 -11922 -3345 -10289 -18317 -9614
3831 -9614 -11203 -28008 -30763 -21442 -2834 2804 -5124 -6212 7237 86 -7400 -7368 -7386 -6445 1660
3816 1660 518 10572 13075 107 -4375 -5693 -650 4823 3615 11227 8147 -8430 -21053 -23768
3802 -23768 -22715 -14155 -3126 16272 19045 18469 24366 18502 -6532 -9171 2388 16391 10017 -9792
3788 -9792 -28615 -31871 -20130 460 6703 11340 9133 -3654 -6257 1019 6081 8113 -11606 -26055
3774 -26055 -30835 -16731 -13835 -18626 -17258 -14908 -4686 2693 -9493 -15950 -13411 -7442 12580 11812
3760 11812 -3467 -14682 -23890 -15624 -14780 -16572 -10914 1597 12396 30021 26662 22739 20267 747
3746 747 -9908 -9959 6205 8597 -2366 -11894 -9572 5763 10435 15764 11768 804 -157 4083 10139
3731 10139 2349 -1311 1239 18811 28264 22637 10753 -165 985 537 12746 7251 1367 -778
3717 -778 -10280 -1856 16430 26436 16955 10565 1886 -2594 -12515 -15138 -12902 6710 8046 590
3703 590 -1295 -259 -4584 -16043 -20778 -4963 352 -10045 -27368 -14123 266 -8140 -5844 528
3689 528 3857 770 -2658 -3210 4684 12801 13666 10824 10495 -4914 -24069 -34660 -22331 -4908 -548
3674 -548 -15337 -11308 -17127 -6844 -2770 6258 4965 -96 2150 2114 7012 3867 -10878 -4126 13252
3659 13252 7853 -1416 -2382 -10319 -16305 -5836 -415 -7805 -8122 -7887 -18995 -12843 -10552 -20543 -18648
3644 -18648 -18747 -9539 -1274 -175 -3423 -19855 -5697 3789 3739 6386 5724 14346 18931 -13486 -26036
3629 -26036 -16149 -10128 -10010 -866 9765 20305 13862 1291 -2413 -9855 -18466 -18483 -12709 -12206 -17581
3614 -17581 -18539 -6620 -5684 -1349 495 13167 21574 14966 17389 24670 25581 22982 28264 28306 19020
3599 19020 20453 7972 -1089 -393 -413 -6394 -10165 -10385 -14775 -23585 -17655 -11908 -6837 -13533 -24615
3584 -24615 -31470 -13412 1487 2222 7298 15122 4175 -3367 -3230 1358 7241 -7409 -16118 -16567
3570 -16567 -33584 -15710 -10170 -10972 2695 -2104 -18643 -27175 -22699 -11239 3498 2240 -3070
3557 -3070 -11353 369 19945 17607 17110 8800 5350 -4918 -17715 -14982 -14711 -17235 -12830 -5414
3543 -5414 -7371 -14663 -12242 -15668 -22474 -17110 -18369 -17788 -4393 11219 3271 -7788 -5929 -18948
3529 -18948 -24546 -7021 -9801 -21575 -30065 -32709 -17796 -26265 -25834 -22353 -19168 -21425 -9495 -1224
3515 -1224 -16848 -21621 -20261 -21663 -10464 -6256 -10169 -17589 -17590 -13876 -1227 5034 -4979 -10698 -19449
3500 -19449 -13991 -11072 -9748 -11399 -8693 509 -3664 5056 18903 17299 10081 -3952 -2892 8439
3486 8439 8855 91 -1212 -9788 -19871 -9309 -9700 -9847 -11888 -14978 -16250 -10589 -14109 -20678 -12407
3471 -12407 -7826 -17329 -24926 -20505 -6984 -11019 -5623 4238 2058 -16410 -8943 -7345 -8003 -8906 -14866
3456 -14866 -12365 -6379 -11949 -13744 -7418 -15476 -16393 -11720 -13026 1784 15136 7077 3185 194
3442 194 944 -2675 -11602 -3413 2913 6246 -1386 -13022 -11329 -10100 -18969 -17416 3182 -8149 -24806
3427 -24806 -41606 -28062 -23520 -17140 -7461 -14886 -26369 -33042 -15338 -6962 -4263 8833 -11661
3414 -11661 -23960 -25075 -18970 -11541 -3538 -2041 8860 -2 10772 13339 7504 10602 14704 2213
3400 2213 2607 12835 32099 9358 -26341 -26541 -14711 -5585 -7538 -11252 -6723 -21359 -27582 -25371
3386 -25371 -22875 -9442 -10121 -17918 -30438 -24891 -9867 -4339 -10475 -11792 2113 11348 -3302 1899
3372 1899 -5112 -9502 -1206 -3028 -12237 -12398 -16313 -18613 -7592 832 860 -611 3868 -3211 -18970
3357 -18970 -7715 2603 6143 -1635 -6132 -3347 -9080 -9440 -13161 -9426 -19952 -22652 -13748 -7900
3343 -7900 -8053 -3869 1616 -481 -3194 -6076 -14595 -17268 -16210 -21793 -9670 -7729 -12646 -10286 -14631
3328 -14631 -23466 -24651 -8956 12679 18744 7340 -6077 -5954 -3385 -8876 -26034 -16513 1138
3315 1138 -6519 -1392 958 -1681 -2463 -9971 -20324 -10058 -8205 6839 -516 1688 1518 -8926
3301 -8926 -7825 -5885 -18137 -13577 -8622 -7281 -17268 -10881 -3160 7063 19117 374 -12657 -8054
3287 -8054 -3914 6060 16516 6176 -7723 -18835 -30771 -27893 -3453 10146 1808 3581 -3741
3274 -3741 -16445 -11164 -12510 -12437 -5299 4380 8842 -395 -1261 3907 -367 -12399 -29142 -26950 -7736
3259 -7736 7388 7773 498 -7002 3481 5153 4098 11510 7422 13212 20599 4065 4770 11901 18806
3244 18806 18368 5190 429 -3342 11368 14430 2879 11889 12823 7725 -2495 -4450 -2283 -2213 -9145
3229 -9145 -14445 -13579 7786 17457 7274 4138 -7774 -17136 2109 16595 11486 10440 6642 -12235
3215 -12235 -14318 -20722 -21702 -21271 -2577 -4803 -7010 -4309 3611 9676 3352 -5525 -1963 -3801 -10234
3200 -10234 -5953 2542 -5606 -14136 -6865 -486 -4807 -16248 -22987 -18811 12725 19540 10025 17904
3186 17904 15813 739 -8208 -970 -10369 -12529 -15487 -20951 -34065 -42761 -38716 -35300 -19020 -13801
3172 -13801 -8325 9999 21990 20999 8817 -8280 -7457 -1753 -8714 -2179 -1708 -3364 3632 3578 7208
3157 7208 8216 1275 4866 16844 20432 27057 19526 14627 16262 9288 6905 22973 13852 9908
3143 9908 7878 -929 -3706 -3260 858 -740 1425 -2884 -23 -5004 -7752 -5008 -10698 -6975 -1040
3128 -1040 -5025 2322 -7872 -16293 -5992 9334 21164 17475 -2191 -7591 -17038 -18265 -9119 -3080
3114 -3080 1595 1838 10594 16382 -8658 -13592 -12714 -19738 -15764 -23953 -29095 -25552 -15269 -418 -9455
3099 -9455 -1447 9970 6391 4584 587 5299 7447 -2304 -7734 -9018 -14970 -7903 1824 1287 8739
3084 8739 16206 18094 15713 -3245 -3597 2505 348 -2452 -17400 -15257 -9949 -5184 -12151 -9082 -13916
3069 -13916 -7763 -10608 -18354 -10495 2355 -1600 1901 481 -4529 -10659 -9205 -3473 -1879 -735
3055 -735 6283 -3887 -24150 -32161 -23130 -2568 -4414 -6518 -2824 13548 7194 -1295 -4526 -12185
3041 -12185 -12962 -14713 -33607 -49721 -44799 -28078 -20765 -21849 -18393 -13823 -16748 -11078 -4123 -3270
3027 -3270 4758 4032 11840 11734 14557 -2979 -2477 -3408 -11937 -14769 -6557 -2509 1254 -8233 -6430 -7432
3011 -7432 -4843 -7101 1837 15571 12360 -1686 -5463 4330 10073 3592 12248 12818 9786 -1244
2997 -1244 3674 16910 -8083 -25275 -13821 -466 4385 9351 14640 19564 12081 -13517 -13199 -5691
2983 -5691 4106 6571 -562 4950 9335 10729 6845 11145 14780 15219 20118 24573 20955 8811 10211
2968 10211 23648 19940 15142 11635 14508 12762 2051 12644 9613 -16024 -10358 3490 1675
2955 1675 -7071 -8460 -3829 -4484 6597 16278 11744 121 6350 9755 3121 -2656 -8373 -16570 -1931
2940 -1931 13415 5575 12212 4420 4402 5436 3035 -7928 -11108 1126 13281 12173 8934 5713
2926 5713 -12302 -12099 7803 15955 910 -11400 -8940 -21022 -29098 -20727 -5994 -14162 -4804 -1303
2912 -1303 -10596 -29009 -27264 -19308 -20610 -30202 -20257 3097 6593 11287 11100 14261 21816 18525 18396
2897 18396 13039 2826 8468 4719 -14744 -29178 -23932 234 8037 9471 12457 14125 12461 -1541
2883 -1541 -14806 -7496 -3689 -10142 -9796 -7238 -22163 -23413 -4893 -1007 -11753 -6233 -2039 516
2869 516 86 13307 8352 7513 11447 16904 14199 20966 28126 25283 8711 5781 -12287 -14090 -8914
2854 -8914 -14413 -12407 1222 -889 19057 8145 -8032 -1578 19684 24448 29270 27286 19664 13754
2840 13754 1801 -10755 -11948 -15792 -17190 -15345 -5194 1694 -2702 -2356 1173 -2042 1276 8766
2826 8766 9335 8811 8160 17876 21861 11115 -3067 -4017 -1643 -171 7149 2354 -11396 -3040 7515
2811 7515 -9975 -3994 1009 5538 -414 -11132 -6608 -10338 -23189 -19840 -12461 -9479 -5679 -10005
2797 -10005 -22190 -16039 1050 7104 6230 428 -6151 -10172 -19740 -22147 -16921 -21865 -12372 -5874
2783 -5874 -9050 -15018 -18349 -9856 -5191 -6346 -2667 -769 -8603 -4642 -12005 -16809 -18101 -9270 1350
2768 1350 -6555 -21603 -23635 -7564 7100 20001 11255 1033 7802 9121 4867 -1028 -1280 -5870
2754 -5870 2248 6460 1743 -5410 7174 12906 12870 11384 -892 -9404 -2771 -2137 7160 -1381 -4914
2739 -4914 -1553 4113 8338 6239 14040 15409 2457 6720 -656 -7685 -14396 -10153 -4070 1893 1307
2724 1307 5768 7221 893 4933 5016 11626 4560 343 7153 6685 -7656 -27485 -22370 -12970 -13989
2709 -13989 -8476 -12867 -20745 -5044 -294 -351 -2511 -13054 -27745 -32363 -24184 -23985 -18470 -21193 -17323
2694 -17323 -9624 13326 18710 2195 -8179 -10316 -10639 -881 -11140 -15736 -13776 -6506 3665 2265
2680 2265 -13132 -20419 -27367 -28653 -24151 -9203 -8370 -3250 3897 17382 8721 6422 7375 15563 16888
2665 16888 13102 12545 11232 24010 14766 8000 5916 1703 12743 25944 29248 10341 -4082 -2214
2651 -2214 3772 -1974 121 -562 3236 19399 19997 19222 12517 -585 -22073 -20153 -27406 -27351 -14282
2636 -14282 -12444 -9620 -14228 -27150 -22025 217 2626 -208 -3048 1399 10388 1861 -5627 2320
2622 2320 -6749 -1801 5601 1869 -7420 768 12947 16715 -553 -18328 -26118 -28313 -14321 -11018
2608 -11018 -12129 -13933 -15530 -17564 -23236 -15974 -10376 -2716 581 7387 9515 4191 5438 4964 -8482
2593 -8482 -22201 -24797 -17279 -10886 -18119 -3381 10525 22487 15841 14798 7581 1879 3082 7338
2579 7338 5485 3623 -48 13191 19009 9330 -4464 -7658 1490 12979 10445 18099 21905 7576
2565 7576 -3279 12705 12767 4728 -8365 -15805 -9237 1367 -2984 -8470 104 -3297 -14802 -25050
2551 -25050 -24235 -16658 -14286 2946 15621 12037 13577 -678 -13040 -15094 2995 7568 -9563
2538 -9563 -10751 -17761 -17481 -12532 -10301 -8611 -12303 -17243 -30416 -24893 -1331 13810 13367 3881 354
2523 354 2151 -7284 -11326 4171 12097 22720 20796 6247 -15561 -13378 -930 -4111 -3769 5117
2509 5117 3079 3191 1551 -16730 -21830 -4639 16290 11859 -9746 -13544 -15704 -10819 3077 1567
2495 1567 -5523 -644 -1942 -4166 -9741 -15875 -18231 2714 15712 4808 -14280 -8545 10201 15365
2481 15365 14774 19124 7937 16104 20192 14761 8517 11920 13973 20476 19360 13197 1914 24581
2467 24581 24130 17277 8199 -2715 -7567 -3020 -5822 -2061 9590 16575 10751 737 -8899 -12566
2453 -12566 -10125 4416 15710 14485 13730 9570 7609 13718 6124 4313 14606 15286 7534 -2653
2439 -2653 -1530 7199 5929 454 -704 -2359 2763 8182 -5255 -1119 2205 397 -115 -8061 -15516
2424 -15516 -10603 -5026 9249 21886 24310 31530 40873 33748 30068 23185 16035 -3409 -16558 -11951
2410 -11951 -1745 -17681 -23780 -23386 -20076 -16647 -17855 -8436 -8276 -14738 -17075 -10613 -6279 -12314 -19565
2395 -19565 -4504 11714 13915 6508 3981 3463 2647 3682 4506 -12 -10839 -23550 -9512 -2922
2381 -2922 8216 6811 1452 2232 12737 15945 12281 12548 5192 2447 615 10537 22413 28791 30863
2366 30863 25243 29657 38767 26808 7952 557 1831 3453 -2207 -8854 -15324 -12586 -372 4309
2352 4309 -10156 -12555 -14020 -10209 3115 4534 -8116 -21254 -6787 -2004 -5796 -3162 -438 5897
2338 5897 2343 7483 19504 25292 11440 -2505 -4078 -12895 -17906 -9718 -5592 -4398 -10561 -7065
2324 -7065 -17225 -16663 -18431 -21905 -13244 -4249 -2164 1953 10322 -2249 -3429 5050 5794 -11621 -18966
2309 -18966 -15041 -25469 -21774 -10190 -204 11317 11980 7909 13877 15434 16748 10609 25247 22008
2295 22008 11692 -5716 -1980 180 -5479 -5745 -11768 -11269 -13071 -15665 -7217 -857 -2991 -2283 -14529
2280 -14529 -22945 -6597 -3585 5245 5309 14785 10608 11639 16952 19969 11753 5934 5161 -2318 -247
2265 -247 5334 18157 15092 8685 6399 -910 -9295 -22500 -30797 -29319 -16905 -17560 -10568 -9308 -2387
2250 -2387 -9821 -12196 -20777 -16872 1971 4994 950 -12185 -6099 -4029 -14923 -26035 -17175 -21713
2236 -21713 -13081 -3883 -7587 -4521 -4253 1639 4985 -7469 -17919 -27636 -16539 -1657 -546 2936
2222 2936 -4396 -11452 -7268 2477 5440 6024 6221 -730 -2034 -3083 -13288 -28031 -26446 -22648 -18524
2207 -18524 2745 8537 8705 1648 7731 12625 3533 2814 3704 8168 2981 -4508 -8459 -8472 -31 1717
2191 1717 7188 4769 6019 -2281 -6658 -9144 7766 7230 -13071 -11427 6814 10844 21650 21266
2177 21266 -4470 -12570 -7570 4419 1486 -6650 -6335 -1928 1786 711 -5871 -38 1552 5980
2163 5980 14328 4091 -1050 -7347 -3275 -3476 -1743 8138 19484 19907 19173 21708 10239 -1552 -8574
2148 -8574 -1116 -16629 -11258 -4296 -2091 241 17155 30154 28247 20434 505 -2485 -2913 4970
2134 4970 -1832 -14586 -16149 -20543 -12492 -6333 -4817 -5053 -15595 -5737 16290 5394 -15690 -22172
2120 -22172 -10522 99 12013 14271 20624 12146 -1247 -2470 -1014 9651 8584 7547 6380
2107 6380 22604 37887 41294 35786 25426 9224 10525 22129 20712 5732 6702 3172 1354 748
2093 748 -11138 -12883 -8648 -389 -2601 -4932 4246 13874 14442 7342 9621 1320 1283 -201 -4032 -14653
2077 -14653 -18906 -11790 -12512 -10175 6130 21107 25024 15322 -7116 -2260 8561 14568 6489 -16648
2063 -16648 -12402 -15645 -7380 -14266 -5933 -7572 -4679 -10714 -17756 -10150 -2944 -890 -13942 -25681
2049 -25681 -23600 -13256 -19917 -27702 -23540 -19885 -15018 -10758 1381 14828 18620 18561 12446 -4354
2035 -4354 -8886 -8725 1036 -16413 -20614 -12648 -1400 1080 -8493 -9404 -382 -1210 -7678 3346 9006
2020 9006 6405 -3111 4096 21701 22898 10088 11177 15940 16953 12425 10741 7606 2562 2702 -11796
2005 -11796 -17450 -13775 -8984 -9781 -11520 -1563 4533 1462 6730 14108 -2320 -2302 206 -10793 -11179
1990 -11179 1998 2815 1273 -6005 -8806 -4544 9216 14056 2482 -3819 1548 2892 262 14352
1976 14352 17759 13814 8351 7896 17801 22265 12750 -8570 -19064 -661 12494 15176 18993 9198
1962 9198 4822 21790 31281 17012 5547 -2921 -2269 4513 13032 6125 3708 3334 8823 5304 600
1947 600 -938 -9595 -12507 -16049 -12225 -5392 1527 -1781 992 3768 1844 -1765 7207 16702 26177
1932 26177 13269 -2843 2469 3861 3834 -2844 -5257 -6352 141 3181 21303 27337 26608 13252
1918 13252 3362 -310 11078 8887 4459 -3094 -117 550 1989 6065 6561 8681 4209 14354 7567
1903 7567 -11086 -4456 -2946 -15845 -24200 -12415 -53 -1256 727 1796 -3507 4904 -2161 -10290
1889 -10290 -15861 -20421 -19623 -13159 -512 4393 -2349 5488 -1911 -6763 -3385 -8337 -5743 14345
1875 14345 16680 14445 17956 19604 10225 1172 -4991 -2678 -6039 -8102 -1982 11781 8876 -2476
1861 -2476 1982 6353 -4290 -10542 -2464 2961 -6239 1087 -3315 -23364 -24338 -3403 4568 14882
1847 14882 19865 10475 6822 14844 17628 10770 -10300 -6386 -2214 4692 -4361 2166 19916 30531
1833 30531 31711 27245 36045 27596 19303 19644 1758 -5059 475 1405 4565 10477 26270 28279 7553
1818 7553 -10350 -18898 -8076 19036 36941 34077 35826 26566 21286 9975 14800 16321 21649 16365
1804 16365 11503 -8748 -15998 3758 1460 -4106 -11115 -5804 -4106 2470 2528 -3733 -758 -3559 -2260
1789 -2260 -3817 -2584 10357 715 -3884 -9434 -1334 -1601 -5769 -5360 4098 8631 5463 73 338
1774 338 1529 4465 9622 12276 4757 9302 12495 13190 7902 6912 -1323 -9215 -6805 8771 16100
1759 16100 12701 3720 -12000 -11840 5697 2971 4854 14176 18547 4888 10397 13818 17682 18939
1745 18939 16011 3453 -5951 -3942 -887 -14582 -17402 -23646 -13560 -6280 -4195 3941 -2030 -2539
1731 -2539 -3877 -10047 -25659 -26887 -13419 -6245 618 8825 -6433 -21334 -18303 -10079 -12258 -12577
1717 -12577 7314 18571 19629 17478 13648 13732 17155 9046 10165 11594 13632 10637 -2297 -1907 1245
1702 1245 1818 -4089 8132 8751 6219 1524 2123 14515 24496 26459 14976 240 -4221 10054
1688 10054 23100 26507 15497 9174 9330 11227 15605 7851 7585 12506 10958 9889 10623 16026 21476
1673 21476 26460 19265 12184 14689 11948 15122 15672 -1543 -5283 -8159 -10868 -9965 -8184 -2439 2867
1658 2867 12973 20997 14336 9108 13419 13258 -8063 -12907 4315 -3430 -413 1140 6733 14018
1644 14018 8121 7321 2853 14736 17366 6993 7122 8489 10012 5638 -320 -16444 -22778 -22464 -20548
1629 -20548 -26605 -16073 -574 16532 13267 10256 4801 6388 5267 -4713 1890 3278 -1611 -3724
1615 -3724 139 -3973 6201 14688 5263 -480 2910 13256 13174 2149 -6475 -7766 -629 1897 -10
1600 -10 9553 6101 695 3654 8207 12960 -11190 -20916 -13547 -3032 -8296 482 -4333 4906 8741
1585 8741 3762 -2927 -22558 -32734 -20634 -20249 -10540 1779 590 4953 7785 -8788 -14764 -3241
1571 -3241 9777 9968 3004 10447 20088 21547 16016 11345 14266 20554 22059 24518 21456 6506 -411
1556 -411 4849 13451 23214 30247 35713 35037 9813 3489 14391 19302 14971 27711 27206 4844 -11973
1541 -11973 -510 13503 6123 4280 24405 29590 22820 24810 19288 16600 4636 -17366 -28748
1528 -28748 -19738 -13889 -18388 -5797 7730 13049 13404 9841 15148 13018 11036 19628 31082 22923
1514 22923 4947 556 -8367 17374 20207 12648 15545 18945 21941 17002 13208 12238 4562 5190 9744
1499 9744 1474 -4970 -700 -384 -1921 13088 14811 13038 16779 9698 9944 10934 7673 10260 11843
1484 11843 4681 -3839 -1292 11101 9552 -1278 1787 977 -3007 -556 3632 9571 10267 14654 -1599
1469 -1599 -13169 -20866 -8908 4617 12103 7702 1620 272 -6554 -3001 -5128 -3922 -251 3489
1455 3489 2787 -2053 11671 17273 14130 14085 8352 2464 7509 -4001 -6596 -110 -529 -12419 2800
1440 2800 21856 14535 15535 19614 17911 20462 11323 20038 21153 6417 2741 21542 21164 19223
1426 19223 15876 7796 8457 1056 11140 24447 17852 4535 2733 11983 11476 10127 18713 13387
1412 13387 2272 8531 8190 14937 11264 4816 -14163 -11709 -8543 55 -8054 -14643 -7046 -2261
1398 -2261 -3603 -4660 -5897 758 -2457 3101 11712 13978 13332 20961 26723 20701 18970 14362 14624
1383 14624 17683 25133 22312 9473 1054 -2201 -3219 -9453 -1124 3792 8138 7422 17627 23443
1369 23443 10081 -1359 -10175 -13111 -3249 7691 -1871 -9724 8234 18586 14208 22620 34687
1356 34687 23646 5588 14063 17101 13876 20564 15529 11869 14670 25116 22235 29414 10717 3417
1342 3417 3502 -6585 -12344 -17520 -21897 -16961 -1587 -164 -171 3861 10526 7478 -2806 -9027 -2830
1327 -2830 7264 8186 9382 18938 28098 25865 23344 24557 26714 31170 25693 14100 16251 15060 835
1312 835 2940 911 -1978 3097 2054 -20790 -24926 -6933 3818 8749 3087 3072 -2967 -9139 -487
1297 -487 -1009 -5057 5019 12315 18030 8882 9943 10764 5495 15372 20759 16382 12676 15516 7033
1282 7033 1475 -3074 -2387 15452 -36 -10630 -13232 -17486 -20995 -7068 -4534 -2749 1925 -1343
1268 -1343 -5846 -438 8366 8634 6773 10337 18467 2173 -13706 -21179 -7518 2191 -6619 -267
1254 -267 1097 12452 14953 7382 4141 -6435 -3431 -6090 -2874 -1395 -3344 1860 14323 6983
1240 6983 9947 2754 -10140 -12774 -3128 3575 6483 -217 300 11246 5911 2356 5660 11304 18311
1225 18311 6111 6208 -1336 -15174 -19340 -25833 -19875 -6246 -11140 -21704 -18628 -4793 -4897 -7353
1211 -7353 5225 8350 12797 24825 38848 36374 22466 4996 7219 8310 -4569 -10304 5773
1198 5773 12115 15971 9994 -7782 -15080 -19914 -11630 -14052 -24947 -22373 -25640 -7365 13230 14069
1184 14069 1747 -16707 -19708 -11436 4969 7321 -12311 -16786 -12637 -12213 -7790 -1951 4571 8864
1170 8864 9938 6340 9354 9764 2175 4928 2403 -4470 -17253 -19541 -12028 5859 20493 7434
1156 7434 -1483 5166 13213 13221 16345 26215 17155 6149 1598 12770 24049 28126 22485 15525 8672
1141 8672 3638 9808 11362 4732 9980 17636 15179 7580 12 -5412 2240 21045 27256 20687 -740
1126 -740 -2955 8639 13288 5519 773 12421 4224 2371 11524 21114 15815 11721 7735 10748 9611
1111 9611 -1376 -5271 -4896 -9799 15953 31401 20761 10262 6607 24633 29248 12934 8810
1098 8810 6102 -7250 -21905 -15245 -8295 5566 9907 5304 4556 19038 27824 18681 7620 5449
1084 5449 5066 -3890 -7810 -13498 5898 13590 6727 3501 329 2400 8378 21207 10713 6744
1070 6744 -5317 -9949 -8292 -12419 -14414 -17406 -12909 -15432 -10932 -6459 -19158 -18079 -6886 -4870
1056 -4870 -2943 12471 8415 -8909 -18394 -22376 -15376 -3423 8015 371 -8439 1136 4213 14290
1042 14290 13987 16313 9518 6114 19809 28537 25524 6919 2776 11522 -2428 -10943 -7920 -7215
1028 -7215 -9516 -8007 4749 22383 14242 -1092 -16216 -11796 4752 10783 3579 -4532 -2316 -7384
1014 -7384 -5453 -11668 -4820 3538 2067 11542 6706 13232 10455 12865 -2635 -7098 -10300 -12214 -10260
999 -10260 -13770 -9183 4031 16437 11876 2046 2323 -3372 -4773 405 988 -6640 -15803 -12632 -1270
984 -1270 -1263 -1005 -1497 -7336 10937 13910 4602 12250 14433 21848 20740 9376 -1897 -6316 -1611 945
968 945 7978 1982 2213 7732 19039 30894 27758 24759 10219 -8356 -5049 -5345 -3993 6310 -1467
953 -1467 -14148 -15580 -18998 -20287 -23747 -28202 -27665 -21800 -8152 -6280 2449 21367 27010 10902
939 10902 -6807 -4825 -2769 10086 20368 32413 34113 29629 17055 17147 25718 24378 6415 6772
925 6772 18155 19144 21455 21242 12685 16535 14448 9751 15307 24033 22046 16250 26718 41553 30989
910 30989 16010 -3207 -13959 -18246 -24289 -10170 6760 3683 -1460 -20281 -23163 -25497 -27562
897 -27562 -17455 -7352 -6527 8721 15494 435 -12451 -11551 10747 13251 -1126 -8317 -1588 -9470
883 -9470 -2156 15221 24078 27531 19226 5271 2956 12869 23783 17514 6229 12603 19557 9080
869 9080 7637 5116 -1361 -1010 784 9932 10184 12390 2924 3984 2071 496 881 -4113 2494 6683
853 6683 -5063 479 -3160 -4760 5976 27357 44786 34858 17834 21839 13858 6709 4814 11266
839 11266 395 1224 5242 7083 7840 5885 11859 15332 24382 22328 19635 20704 17296 9912 675
824 675 5755 8053 11633 6991 3143 4268 18 6807 -572 -11050 -9732 -6533 -764 2594 11480
809 11480 23364 23375 22253 16331 5257 -3555 -1699 6885 -3890 -5133 5911 7894 13459 26150
795 26150 48548 56028 46007 39318 30352 26319 28124 36796 46348 32337 29070 25592 32167 32079 35654
780 35654 27816 22781 17401 22419 26933 32042 23649 20317 22412 24016 17938 16938 12249 13331 6175
765 6175 3300 19757 13957 15455 17729 33850 43047 26766 20199 7461 -2877 -6780 -1437 6757
751 6757 14618 12828 4373 8475 20890 14516 21256 20450 8342 -2418 -2279 8750 23671 34746
737 34746 17874 -7376 -3641 -4897 -1271 4668 -2049 -1717 8641 5395 3143 873 5980 14372
723 14372 17179 9252 12441 10661 16291 22331 25485 14767 4333 -4012 -10194 -11113 -1653 7227 11153
708 11153 16096 8867 17251 18232 7549 3175 -6748 -19441 -27855 -26912 -17294 -4777 5457 6491
694 6491 6454 2227 6226 3858 9937 11424 11571 25592 29014 36943 40153 36273 27771 18672 13564 14355
678 14355 5452 1302 -1872 13945 15346 21319 24699 17989 11523 -6109 -4219 -9340 565 17113
664 17113 23116 45433 41366 38202 29580 27965 17102 11362 8634 7411 1705 -4317 -11932 -558
650 -558 5859 16883 18080 18747 16238 11615 16911 7289 2021 4971 8937 10518 18274 16196 3631
635 3631 9961 17279 25990 12558 345 2260 8603 -1109 -3067 -6557 -8930 -917 6656 8568 -337
620 -337 1296 30549 39156 21081 -4995 -32445 -22805 -4836 -3722 -2201 5105 11540 2139 4678
606 4678 10783 4768 19914 33605 26904 28592 39571 39904 50898 34289 15072 8486 13264 20848
592 20848 27102 20178 33159 50418 35897 17905 19785 32744 40036 29522 14540 9713 19182
579 19182 30134 25304 13310 14181 19388 36664 31218 20441 10388 20776 23208 31092 28737 13502
565 13502 15622 15464 7644 13053 24818 28517 26411 21307 18309 8392 -18238 -23492 -17830 -9317 180
550 180 4141 2871 6137 10372 14691 15962 7146 16445 27168 23764 23238 15304 15052 18585 20785 21364
534 21364 7790 8013 11289 7198 5567 -491 -8597 -19980 -22880 -10234 -1021 4190 10003 5929
520 5929 14510 10491 14867 21386 21665 16071 15037 18911 8392 22943 23249 24936 22657 21435 24784
505 24784 38814 28863 11962 19329 16912 8120 6963 18358 18035 -2974 -9964 -3018 7405 20306
491 20306 25089 29510 23088 20124 -2300 -2878 647 1301 -2650 -2125 -5727 -771 13873 20477 15074
476 15074 13016 10647 23307 30047 28217 28496 15559 11355 13738 22800 15777 20359 25768 25638 32488
461 32488 20411 18955 32706 20516 18028 27794 23064 16234 23579 14911 9310 10337 17558 -118
447 -118 -6723 1335 -651 -969 9812 20014 25874 38554 31359 29276 24344 26583 14159 10328 1588
432 1588 3791 13584 13605 20968 30818 22454 7402 785 -6293 -2104 14203 17658 19546 20186 13262
417 13262 20183 17352 13223 17226 21283 21725 19264 23716 14973 23919 16364 8115 4242 5768 10885
402 10885 19748 17139 15262 13158 11164 1168 -5012 -451 9181 10681 720 7835 27281 28170 16618
387 16618 21092 26488 14038 11286 9165 9639 13461 28527 38198 36712 32622 33485 26467 11346 3327
372 3327 -245 953 3844 16233 19213 15947 975 404 -1358 -11803 -3423 6374 15028 15229 5533
357 5533 222 -6527 5555 7968 19712 18589 20662 8285 3768 4399 9529 13693 16474 13739 8624
342 8624 8844 1642 6153 11676 9683 -97 -2448 1144 -6623 1440 10273 -1438 -4463 -7668 -761
327 -761 802 -10239 -7123 -4371 6098 15493 19981 22921 34104 39684 38348 37006 27970 16526
313 16526 14890 6358 6306 2174 -8851 1655 9934 8050 5615 606 -4308 1246 9910 14915 15385
298 15385 13776 2146 -6811 -8242 -9147 -23358 -26383 -16341 -13968 -9980 -13162 -15138 -10218 -5472
284 -5472 -2390 1502 591 2940 -5172 -8448 15985 23093 25371 25585 25497 33289 35567 31494 20492 22027
268 22027 25222 13227 -1963 -7598 -2900 -310 9897 7586 3557 15964 14082 13545 18139 18588
254 18588 17576 17164 17928 7192 8029 20859 20203 11457 3535 1734 6148 15219 26936 32071 34171
239 34171 28590 20572 20858 12172 14026 13297 9612 13147 24905 24645 11215 11046 10234 13804 9654 2342
223 2342 11703 10442 9822 8590 10221 5959 8728 8456 11676 18216 13336 10993 13514 18698 15271 18667
207 18667 19836 36611 29779 23734 16077 18743 16902 12548 14942 18034 21306 10498 3334 11791
193 11791 1348 2624 4334 -478 1737 11110 15538 8232 9673 21241 28964 26227 25723 22833 26129
178 26129 22545 14903 22550 37724 45942 30147 18225 19718 16756 16270 17503 8006 9405 4799
164 4799 13055 27285 26739 28713 16993 4900 10106 13570 17970 18194 15709 13360 19572 20307 16727
149 16727 18494 15573 8248 1515 12133 5463 881 1851 4947 10122 14624 18112 20901 17760 12490
134 12490 14271 11852 6636 11097 14973 14717 12639 6555 1829 1993 17452 21873 11628 14692 23681
119 23681 25663 20552 6367 16739 24809 14739 8662 10783 9604 26627 33148 21676 18834 13605
105 13605 15734 20710 26118 18386 8143 8068 11958 15235 19405 17580 9295 17402 16614 5697 6476
90 6476 310 3875 5875 -7419 -8845 -578 -4764 -5 4568 10668 16986 19909 18397 14417 2061
75 2061 -240 2890 2874 4190 -873 -3746 -6941 -6156 -5468 10574 23176 21434 12984 9657 1180 739
59 739 5826 5088 16357 19177 9191 43 5469 6775 17691 20998 16281 12911 7387 695 -231 4640
43 4640 9541 6464 635 6360 10851 16825 12134 9311 18554 19234 11127 4657 5420 9063 12005 2871
27 2871 6157 12901 15595 18611 18138 11550 14804 15645 20324 26196 27669 24437 19740 17080 18496 10146
11 10146 12965 22008 19129 15599 16990 16200 9823 8453 7190 1947 -2151
0 -2151
$$ Imaginary data points
##PAGE= N=2
##DATA TABLE= (X++(I..I)), XYDATA
32767 98045 95679 94606 99208 104501 98413 89851 94198 102688 103307 94878 94681 99210 102695 101453 103186
32752 103186 102641 99753 91210 92366 102451 108003 109805 105229 103441 108895 116348 115864 109530 121356
32738 121356 128319 125202 133612 141355 134814 129099 123374 122660 118484 109603 112111 124820 126681 127043
32724 127043 133752 135006 131768 136014 148919 154009 149810 142276 149093 157877 156438 157011 158247 159276
32710 159276 162748 156995 153344 154440 155600 155960 148184 146176 153019 155997 166792 174433 176806 179373
32696 179373 179941 191371 192487 189931 187606 186766 190034 197472 201275 199939 198456 200692 198791 188964
32682 188964 196769 205195 198972 193584 197715 209923 215237 215174 214067 214796 209776 213608 212082 210786 212900
32667 212900 218171 215667 216804 219241 221680 225361 220078 219835 218299 223652 236495 241758 250650 243134
32653 243134 234591 236002 236747 230518 228869 234170 233444 224634 225021 224648 237614 241680 237836 241387 242349
32638 242349 237898 241000 242528 247842 257417 253250 253753 257838 261209 256672 263078 269878 268151 271342
32624 271342 273919 276959 272633 268065 271020 281555 288178 281191 274686 273869 272196 275765 288684 289491
32610 289491 279787 280756 269715 264239 261501 268861 272790 279701 293190 304978 312665 310502 297513
32597 297513 295075 296860 295725 286422 280607 276851 272197 277863 296905 312302 310463 304013 290600
32584 290600 290121 295788 297999 303944 299759 294709 297586 303682 308661 317402 327209 330633 336116 336879 335530
32569 335530 334580 344034 344397 332932 332979 336502 332644 325111 320999 316295 313943 325880 321430 321724 331050
32554 331050 335375 339756 330718 320676 319745 325604 333455 331188 337617 348448 351491 350712 357496 355963
32540 355963 352889 351404 348065 349447 362502 372550 364065 367300 365423 362366 363358 352702 350281 347867
32526 347867 342731 346933 349644 339874 352474 353908 363335 363073 359550 360675 349328 352159 364378 374175
32512 374175 378540 378209 382760 382255 383255 370875 351700 359243 373303 381744 380309 380823 379549 384106
32498 384106 390699 390988 381487 378498 392436 394491 391862 390715 386051 384232 382347 373287 384466 379225
32484 379225 385109 395662 389004 386392 388132 391140 403770 411438 400512 398738 404319 410972 403913
32471 403913 388307 395554 396010 390190 382610 390868 404530 409207 400797 388470 396760 402280 399326 389121
32457 389121 384227 396073 410321 411997 402037 398656 411155 426081 425909 414984 408003 399541 400206
32444 400206 405064 409835 417087 414878 415176 419351 425729 424093 430498 438040 434139 443522 437701 427777
32430 427777 436834 442173 448682 453063 447283 454760 452564 440551 434068 438434 449876 450145 443456 443495
32416 443495 442461 438736 433964 450790 463400 456733 456258 458962 456466 464111 461072 450428 444508 451634
32402 451634 461820 452247 440258 441007 435557 442058 441207 442486 445145 446040 444775 425962 434921 441755
32388 441755 457051 462236 456025 453013 458290 469203 465156 471377 484685 488094 476861 467683 468212
$$ [...]
##END NTUPLES=NMR SPECTRUM
##END=
