##TITLE=Analysis number 320558
Compound Code cc 55714
Book Reference 467/56/1
Project Code adrs
Chemist Name benw
##JCAMPDX= 6.0         $$ Bruker NMR JCAMP-DX V2.0
##DATA TYPE= NMR SPECTRUM
##DATA CLASS= NTUPLES
##ORIGIN= Bruker BioSpin GmbH
##OWNER= nmr
$$ XWIN-NMR		Version 3.5
$$ Thu Jun 29 12:52:13 2006 GMT Daylight Time (UT+1h)  MAYBRIDGE\nmr@NMR_250MHZ
##.OBSERVE FREQUENCY= 250.131544655141
##.OBSERVE NUCLEUS= ^1H
##.ACQUISITION MODE= SIMULTANEOUS (DQD)
##.ACQUISITION SCHEME= undefined
##.AVERAGES= 16
##.DIGITISER RES= 18
##SPECTROMETER/DATA SYSTEM= dpx250
##.PULSE SEQUENCE= zg30
##.SOLVENT NAME= CDCl3
##.SHIFT REFERENCE= (INTERNAL, CDCl3, 0, 16.522)
##AUDIT TRAIL= $$ (NUMBER, WHEN, WHO, WHERE, WHAT)
$$ ##TITLE= Audit trail, XWIN-NMR		Version 3.5
$$ ##JCAMPDX= 5.01
$$ ##ORIGIN= Bruker BioSpin GmbH
$$ ##OWNER= nmr
$$ C:\u/data/dgb/nmr/ADRS/1850/pdata/1/auditp.txt
$$ ##AUDIT TRAIL=  $$ (NUMBER, WHEN, WHO, WHERE, WHAT)
(   1,<2006-06-29 12:51:50.90 +100>,<MAYBRIDGE\nmr>,<NMR_250MHZ>,
      <created by zg, POWCHK disabled, PULCHK disabled
       configuration hash MD5:
       E2 DF 36 D8 04 B2 41 60 5A D7 A3 38 5A 4B D0 FE
       data hash MD5: 64K
       4E 77 BD AA 8F E4 A4 37 03 D7 94 35 B8 09 79 52>)
(   2,<2006-06-29 12:52:03.98 +100>,<MAYBRIDGE\nmr>,<NMR_250MHZ>,
      <Start of raw data processing
       ef LB = 0.3 FT_mod = 6 PKNL = 1 SI = 32K 
       data hash MD5: 32K
       F7 BA 0D 4D 2F F5 F5 9D 60 2E 0D F9 90 E6 EC 51>)
(   3,<2006-06-29 12:52:05.51 +100>,<MAYBRIDGE\nmr>,<NMR_250MHZ>,
      <apk 
       data hash MD5: 32K
       B2 27 F9 82 0A CA F3 EB 4A 55 EA 21 FA C5 F6 31>)
(   4,<2006-06-29 12:52:06.24 +100>,<MAYBRIDGE\nmr>,<NMR_250MHZ>,
      <abs ABSG = 5 
       data hash MD5: 32K
       30 B5 8E D6 6D 7C AF 32 DD DA 71 F4 31 5E 81 D3>)
$$ ##END=
$$ 
$$ hash MD5
$$ DE 8F EB 62 D4 F2 06 1B B9 EA F3 14 09 13 A5 4C
##$RELAX= 
##$RELAX= 
##$RELAX= 
##$RELAX= 
##$RELAX= 
##$RELAX= 
##$RELAX= 
$$ Bruker specific parameters
$$ --------------------------
##$DU= <C:\u>
##$EXPNO= 1850
##$NAME= <ADRS>
##$PROCNO= 1
##$TYPE= <nmr>
##$USER= <dgb>
##$AMP= (0..31)
100 100 100 100 100 100 100 100 100 100 100 100 100 100 100 100 100 100 
100 100 100 100 100 100 100 100 100 100 100 100 100 100 
##$AQSEQ= 0
##$AQ_mod= 3
##$AUNM= <au_zg>
##$AUTOPOS= <33 >
##$BF1= 250.13
##$BF2= 250.13
##$BF3= 250.13
##$BF4= 250.13
##$BF5= 500.13
##$BF6= 500.13
##$BF7= 500.13
##$BF8= 500.13
##$BYTORDA= 1
##$CFDGTYP= 0
##$CFRGTYP= 5
##$CHEMSTR= <none>
##$CNST= (0..31)
1 1 145 1 1 1 1 1 1 1 1 1 1 1 1 1 1 1 1 1 1 1 1 1 1 1 1 1 1 1 1 1 
##$CPDPRG= <>
##$CPDPRG1= <>
##$CPDPRG2= <>
##$CPDPRG3= <>
##$CPDPRG4= <mlev>
##$CPDPRG5= <mlev>
##$CPDPRG6= <mlev>
##$CPDPRG7= <mlev>
##$CPDPRG8= <mlev>
##$CPDPRGB= <>
##$CPDPRGT= <>
##$D= (0..31)
0 1 0 0 0 0 0 0 0 0.06 0 0 0 0 0 0 0.0002 0 0 0 0 0 0 0 0 0 0 0 0 0 0 
0 
##$DATE= 1151581909
##$DBL= (0..7)
120 120 120 120 120 120 120 120 
##$DBP= (0..7)
150 150 150 150 150 150 150 150 
##$DBP07= 0
##$DBPNAM0= <>
##$DBPNAM1= <>
$$ [...]
##$SUBNAM7= <"">
##$SUBNAM8= <"">
##$SUBNAM9= <"">
##$SW= 20.6930455092707
##$SWIBOX= (0..15)
0 0 3 0 0 0 0 0 0 0 0 0 0 0 0 0 
##$SW_h= 5175.983436853
##$TD= 65536
##$TD0= 1
##$TE= 296.16
##$TE2= 300
##$TE3= 300
##$TEG= 300
##$TL= (0..7)
0 120 120 120 120 120 120 120 
##$TP= (0..7)
150 150 150 150 150 150 150 150 
##$TP07= 0
##$TPNAME0= <>
##$TPNAME1= <>
##$TPNAME2= <>
##$TPNAME3= <>
##$TPNAME4= <>
##$TPNAME5= <>
##$TPNAME6= <>
##$TPNAME7= <>
##$TPOAL= (0..7)
0.5 0.5 0.5 0.5 0.5 0.5 0.5 0.5 
##$TPOFFS= (0..7)
0 0 0 0 0 0 0 0 
##$TUNHIN= 0
##$TUNHOUT= 0
##$TUNXOUT= 0
##$USERA1= <user>
##$USERA2= <user>
##$USERA3= <user>
##$USERA4= <user>
##$USERA5= <user>
##$V9= 5
##$VALIST= <valist>
##$VCLIST= <CCCCCCCCCCCCCCC>
##$VD= 0
##$VDLIST= <DDDDDDDDDDDDDDD>
##$VPLIST= <PPPPPPPPPPPPPPP>
##$VTLIST= <TTTTTTTTTTTTTTT>
##$WBST= 1024
##$WBSW= 4
##$XGAIN= (0..3)
0 0 0 0 
##$XL= 0
##$YL= 0
##$YMAX_a= 412025
##$YMIN_a= -661113
##$ZGOPTNS= <>
##$ZL1= 120
##$ZL2= 120
##$ZL3= 120
##$ZL4= 120
##$ABSF1= 16.522
##$ABSF2= -4.171173
##$ABSG= 5
##$ABSL= 3
##$ALPHA= 0
##$AQORDER= 0
##$ASSFAC= 0
##$ASSFACI= 0
##$ASSFACX= 0
##$ASSWID= 0
##$AUNMP= <proc_1d>
##$AZFE= 0.1
##$AZFW= 0.1
##$BCFW= 0
##$BC_mod= 0
##$BYTORDP= 0
##$COROFFS= 0
##$CY= 12.5
##$DATMOD= 1
##$DC= 0
##$DFILT= <>
##$DTYPP= 0
##$F1P= 14.0000005364418
##$F2P= -0.99999901652339
##$FCOR= 0.5
##$FTSIZE= 32768
##$FT_mod= 6
##$GAMMA= 0
##$GB= 0
##$INTBC= 1
##$INTSCL= 1
##$ISEN= 128
##$LB= 0.3
##$LEV0= 0
##$LPBIN= 0
##$MAXI= 10000
##$MC2= 0
##$MEAN= 0
##$ME_mod= 0
##$MI= 0
##$NCOEF= 0
##$NC_proc= -4
##$NLEV= 6
##$NOISF1= 0
##$NOISF2= 0
##$NSP= 0
##$NTH_PI= 0
##$NZP= 0
##$OFFSET= 16.522
##$PC= 1
##$PHC0= 172.1194
##$PHC1= 5.616805
##$PH_mod= 1
##$PKNL= yes
##$PPARMOD= 0
##$PSCAL= 4
##$PSIGN= 0
##$REVERSE= no
##$SF= 250.13
##$SI= 32768
##$SIGF1= 0
##$SIGF2= 0
##$SINO= 400
##$SIOLD= 32768
##$SREGLST= <1H.CDCl3>
##$SSB= 0
##$STSI= 32768
##$STSR= 0
##$SW_p= 5175.98343685301
##$SYMM= 0
##$S_DEV= 0
##$TDeff= 65536
##$TDoff= 0
##$TI= <Analysis number 999999
Compound Code 99
Book Reference 9
Project Code 9>
##$TILT= no
##$TM1= 0
##$TM2= 0
##$TOPLEV= 0
##$USERP1= <user>
##$USERP2= <user>
##$USERP3= <user>
##$USERP4= <user>
##$USERP5= <user>
##$WDW= 1
##$XDIM= 32768
##$YMAX_p= 295844244
##$YMIN_p= -182232
$$ End of Bruker specific parameters
$$ ---------------------------------
##NTUPLES= NMR SPECTRUM
##VAR_NAME=  FREQUENCY,     SPECTRUM/REAL,   SPECTRUM/IMAG
##SYMBOL=    X,             R,               I
##VAR_TYPE=  INDEPENDENT,   DEPENDENT,       DEPENDENT
##VAR_FORM=  AFFN,          ASDF,            ASDF
##VAR_DIM=   32768,         32768,           32768
##UNITS=     HZ,            ARBITRARY UNITS, ARBITRARY UNITS
##FACTOR=    0.157963299565203, 1,           1
##FIRST=     4132.6476996994, 0,             0
##LAST=      -1043.33573715361, 0,           0
##MIN=       -1043.33573715361, -182232,     0
##MAX=       4132.6476996994, 295844244,     0
$$ Real data points
##PAGE= N=1
##DATA TABLE= (X++(R..R)), XYDATA
$$ [...]
17748C310344r8701r2499n3557j07632j11148q6254j19189j50599j09416m0220
17738B341129l2818o6691m7009l8182m1007j40425r2809p1988l9488o4189p5457
17727A631066q3859l3115m6438m8362k9007q971m2276j3615j4825m2659K7120
17716A295059o1573n9147k9670Q926J4869j0117n2479k4922Q242K5491k2550p3410
17704A018719l6699J6571m4382R806n9313m8980j8364k8539k474j4512N583n4365
17692G43051k2320k5112k4033j2282k7209J163l4667P88j4902n6972J3666K5856
17680E67027j2528L5725l1554l7856p7022J7069J7408j4559J9473k7829p133k1697
17668D26524m7386R397k75L301J2777k6015n9700j4054j4913K7006K0773n8074
$$ y = [3310344, 3211643, 3119144, 3065587, 2957955, 2846807, 2760553, 2641364, 2490765, 2381349, 2341129, 2308311, 2241620, 2194611, 2156429, 2115422, 1974997, 1882188, 1810200, 1770712, 1706523, 1631066, 1547207, 1514092, 1467654, 1419292, 1390285, 1381314, 1339038, 1325423, 1310598, 1267939, 1295059, 1233486, 1174339, 1144669, 1153595, 1168464, 1158347, 1105868, 1080946, 1089188, 1114679, 1092129, 1018719, 982020, 998591, 954209, 964015, 904702, 855722, 837358, 808819, 806345, 791833, 797416, 743051, 720731, 695619, 671586, 659304, 632095, 633258, 598591, 599379, 584477, 527505, 541171, 567027, 554499, 590224, 558670, 520814, 443792, 460861, 478269, 463710, 483183, 455354, 448221, 426524, 379138, 388535, 388260, 391561, 404338, 378323, 318623, 304569, 289656, 316662, 337435, 279361]
17656B79361K0646N6719M2182L7122o80m2651R919n510J1996J2877r025k2137
17644C90819j8341n1132j0675K2286L0380j1844M405j1593J3853n1945k7210K8251
17632C07254K8054M991O65n8360j2958k4969k0430J096r004p155J0886m69L9539
17619B59140L0574l5356q2520q7996J4175N5377N1613J1254L9460L0137N4089
17608C39947k7998n3451n1126j4952k1653O1834K9516k6013j5692k0930p790K2899
17596B14591q108M8635M9271J3597j2604j3816L5083l4334Q380j2288n1876J2787
17584B49318O4295L128J0820p127N535L2058n9330l3023K9520m9199o4312O5129
17572B46812Q4214n818j1836q776k9750m7813n0975N489L8601K5648j5066k2007
$$ y = [279361, 300007, 356726, 398908, 436030, 435350, 392699, 402618, 397108, 409104, 421981, 412956, 390819, 372478, 321346, 310671, 332957, 363337, 351493, 355898, 344305, 358158, 306213, 279003, 307254, 335308, 340299, 340964, 282604, 269646, 244677, 224247, 225343, 216339, 209184, 220070, 219601, 259140, 289714, 254358, 171838, 83842, 98017, 153394, 205007, 216261, 255721, 285858, 339947, 311949, 258498, 207372, 192420, 170767, 232601, 262117, 236104, 220412, 199482, 191692, 214591, 206483, 255118, 304389, 317986, 305382, 291566, 326649, 292315, 300695, 288407, 236531, 249318, 313613, 316741, 327561, 320434, 325969, 358027, 298697, 265674, 295194, 245995, 181683, 246812, 331026, 325208, 313372, 304596, 274846, 227033, 176058, 181547, 220148, 245796, 230730, 208723]
17560B08723n688j4187L0086K9730k363j6273K2627N5426l2624J1510L1286k52
17548C18001L7238O1113J0024n3735l4492R558m963r569J382m998p537K2742M5137
17535C89901o7483p3833m3151J0805j187M3469O797l7649q4997j4449L562n052
17523A26733M546r322j2385L1444N1143J7321k2867o3199J0339L5981K9075j3328
17511A85481m2425J2331J9897L3824K6990q068l8299P138q621k8333j952K6751
17499A84714L4318K1333k9650n2423j1186J7473L1162L2108R223j1909J0537K3048
17487B58748N350m9315j2116j4634K8245J2909o091l3429l1719k6466K9450j5140
17475A45792j4540j5451n0961l2708M3229j5128J1934L2437K7957l9402j297k4548
$$ y = [208723, 203035, 188848, 218934, 248664, 246301, 230028, 252655, 308081, 275457, 286967, 318253, 318001, 355239, 416352, 426376, 372641, 338149, 347707, 342744, 333175, 334557, 329559, 322022, 344764, 389901, 322418, 248585, 205434, 216239, 215052, 258521, 265318, 227669, 142672, 128223, 131785, 126733, 131279, 121957, 109572, 141016, 192159, 209480, 186613, 123414, 133753, 169734, 198809, 185481, 143056, 155387, 175284, 209108, 236098, 228030, 189731, 196869, 188248, 159915, 157963, 184714, 219032, 240365, 210715, 158292, 147106, 164579, 195741, 227849, 237072, 225163, 235700, 258748, 264098, 214783, 202667, 188033, 216278, 229187, 223096, 189667, 157948, 131482, 160932, 145792, 131252, 115801, 64840, 32132, 75361, 60233, 72167, 104604, 132561, 93159, 91862, 67314]
17463F7314j5265q513R284k2328m5763m3758K6755M1318N727R557j0961k5504
17451a2137j2139J6092M8596j5908q527J1414N9914P4136L9960k3261l2476J2439
17439A58103j9082k8462n2655p3519j6555N4913P325n922j7064K337M386K3230
17427C7035J9619L6812N658J5466k1440l3976L0023K7717q81k6672n219K4702
17415A08844K9557j5104j0962n1068k164L2052l2050l4038L662J8382M092K5616
17403G6819m3078r098L6377M1095l8807K4214L3114J2706K4053Q3890L0839j4735
17391B57389K9381L6213M4761M1941J0087q372K3515K9129M0569P531j9896l470
17379D88778N207m955N7509N2234k5011o1332J4289P629n4557L477L5892o1710
$$ y = [67314, 52049, 43536, 52820, 30492, -15271, -59029, -32274, 9044, 14771, 24328, 13367, -12137, -24276, -8184, 40412, 24504, 15977, 27391, 87305, 161441, 201401, 178140, 145664, 158103, 139021, 110559, 57904, -15615, -32170, 22743, 30068, 24146, 7082, 9419, 13805, 37035, 56654, 93466, 99124, 114590, 93150, 59174, 89197, 116914, 116033, 89361, 84142, 108844, 138401, 123297, 112335, 61267, 59103, 91155, 59105, 25067, 28729, 47111, 51203, 76819, 33741, 24643, 61020, 102115, 63308, 87522, 120636, 133342, 157395, 241285, 272124, 257389, 286770, 322983, 367744, 409685, 419772, 411400, 434915, 464044, 504613, 512144, 492248, 488778, 493985, 489030, 546539, 598773, 573762, 512430, 526719, 534348, 479791, 483268, 519160, 457450]
17367D57450q958p3208n5747n488J3014l9767m5522N088L329k7084j1512L4041
17355B45636L6861J0926q963m7J615K8906K3933J744L2471O5011J03944J04680
17343F46717R3026J6827L1800p355K7963q329j3499n2397l0132k4325l4254l6711
17331F09331K538l2274l458P894k747K2466p139k0777k3646m452j8106N392M4566
17318E79588J5185K710J5156J9038N9648J9645N1296J2408J5069J727L8432R3783
17306I23685J16858J19959O3686R2222J26318P8362J09647K00771K39722K35691
17296B306921K54077K59770K90841K90215L07518M06626M68949M30285L81780
17287E396982N17138N93767P48916R56516J050515J197202J587287K064924K475617
$$ y = [457450, 448492, 375284, 319537, 314049, 327063, 287296, 241774, 246862, 250191, 223107, 211595, 245636, 282497, 293423, 284460, 284413, 286028, 314934, 338867, 340611, 373082, 438093, 542037, 646717, 739743, 756570, 788370, 781015, 808978, 800649, 787150, 734753, 704621, 680296, 646042, 609331, 611869, 579595, 576137, 584031, 581284, 603750, 596611, 575834, 552188, 547736, 529630, 535022, 579588, 594773, 597483, 612639, 631677, 691325, 710970, 762266, 774674, 789743, 791470, 829902, 923685, 1040543, 1160502, 1224188, 1316410, 1442728, 1521090, 1630737, 1831508, 2071230, 2306921, 2560998, 2820768, 3111609, 3401824, 3709342, 4115968, 4584917, 5015202, 5396982, 5914120, 6507887, 7256803, 8213319, 9263834, 10461036, 12048323, 14113247, 16588864]
17278A6588864K986453L597345M587315N866105P084574Q113339R240843J0406977
17270F8471815J1259208J0819307Q675820N799951M439775L142383M11488p50590
17262A12269157J818966L982000M864112O792461P334878K754904j284339k322430
17254A36209709o081282j2402956j3180350j0227457q724115q289153p240238
17247G0064158n545886m339053m634760n565697n242666m483427m110730l667127
17239C2474812k932358k224822j733294j432866j090282q86958p80603o38325
17231B0755304l67720k5525L13440Q65485J560228K010095K433505L185216L761373
17222C4491401L072223K397277K823416K714543J462363J681452K196882R63675
$$ y = [16588864, 19575317, 23172662, 27759977, 33626082, 40710656, 48823995, 58064838, 68471815, 79731023, 90550330, 99226150, 105026101, 109465876, 112608259, 113019747, 112269157, 114088123, 118070123, 122934235, 129726696, 137061574, 139816478, 138532139, 136209709, 130128427, 117725471, 104545121, 94317664, 85593549, 77304396, 70064158, 64518272, 60179219, 55544459, 49978762, 44736096, 40252669, 36141939, 32474812, 29542454, 27317632, 25584338, 24151472, 23061190, 22174232, 21393629, 20755304, 20387584, 20362059, 20675499, 21540984, 23101212, 25111307, 27544812, 30730028, 34491401, 37563624, 39960901, 42784317, 45498860, 46961223, 48642675, 50839557, 51803232]
17214E1803232L25895Q68677n06597k649841k404813j896184k806354k862698
17206C9871317k046993k255162k551653k139434k251625l056567k947641k308770
17198B0313472k185440j991121j498042j147850r14985p55007o21383n34914n13245
17189A0151485m49529l81710l85742l87585l66408l05223l04075k67935l12977
17180F990301l05269k59934k09889j79444j84509k04011k48865k16155j34168
17171E048057j04174j40884j19965r9748j17032j86762j47027m6234j01337j46086
17161C838808p3160p1824r0796j24391j22733j37862j15116p6051o9754o061l1112
17150B919948m4180j04332r8850l3708p7764l9225j3998n5596n7664n8184m6798
$$ y = [51803232, 52129127, 52997804, 52491207, 49841366, 47436553, 45540369, 42734015, 39871317, 37824324, 35569162, 33017509, 30878075, 28626450, 25569883, 22622242, 20313472, 18128032, 16136911, 14638869, 13491019, 12576034, 11821027, 11199644, 10664730, 10151485, 9701956, 9320246, 8934504, 8546919, 8180511, 7875288, 7571213, 7303278, 6990301, 6685032, 6425098, 6215209, 6035765, 5851256, 5647245, 5398380, 5182225, 5048057, 4943883, 4802999, 4683034, 4583286, 4466254, 4279492, 4132465, 4086231, 3984894, 3838808, 3765648, 3693824, 3603028, 3478637, 3355904, 3218042, 3102926, 3026875, 2957121, 2951060, 2919948, 2875768, 2771436, 2672586, 2638878, 2561114, 2521889, 2507891, 2452295, 2394631, 2336447, 2289649]
17139B289649k5189k1586m8523o1547k9190l2362j1690k1425j0933j0246k8389
17128A988569o765K632j0337l6851l9900j6345k3039q8171p7402l1817J0749j8628
17116A652695k309L151l267j9777K4608N1360m8367j15491l5363j8850J6832n314
17104A499908L968J2706R791K9196r434m914J200J9461m196N7653L7157J8531
17092A671027K8707P1773P0302o017M5161N9024J01402J24972J09784J52515J59348
17081B587998J60638J56115J59772K17516K34312K48241L38142N58569P06671
17072E367974R99286J451105K296311L428838M425883N093149N223857M212753
17064C2499156K547024P50877r73850k611806k466510j009098R96531L067633
$$ y = [2289649, 2264460, 2242874, 2194351, 2132804, 2103614, 2071252, 2059562, 2038137, 2027204, 2016958, 1988569, 1981804, 1984436, 1974099, 1937248, 1897348, 1881003, 1857964, 1769793, 1692391, 1660574, 1671323, 1652695, 1650386, 1653537, 1650270, 1630493, 1655101, 1706461, 1658094, 1542603, 1507240, 1488390, 1505222, 1499908, 1503876, 1516582, 1526373, 1555569, 1546135, 1541221, 1542421, 1561882, 1557686, 1615339, 1652496, 1671027, 1699734, 1771507, 1841809, 1835792, 1880953, 1939977, 2041379, 2166351, 2276135, 2428650, 2587998, 2748636, 2904751, 3064523, 3282039, 3516351, 3764592, 4102734, 4661303, 5367974, 6367260, 7818365, 10114676, 13543514, 17969397, 23062546, 28286403, 32499156, 35046180, 35797057, 34823207, 32211401, 29744891, 28735793, 29732324, 32799957]
17056C2799957M682506N123171L917670J793697n14147k801155m730785m861404
17048C5409510l672973j957668J0769J661203K188131J453557J81576j226693
17040C4047412k750461m137001m157173l700631l014050k139427j404659r29645
17032A1814365p13319n26213m13558l22933k59236j85440q7505l0570N3120J55728
17022I484439M61147Q69430J546471K367921L283666M018392M278807L713028
17014C0023301K764373J914480J189306K02490R7853L42673p4779m84740q86386
17005C5088571j362953j643169r30624J23667J107602J502958J129657N51540
16997C5567249K62494m49498o49645m01549p83858j284634j840856k659285l641573
$$ y = [32799957, 37482463, 42605634, 46523304, 48317001, 47802854, 45001699, 40270914, 35409510, 31736537, 29778869, 29789638, 31450841, 33638972, 35092529, 35274105, 34047412, 31296951, 27159950, 23002777, 19302146, 16288096, 14148669, 12744010, 11814365, 11101046, 10574833, 10161275, 9838342, 9579106, 9393666, 9306161, 9275591, 9328711, 9484439, 9945586, 10815016, 12361487, 14729408, 18013074, 22031466, 26310273, 30023301, 32787674, 34702154, 35891460, 36093950, 36191803, 36534476, 36459697, 35974957, 35088571, 33725618, 32082449, 31151825, 31275492, 32383094, 33886052, 35015709, 35567249, 35829743, 35380245, 34730600, 34329051, 33545193, 32260559, 30419703, 27760418, 24118845]
16988B4118845l678389l231374k634356j913093j376598r79816p18868o75101
16980H911250n68350m43500l99907l48552l04234k58668k54209l06467l32638
16971E694725k25374k66344k16064j71930j77610j63707k06698j44613j43519
16962C978866j18701j30195j29012j63425j25276r5565q8983p1543j00944j01153
16952B854069r8056p5738k8604l5794j9091m9000j13349q7882m3659m8444j18213
16941B136239o9362k9870q9608j14170o9098l6297m2655L8517K4528p7507j3978
16930A656739n3866o7590l7898k8005n444R093m1134n1908q179k6119l3314q005
16918A304370l6504o4997m5690r457p54k7661r530L4017P985n8303k4713n304
$$ y = [24118845, 20440456, 17209082, 14574726, 12661633, 11285035, 10305219, 9586351, 8911250, 8342900, 7899400, 7499493, 7150941, 6846707, 6588039, 6333830, 6027363, 5694725, 5469351, 5203007, 4986943, 4815013, 4637403, 4473696, 4266998, 4122385, 3978866, 3860165, 3729970, 3600958, 3437533, 3312257, 3216692, 3127709, 3056166, 2955222, 2854069, 2756013, 2680275, 2651671, 2615877, 2596786, 2547786, 2434437, 2346555, 2302896, 2254452, 2136239, 2066877, 2037007, 1947399, 1833229, 1764131, 1727834, 1685179, 1723696, 1748224, 1670717, 1656739, 1602873, 1535283, 1497385, 1469380, 1463936, 1473029, 1431895, 1379987, 1371808, 1345689, 1312375, 1304370, 1267866, 1202869, 1157179, 1147722, 1146968, 1119307, 1109777, 1143794, 1151779, 1093476, 1068763, 1063459]
16906A063459k0216j9154j5074l309n4833l5625j8550K4110j013L596n0171l5578
16894H37642k0382J1529K1654k5659m4364m8250k572J9569n539N044k8651M22
16882G20443J9932K648j2511j6357l3016O70N2390k8381p0724J9960j330j3628
16870F40096m7457k1847j6588n972j6509k7286j9532n977O601J11475R027q0719
16858E25312k1704N1152K4941Q66j1017m9723M43L4236k6543M3533L0543o7716
16846E34323m7546k2057k4920L92R384j780p1964j1493k1137O0125Q9593j9568
16834D73352n9386l6021M034J355j8286O06J1236j0294R407j9771n712L032k9287
16821C24265J9801L1418J1618l5210K6050N9997J234l2038l1540k359K6014P952
$$ y = [1063459, 1043243, 1024089, 1009015, 1005706, 950873, 915248, 896698, 920808, 919795, 923391, 873220, 837642, 817260, 828789, 850443, 824784, 780420, 732170, 729598, 749167, 743628, 748672, 720021, 720443, 740375, 743023, 730512, 714155, 681139, 681809, 734199, 705818, 635094, 655054, 653724, 640096, 592639, 570792, 554204, 548232, 531723, 504437, 484905, 478928, 485529, 597004, 606031, 525312, 503608, 554760, 579701, 580567, 569550, 519827, 520270, 554506, 527963, 571496, 602039, 534323, 486777, 464720, 439800, 440192, 449576, 447796, 375832, 364339, 343202, 403327, 492920, 473352, 413966, 377945, 381979, 383334, 365048, 365654, 376890, 366596, 376003, 356232, 350520, 353552, 324265, 344066, 375484, 387102, 351892, 377942, 437939, 439173, 407135, 375595, 373236, 399250, 407202]
16809D07202l8419m5554l7815l6068j2678O0479J5781R412j4452k1195L2293K2713
16797C41699j8837k8824J530M965N0890k4750j7845l1368N925L4772P4194N1091
16785D43442Q863j5130M744R1633Q7330l6702o4740m0363L6976O7014Q4647k201
16773F65513j5916j0675J7742j5350K1425M9338M3067l2363j0908K8697j4213
16762G26357r816O980N8030J3099M0241m2333k8591k4327j2110Q130L7345n3351
16750G19654n0358p3572o3812n1445m899k6129q984j3656k7605l4075o1134n5688
16738B48297M0272J5305K6973L4400m9934K0470j3336k0846j813m053r291M998
16726B91442M029J4636K4459N979J2345m492j4718K899M9328J8110j4484K3630
$$ y = [407202, 368783, 323229, 285414, 249346, 236668, 297147, 312928, 322340, 307888, 286693, 318986, 341699, 322862, 294038, 295568, 300533, 351423, 326673, 308828, 277460, 283385, 318157, 392351, 443442, 452305, 437175, 441919, 533552, 620882, 584180, 519440, 479077, 516053, 583067, 667714, 665513, 649597, 638922, 656664, 641314, 662739, 712077, 755144, 722781, 711873, 740570, 726357, 716541, 723521, 781551, 794650, 834891, 792558, 763967, 739640, 727530, 735660, 773005, 719654, 669296, 595724, 531912, 480467, 475568, 449439, 440455, 426799, 399194, 365119, 303985, 248297, 288569, 303874, 330847, 365247, 315313, 335783, 322447, 301601, 299788, 295735, 286444, 291442, 295471, 310107, 334566, 340545, 352890, 348398, 333680, 336579, 385907, 404017, 389533, 413163]
16714D13163l631M437R980l6687j4490P467m4466L5791q167o332J673N5275J4154
16701D28167o549J0114J821m4974p7394k5084l006J4701k3109l9433m4565r970
16689A80719N7022K7318m492o3534o4062J39L334o410k8097J0329M7891J4172
16677A74329k4317k939J4007N3917J70N0830O9732J3534N700o4468o8930r8981
16665A22584K6612L9713q222l1019m886J8053l3531j1947q740j2129j5846K40
16653H0882N1864K9608j7868m980R692l8799n0121K0508K2084L9213K0785j5495
16641A47373k2251J7541k138K4072R363k1112m7642L0003N1931k067R318J038
16629A95429n473n3011l0779J5502P991j3829k4640j5476J8528P5590l1407l185
$$ y = [413163, 409532, 413969, 423949, 387262, 372772, 380239, 335773, 371564, 363397, 357065, 358738, 414013, 428167, 421618, 431732, 433553, 388579, 311185, 286101, 283095, 297796, 274687, 235254, 190689, 180719, 237741, 265059, 260567, 197033, 132971, 133110, 136444, 130034, 101937, 112266, 160157, 174329, 150012, 147073, 161080, 214997, 215167, 265997, 335729, 349263, 354963, 290495, 221565, 122584, 149196, 188909, 180687, 149668, 144782, 162835, 129304, 117357, 108617, 96488, 80642, 80882, 132746, 162354, 144486, 139506, 149198, 110399, 60278, 80786, 102870, 142083, 162868, 147373, 125122, 142663, 140525, 164597, 173960, 152848, 105206, 135209, 187140, 185073, 194391, 195429, 189956, 136945, 106166, 121668, 129659, 115830, 91190, 75714, 94242, 169832, 138425, 135240]
16617A35240j5564j0979J7440R815m2839j1925K7216k9578K9279M1343l692k3890
16605A21866k3564j8598L801P7135j1654o7293k2216K8466O521M0283l922k6132
16593A04693O820j7265l5899L9347Q9771J8573q44m642k3730j7182l777K2180
16581A78045q591m3134j0814q857n7391K7066L2621q067r68L9883Q0843K0764
16569B41400q615L98R461J8005L2593m5959O990K1264l339N9526J6205j3279j11
16556C34539L9366m0763j3766k4649j4643R215K1155p707o325J0089m7523j7316
16544B41672J2846P504j1971n3368J0865j4377j8064m536j0137O495J0933p430
16532A70432L202m6966j6683J1784L8788j9208R759j2844j3623M8131K5377J9117
$$ y = [135240, 119676, 108697, 126137, 135952, 93113, 81188, 108404, 78826, 108105, 149448, 145756, 121866, 98302, 79704, 83505, 160640, 148986, 81693, 59477, 87943, 94464, 134747, 130825, 104693, 111513, 94248, 58349, 97696, 187467, 206040, 205196, 200554, 176824, 159642, 155865, 178045, 169454, 126320, 115506, 106649, 49258, 76324, 108945, 100878, 99910, 139793, 220636, 241400, 232785, 233183, 242644, 260649, 293242, 247283, 254273, 275537, 272198, 331724, 347929, 334650, 334539, 373905, 333142, 319376, 294727, 280084, 289299, 310454, 302747, 296422, 306511, 258988, 241672, 254518, 262022, 250051, 196683, 207548, 193171, 175107, 170571, 160434, 166929, 177862, 170432, 173634, 126668, 109985, 121769, 160557, 141349, 151108, 138264, 124641, 172772, 198149, 217266]
16520B17266L5190N991J5738l5379k1606Q533j2232l0575M1759J70M595M2828
16508B72278L3462l4755l7390k9093K8818J6583M8916j5554l0484K9246N1609
16497C33636l7536n1991m5826M266j6544j844j9278J9904j5068q6124K483N8681
16485A44759m2214l5524L9408N1009J1668k1715J4203l2506J188o243K3239J1866
16473A59138m6975l4400Q389N2478l6616J0790K9315k0643k6428j2911L330M232
16461H9699r816K408l9118l0557k0735K8233J2968P627o066j0196j2035o4325
16449e1913j1742N4390M4424O2601l460q562m888m2624j4595L0617N4731K484
16437A11463n4320k0804n827K9923N6014N6238j0701j4337n2401M552k5245K4620
$$ y = [217266, 252456, 258447, 274185, 238806, 217200, 225733, 213501, 182926, 224685, 224855, 229450, 272278, 305740, 270985, 233595, 204502, 233320, 249903, 298819, 283265, 252781, 282027, 333636, 296100, 244109, 198283, 202549, 186005, 184161, 164883, 184787, 169719, 83595, 86078, 144759, 102545, 67021, 106429, 157438, 169106, 147391, 161594, 129088, 130276, 124033, 147272, 159138, 112163, 77763, 86152, 138630, 102014, 112804, 142119, 121476, 95048, 82137, 85467, 89699, 79883, 82291, 43173, 12616, -8119, 20114, 33082, 40709, 34643, 24447, 12412, -51913, -63655, -9265, 35159, 97760, 94300, 85738, 80850, 38226, 23631, 54248, 108979, 111463, 57143, 36339, 30512, 60435, 116449, 172687, 161986, 147649, 95248, 99800, 74555, 99175]
16425I9175k294k4604q438M111R697j0277J4603R157j6778L570K2957j1316l0299
16412E9264L4397M8729k2690n0916J5367n0800J0006j5222L999n065j2822O502
16400B0749L508J4859K8236k5810k2791j2384n107K396J3575M1815O8759p030
16388A20775l6976j5110J9701k9514k5570K1510O35j0490O037j6598J9449O707
16376F0556N637K7959j3250r727J1318k7530J0548J5457L6088k8957J043j5425
16364G3717k133Q091O994l8583k394j3818O2837P1385n9889p1399J7562P0456
16352A22826l2433j7032K737j7690O701l0186J6533j9263m5980J7796k5873K1564
16340c00K0310M993k3380J7751J683n018l6279K0820J7539N9039r198j929M8008
$$ y = [99175, 96881, 72277, 63839, 67950, 77647, 67370, 81973, 91130, 74352, 77922, 100879, 89563, 59264, 93661, 142390, 119700, 68784, 84151, 33351, 43357, 28135, 32134, 27069, 14247, 20749, 24257, 39116, 67352, 41542, 18751, 6367, 1260, 3656, 17231, 59046, 127805, 120775, 83799, 68689, 88390, 58876, 33306, 54816, 55451, 44961, 50998, 34400, 53849, 60556, 66193, 94152, 80902, 71175, 82493, 54963, 65511, 80968, 117056, 88099, 89142, 73717, 71584, 79675, 86669, 48086, 45692, 31874, 94711, 166096, 106207, 34808, 52370, 122826, 90393, 73361, 76098, 58408, 65109, 34923, 51456, 32193, -13787, 4009, -21864, -300, 20010, 25003, 1623, 19374, 21057, 16039, -20240, 580, 18119, 77158, 67960, 66031, 114039]
16327A14039K1218o9j1560m9101k9157l571o137O129L7368O594k3906k415o011
16314E3421k7005k9555k7315J1954K3020K9253L3108M2337k1449k3837m6780o6815
16302d9663l2811J5731P9493R616J7520M8642J3132J4746j7922n9279n3975M6072
16290C1302L8010q3379J9694K5084M4710J079K082o92K9493K5095k299j4830n5141
16277F0208m0496q599l695J3163J2667K0340J8442M2707k4554p4282n2097O02
16265c5594L6870N2442J048K6576k7620r943l2003q700J5471J5242M1917l38K5934
16252A01302L0344n964m8766l4927J3171j9474L0396k161K5429L2679j4394m7520
16240F0115m3503K4305L9398J2860J311k2996K8164l4800m5226m6173N0229O4212
$$ y = [114039, 135257, 135188, 123628, 74527, 45370, 41799, 35662, 41791, 79159, 85753, 61847, 59432, 53421, 26416, -3139, -30454, -18500, 4520, 33773, 66881, 109218, 87769, 63932, 17152, -49663, -82474, -66743, 12750, 22366, 39886, 88528, 101660, 116406, 98484, 39205, -14770, 31302, 69312, -14067, 5627, 30711, 75421, 76500, 78582, 77890, 107383, 132478, 130179, 115349, 60208, 19712, 11113, 7418, 20581, 33248, 53588, 72030, 114737, 90183, 15901, -36196, -35594, 1276, 53718, 54766, 81342, 53722, 43779, 11776, 3076, 18547, 33789, 75706, 75368, 101302, 131646, 125682, 76916, 41989, 55160, 35686, 66082, 63921, 89350, 122029, 107635, 60115, 16612, 40917, 80315, 93175, 94486, 71490, 99654, 64854, 19628, -26545, 23684, 87896]
16228H7896J3733J5187k1307n0254K5308J9738K0098m1847j4638j7916p814k921
16216B5263L6193R915K6336L3877K2942M414n0007p9367K880N7793N6829j8260
16204A28808n5188l6301J7501N499j6643r955M6237J2245m4882m2021j1060K5006
16192A9246O2831m9495l9429M495L7532K9083N7000q193k3894j5701J0609n25
16180H3559q880j9114J354K0842l6874j8132J0701K1005R5436L291q2028j8063
16168E3097j8959m018J5154o645l0769L9942L5432j6690l8560l6732j1217j7976
16156c7941M0781M0810o7739k4343N2036K3926J265K4853J0915l455m828J1954
16144F8234J667m9283m9013j7716k1217M7074L8786l0294K6415J7925K3944M8641
$$ y = [87896, 101629, 116816, 95509, 45255, 70563, 90301, 110399, 68552, 53914, 35998, 28184, 25263, 61456, 71371, 97707, 131584, 154526, 158940, 108933, 29566, 32446, 90239, 147068, 128808, 73620, 37319, 54820, 60319, 43676, 33721, 79958, 92203, 47321, 5300, -5760, 19246, 82077, 32582, -6847, -2352, 35180, 64263, 121263, 113070, 89176, 73475, 84084, 83559, 74679, 55565, 56919, 77761, 40887, 22755, 33456, 54461, 149897, 153188, 71160, 53097, 34138, 30120, 45274, 38629, 7860, 47802, 83234, 66544, 27984, -8748, -19965, -37941, 2840, 43650, -24089, -48432, 3604, 27530, 28795, 53648, 64563, 61108, 56280, 68234, 69901, 20618, -28395, -46111, -67328, -20254, 18532, -11762, 14653, 32578, 56522, 105163]
16132A05163J5231n3983m3795L636K9787K5903l7589k0826p604k9990r231M5842
16120B2544K359k1567K1103m72k459J4143R064O6763j4022l0215J2466j5882m4869
16107A8956j8443j3447J4357L9145m1839J0539N7895l1312l6686j626M4110M0150
16095H1799l4083p116L6782L8113j6253m5217n3654N375K8660L3096L5059j2252
16083I0309o6625K147k217J4179J0604n2196K8072M7885J6597l2551m0843m7194
16071c1833N230K8769k157q481K9872P289L8186m9667j6677N0192J4885l5388
16059C0220k9301L0202O833r398l1723K724l0117r415M6588L3113l4547q992l173
16046f986J1535l3562j8847m857M8746O7188J361n149l002k3602k3881J0405K3732
$$ y = [105163, 120394, 66411, 22616, 26252, 56039, 81942, 44353, 23527, 15923, -14067, -23298, 22544, 24903, 3336, 24439, 23967, 21508, 35651, 44715, 111478, 97456, 67241, 79707, 63825, 18956, 513, -12934, 1423, 40568, -1271, 9268, 67163, 35851, -835, -2461, 41649, 81799, 47716, 40600, 77382, 115495, 99242, 54025, 371, 5746, 34406, 67502, 102561, 90309, 23684, 25831, 23614, 37793, 48397, -3799, 24273, 72158, 88755, 56204, 15361, -31833, -26603, 2166, 9, -8472, 21400, 28689, 66875, 17208, 531, 50723, 65608, 30220, 919, 31121, 37954, 28556, -3167, -443, -30560, -39975, 6613, 39726, 5179, -3813, -6986, 4549, -29013, -47860, -52717, -3971, 63217, 64578, 59429, 56427, 32825, 8944, 19349, 43081]
16033D3081M4902L4894N235j2896j8285m1718K9255K3012o502n137j4540l0412
16021E0889K161J8192n0828L4640o771o3415M8018M4793k756q943m2259J632J7539
16008D2892P776m450n9221m6112J8158L5798m699J8918j3523L3905P554L761L3756
15995G4513M8079k6703p0296L902l5448M045M7823O327j4776n2005k631M9721
15983C2551N4631j9509m454k4804m4048J2695M5610K2232k7035n0751K4988M9484
15971G1590q223o3307k8615J284J4113J9916L0596J3610m909k3109N999J5522
15959D4467K5903r509k8681J5157K9495J7171k3357K421L7812m6558o6097q830
15947a0606J3668J3567o633j6595m0906K3520N1152M1416k6871n9879O7068N4832
$$ y = [43081, 87983, 122877, 128112, 115216, 96931, 55213, 84468, 107480, 100978, 95841, 81301, 50889, 53050, 71242, 20414, 55054, 48283, -15132, 32886, 77679, 74923, 65980, 23721, 25353, 42892, 50668, 46218, -13003, -59115, -40957, -5159, -9858, 9060, -4463, 29442, 36996, 40757, 74513, 122592, 95889, 25593, 29495, -5953, -1908, 45915, 52242, 37466, -14539, -17170, 32551, 87182, 67673, 63219, 38415, -5633, 7062, 52672, 74904, 47869, -2882, 22106, 71590, 63367, 60, -28555, -27271, -13158, 6758, 37354, 50964, 46055, 22946, 28945, 44467, 70370, 60861, 32180, 47337, 76832, 94003, 70646, 73067, 110879, 64321, -1776, -10606, 3062, 16629, 9996, -6599, -47505, -23985, 27167, 68583, 41712, -18167, 48901, 103733]
15935A03733l8686j3927k5996k3517j7664n909J2121q836j0655J7155L9363j0999
15923A6183k8326J4054j7216j3779r253l923K8006O2216k8796N48j7788l6848
15911c4922M8246K4879k485j6321j143J0526K0558r361J5417N194l3992p3815
15899d7219L5223L8775k8795l1448o197J2263K7026l6021K3108K5146r289J137
15887C709L0877L4762k8404P201N6675K0827r0011n5335j4812m8427k251K2721
15875f2468K0595O603J8746K0816J2784N19J8569k0006j3168J9473J1591P143
15863D1197K1668k2427l5383l8765J7626L1j8026j9169J871J9175M7746K8561
15851D4105j2775k8760k0224L3021Q800n823n515M2921J4939l8728m6496O289
$$ y = [103733, 65047, 51120, 25124, 1607, -16057, -21966, -9845, -18681, -29336, -12181, 27182, 16183, -12143, 1911, -15305, -29084, -38337, -42260, -14254, 47962, 19166, 19714, 1926, -34922, 13324, 38203, 35718, 19397, 18254, 28780, 49338, 39977, 55394, 60588, 26596, -47219, -11996, 26779, -2016, -33464, -39661, -27398, -372, -36393, -13285, 11861, 2572, 3709, 34586, 69348, 40944, 48145, 104820, 125647, 35636, -19699, -34511, -82938, -85189, -62468, -41873, -35270, -16524, 4292, 17076, 17595, 36164, 16158, 2990, 22463, 34054, 41197, 62865, 40438, 5055, -33710, -16084, -16053, -34079, -53248, -51377, -32202, 15544, 44105, 31330, 2570, -17654, 15367, 24167, 18344, 12829, 55750, 70689, 31961, -14535, -8246]
15839h246O8922k5506j1253J6825q339J3308o694j4203j4493M2827J2887j9949
15827D6086k7283o764K038k628J3244l496J9069M8J05m1370K8855J0956K9801
15814F8661L082k9481k5648j4080k4913J1408l9226l7145q513K0966N1722m465
15802b7632Q953K4528j77M4699M9477J9344m5399m1563p0894R407O7697L3744
15790G2184k9087l1639l611n4827k4294J5198J5540L8854K3775m6970K7770L6632
15778C9525m3997J92K7469L0933m8308l0757j7935O6542N036j1642L4186M374
15766E5618l9602m3815M1303K8378J8109J0666j3985N383n7522k5444q341k2988
15754e2240K6814N9270L4122N0703j2113K5075j9003k1398m2624L0609K2579j5302
$$ y = [-8246, 60676, 35170, 23917, 40742, 32403, 45711, 39017, 24814, 10321, 53148, 66035, 46086, 18803, 12039, 14077, 11449, 24693, 21197, 40266, 40314, 40419, -951, 27904, 38860, 68661, 71743, 42262, 16614, 2534, -22379, -10971, -50197, -87342, -95855, -74889, -23167, -27632, -18679, 5849, 5672, 50371, 99848, 119192, 73793, 32230, -38664, -29257, 38440, 72184, 43097, 11458, 7847, -46980, -71274, -56076, -40536, -1682, 22093, -24877, 2893, 39525, -4472, -4280, 23189, 54122, 5814, -24943, -42878, 23664, 28700, 17058, 51244, 55618, 16016, -27799, 13504, 41882, 59991, 70657, 56672, 62055, 4533, -20911, -29252, -52240, -25426, 33844, 67966, 118669, 106556, 131631, 112628, 91230, 48606, 79215, 101794, 86492]
15742H6492r911l0837l9383J9150m989l6629l1350R542L6364M3655L1956j1465
15730F2595k7990j8458j1879k4446J1818J5724L3864m300n5746m1710j0572K1938
15718d9162L0921J9715k2070k3726K5784K6306L0786L1256j4694l3790l0510N0620
15706D1436J8501j4314J899j181j4032K280k7847j881K0273N4419n460j3872j3345
15693D6876m677l486L7237l7181k2986j589L2812J271j0640P439L0295l0807K7177
15680G1741k9636o6651k3312J4608M3186M2671K0438K7942r755k9862l8914m3050
15668b0594K7546J2256l030p783J6061O565Q060n886o392j8913j9197M3759M1660
15655G4112J3948j8677l3999J3729n1510k9704l266M01O8378M8613J0317m811
$$ y = [86492, 76581, 45744, 6361, 25511, 20522, -16107, -47457, -37915, -1551, 42104, 74060, 62595, 34605, 16147, 4268, -20178, -8360, 7364, 41228, 36928, -18818, -60528, -71100, -49162, -18241, 1474, -20596, -44322, -18538, 7768, 38554, 69810, 55116, 21326, -9184, 41436, 59937, 45623, 47522, 46341, 32309, 34589, 6742, 4861, 25134, 79553, 74093, 60221, 46876, 42199, 38713, 75950, 38769, 15783, 14194, 47006, 48277, 37637, 45076, 75371, 44564, 71741, 42105, -24546, -47858, -33250, 9936, 52607, 73045, 100987, 91232, 61370, 22456, -20594, 6952, 19208, 16178, 8395, 24456, 31021, 39081, 33195, 26803, 7890, -11307, 32452, 74112, 88060, 69383, 35384, 49113, -2397, -32101, -35367, -34966, 33412, 82025, 92342, 87531]
15643H7531l2281J5433n418J2393L5293k5300j05539L4282L5072k9465J2316N357
15631C9674k3092J2534M54N337J9588J4187K8298l4607n9331l3937j3051J8365
15619b5581k5781l3047L3139L1926L3118J8216k9997J1029J5707J1176j8299K8885
15607E0491k105j5596l6403M2650k034m3339J4230K2448j6946k2974J5410K724
15595H556j2250j9317n6467L3868K1438M0887O350j4664l8168l5758k2919K0879
15583f7565J6497l2011k100L0031L8059j0104J8009M8273j7240l1482N8664j0249
15571C8782r7021k3519J9806J7795k2766M3611K8809K2606L8827L3797k6193o9298
15559E236J1655R033k0654N763J4969L2461k0569j7264L1714k2142o770k0282
$$ y = [87531, 55250, 70683, 65265, 77658, 112951, 87651, -17888, 16394, 51466, 22001, 34317, 39674, 16582, 29116, 29570, 34907, 54495, 68682, 96980, 62373, 3042, -30895, -43946, -25581, -51362, -84409, -51270, -19344, 13774, 31990, 1993, 13022, 28729, 39905, 21606, 50491, 48386, 32790, -3613, 39037, 37003, -6336, 7894, 30342, 13396, -9578, 5832, 8556, -3694, -23011, -79478, -45610, -24172, 16715, 23065, 8401, -29767, -65525, -88444, -67565, -51068, -83079, -85179, -55148, -17089, -27193, -9184, 39089, 21849, -9633, 49031, 38782, -58239, -81758, -61952, -44157, -66923, -23312, 5497, 28103, 66930, 100727, 74534, 5236, 16891, 25924, 5270, 11033, 26002, 58463, 37894, 20630, 52344, 30202, 23432, 3150]
15547C150o6680l6620M2776L0591N2931J0855l0170l6249j4989n8236M2030M6794
15535a3817J5410K1218J1817j9322M0178k0858m0746k5321j6880j9987N4704M2962
15523B9358j0892r534L2015J2774M345J0112n729j8026J8018P288m5914O669M3859
15510G4343j3152r457K9113k9579k1742J3829l977J4360K7463j0006m3138k8225
15498a68l0168k8826L836p204j270J5231N2811L2042l6321p62j6096m0311N137
15485e2069M464L6204K8497N9523j8679l9312j3053N3158k6744l0190J4347J1913
15473B8059o1662k1676J5897L236m3229j7582j390L7185J7760M609J9982j9677
15461c8488K010Q206J5892K8139N1742q330j7341k9758j1741j5148j8744M7580
$$ y = [3150, -63530, -100150, -57374, -26783, 26148, 37003, 6833, -29416, -44405, -102641, -60611, -13817, 1593, 22811, 34628, 15306, 55484, 34626, -6120, -31441, -48321, -68308, -13604, 29358, 18466, 8932, 40947, 53721, 58066, 68178, 62449, 44423, 62441, 69729, 23815, 30484, 74343, 61191, 51734, 80847, 51268, 29526, 43355, 39378, 53738, 81201, 71195, 28057, -168, -30336, -59162, -55326, -62530, -63800, -48569, 4242, 36284, -37, -799, -16895, -57206, -52069, -47605, -11401, 17096, 76619, 57940, 18628, 5575, 58733, 31989, 1799, 16146, 28059, -33603, -55279, -39382, -36146, -79375, -96957, -98347, -61162, -43402, -38793, -18811, -38488, -36478, -28272, -12380, 15759, 67501, 59171, 41830, 12072, 331, -14817, -33561, 14019]
15449A4019L8893j9897k9809k9669o771J463L1810K9825k2238j7793m004q297
15437b2468L1624L2414J8568K7908m7412n5968j6636K4854k0817m5693Q722J8646
15425d6258O6723J2970j697k752n321K7371L8700p113J1331j5041n7175m2440
15413b0702R313R1258j4241j3607k7989m081K845O732J1919m56k5167m3531p146
15400c4853K3674M0295K1713n0802K2795K7354j2262k1186m1551k8000J442J2824
15388c8557J2225L9139K4039M0097m3389k0418L0837K1700K5200p0998m5167M757
15376b0535k2009K9996J6828J4401N486J1414k7432M6393K0663n9880J508J4120
15364C0953J8225J2453m2516r210j2484m3020M3306J8794l0796j8629m0120L9484
$$ y = [14019, 52912, 33015, 3206, -26463, -33234, -31771, 39, 29864, 7626, -10167, -14171, -22468, 9156, 41570, 60138, 88046, 40634, -15334, -31970, -7116, -27933, -73626, -64904, -46258, 20465, 33435, 31738, 28986, 23665, 51036, 89736, 82623, 93954, 78913, 21738, -20702, -11389, 79869, 65628, 52021, 24032, 19951, 22796, 29528, 41447, 40991, 15824, -27707, -34853, -11179, 29116, 50829, 27, 22822, 50176, 37914, 16728, -24823, -52823, -51381, -38557, -26332, 12807, 36846, 76943, 33554, 13136, 43973, 65673, 90873, 19875, -25292, -20535, -42544, -12548, 4280, 18681, 24167, 35581, 8149, 54542, 75205, 15325, 16833, 30953, 49178, 61631, 19115, 9905, -2579, -45599, -2293, 16501, -14295, -32924, -73044, -33560]
15352c3560L6254k5946o5287k4682o61J4927J4564J8117L0736N0783L37l02j5289
15339il4821n582q509o244L3615N8838l6470l8387M9387J4415m4797K1424J790
15326D650k189p5348K057L5847L0513L7626J4669M6117J9038l1657M873J737l0574
15313E7359j4568k2117k125j5209l3782K9001K9747j9098k4189j3453k798L3644
15301B412N281l0142k5464k1561L4752L6978K0120L0958J7491P132J6310l5414
15289E8853k586m8860J9748J4660k5689r632J870J0752j2089o0096j4053L3393
15277c3729Q5418J0598l5194p467k6221J2785Q743P726j3176p971M7927j8959
15265C0480j4557n0851Q6951O325m0326p376j3789k23K0408L4899j3814n8283
$$ y = [-33560, 2694, -23252, -88539, -113221, -113882, -98955, -84391, -66274, -35538, 15245, 15582, 15280, -9, -34830, -40412, -48921, -55165, -21550, 37288, 818, -37569, 11818, 26233, -18564, 2860, 4650, 2461, -72887, -70830, -34983, -4470, 33156, 47825, 93942, 112980, 81323, 86196, 87933, 57359, 42791, 20674, 18549, 3340, -30442, -1441, 28306, 9208, -14981, -28434, -31232, 2412, 7693, -22449, -47913, -69474, -34722, 2256, 22376, 53334, 70825, 77957, 94267, 58853, 56267, 7407, 27155, 41815, 16126, 6494, 8364, 19116, 7027, -53069, -67122, -33729, 51689, 62287, 27093, 19626, -6595, 6190, 14933, 22659, 9483, 1512, 49439, 30480, 15923, -34928, 52023, 58348, 18022, 10646, -3143, -3366, 17042, 51941, 38127, -20156]
15253b0156l644j994L1875N5020J0011j1296k2733k444K769j9452m4534l3845
15241f0423m229L78p716J4828N1223J9870J08k6655p439k9771K5759K0453J1299
15228G685j1790q362k6550M3281J2660m845k1476L294j0923R001K2449R738n8824
15215c4662m527l2839j5901n449R521L0732J0023K784n7536Q614N7301N236m500
15202c1203o040J3248J3039k416l8334L8345L9551K6887L0860R02K8475l1895
15190H1419p4529j4141L3711M483p159o0582j379J8127P443m5666q435K052N2140
15177a2516N8931k4273m0036K8557l6238l6452J8730K4083J2474m4945n7626M5918
15165f3393r255m2625J2779P981Q060k5397P0984M6882L4759J1638j0606k7210
$$ y = [-20156, -23800, -25794, 6081, 61101, 71112, 59816, 37083, 34639, 37408, 17956, -26578, -60423, -64652, -64274, -71990, -57162, -5939, 13931, 14039, -12616, -20055, -49826, -24067, -3614, 7685, -4105, -12467, -39017, 4264, 16924, 12079, -9397, -6103, -17026, -8025, 14424, 24162, -34662, -39189, -72028, -87929, -93378, -83857, -53125, -43102, -40318, -97854, -89240, -31939, -26703, -31203, -37243, -23995, -10956, -13372, -51706, -13361, 26190, 53077, 83937, 84839, 113314, 81419, 6890, -7251, 26460, 30943, 23784, -36798, -38177, -20050, -12607, -58273, -66708, -64656, -12516, 46415, 22142, -17894, 10663, -25575, -62027, -43297, -19214, -6740, -51685, -109311, -63393, -72648, -115273, -102494, -94513, -86453, -111850, -40866, 6016, 40775, 52413, 41807, 14597]
15153A4597k8487P862L3287K3741q510k6008K5k0928o0499J0316O4404K7256R422
15140D6478K3311k694l2483J2541M0156l6368m7428n5982k7941k908M5718P966
15128b9634j5179k758M3902l4409k8896N512j4328l582J0159O2511M1566O526
15116D1390q641l2131k3362J2168P911L087k6500L0345L5715K1241J075k4836
15104C7462J4181r3264k4509O0313K5938j0244k469J1267n2510M507N825p8K0128
15091c453P851j6490l3949M0073L4596l2777N896N7748k6901J7428R954L381l2978
15078C0379r112l0541o472j0196l1201m1920J4928k210P584K2806K7655L4235
15066E935P807j0550l5426q984J5752l0035N806K2377P599l4317k190K72J2171
$$ y = [14597, -13890, -6028, 27259, 51000, 42490, 16482, 16507, -4421, -64920, -54604, 9800, 37056, 46478, 69789, 67095, 34612, 47153, 87309, 50941, 3513, -52469, -80410, -83318, -37600, -29634, -44813, -47571, -3669, -38078, -66974, -61462, -75790, -79372, -69213, -6702, 34864, 41390, 32749, 618, -22744, -10576, -2665, 422, -26078, 4267, 39982, 61223, 62298, 37462, 51643, -41621, -66130, -5817, 20121, 9877, 7408, 18675, -33835, -29328, -23503, -23581, -3453, 4398, -12092, -46041, -5968, 28628, -4149, 1747, 59495, 32594, 50022, 59976, 63357, 30379, 21267, -9274, -15746, -25942, -57143, -99063, -84135, -86345, -78761, -55955, -28300, 5935, 13742, 3192, -32234, -41218, -25466, -55501, -49695, -27318, -19719, -54036, -56226, -55954, -43783]
15053d3783j7819O1357L807l3412m109p462K4667J5513N492K0230j2506L9787
15041E1762N3997j7994l1192m7516p475k3241K760j6618j1549J6682k5972j8973
15029g5329l894K7937j9988j7295K7199l68L2688Q651L3111K3817N3745J5946
15017A06220R560p3010k3658K6088k5434K996j3488k0336J1154J1352K0579l0407
15005A616l1335k594J7304M8109O5098m7296o5932j9784J3069L3311j0102K880
14993D344J5688J6125R966O660k1132K7570m6563m8087n853L1895k549n1888N666
14980e8158k4365m2704P671J8601k4947R950K9736K0762L4513O8333j1200m8044
14968a9852o7456L5477M1681L370k6069j5446l202m7407K1013J3653N991j4521
$$ y = [-43783, -61602, -245, 3562, -29850, -33959, -41421, -16754, -1241, 4251, 24481, 11975, 51762, 105759, 87765, 56573, 9057, 1582, -21659, -18899, -35517, -47066, -30384, -56356, -75329, -79223, -51286, -71274, -88569, -61370, -61738, -29050, -20399, 12712, 36529, 90274, 106220, 115780, 42770, 19112, 45200, 19766, 22762, 9274, -11062, 92, 11444, 32023, 1616, -29719, -32313, -15009, 33100, 98198, 50902, -15030, -34814, -21745, 11566, 1464, 4344, 20032, 36157, 46123, 52783, 31651, 59221, 12658, -35429, -41282, -9387, -11936, -63824, -58158, -82523, -125227, -117556, -98955, -123902, -113952, -84216, -63454, -28941, 39392, 28192, -19852, -87308, -51831, -10150, -6780, -32849, -48295, -51497, -98904, -77891, -64238, -58247, -72768]
14956g2768l5040M6310M7162n211j5391L2897J8558M3083K4956j1198j6411L454
14944F0401o3019j6458L1365k40l013N2572M229k5714l6142m2876M2319K9177
14932C2601l230k6209k9951j4631J3355j3128l6446n706O1998M1313j8813n7111
14920e5958M790J18M5181n932k2293R270O5040p711l2548O509k7861J2671k187
14907a0911M758K0192j7370K7300j8069k5531l0267r74o263J8235K8104N5384
14895D4588j2234r1505K0009M2511l264R73Q014k9897m0580k411K6906j0376J4421
14882c2845P098q07J6227Q330K3021J8091n5399r712J6875J4233J3670k4053l9271
14869d4542n8579M5338R0560M3073R963o0587J3150N0400j5472k3382o2560L181
$$ y = [-72768, -107808, -61498, -14336, -19547, -34938, -2041, 16517, 59600, 84556, 73358, 56947, 60401, -2618, -19076, 12289, 12049, 9036, 61608, 65837, 40123, 3981, -38895, 3424, 32601, 29371, 3162, -26789, -41420, -28065, -41193, -77639, -83345, -21347, 19966, 1153, -55958, -51168, -51050, -5869, -11801, -34094, -24824, 40216, 32505, -43, 6466, -21395, -8724, -10911, -6153, 14039, -3331, 23969, 5900, -19631, -49898, -50872, -57135, -38900, -10796, 44588, 32354, -59151, -39142, 3369, 105, 1078, 9092, -20805, -61385, -63796, -36890, -47266, -32845, -25747, -26554, -10327, -1997, 21024, 39115, -16284, -25996, -9121, 5112, 18782, -5271, -44542, -103121, -57783, 32777, 75850, 85813, 25226, 38376, 88776, 73304, 49922, -12638, -9457]
14857i457M0212K8504n6660m2438J8800J0990R354O969P474o661k8743O248K3451
14844H043J6842p285k5166J230J239K2159N0171L6602m5323o2098o747j3356j8925
14831d2614L0610J345k8064J1548J7872O658K3044m3502N690L9946l419l8202
14819a9088k3052J5779M5586N357M2950j6622r266k8654m9429J1230M1736P111
14807B3638j4108k0483o490L2461J2935j2590j5722k964L4862K9379K3762j6503
14795F8177m0886N334J0747r0288k6450L720K8031J8852k7469L5506L0842n532
14783A0584m9573j8317j974M118j0057P0315O6439k860j6395m7058m4957J0202
14771b9533K501j3104k7345L3999k0786m6426j6312L3360J8656O9147K362o2075
$$ y = [-9457, 30755, 59259, 2599, -39839, -21039, -10049, -695, 6274, 13748, 7087, -21656, -15408, 8043, 24885, 17600, -7566, -6336, -5097, 17062, 67233, 103835, 58512, -3586, -10333, -23689, -42614, -12004, -10659, -38723, -27175, -9303, -2645, 20399, -23103, -17413, 22533, 19114, -19088, -42140, -26361, 19225, 24582, 67532, 50910, 41644, 12990, -36439, -25209, 16527, 23638, 9530, -10953, -17443, 15018, 27953, 15363, -359, -3323, 31539, 60918, 84680, 68177, 27291, 32625, 43372, -46916, -73366, -69646, -41615, -22763, -50232, -14726, 16116, 10584, -38989, -57306, -59280, -55162, -65219, 5096, 71535, 68675, 52280, 5222, -39735, -29533, -27032, -40136, -67481, -33482, -54268, -100694, -117006, -83646, -64990, 4157, 6519, -55556]
14759e5556m6436k8013N6618K4732l6554J6492K7472Q823j2861j743K1769M26
14747b4831j1462K9806J8838K5161r897o0532O797M0188k1020j5269N1360L4851
14735F3990k400M521m3946N661j7093j2342K0841j5369l9168j6249N920M7282
14723A648k927k137j8886l5989K5532K8349K9545L0225K9911j5565l0017q838
14711C0851L1128l4377m3216J9573n0418j3862k6959K162L7724j0895j5380K2461
14699e1208M165n2665j2398N3709L3996n43j3824M762K1320k6384L9588P555o7047
14686e8974K5109r534M1121j2993l2651O185k2790K2752L7555l0163L5724J6565
14674A7906l0789q284p33J9231J3375n93l7566l2141m3015j9048L9673L2205L5770
$$ y = [-55556, -101992, -130005, -73387, -48655, -85209, -68717, -41245, -32422, -45283, -47026, -25257, -24831, -36293, -6487, 12351, 37512, 27615, -32917, -26120, 14068, -6952, -22221, 29139, 63990, 61590, 66111, 22165, 27826, 10733, -1609, 19232, 3863, -35305, -51554, -45634, 1648, -1279, -3416, -22302, -58291, -32759, -4410, 25135, 55360, 85271, 69706, 39689, 30851, 61979, 27602, -15614, 3959, -46459, -60321, -87280, -85118, -47394, -58289, -73669, -51208, -47043, -99708, -112106, -58397, -24401, -24944, -38768, -34006, -12686, -39070, 518, 8073, -58974, -33865, -43399, -2278, -15271, -47922, -41737, -64527, -41775, -4220, -34383, 1341, 17906, -12883, -21167, -21900, -2669, 10706, 10113, -27453, -59594, -102609, -121657, -81984, -49779, -14009]
14661a4009K9826j0926m5910n4037K7947K8484J7991o226l0343k602N2590J9914
14649A2699m5643J9068M6793k9769k9081k7847N501L1278m5199o8413L3659L8620
14637e8334k5013K2900O3153k4657J1818J2944L5286J5351k0334p1551q947k1898
14625f9282n574n367k8955l661K0572K6198J0669o223j2652m3784K85L9289K0857
14612e7628P64L499L4822j8761o4381j297P4005M1581k2557q975J6813K1485j4489
14599D881j9049N969l9624j3411L2521k4091J0324j7813n2952J9185J6497M0205
14587c7358K8768R347O07j2938q740k6922j9355K0872r330j3633J5731q020k2367
14574h3338k868K0569P846L8111K0955k5851n7545K0831L2306J1461N275j6849
$$ y = [-14009, 15817, 4891, -41019, -95056, -67109, -38625, -20634, -26860, -57203, -59805, -7215, 12699, -32944, -13876, 32917, 3148, -25933, -53780, -48279, -17001, -62200, -130613, -96954, -58334, -83347, -60447, 2706, -21951, -10133, 2811, 38097, 53448, 33114, -38437, -47384, -69282, -74856, -80223, -109178, -112839, -92267, -66069, -55400, -61623, -74275, -118059, -117774, -78485, -57628, -56864, -53365, -18543, -37304, -101685, -102982, -28977, 12604, -9953, -18928, -2115, 19370, 4881, -14168, -8199, -47823, -61234, -28713, -52804, -42480, -60293, -113245, -94060, -77563, -37358, -8590, 757, 1364, -11574, -20314, -47236, -66591, -45719, -55049, -68682, -52951, -60971, -83338, -86206, -65637, -57791, -19680, 1275, -24576, -82121, -61290, -28984, -17523, -12248, -29097]
14562b9097j4098J0750k5396M513J6482M4265O41M9715j903l3834j9747o483n8380
14549f2572k7265L6017M7144o6444k6475O7774Q1785k5480m8157N8J1431r550
14537b1734k1771N094k692k3170l6357K7881M9379L0382L6224r753M09O902Q568
14524D9362k7133m3954k4323L696N7843K3646K4349O086n8387o3702j9826m114
14512g6457M2255k8430J5886M2712L6599N7270j003J9083j1284o9339j3470N6726
14500G0548l5255l9945q235j1468J3289K7721J5175K8487j4696k6587m9950K0304
14488a0612l5373m5083M0365J6129k166N1638M1920k9079k320L2307L5561j2957
14476H0330j6749m1533o122R087J9155o5959k9365n2874k5600j7595N6768P5621
$$ y = [-29097, -43195, -32445, -57841, -53328, -36846, 7419, 8060, 57775, 55872, 22038, 2291, -4192, -62572, -89837, -53820, -6676, -73120, -99595, -31821, 49964, 24484, -23673, -23615, -12184, -21734, -43505, -38411, -41103, -64273, -100630, -72749, -23370, 7012, 43236, 33483, 33892, 40794, 49362, 22229, -21725, -46048, -42352, 15491, 39137, 63486, 69572, 11185, -52517, -72343, -76457, -34202, -62632, -46746, -4034, 32565, 89835, 88832, 107915, 96631, 27292, 13822, 70548, 35293, -4652, -12887, -24355, -11066, 16655, 31830, 60317, 45621, 19034, -30916, -10612, -45985, -91068, -50703, -34574, -36740, 14898, 56818, 27739, 25419, 57726, 93287, 80330, 63581, 22048, 15926, 25013, 44168, -21791, -51156, -104030, -129630, -147225, -90457, -14836]
14464a4836N2621n510R726O8048J071j1466l5953j7568l3063o2231R44N0593n128
14451b752o4031m6173M5996M3408J6259k245q551o7291m981L8637K6041k2963
14439d8646j7627l198M8729R135k450J6226O425l5929l761P671n5238m812K9964
14426e3511K2924l760J4253N2708L2103J2601l9293j9368R910K8602J0199j3916
14414E3452k7140q299K9025K5494o927p596l4355m2241j2248k9163j0677N5561
14402a5114R375J6410J7788n5592L0016N6983J8808l1375J4966n6217j8678N0531
14390C7901j9786l5185M4384j3559J6824Q071j4441L1159K0364J1097k0223m9204
14378A7402n2302K9852K7823K1020J756j0908p924j469J3460m715J1694l9473
$$ y = [-14836, 37785, 32275, 42001, 110049, 111120, 99654, 63701, 46133, 13070, -49161, -48217, 2376, -2752, -66783, -112956, -66960, -23552, -7293, -9538, -18089, -85380, -90361, -51724, -25683, -48646, -66273, -69471, -20742, -11607, -14057, 2169, 8594, -27335, -31096, -23425, -78663, -83475, -53511, -30587, -34347, -20094, 32614, 64717, 77318, 38025, 18657, 28567, 57169, 67368, 53452, 26312, 18013, 47038, 72532, 65605, 58009, 23654, -18587, -30835, -59998, -70675, -15114, -5739, 10671, 28459, -27133, 2883, 59866, 78674, 47299, 62265, 6048, -12630, 37901, 18115, -17070, 27314, 13755, 30579, 38650, 24209, 55368, 75732, 86829, 66606, 17402, -34900, -5048, 22775, 43795, 45551, 34643, 26719, 25250, 38710, 33995, 45689, 6216]
14366F216l1524K6828J3490K740k0189Q118j9668l5216k1383k316L6385M6375
14354I856N816n6643k2832L4507L5431l9373N971M8196J2691k2124J274L754j2176
14341D348L1621O1692j0060j7231k6831k5648k2633j962l1612l1580L5656M6344
14329A2104l2578k4818Q001j147L3530Q5394N645m6964j5888K0910J8288K0807
14317H3284M079J8598k580R756K6153K5604J4945n8203m5336k9797J797L169n7018
14304e549k8232J7173K3486M1837k378o8539j1631J6930N8354m6741m9926j0028
14292f5244m86K9421k1987n132L9949L6404m361K8003J8130j5717k1522k7244
14280i786J9118J3818k5061m1374J9398j9437K0272J2330N084r715j8877r260
$$ y = [6216, -25308, 1520, 15010, 17750, -2439, 5679, -13989, -49205, -70588, -72904, -36519, 9856, 15672, -40971, -63803, -29296, 6135, -33238, -27267, 20929, 33620, 11496, 12770, 16524, 4348, 35969, 97661, 87601, 70370, 43539, 17891, -4742, -6704, -38316, -69896, -34240, 12104, -20474, -45292, -37291, -38438, -4908, 80486, 86131, 39167, 23279, 44189, 62477, 83284, 87363, 105961, 103381, 113137, 139290, 164894, 179839, 121636, 76300, 46503, 48300, 51469, -5549, -33781, -16608, 6878, 48715, 46337, -22202, -33833, -16903, 41451, -5290, -55216, -65244, -65730, -36309, -58296, -63428, -23479, 12925, 8564, 36567, 54697, 38980, 17458, -9786, 9332, 23150, -1911, -43285, -23887, -43324, -23052, -10722, -5638, -15353, -34230, -43490]
14268d3490J3299J7031l933R61J504K256J3727l943j7337L2652j256K4869R535
14255D5875k6209K454k3284j62l1145l6189K289J8701P2943M8702k1168m9460
14243C347k8623j6702J848K4204K3767L2908n7726j9276K6398n1525n2497r57
14231a14834N2712K7446k0018R542K0120K3213J8819j725R720j0298l5350m723
14219b5376J8685K0084K4277j6980j3633M4489l7124l8679j0988M5819N2207J0256
14207G3037l7267m8324j0713k0686J9836J8851n1666m1937K4271L0494J3504Q299
14195b2301R496M1804K0903j2752j0782n2531j4676J3201j5873k5218l7929N3808
14183e2850O4621L3565k3837J788J0840k55k5318J4834m0347p1855o466L044J6504
$$ y = [-43490, -30191, -13160, -17093, -16132, -14628, -12372, 1355, -2588, -19925, 12727, 11471, 36340, 45875, 19666, 22120, -1164, -1326, -32471, -68660, -66371, -47670, 25273, 73975, 52807, 3347, -25276, -41978, -40130, -15926, 7841, 40749, -16977, -36253, -9855, -61380, -113877, -114834, -62122, -34676, -54694, -45152, -25032, -1819, 17000, 15275, 24995, 14697, -20653, -25376, -6691, 13393, 37670, 20690, 7057, 51546, 14422, -24257, -35245, 10574, 62781, 73037, 35770, -12554, -23267, -43953, -24117, -5266, -56932, -98869, -74598, -44104, -30600, -22301, -12805, 28999, 49902, 37150, 26368, -26163, -40839, -27638, -43511, -68729, -106658, -52850, 11771, 45336, 21499, 23287, 34127, 33872, 8554, 23388, -16959, -88814, -95280, -92236, -75732]
14170g5732L6449j3294k5078L4020P214K7275n341k4344j6329J7937j2258p989
14158e7470K6414J9039m0222l512K8176j0202q146N189k2624J4110k2944J3769
14146e8423P3644L8674j1709K4644j3938o5220m8566m1272L5622L3505J3488k816
14134b2367K1515J5577J4121l5512m131O7016j1742j9982j266Q162n6398l2011
14122e7018L3875o59n218J2837J4519J4492K2208j2372Q352J2936M054l9690q02
14109G514L3543l6745l6306R948L7100N77n297M295J0724R706n2130L470K0290
14096F689l8179n79O0415L8502k6872n7668l9617l966k796N5707K8792J4701l2975
14083B154p7550L3950J7693L5013J3379j8756L5062K4134n0110J3247J6653k5824
$$ y = [-75732, -39283, -52577, -77655, -43635, -36421, -9146, -14487, -38831, -55160, -37223, -49481, -57470, -31056, -12017, -52239, -55751, -27575, -37777, -45923, -40734, -63358, -49248, -72192, -58423, 15221, 53895, 42186, 66830, 52892, -12328, -60894, -102166, -66544, -33039, -19551, -22367, -852, 14725, 28846, -6666, -10797, 56219, 44477, 24495, 23229, 31391, -25007, -57018, -23143, -23802, -29020, -16183, -1664, 12828, 35036, 22664, 31016, 43952, 48006, 8316, 7514, 41057, 4312, -31994, -22046, 15054, 15631, 10334, 14629, 25353, 35059, -17071, -13601, 6689, -31490, -32069, 28346, 66848, 39976, -17692, -57309, -61275, -64071, -8364, 20428, 35129, 2154, -75396, -41446, -23753, 11260, 24639, 5883, 40945, 65079, 14969, 28216, 44869, 19045]
14071A9045k9010k9362m6045J4097J7006K407j539L6145J7174m051m6473o0223
14059a10829N9687P4484L9062J5642K4551k1830j8423K0697K8j8777m5667j3556
14047E069J6838j5910J813N664n4628R687J5469J3819N1851K3644j4933j4338
14035D4045j6608K6479J7415m3836l1647R529L7209P376l178k2580K2183K0192
14023F6579m6101M2670J9408l5376l3405M2640j394k9758m9451L0722J1427m238
14011A3723N762k7268n8229M6240K9626o595L4806M3770M1460j1178m4608n9354
13999H155L5199J8381l4389k0350J6389K2635L5598J706p824L6420r346l4065
13987F8509n9041O174K998j9191M8890J0454K7947n1944j7229k2684m367J1538
$$ y = [19045, -9965, -39327, -85372, -71275, -54269, -51862, -53401, -17256, -82, -4133, -50606, -110829, -51142, 23342, 62404, 78046, 102597, 80767, 62344, 83041, 83069, 64292, 18625, 5069, 21907, 5997, 7810, 13474, -41154, -31467, -15998, -2179, 49672, 73316, 58383, 44045, 27437, 53916, 71331, 27495, -4152, 5377, 42586, 49962, 46784, 24204, 46387, 66579, 20478, 63148, 82556, 47180, 13775, 56415, 55021, 25263, -24188, 6534, 17961, 13723, 19485, -7783, -66012, -19772, 9854, 3259, 38065, 81835, 123295, 112117, 67509, 8155, 43354, 61735, 27346, 6996, 23385, 46020, 81618, 83324, 75500, 111920, 102574, 68509, 9468, 15642, 18640, -551, 48339, 58793, 86740, 34796, 17567, -5117, -9484, 2054]
13975B054l836l505J4775J9873P459K883j3340K642J0483J8986m027n9520r468
13962a4541O2317j4140l559L3655l557J7344j5388r843R594J4673K1425o5348
13950C2632j06222M751Q9236N5073J4345m0839j1790l6571J348N7285L2877j020
13938I1105K3361K1596k3911m6454j7714l4469M2553M0958p7849j9696J5661J2373
13926B7514P3964j1943l8149r951m3192k4852J0735O916M7643O3664k8329k3719
13914E0301L8782L4179L5383M2328l9120m7414R919J9561k4232l5944l6820J154
13902D8077L9461M6059J9876k6715J9262l337k1149j0193o2028j7648N5777L4922
13890A22364l4622m3060m0647n729l182K3132L3570k6685L716L6210p55P6220
$$ y = [2054, -1782, -5287, 9488, 29361, 36820, 39703, 26363, 29005, 39488, 58474, 54447, -5073, -14541, 47776, 33636, 30077, 63732, 60175, 77519, 62131, 52288, 61882, 76555, 97980, 32632, -73590, -68839, 20397, 75470, 89815, 48976, 37186, 615, 1963, 59248, 92125, 91105, 114466, 136062, 112151, 65697, 47983, 13514, 56067, 97025, 19176, -520, 15141, 27514, 101478, 89535, 51386, 41435, -1757, -26609, -15874, -8958, 38685, 102349, 74020, 50301, 89083, 123262, 158645, 200973, 161853, 114439, 124358, 143919, 119687, 83743, 46923, 48077, 87538, 133597, 153473, 126758, 146020, 142683, 121534, 111341, 49313, 31665, 87442, 122364, 87742, 44682, 4035, -1694, -4876, 18256, 51826, 25141, 28857, 65067, 64312, 140532]
13878A40532l1091k1878k9361k5510R572J2715K0167n1976k3622N2228N846j7651
13866C9971N494j6158K595K4230N2626K4978l6162k2883m8173k3485K3563J6393
13854D2989K1246L273K3373l7335L6130K092J3116J7247Q625k962j2567J2876
13842A28103K2997J5620l3072n7862j2458l400O230K8940L317K7184j9177k9609
13830G6813k2988m699K5401l6928k0406J232L6163K3424n059m5853k5295L3532
13818C5337k2679J3619L1714j2888L340P396j3937m7185j9118r356K9677J7668
13806A3588M5982K0021m6470K5268N3437m2396K583M4322k9476j8216l844N1752
13794A16551M639j7461k4219j0238J4025k6880M7447n2303j7248M1424M3652M569
$$ y = [140532, 109441, 87563, 58202, 32692, 42264, 54979, 75146, 23170, -452, 51776, 57622, 39971, 45465, 29307, 31902, 56132, 108758, 133736, 97574, 74691, 26518, 3033, 26596, 42989, 64235, 67508, 90881, 53546, 89676, 91768, 104884, 122131, 130756, 127794, 115227, 128103, 151100, 166720, 133648, 75786, 63328, 59928, 66158, 95098, 98415, 125599, 106422, 76813, 53825, 49126, 74527, 37599, 17193, 18425, 54588, 78012, 72953, 27100, 1805, 35337, 12658, 26277, 57991, 45103, 48443, 55839, 41902, -5283, -24401, -33757, -4080, 13588, 59570, 79591, 33121, 58389, 111826, 69430, 72013, 116335, 86859, 68643, 64799, 116551, 121190, 103729, 79510, 69272, 83297, 56417, 103864, 51561, 34313, 75737, 119389, 123958]
13782A23958j1367J563J3718M524j1665M796l2194m6878J3922j9503K2955m453
13770E9376p319O7388O2165l072o5769k9265L166k50k8204K4539M8532k629o7010
13757F1648n5532l9189j0307L5240M669p821L4671L110J1256O163N84O938R5l3516
13743A8009q396J5511N189N7772K5096k4825j6524p694k1839L6664M700J0487
13731I4150k541J9254m870k5603L3989L3100q944R525l47j8926J7220J3145J7470
13718A76622M0789L0607r659L3816l8594k9625J1897o883N527K800n959K2374
13706B33712J287J2342N9272N7824Q061P6062Q5157Q3130R2997R7744l94p811
13694G99383k9582m5202o745o0881r3828m6746n3042k8261k425n1716m0038l7558
$$ y = [123958, 112591, 114154, 127872, 132396, 120731, 125527, 93333, 46455, 60377, 40874, 63829, 59376, 52057, 119445, 181610, 178538, 112769, 83504, 86670, 86420, 58216, 82755, 131287, 128658, 61648, 6116, -33073, -43380, -8140, -3471, -11292, 23379, 26489, 37745, 43908, 44492, 51430, 51525, 18009, 9613, 25124, 30313, 88085, 113181, 88356, 71832, 64138, 42299, 78963, 83663, 94150, 91609, 110863, 105993, 80390, 114379, 147479, 138535, 148060, 147713, 128787, 146007, 159152, 176622, 217411, 248018, 238359, 272175, 233581, 203956, 215853, 208970, 214497, 217297, 211338, 233712, 234999, 247341, 306613, 364437, 372498, 448560, 533717, 616847, 709844, 807588, 807194, 799383, 769801, 724599, 717854, 656973, 563145, 516399, 463357, 435096, 432671, 380955, 340917, 303359]
13682C03359J8438O475P190R630o1763l6213n650q808J5514k1437p9268j1479
13670A35988L4500j3474l0060j3248j1227J2370K7207M1636J1249j4197J7673
13659A98417L2508j1617l5077j1245j8139r806J1119J3473L1485P530j5566k6497
13647A66585o573n0291j3129j2940N7700J8035j8222K5524M268J1540J9750l3972
13635A68275m112K742K6852K8007j39k5724k0704L2222m947k3925j3446l4k1352
13622A43715k4192j6159J7958L9657m3741L844K4927j4245L24J5041O3844J5917
13610B26890j3973k5876N33L4097N230j0799R15j8721o5341r098L2662P8790L1338
13597B66647l3911n0573J4747K8981K7593k5729n4711m6684q179k3133M7201J6041
$$ y = [303359, 321797, 328272, 335462, 345092, 283329, 247116, 241466, 232658, 248172, 226735, 147467, 135988, 170488, 157014, 126954, 113706, 102479, 114849, 142056, 183692, 194941, 180744, 198417, 230925, 219308, 184231, 172986, 154847, 145041, 156160, 169633, 201118, 208648, 193082, 166585, 160012, 109721, 96592, 83652, 141352, 159387, 141165, 166689, 170957, 182497, 202247, 168275, 164163, 166905, 193757, 221764, 221625, 195901, 175197, 207419, 202472, 178547, 165101, 165067, 143715, 119523, 103364, 121322, 160979, 117238, 121082, 146009, 131764, 132088, 147129, 210973, 226890, 212917, 187041, 187574, 221671, 226901, 216102, 217017, 198296, 132955, 123857, 156519, 235309, 266647, 232736, 182163, 196910, 225891, 253484, 227755, 173044, 126360, 118181, 95048, 142249, 158290]
13585A58290M9408L254n8193M179p162m1501K1705K7238j1633k1221J9693L8088
13573A82145L551k398o161m158j9327p552J1892J1263j2733N3775M50k2794J3733
13560B01686J1209J5685m3431n7069K4999K7378M1343j3344j5243K6793n2933
13549A67073k6680L1742K6154J1075J0505l0379m5743J5418j1941M8827K564j9994
13537A78621j2886K3185L1679k9080Q393N2205L4411m7180n3363k3817k9103m4446
13525H8619L6884L2172J3228M6671L8162j6475j1652j1033j1290N028q123k8377
13513A73814K1341L2115m3252j2637m079J8593k5879J3453K3126O6987M2870K0914
13501C27366r483J7875K1043j5849k7590m1830L5157L9913J4506l1132l4137j2841
$$ y = [158290, 207698, 210952, 152759, 156938, 149776, 108275, 129980, 157218, 145585, 124364, 144057, 182145, 185696, 183298, 177137, 172979, 153652, 146100, 157992, 169255, 156522, 210297, 210747, 187953, 201686, 212895, 228580, 185149, 128080, 153079, 180457, 221800, 208456, 193213, 220006, 167073, 140393, 172135, 198289, 209364, 219869, 189490, 143747, 159165, 147224, 196051, 198615, 178621, 165735, 188920, 220599, 191519, 199912, 252117, 286528, 239348, 185985, 162168, 133065, 88619, 125503, 157675, 170903, 217574, 255736, 239261, 227609, 216576, 205286, 210314, 202191, 173814, 195155, 227270, 184018, 171381, 167302, 185895, 160016, 173469, 196595, 263582, 306452, 327366, 317883, 335758, 356801, 340952, 313362, 271532, 306689, 346602, 361108, 329976, 295839, 282998]
13489B82998J9143k7406j1924R746q1257J039J7235k3797J7815k0950k8767L3549
13477A87424J9073l4015K7073o588j6271M581J4632J9149M4262n8631m8102N3034
13465B05621K5818j4327K0534j5792j6239l1375J7023L0374l3551J4046p814K7869
13453B22187M6381k3794l9205o01p834k508J0550L3795J8164n7642p4436N0248
13441A75305M5531K3806J348l783p2558j3074N4429L73m9445j6170P857Q931m0710
13428A21840j3593k2541K0898L1276K9496N6595J4430N340K9344K4633j8205m9040
13416B30473m4032L1041J0328k5035m6413m43N1599m124j1409K943P918O5827
13404B68673K3733P922j0822k5436o0478L462K1361m705J1546n36j1192L0346
$$ y = [282998, 302141, 274735, 262811, 272557, 191300, 192339, 209574, 185777, 203592, 182642, 153875, 187424, 206497, 172482, 199555, 192967, 176696, 181277, 195909, 215058, 259320, 200689, 152587, 205621, 231439, 217112, 237646, 221854, 205615, 174240, 191263, 221637, 188086, 202132, 194318, 222187, 268568, 244774, 205569, 204968, 197134, 194626, 205176, 238971, 257135, 199493, 125057, 175305, 220836, 244642, 245990, 242207, 169649, 156575, 211004, 211377, 161932, 145762, 153619, 162550, 121840, 108247, 85706, 106604, 137880, 167376, 223971, 238401, 243741, 273085, 297718, 279513, 230473, 186441, 217482, 227810, 202775, 156362, 155919, 207518, 203394, 191985, 194928, 202846, 268673, 292406, 300328, 289506, 264070, 203592, 207054, 228415, 223710, 235256, 234720, 223528, 253874]
13392B53874K2916j2031J946j1079k3706m5035j1346k275M415N8658L1394K1199
13380B88930j1675J0008K6244l773J6640l5502n4419l3425l231M1616M1235J2730
13368B95378j2746L4911j9045l5360o774P398O4605L0324K72l7194j2211k1296
13356B88262k8087j9691l9648P57L6085N7348k733n3461L1375K6852L79Q74l1243
13343B67069k9464M8930k3308k8675j9161j8315m988k1819r665R0112K7041J2337
13331B90094J5408k8713l5038K8106m292o017j5894J9021J8974J335k1608k0162
13319B41214M5406j2831M032k0353L95K4137l4199k8992N0993Q9751L5161j1849
13307C82865m314o986o0918n6582k2955o862P9222p935r070M806J2913j4132J8920
$$ y = [253874, 276790, 264759, 266705, 255626, 231920, 186885, 175539, 173264, 177679, 236337, 267731, 288930, 277255, 287263, 313507, 309734, 326374, 290872, 236453, 203028, 199797, 241413, 282648, 295378, 282632, 317543, 298498, 263138, 256364, 263762, 328367, 358691, 358963, 321769, 309558, 288262, 260175, 240484, 200836, 201593, 237678, 295026, 292293, 238832, 270207, 297059, 297438, 298312, 267069, 237605, 286535, 263227, 234552, 215391, 197076, 192088, 170269, 160604, 250716, 277757, 290094, 305502, 276789, 241751, 269857, 265565, 259548, 243654, 262675, 281649, 282984, 261376, 241214, 286620, 273789, 277821, 257468, 257863, 282000, 247801, 218809, 269802, 359553, 394714, 382865, 378551, 371565, 310647, 254065, 231110, 224248, 303470, 295535, 286465, 291271, 304184, 290052, 308972]
13294C08972M4515l4725l2865m2512J7144O0556M0953k6839l2584O152M8265k2714
13282C34318j8891N3412K9728q27l9299k5415N023J2710K1896o1523j2348N9566
13270C58350k8789q025J8558n302p788J862J5807k939M2902J2048k0380j5115
13258C61189n4704o618L6513O7298l632j5841K5952l1780m7241j1243l690k3035
13246B93168q235J0383L3909Q3613K4539m3240Q789J2140J4640Q903j6834k8947
13234C92828q239j6698P856J5366N0521n806R207n16k782j5411l1504k6875O8297
13221D36244K1144n1534m6540N845K0010q063J4552J1229o589K1427K2678L102
13209D43505J8527Q100J7655j2588Q864j969M369j9748Q552n143n4698L7843Q871
$$ y = [308972, 353487, 318762, 285897, 243385, 260529, 321085, 362038, 335199, 302615, 308767, 357032, 334318, 315427, 368839, 398567, 397740, 358441, 333026, 338049, 350759, 372655, 311132, 298784, 358350, 329561, 321536, 340094, 334792, 327004, 328866, 344673, 341734, 384636, 396684, 376304, 361189, 306485, 299867, 336380, 403678, 400046, 384205, 410157, 378377, 331136, 319893, 316203, 293168, 284933, 295316, 329225, 412838, 437377, 394137, 402926, 415066, 429706, 438609, 421775, 392828, 384589, 367891, 375747, 391113, 441634, 435828, 445035, 444519, 441737, 426326, 394822, 367947, 436244, 457388, 405854, 359314, 365159, 385169, 377106, 391658, 402887, 396298, 417725, 440403, 443505, 462032, 470132, 487787, 475199, 484063, 482094, 486463, 466715, 475267, 470124, 415426, 453269, 462140]
13196D62140J7780J7495j4697j8136n6748r5008k449N3161N2001L0927M8323j6226
13184D78563l6036l8946j4304J6833K9709M2548L4499k676j8529m3377l3116O9546
13172D84714M7247m2657j4871j5443l786N583J4104J1516J5129K8766O327l756
13160E32873j4277K5180K0236M7532k930r6604l2981J584K7045J0468k1333n912
13148D90881J3281O1480J3551k1314j3025n57M1597j8580K2678L2228l7100m9245
13136E35875l1683n9192j7933k2459P4042Q2195L2468K3497r165j6726J0207j7799
13124E83327p439K8533l8072j8724k0871j8581J0228J8785M5162m254k3732L8576
13112E92938O0758N544l6177o805Q203L4877k0242o3413j9852R702L155Q761J3693
$$ y = [462140, 479920, 497415, 482718, 464582, 407834, 312826, 310377, 363538, 415539, 446466, 494789, 478563, 442527, 403581, 389277, 406110, 435819, 478367, 512866, 510190, 491661, 448284, 415168, 484714, 531961, 489304, 474433, 458990, 455204, 460787, 474891, 486407, 501536, 530302, 536629, 532873, 518596, 543776, 564012, 611544, 608614, 512010, 479029, 480613, 507658, 518126, 496793, 490881, 504162, 565642, 579193, 557879, 544854, 544297, 585894, 567314, 589992, 622220, 585120, 535875, 504192, 445000, 427067, 404608, 478650, 560845, 593313, 616810, 607645, 590919, 601126, 583327, 575888, 604421, 566349, 547625, 526754, 508173, 518401, 537186, 582348, 578094, 554362, 592938, 653696, 659240, 623063, 616258, 624461, 659338, 639096, 575683, 555831, 565533, 568688, 577449, 591142]
13099E91142j2876k9257Q951L5619j1867r561L1079m7497o8071M2495m968J1544
13087E36733J3038m908K340k2027K0013L1705N009q8M0361L6838m6761O811J965
13074F21029R768k8245L146O4181K3339k5875j4051j2314m2092L4944J5000j1887
13062F36943l783J8389M1581J425K4218l3177k1077M922k1367q454J327K4550
13050F65497j5070j1588J9741k459j1967q115j5588j6786k713j6094L495P5348
13038F63701N0230L499j0972L185L1551k3977l6202J8056J3127M2731m5167o609
13026G03153n337K7381L5980M3391J8910l0973k242p513n3330K647R397l1824
13014G09640K6296J2628m8857K8931L5564J6799k6438k8212K6802K9450R068r638
$$ y = [591142, 578266, 549009, 557960, 593579, 581712, 572151, 603230, 555733, 487662, 530157, 525189, 536733, 549771, 544863, 547203, 525176, 545189, 576894, 581903, 581815, 622176, 659014, 612253, 619064, 621029, 630797, 602552, 605698, 669879, 693218, 667343, 653292, 640978, 598886, 633830, 648830, 636943, 633160, 651549, 693130, 694555, 718773, 685596, 664519, 669441, 648074, 639620, 640947, 665497, 650427, 638839, 658580, 656121, 644154, 636039, 620451, 603665, 600952, 584858, 588353, 663701, 713931, 717430, 706458, 709643, 741194, 717217, 681015, 699071, 712198, 754929, 709762, 703153, 697816, 725197, 761177, 804568, 823478, 792505, 790263, 782750, 729420, 732067, 741464, 709640, 735936, 748564, 699707, 728638, 764202, 781001, 754563, 726351, 753153, 782603, 791671, 782033]
13002G82033Q333j2651L256O235l030Q010j2298J2681l5707Q24K1304l6604K5344
12989G67730J5729N6114k1419j4810l0237N0186L5644l2314J4158j1303J1695
12978H41173m4391l8145K0210L6803l0875k2159K1551M6484K288J640m8881l7416
12966G48282J2666L1869K3378J7755L7943L541p642J0253M2868Q48k1355L5564
12954I35970m178L6855n916n4856J333r662j5273k5337K487M9188K4836m111l4724
12941H96612m1779l329K6348L3156N101j66j1573Q873K7041j8722j4347K2954
12929I30169l009J1885P46M2383K1164r971K3093J0516l2417m7795J3852L9657
12917A000273L680j0424N7519m466m1881l2614j733Q600M4154j3432j3318m6243
$$ y = [782033, 790366, 777715, 780971, 787206, 784176, 792186, 779888, 792569, 756862, 757686, 778990, 742386, 767730, 783459, 839573, 818154, 803344, 773107, 823293, 858937, 826623, 840781, 829478, 841173, 796782, 758637, 778847, 815650, 784775, 762616, 784167, 830651, 832939, 834579, 785698, 748282, 760948, 792817, 816195, 833950, 871893, 875434, 867792, 878045, 920913, 921761, 900406, 935970, 931792, 968647, 962731, 907875, 909208, 899546, 884273, 858936, 861423, 910611, 935447, 931336, 896612, 854833, 851504, 877852, 911008, 916109, 915943, 904370, 913243, 940284, 921562, 907215, 930169, 927160, 939045, 939791, 982174, 1003338, 993367, 1016460, 1026976, 994559, 946764, 960616, 1000273, 1003953, 993529, 1051048, 1046582, 1004701, 972087, 970354, 978954, 1023108, 1009676, 996358, 950115]
12905I50115J8912J7986K3316N0815L0357K9525n1205J1570K5980N141m4155K5682
12893A094039K7454k1375n0526K0500N6061K5223k9273j9398k2410k3394j1424
12882A045477k25K5290j8801j6405L116j230N69M4551L7386K3546J2691K2233
12870A178198L68J8060k672Q417n037L47L4856P777m3330L1837l297k7134j2384
12857A186006P431J8891L5092K2902l2130M4268M2699j6669n4120m5247j5760
12846A193363J0432n434N2524n832K209o57m959J0218O0619N3048l5202q3924
12834A246405l4435L1447K7796N9372K5855j4893K986q215L8309L2268Q663R546
12822A425104L0924K2792j7778m7612o421l39l7019Q259M1013Q959k710P5367
$$ y = [950115, 969027, 987013, 1010329, 1061144, 1091501, 1121026, 1069821, 1081391, 1107371, 1112512, 1068357, 1094039, 1121493, 1100118, 1049592, 1070092, 1126153, 1151376, 1122103, 1102705, 1080295, 1056901, 1045477, 1045252, 1070542, 1051741, 1035336, 1038452, 1037222, 1037791, 1082342, 1119728, 1143274, 1155965, 1178198, 1178566, 1196626, 1193954, 1202371, 1197334, 1197681, 1232537, 1240314, 1196984, 1228821, 1225524, 1198390, 1186006, 1193437, 1212328, 1247420, 1270322, 1238192, 1282460, 1325159, 1308490, 1254370, 1209123, 1193363, 1203795, 1198361, 1250885, 1245053, 1247262, 1246605, 1241646, 1251864, 1312483, 1365531, 1330329, 1246405, 1211970, 1243417, 1271213, 1330585, 1356440, 1341547, 1344533, 1336318, 1374627, 1406895, 1415558, 1425104, 1456028, 1478820, 1461042, 1413430, 1407009, 1406670, 1369651, 1377910, 1418923, 1427882, 1425172, 1500539]
12810A500539M0846q013O7J8575n082n4978k2060J3388M989j7573L6927K2910
12798A530535o9746j688K8575m098J1452L8721K1469M804J3668l3612J8759l533
12786A555306O892J2254L3870j1170N0149K4704q450K3871N3599K4732l7176O211
12774A734792J1788m5934K0416P3171k4343o5868m3358L2823M5235M2514K5054
12763A806290J1887k2643j5407k6780m9073L6562N6534L527k857K1848Q817J3993
12751A842698R690J6056K8765N7990K995k4019j754l920P3199r08n2016J8118
12739A966894k9898K1618M251J7007M6319L3457m174K1725N1733n3439m358M5827
12727B116962L0632L5097J4037k1196j9591O019P412J1017j498J8356M4581J8856
$$ y = [1500539, 1541385, 1533372, 1533439, 1552014, 1546932, 1491954, 1469894, 1483282, 1488271, 1470698, 1507625, 1530535, 1460789, 1459101, 1487676, 1483578, 1495030, 1533751, 1555220, 1560024, 1573692, 1540080, 1558839, 1555306, 1562198, 1574452, 1608322, 1597152, 1647301, 1672005, 1663555, 1687426, 1741025, 1765757, 1728581, 1734792, 1746580, 1700646, 1721062, 1794233, 1769890, 1704022, 1660664, 1693487, 1738722, 1781236, 1806290, 1818177, 1795534, 1780127, 1753347, 1704274, 1740836, 1797370, 1800897, 1798040, 1819888, 1828705, 1842698, 1852388, 1868444, 1897209, 1955199, 1958194, 1934175, 1932421, 1928501, 2001700, 2000792, 1948776, 1966894, 1936996, 1958614, 1962865, 1979872, 2026191, 2059648, 2055474, 2077199, 2128932, 2075493, 2071135, 2116962, 2147594, 2182691, 2196728, 2175532, 2155941, 2161960, 2169372, 2180389, 2178891, 2197247, 2241828, 2260684]
12715B260684j655l0401J1164J0886r877L3449L7754L1169M0454l693J6427M7662
12703B444023l1113M088L7803K5013j505K7320K2126l9950L1955M1485J2740M3476
12691B617461K5008l090l2717N765O7278N9891J8430j0127l0595O627L9341L0773
12679B794045L2342n898k3660N2750P6818N4964R6670P661k4977J5715L6225P184
12667C119839J586M7559Q3708J27178Q2171Q5505J44615J96073K12879K09449
12657D310562J67309J34820J43029K7703m3783m2350j39703j40774j52194j22668
12647D141951q1269j05176l9677L7613k8532m4990N9420J4346o7312r1455K908
12636C797827L4973O0505J4739P446J0111Q0705k1839J1912P1514q931J3569J8946
$$ y = [2260684, 2259029, 2228628, 2239792, 2250678, 2240801, 2274250, 2312004, 2343173, 2383627, 2379934, 2396361, 2444023, 2412910, 2416998, 2454801, 2479814, 2478309, 2505629, 2527755, 2487805, 2519760, 2561245, 2573985, 2617461, 2642469, 2639379, 2606662, 2612427, 2679705, 2739596, 2758026, 2747899, 2717304, 2723931, 2763272, 2794045, 2826387, 2820489, 2796829, 2849579, 2926397, 2981361, 3078031, 3085692, 3060715, 3076430, 3112655, 3119839, 3121425, 3168984, 3252692, 3379870, 3462041, 3547546, 3692161, 3888234, 4101113, 4310562, 4477871, 4612691, 4755720, 4783423, 4739640, 4697290, 4557587, 4416813, 4264619, 4141951, 4060682, 3955506, 3915829, 3953442, 3924910, 3879920, 3939340, 3953686, 3886374, 3794919, 3797827, 3832800, 3893305, 3908044, 3915490, 3925601, 4006306, 3984467, 3996379, 4067893, 4058962, 4072531, 4091477]
12624D091477L8844J1401J3254L9332m209l8522K9817N2270J7739L8220N4707
12613D344330L8200N0459N3516P0138O3779m670k3507K7419O373K5683L9774N1696
12601D743190N1713J8289M0415J8297o705P2387K6474M787O4439L1558K857J4422
12589E082123O2928N8018M8648O9642R7905J2549J1489K6207M8394N5321L5269
12578E608493K4833J7442Q1919J12675M0094J1435M2820N6342J8261O1140N2989
12567F128443N3263Q3045N1929J00057J12010N3332P6903O5883O4531J8277M0687
12556F848360R8061M1580N1688N4450j5074N0010R1030J09795R9822P9701O5428
12545G574851K6432L8451R9387L5388O4218R1305M3164L3350N3202J18219O0188
$$ y = [4091477, 4130321, 4141722, 4154976, 4194308, 4190099, 4151577, 4181394, 4233664, 4251403, 4289623, 4344330, 4382530, 4432989, 4486505, 4556643, 4620422, 4615752, 4592245, 4619664, 4626037, 4651720, 4691494, 4743190, 4794903, 4813192, 4853607, 4871904, 4865199, 4937586, 4964060, 4968847, 5033286, 5064844, 5067701, 5082123, 5145051, 5203069, 5251717, 5321359, 5419264, 5431813, 5443302, 5469509, 5517903, 5573224, 5608493, 5633326, 5650768, 5732687, 5845362, 5885456, 5896891, 5939711, 5996053, 6014314, 6075454, 6128443, 6181706, 6264751, 6316680, 6416737, 6528747, 6582079, 6658982, 6724865, 6789396, 6807673, 6848360, 6946421, 6988001, 7039689, 7094139, 7079065, 7129075, 7220105, 7329900, 7429722, 7509423, 7574851, 7601283, 7639734, 7739121, 7774509, 7838727, 7930032, 7973196, 8006546, 8059748, 8177967, 8238155]
12534H238155J12447J05741J48835J09143M8226R6296J09824O9456J05427J07564
12524I251114J25306J20094J31657J55722J32938J35767J49612J66049J61038
12515A0529297J61661K60006L20193L85325M54183M61007N49757N55434M61624
12506A4138487L43237K15699J14445k1307j02299j73377k32277j81210j88256
12497A3913142j42436j5094k940M3064P0414P9039R6685J06071O5591P4549J16392
12486A4404477J12428N0974J12996O8563J06873J17911J16896J66206J35899J04021
12476A5497244J01174J51859K21054J47452J22052J35267J26335J53352K36038
12467A6891827J73744J33148J49452J68818J47080J98676J74211J54552J65563
$$ y = [8238155, 8350602, 8456343, 8605178, 8714321, 8762547, 8858843, 8968667, 9038123, 9143550, 9251114, 9376420, 9496514, 9628171, 9783893, 9916831, 10052598, 10202210, 10368259, 10529297, 10690958, 10950964, 11271157, 11656482, 12110665, 12571672, 13121429, 13676863, 14138487, 14481724, 14697423, 14811868, 14790561, 14688262, 14514885, 14282608, 14101398, 13913142, 13770706, 13755612, 13752672, 13795736, 13866150, 13945189, 14041874, 14147945, 14213536, 14288085, 14404477, 14516905, 14567879, 14680875, 14749438, 14856311, 14974222, 15091118, 15257324, 15393223, 15497244, 15598418, 15750277, 15971331, 16118783, 16240835, 16376102, 16502437, 16655789, 16891827, 17065571, 17198719, 17348171, 17516989, 17664069, 17862745, 18036956, 18191508, 18357071]
12458A8357071K01127K18760K00571J36602J23259J37020J13556Q6961J53648
12449A9728575J70211J07293J51362J27004J20756J05342Q7059J20425J81615
12440B0899642J64616J49891Q0761R5250Q0640J39426Q2285N1636J26444J20447
12430B1991038Q6191J00829Q3593N5639L0671O3062J20196J03996M7302O5988
12420B2748505J00984O9551J2344J2191K2392R6322P5493K3802J9342k9j4783
12409B3166114L2991J6270L01o9222r9855j28564j38240j33056p0294j11708j46470
12398B2318267j49532j17887p3302j16566r7633r6723j30987j74935j47236j64110
12388B1049356j75520j45039j29971j37492j36302j82702j84213j30283j64585
$$ y = [18357071, 18558198, 18776958, 18977529, 19114131, 19237390, 19374410, 19487966, 19574927, 19728575, 19898786, 20006079, 20157441, 20284445, 20405201, 20510543, 20597602, 20718027, 20899642, 21064258, 21214149, 21294910, 21390160, 21470800, 21610226, 21692511, 21744147, 21870591, 21991038, 22077229, 22178058, 22261651, 22317290, 22347961, 22411023, 22531219, 22635215, 22682517, 22748505, 22849489, 22919040, 22931384, 22943575, 22965967, 23062289, 23137782, 23161584, 23180926, 23180897, 23166114, 23199105, 23215375, 23215676, 23146454, 23046599, 22918035, 22779795, 22646739, 22576445, 22464737, 22318267, 22168735, 22050848, 21977546, 21860980, 21763347, 21666624, 21535637, 21360702, 21213466, 21049356, 20873836, 20728797, 20598826, 20461334, 20325032, 20142330, 19958117, 19827834, 19663249]
12379A9663249j45819j09861k13745k13340j62639j28380j45529q3104j40295
12370A8320537j51142j29132j06869o9712j12786j41356j33826j48453j63585
12361A7163676j62076j34891j95003j83907j51821j73120k16785j53195j32455
12352A5660423j74407j63884j79834k10245j47661j14941j57491j87738j64921
12343A4159301j65819j62952j61322j72607j68641j51501j69089j43783j45007
12334A2718580j36817q9595j84150j49447j38731r1214j21586r4088r2283j73824
12324A1446845j51123j29887j81857j70782p8627m4280q5630j27398j25148j31195
12314A0220918j27383j15413r3413r1541q9963j42248j03625j41410r6811k2585
$$ y = [19663249, 19517430, 19407569, 19193824, 18980484, 18817845, 18689465, 18543936, 18460832, 18320537, 18169395, 18040263, 17933394, 17863682, 17750896, 17609540, 17475714, 17327261, 17163676, 17001600, 16866709, 16671706, 16487799, 16335978, 16162858, 15946073, 15792878, 15660423, 15486016, 15322132, 15142298, 14932053, 14784392, 14669451, 14511960, 14324222, 14159301, 13993482, 13830530, 13669208, 13496601, 13327960, 13176459, 13007370, 12863587, 12718580, 12581763, 12492168, 12308018, 12158571, 12019840, 11928626, 11807040, 11712952, 11620669, 11446845, 11295722, 11165835, 10983978, 10813196, 10734569, 10690289, 10604659, 10477261, 10352113, 10220918, 10093535, 9978122, 9884709, 9793168, 9703205, 9560957, 9457332, 9315922, 9219111, 9196526]
12304I196526p4109n9167o5905q6890p3763r2747p5156j38594j14861k3904q6434
12293H304996o3720m5578n148Q188J9968J1492Q527m1608l2694j6114j6523L0090
12281H161876J8095L829M2049L8925R2891J01333N7284R1823J71457J72008J69615
12270I121185J33723J73727K58002L31305L72277M28634M98745N74209P47102
12261A2638909R85415J134056J367187J582363J805170J970397K100809K217659
12253B5801965K351607K553729K949350L768364N287677P928038J1905265J7140777
12245G9686772K2818222K8469304L3487076L6109243L4653734K9460599K1173100
12238B85858050R986194k909964j4662736k3750062k9982355l2852874l1514999
$$ y = [9196526, 9122417, 9063250, 8997345, 8910455, 8836692, 8743945, 8668789, 8530195, 8415334, 8391430, 8304996, 8241276, 8195698, 8190550, 8198738, 8218706, 8230198, 8238725, 8197117, 8164423, 8148309, 8131786, 8161876, 8179971, 8183800, 8225849, 8264774, 8357665, 8458998, 8516282, 8608105, 8779562, 8951570, 9121185, 9254908, 9428635, 9686637, 10017942, 10390219, 10818853, 11317598, 11891807, 12638909, 13624324, 14758380, 16125567, 17707930, 19513100, 21483497, 23584306, 25801965, 28153572, 30707301, 33656651, 37425015, 42712692, 50640730, 62545995, 79686772, 102504994, 130974298, 164461374, 200570617, 235224351, 264684950, 285858050, 295844244, 292934280, 278271544, 254521482, 224539127, 191686253, 160171254]
12231A60171254k7434511k2583367j7551358j2591473q754055o298098m828010
12224F0130382m033621l587275l337934l249636l154923k979018k793329k540110
12216C4454536k312147j999094j705566j479901j359065j239491j080954j029634
12208B2248684r47667r12047q14291o77139o57923o01346n60665n51700n41140
12199A5984766m70358m36362m68727m70085m41975m12095m12592m19437l88277
12190A2064858l43400l27836k28112k23294k55499k82353l01565k87675k57771
12181I557353k10774k75395k26691k28026j83059j97130k09004j74010j43099
12172G710165j91824k03764j21084j16945j32625j35051j63957j60590j29875
$$ y = [160171254, 132736743, 110153376, 92602018, 80010545, 71256490, 64958392, 60130382, 56096761, 52509486, 49171552, 45921916, 42766993, 39787975, 36994646, 34454536, 32142389, 30143295, 28437729, 26957828, 25598763, 24359272, 23278318, 22248684, 21301017, 20388970, 19574679, 18897540, 18239617, 17638271, 17077606, 16525906, 15984766, 15514408, 15078046, 14609319, 14139234, 13697259, 13285164, 12872572, 12453135, 12064858, 11721458, 11393622, 11165510, 10942216, 10686717, 10404364, 10102799, 9815124, 9557353, 9346579, 9071184, 8844493, 8616467, 8433408, 8236278, 8027274, 7853264, 7710165, 7518341, 7314577, 7193493, 7076548, 6943923, 6808872, 6644915, 6484325, 6354450]
12163F354450p1368r8304j73707j24589j17119r1348n5970l3017r4263j36600
12153E358165r5926p0390k5640n0874j60681j05411n6585r7776r4983r1536q7433
12142D420930r0747o8113r2687n2967o2114j08707j05384o9211r6657q1002k8657
12131C564684k0352k2833n6194l6284o0858o0027k9889j7893N434k0516n5712
12120C189560q9435j06949l7921o1737n9369m083l8964Q934M9253l1859n9935
12109B757495k4135R838L4917k377l2618n58J1121Q400K7669L3679K1324M3665
12097B888420K5558J8153j5559k8950o2783n1580j03694r4154n7621j8288j8206
12086B481296P931q6316j30309m5524j4084n5923n1941r365J2270j0400l6278
$$ y = [6354450, 6283082, 6184778, 6011071, 5886482, 5769363, 5678015, 5622045, 5589028, 5494765, 5358165, 5262239, 5191849, 5166209, 5115335, 4954654, 4849243, 4792658, 4694882, 4599899, 4508363, 4420930, 4330183, 4262070, 4169383, 4116416, 4054302, 3945595, 3840211, 3771000, 3674343, 3593341, 3564684, 3544332, 3521499, 3465305, 3429021, 3368163, 3308136, 3278247, 3260354, 3265788, 3245272, 3189560, 3100125, 2993176, 2955255, 2893518, 2834149, 2830066, 2791102, 2800036, 2849289, 2817430, 2757495, 2733360, 2743198, 2778115, 2775738, 2743120, 2742562, 2753683, 2762083, 2789752, 2823431, 2844755, 2888420, 2913978, 2932131, 2916572, 2887622, 2824839, 2773259, 2669565, 2575411, 2517790, 2499502, 2481296, 2489227, 2402911, 2272602, 2227078, 2212994, 2157071, 2105130, 2095765, 2108035, 2097635, 2061357]
12075B061357o6496o525P534k6770m0918j8824o0175l9186l1809p59M5269o9818
12063A752880r3991n4070m5515j2236L9643N9051L6956K4639J298j2913k639L3757
12051A726860N768J5261J8049l1905l3271o877Q245J9005j7927k3032n1120m2502
12039A586554l344k0492o0318j1054J4280n1920n4819m3417J1459k589m3508k6708
12027A294124J9880k5701k7293J6447K0532k7905k2387k1066l3732l4588j1856
12016A146455j8806M6813j390k1549O874K2821n1683k0637J7219M249j3641m602
12004A112123J4493l9984l9353q869L8777M8482L1954J7044k6813n5842L5776
11993A127788N0110l5022q461P036k6732k5851L7263k892k5780l9643N924J3K5548
$$ y = [2061357, 1994861, 1988336, 1995870, 1969100, 1928182, 1909358, 1849183, 1809997, 1778188, 1777429, 1822698, 1752880, 1658889, 1604819, 1559304, 1547068, 1586711, 1645762, 1682718, 1707357, 1708655, 1695742, 1693103, 1726860, 1732628, 1747889, 1765938, 1734033, 1700762, 1693885, 1702130, 1721135, 1703208, 1680176, 1629056, 1586554, 1583210, 1562718, 1502400, 1491346, 1505626, 1453706, 1398887, 1355470, 1366929, 1364340, 1320832, 1294124, 1314004, 1288303, 1261010, 1277457, 1297989, 1270084, 1247697, 1226631, 1192899, 1158311, 1146455, 1127649, 1174462, 1173072, 1151523, 1158397, 1181218, 1129535, 1108898, 1126117, 1130366, 1116725, 1112123, 1126616, 1086632, 1047279, 1038410, 1077187, 1125669, 1157623, 1174667, 1147854, 1092012, 1127788, 1177898, 1142876, 1134415, 1141451, 1114719, 1088868, 1126131, 1123239, 1097459, 1057816, 1063740, 1063753, 1089301]
11980A089301K3807r155J4766o492j5656J9948K7194M7109O86j0965K0574K2449
11968A223566j9859l6181j8581N07N6069k966j4292l7744m1933o439N879O3578
11956A171604m294p8465j8233n1743R933K883p729p901M1038M37j7468m2838L6720
11943A033944j6615j5243j627k1821J5025J5875k5664q369K0366l0420q641J6692
11931I73502j3656l4142k5362k6472k3267m06k046R534L4382K8320L339K8764
11919I52490J0565n6179l8047J7059j1284J9065L737k5563k0026k3672m9248K5465
11907H04362L1722n927J0012K0242L991j1862L783n862l5961l2152J5044L1408
11895H28800j1118k9967J9651j2473K7263K065k2167q9833p3442n419M7121L8122
$$ y = [1089301, 1113108, 1103953, 1118719, 1112227, 1096571, 1116519, 1143713, 1190822, 1191508, 1180543, 1201117, 1223566, 1203707, 1167526, 1148945, 1149452, 1205521, 1202555, 1188263, 1150519, 1108586, 1102147, 1108026, 1171604, 1167310, 1088845, 1070612, 1018869, 1028802, 1031685, 1023956, 1016055, 1057093, 1057530, 1040062, 997224, 1033944, 1017329, 1002086, 1000459, 978638, 993663, 1009538, 983874, 975505, 995871, 965451, 956810, 973502, 959846, 925704, 900342, 873870, 850603, 850197, 848151, 857685, 892067, 920387, 923726, 952490, 963055, 906876, 868829, 885888, 874604, 893669, 897406, 871843, 851817, 828145, 778897, 804362, 836084, 830157, 840169, 860411, 864402, 852540, 856323, 850461, 814500, 782348, 797392, 828800, 817682, 787715, 807366, 794893, 822156, 824221, 802054, 712221, 638779, 633360, 680481, 718603]
11883G18603M0060j649n7k7353o6104k6452K618J1531K1104l1003L267N1125K0154
11870G15844p427k0011J4142k3801k1387J271M1759m8145m7382J1384k2800L1348
11858F24795k3537k3646M9030P437k8549j4691K807J3708N379M0816O1916M6103
11846G61568l0015k5256n536q370p8057q1821k4294L7169J6234k4046J4881R0541
11834F42998m175m0491P33J3818J4101L1768L4178p788K691M5194Q1240J19029
11822I33296J83891J30728J37892J97788J85811R7599J1053P3683m1272p6409
11812A834060j05027j86075j94047p8884j04287j12108j21052p8232n6838j4076
11802G83434J0003L927N79K7913o0462o4349n2363p8800l2549q390K0273K3516
$$ y = [718603, 758663, 757014, 756957, 729604, 663500, 637048, 639666, 651197, 672301, 641298, 644565, 695690, 715844, 708417, 688406, 702548, 678747, 657360, 658631, 700390, 652245, 604863, 616247, 593447, 624795, 601258, 577612, 626642, 634079, 605530, 590839, 593646, 607354, 612733, 653549, 715465, 761568, 731553, 706297, 700761, 692391, 614334, 532513, 508219, 545388, 561622, 537576, 552457, 642998, 638823, 598332, 599065, 612883, 626984, 658752, 692930, 685142, 687833, 733027, 814267, 933296, 1117187, 1247915, 1385807, 1583595, 1769406, 1867005, 1878058, 1951741, 1910469, 1834060, 1729033, 1542958, 1348911, 1270027, 1165740, 1053632, 932580, 854348, 797510, 783434, 793437, 797364, 797943, 825856, 765394, 701045, 648682, 569882, 537333, 528943, 549216, 572732]
11790E72732l1646j8405J5963m3679j9349j0956K226J5425M2526Q395J7769L3714
11778E84715n3942o0870r418n312l4740L8574O373Q086m1569n8359n3020O747
11766C27265M4223l2429Q50M709o438J7078J7478j8688O068k563k9947R644N1616
11753C88866m526N047L2463j8465l9904J9245k3491k3554r431L1732l475m1163
11741C13344j8258L9905M9341J0594j4751l8670R855R310n3783K148L494j1276
11729C01253j5084k0226K2683M164k500j7600K7168L1822k0477O388l7557k0389
11717B59645L7026L884Q250l702k4799J28K781l8696K6014L3265k9492l1445R140
11704B51999j7262J0188J7378L3110j2262m3291j4026L3530P944k8697j870j1953
$$ y = [572732, 541086, 522681, 538644, 494965, 475616, 464660, 466886, 482311, 524837, 533232, 551001, 584715, 530773, 469903, 460485, 455173, 420433, 459007, 465380, 473466, 431897, 373538, 320518, 327265, 371488, 339059, 339909, 344618, 338180, 355258, 372736, 354048, 360116, 357553, 327606, 337250, 388866, 384340, 389387, 421850, 403385, 363481, 382726, 359235, 335681, 326250, 357982, 354507, 313344, 295086, 334991, 384332, 394926, 380175, 341505, 351360, 360670, 306887, 309035, 312529, 301253, 286169, 265943, 288626, 292790, 290290, 272690, 299858, 331680, 311203, 317591, 280034, 259645, 296671, 300555, 308805, 305103, 280304, 280432, 283213, 244517, 270531, 303796, 274304, 242859, 251999, 234737, 244925, 262303, 295413, 283151, 239860, 225834, 259364, 267308, 238611, 236741, 224788]
11692B24788J613M9287N592j0692q194p148k7602m7134J4802L3407k7768p812
11680A93139L2056r40J6719j2928l4380j1301L0615k1294M185k4459m5139L1253
11668A57526M2047K554L271J2273j3559j3172M996j4154J234N2539L1869J0162
11656B77586q2338k1358k1326M036j5247K2050K4599J1994j0677J7059j7261m0986
11644A48131k5512L1063K6482L0334j2982j1848P7236K1043k4685O251Q144m5875
11632B27782p3655k0756j9744M8974L0299K01J32L0736j2165p6793l7756K3706
11620A20961L4307K9546Q14K5748M6143j1666j7523l1490k9157l4977N0306Q8295
11608B71307j257k7626o241j4925l883m3089o7507l9499M4236L7600k3033k7459
$$ y = [224788, 226401, 275688, 281280, 270588, 262394, 255246, 227644, 180510, 195312, 228719, 200951, 193139, 225195, 224255, 240974, 228046, 193666, 182365, 212980, 191686, 195871, 171412, 126273, 157526, 199573, 202127, 205398, 217671, 204112, 190940, 195936, 181782, 183016, 235555, 267424, 277586, 195248, 173890, 152564, 156600, 141353, 163403, 188002, 199996, 189319, 206378, 189117, 148131, 122619, 153682, 180164, 210498, 197516, 185668, 262904, 283947, 259262, 265513, 273657, 227782, 154127, 133371, 113627, 162601, 192900, 193101, 193233, 223969, 211804, 135011, 97255, 120961, 155268, 184814, 185628, 211376, 257519, 245853, 228330, 196840, 167683, 132706, 183012, 271307, 270050, 242424, 236183, 221258, 217375, 174286, 106779, 67280, 111516, 149116, 126083, 98624]
11596I8624K776k0252L3769J8644k875k4391k6609J6327M7422k955M831K0370
11584A65681l579l9857k2658m527M3814J7470m9332n805J9089n4564j8329O1051
11572A08454M7209k3265R50J9744K5528J0572j5507K1681K0327o477L584k1253
11560A91547m6821r9908j7643Q5207M1262J0387l3247l0327M3775j3141l7209
11549I3882N3684N3424j6311r2795j9363K3514k1319L0599L4845k273r88O168
11537A43067p882m2962l4840l4460K9918P1839P3407K4413p203l0233n3732j9904
11525A11428K1212Q2470j0872j4461j3686O292p089K119o5223j1077J9189J1278
11513A31580j2925j6298K749j3487N520J4883M335K5024j6198l6583n1450J4652
$$ y = [98624, 101400, 81148, 114917, 133561, 130686, 106295, 79686, 96013, 143435, 140480, 145311, 165681, 162102, 122245, 99587, 95060, 138874, 156344, 107012, 101207, 120296, 65732, 47403, 108454, 155663, 132398, 133348, 153092, 178620, 189192, 173685, 195366, 215693, 209216, 212800, 191547, 144726, 44818, 27175, 112382, 153644, 164031, 130784, 100457, 144232, 131091, 93882, 147566, 200990, 184679, 91884, 72521, 96035, 74716, 105315, 140160, 137887, 136899, 143067, 135185, 92223, 57383, 22923, 52841, 124680, 198087, 222500, 215297, 185064, 131332, 111428, 132640, 215110, 204238, 189777, 176091, 182383, 175294, 177413, 112190, 101113, 120302, 131580, 118655, 102357, 105106, 91619, 97139, 112022, 116357, 141381, 125183, 88600, 37150, 51802]
11501E1802R764J2114L8061K6148L6371j3699q199j4043l1858J3431L889k1587
11489A02194O6988Q747l9215j7705k0087R792J6978m8981n2010J8808K2546M4532
11477A12587l7691O517L3800P853j8756J5530l6157j8572J705K4855K7290O042
11465A25003j316k187m0551j4742L3129M2114P631J4227M401m4531o1463Q440
11453G0155N972R3084M8412l707m8170n3463Q232m5856l860K7572k24l7028K5703
11440H6822P6071M930k8759o329L776K430J4632o281n2471K9417P791n642L9518
11427A65905M3467l3779k9057k3008j3768L292K7624L351l7719J3880J5908j3014
11415A23082j0393m07L1745K2887K366l9504L307N8057r330l1953N0047K5302
$$ y = [51802, 61566, 73680, 111741, 137889, 174260, 160561, 152362, 138319, 106461, 119892, 123781, 102194, 169182, 177929, 138714, 121009, 100922, 110714, 127692, 78711, 26701, 45509, 68055, 112587, 74896, 81413, 115213, 123066, 104310, 119840, 83683, 65111, 66816, 91671, 118961, 125003, 123687, 121500, 80949, 66207, 99336, 141450, 149081, 163308, 167709, 123178, 61715, 70155, 76127, 169211, 217623, 213916, 165746, 112283, 120515, 74659, 70799, 98371, 98147, 61119, 86822, 162893, 167823, 139064, 132735, 136511, 138941, 153573, 147292, 94821, 124238, 132029, 126387, 165905, 209372, 175593, 146536, 123528, 109760, 113052, 140676, 144027, 106308, 120188, 136096, 123082, 112689, 112282, 144027, 166914, 169280, 129776, 133083, 191140, 181810, 149857, 199904, 225206]
11403B25206k4888k8886n4861j6963J6625L585k658K276p179m9298j7111n957
11391C9891k6616J608L9827j0523k5675J3542J0229J418r78K9889P5689L037O126
11378A57464R317k402l5083m9851J2587k8690k3327K6814Q081J4905K710J0772
11366A03297l8413p2794m939J2782O5565M622J8475J8802J4183o2215n2398L6940
11354D3907L7544J4832M13J839j9696l6669J7635K3835k9193R065k5557N462R200
11341E2617M4449j8096o791M727K5701k3702n044J2632J7726J0363J333j5296
11329A00619n8207j5977J5445J4712K388o9580q626L5275o783j8483R998Q345
11317I126K2989J1460j7703K834L2197j0779q376K8736P634P779k5713O221R523
$$ y = [225206, 200318, 171432, 116571, 99608, 116233, 119818, 117160, 119436, 112257, 62959, 45848, 39891, 13275, 14883, 54710, 44187, 18512, 32054, 42283, 43701, 42723, 72612, 148301, 151338, 157464, 166781, 164379, 129296, 79445, 92032, 63342, 40015, 66829, 74910, 89815, 92525, 103297, 64884, -7910, -12849, -67, 65498, 70120, 88595, 107397, 121580, 59365, 6967, 43907, 81451, 96283, 96696, 98535, 78839, 42170, 59805, 83640, 54447, 63512, 37955, 43417, 52617, 97066, 78970, 72179, 76906, 102607, 78905, 73861, 86493, 104219, 114582, 115915, 100619, 42412, 26435, 41880, 56592, 58980, -10600, -19226, 16049, 9266, -9217, 781, 9126, 32115, 43575, 25872, 28706, 60903, 50124, 41748, 70484, 78118, 85897, 60184, 66405, 75928]
11304G5928N440p313r996k31k0704j2841M8254N961m330J1217L8295m6612n7640
11291B5428L10P957J1302L5235Q2094N1881O7974M4478N8402K7438M763n3340
11279C63922p0849q4856p2922m2814k4284j1971j8133J2778L2824m9479j544k259
11267C0413M3250K8613l4685j6428K3992L2862n0109k4258k3m6132J8802K0314
11255B6611L2299M4324M0757L1847m3841m6699m299q6n8387m2059j320j4126J9114
11242a5865N9688N2335p716l3400K0976K0621K229j2243l8948l5159J8660k1551
11230I627J8611j5494J9132J1166L0206N267n8994L309R196l360p700j5073J4073
11217A9966M2696M7213K7141l7555p194k9288n5537m0459L4876N1545O211p165
$$ y = [75928, 81368, 74055, 64059, 63828, 43124, 30283, 78537, 84498, 80168, 91385, 129680, 83068, 25428, 25738, 33695, 44997, 80232, 162326, 214207, 282181, 326659, 385061, 412499, 417262, 363922, 293073, 208217, 135295, 92481, 68197, 56226, 38093, 50871, 83695, 34216, 32672, 30413, 73663, 102276, 67591, 51163, 75155, 108017, 57908, 33650, 33627, -12505, 6297, 26611, 58910, 103234, 143991, 175838, 131997, 85298, 80999, 80913, 22526, -19533, -20853, -34979, -15865, 43823, 96158, 88442, 55042, 76018, 96639, 98868, 86625, 47677, 12518, 31178, 9627, 28238, 12744, 31876, 43042, 73248, 78515, 19521, 22830, 32026, 28666, 20966, 5893, 19966, 62662, 109875, 137016, 99461, 92267, 62979, 7442, -33017, 1859, 53404, 59615, 52450]
11205E2450K1498j6354K5911L373q817j6326m674k3820J0892Q174o428n3086j8094
11192b5301O580Q286k3422j3680K907L5359j7393J0048N1099n298n305k978P2386
11179I3288J5431j5200k2814L4741R4603O2390Q1693L6545k9207J0760J8538n8043
11167C22725q9939m3489j994m6163l4352j9029l992J998m865N470p331j3879K9659
11154I4819J6034K0339J153k5665n2754Q323O104p0559k3735L6860P132K8994
11142D7045J6583o978J9897K6208K5576o1560j7951Q0287k2162l8601K2140j0652
11130G9832k789K9229K9145k0234m4306j9427O493K1433j4626q101q175K8226
11118G6700M9522M0506M6399J6755j8904J4289N1659M765N9456J6163n32R317
$$ y = [52450, 73948, 57594, 83505, 86878, 78061, 61735, 57061, 33241, 44133, 52307, 45879, -7207, -25301, -18721, -10435, -33857, -47537, -44630, -9271, -26664, -16616, 34483, 29185, 23880, 20902, 93288, 108719, 93519, 70705, 105446, 200049, 262439, 344132, 380677, 351470, 362230, 380768, 322725, 232786, 189297, 187303, 141140, 106788, 87759, 83767, 85765, 80900, 86370, 79039, 65160, 94819, 110853, 131192, 132345, 106680, 53926, 62249, 68353, -2206, -25941, 10919, 18051, 47045, 63628, 56650, 76547, 102755, 128331, 66771, 48820, 129107, 106945, 68344, 90484, 79832, 77043, 106272, 135417, 115183, 70877, 51450, 57943, 79376, 64750, 56649, 48474, 76700, 126222, 166728, 213127, 229882, 210978, 225267, 276926, 281691, 341147, 357310, 356778, 366095]
11106C66095K4731k1067J2151j3422L454K4562j1913q8329J3234Q128K0420J3070
11094C51114j534j6297L2804j825N432K9188K7720M0275l7018n5771O1562J5582
11082D51232j398k8202k3985J9066K0496j2377k6752L9678O7313q525O1987Q6178
11070F44711O6045J16911R9193J1875L8097l3125n7599n4916m2875n9164r0268
11059F38885j938k1309L679j6861k7875N052N9373K423k555k0105l2176l7982
11047E48611j7268o514m781j8582j2246o272M1185q624o0894k4097k620j9597
11035D08301J8114K519k0519k3775j9993L2393J2159J5987O4206k3132k3966j1308
11023D30986o560n1993n4718r886k8673o3245m5921p181L2004M0449r217j9513
$$ y = [366095, 390826, 369759, 381910, 368488, 371942, 396504, 384591, 296262, 309496, 317624, 338044, 351114, 349580, 333283, 366087, 364262, 369694, 398882, 426602, 466877, 429859, 374088, 435650, 451232, 449834, 421632, 397647, 416713, 437209, 424832, 398080, 437758, 505071, 496546, 558533, 644711, 710756, 827667, 926860, 938735, 976832, 943707, 886108, 831192, 788317, 729153, 638885, 636947, 615638, 619317, 602456, 574581, 579633, 639006, 641429, 638874, 618769, 586593, 548611, 531343, 524829, 520048, 501466, 489220, 482948, 524133, 515509, 454615, 430518, 427898, 408301, 426415, 428934, 408415, 384640, 364647, 397040, 409199, 425186, 489392, 466260, 442294, 430986, 424426, 372433, 317715, 307829, 279156, 215911, 169990, 162809, 194813, 235262, 226045, 206532]
11011B06532j0344k5133j8267j8822L8011k308l8387j3849J2481J4794m5858k3840
10999G5010j0485Q32K0433J5388M456j5525m4567J6264K3312M301k1941p060l233
10986E7185j1226K699M484J7357l8534k391j2979o022K2148L7310L5796Q09k4246
10973H2390P677R368k8815N848k5780l8013r442L2607J581j2527J3869j640J9309
10960E6432N6271k788k580M590N2533K439k6051J2563l8158j6332l3249n4315
10948A1355Q953j3319l4106J5913M2700p292m859j7622m811L2478K457K604m0449
10935e998k4419m576J1485K553M4283L3560J7469J581j8780J104j4585M1201j6945
10922F7933k4341k4934J1491j0828K4204k578P883j9826K2938o553J6399O215
$$ y = [206532, 196188, 171055, 152788, 133966, 171977, 169669, 131282, 117433, 129914, 144708, 98850, 75010, 64525, 65357, 85790, 101178, 105634, 90109, 45542, 61806, 85118, 89419, 67478, 60418, 57185, 45959, 48658, 53142, 70499, 31965, 29574, 16595, 10573, 32721, 70031, 105827, 106636, 82390, 90067, 99435, 70620, 76468, 50688, 12675, 3233, 35840, 37421, 24894, 38763, 37123, 56432, 112703, 109915, 107335, 111925, 164458, 166897, 140846, 153409, 115251, 98919, 65670, 11355, 20308, 6989, -27117, -11204, 31496, 24204, 19345, 1723, -3088, 29390, 31847, 34451, -5998, -30417, -34993, -23508, -20955, 23328, 56888, 74357, 75938, 57158, 58262, 43677, 84878, 67933, 43592, 18658, 30149, 19321, 43525, 40947, 48830, 29004, 51942, 45389, 61788, 68003]
10910F8003J6400m7587j7627k5191j7602K0505L271L8119M0756r016O752J0548
10898H7331P4233R3515P6423J5287j0572k9741n7376o1708j4005J0167k2867l6034
10886A24653q042n926P73M6852k2021n0728m3379o82k1299j9211q610N0991K5290
10873F8661n700m0483j1619j8820p070J8821K6276n2819j4447M015j3278k5853
10861g2316k1253q504N5258N2682K7673J0141J4331k6229K4989J6605L533j8138
10849E8772j3514j3710o4932M669K1521R470j8120k082M2795j6183R128j8811
10837i97M4369M3462M567p3664l4363l8930q432L4521O9346k0081k4840J1665
10825F623L4591j7545J0164Q889J656m1310K8828M8570m8913J3686K0825q836
$$ y = [68003, 84403, 36816, 19189, -6002, -23604, -3099, 172, 38291, 79047, 70031, 76783, 87331, 161564, 255079, 331502, 346789, 336217, 306476, 249100, 187392, 173387, 183554, 160687, 124653, 116611, 110685, 111458, 158310, 136289, 85561, 42182, 41500, 20201, 990, -7620, 43371, 68661, 62961, 22478, 10859, -7961, -15031, 3790, 30066, -22753, -37200, -33185, -46463, -72316, -93569, -102073, -46815, 5867, 33540, 43681, 58012, 31783, 56772, 73377, 76910, 58772, 45258, 31548, -33384, -28715, -7194, 2276, -15844, -17926, 24869, 8686, 17814, -997, 43372, 86834, 91401, 17737, -16626, -55556, -63988, -29467, 39879, 19798, -5042, 6623, 41214, 23669, 33833, 42722, 44378, 3068, 31896, 80466, 31553, 45239, 66064, 57228]
10813E7228O2057n175n3924J7794L6566r224N703K2756k9984j5309M8376K1327
10801A58191L6831N7059Q995m293j571j2656J1765N737l4887J4977Q0530L6661
10789C57339K0848m9849N1936L8465P575K9769L0656P037K4200M9982L8129L0359
10777F36446K9597J6776K8200M3802R5578N7795Q2296J43003J50621P9644O3222
10766A426980Q2187O6276l5892o5186j5298J9587L0826M5200n5258k0453P7611
10755A556580L0958o240L5500L1763K2279L1738P5991P2728N0724J2835K8416
10744A943272L8060n716k2685L0179j1454m4133q988j9776M1304K3629Q0358J71811
10732B215861J23087J05128J41387J61615K13268K79106K22841J92343J93594
$$ y = [57228, 119285, 114110, 60186, 77980, 114546, 105322, 111025, 133781, 103797, 88488, 136864, 158191, 195022, 252081, 261076, 256783, 255212, 242556, 254321, 260058, 225171, 240148, 320678, 357339, 378187, 328338, 380274, 418739, 426314, 456083, 486739, 493776, 517976, 567958, 606087, 636446, 666043, 682819, 711019, 754821, 850399, 908194, 990490, 1133493, 1284114, 1363758, 1426980, 1509167, 1575443, 1539551, 1474365, 1459067, 1478654, 1509480, 1554680, 1499422, 1478969, 1556580, 1587538, 1581298, 1616798, 1648561, 1670840, 1702578, 1778569, 1851297, 1902021, 1914856, 1943272, 1981332, 1975616, 1952931, 1983110, 1971656, 1927523, 1918535, 1898759, 1940063, 1963692, 2044050, 2215861, 2338948, 2444076, 2585463, 2747078, 2960346, 3239452, 3462293, 3654636, 3848230]
10723C848230K47134K00912J76404J43516J72464K36339L16657L92441M86198
10714F220295N87228O77876P15325O84257N72214N32326M67282M30967M06243
10705A1294013L83134M28370M01724L36471J50412k8491q8714j26033j54830o0660
10695A2535396J49376M22604O98568R32942J309469J906373K703297L845756N378170
10686B9881951O907939P683590P208961N738717L756201J423012p27520j870347
10678F0002504j510737r8292J351883K115253K124009J500696O33092j9897k17035
10669F5881476q5513K37389N17514P03261P50028O20097O65286J340432K490523
10660G3120493L515112L994427L709575K954125K052496J161005N24589M27182
$$ y = [3848230, 4095364, 4296276, 4472680, 4616196, 4788660, 5024999, 5341656, 5734097, 6220295, 6807523, 7485399, 8200724, 8884981, 9457195, 9989521, 10456803, 10887770, 11294013, 11677147, 12105517, 12507241, 12843712, 12994124, 12965633, 12876919, 12750886, 12596056, 12535396, 12684772, 13107376, 13805944, 14738886, 16048355, 17954728, 20658025, 24503781, 29881951, 36789890, 44473480, 51682441, 57421158, 61177359, 62600371, 61872851, 60002504, 58491767, 58393475, 59745358, 61860611, 63984620, 65485316, 66118408, 66098511, 65881476, 65795963, 66033352, 66550866, 67254127, 68004155, 68624252, 69289538, 70629970, 73120493, 76635605, 80630032, 84339607, 87293732, 89346228, 90507233, 91031822, 91459004]
10652I1459004R81037J770540K693204L339900L411088L265113L686483M967681
10644A15574050O738764R002768J1195058J1294097Q406573M111545j13651m582712
10636A61626492q728694r773828p822289n209215l286886k227713j857946j747139
10628A20972782j581818j214872j083718j341718j778743k100823k796798l796734
10620A05277558m604450m675917m006375k946007j995020j252462q69843q67857
10612H4059627r35667q83092q01046m56603J96175Q75428J155511N94042l45537
10603H3458838j109154j306081n80481J013372K731325L035534J614867o88187
10595H8170033l272989o254056q899034r463691q140532o221119m569796l337684
$$ y = [91459004, 92440041, 94210581, 96903785, 100243685, 103654773, 106919886, 110606369, 115574050, 122312814, 131315582, 142510640, 153804737, 162211310, 166322855, 166209204, 161626492, 152897798, 143123970, 135301681, 130092466, 126805580, 124577867, 122719921, 120972782, 119390964, 118176092, 117092374, 115750656, 113971913, 111871090, 109074292, 105277558, 100673108, 95997191, 91990816, 89044809, 87049789, 85797327, 84927484, 84059627, 83123960, 82240868, 81439822, 80983219, 81179394, 82054822, 83210333, 83804375, 83458838, 82349684, 81043603, 80463122, 81476494, 84207819, 87243353, 88858220, 88170033, 84897044, 78642988, 69743954, 60280263, 52139731, 45918612, 41348816, 38011132]
10587C8011132k480779j999836j621393j235497q77770o26727m32401k22628k12728
10578B8301373k95257l61988m00468m17194n53296o32197o78395p33292q13067
10569B3416219q18053q32494q67305q78839r15657r11176q13640p80591o47599
10560A5950865n79639m95564m81590l76157l62349l85209m57349n02022n15959
10551A1795027n16166n12077m01552l95368l19353k84798k86374k17360k00827
10542H661152k34083j71963j24733j07798j47592q6562r3580j15897j54976j14053
10532G309915j43105j97022k02016j13912q8771j13945j29506j41728j23238p1347
10522E985325n4791j28976p3967n2146m3120J4056N7689N355o8002m1387j14695
$$ y = [38011132, 35530353, 33530517, 31909124, 30673627, 29795857, 29169130, 28736729, 28514101, 28301373, 28006116, 27644128, 27243660, 26826466, 26273170, 25640973, 24962578, 24229286, 23416219, 22598166, 21765672, 20898367, 20019528, 19103871, 18192695, 17379055, 16598464, 15950865, 15371226, 14875662, 14394072, 14017915, 13655566, 13270357, 12813008, 12310986, 11795027, 11278861, 10766784, 10365232, 9969864, 9650511, 9365713, 9079339, 8861979, 8661152, 8427069, 8255106, 8130373, 8022575, 7874983, 7788421, 7694841, 7578944, 7423968, 7309915, 7166810, 6969788, 6767772, 6653860, 6565089, 6451144, 6321638, 6179910, 6056672, 5985325, 5930534, 5801558, 5727591, 5675445, 5632325, 5646381, 5704070, 5709425, 5641423, 5600036, 5485341]
10511E485341j68574j41082k23076k82102k11394j73439j02387o5697q3922j22968
10501C910700r0742j27542q6637l3511o6560n9586r3763o7553n5934p1090j16316
10490C041466j31825p8908o1056k6564n9274m8126j3075l8219m8417l4904k4782
10479B476316j9421m6344p5373o0126l3974n4660N612l5082n71K3081o2416n2857
10467B064185j628j1975r0923n3383o1814o1516j6577k1161m2709j9540k9812
10456A653147k9973l4618p434O23j20o80n2914o6595N1514k1624k1456o400n6062
10443A407408j3958o0437n3665j397M6875n394n9185J3402m0706p2377n3263l9135
10431A068168J514j5021J9903l4416N793K9509q632k0895R348L3276j1495l9093
$$ y = [5485341, 5316767, 5175685, 4952609, 4670507, 4459113, 4285674, 4183287, 4117590, 4033668, 3910700, 3819958, 3692416, 3605779, 3572268, 3505708, 3446122, 3352359, 3284806, 3228872, 3157782, 3041466, 2909641, 2830733, 2769677, 2743113, 2683839, 2635713, 2622638, 2584419, 2536002, 2501098, 2476316, 2456895, 2410551, 2335178, 2275052, 2241078, 2186418, 2192030, 2156948, 2156377, 2179458, 2117042, 2064185, 2062557, 2050582, 1959659, 1906276, 1844462, 1782946, 1766369, 1745208, 1702499, 1682959, 1653147, 1623174, 1588556, 1581122, 1581745, 1581625, 1580945, 1528031, 1461436, 1512950, 1491326, 1469870, 1463470, 1407408, 1393450, 1333013, 1279348, 1277951, 1324826, 1319432, 1260247, 1273649, 1232943, 1160566, 1107303, 1068168, 1069682, 1054661, 1074564, 1040148, 1045941, 1075450, 1066818, 1045923, 1055271, 1088547, 1077052, 1037959]
10419A037959r2702k9130P650M1160N0750J2150k1644m7414o0348m0750q522J7724
10407H66883O536J0811k2196k7554k7488n1497j2005M128J7566j6515k2328K5103
10395G51444L7305J3203l2531j7205L4577P84l4808l4823l5272k156n2343R866
10383F38041k41j9136m8734j8725K3072L6249M945k7512n164N267r515q690k5080
10370E44777N568M3747O4606k9088p0352k8449n4169k2984o521L8037j094k5010
10358D59068J7024J0762J0562M1162J3974p078J6043j084Q11P741k1216j4164
10346E33605q741r984L094Q313q267l704k1045j2132L463J7157l4838n7097K8670
10333D38494L5557J5242Q038j4520j8336j7293L0528m3237l1480j3553M4378j6321
$$ y = [1037959, 945257, 916127, 923777, 964937, 1015687, 1027837, 1006193, 958779, 898431, 857681, 849159, 866883, 873419, 884230, 862034, 834480, 806992, 755495, 743490, 747618, 765184, 748669, 726341, 751444, 788749, 801952, 769421, 752216, 786793, 787577, 752769, 717946, 682674, 680518, 628175, 638041, 637800, 618664, 569930, 551205, 574277, 610526, 615471, 587959, 582795, 588062, 578547, 569857, 544777, 550345, 594092, 658698, 629610, 559258, 530809, 476640, 453656, 447135, 485172, 484078, 459068, 476092, 486854, 497416, 538578, 552552, 545474, 561517, 560433, 561244, 568985, 547769, 533605, 524864, 514880, 517974, 526287, 518020, 514316, 493271, 481139, 484602, 501759, 466921, 409824, 438494, 474051, 489293, 497331, 482811, 464475, 447182, 477710, 434473, 402993, 389440, 433818, 417497]
10321D17497l1349J7553M2149l0548n1813k993K1935k3861n80k2840k9808k1642
10309B83700K3927O6508N5748O6129K4645p280l3592p0425p8348j9680L0025M984
10297C46341M6942j0083l9197q936N1360K0041j3458J9609K314o86l0106l412
10285C80729j4688K8122M2833J5560J24j2644P2j3625m3193j9038L0390P7282
10273D71924M0051Q740M1956k5811j9432L666p1946k2269N5777k665n3133K137
10261D28995J0246m0282K1524O1862J0372L8116j7810L1741K5179J6518L6245
10250F22706L9065J2226K3837L751Q679l508J8293m0765n39M0098L3376j4987
10238G42232m3681m2674J7537Q3606N0161k6669j7205n3730K6932M2960k0213
$$ y = [417497, 386148, 403701, 445850, 415302, 363489, 360496, 382431, 358570, 357990, 335150, 305342, 283700, 307627, 374135, 429883, 496012, 520657, 513377, 479785, 409360, 331012, 311332, 341357, 346341, 393283, 383200, 344003, 335067, 386427, 406468, 393010, 412619, 414933, 414247, 384141, 380729, 366041, 394163, 436996, 452556, 452680, 440036, 440108, 426483, 383290, 364252, 394642, 471924, 511975, 520715, 562671, 536860, 517428, 521094, 449148, 426879, 482656, 479991, 426858, 428995, 439241, 398959, 420483, 482345, 492717, 530833, 513023, 544764, 569943, 586461, 622706, 661771, 673997, 697834, 701585, 710264, 706756, 725049, 684284, 683745, 723843, 757219, 742232, 698551, 655877, 673414, 757020, 807181, 780512, 763307, 709577, 736509, 779469, 759256]
10227G59256j7051J9154J6672M0585J6944n778L696k9739M1481L8764M5845l255
10215I26574m2867p0k7391j260P4766O5320M9851N4731L2653L9188J1489Q6743
10203A269727N8891p377n6012p9085o3857m3780m1415l7438j11891k118J4345
10192H99990l2590l1571N382m8974K091Q187j8659o4476l8034j2819l2085L047
10180F39489M7272N7788J9524j1089m6089n165j7050m9045j4982l2590n291Q53
10168E83625K5840P8626J9298o295K3301k6477q739P213M473l4526p334n1660
10156F07345n9682k4498o2420k6714k666M051l0910m7517o7366j5189J3725M3878
10144C32037N2503j2276k3781j9119k2823p07K665L026q7967r563K0119J2666
$$ y = [759256, 742205, 761359, 778031, 818616, 835560, 829782, 833478, 803739, 845220, 883984, 929829, 926574, 883707, 883637, 856246, 854986, 929752, 995072, 1044923, 1099654, 1132307, 1171495, 1182984, 1269727, 1328618, 1321241, 1265229, 1186144, 1122287, 1078507, 1037092, 999654, 887763, 885645, 899990, 867400, 835829, 841211, 792237, 794328, 802515, 783856, 719380, 681346, 668527, 636442, 639489, 686761, 744549, 764073, 752984, 706895, 701730, 684680, 635635, 620653, 588063, 582772, 583625, 609465, 688091, 707389, 701094, 724395, 697918, 689179, 696392, 700865, 666339, 659005, 607345, 547663, 523165, 460745, 434031, 431365, 435416, 404506, 356989, 289623, 274434, 288159, 332037, 384540, 372264, 348483, 329364, 306541, 305834, 308499, 311525, 223558, 213995, 234114, 246780]
10132B46780k2731L915k794L5432L3267L4836j9779m5484q222k1136j5715q895
10120B09474L4259j4379k6626K77P942j7535j6487O416L1919J1336l7349j0226
10108A79021O264L3759j5029j4528M7638n4307j5133K8490j2876N416O454M755
10096A99924k617o707m1380K2889k6611m293m188K2424k1248m17J4053k0865p552
10083A23412Q49L8131j1987J334P217J1301j8737m8292l0324K1195n751N2959
10071A41307P16L4506L2525l7180j6635J1796l1762J6721J479K0600L288k5632
10059A51729J4986J2580L6457L5014q529n7832L887k8245p716K3664N6233J07897
10047C40125R7013K1932l6624K4353M875q2863l6567j4447n7468o6702l7398l3486
$$ y = [246780, 224049, 227964, 225170, 260602, 293869, 328705, 308926, 263442, 255220, 234084, 218369, 209474, 243733, 229354, 202728, 203005, 210947, 193412, 176925, 183341, 215260, 226596, 189247, 179021, 185285, 219044, 204015, 189487, 237125, 182818, 167685, 196175, 183299, 188715, 195169, 199924, 197307, 190600, 149220, 172109, 145498, 141205, 137017, 159441, 138193, 137776, 151829, 130964, 123412, 124261, 162392, 150405, 151739, 158956, 170257, 151520, 103228, 72904, 94099, 88348, 141307, 142023, 176529, 209054, 171874, 155239, 167035, 135273, 151994, 153473, 174073, 177361, 151729, 166715, 179295, 215752, 250766, 242237, 184405, 188292, 160047, 152331, 175995, 232228, 340125, 437138, 459070, 422446, 446799, 451674, 368811, 332244, 317797, 260329, 193627, 156229, 122743]
10035A22743k9511N3032k774n421K0909J3738l4590J2575J1662K7784m4457j3688
10023A32002K1753J9146p699J890m540K0387K8086M1744o886J9713n669k3363
10011B36564q3591m8970L3535J4830N059p006J5629j759j6879j8490k7264o484
9999I5174L6845r664L1235K2903M1364K2337k0332k1624q4619l6656Q204k3212
9987F1955m7055k0040K3602N1281j3929K9456L1612k7918r790m2679J1190J8825
9975F6510O7039L8524l467K2308K4841L1153L5072k2991J5002M224L2060l2821
9963B77454n644l546l6252m3292j6001p007K2041j2400m6590j9398l5781J7882
9951I1466p609L3372J3317k1483l933Q065J8963K8825M2736L375j0915k9033k2706
$$ y = [122743, 93232, 146264, 143490, 138069, 158978, 172716, 138126, 150701, 162363, 190147, 145690, 132002, 153755, 172901, 165202, 167092, 162552, 182939, 211025, 252769, 245883, 265596, 259927, 236564, 152973, 104003, 137538, 152368, 157427, 150421, 166050, 164291, 147412, 128922, 101658, 95174, 132019, 122355, 153590, 176493, 217857, 240194, 219862, 198238, 113619, 76963, 85167, 61955, 14900, -5140, 18462, 69743, 55814, 85270, 116882, 88964, 79174, 36495, 47685, 66510, 133549, 172073, 168606, 190914, 215755, 246908, 281980, 258989, 273991, 278215, 310275, 277454, 271810, 268264, 232012, 188720, 172719, 165712, 187753, 175353, 128763, 109365, 73584, 91466, 83857, 117229, 130546, 109063, 105130, 113195, 132158, 160983, 203719, 207094, 196179, 167146, 144440]
9938A44440N466N7376K5030l3645j8272L6164O2102O6103K9735J6628L6267q02
9926D26592L6862J7181q556J2785M2115K4113n974l021q926q2469p4380j3325
9914C62997q13l9404q0048r240J8180j4459q870K8422K6259j3639K0452j3505
9902B76332l0084R368L3294K336o1578K362N5918K116O868N6924L8072q623j5641
9889C67664L4592P6660K7927J4539K5399P418J8385J5098m11m0939o2962n7091
9877D26279J8225O4135O7795O1721n579j1509l701j3908L4684J3138k9310n2509
9865E69461n8050m1990L2009P3283J3918K2877M4819J7821m8656l0768j663K6758
9853F19819j0160M7970K1211N73l0691l7399k0608P336M1881n355r375o1620p6524
$$ y = [144440, 149906, 207282, 232312, 198667, 180395, 216559, 278661, 344764, 374499, 391127, 427394, 426592, 463454, 480635, 472079, 484864, 526979, 551092, 545118, 542097, 533171, 450702, 376322, 362997, 362184, 322780, 242732, 233492, 251672, 237213, 228343, 256765, 283024, 269385, 289837, 276332, 246248, 255616, 288910, 291246, 229668, 232030, 287948, 290064, 296932, 353856, 391928, 383305, 367664, 402256, 478916, 506843, 521382, 546781, 554199, 572584, 587682, 587271, 546332, 483370, 426279, 444504, 508639, 576434, 638155, 632576, 621067, 617366, 603458, 638142, 651280, 621970, 569461, 511411, 469421, 501430, 574713, 588631, 611508, 656327, 674148, 625492, 594724, 593061, 619819, 609659, 657629, 678840, 679413, 648722, 611323, 590715, 598051, 639932, 634577, 625202, 563582, 487058]
9840D87058l2875j5853q378J774m53j1327l9574K964K5102M5477O3517M0653L9618
9827E97703O9319P2454N6048k72j3340k1084M5653Q5128J10115P0984o238q4593
9815I81877k9778l8392j36451j43263j32261o1967n3699l425J6926j2312m2536
9804C44719N317J7196p420j2656m9052m3417K2408j1737k134O1183n0174n3331
9792B20902K1124M6005P193n4176n4896m24M1065j4883L4764K4447L0253K9743
9780C31117k3047L3814J9135l4082M431k1725m3962p699l7393L2759n932l349
9768B44067j4911J1459k9049o0435k6531J5654O614m1545p842K9903O865k1622
9756A12627l9490J2870J5476j8003l3246J6493M3451J0697J5282J8821k1857J552
$$ y = [487058, 454183, 438330, 429952, 431726, 431273, 419946, 380372, 383336, 408438, 453915, 517432, 558085, 597703, 667022, 739476, 795524, 795252, 781912, 760828, 806481, 891609, 1001724, 1072708, 1066470, 981877, 952099, 913707, 777256, 633993, 501732, 439765, 386066, 382641, 399567, 387255, 344719, 350036, 367232, 359812, 347156, 298104, 254687, 277095, 265358, 263224, 324407, 274233, 220902, 242026, 288031, 295224, 241048, 186152, 185728, 226793, 211910, 246674, 271121, 301374, 331117, 308070, 341884, 361019, 326937, 331368, 309643, 265681, 257982, 220589, 253348, 247416, 244067, 229156, 240615, 211566, 151131, 124600, 140254, 146868, 105323, 97481, 127384, 134249, 112627, 73137, 86007, 101483, 83480, 50234, 66727, 110178, 120875, 136157, 154978, 133121, 134673]
9744A34673R401M5863P666M048k5224n5239j3144P730j4258m918L5006m3167J7342
9731A05779J090j7162l9980k881J4320L224J8212N2129K8796J6466j0240k4088
9719A45665K0236O1488K2441n3349p649J2862M8184M4853j527m2325J151K2268
9707B74298J216r348j7078j3593k673L5536M3742l7527J712o89J747M0600m7041
9694B70902k9463J1934N49j463J5812M9217P007l2310k5386j2642j9869n551p866
9681B20871j8581l703k9368k9456L3443K5853K7554j1675n948K956k1395o4351
9669A26200L045J6496j677Q124M8650K4213N4212K897j3305K5553q313l2900l7294
9656B15901K3956j4585o6428k4228N706O377J5362J0224k621l202o6544l2761
$$ y = [134673, 144074, 189937, 197603, 201651, 176427, 121188, 108044, 115774, 101516, 96598, 131604, 88437, 105779, 106869, 89707, 49727, 46846, 61166, 64390, 82602, 134731, 163527, 179993, 169753, 145665, 165901, 227389, 249830, 196481, 188832, 201694, 249878, 294731, 293204, 250879, 252030, 274298, 275514, 266166, 249088, 235495, 232822, 268358, 312100, 274573, 276285, 275596, 277343, 317943, 270902, 241439, 253373, 253922, 252459, 268271, 317488, 324495, 292185, 266799, 254157, 234288, 228737, 220871, 202290, 198587, 169219, 139763, 173206, 199059, 226613, 214938, 208990, 211946, 190551, 126200, 129245, 145741, 144064, 152188, 200838, 225051, 279263, 282160, 268855, 294408, 286095, 253195, 215901, 239857, 225272, 158844, 134616, 140322, 146699, 162061, 172285, 169664, 166462, 99918, 67157]
9644F7157N1224N3952l903N4066P0307L6062L282k5009M460k9275j4778k0250
9632B47295m283N3858K4985k4565M8655K2032j2264n7574n6343J2823M4516L6243
9620C35378n976o266L4063L2970L7537K4602J6971M1724L6430L2812N7325R781
9608F47351J015K9059j5791j6888M1946J5729L3651L7374j0420l3342M168L5990
9596G69842R5461J19263P1374O2151O2746P1055O0493K8573Q9431J58210J34000
9585A722599J15326J71420J57651J31531J73431J38213J75072K40100K08073Q5542
9575C318958m235n9083j51166k39470j56391r8547p8395k8444n70J5553K8849
9564B547059J9640J2049M0441O2414Q8437J73353K15115L09482M43669O28224
$$ y = [67157, 118381, 172333, 168430, 222496, 292803, 328865, 332147, 307138, 311598, 282323, 267545, 247295, 243012, 296870, 321855, 297290, 345945, 367977, 355713, 298139, 241796, 254619, 299135, 335378, 329402, 323136, 357199, 390169, 427706, 452308, 469279, 511003, 547433, 580245, 637570, 647351, 648366, 677425, 661634, 644746, 686692, 702421, 736072, 773446, 763026, 729684, 733852, 769842, 865303, 984566, 1055940, 1118091, 1180837, 1251892, 1312385, 1340958, 1430389, 1588599, 1722599, 1837925, 2009345, 2166996, 2298527, 2471958, 2610171, 2785243, 3025343, 3233416, 3318958, 3314723, 3255640, 3104474, 2865004, 2708613, 2610066, 2531671, 2503227, 2502657, 2518210, 2547059, 2566699, 2578748, 2619189, 2681603, 2770040, 2943393, 3158508, 3467990, 3911659, 4539883]
9554D539883P55803P96671P36373O22941M21315J98667n1282k30411l18609l55079
9544G116272l42559l64769l13564l27513l27722j54024n5767q6780k7399P0186
9534E186361L6953R5505K31761L01448L58502M36660N42173P06696R16247J072233
9524I884539J091402J044322Q83218N81947J80443j22308l14398l91559k75283
9515A2562323r1135J22764L72409P81256J241803J800695K543590L476159M586130
9506B7395994O120257P882185R120675Q684418O598389M046352J382513j686799
9498F9543984m284311m952037l607779j588289N8290J083899J506064J841309
9490E9601130K199236K361454K614172L404045M709793N921609O384421N721702
$$ y = [4539883, 5295686, 6092357, 6828730, 7451671, 7872986, 8071653, 8020371, 7789960, 7471351, 7116272, 6773713, 6408944, 6095380, 5767867, 5440145, 5286121, 5230354, 5143574, 5116175, 5186361, 5223314, 5318819, 5550580, 5852028, 6210530, 6647190, 7189363, 7896059, 8812306, 9884539, 10975941, 12020263, 12903481, 13485428, 13665871, 13543563, 13229165, 12837606, 12562323, 12471188, 12593952, 12966361, 13747617, 14989420, 16790115, 19333705, 22809864, 27395994, 33516251, 41398436, 50519111, 59203529, 65801918, 69848270, 71230783, 69543984, 65259673, 60307636, 56699857, 55111568, 55169858, 56253757, 57759821, 59601130, 61800366, 64161820, 66775992, 70180037, 74889830, 80811439, 87195860, 92917562]
9482I2917562M483123L138550J651180j20540j621656k289531k371385k369096
9474I3418207k389290k037468j226766k24782P55613J648754K508679L253109
9466I5706056M157418N547386P761008J1076202J5410796J9122468J9249242J4600421
9458A92630997P513240J18018q202190j6500002k0422571j8578022j4066503r734911
9450A12758056o204542l769353k432176j854119j617816j604516j406730m79079
9442I3389725Q40020K110631L086113L751503M006573L490682K218381K95702
9434A13189330j909288m197428o166288p249033p135117o060848m553230l209791
9426G2708307k247861j757838j630374j544965j279865n69444Q37122K646626
$$ y = [92917562, 97400685, 100539235, 102190415, 102069875, 100448219, 98158688, 95787303, 93418207, 91028917, 88991449, 87764683, 87539901, 88295514, 89944268, 92452947, 95706056, 99863474, 105410860, 113171868, 124248070, 139658866, 158781334, 178030576, 192630997, 200144237, 200262255, 192060065, 175560063, 155137492, 136559470, 122492967, 112758056, 106553514, 102784161, 100351985, 98497866, 96880050, 95275534, 93868804, 93389725, 94229745, 96340376, 99426489, 103177992, 107184565, 110675247, 112893628, 113189330, 111280042, 107082614, 100916326, 93667293, 86532176, 80471328, 75918098, 72708307, 70460446, 68702608, 67072234, 65527269, 64247404, 63677960, 64515082, 67161708]
9418F7161708M111720M187004K580372K70202k117554m703999p215663q228735
9410E6045055p470942o063982m641126l554234k790173k180354j672622j249880
9402B6421742r94361p23092m10528k46623j06347j31942k24230l60678n92345
9393B2631596r60484j114615j146844j148573r99251q05464o81635o26587n80307
9384A4567836n21721m58737l86454l75432k93315l09385k80656j74967q3988j2374
9374A1670807n327P0483J82100J59135J24713J64889O1935n8760k47501m62003
9364A1660471o19293p52805p43844o71640n31965m53383l05458k44370k37260
9355G100453k61811j86602j38485j38717j59826j36827r8898n0881o6683n7491
$$ y = [67161708, 71273428, 75460432, 78040804, 78311006, 76193452, 71489453, 64273790, 56045055, 48574113, 42510131, 37869005, 34314771, 31524598, 29344244, 27671622, 26421742, 25427381, 24704289, 24293761, 24047138, 23940791, 23808849, 23584619, 23223941, 22631596, 21671112, 20556497, 19409653, 18261080, 17261829, 16456365, 15774730, 15148143, 14567836, 14046115, 13587378, 13200924, 12825492, 12532177, 12222792, 11942136, 11767169, 11683181, 11670807, 11665480, 11735963, 11918063, 12077198, 12201911, 12366800, 12428735, 12369975, 12122474, 11660471, 11041178, 10288373, 9544529, 8872889, 8340924, 7887541, 7582083, 7337713, 7100453, 6838642, 6652040, 6513555, 6374838, 6215012, 6078185, 5979287, 5928406, 5861723, 5804232]
9345E804232k0902M4720Q8537N4875M6533M0716m9209j51277j93789k28738k05297
9334E230401j79918k00926j37444j04281j13840j09702q8712j05912j10839r7888
9324C980939r6008j37789j96624j57536n3893o5588r1940o8582k2580k3251l0332
9313C036816n5868p4547m0715n8320n8051k5367o2536O36k5947p6562q4107l4658
9301B440774n9316o2336o3490o1302J1607K2780k4054j6441o4811M068k8652r2774
9289B006053o3411k0772m1719k1725k6514l4873p1587m7825Q527L9901J6432P437
9277A749924m7120l3272m1118q345r31P29r039m2079o4772n0150L814j2530m4092
9264A401019m5631p032L5482q701k9065j7997n2962p5997O167L2839j6887p2116
$$ y = [5804232, 5783330, 5828050, 5916587, 5971462, 6017995, 6058711, 6009502, 5858225, 5664436, 5435698, 5230401, 5050483, 4849557, 4712113, 4607832, 4493992, 4384290, 4295578, 4189666, 4078827, 3980939, 3884931, 3747142, 3550518, 3392982, 3339089, 3273501, 3181561, 3112979, 3090399, 3067148, 3036816, 2980948, 2906401, 2865686, 2807366, 2749315, 2723948, 2661412, 2662048, 2636101, 2559539, 2475432, 2440774, 2381458, 2319122, 2255632, 2194330, 2205937, 2228717, 2204663, 2188222, 2123411, 2127479, 2098827, 2006053, 1942642, 1921870, 1880151, 1858426, 1831912, 1797039, 1725452, 1677627, 1686154, 1726055, 1742487, 1749924, 1702804, 1669532, 1628414, 1620069, 1619138, 1619867, 1610828, 1568749, 1503977, 1453827, 1457641, 1445111, 1401019, 1355388, 1348356, 1383838, 1375137, 1346072, 1328075, 1275113, 1199116, 1205283, 1238122, 1221235, 1149119]
9252A149119m3612j0392o382K9264N8055k3116j01566j04160r864j8035O7721
9241I87032M5493m4186o429j1063J1800K9045n3680j076K0307n2650r337L6229
9229I51485l530J6016j3192P52q899O638j9811j898m2223N777K438M260l7763
9216H60050m6314l0743O070M5604m5809K5813K5647j0427l1381l0373l2276j6969
9204G18892l8750l6517k8958j6428N6666M9144L112m2775Q610J9729n1464n6858
9192E84403J3124J6224m180j1614Q098Q8298j7426J8415n0568n7065r98L6831
9180F23542J0055j6272j7437J7242K22k9507P776k0737l2344K6545Q7617J9438
9168F76140m9546k1196k4502O850j9273k8438l0222n9616J1049M9103M2264M1213
$$ y = [1149119, 1105507, 1095115, 1088733, 1117997, 1176052, 1152936, 1051370, 947210, 937346, 919311, 987032, 1032525, 988339, 981910, 970847, 982647, 1011692, 958012, 956936, 977243, 924593, 915256, 951485, 947955, 963971, 950779, 951531, 942632, 949270, 929459, 927561, 885338, 891115, 893553, 897813, 860050, 813736, 782993, 789063, 834667, 788858, 814671, 840318, 829891, 798510, 768137, 735861, 718892, 680142, 643625, 614667, 598239, 654905, 704049, 707161, 664386, 672996, 692725, 641261, 584403, 597527, 613751, 609571, 597957, 606055, 694353, 676927, 695342, 644774, 587709, 586711, 623542, 633597, 617325, 599888, 617130, 617352, 587845, 595621, 574884, 542540, 569085, 656702, 676140, 626594, 605398, 580896, 587746, 568473, 540035, 509813, 450197, 461246, 510349, 552613, 593826]
9156E93826K9731N656m4796m0690m1834P256j5739m2899N8248J8973r324j7565
9144E00843K0340K5923J6533K5200k3512l7406p592j763j470N0962R5420k2074
9132F41404j4144K879J14l2527l6140K511O2628j2194n5099p3663Q563m950L4535
9119E23917k1718l7858m228K0171m2012l8751M466M9345r009k3376J0363K8712
9107D60022k4771J020J6836O0681M4588o360l8766J6380N5214J4806o9764m0494
9095D89392O359J3157N3992K5939L0962Q8225R7902Q8253N4385j9964l7609n411
9083H85582J3797j5656l3547j9270Q880o4487p3487l0740r1645j0423J7293j986
9071E84311j3388J8346j7135k8104J6080N235p048R10L2861m7258k4998J7510
$$ y = [593826, 623557, 629213, 584417, 543727, 501893, 509149, 493410, 450511, 508759, 527732, 518408, 500843, 521183, 547106, 563639, 588839, 565327, 527921, 520329, 518566, 517096, 568058, 663478, 641404, 627260, 630139, 630253, 597726, 561586, 564097, 626725, 614531, 559432, 485769, 494332, 489382, 523917, 502199, 464341, 460113, 480284, 438272, 399521, 403987, 453332, 444323, 420947, 431310, 460022, 435251, 436271, 453107, 513788, 558376, 552016, 513250, 529630, 584844, 599650, 529886, 489392, 495751, 508908, 562900, 588839, 619801, 708026, 805928, 894181, 948566, 928602, 890993, 885582, 899379, 883723, 850176, 830906, 839786, 775299, 701812, 671072, 579427, 569004, 586297, 584311, 570923, 589269, 572134, 544030, 560110, 565345, 558297, 559207, 592068, 544810, 519812, 537322]
9059E37322R292J5735j0143k5199N8598K9376l0423K1639K7531j5020n433M4109
9047F57384N7521N7854o178m594M2631R3090L6630p0094m4608N0119l848m4221
9035H21686l7930J1153L0418j9271J1490Q2340J4911j2864n9052j9102n2885o2215
9023G08679m4002k4659j3185k6380J1949j9818n4198m5537j3017O547L3201R418
9011E28998l9559k7287l5382K4079N8238j0565r071K8956J6737m7020j1760O919
8999D83283J4588M093n547N8758L2917J7158M6844O3668m522k007m0626j5227
8987F53380j088q304R674K6737K3671n6339n644k0509j8721m4981l1934n8661
8975D67281m4177P982j0049q8J0357J3465p686Q091j3m8927o8495k6671n18K9414
$$ y = [537322, 546614, 562349, 552206, 527007, 585605, 614981, 584558, 606197, 633728, 618708, 613275, 657384, 714905, 772759, 766581, 761987, 804618, 897708, 934338, 864244, 819636, 869755, 865907, 821686, 783756, 794909, 825327, 806056, 817546, 899886, 914797, 901933, 842881, 823779, 770894, 708679, 664677, 640018, 626833, 600453, 612402, 592584, 538386, 492849, 479832, 486379, 519580, 528998, 489439, 462152, 426770, 450849, 509087, 498522, 489451, 518407, 535144, 488124, 476364, 483283, 497871, 501964, 496417, 555175, 588092, 605250, 652094, 715762, 711240, 709233, 668607, 653380, 652292, 643988, 653662, 680399, 704070, 647731, 642087, 621578, 602857, 557876, 525942, 467281, 423104, 431086, 421037, 420949, 431306, 444771, 437085, 445176, 445163, 396236, 327741, 301070, 300552, 329966]
8961C29966J7775j6430m782l0809j1703O701J9624m3453J4056J3918J1937K1224
8949C28024K4707O939K8100j515r437n840n728k9607L403O9750k3479l9849k2401
8936C23067m9619j4117O282L4479K564j395j3722j2218k8853m2244j2251N592
8924A97565J1149K5983j1020L094R12j674Q255K6387K8k0616J9152K8300l0351
8911B57164m1160j0244n607l3717J7757M7523J2305K0882l499j7155K1285L513
8899B69047K6041R386p069o0271j732J399R602J1096P218m0428k6168o191n819
8886A86111K1366Q868J9657k751k6645l310j2405r250R826m8872O490L4020L4330
8873B17435Q9294O7885p646L8929J5906K0010M556j6718O74m1368q3932n2172
$$ y = [329966, 347741, 331311, 326529, 295720, 284017, 290718, 310342, 266889, 280945, 294863, 306800, 328024, 352731, 359670, 387770, 386255, 376818, 370978, 365250, 335643, 339046, 408796, 385317, 345468, 323067, 273448, 259331, 265613, 300092, 302656, 301261, 287539, 275321, 246468, 204224, 191973, 197565, 208714, 234697, 223677, 226771, 227683, 226009, 234264, 260651, 260679, 240063, 259215, 287515, 257164, 216004, 205760, 200153, 166436, 184193, 231716, 244021, 264903, 261404, 244249, 265534, 269047, 295088, 304474, 297405, 237134, 235402, 236801, 246403, 257499, 264717, 224289, 198121, 191930, 186111, 207477, 216345, 236002, 233251, 206606, 203296, 190891, 181641, 191467, 142595, 149085, 183105, 217435, 306729, 374614, 366968, 405897, 421803, 441813, 446369, 429651, 430325, 388957, 305025, 252853]
8861B52853j3568J1320M618l2451r144J4640L6419j7717m4883K2797N1702k686
8849B73900m7961k247l2030J7644J6046l1642M657j8765O572M5923K0968l1230
8837B21835J5489L970J369J7909l2472P069L2459j927K0196K147j3539m7518n3456
8824A73531O15L7594r103n1389n4492M729O1122l730o815l8596J0225J05565n272
8811B23984m9835J1222N7711P964k7036j8293l8274k489J6651M4856L6037m198
8799B58300J4750K992m3889l5614k6470j1477j3065n105R412J784J4671L8644
8787B04933j4132k3031k5669l1386K2545P1296K726l2977L2403M0206k0443k6938
8775A99533k8463Q694j3644l8933p531P4212K6687j8084K1485J1508J9680l4972
$$ y = [252853, 239285, 250605, 255223, 222772, 213628, 228268, 264687, 246970, 202087, 224884, 276586, 273900, 225939, 223692, 191662, 209306, 225352, 193710, 198367, 179602, 186174, 232097, 253065, 221835, 237324, 241294, 242663, 260572, 228100, 235169, 267628, 265701, 285897, 288044, 274505, 226987, 173531, 174146, 211740, 202637, 151248, 96756, 101485, 162607, 158877, 152062, 113466, 123691, 229256, 223984, 174149, 185371, 243082, 251046, 224010, 205717, 167443, 164954, 181605, 226461, 262498, 258300, 273050, 276042, 232153, 196539, 170069, 158592, 145527, 140422, 149834, 151618, 166289, 204933, 190801, 167770, 142101, 110715, 133260, 204556, 207282, 174305, 206708, 246914, 226471, 199533, 171070, 179764, 166120, 127187, 119656, 193868, 220555, 202471, 223956, 235464, 255144, 220172]
8763B20172l0154l1745j164L0809M1899p399j1587l8870L028o260L0277j2778
8751A86228m3409O103j1120K6438N7682O7386J145l5749j2639m8676o2240j9951
8739A11198L4537K4367K072j1935L703L1069p304K2263O0958L0926m12K713M0876
8726C45031J6631o597n4084m6047m5485k5672j9638K1302P1993L6471n9975L703
8714B37633R828Q466r468o0695j1172O2850K0546k205o9065j8398p585O616O2688
8701B30039n257k5258p121j8180J3691K0911k3626q289K4214L9490M9060l7583
8689B52091q85j0853K0438M5742M0k5234L7802l5004K890p04K5902k871m8419
8676B60935J4324K2952N472K9249j2410l4941K156K6371m1287n9122l1007M5811
$$ y = [220172, 190018, 158273, 157109, 187918, 229817, 222418, 210831, 171961, 174989, 168729, 199006, 186228, 142819, 148922, 137802, 164240, 221922, 289308, 290453, 254704, 242065, 193389, 131149, 111198, 145735, 170102, 172174, 160239, 163942, 195011, 187707, 209970, 270928, 301854, 301442, 304155, 345031, 361662, 355065, 300981, 254934, 209449, 183777, 164139, 185441, 257434, 293905, 233930, 237633, 247461, 255927, 246459, 185764, 174592, 237442, 257988, 255783, 186718, 168320, 160735, 167351, 230039, 224782, 199524, 192403, 174223, 187914, 208825, 185199, 176910, 201124, 240614, 289674, 252091, 251206, 240353, 260791, 306533, 306573, 281339, 319141, 284137, 287027, 286323, 312225, 309354, 260935, 275259, 298211, 303683, 332932, 320522, 285581, 287737, 314108, 272821, 213699, 182692, 228503]
8664B28503N6453j602J9771K938L1000k614j4770K4404K5355l6959j9472L6958
8652C49965M5436R562K8457J4828j7913j6747k4261L2473j4683k5043k9409m0657
8640C12008M2849K4502L6915K2013M3597p927k922K0846K7819r864n055L4884
8628E39665J6809J2251J6518O9727N2823J1547K9735J342p564N031K6449K1403
8616G95736J0176R263l6031l7610j1747R504L6210j2274K6467Q5085J5449l8399
8604H51829j714r225k9264m814j334k8619m4073n9624m1451o0070o2736n746k479
8591E00680n3899o4108m7899O069P007N134l2758k1683L6038q024k6332Q489M0263
8578C48977k3555n3418k5793N939M5295J0567l2206J1488K7218j4527m4098K6158
$$ y = [228503, 284956, 283354, 303125, 306063, 337063, 334449, 319679, 344083, 369438, 332479, 313007, 349965, 395401, 404963, 433420, 448248, 430335, 413588, 389327, 421800, 407117, 382074, 352665, 312008, 354857, 379359, 416274, 438287, 481884, 473957, 471035, 491881, 519700, 509836, 504781, 539665, 556474, 568725, 585243, 654970, 707793, 719340, 749075, 750417, 742853, 747884, 774333, 795736, 805912, 815175, 779144, 741534, 729787, 739291, 775501, 763227, 789694, 874779, 890228, 851829, 850115, 840890, 811626, 806812, 805478, 776859, 732786, 673162, 631711, 571641, 508905, 503159, 500680, 446781, 382673, 334774, 340843, 347850, 352984, 320226, 298543, 334581, 326557, 300225, 308714, 348977, 325422, 272004, 246211, 252150, 297445, 308012, 275806, 287294, 314512, 299985, 255887, 282045]
8566B82045N3358P9468P5356L2007j3575O604M3550l6294j02918p1726p6161r999
8554B61715j7991K2061N9259K6482K055p4206n4013N474l6412j4300O9688K9275
8542B79087k9784j6602J4363n0276l1293L398L174J5729k111K2437o962L233l8
8529B04355L0959k4461l9803M234k0875j0442L9852j63j2328N2831O8428L9464
8517C32051K9218q98m72k7961j1451j2928n5222l4240k5467K3305K6893l2407
8505B10421l3642k2457J864J5924J4545K4126k414L006k840o389m6389J7640o125
8492A67270J9080K5852l0505L0483J2658m463k9068m2171m0923k5891m13L688
8480H5597P6159L1621L6524r972l1927o3109j9471P2477J6935p931m5015o3905
$$ y = [282045, 335403, 414871, 490227, 522234, 508659, 515263, 558813, 522519, 419601, 347875, 271714, 261715, 243724, 265785, 325044, 351526, 353581, 279375, 225362, 230836, 194424, 180124, 249812, 279087, 249303, 232701, 247064, 196788, 165495, 168893, 172067, 187796, 185685, 208122, 201160, 204393, 204355, 235314, 210853, 171050, 175284, 154409, 143967, 183819, 183656, 171328, 224159, 292587, 332051, 361269, 360371, 359899, 331938, 320487, 307559, 252337, 218097, 192630, 215935, 242828, 210421, 176779, 154322, 156186, 172110, 186655, 210781, 208367, 211373, 208533, 202144, 155755, 173395, 167270, 186350, 212202, 181697, 212180, 224838, 220375, 191307, 149136, 108213, 82322, 81909, 85597, 161756, 193377, 229901, 219929, 188002, 124893, 105422, 177899, 194834, 186903, 141888, 77983]
8468G7983K2029R1430M4521m6761m114k2857j0570J6827J0813M976j0440K6189
8456B00026l2608m2487J4550L127l9N3118K4662k2499l2196L2558K2997k4764
8444A96445j728L5372N2289K4540Q685m2294m0103j0081k6896k6410p1724k842
8432I5253K9371L3273k1694j5897J4704l2107m3902J7780L7613K0829P590j7719
8420A25094L0994K0575l2800p5328o057K5449K1980n6770L9243L3769j1664l3173
8408H1312j11J8016K6695J1470L3847J8000Q034m8053n3305l1708M7295J0041
8396A21533j0040l148l97l753r726j1309K3375L3220K9391j6392j9231j9480O4697
8383A78740L0851l9814l2265J6013K7815j9073m1565J5790q499K7923K474K3209
$$ y = [77983, 100012, 191442, 235963, 189202, 185088, 162231, 151661, 168488, 179301, 184277, 173837, 200026, 167418, 124931, 139481, 142608, 142569, 195687, 220349, 197850, 165654, 198212, 221209, 196445, 194717, 230089, 282378, 306918, 315603, 273309, 233206, 223125, 196229, 169819, 98095, 95253, 124624, 157897, 136203, 120306, 135010, 102903, 59001, 76781, 114394, 135223, 142813, 125094, 156088, 176663, 143863, 68535, 62478, 87927, 109907, 53137, 92380, 126149, 114485, 81312, 81201, 99217, 125912, 137382, 171229, 189229, 197263, 149210, 95905, 64197, 111492, 121533, 111493, 108345, 107948, 104195, 94469, 83160, 106535, 139755, 169146, 152754, 133523, 114043, 178740, 209591, 169777, 137512, 153525, 181340, 162267, 120702, 136492, 127993, 155916, 158390, 181599]
8371A81599K5474k7160J1578l296n5092M8683P100J2162N661m5507p102M3023
8359A97123j4133n479l349m9040n5825J3966K1474J1805J6115m4785K904L4320
8347A25096M1510N5595K5226k2518o7968m2090M2745l2083O74O3154J9325j4622
8335A94044J1329m606k9139L7229M7537p4921o0404K7507Q699J561m5973k3992
8323H8871K67R179N975K32J2421J7681J2808K2879J2251n4741m0336K553N4657
8310A44697K3230K0843m2093m8811k8084J7791J7491k8184K3240M0670k1060p057
8298A12673L021J2851k1710K2019q505k1357K8576K1676l8602k5958n6017j5726
8286A2941K9470K1972J670K809L1586J3667k0151l7879j7175M5413M0663n3487
$$ y = [181599, 207073, 179913, 191491, 188195, 133103, 181786, 188886, 201048, 206709, 161202, 154100, 197123, 182990, 177511, 174162, 125122, 69297, 83263, 104737, 116542, 132657, 87872, 90776, 125096, 166606, 222201, 247427, 224909, 156941, 114851, 157596, 125513, 126187, 189341, 208666, 194044, 205373, 200767, 171628, 208857, 256394, 181473, 121069, 148576, 157275, 158836, 112863, 88871, 89138, 98317, 104292, 104524, 116945, 134626, 147434, 170313, 182564, 127823, 87487, 90040, 144697, 167927, 188770, 146677, 97866, 69782, 87573, 105064, 76880, 100120, 140790, 119730, 112673, 115694, 128545, 106835, 128854, 120349, 98992, 127568, 149244, 110642, 84684, 28667, 12941, 42411, 64383, 66053, 68862, 100448, 114115, 93964, 56085, 38910, 84323, 124986, 71499]
8274G1499l8365l0140j4449r258j0321L426K2969L5184J808K7938m339K1513N969
8261H3434K8249J6699j8480O6985j8921O098J1831k2880k8459j1805n589m5810
8249F1352o7701L0114M0611M276O3360K4879m3086m160k0307J4149J0971M4529
8237A58987J3223n1918p1794q39K7137q1o778k2358p254N5247L8862k4265J1605
8224A19774K9426n38m8958n3247K9972K2907n4341J9002J875K7678M0178k8176
8212A05552m9448L3163J5281j4927L4686k483m8372j25M1092P805k0437o0177
8200D1610k2052M7651N706k5906j4934j9716k2797k4954O6187O5920k3256m541
8188F8918K0128K2865K7158j5595j5005l8170m0267O288J4132o958K2965o829
$$ y = [71499, 33134, 2994, -11455, -20713, -31034, -27608, -4639, 30545, 32353, 60291, 55952, 77465, 83434, 111683, 128382, 109902, 176887, 157966, 164064, 175895, 153015, 124556, 112751, 107162, 61352, -6349, 23765, 64376, 68652, 132012, 156891, 113805, 109645, 89338, 103487, 114458, 158987, 172210, 120292, 48498, 47659, 74796, 74715, 67937, 45579, 38325, 93572, 132434, 108169, 119774, 149200, 148662, 99704, 46457, 76429, 99336, 44995, 63997, 65872, 93550, 133728, 105552, 56104, 89267, 104548, 89621, 124307, 121824, 73452, 73327, 114419, 122224, 101787, 41610, 19558, 67209, 72915, 47009, 32075, 12359, -10438, -35392, 30795, 96715, 73459, 68918, 89046, 111911, 139069, 123474, 108469, 70299, 30032, 36320, 50452, 43494, 66459, 59630]
8176E9630J5941L1896j3339l2613j9320K6668L0810R410p1385K6401J3616J7642
8164I5357P0858P3473j0296l1972j4307L6666M0979l729j0601l3053l5884l3303
8152A44188k0345l8600L2863Q654o579k7494m5386L261N1151l3529m331j0358
8140E3495p406l0715l8403L2777J5853K0970L550L0069K227J8086l796K224J8363
8127A17294k7894R456J4371q245L5177O6054Q526L6158N0968k1579j8676J5667
8115B77277m2861n5217l5157R538n420N154n1586k0537J4538l9532l3685j6747
8103E765k2341n231j8758N5126L5145J81O8157K5931m9531j3604K621J0237J1039
8090A04737m9388j2081j198K1343l493P66n942j9742k5957M889N2508L1069j1523
$$ y = [59630, 75571, 107467, 94128, 61515, 42195, 68863, 99673, 109083, 37698, 64099, 77715, 95357, 166215, 239688, 229392, 197420, 183113, 219779, 260758, 257029, 246428, 213375, 177491, 144188, 123843, 85243, 118106, 126760, 120181, 92687, 47301, 50562, 101713, 68184, 63853, 53495, 46089, 15374, -23029, 9748, 25601, 46571, 50121, 80190, 82417, 100503, 96707, 98931, 117294, 89400, 98856, 113227, 104982, 140159, 206213, 214739, 250897, 301865, 280286, 261610, 277277, 234416, 179199, 144042, 153580, 148160, 153314, 101728, 81191, 95729, 56197, 22512, 5765, -16576, -21807, -40565, 14561, 49706, 49887, 118044, 143975, 94444, 80840, 83461, 93698, 104737, 55349, 43268, 42070, 63413, 59920, 60686, 54744, 35002, 9045, 13934, 66442, 97511, 85988]
8077H5988K488M66R383K1956j0329o0292k067j1610J1848P9949L4956k9654j6617
8064A16465M0776r946m1470J3212J4713j801k542N265j5641J8544K6144L0759
8052A94478N0876O2649L4229k2800k1251Q155J6588L9848j0263j7754l5970m8190
8040B50595l547N3784k5393O192N8817k014o0309k4294J9881J6224j0924o8458
8028B10554N1847L267j46K9776k747q681P086K2213L705o1175k0566O4421M4464
8015C44018O7751P0914R0467R3522R4657Q2876M7258L5885K9674m4890j57374
8004G54758q7917j28055l6495M937N9411L9580L5929J11087O4414J0203p3280
7993G54572j55848j23455j03230r2399l1003J3034O3128M631j9023j1450l513
$$ y = [85988, 88476, 88942, 98325, 120281, 109952, 49660, 47593, 35983, 47831, 127780, 162736, 133082, 116465, 157241, 147295, 105825, 119037, 133750, 131949, 129407, 134672, 119031, 137575, 163719, 194478, 245354, 308003, 342232, 319432, 298181, 306336, 322924, 362772, 352509, 334755, 298785, 250595, 247048, 300832, 275439, 281631, 340448, 338434, 278125, 253831, 273712, 289936, 279012, 210554, 262401, 265668, 265522, 295298, 292551, 283870, 290956, 313169, 316874, 255699, 235133, 299554, 344018, 411769, 482683, 573150, 666672, 761329, 844205, 891463, 927348, 957022, 912132, 754758, 666841, 538786, 502291, 507228, 566639, 606219, 642148, 753235, 817649, 827852, 754572, 598724, 475269, 372039, 279640, 248637, 261671, 324799, 329430, 310407, 298957, 295444]
7982B95444M0670J8171o9355l6807J5402J818j58L5277L2779K0995K2671N3789
7970D30696R964J1057N5992O6572M3149J1506P0617Q6490k6203n4142p6179l6485
7958E93034L11M7621O9124N2403j0121k7330q2714j22093n1047m5594r0352k3427
7946C09815K5494j3581Q877K5709k5606o2913o873m6m1637l6491m3467j610k532
7933A35139o826J2076L2948m5874L0293N2569J0420N9627M6962n622L3467k0134
7921C35045l9558Q215n092j4323J2796R509m0539l1259k5864J854J2545J6081
7909B39410L442o4685j2171l0484k1941r176n3346K2939R6359J2335m1246m231
7897A37205Q514n0917l5478J3474M2637J4949r107J4105j1620Q949R558k5136
$$ y = [295444, 336114, 354285, 284930, 248123, 263525, 265343, 265185, 300462, 333241, 354236, 376907, 430696, 440660, 451717, 507709, 574281, 617430, 628936, 699553, 786043, 759840, 705698, 629519, 593034, 593345, 640966, 710090, 762493, 752372, 725042, 642328, 520235, 469188, 423594, 333242, 309815, 335309, 321728, 330605, 356314, 330708, 267795, 260922, 260876, 219239, 182748, 139281, 137671, 135139, 128313, 140389, 173337, 127463, 157756, 210325, 220745, 280372, 327334, 321712, 355179, 335045, 295487, 303702, 298610, 284287, 297083, 306592, 266053, 234794, 208930, 210784, 223329, 239410, 242852, 178167, 165996, 135512, 113571, 104395, 51049, 73988, 170347, 182682, 141436, 137205, 145719, 94802, 59324, 72798, 115435, 130384, 121277, 135382, 123762, 132711, 142269, 117133]
7885A17133j4638K0021k5406j4444m7607R157N8328j8298k0689k0900L8027J1790
7873I2474q196k390K450l2749n835n5515j752p755j7991K3572O0174O1678N0923
7860A59088J0539m5318L9861p227n3911m1644J1499m3089k126j8490n867J1011
7848A4326Q872j2231L3644k411J5464k7869l1151Q149K371j5913K6256L2893K9936
7835H2336J7168K6806r898k0252j3148M243M635l9368K4334J4235l5909K0806
7823G5988M6372J0928r6345n2962L5015J367j9408k5709N454O1267L2824j509
7811G3282n53l2634l7553J4418j3849q871J346N887K8584J9629J2449m5828l0301
7798a3994M9035J4233k0484J5805K1738m1386j0725j0798r676j3824K6187L3269
$$ y = [117133, 102495, 122516, 97110, 82666, 35059, 44216, 102544, 84246, 63557, 42657, 80684, 92474, 84278, 81888, 84338, 51589, 45754, -9761, -11513, -19268, -37259, -13687, 46487, 108165, 159088, 169627, 124309, 164170, 156943, 103032, 61388, 72887, 29798, 27672, 9182, 3315, 14326, 23198, 10967, 44611, 42200, 57664, 29795, -1356, 6793, 9164, -6749, 19507, 52400, 82336, 99504, 126310, 116412, 96160, 83012, 87255, 91890, 52522, 76856, 91091, 55182, 75988, 122360, 133288, 36943, -16019, 18996, 20363, 955, -24754, -19300, 41967, 74791, 73282, 72729, 40095, 2542, 16960, 3111, -5760, -4414, 1473, 30057, 49686, 62135, 16307, -13994, 35041, 49274, 28790, 44595, 66333, 24947, 14222, 3424, -6252, -20076, 6111, 39380]
7786C9380N185J2190m7147m4882L7681k2169J1120J7552L5492J888K0362M930
7774G1582m376n7536K3834O1504R308q854l4155L3308M5682m4972k0088j8783
7762E6454m045n419p199m6720J7465j8024O2389K1523m188J8627k6869M4570L7895
7749A46459J1112l0617m9518N724j5284Q909N679n5150o93k0991p6414k0733N7461
7736c4056P6417M8106L6826r303m6814J5851l9219m8331K6716K3399r775M8640
7724H8457j8533l0633J3568K9417j0038n946k7478l5857q73J7679J0024L7512
7712F7299J4013O238k3413k4658N719L3641k5323l0469q674j2215k1821R433K4793
7699A4563J1351L6424L760J1173P0407k3378O789K8129m2362r1964l5599N0846
$$ y = [39380, 44565, 56755, 9608, -35274, 2407, -19762, -8642, 8910, 44402, 46290, 66652, 71582, 67206, 9670, 33504, 95008, 104316, 95462, 61307, 94615, 140297, 95325, 75237, 56454, 52409, 46990, 39791, -6929, 10536, -7488, 54901, 76424, 72236, 90863, 63994, 108564, 146459, 157571, 126954, 77436, 83160, 67876, 76785, 82464, 27314, 26621, 5630, -70784, -91517, -34056, 42361, 90467, 127293, 117990, 71176, 87027, 47808, -523, 26193, 49592, 39817, 88457, 69924, 39291, 52859, 82276, 72238, 66292, 38814, 2957, 2084, 19763, 29787, 67299, 81312, 87550, 64137, 39479, 45198, 78839, 53516, 23047, 14373, 2158, -19663, -10230, 14563, 25914, 62338, 66098, 77271, 147678, 124300, 131089, 159218, 116856, 24892, -10707, 40139]
7687D0139L0393j3551M097m0097o3751k8038K0054M3306O0192j0112n530j0497
7675B6605o998m3222J5870J2397J4098k85j7160R04K1312Q420J9580L1713O714
7662H9948j1390l1402m2378L2729K0848J1464m3791n255J0406J1281m103j7599
7650B0758p639O654q880L7127r481m3457j8823K2141j971r653m6172L035L1976
7637b4385K4087M08K3537M6245m4728K821K7876O510j2025j9534M219K7905K1975
7624H4911J8123K7037K8140p3302n9659M1299J5034M922Q784M505p039j6025l1610
7611D5120r0590k1640Q0112L539o474j0696Q384J1476J6432k0153j2745P897k8809
7598a8147p57K4262P1155K8736j2472N780k0126m173m260k9155J6703o95k2373
$$ y = [40139, 70532, 56981, 61078, 20981, -42770, -70808, -50754, -7448, 52744, 42632, 37102, 26605, 19607, -23615, -7745, 4652, 18750, 18465, 1305, 2209, 23521, 31941, 51521, 83234, 89948, 78558, 47156, 4778, 37507, 58355, 69819, 26028, 20773, 31179, 42460, 38357, 20758, 13119, 19773, 10893, 48020, 38539, -4918, -23741, -1600, -3571, -13224, -59396, -56361, -24385, -298, 110, 23647, 69892, 25164, 27985, 55861, 62371, 50346, 30812, 35031, 62936, 84911, 103034, 130071, 158211, 84909, 25250, 66549, 81583, 86505, 95289, 99794, 92755, 76730, 45120, -45470, -67110, 13002, 16541, 10067, -629, 7755, 19231, 35663, 15510, 2765, 10662, -18147, -18904, 5358, 76513, 105249, 92777, 98557, 78431, 74258, 69998, 40843, 57546, 56851, 34478]
7585C4478j010K2646O7139j6110n6283N217m993M950k5458k8288l2807O046l0022
7572e4495R442L1443N792K2488K1406q828r399Q336o614q730k878l447J8715Q796
7558C2027K7867l1111k414m3883k1202J3890M8964J8615j0693l988J321n1850
7546b2457m0287J8162j5733j3000K9192Q434j1126J5531M6422r746O1493O9320
7534A36205j8168j1761m2398j907j9595j3310J3363R60k5241L186K9428J0886
7522F1648l6865m0145L3386P490j3535L1011k507O870K643J0718m4015j1935j9156
7509a4392P289k6776L371M9934K1414n8254m1701N1079L1095K7687o606J7570
7497F1710K1161k8597K0814J9166l3249m7440j9836J4679K0378l7903m4812n764
$$ y = [34478, 33468, 56114, 123253, 107143, 50860, 56077, 51084, 56034, 30576, 2288, -30519, -24473, -54495, -45053, -13610, -7818, 14670, 36076, 27248, 17849, 26185, 19571, 10841, 7963, 4516, 23231, 32027, 59894, 28783, 26369, -17514, -38716, -24826, 24138, 42753, 32060, 28072, 29393, -22457, -62744, -44582, -60315, -73315, -44123, -35689, -46815, -31284, 15138, 5392, 66885, 136205, 118037, 106276, 63878, 61971, 42376, 29066, 42429, 43389, 18148, 21334, 50762, 61648, 24783, -15362, 18024, 25514, 11979, 42990, 40483, 47353, 49996, 60714, 16699, 4764, -14392, -7103, -33879, -30508, 19426, 40840, -17414, -59115, -8036, 23059, 50746, 44140, 61710, 82871, 54274, 75088, 94254, 61005, 13565, -6271, 8408, 28786, -9117, -53929, -59693]
7485e9693L1815O3972J9088n769k4062K512L4255J2537j8867j3662M954r033k8899
7472I148N15J6911O537r96Q326o202o0866k8301J2727N937L5702m2498p895K3203
7458b7752J9457M9048K6580K4607J1045j3457J0426k7362L798J8484R289n27j3099
7445I0537l5844j0208L9309j7434j9512j4762J5441l574k6491k6029M572M1312
7433C7317Q519K5041L1142M7692n6179p5337j7172Q029K7043K675K0091l1322
7421B7539j713j2317m7341l7997k0502o520M5977J8917L7910k1529r915J2775
7409a4716J0065K8864p008p213n1874J1765L5585L3953J3511J2470M746R29l2266
7396C8811k0681j3796k90J2318j4467j0333K7410j224J4737j7822m5376j8966
$$ y = [-59693, -27878, 36094, 55182, 49413, 25351, 27863, 62118, 74655, 55788, 42126, 47080, 38047, 9148, 9663, 26574, 33111, 32115, 40441, 34239, -26627, -54928, -42201, -36264, -562, -43060, -50955, -27752, -8295, 40753, 67333, 91940, 102985, 89528, 99954, 72592, 76390, 94874, 104163, 103636, 90537, 54693, 44485, 83794, 66360, 46848, 32086, 47527, 43953, 17462, -8567, -3995, 37317, 45836, 70877, 102019, 149711, 93532, 18195, 1023, 9052, 36095, 38770, 58861, 27539, 25826, 13509, -33832, -71829, -92331, -98851, -52874, -33957, 3953, -17576, -27491, -14716, -4651, 24213, 17205, 9992, -41882, -30117, 5468, 39421, 52932, 65402, 70148, 71077, 38811, 18130, 4334, 4044, 16362, 1895, -8438, 18972, 17748, 32485, 14663, -30713, -49679]
7384d9679j0223K5571J3088N988O6711N3947j3493j6197k3434m3611J495m8999
7372c8836k7434J8933L8271p50N980M812M418j4911l0808O318J5898O412N064
7359f633K536k235L7701j1943l6972q513M1184m3878J8410M1466K5991o0112m5936
7346d8934N901L2845K0844l3168K9007l63j3913k0700K3817M9958l2651k9627
7334a6984j326N5884L5261j7330m136O143o0221q057K3899J4676k580m674j8473
7321B082J6144M605l4433J2269N8764L6741l2789l3607j9387l3635K9297J9393
7309B5444l597J9934j1393j0854K5435J1113j2860k1736l0888k0784k7307l9472
7297i6965L0782L4766R1696m692q553j6937K249Q962j8855l4950J68k6817p558
$$ y = [-49679, -59902, -34331, -21243, -15255, 51456, 105403, 91910, 75713, 52279, 8668, 10163, -38836, -66270, -47337, -9066, -9816, -3836, 976, 5394, -9517, -40325, -34007, -18109, -11697, -6633, -4097, -6332, 31369, 19426, -17546, -26059, 15125, -28753, -10343, 31123, 57114, -2998, -48934, -43033, -10188, 10656, -22512, 6495, 6132, -7781, -28481, -4664, 45294, 12643, -16984, -18310, 37574, 72835, 55505, 51369, 57512, -2709, -10766, 13133, 27809, 25229, 20555, 2082, 18226, 22831, -11602, 667, 59431, 96172, 63383, 29776, 10389, -23246, 6051, 25444, 21847, 41781, 30388, 19534, 44969, 56082, 43222, 21486, -9402, -30186, -57493, -96965, -66183, -31417, 60279, 55587, 47034, 30097, 32346, 41308, 22453, -12497, -12329, -39146, -46704]
7284d6704J3476M8120J2755l7572K744K3371L044J6179J0511q705L871M2610k6188
7271E7512K046K4804l9487n7818q703O980L5845j7537o2112J0558K428K3540M2818
7258B0874Q100j2007K1397m6751P19m4209j5840K2835L6261M3054J9790k1592
7246C2631l0674k1837j0064J382j4412L0159L3454L6419O013m3845l1626K1644
7234I244k7579k2387J6555O4690L7992n7350m3051o016L836L3989K0295k0361
7222I857k2122k4719J0287J0986l5912O376j0556k1826O8172Q888o224Q656J3337
7209A5200K4451L4610k2545j7563K7945J1279j6858j9618p903j3873n7120j5774
7197e7769L8603j8020L7258L9951K4788n2905j4391K5357j9228N0393K5997n2547
$$ y = [-46704, -33228, 14892, 27647, -9925, -7181, 16190, 19234, 35413, 45924, 37219, 41090, 83700, 57512, 59558, 84362, 44875, -12943, -21646, -14666, 21179, 3642, -58470, -47912, -45484, -21944, 20874, 28974, 16967, 38364, -8387, -7668, -51877, -67717, -44882, -8621, 34433, 54223, 32631, 1957, -19880, -29944, -28562, -42974, -12815, 20639, 57058, 63071, 19226, -12400, 9244, -18335, -40722, -24167, 40523, 78515, 21165, -21886, -27902, -24066, 9923, 30218, 9857, -12265, -36984, -26697, -15711, -51623, -45247, -55803, -77629, -9457, -569, -6793, 1863, 15200, 39651, 74261, 51716, 34153, 62098, 73377, 56519, 36901, 28998, 15125, -41995, -57769, -19166, -37186, 72, 40023, 64811, 11906, -2485, 22872, 3644, 54037, 80034, 27487]
7185B7487n8780M8116J5400j7104m209j0029o183J5621k8864K700j1613K757Q424
7172a6277k5349j7402j0968J592j6232M899K602k3773J9564K8906M0562J9380
7160G504l732l8150L487l827l4339k9840N905M2063N3788K638r751n30p812N1373
7146C8777L0434j6097o629k1782L2237L0512O051o1065p1528j8367M0303N4340
7134C7186J6983p773n7900o6588L5496L1425M407J3220K2790P883m7290l3508
7122d3669L0155J183L960l18k3953k4400K3541k8700k139n772N2301N5163P486
7109D4838q5016o5767j6154M076K4395M2544K8814j9733K866J110l960J7668J812
7096b2507k1440L5100M9744J6072k3839j779L1138K5017l3949l9335k7934r835
$$ y = [27487, -31293, 16823, 32223, 15119, 10910, 881, -5302, 10319, -18545, -15845, -27458, -24701, -16277, -41626, -59028, -69996, -68404, -84636, -79737, -77135, -100908, -81344, -52438, -11876, 7504, 3772, -34378, -30891, -34718, -69057, -98897, -92992, -50929, 2859, 5497, -4254, -4784, -12596, 38777, 69211, 53114, 46485, 24703, 56940, 87452, 93503, 32438, -39090, -57457, -17154, 37186, 54169, 46396, -11504, -78092, -42596, -11171, -6764, 6456, 29246, 37129, -10161, -43669, -13514, -12331, -8371, -8689, -32642, -57042, -33501, -62201, -64340, -70112, -17811, 37352, 44838, -40178, -105945, -122099, -118023, -93628, -51084, -22270, -42003, -39137, -38027, -41987, -24319, -22507, -43947, -8847, 40897, 56969, 33130, 31351, 62489, 87506, 53557, 14222, -13712, -23547]
7084b3547k5626M5123J9656J1998n3430j9142L1669O471k2833M5161N7195l1673
7072D1022k0622r389O101j6215N941K2321J2104k9257n265j0256l2086K3663K570
7059i368l452k1066K1496K2346m7380j8628l7544J3281k311J6762K1038N782q484
7046d7528k8548L5254N2762j0492L1382M3906M212m1482l295M3147j7025m2388
7034A9905k5139L5894K6853L2404k8822l0071k8465J7760o910P983k6900l3238
7022c8746L3161M5770K2333J0270q454J825o2581k0651J67j340J1946l9224Q755
7009c6769J0458o906l5907K1759N7587J5065K5356M028o670k1448m0474j6436
6997c0357Q882P782l0155m0109N0596J2606j6114k5377n0867Q581J8992j0274
$$ y = [-23547, -49173, -4050, 15606, 27604, -25826, -44968, -13299, -6828, -29661, 15500, 72695, 41022, 20400, 11011, 17112, 897, 6838, 29159, 41263, 12006, 6741, -3515, -35601, -11938, -9368, -12820, -33886, -12390, 9956, -37424, -56052, -93596, -80315, -82626, -65864, -44826, -39044, -47528, -76076, -40822, 11940, 1448, 32830, 76736, 80948, 39466, 36171, 79318, 62293, 19905, -5234, 30660, 57513, 89917, 61095, 31024, 2559, 20319, 13409, 21392, -5508, -38746, -5585, 40185, 62518, 72788, 64334, 66159, 3578, -17073, -16906, -18246, -6300, -45524, -36769, -26311, -33217, -69124, -47365, 10222, 25287, 50643, 54671, 48001, 26553, -13921, -30357, -21475, -13693, -43848, -83957, -33361, -20755, -36869, -62246, -113113, -104532, -85540, -95814]
6985i5814M1413J3681J5180j4053l222M571N1945k1223J446j4537j9110L2263
6973g460K3557j2497K5774K6202o067k0068j871J6726k3792K4836R825l7505j5095
6960B565J5176J3215l5434j859L4296J4616j8347p3380K493M6164J5611m1862
6948b6746J091N8399K3812j3490m9161r729j994L120K3159k7904K7495K1913k3959
6935F006k5168J2674M7028L1151k7718k4853J779L0120J3112n420J6041j1355
6923F3397m0229m9408n2545M1771j3219J5008P9139N3787O854q5352o8501j3347
6911f2645o67L734O362L0545J7899P076K9854K2605m4312k2960k5201j8565O6123
6898I848P751L7323K0354N7322R213q3424p0419l6683m42N486n004N466R288J932
$$ y = [-95814, -54401, -40720, -25540, -39593, -42815, -38244, 13701, -7522, -6076, -20613, -39723, -7460, 16097, 3600, 29374, 55576, 49509, 29441, 27570, 44296, 20504, 45340, 55165, 17660, 2565, 17741, 30956, -4478, -6337, 27959, 42575, 24228, -49152, -46659, -495, 15116, -26746, -25655, 32744, 56556, 43066, -6095, -15824, -17818, -14698, 8461, -19443, 8052, 29965, 6006, -19162, -6488, 40540, 71691, 43973, 19120, 20899, 51019, 64131, 58711, 74752, 63397, 23168, -26240, -78785, -37014, -50233, -35225, 43914, 97701, 104555, 19203, -49298, -62645, -63312, -59578, -53216, -22671, -4772, 2304, 32158, 54763, 10451, -12509, -37710, -56275, 9848, 17599, 54922, 75276, 132598, 141811, 58387, -12032, -48715, -49157, -43671, -48675, -43209, -33921, -31989]
6884c1989J0697L3907J8290K1153k3373l4329J5180M71l1676J0576K8206P870
6872B4983j6660k8628o950J7362K5315n074j3616L4146R854l1848l0744k0801
6860d2661K0534K0150Q31J0427L3978R217R704k74l117m4066k2572K8288L5279
6847E5718J803J5142l9964o008P638L3754M4562k4361m1243l2592Q550M1491l8491
6834B5999P631j932q282n5466k0631L1231n21L687j8278P898L8449K2068j3244
6821A8609J4208K107j9354j429K9372k7197k0916j6553k6880J0289J770J5496
6809b0478l8192l3422L5138j61m4282L366J6291q220m869J862L7075J3241l51
6796d3002j4015q264k8076o174K0273J2934N410K3095J1809j1996n1275j8471
$$ y = [-31989, -21292, 12615, 30905, 52058, 28685, -5644, 9536, 10007, -21669, -11093, 17113, 24983, 8323, -20305, -27255, -9893, 15422, 10348, -3268, 30878, 40732, 8884, -21860, -42661, -22127, -1977, -1146, 9281, 43259, 52476, 62180, 61906, 58789, 14723, -7849, 20439, 55718, 57521, 72663, 32699, 26691, 34329, 68083, 112645, 88284, 47041, 14449, 22999, 64490, 25999, 33630, 31698, 23416, -32050, -52681, -21450, -21971, -18284, -36562, -28664, 9785, 31853, 18609, 32817, 34924, 15570, 14141, 43513, 16316, -4600, -21153, -48033, -37744, -35974, -20478, -58670, -92092, -56954, -57115, -101397, -98031, -81740, -89960, -94829, -92967, -55892, -42651, -43002, -57017, -65281, -93357, -99531, -79258, -66324, -60914, -37819, -26010, -38006, -89281, -107752]
6784a07752J1457O4967K8590M3450n21J294j6688k5583j3949K9677j3033k5504
6772b3595j4469n6847j2106r561L9542L5619k6187m1075J4029J7490L5631K0890
6760b0639m630M8316k2608l5906L5825k036o143j8031J187j3060J9779K930k5444
6747d0460K3372L8403K0408j3884k4881J1157M85K6302m162p145L8144m1585l4506
6734h352j3447l95K4831M5291K8818j6612m645k1535L827R074K8657n6401k8036
6721h925J1514K6276m473p076n5811o0414P68M429N0006K4332N6925n794m2876
6708a1119k1124K4758K4084j6894J1323k885M0453k052l908k8584l7719J6497
6696g170R792L8407m7808m2512L7091j70l1380k7121Q888j6455j8221J7483K7442
$$ y = [-107752, -96295, -31328, -2738, 40712, 40191, 41485, 24797, -786, -14735, 14942, 1909, -23595, -38064, -94911, -107017, -116578, -77036, -41417, -67604, -108679, -94650, -77160, -41529, -20639, -25269, 23047, 439, -35467, 358, -1678, -7821, -25852, -24665, -37725, -17946, -15016, -40460, -17088, 21315, 41723, 27839, 2958, 14115, 14600, 40902, 36740, 29595, 67739, 26154, -8352, -21799, -22194, 2637, 47928, 76746, 60134, 55489, 33954, 37781, 46855, 75512, 19111, -8925, 2589, 28865, 24392, 17316, -38495, -98909, -98141, -93712, -43706, -19374, 37551, 31757, -11119, -32243, -7485, 16599, -295, 11028, 8143, 48596, 46544, 42636, 14052, -23667, -7170, 2622, 41029, -6779, -49291, -12200, -12370, -43750, -70871, -61983, -78438, -96659, -79176, -51734]
$$ [...]
##END NTUPLES=NMR SPECTRUM
##END=
