##TITLE=Analysis number 321339
Compound Code cc 55746
Book Reference 467/62/3
Project Code adrs
Chemist Name benw
##JCAMPDX= 6.0         $$ Bruker NMR JCAMP-DX V2.0
##DATA TYPE= NMR SPECTRUM
##DATA CLASS= NTUPLES
##ORIGIN= Bruker BioSpin GmbH
##OWNER= nmr
$$ XWIN-NMR		Version 3.5
$$ Fri Aug  4 11:16:30 2006 GMT Daylight Time (UT+1h)  MAYBRIDGE\nmr@NMR_250MHZ
##.OBSERVE FREQUENCY= 250.131544655141
##.OBSERVE NUCLEUS= ^1H
##.ACQUISITION MODE= SIMULTANEOUS (DQD)
##.ACQUISITION SCHEME= undefined
##.AVERAGES= 16
##.DIGITISER RES= 18
##SPECTROMETER/DATA SYSTEM= dpx250
##.PULSE SEQUENCE= zg30
##.SOLVENT NAME= CDCl3
##.SHIFT REFERENCE= (INTERNAL, CDCl3, 0, 16.522)
##AUDIT TRAIL= $$ (NUMBER, WHEN, WHO, WHERE, WHAT)
$$ ##TITLE= Audit trail, XWIN-NMR		Version 3.5
$$ ##JCAMPDX= 5.01
$$ ##ORIGIN= Bruker BioSpin GmbH
$$ ##OWNER= nmr
$$ C:\u/data/dgb/nmr/ADRS/300/pdata/1/auditp.txt
$$ ##AUDIT TRAIL=  $$ (NUMBER, WHEN, WHO, WHERE, WHAT)
(   1,<2006-08-04 11:16:04.93 +100>,<MAYBRIDGE\nmr>,<NMR_250MHZ>,
      <created by zg, POWCHK disabled, PULCHK disabled
       configuration hash MD5:
       E2 DF 36 D8 04 B2 41 60 5A D7 A3 38 5A 4B D0 FE
       data hash MD5: 64K
       96 1F 34 F3 66 E2 D9 E2 07 FA 26 50 F5 F3 FE 0D>)
(   2,<2006-08-04 11:16:16.32 +100>,<MAYBRIDGE\nmr>,<NMR_250MHZ>,
      <Start of raw data processing
       ef LB = 0.3 FT_mod = 6 PKNL = 1 SI = 32K 
       data hash MD5: 32K
       9A B9 3F 12 26 09 2E 8A C4 3B A2 C3 CD BE BA 71>)
(   3,<2006-08-04 11:16:18.10 +100>,<MAYBRIDGE\nmr>,<NMR_250MHZ>,
      <apk 
       data hash MD5: 32K
       0B EA 73 E1 37 D8 74 DF 5F 01 7E 04 B2 69 90 F7>)
(   4,<2006-08-04 11:16:19.25 +100>,<MAYBRIDGE\nmr>,<NMR_250MHZ>,
      <abs ABSG = 5 
       data hash MD5: 32K
       95 43 DB 37 A5 DB 66 BC 08 54 1E E8 62 64 7B C4>)
$$ ##END=
$$ 
$$ hash MD5
$$ CB 49 FC 45 9F 1D 2F EF 82 3B 00 68 39 D2 16 C9
##$RELAX= 
##$RELAX= 
##$RELAX= 
##$RELAX= 
##$RELAX= 
##$RELAX= 
##$RELAX= 
$$ Bruker specific parameters
$$ --------------------------
##$DU= <C:\u>
##$EXPNO= 300
##$NAME= <ADRS>
##$PROCNO= 1
##$TYPE= <nmr>
##$USER= <dgb>
##$AMP= (0..31)
100 100 100 100 100 100 100 100 100 100 100 100 100 100 100 100 100 100 
100 100 100 100 100 100 100 100 100 100 100 100 100 100 
##$AQSEQ= 0
##$AQ_mod= 3
##$AUNM= <au_zg>
##$AUTOPOS= <9 >
##$BF1= 250.13
##$BF2= 250.13
##$BF3= 250.13
##$BF4= 250.13
##$BF5= 500.13
##$BF6= 500.13
##$BF7= 500.13
##$BF8= 500.13
##$BYTORDA= 1
##$CFDGTYP= 0
##$CFRGTYP= 5
##$CHEMSTR= <none>
##$CNST= (0..31)
1 1 145 1 1 1 1 1 1 1 1 1 1 1 1 1 1 1 1 1 1 1 1 1 1 1 1 1 1 1 1 1 
##$CPDPRG= <>
##$CPDPRG1= <>
##$CPDPRG2= <>
##$CPDPRG3= <>
##$CPDPRG4= <mlev>
##$CPDPRG5= <mlev>
##$CPDPRG6= <mlev>
##$CPDPRG7= <mlev>
##$CPDPRG8= <mlev>
##$CPDPRGB= <>
##$CPDPRGT= <>
##$D= (0..31)
0 1 0 0 0 0 0 0 0 0.06 0 0 0 0 0 0 0.0002 0 0 0 0 0 0 0 0 0 0 0 0 0 0 
0 
##$DATE= 1154686563
##$DBL= (0..7)
120 120 120 120 120 120 120 120 
##$DBP= (0..7)
150 150 150 150 150 150 150 150 
##$DBP07= 0
##$DBPNAM0= <>
##$DBPNAM1= <>
$$ [...]
##$SUBNAM7= <"">
##$SUBNAM8= <"">
##$SUBNAM9= <"">
##$SW= 20.6930455092707
##$SWIBOX= (0..15)
0 0 3 0 0 0 0 0 0 0 0 0 0 0 0 0 
##$SW_h= 5175.983436853
##$TD= 65536
##$TD0= 1
##$TE= 295.16
##$TE2= 300
##$TE3= 300
##$TEG= 300
##$TL= (0..7)
0 120 120 120 120 120 120 120 
##$TP= (0..7)
150 150 150 150 150 150 150 150 
##$TP07= 0
##$TPNAME0= <>
##$TPNAME1= <>
##$TPNAME2= <>
##$TPNAME3= <>
##$TPNAME4= <>
##$TPNAME5= <>
##$TPNAME6= <>
##$TPNAME7= <>
##$TPOAL= (0..7)
0.5 0.5 0.5 0.5 0.5 0.5 0.5 0.5 
##$TPOFFS= (0..7)
0 0 0 0 0 0 0 0 
##$TUNHIN= 0
##$TUNHOUT= 0
##$TUNXOUT= 0
##$USERA1= <user>
##$USERA2= <user>
##$USERA3= <user>
##$USERA4= <user>
##$USERA5= <user>
##$V9= 5
##$VALIST= <valist>
##$VCLIST= <CCCCCCCCCCCCCCC>
##$VD= 0
##$VDLIST= <DDDDDDDDDDDDDDD>
##$VPLIST= <PPPPPPPPPPPPPPP>
##$VTLIST= <TTTTTTTTTTTTTTT>
##$WBST= 1024
##$WBSW= 4
##$XGAIN= (0..3)
0 0 0 0 
##$XL= 0
##$YL= 0
##$YMAX_a= 548114
##$YMIN_a= -652663
##$ZGOPTNS= <>
##$ZL1= 120
##$ZL2= 120
##$ZL3= 120
##$ZL4= 120
##$ABSF1= 16.522
##$ABSF2= -4.171173
##$ABSG= 5
##$ABSL= 3
##$ALPHA= 0
##$AQORDER= 0
##$ASSFAC= 0
##$ASSFACI= 0
##$ASSFACX= 0
##$ASSWID= 0
##$AUNMP= <proc_1d>
##$AZFE= 0.1
##$AZFW= 0.1
##$BCFW= 0
##$BC_mod= 0
##$BYTORDP= 0
##$COROFFS= 0
##$CY= 12.5
##$DATMOD= 1
##$DC= 0
##$DFILT= <>
##$DTYPP= 0
##$F1P= 14.0000005364418
##$F2P= -0.99999901652339
##$FCOR= 0.5
##$FTSIZE= 32768
##$FT_mod= 6
##$GAMMA= 0
##$GB= 0
##$INTBC= 1
##$INTSCL= 1
##$ISEN= 128
##$LB= 0.3
##$LEV0= 0
##$LPBIN= 0
##$MAXI= 10000
##$MC2= 0
##$MEAN= 0
##$ME_mod= 0
##$MI= 0
##$NCOEF= 0
##$NC_proc= -4
##$NLEV= 6
##$NOISF1= 0
##$NOISF2= 0
##$NSP= 0
##$NTH_PI= 0
##$NZP= 0
##$OFFSET= 16.522
##$PC= 1
##$PHC0= 146.8982
##$PHC1= 4.815516
##$PH_mod= 1
##$PKNL= yes
##$PPARMOD= 0
##$PSCAL= 4
##$PSIGN= 0
##$REVERSE= no
##$SF= 250.13
##$SI= 32768
##$SIGF1= 0
##$SIGF2= 0
##$SINO= 400
##$SIOLD= 32768
##$SREGLST= <1H.CDCl3>
##$SSB= 0
##$STSI= 32768
##$STSR= 0
##$SW_p= 5175.98343685301
##$SYMM= 0
##$S_DEV= 0
##$TDeff= 65536
##$TDoff= 0
##$TI= <Analysis number 999999
Compound Code 99
Book Reference 9
Project Code 9>
##$TILT= no
##$TM1= 0
##$TM2= 0
##$TOPLEV= 0
##$USERP1= <user>
##$USERP2= <user>
##$USERP3= <user>
##$USERP4= <user>
##$USERP5= <user>
##$WDW= 1
##$XDIM= 32768
##$YMAX_p= 374843332
##$YMIN_p= -678801
$$ End of Bruker specific parameters
$$ ---------------------------------
##NTUPLES= NMR SPECTRUM
##VAR_NAME=  FREQUENCY,     SPECTRUM/REAL,   SPECTRUM/IMAG
##SYMBOL=    X,             R,               I
##VAR_TYPE=  INDEPENDENT,   DEPENDENT,       DEPENDENT
##VAR_FORM=  AFFN,          ASDF,            ASDF
##VAR_DIM=   32768,         32768,           32768
##UNITS=     HZ,            ARBITRARY UNITS, ARBITRARY UNITS
##FACTOR=    0.157963299565203, 1,           1
##FIRST=     4132.6476996994, 0,             0
##LAST=      -1043.33573715361, 0,           0
##MIN=       -1043.33573715361, -678801,     0
##MAX=       4132.6476996994, 374843332,     0
$$ Real data points
##PAGE= N=1
##DATA TABLE= (X++(R..R)), XYDATA
$$ [...]
16072a7337J8571k8984J3169o748k0999J0864J0631P781N4K849n0k433K922R3
16058i617k4744Q624J8364j5769l6019J771J9330M5311m857j4205K4065Q1k391
16045I944j0534l001j1248o62K3878J529K283k0455P876J4558j4229L43p516r123
16031a6357J4914J8272K1772Q631k1692j7743j9822R993Q415j1132n225l659j1252
16018b4885o445p364J7098J4018J4542r83o621j1681j7400j3269p762J5709J6582
16005a8461M120j3479p973P066R351Q809J013q508J4499p960k7777l6898J1960
15992f4238K3276J3717P015R621j2532l4387J5636L0273m827j1471q516J4583
15980b1850k590j5180K0308n049m3943R374J7324K0168K9547j4270m103O504j3304
$$ plain form
16072 -17337 1234 -27750 -14581 -21329 -42328 -31464 -20833 -13052 -12998 -10149 -10199 -12632 -9710 -9617
16058 -9617 -34361 -25737 -7373 -23142 -59161 -57390 -38060 7251 2394 -11811 12254 12335 9944
16045 9944 -590 -3591 -14839 -15501 8377 9906 12189 -8266 -390 14168 -61 282 -7234 -16357
16031 -16357 -1443 16829 38601 47232 25540 7797 -12025 -2032 6383 -4749 -9974 -13633 -24885
16018 -24885 -31330 -38694 -21596 -7578 6964 5981 -640 -12321 -29721 -42990 -50752 -35043 -18461
16005 -18461 -14341 -27820 -35793 -28727 -19376 -10567 -9554 -18062 -3563 -11523 -39300 -76198 -64238
15992 -64238 -40962 -27245 -20230 -10609 -23141 -57528 -41892 -11619 -16446 -27917 -36433 -21850
15980 -21850 -24440 -39620 -19312 -24361 -68304 -58930 -41606 -21438 8109 -6161 -10264 -3760 -17064
15967a7064o56K3451J2504q387j2146j199k2778j3457N258K2972K9712k7160p227
15954a6177J8463p185k1030O756M4785K0122j0896j8849Q889P355R534j0059N68
15941C2276j7943J18J6864k266P166J1803j3214p223L676K953o644k344M536m712
15927B5046k0856k1916j164l0789k957K7308K1935q239k5922q106P890L9652J9548
15914B1430k5411j2091Q791j4447N021K0687p787k4156j8380l350J1883j2007
15902d9817K000Q78j308K443L0699r116p129k700L542r729j1233j6532J5611L0043
15888b2348Q552q785j4150L0121k0490o192J5292J4435Q323p37k2703J3948M259
15875d75k5520K279J746k676K2843K5473p190l207n95j1978k9039j0102p396R552
$$ plain form
15967 -17064 -17720 5731 18235 9848 -2298 -3497 -26275 -39732 -34474 -11502 18210 -8950 -16177
15954 -16177 2286 -4899 -25929 -19173 25612 45734 34838 15989 24878 32233 41767 31708 32276
15941 32276 14333 14451 31315 29049 36215 48018 34804 27581 31257 34210 27566 25222 29758 25046
15927 25046 4190 -17726 -18890 -49679 -52636 -25328 -3393 -11632 -37554 -45660 -37770 1882 21430
15914 21430 -3981 -16072 -7281 -21728 -16707 3980 -3807 -27963 -46343 -49693 -37810 -49817
15902 -49817 -47817 -46939 -48247 -45804 -15105 -24221 -31350 -34050 -30508 -40237 -51470 -68002 -52391 -22348
15888 -22348 -13796 -22581 -36731 -6610 -27100 -33292 -18000 -3565 4758 4021 -18682 -4734 -475
15875 -475 -25995 -23716 -21970 -24646 -1803 23670 16480 13273 12678 700 -28339 -38441 -45837 -36285
15861c6285K3236J6177k1732j8313L5751L8912j3891k6032n571J5648K779n403
15849E276P557j4014Q870J5542K588q033r542r986k6162o430Q231K332N094k4585
15835d3262j656q12p868n583J3278R074J8685K9304O6j8137k0516j5268J1258
15822c1437L5021K0208k2464k2629O134K2981O631j7209r210k939p742O85M900
15809a7070M9561K3578J607k4619l9425l2617J5148L120L725N930r905K011J3476
15796e480M1795J8698j7482l3212l8817J8843M9815n40k1686n64J9570M352q409
15783B6883l5512j4124K3440J759k863L838Q711j1191j533k775p753J878l2553
15770d1795q336K2773P979J7867P025k180k5661k151J1575p520j7777k79J1391
$$ plain form
15861 -36285 -13049 3128 -18604 -36917 -1166 37746 23855 -2177 -7748 7900 10679 5276
15849 5276 12833 -1181 7689 23231 25819 17786 8244 -1742 -27904 -34334 -26103 -23771 -18677 -43262
15835 -43262 -44918 -45730 -53598 -59181 -45903 -36829 -18144 11160 11226 -6911 -27427 -42695 -31437
15822 -31437 3584 23792 1328 -21301 -15167 7814 14445 -2764 -11974 -14913 -22655 -21970 -17070
15809 -17070 32491 56069 57676 33057 -6368 -38985 -23837 -20717 -16992 -11062 -20967 -18956 -5480
15796 -5480 36315 55013 37531 4319 -34498 -15655 34160 33620 11934 11370 30940 35292 26883
15783 26883 -8629 -22753 687 2446 -417 3421 12132 941 -592 -3367 -11120 -9242 -41795
15770 -41795 -50131 -27358 -19379 -1512 5513 3333 -22328 -24479 -12904 -20424 -38201 -38480 -27089
15757b7089J6823m071J2326j3054K103J6097m886l1987l336K4687K1202q538J1309
15744A1586q505K839k0934k6297Q255J4512N731l753l89K9796Q83k1839K126J3003
15730G014m988L5209q413m6258k7991o406N4432J0618L375l339j7092l5737j9626
15717e9202j8473j2094J9233J5767K8701J6090q619j5625K3264K384q959m249
15705b1782J3889J1425l2530k7552j420R985M684N174N081J3209m480J2652L1256
15692A9591M3883l540n1377m7294O179J7727K4564R383l6419R793k110J976k880
15679a0524j1425J5599j1448j0908J8725O750q604r768K2592M885n140R456k2292
15666a2102k2948j0740O671K4099J1880k2464j444n728J5707J6148k1289p311
$$ plain form
15757 -27089 -10266 -14337 -2011 -15065 -12962 3135 -1751 -33738 -37074 -12387 8815 277 11586
15744 11586 3081 5920 -15014 -41311 -33056 -18544 -12813 -16566 -16955 12841 13724 -8115 -5989 7014
15730 7014 2026 37235 28822 -17436 -45427 -51833 2599 13217 16592 13253 -3839 -39576 -59202
15717 -59202 -77675 -89769 -70536 -54769 -26068 -9978 -18597 -34222 -10958 -8574 -17533 -21782
15705 -21782 -7893 3532 -28998 -56550 -57970 -47985 -43301 -38127 -33046 -19837 -24317 -11665 19591
15692 19591 63474 59934 8557 -38737 -32558 -14831 9733 19116 -17303 -7510 -9620 -7644 -10524
15679 -10524 -21949 -6350 -17798 -28706 -9981 -3231 -11835 -21603 989 5874 734 10190 -12102
15666 -12102 -35050 -45790 -39119 -15020 -3140 -25604 -27048 -32776 -17069 -921 -22210 -29521
15654b9521L2969J0045J7971j0639m1353m848O273Q859j3240J7482M11k0740o1061
15641h7392J843N5585J6476J10L006l269j7977J7122M02m0445R573J6854J8389
15628i723L2594j5458m3671j7138L316K8823J0216j3372r473L5735J9461q164
15616A3146p70m671k1J5224P450P950m4438l5736L1607K4292j2261J1440N191
15603A8403j0413k6427o497M026K3033k570p178m234o236j3515M381q686Q792
15590b7121L3952n735j1145P954P49k5439m201k0657j499J2539N6330O211j9513
15577B425j2357L5085J1828k3381l5862J0373j3313o058Q548p660k541K2936j0935
15564b0912K3045O33m775m35o364O122J1828n907J3674m320j0779m019r564k763
$$ plain form
15654 -29521 3448 13493 31464 20825 -20528 -25376 -19103 -10244 -23484 -6002 -5591 -26331 -87392
15641 -87392 -85549 -29964 -13488 -13378 -10372 -13641 -31618 -14496 -14094 -54539 -44966 -28112 -9723
15628 -9723 22871 7413 -36258 -53396 -50080 -21257 -11041 -24413 -33886 1849 21310 13146
15616 13146 12376 7705 7684 22908 30358 38308 -6130 -41866 -10259 14033 1772 13212 18403
15603 18403 7990 -18437 -24934 -20908 2125 -445 -7623 -11857 -18093 -31608 -27227 -35913 -27121
15590 -27121 6831 1096 -10049 -2095 -1346 -26785 -30986 -51643 -53142 -40603 15727 21938 2425
15577 2425 -9932 25153 36981 13600 -22262 -11889 -25202 -31260 -22712 -30372 -32913 -9977 -20912
15564 -20912 2133 2766 -2009 -2444 -8808 -2686 9142 3235 16909 12589 1810 -2209 -11773 -14536
15550a4536l8147j1385L0370O042J8921K9182J4353j4968l0358k0019l106O754
15538b6897m322j2954O081J8645J3785n523Q828k4303l2703M285Q076P019m442
15525d4425K062q472J7781K1071K1600j1045j0990l3644j5992K5947P296k6497
15513e5308k9878L2190N0302J8527l3487j3119k4871j2719L419K9190L9469q633
15501d918k0679n483k5383j4219K6522n408L655N949M626J9375Q384j5461M633
15488a8407k470J8687N410j0511k2453N600k060k3107j5440o32J6182J6228J8623
15475a4350L666K871n443R879L9920P219M559j9578k0989j140J4427j9241J4732
15462A6532J4685O435l9917j9805O233k1638q621o270K2078L887K1311P303J0927
$$ plain form
15550 -14536 -52683 -64068 -33698 -27656 -8735 20447 34800 19832 -10526 -30545 -33651 -26897
15538 -26897 -31219 -44173 -38092 -19447 -5662 -11185 -2357 -26660 -59363 -55078 -47002 -39983 -44425
15525 -44425 -42363 -50835 -33054 -11983 9617 -1428 -12418 -46062 -62054 -36107 -28811 -55308
15513 -55308 -85186 -52996 -2694 15833 -17654 -30773 -55644 -68363 -64944 -35754 3715 -4918
15501 -4918 -25597 -31080 -56463 -70682 -44160 -49568 -45913 -39964 -35338 -15963 -7579 -23040 -18407
15488 -18407 -20877 -2190 3220 -7291 -29744 -24144 -26204 -49311 -64751 -65383 -49201 -32973 -14350
15475 -14350 -10684 -7813 -13256 -3377 36543 43762 48321 28743 7754 6614 21041 1800 16532
15462 16532 31217 37652 -2265 -22070 -15837 -37475 -46096 -52366 -30288 -26401 -5090 2213 13140
15449A3140k1217m7036n196K6562J9413r054k3825k6416J4370J9368O945K8281
15437d665L0093Q933m1806l3847M485K3021p712k5416L606p127O081J0618K1018
15424a2718J9365N435J8083k1086P000j1818M31R857k1451k4027k602K6204R693
15411B366J0079r110q838O825K7882m234k2151m265o603O936Q775o573o676j3673
15397a9260O168j1366N222j2471J1982K6508P435J0319k6423k9499L8452J6470
15385B3537k6328q111p697J4069P199j586M375M808r132j1947K3883L087k4324
15372h167p437J569l8699O211P395Q910n326j5868K8038J8636j4026k5989J2817
15359c1936K2940l847k1881J8663j0458k0937J3657J7696J7818n06K582J3942
$$ plain form
15449 13140 -8077 -55113 -60309 -33747 -14334 -23388 -47213 -73629 -59259 -39891 -32946 -4665
15437 -4665 25428 34361 -7445 -41292 -36807 -13786 -21498 -46914 -43308 -50435 -44354 -33736 -12718
15424 -12718 6647 12082 30165 9079 16079 4261 4692 14549 -6902 -30929 -33531 -7327 2366
15411 2366 12445 3335 -5503 1322 29204 24970 2819 -1446 -8049 -1113 7662 1089 -5587 -19260
15397 -19260 -13092 -24458 -19236 -31707 -19725 6783 14218 24537 -1886 -31385 7067 23537
15385 23537 -2791 -10902 -18599 -4530 2669 1083 5458 10266 1134 -10813 13070 16157 -8167
15372 -8167 -15604 -14035 -52734 -46523 -39128 -30218 -35544 -51412 -23374 -4738 -18764 -44753 -31936
15359 -31936 -8996 -12843 -34724 -16061 -26519 -47456 -33799 -16103 1715 1209 3791 17733
15347A7733K1010N749k6536k8048r351K8227L1210k2901j2731J1277J8050K108
15335C5797j8249J4161K1546J795j8492J9631j5801j5722j3839j0980j8137k2383
15323d0673K6108J9207K66o469P627j1298j0369m999r970p732J2042O675j1629
15310c1214k5781Q146M7790R687k0904m4873k2207K2650L0152J7047q040p808
15298b5355K6493L2588J2893o120q347j4768k0453r69K660R615j7349J9153Q832
15285A8873k571J8573n043N064k0599N279L7240l635j8604m792k2276k6678p843
15272b7012k373O452Q982K3731P747J9885j3366k8496j9604R5L0480o537j1308
15259a1324j6875j0244L559M972j800K7280K5430q097j0057J0877j5317j6403
$$ plain form
15347 17733 38743 44492 17956 -10092 -19443 8784 39994 17093 4362 15639 33689 35797
15335 35797 17548 31709 53255 55050 36558 56189 40388 24666 10827 -153 -18290 -40673
15323 -40673 -14565 4642 4908 -1561 6066 -5232 -15601 -20600 -30570 -38302 -26260 -19585 -31214
15310 -31214 -56995 -48849 -1059 8628 -12276 -57149 -79356 -56706 -26554 -9507 -17547 -25355
15298 -25355 1138 33726 46619 40499 32152 17384 -3069 -4038 -1378 8237 -9112 10041 18873
15285 18873 16302 34875 29832 34896 14297 19576 56816 53181 34577 29785 7509 -19169 -27012
15272 -27012 -29385 -22933 -13951 9780 17527 37412 24046 -4450 -24054 -23959 6521 -16 -11324
15259 -11324 -28199 -38443 -34884 -29912 -31712 -4432 20998 12901 2844 13721 -1596 -17999
15247a7999J342o375L764N749j2123r694l089J9244K7128k1686j4749P031J766
15234a9691j604l4605K7637L3717j0765J0679j6467k4220K6171L3880J1183j1179
15222B4736J146k803K1108J0799q601J0865j6462l9836m661l505j5284J1900Q771
15209a827j7557K2071J3622j5463r123q980N584l5808k6018J7991J4659K4690
15197a6159K7606m424j1471m7594k7058K1908J9868L7985o04j8152k838O845K9123
15184A5035J2241j3794j5086J727k528k932N834j5210j1695P603k24J7057J5717
15171A3745m8k9653j1761K5819K0501k2734n1605l3664L409K3561K8650J5051
15159a8729J1941O82l0505m0816J3700K341J3425K1215J8675q755j427j5311q715
$$ plain form
15247 -17999 -16657 -23032 -19268 -13519 -25642 -35336 -38425 -19181 7947 -13739 -28488 -21457 -19691
15234 -19691 -21295 -55900 -28263 5454 -5311 5368 -11099 -35319 -9148 24732 35915 24736
15222 24736 25882 23079 44187 54986 46385 57250 40788 952 -3709 -7214 -22498 -10598 -1827
15209 -1827 -19384 2687 16309 846 -8277 -17257 -11673 -47481 -73499 -55508 -40849 -16159
15197 -16159 11447 7023 -4448 -52042 -79100 -57192 -37324 661 57 -18095 -20933 -14088 15035
15184 15035 27276 13482 -1604 123 -2405 -5337 497 -14713 -26408 -18805 -19029 -1972 13745
15171 13745 13697 -15956 -27717 -1898 18603 -4131 -55736 -89400 -85991 -62430 -33780 -18729
15159 -18729 -6788 -6106 -36611 -77427 -63727 -61386 -47961 -26746 -8071 -16826 -18253 -33564 -42279
15146d2279p70k5444j3629J8910J9801J3323J8422J1564j0360l723J1622k4697
15134b7260j9963K2254J116k5978k5028j682L1479J8198l843J7746j5130j5776
15122d3867j153k528q584j3263K5674L4615k4221P403J3659K3036n397j0181k5359
15109c0166k5052K5338K1037k6169j0466o868J0124J8895J6979L0352N546j1620
15097A7930j1205j4548j545l470Q728n280R767k170o230L967k5091K511m251n260
15083c6147J6462JJ7664K5013k825r397q030q847j0744R904j1204J302P123L4457
15069B4732K0676n11l8065m4589j05Q116O021j8691K3699o384k7987J2423K5276
15056a5389j783J841j9940n431J0187M01k2072J189k617R880J4918J2699k2431
$$ plain form
15146 -42279 -43049 -68493 -82122 -63212 -43411 -30088 -11666 -102 -10462 -14185 -2563 -27260
15134 -27260 -47223 -24969 -23853 -49831 -74859 -76541 -45062 -26864 -30707 -12961 -28091 -43867
15122 -43867 -45020 -47548 -56132 -69395 -43721 -9106 -33327 -25924 -12265 10771 5374 -4807 -30166
15109 -30166 -55218 -29880 -8843 -35012 -45478 -52346 -42222 -23327 -6348 24004 29550 17930
15097 17930 6725 -7823 -9368 -12838 -4110 -9390 377 -1793 -8023 -4056 -29147 -26636 -30887 -36147
15083 -36147 -19685 -19684 -2020 22993 20168 10771 2741 -6106 -16850 -6946 -18150 -16848 -9725 24732
15069 24732 45408 44897 6832 -37757 -37862 -29746 -23725 -42416 -18717 -25101 -53088 -40665 -15389
15056 -15389 -17172 -15331 -35271 -40702 -30515 -30114 -52186 -50997 -53614 -43734 -28816 -16117 -38548
15043c8548M315J3853J1005k6223J3949J5105M49M743K6501J6973p564j3487k3984
15030b913k1035Q371j205J8509j5095j0651K3636O955K179m13k526m726k2832
15017b1746j8759P986O480J1094P71R670n666M137J5238k805o833K325l0184P02
15003b7590N151Q599J742L0158j9260j8919m0099j969M7573K8276L485k4719k035
14990i607J2979j5728p222J1115Q985j5323j5914j3167n348J932J1995K5722K8098
14977A8517p644r225k1148k243j3127J6189O064Q444k9957k4529l490K6439L0067
14964e643n863o13J0654l209J20j498k1675j2613j4876j2634J9216j6665k584
14951f7883L5326L4068J2253p263N403J8040J481J297L453J5580k2421l6090o859
$$ plain form
15043 -38548 -34233 -20380 -9375 -35598 -21649 -6544 -6095 -1352 25149 42122 34558 21071 -2913
15030 -2913 -23948 -15577 -16782 1727 -13368 -24019 -383 6572 8751 8338 5812 1086 -21746
15017 -21746 -40505 -32519 -26039 -14945 -14174 -4504 -10170 -6033 9205 6400 -433 1892 -28292 -27590
15003 -27590 -22439 -13840 -12098 18060 -1200 -20119 -60218 -62187 -14614 13662 17147 -7572 -9607
14990 -9607 3372 -12356 -19578 -8463 522 -14801 -30715 -43882 -49230 -47298 -35303 -9581 18517
14977 18517 10873 1648 -19500 -21743 -34870 -18681 -12617 -4173 -34130 -58659 -62149 -35710 -5643
14964 -5643 -11506 -12119 -1465 -4674 -4554 -6052 -27727 -40340 -55216 -67850 -48634 -65299 -67883
14951 -67883 -32557 1511 13764 6501 11904 29944 31425 32722 36175 51755 29334 -6756 -13615
14938a3615j887R294J2887k4739j8267M687J0236R805J479K4277K278j9446m651
14925g662k411k538J4218o285k061j4911K8533J1666j6336O820J7571J6254k1234
14912B1624o6563j2110L409J1364M4904J6645J7511j9960j6558J098k5892n6097
14900h0625J0997L6206K7862P047r131j4017j4836O976K4996k288J966m632l839
14887a3318j1532j4130L1555K0753o663k5443k9718N226m527j2789J0903k0482
14875g0165J4432P921J4760J231J0163J0491l331K534j4191m600k0318M475N023
14862d1575m87J2503K3718q495K506j7576p061J9171K7057l993q008J1723J4228
14849B3711p123L70k056k3828j5974J9405N719j9109q588J7031R083Q134l0895
$$ plain form
14938 -13615 -15502 -6208 6679 -18060 -36327 -31640 -21404 -11599 -10120 14157 16435 -3011 -7662
14925 -7662 -10073 -12611 1607 -4678 -6739 -21650 6883 18549 2213 9033 26604 42858 21624
14912 21624 -44939 -57049 -53640 -42276 2628 19273 36784 16824 266 1364 -24528 -80625
14900 -80625 -69628 -33422 -5560 1487 -7644 -21661 -36497 -29521 -4525 -6813 -4847 -9479 -13318
14887 -13318 -24850 -38980 -7425 13328 6665 -18778 -48496 -43270 -47797 -60586 -49683 -70165
14875 -70165 -55733 -47812 -33052 -31821 -21658 -11167 -14498 -11964 -26155 -30755 -51073 -46598 -41575
14862 -41575 -42062 -29559 -5841 -14336 -11830 -29406 -36467 -17296 9761 5768 -2240 9483 23711
14849 23711 16588 16958 14902 -8926 -24900 -5495 224 -18885 -27473 -10442 -1359 6775 -24120
14836b4120o490P787j5615Q574L085j424j8753o356J3532M3972L1917j1708m5901
14823b1500m0568j90J4885N856j2481P860J6930J9996L111k0153J9167Q229M946
14810F088k6503n230J1371J0395K4388k6793j0521K389r834j6866o1L50R71J8412
14796b1444k2780Q236L4132J6276j2162k1288j0285J1719K5838J6146J1373k8939
14784F822l1516l0790J5046k386n0490P71M9312M6748j0548m4004j1923Q648N150
14771d9160L0286J0790J068k343r29J9602K0461P55j630O682p74l7181l3756j847
14757c7976K1097J9562j1602K7440M0871M101k9070j4188j509p225l1959r78K058
14744a9378K615J8243q953k6136j7533k618Q663K9110J1352J4979j2121m0620
$$ plain form
14836 -24120 -30610 -22823 -38438 -29864 -26779 -28203 -46956 -53312 -39780 4192 36109 24401 -21500
14823 -21500 -62068 -62258 -47373 -41517 -53998 -46138 -29208 -9212 -6101 -26254 -7087 1142 6088
14810 6088 -20415 -25645 -14274 -3879 20509 -6284 -16805 -14416 -24250 -41116 -41177 -40827 -39856 -21444
14796 -21444 -44224 -35988 -1856 14420 2258 -19030 -29315 -17596 8242 24388 35761 6822
14784 6822 -24694 -55484 -40438 -42824 -93314 -92543 -43231 3517 -7031 -51035 -62958 -54310 -49160
14771 -49160 -18874 -8084 -7016 -9359 -10288 9314 29775 30530 28900 35582 34808 -2373 -36129 -37976
14757 -37976 -16879 2683 -8919 18521 59392 63493 34423 20235 18726 11501 -20458 -21436 -19378
14744 -19378 -16763 1480 -7473 -33609 -51142 -53760 -45097 -15987 -4635 10344 -1777 -42397
14732d2397r319J8356L0600J4168J2647l183N584J0080n694q018l2016k151J1149
14719a94n03J1507J079j7407j6931N380M0432l8280k0246J2587r47j2722K6063
14706a0182J5599l2223K6862J5329L765l758j0396n308k6438j7598K2610n599
14694b7337n445j116k4489q766K9846K3175o112p068P230N308J9385k3728l3825
14681e2942k0644J4415J9233K6956J1636K599j3732j0617J1343J1768R266K3768
14669C3049j2871j5952j8197j0762K8008J7540j66k4226k5181R066R565p93j1861
14656b2781j6717J1126O192J620R691M982K3606m229K872O283K9154j9552j7189
14643A5058N241l1661m366o780J6301L562J135k4388j7110J1370N859l498R552
$$ plain form
14732 -42397 -51716 -33360 -2760 11408 24055 20872 26456 36536 30842 22824 -9192 -11343 -194
14719 -194 -697 10810 11889 -5518 -22449 -17069 23363 -14917 -35163 -22576 -23523 -36245 -10182
14706 -10182 5417 -26806 56 15385 19150 15392 4996 -312 -26750 -44348 -21738 -27337
14694 -27337 -32782 -33898 -58387 -67153 -37307 -14132 -20244 -27312 -20082 -14774 4611 -19117 -52942
14681 -52942 -73586 -59171 -39938 -12982 -1346 1253 -12479 -23096 -11753 15 9281 33049
14669 33049 20178 4226 -13971 -24733 3275 20815 20649 -3577 -28758 -19692 -10127 -10920 -22781
14656 -22781 -39498 -28372 -22180 -20560 -10869 -5887 17719 13490 16362 22645 51799 32247 15058
14643 15058 20299 -11362 -15728 -22508 -6207 -2645 -1510 -25898 -43008 -31638 -25779 -29277 -19725
14630a9725l7362m410L0234J8135p121k404k1591J052L1940L4924L105j3898J0139
14617B3018o241j9498k877N777J0684K3005o136J1173P390n93p8l1368q77K5231
14603C8610J158k4666R274M2758K3357R72r560q397N464O784k7975J8141j1678
14590F4242j5192K3236l863L41K743j5556l960j3871j2385k6910Q167L729J5396
14577B6117r389j68k0772R435J2735J404R035J075o714o154j4548N346O287N125
14563A8814R238J9747q92l4333j1657K6119J2729j532k2610J5637J3049j6669
14551B7640n421l1122k4693k161K6019J9325k559m8876m353K8898K6377o621j5187
14538a2734j8748r123K337R924j7743J1152o828J0526L7073j1740r078o638j35
$$ plain form
14630 -19725 -57087 -61497 -31263 -13128 -20249 -22653 -44244 -43192 -11252 23672 26777 12879 23018
14617 23018 16777 -2721 -5598 179 10863 33868 27732 38905 46295 45702 45624 14256 13379 38610
14603 38610 39768 15102 24376 67134 90491 91463 81903 73506 78970 85754 57779 75920 64242
14590 64242 49050 72286 68423 68764 71507 55951 51991 38120 25735 -1175 6992 10721 26117
14577 26117 16728 16560 -4212 5223 17958 19362 28397 29472 22758 16604 2056 7402 13689 18814
14563 18814 28052 47799 46907 12574 917 27036 39765 38233 15623 31260 44309 27640
14551 27640 22219 -8903 -33596 -35757 -9738 9587 7028 -41848 -46201 -17303 9074 2453 -12734
14538 -12734 -31482 -40605 -38268 -28344 -46087 -34935 -41763 -31237 5836 -5904 -14982 -21620 -21755
14525b1755N050k0924j571L1924O791J459j1872J0624O005k4575p887q479J884
14512c3326J0886L852Q731K1668m811K95L775l171q019j5610m342O697K7092j2571
14498A146j4813l1355k3557J6618L2551n508P430L0394J8415o164j4838r704j8425
14485a7810j0381N357J7347q285N423k041j3209K211K7931q84q449k0548k612
14472b5950J8893N789L903j8564M801l777j5288K1431K3795P227j4591J964M451
14459A4084j094r816K077J1621p488j5059j3195J8238O3762K6523k5882j6383
14447D7388n356r703r892M596L526K3848n50m0810k3917R172J3593k4061M2186
14434C0020M121r74j2777N979k8806k8968k6977J8838K7605N8426K1578J7709
$$ plain form
14525 -21755 -16705 -37629 -39200 -7276 -485 974 -10898 -274 5731 -18844 -26731 -35210 -33326
14512 -33326 -22440 -18588 -9857 11811 7000 7295 11070 7899 -120 -15730 -20072 -13375 13717 1146
14498 1146 -13667 -45022 -68579 -51961 -19410 -24918 -17488 12906 31321 25157 10319 615 -17810
14485 -17810 -28191 -22834 -5487 -13772 -8349 -10390 -23599 -21388 6543 5659 -2790 -23338 -25950
14472 -25950 -7057 -1268 2635 -15929 -11128 -14905 -30193 -8762 15033 22260 7669 9633 14084
14459 14084 12990 3174 5251 16872 9384 -5675 -18870 -632 63130 89653 63771 47388
14447 47388 42032 32329 22437 27033 30559 54407 53857 13047 -10870 -1698 11895 -12166 30020
14434 30020 34141 33167 20390 26369 -2437 -31405 -58382 -39544 -11939 46487 68065 85774
14422H5774k1906o732J5389n981n897j0470p64K045J0275J9054o770l1194j4319
14409B8504J8078K1413j4708j3319J1109K4551R608j3838l0960P635J0759l62
14397E8470N903J0637L5459K356k3944J0502J1212p935j1307Q214k4054J1677
14385H7190L0141Q127j1397k5844l9238l1190j4692n822J8540r396j3015j110
14373g706O27K9672M828r572r353J0237L1024J1416q778k186K9137k2264Q742
14360F5824J5762n111m343j1098q644k3615j13r261J454m902J9210j2839k3732
14347a408m997P321M1642J1552j7054j5635j2402k7918l4686P5L3476L216P89
14334a6029j3996J9335P472p088k72M052J3587M424J1313k0917j9111k1754J651
$$ plain form
14422 85774 63868 57136 72525 66544 60647 50177 49413 51458 61733 80787 74017 42823 28504
14409 28504 46582 67995 53287 39968 51077 75628 85236 71398 40438 48073 58832 58470
14397 58470 64373 75010 110469 112825 88881 99383 110595 102660 91353 99567 75513 87190
14385 87190 117331 125458 114061 88217 48979 17789 3097 -2725 15815 6419 -6596 -7706
14373 -7706 -7079 22593 27421 17849 8496 18733 49757 61173 52395 50209 79346 57082 65824
14360 65824 81586 76475 72132 61034 52390 28775 28662 19401 20855 15953 35163 22324 -1408
14347 -1408 -6405 916 42558 54110 37056 21421 9019 -18899 -53585 -53510 -20034 -16818 -16029
14334 -16029 -30025 -10690 -3218 -10306 -10578 -6526 7061 11485 22798 1881 -17230 -38984 -37333
14321c7333L81R97N693k030j520K0762O303p055k771J193k227O158J7358k5828
14307a9919K824l733p509k5790P890K2969J7148j194j7907N5J8867J4565R172
14294A7438J5613n878j6336L87P601j5544J049N986J8164J708p30j2682m243l801
14280H732p595n682L5952J8702r746k4278k87J853j1880O6N692j0241J501K5886
14266B8675J177j9292J3557j3772j9522j4071O626K1790k326q968O966j2459o144
14253a7763L027N072q831j3953K9308K3864k7851k2561j556K6347K9p769j7452
14240c0089l784k3486L1716L3369Q134J4767j1619k1828k2110J0965P0J2991K006
14227A102J897K164l158J7935R020L905k5920J2052J3376j4449n060J4945J5429
$$ plain form
14321 -37333 -36952 -35955 -30262 -32292 -33812 -13050 -6747 -13802 -16573 -15380 -17607 -11449 5909 -19919
14307 -19919 -17095 -20828 -28337 -54127 -46237 -23268 -6120 -7314 -25221 -25166 -6299 8266 17438
14294 17438 33051 27173 10837 11224 18825 3281 4330 10316 28480 30188 29458 16776 12533 8732
14280 8732 1137 -4545 31407 50109 40363 16085 15798 17651 5771 5837 11529 1288 2789 28675
14266 28675 29852 10560 24117 10345 -9177 -23248 -16622 5168 2842 -6126 840 -11619 -17763
14253 -17763 -14736 -9664 -18495 -32448 -3140 20724 -7127 -29688 -31244 -4897 -4868 -12637 -30089
14240 -30089 -33873 -57359 -25643 7726 15860 30627 19008 -2820 -24930 -13965 -13895 -904 1102
14227 1102 2999 5163 2005 19940 28960 32865 6945 18997 32373 17924 12864 27809 43238
14214D3238O369k7148j1069l352P518N442j0045J0053k3033K653J0573Q274j0876
14201H597J928j4214j2665j3007J8179J5801k6780p404J4039J2350k7121j8754
14189d9051j6033P058J9966J8973J0462O593j7034L010J1643J2097Q343J6950
14177C2977k1387j1185j6055k5919K0824Q789K1662J4095M670q529j0505k0525
14165a1088k751J5477K5845J2633Q173j0924j9308j3223j7281J1876o2k0523j7044
14152c8200L769K2801O763j0985J4607J4511J8742j2373k4849P722J9542k168
14140A9882j5735k6576k8332N853j4909K4401L8221k191l233j1218n374r930K219
14127b6922K8547j6073M126P823K4158k4191j2531J479o585L744N588k203o296
$$ plain form
14214 43238 49607 22459 11390 8038 15556 20998 10953 21006 -2027 626 11199 19473 8597
14201 8597 10525 -3689 -16354 -29361 -11182 4619 -22161 -29565 -15526 -3176 -30297 -49051
14189 -49051 -65084 -58026 -38060 -19087 -8625 -2032 -19066 -16056 -4413 7684 16027 32977
14177 32977 11590 405 -15650 -41569 -20745 -11956 9706 23801 28471 19942 9437 -11088
14165 -11088 -13839 1638 27483 40116 48289 37365 18057 4834 -12447 -571 -633 -21156 -38200
14152 -38200 -34431 -11630 -4867 -15852 -1245 13266 32008 19635 -5214 2508 22050 19882
14140 19882 4147 -22429 -50761 -44908 -59817 -35416 2805 614 -2619 -13837 -19211 -29141 -26922
14127 -26922 1625 -14448 -10322 -2499 21659 -2532 -15063 -13584 -20169 -16425 -10837 -13040 -19336
14114a9336r353j0110K0833J8674L932j7499k4742J9664K9718L926j1749l5866
14102c1908j19L7979J0029j597j4116k1162j4471M2672j721p782J8199o336k5197
14089a5530J6804l255k1276J708L1634J2118n808J019J9591j037k3345o932M457
14076A0148k8390j2585K525J9752P601j7649m122O010J866M895K4107j6535J1392
14063I015M1479k2979q190n037L142J1712m600j1439p642J8097k92l3022q047
14050a7803M4387J4920j5626j5446j2478L279J3584K456j8807P791r419l8376
14038d1538K075M5449J9883J3410r182O701J9720m1678k6841j0481J6813J4914
14026I245J6640k0191k929K309J1811j168J0285n522k3901j7400J8848n396r820
$$ plain form
14114 -19336 -28689 -38799 -17966 708 4640 -12859 -37601 -17937 11781 15707 3958 -31908
14102 -31908 -32027 5952 15981 14384 268 -20894 -35365 7307 5586 -2196 16003 9667 -15530
14089 -15530 1274 -1981 -23257 -21549 10085 22203 16395 17414 37005 35968 12623 5691 10148
14076 10148 -18242 -30827 -28302 -8550 -949 -18598 -22720 -16710 -14844 -9949 14158 -2377 9015
14063 9015 50494 27515 19325 14288 17430 29142 24542 13103 5461 23558 23266 -9756 -17803
14050 -17803 26584 41504 25878 10432 -2046 1233 14817 17273 -1534 6257 -3162 -41538
14038 -41538 -39463 5986 25869 39279 30097 36798 56518 14840 -12001 -22482 -5669 9245
14026 9245 25885 5694 2765 5074 16885 15717 26002 20480 -3421 -20821 -1973 -7369 -17189
14013a7189Q344J2599m953j3142k0108p975K4262L1663K1949Q709k0193K0875
14001D4841K3340j3390k6704O259L172M685J2679j5533k923k5008K6002p014O31
13988C1037m826l889l564N700Q984j6268k1279L8154K9426K2429K4586J7299j616
13975A26173J8859J3021q423P339K8642L0457K7356L3224O8215O0070J15388J52224
13963F72545J55797J70369K13023K30356K20335K15876K21174J69509J33627N0356
13953B452967l0574n8307o6620j46905j79509j84691k02633k09287k19594k16307
13943I38540j81446j22747n7024l6221o0921n6931n5992n7111k3250q938k5723
13932B52236j9441K436J6996O11q178q096l2951m004K2171p592p441q543O195
$$ plain form
14013 -17189 -8845 3754 -1199 -14341 -34449 -42424 -18162 13501 35450 44159 23966 44841
14001 44841 68181 54791 28087 34346 37518 42203 54882 39349 36426 11418 37420 30406 31037
13988 31037 26211 22322 18758 24458 33442 17174 -4105 34049 63475 85904 110490 127789 126173
13975 126173 145032 158053 149630 156969 185611 216068 243424 276648 344863 404933 520321 672545
13963 672545 828342 998711 1211734 1442090 1662425 1878301 2099475 2268984 2402611 2452967
13953 2452967 2422393 2364086 2297466 2150561 1971052 1786361 1583728 1374441 1154847 938540
13943 938540 757094 634347 577323 541102 480181 423250 367258 310147 286897 277959 252236
13932 252236 232795 235231 252227 252838 244660 236564 203613 199609 221780 214188 206747 198204 204399
13919B04399K237J3425K3352j626P546j1288K103q507P436k6972m2117k4815K984
13906A48157q464m2610J021K1110R426J1163J3205m935l542J9177j3798q020j4006
13893A27884m1874j3780K8504N4852Q918m0866l3872k0993r232o708j928J6407
13881F7312K3472q041k1147m3175r868L9255m882n0224j3521J6870J0265k3068
13869a6752J6889M4424J715J5990M4018j4162m7290l7354k0726J1602J065r474
13857a0055K6955J6813l260p46j5642j1375L4166J1949k1965j5749K921k1698
13845g686J860N8360r12k4306k7144j3051M852R828L2503P320o275q748n30k6734
13831f63J7191K446K0824K1603q658m9314r868K2448N768l2100l1166L243N942
$$ plain form
13919 204399 206636 220061 243413 241787 249333 238045 240148 231641 239077 212105 169988 145173 148157
13906 148157 139693 97083 98104 119214 128640 139803 153008 148073 144531 163708 149910 141890 127884
13893 127884 86010 72230 100734 155586 164504 123638 89766 68773 59541 52833 50905 67312
13881 67312 90784 82743 61596 18421 8553 47808 42926 -7298 -20819 -3949 6316 -16752
13869 -16752 137 44561 46276 62266 106284 92122 44832 7478 -13248 -1646 -581 -10055
13857 -10055 16900 33713 30453 29707 14065 2690 36856 48805 26840 11091 14012 -7686
13845 -7686 -5826 52534 51622 27316 172 -12879 -8027 1801 34304 41624 35349 26601 26071 -663
13831 -663 16528 18974 39798 61401 52743 3429 -6439 16009 21777 -10323 -41489 -38246 -32304
13818c2304L3134L9036R112r372K543L744P101N411l7660k5412k054R366M3781
13805D6426J2453r335O417n42k223Q554j3849m562J1427l831k2490k8187l7966
13792c7708R187J763K6764J0519j937O492J0868m508O671L599j9361o842J2625
13779A8132K1066J2021n311j200j0212o839j4142R436l960n787L031J4842J5643
13766D6720M72j1088q859J3807M367J5610Q582J0997N201l8040j9512K0662K0606
13753F9525j4043K100J6134J616q122K120k3045m393M137m350O809Q729K9217
13740H6434J4285o234l59l900k662k5630N182R381M393j9795k1056L270J1551
13727E4860q261M49L970L034K4520J1116j1513R850j3435j5355R182R874J0454
$$ plain form
13818 -32304 830 39866 48978 39606 42149 45893 52994 58405 20745 -4667 -6721 2645 46426
13805 46426 58879 49544 55961 55419 53196 61750 47901 43339 54766 50935 28445 258 -37708
13792 -37708 -28521 -26758 6 10525 8588 15080 25948 21440 28111 31710 12349 5507 18132
13779 18132 39198 51219 45908 44708 34496 27657 13515 22951 18991 13204 16235 31077 46720
13766 46720 47192 36104 27245 41052 45419 61029 69611 80608 85809 47769 28257 48919 69525
13753 69525 55482 57582 73716 75332 67210 69330 46285 41892 46029 41679 48488 57217 86434
13740 86434 100719 94485 94126 90226 87564 61934 67116 76497 80890 61095 40039 43309 54860
13727 54860 46599 47048 51018 54052 78572 89688 78175 88025 74590 59235 68417 78291 88745
13714H8745J2237L275j9475Q867K5175q870l5924k3279j2362r192J6102L3491
13702G8790J1842R315J1281j1629j6709J2002p888o828K0068j1492l5568l761
13690D9423j6101J8389j3635k1773L173K7181r392j9244K1385K0686L3177j5311
13678G7958k0280J2858j1820o837J3274K7126J7399k949k4702j2814j5227O316
13666F0302J3146j9794k6100L615n818k4852j7502P687L0107o016J9771P686n476
13653C6756J2766J4604l9610j2703J4665K9552J0340k6089j968j3454k1208j9634
13641a5983j0841J195L3101L774j0331l782J4477J6149r549J2450j5205l8010
13629b2555L8881K4841k8295m119K8066r151k3240R428l022N867r445k5158J1896
$$ plain form
13714 88745 100982 104257 84782 93649 118824 109954 74030 50751 38389 29197 45299 78790
13702 78790 90632 99947 111228 99599 82890 94892 87004 80176 100244 88752 53184 49423
13690 49423 33322 51711 38076 16303 19476 46657 37265 18021 39406 60092 93269 77958
13678 77958 57678 70536 58716 51879 65153 92279 109678 106729 82027 69213 53986 60302
13666 60302 73448 53654 27554 31169 25351 499 -17003 -9316 20791 14775 34546 42232 36756
13653 36756 49522 64126 24516 11813 26478 56030 66370 40281 38313 24859 3651 -15983
13641 -15983 -26824 -25629 7472 11246 915 -2867 11610 27759 18210 30660 15455 -22555
13629 -22555 16326 41167 12872 8753 36819 27668 4428 13856 10834 16701 7256 -17902 -6006
13616f006L6749m060K509k8988Q419p003m843R161J246J855k78j776J6826j6739
13602G072k0370P718J4636P941K445l001K1649o602Q43J7175O69m3842j3588J0296
13588C041L6894L288m653l548O255P444j8199M764K3201K0339J1885m6172k6871
13575A7668r174K7873M3392k232l4928L033K4044k4423l6845q648M4181L4715
13563G8656o680k6157p552j13k858M1892K5534j3144k2227j9645J7514p825j2418
13550D4977k743j2638j9194J094q970K2431J7360m72L1075L0527O287J063n883
13537A04914k7466J9218j126k7981P451P643l3751l349K1709K6643K0520k1742
13525I2683o073j3284j3593K658J2268J6909k5290R830j8307r189o944J6953r887
$$ plain form
13616 -6006 30743 26683 29192 204 8623 1620 -3223 5938 7184 9039 8761 6985 23811 7072
13602 7072 -13298 -5580 9056 16997 19442 16441 38090 31488 32331 49506 50175 6333 -7255 3041
13588 3041 39935 43223 38570 35022 41277 48721 30522 35286 58487 78826 90711 44539 17668
13575 17668 8494 36367 79759 77527 42599 45632 69676 45253 8408 -240 43941 78656
13563 78656 71976 45819 38267 38154 35296 77188 102722 89578 67351 47706 65220 57395 44977
13550 44977 42234 29596 10402 11496 2526 24957 42317 41845 72920 103447 109734 110797 104914
13537 104914 77448 96666 95540 67559 75010 82653 48902 45553 67262 93905 114425 92683
13525 92683 86610 73326 59733 62391 74659 91568 66278 76108 57801 48612 41668 58621 48734
13512D8734j1083L820o753l1146k02O007R093J3631M12l660J5504J4941J7907
13499G7205J4778j9906j0398J1116J1443j9462J0235J6641K3919j9081j7889n336
13487G3265m8763k3624J3202j9225K6465K6677Q721J0121R776J8117j7158j1324
13475F6250K688j2448k2121P554R971j8629L444J4873K9944L482k2039k9198p425
13462B6346J5244q051j2765k4279p959J3210K298K0680K1125J1374j5794j666
13450C9763K3858K379k0072r796j5104K8145J2335l244R310q458J942J5091M486
13437H0635j8985j8346J1752j6877j9578R524J2516l80J8344J2371r13p801q617
13424E3645r30J1028Q389j397J1353n957j1071K1146k655r92R967p24p918j0560
$$ plain form
13512 48734 37651 41471 34718 3572 3370 9377 18470 32101 32513 28853 44357 59298 77205
13499 77205 91983 72077 61679 72795 84238 64776 75011 91652 115571 96490 78601 73265
13487 73265 24502 878 14080 -5145 21320 47997 56718 66839 76615 94732 77574 66250
13475 66250 68938 56490 34369 41923 51894 33265 36709 51582 81526 85008 62969 33771 26346
13462 26346 41590 33539 20774 -3505 -11464 1746 4044 24724 45849 57223 41429 39763
13450 39763 63621 66000 45928 36132 21028 49173 61508 58264 67574 59116 61058 76149 80635
13437 80635 61650 43304 55056 38179 18601 28125 40641 40261 58605 70976 70063 62262 53645
13424 53645 52715 63743 72132 70735 82088 76131 65060 86206 83551 82559 92526 91802 83884 73324
13410G3324K0535P27j7641j9846R014J694J704J1688k3661N979K3674l917L3865
13397A17139J8206K8494J5343J8635L334L5160K2840L5006O3738P4816L9846P2805
13385E45362J04340R2400O1655N4128N9944N9129Q9467K3979j0394j369j9628
13374A059013r943m3179n6580j7986m275J305K0119L8409N2217L3256P1780L8855
13362A182991K0811M3728M352k0639k0308o1989p7222r7832r4077r2506j00230
13351F87079j03099o4416n1601l5409j6348j9422k1052l2795m3572k2883k8845
13340B47637k3156R724J5273l94n802k932j4190j4074l6174J2981M430l3836j3491
13327A45996k3527J3701K7137n142K893j2318j8217J6264L3055L655J414J4913
$$ plain form
13410 73324 93859 94586 76945 57099 66113 67807 69511 81199 57538 63517 87191 83274 117139
13397 117139 135345 163839 179182 197817 201151 236311 259151 294157 357895 432711 472557 545362
13385 545362 649702 742102 803757 857885 917829 976958 1066425 1090404 1080010 1078641 1059013
13374 1059013 1049070 1005891 949311 931325 927050 928355 948474 986883 1039100 1072356 1144136 1182991
13362 1182991 1203802 1247530 1251882 1231243 1210935 1148946 1071724 973892 879815 787309 687079
13351 687079 583980 519564 467963 432554 416206 396784 375732 342937 299365 276482 247637
13340 247637 224481 234205 249478 249084 243282 240350 226160 212086 175912 188893 193323 159487 145996
13327 145996 122469 136170 163307 158165 161058 148740 130523 146787 179842 183497 184911 199824
13315A99824J977j6344o96O378k6159j2441J4703K7045K0857N3315M3133K4244
13303C35836K9724Q6530O3750R6509Q9397O5440R1857O9474R5367R5583O5225
13292A184692N4545L0473j654m339k5009l2679m2158l2951q545n377K739K5740
13280A145477L8256N2608N6590M3900N6099J8293K6554j3745n0904j8574m0372
13269A314182q3258r8587j01686j10375j20055j03942n2045o8510n8689l6999
13259D80036k2239k3870q571m3340m6740m0116j0111P02j1594j7300j3922r294
13247B33641J0206J0784K816j6879k8753o59M247j310k4285j8881K382k0904J0611
13234A63016N199l8099J2243K7589k5267l7520Q635K5647K5013k7930M945j4823
$$ plain form
13315 199824 201801 185457 184761 191139 164980 152539 167242 194287 215144 268459 311592 335836
13303 335836 365560 452090 515840 612349 701746 767186 859043 928517 1023884 1119467 1184692
13292 1184692 1239237 1269710 1268056 1263717 1238708 1206029 1163871 1130920 1122375 1116998 1119737 1145477
13280 1145477 1183733 1236341 1292931 1336831 1392930 1411223 1437777 1424032 1373128 1354554 1314182
13269 1314182 1230924 1132337 1030651 920276 800221 696279 644234 575724 517035 480036
13259 480036 457797 433927 425356 382016 335276 295160 285049 285751 274157 256857 242935 233641
13247 233641 243847 254631 257447 240568 211815 211156 215403 214093 189808 170927 173309 152405 163016
13234 163016 168215 130116 142359 169948 144681 107161 115796 141443 166456 138526 143471 128648
13222A28648q930n68L5265M3819j9642l9898j4702j8408j81J010K8805J3659n746
13209A43131j0463j280J127j1051j4976j4746j3950m990j2165R505J8347M1720
13197A30209k6224j841R149N117K4016J514r680j6033R669L798l8267j5530J0200
13184H6097NQ236J3265K0301J0993p668l3754k0822L2056l892j0681j3525R1J6943
13170I7645K277n131k1431j0336K6629K6713J7807K0250m832j5596R327K800o88
13157A45434K4122Q766m4800l8977j0027J3612K3183l164k1868O584n040l1185
13145F6640K654J1380J6533P27J5297k0236j9459o941j5180N331J2559J9513M924
13132I3742r27r924J2194K0399J4957J8159k513r997k1070K172R681M346p961
$$ plain form
13222 128648 119718 119150 154415 198234 178592 138694 123992 105584 105403 106413 135218 148877 143131
13209 143131 132668 131388 132515 121464 106488 91742 77792 72802 60637 70142 88489 130209
13197 130209 103985 102144 111293 116410 140426 141940 132260 116227 125896 129694 91427 75897 86097
13184 86097 86102 94338 107603 127904 138897 131229 97475 76653 108709 104817 94136 80611 80702 97645
13170 97645 99922 94791 73360 63024 89653 116366 134173 154423 149591 133995 143322 146122 145434
13157 145434 169556 178322 133522 94545 84518 98130 121313 118149 96281 102865 97825 66640
13145 66640 69294 80674 97207 97934 113231 92995 73536 66595 51415 56746 69305 88818 93742
13132 93742 92815 82891 95085 115484 130441 148600 146087 136090 115020 117192 126873 131219 123258
13119A23258l2633J525k0225k182K0774j147N229j7505j12J987J8023M705J9141
13106A20838k3714j4336L5274p912k144J3011M917L642j1257j8032j6134r843
13094G4310L493J8531J9477j73M2J4368o604k0931R587K4071R115L2281J7799
13081A95366J2699k2737o0568k9607M948L5396J0824k0882k908K7443K639M277
13069A56890J8989N322J4685n568O462Q96K1789K4379n563l4903j4784M530k5947
13056A67177k258k074N507L5183L6746k1476k9838o215N127J0341P201J7985L2675
13043B56081k6796k5065K087K0558K1258j5941j6348Q434K573M4236M547j6856
13031B58768j5671L061n804m935P64P748P116n828K4258J3041J7413K8493j1969
$$ plain form
13119 123258 90625 92150 71925 69743 90517 89370 94599 77094 76982 78969 96992 101697 120838
13106 120838 97124 82788 118062 110150 108006 121017 125934 129576 118319 100287 84153 74310
13094 74310 77803 96334 115811 115638 115680 130048 123444 102513 112100 136171 145286 177567 195366
13081 195366 208065 185328 124760 95153 100101 135497 146321 125439 122531 149974 152613 156890
13069 156890 175879 181201 195886 190318 196780 197676 219465 243844 238281 203378 188594 193124 167177
13056 167177 164919 162845 168352 203535 240281 218805 188967 182752 187879 198220 205421 223406 256081
13043 256081 229285 204220 206307 226865 248123 232182 215834 224268 226841 271077 275624 258768
13031 258768 243097 246158 240354 235419 236183 243931 251047 245219 269477 282518 299931 328424 316455
13018C16455k5936l991P86J2108K137J07P148n33K0410k79r000R083l564J6841
13004C41772J5700M234m26K54n078Q934q288P978K817L7330K7580J6510R794k8340
12990D30771k821N987q771j213j7056p408J3220K8176J9294j6043j4694p9J9580
12977D48943J9084J3309J4291r229J7433K2597q092l2k4791q736N4284K9163k9990
12964E38234N480M9235L7807J5703k48L4542K8614J5822R802M2385Q6942J08457
12952I72775R5847P6786R4647J09926N9805Q9284P5650O7857K0968M770m0776
12941A627539o5669n3533o7265q4888j07187r1238n2917p3203p1879q2618m3312
12930H33830l6544j7860q752j830j3135k3105o452j2694k7242j6216j062k4876
$$ plain form
13018 316455 290519 286528 287314 299422 301559 301666 308814 308281 328691 328412 319412 328495 324931 341772
13004 341772 357472 361706 361280 361534 356456 365390 357102 365080 367897 405227 432807 449317 459111 430771
12990 430771 427950 433937 425166 423953 406897 399489 412709 440885 460179 444136 429442 429363 448943
12977 448943 468027 481336 495627 486398 503831 526428 518336 518304 493513 484777 539061 568224 538234
12964 538234 543714 592949 630756 646459 646211 680753 709367 725189 734991 777376 864318 972775
12952 972775 1068622 1145408 1240055 1349981 1409786 1499070 1574720 1642577 1663545 1668315 1627539
12941 1627539 1561870 1508337 1441072 1356184 1248997 1157759 1104842 1031639 959760 877142 833830
12930 833830 797286 779426 770674 768844 755709 732604 726152 713458 686216 670000 668938 644062
12918F44062j2483j1225J7188M768R79L0254l126j9490m3059j1084K7424r166
12906F15042K948N327r693j486K7947J739J3604J0949j0918q398j1175l3778l6542
12893E65566J4884N03k4565J2007J5732M4122k525l2406m210j1889K9574q845
12881E97948j8788O589J4044j8075l9014J40j282o315J2288Q068J4659L1036k025
12868E99273k3144j7797j7954k9101Q479Q415m1765j3997Q786j8241J1484k5266
12856D49172l9929o702J1590K4894J3428Q188N535N255j7513j1841k8244j3131
12844D00702k477K0585N11j1337K1205O510j3198j1526n664j9443n180J3333n686
12831C88335j3979n02j4811J9523O456j8216l1505r253J5006J3036J7256M3538
$$ plain form
12918 644062 631579 620354 637542 642310 643289 673543 670417 650927 607868 596784 624208 615042
12906 615042 617990 623317 613624 612138 640085 641824 655428 666377 655459 647061 635886 602108 565566
12893 565566 580450 580953 556388 568395 584127 628249 625724 593318 589108 577219 606793 597948
12881 597948 579160 585749 599793 581718 542704 542844 541562 535247 547535 555603 570262 601298 599273
12868 599273 576129 558332 540378 511277 519756 528171 486406 472409 481195 462954 474438 449172
12856 449172 409243 402541 414131 439025 452453 460641 466176 471431 453918 442077 413833 400702
12844 400702 398225 418810 419321 407984 429189 435699 422501 410975 405311 385868 380688 394021 388335
12831 388335 374356 373854 359043 378566 385022 366806 335301 326048 341054 354090 371346 414884
12819D14884J336k8655k2259j6007M066J4467L299N340J2297j8259o708j5080
12807C48721l7399Q487L0047q446k5894o457O595M786K1427J9232k862j4015J3789
12794C58011l296l279J3749J6873J0157o367j9478O1874K2291j3661q773O327
12782D34428J6198K1505J7520M047R939J4569j61k5162k3350k1790q015k0690
12770D19038k0072k0156l182q338k1545O460K8064k0066Q536K5102K6233J1890
12758D31964Q709q416p495j562k0899R675K6935M0027J8775J9237j1608R09K1656
12745E27907L6615O8999O9143Q9507J20217Q6644J01511J07380J28772J22155
12735A458850L7881L5280K6766l3537r6715o9728n9676n3143p2217j24688j13059
$$ plain form
12819 414884 416220 387565 365306 349299 353365 367832 371131 376471 388768 370509 363801 348721
12807 348721 311322 319809 349856 341410 315516 309059 315654 320440 341867 361099 358237 344222 358011
12794 358011 354715 351436 365185 382058 392215 385848 366370 428244 450535 436874 428101 434428
12782 434428 450626 472131 489651 493698 503637 518206 518045 492883 469533 447743 439728 419038
12770 419038 398966 378810 375628 367290 345745 352205 380269 360203 368739 393841 420074 431964
12758 431964 440673 432257 424762 423200 402301 411976 438911 478938 497713 516950 505342 506251 527907
12745 527907 564522 633521 702664 792171 912388 999032 1100543 1207923 1336695 1458850
12735 1458850 1496731 1532011 1558777 1525240 1428525 1358797 1299121 1245978 1173761 1049073 936014
12724I36014q9761p8466n4999m0654n3919l1292J4896k0237j2294k47j5937J0200
12712E63304L5667m3009l3085l4472l5939l5411K7984L9240j1089n0968k2141
12701D00081K7467l941j7364n626K273j9712K2828J0718L421Q715q907m3800k4363
12688C51790K1051J3290J0750K5313j1917j3177k599j2197K8933J2944j657q270
12676D14254O574J0870K1945L5885k6475m974K4391J4444K4410j1314l511j1503
12664D94996K7292k498R942L3061K8005J5428J2952L1394N2770N0936K8697k1746
12652G61229J0593M5354J0428O629J5939p159K8354M0265P687j2740M5926K9840
12640I82345j2320r216k6873N1550K1121k111J3885J5854J5862K468J2533J9049
$$ plain form
12724 936014 846253 767787 712788 672134 618215 586923 601819 581582 569288 569041 553104 563304
12712 563304 598971 555962 522877 488405 452466 417055 445039 484279 473190 422222 400081
12701 400081 427548 423607 406243 400617 402890 383178 406006 416724 420145 428860 419953 376153 351790
12688 351790 372841 386131 396881 422194 410277 397100 394501 382304 411237 424181 422524 414254
12676 414254 420828 431698 453643 489528 463053 458079 482470 496914 521324 510010 506499 494996
12664 494996 522288 519790 529732 562793 590798 606226 619178 650572 703342 754278 782975 761229
12652 761229 771822 817176 827604 834233 850172 843013 871367 911632 919319 906579 952505 982345
12640 982345 970025 960809 933936 985486 1006607 1004496 1018381 1034235 1050097 1052565 1065098 1084147
12628A084147J337j9405j675K0111K1797K6347R703M268L8017P319k2401k0458
12616A149107k791J6101J789J1608J9467J2821J3657L1116J4561J6037K9820L0929
12604A344222J8560K7024L6374J4248J4058J9101p730K471J0578M3991K5629R376
12592A557902K0140R577M712J3047N9854Q1342N7909N2202K0352L029K1774O1350
12580A963190Q2169M7530N7364Q3734J04047R8607J28169J22691Q8550J09931
12570B885982J13539Q7248J23080J33735J29825R9457J13384J34870J37064J70124
12560D128308K29947K04475K57451L02130L24039L49883L45770M23402M82516
12551G047921N45134O20361P31637Q71497J036382J191814J377591J631668J871258
$$ plain form
12628 1084147 1085484 1066079 1064404 1084515 1106312 1132659 1142362 1146630 1184647 1191966 1169565 1149107
12616 1149107 1146316 1162417 1164206 1175814 1195281 1208102 1221759 1252875 1267436 1283473 1313293 1344222
12604 1344222 1362782 1389806 1426180 1440428 1454486 1473587 1465857 1468328 1478906 1522897 1548526 1557902
12592 1557902 1578042 1587619 1592331 1605378 1665232 1746574 1804483 1856685 1877037 1880066 1901840 1963190
12580 1963190 2045359 2092889 2150253 2233987 2338034 2436641 2564810 2687501 2776051 2885982
12570 2885982 2999521 3086769 3209849 3343584 3473409 3572866 3686250 3821120 3958184 4128308
12560 4128308 4358255 4562730 4820181 5122311 5446350 5796233 6142003 6565405 7047921
12551 7047921 7593055 8213416 8945053 9816550 10852932 12044746 13422337 15054005 16925263
12542A6925263K072807K330973K690080L088212L640534M388723N515018P178030
12534D7829640R427988J2111870J4895999J7446790J9337030K0219431J9872185
12527A61140933J8112727J5052723J0884046O031297J046790l760088q135102
12520B00373326j2025012j5139514j7245275j8281880j8124017j6884438j4952235
12513H7720955j2719229j0512947q415159o610564n198002m164815l461977k947395
12505C3690867k577357k328664k125077j895525j722949j566483j403330j286598
12497A8784884j158192j019497r19713q34329p77603p27864o58830n83896n59805
12488A1545155n17403m86681m53844m31734l79411l31339l24760l32673k72315
$$ plain form
12542 16925263 18998070 21329043 24019123 27107335 30747869 35136592 40651610 47829640
12534 47829640 57257628 69369498 84265497 101712287 121049317 141268748 161140933
12527 161140933 179253660 194306383 205190429 211221726 212268516 208508428 200373326
12520 200373326 188348314 173208800 155963525 137681645 119557628 102673190 87720955
12513 87720955 75001726 64488779 56073620 49463056 44265054 40100239 36638262 33690867
12505 33690867 31113510 28784846 26659769 24764244 23041295 21474812 20071482 18784884
12497 18784884 17626692 16607195 15687482 14853153 14075550 13347686 12688856 12104960 11545155
12488 11545155 11027752 10541071 10087227 9655493 9276082 8944743 8619983 8287310 8014995
12479H014995k69682k56922k55334k26008k40933k30525j61312j61590j77238
12470F035451j68703j43742j67614j61797j30586j52110j51096j54214j27979
12461D677610j35529j51248j60804j26036j39899j17674j02975q7659r2076j05436
12451C458274j26361j34661j06981p8670j07743q3959p7928p4078n1291o8604
12441B547998p7965p1138q9329p5020n5026l9218m9110l0420n0752l3126j8321
12430A958573q47R355M6538M6141O2873K9156J6564j0268l3976m5416R5K2425
12418B101213k3508m1412m5726m6324m0837j7972j5072k9120m5745k6548j467
12407A767482K8636q659j2120J2105K7609J9000m335K1153K2642K6856M4850K3005
$$ plain form
12479 8014995 7745313 7488391 7233057 7007049 6766116 6535591 6374279 6212689 6035451
12470 6035451 5866748 5723006 5555392 5393595 5263009 5110899 4959803 4805589 4677610
12461 4677610 4542081 4390833 4230029 4103993 3964094 3846420 3743445 3655786 3563710 3458274
12451 3458274 3331913 3197252 3090271 3011601 2903858 2819899 2741971 2667893 2616602 2547998
12441 2547998 2470033 2398895 2309566 2234546 2179520 2140302 2091192 2060772 2010020 1976894 1958573
12430 1958573 1957726 1967081 2013619 2059760 2122633 2151789 2168353 2158085 2124109 2078693 2078788 2101213
12418 2101213 2077705 2036293 1990567 1944243 1903406 1885434 1870362 1841242 1795497 1768949 1767482
12407 1767482 1796118 1787459 1775339 1787444 1815053 1834053 1829718 1850871 1873513 1900369 1945219 1968224
12395A968224J6287L9536J9397N028K5709K5395j4317j0646L0672L0577L1362
12384B167224K4225L2473M4113M2076L5612J767J38M9362N3752L9402K5902N7323
12372B573369Q5492R6694M3975R2424J64921J45473J18664J47748J49433J31815
12362C750008J23581J27386J55810J63166J78948J82318K21868K72453K65779
12353E441317L34794L81408M50536N59934O51719P61776R10423R86104J051524
12344A1529535J183002J298938J385160J500924J623922J729469J866950J983520
12336B4101420K142899K351046K671181L121734L869192N011078O699821R184998
12328E9153369J2328490J5753925J9040381K1715870K3290870K3367015K1683244
$$ plain form
12395 1968224 1984511 2024047 2043444 2048472 2074181 2099576 2085259 2074613 2105285 2135862 2167224
12384 2167224 2191449 2223922 2268035 2310111 2345723 2347490 2347628 2396990 2450742 2490144 2516046 2573369
12372 2573369 2658861 2755555 2799530 2891954 3056875 3202348 3321012 3468760 3618193 3750008
12362 3750008 3873589 4000975 4156785 4319951 4498899 4681217 4903085 5175538 5441317
12353 5441317 5776111 6157519 6608055 7167989 7819708 8581484 9491907 10478011 11529535
12344 11529535 12712537 14011475 15396635 16897559 18521481 20250950 22117900 24101420
12336 24101420 26244319 28595365 31266546 34388280 38257472 43268550 49968371 59153369
12328 59153369 71481859 87235784 106276165 127992035 151282905 174649920 196333164
12321A96333164J8351876J3749479Q301544K600873k921384q044394j2517424
12314B15853734j6180896j8747521k0039704j9894826j8426355j6060776j3387145
12307I3116511j0765738q351594o403508n004489m163602l643688l364573l257418
12299D8161901l210751l183691l159796l067639k889836k662561k403784k158741
12291B5425102j952850j729508j521219j307875j171225j057168r79475q86736
12283A4819046p95206p27970o43562o17811n58744m80527m42096m12040l88849
12274I752241l69193l58265l19809l00468k83890k62724k35985k34054k35946
12265G151907k66820k08365k07339k16716j95816j96044j81824j69192j92884
$$ plain form
12321 196333164 214685040 228434519 236736063 239336936 236415552 228371158 215853734
12314 215853734 199672838 180925317 160885613 140990787 122564432 106503656 93116511
12307 93116511 82350773 73999179 67595671 62591182 58427580 54783892 51419319 48161901
12299 48161901 44951150 41767459 38607663 35540024 32650188 29987627 27583843 25425102
12291 25425102 23472252 21742744 20221525 18913650 17742425 16685257 15705782 14819046
12283 14819046 14023840 13295870 12652308 12034497 11475753 10995226 10553130 10141090 9752241
12274 9752241 9383048 9024783 8704974 8404506 8120616 7857892 7621907 7387853 7151907
12265 7151907 6885087 6676722 6469383 6252667 6056851 5860807 5678983 5509791 5316907
12256E316907j72103j55646j54315j50256j65133j85060j76435j18642j38369
12247C900948j53640j28440j19711j33618j19602j23185p9419n5595j07376j08455
12237B771907j06614j03836j15367j25493j20881j17948j09936j54659j36056
12228A681117j34040r3232p7703m4694o0413m5776n7741l9925J663k2885m7601
12217A058770L60j2329P854L9650r242m3844m2280k1954k4876m9727k4505k8734
12205H49143o296k7226K2696L5747J1889K5095J3851J2457O358M6281M6476J2590
12193A049061K2390J5431J7718Q516J8023k726J627J2309M7652K6380K5503O1432
12181A303316R2756J16017J34685J58662J57560J50929J34441N8196L0422J1302
$$ plain form
12256 5316907 5144804 4989158 4834843 4684587 4519454 4334394 4157959 4039317 3900948
12247 3900948 3747308 3618868 3499157 3365539 3245937 3122752 3043333 2987738 2880362 2771907
12237 2771907 2665293 2561457 2446090 2320597 2199716 2081768 1971832 1817173 1681117
12228 1681117 1547077 1453845 1376142 1331448 1271035 1225259 1167518 1127593 1129256 1106371 1058770
12217 1058770 1059130 1046801 1054655 1094305 1085063 1041219 998939 976985 952109 902382 877877 849143
12205 849143 842847 815621 838317 874064 885953 911048 924899 937356 943714 989995 1036471 1049061
12193 1049061 1071451 1086882 1104600 1113116 1131139 1128413 1130040 1142349 1190001 1216381 1241884 1303316
12181 1303316 1396072 1512089 1646774 1805436 1962996 2113925 2248366 2306562 2336984 2348286
12171B348286r648k3726j0810n1221p3326q0892o1843q0390k5264J4660M5159
12160A990985P1940R7553J31252J51431J74312J43445R4297Q3465P7288K9866
12150C045834J5071o496l0022n3111n7538o4912q118j1152O291J781J1151J02611
12138B951390J35961J33372J14434J10024Q7403N5069K7951K5203m0825n9644
12128C540338j23151j10871j35905j26558j45318j23486j39387j06032p5269o2930
12118B391431m8441k1810L0589P2583Q7159P2620N8344p419k0948k7337k9591
12107B557180o014l6484k4889n4244n9629l9117l1499J2991j1605J7767J6793
12096B341250K5808n616l0224J7759N0905L4132J001k1222j8937l8216l7154m0366
$$ plain form
12171 2348286 2338638 2314912 2304102 2252881 2179555 2098663 2036820 1956430 1931166 1945826 1990985
12160 1990985 2062925 2160478 2291730 2443161 2617473 2760918 2855215 2938680 3015968 3045834
12150 3045834 3060905 3054409 3024387 2971276 2913738 2848826 2840708 2829556 2835847 2837628 2848779 2951390
12138 2951390 3087351 3220723 3335157 3445181 3532584 3587653 3615604 3640807 3599982 3540338
12128 3540338 3417187 3306316 3170411 3043853 2898535 2775049 2635662 2529630 2454361 2391431
12118 2391431 2342990 2321180 2351769 2424352 2511511 2584131 2642475 2635056 2614108 2586771 2557180
12107 2557180 2551166 2514682 2489793 2435549 2375920 2336803 2305304 2318295 2306690 2324457 2341250
12096 2341250 2367058 2361442 2331218 2348977 2399882 2434014 2435015 2413793 2394856 2356640 2319486 2279120
12084B279120n7471q9974j08650j30420j31618j10951j15472j21589r4075r3046
12074A225854o1626m6134o9564m6904l0495l7217m2101k6114m5419q121j6938
12063G95221k8606k6216k1551k0151l6583j1322R474M449k2305j8417k6430k5775
12051E71788m611J4716J458j2972n309j9047O804j7619K561L0704M904R620K6410
12038F09407p09J4543R352K4773M8979N5080N2105P5247R3760J21601J46044J31223
12026A381405J84696K10695J77562Q3136P0408L9737j2635k1391n8122o0643n3824
12015A941024j04523j39461n1998k887J8019K0121P7307J20308J51791J70936
12005B200637K34108L43821M22598N91475P69611R43084J074850J163635J155994
$$ plain form
12084 2279120 2221649 2131675 2023025 1892605 1760987 1650036 1534564 1412975 1318900 1225854
12074 1225854 1164228 1118094 1048530 1001626 971131 933914 891813 865699 820280 812159 795221
12063 795221 766615 740399 718848 698697 662114 650792 660266 664715 642410 623993 597563 571788
12051 571788 567177 581893 583351 570379 565070 546023 552827 535208 537769 568473 573377 582997 609407
12038 609407 608698 623241 632593 657366 706345 761425 813530 888777 982537 1104138 1250182 1381405
12026 1381405 1566101 1776796 1954358 2037494 2107902 2147639 2135004 2113613 2055491 1994848 1941024
12015 1941024 1836501 1697040 1645042 1642155 1660174 1680295 1757602 1877910 2029701 2200637
12005 2200637 2434745 2778566 3201164 3792639 4562250 5505334 6580184 7743819 8899813
11996H899813J066003R08743O82732M13490J03980j42955m44812p24729q90675
11987I871590r91626j041696j028668j017399q99582p24255n80209m44305l45540
11978B798310k92102k46120j88817j57137j10582r1250j10041r5940q1561q4976
11968A339784q2638o1606o7046n7167n2063n5397m6062m0986l0729o4766l7499
11957G43825j8877q324l0870n2668j9690l9843j1146j4426o86j6207p194P149
11945E31043K153j2669j6383o958j4713j6708k5534k7258J566O89j7542m5848
11933C51838j7247J8360j2790n1248l139N1183j6736M642J0736k4100j2656m737
11921B94106L1891L6891K2956k3312n1127n889j5899J590J9741L5853L7837J8987
$$ plain form
11996 8899813 9965816 10874559 11557291 11970781 12074761 11931806 11486994 10762265 9871590
11987 9871590 8879964 7838268 6809600 5792201 4892619 4168364 3588155 3143850 2798310
11978 2798310 2506208 2260088 2071271 1914134 1803552 1712302 1602261 1506321 1424760 1339784
11968 1339784 1257146 1195540 1128494 1071327 1019264 963867 917805 876819 846090 781324 743825
11957 743825 724948 716624 685754 633086 613396 573553 562407 547981 547295 531088 523894 531043
11945 531043 533196 520527 504144 497186 482473 465765 440231 412973 414539 415228 397686 351838
11933 351838 334591 352951 340161 288913 285774 336957 320221 324863 335599 311499 298843 294106
11921 294106 325997 362888 385844 362532 311405 305516 289617 291207 310948 346801 384638 403625
11909D03625K6397M4150N8716M8717P6966R1871R8042J15797J54548J14500O3578
11898A296907O0546L5796p790k4296m8876p2344q5386r7519j13606j18208j05158
11887G20066r1452o7032l474o928k5136m1726k4398o2901j6685J0095k4797m2236
11875C23396k3789j7064r569M195k426j0017J3674j719j9680k5333P390J5072
11863B54130m2585k3493N537k2948j1963o932j6210n1M812j4722N80Q456J6143
11850A50754k2871O667K4342O26q77O70j1092O673q673j2110M581j8561k6501
11837I3628O729K8929j1232j9540l386j4015P526J9538m760J604k0878K94J8403
11824A02840k0849M39J1367r289j2218J992j8228K0051R297j0977L3530J1508
$$ plain form
11909 403625 430022 474172 532888 581605 658571 750442 848484 964281 1118829 1233329 1296907
11898 1296907 1357453 1393249 1385459 1361163 1312287 1239943 1154557 1057038 943432 825224 720066
11887 720066 628614 561582 558108 551180 526044 484318 459920 397019 380334 390429 365632 323396
11875 323396 299607 282543 272974 277169 274743 264726 278400 276681 257001 231668 239058 254130
11863 254130 211545 188052 193589 170641 158678 151746 135536 135485 140297 125575 126155 134611 150754
11850 150754 127883 134550 158892 159518 158641 159311 148219 154892 146219 134109 138690 120129 93628
11837 93628 100357 129286 118054 98514 95128 81113 88639 108177 103417 105021 84143 84437 102840
11824 102840 81991 82430 93797 84508 72290 74282 56054 76105 85402 74425 107955 119463
11812A19463l0486J2043L0926j4940k4616j447J1853q928j9105j8601J9754l303
11800G2613K1581J3495j8355l8782L35M1974L5954J8167o679k8323k2172r913
11788G9895k6585m884j51r762K7400q803q632R140K0102j3500j9561K0441L783
11775F8883q546o14J9493K9862O190k4304j6583J9037J2267R082j3248j1908j5741
11762G3870j896J19o256J0935O966K5578R711k9642J5111k14K981P846P487j0341
11748A12255j5833j4278j7263j8143M271J3664k7393N767J8937J0059K3624P109
11736A02776k6720p304J4612K855J6424K0561k7791j4880j1493j1712R369l8162
11724B8535k9460J1518K7856L2346L1611L40k681M496j2677j0228l134J95j3042
$$ plain form
11812 119463 88977 101020 131946 117006 92390 90943 102796 93868 74763 56162 75916 72613
11800 72613 94194 107689 89334 50552 50887 92861 128815 146982 140303 111980 89808 79895
11788 79895 53310 48426 48275 38513 65913 57110 48478 57618 77720 64220 44659 65100 68883
11775 68883 60337 59723 79216 109078 115268 90964 74381 93418 105685 114767 101519 89611 73870
11762 73870 71974 72093 65837 76772 83738 109316 119027 89385 104496 104282 107263 115109 122596 112255
11748 112255 96422 82144 64881 46738 51009 64673 37280 43047 61984 72043 95667 102776
11736 102776 76056 68752 83364 86219 102643 123204 95413 80533 69040 57328 66697 28535
11724 28535 -925 10593 38449 70795 102406 102746 100065 104561 91884 81656 78522 78717 65675
11711F5675J0079p085K1794J0868m824P028J4255P740l4252j3334J6773J1420
11699A06137j1326q2l2423k8400p300K7936L5105j944o183j6408O433O466K3670
11686A01681J8767j8887j7929L039K7484p409J822K0315k7856j6249J966j627
11674H5117l2126j3439J3276Q484K9865J7431O717k1914j486j8567P969q713L633
11661G6247J0451L438J5766j10p218k994k327p74j0750n331L303q318l8925K6314
11647E8772K8198R937p510l8443J488J3428Q757m737j986l731n941J8972J4850
11634I2054L946j4945Q600L261L386p71k999J443j3639J249O557Q043J2496L913
11620A12594j3328k823n946J2366N479n337J3692M231K6328P253p752j8896j292
$$ plain form
11711 65675 75754 68669 90463 101331 96507 103535 117790 125530 91278 77944 94717 106137
11699 106137 94811 94729 62306 33906 26606 54542 89647 87703 81520 65112 71545 78011 101681
11686 101681 120448 101561 83632 86671 114155 106746 108568 128883 101027 84778 86744 85117
11674 85117 52991 39552 52828 61312 91177 108608 115325 93411 91925 73358 81327 72614 76247
11661 76247 86698 90136 105902 105792 98574 95580 93253 92479 81729 76398 79701 71383 32458 58772
11647 58772 86970 96907 89397 50954 52442 65870 74627 69890 67904 64173 58232 77204 92054
11634 92054 96000 81055 89655 92916 96302 95531 92532 93975 80336 81585 88142 96185 108681 112594
11620 112594 99266 96443 90497 102863 108342 103005 116697 120928 147256 154509 146757 127861 126569
11607A26569j5584R671M274Q443K1696o59Q173j3331r926k610P428K9057K750
11594A75951j9721l1239o067N922K3160j1097k3606j6174L5820O078R636J5506
11582A64169O23R136p498j5724k637J1095J1340M5910J2665p467k2402j7702j8366
11569A63142K5598J7408K0022j1233k7767k014j319pj1830R613l683j5351M41
11556A63020j9160L265K9097r605K6957K770k2217J1553K5150J955l3575J6211
11544A95421L4696P753J1014J9623J6806p493K978O473j5261N685n839k4236p338
11531B40282M363M9851J1163l3002l2665q607K6103J7182k2939M618J575q640
11519B49284M968J9980J6086L1855M3838J7798R70l496K55J0239l653O179K0880
$$ plain form
11607 126569 110985 120656 124930 133373 155069 154410 162583 149252 139326 136716 144144 173201 175951
11594 175951 156230 124991 118924 124846 148006 136909 113303 97129 132949 139027 148663 164169
11582 164169 164792 173928 166430 150706 148069 159164 170504 216414 229079 221612 199210 181508 163142
11569 163142 188740 206148 226170 214937 187170 185156 183837 183830 172000 181613 177930 162579 163020
11556 163020 143860 147125 176222 166617 193574 196344 174127 185680 210830 212785 179210 195421
11544 195421 230117 237870 248884 268507 285313 277820 280798 287271 272010 277695 271856 247620 240282
11531 240282 244645 294496 305659 272657 239992 231385 257488 274670 251731 256349 257924 249284
11519 249284 254252 274232 290318 322173 366011 383809 384779 381283 381538 391777 388124 394303 415183
11506D15183j2772R781M350J8397O1506L4831O513Q348l7884m038l4196k9007
11494D41012p471J288J0623M9578j2152l2457k1431l0315l7740K2428k454k2535
11482C58374p486k1310N286P430k1340k0992P529O672k4688k3773P449R119P00
11469B82970j338l179L2305J0021j1380j9644k188K0965M69l145j452k0808rJ3575
11455B97162j6046j9579J94O982m966J4475J312j9839p535j3127l1579J8429J0181
11442B36064k1346j0622j2724l767R893J8016N3521j3959m4448k0311r409r914
11430A70994k99m388l706J5743K5613l600P650l6822j244j2639K2638N801o859
11417A78882j2457k957J722q141l5227q826K4656L5507m861Q530J8582M01j7137
$$ plain form
11506 415183 402411 412192 416542 434939 496445 531276 537789 546137 508253 504215 470019 441012
11494 441012 433541 434829 445452 495030 482878 450421 428990 398675 360935 383363 380909 358374
11482 358374 350888 329578 334864 342294 320954 299962 307491 314163 289475 265702 273151 282270 282970
11469 282970 281632 278453 310758 320779 309399 289755 287567 308532 309001 305856 304404 283596 283587 297162
11455 297162 281116 261537 261731 268713 263747 278222 279534 259695 252160 239033 207454 225883 236064
11442 236064 214718 204096 191372 187605 197498 215514 269035 255076 210628 190317 180908 170994
11430 170994 170695 166307 162601 178344 203957 200357 208007 171185 169941 157302 179940 185741 178882
11417 178882 166425 163468 165190 157049 121822 112996 137652 173159 168298 176828 195410 195811 178674
11404A78674j6460K6283q128k9051L277K3831L3532R846P527j3455n5035n677
11392A55164J4123K2020J6206j4065L2017K1224M7497L5222j2049p211M44J1676
11380C22268j8019J3233J9120J7454O3131N0184L8957K5464N1870M9972O1438
11369F95072Q4813O2459P9320J36543J62824J61132K40310L26514L25525M19183
11359B693695M50190L76266K64266J34750N4195l4700q2703j81746k20672l04954
11349C148587l87820l83546l58473l01747k69155j94918j26499j08610p5459o2369
11339H79991q9010o0854j6255m7420l4926p4891j2284j2546m1471p0977o240k474
11327D10643J6426r095k8598j0841k8852j2071J218R105j7930O025k9996j2781
$$ plain form
11404 178674 162214 188497 180369 151318 154595 178426 211958 221804 229331 215876 160841 155164
11392 155164 169287 191307 207513 193448 225465 246689 294186 329408 317359 310148 310592 322268
11380 322268 304249 317482 336602 354056 417187 467371 506328 531792 583662 633634 695072
11369 695072 779885 842344 921664 1058207 1221031 1382163 1622473 1948987 2274512 2693695
11359 2693695 3143885 3520151 3784417 3919167 3973362 3938662 3855959 3674213 3453541 3148587
11349 3148587 2760767 2377221 2018748 1717001 1447846 1252928 1126429 1017819 942360 879991
11339 879991 790981 730127 713872 666452 631526 556635 544351 531805 490334 419357 413117 410643
11327 410643 427069 417974 389376 378535 349683 337612 338830 347935 330005 336030 306034 293253
11315B93253k1684j2261N853l052j0126M681K062J6346K6605k4103l4081k4805
11303B18688J4433L9198J8021n532l5481l6540J8166L9706j829j4176j6940k7439
11291B10275j8092j4205m769J0678K9756o477J1592k0096l4242j211j5008l873
11279A44328M164K6328J6200j8096j0871k896J0664Q390R774o405j2358J9871
11267A89093L4614L864R05r089j3196j7332k0451J1318J1179K7394J8769k2108
11255B14960j9766k0266j9133L0089K3496N932l0710k7945j1070r007J5498p409
11243A44669K9793L3042j635P122J8371k4884j2927j837J7639J993l3468k2989
11231A54889L1349P344j7070Q679K4356J0327n99o847m537M471k685l2899r818
$$ plain form
11315 293253 271569 259308 265161 262109 251983 256664 258726 275072 301677 277574 243493 218688
11303 218688 233121 272319 290340 284808 249327 212787 230953 270659 268830 254654 237714 210275
11291 210275 192183 177978 173209 183887 213643 207166 218758 198662 164420 163209 148201 144328
11279 144328 148492 174820 191020 172924 162053 159157 169821 178211 187985 181580 169222 189093
11267 189093 223707 227571 228476 219387 206191 188859 168408 179726 190905 218299 237068 214960
11255 214960 195194 174928 155795 185884 209380 215312 184602 156657 145587 136580 152078 144669
11243 144669 174462 207504 205869 212991 231362 206478 193551 191714 209353 211346 177878 154889
11231 154889 186238 193582 176512 185191 209547 219874 219275 212428 207891 212362 209677 176778 166960
11218A66960N614J1172l025Q455j4079J307R608O646k993N862K1475l497m1265
11205A72240L611J7383P995N418l782M254n742l490K6042J8344o241k7837n71
11192B07624J8736k1756Q48J6941R548q738m389m992K0321J0221L510j168j4797
11179B31909l8961j4939M131P911Q252K3211J90l189j8798M976L0142J855j1786
11166B24904M740J5597p520J1803j3539m0206j9055K947K638L0112L2262j0690
11154B33993l952L516k8989q435P730M48J5127L2392o608j2427N591K7525l633
11141B62278n720m7808n775J4909J3782J2475J4956J7866J1955J0665J3726n032
11129C08277j5306j4377P589N972N55j5651M793r446J145r99O820K5910n619J405
$$ plain form
11218 166960 172574 183746 180721 189176 175097 176404 186012 192658 189665 195527 217002 213505 172240
11205 172240 175851 193234 201229 206647 202865 207119 201377 197887 223929 242273 236032 208195 207624
11192 207624 226360 204604 205452 222393 231941 223203 218814 213822 234143 244364 247874 246706 231909
11179 231909 192948 178009 182140 190051 198303 221514 221704 218515 199717 204693 234835 236690 224904
11166 224904 229644 245241 237721 249524 235985 195779 176724 179671 182309 212421 244683 233993
11154 233993 230041 233557 204568 196133 203863 204311 219438 251830 245222 232795 238386 265911 262278
11141 262278 256558 208750 202975 217884 231666 244141 259097 276963 288918 299583 313309 308277
11129 308277 292971 278594 286183 292155 292710 277059 281852 272406 273551 272552 279372 305282 299663 301068
11115C01068J1241J1226n705j9233J3244p729L5706M6681j3473l0320p751K597
11103C37552P629K5940p371m7787J370K882j733J008j1669k0781P779o629J3685
11090C01875L0763J7287L034L0020J0686K71P577P95m859r897j6807k0045M26
11077C51126N177j5810j5149J7653J5294k4429J996N549j5116P802m614J3213
11065C42692N4019k4031j0048K1330L669k4299p905J7088K1233K568K2234K1876
11053D40426K2016J8104K1315J2140M783K7338K6301K3862j8793q949N34K1270
11041E90347M721k8656P005n936j606J3531J5354p136P413K3396L3120K1063N537
11028F78153j3220M764J8606J98k4357o761K8908k07j6324Q209J9877L1053l023
$$ plain form
11115 301068 312309 323535 317830 298597 311841 304112 339818 386499 373026 342706 334955 337552
11103 337552 345181 371121 363750 315963 317333 320215 318482 319490 307821 287040 294819 288190 301875
11090 301875 332638 349925 352959 382979 393665 393936 401513 402308 397449 387552 370745 350700 351126
11077 351126 356303 340493 325344 342997 358291 333862 335858 341407 326291 334093 329479 342692
11065 342692 396711 372680 362632 383962 387631 363332 355427 372515 393748 396316 418550 440426
11053 440426 462442 480546 501861 514001 518784 546122 572423 596285 577492 568543 569077 590347
11041 590347 595068 566412 573417 567481 565875 579406 594760 587624 595037 618433 651553 672616 678153
11028 678153 664933 669697 688303 688501 664144 657383 686291 686084 669760 677969 697846 728899 725876
11015G25876j8817K2626J4777O2111P8060M6473M2326L9184J3301N1328L2163
11004A109408Q852r456j2770j964k1594n6039k3555j0418l3084J776N482m5985
10992I10653J589K8512N199J1525r493l3703j1420j679M694O02n75j7604m5019
10979H43281m0081k6017l0860n274J3082o919j3823K252P373Q159N26M323L1568
10966G87590j7641l3280M601M292R422k3781p182k5631n4084k8540J2004j5875
10954F11895j3000k0870j0813j2679k6131j1830j8548p123J7151P346j8726j7040
10942D79632k77k6333k1411l82q465l3830j1963m25q970k3498j0894k94J0050
10929C42940K4300R509m461J0552m650j798J2963r005J3266K5233R621j6187K1847
$$ plain form
11015 725876 707059 729685 744462 806573 884633 931106 973432 1012616 1025917 1077245 1109408
11004 1109408 1118260 1108804 1096034 1094070 1072476 1016437 992882 982464 949380 951156 956638 910653
10992 910653 912242 940754 945953 957478 947985 914282 902862 901183 905877 906479 905904 888300 843281
10979 843281 803200 777183 746323 741049 754131 747212 733389 735641 743014 751173 751699 756022 787590
10966 787590 769949 736669 741270 745562 754984 731203 724021 698390 644306 615766 627770 611895
10954 611895 598895 578025 567212 554533 528402 516572 498024 490901 508052 515398 496672 479632
10942 479632 479355 453022 431611 431229 422764 388934 376971 376546 367576 344078 333184 332890 342940
10929 342940 367240 376749 372288 382840 378190 376392 389355 380350 393616 418849 428470 412283 434130
10916D34130L4328Q322N860O635m178K2743L3777L8874K8728M3833N0704P6016
10904G79772Q9178J22071J72989K42706K89401L06894K15421R4232J7636j0436
10894B319864k5199n3332n6821j26749k17732k28066k51233k04188j46722r7636
10884I12186p5476l2184k5713k9749k6852m939j034j0382n9896k4505J9121L5147
10872F75724K2735j7983l8557j6770k1647j3113J0805j1570L066j2571k9179R285
10860E60225Q136o046N893q85r564J2351J0517J9784o750j5464K8747j3451n653
10847E87840N264L817N446l922K583M2203M0668J5697j0361J3512M0q829j1453
10834F82505K1531R728k6607N977J5845J680l245l196J5980j088J1658K1331J6310
$$ plain form
10916 434130 468458 476780 482640 489275 485097 507840 541617 580491 609219 653052 703756 779772
10904 779772 868950 991021 1164010 1406716 1696117 2003011 2218432 2312664 2330300 2319864
10894 2319864 2294665 2241333 2184512 2057763 1840031 1611965 1360732 1156544 1009822 912186
10884 912186 836710 804526 778813 749064 722212 717273 716239 705857 645961 621456 640577 675724
10872 675724 698459 680476 641919 625149 603502 590389 601194 589624 592690 580119 550940 560225
10860 560225 568361 562315 568208 567323 557759 570110 580627 600411 593661 578197 606944 593493 587840
10847 587840 593104 596921 602367 598445 601028 643231 683899 699596 689235 702747 702787 693958 682505
10834 682505 704036 713764 687157 693134 708979 710659 707414 704218 720198 719110 730768 752099 768409
10821G68409m568j8190l3979j0045L061N39j3280m0249J7691K9306J8983J6960
10809G34638R490j7545r32J1824r163j4291P012o071k1014J3187K3271K1207j1787
10796G39826l192O550O826K0638m773q793k1944j3361J828k5860k7102K071j85
10783F72529R103K4153M278K0274J3710l2599k8280m263L4133O0174K3124k5837
10771G70499J4917K3731R345K3214K3714q828M3166j722k4777j0568J8844J6017
10759H97552o219j6855Q693K0332J6059K5147J1737l7359K663K3562K9082J5306
10747I89700M0666N6332J8312k7092K4470L4235k096J41K9138L6300K5886M0660
10735A266652M9690R2044Q0473N9206N4227J2192l0043l6177j4356Q593M1286
$$ plain form
10821 768409 763841 745651 711672 701627 704688 705227 691947 651698 669389 698695 717678 734638
10809 734638 744128 726583 725651 737475 728312 714021 721033 714962 693948 707135 730406 751613 739826
10796 739826 736634 743184 750010 770648 765875 757082 735138 721777 723605 697745 670643 672714 672529
10783 672529 681632 705785 710063 730337 744047 711448 683168 678905 713038 773212 796336 770499
10771 770499 785416 809147 818492 841706 865420 856592 899758 898036 873259 862691 881535 897552
10759 897552 891333 874478 883171 903503 919562 944709 956446 919087 921750 945312 974394 989700
10747 989700 1030366 1086698 1105010 1077918 1102388 1136623 1134527 1134668 1163806 1200106 1225992 1266652
10735 1266652 1316342 1408386 1488859 1548065 1602292 1614484 1584441 1548264 1533908 1542501 1583787
10724A583787L1597J0042k12K564K2654J4860M1186K1781O2910Q0663L9711M3173
10712A954716L4214P0750Q1238O4865Q0626O1394P5886N8335Q6296P6008L2253
10701B676581r80J6722N855L3661K8075K4782K4649K7033L2219N9087M8783N1513
10689C027980O7144M1023K0637N1322O0401L9683M1878K8776J6734j8747N24K4353
10677C401708M1861O3849O1494P8528Q1194J13091J50046J49177J61670J67155
10667D469773J82192K03305J95997K13804K36754K15039J96219K09349K30221
10658F352653K38213L16896L79739M07309M20661M26553M80739M78560N00548
10649A0001871N31702M91364M28771M40492M16261L96835L18638K56688J76829
$$ plain form
10724 1583787 1615384 1625426 1625214 1627778 1650432 1665292 1706478 1728259 1791169 1871832 1911543 1954716
10712 1954716 1988930 2059680 2140918 2205783 2286409 2347803 2423689 2482024 2568320 2644328 2676581
10701 2676581 2675601 2692323 2698178 2731839 2759914 2784696 2809345 2836378 2868597 2927684 2976467 3027980
10689 3027980 3095124 3136147 3156784 3208106 3268507 3308190 3350068 3378844 3395578 3376831 3377355 3401708
10677 3401708 3443569 3507418 3568912 3647440 3728634 3841725 3991771 4140948 4302618 4469773
10667 4469773 4651965 4855270 5051267 5265071 5501825 5716864 5913083 6122432 6352653
10658 6352653 6590866 6907762 7287501 7694810 8115471 8542024 9022763 9501323 10001871
10649 10001871 10533573 11024937 11453708 11894200 12310461 12707296 13025934 13282622 13459451
10640A3459451J62240J66286K14432K75378L05660M05582N63221P37143J007478
10631A7296871J399248J906277K579200L440422M259270M669091M500604L867213
10623D3918196L213639K713297K549996K600955K614631K342842J726877J025938
10615F2706371M94380K77889L89382P58956J144284J343675J265996Q85267M93797
10606F9759997L57277M86712R59701J569924K059301K279376K193677J967642
10598H1633607J824393J792309J871477K064816K272755K326467K277818K167819
10590I8231461K115437K177454K546951L286218M342777N545108O662988P241276
10582A32149670O648450M917528L002948J624996R79212O83527J63889p69198
$$ plain form
10640 13459451 13621691 13787977 14002409 14277787 14583447 14989029 15552250 16289393 17296871
10631 17296871 18696119 20602396 23181596 26622018 30881288 35550379 40050983 43918196
10623 43918196 47131835 49845132 52395128 54996083 57610714 59953556 61680433 62706371
10615 62706371 63200751 63478640 63868022 64626978 65771262 67114937 68380933 69266200 69759997
10606 69759997 70117274 70603986 71563687 73133611 75192912 77472288 79665965 81633607
10598 81633607 83458000 85250309 87121786 89186602 91459357 93785824 96063642 98231461
10590 98231461 100346898 102524352 105071303 108357521 112700298 118245406 124908394 132149670
10582 132149670 138798120 143715648 146718596 148343592 149322804 150006331 150170220 149401022
10574A49401022k122165l535105m323317m230622l519987k638813j929879j576147
10566A25524987j652027j942889k364259k749541k934640k906788k901249k891499
10558A05182095k856838k778099k640890k511053k288352k007135j563947r60069
10550H7575712l89260o7133j01876m57382p99897r82401p64772k07070M74125
10541H4280046R83885J055211L32127r78867k240200k937063l122099l109386
10533G4263654l164681l581890m309220m976359n142878m621541l787113k935353
10525D1744619k284285j837952j531711j270499j063586q93910p09890n86784
10517C1566002n62979n48755n57578n58204n29593m67924m51227m15190l97179
$$ plain form
10574 149401022 147278857 143743752 139420435 135189813 131669826 129031013 127101134 125524987
10566 125524987 123872960 121930071 119565812 116816271 113881631 110974843 108073594 105182095
10558 105182095 102325257 99547158 96906268 94395215 92106863 90099728 88535781 87575712
10550 87575712 87186452 87119319 87017443 86560061 85760164 84777763 84012991 83805921 84280046
10541 84280046 85263931 86319142 86651269 85672402 83432202 80495139 77373040 74263654
10533 74263654 71098973 67517083 63207863 58231504 53088626 48467085 44679972 41744619
10525 41744619 39460334 37622382 36090671 34820172 33756586 32862676 32152786 31566002
10517 31566002 31003023 30454268 29896690 29338486 28808893 28340969 27889742 27474552 27077373
10508B7077373l88202l48449k72731j88500j46359q6645N9051K38987M15480O73990
10498B7033995Q85162J017949J162781J309403J527635J926500K514520L196092
10490D0574037M037249N090792O462105Q318978J0857564J4607906K0572796L0074702
10482A40596129M3753018N7680587O0697798M5646761K2265365M203674l950763
10475C70892569n977972o747608r971551k0733323l8232688n0510823m9253947
10468A89464657l9156981k8102366j9772547j4196105j0436393p909281o277701
10461F3613283n171340m352762l710983l224996k833063k542871k381299k217510
10453C7178459k104838k000202j896926j760448j582285j470752j404631j265881
$$ plain form
10508 27077373 26689171 26340722 26067991 25879491 25733132 25646487 25705538 25944525 26360005 27033995
10498 27033995 27919157 28937106 30099887 31409290 32936925 34863425 37377945 40574037
10490 40574037 44611286 49702078 56164183 64483161 75340725 89948631 110521427 140596129
10482 140596129 184349147 242029734 302727532 348374293 370639658 374843332 370892569
10475 370892569 364914597 358166989 348195438 327462115 289229427 238718604 189464657
10468 189464657 150307676 122205310 102432763 88236658 77800265 69890984 63613283
10461 63613283 58441943 54089181 50378198 47153202 44320139 41777268 39395969 37178459
10453 37178459 35073621 33073419 31176493 29416045 27833760 26363008 24958377 23692496
10445B3692496j146606j099742j007290r22619q27783p93090p27245o62624o19687
10436A5885810n61667n30947m91394m22584l40359l71517l73339l03698l09191
10427A2181114k76386k47272j99745j49972r5638q8583m6348J1417N0750J63589
10417A1302926K88449L81815M54992M44834L94385L14122J81878r427j40769k76167
10407A3337038l95151n10058o43947p56816p76129p99682p78642o90165n94714
10398G391734n04724m20502l38115l07582k37003k03751j88903j58230j47055
10389D885869j17820m3268o6992k5502L2050R7553J96724K58369L46712M78192
10379F041887N71835N82201N72454N21522M02577K20896Q2571n4935j82327k83290
$$ plain form
10445 23692496 22545890 21446148 20438858 19516239 18688456 17895366 17168121 16505497 15885810
10436 15885810 15324143 14793196 14301802 13879218 13538859 13167342 12794003 12490305 12181114
10427 12181114 11904728 11657456 11457711 11307739 11212101 11123518 11077170 11088587 11139337 11302926
10417 11302926 11591375 11973190 12428182 12873016 13267401 13581523 13763401 13753974 13613205 13337038
10407 13337038 12941887 12431829 11787882 11031066 10254937 9455255 8676613 7986448 7391734
10398 7391734 6887010 6466508 6128393 5820811 5583808 5380057 5191154 5032924 4885869
10389 4885869 4768049 4724781 4657789 4632287 4664337 4761890 4958614 5216983 5563695 6041887
10379 6041887 6613722 7195923 7768377 8289899 8692476 8913372 8995943 8941008 8758681 8475391
10369H475391m44648n53196o16726o68743o19300n37478n02209l56361l22840
10360C853890k66903k21048j47697r6505p6656m8601m0785m7590o4072o8979p9732
10349B695322k8403l8499n5082m4034n6905r9787p0975n3550l8606k7494k8339
10338B153648n6641o8704j4850l3322n5477k7581K745j8554l4848k6670l8732
10327A781014k3760K432j5046k1837P014K0254j4539l2508q553n410k3145K294
10315A668210q557k4076k6766j5731k098O32k8688m1282r035k0693j8831k936
10303A470149k0893l1705o435k2190j7755p221Q280j3993j6134l1988k8082K7094
10291A309127J9393k6435j3793m1560j310J5091J8159J1785K0920J1081j0092
$$ plain form
10369 8475391 8030743 7477547 6860821 6192078 5572778 5035300 4533091 4176730 3853890
10360 3853890 3586987 3365939 3218242 3121737 3045081 2996480 2955695 2908105 2844033 2775054 2695322
10349 2695322 2666919 2628420 2573338 2529304 2472399 2372612 2301637 2248087 2209481 2181987 2153648
10338 2153648 2097007 2028303 2013453 1980131 1924654 1897073 1899818 1881264 1846416 1819746 1781014
10327 1781014 1757254 1759686 1744640 1722803 1729817 1750071 1735532 1703024 1694471 1689061 1665916 1668210
10315 1668210 1659653 1635577 1608811 1593080 1590982 1591614 1562926 1521644 1512609 1491916 1473085 1470149
10303 1470149 1449256 1417551 1411116 1388926 1371171 1363950 1372230 1358237 1342103 1310115 1282033 1309127
10291 1309127 1328520 1302085 1288292 1246732 1245422 1260513 1278672 1290457 1311377 1322458 1312366
10280A312366l6368q857l38J5570J0716j3565N09Q658J9105j7160k7649q246l8672
10267A216069j9763k0533p617l1952l5753k7976k2562j5470n144J4142K0233J1744
10255A075418j6821j579P247l900j1831M986J983J3643o095m3141J4924M2884
10243A077718p005n307L4446J2013k3876l1587L808l831o674J5233j391K3177
10231A086724K5975K9335K4091j51j7664J4028R17K388k6828L614J0962K1588
10219A174979j3940l0274J5351R01N93n680J46j840J844J3904M9903K8841K5282
10206A260010J3214L1417J899J0486M34j4614J4117K6730J659J4139M7308O4443
10194A471242J8538j8822n197J2936K1352L9314L7606K2641L3431L4537J8568
$$ plain form
10280 1312366 1275998 1267141 1266803 1282373 1293089 1279524 1280033 1288691 1307796 1290636 1262987 1254741 1216069
10267 1216069 1196306 1175773 1168156 1136204 1100451 1072475 1049913 1034443 1029299 1043441 1063674 1075418
10255 1075418 1058597 1057018 1064265 1060365 1048534 1053520 1055503 1069146 1063051 1019910 1034834 1077718
10243 1077718 1070713 1065406 1099852 1111865 1087989 1056402 1060210 1056379 1049705 1064938 1063547 1086724
10231 1086724 1112699 1142034 1166125 1165974 1148310 1162338 1163255 1165643 1138815 1142429 1153391 1174979
10219 1174979 1161039 1130765 1146116 1147017 1147610 1141930 1142076 1140236 1142080 1155984 1205887 1234728 1260010
10206 1260010 1273224 1304641 1306540 1317026 1317460 1302846 1316963 1343693 1345352 1359491 1406799 1471242
10194 1471242 1489780 1470958 1465761 1478697 1500049 1539363 1576969 1599610 1633041 1667578 1686146
10183A686146J3773k488K9333K0231K5521L7133L8306J5114N6315L5697P238K448
10171A964767m862L6299L8841O4076M3992O5983M1105M5301M1876O5530N9218
10160B462126O4411R2891P6196P1396J06559J25118J19614J35670J74999J95992
10150C624972K06779K48372K43968K50223K51795L09236L47260L97929M79044
10141F359578O09795Q27150J071014J405539J969215K787199M053649N470466
10133B4553605O334375N788582L876279J676111J94181m30397o30506r52809j856945
10124C8552476l449146m917287n288868m548536l327585k226165j427603q98779
10116A2468507n22927k12561J01224L81135O90436R72249J178169J185990J025845
$$ plain form
10183 1686146 1699919 1697431 1726764 1746995 1772516 1809649 1847955 1863069 1919384 1955081 1962319 1964767
10171 1964767 1959905 1996204 2035045 2099121 2143113 2209096 2250201 2295502 2337378 2402908 2462126
10160 2462126 2526537 2619428 2695624 2767020 2873579 2998697 3118311 3253981 3428980 3624972
10150 3624972 3831751 4080123 4324091 4574314 4826109 5135345 5482605 5880534 6359578
10141 6359578 6969373 7796523 8867537 10273076 12242291 15029490 19083139 24553605
10133 24553605 30887980 36676562 40552841 42228952 42423133 41992736 41362230 40409421 38552476
10124 38552476 35103330 30186043 24897175 20348639 17021054 14794889 13367286 12468507
10116 12468507 11945580 11733019 11834243 12215378 12905814 13878063 15056232 16242222 17268067
10107A7268067O43904K56601j4633k56535m79949o40876r17362j227465j375027
10098A3256725j320328j203309r92373p74723o10862m59344l92426l15492k29118
10089F958750j80191j65300j58505r6472n5056n8407q4288l3485k8138k0752K0553
10078F098709K7217K1043m350K0999P0677O9404P4155O8332Q3025J17124J24952
10067F771287J58719J58383J28324J64744J56532J70211K07506K59538K94821
10058H470065L13688M07766M94655N78080N66797M94450L93757L76727L41777
10049A2437762L34886L79849L89959L66623L16705L32657M15739N18865O66574
10040A6159619Q13130R24025J033389J052027J034312J012007R35332Q95146Q96237
$$ plain form
10107 17268067 17911971 18168572 18153939 17897404 17417455 16776579 15859217 14631752 13256725
10098 13256725 11936397 10733088 9740715 8965992 8355130 7895786 7503360 7187868 6958750
10089 6958750 6778559 6613259 6454754 6358282 6303226 6244819 6160531 6127046 6098908 6078156 6098709
10078 6098709 6125926 6146969 6142619 6163618 6234295 6303699 6377854 6446186 6529211 6646335 6771287
10067 6771287 6930006 7088389 7216713 7381457 7537989 7708200 7915706 8175244 8470065
10058 8470065 8783753 9191519 9686174 10264254 10831051 11325501 11719258 12095985 12437762
10049 12437762 12772648 13152497 13542456 13909079 14225784 14558441 14974180 15493045 16159619
10040 16159619 16972749 17896774 18930163 19982190 21016502 22028509 22963841 23858987 24755224
10031B4755224Q74526Q47741Q29645P98336P95814P92097Q56439R42359R77542
10022C2469723J004462J018107R92437R59950R34316Q96385P79441O97525N58023
10013D0310369M33808L41631K21428L6169j20392k44806l83179n14030o36942
10004C9444056p51357q61939r37509j029647j077206j119729j179717j210053
9996C1276899j203726j192014j192746j140571j118690j115593j096728j053336
9988B2163495r56225q99739q72264q36202p81516p14272p00511o89248o89735
9979A5023783o44208n80986n72599n38506n01183m69848m79864m43070m10558
9970A0382961l88885l55313l56700l26236l13425k85055k87196k79205k41296
$$ plain form
10031 24755224 25629750 26477491 27307136 28105472 28901286 29693383 30549822 31492181 32469723
10022 32469723 33474185 34492292 35484729 36444679 37378995 38275380 39054821 39752346 40310369
10013 40310369 40744177 41085808 41307236 41343405 41223013 40978207 40595028 40080998 39444056
10004 39444056 38692699 37830760 36893251 35863604 34786398 33666669 32486952 31276899
9996 31276899 30073173 28881159 27688413 26547842 25429152 24313559 23216831 22163495
9988 22163495 21207270 20307531 19435267 18599065 17817549 17103277 16402766 15713518 15023783
9979 15023783 14379575 13798589 13225990 12687484 12186301 11716453 11236589 10793519 10382961
9970 10382961 9994076 9638763 9282063 8955827 8642402 8357347 8070151 7790946 7549650
9961G549650k08895k20085k31768j93600k20466k22349k00538j65169j47078j59634
9951E580068j65419j59757j54551j31802j25350j22403j28437j18879j10217p3919
9941D289334j02872p7189j01833p2438p9962q9019o7893m0899n2576q3548m7651
9930C473454l9385m8653o2766n2475n7650p9444o2221o3649o5795o7307m9201
9919B824908o2943o4832l5439j3751l8089m8325j9101n3517o7210m0651l7443
9908B343607j2046j8640j2038o523j134l9765k3227J476j6249m5760q221o934
9896B154546k1934J284R956K868j4417Q590j1776r336o913k7109J3773R803k3663
9883B085672l1848k923k8652k4209k6214K2024K0330m1444n5009o0684k4976m1648
$$ plain form
9961 7549650 7340755 7120670 6888902 6695302 6474836 6252487 6051949 5886780 5739702 5580068
9951 5580068 5414649 5254892 5100341 4968539 4843189 4720786 4592349 4473470 4363253 4289334
9941 4289334 4186462 4109273 4007440 3935002 3855040 3766021 3698128 3657229 3604653 3521105 3473454
9930 3473454 3434069 3385416 3322650 3270175 3212525 3133081 3070860 3007211 2941416 2874109 2824908
9919 2824908 2761965 2697133 2661694 2647943 2609854 2561529 2542428 2488911 2421701 2381050 2343607
9908 2343607 2331561 2312921 2300883 2294360 2293226 2253461 2230234 2231710 2215461 2169701 2161480 2154546
9896 2154546 2132612 2133896 2143852 2146720 2132303 2140893 2129117 2119781 2112868 2085759 2099532 2109335 2085672
9883 2085672 2053824 2050901 2022249 1998040 1971826 1993850 2014180 1972736 1917727 1857043 1832067 1790419
9871A790419l5538m9981k4132j2018m596J287L1722r22m6870m2280j4922R739
9859A601908J8266j3904j3633q315k0474l312k656j2911k5023J6400K3247M799
9847A564392o375k465J7965J5248J7918K0479R040J4020j3592N42j1741K9324
9835A654755R541k4063l1326k3452m253l3254k3736l2200j6289l6219l7096j1184
9823A391224j7728j3064q976k9608r801K2031j0362k6099l4189j1325q36k7035
9811A224232j5572o404q225p510k1150l0608J3743n454l8906K6559L8015P470
9799A176190k9631k271J3800j7957n711J6746q4L4989M9989K5700J7933J5387
9787A295080L6108L1982l776j7638l0076m0166p0508l4195m017n8778l5938J1370
$$ plain form
9871 1790419 1754881 1704900 1680768 1668750 1664154 1665441 1697163 1696241 1649371 1607091 1592169 1601908
9859 1601908 1620174 1606270 1592637 1584322 1563848 1560536 1557880 1544969 1519946 1536346 1559593 1564392
9847 1564392 1558017 1555552 1573517 1588765 1606683 1627162 1636202 1650222 1636630 1637172 1625431 1654755
9835 1654755 1664296 1640233 1608907 1585455 1581202 1547948 1524212 1492012 1475723 1439504 1402408 1391224
9823 1391224 1373496 1360432 1351456 1321848 1312047 1334078 1323716 1297617 1263428 1252103 1251267 1224232
9811 1224232 1208660 1202256 1194031 1186521 1165371 1134763 1148506 1143052 1104146 1130705 1168720 1176190
9799 1176190 1146559 1144288 1158088 1140131 1134420 1151166 1151082 1186071 1236060 1261760 1279693 1295080
9787 1295080 1331188 1363170 1359394 1341756 1311680 1271514 1201006 1166811 1162794 1104016 1068078 1079448
9775A079448j9614j5983J0027l7620l3719J1502K6811k0489m4492j4430r218l8408
9763H93815j6557l0648k2350K4051J697j1159l0998j6708J4734J1772m203N78
9751H14024R238M997J0796K0426K4537L0466k673m249K725N554J5906n156k6577
9738I00014l468Q244o42j1187j1922l8678r429J9572J7218K6452K5728L7068K156
9725I61126k6524k6531j5628j2231K153J0381l17p481l735R243K6888r094r357
9712H98893K8132J1781L1000L4964p422k6971l057J3633L9749l119j4254M951
9700A008280J2894j3466p014k5395j9369j5515J4854J9528j0183m6748k4593K737
9688H96010J0402L2095R965p085l1424N294K9200K0164O711L5468K695K5899J5653
$$ plain form
9775 1079448 1059834 1043851 1053878 1016258 982539 994041 1020852 1000363 955871 941441 932223 893815
9763 893815 877258 846610 824260 848311 850008 838849 807851 791143 805877 817649 813446 814024
9751 814024 823262 828259 839055 859481 884018 914484 911811 907562 910287 915841 931747 926591 900014
9738 900014 896546 904790 904148 892961 881039 842361 832932 852504 869722 896174 921902 958970 961126
9725 961126 934602 908071 892443 880212 882365 892746 892429 884948 881213 890456 917344 908250 898893
9712 898893 927025 938806 969806 1004770 997348 970377 967320 980953 1020702 1017583 1003329 1008280
9700 1008280 1021174 1007708 1000694 975299 955930 940415 955269 974797 964614 917866 893273 896010
9688 896010 906412 938507 948472 941387 909963 915257 944457 964621 971332 1006800 1009495 1035394 1051047
9675A051047j092m41L609L2241l2423l6777j9224r813j4891J885j1608j2616Q428
9662I58325p188j1283J395K0021L3133p498K901K837P245K1936N752N620K5564
9649A058760K3063l364k6867k2636j2011J1353l8218j1573J8588L6036L2709M3375
9637A109215N5324M0993K5311K7263J1808J9308j2238k7265j6127j3991m07K0170
9625A239364o993r789k1974j1369k752L5528M4588q467J3748J5134L0342L5166
9613A352526J0574L2241L8979K1050n602n801k388k8963m0356j6278o600J5818
9601A365200j2456q652K4480Q925L1035L2781K0083L4946K5259L7494L1496J7575
9589A608166L2675J6383k2839J6467J606P971j7640q333J952j6530l96j6930L2848
$$ plain form
9675 1051047 1049955 1049514 1053123 1085364 1052941 1016164 996940 987127 972236 974121 962513 949897 958325
9662 958325 951137 939854 941249 961270 994403 986905 989806 992643 999888 1021824 1027576 1033196 1058760
9649 1058760 1081823 1078459 1051592 1028956 1016945 1028298 990080 978507 997095 1033131 1065840 1109215
9637 1109215 1164539 1205532 1230843 1258106 1269914 1289222 1276984 1249719 1233592 1219601 1219194 1239364
9625 1239364 1232371 1222582 1200608 1189239 1186487 1222015 1266603 1258136 1271884 1287018 1317360 1352526
9613 1352526 1363100 1395341 1434320 1455370 1449768 1443967 1441579 1412616 1372260 1355982 1349382 1365200
9601 1365200 1352744 1344092 1368572 1377497 1408532 1441313 1461396 1496342 1521601 1559095 1590591 1608166
9589 1608166 1640841 1657224 1634385 1650852 1652458 1660429 1642789 1634456 1636408 1619878 1619482 1602552 1635400
9576A635400J3643M1243P0222K1980N0336M2504M7218M8095L6598P477M633L5727
9564B055076L8040P234Q777M5731L6647L880K5163N2393Q4634P4273Q7788R1255
9552B610891P7557Q8803J16898J03834J14097J03888J23504J39488J50686J56076
9542C785722J46158J11463J01870O9993O2361O4856M7403O403m016m9597p0593
9531D272023k9156j7220j2551k6729j1458P191N1359Q0249J04281J90085K75384
9520D883458L03412L51687M20300M69606M61908M41097L71355K99496K52616K18894
9510H473829J44941N3347m0793r4968j30552j55728j82163j97592j70368j21141
9500G578812o1974l3901L7039Q1989J22551J95323K69870L47602M95002O02022
$$ plain form
9576 1635400 1649043 1690286 1760508 1782488 1832824 1875328 1922546 1970641 2007239 2014716 2019349 2055076
9564 2055076 2093116 2100350 2109127 2154858 2191505 2195385 2220548 2272941 2357575 2431848 2519636 2610891
9552 2610891 2688448 2777251 2894149 2997983 3112080 3215968 3339472 3478960 3629646 3785722
9542 3785722 3931880 4043343 4145213 4215206 4277567 4342423 4389826 4396229 4392213 4342616 4272023
9531 4272023 4242867 4225647 4213096 4186367 4174909 4182100 4233459 4313708 4417989 4608074 4883458
9520 4883458 5186870 5538557 5958857 6428463 6890371 7331468 7702823 8002319 8254935 8473829
9510 8473829 8618770 8672117 8631324 8536356 8405804 8250076 8067913 7870321 7699953 7578812
9500 7578812 7516838 7482937 7519976 7601965 7724516 7919839 8189709 8537311 9032313 9634335
9490I634335P01018Q23097Q92451R07814P95058O88980N54716M77723M36320L36778
9480A6248290K60110K13523J71744K53101M87166P77955J113380J585462K171666
9471B3282397K822517L623646M480391N176542N346838M836643L954277L066102
9463E6589353K426164K000518J638172J239184O79283N8633l91082n08128k40746
9454F3491351L04522J013654J779919K490047L127447L678580L942528L856481
9446H3684529L610441L312636L063022K704781K144267J410042N62967l07919
9438A00184766r28830j141773j000774o45396l10468P331M30204J112117K140708
9429I9847885L452693M979392O695712Q602234J0113192J0306137Q761865O070903
$$ plain form
9490 9634335 10335353 11158450 12050901 12958715 13753773 14442753 14997469 15475192 15911512 16248290
9480 16248290 16508400 16721923 16893667 17146768 17633934 18411889 19525269 21110731 23282397
9471 23282397 26104914 29728560 34208951 39385493 44732331 49568974 53523251 56589353
9463 56589353 59015517 61016035 62654207 63893391 64572674 64631307 64240225 63732097 63491351
9454 63491351 63795873 64809527 66589446 69079493 72206940 75885520 79828048 83684529
9446 83684529 87294970 90607606 93670628 96375409 98519676 99929718 100492685 100184766
9438 100184766 99255936 98114163 97113389 96467993 96157525 96164856 96595060 97707177 99847885
9429 99847885 103300578 108279970 114975682 123577916 133691108 143997245 152759110 158830013
9421A58830013L315623J097635m43686j603122k926122m725207o793399q340804
9413A38410931q780907q268789p218157n916998m475610l080953j793270q23870
9405I8052377j61905L57300R22326J478186J768999J566772Q63032o7735j033961
9396A03745391j853207k458298k879013l278202l694601m108549m284878m186559
9388G7002084l764313l104685k235787j311743m88118K10393O49152O61387K46803
9379F7865173m18984j146440j700456k068473k371878k774565l404239m046628
9371D9933510m453230m391166m001384l410341k804839k311860j902645j531728
9363B5126317j189191q92232o73310n13137n11190n35006n45255n84815o29652
$$ plain form
9421 158830013 162145636 163243271 162799585 161196463 158270341 153545134 146751735 138410931
9413 138410931 129630024 121361235 114143078 108226080 103750470 100669517 98876247 98052377
9405 98052377 97890472 98247772 99170098 100648284 102417283 103984055 104847087 104779352 103745391
9396 103745391 101892184 99433886 96554873 93276671 89582070 85473521 81188643 77002084
9388 77002084 73237771 70133086 67897299 66585556 66097438 66307831 66956983 67618370 67865173
9379 67865173 67446189 66299749 64599293 62530820 60158942 57384377 53980138 49933510
9371 49933510 45480280 41089114 37087730 33677389 30872550 28560690 26658045 25126317
9363 25126317 23937126 23044894 22371584 21858447 21347257 20812251 20266996 19682181 19052529
9354A9052529o85556p15654p71062q17459q44192q74151p90717p09272o48500
9345A2195966n79468n03320m77043l98608k68971k11962j80356j31634r5936m3817
9335I304851k1672L8042N0418O876p6322j43777j92559k52836l05604l23458l49643
9324G734316l94879m27265m50892m14988l70652l22525k67040k18110k14359j99682
9314D453924j47963r5871q7311q2871m5893l5244m1824m4126j5566M2608k570
9303C897293l7247l0016k9157p0713q0658p8569p7623j09626j26572j26574j32559
9292B997979j01816r5560q3312q8740j05212r9451m3791o4641o1052n6922q3366
9281B114116q1572n1622k4192m2640q0130p1955k5995j1498k3766j7643k4009
$$ plain form
9354 19052529 18366973 17651319 16880257 16062798 15218606 14344455 13553738 12844466 12195966
9345 12195966 11616498 11113178 10636135 10237527 9968556 9756594 9576238 9444604 9348668 9304851
9335 9304851 9283179 9321221 9371639 9378515 9302193 9158416 8965857 8713021 8407417 8083959 7734316
9324 7734316 7339437 6912172 6461280 6046292 5675640 5353115 5086075 4867965 4653606 4453924
9314 4453924 4305961 4210090 4122779 4039908 3994015 3958771 3916947 3872821 3857255 3899863 3897293
9303 3897293 3860046 3830030 3800873 3730160 3649502 3570933 3493310 3383684 3257112 3130538 2997979
9292 2997979 2896163 2800603 2717291 2628551 2523339 2423888 2380097 2315456 2254404 2197482 2114116
9281 2114116 2032544 1980922 1956730 1914090 1833960 1762005 1736010 1724512 1700746 1683103 1659094
9270A659094m2716m3028J1883o212l3113o6023l6338P77N603j815k1872m5253
9258A380987m9408q376k4843j3707K186k0480j3814l929l3556l341P06k7746l7674
9245A147005O400m272k1104n390P414j3775l3630m0790L153J3615j1062l1489
9233A016075j2207j4821k0715j0967K673J3872n028j1608j4966k3090r056j0278
9221H99884J04O090q269k1054m3951j8836m812l979j3721k595j3939L794n491
9208G73225j3274p201n512n0381Q592L666l8349q206J3379l0801k578L444J4123
9195F60127P933K295r062j7902j7950n853m924j0174m2870k5394J3072m086J1081
9182E56293j2655q84J6011j2034k7186P729L5438j701k3279K8641P090j5814k9600
$$ plain form
9270 1659094 1616378 1573350 1585233 1579021 1545908 1479885 1443547 1444324 1449927 1448112 1426240 1380987
9258 1380987 1331579 1323203 1298360 1284653 1286839 1266359 1252545 1248616 1215060 1211719 1212425 1184679 1147005
9245 1147005 1153405 1149133 1128029 1122639 1130053 1116278 1082648 1041858 1045011 1058626 1047564 1016075
9233 1016075 1003868 989047 968332 957365 960038 973910 968882 957274 942308 919218 910162 899884
9221 899884 899988 906078 897809 876755 832804 813968 809156 805177 791456 788861 774922 778716 773225
9208 773225 759951 752750 747238 696857 705449 709115 670766 662560 675939 645138 642560 646004 660127
9195 660127 668060 670355 661293 643391 625441 619588 614664 604490 561620 536226 549298 545212 556293
9182 556293 543638 542754 558765 546731 519545 527274 562712 561011 537732 566373 573463 557649 528049
9169E28049m0874j0583M1142M300M148o434j4920j0129L42K0739Q895l827k0102
9156E00746k3007k6843k8953j3302K3288L7159k849j2066j4176J2217o757k1134
9144D24323n510J4545J7035K0535J282j0201k2420J7882r622Q279k7838l3257
9132C95033l647j3738P850K6072L1978K8819j3511n018R062R532l579j1396k977
9119D54480j1927K5678P135p464j7224K5749K6511J2027j2109k0883j0606O176
9107D77543L631J6880Q220N190K0670n260j9871L4786R013L0623L1578K9371M41
9094F42815k842J0415P557j2340j5531q799j5863j3184j0058j8493j2037q278
9082E43362j7370j7692k5127l0072j7828l486L6692K9935J4753Q31j3459J9371
$$ plain form
9169 528049 487175 476592 517734 522034 526182 519748 504828 494699 495041 515780 524675 520848 500746
9156 500746 477739 450896 421943 408641 431929 469088 466239 454173 439997 452214 445457 424323
9144 424323 418813 433358 450393 470928 472210 462009 439589 457471 447849 456128 428290 395033
9132 395033 391386 377648 385498 411570 443548 472367 458856 453838 462900 472432 468853 457457 454480
9119 454480 442553 468231 475366 467902 450678 476427 502938 514965 502856 481973 471367 477543
9107 477543 481174 498054 506274 511464 532134 526874 507003 541789 550802 581425 613003 642374 642815
9094 642815 639973 650388 657945 645605 630074 621275 605412 592228 582170 563677 551640 543362
9082 543362 525992 508300 483173 453101 435273 431787 468479 498414 513167 513998 500539 519910
9070E19910R752j2726r718M626L9053K1299J0257o936P546N229L767j4368J6947
9057E94638Q471K7432r427q774K6988N8989N3554L3538K764K485J4173n368P692
9044H07155J3710j9993k0631l1358J5318L296m8383k7592k1124k1250q299m937
9032F35912k0111j3936K6162k7638k7437J2367q791r310P3o757k0654m996n83
9019E34301L3605K0484K1513O219o822M815J1447K5525L1329K174J7955L0134
9007G32679M3926M096P164k233J7299K3437P35j0702j0852J3622J1061P605N101
8994H42938n875j2708k256r083j3128l0735l7192j3936o077l9647k0362k7136
8982F24803l0492k3191k6197l494J415J5713j3283J1383Q092O59N984j2749j1912
$$ plain form
9070 519910 529662 516936 507218 511844 550897 572196 582453 575517 583063 588292 592059 577691 594638
9057 594638 603109 630541 621114 612340 639328 698317 751871 785409 788173 790658 804831 799463 807155
9044 807155 820865 800872 780241 748883 764201 767497 719114 691522 670398 649148 640849 635912
9032 635912 615801 601865 628027 600389 572952 585319 576528 567218 567291 560534 539880 534884 534301
9019 534301 567906 588390 609903 616122 609300 614115 625562 651087 682416 684590 702545 732679
9007 732679 776605 780701 787865 785632 802931 826368 827103 816401 805549 819171 830232 837837 842938
8994 842938 837063 824355 822099 813016 799888 769153 731961 718025 711948 672301 651939 624803
8982 624803 594311 571120 544923 541429 542844 558557 545274 556657 564749 565408 571392 558643 546731
8969E46731o945j8785m910k823J893k0637j4434o561K1049L4951K3673Q387K7992
8956E89581K7803J3599O457k114j2296l8966J5771J7277J7377j2677R90l426O006
8943F25382j601l1437j1292r38m9390k6182j7792l0268k3398l5990l7003n787
8931C54304O053j0145L2392j8149j8813J378r131j4311J146R012n787j3868O687
8918C20768J3441k1253k4958J5315L5060J263j7353m901k383K313r462P072L0390
8905C45312N715J2487j7966K685J2092j7126m4350Q819m4237k9123q913K221J1455
8892B39071J115J2507K7132R228l984Q922j1603l5096k2338Q114L0084K1577J2085
8879B96814K5464j3726k7405j0992J0347K1258J5840J2699k6737l7997J1848J2588
$$ plain form
8969 546731 539786 521001 516091 513268 515161 494524 480090 473529 494578 529529 553202 561589 589581
8956 589581 617384 630983 637440 635326 623030 584064 599835 617112 634489 621812 622802 619376 625382
8943 625382 623781 592344 581052 580114 530724 504542 486750 456482 433084 397094 360091 354304
8931 354304 360357 350212 382604 364455 345642 347020 337889 323578 324724 333736 327949 314081 320768
8918 320768 334209 312956 287998 303313 338373 339636 322283 317382 314999 317312 307850 314922 345312
8905 345312 351027 363514 345548 348233 360325 343199 298849 307668 263431 234308 225395 227616 239071
8892 239071 240186 252693 279825 289053 285069 293991 282388 247292 224954 233068 263152 284729 296814
8879 296814 322278 308552 281147 270155 280502 301760 317600 330299 303562 265565 277413 290001
8867B90001M75O789L0280L1739M4570P2997J03596J00513M4644k673j2528j0102
8855G00301p288k7329o3198o3031m1821m8953m9818l4407j6023j4482m1837m1646
8843B50468N58L1365k1638j4944O902j3687J6967j1580J8754K1462R628n442j3658
8830B75155P592L903j1678Q829q491j5627k3657Q440K6947J3226m205J877j1871
8817B70440k2334m883L2586k1303m2725k0993P777J1032p764K1001J5886k6646
8805B12074K5886k215l533m161K779k4261j1603k1227J5095K7132l918n428K9429
8792B36049K128k9694l494K315L7714N947J0986j9502m4702j0904K4282J211L5052
8779B47388K3740m0217P499j1K5708J9117k4117k5101R147k0466k0227J1208R861
$$ plain form
8867 290001 290476 297265 327545 359284 403854 476851 580447 680960 725604 722931 710403 700301
8855 700301 693013 665684 602486 539455 497634 448681 398863 364456 348433 333951 292114 250468
8843 250468 251026 282391 260753 245809 252711 239024 255991 244411 263165 284627 294255 288813 275155
8830 275155 282747 286650 274972 283801 275310 259683 236026 244466 271413 284639 280434 282311 270440
8817 270440 248106 243223 275809 254506 211781 190788 198565 209597 201833 222834 238720 212074
8805 212074 237960 235745 232212 228051 230830 206569 194966 173739 188834 215966 212048 206620 236049
8792 236049 238177 208483 204989 207304 245018 250965 261951 242449 197747 186843 211125 212336 247388
8779 247388 271128 230911 238410 238399 264107 283224 259107 234006 243153 222687 202460 213668 223529
8766B23529j4192j4283k523l776j6744L622p982K47k2613j4777K6646K8249M465
8753A89868P275J3152P461r509j9687J1761K8647M84K874O863K3643l4693k5L1304
8739B59418J1319q840M127J890l2656q034J0803k5319J9904L5124Q586j7797k5592
8726B32933j3157k7182Q210L4523o048l5336j0453L4892J9258j0355m427L561
8714B26419n552L933m754j7307J5202J2143r434J8499k563p405k0961M038K4849
8701B37107O386M60J2156j7159J4227J5629J6414J7175J369K2149j689k1301l1543
8688B71380q233j3762k0367k2898N253J6715O342J1071J034j0922m939l2212J8834
8675B17296J1946q597j0813K2871J2425J473J5060l169M379P963k0606r470j1687
$$ plain form
8766 223529 209337 195054 192531 188755 172011 175633 167651 167898 145285 130508 157154 185403 189868
8753 189868 197143 210295 217756 208247 188560 200321 228968 229452 232326 239189 262832 228139 228114 259418
8739 259418 270737 261897 266024 267914 235258 227224 238027 212708 232612 267736 276322 258525 232933
8726 232933 219776 192594 200804 235327 229279 193943 183490 218382 237640 227285 222858 226419
8714 226419 220867 224800 220046 202739 217941 230084 220650 239149 236586 229181 208220 212258 237107
8701 237107 243493 243953 256109 238950 253177 268806 285220 302395 303764 325913 324224 302923 271380
8688 271380 263147 249385 229018 206120 211373 228088 234430 245501 246535 235613 230674 198462 217296
8675 217296 229242 220645 209832 232703 245128 246601 261661 258492 262871 270834 250228 240758 229071
8662B29071j2163J4183n886q791j1404j5090j0222q371N752J3729K1640J820j0616
8649B03652r373L391J4170n427J2916J0824M849j1531J2178M92J9932K0129j2400
8636B63802K5857J8336p140P286P862J4860j3443k0712j9650j3091l8859q115
8624B16993J7663k4715j7403J0237K8167K9156Q892l164q185j1365j2743o829
8612B26704P49j4978k9637J1974M7840J4297N354l7136j0610J2285K2693L983
8600B53518K032r873l2350m427K1621K8287L3463K6597j5584k9567l093J1866
8588B82490K6404L3177j6295l3902q428P574L3274K4641l719J4656m691n939R909
8575C59151K200r1k7612l3921kP019p419j4466k2649O276l9778j1159K8503o099
$$ plain form
8662 229071 216908 231091 225205 216414 205010 189920 179698 171327 177079 190808 212448 214268 203652
8649 203652 194279 197670 211840 206413 219329 230153 235002 223471 235649 236141 256073 276202 263802
8636 263802 289659 307995 300855 308141 316003 330863 317420 296708 277058 263967 225108 216993
8624 216993 234656 209941 192538 202775 230942 260098 268990 265826 257641 246276 233533 226704
8612 226704 227453 212475 182838 194812 242652 256949 262303 225167 214557 226842 249535 253518
8600 253518 255550 245677 213327 208900 230521 258808 292271 318868 303284 273717 270624 282490
8588 282490 308894 342071 325776 291874 283446 291020 324294 348935 345216 359872 355181 349242 359151
8575 359151 361351 361260 333648 299727 299725 306744 299325 284859 262210 268486 228708 217549 246052 239953
8561B39953k0663j9184K537K9533K339j6427K3102k4828j9657o340M132l931j0134
8548A80432J0980M3110K1432j0913p061j820j5808k63r865k101J8373P644j0697
8535B23443j5076j7322j0080l669o092L1709J4839J538R343k8696k0086j1181
8523A68670j156N217O632j8873P242L207J7877R026j07k7204R856j2648k2009
8510A45730j701k4952K171K7370K2063N085J9162j6344l3462r955J4543K5342
8498A75052J6382k4307n1457j607L408j0384O974m693j5618J4489K2574j3429
8486A17384r599J8266J2271J9181O020k7943o473k1725j8169m44R312j072J0823
8473A07832j8076r237J5426j2797K0748K0310j0546j3026p66l947k3659j8325
$$ plain form
8561 239953 219290 200106 202643 232176 234515 218088 241190 216362 196705 190365 194497 190566 180432
8548 180432 191412 234522 255954 245041 237980 236160 220352 220089 210224 208123 226496 234140 223443
8535 223443 208367 191045 180965 177296 171204 202913 217752 219290 228633 199937 179851 168670
8523 168670 167514 172731 179363 160490 167732 170939 188816 197842 197735 170531 180387 167739 145730
8510 145730 144029 119077 121248 148618 170681 175766 194928 178584 145122 135167 149710 175052
8498 175052 191434 167127 115670 114063 117471 107087 114061 109368 93750 108239 130813 117384
8486 117384 107785 126051 138322 157503 163523 135580 129107 107382 89213 88769 98081 97009 107832
8473 107832 89756 80519 95945 83148 103896 124206 113660 100634 99868 95921 72262 53937
8461E3937k97n838P384J6423K0780L6562L334J1497j020j3499k7267m4659l1245
8448B6092K0491L0278j0964k9166j2313K0931Q624r98M083k2190P165J9451L3845
8435I5329J8198J5086L9181J8505K065K2526r049k7569k5713j7166j76j0765J1877
8422A32329r701m9176j0871L0770P656j355P803O486O769O099q652K6620P564
8409A52341m4009k1856q795O798r558K3167o549l5110m2557M1502M1854Q724j0337
8396I5615r018j1915K7593K0774k905k6591J6651L8078J341r720j3531o804J454
8383A21022J9410N506n598j3253R419k303j8350l3302N192K8120k068k2971M559
8370I5383j0502k3185K509L5662N984o480k7452N619j4907m263j6489j3821K2980
$$ plain form
8461 53937 53640 47802 55186 71609 92389 128951 132285 143782 142762 129263 101996 57337 26092
8448 26092 46583 76861 65897 36731 24418 45349 53973 52975 57058 34868 42033 61484 95329
8435 95329 113527 128613 167794 186299 188364 210890 201841 174272 148559 131393 131217 120452 132329
8422 132329 122628 73452 62581 93351 101007 99652 107455 113941 120710 126809 118157 144777 152341
8409 152341 108332 86476 77681 84479 74921 98088 91539 56429 13872 55374 97228 105952 95615
8396 95615 86597 74682 102275 123049 120144 93553 110204 148282 149623 139903 126372 119568 121022
8383 121022 140432 145938 140340 127087 136506 134203 115853 82551 87743 115863 113795 90824 95383
8370 95383 84881 61696 64205 99867 105851 99371 71919 77538 62631 58368 41879 28058 51038
8357E1038J0886j1772o439L3576M3619Q623r959l0426j7836k475k233J0609K5246
8344A02457M922j5347L000P361K178l8153q491J2242O755j2265J260k556J0783
8331G4146J3003K5738q730k1264l623o825l519P181J3323k0164k141J32j3998
8318E3259K4319p129k871J1764K2981J6745j8923j4560m653o564j0951Q277J3251
8305H4945l2901m290n284j2326J8370j319k1539J2323J8651L4555k431j5912k532
8292G0310K9628K8707k0053r546M441j4918m674j9557k2169j6819K2102P925j5553
8279C9824r767l484N401Q507L0141L0773k699j0719k6477j0340Q621M786Q146
8266G2713O270Q117j4738j1795K6029j6322l3507K1538j2150J0689K0963K9248
$$ plain form
8357 51038 61924 50152 43713 77289 120908 129531 119572 89146 71310 68835 66602 77211 102457
8344 102457 107379 92032 95032 102393 104571 66418 57927 70169 76924 64659 65919 63363 74146
8331 74146 87149 112887 104157 82893 79270 72445 68926 76107 89430 69266 67125 67257 53259
8318 53259 77578 70449 67578 79342 102323 119068 100145 85585 80932 74368 63417 71694 84945
8305 84945 52044 47754 42470 30144 48514 47195 25656 37979 56630 91185 88754 72842 70310
8292 70310 99938 128645 108592 99046 103487 88569 83895 64338 42169 25350 47452 55377 39824
8279 39824 30057 26573 31974 40481 70622 101395 98696 87977 61500 51160 59781 64567 72713
8266 72713 78983 87100 72362 60567 86596 70274 36767 58305 46155 56844 77807 107055
8254A07055J1903J797m3921l0424k180k405j0047j587k163O611R440P576n168
8241D6487J4704M717q488L294m603J931l1309J3530K2657N39k6302k8429K3565
8228C2293K2857J4096J3840n72j6740q246l872r957J375m519J4471j6537j1772
8215B6717J3476J3360j0469j1500J3008m42l098K2475n697k7104l3543J8137K9084
8202D4404K2393j4485K416o082l81K3771k713k5305K46L950K9678k0892L760J7545
8188G8305k0784k2688k0224J0350K0359J3972p760k601L2059J7630r256j7819
8176G1543n1045k2807L0133j3733M130J8997J7108R679l067O577q656j4501K642
8163D7000J5718l035l8109k0095n872J112J2533j8170k0895N1018K0714J686j726
$$ plain form
8254 107055 118958 120755 76834 46410 44230 41825 31778 30191 28028 34639 44079 51655 46487
8241 46487 61191 65908 57420 60714 56111 58042 26733 40263 62920 63459 37157 8728 32293
8228 32293 55150 69246 83086 82514 65774 57528 53656 43699 45074 40555 55026 38489 26717
8215 26717 40193 53553 43084 31584 44592 44150 41052 63527 57830 30726 -2817 15320 44404
8202 44404 66797 52312 54728 48646 48265 72036 69323 44018 44264 48214 77892 57000 60760 78305
8188 78305 57521 34833 14609 24959 45318 59290 51530 48929 80988 98618 89362 71543
8176 71543 20498 -2309 27824 14091 18221 37218 54326 64005 60938 67515 58859 44358 47000
8163 47000 62718 59683 21574 1479 -4393 -3281 9252 -8918 -29813 21205 41919 43605 41879
8150D1879n643j2154q418L3618K9786k0292k2145j1176k2472K6428J3892j2922
8138C0381J1089L227j5083j8842k0323P940L1598J1564o935l116J0640J9519n971
8125E5688o626n685q126p618O969j0168j4042J7449p010p115R564J4677J4058
8112E2015J3487J1192N161j2161j7360J857l113J156r484K812J0814J1334N461
8099G3171P123J4885o424j5351q475j110j0550n090p292J2404K3207j7711o74
8086E8113P317k0378j3383K46M967M037N925j0950Q459r819q48k1165K6263J3972
8072E2756P246L4358O993k3594l6253p490j0484N473q893p246J3395J089J1807
8059C9157j907L770K0622L9460J4136k4631n972K8021j8267j9136J3831K7160
$$ plain form
8150 41879 36236 24082 15664 49282 79068 58776 36631 25455 2983 29411 43303 30381
8138 30381 41470 44697 29614 10772 -9551 -1611 29987 41551 34616 31500 42140 61659 55688
8125 55688 49062 43377 35251 27633 34602 24434 10392 27841 20831 13716 23280 37957 52015
8112 52015 65502 76694 81855 69694 52334 54191 51078 52234 42750 45562 56376 67710 73171
8099 73171 80294 95179 88755 73404 64929 63819 53269 48179 40887 53291 76498 58787 58113
8086 58113 65430 45052 31669 31915 36882 40919 46844 35894 44353 34534 33686 12521 38784 52756
8072 52756 60002 94360 101353 77759 41506 34016 23532 29005 20112 12866 26261 27350 39157
8059 39157 37250 41020 61642 101102 115238 90607 84635 112656 94389 75253 89084 116244
8047A16244k3151k1870J6018N871J978o674J0043j8438P784J8904m1517k3508
8035D1684O271j6106j8330Q009Q18m216L4480K3453n968k0795k641j0026p615
8022B9018N4076J5869K6433m3099j4492J2883K770J5448q949l0451j8736K4915
8010F5685N6407R965o102K7558l996k6799r464J835k9402j3971R444P495m566
7997H4089r252R632n338J4071r172k5942j1776J2281K8162L8310p841j4435L981
7984A06770j6940j9722Q034K3304q105K5078J5194p72j9535m5862j7306L6146
7972H6284L3970n987K1767k2905M592k4678l0443L1612J5596j6083J0725l865
7960A00585l8502k5984K3321J9741O420R290J6608M569l4408k7186J1945L847
$$ plain form
8047 116244 93093 71223 87241 93112 95090 88416 98459 80021 87805 106709 65192 41684
8035 41684 47955 31849 13519 21528 22346 18130 52610 76063 70095 49300 46659 36633 29018
8022 29018 83094 98963 125396 82297 67805 80688 83458 98906 89957 59506 40770 65685
8010 65685 122092 132057 125955 153513 149517 122718 113254 115089 85687 71716 81160 88655 84089
7997 84089 74837 84469 79131 93202 84030 58088 46312 58593 86755 125065 117224 102789 106770
7984 106770 89830 70108 78142 101446 93341 118419 133613 132841 113306 67444 50138 86284
7972 86284 120254 114267 136034 113129 117721 93043 62600 94212 109808 93725 104450 100585
7960 100585 62083 36099 59420 79161 85581 94871 111479 116048 81640 54454 66399 70246
7948G0246j3831R114R064P210N321R402K477j9594p367Q605O59j5822J0860K2638
7934I8982N921l0830j2040M397J829n056K0645J5978q700k9977k0022o54k084
7921C8389r856j818M648K4449M6161K1735l1896m5833j6075M22j680P956Q543
7908D5145m581j4114K3496J4018j7426P260L3392L0497r479l4562k6298O508K4141
7895G7997J1587j6727m1800j1647p38j2215L079P948M119Q602j3553N513l708
7882A8457R681J240j641j1090j930L2732l3689m340J7519L2869j8577N358j0816
7869C5773k4149k919Q27M615j9799J1651J6414l0647k768R296L80J0364L804K3594
7855C6436J7320J7517k145k8897j4839k6630k4502J5304J4639Q590n799L3538
$$ plain form
7948 70246 56415 65529 74593 81803 87124 96526 99003 79409 72042 80647 81306 65484 76344 98982
7934 98982 104903 74073 62033 66430 68259 63203 83848 99826 91126 61149 41127 40473 38389
7921 38389 28533 26715 31363 55812 101973 123708 91812 45979 29904 30326 28646 36602 45145
7908 45145 40564 26450 49946 63964 46538 53798 87190 117687 108208 73646 47348 53856 77997
7895 77997 89584 72857 31057 19410 18672 6457 9536 17484 21603 30205 16652 22165 18457
7882 18457 28138 29378 27737 16647 14717 47449 13760 9420 26939 59808 41231 46589 35773
7869 35773 11624 8705 9532 14147 -5652 5999 22413 -8234 -11002 -1706 -1326 9038 12842 36436
7855 36436 53756 71273 69128 40231 25392 -1238 -25740 -10436 4203 12793 6994 40532
7843D0532P602k521J0109Q226k5027o675m7605j4615L5975L1782p504P642J9147
7830E7068l2839k0165j0330Q529K245N172P248O865J3603j7314j2975j3212j8572
7817b4677Q674J5340L550N21L012J3541r962o340p643Q946k5298J0790J7787L532
7803A1773M532J193j9055l1160K988K290P140l5588M973J7762P095N391L3528
7790A2862K9231L821k6327j8534K3120L7j0069J1465K6551r802k8212N778j8162
7777A759j4991l420N0605j829n658l07j9290j2957p644k078L3931J4803q015P6
7763B4985o613M135M411j3310j0717J2133J8946j095N532j3037k3161M223j0476
7750d044k4445o845J3062K0467K3078m317K466K6135K0249J3994j4363k0427l655
$$ plain form
7843 40532 48134 45613 55722 63948 38921 32246 -15359 -29974 6001 37783 30279 37921 57068
7830 57068 24229 4064 -6266 2263 4508 9680 16928 23793 37396 20082 7107 -6105 -24677
7817 -24677 -16003 -663 2887 3408 6420 19961 9999 3659 -3984 4962 -20336 -9546 8241 11773
7803 11773 16305 17498 -1557 -32717 -29729 -27439 -20299 -55887 -50914 -33152 -26057 -20666 12862
7790 12862 42093 45914 19587 1053 24173 24210 14141 25606 52157 42355 14143 19921 1759
7777 1759 -13232 -16652 33953 32124 26466 26159 6869 -6088 -13732 -15810 18121 32924 24909 24985
7763 24985 18372 22507 26918 13608 2891 15024 33970 32875 38407 25370 2209 6432 -4044
7750 -4044 -28489 -35334 -22272 -1805 21273 16956 19422 45557 65806 79800 65437 45010 41355
7737D1355j4717k0826j8353j6153J8382K3485p588p12r039k80p190P392j2987
7724a7231r271J6392j214o734r670K6172M5749k5614m3311k3991J1289L9345O008
7711G919k9147j3976J8331K9833N89Q525O274j7003j8450J5025o835o293k3463
7698b8671m189Q597J4878Q682P811k5141n357K7067m907l0245o954J089J4238
7685b3102M163J4621o221K0509O086N168q236l6814J1689K5891O830k2447J7537
7672A5674J0386j5043m728j57l0086k6929K1722J2284J718j5819j8574j7407p133
7659g4092J8399L0732K3232p848l048j7157K0901M405K6020L2915j1630l7657
7647E172m9348O594m035J7676J465Q487l257K2561K65j8981j868J4324K5967m0107
$$ plain form
7737 41355 26638 5812 -12541 -28694 -10312 13173 5585 4873 -4166 -4446 -11636 -4244 -17231
7724 -17231 -26502 -10110 -11324 -18058 -27728 -1556 44193 18579 -24732 -48723 -37434 1911 7919
7711 7919 -21228 -35204 -16873 12960 13549 22074 28348 11345 -7105 7920 1085 -5208 -28671
7698 -28671 -32860 -24263 -9385 -703 7108 -18033 -23390 3677 -1230 -31475 -38429 -37340 -23102
7685 -23102 -18939 -4318 -10539 9970 16056 21224 12988 -23826 -12137 13754 20584 -1863 15674
7672 15674 26060 11017 6289 6132 -23954 -50883 -29161 -16877 -15159 -30978 -49552 -66959 -74092
7659 -74092 -55693 -24961 -1729 -9577 -12625 -29782 -8881 -4476 21544 54459 42829 5172
7647 5172 -44176 -37582 -41617 -23941 -22476 -13989 -17246 5315 5580 -13401 -15269 -945 25022 -15085
7633a5085l7642l457K3488K4258n878l2749o263J9051K6891o020l852P940j0621
7620a9939j2974J9451l038Q099K429K0379Q579L889J764N158j0516k8806l1699
7607c7224r775J1470K0624k572J5298j3090k3230j6172j1236J0869K2128L779
7595b9131j0986J9771j5663r86J2517K43J7913k417N717o34k5502j0865J9187
7582b0836J9676q676j5374J7070M3157J7012k1209k3376j2142k4076p737P708
7570b8803j1701R674L0042j3191k5523J0587Q6M417O674p982j9013N381l110l0703
7556g3165Q507M2866K6777q229l686K7618n431l3251j5175J4888K829j9606p205
7543d2263L4421P588m3135J6786J8190J4910k7560N764K824p663k603j5484J6377
$$ plain form
7633 -15085 -52727 -56184 -32696 -8438 -14316 -47065 -53328 -34277 -7386 -13406 -17258 -9318 -19939
7620 -19939 -32913 -13462 -16500 -8401 -5972 14407 22986 26875 28639 33797 23281 -5525 -37224
7607 -37224 -46999 -35529 -14905 -17477 -2179 -15269 -38499 -54671 -65907 -55038 -32910 -29131
7595 -29131 -40117 -20346 -36009 -36995 -24478 -24235 -6322 -8739 -3022 -3656 -29158 -40023 -20836
7582 -20836 -1160 -9836 -25210 -8140 35017 52029 30820 7444 -4698 -28774 -36511 -28803
7570 -28803 -40504 -30830 -788 -13979 -39502 -28915 -28829 -24412 -17738 -25720 -44733 -39352 -42462 -73165
7556 -73165 -64658 -21792 4985 -3244 -6930 20688 15257 -17994 -33169 -18281 -15452 -35058 -42263
7543 -42263 -7842 -254 -43389 -26603 -8413 6497 -21063 -15299 -12475 -20138 -22741 -38225 -21848
7530b1848L8599K1128o9015n556K4866k092P131J2643j6361k8929J9056J7223
7518c155J2617L943Q047j6291j531P99j3437O281K4077L393l4331Q562K513n32
7504I55k1879n371J0678K6088j7680j4262L4346J7476j2776n867j3132l400K3036
7491A8212J0315k8529j2161J3611p071j6587P688K8915j5138l4560N803Q295J2771
7478h436K2441M034L605n612k4528k619j159l0203n46J6159J6244O084m419j2660
7464b1615K321r466P323Q051q774K35K1820p371M1206m847n4319j4942K8603k153
7450a3928j8502J3767K1914j2676O084k704J3871K9323K5418j8889l1884j2196
7438d02j1183J1030J7555O314k3648j2797j6987J9171M666m358L733O216J081
$$ plain form
7530 -21848 16751 37879 -31136 -36692 -11826 -13918 -6787 5856 -10505 -39434 -20378 -3155
7518 -3155 9462 13405 21452 5161 3630 4429 -9008 -2727 21350 24743 -9588 -1026 1487 955
7504 955 -20924 -26295 -15617 10471 -7209 -21471 12875 30351 17575 11708 -1424 -4824 18212
7491 18212 28527 -2 -12163 1448 -5623 -22210 -14522 14393 -745 -35305 -29502 -21207 -8436
7478 -8436 14005 18039 21644 16032 -8496 -11115 -12274 -42477 -43023 -26864 -10620 -4536 -8955 -21615
7464 -21615 -19294 -28760 -21437 -13386 -22160 -21925 -105 -7476 33730 28883 -25436 -40378 -11775 -13928
7450 -13928 -32430 -18663 3251 -9425 -3341 -6045 7826 37149 62567 43678 11794 -402
7438 -402 -11585 -555 17000 23314 -334 -13131 -30118 -10947 -6281 -10639 -6906 -690 391
7425C91j3952j4973O929J7835l599j0989J1710M847m865j1126m5166K2830J5707
7412b4421n187L4430L044j6694q721k233r591n204j7178P994p770L4962J6136
7399d33O047q41l2487J880k927k2550q897K3653L6263R344Q526k1161k8872j6852
7385d9307J9541K6570K3654K0295j1691m000L53l669m181R515q714k3213M35j3403
7371a7815r328L005L1937J3654R194j8508k4002O388j5128J0073L8447p239k3083
7358b405l1766M187K57j1898J8066j908L668j6422o662L8435R455p210k2639j7987
7344d4829J8126K0265o752n531k4059J0513K5384J1251j487J6629L105k7436K538
7331b283n1520o501J9837J0960k519K3930K3330J22j5010k1311Q724q06L830j4836
$$ plain form
7425 391 -13561 -28534 -21605 -3770 -7369 -18358 -6648 -1801 -6666 -17792 -62958 -40128 -24421
7412 -24421 -29608 4822 7866 -8828 -17549 -19782 -29373 -34577 -51755 -43761 -51531 -16569 -433
7399 -433 5614 4773 -27714 -25834 -28761 -51311 -60208 -36555 -292 9052 17578 -3583 -32455 -49307
7385 -49307 -29766 -3196 20458 40753 29062 25062 25415 21746 17565 27080 18366 -4847 -4412 -17815
7371 -17815 -27143 -24138 7799 21453 30647 12139 -11863 -5475 -20603 -10530 27917 20678 -2405
7358 -2405 -34171 -29984 -29727 -41625 -23559 -25467 -21799 -38221 -44883 -6448 3007 -4203 -26842 -44829
7344 -44829 -26703 -6438 -13190 -18721 -42780 -32267 -6883 4368 2881 19510 22615 -4821 -2283
7331 -2283 -53803 -60304 -40467 -29507 -32026 -8096 15234 15356 346 -20965 -12241 -13047 -9217 -24053
7317b4053m644J5309R690l777j7742l9282N936K0034M528r551l377L9181K4977
7304A7229J338k2868k6421k8163k5946K2495M9184L6473K4671J3550m688k5740
7292C1114k5719q348P517r490Q117L810J2284m408K263L947j356l26k5172j7598
7278b3365J806L850J2094P840N341O813l3796l2447R644K004K6958P675j4880
7265b0463j3550l49l854r824R251J6401Q818k953K9920m057k0080k2278l566J9936
7251a6648O702J3012l642j711j0830k2192j8197K1378j4732M486l760J4125j3673
7238d5682j696J142K8330J9138j0844M679L549j2144j251L1157J0280q652j2853
7225E153k389l2773M832l6046j6981k0194k381J1444J7381J0942J2626M732L1377
$$ plain form
7317 -24053 -28697 -13388 -3698 -7475 -25217 -64499 -58563 -38529 -34001 -43552 -46929 -7748 17229
7304 17229 18567 -4301 -30722 -58885 -84831 -62336 -13152 23321 47992 61542 56854 31114
7292 31114 5395 -2953 4564 -4926 3191 7001 19285 14877 17140 21087 19731 19405 -5767 -23365
7278 -23365 -21559 -17709 -5615 2225 7566 14379 -19417 -51864 -42220 -40216 -13258 -5583 -20463
7265 -20463 -34013 -34362 -38216 -48040 -38789 -22388 -13570 -16523 13397 9340 -10740 -33018 -36584 -16648
7251 -16648 -9946 3066 -576 -2287 -13117 -35309 -53506 -32128 -46860 -42374 -46134 -32009 -45682
7238 -45682 -47378 -46236 -17906 1232 -9612 -4933 -1384 -13528 -14779 16378 26658 18006 5153
7225 5153 2764 -30009 -25177 -61223 -78204 -98398 -100779 -89335 -71954 -61012 -48386 -43654 -12277
7212a2277J1279P345o974m6156L347M0691J4310j4454O148j5124k629j8506N276
7199b7724O868O037j39k3365k8134K914K2438K5457K9585J8914J0991k7537j2279
7186D026k948Q41K4186N024l2639j6474j8927k1694j2828o587J9553K9030R261
7173b0176J737k5992k1897K56j4172L2545O578j5025o170J3987N313J0480j0686
7160d3222l4280m641L9550K3040J8058P700l7440L058J461j6589l628j239J0303
7147c7869M228J4129J0206J0875j8034j8296J360k208l501K2213M350j2274L243
7134b1578P016k9490J7031J6412J4399q688k5220K8299l579l0292K1089P154k6539
7121c3986j0080J3550O159m426J6192K3142J6907j2640M871J0825L053k8642j4157
$$ plain form
7212 -12277 -998 6347 -627 -46783 -43436 -2745 11565 -2889 3259 -11865 -14494 -33000 -27724
7199 -27724 -20856 -14819 -14958 -38323 -66457 -63543 -41105 -15648 13937 32851 43842 16305 4026
7186 4026 1078 1919 26105 31129 -1510 -17984 -36911 -58605 -71433 -78020 -58467 -29437 -20176
7173 -20176 -18439 -44431 -66328 -66072 -80244 -47699 -41121 -56146 -62316 -48329 -43016 -32536 -43222
7160 -43222 -77502 -82143 -42593 -19553 -1495 6205 -31235 -28177 -26716 -43305 -46933 -48172 -37869
7147 -37869 -33641 -19512 -9306 1569 -16465 -34761 -33401 -35609 -39110 -16897 -12547 -24821 -21578
7134 -21578 -14562 -44052 -27021 -10609 3790 -4898 -30118 -1819 -5398 -35690 -14601 -7447 -33986
7121 -33986 -44066 -30516 -24357 -28783 -12591 10551 27458 14818 19689 30514 33567 4925 -9232
7108i232N02k685q75J952J7206l833j8077k2677j399P211K1765K3598P820k1848
7094e72K75n436k0506r333M225J9318q096k4618k1103M504K2099L3471q011K0154
7080F371L064K417J9330k72m2941j8905J620J4927K9825p324m0103M39K1759p913
7066a7706l157J6798l280j2970j1791l6304J7720L6571J3057J0217o50k7055j8642
7053c7192P109L9905M8147L779j8503k8025j7892J933K1047k2133r805J0466j5892
7040a7056j9433j022K7989k292J1923K807k1384k8325q897K8357K5874Q277j4613
7027g795p007o516k02k5791o336P815J9614L3120j8852J4015J9511j3638k1992
7014a4054j8754P62K3875j5475l5520L917L373m449J0397L2934L3145j2261l900
$$ plain form
7108 -9232 -8730 -11415 -12290 -10338 6868 3035 -15042 -37719 -39118 -31907 -10142 13456 21276 -572
7094 -572 -297 -5733 -26239 -35572 -31347 -12029 -20125 -44743 -65846 -61342 -39243 -5772 -13783 6371
7080 6371 9435 11852 31182 30910 -12031 -30936 -29316 -14389 15436 8112 -31991 -31552 -9793 -17706
7066 -17706 -20863 -4065 -7345 -20315 -32106 -68410 -50690 -14119 -1062 9155 8505 -18550 -37192
7053 -37192 -30083 9822 57969 61748 43245 15220 -2672 -739 20308 -1825 -11630 -1164 -17056
7040 -17056 -36489 -37511 -9522 -11814 109 2916 -18468 -46793 -55690 -27333 -1459 6818 -7795
7027 -7795 -14802 -21318 -21520 -47311 -53647 -45832 -26218 6902 -11950 2065 21576 7938 -14054
7014 -14054 -32808 -32046 -8171 -23646 -59166 -55249 -51876 -56325 -45928 -12994 20151 7890 3990
7001C990l203J3907k3444r404K6110K2306Q898J282N971N1057j4392j3458o504
6988F3116k7068l3562j3536l8856j6047J8149M2244k366o592J6477j1684l2944
6976d2669J6913L514J322p613n352P29J3726j3616L3917P254l25l703J7201j0328
6962A0970q815J779j2138l0326l003K2909K3233J8775k281l062j5548N227l030
6949D690J0548j1088k177j2274O289J1473j4474j9115J489J9046O04P951J4316
6936A7278J2508Q939m476j0997l461k9390k3214j1467L1904N225j8410J5002K4584
6923A4025k2940l2192J3092K7161K098j080M809L0088n528R003J0347l6969j918
6910I996N205J1840k472l6109R86j5280k3067L860K0577p027J6107K2695p649
$$ plain form
7001 3990 787 14694 -8750 -18154 7956 30262 39160 40442 46413 97470 83078 69620 63116
6988 63116 36048 2486 -11050 -49906 -65953 -47804 -5560 -7926 -14518 1959 -9725 -42669
6976 -42669 -25756 -22242 -20920 -28533 -33885 -33156 -19430 -33046 871 8125 7800 4097 21298 10970
6962 10970 2155 3934 -8204 -38530 -41533 -18624 4609 23384 21103 18041 2493 7720 4690
6949 4690 15238 4150 1973 -10301 -4012 7461 -7013 -26128 -24639 -5593 -4989 2962 17278
6936 17278 29786 38725 34249 23252 19791 -9599 -32813 -44280 -12376 -7151 -25561 -10559 14025
6923 14025 -8915 -41107 -28015 -854 1244 164 4973 35061 29533 38536 48883 11914 9996
6910 9996 15201 27041 24569 -11540 -10554 -25834 -48901 -45041 -24464 -31491 -15384 7311 -338
6897c38l081k3989L823K9650K6340j0741l7208k3016K3645L8726j4594m1417O035
6884b6165m314k1566L0434j561R66p669n527O816L9883l245O050L2658q468k7091
6870A1201j8425J7110J0904p375j9148j420O289N229k0735k2340M876K3055K2233
6857A1454K5263k2094j0089K0981m5441k5300J4383Q246k860L7358L22l2545l46
6844b0668n989q226L1757J3731j7915k0574J5592L2639J1314P841l2290o936m125
6831c849k0498l054p014j199O815k8168k0912J9617K9248n482J7427M0345j2547
6818A0729n3278p47j3177J8870K3888o536J4265J3950j2935j0894k1378Q682p618
6805c6179j4829j4359K7872J5905j2453J3353J2432J9659R558n593j971k9850
$$ plain form
6897 -338 -3419 -27408 -23585 6065 32405 21664 -15544 -38560 -14915 23811 9217 -32200 -26165
6884 -26165 -30479 -52045 -21611 -23172 -22206 -29875 -35402 -28586 11297 8052 14102 46760 38292 11201
6870 11201 -7224 9886 20790 13415 -5733 -7153 -864 4365 -16370 -38710 -33834 -10779 11454
6857 11454 36717 14623 4534 25515 -19926 -45226 -30843 -22597 -25457 11901 12223 -20322 -20668
6844 -20668 -26657 -34883 -3126 10605 -7310 -27884 -12292 20347 31661 39502 7212 276 -3849
6831 -3849 -24347 -27401 -34415 -35614 -28799 -56967 -77879 -58262 -29014 -34496 -17069 23276 10729
6818 10729 -42549 -43296 -56473 -37603 -13715 -20251 -5986 7964 -4971 -15865 -37243 -28561 -36179
6805 -36179 -51008 -65367 -37495 -21590 -34043 -20690 -8258 11401 20959 15366 13395 -16455
6793a6455k2729r919p809J5961J1751L3753J7124L313L14j6455k201J0341K604
6780A9593j5849J2761N82L972N61P554n341l5462j6931R655N036r311N125K8929
6766A0874L300o968l478M58j1188k440l691m399j1599O11R778N871N850p720J770
6751a2971P105J7175K0466j8704j7994K1819l3348j8124J0777L1986J6676m354
6739B0509l562l5788r226M704o235r63J4279K4567p235j3113J6411J821j1774
6726e605P234J9108K1966j1474j2689p106R998j7423Q295K948N37K3784K0561
6713F0134m733l3314j5615K0458K1728J8431M963L2214p039l8102j5115k5455
6701A8555j1697J3708o771k7176o917K2492j6379k5674q627K6765J5274j952o215
$$ plain form
6793 -16455 -39184 -49103 -56912 -40951 -29200 4553 21677 24990 25304 8849 6648 16989 19593
6780 19593 3744 16505 17087 21059 21620 29174 23833 -11629 -28560 -18905 -13869 -23180 -18055 10874
6766 10874 14174 7206 3728 4186 -7002 -9442 -13133 -17532 -29131 -28520 -18742 -12871 -7021 -14741 -12971
6751 -12971 -5866 11309 31775 13071 -4923 16896 -16452 -34576 -23799 8187 24863 20509
6739 20509 16947 -18841 -28067 -23363 -29598 -30561 -16282 8285 1050 -12063 4348 6169 -5605
6726 -5605 1629 20737 42703 31229 18540 11434 21432 4009 12304 15252 15789 39573 60134
6713 60134 55401 22087 6472 26930 48658 67089 72052 104266 97227 59125 44010 18555
6701 18555 6858 20566 13795 -13381 -20298 2194 -14185 -39859 -48486 -21721 -6447 -8399 -14614
6688a4614m873K2383m73j439j88p142Q916K155J876L959P174R861j0744j2966
6674C885K980j1068J6403O115q470J5818r423j0558j9634J1516m135j5121k1492
6661d3184j7617N646Q557k0269P203m280J1847K3063Q183j5244R076J5578N264
6648f177r594J125Q875J4829k6908q797K2206J8272m828j4024l795M015n711n302
6634a5814M808L7119k6731k2677J372p743N634M737L868k7662j1673J0516q452
6621e2698J555j6484J0726J0767O801M4174K0574l043k2607o432K4550k0088k2794
6608b4999K693J8163P574q009Q648n387J4902j0706l1468n261K4525J3068j729
6595B014n035j2688Q919J9416o228j52n610m0568k0607r708J2527Q447M408K553
$$ plain form
6688 -14614 -19487 2896 2423 984 796 -6346 2570 4725 6601 10560 17734 27595 16851 3885
6674 3885 6865 -4203 12200 18315 9845 25663 16240 5682 -13952 -2436 -6571 -21692 -43184
6661 -43184 -60801 -55155 -46598 -66867 -59664 -63944 -52097 -29034 -20851 -36095 -27019 -11441 -6177
6648 -6177 -15771 -14646 -5771 9058 -17850 -26647 -4441 13831 9003 -5021 -8816 -4801 -10512 -15814
6634 -15814 -11006 26113 -618 -23295 -21923 -29666 -24032 -19295 -15427 -43089 -54762 -44246 -52698
6621 -52698 -51143 -67627 -56901 -46134 -39333 4841 25415 22372 -235 -6667 17883 -2205 -24999
6608 -24999 -22306 -4143 3431 -4578 4070 -1317 13585 2879 -28589 -33850 -9325 3743 2014
6595 2014 -3021 -15709 -6790 12626 6398 6246 636 -39932 -60539 -70247 -57720 -49273 -44865 -42312
6581d2312M231O008J9778r850K9349j3301J207J1171j353J5337M1662O950m814
6568F4063k6141r514m965j9807r51K1631K6237K583l7140l0271r72j5754j2038
6555d3039K0179K7803N290m927r341R063r564l8737k6609K9014q795j3752j0666
6542g4081K5608J3551n436M4430J7379o836l3730j7796K5676k8805j6870M648
6530e2262L155J2870k134J3772j1624J9542K9316r594k3482K8347J2553q920j0708
6517H31k9120J0723L623q76p78m707J2311j3737J8644k6978k4839Q095m908J2722
6503c8994M10Q99J4467J4893J1543j8088P294P510Q014j5184j9697N358m565P323
6489a8817j9753n374M1066J1292M20P12k3483j4311K9027K3442J5679k6333k8181
$$ plain form
6581 -42312 -38081 -32073 -12295 -22145 7204 -6097 -4890 6281 4928 20265 61927 68877 64063
6568 64063 37922 28408 23443 3636 2685 24316 50553 53136 15996 -14275 -15247 -31001 -43039
6555 -43039 -22860 4943 10233 5306 -4035 5028 -4536 -43273 -69882 -40868 -49663 -63415 -74081
6542 -74081 -48473 -34922 -40358 4072 21451 14615 -19115 -36911 -11235 -40040 -56910 -52262
6530 -52262 -49107 -36237 -38371 -24599 -36223 -16681 12635 3041 -20441 7906 20459 11539 831
6517 831 -28289 -17566 -13943 -14819 -15597 -20304 -7993 -21730 -3086 -30064 -54903 -46808 -51716 -38994
6503 -38994 -38584 -37685 -23218 -8325 3218 -14870 -7576 -66 7948 -7236 -26933 -21575 -26140 -18817
6489 -18817 -38570 -43944 -2878 8414 8834 9546 -13937 -28248 779 24221 39900 13567 -14614
6476a4614k1000O131P476n023j80n684J9979Q837q672K3172j4292R17K493j9268
6462a9728J2273q303j4106k6475L579J4943J937j5568j5715K1101K7915j4657
6450c2804p105Q841J7481m780J4558K7949m157k3217j5552L601N256l353O790
6437f492m7519m871J4624o123m170J044q477p812l485K158J003M295J5693L040
6423d7092L2038J0362K823o482K3004K2084j1060l6474R511J4548K8276L054m63
6410D4129k0957j3497l198J5388L2902j8294j2308K550k7931l1931p711L704n886
6397d3040L6463J4979j0253j9248n626j4225J7777K2469k252l458j7073J8839
6385d648M749n598P641P608k3175l7056M38k131j895J5956L9078J7678j5138l3067
$$ plain form
6476 -14614 -35614 -29483 -22007 -27030 -27210 -32894 -12915 -4078 -12750 10422 -3870 -2953 -460 -19728
6462 -19728 -7455 -15758 -29864 -56339 -52760 -37817 -35880 -51448 -67163 -46062 -18147 -32804
6450 -32804 -39909 -31068 -13587 -18367 -3809 24140 19983 -3234 -18786 -15185 -9929 -13282 -6492
6437 -6492 -54011 -58882 -44258 -50381 -54551 -53507 -61984 -69796 -73281 -71123 -70120 -65825 -50132 -47092
6423 -47092 -15054 -4692 -1869 -8351 14653 36737 25677 -10797 -1286 13262 41538 44592 44129
6410 44129 23172 9675 6477 21865 54767 36473 24165 26715 -1216 -33147 -40858 -37154 -43040
6397 -43040 -6577 8402 -1851 -21099 -26725 -40950 -23173 -704 -2956 -6414 -23487 -4648
6385 -4648 101 -5497 2144 9752 -13423 -50479 -50041 -52172 -54067 -38111 967 18645 3507 -29560
6371b9560m787K6127J0665o672Q322j7615q270J4272o920l313K831M805Q016k3650
6357b5749j8716J1916j1406N859M2941J1466k3567j1519K1582K4866J617m2159
6345a2869R85l813M1065J6921j6669j2563j9242o419J9299J2226k4051j2681l6693
6332e4504m23J7500J2544J2526J6556J060K856p086J919L023J8906k0577J2216
6319A6516Q026j6317j4676n024R983J9555L0840J4249j3569j7482k1312j9526
6307h737J0444k6386Q110J3721q914J6607O813O928p546L3022M0591k6560l7235
6294B0858k2809N621L0774j809q736n967J437j6767l2374j315K1756n059q105
6281b2495j9543K440K1906O431j6861M227l942J260Q356N473j0551K1077J3852
$$ plain form
6371 -29560 -34347 -8220 2445 -4227 4095 -13520 -21790 -7518 -14438 -17751 -14920 -10115 -2099 -25749
6357 -25749 -44465 -32549 -43955 -38096 4845 16311 -7256 -18775 2807 27673 29290 -12869
6345 -12869 -11884 -15697 25368 42289 25620 13057 -6185 -12604 6695 18921 -5130 -17811 -54504
6332 -54504 -54927 -37427 -24883 -12357 4199 5259 8115 1029 2948 5971 24877 4300 16516
6319 16516 24542 8225 -6451 -11475 -1492 18063 48903 63152 49583 32101 10789 -8737
6307 -8737 1707 -24679 -16569 -2848 -11762 4845 11658 18586 11040 44062 84653 58093 20858
6294 20858 -1951 3670 34444 32635 23899 17932 19369 2602 -29772 -31087 -9331 -14390 -22495
6281 -22495 -42038 -39598 -17692 -11261 -28122 -23895 -27837 -26577 -18221 -12748 -23299 -2222 11630
6268A1630j5131m167J0033o811r695J1886Q845l7658k04m911R38K397J5253Q751
6254h844m800J8841m053J2779K9346Q447k8899k3128j0523M2183K7577k2949k0706
6241A5271l3526Q359j863j6410M93J5752J9464L5527Q969q083j2724k8134k6325
6228b3230j9761K3678Q853J964j5113J1948J6518j0538j009p187k5285J0620L3675
6215E133K6442P64k3543L875l3438P181J1877M078J3207L218j3698p083j7686
6202a9673M404M8480R259j4946Q921K152m8668k7019m449K6485J2287q431j2691
6189b3889j6503J4280j423j681j562j7377J6627J0404M066j0491L789K4420J7244
6176A7904n948k9408J0413j071j0498J0766J610J3985J9058m537j0396k911R680
$$ plain form
6268 11630 -3501 -7668 2365 -4446 -14141 -2255 6590 -31068 -31272 -36183 -35245 -32848 -17595 -8844
6254 -8844 -13644 5197 1144 13923 43269 51716 22817 -311 -10834 31349 58926 35977 15271
6241 15271 -18255 -9896 -11759 -28169 -27676 -11924 7540 43067 52036 43953 31229 3095 -23230
6228 -23230 -42991 -19313 -10460 -8496 -23609 -11661 4857 -5681 -6690 -13877 -39162 -28542 5133
6215 5133 31575 32339 8796 12671 -20767 -13586 -1709 2369 15576 18794 5096 -1987 -19673
6202 -19673 -15269 33211 42470 27524 36445 38597 -10071 -37090 -41539 -15054 -2767 -11198 -23889
6189 -23889 -40392 -26112 -27535 -29216 -30778 -48155 -31528 -21124 -17058 -27549 -23760 660 17904
6176 17904 11956 -17452 -7039 -8110 -18608 -7842 -6232 7753 26811 22274 11878 8967 18647
6163A8647j2529k9350j1737J9755K3327j0832j6541P390j5122J7985K7311m144
6151A4160L529k6076j2607J1956o437j7667l612l0707J6241M1596j8392j0138
6139c8154Q207j0221K1968o900J0104J2853J5835k838J7958P721j9509k1630P645
6126C039L0588j2608k6501k2049O890P081j2021N058K7505j6819j8771J1656J5210
6113a742k4182K835p461L073q464n67J6451K6725j8860q836j0456k3769J1663
6100d3590K4340M1914K1948j4421l1593Q791j0009j6258K7764O566m2115k5937
6088e2600O907J4105K5071Q027n833K4307J7833k0794m592J6090k3553n121J2020
6075A1867j7766M3860J0998k7443k8076K344j0140j4265j1166J2326L61o323K7862
$$ plain form
6163 18647 6118 -23232 -34969 -15214 8113 -2719 -19260 -11870 -26992 -9007 18304 14160
6151 14160 17689 -8387 -20994 -9038 -15475 -33142 -36754 -67461 -51220 -9624 -28016 -38154
6139 -38154 -29947 -40168 -18200 -25100 -14996 -2143 13692 10854 28812 36533 17024 -4606 3039
6126 3039 33627 21019 -5482 -27531 -20641 -13560 -25581 -20523 6982 -9837 -28608 -16952 -1742
6113 -1742 -25924 -23089 -30550 -27477 -35941 -36508 -20057 6668 -12192 -21028 -31484 -55253 -43590
6100 -43590 -19250 22664 44612 30191 -1402 7389 -2620 -18878 8886 15452 -26663 -52600
6088 -52600 -45693 -31588 -6517 1510 -4323 19984 37817 17023 12431 28521 4968 -153 11867
6075 11867 -5899 37961 48959 21516 -6560 -4216 -14356 -28621 -39787 -27461 -27100 -33423 -5561
6062e561J0893J0273J4307M78P62R669J1879l094l8562j1010j6523j2991j4621
6049d4101r733K1151m112O481J2255L3728J4534O894J2273j9444O59k6456m2097
6036c7968m05P308r197J1417J1747n147L015J16J7690L314n662k4910O620K3694
6022A632j1859r910J2130J9250P691o842L567Q907j9690k8501L922k4588k1168
6009f5459l360P788Q860J2580k950j9336J8485J6247K449K2267j0319m972l048
5996b0768K5779j0040N679q554J6816N221L531k1379o839J3427J8658J4736l0499
5983E768q705n775k97j983J543J0569J2785Q557j6143p915Q35n441r002J2176
5969c028o305j3604J516J5042m710l914J0997j1950j0673L2985J6665k1741k743
$$ plain form
6062 -5561 5332 15605 29912 30390 31152 40821 52700 49606 11044 34 -16489 -29480 -44101
6049 -44101 -53834 -32683 -36795 -30314 -18059 15669 30203 37097 49370 29926 30585 4129 -37968
6036 -37968 -38373 -31065 -40262 -28845 -17098 -22245 -19230 -19114 -1424 1890 -3772 -28682 -22062 1632
6022 1632 -10227 -20137 -8007 11243 18934 12092 15659 24566 4876 -23625 -19703 -44291 -65459
6009 -65459 -68819 -61031 -52171 -39591 -42541 -61877 -43392 -27145 -24696 -2429 -12748 -17720 -20768
5996 -20768 5011 -5029 650 -7904 8912 14133 17664 -3715 -10554 2873 21531 36267 5768
5983 5768 -2937 -8712 -9009 -10992 -9449 1120 13905 22462 6319 -1596 -761 -6202 -15204 -3028
5969 -3028 -9333 -22937 -21421 -6379 -11089 -15003 -4006 -15956 -26629 6356 23021 1280 -1463
5956a463J1600J0305N523K1871j1384k3585l3944N150J9299R594j2035N766J0422
5943A7119l7748k7956R225L6003L8209J0384M993j8698k5083l0726q864J3763
5931a9379K0430N805N202j6775l0280P698M019J764K7901j0278q238n564l8298
5918e5993m748M656J6984K3034P572o615l432O996K4685K681k1520k3086J9350
5905i436L485J5300j81J7640k5476k6210j1800J7555Q222K6940p95m327R35l316
5891H536m4381j2293J0863J0306J6998J6334k9801l6511j4962P855K3413K0365
5879b3278K095J7416M434J2872k8541j2491K5477K9823j7636k9204l2441L707
5867d7767K3747N891K2253O061K637j7077M946J330K795N178k8573j4589J0070
$$ plain form
5956 -1463 10137 20442 25965 47836 36452 12867 -21077 -15927 3372 12966 931 6697 17119
5943 17119 -20629 -48585 -39360 -3357 34852 45236 50229 31531 6448 -24278 -33142 -19379
5931 -19379 1051 6856 12058 -4717 -34997 -27299 -23280 -21516 6385 -3893 -12131 -17695 -55993
5918 -55993 -60741 -56085 -39101 -16067 -8495 -15110 -18542 -11546 13139 15820 -5700 -28786 -9436
5905 -9436 -5951 9349 9168 26808 1332 -24878 -36678 -19123 -10901 16039 15244 10917 11852 8536
5891 8536 -35845 -48138 -37275 -26969 -9971 6363 -23438 -59949 -74911 -67056 -43643 -23278
5879 -23278 -21183 -3767 667 13539 -15002 -27493 -2016 27807 10171 -19033 -51474 -47767
5867 -47767 -24020 -18129 4124 10185 12822 -4255 691 2021 4816 9994 -18579 -33168 -23098
5854b3098K4911Q766N167K569j046M86j7964l3231k3608j7921M596j1145J8757
5841f2761J6118r392K0716L9151L886j7300k475j6627O436J5991R940j8838M40
5828a4715l119j2315O610J8873j0675j8847m1575J4579L7709L7343J7716m4604
5816a3020k5454J041L3880K1086L2240J4821K0172k2262k8439k8232j0767Q665
5804C731Q442o8q641j8424R904O752n081k737j6804l0324J1138J821l710O950
5790c7051L4879J3064J17K239L4106k908l4010j7104k2960l192K4715Q151j8155
5777a8109K3694P543q380m3384K267K7315p756Q058K3984J7489q591O52j1137
5764A3645j3086J3409P405o155o472r726R454M4253J42m1679J0300J6711o673
$$ plain form
5854 -23098 1813 10579 15746 18315 17269 17755 -209 -33440 -57048 -74969 -70373 -81518 -62761
5841 -62761 -46643 -56035 -35319 3832 7718 -9582 -12057 -28684 -22248 -6257 3683 -15155 -14715
5828 -14715 -17834 -30149 -23539 -4666 -15341 -34188 -75763 -61184 -23475 13868 31584 -13020
5816 -13020 -38474 -37433 -3553 17533 49773 64594 84766 62504 34065 5833 -4934 3731
5804 3731 12173 12105 3464 -14960 -5056 1696 -3385 -6122 -22926 -53250 -42112 -40291 -44001 -37051
5790 -37051 -2172 10892 11009 13248 47354 44446 10436 -6668 -29628 -32820 -8105 46 -18109
5777 -18109 5585 13128 4748 -38636 -36369 -9054 -16810 -8752 15232 32721 24130 24782 13645
5764 13645 559 13968 21373 15218 8746 -980 8474 52727 52869 11190 21490 38201 31528
5751C1528j1044k2787j1280k7709K1836J2574K5922J3485o961N328k1054J0764
5739B0602Q85R312q34j8155m4794k2202K0123L3111P170J400O610J1061L102k7714
5725c23O164J0673k049j7495l6173j2401j455N265R593J1577P572R577K394L491
5711c590p064j636j1077J3810J6527n907N979p860k5908n070K5862L0692J2000
5698C6758j7224l3098j0582Q758K9681J5282J527J8317K5172r641n593k8557k3553
5685G247j0356j243J2965N801l2013M720p719k4173q047J6977K8081J2446j5445
5672a0759j6201L5605L2749q631l3891K790J510P950n792p899l542J6535q809
5659A615r103N410J4998o074k8473j5422Q065j192J3405K8891q674M959m5600
$$ plain form
5751 31528 20484 -2303 -13583 -41292 -19456 -6882 19040 32525 25564 30892 9838 20602
5739 20602 21487 30799 29965 11810 -32984 -55186 -35063 -1952 5218 6618 13228 24289 27391 -323
5725 -323 5841 16514 14465 -3030 -39203 -51604 -53059 -47794 -38201 -26624 -19052 -9475 -7081 -3590
5711 -3590 -10654 -12290 -23367 -9557 6970 1063 7042 -818 -26726 -31796 -5934 24758 36758
5698 36758 19534 -13564 -24146 -15388 14293 29575 31102 49419 74591 64950 59357 30800 7247
5685 7247 -3109 -4352 8613 14414 -17599 -12879 -20598 -44771 -52818 -35841 -7760 4686 -10759
5672 -10759 -26960 8645 41394 32763 -1128 1662 3172 11122 5330 -2569 -6111 10424 1615
5659 1615 -7488 -2078 12920 6846 -21627 -37049 -28984 -30176 -16771 12120 3446 8405 -37195
5646c7195r791L9248J7860l2144K0455K2242k5081p333j6555J2913K7678k6754
5634a4457j5662J5822J7539Q72P528j2233k9401N522J9036J4749J937P187j5183
5621C256k0071p263O974J284j9400K4306K8938O441q090j8254j1077J5945r487
5608f498J5319L2635l922k3009R029J1404r577j5075k5887m453J2645K8510R361
5595C0482O143j2578j9117K285o842K35j851L774J9083J1645Q138k4771l609J1123
5581B4140l234j9973j6789K1569L462q972K2630L7903K7621k0889j1918k0992
5569C4558p206j4897j1903J2374J1946k7270j7379J3624J4857O200O141Q390J0676
5556D0111k456j9374k9304j7584k4238N768K4912p122q9k169J0487O797K0864
$$ plain form
5646 -37195 -46986 -7738 10122 -22022 -1567 20675 -4406 -11739 -28294 -15381 12297 -14457
5634 -14457 -30119 -14297 3242 4114 11642 -591 -29992 -24470 -5434 9315 11252 18439 3256
5621 3256 -16815 -24078 -17104 -15820 -35220 -10914 18024 24465 16375 -1879 -12956 2989 -6498
5608 -6498 8821 41456 37534 14525 23554 34958 25381 10306 -15581 -20034 -7389 21121 30482
5595 30482 36625 24047 4930 7215 373 608 -1243 2531 21614 33259 41397 16626 13017 24140
5581 24140 20906 933 -15856 5713 9175 203 22833 60736 88357 67468 55550 34558
5569 34558 27352 12455 552 12926 24872 -2398 -19777 -6153 8704 14904 21045 29435 40111
5556 40111 37655 18281 -11023 -28607 -52845 -47077 -22165 -29287 -29376 -31545 -21058 -14261 6603
5543F603M173j1131J1444j2886o638n2j9844k4L4806J0249J0368J3130m776j9749
5529A5673J0673N090K727j5801m3539j8282K2801J3116j3508P133P954K5965J7591
5516C7593l6551k961N993j6851j1322j236J3519L2537J3379n770n098p769J0377
5503B5840J6965q002k0919q386l8916j4166K835K6246n809L614Q734J3435K5081
5490B6552J076l704j8633l0883j4494O23J9250j5739j0685J1296J5267K1701J334
5477B961j0446j1092j9252M200N196k587J2239m033j551J4090O31O918j5183J3788
5463d121K0914l501j0163m086o966N041K2795M45l2390K3536K6837j2860l4629
5450i148m0072J5533K4467K6042M8658q033l5911j448L142r989j0416j1193r807
$$ plain form
5543 6603 10776 -355 11089 -1797 -8435 -8487 -28331 -28355 6451 16700 27068 40198 35422 15673
5529 15673 26346 31436 34163 18362 -25177 -43459 -20658 -7542 -21050 -13917 -5963 20002 37593
5516 37593 1042 -1919 4074 -12777 -24099 -25335 -11816 20721 34100 28330 23232 15463 25840
5503 25840 42805 34803 13884 5498 -33418 -47584 -44749 -18503 -24312 -20698 -11964 1471 26552
5490 26552 27628 23924 5291 -25592 -40086 -39463 -20213 -35952 -46637 -35341 -20074 1627 2961
5477 2961 -7485 -18577 -37829 -33629 -28433 -31020 -18781 -22814 -24365 -10275 -9644 -2726 -17909 -4121
5463 -4121 16793 13292 3129 -957 -7923 -2882 19913 20358 -12032 11504 38341 25481 -9148
5450 -9148 -49220 -33687 -9220 16822 65480 57447 21536 20088 23230 13241 2825 -8368 -18175
5437a8175j0852J0597M3991K4036l1705l2393j7607J0762J3532J2253o557L557
5425A439M127p803J1153p950l1301K467o632J2868K1535K70k8536P305K9570J159
5411I671k1768n400Q631K2729J5963k858P947j1253o588k2841j7460J1796J6944
5398E513Q114J701k0389k4026J9330P482k1639l0207M228K2776Q338r167j683
5385b9629J8471L9397k545j6016j12q840q284K644q58J3521Q218l551J064n12
5371A2968M6l885R054J3809k1195m1426k2770J5885J4745j8438L149J7895j05
5358b0268k3564p698J7627J1238J3986J059q431o794R82Q218J467m2170n684K0906
5344c9126k2281L46N461O165n971J4224Q025N056k649j781K375N039l990j4975
$$ plain form
5437 -18175 -29027 -18430 25561 49597 17892 -14501 -32108 -21346 -7814 4439 -2118 1439
5425 1439 5566 -2237 8916 966 -30335 -27868 -34500 -21632 -97 173 -28363 -21058 8512 9671
5411 9671 -12097 -17497 -8866 13863 29826 26968 34915 23662 17074 -5767 -23227 -11431 5513
5398 5513 13627 15328 -5061 -29087 -9757 -2275 -23914 -54121 -49893 -27117 -18779 -27946 -29629
5385 -29629 -11158 28239 25694 9678 9566 726 -7558 -4914 -5772 7749 15967 12416 13480 12968
5371 12968 13014 9129 18183 31992 10797 -30629 -53399 -37514 -22769 -41207 -38058 -20163 -20268
5358 -20268 -43832 -51530 -33903 -22665 -8679 -7620 -16051 -22845 -21863 -13645 -12178 -54348 -60032 -39126
5344 -39126 -61407 -61061 -55600 -49435 -55406 -41182 -33157 -28101 -30750 -32531 -30156 -25117 -29107 -44082
5330d4082O325j2851j1581j2087J9528J816J4499J5303J0015j1510Q907K0392
5318D674m279K1953J1662j2503n233l483J1674q036o32k6238k2455M636K9592
5305A332q999J753J1269m715j8221j0976k455k715o503K7254k1029J3027o143
5292b7121m2025l990J4104O245K3415K2707J3103j1749j7165O336K2656j5186
5280h670j7060k410R10m212K4681K8053j1697j2823J635l327Q237p942K977p315
5266h963o770k6748j3205J3072P516J3515J4445j4087p536L3549m434O563J3021
5253A9938j1726o378j8340Q69P161j1565p039L49m525J79j0966J6433J2861J7898
5239E149J5894r833o375L944m068o912j7847l9378J152L2169Q151J202l9495j9677
$$ plain form
5330 -44082 -37757 -50608 -62189 -74276 -54748 -52932 -38433 -23130 -13115 -24625 -15718 4674
5318 4674 395 22348 34010 21507 16274 12791 24465 16429 15797 -10441 -32896 -28260 1332
5305 1332 -7667 -5914 5355 640 -17581 -28557 -31012 -33727 -40230 -12976 -34005 -20978 -27121
5292 -27121 -69146 -73136 -59032 -52787 -29372 -6665 6438 -5311 -22476 -16140 6516 -8670
5280 -8670 -25730 -28140 -27230 -31442 -6761 21292 9595 -3228 -1593 -4920 3317 -4625 -1648 -8963
5266 -8963 -15733 -42481 -55686 -42614 -35098 -21583 -7138 -21225 -28761 4788 354 6917 19938
5253 19938 8212 1834 -16506 -15637 -8476 -20041 -27080 -26731 -31256 -31077 -42043 -25610 -12749 5149
5239 5149 21043 11210 4835 8779 4711 -2201 -20048 -59426 -58274 -26105 -17954 -16752 -56247 -75924
5225g5924M026M1938K6485K247L267p799j7194l662O19J9163K4445Q155k4117
5212A649q952P093k559Q362M535j013r64K577j6156j7716j3233k2770L1383J7399
5198a0365J4232K5180l6835R644N627M427J333j0014o601J0043N523J2856q266
5185A6784k2184P95J2351K6056J7216n711j0844l8233j0348K5488p570R34K516
5172G250Q044j4190r367j3682j5265J604j5649L786n821K016L1001P316q727l330
5158b5014j9086o944J5732R695N698L241J2354J2955J2764j1495j2054l8200m2625
5145h2979J8089J2133K4860q260Q238N09P602m2700J0162K4543K7180n211P082
5132A248j6334N310J1428j4580j7020o729k0740o72K2074K8538J4003L1047J3922
$$ plain form
5225 -75924 -71898 -29960 -3475 -1228 2039 -5760 -22954 -26616 -25997 -6834 17611 25766 1649
5212 1649 -7303 -210 -2769 5593 10128 9115 8151 10728 -5428 -23144 -36377 -59147 -27764 -10365
5198 -10365 3867 29047 -7788 1856 7483 11910 13243 3229 -3372 6671 12194 25050 16784
5185 16784 -5400 -4605 7746 33802 51018 45307 34463 -3770 -14118 11370 3800 4734 7250
5172 7250 15294 1104 -8263 -21945 -37210 -35606 -51255 -47469 -53290 -51274 -20273 -12957 -21684 -25014
5158 -25014 -44100 -51044 -35312 -25617 -19919 -16678 -4324 8631 21395 9900 -2154 -40354 -82979
5145 -82979 -64890 -52757 -27897 -36157 -27919 -27410 -19808 -62508 -52346 -27803 -623 -5834 1248
5132 1248 -15086 -9776 1652 -12928 -29948 -36677 -57417 -58089 -36015 -7477 6526 37573 51495
5119E1495k3565k2147R603M093J076J3783J3690j5074l0728k6268k369M5837Q124
5106B7550j5521j2878P410M707J8188l7910j3236O304J1608m1339j6588K9704
5094c2001N5408M665L983M563j4098j7561q589J0345j176k6424J430L5400J9236
5081C5181j4777j1997j8235j1070J588P782K5358k4298l4292j0059K0271Q553
5069b5995P551J720R934o563k5642n02K6668R364j0989M135J0742L687J0137k2797
5055h550k0307J1035m811K3839J4545o13q736K5854N148q778J198r222n4442j5753
5041d9593J5245p098L1415J0887m890m991J0034j0340M538K5154j225J5654j4920
5028A9870k4230l2039J2719L0528J3901j0090K676J436j6791j5726Q84L598j073
$$ plain form
5119 51495 27930 5783 15386 19479 20555 34338 48028 32954 2226 -24042 -26411 19426 27550
5106 27550 12029 -849 6561 11268 29456 -8454 -21690 -15386 -3778 -45117 -61705 -32001
5094 -32001 23407 28072 32055 36618 22520 4959 -3630 6715 5539 -20885 -19455 15945 35181
5081 35181 20404 8407 -9828 -20898 -19310 -11528 13830 -10468 -44760 -54819 -34548 -25995
5069 -25995 -18444 -16724 -6790 -13353 -38995 -39497 -12829 -3465 -14454 -10319 423 4110 14247 -8550
5055 -8550 -28857 -17822 -22633 1206 15751 15138 6402 32256 37404 28626 29824 20602 -33840 -49593
5041 -49593 -34348 -41446 -10031 856 -4034 -9025 1009 -9331 -4793 20361 19136 34790 19870
5028 19870 -4360 -36399 -23680 6848 20749 10659 13335 14771 -2020 -17746 -16862 -13264 -14337
5015a4337r91R622j892Q709m69J2876k5550k3124j6550K0745J4361K4024K635
5002A0059j1358K0177j9901n824j7205k503J6772N423J3751j9124O343J0758l1347
4989b3979j8932j9593j2472K2424P874m115J1088L3014N674j2143L028K4295K544
4976A8707K2043p360j9562k0596j6278q671r340k2066J2527R277j503R792K1674
4963a1356J6590m156L5126J2122k1292l3840l1846M417N828J8892P650m20N125
4950B840k92j5993j7927n470J9591K9535N618L713J1806m4r754N355p527k2486
4936a035K870M197j5436k1119j4490J4488p811J3892K8383k761K32j5342J1551
4923b381J9867j3606j9381j9760J0188m927Q485K0304J0987J9764k0183m12m747
$$ plain form
5015 -14337 -15328 -5706 -7598 1111 642 13518 -12032 -35156 -51706 -30961 -16600 7424 10059
5002 10059 -1299 18878 -1023 -6847 -24052 -26555 -9783 -4360 9391 -9733 -3390 7368 -23979
4989 -23979 -42911 -62504 -74976 -52552 -44678 -48793 -37705 -4691 983 -11160 -8132 16163 18707
4976 18707 40750 33390 13828 -6768 -23046 -31717 -41057 -63123 -50596 -41319 -42822 -33030 -11356
4963 -11356 5234 1078 36204 48326 27034 -6806 -38652 -34235 -28407 -9515 -1865 -2285 2840
4950 2840 2548 -13445 -31372 -36842 -17251 12284 17902 21615 33421 33377 23623 28978 21451 -1035
4936 -1035 1835 6032 -9404 -30523 -45013 -30525 -38336 -24444 3939 1178 1410 -13932 -2381
4923 -2381 17486 3880 -15501 -35261 -25073 -30000 -21515 -1211 9776 29540 9357 8945 4198
4910D198Q234j348l7333o209l0771j3826J7044J3470L2723K3247J7954L915l4424
4897c126j1080m505J9873O229j3742k1769J4454J7100N112j1837k5491L8150J4117
4884B3485O127n743m485j9364J426j4738k5032o748l075m643J8050j3058L093
4871d4705l0893k448J6965J3795M1275J7691J940m695j4686R351J9276J727n5572
4858c0979k2892M992J2562K1151j0375Q737j0590N390M059K929J4238l7260j6472
4845e4510J0540P501J923K4623P566j5163k2810j9446n181l3754K0124K3720K8582
4832b6285J6550k3114P167K0888j4607%r879N861P695j243j7425m565M485j583
4818c6055J5677l096j427K6249K8909Q986Q252J607o468k2603M9Q67O350m546
$$ plain form
4910 4198 12432 11084 -26249 -32458 -63229 -77055 -60011 -46541 -13818 9429 27383 31298 -3126
4897 -3126 -14206 -18711 1162 7391 -6351 -28120 -13666 3434 8546 -3291 -28782 9368 23485
4884 23485 29612 23869 19384 20 1446 -13292 -38324 -45072 -48147 -52790 -34740 -47798 -44705
4871 -44705 -75598 -78046 -61081 -47286 -6011 11680 13620 8925 -5761 3590 22866 24593 -30979
4858 -30979 -53871 -48879 -36317 -15166 -25541 -16804 -27394 -22004 -17945 -15016 -778 -38038 -54510
4845 -54510 -43970 -36469 -34546 -9923 -2357 -17520 -40330 -59776 -64957 -98711 -78587 -54867 -26285
4832 -26285 -9735 -32849 -25682 -4794 -19401 -19401 -29280 -23419 -15724 -16967 -34392 -38957 -34472 -36055
4818 -36055 -20378 -23474 -24901 1348 30257 39243 47495 49102 42634 20031 20080 20947 27297 22751
4804B2751K936o680l5614j9113m412J1635L9520L1797P564j6984n555N311j2371
4791B0785m631m6349j0463J9668L2204K988j6251j3053j1750J5815Q705O541p328
4778c119N643K3825J5513k029k4055j101J484j4802j3447J697L1397j6563j5494
4765a1051o962l3921n302M0136K8619q300r901k0275j2419J9301J299M670J3641
4752d65o997K9827L9055m5860j0519o34n225L732j9696O904J8103q454L198K249
4738E218l0000k6162m743K9705L0541J0705N574l524j1391K352N682j9575q430
4725a4048L6199K2779j0621k9923k6204j2698J8334J3024q600M525J0523o810
4713c520j3483r939N79J5835P294p748Q996J8325j1020j3809o998R084r707j2607
$$ plain form
4804 22751 25687 19007 -16607 -35720 -40132 -28497 11023 42820 50384 33400 27845 33156 20785
4791 20785 16154 -30195 -40658 -20990 11214 14202 -2049 -15102 -26852 -11037 -2332 4209 -3119
4778 -3119 2524 26349 41862 39833 15778 14677 16161 1359 -12088 -10391 21006 4443 -11051
4765 -11051 -18013 -51934 -57236 -17100 11519 3219 -6682 -26957 -39376 -20075 -18776 -14106 -465
4752 -465 -7462 22365 61420 15560 5041 4407 -818 2914 -16782 -9878 8225 -229 2969 5218
4738 5218 -24782 -50944 -55687 -25982 4559 15264 20838 17314 5923 8275 13957 -5618 -14048
4725 -14048 22151 44930 34309 4386 -21818 -34516 -16182 -3158 -11758 -7233 3290 -3520
4713 -3520 -17003 -26942 -26363 -10528 -3234 -10982 -1986 16339 5319 -8490 -15488 -6404 -16111 -28718
4699b8718j6586J1623M881j3137M26j4579K8607J0375J7466K1096r844P269j5070
4686C809l019j102k2369r482K1591J1729L506q16m843q563k0288J9514Q013K65
$$ plain form
4699 -28718 -45304 -33681 -28800 -41937 -41511 -56090 -27483 -17108 358 21454 11610 18879 3809
4686 3809 790 -312 -22681 -32163 -10572 1157 4663 3847 -996 -9559 -29847 -10333 -2320 -2055
$$ [...]
##END NTUPLES=NMR SPECTRUM
##END=
