##TITLE=Analysis number 320092
Compound Code cc 56046
Book Reference 494/6
Project Code adrs
Chemist Name craigr
##JCAMPDX= 6.0         $$ Bruker NMR JCAMP-DX V2.0
##DATA TYPE= NMR SPECTRUM
##DATA CLASS= NTUPLES
##ORIGIN= Bruker BioSpin GmbH
##OWNER= nmr
$$ XWIN-NMR		Version 3.5
$$ Tue Jun 13 10:41:42 2006 GMT Daylight Time (UT+1h)  MAYBRIDGE\nmr@NMR_250MHZ
##.OBSERVE FREQUENCY= 250.131544655141
##.OBSERVE NUCLEUS= ^1H
##.ACQUISITION MODE= SIMULTANEOUS (DQD)
##.ACQUISITION SCHEME= undefined
##.AVERAGES= 16
##.DIGITISER RES= 18
##SPECTROMETER/DATA SYSTEM= dpx250
##.PULSE SEQUENCE= zg30
##.SOLVENT NAME= CDCl3
##.SHIFT REFERENCE= (INTERNAL, CDCl3, 0, 16.522)
##AUDIT TRAIL= $$ (NUMBER, WHEN, WHO, WHERE, WHAT)
$$ ##TITLE= Audit trail, XWIN-NMR		Version 3.5
$$ ##JCAMPDX= 5.01
$$ ##ORIGIN= Bruker BioSpin GmbH
$$ ##OWNER= nmr
$$ C:\u/data/dgb/nmr/ADRS/630/pdata/1/auditp.txt
$$ ##AUDIT TRAIL=  $$ (NUMBER, WHEN, WHO, WHERE, WHAT)
(   1,<2006-06-13 10:40:50.56 +100>,<MAYBRIDGE\nmr>,<NMR_250MHZ>,
      <created by zg, POWCHK disabled, PULCHK disabled
       configuration hash MD5:
       E2 DF 36 D8 04 B2 41 60 5A D7 A3 38 5A 4B D0 FE
       data hash MD5: 64K
       84 6A CA 59 7D 5D 4D BE 19 F8 F5 3D 28 5F B6 20>)
(   2,<2006-06-13 10:41:12.98 +100>,<MAYBRIDGE\nmr>,<NMR_250MHZ>,
      <Start of raw data processing
       ef LB = 0.3 FT_mod = 6 PKNL = 1 SI = 32K 
       data hash MD5: 32K
       C0 A8 8D 51 E7 CA CC 46 9E 00 30 E5 1A 82 0C C7>)
(   3,<2006-06-13 10:41:15.84 +100>,<MAYBRIDGE\nmr>,<NMR_250MHZ>,
      <apk 
       data hash MD5: 32K
       22 A9 84 7C 1A 11 9D BD F9 E5 0F 9D 43 AC 22 6E>)
(   4,<2006-06-13 10:41:17.28 +100>,<MAYBRIDGE\nmr>,<NMR_250MHZ>,
      <abs ABSG = 5 
       data hash MD5: 32K
       8E C7 A9 88 0C 80 C2 01 AB 43 9C 0F 20 57 69 C1>)
$$ ##END=
$$ 
$$ hash MD5
$$ 14 47 01 AD 9D D1 F5 29 9B 67 9A 2A 9E AE 3C A6
##$RELAX= 
##$RELAX= 
##$RELAX= 
##$RELAX= 
##$RELAX= 
##$RELAX= 
##$RELAX= 
$$ Bruker specific parameters
$$ --------------------------
##$DU= <C:\u>
##$EXPNO= 630
##$NAME= <ADRS>
##$PROCNO= 1
##$TYPE= <nmr>
##$USER= <dgb>
##$AMP= (0..31)
100 100 100 100 100 100 100 100 100 100 100 100 100 100 100 100 100 100 
100 100 100 100 100 100 100 100 100 100 100 100 100 100 
##$AQSEQ= 0
##$AQ_mod= 3
##$AUNM= <au_zg>
##$AUTOPOS= <14 >
##$BF1= 250.13
##$BF2= 250.13
##$BF3= 250.13
##$BF4= 250.13
##$BF5= 500.13
##$BF6= 500.13
##$BF7= 500.13
##$BF8= 500.13
##$BYTORDA= 1
##$CFDGTYP= 0
##$CFRGTYP= 5
##$CHEMSTR= <none>
##$CNST= (0..31)
1 1 145 1 1 1 1 1 1 1 1 1 1 1 1 1 1 1 1 1 1 1 1 1 1 1 1 1 1 1 1 1 
##$CPDPRG= <>
##$CPDPRG1= <>
##$CPDPRG2= <>
##$CPDPRG3= <>
##$CPDPRG4= <mlev>
##$CPDPRG5= <mlev>
##$CPDPRG6= <mlev>
##$CPDPRG7= <mlev>
##$CPDPRG8= <mlev>
##$CPDPRGB= <>
##$CPDPRGT= <>
##$D= (0..31)
0 1 0 0 0 0 0 0 0 0.06 0 0 0 0 0 0 0.0002 0 0 0 0 0 0 0 0 0 0 0 0 0 0 
0 
##$DATE= 1150191648
##$DBL= (0..7)
120 120 120 120 120 120 120 120 
##$DBP= (0..7)
150 150 150 150 150 150 150 150 
##$DBP07= 0
##$DBPNAM0= <>
##$DBPNAM1= <>
$$ [...]
##$SUBNAM7= <"">
##$SUBNAM8= <"">
##$SUBNAM9= <"">
##$SW= 20.6930455092707
##$SWIBOX= (0..15)
0 0 3 0 0 0 0 0 0 0 0 0 0 0 0 0 
##$SW_h= 5175.983436853
##$TD= 65536
##$TD0= 1
##$TE= 295.16
##$TE2= 300
##$TE3= 300
##$TEG= 300
##$TL= (0..7)
0 120 120 120 120 120 120 120 
##$TP= (0..7)
150 150 150 150 150 150 150 150 
##$TP07= 0
##$TPNAME0= <>
##$TPNAME1= <>
##$TPNAME2= <>
##$TPNAME3= <>
##$TPNAME4= <>
##$TPNAME5= <>
##$TPNAME6= <>
##$TPNAME7= <>
##$TPOAL= (0..7)
0.5 0.5 0.5 0.5 0.5 0.5 0.5 0.5 
##$TPOFFS= (0..7)
0 0 0 0 0 0 0 0 
##$TUNHIN= 0
##$TUNHOUT= 0
##$TUNXOUT= 0
##$USERA1= <user>
##$USERA2= <user>
##$USERA3= <user>
##$USERA4= <user>
##$USERA5= <user>
##$V9= 5
##$VALIST= <valist>
##$VCLIST= <CCCCCCCCCCCCCCC>
##$VD= 0
##$VDLIST= <DDDDDDDDDDDDDDD>
##$VPLIST= <PPPPPPPPPPPPPPP>
##$VTLIST= <TTTTTTTTTTTTTTT>
##$WBST= 1024
##$WBSW= 4
##$XGAIN= (0..3)
0 0 0 0 
##$XL= 0
##$YL= 0
##$YMAX_a= 267397
##$YMIN_a= -474582
##$ZGOPTNS= <>
##$ZL1= 120
##$ZL2= 120
##$ZL3= 120
##$ZL4= 120
##$ABSF1= 16.522
##$ABSF2= -4.171173
##$ABSG= 5
##$ABSL= 3
##$ALPHA= 0
##$AQORDER= 0
##$ASSFAC= 0
##$ASSFACI= 0
##$ASSFACX= 0
##$ASSWID= 0
##$AUNMP= <proc_1d>
##$AZFE= 0.1
##$AZFW= 0.1
##$BCFW= 0
##$BC_mod= 0
##$BYTORDP= 0
##$COROFFS= 0
##$CY= 12.5
##$DATMOD= 1
##$DC= 0
##$DFILT= <>
##$DTYPP= 0
##$F1P= 14.0000005364418
##$F2P= -0.99999901652339
##$FCOR= 0.5
##$FTSIZE= 32768
##$FT_mod= 6
##$GAMMA= 0
##$GB= 0
##$INTBC= 1
##$INTSCL= 1
##$ISEN= 128
##$LB= 0.3
##$LEV0= 0
##$LPBIN= 0
##$MAXI= 10000
##$MC2= 0
##$MEAN= 0
##$ME_mod= 0
##$MI= 0
##$NCOEF= 0
##$NC_proc= -4
##$NLEV= 6
##$NOISF1= 0
##$NOISF2= 0
##$NSP= 0
##$NTH_PI= 0
##$NZP= 0
##$OFFSET= 16.522
##$PC= 1
##$PHC0= 170.372
##$PHC1= 7.829631
##$PH_mod= 1
##$PKNL= yes
##$PPARMOD= 0
##$PSCAL= 4
##$PSIGN= 0
##$REVERSE= no
##$SF= 250.13
##$SI= 32768
##$SIGF1= 0
##$SIGF2= 0
##$SINO= 400
##$SIOLD= 32768
##$SREGLST= <1H.CDCl3>
##$SSB= 0
##$STSI= 32768
##$STSR= 0
##$SW_p= 5175.98343685301
##$SYMM= 0
##$S_DEV= 0
##$TDeff= 65536
##$TDoff= 0
##$TI= <Analysis number 999999
Compound Code 99
Book Reference 9
Project Code 9>
##$TILT= no
##$TM1= 0
##$TM2= 0
##$TOPLEV= 0
##$USERP1= <user>
##$USERP2= <user>
##$USERP3= <user>
##$USERP4= <user>
##$USERP5= <user>
##$WDW= 1
##$XDIM= 32768
##$YMAX_p= 375869232
##$YMIN_p= -119338
$$ End of Bruker specific parameters
$$ ---------------------------------
##NTUPLES= NMR SPECTRUM
##VAR_NAME=  FREQUENCY,     SPECTRUM/REAL,   SPECTRUM/IMAG
##SYMBOL=    X,             R,               I
##VAR_TYPE=  INDEPENDENT,   DEPENDENT,       DEPENDENT
##VAR_FORM=  AFFN,          ASDF,            ASDF
##VAR_DIM=   32768,         32768,           32768
##UNITS=     HZ,            ARBITRARY UNITS, ARBITRARY UNITS
##FACTOR=    0.157963299565203, 1,           1
##FIRST=     4132.6476996994, 0,             0
##LAST=      -1043.33573715361, 0,           0
##MIN=       -1043.33573715361, -119338,     0
##MAX=       4132.6476996994, 375869232,     0
$$ Real data points
##PAGE= N=1
##DATA TABLE= (X++(R..R)), XYDATA
$$ [...]
16301D2962j412j0213P13M511J5291j8984j1157K33K0414J7297K910o359j3891
$$ 42962 41550 31337 32050 36561 51852 32868 21711 21944 42358 59655 62565 56206 42315
16288D2315k9519R153L6954J8583l2160j3541N876K1409J3129J5342J2257j8391
$$ 42315 12796 21949 58903 77486 45326 31785 37661 59070 72199 87541 99798 81407
16276H1407l9808l385j0145P03j8145j7561J2205Q944r424J5307q729j9917n43
$$ 81407 41599 38214 28069 28772 10627 -6934 5271 14215 4791 20098 11369 -8548 -9091
16263i091R420K2375J8705l2674j0463n57J2712M432q871J6493j7537k1629l466
$$ -9091 329 22704 41409 8735 -1728 -2285 10427 14859 5988 22481 4944 -16685 -20151
16250b0151p410J3670K5555l211j0730l377R907J743j4390j3337K7071m881j5344
$$ -20151 -27561 -13891 11664 8453 -2277 -5654 4253 5996 -8394 -21731 5340 459 -14885
16237a4885k229J7810o045l7517L216K6696r666k8494J3162j5838L907N2N413
$$ -14885 -17114 696 -5349 -42866 -39650 -12954 -22620 -51114 -37952 -53790 -49883 -49831 -44418
16224d4418K2063K7694K203k527p456J544J5465L26K597k2615j8653N676L061
$$ -44418 -22355 5339 7542 5015 -2441 -897 14568 14894 17491 -5124 -23777 -18101 -15040
16211a5040J2431J209m2384q151M251j6633J4845K6059J263J8234M4423Q115l4976
$$ -15040 -2609 -1400 -43784 -51935 -47684 -64317 -49472 -23413 -22150 -3916 40507 48622 13646
16198A3646p783K2006M085J3182J0011j3039J0633m1181k2992j0915J4481O288
$$ 13646 5863 27869 31954 45136 55147 42108 52741 11560 -11432 -22347 -7866 -1578
16186a578J9019J929J9641J6875j6595l1876L518m580m471L292K5339N22k7423
$$ -1578 17441 19370 39011 55886 39291 7415 10933 6353 1882 5174 30513 31035 3612
16173C612q691J6036j1970M735K519J1211J2792L852J43L99k1454k8387k8758
$$ 3612 -5079 10957 -1013 3722 6241 17452 30244 34096 34239 34638 13184 -15203 -43961
16160d3961n346l841k364Q762K8330P618j6839j48L464K2654J8226j4368k152
$$ -43961 -49307 -53148 -55512 -46750 -18420 -10802 -27641 -27789 -24325 -1671 16555 2187 35
16147C5k1342j0783J8946J9042j6836k1095P384J0860l4300M5650M6042n715k7460
$$ 35 -21307 -32090 -13144 5898 -10938 -32033 -24649 -13789 -48089 -2439 43603 37888 10428
16134A0428j3185O913Q838o915J0647j4201j0323k3169o824J4727K1035K7058
$$ 10428 -2757 4156 12994 6079 16726 2525 -7798 -30967 -37791 -23064 -2029 25029
16122B5029R143j1934l191m551N162j1046J2963k1081k2474Q389K0699N109k5802
$$ 25029 34172 22238 19047 14496 19658 8612 21575 494 -21980 -13591 7108 12217 -13585
16109a3585j7230M5460K0047j8117J4853J8642k3101k4601j1516J3363K1340l7042
$$ -13585 -30815 14645 34692 16575 31428 50070 26969 2368 -9148 4215 25555 -11487
16097a1487m349K5547M4046j8073k5955m850l60k904J3315J6266j7002K066n870
$$ -11487 -15836 9711 53757 35684 9729 4879 4519 1615 14930 31196 14194 16260 10390
16084A0390J879l7098k7395q170L6770K7421Q86p29j377j4903J620P038J9158
$$ 10390 12269 -24829 -52224 -60394 -23624 3797 4683 3954 2577 -12326 -10706 -3668 15490
16071A5490P348m004p799M795q528k3007n169l0604k4038j3556j1019M2645M3074
$$ 15490 22838 18834 11035 15830 7302 -15705 -20874 -51478 -75516 -89072 -100091 -57446 -14372
16058a4372n124J5332k300K4231k606q928k5061l1025J0125L5135j2460k8880
$$ -14372 -19496 -4164 -6464 17767 15161 6233 -18828 -49853 -39728 -4593 -17053 -45933
16046d5933m590M551J781m535K973K5114K5120J7544j8029j2059J558R776Q981
$$ -45933 -50523 -45972 -44191 -48726 -45753 -20639 4481 22025 3996 -8063 -6505 3271 12252
16033A2252k0160k7486r631K212J4403J9734K0553K1148k8521l5974R721L2655
$$ 12252 -7908 -35394 -45025 -42813 -28410 -8676 11877 33025 4504 -31470 -21749 10906
16021A0906J995j3881k3546j1057L0050m48p387m469J5922l188L569J9338n43
$$ 10906 12901 -980 -24526 -35583 -5533 -5981 -13368 -17837 -1915 -5103 -1534 17804 17261
16008A7261O645j9849K1996J6693j8254P986J3685k0640j3875k5518K317J5894
$$ 17261 23906 4057 26053 42746 24492 32478 46163 25523 11648 -13870 -11553 4341
15996D341o815J0395L8458K7383M1942L3055K4676K6599K2043P799j914K3250
$$ 4341 -2474 7921 46379 73762 115704 148759 173435 200034 222077 229876 227962 251212
15984B51212Q330m4775n0159l3018J0877L1326N7112L4494K5062K7023K5585L4415
$$ 251212 259542 214767 164608 131590 142467 173793 230905 265399 290461 317484 343069 377484
15972C77484K3749j7661k3645k8794l6125k9173k6004m5984j1853M3350K0260
$$ 377484 401233 383572 359927 331133 295008 265835 239831 193847 181994 225344 245604
15961B45604j4785r708O450L5832M225k8827l3189m3030o0396j7434j2033J1389
$$ 245604 230819 221111 227561 263393 267618 238791 205602 162572 102176 84742 72709 84098
15949H4098K700n167j4870k0814m479J4773K366K3690k061l624n998p190K8821
$$ 84098 86798 81631 66761 45947 41468 56241 58607 82297 80236 76612 70614 63424 92245
15936I2245j5969k0408j2546L28K1476N928O22m968m3507k0993L2761L324m6245
$$ 92245 76276 55868 43322 43650 65126 71054 71676 66708 23201 2208 34969 38293 -7952
15923g952j1998L4467Q646K4388N637k8790k8970J8642L4454j8449j6210K3967
$$ -7952 -19950 14517 23163 47551 53188 24398 -4572 14070 48524 30075 13865 37832
15911C7832j0039j5439k0952K2998M121l284q751k961l828M939L59J8384K224
$$ 37832 27793 12354 -8598 14400 18521 15237 6486 3525 -303 4636 4995 23379 25603
15898B5603k1471M014J8299m386j145K699j6255l5533r423K7517j7794k1101P219
$$ 25603 4132 8146 26445 22059 20914 23613 7358 -28175 -37598 -10081 -27875 -48976 -41757
15885d1757m114j9981j9729K8981K8059J111J8955l0889M882K1867J9560K8876
$$ -41757 -45871 -65852 -85581 -56600 -28541 -27430 -8475 -39364 -34482 -12615 6945 35821
15873C5821K6233n476k6630P77l1968j9661L1219p631j7281j5456R80J2492n520
$$ 35821 62054 56578 29948 30725 -1243 -20904 10315 2684 -14597 -30053 -29073 -16581 -22101
15860b2101l3556r468J9004M182R055m254J5510m386l343N334L180Q922K8933
$$ -22101 -55657 -65125 -46121 -41939 -32884 -37138 -21628 -26014 -29357 -24023 -20843 -11921 17012
15847A7012j3145j0693O2j4027j0623J5612J5883J3953q02J337P16K1542J6945
$$ 17012 3867 -6826 -6764 -20791 -31414 -15802 81 14034 13232 14569 15285 36827 53772
15834E3772p342l3575k2374j3401J6585L331P12k3218j4045N022J8051K0003k9465
$$ 53772 46430 12855 -9519 -22920 -6335 -3004 -2292 -25510 -39555 -34533 -16482 3521 -25944
15821b5944p775K541J1883J1718r543j8869q480L6669K8271L14J2720j017Q593
$$ -25944 -33719 -31178 -19295 -7577 -17120 -35989 -44469 -7800 20471 20785 33505 32488 41081
15808D1081j512M217r154j2073m8652l2104P872L1692Q433j0782k9692K871J5062
$$ 41081 39569 43786 34632 22559 -26093 -58197 -50325 -18633 -10200 -20982 -50674 -47803 -32741
15795c2741J1185q00k485j1K5261R147J0749M047J3832j8179l5058n201J4965
$$ -32741 -21556 -22356 -24841 -24852 409 9556 20305 24352 38184 20005 -15053 -20254 -5289
15782e289K4061j6977j9617J2342O469q653l668J409J8936R597K6736k2407j0686
$$ -5289 18772 1795 -17822 -5480 989 -7664 -11332 -9923 9013 18610 45346 22939 12253
15769A2253j5055m0489j9868K5208K5295K098J3539M4174J5744k0991l0827n509
$$ 12253 -2802 -43291 -63159 -37951 -12656 -10558 2981 47155 62899 41908 11081 5572
15757E572m822j0135j0527J2130j9263l93L6839K840r499K4897j067m169J1458
$$ 5572 750 -9385 -19912 -7782 -27045 -27438 9401 12241 2742 27639 26572 22403 33861
15744C3861J9160j6977O402j4221m0825N655j7168J8200K7469K0823k3595k5462
$$ 33861 53021 36044 42446 28225 -12600 -6945 -24113 -5913 21556 42379 18784 -6678
15732f678N774k506J076q248o045K6606K3503P977k7504j5338j0408j1225K0321
$$ -6678 -904 -3410 -2334 -10582 -16627 9979 33482 41459 13955 -1383 -11791 -23016 -2695
15719b695M0314M44k1946L124k7005j9729p384J1353r954o857L3315L3939m321
$$ -2695 37619 38063 16117 19241 -7764 -27493 -34877 -23524 -33478 -40335 -7020 26919 22598
15706B2598Q628m603k5839m347k251p654R646K2503j5854J832l173J0040p878
$$ 22598 31226 26623 784 -3563 -5814 -13468 -3822 18681 2827 4659 1486 11526 3648
15693C648l2198J8260J3706j5886K5352J089j7529j9609o960m193M263j6919J2104
$$ 3648 -28550 -10290 3416 -12470 12882 13971 -3558 -23167 -30127 -34320 -30057 -46976 -34872
15680c4872p089P104L1127l75m1880j019J9049L2474M461p83J1351K799j2817
$$ -34872 -41961 -34857 -3730 -4105 -45985 -47004 -27955 4519 8980 8197 19548 22347 9530
15667I530L2595l93j9296M944J2115m862l7092k0154k1971j3413K6496K8177L3326
$$ 9530 42125 41732 22436 27380 39495 34633 -2459 -22613 -44584 -57997 -31501 -3324 30002
15654C0002L418j0236r605P039j809j0858J6853K6845k9259q434l060k426N583
$$ 30002 33420 23184 13579 20618 18809 7951 24804 51649 22390 13956 10896 8470 14053
15641A4053J256K4907J5324l722j5851l0218j0027K0028O879o262R041K867J5893
$$ 14053 15309 40216 55540 51818 35967 5749 -4278 15750 22629 16367 25408 28275 44168
15628D4168l496j658J3332j3027o5141j2355j062K5212M1263j3475j5671l2350
$$ 44168 40672 39014 52346 39319 -25822 -38177 -39239 -14027 27236 13761 -1910 -34260
15616c4260k3800k2653N583K3705l987j638K7185K137P085k0065K2996J9108N356
$$ -34260 -58060 -80713 -75130 -51425 -55412 -57050 -29865 -27728 -20643 -40708 -17712 1396 6752
15603F752k359k318N414J8949r40q167J0350l2165k0015K1727p923k0513j8585
$$ 6752 4393 2075 7489 26438 25498 17331 27681 -4484 -24499 -2772 -10695 -31208 -49793
15590d9793r99L0839L5201J3356Q818J0184k3201r2J413L625k832n292j0907j4226
$$ -49793 -50792 -19953 15248 28604 37422 47606 24405 24313 25726 29351 26519 21227 10320 -3906
15576c906K0259J258o357p553j9367j1718L9156N7805K0534j8918l6025m0322
$$ -3906 16353 17611 11254 3701 -15666 -27384 11772 69577 90111 71193 35168 -5154
15564e154k5249j828R809J7981J7751j2125k7507N989j3118l137M363K4251J5832
$$ -5154 -30403 -32231 -22422 -4441 13310 1185 -26322 -20333 -33451 -36588 -32225 -7974 7858
15551G858J1950R121J3351n086j7065N455K5645l8256j6028j8184p532J9562r745
$$ 7858 19808 28929 42280 37194 20129 25584 51229 12973 -3055 -21239 -28771 -9209 -18954
15538a8954k2905m383K0007K1480K6144N520l4123k3085J8187K5836j5803Q043
$$ -18954 -41859 -46242 -26235 -4755 21389 26909 -7214 -30299 -12112 13724 -2079 5964
15526E964M435K4717P030j8665J0731N467J3559O050O219j0792k8554j0648Q476
$$ 5964 10399 35116 42146 23481 34212 39679 53238 59288 65507 54715 26161 15513 23989
15513B3989J7601N870j5608k263M605J3282J157j752k3434n388P068J6489j8022
$$ 23989 41590 47460 31852 29589 34194 47476 48633 46881 23447 18059 25127 41616 23594
15500B3594j2128J7218J6873J4116J1816J9371j7943j9317j3604j4495k0135J6297
$$ 23594 11466 28684 45557 59673 71489 90860 72917 53600 39996 25501 5366 21663
15488B1663Q455J0651k595j8093J139J6408j434j6152l9606J0275L0194P256L7779
$$ 21663 30118 40769 38174 20081 21220 37628 36194 20042 -19564 -9289 20905 28161 65940
15475F5940L9324m522j797k7460o413L2413J3632L386K0902O02j5730j837K0979
$$ 65940 105264 100742 98945 71485 65072 97485 111117 114503 135405 136007 120277 118440 139419
15462A39419M229J1491J9888L0213K269P647K4587J2967P3387P8610R5618Q6383
$$ 139419 143648 155139 175027 205240 207509 215156 239743 252710 326097 404707 500325 586708
15450E86708O8590J00801Q4430J01384Q9628O1354J7022k2806m3968q6365q6477
$$ 586708 655298 756099 840529 941913 1031541 1092895 1109917 1087111 1043143 956778 870301
15439H70301q4255j09896j08295p8572n8878m7511q2782p2138p327n078n900j2120
$$ 870301 786046 676150 567855 489283 430405 382894 300112 227974 220647 215569 209669 197549
15427A97549m8855m0018O628p059j494k4988K100K3739k5146k8734q3l4022j0271
$$ 197549 148694 108676 115304 108245 106751 81763 83863 107602 82456 53722 53639 19617 9346
15414I346M754J2170J5331J1217J7945O538l7317J6634J8142k4043k7046J3554
$$ 9346 14100 26270 41601 52818 70763 77301 39984 56618 74760 50717 23671 37225
15402C7225k0414k0094j6812N900K0783K0227M865j3014k5456l1000J8668O555
$$ 37225 16811 -3283 -20095 -14195 6588 26815 31680 18666 -6790 -37790 -19122 -12567
15390a2567q475P708j4031Q77J9750l306O145M970j2375R909j3211J4480k792
$$ -12567 -21042 -13334 -27365 -26488 -6738 -10044 -3899 1071 -11304 -1395 -14606 -126 -2918
15377b918j0925k0783k6997L878K3009J2154l783K08l701k316J5279j2692k4188
$$ -2918 -13843 -34626 -61623 -57745 -34736 -22582 -26365 -26157 -29858 -32174 -16895 -29587 -53775
15364e3775j5239o618K1060L8686m14j0393p5J3736R658J8324m544J5149J8438
$$ -53775 -69014 -75632 -54572 -15886 -16300 -26693 -26768 -13032 -3374 14950 10406 25555 43993
15351D3993q702k6210R118K610J1893j6240q737R208n503l6823M2814K1060L287
$$ 43993 35291 9081 18199 20809 32702 16462 7725 16933 11430 -25393 17421 38481 41768
15338D1768K424P877j6339k2748L4211L2497l5352j3770k4002j088K8435n80K490
$$ 41768 44192 52069 35730 12982 47193 79690 44338 30568 6566 5478 33913 33333 35823
15325C5823M235j2012m283K4496K3173j2089k5373n157J3181N544k7356j8076
$$ 35823 40058 28046 23763 48259 71432 59343 33970 28813 41994 47538 20182 2106
15313B106J0626o342J686J8264K6543L0709k1388q578l2587k701J3446J359k398
$$ 2106 12732 6390 8076 26340 52883 83592 62204 53626 21039 18338 31784 33143 30745
15300C0745K5033K0265k6148p929M54k3206o786J1805L3761P159l765j943N854
$$ 30745 55778 76043 49895 41966 42420 19214 12428 24233 57994 65153 61388 59445 65299
15287F5299l444o388j5475J0231j0730j021n288L6778K4486l740j1715k1219l6963
$$ 65299 61855 55467 39992 50223 39493 38472 33184 69962 94448 90708 78993 57774 20811
15274B0811Q227r823K1294L4125K6746j3920q503j0978M658L3884J9355M1125
$$ 20811 29038 19215 40509 74634 101380 87460 78957 67979 72637 106521 125876 167001
15262A67001o861J5593K4786m721J4947J8731j2458l4073j6643o26k7857l2045
$$ 167001 160140 175733 200519 195798 210745 229476 217018 182945 166302 165676 137819 105774
15250A05774j2284Q667j0584N163L0517J9029Q281J9758j9976l1731l7555p118
$$ 105774 93490 102157 91573 96736 127253 146282 154563 174321 154345 122614 85059 77941
15238G7941M428J1889n738o846j0573j4355J8484R730j3191k3017O154j5892j9850
$$ 77941 82369 94258 88520 81674 71101 56746 75230 84960 71769 48752 54906 39014 19164
15225A9164m20M163J4275K7367Q025o934j3512k5683M170N2040L5072L2074k1630
$$ 19164 18744 22907 37182 64549 72574 65640 52128 26445 30615 82655 117727 149801 128171
15212A28171j5124l2988M040J696K1778K4954j5706j8785J491K0008R338l575
$$ 128171 113047 80059 84099 85795 107573 132527 116821 98036 99527 119535 128873 125298
15200A25298j1800l28j8134Q79l856j5835l8300J2561L5452K176j466L045k832
$$ 125298 113498 113170 95036 95915 92059 76224 37924 50485 85937 88113 86647 89692 86860
15187H6860k4485l3742r788L944J0215k4249j1380K5624J1356L243n791R87L884
$$ 86860 62375 28633 18845 22789 33004 8755 -2625 22999 34355 37598 31807 32794 36678
15174C6678J8707J7803J1879j5955J5774j0921j0707j5615j994M8375L9128J0467
$$ 36678 55385 73188 85067 69112 84886 73965 63258 47643 45649 94024 133152 143619
15162A43619J5871J0695J8514K162j503K0293j8501K5006M4645j6378l2750k970
$$ 143619 159490 170185 188699 190861 189358 209651 191150 216156 260801 244423 211673 208703
15150B08703j4414J1691K2590L893K1419J1158M694L1547N1439N2170L9231J7060
$$ 208703 194289 205980 228570 232463 253882 265040 269734 301281 352720 404890 444121 461181
15138D61181N1538L3889N1079N9888N7976O1561K4491O984k7826k961j1483m5915
$$ 461181 512719 546608 597687 657575 715551 777112 801603 808587 780761 777800 766317 720402
15126G20402l4295o2507l2531j1696j6759j3634j4058j4639j173j9477k348k6169
$$ 720402 686107 623600 591069 579373 562614 548980 534922 520283 519110 499633 497285 471116
15114D71116l9953k419J8192K1639r794l612k186P142J7436m1436j5601j0653
$$ 471116 431163 428744 446936 468575 458781 455169 452983 460125 477561 436125 420524 409871
15102D09871Q967O117N943K4009J2286n336p774K1399J6372M575K6758J4634o106
$$ 409871 418838 424955 430898 454907 467193 461857 454083 475482 491854 496429 523187 537821 531715
15089E31715p481R069K5949K9465K285L084K1765M0734M9383K4574Q424M8750
$$ 531715 524234 533303 559252 588717 591002 594086 615851 656585 705968 730542 738966 787716
15077G87716L6275M5020L1465K9068L2440L4224M3068M7054J6970K6640N3835
$$ 787716 823991 869011 900476 929544 961984 996208 1039276 1086330 1103300 1129940 1183775
15066A183775R1939N8429N8406O2232L0393Q2958R4301J07898J30990J24652J14250
$$ 1183775 1275714 1334143 1392549 1454781 1485174 1568132 1662433 1770331 1901321 2025973 2140223
15055B140223J23793J45132J13476Q7715Q8681Q5314O7438J00182J20805J28525
$$ 2140223 2264016 2409148 2522624 2610339 2699020 2784334 2851772 2951954 3072759 3201284
15045C201284J59515J83357J91452K04365K95484L43696L87046M29077M56346
$$ 3201284 3360799 3544156 3735608 3939973 4235457 4579153 4966199 5395276 5851622
15036E851622N02049N73631O15261P14103P66413Q72812R66332J085362J214793
$$ 5851622 6353671 6927302 7542563 8256666 9023079 9895891 10862223 11947585 13162378
15027A3162378J384197J583383J831334K035889K330776K720222L228684L868011
$$ 13162378 14546575 16129958 17961292 19997181 22327957 25048179 28276863 32144874
15019C2144874M788206O067012P710475R724968J2045154J4489230J6737089J8516909
$$ 32144874 36933080 43000092 50710567 60435535 72480689 86969919 103707008 122223917
15011A22223917J9568525J9437769J7846345J4734237J0359816N034604p42601
$$ 122223917 141792442 161230211 179076556 193810793 204170609 209205213 208462612
15004B08462612o461668j1573926j5635955j8189201j9309060j9040697j7674541
$$ 208462612 202000944 190427018 174791063 156601862 137292802 118252105 100577564
14997A00577564j5621920j3221712j0744126q548014o774781n362417m315870
$$ 100577564 84955644 71733932 60989806 52441792 45667011 40304594 35988724
14990C5988724l577575l032848k626095k303964k025244j766868j556935j383597
$$ 35988724 32411149 29378301 26752206 24448242 22422998 20656130 19099195 17715598
14982A7715598j227340j067302r71739q43636p76013p33516o60500n85834n49615
$$ 17715598 16488258 15420956 14449217 13605581 12829568 12096052 11435552 10849718 10300103
14973A0300103n14958m74313m19551m29469m26763l65383l41335k97896l28292
$$ 10300103 9785145 9310832 8891281 8461812 8035049 7669666 7328331 7030435 6702143
14964F702143k95088k56625k30773k35171k14926k01326j90738j85818j63627
$$ 6702143 6407055 6150430 5919657 5684486 5469560 5268234 5077496 4891678 4728051
14955D728051j80139j68958j61001j42721j54692j54129j55251j17035j05040
$$ 4728051 4547912 4378954 4217953 4075232 3920540 3766411 3611160 3494125 3389085
14946C389085q6342q5301p2034j04460j11986p9178p1856o9054p8667j18455j05753
$$ 3389085 3302743 3217442 3145408 3040948 2928962 2849784 2777928 2708874 2630207 2511752 2405999
14935B405999j00880q2338j00459j29318j20595q9007p7017r5665p3592p3946
$$ 2405999 2305119 2222781 2122322 1993004 1872409 1783402 1706385 1610720 1537128 1463182
14925A463182o7521n3609n2893n9782q2651o7203p3004m5846j0717l0657p9689
$$ 1463182 1395661 1342052 1289159 1229377 1146726 1079523 1006519 960673 949956 919299 839610
14914H39610m1649k5933m0774j0773J2498l2545n0206K0095j582m5520k6034J1641
$$ 839610 797961 772028 731254 720481 732979 700434 650228 670323 668741 623221 597187 608828
14902F08828q946L335j4924J0532J550j7605n117m5131M331m392j8415M272J419
$$ 608828 599882 603217 588293 598825 600375 582770 577653 532522 536853 532461 514046 518318 519737
14889E19737l3209J347J4480J250L7857J7966O328O476k1434O972J9927J3108
$$ 519737 486528 487875 502355 503605 541462 559428 565756 572232 550798 557770 577697 590805
14877E90805Q96N654k931l3720k1146K321l584r929M000j737k9591k014L889k8140
$$ 590805 591701 597355 594424 560704 539558 541879 538295 528366 532366 530629 501038 499024 502913 474773
14863D74773k0979o085L762o899j312n678k9023l9021k2532j0305M7274P372K13
$$ 474773 453794 447709 451471 444572 443260 437582 408559 369538 347006 336701 383975 391347 391560
14850C91560K6405K0827N569q78k60l715q894l9205j4443J4679K5246j8251Q871
$$ 391560 417965 438792 444361 443483 443223 439508 430614 391409 376966 391645 416891 398640 407511
14837D07511J1821M3530j2815m2289j6335j1719j8759n800k3710R699j5892j8427
$$ 407511 419332 462862 450047 407758 391423 379704 360945 355145 331435 341134 325242 306815
14825C06815J7457K5213l9842k9692J844J0735J3758j4640k2838j0734j0422p221
$$ 306815 324272 349485 309643 279951 281795 292530 306288 291648 268810 258076 247654 240433
14813B40433m515j4686k4459j3892J0373J8715p592K4288O455j5057K418j3120
$$ 240433 235918 221232 196773 182881 193254 211969 204377 228665 235120 220063 222481 209361
14801B09361j6561k822N1j7719j9044L8671K8892M146j6595k92j9043M037J7147
$$ 209361 192800 189978 190029 172310 153266 191937 220829 224975 208380 208088 189045 193082 210229
14788B10229O300r191q306j2662l959m819l2796m7414K987O481K1093p748j6886
$$ 210229 216529 207338 199032 186370 182411 177592 144796 97382 100369 106850 127943 120195 103309
14775A03309M18N945J0036L048l2227k2033N488J0133k0277j0697o838K832R736
$$ 103309 103727 109672 119708 122756 90529 68496 73984 84117 63840 53143 46305 49137 58873
14762E8873O391J739k5593j368J1957K0457j427L848O158k4682P999L8663k3894
$$ 58873 65264 67003 41410 40042 51999 72456 71029 74877 81035 56353 64352 103015 79121
14749G9121j0139J8366j3953N079Q143K4345k2198j3338j1144k7872k8697l675
$$ 79121 68982 87348 73395 78474 86617 110962 88764 75426 64282 36410 7713 4038
14737D038J077J6422K4174j0610K3737J2051J2410j5164k2122L0997K1060l8704
$$ 4038 5115 21537 45711 35101 58838 70889 83299 68135 46013 77010 98070 59366
14725E9366k2581r990l690Q704J4829J4960J770K5124k0021l0260j5988p597L2358
$$ 59366 36785 26795 23105 31809 46638 61598 63368 88492 68471 38211 22223 14626 46984
14712D6984j2924q479N876L751J4750o410n319L992k7803j4196l741J6083M659
$$ 46984 34060 25581 31457 35208 49958 43548 38229 42221 14418 222 -3519 12564 17223
14699A7223J7869L9969J6881k9679n4023k2052J760k030J0462K8120r789k6364
$$ 17223 35092 75061 91942 62263 8240 -13812 -12052 -14082 -3620 24500 14711 -11653
14687a1653Q917K2298k721k5216r001L958J6090K6538m430j8510j7417K9097K8297
$$ -11653 -2736 19562 16841 -8375 -17376 -13418 2672 29210 24780 6270 -11147 17950 46247
14674D6247Q146k4819n025J4758m678N578N526n299k6591p011K5149j3702l9801
$$ 46247 54393 29574 24549 39307 34629 40207 45733 40434 13843 6832 31981 18279 -21522
14661b1522M5578J2103l679l052n158N030l062J6042j0878j2179J7872p585l1043
$$ -21522 24056 36159 32480 29428 24270 29300 26238 42280 31402 19223 37095 29510 -1533
14648a533K3841L7408J7201j8699j1708K697j9001k8840P978L4008K8033M7368
$$ -1533 22308 59716 76917 58218 46510 49207 30206 1366 9344 43352 71385 118753
14636A18753P080j3405l005N245k2342l2203l4626m2662j1311J4364N5108N1931
$$ 118753 125833 112428 109423 114668 92326 60123 25497 -17165 -28476 -14112 40996 92927
14624I2927K033P20J6900P335j3444J20k2757k0029q210j9306j856l477r315K4000
$$ 92927 94960 95680 112580 119915 106471 106591 83834 63805 55595 36289 34433 30956 21641 45641
14610D5641R633m567L9449K8088J2195q218j3043k3686m6081j0743R346P087J4005
$$ 45641 55274 50707 90156 118244 130439 122221 109178 85492 39411 28668 38014 45101 59106
14597E9106J8247J1946P931n12P94L244J6665j5878k3181j5345J3563J9548J4947
$$ 59106 77353 89299 97230 96718 97512 100756 117421 101543 78362 63017 76580 96128 111075
14584A11075j0167j3864K7645O888J6439M179J8719L7135J3853J9624L4649L0787
$$ 111075 100908 87044 114689 121577 138016 142195 160914 198049 211902 231526 266175 296962
14572B96962K9116M6309J07863P9732P7053Q0692R3886J04642Q4366M9839K1929
$$ 296962 326078 372387 480250 559982 637035 717727 811613 916255 1000621 1050460 1072389
14561A072389J9126k1288n3594p7557q5309q1804q1178p9720o4559o2741p6399
$$ 1072389 1091515 1070227 1016633 939076 853767 771963 690785 611065 546506 483765 407366
14550D07366p8572j9399k0902l6176m1147m2730j3817j1162P89j3265j0899k2732
$$ 407366 328794 309395 288493 252317 211170 168440 154623 143461 144250 130985 120086 97354
14538I7354p014j0246r488k9807p250K0263K3667r631M259K2767N329k4657k4477
$$ 97354 90340 80094 70606 40799 33549 53812 77479 67848 72107 94874 100203 75546 51069
14525E1069j5604K616k4360J0072O228j9292j6280J4663M397j7457k7680q765
$$ 51069 35465 38081 13721 23793 30021 10729 -5551 9112 13509 -3948 -31628 -40393
14513d0393L5071J9758j0884j7321j7372K2217l071N005R500m441P476p475K306
$$ -40393 -5322 14436 3552 -13769 -31141 -8924 -11995 -6990 2510 -1931 5545 -1930 376
14500C76J7990J1990q111J1644K0455M566j2341j2177j0328j1419n430J8595q104
$$ 376 18366 30356 22245 33889 54344 58910 46569 34392 24064 12645 7215 25810 17706
14487A7706j2897L657j5412K753Q567L955J0465l959p960K721J7078m444j3331
$$ 17706 4809 8466 -6946 -4193 4374 8329 18794 14835 6875 9596 26674 22230 8899
14474H899j9245L531q445O721j0795m977j7106M255j5J4095L2865K7052J3982
$$ 8899 -10346 -6815 -15260 -8539 -19334 -24311 -41417 -37162 -37177 -23082 9783 36835 50817
14461E0817j1758r383J5980M035k4014k8843j4524J6526j7126K1068K4363J402
$$ 50817 39059 29676 45656 49691 25677 -3166 -17690 -1164 -18290 2778 27141 28543
14449B8543r492N159K676L1417K8044j7247k6131m7189j1712n013J1085J0375
$$ 28543 19051 24210 26886 58303 86347 69100 42969 -4220 -15932 -20945 -9860 515
14437E15o737q273N366l418q352l0661J9776r480J004l628L5837L6940Q536k1414
$$ 515 -6222 -14495 -9129 -12547 -20899 -51560 -31784 -41264 -40260 -43888 -8051 28889 37425 16011
14423A6011J321l641j9343j4472j5386J5166K9090J652k6609k2032J2373l334
$$ 16011 17332 13691 -5652 -20124 -35510 -20344 8746 10398 -16211 -38243 -25870 -29204
14411b9204j6810J4143J2187K292l4p944j580M595L6m842m818L4347J7252r111
$$ -29204 -46014 -31871 -19684 -17392 -17426 -25370 -26950 -22355 -22319 -27161 -31979 2368 19620 10509
14397A0509r339M415O457l753r408Q1q766j322L3457j4162j7615n96K163L530
$$ 10509 1170 5585 12042 8289 -1119 -1038 -9804 -11126 22331 8169 -9446 -10042 -7879 -4349
14383d349k517K300L0283j3637m0873q855N567N290k2422p642M2237K3108L860
$$ -4349 -6866 -4566 25717 12080 -28793 -37648 -32081 -26791 -49213 -56855 -14618 8490 12350
14370A2350K710L62l163l47M012R084M028k0694k5750j1996P491j7915j7352J6288
$$ 12350 15060 15422 12259 11912 15924 25008 29036 8342 -17408 -29404 -21913 -39828 -57180 -40892
14356d0892L1678p785l1362j1455P798M7801L1819j0776m2097j7199L227q196
$$ -40892 -9214 -16999 -48361 -59816 -52018 -4217 27602 16826 -25271 -42470 -39243 -47439
14344d7439J6326J5557J1736k6209L602J1331J3518j7794j6216J5616J5023l0017
$$ -47439 -31113 -15556 -3820 -30029 -26427 -15096 -1578 -19372 -35588 -19972 -4949 -34966
14332c4966j0260n716Q497J1556J2030O573j9222o60j9748j8795j6073K717M8100
$$ -34966 -45226 -50942 -42445 -30889 -18859 -12286 -31508 -32168 -51916 -70711 -86784 -84067 -35967
14319c5967K5957j0577L4678J1329m893N346Q759R01j0972q639m0194j2051Q013
$$ -35967 -10010 -20587 14091 25420 20527 25873 34632 35533 24561 15922 -24272 -36323 -28310
14306b8310K0502J9783j844K4317r819J2426k0613l814m124J392j5273o925k4867
$$ -28310 -7808 11975 10131 34448 24629 37055 16442 12628 8504 9896 -5377 -12302 -37169
14293c7169j0208p715J0043K4424L906l1269l220K7493J0898m704m173j4444J4901
$$ -37169 -47377 -55092 -45049 -20625 -16719 -47988 -51208 -23715 -12817 -17521 -21694 -36138 -21237
14280b1237R712n073L770J6102K701k5737k0567K7688L773j2328K382O641j9050
$$ -21237 -11525 -16598 -12828 3274 5975 -19762 -40329 -12641 -8868 -21196 -18814 -12173 -31223
14267c1223J4698K2222p105l010l4771J362L1395J3896k2056k1225J4817K4097
$$ -31223 -16525 5697 -1408 -4418 -39189 -37827 -6432 7464 -14592 -35817 -21000 3097
14255C097k4312l515K0542J1665m23O88L2250j7653q749L054J2886n216n059k4277
$$ 3097 -21215 -24730 -4188 7477 7054 7742 39992 22339 13590 16644 29530 24314 19255 -5022
14241e022k0618j6353J7094J8905k2920n969K5408K3036J1362j918l6934j9738
$$ -5022 -25640 -41993 -24899 -5994 -28914 -34883 -9475 13561 24923 23005 -13929 -33667
14229c3667j6471M225n806q349J0658K8090P81J5937j7347l247l989J0002r459
$$ -33667 -50138 -45913 -51719 -60068 -49410 -21320 -20539 -4602 -21949 -25196 -29185 -19183 -28642
14216b8642j1569L08Q714K2517L071j3208j1814K2064m434l299j298R437J726
$$ -28642 -40211 -39903 -31189 -8672 -5601 -18809 -30623 -8559 -12993 -16292 -17590 -8153 -6427
14203f427o000M768k3753k915K6339N937k9702J3404K813K0990p935O995L741
$$ -6427 -12427 -7659 -31412 -34327 -7988 -2051 -31753 -18349 -15536 5454 -2481 4514 8255
14190H255l1940J4623r830j3323J9176L2222n418k9861l140L349J0532m680L334
$$ 8255 -23685 -9062 -18892 -32215 -13039 19183 13765 -16096 -19236 -15887 -5355 -10035 -6701
14177f701J9841J4996m273J1787O778M360q56j9828k0352l949j5559j8142r250
$$ -6701 13140 28136 23863 35650 42428 46788 45932 26104 5752 1803 -13756 -31898 -41148
14164d1148k9583J6689J3622J4501M8550K6851k5354k9005l1408l755J235p089
$$ -41148 -70731 -54042 -40420 -25919 22631 49482 24128 -4877 -36285 -40040 -38805 -45894
14152d5894K1684K7971J8831q507o904N080l1014k9243J0429R710MN805k443R727
$$ -45894 -24210 3761 22592 14085 7181 12261 -18753 -47996 -37567 -27857 -27853 -22048 -24491 -14764
14138a4764J0743P72j8020L124J0009o143j136J83M921j0140k809j2321o018j0500
$$ -14764 -4021 -3249 -21269 -18145 -8136 -14279 -15415 -15232 -10311 -20451 -23260 -35581 -41599 -52099
14124e2099j8901m611K4806o760L3548K7230j4623J6683n384r319j8241l1168
$$ -52099 -71000 -75611 -50805 -57565 -24017 3213 -11410 5273 -111 -9430 -27671 -58839
14112e8839K3621K730P034l335p804L208q789J3820K6937k0380j2644J6218J5449
$$ -58839 -35218 -32488 -25454 -28789 -36593 -33385 -42174 -28354 -1417 -21797 -34441 -18223 -2774
14099b774k422J8265K257j0133J5432j7928n3917O827K4328j1613J861J3525J0713
$$ -2774 -5196 13069 15326 5193 20625 2697 -51220 -44393 -20065 -31678 -29817 -16292 -5579
14086e579j7275k1056R58K0572o347J5350M151n677J596L4114p748m8955R90K6994
$$ -5579 -22854 -43910 -42952 -22380 -28727 -13377 -9226 -14903 -13307 20807 13059 -35896 -34906 -7912
14072g912L4134J2855j2219l856N828k2415k2873L0562l316j7826l5752j9918
$$ -7912 26222 39077 26858 23002 28830 6415 -16458 14104 10788 -7038 -42790 -62708
14060f2708K130J1449r231K6817M2182L419k0077j7774k754K6371o211q694q659
$$ -62708 -60578 -49129 -58360 -31543 10639 14058 -6019 -23793 -26547 -176 -6387 -15081 -23740
14047b3740k1571p550j422K3854J5434J3164J5030j7648K3711J700J2481q51k1062
$$ -23740 -45311 -52861 -54283 -30429 -14995 -1831 13199 -4449 19262 20962 33443 32592 11530
14034A1530J922J3418K5766O451k1782p883j0310q895K0049L668j9746q787q601
$$ 11530 13452 26870 52636 59087 37305 29422 19112 10217 30266 33934 14188 5401 -3200
14021c200K4358j517j7500o981l829q869L483P217r617p735P989k098J8669j486
$$ -3200 21158 19641 2141 -4840 -8669 -17538 -14055 -6838 -16455 -24190 -16201 -18299 370 -1116
14007a116j2411O198l657j2663P661R616q086J6937o80l4700k2973L3055L7065
$$ -1116 -13527 -7329 -10986 -23649 -15988 -6372 -14458 2479 1799 -32901 -55874 -22819 14246
13994A4246J9019L094p161l0320J277J2743n158k306n549M172O081O685j7761
$$ 14246 33265 36359 29198 -1122 155 12898 7740 5434 -115 4057 10138 16823 -938
13981i38R789L804n253l3748k8835J6053J9767O065K2026j2076j1754K1514L5231
$$ -938 8851 12655 7402 -26346 -55181 -39128 -19361 -13296 8730 -3346 -15100 6414 41645
13968D1645K744l456k7906o877j7800K454m321J5840L637J6141j8218J5087l144
$$ 41645 44389 40933 13027 6150 -11650 -9196 -13517 2323 5960 22101 3883 18970 15826
13955A5826K0959J8495o793J494N415o378N306q006j167k9664p129o233n454J0381
$$ 15826 36785 55280 48487 49981 55396 49018 54324 46318 45151 15487 8358 2125 -3329 7052
13941G052m793j0633n814j966J0998J8348m15L468n146n3466Q222J0016J460o115
$$ 7052 2259 -8374 -14188 -16154 -5156 13192 12777 16245 11099 -42367 -34145 -24129 -22669 -28784
13927b8784m410k2919o662o887K1593L0162J255j6833j6611M286J7611j068R792
$$ -28784 -33194 -56113 -62775 -69662 -48069 -17907 -16652 -33485 -50096 -45810 -28199 -29267 -19475
13914a9475l6728O51j1391n2395O035J3918K7030K227j5336R279K0156J521l0602
$$ -19475 -56203 -55552 -66943 -119338 -113303 -99385 -72355 -70128 -85464 -76185 -56029 -54508 -85110
13901h5110J4886M0643K3439j0385j3154j0879J0414J7243O038M4229j875j7298
$$ -85110 -70224 -29581 -6142 -16527 -29681 -40560 -30146 -12903 -6865 37364 35489 18191
13889A8191k6731m1409L471k7689p823M3564K3080p088J4283o803j4559j5824
$$ 18191 -8540 -49949 -46478 -74167 -81990 -38426 -15346 -22434 -8151 -14954 -29513 -45337
13877d5337m479K5479P585p937O531J4819M901j6163j1903L4972J342M544O303
$$ -45337 -49816 -24337 -16752 -24689 -18158 -3339 1562 -14601 -26504 8468 9810 14354 20657
13864B0657k2635l124l866J0765j0416o232J1416j2203J1872j6630j43R556K602
$$ 20657 -1978 -5102 -8968 1797 -8619 -14851 -3435 -15638 -3766 -20396 -20539 -10983 -8381
13851h381J8574n207O227p151j3311j0509j863k2234q815J2503J8771J6749l290
$$ -8381 10193 4986 11213 4062 -9249 -19758 -21621 -43855 -52670 -40167 -21396 -4647 -7937
13838g937p460K2q518o566J3823K3486n000j9161k6901o844L0122O736j1957K4391
$$ -7937 -15397 -15375 -23893 -30459 -16636 6850 1850 -17311 -44212 -51056 -20934 -14198 -26155 -1764
13824a764K2545J4371n9178l0088Q205N858J5950K3406O450o396j7120q937k549
$$ -1764 20781 35152 -24026 -54114 -45909 -40051 -24101 -695 5755 -641 -17761 -26698 -29247
13811b9247J1712R214k9025J887J2475j6200K3965J5004k79k3635J3500K8239
$$ -29247 -17535 -8321 -37346 -35459 -22984 -39184 -15219 -215 -494 -24129 -10629 17610
13799A7610J3209k4115p255r751j2339J0292L841j3885r05J3833q298J9243K7265
$$ 17610 30819 6704 -551 -10302 -22641 -12349 -8508 -22393 -23298 -9465 -17763 1480 28745
13786B8745M237l403L423j119j4409j9719o2206R925J8572M0806J4937j7136j2194
$$ 28745 32982 29579 33002 31883 17474 -2245 -64451 -54526 -35954 4852 19789 2653 -9541
13773i541R140k5159m8228o746r630K6419J7350o125k3715J2086K4588M06j6424
$$ -9541 -401 -25560 -73788 -80534 -90164 -63745 -46395 -52520 -76235 -64149 -39561 -39155 -55579
13760e5579r782N2316L3571k0114j3528k6213m228J6100M284J876j8530J8006
$$ -55579 -65361 -13045 20526 412 -13116 -39329 -43557 -27457 -23173 -21297 -39827 -21821
13748b1821J3326j322J5082k2265k1728J3017L0684l1361p075K1979L2286q259
$$ -21821 -8495 -9817 5265 -17000 -38728 -25711 4973 -26388 -33463 -11484 20802 12543
13736A2543J1599j1371l2540L302J3862n778J3839J5459o46J2261j0840j6001
$$ 12543 24142 12771 -19769 -16467 -2605 -8383 5456 20915 20269 32530 21690 5689
13724E689O994o664k1050o022n895p773l928l227J6610K6502J5570K192j4276
$$ 5689 12683 6019 -15031 -21053 -26948 -34721 -38649 -41876 -25266 1236 16806 18998 4722
13711D722J965r774j993J6904n276o296J4643o301J1595n171k7997M032J1476
$$ 4722 6687 -3087 -5080 11824 6548 252 14895 8594 20189 15018 -12979 -8947 2529
13698B529k0865k1640r925J3278J3572m474m0051J3535j933J0977L4393L9243
$$ 2529 -18336 -39976 -49901 -36623 -23051 -27525 -67576 -54041 -55974 -44997 -10604 28639
13686B8639N981n037m904m0972j8526K4940j4498Q13L4078M525j7036j7112j9417
$$ 28639 34620 29583 24679 -16293 -34819 -9879 -24377 -23564 10514 15039 -1997 -19109 -38526
13673c8526M169J0071P934N936K5383l914k0045k5141p026K2915J5257J3319l485
$$ -38526 -34357 -24286 -16352 -10416 14967 11053 -8992 -34133 -41159 -18244 -2987 10332 6847
13660F847J3337j7390j3257K426q88p113k0618P23J0737j0075K364O864j3707
$$ 6847 20184 2794 -10463 -8037 -8925 -16038 -36656 -35933 -25196 -35271 -32907 -26043 -39750
13647c9750K9040K1401K1212j793p877k3230M863N830m712R450Q536J4940q009
$$ -39750 -10710 10691 31903 30110 22233 -997 3866 9696 4984 14434 22970 37910 29901
13634B9901m7824k1237J9057K725q437j2701j691J2377j779J5771L426j4805j6519
$$ 29901 -17923 -39160 -20103 -17378 -25815 -38516 -40207 -27830 -29609 -13838 -10412 -25217 -41736
13621d1736j2099q762J5136K5170J958P709n928j3855p323r575K2207R842p626
$$ -41736 -53835 -62597 -47461 -22291 -20333 -12624 -18552 -32407 -39730 -49305 -27098 -17256 -24882
13608b4882K3189J337k6344R38J0108p890r002K9959L3035j8598k6284K3693L288
$$ -24882 -1693 -356 -26700 -25762 -15654 -23544 -32546 -2587 30448 11850 -14434 9259 12547
13595A2547j9118k5911J590J1404l974j0729O073J9437k336k328Q39J4971J6051
$$ 12547 -6571 -32482 -30892 -19488 -23462 -34191 -28118 -8681 -11017 -13345 -12506 2465 18516
13582A8516K142j4301j290l645k9757k727J5309L911J1476j3419n691o348j6655
$$ 18516 20658 6357 5067 1422 -28335 -31062 -15753 -11842 -366 -13785 -19476 -25824 -42479
13569d2479j7171Q888J1912J215j2360L2623l062m9690l492K2560J3748j3742
$$ -42479 -59650 -50762 -38850 -37635 -49995 -17372 -20434 -70124 -73616 -51056 -37308 -51050
13557e1050K237P820J4981L339j6346j4740M365K2111J0876K2945K0385j0764
$$ -51050 -48813 -40993 -26012 -22673 -39019 -53759 -49394 -27283 -16407 6538 26923 16159
13545A6159P860J6841j3038k3105j7854q797k696m978l1724J5678j0143Q195J8181
$$ 16159 24019 40860 27822 4717 -13137 -21934 -24630 -29608 -61332 -45654 -55797 -47602 -29421
13532b9421j5084p533j466J6610J4938J2583M124j305K9634j2847m56J355j4192
$$ -29421 -44505 -52038 -53504 -36894 -21956 -9373 -5249 -6554 23080 10233 9777 11132 -3060
13519c060k536j8288p99j9349j3448J184j606J629K3077K1933o081j025k9292
$$ -3060 -5596 -23884 -24683 -44032 -57480 -56296 -57902 -56273 -33196 -11263 -17344 -18369 -47661
13506d7661J2009K0842J2737q676r491j4627R059J6862j7173r007K0193k6796
$$ -47661 -35652 -14810 -2073 -10749 -20240 -34867 -25808 -8946 -26119 -35126 -14933 -41729
13494d1729j3641J4369J3382k050K940k911Q690J6628j6905j0928m667j50P781
$$ -41729 -55370 -41001 -27619 -29669 -26729 -29640 -20950 -4322 -21227 -32155 -36822 -36972 -29191
13481b9191k354j3847L984N128R758J3594K0216J9593l554o551j4198r443J997
$$ -29191 -31545 -45392 -41408 -36280 -26522 -12928 7288 26881 23327 16776 2578 -6865 -4868
13468d868j6042j874j5692P449j135r651j1072P63K2466J7465J7465K018Q831
$$ -4868 -20910 -22784 -38476 -31027 -32162 -41813 -52885 -52122 -29656 -12191 5274 7292 16123
13455A6123j46Q99o582k0646L733J4378q398n382M064K0109p163m820O205j127
$$ 16123 15977 16876 10294 -10352 -6619 7759 -639 -6021 -1957 18152 10989 6169 12374 11247
13441A1247P400m301k5838N404J075k0087O879J84l3716N494K8303K0691R25l955
$$ 11247 18647 14346 -11492 -6088 -5013 -25100 -18221 -18037 -51753 -46259 -17956 2735 3660 -295
13427b95K045J7161p66j297r486k0348j0076p463K0296n824k813M887L637j0343
$$ -295 1750 18911 18145 16848 7362 -12986 -23062 -30525 -10229 -16053 -18866 -13979 -10342 -20685
13413b0685K5520J435k8052j2111J919J9430k0899K1901L07j1810j4851K7629
$$ -20685 4835 6270 -21782 -33893 -31974 -12544 -33443 -11542 -11235 -23045 -37896 -10267
13401a0267O210L548N384Q767j7431q150j5727m521j7630l406K4027k20K1607
$$ -10267 -4057 -509 4875 13642 -3789 -11939 -27666 -32187 -49817 -53223 -29196 -29416 -7809
13388g809N915q173j2449j0628R150j0008p823O716Q447K24j5440n910K0842P311
$$ -7809 -1894 -10067 -22516 -33144 -23994 -34002 -41825 -35109 -26662 -26438 -41878 -47788 -26946 -19635
13374a9635J5543J012j5459j4J6147j6572m3482p032Q130K7645K506j2774J5408
$$ -19635 -4092 -3080 -18539 -18553 -2406 -18978 -62460 -69492 -61362 -33717 -31211 -43985 -28577
13361b8577J9087l561k6037k5056P805J2568K2231l013l297k338n97n0j0056J6998
$$ -28577 -9490 -13051 -39088 -64144 -56339 -43771 -21540 -24553 -27850 -30188 -30785 -30835 -40891 -23893
13347b3893L0059J6097l6829M782Q513k665K7454j0234j0865j5366P397K2899
$$ -23893 6166 22263 -14566 -9784 -1271 -3936 23518 13284 2419 -12947 -5550 17349
13335A7349L646J1542L434l449Q831o384l650k0920j2259j399P965M793j6015
$$ 17349 20995 32537 35971 32522 41353 34969 31319 10399 -1860 -3259 4706 9499 -6516
13322f516j2603r650K1307J8840j8302K190J1384J6653J7432k0080j8804L286
$$ -6516 -19119 -28769 -7462 11378 -6924 -4734 6650 23303 40735 20655 1851 5137
13310E137L4839J8809k2969j2083J5748J8970m922j4613K3365J988j3963k8798
$$ 5137 39976 58785 35816 23733 39481 58451 53529 38916 62281 64269 50306 21508
13298B1508j2709q88q903m39M713J5491k171r084K974J7990q472P039j2290k2465
$$ 21508 8799 7911 -992 -1431 3282 18773 16602 7518 10492 28482 20010 27049 14759 -7706
13284g706q167K1914j8639J0147j5080l0981k2946l063K6892K9725L9283o842
$$ -7706 -15873 6041 -12598 -2451 -17531 -48512 -71458 -74521 -47629 -17904 21379 14537
13272A4537k794J572L0980J1534j4333o110k0682j0979J0597k0183J6097M944
$$ 14537 11743 13315 44295 55829 41496 35386 14704 3725 14322 -5861 10236 15180
13260A5180L228q504k214k833J412K722J3072j6379j931J7585k2230r889K7294
$$ 15180 18408 9904 7690 4857 6269 8991 22063 5684 3753 21338 -892 -10781 16513
13247A6513J7887j5149K2585K231j1762q325N706L403K2632M094j8790K3731k3402
$$ 16513 34400 19251 41836 44067 32305 23980 29686 33089 55721 59815 41025 64756 41354
13234D1354J487K5003j542M115K367J4209j379J7353j575k1480j6055k161J888
$$ 41354 42841 67844 66302 70417 72784 86993 85614 102967 101392 79912 63857 61696 63584
13221F3584P699l3159o967l450P928J750J6185n554j1657M406j6951o669p509
$$ 63584 71283 38124 31157 27707 35635 37385 53570 48016 36359 40765 23814 17145 9636
13208I636j7283M195J3534m619n266M0055J1672j1188K7716k046o928K3089J6219
$$ 9636 -7647 -3452 10082 5463 197 40252 51924 40736 68452 66406 59478 82567 98786
13195I8786P998k6092l5793j3618L446J966k8644N299n779J1516j010J0428M998
$$ 98786 106784 80692 44899 31281 34727 36693 8049 13348 7569 19085 18075 28503 33501
13182C3501j7322j1294k809J084K345k6867o424K7452K269k6333N022J1115P352
$$ 33501 16179 4885 2076 3160 5505 -21362 -27786 -334 1935 -24398 -19376 -8261 -909
13169i09j5817K0773L4641P799j5767l8712j4836J5190K2344K8729J4437J1537
$$ -909 -16726 4047 38688 46487 30720 -7992 -22828 -7638 14706 43435 57872 69409
13157F9409o398J9882M9655M9805K6618L0011N8135O071l919m3068o0192m2053
$$ 69409 63011 82893 132548 182353 208971 238982 297117 303188 299269 256201 196009 153956
13145A53956k8010m315k9567j3359k7649j0487P512M5119J7230k4785l4788k1003
$$ 153956 125946 121631 92064 78705 51056 40569 48081 93200 110430 85645 50857 29854
13133B9854l695l2580L509P207J7634o776q066N719l275j2003Q806P001J9156
$$ 29854 26159 -6421 -2912 4295 21929 15153 7087 12806 9531 -2472 6334 13335 32491
13120C2491L5849J688q739k558j8831J2286M457K4757n61M1566M4636J3472M4916
$$ 32491 68340 70028 61289 58731 39900 52186 56643 81400 80839 122405 167041 180513 225429
13107B25429N8428M0721o963k6328J997l2672l6089n6291l9834j4601k0820m7677
$$ 225429 283857 324578 317615 291287 293284 260612 224523 168232 128398 113797 92977 45300
13095D5300j5362J4345j0537k988j9909k5367j5480P459K7108K3098J5229J5852
$$ 45300 29938 44283 33746 30758 10849 -14518 -29998 -22539 4569 27667 42896 58748
13083E8748j643n854l9766j3156J6809K1341K965r059n054j887O319M997M1980
$$ 58748 57105 51251 11485 -1671 15138 36479 39444 30385 25331 23444 29763 34760 76740
13070G6740r266k6156n219K3051l169j1834O790m132K6793K6580K88p719K0119
$$ 76740 67474 41318 36099 59150 55981 44147 50937 46805 73598 100178 100466 92747 112866
13057A12866Q441k6801k8183l685o373J7070j0653j0968J4556p378k0969k5021
$$ 112866 121307 94506 66323 62638 56265 73335 62682 51714 66270 58892 37923 12902
13045A2902Q784l135j1332R907K3426J6568o0r965J4221p209m998m5404p742J5052
$$ 12902 21686 18551 7219 17126 40552 57120 57060 47095 61316 54107 49109 3705 -4037 11015
13031A1015J3345q09p952p056q460o285K0636j476j1203Q731j2717o020J5402
$$ 11015 24360 23551 15599 8543 83 -6202 14434 12958 1755 10486 -2231 -8251 7151
13018G151j8648p687J4198M1286M260p440k5928M464J1452L250K8661o812l917
$$ 7151 -11497 -19184 -4986 36300 40560 33120 7192 11656 23108 26358 55019 48207 44290
13005D4290j9104j4706J3074j6235j0203K5039J3777j921k5090l815O710N214
$$ 44290 25186 10480 23554 7319 -2884 22155 35932 34011 8921 5106 11816 17030
12993A7030J3668K3014J9151p27K459j7473l2989J2584p107j2260P039k633J0963
$$ 17030 30698 53712 72863 72136 74595 57122 24133 36717 29610 17350 24389 21756 32719
12980C2719K5282M9390K42m3292j5028J4865k8080R074L2697J8029m594j4071
$$ 32719 58001 107391 107633 64341 49313 64178 36098 45172 77869 95898 91304 77233
12968G7233n747M138l166j5620K5462L3089l223r616O71j8621k8404j1043j5302
$$ 77233 71486 75624 72458 56838 82300 115389 112166 102550 103221 84600 56196 45153 29851
12955B9851M653L6073K7767j0270j7630K6931J4930o224K0412l16j3209j2336
$$ 29851 34504 70577 98344 88074 70444 97375 112305 106081 126493 126177 112968 100632
12943A00632J780K0034L0610P218K5069K9367O7103R4991J10189Q0814O5951J11909
$$ 100632 102412 122446 153056 160274 185343 214710 281813 376804 486993 567807 633758 745667
12931G45667Q6144L2623L4499L4036K2442Q431o591n4053q2808r9366r1891o7090
$$ 745667 831811 864434 898933 932969 955411 963842 957251 903198 820390 721024 629133 562043
12919E62043q6769j02288o8295l4867l5941N03r938Q985J2129k995o0508l8606
$$ 562043 475274 372986 304691 269824 233883 234386 224448 233433 245562 242567 182059 143453
12907A43453j0221k7872k9658K6726k569m545j828n073P333j8166k1805Q100k2774
$$ 143453 133232 105360 75702 102428 99859 95314 93486 88413 95746 77580 55775 63875 41101
12894D1101j1060R414K5557o815j378J77J3800N350P550J0174j1309k7953o713
$$ 41101 30041 39455 65012 58197 56819 56996 70796 76146 83696 93870 82561 54608 47895
12881D7895j4117J1361q916K082j0781k380J1685J5582O544k6617K452p790j4292
$$ 47895 33778 45139 36223 38305 27524 25144 36829 52411 58955 32338 34790 27000 12708
12868A2708r691j5481n071J675p245j9091l787J5114K0891k812j1803l705k601
$$ 12708 3017 -12464 -17535 -15860 -23105 -42196 -45983 -30869 -9978 -12790 -24593 -28298 -30899
12855c0899J5697J9669Q631L354m699R050o776k7197j0025L4831J7566l0036l952
$$ -30899 -15202 4467 13098 16452 11753 20803 14027 -13170 -23195 11636 29202 -834 -4786
12842d786M0583J9070J0025j1624r201o480q266k9421J3352q509j0215L6982L186
$$ -4786 35797 54867 64892 53268 44067 37587 29321 -100 13252 4743 -5472 31510 34696
12829C4696j1368j0084J0105K0959M543p848r459j1736L068M011o780n423J0517
$$ 34696 23328 13244 23349 44308 48851 41003 31544 19808 22876 26887 20107 14684 25201
12816B5201K532K160j622J1099o047p522m6612j4265K1253o693q378M4522K6290
$$ 25201 27733 29893 28271 39370 33323 25801 -20811 -35076 -13823 -20516 -28894 15628 41918
12803D1918j9420p756R410R956K9250l149k2403p995P755K7243j1878l3412K921
$$ 41918 22498 14742 24152 34108 63358 60209 37806 29811 37566 64809 52931 19519 22440
12790B2440L002p144K1458r814J7016K8784P48m1436j1390m893r718J3671P336
$$ 22440 25442 18298 39756 29942 46958 75742 76490 35054 23664 18771 9053 22724 30060
12777C0060n434R849j1123j1956J7794K1084p745N836K4270M2525O113j7444L1917
$$ 30060 24626 34475 23352 11396 29190 50274 42529 48365 72635 115160 121273 103829 135746
12764A35746L6204L0603j1316K6052L9912j384p002o583n928l1009l8215l2072
$$ 135746 171950 202553 191237 217289 257201 255817 248815 242232 236304 205295 167080 135008
12752A35008p983Q225P252l3208k4098J2758l610l5161j200K2920O896L1916J8934
$$ 135008 127025 135250 142502 109294 85196 97954 94344 59183 57983 80903 87799 119715 138649
12739A38649j4400l5252j2524l0022j2098J3234l379k1164J0993q744o653j1482
$$ 138649 124249 88997 76473 46451 34353 47587 44208 23044 34037 25293 18640 7158
12727G158n943K3258K1293J5630k7960r834K8067p8M526p96q14L2260J7599K589
$$ 7158 1215 24473 45766 61396 33436 23602 51669 51591 56117 55321 54507 86767 104366 106955
12713A06955L1821O896k765J8403k3431k5869o861l309J0302K4285K9781k7114
$$ 106955 138776 145672 142907 161310 137879 112010 105149 101840 112142 136427 166208 139094
12701A39094O415O768k283o089p669J9213O131J767m4907l4433J1508J6949n283
$$ 139094 145509 152277 149994 143905 136236 155449 161580 163347 118440 84007 95515 112464 107181
12688A07181k9137n047j0550K836Q619J2382j8503k9352J6191L5558o481k8097
$$ 107181 78044 72997 62447 65283 73902 86284 67781 38429 54620 90178 83697 55600
12676E5600k871N094j6232l049K822k39K22L7236K5840K2952J8603P88l581l535
$$ 55600 52729 57823 41591 38542 41364 41125 41347 78583 104423 127375 145978 146766 143185 139650
12662A39650J3850l617k0006J0374K6336O414J884P352l355R748k249n045J9707
$$ 139650 153500 149883 129877 140251 166587 173001 174885 182237 178882 188630 186381 181336 201043
12649B01043m77J7254N8670M2215q049K0437M5285L3042N5647M6479P7339M5076
$$ 201043 200566 217820 276490 318705 310656 331093 376378 409420 465067 511546 588885 633961
12637F33961L4533J778K0654N2219O691j5502J9173j4859l2238k9047l4516m1644
$$ 633961 668494 670272 690926 743145 749836 734334 753507 738648 706410 677363 642847 601203
12625F01203j8751k3501m0864m8889j2097K0152O14l250R508L854l6444k3009
$$ 601203 582452 558951 518087 469198 457101 477253 477867 474617 484125 487979 451535 428526
12613D28526j2896k865l873j9658j3605K3579J3042n094J165K3800j2864j2450
$$ 428526 415630 412765 408892 389234 375629 399208 412250 407156 408321 432121 419257 406807
12601D06807P201K9096K4118k7058J7982O972M3695L6621K5645J8641L5177J5682
$$ 406807 414008 443104 467222 440164 458146 465118 508813 545434 571079 589720 624897 640579
12589F40579J2010j4527r094N849L8925J6523j7782J4550M0727L6907M819K2341
$$ 640579 652589 638062 628968 634817 673742 690265 672483 687033 727760 764667 769486 791827
12577G91827M9880L9133L8620J6019M4283M9607M7699N0503K2674N5632M8178
$$ 791827 841707 880840 919460 935479 979762 1029369 1077068 1127571 1150245 1205877 1254055
12566A254055N7682M3949K2442M6868O3653O8844N5677P8968O4946Q4269R1944
$$ 1254055 1311737 1355686 1378128 1424996 1488649 1557493 1613170 1692138 1757084 1841353 1933297
12555A933297J26032Q7026P2638J52425J44142J58089K04037J96702J88520K04630
$$ 1933297 2059329 2146355 2218993 2371418 2515560 2673649 2877686 3074388 3262908 3467538
12545C467538K28237K55366K89198L10678L54141L80751M43968N17787N81719
$$ 3467538 3695775 3951141 4240339 4551017 4905158 5285909 5729877 6247664 6829383
12536F829383O17580P04792P76670Q54522R56962J053284J215266J374297J504821
$$ 6829383 7446963 8151755 8928425 9782947 10739909 11793193 13008459 14382756 15887577
12527A5887577J688037J930269K184218K515606K883506L370506L977631M872184
$$ 15887577 17575614 19505883 21690101 24205707 27089213 30459719 34437350 39309534
12519C9309534O124913P667738R549785J1649474J3788685J5748841J7204211
$$ 39309534 45434447 53102185 62651970 74301444 88090129 103838970 121043181
12512A21043181J7899732J7411188J5594813J2447227Q144622L112578k251659
$$ 121043181 138942913 156354101 171948914 184396141 192540763 195653341 193401682
12505A93401682p434374j1990194j5371817j7396736j7999756j7377913j5855061
$$ 193401682 185967308 173977114 158605297 141208561 123208805 105830892 89975831
12498H9975831j3800716j1448656r163006p175368n635243m477279l644471l049648
$$ 89975831 76175115 64726459 55563453 48388085 42752842 38275563 34631092 31581444
12490C1581444k654443k341343k122522j936051j698581j552257j421476j251627
$$ 31581444 28927001 26585658 24463136 22527085 20828504 19276247 17854771 16603144
12482A6603144j064299r34206q58456p71077p13738o85084o13281n45892n16347
$$ 16603144 15538845 14604639 13746183 12975106 12261368 11576284 10963003 10417111 9900764
12473I900764m81028m63458m04396m21090m13095l65223l11403k92855k76362
$$ 9900764 9419736 8956278 8551882 8130792 7717697 7352474 7041071 6748216 6471854
12464F471854k65707k45152k20505k43777k13372j64484j73333j40278j46680
$$ 6471854 6206147 5960995 5740490 5496713 5283341 5118857 4945524 4805246 4658566
12455D658566j91748j82207j65627j35761j33991j38846j18051j10552j06807
$$ 4658566 4466818 4284611 4118984 3983223 3849232 3710386 3592335 3481783 3374976
12446C374976j16059o8214o6676q5681q8766p2118p7167r7076r4077r3583q7269
$$ 3374976 3258917 3190703 3124027 3038346 2949580 2877462 2800295 2703219 2609142 2515559 2428290
12435B428290r0272j23954j22501r8405o9092p4110q5119r9485r1069n6872n3611
$$ 2428290 2338018 2214064 2091563 1993158 1924066 1849956 1764837 1665352 1574283 1517411 1463800
12424A463800n1951p2712l8057n6376o9624q0893o3525k3393k8656j0234l8202
$$ 1463800 1411849 1339137 1301080 1244704 1175080 1094187 1030662 1007269 978613 968379 930177
12413I30177k6636l7162j4064k3271p517j2577j1415l9386j5211l2954j5844p33
$$ 930177 903541 866379 852315 829044 821527 808950 797535 758149 742938 709984 694140 693407
12401F93407j5138j87j7082l0854j4552P725o500N508O235J1906n370k4082n703
$$ 693407 678269 678082 661000 630146 615594 623319 616819 622327 628562 640468 635098 611016 605313
12388F05313L40P272j165K0235j201q887j154L2923K910l9864j4093j1532j0065
$$ 605313 605653 612925 611760 631995 630794 621907 620753 653676 656586 616722 602629 591097 581032
12375E81032k0833M548o740R027O385k3105R314o0250K2196K3569j5084n650l424
$$ 581032 560199 564747 558007 567034 573419 550314 559628 499378 521574 545143 530059 524409 520985
12362E20985k4677k8478j7247J991O973k0422J7056J3889j6070q146L528L007
$$ 520985 496308 467830 450583 452574 459547 439125 456181 470070 454000 445854 449382 452389
12350D52389J5521K3673J7143K4484n144j215j60K333K671k3916q323P512J3028
$$ 452389 467910 491583 508726 533210 528066 526851 526691 529024 531695 507779 499456 506968 519996
12337E19996n116q399K6630K4692R331k4797k4315q36r595o114O346n410J3952
$$ 519996 514880 506481 533111 557803 567134 542337 518022 517186 507591 501477 507823 502413 516365
12324E16365P957J0020N619M27J6850K5286J6673j058n709J410J5613N5999N0965
$$ 516365 524322 534342 539961 540388 557238 582524 599197 598139 592430 593840 609453 665452 716417
12311G16417O1453O7931N9930O6142R0541J20344J17361J14548J64387K06251
$$ 716417 777870 845801 905731 971873 1062414 1182758 1300119 1414667 1579054 1785305
12301A785305K29445K66847L09604L47279M39618M13385M16871M11776L40623
$$ 1785305 2014750 2281597 2591201 2938480 3378098 3791483 4208354 4620130 4960753
12292D960753L09312K28346Q2007k7107j34667k59989l57023m15740m23195m19170
$$ 4960753 5270065 5498411 5580418 5553311 5418644 5158655 4801632 4385892 3962697 3543527
12282C543527l77746l84284l38261k97088k61535k36436j74689j28748r8716r8873
$$ 3543527 3165781 2781497 2443236 2146148 1884613 1648177 1473488 1344740 1246024 1147151
12272A147151j16756q0179m2993m2728l5472n9666m5554l6812m4904n6660k5412
$$ 1147151 1030395 950216 907223 864495 829023 769357 723803 686991 642087 585427 560015
12261E60015m730m3944k6424o777k247l1810m5576k4636k1840m995N658j6585
$$ 560015 555285 511341 484917 478140 475893 444083 398507 373871 352031 347036 352694 336109
12249C36109k1114k3198j2591p974l852L7117k6935k1574j3366k5902J8777L4483
$$ 336109 314995 291797 279206 271232 267380 304497 277562 255988 242622 216720 235497 269980
12237B69980L352l1113j7394r167l82k1876j1398m039k4868K2472K4729j6473
$$ 269980 273332 242219 224825 215658 215276 193400 182002 177963 153095 175567 200296 183823
12225A83823j6807M2617p04j1178l2039K110L2286J9231l279k1755l4022R944
$$ 183823 167016 209633 208929 197751 165712 167822 200108 219339 216060 194305 160283 170227
12213A70227J2144r662j6135o767K2789j1424k704M641j0508l3664M046P590J6148
$$ 170227 182371 172709 156574 149807 172596 161172 158468 163109 152601 118937 122983 130573 146721
12200A46721J3819j0774k2727N480L1052j34J1790J1124m821p88K5769K6371M1673
$$ 146721 160540 149766 127039 132519 163571 163437 175227 186351 181530 180742 206511 232882 274555
12187B74555K3578J9840P04K843j3174k5892n0075l4198J1679m808r449j8220
$$ 274555 298133 317973 318677 321520 308346 282454 232379 198181 209860 205052 195603 177383
12175A77383j9777K29k408J3139J4032k9851j6640j0459N370J3398K2626n485
$$ 177383 157606 157835 155427 168566 182598 152747 136107 125648 131018 144416 167042 161557
12163A61557k521m744l2750k2617J7524j0138j3255l089K0302J3394R336J3018
$$ 161557 159036 154292 121542 98925 116449 106311 93056 89967 110269 123663 132999 146017
12151A46017k5017l6724J61N44j7244J9129J9235J5666k586R665K350M377l3303
$$ 146017 121000 84276 84437 84981 67737 86866 106101 121767 119181 128846 131196 135573 102270
12138A02270P823K4953n278k343k193k2902J5573o278K825q50j5861K4793M2991
$$ 102270 110093 135046 129768 127425 125232 102330 117903 111625 114450 113600 97739 122532 165523
12125A65523j0072N730O589k4748j4900K4895R25m1507k0358j2050P299L8447
$$ 165523 155451 161181 167770 143022 128122 153017 153942 112435 92077 80027 87326 125773
12113A25773K9126j8023l1636R617K1166K7666l104q658J6185P922j3233L2489
$$ 125773 154899 136876 105240 114857 136023 163689 160585 151927 168112 176034 162801 195290
12101A95290M8372J6255M0660Q849j7046K6947L6459k918J637K0410K7493Q0075
$$ 195290 243662 259917 300577 309426 292380 319327 355786 352868 354505 374915 402408 482483
12089D82483O9931M6324R5864P6280P7662Q5121Q2603L9475J8874k0634n0898
$$ 482483 552414 598738 694602 770882 848544 933665 1016268 1055743 1074617 1053983 1003085
12078A003085m5482m4042j02958r3563n5399j11264o4564p0379o4114k2498j5500
$$ 1003085 957603 913561 810603 717040 661641 550377 485813 415434 351320 328822 313322
12067C13322l8730k2581k2676l6188l0617k3461j6668N009J1377j0663o990Q014
$$ 313322 274592 252011 229335 193147 162530 139069 122401 127410 138787 128124 121134 129148
12055A29148O827k3728J7676n313l5743j0512l6529n120j9023Q278J1995L1368
$$ 129148 135975 112247 129923 124610 88867 78355 41826 36706 17683 25961 37956 69324
12043F9324j4369o70J1913j1709J0262J0093K3675k3911L743K670M324K0449J187
$$ 69324 54955 54285 66198 54489 64751 74844 98519 74608 78351 81021 85345 105794 106981
12030A06981P523j723k5737k3171m837p065r065k1817k3896K8498O40l3361J8848
$$ 106981 114504 112781 87044 63873 59036 51971 42906 21089 -2807 25691 26331 -7030 11818
12017A1818K9736N830J9151O546j7563L62L706J6727j6758o273l1351o177j8810
$$ 11818 41554 47384 66535 73081 55518 55880 59586 76313 59555 53282 21931 15754 -3056
12004c056k3525J341J1558K2186K0439L0283m392J1306M3821J7725J8588j3705
$$ -3056 -26581 -25240 -13682 8504 28943 59226 54834 66140 109961 127686 146274 132569
11992A32569L1602J3322l1559J1424N8217K0598J3745M494L6279P0998N4924M6589
$$ 132569 164171 177493 145934 157358 215575 236173 249918 254412 290691 361689 416613 463202
11980D63202L9021J6487M4015L2083l2004o0416m1751j8961m7361o6295m9949
$$ 463202 502223 518710 562725 594808 562804 502388 460637 441676 394315 328020 278071
11969B78071l0553k8058l1613m3016l8527k841l2079k2297k9805J3125o916J0415
$$ 278071 247518 219460 187847 144831 106304 103463 71384 49087 19282 32407 25491 35906
11957C5906p55p876k6033r701n221K5787J8131k1678j7661j41k028J1270J7996
$$ 35906 35151 27275 1242 -8459 -13680 12107 30238 8560 -9101 -9242 -11270 0 17996
11944A7996o36k7302k914J2867p530O76M415N873J2875L0309L260l3054l362j164
$$ 17996 17360 -9942 -12856 11 -7519 -6843 -2428 3445 16320 46629 49889 16835 13473 12309
11930A2309J8183j714k8748l489l0300R278K6991M2984J0840L310m1016l2960
$$ 12309 30492 28778 30 -3459 -33759 -24481 2510 45494 56334 59644 18628 -14332
11918a4332L144J2002O355R014J1556j6041m150j0192J2488J0444q078k7579J3877
$$ -14332 -11188 814 7169 16183 27739 11698 7548 -2644 9844 20288 12210 -15369 -1492
11905a492q646k6864Q822L2753j3368k9061k1843J6801R877K1213J6840J7153
$$ -1492 -10138 -37002 -28180 4573 -8795 -37856 -59699 -42898 -33021 -11808 5032 22185
11893B2185J2726K1864j0156j9535j2759j5793J5334K7838j2607l695j6032J6450
$$ 22185 34911 56775 46619 27084 14325 -1468 13866 41704 29097 25402 9370 25820
11881B5820p028m366j1633j2146K1865r005j1635K6326K2157J3708K880L4117
$$ 25820 18792 14426 2793 -9353 12512 3507 -8128 18198 40355 54063 56943 91060
11869I1060k6022l6755l0693j3869k5409r960J8747M1093j5805j6418J8248K1965
$$ 91060 65038 28283 -2410 -16279 -41688 -51648 -32901 8192 -7613 -24031 -5783 16182
11857A6182J1611O630j9016J1024Q273Q403k634l6259J0110J1596J470k4885k1865
$$ 16182 27793 34423 15407 26431 34704 43107 40473 4214 14324 25920 27390 2505 -19360
11844a9360J3703L094K6360L815j1201L3P089j1803o0895l8363J5142K8028k242
$$ -19360 -5657 -2563 23797 27612 16411 16444 23533 11730 -49165 -87528 -72386 -44358 -46600
11831d6600J1208m414J8434J5519L9338j0360j4381j8158J406J6394k8441j1246
$$ -46600 -35392 -39806 -21372 -5853 33485 23125 8744 -9414 -8008 8386 -20055 -31301
11819c1301L6480K174l935J0468Q960j4013O073q615m359J9224J7030L922n090
$$ -31301 5179 7353 3418 13886 22846 8833 14906 6291 1932 21156 38186 42108 37018
11806C7018l1577j0996m560N945l0250M613L3282o757j1675J8307J8172N569q25
$$ 37018 5441 -5555 -10115 -4170 -34420 -29807 3475 -3282 -14957 3350 21522 27091 26266
11793B6266j4040P454l867j6596M228L3425J7152O33m7964m8587K1262J8459o552
$$ 26266 12226 19680 15813 -783 3445 36870 54022 54655 6691 -41896 -20634 -2175 -8727
11780h727k503r773N924j553m470K2374K7932k9034k6466J7939J587J8097l129
$$ -8727 -11230 -21003 -15079 -16632 -21102 1272 29204 170 -26296 -8357 -6770 11327 8198
11767H198M409j1364k2220R633o13l145J1739m13j8282m2821r075K9200J5296
$$ 8198 12607 1243 -20977 -11344 -11957 -15102 -3363 -3776 -22058 -64879 -73954 -44754 -29458
11754b9458N490K0911j3402Q513J2546j0433L2347K3684j5228l1203P556O431
$$ -29458 -23968 -3057 -16459 -7946 4600 -5833 26514 50198 34970 3767 11323 17754
11742A7754M90k6764l494K6573M982K246k3164r730L1087l357m8531j2234K4949
$$ 17754 18244 -8520 -12014 14559 19541 21787 -1377 -11107 19980 16623 -31908 -44142 -19193
11729a9193L2735j6214k1676r947J1541j1286J5359K575m091k487J6989k3678
$$ -19193 13542 -2672 -24348 -34295 -22754 -34040 -18681 -16106 -20197 -22684 -5695 -29373
11717b9373l8924j4326L6356L8056J6708o122j0487L509J1157j8356j1129J311
$$ -29373 -68297 -82623 -46267 -8211 8497 2375 -8112 -4603 6554 -11802 -22931 -21620
11705b1620R27L018L9249J1072k3279k1677l909l543M440N463O824O165m0117
$$ -21620 -20693 -17675 21574 32646 9367 -12310 -16219 -19762 -15322 -9859 -3035 3130 -36987
11692c6987n648p052j8586j8470o152J2996J0523J7092O707k2821L5215J5556
$$ -36987 -42635 -49687 -68273 -86743 -92895 -79899 -69376 -52284 -45577 -68398 -33183 -17627
11680a7627l616O399M34J4910J7802l756j3653n96l101k2973j4138J208q514J5342
$$ -17627 -21243 -14844 -14410 500 18302 14546 893 297 -2804 -25777 -39915 -38707 -47221 -31879
11666c1879J0081J1495P926j9153j7554r714k336l195j2935M831K2011K0648J6265
$$ -31879 -21798 -10303 -2377 -21530 -39084 -48798 -51134 -54329 -67264 -62433 -40422 -19774 -3509
11653c509l1638k1778J3677J220L427L114k716L400M1991J8313k5550k0264j1561
$$ -3509 -35147 -56925 -43248 -42028 -38601 -35487 -38203 -34803 7188 25501 -49 -20313 -31874
11640c1874J140K4554J8771o266O925j5469k2978J611n678O69P509r528K527K3458
$$ -31874 -30734 -6180 12591 6325 13250 -2219 -25197 -23586 -29264 -28595 -21086 -30614 -28087 -4629
11626d629l795j0861K1400J2569K0772L578k7282k8494J8744N374r073j2588N612
$$ -4629 -8424 -19285 2115 14684 35456 39034 11752 -16742 2002 7376 -1697 -14285 -8673
11613h673O224k8846J5802K5101P113j7719j2974r632J2469o466j0024j0313K3118
$$ -8673 -2449 -31295 -15493 9608 16721 -998 -13972 -23604 -11135 -17601 -27625 -37938 -14820
11600a4820L225j3730k849j6218K0371l0304j4179J7678j9592K6638K8056R25
$$ -14820 -11595 -25325 -28174 -44392 -24021 -54325 -68504 -50826 -70418 -43780 -15724 -14799
11588a4799N445k511m9910J9790J5908J8066j1964o304J148K8585N787j2011R775
$$ -14799 -9354 -11865 -61775 -41985 -26077 -8011 -19975 -26279 -25131 3454 9241 -2770 7005
11575G005j0275k806k6190%K4385n479J2341K327K010p130j3182L234L070J2997
$$ 7005 -3270 -6076 -32266 -32266 -7881 -13360 -1019 1308 3318 -3812 -16994 -13760 -10690 2307
11561B307K1134k502l211j5190j4655n352M967j9516q102J5292J3465K7636j8617
$$ 2307 23441 20939 17728 2538 -12117 -17469 -12502 -32018 -40120 -24828 -11363 16273 -2344
11548b344j8880K247J0916M577p772j2407q390k7358j1419J1865q74L575J8695
$$ -2344 -21224 -18977 -8061 -3484 -11256 -23663 -32053 -59411 -70830 -58965 -59839 -56264 -37569
11535c7569J969P618J2753r432o040K833O649j9723L990K0515J2089p634L408
$$ -37569 -35600 -27982 -15229 -24661 -30701 -27868 -21219 -40942 -36952 -16437 -4348 -11982 -8574
11522h574j3824J0178L678n459J366J000J100Q360j5287k9440k8848R44L7517
$$ -8574 -22398 -12220 -8542 -14001 -12635 -11635 -10535 -2175 -17462 -46902 -75750 -74806 -37289
11509c7289P134Q625n74J7150J3904k0430j2553j2863K056J9004P268J5328N39
$$ -37289 -30155 -21530 -22104 -4954 8950 -11480 -24033 -36896 -34840 -15836 -8568 6760 7299
11496G299k1702j590j355j7971K1733J2621l216K308l544j9579K1893K8859r92
$$ 7299 -14403 -15993 -17348 -35319 -13586 -965 -4181 -1873 -5417 -24996 -3103 25756 24764
11483B4764j4945k188R712j7741l5131K0306J9012j0295l545K156k090j7167j195
$$ 24764 9819 7631 17343 -398 -35529 -15223 3789 -6506 -10051 -7895 -9985 -27152 -28347
11470b8347m042m484J9461K7020K8928K754m0309m0268j2408R611O0518J6682
$$ -28347 -32389 -36873 -17412 9608 38536 41290 981 -39287 -51695 -42084 18434 35116
11458C5116l5351L387j3140J0210J5352J4345k447J589q031k8687K485j3005j4753
$$ 35116 -235 3152 -9988 222 15574 29919 27472 29061 21030 -7657 -5172 -18177 -32930
11445c2930k1513K1098M9216j7152l184k0681N565K1377K6526K340n400J721M808
$$ -32930 -54443 -33345 15871 -1281 -4465 -25146 -19581 1796 28322 30662 25262 26983 31791
11432C1791K972p325l0434J0757K1867o000k299k1365k147P918j8116O864K8134
$$ 31791 34763 27438 -2996 7761 29628 23628 21329 -36 -2183 5735 -12381 -5517 22617
11419B2617l529j9685j2895j5807L861k900k6367J1314P444n670j1436J077N280
$$ 22617 19088 -597 -13492 -29299 -25438 -28338 -54705 -43391 -35947 -41617 -53053 -51976 -46696
11406d6696J5137K2107J866J4307j0445j9858j1259M0406L0278J0087J503k2460
$$ -46696 -31559 -9452 -7586 6721 -3724 -23582 -34841 5565 35843 45930 47433 24973
11394B4973j9998J1841N249k293K4450J3480K0987O052N680J9092K0068o989O575
$$ 24973 4975 16816 22065 19772 44222 57702 78689 84741 90421 109513 129581 122592 129167
11381A29167j1777k1882J5107J8632j077J0435L4384M2380K1529m010M1487K0675
$$ 129167 117390 95508 110615 129247 128170 138605 172989 215369 236898 232888 274375 295050
11369B95050L4103M6058O1910N0687N0967L4218R3132J07922J37985J47917J99547
$$ 295050 329153 375211 437121 487808 538775 572993 666125 774047 912032 1059949 1259496
11358A259496K61275L45300L79894L49675L24291K44109J71763K8738j26234k57483
$$ 1259496 1520771 1866071 2245965 2595640 2919931 3164040 3335803 3364541 3238307 2980824
11348B980824l53322m24830l79411l21276k40840k00907j49072r2227p5536o6138
$$ 2980824 2627502 2202672 1823261 1501985 1261145 1060238 911166 818939 743403 677265
11338F77265q7780n6521l5568m2872l8285j1559k5626n4531n8098l4224j690j9962
$$ 677265 589485 532964 497396 454524 416239 404680 379054 324523 266425 232201 230511 210549
11326B10549n2526l090M762n384k4511Q124L3701j6323k9909Q26j629n741l741
$$ 210549 158023 154933 159695 154311 129800 137924 171625 155302 125393 126219 124590 118849 115108
11313A15108j7521K632r908m0946K132K0987m502M224K1866l834j6231K863q021
$$ 115108 97587 100219 90311 49365 51497 72484 67982 72206 94072 90238 74007 76870 68849
11300F8849j203j2693K8N59J8103m288m094j34j4352k1163j6864n567l944j0183
$$ 68849 67646 54953 54981 55540 73643 69355 65261 65127 50775 29612 12748 7181 3237 -6946
11286f946r151j7622J2436J5480q301Q235r23k46K6336K2113j44k7194j5023L570
$$ -6946 -16097 -33719 -21283 -5803 -14104 -5869 -6792 -7038 19298 41411 41267 14073 -950 2620
11272B620n729n791J0P423p080J422J5827K8081Q5m1426j0693J0919l750J977
$$ 2620 -3109 -8900 -8890 -1467 -8547 -7125 8702 36783 36868 -4558 -15251 -4332 -8082 -6105
11258f105K5771L1969k6069k5699J7472l104l324J3826L5429l919N580N542l5160
$$ -6105 19666 51635 25566 -133 17339 14235 10911 24737 60166 56247 61827 67369 32209
11245C2209J1654o370k396l598m030j0214j0555J4699j9338j6071K9203K2891
$$ 32209 43863 37493 35097 31499 27469 17255 6700 21399 2061 -14010 15193 38084
11233C8084J5717L538j7077J300J8227m7655J811K2546K121k0212r777j4627O107
$$ 38084 53801 57339 40262 41562 59789 12134 13945 36491 38612 18400 8623 -6004 103
11220A03J5123j3673m0498j9679J8101r527P927K333K3508L3399j1191k3398j0085
$$ 103 15226 1553 -38945 -58624 -40523 -50050 -42123 -39790 -16282 17117 5926 -17472 -27557
11207b7557J4948L315M783J1549J2120j774j7881p294j4070Q091L0705l423j3115
$$ -27557 -12609 -9294 -4511 7038 19158 17384 -497 -7791 -21861 -13770 16935 13512 397
11194C97k036j8114j1630J5460K5835R260j0924j5844M147Q871j497Q916L890
$$ 397 -1639 -19753 -31383 -15923 9912 19172 8248 -7596 -3449 5422 3925 12841 16731
11181A6731j845N099r200K042J03j438q986K084J4328O157K4967p90mk4835k2069
$$ 16731 14886 19985 10785 12827 12930 11492 2506 4590 18918 25075 50042 49252 49248 24413 2344
11166B344K8062P139L300j5708P5J4094J4422l46j9892l179k0009L473r946J0127
$$ 2344 30406 37545 40845 25137 25212 39306 53728 53382 33490 30311 10302 13775 3829 13956
11152A3956j769N18J8142J081J713K8268J2104M523l4050l2128q028J2251p131
$$ 13956 12187 12705 30847 31928 33641 61909 74013 78536 44486 12358 4330 16581 9450
11139I450R095k095J0215J1820J5235l4240j0102k007N268m156n999n821P08J6059
$$ 9450 18545 16450 26665 38485 53720 19480 9378 7371 12639 8483 2484 -3337 -2629 13430
11125A3430l0173r358J1226R020J3619L763k6841Q154n966R310P787N328L1098
$$ 13430 -16743 -26101 -14875 -5855 7764 11527 -15314 -7160 -13126 -3816 3971 9299 40397
11112D0397O893k1281J7481R912k4002o342J6424K1868l6500J895p346m3322o639
$$ 40397 47290 26009 43490 53402 29400 23058 39482 61350 24850 26745 19399 -23923 -30562
11099c0562K2459J515j5731p284r978J8066K4090j5480k381J7598j3361N72L5004
$$ -30562 -8103 -6588 -22319 -29603 -39581 -21515 2575 -12905 -15286 2312 -11049 -10477 24527
11086B4527K808K981K5716J0213p672n578J1137p471j2545k7575R352J576o364
$$ 24527 27335 30316 56032 66245 58573 52995 64132 56661 44116 16541 25893 27469 21105
11073B1105J675j2335J9731M948J527M601J0650l371m2990J997j7704j812M2249
$$ 21105 22780 10445 30176 35124 36651 41252 51902 48531 5541 7538 -10166 -11978 30271
11060C0271R716k526k3094n3708m998j4188L1210K603m163n770k340J0538j6358
$$ 30271 39987 37461 14367 -39341 -44339 -58527 -27317 -24714 -28877 -34647 -36987 -26449 -42807
11047d2807l905j2525P504j2978m143r30M7748K3081J7718M5520j755j5087j9690
$$ -42807 -46712 -59237 -51733 -64711 -68854 -69784 -22036 1045 18763 64283 62528 47441 27751
11034B7751l5165L026J4880K6625j4790j8233j4982q07K4707L483J2598O492l8599
$$ 27751 -7414 -4388 10492 37117 22327 4094 -10888 -11695 13012 16495 29093 35585 -3014
11021c014j270P209J3251p832k3410k6982K2704M4889p485k9055q073L28K2726
$$ -3014 -4284 2925 16176 8344 -15066 -42048 -19344 25545 18060 -10995 -19068 -18740 3986
11008C986J1629O99O718m41J550j4192j220L0084J2985o214q293l2358j4859J5542
$$ 3986 15615 16314 23032 22591 24141 9949 8729 38813 51798 45584 37291 4933 -9926 5616
10994E616J606k2890O164K0304Q205k6173L886m363L0039m173k1378o497P60j6099
$$ 5616 7222 -15668 -9504 10800 19005 -7168 -3282 -7645 22394 18221 -3157 -9654 -8894 -24993
10980b4993J7866K8128K344J3575j3455r2K88k593k5759l726L3263J7786j0625
$$ -24993 -7127 21001 23345 36920 23465 23373 23661 21068 -4691 -8417 24846 42632 32007
10967C2007k1110q707p918r905m847M3141j725k942N409L360R775j4328o905p49
$$ 32007 10897 2190 -5728 -15633 -20480 22661 20936 17994 23403 26763 36538 22210 15305 14556
10953A4556r631j5189j945K8311Q676O265j1894j6144J683J6708r706N304r682
$$ 14556 4925 -10264 -12209 16102 24778 31043 19149 3005 4688 21396 11690 16994 7312
10940G312R487j8121Q988p812Q597J455O831N0515K9874J586o006J437j8268k9125
$$ 7312 16799 -1322 7666 -146 8451 9906 16737 67252 97126 98712 92706 94143 75875 46750
10926D6750J230J5426R712l3841l4309K8289K2188J5145k8788J9541m907j8163
$$ 46750 47980 63406 73118 39277 4968 33257 55445 70590 41802 61343 56436 38273
10914C8273r438k508J2803J4929R731l911J7073K2124J2229l895K1364J1088J8423
$$ 38273 28835 26327 39130 54059 63790 59879 76952 99076 111305 107410 128774 139862 158285
10901A58285L322J9809k3412j5406O962N1356O7844O3982P1243O7459R2431J27937
$$ 158285 161607 181416 158004 142598 149560 200916 268760 332742 403985 471444 563875 691812
10889F91812J78681K32709K41762K10089J82184J38370P4813J0112j26566k35894
$$ 691812 870493 1103202 1344964 1555053 1737237 1875607 1950420 1960532 1833966 1598072
10879A598072l12863k92933k02374j51637r6954q0378n0702n1360n2480n1368
$$ 1598072 1285209 992276 789902 638265 541311 460933 410231 358871 306391 255023
10869B55023p7532q625P790L675Q044q664J4584j4186j3946j3261r892j7413j6449
$$ 255023 177491 168866 176656 180331 188375 179711 194295 180109 166163 152902 143010 125597 109148
10856A09148K6852L786l1893l7577K147R444J1552j4278k1648k4100j0589L0695
$$ 109148 136000 139786 107893 70316 72463 81907 93459 79181 57533 33433 22844 53539
10844E3539J0043j4128m07K3989o539k5479m1677k0389j8007p013N514L7307K5296
$$ 53539 63582 49454 49047 73036 66497 41018 -659 -21048 -39055 -46068 -40554 -3247 22049
10831B2049J9779q292k7254k3178J5911J7960J9503j9252k4769k0440j917n96
$$ 22049 41828 33536 6282 -16896 -985 16975 36478 17226 -7543 -27983 -29900 -30496
10819c0496J9735K0401J4663j4109J000q607k4449R87n890L4512M5586K6682k5696
$$ -30496 -10761 9640 24303 10194 11194 2587 -21862 -20875 -26765 7747 53333 80015 54319
10806E4319l3680O180q335j3477k3657o367Q748Q817J0051o233K8346K3115K1069
$$ 54319 20639 26819 18484 5007 -18650 -25017 -16269 -7452 2599 -3634 24712 47827 68896
10793F8896J0245k2072N547j4462m7148j959M816J2995k836J448j5258K4234K1994
$$ 68896 79141 57069 62616 48154 1006 -953 3863 16858 14022 15470 212 24446 46440
10780D6440R253l005k565n405k0028J244r843l524Q902n553O279L8162J8343j4395
$$ 46440 55693 52688 50123 44718 24690 25934 16091 12567 21469 15916 22195 60357 78700 64305
10766F4305J580J188m754j0783j2626n032p808j8342J4568M5103J3001l3018j2178
$$ 64305 65885 67073 62319 51536 38910 33878 26070 7728 22296 67399 80400 47382 35204
10753C5204J9782J220o545p185M874J0704K1433K1721J4219L045j5848j8628k7604
$$ 35204 54986 56206 49661 42476 47350 58054 79487 101208 115427 118472 102624 83996 56392
10740E6392m391j5208q351N120K925M2554n612Q360l7791k3039o128J5356N2592
$$ 56392 52001 36793 28442 33562 36487 79041 73429 81789 43998 20959 14831 30187 82779
10727H2779Q425K3244N5667Q187K0403M7545N5433K4413o809N025J9502r970j9188
$$ 82779 91204 114448 170115 178302 198705 246250 301683 326096 319287 324312 343814 333844 314656
10714C14656k4312j4569j2866k1162m1101m3169j9004n946j3574k4978m055n694
$$ 314656 290344 275775 262909 241747 200646 157477 138473 132527 118953 93975 89920 84226
10702H4226J077P786p645O098O394o8j1388j3213o092K214k2489k2321q305j8264
$$ 84226 85303 93089 85444 91542 97936 97868 86480 73267 67175 69389 46900 24579 16274 -1990
10688a990k6073Q422M040j3860O538J6094J8677K5456L5616P895N814J2576j3060
$$ -1990 -28063 -19641 -15601 -29461 -22923 -6829 11848 37304 72920 80815 86629 99205 86145
10675H6145l9656n321R949o087K603L0810N5243M0012N338q783m797M3425J8986
$$ 86145 46489 41168 51117 45030 47633 78443 133686 173698 179036 170253 165456 208881 227867
10662B27867k1580j8881M5458o030m4764m3205j4844k1034J78N6971J8048k0266
$$ 227867 206287 187406 232864 226834 182070 138865 124021 102987 103165 160136 178184 157918
10650A57918j4371L6181J0994k9699k9046j6625j6703k7612k5945j3410p94K776
$$ 157918 143547 179728 190722 161023 131977 115352 98649 71037 45092 31682 30888 33664
10638C3664J5605J0189K4689K4875n56j4709k1997j4625J6081O172Q048J0470
$$ 33664 49269 59458 84147 109022 108466 93757 71760 57135 73216 79388 87436 97906
10626I7906K353n565J7967m593J9119M3297Q408K8039L3149J7542L553M4K602
$$ 97906 100259 94694 112661 108068 127187 170484 178892 206931 240080 257622 261175 261219 263821
10613B63821K2430K7591J798m2945o0902J1964J22M0634M1628M9768K7596Q089
$$ 263821 286251 313842 315640 272695 211793 223757 223879 264513 306141 355909 383505 391594
10601C91594K6015N2122O5678O7358N3351R7592J08343J10748J16922R4473O6995
$$ 391594 417609 469731 535409 602767 656118 753710 862053 972801 1089723 1184196 1251191
10590A251191M6857j2201r2861j03566o3904q2599p9122l0018j6333j2521j1400
$$ 1251191 1298048 1285847 1192986 1089420 1025516 942917 863795 833777 817444 804923 793523
10579G93523k2981l2668k5137n3195m0033J9795O049P273k1074l012r072j7777
$$ 793523 770542 737874 712737 659542 619509 639304 645353 652626 631552 628540 619468 601691
10567F01691m21K510M515j7400r773O2626L0030L739l590K5583J9816k4654k1213
$$ 601691 601270 603780 608295 590895 581122 643748 673778 677517 673927 699510 719326 694672 673459
10554F73459m7941J3431N0082J0491o282K4231O1737M1225J0840M1898L0985L0981
$$ 673459 625518 638949 689031 699522 693240 717471 779208 820433 831273 873171 904156 935137
10542I35137K2826K6674M5003M0616J2834M9560M9945O9131O9064M7589K5882
$$ 935137 957963 984637 1029640 1070256 1083090 1132650 1182595 1251726 1320790 1368379 1394261
10531A394261M4237P4912M0799L7884M1493Q4172P0871P6349O9295N9976P1908
$$ 1394261 1438498 1513410 1554209 1592093 1633586 1717758 1788629 1864978 1934273 1994249 2066157
10520B066157N5618P9520R0582Q2018J16000R9946Q4276J04646J32443J63487
$$ 2066157 2121775 2201295 2291877 2373895 2489895 2589841 2674117 2778763 2911206 3074693
10510C074693J85654K20490K33184K21558K25377K55348L21354L31928L24340
$$ 3074693 3260347 3480837 3714021 3935579 4160956 4416304 4737658 5069586 5393926
10501E393926L51015L89305M54964M82704N53718O38175P81000Q73823R69399
$$ 5393926 5744941 6134246 6589210 7071914 7625632 8263807 9044807 9918630 10888029
10492A0888029J026378J121386J220772J331658J438287J622974J780322J900134
$$ 10888029 11914407 13035793 14256565 15588223 17026510 18649484 20429806 22329940
10484B2329940K033798K165268K417444K753406L193672L726281M464034N498134
$$ 22329940 24363738 26529006 28946450 31699856 34893528 38619809 43083843 48581977
10476D8581977P007970Q960154J1592193J5133679K0211800K7609347L7390654
$$ 48581977 55589947 64550101 76142294 91275973 111487773 139097120 176487774
10469A76487774M6823556M9747432M2492965L0476562K0163933R677010n549407
$$ 176487774 223311330 273058762 315551727 346028289 366192222 375869232 370319825
10462C70319825k8491762n1356002n8995609n0764782l7787813k7071898j9566973
$$ 370319825 341828063 290472061 231476452 180711670 142923857 115851959 96284986
10455I6284986j4407237j0879794q436885o643364n359881m367657l641334l156948
$$ 96284986 81877749 70997955 62561070 55917706 50557825 46190168 42548834 39391886
10447C9391886k742898k436478k235920k122292k041295j899679j669948j493926
$$ 39391886 36648988 34212510 31976590 29854298 27813003 25913324 24243376 22749450
10439B2749450j305908j164284j042078r57044r14071q41290p93066p54821p09722
$$ 22749450 21443542 20279258 19237180 18280136 17366065 16524775 15731709 14976888 14267166
10430A4267166o57081o47572o35341n72288n10474m86067m31859m12843m11332
$$ 14267166 13610085 12962513 12327172 11754884 11244410 10758343 10326484 9913641 9502309
10421I502309l68930l76168l27481k76479l02576k62413k61221k29438k60165
$$ 9502309 9133379 8757211 8429730 8153251 7850675 7588262 7327041 7097603 6837438
10412F837438k40109k01431k01192k26723k10295k05391j78202j72533j23993
$$ 6837438 6597329 6395898 6194706 5967983 5757688 5552297 5374095 5201562 5077569
10403E077569q3817j16018j04864p2717r0315j09812q3644j01508j16139j20482
$$ 5077569 4993752 4877734 4772870 4700153 4609838 4500026 4416382 4314874 4198735 4078253
10393D078253j37396j36506j55973j90901j95511j79178j60239j60201j40677
$$ 4078253 3940857 3804351 3648378 3457477 3261966 3082788 2922549 2762348 2621671
10384B621671j27887j28213r3424j04359j16364j01430o0889n1514n3170m9407
$$ 2621671 2493784 2365571 2272147 2167788 2051424 1949994 1889105 1837591 1784421 1735014
10374A735014p4680q5937r1367n1730k8803j9961l1617k1397L1793J628m6942
$$ 1735014 1660334 1574397 1483030 1431300 1402497 1382536 1350919 1329522 1361315 1362943 1316001
10363A316001j7212j6715o489K0543L6680J2985J2758j2888l1478k9566k6785
$$ 1316001 1298789 1282074 1275585 1296128 1332808 1345793 1358551 1345663 1314185 1284619 1257834
10352A257834j4263n5628n1962n9351k0841k5888M403J4207j4085j3180L0595
$$ 1257834 1243571 1187943 1135981 1076630 1055789 1029901 1034304 1048511 1034426 1021246 1051841
10341A051841R812k8867j5383J6263M4632q485O514k4526o3583p2606l4882J42
$$ 1051841 1061653 1032786 1017403 1033666 1078298 1069813 1076327 1051801 988218 915612 880730 880872
10329H80872p118k6190J109Q645N665J7508l652L502k2710l2646l4071m5170k6388
$$ 880872 873754 847564 848673 857318 862983 880491 876839 880341 857631 824985 790914 745744 719356
10316G19356o035O947k1122k1091J1361L9080j6796m915J5912J3022K5094P250
$$ 719356 713321 720268 699146 678055 689416 728496 711700 706785 722697 735719 760813 768063
10304G68063O242J9118J4131j1353m2735j1519j2777J2227N718k2197k978k99
$$ 768063 774305 793423 807554 796201 753466 741947 729170 741397 747115 724918 721940 721641
10292G21641k3177j9341n235l2633j7937l8152p924L1853j7286l9783O527K3807
$$ 721641 698464 679123 673888 641255 623318 585166 577242 609095 591809 552026 558553 582360
10280E82360J4131R732o044r725k5095n688k7605n1810l9253j1665k2234K1378
$$ 582360 596491 606223 600179 590454 565359 559671 532066 480256 441003 429338 407104 428482
10268D28482p41K031k4499k7773N910n986M376L6005j609k3479j2831J582j0879
$$ 428482 427741 429772 405273 377500 383410 377424 381800 417805 416196 392717 379886 381468 370589
10255C70589o234K803M087k3953J767N522R332K8593J7849j103j5599j7488k4389
$$ 370589 364355 367158 371245 347292 349059 354581 363913 392506 410355 409252 393653 376165 351776
10242C51776j6667k2348r181Q370l4539l7188o084J7100k322j6148J4259j4403
$$ 351776 335109 312761 303580 311950 277411 240223 234139 251239 248917 232769 247028 232625
10230B32625j9018j3762n527J6845L2548P943j0736j1907J9036N539l17j077r846
$$ 232625 213607 199845 194318 211163 243711 251654 240918 229011 248047 253586 253269 252192 242346
10217B42346l2836l6316N236M0253N4404K896j546k4008k0167j3315o290p717
$$ 242346 209510 173194 178430 218683 273087 275983 274437 250429 230262 216947 210657 202940
10205B02940K4511r082r541j1851j0980N377J4658Q66q088k9174j4875J7060P989
$$ 202940 227451 218369 208828 196977 185997 191374 206032 206898 198810 169636 154761 171821 179810
10192A79810R336J0971j194J094Q665q240k2028j8910J3707K2654K4907l2961
$$ 179810 189146 200117 198923 200017 208682 200442 178414 159504 173211 195865 220772 187811
10180A87811l1384l133k790K1803J2049M34m573M159q830q422Q008l226K442j1845
$$ 187811 156427 153294 150504 172307 184356 184790 180217 184376 175546 167124 175132 171906 174348 162503
10166A62503k988J2760R28J7836R405J5262j2789j6893j020L166k6370j3727l2170
$$ 162503 159515 172275 173203 191039 200444 215706 202917 186024 185004 188170 161800 148073 115903
10153A15903n242N2987K3645L1698J6494K21P529J1642L336M597M4701p455j4747
$$ 115903 110661 163648 187293 218991 235485 235706 243235 254877 258213 262810 307511 300056 285309
10140B85309L791L389L3855K7681K1469L8925Q540j2963L9269L1558L3108P5031
$$ 285309 289100 292489 326344 354025 375494 414419 422959 409996 449265 480823 513931 588962
10128E88962R8223J56272K18115K54327L14749K79571J98602J27355Q7622J1919
$$ 588962 687185 843457 1061572 1315899 1630648 1910219 2108821 2236176 2323798 2335717
10118B335717r1879k05561l36497l31905k61916j46093q8568p1607q4014p3146
$$ 2335717 2243838 2038277 1701780 1369875 1107959 961866 873298 801691 717677 644531
10108F44531k6442j9890l0855r145O041P621J2679K6975P180J187L5723L2495
$$ 644531 618089 598199 567344 558199 564240 571861 584540 611515 618695 619882 655605 688100
10096F88100L0176L7107K0341K9987J4179J8935O0839K8480Q6752J05092J03281
$$ 688100 718276 755383 775724 805711 819890 838825 899664 928144 1014896 1119988 1223269
10085A223269J37675J15740J10663J93644K45341K47821L19912L76911N05329
$$ 1223269 1360944 1476684 1587347 1780991 2026332 2274153 2594065 2970976 3476305
10076C476305O69337Q74000J022165J132075J128463J014584P52667M32095Q0684
$$ 3476305 4145642 5019642 6041807 7173882 8302345 9316929 10069596 10501691 10582375
10067A0582375l33875p86602j120455j249960j192802r96292p78840o04221m57142
$$ 10582375 10248500 9461898 8341443 7091483 5898681 4902389 4123549 3519328 3062186
10058C062186l47490k89026k12168j70139j38970q9452q2288n6614l9579o346
$$ 3062186 2714696 2425670 2213502 2043363 1904393 1814941 1732653 1676039 1636460 1630114
10048A630114j830L2808R3081J51318K13432J95045J61996J30626O7678J2487
$$ 1630114 1628284 1661092 1754173 1905491 2118923 2313968 2475964 2606590 2674268 2686755
10038B686755m9804j87604l05163l11089k72141k19654j69190j40313j08631p8091
$$ 2686755 2636951 2449347 2144184 1833095 1560954 1341300 1172110 1031797 923166 845075
10028H45075o8966l9838p9018n3452q832m003l6570k6572n0742l2452j1560k4271
$$ 845075 776109 736271 657253 603801 594969 590966 554396 527824 477082 444630 433070 408799
10016D08799L963J108j8875n473l912j4204l8880j8243j9205m519k7600K462l930
$$ 408799 412762 413870 394995 389522 385610 371406 332526 314283 295078 290559 262959 265421 261491
10003B61491o335L429J0433J3263l836j9033j9152L18k2078j7085N921r929K1499
$$ 261491 255156 258585 269018 282281 278445 259412 240260 240578 218500 201415 207336 197407 218906
9990B18906O901k0921k0962j0932j9099K33K8356l922M192l3022P024j8690P732
$$ 218906 225807 204886 183924 172992 153893 154126 182482 178560 182752 149730 156754 138064 145796
9977A45796J8564o71K2177J0268K4592J4861k524j2769j8633j2208l673q982j9000
$$ 145796 164360 163689 185866 196134 220726 235587 233063 220294 201661 189453 185780 176798 157798
9964A57798o638m556l2120j0007j2196j6844R22j7216J1657K1943J7934M2064
$$ 157798 151160 146604 114484 104477 92281 75437 76359 59143 70800 92743 110677 152741
9952A52741J2936l6492k4847q229p299K04j3750O248J0694j859J7395K8136J0938
$$ 152741 165677 129185 104338 96109 88810 89014 75264 81512 92206 90347 107742 135878 146816
9939A46816j8686j5104k5371j1355L3082J6835q024J6065q166l9645j3353k1809
$$ 146816 128130 113026 87655 76300 109382 126217 118193 134258 126092 86447 73094 51285
9927E1285j9897K554K8979j486j3331j9290m242K2091J0241j5449J9515J2508
$$ 51285 31388 33942 62921 61435 48104 28814 24572 46663 56904 41455 60970 73478
9915G3478n048k9948m8p053P340J2682q561r450L899Q594J0402K1431j9432j9118
$$ 73478 68430 38482 38434 31381 38721 51403 42842 33392 37291 45885 56287 77718 58286 39168
9901C9168J2079J3503J981j6995n496Q228l098K522r691j5966L423J4038J9405
$$ 39168 51247 64750 66731 49736 44240 52468 49370 51892 42201 26235 29658 43696 63101
9888F3101K3804j3388r893k09P412M802j3807J0557Q089K0110N854j5001j7913
$$ 63101 86905 73517 63624 63415 70827 75629 61822 72379 80468 100578 106432 91431 73518
9875G3518j2317J3283O581j8601R780J6025Q098j7037N600M819J5861L666q345
$$ 73518 61201 74484 81065 62464 72244 88269 96367 79330 84930 89749 105610 109276 100931
9862A00931N4544K5190l3932k6005J0200L6573Q777Q00R912J4432J6696L2981
$$ 100931 155475 180665 146733 120728 130928 167501 176278 177078 186990 201422 218118 251099
9850B51099M5451N8821O3427R2017J54128J51705J76368J64900J10713M9221O0578
$$ 251099 296550 355371 418798 510815 664943 816648 993016 1157916 1268629 1317850 1378428
9839A378428J7558j00757k55914k38802k03899j97863r6248o7406l985l057j3048
$$ 1378428 1395986 1295229 1039315 800513 596614 398751 302503 235097 231112 228055 215007
9828B15007k5984j7859j3850j7487j397m404K265q433k297r051r679j9787j4542
$$ 215007 189023 171164 157314 139827 138430 134026 136291 127858 125561 116510 106831 87044 72502
9815G2502l4415p33K2930J3480K4325l466l6574n993J7745k5977J103K2464J2195
$$ 72502 38087 37354 60284 73764 98089 94623 58049 52056 69801 43824 44927 67391 79586
9802G9586j5961O608J3062r060k6204r94j9454Q313K7322K602n457K1656P770
$$ 79586 63625 70233 83295 74235 48031 47037 27583 35896 63218 65820 60363 82019 89789
9789H9789j2658j2382m630j494R445j5448j792J5555m676J2853K425j4485O01
$$ 89789 77131 64749 60119 58625 68070 52622 50830 66385 61709 74562 76987 62502 63103
9776F3103K0131k70j8485m8943L823K8006L8025J6248j9570m8913l485J4171o358
$$ 63103 83234 82964 64479 15536 19359 47365 85390 101638 82068 33155 29670 43841 37483
9763C7483k5787R247J9783n818M920K247o495k7026K549k07Q797M9266J8078j2320
$$ 37483 11696 20943 40726 34908 39828 42075 35580 8554 11103 10896 19693 68959 87037 74717
9749G4717k362j5797k0655J5257p862J7673J9285j0306j8317j8354j4016K3270
$$ 74717 72355 56558 35903 51160 43298 60971 80256 69950 51633 33279 19263 42533
9737D2533J1066K058P676p533j9291P066J7392k780q577j8887J6522q520l3088
$$ 42533 53599 55657 63333 55800 36509 43575 60967 58187 49610 30723 47245 38725 5637
9724E637L379J7124J5027k5064k6987L5174j670J5797K0964K2001K936j4973j4192
$$ 5637 9016 26140 41167 16103 -10884 24290 22620 38417 59381 81382 84318 69345 55153
9711E5153j0275J304J9390j4374j9055k7044L025K6722J0060O94K7985P394j7120
$$ 55153 44878 46182 65572 51198 32143 5099 8124 34846 44906 45600 73585 80979 63859
9698F3859j5039J9317j0940m710M253n815j9352k2491K0829j4756J0343L7676
$$ 63859 48820 68137 57197 52487 56740 50925 31573 9082 29911 15155 25498 63174
9686F3174J2879k1725j4654k2419j904p803j4091j156m459J2326k700j7334l003
$$ 63174 76053 54328 39674 17255 15351 7548 -6543 -7699 -12158 168 -2532 -19866 -22869
9673b2869J7994L4886J0980j1648N644k6408J0774K0161R242j2560j0387j1806
$$ -22869 -4875 30011 40991 29343 34987 8579 19353 39514 48756 36196 25809 14003
9661A4003M244k1989l730J4512J0097J9215K7154m209n180p961j9439k412L8866
$$ 14003 18247 -3742 -7472 7040 17137 36352 63506 59297 54117 46156 26717 24305 63171
9648F3171L4110j7241l0752K48j1981L704o048j6980K4397L3736k0126K012l049
$$ 63171 97281 80040 49288 49536 37555 41259 35211 18231 42628 76364 56238 58250 55201
9635E5201j2096J2916j1282m3014k2821J2527Q547K2573J9419j0891j9003R729
$$ 55201 43105 56021 44739 1725 -21096 -8569 -22 22551 41970 31079 12076 21805
9623B1805K1832K2638r908k2622j8409j0250p234k16q312J7724J9840J4902j272
$$ 21805 43637 66275 56367 33745 15336 5086 -2148 -2364 -10676 7048 26888 41790 40518
9610D0518P883j8230k2892J7054J2095K0241Q25K86j0734j5426l154J9535j5280
$$ 40518 48401 30171 7279 24333 36428 56669 57494 57780 47046 31620 28466 48001 32721
9597C2721j1902k5129R622M7855P235K7091j6067j6048J9319J9914K804l7375
$$ 32721 20819 -4310 5312 53167 60402 87493 71426 55378 74697 94611 97415 60040
9585F0040k1986Q179q685k7160k1215K48P306j5554K7980K7064k2460l6818j2678
$$ 60040 38054 46233 37548 10388 -10827 -10579 -3273 -18827 9153 36217 13757 -23061 -35739
9572c5739j048R616J091Q672L8175L1261J2172k0403J819n318j1762j8255K469
$$ -35739 -36787 -27171 -26080 -17408 20767 52028 64200 43797 45616 40298 28536 10281 12750
9559A2750O645r06K0488K1872j5931L91j224P77Q153O237j570J5054j9139j7911
$$ 12750 19395 18489 38977 60849 44918 45309 44085 44862 53015 59252 57682 72736 53597 35686
9545C5686m5464n237J2924O187j592P826K960j6184O439L536l2939J3161L11J381
$$ 35686 -9778 -15015 -2091 4096 2504 10330 13290 -2894 3545 7081 -25858 -12697 -12386 -11005
9531a1005L320L1233P704Q447j321L023O056n863J8252n576K3433k9163j331R09
$$ -11005 -7685 23548 31252 39699 38378 41401 47457 41594 59846 54270 77703 48540 47209 48118
9517D8118K2962K925k3035O022O810k4898q439l500k3693j6477J9432m591k687
$$ 48118 71080 74005 50970 56992 63802 38904 30465 26965 3272 -13205 6227 1636 -1051
9504a051M578K0669K6205M321l113j7575J153j3839k6783J0700q653K0713K3538
$$ -1051 3527 24196 50401 54722 51609 34034 35187 21348 -5435 5265 -3388 17325 40863
9491D0863n341k3783J183J339J2207j3401n694j6955K723K0888l0607j4987J6475
$$ 40863 35522 11739 12922 14261 26468 13067 7373 -9582 -6859 14029 -16578 -31565 -15090
9478a5090J1749J6084J5217J4486K5634J3000l6950l921m275K7104M823j6150
$$ -15090 -3341 12743 27960 42446 68080 81080 44130 40209 35934 63038 67861 51711
9466E1711k7797j3669J040K8726k0023P728K5703P208j5609J4922J3007k1045
$$ 51711 23914 10245 11285 40011 19988 27716 53419 60627 45018 59940 72947 51902
9454E1902l2785j0602Q297L8542K5335j1208p678M546J5904j4564J2992L748l9253
$$ 51902 19117 8515 16812 55354 80689 69481 61803 66349 82253 67689 80681 84429 45176
9441D5176l6420J4529k5562O412Q103Q504J967L617J2209j4457J4577k076k7184
$$ 45176 8756 23285 -2277 4135 12238 20742 22709 26326 38535 24078 38655 36579 9395
9428I395J3231N1005J3332l797J2651k4182j8459J8082J1404j4039N631r568l482
$$ 9395 22626 73631 86963 83166 95817 71635 53176 71258 82662 68623 74254 64686 61204
9415F1204Q16J477L0710k0803l8921k4157r837K0442o122K5437L3607j0641j6494
$$ 61204 62020 63497 94207 73404 34483 10326 489 20931 14809 40246 73853 63212 46718
9402D6718q067N159j126l3964j1849j3670r787R145K919p689L1918K6170p081
$$ 46718 38651 43810 42684 8720 -3129 -16799 -26586 -17441 -14522 -22211 9707 35877 28796
9389B8796M778K0475j2103q187r441j6842K1524J5797J821j7927J5253o046p067
$$ 28796 33574 54049 41946 33759 24318 7476 29000 44797 46618 28691 43944 37898 30831
9376C0831Q14j2816p336j3610j8798J5714J6547P775L897m124L039l9830R128
$$ 30831 31645 18829 11493 -2117 -20915 -5201 11346 19121 23018 18894 21933 -17897 -8769
9363h769O681L3272K9301p492j0345j0716n476k2665k1207P928K8422J0647J8664
$$ -8769 -2088 31184 60485 52993 42648 31932 26456 3791 -17416 -9488 18934 29581 48245
9350D8245L6758o291j9056J3850J0287n922k5288k6318l960R566L52M421j2670
$$ 48245 85003 78712 59656 73506 83793 77871 52583 26265 22305 31871 32223 36644 23974
9337B3974k3072K0341K3394j2085k490K916J3154k504P613J4882p228J0947J576
$$ 23974 902 21243 44637 32552 30062 32978 46132 43628 51241 66123 58895 69842 71418
9324G1418P451J224j8535k4658j5402j4853J552R249o331j260J5348J7363j7390
$$ 71418 78869 80093 61558 36900 21498 6645 8197 17446 11115 9855 25203 42566 25176
9311B5176j2403J1551L1785l486k5720m37K0140j2142j9829J673J0583P591J6583
$$ 25176 12773 24324 56109 52623 26903 26466 46606 34464 14635 16308 26891 34482 51065
9298E1065l043J2173p811J9427j3752j0877Q147n285o799L475q81l384o729L523
$$ 51065 48022 60195 52384 71811 58059 47182 55329 50044 43245 46720 45839 42455 35726 39249
9284C9249k816K408K896l592J475p697k5487j16K078K7110M988J991j6305Q046
$$ 39249 36433 38841 41737 38145 39620 31923 6436 6320 8398 35508 40496 42487 26182 34228
9270C4228l875q029n264r3p340J4590k7837k0250K4038L3389N874K076j0725m030
$$ 34228 30353 22324 17060 16967 9627 24217 -3620 -23870 168 33557 39431 41507 30782 26752
9256B6752n148J1077J4175O994J0103Q711j5903j7926J2878m246j5520J8511J5038
$$ 26752 21604 32681 46856 53850 63953 72664 56761 38835 51713 47467 31947 50458 65496
9243F5496R913J909j0027k283j270m18J0934m09j2357l871k8682j7094M8561J9272
$$ 65496 75409 77318 67291 65008 63738 63320 74254 73845 61488 57617 28935 11841 60402 79674
9229G9674J8472o74R404q098j7591o016k6813k3163N766N208J6072J7919J3116
$$ 79674 98146 97472 106876 98778 81187 75171 48358 25195 30961 36169 52241 70160 83276
9216H3276n306L4349R536j5982l4655j7316J0825K36J0047P214J1448m230l792
$$ 83276 77970 112319 121855 105873 71218 53902 64727 64963 75010 82224 93672 89442 85650
9203H5650r642n758P013j7003l7883J209Q536K2975R31j5936j4341J651K9682
$$ 85650 76008 70250 77263 60260 22377 23586 32122 55097 56028 40092 25751 27402 57084
9190E7084J9040p032k5903J8673J023J5608J447q702L454n317K5855q875k2675
$$ 57084 76124 69092 43189 61862 62885 78493 79940 71238 74692 69375 95230 86355 63680
9177F3680L007n860J3797J8395j8917N287j0735n678J1539p575k5808J5987L4648
$$ 63680 66687 60827 74624 93019 74102 79389 68654 62976 74515 66940 41132 57119 91767
9164I1767K6963j57j4895K2411j5513l3832k7461J0843K4973r537J4835j60k83
$$ 91767 118730 118573 103678 126089 110576 76744 49283 60126 85099 75562 90397 90237 89954
9151H9954o250j2478l467k961K1850r831q141l760K6059Q518j3373l258k9315
$$ 89954 83704 71226 67759 64798 86648 76817 68676 64916 90975 99493 86120 82862 53547
9138E3547j5122j1118K6140R07o145J6233P884j3452K9543J1383j7312l0897j7442
$$ 53547 38425 27307 53447 54354 48209 64442 72326 58874 88417 99800 82488 51591 34149
9125C4149J4555k357j1612q717J1515N7021n882j5980L588o111K770j0030p419
$$ 34149 48704 46347 34735 26018 37533 94554 88672 72692 76280 70169 72939 62909 55490
9112E5490J5947N617K1134r841n5757K7879J4444j4494L1675l398O255J5303r743
$$ 55490 71437 77054 98188 88347 32590 60469 74913 60419 92094 88696 94951 110254 100511
9099A00511l651j771L842j8134q753K0249q507R547k158k3965j3172K6614Q421
$$ 100511 96860 95089 98931 80797 72044 92293 83786 93333 91175 67210 54038 80652 89073
9086H9073j9133j1736K4501J483J0142K2350J5450j7472j3412R184k8417k623
$$ 89073 69940 58204 82705 84188 94330 116680 132130 114658 101246 110430 82013 79390
9074G9390J4219j3941j1616J8809J3275M563J1043m141J0262J4774L491l0978
$$ 79390 93609 79668 68052 86861 100136 104699 115742 111601 121863 136637 140128 109150
9062A09150m0112J4921J532q189J5508J4010K5288M349l332k5276j4543n920j0901
$$ 109150 69038 83959 85491 77302 92810 106820 132108 136457 133125 107849 93306 87386 76485
9049G6485L4258J6748k282j6486j5177P62J8772L3990j2503k6044J3216m206J7916
$$ 76485 110743 127491 125209 108723 93546 94308 113080 147070 134567 108523 121739 117533 135449
9036A35449k4512j5246L4786n239q021J3610J9108j1858o7K4361j6613p113q584
$$ 135449 110937 95691 130477 125238 117217 130827 149935 138077 138010 162371 145758 138645 130061
9023A30061k064J6297m324R881o78j5881K4311K168L24K0732j2623j8848J3030
$$ 130061 127997 144294 139970 149851 149173 133292 157603 159771 160095 180827 168204 149356 162386
9010A62386J4336J8214l101j7629j3881j4373J3627J6617J4231R802l6185p856
$$ 162386 176722 194936 191835 174206 160325 145952 159579 176196 190427 200229 164044 156188
8998A56188M5351J0699j8641R952Q192O117K039j6692k6333K1495l337k59k0766
$$ 156188 201539 212238 193597 203549 211741 217858 219897 203205 176872 198367 195030 194771 174005
8985A74005M815m644J5613J9559O595l1610m818J2329J7552r81P616J934J7532
$$ 174005 178820 174176 189789 209348 215943 184333 179515 191844 209396 208415 216031 217965 235497
8972B35497k0625j6925P583j260J5532k1740n732J051J549K3845J7589n668J1517
$$ 235497 214872 197947 205530 204270 219802 198062 192330 193381 194930 218775 236364 230696 242213
8959B42213k040k1967K4389K3821l464j4897K8565K3304l3227j7159K2481J1668
$$ 242213 240173 218206 242595 266416 262952 248055 276620 299924 266697 249538 272019 283687
8947B83687l7305P938K5350J7084j4191j1216N610j6876l401j3592J0356J7840
$$ 283687 246382 254320 279670 296754 282563 271347 276957 260081 256680 243088 253444 271284
8935B71284J2530p998q923J7774K4904K475o512r413j3814k037J8116J8904L3325
$$ 271284 283814 275816 266893 284667 309571 312046 305534 296121 282307 280270 298386 317290 350615
8922C50615M8626K7018k6793o2482j0250J8449M073J3737J0210r443j1996j9972
$$ 350615 399241 426259 399466 336984 326734 345183 349256 362993 373203 363760 351764 331792
8910C31792K0220J2942L625R301N874j0826l1890K7529K9227K6137j6363m47O228
$$ 331792 352012 364954 368579 377880 383754 372928 341038 368567 397794 423931 407568 407121 413349
8897D13349R2L0285K2333j1474J3830l339J8639J5581K2733J6609K5384J1088
$$ 413349 413441 443726 466059 454585 468415 465076 483715 499296 522029 538638 564022 575110
8885E75110L2535M726J8244J4214j803J3906P45J2846M1660K9383k1703k8631
$$ 575110 607645 612371 630615 644829 643026 656932 657677 670523 712183 741566 719863 691232
8873F91232L8972K1168L3273l013M894J2166j8855K4773J7697j4657M5944J8734
$$ 691232 730204 751372 784645 781632 786526 798692 779837 804610 822307 807650 853594 872328
8861H72328k831K6612O367J0805J016J6416P216O594q482M1609K7974l0644k0381
$$ 872328 869497 896109 902476 913281 914297 930713 937929 944523 936041 977650 1005624 974980 954599
8848I54599K0813L6823J7110o711J2326L3925J0321K2902J3852j1801J0286L0133
$$ 954599 975412 1012235 1029345 1022634 1034960 1068885 1079206 1102108 1115960 1104159 1114445 1144578
8836A144578L5359J7890L9908M9227K295K8211M2409P327L5495N5215O320L8285
$$ 1144578 1179937 1197827 1237735 1286962 1289257 1317468 1359877 1367204 1402699 1457914 1464234 1502519
8824A502519N7146N5688N6820N0226L3403K3737J7913L5256N1322N0610L7189
$$ 1502519 1559665 1615353 1672173 1722399 1755802 1779539 1797452 1832708 1884030 1934640 1971829
8813A971829K9301N2712O3703O6789Q0112P5369O1337O9022Q7782J02028P4731
$$ 1971829 2001130 2053842 2117545 2184334 2264446 2339815 2401152 2470174 2557956 2659984 2734715
8802B734715Q9126J06677J04084J35218J35464J18050J26495R8946J09328J13867
$$ 2734715 2823841 2930518 3034602 3169820 3305284 3423334 3549829 3648775 3758103 3871970
8792C871970J76833J75281J70547J76338J83921K25300K23812J97839K34294K73053
$$ 3871970 4048803 4224084 4394631 4570969 4754890 4980190 5204002 5401841 5636135 5909188
8782E909188K74873K48426L02633L43838L53373L70529L85903M06706M77020N02274
$$ 5909188 6184061 6432487 6735120 7078958 7432331 7802860 8188763 8595469 9072489 9574763
8772I574763N29701N52629N80437O24184O83115P33057P67959Q46331R07504R73027
$$ 9574763 10104464 10657093 11237530 11861714 12544829 13277886 14045845 14892176 15799680 16772707
8762A6772707J057897J134849J197732J282923J374887J465200J548652J658674
$$ 16772707 17830604 18965453 20163185 21446108 22820995 24286195 25834847 27493521
8754B7493521J757198J803586J864328J886207J882834J841011J787893J639925
$$ 27493521 29250719 31054305 32918633 34804840 36687674 38528685 40316578 41956503
8746D1956503J445635J259164R92455O82721L06328m9999m36218p55638j002990
$$ 41956503 43402138 44661302 45653757 46336478 46642806 46592807 46156589 45400951 44397961
8737D4397961j246588j510916j680725j746206j773844j781573j772249j716488
$$ 44397961 43151373 41640457 39959732 38213526 36439682 34658109 32885860 31169372
8729C1169372j670444j635192j565266j461941j333553j261749j177074j093862
$$ 31169372 29498928 27863736 26298470 24836529 23502976 22241227 21064153 19970291
8721A9970291j056359r71716q82872q34510q00653p52450o82595o34655o12567
$$ 19970291 18913932 17942216 17059344 16224834 15424181 14671731 13989136 13354481 12741914
8712A2741914o04731n40865n00992m82791m59960m16487l78674l46001l85677
$$ 12741914 12137183 11596318 11095326 10612535 10152575 9736088 9357414 9011413 8625736
8703H625736l44440l15551k85682k97141k43757k26544k67138k28680k33126j97647
$$ 8625736 8281296 7965745 7680063 7382922 7139165 6912621 6645483 6416803 6183677 5986030
8693E986030j61741j90249j86451j63200j52377j83019j68647j48353j43285j75500
$$ 5986030 5824289 5634040 5447589 5284389 5132012 4948993 4780346 4631993 4488708 4313208
8683D313208j31514j16934j23490j17281j12386q6797j03233r8795p2681q3698
$$ 4313208 4181694 4064760 3941270 3823989 3711603 3624806 3521573 3422778 3350097 3266399
8673C266399j13074j14851p7195o7981p4894o8716p5810o9001n6664o0639p2940
$$ 3266399 3153325 3038474 2961279 2893298 2818404 2749688 2673878 2604877 2548213 2487574 2414634
8662B414634m2859p0666p8481o5782o8539l9285j5194k5515n0733l8790n7161
$$ 2414634 2371775 2301109 2222628 2156846 2088307 2049022 2033828 2008313 1957580 1918790 1861629
8651A861629p5283k3053k3671j2826J441J8190K0506J7054j0422r754l772l3129
$$ 1861629 1786346 1763293 1739622 1726796 1728237 1746427 1766933 1783987 1773565 1763811 1760039 1726910
8639A726910n5936q9380r3226m8845m5225p1089m5273j4942m1236m6597n424n153
$$ 1726910 1670974 1581594 1488368 1439523 1394298 1323209 1277936 1262994 1221758 1175161 1169737 1164584
8627A164584j2852L45p664k8235p452k6108j8800p926O146j5456k8809m091J9736
$$ 1164584 1151732 1152077 1144413 1116178 1108726 1082618 1063818 1055892 1062038 1046582 1017773 1013682 1033418
8614A033418r984j3573k7979n255j5989O153J2977J0602Q067m978K412J3803R5668
$$ 1033418 1023434 1009861 981882 976627 960638 966791 979768 990370 998437 993459 995871 1009674 1105342
8601A105342J01623J14078R5343L9273L1370J4540L3139k8835j01758j62956j23854
$$ 1105342 1206965 1321043 1416386 1455659 1487029 1501569 1534708 1505873 1404115 1241159 1117305
8590A117305p6232p3295o6233m3070l9357l0286q249k9408k4052k4547N887l6871
$$ 1117305 1041073 967778 901545 858475 819118 788832 780583 751175 727123 702576 708463 671592
8578F71592m5458k0053J2247J8773k6564r894P633O219q057m724o984k393K2961
$$ 671592 626134 606081 618328 637101 610537 600643 608276 614495 606438 601714 594730 592337 615298
8565F15298j4203o180n073J5116J0157K1470p614k5293j2011L5385O7240N4410
$$ 615298 601095 594915 589842 604958 615115 636585 628971 603678 591667 627052 694292 748702
8553G48702P475k4902O249J0537o829k1814o9000n5575p1380l6610O002M248j6690
$$ 748702 756177 731275 737524 748061 741232 719418 650418 594843 523463 486853 492855 497103 480413
8540D80413k2157k0169j8249k177K6323J2018m1480j5722J4256K940n3766j3401
$$ 480413 458256 438087 419838 417661 443984 456002 414522 398800 413056 415996 362230 348829
8528C48829J8417q219j1537J6816K4675k4994l268k3220m2686Q758N75n06J0085
$$ 348829 367246 359027 347490 364306 388981 363987 360719 337499 294813 303571 304146 303640 313725
8515C13725K482m563q861n908m5863O000R602l415K2852J2228j9111k118j329
$$ 313725 316207 311644 302783 296875 251012 257012 266614 263199 286051 298279 279168 277050 275721
8502B75721Q2j3069J0263K4406K1150m0014j632m695j8488j0077J8459K1432M097
$$ 275721 275803 262734 272997 297403 318553 278539 276907 272212 253724 243647 262106 283538 287635
8489B87635p630l1566j1792K6246K450J2384j0566k2876l7094j3764q776k7851
$$ 287635 280005 248439 236647 262893 265343 277727 267161 244285 207191 193427 184651 156800
8477A56800p826L3739L292j886P818k2847R473K6967R158p791J073J2253k4781
$$ 156800 148974 182713 186005 184119 191937 169090 178563 205530 214688 206897 207970 220223 195442
8464A95442m0275j910j0681j2829J7239J7901J6930M1220k2250j3711k7985j5690
$$ 195442 155167 153257 142576 129747 146986 164887 181817 223037 200787 187076 159091 143401
8452A43401K892N783J343k456J239j7823k899j1841m832j0013O417K7251L8702
$$ 143401 146293 152076 153419 150963 152202 134379 131480 119639 114807 104794 111211 138462 177164
8439A77164J4084l394j1233L367o47r301l5915p788L8977M2255k7196m589J7452
$$ 177164 191248 187854 176621 179988 179341 170040 134125 126337 165314 207569 180373 175784 193236
8426A93236K9347K6322m4089k0941k5440j0697J1807r408L1108J4539l7380l5902
$$ 193236 222583 248905 204816 183875 158435 147738 159545 150137 181245 195784 158404 122502
8414A22502l8059J9963j600j9793L0933K1102j1573J1243J2871o943j1536M146
$$ 122502 84443 104406 102806 83013 113946 135048 123475 134718 147589 140646 129110 133256
8402A33256K0040Q365j9938k3905M665L914k5152r245J4736Q582r463K8646J6304
$$ 133256 153296 161661 141723 117818 122483 126397 101245 92000 106736 115318 105855 134501 150805
8389A50805j6284k6555K532Q156m43N288k445j776J8438L111j8587P785P698L011
$$ 150805 134521 107966 110498 118654 118211 123499 121054 119278 137716 140827 122240 130025 137723 140734
8375A40734l3611l4955j7433K8827J5094J5626K5807m580k1123l2275k2645J8356
$$ 140734 107123 72168 54735 83562 98656 114282 140089 135509 114386 82111 59466 77822
8363G7822O947J9794n807L975j8299j377K326o713o809j8596J8533K1062J5166
$$ 77822 84769 104563 98756 102731 84432 83055 85381 78668 71859 53263 71796 92858 108024
8350A08024q96k7287p155j2748J6487J6154p167k7752p019N445J0732n630N311
$$ 108024 107128 79841 72686 59938 76425 92579 85412 57660 50641 56086 66818 61188 66499
8337F6499p915N888J2039O898P62m4824K627K7764J9918j7439m3325K9919P397
$$ 66499 58584 64472 76511 83409 84171 39347 41974 69738 89656 72217 28892 58811 66208
8324F6208k2914k09K2940Q849L42j8727Q45L0041L8916K3273j3368j9890J0698
$$ 66208 43294 43085 66025 74874 75216 56489 57334 87375 126291 149564 136196 116306 127004
8311A27004k2148m0518J915K1540r529j2093J5413J1563K4190l223O10P078J435
$$ 127004 104856 64338 66253 87793 78264 66171 81584 93147 117337 114114 114724 121802 123237
8298A23237O23j6849l786j2344k078J1507J5858K4287j263n502j6630J6082K5701
$$ 123237 123860 107011 103225 90881 88803 100310 116168 140455 139192 133690 117060 133142 158843
8285A58843l0401p7621j8992K6863J7740k6915R512J0011j2140J0740j0458j2824
$$ 158843 128442 50821 31829 58692 76432 49517 59029 69040 56900 67640 57182 44358
8273D4358p029L413J3893J0493j3119n14j1917j2555J5549o493J4305j4646M544
$$ 44358 37329 40742 54635 65128 52009 51495 39578 27023 42572 36079 50384 35738 40282
8260D0282K1031N692P494k380N402J7949j2799l1806k0898K3623m56J9243L8645
$$ 40282 61313 67005 74499 72119 77521 95470 82671 50865 29967 53590 53134 72377 111022
8247A11022L6420O770J2537j0715l7012j9724j9194l733j0456m688K870l9077
$$ 111022 147442 154212 166749 156034 119022 99298 80104 76371 65915 61227 64097 25020
8235B5020p546N488k422j4167K5913M2310L0334j8291j8047J6767m541k1385J2155
$$ 25020 17474 22962 20540 6373 32286 74596 104930 86639 68592 85359 80818 59433 71588
8222G1588o98j610M273j1604k8033r938M2232J7560k1869q945J4153j641O992
$$ 71588 70890 69280 73553 61949 33916 23978 66210 83770 61901 52956 67109 65468 72460
8209G2460L1412j5031j093q713l6709K569K265P395k4357p378k003L8016J5104
$$ 72460 103872 88841 87748 79035 42326 44895 47160 54555 30198 22820 20817 58833 73937
8196G3937n041L896k1814K4717L7034K185m920j5113j2948m575K1490J9708K91
$$ 73937 68896 72792 50978 75695 112729 114914 109994 94881 81933 77358 98848 118556 118847
8183A18847k0257J0115k7022m2550j6206J5949J4370K290k3354K2047K3253j7999
$$ 118847 98590 108705 81683 39133 22927 38876 53246 55536 32182 54229 77482 59483
8171E9483P17k7092N287J1857J4110k0264n4643J3941K5453L7570O801L182J0952
$$ 59483 60200 33108 38395 50252 64362 44098 -10545 3396 28849 66419 73220 76402 87354
8158H7354r045k3627N326K747j3912k5236l3143K4266K2774j3615k4915q25O463
$$ 87354 78309 54682 60008 62755 48843 23607 -9536 14730 37504 23889 -1026 -1851 4612
8145D612J3374L956j0297n662K966J6908o062j4505K1049K0969J7770j2319J8286
$$ 4612 17986 21942 11645 5983 8949 25857 19795 5290 26339 47308 65078 52759 71045
8132G1045L1034j2156r607k232p966r201k1497k2005P78L807N746L193P759k456
$$ 71045 102079 89923 80316 78084 70118 60917 39420 17415 18193 22000 27746 30939 38698 36242
8118C6242p132J1672K2030p789o096m93n083k8266M505J6443J4437J0051n958
$$ 36242 29110 40782 62812 55023 48927 48434 43351 15085 19590 36033 50470 60521 54563
8105E4563k4046k394J2973m141j2852m33J305p102o893N714q35J5930k9429J028
$$ 54563 30517 28123 41096 36955 24103 23670 24975 17873 10980 16694 15859 31789 2360 3388
8091C388K0991j392r599n048r67L2918r813r08K1350J1607k9366l625k3943j2212
$$ 3388 24379 22987 13388 8340 7373 40291 30478 29570 50920 62527 33161 29536 5593 -6619
8077f619Q443M0006J7112k1589J0468Q851j7791j5487o408L563J789K10j519J4780
$$ -6619 1824 41830 58942 37353 47821 56672 38881 23394 16986 20549 22338 22548 21029 35809
8063C5809J358k9617r95Q700K3499R022J4740j4035j1830Q725m422J3871k4886
$$ 35809 37167 7550 6555 15255 38754 47776 62516 48481 36651 45376 40954 54825 29939
8050B9939M149R765O934p005O9j3003n295K1978R688p219K7428O47k5585l1923
$$ 29939 34088 43853 50787 43782 43851 30848 25553 47531 57219 50000 77428 78075 52490 20567
8036B0567q487p568J3487K6892K0159l7693j2082J5642L1113K3739M511k2160
$$ 20567 12080 4512 17999 44891 65050 27357 15275 30917 62030 85769 90280 68120
8024F8120J960k4016j6836j2033j2896k4972J8625O228J8875J1491R027R833j7480
$$ 68120 70080 46064 29228 17195 4299 -20673 -2048 4180 23055 34546 43573 53406 35926
8011C5926O154J3738K1527l819J9670k0000k6203J6326J7852L651q781j2162R466
$$ 35926 42080 55818 77345 73526 93196 73196 46993 63319 81171 84822 76041 63879 73345
7998G3345J1418l482J1815m447l3084J1409R158k7774k5639m763K1897J4251k1525
$$ 73345 84763 81281 93096 88649 55565 66974 76132 48358 22719 17956 39853 54104 32579
7985C2579q258j1472j8293m282J2963J8508j4202l43j2783l395P921J6211Q393
$$ 32579 24321 12849 -5444 -9726 3237 21745 7543 7200 -5583 -8978 -1057 15154 23547
7972B3547J8175L5666n136r648K0107J5500L746j8930l0398p791n180L693j9410
$$ 23547 41722 77388 72252 62604 82711 98211 101957 83027 52629 44838 39658 43351 23941
7959B3941K8102K0294k1061j366o369o385J5912J7580J0097J2114j6068Q08j5221
$$ 23941 52043 72337 51276 49910 43541 37156 53068 70648 80745 92859 76791 77599 62378
7946F2378j9031j5136j0283R285K414p828N666J308K2532J6803O176j2766J8640
$$ 62378 43347 28211 17928 27213 29627 21799 27465 28773 51305 68108 74284 61518 80158
7933H0158n576k3435j4890p984J8950K9533j5902j1869K2661j9087k5872k0661
$$ 80158 74582 51147 36257 28273 47223 76756 60854 48985 71646 52559 26687 6026
7921F026O73j196o134K5906P419j0019q681Q663r76K4557j9433m3503M0203K5979
$$ 6026 6699 5503 -631 25275 32694 22675 13994 22657 21681 46238 26805 -16698 23505 49484
7907D9484L198K704j1678m391O738j5772K5661j8293j3167L732j1702j8002Q203
$$ 49484 52682 55386 43708 39317 46055 30283 55944 37651 24484 28216 16514 -1488 6715
7894F715q255P903J2889J538p03P445N355M005K0148j6897k2940r171K920j6596
$$ 6715 -1540 6363 19252 20790 20087 27532 32887 36892 57040 40143 17203 8032 10952 -5644
7880e644m32N704M63o463k0102K9248N478j2176m341J54L9915j1388r787J5045
$$ -5644 -6076 -372 91 -6372 -26474 2774 8252 -3924 -8265 -8111 31804 20416 10629 25674
7866B5674l280j6113j7440M697j6114j325Q714m591J4903j141K6311l0992q749
$$ 25674 22394 6281 -11159 -6462 -22576 -23901 -15187 -19778 -4875 -6016 20295 -10697 -19446
7853a9446R495l603J1562j8144O936J391J2083l180K1370j0761j1229P581m480
$$ -19446 -9951 -13554 -1992 -20136 -13200 -11809 274 -2906 18464 7703 -3526 4055 -425
7840d25q421j8364R516q115m907J5580K5559J5702l506m612K7215j8204j8219
$$ -425 -8846 -27210 -17694 -25809 -30716 -15136 10423 26125 22619 18007 45222 27018 8799
7827H799O664J3291j344o314k9810J1800J9472o986k1922j1031n744j0196K0905
$$ 8799 15463 28754 27410 21096 -8714 3086 22558 15572 -6350 -17381 -23125 -33321 -12416
7814a2416m472J6645J7196L8387j8181l9970O554M705o150j339J6491K0J8595
$$ -12416 -16888 -243 16953 55340 37159 -2811 3743 8448 2298 959 17450 17470 36065
7801C6065m767j3582j8038j9257o112j359j872m939K1325J6230j9374j2790K2345
$$ 36065 31298 17716 -322 -19579 -25691 -27050 -28922 -33861 -12536 3694 -15680 -28470 -6125
7788f125K2766J7476j1734l3278j8510J3835J2169O010O09P131O456m187p466
$$ -6125 16641 34117 22383 -10895 -29405 -15570 -3401 2609 3218 10349 16805 12618 5152
7775E152p5N857J4477L2572l050o087p595R356J1113Q080j5942l0083l0181o857
$$ 5152 5077 10934 25411 57983 54933 48846 41251 50607 61720 69800 53858 23775 -6406 -13263
7761a3263J5586j4994Q830J1494P944J1230K9761n864l4544O53J6906N36J2523
$$ -13263 2323 -12671 -3841 7653 15597 26827 56588 50724 16180 16833 33739 34275 46798
7748D6798l3358J77K5330j4528j3885N099J7793O780K5569K0396p006p423J222
$$ 46798 13440 13617 38947 24419 10534 15633 33426 40206 65775 86171 79165 71742 72964
7735G2964m2416l2484j1080Q997j072k5756n917K6600J9123K6919R780r250j6589
$$ 72964 30548 -1936 -13016 -4019 -5091 -30847 -36764 -10164 8959 35878 45658 36408 19819
7722A9819j4650K202j1158j792j0601J0569k513k74n492K642J8115M060Q290K
$$ 19819 5169 7371 -3787 -5579 -16180 -5611 -8124 -8398 -13890 -11248 6867 10927 19217 19219
7708A9219J194j5727l6104K6262K17n905L5259K5273r874l4606R007O706j5338
$$ 19219 20413 4686 -31418 -5156 -4939 -10844 24415 49688 39814 5208 14215 20921 5583
7695E583k4461R077L1472J1676k2084o620K8515J7381j6919l2898k4886n689K3826
$$ 5583 -18878 -9801 21671 33347 11263 4643 33158 50539 33620 722 -24164 -29853 -6027
7682f027K6107R287N30k2671j5800J2464p949m362m993Q707J2927P070Q092O665
$$ -6027 20080 29367 29897 7226 -8574 3890 -4059 -8421 -13414 -4707 8220 15290 23382 30047
7668C0047Q368J4443J413j1176j0531J7622l1207j5048N823m118L201j2552q467
$$ 30047 38415 52858 54271 43095 32564 50186 18979 3931 9754 5636 8837 -3715 -12182
7655a2182L3550Q352j9489j8200J4627j1639N911J3057K7732q31k4154p763o02
$$ -12182 21368 29720 10231 -7969 6658 -4981 930 13987 41719 40888 16734 8971 8369
7642H369k7285j2680K0823J596O927K2043j6905j4476j1880O008r722J7966K6651
$$ 8369 -18916 -31596 -10773 -9177 -2250 19793 2888 -11588 -23468 -17460 -27182 -9216 17435
7629A7435P484J715m562j4899K306j0519K767J9896L2217R36k3383p941M277j98
$$ 17435 24919 26634 22072 7173 9479 -1040 1727 21623 53840 54776 31393 23452 27729 27531
7615B7531K00m374j3005P839j8465k308J6237J3202K1714L692q17k1370j2601
$$ 27531 27731 23357 10352 18191 -274 -2582 13655 26857 48571 52263 51446 30076 17475
7602A7475l9918m501L1420o743J506k021J078q31l0963r26K4220K8914M608j9508
$$ 17475 -22443 -26944 4476 -2267 -761 -2782 -1704 -2535 -33498 -34424 -10204 18710 23318 3810
7588C810j6381J3431P37O641K363L1111j134k1199k9086k047J5343K1282q758
$$ 3810 -12571 860 1597 8238 10601 41712 40578 19379 -9707 -11754 3589 24871 16113
7575A6113m3973J1944J5528M645k1654l7305K8637L4840K4430k4304n3763q814
$$ 16113 -27860 -15916 -388 4257 -17397 -54702 -26065 8775 33205 8901 -44862 -53676
7563e3676p337L98K9338j2347J0063K7915k0484J216J5017O692j7356R573J479
$$ -53676 -61013 -60615 -31277 -43624 -33561 -5646 -26130 -24914 -9897 -3205 -20561 -10988 -9509
7550i509L690J9292j4124r415J0899R762l2461M090q088J3450q659N72J0356K1687
$$ -9509 -5819 13473 -651 -10066 833 10595 -21866 -17776 -25864 -12414 -21073 -20501 -10145 11542
7536A1542K442j9052j7770J3720N006J7674L6803j539l5893l2948k9602J0958
$$ 11542 13984 -5068 -22838 -9118 -4112 13562 50365 48826 12933 -20015 -49617 -38659
7524c8659J6987J0334p129j6110j0740L184N805j3635m724l126J6087N174o194
$$ -38659 -21672 -11338 -18467 -34577 -45317 -42133 -36328 -49963 -54687 -57813 -41726 -36552 -42746
7511d2746R061J7024M325J3894J7227M708K5584M075K47m528k7730j9482j7779
$$ -42746 -33685 -16661 -12336 1558 18785 23493 49077 53152 53399 48871 21141 1659 -16120
7498a6120Q517L1193J6111L482o350R009l7759l1907p013J1638j3281m026J0281
$$ -16120 -7603 23590 39701 43183 36833 45842 8083 -23824 -30837 -19199 -32480 -36506 -26225
7485b6225j1247j49J7616K9997K1852M772o605j0563j2153m7849J0349J4029K771
$$ -26225 -37472 -37621 -20005 9992 31844 36616 30011 19448 7295 -40554 -30205 -16176 -13405
7472a3405J1439l0127m236M4706K5315l2865J4140j204J2356j4798j3327N473
$$ -13405 -1966 -32093 -36329 8377 33692 827 14967 13763 26119 11321 -2006 3467
7460C467O182J838J3408j1876k9878j1782j6j7399j615P52J5087K3198L1071p207
$$ 3467 9649 11487 24895 13019 -16859 -28641 -28657 -46056 -47671 -46919 -31832 -8634 22437 15230
7446A5230j7296L800j1709P350J0318K3421J9708m629n7886l8750J9487K375k1226
$$ 15230 -2066 1734 -9975 -2625 7693 31114 50822 46193 -11693 -50443 -30956 -28581 -49807
7433d9807j4122l160K5466K6889j4712M164K0094m973m993j7391K846K0640J2632
$$ -49807 -63929 -67089 -41623 -14734 -29446 -25282 -5188 -10161 -15154 -32545 -29699 -9059 3573
7420C573j0098j8061p699P204j818l376o571j223J3857l482n829j2635j6260J6702
$$ 3573 -6525 -24586 -32285 -25081 -26899 -30275 -36846 -38069 -24212 -27694 -33523 -46158 -62418 -45716
7406d5716l854M1325K0939n8362k4052K3859j1967j1911J2790L646k53K3013J3188
$$ -45716 -49570 -8245 12694 -45668 -69720 -45861 -57828 -69739 -56949 -53303 -53556 -30543 -17355
7393a7355J7426l77J5395K6827K6622j5263m1789j8155j1518m0560J1023K5903
$$ -17355 71 -306 15089 41916 68538 53275 11486 -6669 -18187 -58747 -47724 -21821
7381b1821q028j9657j4363Q017L982l416J5162L9128L163k0958R388n389p848
$$ -21821 -29849 -49506 -63869 -55852 -51870 -55286 -40124 -996 2167 -18791 -9403 -14792 -22640
7368b2640P956R074K107j826J296K4125p039k8158k3824J1899K2145K6938K4263
$$ -22640 -14684 -5610 -3503 -5329 -4033 20092 13053 -15105 -38929 -27030 -4885 22053 46316
7355D6316N381k8062o72J01O611J6340j1221j9168J5218J320k9244l767L951q939
$$ 46316 51697 23635 22963 23064 29675 46015 34794 15626 30844 32164 2920 -847 3104 -5835
7341e835j7460j1056P910k745p122J2589J9768O012J7231J8380o280l1249M1J2124
$$ -5835 -23295 -34351 -26441 -29186 -36308 -23719 -3951 2061 19292 37672 31392 143 184 12308
7327A2308J052l0285k263j5912K273J9220K1661J6682j0969m0868l1147K2996
$$ 12308 13360 -16925 -19188 -35100 -32827 -13607 8054 24736 13767 -27101 -58248 -35252
7315c5252O181J6009k0161m901J5143R115R925N643j245l1019M253K6605K087
$$ -35252 -29071 -13062 -33223 -38124 -22981 -13866 -3941 1702 457 -30562 -26309 296 2383
7302B383k2393l6591K3429J2647r57k0258j826J0959M335K6366O780J7679K3292
$$ 2383 -20010 -56601 -33172 -20525 -21482 -41740 -43566 -32607 -28272 -1906 4874 22553 45845
7289D5845l904m1720j0782j6828J419K3786O944O478k209j436l3385k6438j2801
$$ 45845 41941 221 -10561 -27389 -25970 -2184 4760 11238 9029 7593 -25792 -52230 -65031
7276f5031K7180J2967j022n672L0744k966J1946J9838j4088j5077k5882n165o498
$$ -65031 -37851 -24884 -25906 -31578 -834 -3800 8146 27984 13896 -1181 -27063 -32228 -38726
7263c8726M7002J9455J8552j3746k2471j2609R453J1727k5497j9022m839j5322
$$ -38726 8276 27731 46283 32537 10066 -2543 6910 18637 -6860 -25882 -30721 -46043
7251d6043L555L1675L500M336l2367J2499K2759J8001k5489J355L9352r760k7843
$$ -46043 -42488 -10813 -7313 -2977 -35344 -22845 -86 17915 -7574 -6219 33133 23373 -4470
7238d470n968N015L7575J5639J738K751k4308k4044q004J7672L2712r91k1456
$$ -4470 -10438 -5423 32152 47791 49529 52280 27972 3928 -4076 13596 46308 45317 23861
7225B3861j2328j7006J5076k1796j1020r693m458K3273j1307K88K5633J947k6006
$$ 23861 11533 -5473 9603 -12193 -23213 -32906 -37364 -14091 -25398 -25110 523 2470 -23536
7212b3536Q02M052p094J9309r168J6393K5343M208Q037J9725j6468k6754K260
$$ -23536 -22734 -18682 -25776 -6467 -15635 758 26101 30309 38346 58071 41603 14849 17109
7199A7109j049k924j5892J6037P533J0414L850j3336o376J1175J0120r539o206
$$ 17109 16060 13136 -2756 13281 20814 31228 35078 21742 15366 26541 36661 27122 20916
7186B0916n709q97j6781p946q820J44K195n445O318O194L417N95j0372k2646l251
$$ 20916 15207 14310 -2471 -10417 -19237 -19093 -16898 -22343 -16025 -9831 -6414 -5819 -16191 -38837 -42088
7171d2088l7232n478L0931L0J0382M8502L7596j9607j8192m483k3426j6903J1947
$$ -42088 -79320 -84798 -53867 -53837 -43455 5047 42643 23036 4844 361 -23065 -39968 -28021
7158b8021J1465J810Q576j028K0067L671l109J5069j0439j0782r163k80N920q377
$$ -28021 -16556 -14746 -6170 -7198 12869 16540 13431 28500 18061 7279 -1884 -2164 3756 -4621
7144d621p766O393N179l61k1572k7620P530Q97N336o991J2713l403Q93J0763J3024
$$ -4621 -12387 -5994 -815 -1176 -22748 -50368 -42838 -41941 -36605 -43596 -30883 -34286 -33393 -22630 -9606
7129i606J4595J334k6442k940L2545K7027j1835k1724p908j2561M472r954Q729
$$ -9606 4989 6323 -20119 -23059 9486 36513 24678 2954 -4954 -17515 -13043 -22997 -14268
7116a4268j1452J1484O079J5419o333o92k648M420Q05j6480J047M7247K5898l9405
$$ -14268 -25720 -14236 -8157 7262 929 237 -2411 2009 2814 -13666 -12619 34628 60526 21121
7102B1121j4920P483n864j3679k9996P851J3323j6841M221K2027n729m524J7838
$$ 21121 6201 13684 7820 -5859 -35855 -28004 -14681 -31522 -27301 -5274 -11003 -15527 2311
7089B311k325l110q85k0406o601j849J2640K0569J8083j3767K1920L498r191j6907
$$ 2311 -14 -3124 -4009 -24415 -31016 -32865 -20225 344 18427 4660 26580 30078 20887 3980
7075C980j5100m741K4430K977l432l881j642j6579j8424Q63J6811j73R588J757
$$ 3980 -11120 -15861 8569 11546 8114 4233 2591 -13988 -32412 -31549 -14738 -14911 -5323 -3566
7061c566j0605k821j1036j2471N386J4366L0887L517m7364j0334n199J2262J4524
$$ -3566 -14171 -16992 -28028 -40499 -35113 -20747 10140 13657 -33707 -44041 -49240 -36978 -22454
7048b2454o207N035l1424j1573L0130J5830J1633J4753K4519l1983n9857L444
$$ -22454 -28661 -23626 -55050 -66623 -36493 -20663 -9030 5723 30242 -1741 -61598 -58154
7036e8154k911J7061M0912J3674j7268k4214K4150M615j6891j0909J4905l312
$$ -58154 -61065 -44004 -3092 10582 -6686 -30900 -6750 -2135 -19026 -29935 -15030 -18342
7024a8342J427j0644J407j8930K935k2820l853O927J5439L6935j0016o751O412
$$ -18342 -16915 -27559 -26152 -45082 -42147 -64967 -68820 -61893 -46454 -9519 -19535 -26286 -19874
7011a9874%j465m701j7084K947l782J1767O211k09L442L9373o11P824j2408j3079
$$ -19874 -19874 -21339 -26040 -43124 -40177 -43959 -32192 -25981 -26190 -22748 16625 16014 23838 11430 -1649
6996a649m248n810j8116N223M5048k3742n1228j6575K0063J5045J5124o024K722
$$ -1649 -5897 -11707 -29823 -24600 20448 -3294 -54522 -71097 -51034 -35989 -20865 -26889 -24167
6983b4167J6705P259N295m764k5177o821j5019k5571K9092L2781J0859K532O385
$$ -24167 -7462 -203 5092 328 -24849 -31670 -46689 -72260 -43168 -10387 472 3004 9389
6970I389M391j6567J2210j5201J1501k037j4844L2746M4610k3552l4929J064J3999
$$ 9389 13780 -2787 9423 -5778 5723 3686 -11158 21588 66198 42646 7717 8781 22780
6957B2780N61O059k9275k1317k8829J7757J1456L1536J712q301N974K5686J385
$$ 22780 23341 29400 125 -21192 -50021 -32264 -20808 10728 12440 4139 10113 35799 37184
6944C7184k1694l0673J394M458M806Q132M726Q89q058j6191K0253K5580P357P680
$$ 37184 15490 -15183 -13789 -9331 -4525 3607 8333 9222 1164 -15027 5226 30806 38163 45843
6930D5843k6095m2417P126M531p554j6782O099O927J2205K8228j7652r617k6573
$$ 45843 19748 -22669 -15543 -11012 -18566 -35348 -29249 -22322 -10117 18111 459 -9158 -35731
6917c5731o404J6728J9002K8449j7875j8943Q732j5500m6852Q456O847P437k129
$$ -35731 -42135 -25407 -6405 22044 4169 -14774 -6042 -21542 -68394 -59938 -53091 -45654 -47783
6904d7783J3238J0674q080p122M724O185J4323K095o718K4429Q226j6727O672
$$ -47783 -34545 -23871 -31951 -39073 -34349 -28164 -13841 -11746 -18464 5965 14191 -2536 4136
6891D136j5507J763K1996p232j5098K4096l098j0824K231K0761j5737k7996O11
$$ 4136 -11371 -9608 12388 5156 -9942 14154 11056 232 2463 23224 7487 -20509 -19898
6878a9898L5541r770j5676k4276k0253j0371L2020L8227j5154j309q180J3349
$$ -19898 15643 5873 -9803 -34079 -54332 -64703 -32683 5544 -9610 -10919 -19099 -5750
6866e750R923L7881p512N348k9720j979k0457j8495q339L9582j276l3761m573
$$ -5750 4173 42054 34542 39890 10170 8191 -12266 -30761 -39100 482 -794 -34555 -39128
6853c9128J4671J8308j3600J5588l316k5344n606J4182P097N228J664L757J4488
$$ -39128 -24457 -6149 -19749 -4161 -7477 -32821 -38427 -24245 -17148 -11920 -10256 -6499 7989
6840G989p000J348R66l0340Q810L621k7119K0976K4094J1530k3414p354O16J2176
$$ 7989 989 2337 3303 -27037 -18227 -14606 -41725 -20749 3345 14875 -8539 -15893 -15277 -3101
6826c101l279k8880j1979J9690K5949J0396k4639k0739O07M5929j5476j1921P788
$$ -3101 -6380 -35260 -47239 -27549 -1600 8796 -15843 -36582 -35975 9954 -5522 -17443 -9655
6813i655J8659j5057j656L456j2729j3219k7336J7533L7367j1507r458k3502P486
$$ -9655 9004 -6053 -7709 -4253 -16982 -30201 -57537 -40004 -2637 -14144 -23602 -47104 -39618
6800c9618j1666J7696J2606j5992K3225J5804j1725l3124j6154J4573J049J7789
$$ -39618 -51284 -33588 -20982 -36974 -13749 2055 -9670 -42794 -58948 -44375 -43326 -25537
6788b5537O765R349R958R780m3231m0800r188L7667L4123L2954n60J1950j7945
$$ -25537 -18772 -9423 535 10315 -32916 -73716 -82904 -45237 -11114 21840 21280 33230 15285
6775A5285k6705j4920q488j2638K4736K0610K7361l965j6294l1653j2159N65m0805
$$ 15285 -11420 -26340 -34828 -47466 -22730 -2120 25241 21276 4982 -26671 -38830 -38265 -79070
6762g9070M880M1819K7481j6519q801J3468J9116K1906L458k303m1455k644J4674
$$ -79070 -74190 -32371 -4890 -21409 -30210 -16742 2374 24280 27738 25435 -16020 -18664 -3990
6749c990P225K0304L0040o015l594O994P489k0358l1132m1185M251J7056K8019
$$ -3990 3235 23539 53579 47564 43970 50964 58453 38095 6963 -34222 -29971 -12915 15104
6736A5104J3974J6362j2906J0437P054Q288j9338j6007R958J0657J1776R487P283
$$ 15104 29078 45440 32534 42971 50025 58313 38975 22968 32926 43583 55359 64846 72129
6723G2129K5922J6798O357J7454m868j5414l6978l2336r121j4035r375j1834q151
$$ 72129 98051 114849 121206 138660 133792 118378 81400 49064 39943 25908 16533 4699 -3452
6710c452J1074k266j4975O889j0697l0402J9706M542j2989K0726J24K096m729
$$ -3452 7622 5356 -9619 -2730 -13427 -43829 -24123 -19581 -32570 -11844 -11720 -9624 -14353
6697a4353p078K4780j7140j4483j7819J7863j3642K217L1718J5373k9527j4415
$$ -14353 -21431 3349 -13791 -28274 -46093 -28230 -41872 -39655 -7937 7436 -22091 -36506
6685c6506N084N708M1527q17j6458K5431K027j2985j7659j4710M313R216o394
$$ -36506 -31422 -25714 15813 14996 -1462 23969 25996 13011 -4648 -19358 -15045 -5829 -12223
6672a2223k133m2119R98L895J1343L0087K7769Q79j6857j0902K8980Q138M183
$$ -12223 -14356 -56475 -55477 -51582 -40239 -10152 17617 18496 1639 -9263 19717 27855 32038
6659C2038j6473K223m152l3234J6410K1374j8250j0985k8849J891K0258n677k901
$$ 32038 15565 17788 13636 -19598 -3188 18186 -64 -11049 -39898 -38007 -17749 -23426 -26327
6646b6327L4P123j460L4677M778l1815r680q507J314L5992J5639k6407j3601k146
$$ -26327 -26293 -19170 -20630 14047 18825 -12990 -22670 -31177 -29863 6129 21768 -4639 -18240 -20386
6632b0386K061j2966Q657J4202K9585M972k4443j7933K1994K793p593q441J6151
$$ -20386 -18325 -31291 -22634 -8432 21153 26125 1682 -16251 5743 8536 943 -7498 8653
6619H653j4191K263p994m089m255L2664L497j5417q117J029J8342K1388r73K2835
$$ 8653 -5538 -3275 -11269 -15358 -19613 13051 16548 1131 -6986 -5957 12385 33773 32800 55635
6605E5635j3531k9946K735M505o822R78j3713j1069M594J831J9165o440j1545
$$ 55635 42104 12158 14893 19398 12576 13554 -159 -11228 -6634 -4803 14362 7922 -3623
6592c623m706j1568J009k1610k2234P767L8886P960j5948k06K0522k7563J778
$$ -3623 -8329 -19897 -18888 -40498 -62732 -54965 -16079 -8119 -24067 -24273 -3751 -31314 -29536
6579b9536L6858O548N223k869K36J3197j839k0864n722j4105R38j0991m564j9571
$$ -29536 7322 13870 19093 16224 16460 29657 27818 6954 1232 -12873 -11935 -22926 -27490 -47061
6565d7061r428N703R113M571J6162K4458k444l7016r759K6975J6895L1273l3773
$$ -47061 -56489 -50786 -41673 -37102 -20940 3518 1074 -35942 -45701 -18726 -1831 29442 -4331
6552d331k5960J4623M891k2079k1918K5526K9124k1258L007j5608O407J7843Q295
$$ -4331 -30291 -15668 -10777 -32856 -54774 -29248 -124 -21382 -18375 -33983 -27576 -9733 -1438
6539a438L852J7134J8956j1762R485L140J837j1432p368O319m201J0369j5597
$$ -1438 2414 19548 38504 26742 36227 39367 41204 29772 22404 28723 24522 34891 19294
6526A9294j9742q339O36J0260J6536k879o877l0594j1988J9315r694l4200N233
$$ 19294 -448 -8787 -8151 2109 18645 15766 8889 -21705 -33693 -14378 -24072 -58272 -53039
6513e3039K6759N1185J1250r821k3542j0343J2302P232R465m488J233K0303J4808
$$ -53039 -26280 24905 36155 26334 2792 -7551 4751 11983 21448 16960 18193 38496 53304
6500E3304J2556l504j4511j2242m1242p635n228j4401K6059K3354n016k7569j0887
$$ 53304 65860 62356 47845 35603 -5639 -13274 -18502 -32903 -6844 16510 11494 -16075 -26962
6487b6962l480K1917r896p949Q752K6357n13R742j3663q855m556Q151k274j8082
$$ -26962 -30442 -8525 -18421 -26370 -17618 8739 8226 17968 4305 -4550 -9106 -955 -3229 -21311
6473b1311j4011j734M340j4742K6864K7139P031j4518J1383K0370l576j5050p936
$$ -21311 -35322 -37056 -32716 -47458 -20594 6545 13576 -942 10441 30811 27235 12185 4249
6460D249k962J1603R260n267j1783J7266L3132L9k6693k3129J931k5061k8495
$$ 4249 1287 12890 22150 16883 5100 22366 55498 55537 28844 5715 7646 -17415 -45910
6447d5910J2414K3725K0049P261O273R590k1150j871j757j9606O815J2269Q64
$$ -45910 -33496 -9771 10278 17539 23812 33402 12252 10381 8624 -10982 -4167 8102 8966
6434H966m89k5516l141j4042L925J1897K4418L6170j6170M069j618j1617m503
$$ 8966 8477 -17039 -20180 -34222 -30297 -18400 6018 42188 26018 30087 28469 16852 12349
6421A2349k4541k8180L9960L3576l8265k9044Q20K2580L4817K5191o152k0144
$$ 12349 -12192 -40372 -412 33164 -5101 -34145 -33325 -10745 24072 49263 43111 22967
6409B2967j179j6823l2593j0534N412l633J360j3340J4926J2984j1500k7177k0545
$$ 22967 21788 4965 -27628 -38162 -32750 -36383 -35023 -48363 -33437 -20453 -31953 -59130 -79675
6396g9675Q809J8457o213j0334l415M2723P616k3072P702Q788P455o96j6052n032
$$ -79675 -70866 -52409 -58622 -68956 -72371 -29648 -22032 -45104 -37402 -28614 -21159 -21855 -37907 -42939
6382d2939p743J2455K1385r373k0647l982K610K2717J7572j1408j665j1361J860
$$ -42939 -50682 -38227 -16842 -26215 -46862 -50844 -48234 -25517 -7945 -19353 -21018 -32379 -30519
6369c0519j1333j4306K5361K4029j051l000q580j3863m6568J7551N928M01J0871
$$ -30519 -41852 -56158 -30797 -6768 -7819 -10819 -19399 -33262 -79830 -62279 -56351 -55950 -45079
6356d5079J0237J9539Q300J4559j3578l512j9838R373K2236j2666L3892J8781
$$ -45079 -34842 -15303 -7003 7556 -6022 -9534 -29372 -19999 2237 -10429 23463 42244
6344D2244k9191M638K7675J3214l1210l8659m292j853o158n806N686J2666K0606
$$ 42244 13053 17691 45366 58580 27370 -11289 -15581 -17434 -23592 -29398 -23712 -11046 9560
6331I560J0085p054K275m961O955l0124j9263j1964J4755J0655P902j8246q724
$$ 9560 19645 12591 14866 9905 16860 -13264 -32527 -44491 -29736 -19081 -11179 -29425 -38149
6318c8149K4744K9733k6585K494k2178k3985o631p8K0241P438j0087j852O595
$$ -38149 -13405 16328 -10257 -7763 -29941 -53926 -60557 -60635 -40394 -32956 -43043 -44895 -38300
6305c8300R575j197O416M014J0901k0183P125K2485j299J5970k759l9851j8324
$$ -38300 -28725 -29922 -23506 -19492 -8591 -28774 -21649 836 -463 15507 12748 -27103 -45427
6292d5427J9366J1866J9856j1537j2053q544o592k2768K644Q366L2488J4930j1404
$$ -45427 -26061 -14195 5661 -5876 -17929 -26473 -33065 -55833 -53189 -44823 -12335 2595 -8809
6279h809k0281j4609j519j4321k0156N954J3135M415L8175J588M315J1751J9182
$$ -8809 -29090 -43699 -45218 -59539 -79695 -73741 -60606 -56191 -18016 -16428 -12113 -362 18820
6266A8820j1611j0503j1109k1511j770K3624K0731K3143M543L957k2483P377L5209
$$ 18820 7209 -3294 -14403 -35914 -37684 -14060 6671 29814 34357 38314 15831 23208 58417
6253E8417P994k0838k3713j7286k4453L6535N988j812k2031J5735N416j6050k3464
$$ 58417 66411 45573 21860 4574 -19879 16656 22644 20832 -1199 14536 19952 3902 -19562
6240a9562p721J336R149J2387j3753K700j4397r295L2151O935O257J5591O754
$$ -19562 -27283 -25947 -16798 -4411 -18164 -15464 -29861 -39156 -7005 -70 6187 21778 28532
6227B8532r879J3960K2117k5765l8833M41J2535j1941k0022K073O726J1989N375
$$ 28532 18653 32613 54730 28965 -9868 -9427 3108 -8833 -28855 -26782 -20056 -8067 -2692
6214b692o526m129R453K1932J549j9402j5197k074j640P536M0124n317M697L956
$$ -2692 -9218 -13347 -3894 18038 19587 185 -15012 -17086 -18726 -11190 28934 23617 28314 32270
6200C2270k0308k8960l016Q272J6577O2m814n59j7831J745K4418p005m0157L3533
$$ 32270 11962 -16998 -20014 -11742 4835 4897 83 -476 -18307 -16562 7856 851 -39306 -5773
6186e773K1099K9954j1601j8732K712r674j4480J6446L5889k3428k7833Q942K966
$$ -5773 15326 45280 33679 14947 17659 7985 -6495 9951 45840 22412 -5421 3521 6487
6173F487k3598P88K4938O131k9968r162K628K8001m911p310m482K239o86J8108
$$ 6487 -17111 -16323 8615 14746 -15222 -24384 -21756 6245 1334 -5976 -10458 -8219 -8905 9203
6159I203J0540J6928J0392j5367k3116p489j4547q138j4448l172Q129J2104o095
$$ 9203 19743 36671 47063 31696 8580 1091 -13456 -21594 -36042 -39214 -31085 -18981 -25076
6146b5076q345n6009j7270K9770J0500J6506K1860K5193j8948P632L2036l0463
$$ -25076 -33421 -89430 -106700 -76930 -66430 -49924 -28064 -2871 -21819 -14187 17849 -12614
6134a2614k4137l82j4717j735O427K6898L8645J2537l1641j9272J1040K7137J4379
$$ -12614 -36751 -37133 -51850 -53585 -47158 -20260 18385 30922 -719 -19991 -8951 18186 32565
6121C2565m606j0063l700j5568P047K459l3707L4471J8964k3663j4152Q258j146
$$ 32565 27959 17896 14196 -1372 5675 8134 -25573 8898 27862 4199 -9953 -1695 -2841
6108b841l1109k4690J0485K2901J6892j1557k5657O124M6470J312k7135r564K5912
$$ -2841 -33950 -58640 -48155 -25254 -8362 -19919 -45576 -39452 7018 8330 -18805 -28369 -2457
6095b457O754J279K6154J6583j2773j1070l855K467O309k3343j7473j0351P772
$$ -2457 4297 5576 31730 48313 35540 24470 20615 23082 29391 6048 -11425 -21776 -14004
6082a4004o473r733j5757J3471R938P104r040j0127O600p129p431M222J4548M726
$$ -14004 -20477 -30210 -45967 -32496 -22558 -15454 -24494 -34621 -28021 -35150 -42581 -38359 -23811 -19085
6068a9085m720J8814L6157l966j3908k1465k0883j1234J1693O089q114j0727q74
$$ -19085 -23805 -4991 31166 27200 13292 -8173 -29056 -40290 -28597 -22508 -30622 -41349 -42223
6055d2223J7073q81K998J0924J470J7036J8809K156m599k8296n111J0981K499
$$ -42223 -25150 -26031 -23033 -12109 -10639 6397 25206 27362 22763 -5533 -10644 337 2836
6042B836q293N140m0044k143K0153p124k0564K9471L401J1320K6315J7860p665
$$ 2836 -5457 -317 -40361 -42504 -22351 -29475 -50039 -20568 -17167 -5847 20468 38328 30663
6029C0663j3541k7704q397o417J6188p80L559O888k4115l2315O069j822q199K1494
$$ 30663 17122 -10582 -18979 -25396 -9208 -9988 -6429 459 -23656 -55971 -49902 -51724 -59923 -38429
6015c8429K6511K5333R905l926l147l2061L017K535J8406l170j5417J4930J408
$$ -38429 -11918 13415 23320 19394 16247 -15814 -12797 -10262 8144 4974 -10443 4487 5895
6002E895k4006j6654K3456L9731J1937l3108J58J922j7888M812K5754m1042k6386
$$ 5895 -18111 -34765 -11309 28422 40359 7251 7409 9331 -8557 -3745 22009 -19033 -45419
5989d5419J7475p225K983J5216k3561P891J2665j167k6056o412M1568J9635k4470
$$ -45419 -27944 -35169 -32186 -16970 -40531 -32640 -19975 -21142 -47198 -53610 -12042 7593 -16877
5976a6877j1757R495k6853L836l556L862R334p877R455j2978m100L8693O111j4752
$$ -16877 -28634 -19139 -45992 -42156 -45712 -41850 -32516 -40393 -30938 -43916 -48016 -9323 -3212 -17964
5962a7964L7111j254j4521j1022j5894m697k0278K0279K5756J6554L9407o47k9163
$$ -17964 19147 17893 3372 -7650 -23544 -28241 -48519 -28240 -2484 14070 53477 52830 23667
5949B3667p651K4451q254m1569k0940j453J1882J7048q60j238k2509m111n74j5321
$$ 23667 16016 40467 32213 -9356 -30296 -31749 -19867 -2819 -3679 -4917 -27426 -31537 -32111 -47432
5935d7432j1502J8618R374O490j8401N433K6137K7087j0555j1134M541R51j5631
$$ -47432 -58934 -40316 -30942 -24452 -42853 -37420 -11283 15804 5249 -5885 -1344 -393 -16024
5922a6024J5382K7197j6654k2367o743L333k1878r503L2422J592R478j3937k4098
$$ -16024 -642 26555 9901 -12466 -19209 -15876 -37754 -47257 -14835 -13243 -3765 -17702 -41800
5909d1800J5349K8302O570J8743J5936n0476j8262K1302K2093j7739J016K3138
$$ -41800 -26451 1851 8421 27164 43100 -7376 -25638 -4336 17757 18 1034 24172
5897B4172J7285o75j8173n45Q295o884j2256k0682j5526R245L4476k799j7466
$$ 24172 41457 40782 22609 22064 30359 23475 11219 -9463 -24989 -15744 18732 15933 -1533
5884a533J4582k985j0309p734m25n235p492J252K3934N92N420K6388P412Q024
$$ -1533 13049 10064 -245 -7979 -8404 -13639 -21131 -19879 4055 4647 10067 36455 43867 51891
5870E1891j3069j5080K4190K2229j1097k4110J1120k6776r199J3552K3299k7170
$$ 51891 38822 23742 47932 70161 59064 34954 46074 19298 10099 23651 46950 19780
5858A9780m2094P427L819j3594k4391l467J5273L1647J7619J5129j1072k7953
$$ 19780 -22314 -14887 -11068 -24662 -49053 -52520 -37247 -5600 12019 27148 16076 -11877
5846a1877j6710J5456J9427R46M845L030k3391m3058N186L8462k296n279j7426
$$ -11877 -28587 -13131 6296 7242 12087 15117 -8274 -51332 -46146 -7684 -9980 -15259 -32685
5833c2685j8462J2743K3831J0743K996Q246J311R239l211R149m485p255j1606
$$ -32685 -51147 -38404 -14573 -3830 -834 7412 8723 17962 14751 23900 19415 12160 554
5820E54M635M607k7773j7920K6823K08p489J2380K571j425J816j4387r386o450
$$ 554 5189 9796 -17977 -35897 -9074 -8866 -16355 -3975 -1404 -2829 -1013 -15400 -24786 -31236
5806c1236K2225J8701k2940k2445M110J0140L9576l784l7010j6896k9488K8872
$$ -31236 -9011 9690 -13250 -35695 -31585 -21445 18131 14347 -22663 -39559 -69047 -40175
5794d0175K5793j4403n165K7127m337L703Q089j0J8962j1997K0425l1434j1391
$$ -40175 -14382 -28785 -33950 -6823 -11160 -7457 632 622 19584 7587 28012 -3422 -14813
5781a4813P882q562J3915j0264M641M605r310k282O874P946n589N048K5344J0800
$$ -14813 -6931 -15493 -1578 -11842 -7201 -2596 -11906 -14188 -7314 632 -4957 91 25435 36235
5767C6235k6009P060L2585n5752l4904p270l835j2167J5625K3991L3156J0774
$$ 36235 10226 17286 49871 -5881 -40785 -48055 -51890 -64057 -48432 -24441 8715 19489
5755A9489k1868p178M133O040J5532P633O577m316l3250l9247j9281j7913J1750
$$ 19489 -2379 -9557 -5424 616 16148 23781 30358 26042 -7208 -46455 -65736 -83649 -71899
5742g1899L9346k0000k2479L4544M4307J9917m795n424k1110J3460K4590j3017
$$ -71899 -32553 -52553 -75032 -40488 3819 23736 18941 13517 -7593 5867 30457 17440
5730A7440k8138j3993O069J748J0332J935r17J4315N879j2542j4706J923J1696
$$ 17440 -10698 -24691 -18622 -16874 -6542 -4607 -5524 8791 14670 2128 -12578 -10655 1041
5717A041m87m421n690l7862k1495K4910m252p818J5504J3152j7306o643R966J4223
$$ 1041 554 -3867 -9557 -47419 -68914 -44004 -48256 -56074 -40570 -27418 -44724 -51367 -41401 -27178
5703b7178K7821K2155R688j822k3539l8590j3992j9296k6647L7184K0659K5948
$$ -27178 643 22798 32486 30664 7125 -31465 -45457 -64753 -91400 -54216 -33557 -7609
5691g609K8982j180l0003p170K4601k8529J555J0481J1475k5736j8196M4447R461
$$ -7609 21373 20193 -9810 -16980 7621 -20908 -19353 -8872 2603 -23133 -41329 3118 12579
5678A2579j3658K4210p317k5220Q127K5761O976l5436m7091j441J3241J6003M1216
$$ 12579 -1079 23131 15814 -9406 -1279 24482 31458 -3978 -51069 -52510 -39269 -23266 17950
5665A7950K6465j2320m3272j4855R120J8452p647j1019p006k350N213j7371K6971
$$ 17950 44415 32095 -11177 -26032 -16912 1540 -6107 -17126 -24132 -26482 -21269 -38640 -11669
5652a1669M3220j5396m333j0878n085R627J2615k1161n690j403j5510K7569l162
$$ -11669 31551 16155 11822 944 -4141 5486 18101 -3060 -8750 -10153 -25663 1906 -1256
5639a256k5202L1117o498k0024J4915N738k4j5329k5901J1388M0157N72P529q904
$$ -1256 -26458 4659 -1839 -21863 -6948 -1210 -1234 -16563 -42464 -31076 9081 9653 17182 8278
5625H278K421q593r712m967L67q225J7896L825j84L42m306J6153J3912r913J743
$$ 8278 10699 2106 -7606 -12573 -12206 -20431 -2535 1290 1106 1448 -2858 13295 27207 17294 19037
5610A9037k6791m0472k7145j956J3252L9461K0373R92j2695j6749l1507p444L8843
$$ 19037 -7754 -48226 -75371 -77327 -64075 -24614 -4241 -3249 -15944 -32693 -64200 -71644 -32801
5597c2801L5304J7140j2675j5674p934Q851j5559Q938J6300Q966J1089k0660l0744
$$ -32801 2503 19643 6968 -8706 -16640 -7789 -23348 -14410 1890 10856 21945 1285 -29459
5584b9459n287K4290K51k707K1341O532J3276J4360j7133k3048k1615N929K2945
$$ -29459 -34746 -10456 -10205 -12912 8429 14961 28237 42597 25464 2416 -19199 -13270 9675
5571I675O676J046j3999j8086m291J9179J2077j1732L056j8652N793L1696j5127
$$ 9675 16351 17397 3398 -14688 -18979 200 12277 545 3601 -15051 -9258 22438 7311
5558G311j3594p711J2452M218R421k4020m1427o549j2588m73K2581K2169M414
$$ 7311 -6283 -13994 -1542 2676 12097 -11923 -53350 -59899 -72487 -72960 -50379 -28210 -23796
5545b3796K682r582m767J2275k0998o879R999P139P271K7050o559J9420K0362
$$ -23796 -21114 -30696 -35463 -23188 -44186 -51065 -41066 -33927 -26656 394 -6165 13255 33617
5532C3617l1428J4989Q903j3130j5414j1338L675j3944j6452j0464J1103K7953
$$ 33617 2189 17178 26081 12951 -2463 -13801 -10126 -24070 -40522 -50986 -39883 -11930
5520a1930R887k8379p370O588K8315P270P083j9734k279k1635j5617N659O774
$$ -11930 -2043 -30422 -37792 -31204 -2889 4381 11464 -8270 -10549 -32184 -47801 -42142 -35368
5507c5368L6392m469L335q418R302o121M480l834o15o761m693P551J7349J8327
$$ -35368 1024 -3445 -110 -8528 774 -5347 -867 -4701 -5316 -12077 -16770 -9219 8130 26457
5493B6457L303k0238j2960j0607l548J515o497K4970K7905j0275n126j790j6388
$$ 26457 29760 9522 -3438 -14045 -17593 -16078 -22575 2395 30300 20025 14899 13109 -3279
5480c279l0185J1439J1568J6157O861k2929r540j0139p855J531M509q460J9385
$$ -3279 -33464 -22025 -10457 5700 12561 -10368 -19908 -30047 -37902 -36371 -31862 -40322 -20937
5467b0937O027J1463Q660k4890P84L3732j7564k40K6763K968k0010m127n11k0824
$$ -20937 -14910 -3447 5213 -19677 -18893 14839 -2725 -2965 23798 26766 6756 2629 2118 -18706
5453a8706J1098J7789J9518Q015J0144j866J669k2431O78l0776m5918j824M1303
$$ -18706 -7608 10181 29699 37714 47858 45992 47661 25230 25908 -4868 -50786 -52610 -11307
5440a1307J0518M068J8837p437k8190l6454m31J0926J5753o387J8109L1754j8302
$$ -11307 -789 3279 22116 14679 -13511 -49965 -50396 -39470 -23717 -30104 -11995 19759 1457
5427A457l7136k5292K1750J1484K2002L021j0424k732K0602J5244j0305J7934
$$ 1457 -35679 -60971 -39221 -27737 -5735 -2714 -13138 -15870 4732 19976 9671 27605
5415B7605L7620k595j8522q441J2374k0029k3076J9331J705J949j5570n018Q658
$$ 27605 65225 62630 44108 35667 48041 28012 4936 24267 25972 27921 12351 7333 15991
5402A5991j1487k5849m6014K0488M8322L817l3386l643L948J3368K5590m05j0694
$$ 15991 4504 -21345 -67359 -46871 1451 5268 -28118 -31761 -27813 -14445 11145 10740 46
5389D6l8314k4123L7690J0677J750J7357j1530j3789J7500J9341m707k6365l6518
$$ 46 -38268 -62391 -24701 -14024 -12274 5083 -6447 -20236 -2736 16605 11898 -14467 -50985
5376e0985m480n092J9775P205M50k9348J0219p80j1178K3025Q891N224J1203M509
$$ -50985 -55465 -60557 -40782 -33577 -33127 -62475 -52256 -53036 -64214 -41189 -32298 -27074 -15871 -11362
5362a1362o965O186j0575r615j0620J4173J3724k488M628L5850O531k4679m1198
$$ -11362 -18327 -12141 -22716 -32331 -42951 -28778 -15054 -17542 -12914 22936 29467 4788 -36410
5349c6410N894L0516Q570K2045R100l4224K474J715j0011j1724j7794k073j341
$$ -36410 -30516 0 8570 30615 39715 5491 7965 9680 -331 -12055 -29849 -31922 -33263
5336c3263J8743r358J4583J3829O959j1979r454j9494k8030k614L4726J1851j1225
$$ -33263 -14520 -23878 -9295 4534 11493 -486 -9940 -29434 -57464 -60078 -25352 -13501 -24726
5323b4726M029K2772P779K481J5705k2810j6377J9971J6952J3141R11j0287L089
$$ -24726 -20697 2075 9854 12335 28040 5230 -11147 8824 25776 38917 39828 29541 32630
5310C2630k0156j6020r407j0386M137J418O894P491J3349k6794J4314m761O473
$$ 32630 12474 -3546 -12953 -23339 -19202 -17784 -10890 -3399 9950 -16844 -2530 -7291 -818
5297h18k5968R443L4648J9P128k6737k8709n27K2841J2895L414R790J6245k8593
$$ -818 -26786 -17343 17305 17324 24452 -2285 -30994 -31521 -8680 4215 7629 17419 33664 5071
5283E071j5930J4898K7650m307m1516k4146L513O227L565K430L185m45L1661K252
$$ 5071 -10859 4039 31689 27382 -14134 -38280 -34767 -28540 -24975 -22545 -19360 -19805 11856 14108
5269A4108l4471O213K3234q970k0579k6234p70J0513J6010N10j656L321J1071
$$ 14108 -20363 -14150 9084 114 -20465 -46699 -47469 -36956 -20946 -20436 -22092 -18771 -7700
5256g700N055O646J8756l586m740j2033n179K70K2232l710j5532r473r148J9539
$$ -7700 -2645 4001 22757 19171 14431 2398 -2781 -2511 19721 16011 479 -8994 -18142 1397
5242A397o222k4186J8835J1036r495N953m183L1193m927j0665k53k679q11K2940
$$ 1397 -4825 -29011 -10176 860 -8635 -2682 -6865 24328 19401 8736 8483 5804 4993 27933
5228B7933N964j0509J0106J0570j8147k6889k4129O20N526k2977r057K1528Q246
$$ 27933 33897 23388 33494 44064 25917 -972 -25101 -24481 -18955 -41932 -50989 -29461 -21215
5215b1215l639J8761R998K0238J9823q523k5135j0975m853K7176J3316j1197l10
$$ -21215 -24854 -6093 3905 24143 43966 35443 10308 -667 -5520 21656 34972 23775 23465
5202B3465Q279k260p206n924p111P870j5081j6061j3078L175Q757o753J4152j8424
$$ 23465 31744 29484 22278 16354 9243 17113 2032 -14029 -27107 -23932 -15175 -21928 -7776 -26200
5188b6200J4492J911J3329p619J7184o606j5559r684Q178J0667p36o653J0393
$$ -26200 -11708 -9797 3532 -4087 13097 6491 -9068 -18752 -10574 93 -643 -7296 3097
5175C097J3729O37p184j0130k2755N662l475N609k7659M2347J8370o324K388M095
$$ 3097 16826 17463 10279 149 -22606 -16944 -20419 -14810 -42469 -122 18248 11924 14312 18407
5161A8407n805j5654j3383L3557p678m8052j5894k54R863m199j4210O084J0549
$$ 18407 12602 -3052 -16435 17122 9444 -38608 -54502 -54756 -44893 -49092 -63302 -57218 -46669
5148d6669L4820j981q556L3599k064l6411j4750k364R376K3339J2926k0385j1464
$$ -46669 -11849 -13830 -22386 11213 9149 -27262 -42012 -44376 -35000 -11661 1265 -19120 -30584
5135c0584L0257q686J364K3422K8072p521j0507n011j2067j1213J6624R161j4102
$$ -30584 -327 -9013 -7649 15773 43845 36324 25817 20806 8739 -2474 14150 23311 9209
5122I209j6872j9929m689J3168L3959L0244k2589k7628r21K435j4970m511M354
$$ 9209 -7663 -27592 -32281 -19113 14846 45090 22501 -5127 -6048 -3613 -18583 -23094 -18740
5109a8740K8554J6486q796K575K3185j918q120p570p874k1096j1331L048p894
$$ -18740 9814 26300 17504 20079 43264 41346 33226 25656 17782 -3314 -14645 -11597 -19491
5096a9491P291K4739l374j2642O50K9251J4864j8789k0032j4868J2833n798n747
$$ -19491 -12200 12539 9165 -3477 -2827 26424 41288 22499 2467 -12401 432 -5366 -11113
5083a1113n327P504J9462J3457r393k0741J230L085p286p326j194J200j742j7408
$$ -11113 -16440 -8936 10526 23983 14590 -6151 -4921 -1836 -9122 -16448 -17642 -16442 -18184 -35592
5069c5592O179J0936L0008R610J41k9091K624m636l971L495q066n652k1110l0618
$$ -35592 -29413 -18477 11531 21141 21282 -7809 -5185 -9821 -13792 -10297 -18363 -24015 -45125 -75743
5055g5743J3520K4838J3744J0122K1614J8638R480k9130Q724O445k8606k7778
$$ -75743 -62223 -37385 -23641 -13519 8095 26733 36213 7083 15807 22252 -6354 -34132
5043c4132l0309L2677M5329m749J7491k4449k2462l028J0468j618p265J1835K3322
$$ -34132 -64441 -31764 13565 8816 26307 1858 -20604 -23632 -13164 -14782 -22047 -10212 13110
5030A3110j642j3898r550O132J3463J786l4514j6417N001K5571L4117L712k7054
$$ 13110 11468 -2430 -11980 -5848 7615 9401 -25113 -41530 -36529 -10958 23159 26871 -183
5017a83j6691J0058j9888k9014O667L6546K6734J8001j4261k8519n91J8476J3060
$$ -183 -16874 -6816 -26704 -55718 -49051 -12505 14229 32230 17969 -10550 -11141 7335 20395
5004B0395j98m93P646m097J2393R732m2631k9882M390K0981J7979o248L050p684
$$ 20395 20197 19704 27350 23253 35646 45378 2747 -27135 -22745 -1764 16215 9967 13017 5333
4990E333M587j50j4004R237O01j1798m581l48K3152J0560R298L898r195P270J4065
$$ 5333 9920 9770 -4234 5003 5604 -6194 -10775 -11123 12029 22589 31887 35785 26590 33860 47925
4975D7925k6300j6526j6593K1441L3210J4999m3335l612J4384J3223r604Q302
$$ 47925 21625 5099 -11494 9947 43157 58156 14821 11209 25593 38816 29212 37514
4963C7514J6563j6438Q604K5125l0139k5039j8234l2854k456L8638L7235J341
$$ 37514 54077 37639 46243 71368 41229 16190 -2044 -34898 -37354 1284 38519 39860
4951C9860k9436m9963p437k495J9110K613j199O299q89j959o080J3083k124r167
$$ 39860 10424 -39539 -46976 -49471 -30361 -27748 -28947 -22648 -23537 -25496 -31576 -18493 -20617 -29784
4937b9784m393J5506j1686Q15K5064J9942J1636j7713j3100p040q633K0040m341
$$ -29784 -34177 -18671 -30357 -29542 -4478 15464 27100 9387 -3713 -10753 -19386 654 -3687
4924c687J0460N405J3900O659k3074j5207K767n155K3868n869q549L6258M815
$$ -3687 6773 12178 26078 32737 9663 -5544 -2777 -7932 15936 10067 1518 37776 42591
4911D2591l1420K383N113j3059Q420J588n816l510k6675j2018k1578n33N350L6612
$$ 42591 11171 13554 18667 5608 14028 15616 9800 6290 -20385 -32403 -53981 -54514 -49164 -12552
4897a2552J5470j9824j5564J6974R306R924K2354j5760k8147j2752K1567L0599
$$ -12552 2918 -16906 -32470 -15496 -6190 3734 26088 10328 -17819 -30571 -9004 21595
4885B1595L004j6754R68j3622l2761k4771M51Q593k726J2553J3269q512n269k3510
$$ 21595 24599 7845 8813 -4809 -37570 -62341 -61890 -53297 -56023 -43470 -30201 -38713 -43982 -67492
4871f7492k1767Q003J4157L6483K2919Q75j3994J854J6424l182k4579j2619L0238
$$ -67492 -89259 -81256 -67099 -30616 -7697 -6822 -20816 -18962 -2538 -5720 -30299 -42918 -12680
4858a2680J1430o915K3756j329k6026j7112K2788L0116m143k671n224m420J1337
$$ -12680 -1250 -8165 15591 14262 -11764 -28876 -6088 24028 19885 17214 11990 7570 18907
4845A8907r956m071j9372J0057Q921K1539J2686m3258j1623J338J4735k8551k0845
$$ 18907 8951 4880 -14492 -4435 4486 26025 38711 -4547 -16170 -14832 -97 -28648 -49493
4832d9493J0267O735L4323J0779O401j5682J1187P916j3190n9j72o140j8985j4714
$$ -49493 -39226 -32491 1832 12611 19012 3330 14517 22433 9243 9184 9012 2872 -16113 -30827
4818c0827J3727J2071j8373k5459Q020L3233J9117j2269R741J3064J761q616k6489
$$ -30827 -17100 -5029 -23402 -48861 -40841 -7608 11509 -760 8981 22045 23806 15190 -11299
4805a1299j3132K3365K4641j3287l5801L664j6244j4550K1358L831o455Q74k006
$$ -11299 -24431 -1066 23575 10288 -25513 -21849 -38093 -52643 -31285 -27454 -33909 -33035 -35041
4792c5041K0632J4013j9246j3295n605J0729k727Q595L0836J2376M164r624K897
$$ -35041 -14409 -396 -19642 -32937 -38542 -27813 -30540 -21945 8891 21267 25431 15807 18704
4779A8704N871n296k0115K5216J2993j2584M359j9819j2117o794L2327j2130k0497
$$ 18704 24575 19279 -836 24380 37373 24789 29148 9329 -2788 -9582 22745 10615 -9882
4766i882j0584J2793K27Q008K57l850j969p97j4169j7805j667J3086K073j6233
$$ -9882 -20466 -7673 -7446 562 819 -3031 -5000 -5797 -19966 -37771 -39438 -26352 -24279 -40512
4752d0512M920P397P001L0149J2147P471l1279j6284J8462j2862l5372r000K6311
$$ -40512 -35592 -28195 -21194 8955 21102 28573 -2706 -18990 -528 -13390 -48762 -57762 -31451
4739c1451K0987m29l208l760J1398j0845J5984K411K349l4484P098J958q306J1900
$$ -31451 -10464 -10893 -14101 -17861 -6463 -17308 -1324 1087 3436 -31048 -23950 -21992 -30298 -18398
4725a8398J5229N410r712J817l4543k2912R659K1634L1993J8769P325k851k5098
$$ -18398 -3169 2241 -7471 -5654 -40197 -63109 -53450 -31816 177 18946 26271 23420 -1678
4712a678j5932M770K33J3862J292M336n740J5657o69l871j5402j242K1266k699
$$ -1678 -17610 -12840 -12607 1255 2547 6883 1143 16800 16131 12260 -3142 -4384 16882 14183
4698A4183j6545j3l090J4531J4639J1450k0684p428K0L191k6697q148L3908r836
$$ 14183 -2362 -2375 -5465 9066 23705 35155 14471 7043 7063 10254 -16443 -24591 9317 -519
4684e19L311N577k6416j1526K829Q202L1166k5908k538k975J860L1905O904j4537
$$ -519 2792 8369 -18047 -29573 -26744 -18542 12624 -13284 -15822 -18797 -16937 14968 21872 7335
4670G335k2208m740J0290L8101O705j557p144O398J7595k9618l8004p729L1085
$$ 7335 -14873 -19613 -9323 28778 35483 33926 26782 33180 50775 21157 -16847 -24576 6509
4657F509k0651j2037n185J8547k386k0181L0234J7201j3670R904J0887k7078O078
$$ 6509 -14142 -26179 -31364 -12817 -15203 -35384 -5150 12051 -1619 8285 19172 -7906 -1828
4644a828Pj5459J1254K0736q814j7986Q104k2671k6005Q106N718p458K3339K8997
$$ -1828 -1821 -17280 -6026 14710 5896 -12090 -3986 -26657 -52662 -44556 -38838 -46296 -22957 6040
4630F040L2751K5341N918j9306o032m229l724p053j4656k3144J1853L18k4478
$$ 6040 38791 64132 70050 50744 44712 40483 36759 29706 15050 -8094 3759 4077 -20401
4617b0401J4963L4723l603L767j4765k0852K1676N654j8663J3404r2p145J476
$$ -20401 -5438 29285 25682 29449 14684 -6168 15508 21162 2499 15903 15811 8666 10142
4604A0142J0130J402j7276J419J7090J266k3558k2833P623K1962j5126J3744l08
$$ 10142 20272 21674 4398 5817 22907 24173 615 -22218 -14595 7367 -7759 5985 5677
4591E677m4377M985J6663L242Q28R453J5122K4314L166l9447k0008R50P469K2599
$$ 5677 -38700 -33715 -17052 -13810 -12982 -3529 11593 35907 39073 -374 -20382 -19432 -11963 10636
4577A0636J0196o724j7774J2046l64J410J2508l4184m256J1614j2261j4521R534
$$ 10636 20832 14108 -3666 8380 8016 9426 21934 -12250 -16506 -4892 -17153 -31674 -22140
4564b2140R86J0252j6829K111J4005m679j4667k135N364q629k687K2966J5190
$$ -22140 -21154 -10902 -27731 -25620 -11615 -16294 -30961 -33096 -27732 -36361 -39048 -16082 -892
4551h92O527l0876l8432L9966L6985j0349l183p261n048l881j672Q848K0757J5946
$$ -892 5635 -25241 -63673 -23707 13278 2929 -254 -7515 -12563 -16444 -18116 -9268 11489 27435
4537B7435K64j3185k6563J244j8806K6516J2193o055j3540k0285K1178j568k7135
$$ 27435 27699 14514 -12049 -10805 -29611 -3095 9098 3043 -10497 -30782 -9604 -11172 -38307
4524c8307p928J0856M510L927j8893N561M157J9758K5943K293j5515J0495j3374
$$ -38307 -46235 -35379 -30869 -26942 -45835 -40274 -36117 -16359 9584 11877 -3638 6857 -6517
4511f517K5820K121o806l547n969r138J2738j0927m291J4906m832Q944J964K703
$$ -6517 19303 21424 14618 11071 5102 -4036 8702 -2225 -6516 8390 3558 12502 14466 17169
4497A7169r974l152K562k6276k6984J3411J0041o396l4625L2468P269K0497L0306
$$ 17169 7195 4043 6605 -19671 -46655 -33244 -23203 -29599 -64224 -31756 -24487 -3990 26316
4484B6316J6083j759k1046j7001N138j7950K5808j2387j191j1433R728k3684l2633
$$ 26316 42399 40640 19594 2593 7731 -10219 15589 3202 2011 -9422 306 -23378 -56011
4471e6011J1531K0699j1572j2318R074r658j6167K7482K6063L0689J1338n288
$$ -56011 -44480 -23781 -35353 -47671 -38597 -48255 -64422 -36940 -10877 19812 31150 25862
4459B5862J16l0835N066J9635J2776J380K823p433k4152j2131j8629l2102j8335
$$ 25862 25978 -4857 209 19844 32620 34000 36823 29390 5238 -6893 -25522 -57624 -75959
4446g5959K3637M4316J3629k038J524K518n969o316J2851J2927k274n479l545
$$ -75959 -52322 -8006 5623 3585 5109 7627 1658 -4658 8193 21120 18846 13367 9822
4433I822Q026n630j9803k2709J2600L986J4278J8583M88J0947k5505O949J492
$$ 9822 17848 12218 -7585 -30294 -17694 -13708 570 19153 19641 30588 5083 12032 13524
$$ [...]
##END NTUPLES=NMR SPECTRUM
##END=
