##TITLE=Analysis number 321333
Compound Code cc 56063
Book Reference 438/162
Project Code adrs
Chemist Name antons
##JCAMPDX= 6.0         $$ Bruker NMR JCAMP-DX V2.0
##DATA TYPE= NMR SPECTRUM
##DATA CLASS= NTUPLES
##ORIGIN= Bruker BioSpin GmbH
##OWNER= nmr
$$ XWIN-NMR		Version 3.5
$$ Fri Aug 11 09:08:33 2006 GMT Daylight Time (UT+1h)  MAYBRIDGE\nmr@NMR_250MHZ
##.OBSERVE FREQUENCY= 250.131544655141
##.OBSERVE NUCLEUS= ^1H
##.ACQUISITION MODE= SIMULTANEOUS (DQD)
##.ACQUISITION SCHEME= undefined
##.AVERAGES= 16
##.DIGITISER RES= 18
##SPECTROMETER/DATA SYSTEM= dpx250
##.PULSE SEQUENCE= zg30
##.SOLVENT NAME= DMSO
##.SHIFT REFERENCE= (INTERNAL, DMSO, 0, 16.522)
##AUDIT TRAIL= $$ (NUMBER, WHEN, WHO, WHERE, WHAT)
$$ ##TITLE= Audit trail, XWIN-NMR		Version 3.5
$$ ##JCAMPDX= 5.01
$$ ##ORIGIN= Bruker BioSpin GmbH
$$ ##OWNER= nmr
$$ C:\u/data/dgb/nmr/ADRS/700/pdata/1/auditp.txt
$$ ##AUDIT TRAIL=  $$ (NUMBER, WHEN, WHO, WHERE, WHAT)
(   1,<2006-08-11 09:08:01.70 +100>,<MAYBRIDGE\nmr>,<NMR_250MHZ>,
      <created by zg, POWCHK disabled, PULCHK disabled
       configuration hash MD5:
       E2 DF 36 D8 04 B2 41 60 5A D7 A3 38 5A 4B D0 FE
       data hash MD5: 64K
       61 E6 FA DC 2C 22 22 19 A8 31 27 D0 3A B7 F1 FF>)
(   2,<2006-08-11 09:08:17.58 +100>,<MAYBRIDGE\nmr>,<NMR_250MHZ>,
      <Start of raw data processing
       ef LB = 0.3 FT_mod = 6 PKNL = 1 SI = 32K 
       data hash MD5: 32K
       88 E6 38 AA D3 C1 72 AB 16 26 AF B1 B9 C9 53 F5>)
(   3,<2006-08-11 09:08:21.31 +100>,<MAYBRIDGE\nmr>,<NMR_250MHZ>,
      <apk 
       data hash MD5: 32K
       7B 41 0E 92 02 23 BA 05 AB 89 E0 CA 93 2A 51 5D>)
(   4,<2006-08-11 09:08:22.34 +100>,<MAYBRIDGE\nmr>,<NMR_250MHZ>,
      <abs ABSG = 5 
       data hash MD5: 32K
       95 B7 57 13 B8 6F A4 E0 59 C4 0F 8C 3D 2C DC 4E>)
$$ ##END=
$$ 
$$ hash MD5
$$ 8B D3 FB 81 9B 42 0C 05 6D 77 27 70 ED 30 8E 8A
##$RELAX= 
##$RELAX= 
##$RELAX= 
##$RELAX= 
##$RELAX= 
##$RELAX= 
##$RELAX= 
$$ Bruker specific parameters
$$ --------------------------
##$DU= <C:\u>
##$EXPNO= 700
##$NAME= <ADRS>
##$PROCNO= 1
##$TYPE= <nmr>
##$USER= <dgb>
##$AMP= (0..31)
100 100 100 100 100 100 100 100 100 100 100 100 100 100 100 100 100 100 
100 100 100 100 100 100 100 100 100 100 100 100 100 100 
##$AQSEQ= 0
##$AQ_mod= 3
##$AUNM= <au_zg>
##$AUTOPOS= <5 >
##$BF1= 250.13
##$BF2= 250.13
##$BF3= 250.13
##$BF4= 250.13
##$BF5= 500.13
##$BF6= 500.13
##$BF7= 500.13
##$BF8= 500.13
##$BYTORDA= 1
##$CFDGTYP= 0
##$CFRGTYP= 5
##$CHEMSTR= <none>
##$CNST= (0..31)
1 1 145 1 1 1 1 1 1 1 1 1 1 1 1 1 1 1 1 1 1 1 1 1 1 1 1 1 1 1 1 1 
##$CPDPRG= <>
##$CPDPRG1= <>
##$CPDPRG2= <>
##$CPDPRG3= <>
##$CPDPRG4= <mlev>
##$CPDPRG5= <mlev>
##$CPDPRG6= <mlev>
##$CPDPRG7= <mlev>
##$CPDPRG8= <mlev>
##$CPDPRGB= <>
##$CPDPRGT= <>
##$D= (0..31)
0 1 0 0 0 0 0 0 0 0.06 0 0 0 0 0 0 0.0002 0 0 0 0 0 0 0 0 0 0 0 0 0 0 
0 
##$DATE= 1155283680
##$DBL= (0..7)
120 120 120 120 120 120 120 120 
##$DBP= (0..7)
150 150 150 150 150 150 150 150 
##$DBP07= 0
##$DBPNAM0= <>
##$DBPNAM1= <>
$$ [...]
##$SUBNAM7= <"">
##$SUBNAM8= <"">
##$SUBNAM9= <"">
##$SW= 20.6930455092707
##$SWIBOX= (0..15)
0 0 3 0 0 0 0 0 0 0 0 0 0 0 0 0 
##$SW_h= 5175.983436853
##$TD= 65536
##$TD0= 1
##$TE= 295.16
##$TE2= 300
##$TE3= 300
##$TEG= 300
##$TL= (0..7)
0 120 120 120 120 120 120 120 
##$TP= (0..7)
150 150 150 150 150 150 150 150 
##$TP07= 0
##$TPNAME0= <>
##$TPNAME1= <>
##$TPNAME2= <>
##$TPNAME3= <>
##$TPNAME4= <>
##$TPNAME5= <>
##$TPNAME6= <>
##$TPNAME7= <>
##$TPOAL= (0..7)
0.5 0.5 0.5 0.5 0.5 0.5 0.5 0.5 
##$TPOFFS= (0..7)
0 0 0 0 0 0 0 0 
##$TUNHIN= 0
##$TUNHOUT= 0
##$TUNXOUT= 0
##$USERA1= <user>
##$USERA2= <user>
##$USERA3= <user>
##$USERA4= <user>
##$USERA5= <user>
##$V9= 5
##$VALIST= <valist>
##$VCLIST= <CCCCCCCCCCCCCCC>
##$VD= 0
##$VDLIST= <DDDDDDDDDDDDDDD>
##$VPLIST= <PPPPPPPPPPPPPPP>
##$VTLIST= <TTTTTTTTTTTTTTT>
##$WBST= 1024
##$WBSW= 4
##$XGAIN= (0..3)
0 0 0 0 
##$XL= 0
##$YL= 0
##$YMAX_a= 263338
##$YMIN_a= -575973
##$ZGOPTNS= <>
##$ZL1= 120
##$ZL2= 120
##$ZL3= 120
##$ZL4= 120
##$ABSF1= 16.522
##$ABSF2= -4.171173
##$ABSG= 5
##$ABSL= 3
##$ALPHA= 0
##$AQORDER= 0
##$ASSFAC= 0
##$ASSFACI= 0
##$ASSFACX= 0
##$ASSWID= 0
##$AUNMP= <proc_1d>
##$AZFE= 0.1
##$AZFW= 0.1
##$BCFW= 0
##$BC_mod= 0
##$BYTORDP= 0
##$COROFFS= 0
##$CY= 12.5
##$DATMOD= 1
##$DC= 0
##$DFILT= <>
##$DTYPP= 0
##$F1P= 14.0000005364418
##$F2P= -0.99999901652339
##$FCOR= 0.5
##$FTSIZE= 32768
##$FT_mod= 6
##$GAMMA= 0
##$GB= 0
##$INTBC= 1
##$INTSCL= 1
##$ISEN= 128
##$LB= 0.3
##$LEV0= 0
##$LPBIN= 0
##$MAXI= 10000
##$MC2= 0
##$MEAN= 0
##$ME_mod= 0
##$MI= 0
##$NCOEF= 0
##$NC_proc= -6
##$NLEV= 6
##$NOISF1= 0
##$NOISF2= 0
##$NSP= 0
##$NTH_PI= 0
##$NZP= 0
##$OFFSET= 16.522
##$PC= 1
##$PHC0= 139.2498
##$PHC1= 1.685944
##$PH_mod= 1
##$PKNL= yes
##$PPARMOD= 0
##$PSCAL= 4
##$PSIGN= 0
##$REVERSE= no
##$SF= 250.13
##$SI= 32768
##$SIGF1= 0
##$SIGF2= 0
##$SINO= 400
##$SIOLD= 32768
##$SREGLST= <1H.DMSO>
##$SSB= 0
##$STSI= 32768
##$STSR= 0
##$SW_p= 5175.98343685301
##$SYMM= 0
##$S_DEV= 0
##$TDeff= 65536
##$TDoff= 0
##$TI= <Analysis number 999999
Compound Code 99
Book Reference 9
Project Code 9>
##$TILT= no
##$TM1= 0
##$TM2= 0
##$TOPLEV= 0
##$USERP1= <user>
##$USERP2= <user>
##$USERP3= <user>
##$USERP4= <user>
##$USERP5= <user>
##$WDW= 1
##$XDIM= 32768
##$YMAX_p= 564927676
##$YMIN_p= -846150
$$ End of Bruker specific parameters
$$ ---------------------------------
##NTUPLES= NMR SPECTRUM
##VAR_NAME=  FREQUENCY,     SPECTRUM/REAL,   SPECTRUM/IMAG
##SYMBOL=    X,             R,               I
##VAR_TYPE=  INDEPENDENT,   DEPENDENT,       DEPENDENT
##VAR_FORM=  AFFN,          ASDF,            ASDF
##VAR_DIM=   32768,         32768,           32768
##UNITS=     HZ,            ARBITRARY UNITS, ARBITRARY UNITS
##FACTOR=    0.157963299565203, 1,           1
##FIRST=     4132.6476996994, 0,             0
##LAST=      -1043.33573715361, 0,           0
##MIN=       -1043.33573715361, -846150,     0
##MAX=       4132.6476996994, 564927676,     0
$$ Real data points
##PAGE= N=1
##DATA TABLE= (X++(R..R)), XYDATA
$$ [...]
19900C735584l8554j28710j5274l4039R2616j73154K04638K69858L1169N4173
19890C998307P6847j21738m7290K5745j06283l1920P5687j09622o3843L0583j93568
19879C532905P695N9957q4398o6784P2703P7758o7341j37923J33766j0632n3636
19868C464070p8226q9170J7485K39291J47955P3044j7633k15423n0035M2828l8255
19857C495931m6749R7895o4322k4385k59121p3499R1694J9321l8857p7818j4236
19846C105854P6142J94716K3293p4099J7959k5560O8079q005P3831m574p0621
19835C377015r039J9243M1637k2312j11410q5431K888j1711m6943Q7454Q6129
19824C327520K5426j47944j96576J4704Q0440R6568J51517j09968p7556R6059
$$ plain form
19900 3735584 3697030 3568320 3553046 3519007 3611623 3438469 3643107 3912965 3944134 3998307
19890 3998307 4075154 3953416 3906126 3931871 3825588 3793668 3869355 3759733 3695890 3726473 3532905
19879 3532905 3540600 3600557 3516159 3449375 3522078 3599836 3532495 3394572 3528338 3517706 3464070
19868 3464070 3385844 3296674 3314159 3553450 3701405 3774449 3756816 3541393 3491358 3534186 3495931
19857 3495931 3449182 3547077 3482755 3458370 3199249 3125750 3217444 3236765 3197908 3120090 3105854
19846 3105854 3181996 3376712 3400005 3325906 3343865 3318305 3386384 3378379 3452210 3447636 3377015
19835 3377015 3367976 3387219 3428856 3406544 3295134 3209703 3212591 3200880 3153937 3241391 3327520
19824 3327520 3352946 3205002 3008426 3023130 3103570 3200138 3351655 3241687 3164131 3260190
19814C260190M2678J0574j05119l1424M0611J83109J0320m0368Q6380q4178R0462
19803C463235L0559j57218j39244j6555L2402j25125J81265J95195J3021j34367
19793C343168j28946n7437K9704o8660Q575L2205n1839j34127p1071R2701O4680
19782C058953P4118L0148J45568p1164j04166j35098R351j073J91666K08227j79133
19771C227397m8866j20637j13885K29604K13281O3691m3210l5000n6487M1409
19761C357297L9287j69042M002Q0364O0279M2332R968j14302l468P5084j05469
19750C276332n512J38166L993R185l0275L7494O5065Q8687j09388j6621n0258
19739C406868M0247O2632N6508M2350m1035j8653o3557K1176J03364L1183R8302
$$ plain form
19814 3260190 3302868 3313442 3208323 3176899 3217510 3400619 3410939 3370571 3456951 3372773 3463235
19803 3463235 3493794 3336576 3197332 3180777 3213179 3088054 3269319 3464514 3477535 3343168
19793 3343168 3214222 3156785 3186489 3117829 3126404 3158609 3106770 2972643 2901572 2994273 3058953
19782 3058953 3133071 3163219 3308787 3237623 3133457 2998359 3007710 3006637 3198303 3406530 3227397
19771 3227397 3178531 3057894 2944009 3173613 3386894 3450585 3407375 3372375 3315888 3357297
19761 3357297 3396584 3227542 3231544 3311908 3372187 3414519 3424487 3310185 3306717 3381801 3276332
19750 3276332 3270820 3408986 3412979 3422164 3391889 3429383 3494448 3583135 3473747 3457126 3406868
19739 3406868 3447115 3509747 3566255 3608605 3567570 3548917 3485360 3506536 3609900 3641083 3739385
19728C739385J05284J46683L3438L5781m881j0770M208j05017J18855O8434j66130
19717C965270j43906J0144J14765J14570M6385M6024n6479J47375p669k4841o7869
19706D143769r1600M6806l2581K3280J83741K24364k5963j19894m1033P9804P7965
19695D468658J03777n5721O4032J42469K2913P9305J27364L9796R1317J40162
19685E224072K39299R4388L1223o7350j01249K0735J18242p170J6706K3785k6460
19674E566221P7529n7341j2888N9595j9577q3212l04J0639O4991M038j12672p9050
19662E417969r3819j15956k34219k7579O4646m5748l0474j42242j84414m6917
19652D561247Q2703q8228j76157j02389M5555j0781j0304J50231J69618q019n0920
$$ plain form
19728 3739385 3844669 3991352 4024790 4060571 4055690 4044920 4049128 3944111 4062966 4131400 3965270
19717 3965270 3821364 3831508 3946273 4060843 4107228 4153252 4096773 4244148 4236479 4211638 4143769
19706 4143769 4052169 4098975 4066394 4089674 4273415 4497779 4471816 4351922 4310889 4390693 4468658
19695 4468658 4572435 4516714 4580746 4723215 4746128 4825433 4952797 4992593 5083910 5224072
19685 5224072 5463371 5557759 5588982 5521632 5420383 5441118 5559360 5552190 5568896 5592681 5566221
19674 5566221 5643750 5586409 5573521 5633116 5613539 5530327 5530023 5540662 5605653 5609691 5497019 5417969
19662 5417969 5324150 5208194 4973975 4946396 5011042 4965294 4934820 4792578 4608164 4561247
19652 4561247 4643950 4555722 4379565 4277176 4322731 4311950 4301646 4451877 4621495 4613476 4562556
19641D562556p0074j06148q3451O6454O9877K187K6990M8944j2004j11565J56682
19630D550448J07j23769l0244J07283p2881j66350j99974n4955J09151R5921O5670
19619D280407k1845Q0703L8217J12703J23496j03197J3598j76286k1251L4674
19609D361219k0108M4061m2090M1364l8046m6870J0264J10859J4913j54811R7448
19598D378203J77700N839Q517L0196q2175O0169Q0108L9087N4309l2897N294J70690
19586D895040O557K6744J35219l7824Q6994j23799j38366k9460K19103K70463
19576E310671q0310q623J3935j12239n1643L9257K12506o5007n2697q8916k4125
19565E092809M5171l5085j15684M0392K40451Q2740j22199m1656R8445n273o871
$$ plain form
19641 4562556 4492482 4386334 4302883 4369337 4439214 4441401 4468391 4517335 4505331 4393766 4550448
19630 4550448 4550555 4426786 4396542 4503825 4430944 4264594 4064620 4009665 4118816 4214737 4280407
19619 4280407 4258562 4339265 4377482 4490185 4613681 4510484 4524082 4347796 4326545 4361219
19609 4361219 4341111 4385172 4343082 4384446 4346400 4299530 4309794 4420653 4435566 4280755 4378203
19598 4378203 4555903 4561742 4570259 4600455 4518280 4578449 4658557 4697644 4751953 4719056 4724350 4895040
19586 4895040 4901597 4928341 5063560 5025736 5112730 4988931 4850565 4821105 5040208 5310671
19576 5310671 5230361 5221738 5235673 5123434 5071791 5111048 5323554 5258547 5205850 5116934 5092809
19565 5092809 5137980 5102895 4987211 5027603 5268054 5350794 5228595 5186939 5285384 5280111 5273240
19554E273240Q7221J28937Q5456Q1542r9424J14375n2401r4210j3638K5123N0299
19543E586520l1821R5638l3790K0730J5037O036K15253J78583O661J06651J63178
19532F328676P7378P1361l0017n4855J4195R5839k7481K0322R316L4309K0073
19521F559116N1187J17009P1632j08690J1458R6529Q4447R9065j29220r5988J29054
19510F885599L35727J25818N5449q8403N0622k4345J341Q6459r303m3571Q5150
19499G460543J57757L545Q6464J75118k2768J56063K14646m1071k1806n234R034
19488H172291J81158N1279j84625l7170J61585J27172L5315k6022j9236R1480
19478H553227N1680J43127L24529R4381O6613J08015L5500Q2912P797L2364M1774
$$ plain form
19554 5273240 5360461 5489398 5574854 5656396 5556972 5671347 5618946 5524736 5511098 5536221 5586520
19543 5586520 5554699 5650337 5616547 5637277 5652314 5658350 5873603 6052186 6058847 6165498 6328676
19532 6328676 6406054 6477415 6447398 6392543 6406738 6502577 6475096 6495418 6504734 6539043 6559116
19521 6559116 6610303 6727312 6798944 6690254 6701712 6798241 6882688 6981753 6852533 6756545 6885599
19510 6885599 7221326 7347144 7402593 7314190 7364812 7340467 7341808 7428267 7418964 7375393 7460543
19499 7460543 7618300 7621845 7708309 7883427 7860659 8016722 8231368 8190297 8168491 8163257 8172291
19488 8172291 8353449 8404728 8220103 8182933 8344518 8471690 8507005 8480983 8461747 8553227
19478 8553227 8604907 8748034 9072563 9166944 9233557 9341572 9377072 9459984 9467781 9500145 9541919
19467I541919P7079K34408R9336o1654L3079R2925J53922J01906m0698J09407
19457A0341629J03269N8209J92080K55926Q3931Q3019R4739J42370J85936J34550
19447A1675658J53199J6954Q2401K01150K07887J34399J11466Q8375J25145J48441
19437A2945075K38796K48338J18791R3549Q7358N7745J42996Q9382K43022R411
19427A4274463J23375K47361J65896K88456K44756K53759J40681J03830J92015
19418A6034592L16204J11266J88771K87695K50244J51300K66108K20322J04439
19409A7930941K40392L83100L02202L35278K61314K03676K67044K81316K61876
19400B0467139J76925K04313L66414L21747L02930K89713M26470M17227L00134
$$ plain form
19467 9541919 9618998 9853406 9952742 9891088 9924167 10017092 10171014 10272920 10232222 10341629
19457 10341629 10444898 10503107 10695187 10951113 11035044 11118063 11212802 11355172 11541108 11675658
19447 11675658 11828857 11845811 11928212 12129362 12337249 12471648 12583114 12671489 12796634 12945075
19437 12945075 13183871 13432209 13551000 13644549 13731907 13789652 13932648 14022030 14265052 14274463
19427 14274463 14397838 14645199 14811095 15099551 15344307 15598066 15738747 15842577 16034592
19418 16034592 16350796 16462062 16650833 16938528 17188772 17340072 17606180 17826502 17930941
19409 17930941 18171333 18554433 18856635 19191913 19453227 19656903 19923947 20205263 20467139
19400 20467139 20644064 20848377 21214791 21536538 21839468 22129181 22555651 22972878 23273012
19391B3273012K19711L62737L00483M52461M95223L36567K99714M48829M08303
19382B6597040L32712M48569O32829M52253M30288M20235N18583O26773O24141
19373C1083423O18849M82172M27042L73546N63420N04449N81787O14923O14578
19364C5864189O73336P32044P00705O58561O58626P82192O85743P78831Q89915
19355D2424142P09249P26147P27552P65276Q79974P91522P87255R24748P92690
19346D9528555P75832P30154P39647Q92491R75098J006787Q27358R84779R78032
19337E7438733R16246P97128Q57906J041878J064140R38534R07753Q74949Q54461
19328F5691728R36428Q80605Q70400J191311J163063P95392Q41610J050167R13745
$$ plain form
19391 23273012 23492723 23855460 24155943 24608404 25103627 25440194 25739908 26188737 26597040
19382 26597040 26929752 27378321 28011150 28463403 28893691 29313926 29832509 30459282 31083423
19373 31083423 31702272 32184444 32611486 32985032 33548452 34052901 34634688 35249611 35864189
19364 35864189 36537525 37269569 37970274 38628835 39287461 40069653 40755396 41534227 42424142
19355 42424142 43133391 43859538 44587090 45352366 46232340 47023862 47811117 48735865 49528555
19346 49528555 50304387 51034541 51774188 52666679 53641777 54648564 55475922 56460701 57438733
19337 57438733 58354979 59152107 60010013 61051891 62116031 63054565 63962318 64837267 65691728
19328 65691728 66628156 67508761 68379161 69570472 70733535 71528927 72370537 73420704 74334449
19319G4334449Q55770Q43766J047135R95211Q62443Q68434P74189R69336J133247
19310H2683980Q81338Q14102P73238P24691Q35586P53854P75725Q05374P76027
19301H9823915Q97254Q28531Q82905N83275M68171N64037N87487O66530N97697
19292I5899802M56070N20930N00804N10298M01615L58863N42253O01293M23318
19283A00215246K84814K03394J65092M81502N70980K78605J73847K20125K85783
19274A02879388K35275J50483R9479j00177L177K27262K11281K09540J55887M0878
19264A04112473j83060j10196O729o6624q2817j01172o4052l9737j39598k84447
19254A03047499l78754m82456m50041k91044l50826j58853l18499l73150l62391
$$ plain form
19319 74334449 75190219 76033985 77081120 78076331 78938774 79807208 80581397 81550733 82683980
19310 82683980 83565318 84379420 85152658 85877349 86712935 87466789 88242514 89047888 89823915
19301 89823915 90721169 91549700 92432605 93015880 93484051 94048088 94635575 95302105 95899802
19292 95899802 96355872 96876802 97377606 97887904 98289519 98648382 99190635 99791928 100215246
19283 100215246 100500060 100703454 100868546 101350048 101921028 102199633 102373480 102593605 102879388
19274 102879388 103114663 103265146 103364625 103264448 103267625 103494887 103706168 103915708 104071595 104112473
19264 104112473 103929413 103819217 103825946 103759322 103676505 103575333 103511281 103471544 103331946 103047499
19254 103047499 102668745 102186289 101736248 101445204 101094378 100935525 100617026 100243876 99881485
19245I9881485l46315m83664n39720o66341o53715n36912p04483o23894m82105
19236I4844336o69157p79030q61700r62487p55467o74781o71544q88379r78237
19227H7603554q82709r30630r62354r34885j026513j052501r37982r54068j030027
19218G8891885j109644j110711j104314j232708j280939r85653r24678j118473
19210G0024765j267134j105293j012109r56710j051767j163844j123088j171380
19202F1173440j047631j004637j004081j120048j046745j132092j269482q82478
19194E2666246r61156j026412q45622r80768r59539q35378r22255p53464q05293
19185D4576359j030366r19161q53268q23708p33942o56937o25871o89165n70326
$$ plain form
19245 99881485 99535170 99051506 98511786 97845445 97191730 96654818 95950335 95326441 94844336
19236 94844336 94175179 93396149 92534449 91571962 90816495 90141714 89470170 88581791 87603554
19227 87603554 86720845 85790215 84827861 83892976 82866463 81813962 80875980 79921912 78891885
19218 78891885 77782241 76671530 75567216 74334508 73053569 72067916 71143238 70024765
19210 70024765 68757631 67652338 66640229 65683519 64631752 63467908 62344820 61173440
19202 61173440 60125809 59121172 58117091 56997043 55950298 54818206 53548724 52666246
19194 52666246 51705090 50678678 49833056 48852288 47892749 47057371 46135116 45381652 44576359
19185 44576359 43545993 42626832 41773564 40949856 40215914 39558977 38933106 38243941 37673615
19176C7673615o15150o17453m31791p55863o29934m42149o39596p17913l94014
19167C2429752n23989o74278n72408m56827n32326n39130m26296k74673l20461
19158B8109364k35413l71638m97886l68418k75426m13592l70480l02482k92071
19149B4981958k61007k82759k91736j25704j98312r4612r6317j48786k1414J96
19139B3461507j03626j02309Q9563J28812j41235k2262j9010m9930K11508K08119
19129B3661137O7328K91104K35165K46446K46801K53851K39966K72113L36745
19120B5850656M15316N94184N86925O11517N99623O80012P60667P64744Q30099
19111C1693743J027270R97636J151822J496108J595822J914053K682222L587414
$$ plain form
19176 37673615 37058465 36441012 36009221 35253358 34623424 34181275 33541679 32823766 32429752
19167 32429752 31905763 31231485 30659077 30202250 29669924 29130794 28704498 28429825 28109364
19158 28109364 27873951 27502313 27004427 26636009 26360583 25946991 25576511 25274029 24981958
19149 24981958 24720951 24438192 24146456 24020752 23822440 23727828 23631511 23482725 23461311 23461507
19139 23461507 23357881 23255572 23345135 23473947 23332712 23310450 23291440 23241510 23453018 23661137
19129 23661137 23728465 24019569 24254734 24501180 24747981 25001832 25241798 25513911 25850656
19120 25850656 26265972 26860156 27447081 28058598 28658221 29338233 30098900 30863644 31693743
19111 31693743 32721013 33718649 34870471 36366579 37962401 39876454 42558676 46146090
19103D6146090M691916O694510R475496J2751862J5914024J7450918J7080714
19096A30205530J6852548J6624322J6799489J6620637J5046353J2203733P742687
19089B32095299L159463r63129l900415l754599j158748q4504k835772o095435
19081B16462160n072663P0783N353142P670723P155441L739808j339394o770861
19073B27269139j2154219j6227090j7321692j7480558j9357681k2409400k2614987
19066I9703512j8505285j2691550q409061n808391m130792l204049k540956k330147
19058D2083281j970469j682637j534842j419978j125620j073818j092146j194833
19050C0988938r85067q28633o54856p03394p94968r56657q96050p68621q52503
$$ plain form
19103 46146090 50838006 57532516 67008012 79759874 95673898 113124816 130205530
19096 130205530 147058078 163682400 180481889 197102526 212148879 224352612 232095299
19089 232095299 235254762 234291633 230391218 226636619 225477871 225393367 222557595 216462160
19081 216462160 211389497 211460280 216813422 224484145 231639586 235379394 234040000 227269139
19073 227269139 215114920 198887830 181566138 164085580 144727899 122318499 99703512
19066 99703512 81198227 68506677 60097616 54289225 50158433 46954384 44413428 42083281
19058 42083281 40112812 38430175 36895333 35475355 34349735 33275917 32183771 30988938
19050 30988938 30003871 29175238 28520382 27816988 27022020 26065363 25169313 24400692 23548189
19041B3548189r45549r33323q63880q26669o10431m17718n58555n50651m00174
19032A7441239m30809m62290m43039k37207k83223l72472m76369l53337m72696
19023A3909797m36906l18531k98530m03587j25764j75262l02987k33811j75927
19014A1438492k18750k20608l37317j39261j98962l42389j30466j41675l06095
19005I402969m01780k41001K0430L2390m854j03384j52702k69676j56556j04681
18995H021155L9766j08113k36976j18199k47251j19192Q3436j25419j71152j63911
18985F854144K5446m433J1698j41113j66005J14402R9982j23582K057j7498j55096
18974F500002M8610r793J9354j84079k9870O3300J56529J02306L363p2292j00603
$$ plain form
19041 23548189 22602640 21669317 20805437 19978768 19368337 18950619 18392064 17841413 17441239
19032 17441239 17010430 16548140 16105101 15867894 15584671 15212199 14735830 14382493 13909797
19023 13909797 13472891 13154360 12855830 12452243 12326479 12151217 11848230 11614419 11438492
19014 11438492 11219742 10999134 10661817 10522556 10323594 9981205 9850739 9709064 9402969
19005 9402969 9001189 8760188 8780618 8813008 8808154 8704770 8552068 8282392 8125836 8021155
18995 8021155 8060921 7952808 7715832 7597633 7350382 7231190 7314626 7189207 7018055 6854144
18985 6854144 6879590 6875157 6886855 6745742 6579737 6694139 6794121 6670539 6672596 6655098 6500002
18974 6500002 6548612 6538819 6558173 6374094 6344224 6407524 6564053 6666359 6669722 6597430 6496827
18963F496827j10164j19712J1309L7245j06161j94714J4531K31463N2168j11487
18953F201305r9732M9163j89645k34665k8470L8871j28945j11087N6869K1123
18943E574787j25729k15010j29159k3126J19111K4724K02757R4837p1875j0175
18933E441142k05697j47089R2385J13002K02807J72532J55135J48521N4112P5041
18923F101891J9350P9293R6030J91144K12849J18788K15127o8718j53983n5211
18913F756560J5282j41268k65043p5054j47851k21147l01374j25937m9727j31299
18903E313142q5793j942j16698l2036j07450o8453o3993j39340j52677l2044j3140
18892D499576q9914n140K9309j06495m8800m4090J18550J30352n3481l0631n8435
$$ plain form
18963 6496827 6386663 6266951 6278260 6315505 6209344 6014630 6029161 6260624 6312792 6201305
18953 6201305 6101573 6150736 5961091 5726426 5697956 5736827 5607882 5496795 5553664 5574787
18943 5574787 5449058 5234048 5104889 5081763 5200874 5225598 5428355 5523192 5451317 5441142
18933 5441142 5235445 5088356 5180741 5293743 5496550 5669082 5824217 5972738 6026850 6101891
18923 6101891 6121241 6200534 6296564 6487708 6700557 6819345 7034472 6965754 6811771 6756560
18913 6756560 6771842 6630574 6365531 6290477 6142626 5921479 5620105 5494168 5444441 5313142
18903 5313142 5227349 5225407 5108709 5076673 4969223 4900770 4836777 4697437 4544760 4512716 4499576
18892 4499576 4409662 4404522 4433831 4327336 4278536 4234446 4352996 4483348 4429867 4399236 4340801
18881D340801J17049R2335P4923j11385k7260P0299K40190K26627J30718O0593
18871E214890K7933K3276J61058J01944Q6084K3485n7228J06080N0816O553k30665
18860E514226k18323j34390q3563J0106j8715l10485k27054j65946j44206j33371
18850D088279J8999q556k8457J4765j33902m1794J250K6293O4971o9914M6952
18839C978886r4732k9882L773q6055l0440j17121j7760j08003j08780J05367J53773
18828C649026j4167j08860p9165q5860j13410m6063J62245J68047L9270r5060
18818C476003J2869k5094j2607M7421J82000P1820p1468P5353J20454P2129k7264
18807C921616j59730j590O4513L5476k9919R330L1186k083j97126M3785J5347
$$ plain form
18881 4340801 4457850 4550185 4625108 4513723 4486463 4556762 4796952 5023579 5154297 5214890
18871 5214890 5242823 5266099 5427157 5529101 5615185 5638670 5581442 5687522 5738338 5744891 5514226
18860 5514226 5295903 5161513 5077950 5088056 5069341 4758856 4531802 4365856 4221650 4088279
18850 4088279 4107278 4098722 4070265 4085030 3951128 3909334 3910584 3936877 4001848 3931934 3978886
18839 3978886 3884154 3854272 3858045 3771990 3741550 3624429 3606669 3498666 3389886 3495253 3649026
18828 3649026 3634859 3525999 3446834 3360974 3247564 3201501 3363746 3531793 3571063 3476003
18818 3476003 3488872 3463778 3451171 3498592 3680592 3752412 3680944 3756297 3876751 3948880 3921616
18807 3921616 3761886 3760296 3824809 3860285 3830366 3839696 3870882 3868799 3671673 3715458 3730805
18796C730805L5606o2422k05924L7995R930O5129j82680k44043L3930N7686o0855
18785C215157O333k4225l8348M8025k0949J32019J42524m3193l0392K8323l8208
18774C377066p1843R9480O7361p7294j17417O9541K38887O4440R9358j01701J04054
18763C751932Q3177q6174j87083L6899N8784J16418j0635K1891N8670R8054K390
18752C944323m8351J89070L1563p0202P7652K06686J32987j0309m2001K9041m4426
18741D396033O6297J49037K7990O3085K29112K12956l195K9674L9007J06990P4656
18730E391642J35796J41847K13420L26641J41014J57103K59937M10034L31803
18721G509237P0195R8J79873K77004L20814M17649L73912J73527J51139J48175
$$ plain form
18796 3730805 3766411 3703989 3498065 3536060 3545990 3611119 3428439 3184396 3218326 3276012 3215157
18785 3215157 3221490 3197265 3158917 3206942 3185993 3318012 3460536 3417343 3386951 3415274 3377066
18774 3377066 3305223 3404703 3472064 3394770 3277353 3346894 3585781 3650221 3749579 3647878 3751932
18763 3751932 3835109 3748935 3561852 3598751 3657535 3773953 3763318 3785209 3843879 3941933 3944323
18752 3944323 3895972 4085042 4116605 4046403 4124055 4330741 4463728 4453419 4411418 4440459 4396033
18741 4396033 4462330 4611367 4639357 4702442 4931554 5144510 5141315 5170989 5209996 5316986 5391642
18730 5391642 5527438 5669285 5882705 6209346 6350360 6507463 6767400 7177434 7509237
18721 7509237 7579432 7579530 7759403 8036407 8357221 8774870 9148782 9322309 9473448 9621623
18711I621623K73716P0407o6470P925n137o9608m7834J49546J34384j76553l56395
18700I535604j45639q8742j87760l71453k80801n0633N266j17114j57417k15821
18690G925490k58968j26807n6830K5630N2014j65457j52619K7773j27923m7216
18680G095087K7853j83562j26240j15192k8027M1482n5458r5746j00914j30237
18670F329046l1153l2377k9972j2116l249j01368Q463l6527N0530P2011M3571
18659F256859R3984K06307L4651r2067l4418j46830k4722J3729K995J19339m4394
18648F385433P8576J58401j8632J06367N3557J72041q8545j65563j7644J03906
18638F767897o7308J70912J48739M123J5031L3202k2299l791Q7012R0502Q2546
$$ plain form
18711 9621623 9895339 9965746 9899276 9907201 9902064 9832456 9784622 9934168 10068552 9891999 9535604
18700 9535604 9389965 9301223 9113463 8742010 8461209 8410576 8415842 8298728 8141311 7925490
18690 7925490 7666522 7539715 7482885 7508515 7560529 7395072 7242453 7270226 7142303 7095087
18680 7095087 7122940 6939378 6813138 6697946 6669919 6711401 6655943 6560197 6459283 6329046
18670 6329046 6297893 6265516 6235544 6223428 6220179 6118811 6127274 6090747 6141277 6213288 6256859
18659 6256859 6350843 6557150 6591801 6499734 6465316 6318486 6293764 6307493 6310488 6429827 6385433
18648 6385433 6464009 6622410 6603778 6710145 6763702 6935743 6847198 6681635 6663991 6767897
18638 6767897 6700589 6871501 7020240 7024363 7039394 7072596 7050297 7046506 7133518 7224020 7306566
18627G306566J57351Q7933M6275J94161K63337J66073J22628R8173J20332J35193
18617H698022J82222K36302K62014Q7101j18334Q4781J59922J60561J16476N2615
18607I921682P1964Q7582J15873j4457Q4190R2127J75366O9838L55275L04751
18597A1264191L62152L82214L24547K87992L76954M72260M06214M65655N12567
18588A4854746P13111R46794J032429J104070J428872J736089K132416K497135
18580B6445662K410912K363280K172300J996511J696823J392636J062052J004702
18572D0544878R32184L61644k07469p78367j372043j612296j718838k014706k040134
18563C2094853j705145j311209j002405j023945p26779o28108o14982n85737n84759
$$ plain form
18627 7306566 7463917 7551850 7598125 7792286 8055623 8221696 8344324 8442497 8562829 8698022
18617 8698022 8880244 9116546 9378560 9465661 9347327 9432108 9592030 9752591 9869067 9921682
18607 9921682 9993646 10081228 10197101 10182644 10266834 10358961 10534327 10604165 10959440 11264191
18597 11264191 11626343 12008557 12333104 12621096 12998050 13470310 13876524 14342179 14854746
18588 14854746 15567857 16514651 17547080 18651150 20080022 21816111 23948527 26445662
18580 26445662 28856574 31219854 33392154 35388665 37085488 38478124 39540176 40544878
18572 40544878 41477062 41838706 41631237 40852870 39480827 37868531 36149693 34134987 32094853
18563 32094853 30389708 29078499 28076094 27052149 26325370 25697262 25082280 24496543 23911784
18554B3911784n77361o33805n33462l08880p6737j00962r736J89751J81268J80355
18544B2222215K54043J30083K35459O53802P46713P46747R59715J031834Q50146
18535B7830757J020933J454985J658813J942123K307757K367456K643257K708497
18527D3934578K395366J949598J598680J190993R67330P29151N54552K03534k75367
18518E3248415p14403j487971k220407k768507k575210k353571j932086j599469
18510C7596791j084776p74029m06628N9071R5973K40098K75331L53272O13947
18501C6969050Q09519R94336J410962J584296J682812K199450K683029K944946
18493E1278400L441840M390501N088562O522426Q439093J0955268J4519815J8662010
$$ plain form
18554 23911784 23334423 22700618 22167156 21858276 21781539 21680577 21670841 21860592 22041860 22222215
18544 22222215 22476258 22606341 22841800 23495602 24242315 24989062 25948777 26980611 27830757
18535 27830757 28851690 30306675 31965488 33907611 36215368 38582824 41226081 43934578
18527 43934578 46329944 48279542 49878222 51069215 52036545 52765696 53320248 53523782 53248415
18518 53248415 52534012 51046041 48825634 46057127 43481917 41128346 39196260 37596791
18510 37596791 36512015 35737986 35331358 35390429 35486402 35726500 36001831 36355103 36969050
18501 36969050 37778569 38772905 40183867 41768163 43450975 45650425 48333454 51278400
18493 51278400 54720240 59110741 64199303 70721729 79160822 90116090 104635905 123297915
18485A23297915K1599119K1666242K0689540K0759009K3145646K5810966K6764358
18478B83732795K6429399K5538000K5139325K3921524K0650589J7292136J5667349
18471D38371117J2445587N742479j25513n48375K142338J904018k867031r723484
18463D47341136j8117703k7422697l2500672l1735848l0926550l3518872l6228941
18456B36889853l2626288k4288412j7167241j3423357j1626179j0610873r414784
18449A17732719q320083p280710o325178n085570l788667k604018j786697q50195
18441H1691601n4185O99335J976710K972219L828034M739903N476785N826616
18433A07157018O176255O346925O762199Q040437R451906J1346197J3750874J5969973
$$ plain form
18485 123297915 144897034 166563276 187252816 208011825 231157471 256968437 283732795
18478 283732795 310162194 335700194 360839519 384761043 405411632 422703768 438371117
18471 438371117 450816704 456559183 456433670 455885295 458027633 459931651 457064620 447341136
18463 447341136 429223433 401800736 369300064 337564216 306637666 273118794 236889853
18456 236889853 204263565 179975153 162807912 149384555 137758376 127147503 117732719
18449 117732719 109412636 102131926 95806748 90721178 86932511 84328493 82541796 81691601
18441 81691601 81637416 82336751 84313461 87285680 91113714 95853617 101330402 107157018
18433 107157018 113333273 119680198 126442397 134482834 143934740 155280937 169031811 185001784
18425A85001784J7623792J8231059J7845334J6616467J4807335J1526324P875899
18418B89527994N121023L215233R97549j462047n225704r818268j4894809j9713617
18410B47747354k3535377k5183829k4404635k1672693j8277086j4730777j1497361
18403A08445596q932636p201953n976740n406710n127380m979562m979794m519487
18395F1321334l907537l438047l008008k591639k053377j800544j789349j659370
18387D1073463j667280j540545j382960j481821j379282j523922j547877j223354
18379B9326422j104105j329719j287523j180413j172661p80803q73702q44880
18371B0752616p53470q48168o43554o49122n15344o07554n93689m91043l68119
$$ plain form
18425 185001784 202625576 220856635 238701969 255318436 270125771 281652095 289527994
18418 289527994 294649017 297864250 298861799 297399752 292174048 282355780 267460971 247747354
18410 247747354 224211977 199028148 174623513 152950820 134673734 119942957 108445596
18403 108445596 99512960 92311007 86334267 80927557 75800177 70820615 65840821 61321334
18395 61321334 57413797 53975750 50967742 48376103 46322726 44522182 42732833 41073463
18387 41073463 39406183 37865638 36482678 35000857 33621575 32097653 30549776 29326422
18379 29326422 28222317 26892598 25605075 24424662 23252001 22471198 21597496 20752616
18371 20752616 19999146 19150978 18507424 17858302 17342958 16735404 16141715 15650672 15282553
18362A5282553k48852k95494m96558m27309l41015k13709k80819m80264l29203
18353A2169330k77888j29336l99794j90915j40861j49580l06352j86861j67549
18344A0220194l76230k74717r0237l6083m4957k96198k35921j60950k0018j02461
18334H582422k58588j53811j12218N753j38544j49206k42917k14760j12546k56927
18324F948658k00103j03357j22608j67984J1308j28704k09029q7987j76143k15379
18314E548672k94851j52778N1684k2287Q2994n2465k11953k32368o8457R6394
18304D744585O3174K4613q434j10427j05473r5154j26375K2435J18541O7386M059
18293D598930m6941N2032J03973m9389j56953p5481n2855j11587m7160Q8272P7026
$$ plain form
18362 15282553 15033701 14738207 14241649 13814340 13473325 13259616 12978797 12498533 12169330
18353 12169330 11891442 11762106 11362312 11171397 11030536 10880956 10574604 10387743 10220194
18344 10220194 9843964 9569247 9479010 9442927 9397970 9101772 8865851 8704901 8684883 8582422
18334 8582422 8323834 8170023 8057805 8063558 7925014 7775808 7532891 7318131 7205585 6948658
18324 6948658 6748555 6645198 6522590 6354606 6365914 6237210 6028181 5940194 5764051 5548672
18314 5548672 5253821 5101043 5152727 5130440 5213434 5160969 4949016 4716648 4648191 4744585
18304 4744585 4807759 4832372 4823938 4713511 4608038 4512884 4386509 4408944 4527485 4594871 4598930
18293 4598930 4551989 4604021 4707994 4658605 4501652 4426171 4373316 4261729 4214569 4302841 4379867
18282D379867L4384J26958K3112j02722l0131O9764p755L3441J40782M8562o0575
18271D655687j9835o5973n5739J35865N9599J13522j7471j04646j60272j20939
18261D419798j26763j5004J01493J87114K78189J39q0078p1131r1401L6162l0914
18250D607604J14611J40838M0707j7920o4321M4056p0546m072O0075J23717J08539
18239E083288R1712N727K2868J35712J0347j15568m8352J66267J54486K02845
18229E709332J27708m1681k3837M6054J70441J54654N8339P1029J59236K20186
18219F651461J3606j41258J84453K33879J97291N0157n7381O5871O5569O5011
18209G328659n2065j03478j28634o5225q96r9168j836l9156o7810K1797j24403
$$ plain form
18282 4379867 4414251 4541209 4564321 4461599 4431468 4501232 4493477 4526918 4667700 4716262 4655687
18271 4655687 4635852 4569879 4514140 4650005 4709604 4823126 4805655 4701009 4540737 4419798
18261 4419798 4293035 4278031 4379524 4566638 4844827 4844966 4764888 4693757 4602356 4638518 4607604
18250 4607604 4722215 4863053 4903760 4885840 4821519 4865575 4795029 4790957 4851032 4974749 5083288
18239 5083288 5175000 5180727 5203595 5339307 5349654 5234086 5185734 5352001 5506487 5709332
18229 5709332 5837040 5795359 5771522 5817576 5988017 6142671 6201010 6272039 6431275 6651461
18219 6651461 6665067 6523809 6708262 6942141 7139432 7189589 7132208 7198079 7263648 7328659
18209 7328659 7276594 7173116 7044482 6979257 6978361 6879193 6877357 6838201 6770391 6792188 6667785
18198F667785j26222m2167J22266N9306j22893k54028k3133K6765l5757J39297
18188F411219j19700m8899P5955o9077p4060K6001L4095J384J13850J69832J72714
18177F693314l1507l2941N7426M9242J62754K42702J58055K12242L81384L09761
18167H202432K25262K47255J29977J18249K03931K93536L92750K46763L57415
18158A0417570K02992J26018K08252L72248L92178K68180K79621L45652P6620
18149A2689331K51326M46510M18393M24020O06612N32855Q37322R76459R01613
18140A8084441P68624J180576J162683J479601J991804K306042K500519K876311
18132C2350601L303151L875795M071522M594989M993536N198424N726448O824882
$$ plain form
18198 6667785 6541563 6499396 6621662 6680968 6558075 6304047 6280914 6307679 6271922 6411219
18188 6411219 6291519 6242620 6318575 6249498 6175438 6201439 6235534 6236918 6350768 6520600 6693314
18177 6693314 6661807 6628866 6686292 6735534 6898288 7140990 7299045 7511287 7892671 8202432
18167 8202432 8427694 8674949 8804926 8923175 9127106 9420642 9813392 10060155 10417570
18158 10417570 10620562 10746580 10954832 11327080 11719258 11987438 12267059 12612711 12689331
18149 12689331 12940657 13387167 13805560 14229580 14836192 15369047 16206369 17182828 18084441
18140 18084441 18853065 20033641 21196324 22675925 24667729 26973771 29474290 32350601
18132 32350601 35653752 39529547 43601069 48196058 53189594 58388018 64114466 70939348
18124G0939348Q358670J0265966J2813234J5357626J7859507K0064885K1477240
18117A77136476K1508305J9651087J7328881J5231019J3023098J0544022Q307352
18110B82730240O071603L351702k36815m717377r311647j3232104j6098799j7675895
18102B30880908j7866205j6650168j4457869j1726422r234979p357491o240696
18095A47347078n418981n392687n637967n882508n742473n232401m735729m092460
18087A05211872l401124l143375k891618k445751j930757j111170l30682N85639
18079I0543034J579251K867728L916220M512016M875609N267176O152879P259938
18071A26973851Q440010R921032J1644107J3054695J3354394J2690902J2023433
$$ plain form
18124 70939348 79298018 89563984 102377218 117734844 135594351 155659236 177136476
18117 177136476 198644781 218295868 235624749 250855768 263878866 274422888 282730240
18110 282730240 288801843 292153545 291916730 287199353 277887706 264655602 248556803 230880908
18102 230880908 213014703 196364535 181906666 170180244 160945265 153587774 147347078
18095 147347078 141928097 136535410 130897443 125014935 119272462 114040061 109304332 105211872
18087 105211872 101810748 98667373 95775755 93330004 91399247 90288077 89957395 90543034
18079 90543034 92122285 94990013 98906233 103418249 108293858 113561034 119713913 126973851
18071 126973851 135413861 145334893 156979000 170033695 183388089 196078991 208102424
18064B08102424J1012291R042482N919953L303673J817792R1600k007702m275970
18056B33006543o568050r368184j1968502j4534267j6138311j6448551j5696666
18049A42284012j3801672j1408969q957562o844904n110585m078215l402918l119090
18041H5560097k999225l120862l350493l529598l478626l584625l491405l593737
18033E8411526l672160l665065l767275l614868l376609k874311k642857k524326
18025C2274055k244440j781363j504566j175053j182891j095143q15921p78866
18017B1695812p93473p24162o87866m88718m93456n92834n79596n25729l83310
18008A6426668m75737m90880l54073l79279n26485o99269m78170m66717n17183
$$ plain form
18064 208102424 219114715 228157197 234077150 237380823 239198615 239290215 237282513 233006543
18056 233006543 226438493 217070309 205101807 190567540 174429229 157980678 142284012
18049 142284012 128482340 117073371 108115809 101270905 96160320 92082105 88679187 85560097
18041 85560097 82560872 79440010 76089517 72559919 69081293 65496668 62005263 58411526
18033 58411526 54739366 51074301 47307026 43692158 40315549 37441238 34798381 32274055
18025 32274055 30029615 28248252 26743686 25568633 24385742 23290599 22474678 21695812
18017 21695812 20902339 20178177 19490311 19001593 18508137 17915303 17335707 16809978 16426668
18008 16426668 15950931 15460051 15105978 14726699 14200214 13500945 13022775 12556058 12038875
17999A2038875l22819m01110m79382m65930k82669k38013m27507k28908l04521
17990H888016k63532k54688l37638l30796k40370k32357k63805j58588k00560
17981F605682j89465j53459o8491j93816j52156q7820j20667j87415j02512J49953
17971E499834M4534m4970k18147j2906J67036p249J47576J41358M9941R7435p246
17960E857196O1897P4872p6819k6237j1373r8938r0149j67073M866j13837k25952
17949E188453m2107l5673j88145k60600k92050j86507R796q5353j72578j31783
17939C803453j25981j92028j96716k16158j12435L9512N84j08171j87723o2132
17929B642205P869j89513j34670J37337r548j55332J00347m5109j589J02966j1957
$$ plain form
17999 12038875 11716056 11314946 10835564 10369634 10086965 9848952 9421445 9192537 8888016
17990 8888016 8624484 8369796 8032158 7701362 7460992 7228635 6964830 6806242 6605682
17981 6605682 6416217 6262758 6194267 6000451 5848295 5760475 5639808 5452393 5349881 5499834
17971 5499834 5544368 5499398 5281251 5268345 5435381 5428132 5575708 5717066 5767007 5864442 5857196
17960 5857196 5919093 5993965 5917146 5890909 5879536 5780598 5690449 5523376 5528242 5414405 5188453
17949 5188453 5146346 5110673 4922528 4661928 4369878 4183371 4193167 4107814 3935236 3803453
17939 3803453 3677472 3485444 3288728 3072570 2960135 2999647 3000231 2892060 2704337 2642205
17929 2642205 2650074 2460561 2325891 2463228 2453680 2298348 2398695 2353586 2351997 2454963 2443006
17918B443006p801J73383j52205r7157K07809L8257N61N2984J74923l9412n8091
17907B736257n1633Q8259M2117O3574m8533K8768k3779K124o5907R3889Q745j09802
17895B764079M3896J49580P9510k1010M3634J11684r3107j64743j75365M8524
17885B786682j1234q6890j12482l0924n1893j027j3878n4815L2974j3895r0404
17874B352214j95943j26941M2811n5320r0460n9727m6837n3182O175j15388R770
17863A667172O3008j0674R7717l6309j2696O2730J33086J42580P5231n3606j51711
17852A976528j22971k2841J18001m6392o1442j05224j88411k28529Q0502K2114
17842A421335r0116j71913l7847K2826R1617O8354l8727k7255o57J40537P0327
$$ plain form
17918 2443006 2435205 2608588 2456383 2359226 2567035 2605292 2605853 2658837 2833760 2794348 2736257
17907 2736257 2684624 2772883 2815000 2878574 2830041 2858809 2835030 2837154 2771247 2865136 2873881 2764079
17895 2764079 2807975 2957555 3037065 3016055 3059689 3171373 3078266 2913523 2738158 2786682
17885 2786682 2775448 2688558 2576076 2545152 2493259 2492232 2478354 2423539 2456513 2442618 2352214
17874 2352214 2156271 2029330 2072141 2016821 1926361 1866634 1819797 1766615 1772790 1657402 1667172
17863 1667172 1730180 1719506 1817223 1780914 1768218 1830948 1964034 2106614 2181845 2128239 1976528
17852 1976528 1853557 1830716 1948717 1902325 1840883 1735659 1547248 1318719 1399221 1421335
17842 1421335 1331219 1159306 1121459 1144285 1235902 1304256 1265529 1238274 1237617 1378154 1448481
17831A448481j08874j43863j8261m9725m5520J9975L1300J06760L8414k8793R1363
17820A341257J01414m0619J20604K0765N9949K3705L714m1636J38452o4418L5425
17809A698612P7141N3874P4566J68472J3622q5437j91636m6385l3433n7575Q8607
17798A760428j2573r3448J1440o7685j69289P9073R7914J473n2782j60534j9660
17787A374357K6377J79185Q4263m0779n8825k7623J79880M4406k60498n8820o3542
17776A378381l6634L6498J34694j24552n4932p8199n1836l3449q1037l2455k01105
17765H55374j51680k6190l6779J13661Q4364l9001l9927r9151r261P109L7800
17754F96319n6252q0228J20031N2287j11897o2831P269O1262Q7780M7841j12962
$$ plain form
17831 1448481 1339607 1195744 1177483 1127758 1082238 1102213 1133513 1240273 1278687 1249894 1341257
17820 1341257 1442671 1402052 1522656 1543421 1603370 1627075 1630789 1589153 1727605 1663187 1698612
17809 1698612 1775753 1829627 1904193 2072665 2086287 2000850 1809214 1762829 1729396 1671821 1760428
17798 1760428 1747855 1654407 1665847 1598162 1428873 1507946 1605860 1607333 1554551 1394017 1374357
17787 1374357 1400734 1579919 1664182 1623403 1564578 1536955 1716835 1761241 1500743 1441923 1378381
17776 1378381 1341747 1378245 1512939 1388387 1333455 1255256 1203420 1169971 1088934 1056479 855374
17765 855374 703694 677504 640725 754386 838750 799749 759822 660671 651410 658519 696319
17754 696319 640067 559839 679870 732157 620260 557429 564698 625960 713740 761581 648619
17743F48619k81184j26750n1012J36134p5490l7988J43380P8690J45736N1177
17733F31312j98236o1633l7868J59462K0304p2248r9966r0348p5631m385m277
17722A66486K19765J04039l8967k48908j9945o1527j28104M8328m0506p9167m0381
17711a18887Q4638R6404L5355O9477n7493j80298K269P0198j55188r9622J1289
17700b41858M2852l0954O0294J71856Q8707q8071q6059r6703n8131N6071M3462
17689a38534n9550r6332J08923K7352P7555O2616J62738Q8779L3961n8945j22724
17678H5839l779J24057n8530l2601J75432j02591k22744j71805m0280J08410j7860
17667a56452m1521j18700N7796J52668j33125j7927J0129j8009r3974r8933k1208
$$ plain form
17743 648619 367435 240685 189673 325807 250317 212329 355709 434399 580135 631312
17733 631312 433076 371443 333575 493037 513341 441093 341127 250779 175148 170763 166486
17722 166486 386251 490290 451323 202415 182470 120943 -7161 41167 661 -78506 -118887
17711 -118887 -34249 62155 97510 166987 109494 -70804 -68535 1663 -153525 -253147 -241858
17700 -241858 -199006 -229960 -169666 2190 90897 2826 -83233 -179936 -238067 -181996 -138534
17689 -138534 -198084 -294416 -185493 -158141 -80586 -17970 144768 233547 267508 208563 85839
17678 85839 82060 206117 147587 114986 290418 187827 -34917 -206722 -247002 -138592 -156452
17667 -156452 -197973 -316673 -258877 -106209 -239334 -257261 -247132 -265141 -359115 -458048 -479256
17656d79256J01635K23612J06874j71015j10537O0902Q2827r390j390k1369N9078
17645a58029J81543p0559M3954N298k8223l0456O9489K4039J1053K0157O3140
17634A31406j20229n2299m003K5608P287J35282J41618l514k39025j58546J69490
17623C3075J15809N3357O5582o6845j4181p0353L219J65996J96642r4757N1459
17612D39003K02728p1328j5045J25355K50088J58522j09711j0541J392o3795l8434
17601H68234o9117m8789J13822Q9808j17559O0398J9361p7031j26992m7604j51471
17590E13060j11266n9421J66269J38218l291j58904j38929O2761p1969N0907L0494
17579D17929j69346j49825p453J15408J39466o8128m7919o212j05499J00267J50701
$$ plain form
17656 -479256 -377621 -154009 -47135 -218150 -328687 -267785 -184958 -194348 -195738 -217107 -158029
17645 -158029 23514 -47045 -3091 2207 -26016 -56472 13017 37056 48109 68266 131406
17634 131406 11177 -41122 -45125 -19517 -12230 123052 264670 261156 22131 -136415 33075
17623 33075 148884 202241 267823 200978 186797 116444 119663 285659 482301 387544 439003
17612 439003 641731 570403 555358 680713 930801 1089323 979612 969071 970463 906668 868234
17601 868234 799117 750328 864150 953958 836399 896797 916158 839127 712135 664531 513060
17590 513060 401794 342373 508642 646860 643569 484665 345736 408497 336528 387435 417929
17579 417929 248583 98758 91305 206713 346179 278051 230132 223920 118421 218688 369389
17568C69389N9215J70990R1739L4130j05357j51339j2972L6618J22419J26886
17558G41718L533l9359J35033l8247m4911J7844J8189l1339J597J03723L2070
17547H99851k03057n4119J46191o4819j89758l1237O3432K7791j29965n1481k27897
17536A84932k61779r2507j2706l4437k5918J84239M246K5482p2707j44419m3007
17525b88581R1372j4208p3731p0514J33651L9850k6966j28078k6934j3504J15449
17514b62194j03390o8929K5630P7984K37454j13898j10331L5230j8658j44357
17504d45459J9376j5430o2087j99218L8592O2696O6152J70292J13280j50290j656
17493d03752n5182k5599J24993P4556N1921J59990k3134j09362j95747j58332
$$ plain form
17568 369389 428604 599594 691333 725463 620106 468767 455795 492413 614832 741718
17558 741718 745251 705892 840925 802678 757767 775611 793800 762461 764058 867781 899851
17547 899851 696794 642675 788866 724047 534289 503052 566484 594275 464310 412829 184932
17536 184932 -76847 -169354 -182060 -216497 -242415 -58176 -53930 -28448 -101155 -245574 -288581
17525 -288581 -197209 -211417 -285148 -355662 -222011 -182161 -209127 -337205 -364139 -377643 -262194
17514 -262194 -365584 -434513 -408883 -330899 -93445 -207343 -317674 -282444 -301102 -445459
17504 -445459 -426083 -441513 -503600 -702818 -664226 -601530 -535378 -365086 -251806 -402096 -403752
17493 -403752 -458934 -484533 -359540 -284984 -233063 -73073 -96207 -205569 -401316 -559648
17483e59648J09916Q6955P768J9015O4976P5644o457j32402r5061K5706k5839
17472d29427K2518Q2714J13002r1138m5178M1135p7136m9899P026J27361J264
17461b97758j8458j11358K94J24722J70029J75500o1593j4556q8723j68310n5450
17450c45661l2370Q2493J53906r0943q2362p8502k18384m8631J12151O4657J01583
17439c82063j12725k1575N4134P6819o2488R020J73200O7798j12512L6627m1710
17428c15475N7680j1167o2336j44226L1106K00802k3882j71995M2408Q6330J57036
17417a53719p1379q8753j54436j04390j069J31164J16984m6899j3937p2557j02605
17406e61596p5715J44744J52188m891L001j2573n2737m0923j16968l146Q2639
$$ plain form
17483 -559648 -449732 -362777 -355009 -335994 -271018 -195374 -201831 -334233 -429294 -403588 -429427
17472 -429427 -406909 -324195 -211193 -302331 -347509 -306374 -383510 -433409 -426383 -299022 -297758
17461 -297758 -316216 -427574 -427280 -302558 -132529 42971 -18622 -33178 -121901 -290211 -345661
17450 -345661 -378031 -295538 -141632 -232575 -314937 -393439 -611823 -660454 -548303 -483646 -382063
17439 -382063 -494788 -516363 -462229 -385410 -447898 -438878 -265678 -197880 -310392 -273765 -315475
17428 -315475 -257795 -268962 -331298 -475524 -444418 -243616 -267498 -439493 -397085 -310755 -153719
17417 -153719 -225098 -313851 -468287 -572677 -573746 -442582 -325598 -372497 -386434 -458991 -561596
17406 -561596 -637311 -492567 -340379 -345270 -342269 -354842 -407579 -448502 -565470 -568616 -485977
17395d85977J90256N2516M9628P768m8058J1838k5502j35212o6925K2829m6840
17384d73679J70473J11739p1540j58089q8586k6326M2557R8850R0632L20170K1781
17373C7982j2598m0436l1671r7238j34167k8382Q5677l5836K5658j15536K4982
17362c21565O384P7627N5154j1955P9824J3422k2454k8361j14728n1308L7308
17351b80652J58123l7767K7873J5922k6238j74034k6774M7693J50628J5481n8566
17340a88311r4922k8282J0541Q2351j36035j00243j37532N9231m0317M5602M9808
17329d78109O6774J08743L6864l806K659j07621K1029K15013r5039q3129P064
17318c09558J0004m8326m0160J4729L2205L7857q3889L4347o1430J76694P1383
$$ plain form
17395 -485977 -295721 -243205 -193577 -185809 -233867 -222029 -247531 -382743 -449668 -426839 -473679
17384 -473679 -303206 -191467 -263007 -421096 -509682 -536008 -493451 -394601 -303969 16201 37982
17373 37982 25384 -15052 -46723 -143961 -278128 -306510 -220833 -256669 -231011 -346547 -321565
17362 -321565 -315181 -237554 -182400 -194355 -114531 -101109 -123563 -151924 -266652 -317960 -280652
17351 -280652 -122529 -160296 -132423 -116501 -142739 -316773 -343547 -295854 -145226 -129745 -188311
17340 -188311 -283233 -311515 -300974 -218623 -354658 -454901 -592433 -533202 -573519 -527917 -478109
17329 -478109 -411335 -302592 -265728 -269534 -266875 -374496 -353467 -138454 -233493 -316622 -309558
17318 -309558 -299554 -347880 -388040 -373311 -341106 -303249 -387138 -352791 -414221 -237527 -166144
17307a66144j7663P0781J2326j61761q1819R0291k0037O3533J32351j9187K1j23523
17295b20831j4344N9325m0149j74750O898L1586P852j17032J36661m9171O6882
17284c07073m1426l2770P0440J93844j36431P3536J30863L2726p8916m2832p6582
17273b14621M4110J26566n3956m6607o9083j32030j37417P6463J01254K39246
17263f6075m557l3475q4750k14957n7668l4494K228O3386J27981J02838j41107
17252c40650L179N124J01577Q0751n018j50552r811k6868J33604J31212j05714
17241a83166o9966m6085l8578L5923J46047R074n8781M6208q3582O2847K33555
17230E3496J7031k21729o0099j51841j25365J00399J49720o9186q7240Q7590p0325
$$ plain form
17307 -166144 -183807 -113026 -100700 -262461 -344280 -253989 -274026 -210493 -78142 -97329 -97308 -220831
17295 -220831 -235175 -175850 -215999 -390749 -383851 -352265 -344413 -461445 -324784 -373955 -307073
17284 -307073 -348499 -381269 -310829 -116985 -253416 -179880 -49017 -16291 -95207 -138039 -214621
17273 -214621 -170511 -43945 -97901 -144508 -213591 -345621 -483038 -406575 -305321 -66075
17263 -66075 -70632 -104107 -188857 -403814 -461482 -495976 -493748 -430362 -302381 -199543 -340650
17252 -340650 -337471 -332347 -230770 -150019 -155037 -305589 -315400 -342268 -208664 -77452 -183166
17241 -183166 -253132 -299217 -337795 -301872 -155825 -146751 -205532 -159324 -242906 -180059 53496
17230 53496 70527 -151202 -211301 -363142 -488507 -388108 -238388 -307574 -394814 -307224 -377549
17219c77549q2417N7316K646K265J01216n5950M241J7749j9926J11551M4611j08499
17207c02746k1069m224o579J21935j00028p6906o1402l1158O3718R8165N725n8404
17195c72973j1360l914J1183M0986m8235O8080l3355j4658J16740O0088o0349
17184b47767Q9231J93847j2852p3632L1212m1183j64818j81648j23635J1882j641
17173e21004L7040M6282J8705J19181j478J63602K67873K2873j27899j91009L5389
17162a30445k610r7831N9614o6313k47951K1703N1842K34523N5240K6962N3218
17151d2048R0518K010r0023m8372o5299j7917k0690K22498J8159j93961k7866
17140a72991M1279J52218J94498J23315k3057p9289m4976m3380q63M1083R1079
$$ plain form
17219 -377549 -459966 -402650 -400004 -397739 -296523 -352473 -348232 -330483 -350409 -238858 -194247 -302746
17207 -302746 -323815 -328039 -334618 -212683 -312711 -389617 -451019 -482177 -418459 -320294 -314569 -372973
17195 -372973 -384333 -388247 -377064 -336078 -384313 -316233 -349588 -364246 -247506 -187418 -247767
17184 -247767 -158536 35311 22459 -51173 -19961 -61144 -225962 -407610 -531245 -519363 -521004
17173 -521004 -483964 -437682 -418977 -299796 -301274 -137672 130201 153074 25175 -165834 -130445
17162 -130445 -133055 -230886 -171272 -237585 -485536 -463833 -411991 -177468 -122228 -95266 -42048
17151 -42048 48470 50480 -39543 -87915 -153214 -171131 -191821 30677 48836 -145125 -172991
17140 -172991 -131712 20506 215004 338319 315262 235973 190997 147617 146754 187837 278916
17129B78916M4723J65513j0991o1426R3215J72365Q9145J13452J35825l6391j37051
17118H47295J06001J47254P8015L8217j30016k37852o1595n186L4780o6728j3180
17107G37005l6748j1153P0328Q3369N4689p5449k15732k70563k86492J72805P0075
17096B92134r8833n9881r8236R4167O6851K3537j99567m9433n3089O4265N5719
17085C7634R7329N1895r5327N951l3791o8510J3315L730j10761j88742r7634R8464
17073b86447j3108m7454L6193J23527L0058J16607Q1197K4190j57341j35781j04320
17062c32679k2671R2505J04138J67942N2721l1506j08611o7701K8248K7692o3470
17051a53392r5874q8202p995K25148Q0035l3141j82075j6591j5070L7304K71273
$$ plain form
17129 278916 323639 489152 478161 416735 509950 682315 771460 884912 1020737 984346 847295
17118 847295 953296 1100550 1178565 1216782 1086766 848914 787319 782133 816913 750185 737005
17107 737005 700257 689104 759432 842801 897490 822041 606309 335746 49254 222059 292134
17096 292134 193301 133420 35184 129351 196202 219739 20172 -29261 -82350 -18085 37634
17085 37634 134963 186858 91531 97482 63691 -4819 8496 12226 -98535 -287277 -384911 -286447
17073 -286447 -299555 -347009 -310816 -187289 -157231 -40624 40573 64763 -92578 -228359 -332679
17062 -332679 -355350 -262845 -158707 9235 61956 30450 -78161 -145862 -117614 -89922 -153392
17051 -153392 -249266 -337468 -345463 -120315 -40280 -73421 -255496 -272087 -287157 -249853 21420
17040B1420J76007q3320j49827o091l2460O7002J14648l9401j91725j42588q9439
17029c55774J33254J54768M721Q0423P1331j15209j26711P5126j0081j8989j47315
17018b54456K809J3817m7407J28321Q8003l4594m0474k679K2885m2243j44746
17007c10764r926k7316j56726Q1741R8517M1074M6931L2199n828J41771J2309
16996e6018n6176j06452p7076J27973L5969j28398Q6448J85067p6656r2361r6319
16985b53999K4160J9326j2008J45N3999O5406N6260j45522p7870l0090L5040J04781
16973a60372J20484l2514k44295l9510J66944J00259k5455M752Q383j05581Q1934
16962a24971j940n7359j40727L1352K20598J59005l1513j6603N8107m3985j14559
$$ plain form
17040 21420 197427 114107 -35720 -41811 -74271 -7269 107379 67978 -123747 -266335 -355774
17029 -355774 -222520 -67752 -63031 17392 88723 -26486 -153197 -78071 -88152 -107141 -254456
17018 -254456 -251647 -237830 -285237 -156916 -68913 -103507 -143981 -146660 -123775 -166018 -310764
17007 -310764 -320690 -348006 -504732 -422991 -324474 -283400 -236469 -204270 -210098 -68327 -56018
16996 -56018 -112194 -218646 -295722 -167749 -131780 -260178 -173730 11337 -65319 -157680 -253999
16985 -253999 -229839 -210513 -222521 -222376 -168377 -102971 -46711 -192233 -270103 -300193 -265153 -160372
16973 -160372 -39888 -72402 -316697 -356207 -189263 -89004 -114459 -109707 -101324 -206905 -124971
16962 -124971 -126911 -184270 -324997 -293645 -73047 85958 54445 37842 95949 51964 -62595
16951f2595J9556R2043l3232J8581q6391j79790J27050Q4807l7210K8568j36507
16940a65120l7000N939P1464M1118O6523K2822q5285j90790o2055R3230M3188
16929a95966J35883J58933j75185k24215j09133j5335J58493K87945P6548p3442
16919B4526j40931m0143O4617k8174m9705j40353n4932J57257J67310P1418L0226
16908F1116m1643o6685M7380Q4427J67966K7749j92197q3419o3585m8484K7280
16897h0095M2826j5898J67962N2664R284j51130L7314Q9390J3308J6581k696j4003
16885A65507j24021j68107q0311R8825J36736J58220J18568l3636L2166l5364
16875B68583r9316o1684p2045l6113n4633n6127j2114J26815O8742J8092j97690
$$ plain form
16951 -62595 -43039 49004 15772 34353 -52038 -231828 -104778 -19971 -57181 -28613 -165120
16940 -165120 -202120 -196181 -124717 -83599 -17076 5746 -79539 -270329 -332384 -239154 -195966
16929 -195966 -60083 98850 -76335 -300550 -409683 -425018 -266525 21420 97968 24526
16919 24526 -116405 -156548 -91931 -120105 -169810 -310163 -365095 -207838 -40528 30890 61116
16908 61116 19473 -47212 168 84595 252561 280310 88113 4694 -58891 -107375 -80095
16897 -80095 -37269 -53167 114795 167459 176743 25613 62927 152317 165625 182206 179510 165507
16885 165507 41486 -126621 -206932 -108107 28629 186849 305417 271781 303947 268583
16875 268583 169267 107583 35538 -575 -55208 -111335 -123449 3366 72108 90200 -107490
16864a07490Q5761O6230O8491k8113q1614j38914j25166P9020N1807M1366R2635
16853D013J46733o9179n5004O9944n4221N8826k0835O3792R1015r0109n0444K0829
16841A15360k13236m6140J15329P73N2225N8923m9571K8511L3457Q3483K8648
16830B07762K8620l4412k2348O3366q065m2650l2120r8178K32305J41997m5995
16819C90282m2244m599k9918L0092j3195M8956k3377j48687Q7240Q7470K4796
16808D06816j50233P4457K17474K5109j93537j19203o3768j80093R8984J49868
16798B65874J51226Q2404n0202j30801J0244M3266Q7219L9476o775n2780p7129
16787C62022N6288j5584M3831j12961j97675j140K13670J445q0238L874L533J03358
$$ plain form
16864 -107490 -21729 44501 112992 84879 3265 -135649 -260815 -181795 -129988 -88622 4013
16853 4013 150746 81567 26563 96507 42286 101112 80277 144069 235084 144975 94531 115360
16841 115360 -97876 -144016 -28687 -27914 24311 83234 33663 62174 95631 179114 207762
16830 207762 236382 201970 179622 242988 234923 192273 160153 61975 294280 436277 390282
16819 390282 348038 343439 313521 343613 330418 379374 355997 207310 294550 382020 406816
16808 406816 256583 331040 548514 573623 380086 260883 197115 17022 116006 265874
16798 265874 417100 499504 449302 318501 328745 372011 459230 498706 491931 439151 362022
16787 362022 418310 402726 446557 333596 135921 134781 348451 349896 269658 273532 277065 380423
16775C80423N288j72533j38608l8308j8741J8046J3966j6493L3760k2404J9537
16764F3933R0733L3784p2760j07997j04160J32855J30564Q4067m3530j15027p0031
16753B2431o411P6209J09135J44351N967j04427j42398p3947R7179J69643R34
16742B98666p5801R8066M4561q0806j02914P9089L0829N8103j18484J5880Q5481
16731C32670j87321r2371L5878k2418K24779Q6026q4095P7848j22496n6525J49751
16720C41726j29670l7371R3603Q2493J6853j6710R4703J44404K024k0792K220
16709E73483K5434j4114n7947J15858L00729J62599j31458j31135m5784N0366
16699H48031J89695l4257j5425M1037j19498o1356O8894j4259O7155K944J1462
$$ plain form
16775 380423 385711 213178 74570 36262 17521 35567 49533 33040 66800 44396 63933
16764 63933 154666 188450 115690 7693 -96467 36388 166952 251019 207489 92462 22431
16753 22431 16020 92229 201364 345715 351682 247255 104857 30910 128089 297732 298666
16742 298666 222865 320931 365492 284686 181772 260861 291690 349793 231309 247189 332670
16731 332670 145349 52978 88856 66438 291217 377243 293148 370996 248500 191975 341726
16720 341726 212056 174685 268288 350781 367634 350924 445627 590031 592055 571263 573483
16709 573483 598917 584803 526856 642714 943443 1106042 974584 843449 797665 848031
16699 848031 1037726 1003469 988044 1029081 909583 848227 917121 902862 970017 972961 984423
16688I84423J11711p8466l5225j01656J8665p6931l5260K9882J43253J9894l9190
16677I41100k1712Q4028O109k39808j30204K24675J62142N881N9851K37867J75036
16666A504965O0667n2283r3186N0534m2231j12774n356P9186P1833J3384J37158
16655A611897L5679J87129o6885k38567N3288K30667J22871M8925J20522J70327
16645B275853J13515n6674j15206k2294P3354J51892L3621j14512K19533K09705
16635B768787J02163J32514J815L3473L6260o7321J04583K58347J60722J72870
16625C704213J47601J41433N1112J03973K77694L29154J56048L666L2097L53751
16615E300742L42349K13370K82854M28424N50161L64998K03037P839L46354M27310
$$ plain form
16688 984423 1096134 1017668 982443 880787 899452 822521 787261 817143 960396 980290 941100
16677 941100 919388 1003416 1009525 769717 639513 864188 1026330 1032211 1092062 1329929 1504965
16666 1504965 1565632 1513349 1420163 1470697 1428466 1315692 1310336 1389522 1461355 1474739 1611897
16655 1611897 1647576 1834705 1767820 1529253 1582541 1813208 1936079 1985004 2105526 2275853
16645 2275853 2389368 2332694 2217488 2195194 2268548 2420440 2454061 2339549 2559082 2768787
16635 2768787 2870950 3003464 3005279 3038752 3075012 3007691 3112274 3370621 3531343 3704213
16625 3704213 3851814 3993247 4044359 4148332 4426026 4755180 4911228 4914894 4946991 5300742
16615 5300742 5643091 5856461 6139315 6567739 7117900 7482898 7685935 7693774 8040128 8467438
16605H467438M54489L93059N33318P02912P69371P99785O28856P99992R02610
16596A4451830Q76217Q46234R29497J166008J395311J730792J937746K233510
16588B5567145K560641L175973M465738O715228J0317642J5416292J9931695J7539636
16580A05689990P415769J097625J180614L203395O103158J0000851J3667460J4391559
16572A62750421J0480895N097745M507227P041353Q758548R289123M162867j499101
16564B10589078k52316M787923R133562J0238253N396212m772679j3961872j8052503
16556B03105658j6122541j2600161j2958722j3612099j0270825o352261k870457
16549A28318592Q27636M078432L888313k237192j3294220k2329062k2711586j6420988
$$ plain form
16605 8467438 8921927 9314986 9848304 10551216 11320587 12120372 12749228 13549220 14451830
16596 14451830 15328047 16174281 17103778 18269786 19665097 21395889 23333635 25567145
16588 25567145 28127786 31303759 35769497 42484725 52802367 68218659 88150354 105689990
16580 105689990 113105759 114203384 115383998 118587393 124690551 134691402 148358862 162750421
16572 162750421 173231316 178329061 182836288 189877641 198636189 207925312 212088179 210589078
16564 210589078 210336762 215124685 224258247 234496500 239892712 235120033 221158161 203105658
16556 203105658 186983117 174382956 161424234 147812135 137541310 131189049 128318592
16549 128318592 129146228 133224660 137112973 134875781 121581561 99252499 76540913 60119925
16541F0119925j0176597o478158m348227l219285k721124k321178j941825j617084
16533B7296447j442769j322366j177423j072125j063306r52675r06082r28808
16525A8430893p95222q27879r99415p60626p93472p00113o40515n14396m00485
16516A1998770l71075m55553m74928l95744m76750m54790n19822l26198j69964
16507H353946l87851k45082j41276j92591l62668k73407j74572l01277l26780
16498E948442k94103p5447j64878j20443j39086k16116j80669j29217k56881n7637
16488D313965k33357k87102j08444o4383j78574j36931k22224j63513j43018P4983
16478B851402j0027j74872L7397k13083k12268J4840m7949q9948m8849j91665
$$ plain form
16541 60119925 49943328 43465170 39116943 35897658 33176534 30855356 28913531 27296447
16533 27296447 25853678 24531312 23353889 22281764 21218458 20265783 19359701 18430893
16525 18430893 17635671 16807792 15808377 15047751 14254279 13554166 12913651 12399255 11998770
16516 11998770 11627695 11172142 10697214 10301470 9824720 9369930 8850108 8523910 8353946
16507 8353946 7966095 7721013 7579737 7387146 7024478 6751071 6576499 6275222 5948442
16498 5948442 5654339 5578892 5414014 5293571 5154485 4938369 4757700 4628483 4371602 4313965
16488 4313965 4080608 3793506 3685062 3620679 3442105 3305174 3082950 2919437 2776419 2851402
16478 2851402 2841375 2666503 2703900 2490817 2278549 2293389 2245440 2155492 2106643 1914978
16468A914978k6724k6243o3876j28354j94923J9764n3390q7267q8365J02108L8179
16457A405887k22191j35330p9442m061K9651j31447m1740J06636L0400l2526K4469
16446I50306N0304j96581J2378n8642m818J21161N504r6618k91133r6783R7145
16435D92223R2811j91308j72649K2781J76712J11479n4034m7392j21051o6552
16425B43020n769q6865n3187n6184P1948m7770j05676M7117L189k029j7236N4277
16413D4835R205j01328j31435j12124N7051M9407N6681Q4936j51656k09397J05783
16402b98042N9650M4033M0973N6426J03539K0938O9223k9778q7971j30229K8017
16391a23221o6751J1783J77128Q6137j6995M0409k6435m9573l6492N131p6277
$$ plain form
16468 1914978 1888254 1862011 1798135 1669781 1474858 1494622 1441232 1353965 1265600 1367708 1405887
16457 1405887 1183696 1048366 968924 964863 994514 863067 821327 927963 958363 925837 950306
16446 950306 1000610 804029 816407 757765 752947 874108 879612 782994 491861 395078 492223
16435 492223 585034 393726 221077 243858 420570 532049 478015 430623 309572 243020
16425 243020 237251 150386 97199 41015 112963 65193 -40483 6634 9823 7794 -9442 44835
16413 44835 54040 -47288 -178723 -290847 -233796 -184389 -127708 -42772 -194428 -403825 -298042
16402 -298042 -238392 -194359 -153386 -96960 6579 27517 96740 66962 -21009 -151238 -123221
16391 -123221 -189972 -178189 -1061 85076 68081 108490 82055 32482 -4010 1121 -75156
16380g5156j0510L7402j26253o7899k9931J26472J02931L6751l1265j88841q8065
16369c14364J05785J51248J03935l1754J797l7844r5459J3936p807K3905l8211
16358a24833k33627r0429Q0519J30048J39362l6802j65271k0114l5331P827J10783
16347b37868R766n7454j0679M1243k2448N608k8252J9358q1611N8589R798N6952
16335b36998J09553J39301J51956l910k03240j97640j9529L8610j309r7282j0002
16324c30490N3129n7659M7430J02620k1661M5359j62408j13090J117L3631K39672
16313a62350j7872p7439o4240o8119j1303P6958J3235J46984M9812J86209p5842
16302c967p7106j24045m3626J63405n1161j62764J536m0711P875k5442k3758R5613
$$ plain form
16380 -75156 -85666 -48264 -174517 -242416 -272347 -145875 -42944 -6193 -37458 -226299 -314364
16369 -314364 -208579 -57331 46604 14850 16647 -21197 -116656 -102720 -110527 -86622 -124833
16358 -124833 -358460 -448889 -368370 -238322 -98960 -135762 -301033 -321147 -356478 -348651 -237868
16347 -237868 -228102 -285556 -296235 -254992 -277440 -271832 -300084 -280726 -362337 -303748 -293950 -236998
16335 -236998 -127445 11856 163812 159902 -43338 -240978 -260507 -221897 -223206 -320488 -330490
16324 -330490 -277361 -335020 -287590 -184970 -206631 -161272 -323680 -436770 -435653 -402022 -162350
16313 -162350 -180222 -257661 -321901 -390020 -401323 -324365 -311130 -164146 -114334 71875 -3967
16302 -3967 -81073 -205118 -248744 -85339 -136500 -299264 -297728 -338439 -330564 -356006 -379764 -284151
16290b84151p5454Q4407k0838j32789Q8527K4598p6228r3714L3659N3123j29989
16279e28849q7019n9296K4073J15897J64042K20495o89p0871K4748n0203j41993
16268c89665n4720j04229j7440R9229K1578P4751k5748L1305n0562q3190k7091
16257e25782J02149J17073M2856O6832j77791j39019p8815L4974O7721K9226R4001
16246c66575J51500O2943k4640j34788L1909J70981j14458j91537N8920l2697
16236c88442k1777M3749p5794J76441P6844j31658L9748l7876P9227K9998j11283
16225c20823p5176j24840M8791J80544N607L180L9524M9503q5413m6177M501J0189
16213c10590Q0222J6831Q475l7373j14892N9812M6158k3278M2895N1168K864J22569
$$ plain form
16290 -284151 -359605 -275198 -296036 -428825 -340298 -315700 -391928 -485642 -451983 -398860 -528849
16279 -528849 -615868 -675164 -651091 -535194 -371152 -150657 -151346 -222217 -197469 -247672 -389665
16268 -389665 -444385 -548614 -566054 -466825 -445247 -370496 -396244 -364939 -415501 -498691 -525782
16257 -525782 -423633 -306560 -263704 -196872 -374663 -513682 -592497 -557523 -489802 -460576 -366575
16246 -366575 -215075 -152132 -176772 -311560 -279651 -108670 -223128 -414665 -355745 -388442
16236 -388442 -410219 -366470 -442264 -265823 -188979 -320637 -280889 -318765 -239538 -209540 -320823
16225 -320823 -395999 -520839 -472048 -291504 -285897 -282717 -243193 -193690 -279103 -325280 -320779 -310590
16213 -310590 -230368 -213537 -205062 -242435 -357327 -297515 -251357 -274635 -231740 -180572 -177708 -55139
16201e5139k2651J4311j09928j42378n5962p4377L641J92316K57226J7341l96304
16190c71904r2244J07701J19885m4754j39231j5555r0046L0897J14469J61500
16180b19282R167q9736k3412q5287J1162r0329J19208J44577m883j10955j31837
16169d71607J75606Q7021n7122k05123O6254J38926j47899R4692j4555j50245
16159d84052J90857L7490j70121M7976K3175o3301K7863j4022J930Q0590j52777
16148d74392O8900l0572j57171p2681P5248J40193K01660J6822k4432L1515r0139
16137c15049n048J8237K6399l7092j71196R6957K75010p4276k51366r6398n8957
16126e92779P6096J62423J11008q8578l1196N5241J27332L5305Q6266n6538k475
$$ plain form
16201 -55139 -77790 -63479 -173407 -315785 -371747 -446124 -442483 -250167 7059 24400 -371904
16190 -371904 -464148 -356447 -236562 -281316 -420547 -436102 -526148 -495251 -380782 -219282
16180 -219282 -210115 -299851 -323263 -408550 -397388 -487717 -368509 -223932 -228815 -339770 -471607
16169 -471607 -296001 -208980 -266102 -471225 -404971 -266045 -413944 -319252 -333807 -484052
16159 -484052 -293195 -255705 -425826 -377850 -354675 -417976 -390113 -404135 -402205 -321615 -474392
16148 -474392 -405492 -436064 -593235 -665916 -590668 -450475 -248815 -231993 -256425 -224910 -315049
16137 -315049 -320097 -301860 -275461 -312553 -483749 -386792 -111782 -186058 -437424 -533822 -592779
16126 -592779 -516683 -354260 -243252 -331830 -363026 -307785 -180453 -145148 -58882 -115420 -117895
16115a17895j41656M6375n3100p6556Q9329J11987J41342l6286J836M8526J43342
16104A57244N2280j21762r4384M722M3512n5927o9109j9797o2280r820j09633
16093b84954m7884O9861Q9028j8931l8238l1479L5452J13154l938o0436R3594
16082h4771k0096j24414n0114J0582L4978o514m37k0985m0332L7389O2242K6633
16070a75839k421o3772j65423J06737L5882M1699l20m9539J51805R4113K7144
16059F6J7437n786n4680k25725n5558J13980J3177l7537M3682O4345J96207R1314
16047A60922j63626N7674j8018r6219j45527j36358j6287N7968Q7928L931J03405
16036a04207J3429N3105N0835K5462q8457Q887q1875o4242K0617L2286k2392l5867
$$ plain form
16115 -117895 -259551 -213176 -266276 -342832 -253503 -141516 -174 -36460 -34624 13902 157244
16104 157244 209524 87762 -6622 -1900 41612 -14315 -83424 -103221 -165501 -175321 -284954
16093 -284954 -332838 -262977 -173949 -192880 -231118 -262597 -227145 -113991 -117929 -178365 -84771
16082 -84771 -104867 -229281 -279395 -268813 -233835 -240349 -240786 -261771 -302103 -264714 -202472 -175839
16070 -175839 -178260 -242032 -407455 -300718 -264836 -223137 -223457 -272996 -121191 -27078 66
16059 66 17503 11717 -42963 -268688 -324246 -210266 -197089 -234626 -190944 -126599 69608 160922
16047 160922 -2704 54970 36952 -59267 -204794 -341152 -357439 -299471 -211543 -207612 -104207
16036 -104207 -90778 -37673 13162 38624 -49833 -40946 -122821 -187063 -166446 -134160 -156552 -192419
16024a92419K26606j4187k5597R4471J53616J10391m4145j21888K4721j3473Q3396
16013B81492Q2340k5834R717L3386J56293J40196P2245J81676J34688k19976j20340
16002G25883J932j8556Q7262J68665N9757M8059j18047p8060N0452K6260j92526
15991G61081j41771p2860Q0940m3890p6762M2293Q9035j18258o9834q5473j28431
15980B36070j36435O244P5389m8762l7783l7853l7754n5676j25908j2730J31864
15969d3334j2990l639J28715K0512j07471l0519N6890Q0991P5923o5134n0172
15958D9772K7092j20817J60789K1527k5116q539J7329O2106n4858L1589l7675
15947A23199k3547p3712o0446m0559L3434J03517l7445K8238K2862j00117j39298
$$ plain form
16024 -192419 34187 20000 -5597 88874 242490 352881 308736 186848 211569 198096 281492
16013 281492 363832 337998 347715 381101 537394 677590 749835 931511 1066199 846223 725883
16002 725883 727815 709259 796521 965186 1024943 1073002 954955 876895 927347 953607 761081
15991 761081 619310 546450 627390 583500 506738 549031 638066 519808 449974 364501 236070
15980 236070 99635 105879 181268 132506 94723 56870 19116 -36560 -162468 -175198 -43334
15969 -43334 -56324 -59963 68752 89264 -18207 -48726 8164 89155 165078 99944 49772
15958 49772 76864 -43953 116836 138363 113247 104708 122037 184143 129285 160874 123199
15947 123199 99652 25940 -34506 -75065 -41631 61886 24441 52679 75541 -24576 -163874
15936a63874N9894J81230R825l29k2936j61982q9022Q3523J81122P8049J4433
15925A69933o1802j39290k8161P7238Q9561n9716j42733q0683L7244J85948P4523
15914A22062n1449n6081j07063n9370K2973L0630J77754J6539j03412m382J4385
15903B586J7323J09554l1460j84978Q662P5029J22359p0034j03038K1516j2003
15892d4484k2824K6552J25280n3934L8913r4006M5348j7015Q4517R1639l8549
15881A41437k9293q9563r629N4319J12822P5723q2566j21277l2661j01709o8864
15870a51261J58261O0781P839j4268p0487P9054p4960r4588O9967K2058n090J2714
15858B0L0385m8539j95222j83973j43992O1980J35308M9275P2693J34465M4036
$$ plain form
15936 -163874 -103980 77250 87075 86746 63810 -98172 -187194 -103671 77451 155500 169933
15925 169933 108131 -31159 -59320 17918 107479 47763 -94970 -175653 -138409 47539 122062
15914 122062 70613 14532 -92531 -151901 -128928 -98298 79456 95995 -7417 -11799 2586
15903 2586 19909 129463 98003 -86975 -78313 -3284 119075 49041 -53997 -32481 -44484
15892 -44484 -67308 -40756 84524 30590 69503 -24503 20845 3830 88347 179986 141437
15881 141437 112144 22581 12952 67271 180093 255816 173250 51973 19312 -82397 -151261
15870 -151261 7000 67781 75620 61352 -9135 69919 -5041 -99629 -29662 -7604 -12694 20
15858 20 30405 -18134 -213356 -397329 -541321 -479341 -344033 -294758 -222065 -87600 -43564
15847d3564n0258K0433K19418J6905n2518j62632J6977j6027K0035L0408O5784
15836F4961n7906p6316n3417n7426N6612M7350P9126j91450J836J43302L9223
15825d105m1803L711k0290m5653p0638J05936P5653J8024l7756j85036j32603
15814c34560K2179J99261J50682M6107j05155j28475j02364k2050j1408Q6216
15804a99567K0454o9384N9268Q444L3098J23742M2191q190L6566j8935L6995O3849
15792A28531m3088k2362j06359j52517J21858J1674J43303L3122q0121M7284J68676
15781B50001k7113k9656K2437P5480K5804j57594r9211j06376n6367R2761J2574
15770B740j30414J9576J79712n073K9035J29598M3973l9582j43806j19227M9878
$$ plain form
15847 -43564 -93822 -73389 146029 162934 110416 -52216 -35239 -51266 -31231 -823 64961
15836 64961 7055 -69261 -122678 -180104 -123492 -76142 2984 -188466 -186630 -43328 -4105
15825 -4105 -45908 -42197 -62487 -108140 -178778 -72842 2811 20835 -16921 -201957 -334560
15814 -334560 -312381 -113120 37562 83669 -21486 -149961 -252325 -274375 -285783 -199567
15804 -199567 -179113 -248497 -189229 -180785 -147687 -23945 18246 10056 46622 27687 64682 128531
15792 128531 85443 63081 -43278 -195795 -73937 -62263 81040 114162 34041 81325 250001
15781 250001 222888 193232 215669 291149 316953 159359 60148 -46228 -102595 -9834 2740
15770 2740 -127674 -108098 71614 66541 95576 225174 269147 229565 85759 -33468 16410
15759A6410m1379j9820j257j22085M1989M0352J29235m8567r8631o3072N334P2770
15747h8721M9296O2593m857l1016q4380K9526M7155P3251O3600O520N0289j20309
15735E2947j58660p2427N9551M7169m820J97577O0761j99016j25110J41422r214
15724i820N1987L1099J34278N5851n0058m9930k0856j4930j8805L2220K58499
15713C99535O1444L5158k16172j26070Q8498Q8180k7006j34364O4123O4422j03947
15702A93801J1103o9331r8877p5225K2822K9531K0809O2775n0436O5378p6557
15691C5793J8598O5989j4136Q6073N0913r7298j58979L0737N0913j56882k32587
15680c20866J21488K15165l7626K8201P4719K2898r5711L0391J05339k5561l6220
$$ plain form
15759 16410 -24969 -44789 -46046 -168131 -126142 -85790 43445 -5122 -103753 -166825 -161491 -88721
15747 -88721 -39425 23168 18311 -12705 -97085 -67559 -20404 52847 116447 122967 173256 52947
15735 52947 -105713 -178140 -118589 -71420 -76240 121337 182098 -16918 -142028 -606 -9820
15724 -9820 42167 73266 207544 263395 213337 163407 142551 127621 108816 141036 399535
15713 399535 460979 496137 279965 153895 242393 330573 303567 169203 233326 297748 193801
15702 193801 204904 135573 36696 -38529 -15707 13824 34633 97408 46972 112350 35793
15691 35793 54391 120380 106244 192317 243230 145932 -13047 17690 68603 -88279 -320866
15680 -320866 -199378 15787 -21839 6362 81081 103979 8268 38659 143998 118437 82217
15669H2217J9876Q1867k5098j7012q8936j8412n7651R1895J32800q8707j3996
15658I8843o456p6517n7237N471J83119Q6500k7225m3028p3767j10355k2321K0850
15646b2123Q7271J02353j06813m6078R8193j19769n8378Q2278N8819P4273N2326
15635B02352J44712J64475P827r6394O118j91876R7900P7507l8901j25170n3762
15624A94788P4782l149K4087j21939j00503m7679P3636Q3226J24598J30139j17296
15613C14690j07104N0005L103k4389J01411m1996j71253m2444J1166m9193O2410
15602A06406J14681Q2105n3428n4229L4510Q8355K1185n3736k6739k2142m8944
15591A88024o1909O351K18995O926Q27N593L888m1328L9497P0492J63098j2733
$$ plain form
15669 82217 102093 183960 158862 141850 52914 34502 -23149 68746 201546 112839 98843
15658 98843 92387 15870 -41367 -35896 147223 233723 206498 163470 89703 -20652 -42973 -22123
15646 -22123 65148 167501 60688 14610 112803 -6966 -65344 16934 75753 150026 202352
15635 202352 347064 511539 519366 422972 429090 237214 335114 412621 373720 248550 194788
15624 194788 269570 266421 290508 168569 68066 20387 94023 177249 301847 431986 314690
15613 314690 207586 257591 260694 236305 337716 295720 124467 82023 93189 43996 106406
15602 106406 221087 303192 249764 195535 230045 318400 339585 285849 259110 236968 188024
15591 188024 126115 132466 351461 358387 359214 364807 368695 327367 366864 437356 600454 587721
15579E87721j36879L4307M2514q6640p4255j24932n3025K6949J59179J30828R6598
15568F02365P0312M103q7043j08456O6789j3283j22552N2284J66380J03113o5717
15557F68295J09961O0244k1593O553J35689K7074N6498Q4998K1922R5479J0711
15546A255831j3838J88026L41126K36749O0130L3277j12178K38577K58897M7734
15536B534331J694J45114J31333J44493q7786k13096N2569j41157l74039K9232
15526B222688j18861j24112k02222q1960q0420j60540o9528k08550o5878l64p4881
15515A035372q3954q0821n7655Q8377P0230j68569M2580J07649n0165j53357k3479
15504G26208M1114K8717l8020n7140P3588O4606j24173o8578m4951J8512j21749
$$ plain form
15579 587721 450842 485149 527663 441023 366768 241836 188811 215760 374939 505767 602365
15568 602365 672677 676780 589737 481281 548070 534787 412235 464519 630899 734012 668295
15557 668295 778256 838500 816907 823460 959149 986223 1042721 1127719 1149641 1245120 1255831
15546 1255831 1241993 1430019 1771145 2007894 2068024 2101301 1989123 2227700 2486597 2534331
15536 2534331 2536025 2681139 2812472 2956965 2869179 2656083 2708652 2567495 2193456 2222688
15526 2222688 2103827 1979715 1777493 1695533 1615113 1454573 1385045 1176495 1110617 1110253 1035372
15515 1035372 951418 870597 812942 901319 971549 802980 845560 953209 903044 749687 726208
15504 726208 767322 796039 758019 700879 774467 839073 714900 646322 601371 619883 498134
15493D98134O2548o148n507j4119j51559L4163Q3156L1777J68127p5378j07734
15482E17460O6768Q6432J47681L1150m6329j25249n2557n9009Q3528K9587k22670
15471D56792j8018O7474K0490O9647O5933r6254K2983k550j4790J6062l3212J6162
15459E70719N5957K06190J04333j04495j05291p0170J9808N9774j6037k09912
15449E10876L1629j3033k9444R0994J01253L7009j5683m0571k640R834K433r7021
15437E85636n0255r6241k4872N5245J86270m6481n0308j28618l8798Q5148L1715
15426E08441n7868J94655J28884k08893j72822Q1695l9360o1300J8655N5908o2211
15415C85784O5292J55705J83597j78218k87505j38629j35279R3784J43800P7586
$$ plain form
15493 498134 560682 554534 549027 534908 383349 417512 500668 532445 700572 625194 517460
15482 517460 584228 670660 818341 849491 803162 677913 625356 566347 649875 679462 456792
15471 456792 438774 506248 526738 596385 662318 566064 589047 586497 571707 587769 554557 570719
15459 570719 626676 832866 937199 832704 727413 657243 677051 736825 720788 510876
15449 510876 542505 529472 500028 591022 692275 729284 713601 673030 670390 680224 682657 585636
15437 585636 535381 439140 414268 469513 655783 609302 558994 430376 391578 476726 508441
15426 508441 450573 645228 774112 565219 392397 474092 434732 373432 392087 447995 385784
15415 385784 451076 606781 790378 612160 324655 186026 50747 144531 288331 365917
15405C65917J59233Q5875P7030O5234O8216R8362R5588N6875n2196j73209q317
15394H38608k1674j1724Q7158J68985j8944j85170j98134N1299K66907l9950k12449
15383G24912j05952p5573R0499J18536j9102M885l9200j04486J64770J29026O6468
15372I54783J10372n1457l1133L6799M8671j2074j55670J0548N5458l5045m6764
15361H84488P8335J33841J16117P5587l1282k3734k3806l0879J07750n981N5593
15350A336029N2434j25348N0099L3990J9338P072M9163J7378j62863j52393P8440
15339A203339R4396J00640K723j04134r938R3710j45043j26661j07403K3446l1128
15328I93947N4252Q5586P5445J32146J23905j155K9437p5454n3693N6689j69917
$$ plain form
15405 365917 525150 611025 688055 753289 821505 919867 1015455 1072330 1020134 846925 838608
15394 838608 816934 805210 892368 1061353 1042409 857239 659105 710404 977311 937361 724912
15383 724912 618960 543387 633886 752422 733320 738205 699005 594519 759289 888315 954783
15372 954783 1065155 1013698 982565 1019364 1068035 1055961 900291 910839 966297 931252 884488
15361 884488 962823 1096664 1212781 1288368 1257086 1233352 1209546 1178667 1286417 1280436 1336029
15350 1336029 1388463 1263115 1313214 1347204 1366542 1373614 1422777 1440155 1277292 1124899 1203339
15339 1203339 1297735 1398375 1401098 1296964 1287026 1380736 1235693 1109032 1001629 1025075 993947
15328 993947 1048199 1133785 1209230 1341376 1465281 1464126 1493563 1418109 1364416 1421105 1251188
15317A251188o1862N3639M8976M7048L4726k9123l4615M5603k7702M2052n6669
15306A313261L5513M0900p243j2235q825J22295n6524M9282P8056j14981J7187
15295A456686K0332Q6136o9413P1749N2150l2135m5717K25122K10152k7249n7299
15284A890514q537l1913K303n0902j2740M8764J8562j49l170j35757J9955J22703
15272A859633q5400P9908K8988j29803j10657m4812M5732m2920J07889J36468
15262A845026k04686q5464R0302k42J06083R8653j7343N8955Q8290N201J34688
15251B119463L5705n4622M5403R0158j5778N6661J5151M3452K03246O2981K22077
15240B823897J49118j08774j10890O0503J90230J84247l3424m0524M7316L4014
$$ plain form
15317 1251188 1189326 1242965 1291941 1338989 1373715 1344592 1309977 1355580 1327878 1369930 1313261
15306 1313261 1348774 1389674 1382431 1370196 1361371 1483666 1427142 1476424 1554480 1439499 1456686
15295 1456686 1477018 1563154 1493741 1565490 1617640 1585505 1539788 1764910 1975062 1947813 1890514
15284 1890514 1881977 1850064 1852367 1801465 1788725 1837489 1856051 1855902 1852732 1716975 1736930 1859633
15272 1859633 1774233 1854141 1883129 1753326 1642669 1597857 1643589 1600669 1708558 1845026
15262 1845026 1640340 1554876 1645178 1644936 1751019 1849672 1832329 1891284 1979574 1984775 2119463
15251 2119463 2155168 2100546 2145949 2236107 2220329 2276990 2292141 2335593 2538839 2601820 2823897
15240 2823897 2973015 2864241 2753351 2813854 3004084 3188331 3154907 3114383 3161699 3195713
15230C195713P0785J0763Q4677j1638P987K5556M827r6520L3407J53317J987M0751
15218C521612J89326O3730n364m8775j3966J03725P7800k2267N5670J85585L16621
15207D423697K44535j7726p195K63663J60218K446J53787R9445R5601O6944J00195
15196E585610R2780j9915J4147P9908P3572K67048j6431P209k7825J0107J2624
15185F078834L5160K61949K79590J3829J92065J96415J16968J65801J80407L83642
15175G904660M11590N51264M93203L36864M87099M16049K94386K62542L62678
15166A1520335J96994P8996J91527K7376l093R023o4185N3908R9154N4704o8400
15155A2096339O2502K65891J90591K71661K84725M13694K66049K83762K43510
$$ plain form
15230 3195713 3266498 3277261 3361938 3350300 3358287 3383843 3388670 3292150 3325557 3478874 3480861 3521612
15218 3521612 3710938 3774668 3769304 3720529 3706563 3810288 3888088 3865821 3921491 4107076 4423697
15207 4423697 4668232 4650506 4643311 4906974 5067192 5069638 5223425 5322870 5418471 5485415 5585610
15196 5585610 5678390 5658475 5672622 5752530 5826102 6093150 6076719 6083928 6056103 6066210 6078834
15185 6078834 6113994 6375943 6655533 6669362 6861427 7057842 7174810 7340611 7521018 7904660
15175 7904660 8316250 8867514 9360717 9697581 10184680 10600729 10895115 11157657 11520335
15166 11520335 11717329 11796325 11987852 12015228 12012135 12021158 11956973 12010881 12110035 12164739 12096339
15155 12096339 12158841 12424732 12615323 12886984 13171709 13585403 13851452 14135214 14378724
15146A4378724M50353O20213M04357O42701N20721M87065M56321N95801N45793
15137A9102049P31891R51738Q42832P58861Q15192R49169J150784J372761J550957
15128B8226234J599410J832782K068929K085660K507179K795446L172368L585780
15120D7873788M243911M794799N434076O157554P097410Q272595R329978J0274612
15112A03478723J1197238J2347034J3203487J4380593J5954615J8003622K0421411
15105B08986723K3460265K7086394L0599416L3362386L5422523L6350026L5664161
15098D30931894L3601176L0344131K6121612K0941159J4603852P886948M96904
15091E64927676p810446j6127819k4264979l1734186l7885493m2311778m4050466
$$ plain form
15146 14378724 14829077 15449290 15853647 16496348 17017069 17504134 17960455 18556256 19102049
15137 19102049 19833940 20785678 21628510 22387371 23202563 24151732 25302516 26675277 28226234
15128 28226234 29825644 31658426 33727355 35813015 38320194 41115640 44288008 47873788
15120 47873788 52117699 56912498 62346574 68504128 75601538 83874133 93204111 103478723
15112 103478723 114675961 127022995 140226482 154607075 170561690 188565312 208986723
15105 208986723 232446988 259533382 290132798 323495184 358917707 395267733 430931894
15098 430931894 464533070 494877201 520998813 541939972 556543824 564430772 564927676
15091 564927676 557117230 540989411 516724432 484990246 447104753 404792975 360742509
15084C60742509m3655144m1172175l7261224l2499139k6950955k2097328j8042699
15077A39063845j4566918j1668477r680016q430391p199469o296435n652334m902003
15069G0667802m311659l831927l515109l202724k863457k568690k416513k155534
15061D5802189j938520j628167j603775j406599j289848j289307j153894j009068
15053C4483011q37519j051102j022248q26352q29416p49364o94200o50281n97192
15044B7225337o71556p46187n99993o60446q20536p55165n92861n73176p11449
15035B1093968p69625n88916o48869p98156p64502o65366n71244m79547o00187
15026A5207556o29566n71523n31234n04899o24431l68557m31041o02160m14527
$$ plain form
15084 360742509 317087365 275915190 238653966 206154827 179203872 157106544 139063845
15077 139063845 124496927 112828450 103148434 94718043 87518574 81222139 75569805 70667802
15069 70667802 66356143 62524216 59009107 55806383 52942926 50374236 47957723 45802189
15061 45802189 43863669 42235502 40631727 39225128 37935280 36645973 35492079 34483011
15053 34483011 33645492 32594390 31572142 30745790 29916374 29167010 28472810 27822529 27225337
15044 27225337 26553781 25807594 25207601 24547155 23726619 22971454 22378593 21805417 21093968
15035 21093968 20324343 19735427 19086558 18288402 17523900 16858534 16287290 15807743 15207556
15026 15207556 14577990 14006467 13475233 12970334 12345903 11977346 11546305 10944145 10529618
15017A0529618m05849k06791j66611k07864k79631k96724l37647l14476k93490
15008H020535k71605k06488j75489j56578n9981j28175j53208j6795l26194l27593
14998F198429j04428r3157j60234r8244p8393n4496m2314n9155j26915j27172
14988E253921k55882o0570k65105j48398j77959j21216J1576N6263j71458j46476
14978C974696k2678j20090j11837l9025m6146n5456L2382p2533o1226K8380M7416
14967C553883M6658J5077N2665j4928j75551O4129J16526j2698j08708J680J263
14956C539996n9329q4013n8146l3699r1802j48427j07498j81464j45787k1675
14946B608156j06780o0846m1109J75194L7929r7030j60670n1511j3045L2726r4917
$$ plain form
15017 10529618 10123769 9916978 9750367 9542503 9262872 8966148 8628501 8314025 8020535
15008 8020535 7748930 7542442 7366953 7210375 7150394 7022219 6869011 6852216 6526022 6198429
14998 6198429 6094001 6000844 5840610 5742366 5663973 5609477 5567163 5508008 5381093 5253921
14988 5253921 4998039 4937469 4672364 4523966 4346007 4224791 4236367 4292630 4121172 3974696
14978 3974696 3952018 3831928 3720091 3681066 3634920 3579464 3611846 3539313 3478087 3506467 3553883
14967 3553883 3600541 3615618 3668283 3653355 3477804 3541933 3658459 3645761 3537053 3538733 3539996
14956 3539996 3480667 3396654 3338508 3304809 3213007 3064580 2957082 2775618 2629831 2608156
14946 2608156 2501376 2440530 2399421 2574615 2612544 2515514 2354844 2303333 2290288 2323014 2228097
14935B228097k04580j62523j76973n1470o367J19305K03842L7512k08189q8616
14925A690038j67209q4306m8149o4687l0145L0116p1260o1392K6712J40227K2945
14914A382890p4837r6487l05910p2668J03330L067k21290J39017K9071n5712J02263
14903I32734q5459p0494J04942J7184j7958K9242R9797K8942K1945n1784l6066
14892I73025j17630r4289j75509r5965q9446k7787K2927Q446m8350j49851L7251
14881B42822J31290L4176j39504l9184J9272K1262j06788j48482K5437k2819O7767
14870H5249O7836J37762N5277J3800o4297n3640j10569K113j47849J09354J9425
14859A14461l9277J42396o8828j13332q9220q661J57321o680n5817M200N9907
$$ plain form
14935 2228097 2023517 1860994 1684021 1632551 1626184 1745489 1949331 1986843 1778654 1690038
14925 1690038 1522829 1438523 1390374 1325687 1295542 1325658 1254398 1193006 1219718 1359945 1382890
14914 1382890 1308053 1211566 905656 832988 936318 939385 718095 857112 886183 830471 932734
14903 932734 847275 776781 881723 898907 880949 910191 1009988 1038930 1060875 1009091 973025
14892 973025 855395 761106 585597 489632 400186 372399 395326 403772 355422 205571 242822
14881 242822 374112 408288 268784 229600 248872 270134 163346 14864 40301 17482 85249
14870 85249 153085 290847 346124 359924 295627 241987 131418 133531 -14318 95036 114461
14859 114461 75184 217580 148752 35420 -53800 -62461 94860 88180 32363 36563 96470
14848I6470l0994j33313K1084n7057M1105J14229O6420j6710q6412r9078M6993
14837c7263J78325n3986r7353o931j73308m8135L3414J23329J72874J5323j78436
14826g2147M1762q1446j02254j9884j7504O0760J12098L9811j6411M0224M5252
14815C0261n4878p1105p4659J8848l2167n432k6838j36550N6517J2619r5080N5165
14803c23299K38783l799j31571q0339q1918J5006k7949l3359P0804J46541J4102
14792a96998k7901N0474K7925n4209j43893j17179p8292J06042K04504J47931
14782h1596n449j98034j37066J2107J48912K8846P8994J34009r7640j12236j01855
14771c31008J66183K11842r4786j80697n3147p5639r8089q5849Q9016M5157O347
$$ plain form
14848 96470 65476 -67837 -46753 -103810 -62705 51524 117944 101234 14822 -84256 -37263
14837 -37263 141062 87076 -10277 -17208 -190516 -238651 -205237 -81908 90966 106289 -72147
14826 -72147 -30385 -111831 -214085 -233969 -251473 -190713 -78615 -38804 -55215 -14991 30261
14815 30261 -24617 -95722 -170381 -151533 -183700 -189132 -215970 -352520 -296003 -283384 -378464 -323299
14803 -323299 -84516 -88315 -219886 -300225 -382143 -367137 -395086 -428445 -357641 -211100 -196998
14792 -196998 -224899 -174425 -146500 -200709 -344602 -461781 -540073 -434031 -229527 -81596
14782 -81596 -87045 -285079 -422145 -410038 -261126 -232280 -153286 -19277 -116917 -229153 -331008
14771 -331008 -164825 47017 -47769 -228466 -281613 -357252 -455341 -541190 -452174 -407017 -400670
14760d00670J8839K8245R0153l1078o3330N3141J24890k3549p4571j60675N8482
14749c80123J5875m4614P4873J58887l6754l3866o6370Q1440K15573Q4794J55245
14738B24960N3987j95929q7359n4106J08345o9078l9691q409J46189m3976j22741
14727h7808o4653J02032N0923Q2496J6361j50585k35338O7628N6367M6575P6548
14716c9454m113N8925j17575M5552l4406n0774k4807M0625L3178J7957p248N8388
14704b3752J89732M881O1366j3625m6232N8962N3345k4839L0201l6837j45000
14693A08202j23434j0649K03227J73411P6393J4569o8765j1863r0704K7444l5024
14682B62807j79429l6661l680j17470J00570J0274J35018J43163J25171m0010
$$ plain form
14760 -400670 -381831 -353586 -263433 -294511 -357841 -304700 -179810 -203359 -277930 -438605 -380123
14749 -380123 -364248 -408862 -333989 -175102 -211856 -245722 -312092 -230652 -15079 69715 224960
14738 224960 278947 83018 -4341 -58447 49898 -19180 -58871 -67280 78909 34933 -87808
14727 -87808 -152461 -50429 494 82990 99351 -51234 -286572 -218944 -162577 -116002 -39454
14716 -39454 -43567 15358 -102217 -56665 -91071 -141845 -166652 -126027 -92849 -74892 -82140 -23752
14704 -23752 165980 170861 232227 218602 172370 231332 284677 259838 290039 253202 108202
14693 108202 -15232 -25881 177346 350757 427150 441719 372954 361091 270387 297831 262807
14682 262807 83378 46717 43037 -74433 26137 36411 171429 314592 439763 399753
14672C99753n8118k920L0758K9244o4613J0325n2767P5075N8285k9847N2899J90426
14660F38500J88283K01188K1705J26624J04676J77435J74234Q8810J36304J62430
14650B020189J87459K05543K38032l0335j47726m9086K64623J01251j97999o8519
14640B523432k70310k88017k98523l05473k40799k28881j39408n303j46146k2596
14630E77976n4751j82574J0962j90603j66916J4248J46889J05188j56378r6242
14620G799j0534k6461J3068k8018Q101Q0958l2677L5210j8192k21899k29919K7312
14608c95252J58187J36827P9124J55511L5787l07377r4014J25282J07339J9467
14598B0881J76843L4508j20724j11586J9801N2682m6982J4922j96865k00374m5354
$$ plain form
14672 399753 341635 338715 369473 398717 334104 344429 291662 366737 425022 395175 448074 638500
14660 638500 826783 1027971 1049676 1176300 1280976 1458411 1632645 1721455 1857759 2020189
14650 2020189 2207648 2413191 2651223 2620888 2473162 2424076 2688699 2789950 2591951 2523432
14640 2523432 2253122 1965105 1666582 1361109 1120310 891429 752021 746718 600572 577976
14630 577976 523225 340651 351613 161010 -5906 8342 155231 260419 104041 7799
14620 7799 -2735 -29196 -16128 -44146 -36045 44913 12236 47446 29254 -192645 -422564 -395252
14608 -395252 -237065 -100238 -21114 134397 170184 -137193 -231207 -105925 1414 20881
14598 20881 197724 232232 111508 -78 19723 72405 25423 40345 -156520 -356894 -402248
14587d02248P3375J39647J16795N1157k1062p5767R7829P1342R5489O7318k17154
14576c279l7368o8240J0961j6962Q9366K6389K2275Q9278m6667j76295k0810r170
14564a40522j64228j24196J1342N2893O8002o818l0452J51694O9074K9460Q939
14553g4812j36223q0437j4831m3304j39809L4254J59107J0013j74137L389K267
14542d54523J50965N1683O7107K9553n1137j8100P320q6085j34392L4117J16552
14531b86940M2622P4704j08715j2338N1339M9214q1366j66961j82772q0357K60660
14520d40910K7638k6551P2567N6060O6563N2481p5801r8238J32086L4503j68763
14509c68365j76647J12352Q1384P9125l7132j39934p4116m49J65938J45400J0511
$$ plain form
14587 -402248 -328873 -189226 -72431 -21274 -42336 -118103 -20274 51068 146557 213875 -3279
14576 -3279 -40647 -108887 -97926 -114888 -25522 867 23142 112420 65753 -110542 -131352 -140522
14564 -140522 -304750 -428946 -417604 -364711 -296709 -303527 -333979 -182285 -113211 -83751 -74812
14553 -74812 -211035 -291472 -306303 -349607 -489416 -455162 -296055 -286042 -460179 -456790 -454523
14542 -454523 -303558 -251875 -184768 -155215 -206352 -224452 -217132 -303217 -437609 -403492 -286940
14531 -286940 -244318 -169614 -278329 -290667 -239328 -190114 -271480 -438441 -621213 -701570 -440910
14520 -440910 -413272 -439823 -367256 -311196 -244633 -192152 -267953 -366191 -234105 -199602 -368365
14509 -368365 -545012 -432660 -351276 -272151 -309283 -449217 -523333 -523782 -357844 -212444 -201933
14498b01933N7366o2889L9498O7561R8600L1172n6609j83595j80903l9322k4770
14487d55824k7702o9673Q6936K53462J47260L1163N1197r6401r5316r878m9652
14476b34428p6594J03350j4405R291R7150M5321N0784r3914J9359n6371j04066
14465b54523J6345m3105j05781p4199M0350K35702J13437L7446o5601j7728n3947
14454a71604p6455j7743P2697J06725m2051j87534m6337R330J15231J33502P9024
14443b5215J8865O7068J4808r7565j377j08637j26733J70500K8756p8158O6531
14432g1157N2020J2719L204n2628O3290P5344l3774p5448p8242o7344o9822J63294
14420g8544J04028l0234r5568N0340R7426r5293n0522J37356J12474M1917p6329
$$ plain form
14498 -201933 -144567 -207456 -167958 -100397 -1797 29375 -27234 -210829 -391732 -431054 -455824
14487 -455824 -483526 -553199 -466263 -212801 -65541 -34378 16819 -79582 -174898 -184776 -234428
14476 -234428 -311022 -207672 -222077 -212786 -115636 -70315 -19531 -113445 -94086 -150457 -254523
14465 -254523 -238178 -281283 -387064 -461263 -420913 -185211 -71774 -34328 -99929 -117657 -171604
14454 -171604 -248059 -265802 -193105 -86380 -128431 -315965 -362302 -352972 -237741 -104239 -25215
14443 -25215 -6350 60718 75526 -22039 -23416 -132053 -258786 -88286 -59530 -137688 -71157
14432 -71157 -19137 -6418 -3214 -55842 7448 82792 49018 -26430 -104672 -172016 -241838 -78544
14420 -78544 25484 -4750 -100318 -49978 47448 -47845 -98367 38989 151463 193380 117051
14409A17051r2844K4440j10941L57O9042o53N9514J20562J57680o4711n6735n2767
14397A69995L4565K5481r5705j54489L6174Q4967M4852j32807O4587j2586j10560
14386d5526P2005K12455J0767j4405j407N8494r8027o2105L0055m5100K5558J26253
14374B69017N9761N3931j85025n448K17896l8096J7606J29868M7099p7474O3632
14363E52767M7393O8628J06798r6270k2201j2955p2153L9717L6756L9952m2240
14352F46192o7074K8936q3483q6396j62115J45987J50929P5508o8254j03169l1187
14341D45874P0864R5642l269M8305p0404n9312k9105j35537k80455p2799J35333
14330A45137J14162N5765N4602J4964k06981o5730J74097J61757n0214p0970j23826
$$ plain form
14409 117051 24207 48647 -62294 -61937 7105 6452 65966 186528 344208 279497 222762 169995
14397 169995 204560 230041 134336 -20153 16021 100988 145840 13033 77620 65034 -45526
14386 -45526 26479 238934 249701 235296 233889 292383 194356 132251 162306 117206 142764 269017
14374 269017 328778 382709 197684 192236 410132 372036 389642 519510 566609 489135 552767
14363 552767 600160 668788 775586 679316 657115 644160 572007 611724 648480 688432 646192
14352 646192 579118 608054 524571 438175 276060 422047 572976 648484 580230 477061 445874
14341 445874 516738 612380 609111 657416 587012 527700 498595 363058 82603 9804 145137
14330 145137 259299 315064 369666 384630 177649 111919 286016 447773 397559 326589 202763
14319B02763m0155J16311k0591K5739p624k6679m6360n3448L6336j72534L3194
14308D6952O0880J34669P9383j04652j21635n6358l3054j7403L8879J09186k9930
14297A06917p4634n9191J4717J13173P7772p4515j10496m5510P4775r858k16179
14286b03029l9537J11420J40505j29015q4477N1951N4030o1823Q6432R137p5889
14275a40295J9080P6228P827r0200p1178p6908L8770J24083q3765l0414n0244
14264b77016k3293P9970J1791L6668l5521K9760J1956M4210q7775M3374J03391
14253f2485J7755J37341j50707J3641j26472l1535m9909l2192J70914q221J48890
14242B7020L2232q8940j13322L287O7149p2634n3796J00305J40613J42122O2278
$$ plain form
14319 202763 162608 278919 258328 284067 276443 249764 203404 149956 186292 13758 46952
14308 46952 107832 242501 321884 217232 95597 39239 6185 -11218 27661 136847 106917
14297 106917 32283 -26908 -12191 100982 178754 104239 -6257 -51767 23008 13150 -203029
14286 -203029 -242566 -131146 9359 -119656 -204133 -152182 -98152 -159975 -73543 -64406 -140295
14275 -140295 -121215 -44987 -37160 -127360 -198538 -275446 -236676 -112593 -196358 -226772 -277016
14264 -277016 -300309 -220339 -208548 -171880 -207401 -177641 -165685 -121475 -209250 -165876 -62485
14253 -62485 -44730 92611 -58096 -44455 -170927 -202462 -252371 -284563 -113649 -121870 27020
14242 27020 59252 -29688 -143010 -139723 -72574 -145208 -199004 -98699 41914 184036 246314
14231B46314j19850j06570j01248j9455R4331Q9044n0014m958j82941p4023J5212
14220b14158M9008J58915O8135o8850r0345j74481l3667n660l9333m6324O1302
14209c35458N1601n3305M0665J58403j00627J31997K02454k2505K1742j16776
14199b1809P3940j29332J5201N45M0912l6068q9191p1008N6888J56496m1986L8449
14187f963J4992P2650l6822j38256j17741J51013O5830p6548P4040j04910L5810
14176f6905M4564K8225j04055J9542J03439j05915j47771Q5546J02177J12815
14166G1662P2617n5558o4867k2676j62334j16694m0245O8292j43986p7858J30470
14155c41177o4436p487N9481J13966J00669n5375j86279M6991O7003O3173r255
$$ plain form
14231 246314 126464 19894 -81354 -100809 -6478 82566 32552 27594 -155347 -229370 -214158
14220 -214158 -165150 -6235 61900 -6950 -97295 -271776 -305443 -311103 -350436 -396760 -335458
14209 -335458 -283857 -337162 -296497 -138094 -238721 -106724 95730 73225 94967 -21809
14199 -21809 52131 -77201 -62000 -61455 -20543 -56611 -145802 -216810 -159922 -3426 -45412 -6963
14187 -6963 8029 80679 43857 -94399 -212140 -61127 4703 -71845 2195 -102715 -66905
14176 -66905 -22341 5884 -98171 -78629 24810 -81105 -228876 -143330 -41153 71662
14166 71662 144279 88721 23854 1178 -161156 -277850 -318095 -249803 -393789 -471647 -341177
14155 -341177 -405613 -413100 -353619 -239653 -138984 -194359 -380638 -333647 -266644 -203471 -212726
14144b12726j24883Q148L6289J29689O8376L1756j4181P6306j14737K455l2542
14133a46050J64868O2428j14880j98352K6306O679r0104O1097P9615r4989J00499
14122a42883L7577k6019O9631j10477m4626R3480J45236J30783N3151r2522o7801
14111D5530M251j01817j75257P811O9763L1366J10235n8917q8710K62492P0471
14100A77218k74092p6076p7688k1529O3743O2922P2746M8278K2040j42208P7990
14089f6656j3652M2616J75043J50953j85023l6223P2110m3810n7153j28048K2291
14078f7552k5737J0192r062k891J35303r3753m2101Q4326O9826j4970l1034K4101
14066C6648L054q0898k6377R8461J66501n7387k50976L3476K44882O9349j00928
$$ plain form
14144 -212726 -337609 -329461 -293172 -163483 -95107 -63351 -77532 -1226 -115963 -113508 -146050
14133 -146050 18818 81246 -33634 -231986 -205680 -199001 -289105 -228008 -148393 -243382 -142883
14122 -142883 -105306 -131325 -61694 -172171 -216797 -123317 21919 152702 205853 113331 45530
14111 45530 49781 -52036 -227293 -219482 -149719 -118353 -8118 -67035 -155745 106747 177218
14100 177218 -96874 -172950 -250638 -272167 -208424 -145502 -72756 -24478 -2438 -144646 -66656
14089 -66656 -80308 -37692 137351 288304 103281 67058 139168 95358 38205 -89843 -67552
14078 -67552 -93289 -83097 -92159 -95050 40253 -53500 -95601 -11275 58551 43581 12547 36648
14066 36648 39702 -41196 -67573 30888 197389 140002 -110974 -77498 167384 236733 135805
14055A35805n2937N200j29126N7751O1834l3320R5102j3957K7961j21537j0219
14044B2557O8388J3934j16878j38662O3097j22266q0675p7899L5116Q5315J87548
14033f0425K26467N0249K0209j61590j04110N117J42005J25362n1246j17465o5391
14022I182K053p7339n0388l5773K8151l5967p5907r5785k6046Q7644K48787O1667
14010D0279j48481j28220k3184P0482j17109o5497J19283J42661j26270p4983
14000c11039K23568K05226k13172m1228R6406j04077n0609K08423m6070j110J6224
13989a7458M9668L266J3837l5789q0466m6830J25374P2516L4518j64611o4082
13978a10057k5482N4266M9260m450q9871m2336O6172J56046k8006n6825q7612
$$ plain form
14055 135805 82868 88068 -41058 16693 78527 45207 140309 126352 154313 32776 22557
14044 22557 90945 104879 -11999 -150661 -87564 -209830 -290505 -368404 -333288 -247973 -60425
14033 -60425 166042 216291 236500 74910 -29200 -24083 117922 243284 192038 74573 9182
14022 9182 11235 -66104 -116492 -152265 -124114 -160081 -235988 -331773 -357819 -270175 -21388 40279
14010 40279 -108202 -236422 -259606 -189124 -306233 -371730 -252447 -109786 -236056 -311039
14000 -311039 -87471 117755 -95417 -136645 -40239 -144316 -194925 13498 -32572 -33682 -17458
13989 -17458 32210 35476 49313 13524 -66942 -113772 11602 84118 118636 -45975 -110057
13978 -110057 -135539 -81273 -32013 -36463 -126334 -168670 -102498 53548 25542 -31283 -118895
13967a18895J17973J5313K2366L7291K6722Q1463N9083j16816q5697l058o0426
13956b4681o1650J00052k5680J5487J36907R9197o0656j82653j96729K9979P7214
13945i3213j9573L9821J34394o704o0593O65M9819j29170J7237j2799L1033R4111
13933D5028n0834N2899j16649J8620P1723K0359J6751q3665R423K3754q2821o4351
13921a39763J80826O1505O7275R743j858j0361n2769N969o5374J3506O7538k5200
13909A11037J4930M5742M6471J6632m2180r8137p983J01511J81854N2213m9627
13898C72463j07365j73507J4698P412k7540P1548P5845r6705L7905K62157n2266
13887C84645J1771j67809p9468m6121M3591M9886j3234J0900J2891j19689L355
$$ plain form
13967 -118895 -922 14391 36757 74048 100770 182233 241316 124500 38803 35745 -24681
13956 -24681 -86331 13721 -11959 3528 140435 239632 178976 -3677 -200406 -170427 -93213
13945 -93213 -112786 -72965 61429 54725 -5868 -5203 44616 -84554 -67317 -80116 -49083 45028
13933 45028 -5806 47093 -69556 -50936 20787 41146 57897 -25768 -16345 7409 -75412 -139763
13921 -139763 41063 102568 169843 179586 177728 167367 114598 120567 55193 68699 136237 111037
13909 111037 125967 171709 218180 234812 192632 94495 86512 188023 369877 422090 372463
13898 372463 265098 91591 106289 113701 86161 157709 233554 136849 174754 436911 384645
13887 384645 396416 228607 149139 103018 146609 196495 183261 194161 207052 87363 90718
13876I0718J21871P852o2323r1536q3757n189J14616R0749J26962l3282q4791
13865A91890o5533l9347M378R1839M1560j17772j2760Q2676J25922O7189J53696
13854E23738Q9299p6861j56490j65562r3636n0697m6779O91J46331J09387L954
13843B83375j4601l573r4351k4837L214N267J09626O2663M9582O6930j01692p3446
13831B68157m9508M9376j1450k3745j5842J913L0805N3828q7325o3679r6741j12660
13819e6871P5673O6005L7254J27003M1109J1489R154m9241j35586Q4711J29773
13808C40473p146m7329j15185r752p4569j03635P9154j6172K4736k5021J17548
13797A63102n6118o3231Q6021m6057j75843O7718m7743M6979J26241l0265K3976
$$ plain form
13876 90718 212589 220441 158118 66582 -17175 -22364 92252 183001 309963 276681 191890
13865 191890 126357 87010 91388 183227 224787 107015 94255 176931 302853 370042 523738
13854 523738 613037 536176 379686 214124 120488 69791 23012 23703 170034 279421 283375
13843 283375 268774 265201 170850 146013 149227 154494 264120 326783 376365 443295 341603 268157
13831 268157 218649 268025 256575 232830 216988 218901 249706 303534 216209 152530 55789 -56871
13819 -56871 18802 84807 122061 249064 290173 301662 310816 261575 125989 210700 340473
13808 340473 333327 285998 170813 161061 86492 -17143 62011 45839 70575 45554 163102
13797 163102 106984 43753 129774 83717 -92126 -24408 -72151 -25172 101069 70804 94780
13786I4780J06075P8685k3993m2310n146l8007j8785O5902R1534J40528N2229
13775E01492j08195j06480j18778r5621J7774M5333J0011K2939P6256k1682N8602
13764B81651J72127k1803j26359j36498M4460N1497n6402J01945J72386O5484
13754E48488R3977M2539l2728J7585J17253j10581J09481K8222j35913O1103M019
13743G43445K19230J33767J61316l473l1511q8818K2600J01102l1705R8337m549
13732A319741k7516q7904J7143K4723L6119j31425k6441o7764r2068j76271L5621
13721H23958N4245p6692r3354j00655m6877J4463R101q9789j09134j00214J08647
13710C93699J64069J67102O9087q1910k48155l3033J35079k9007R2870R7956k22654
$$ plain form
13786 94780 200855 279540 255547 213237 208091 170084 151299 217201 308735 449263 501492
13775 501492 393297 286817 168039 72418 90192 135525 145536 168475 244731 223049 281651
13764 281651 453778 431975 305616 169118 213578 265075 208673 310618 483004 548488
13754 548488 642465 685004 652276 669861 787114 676533 786014 814236 678323 739426 743445
13743 743445 962675 1096442 1257758 1254285 1222774 1133956 1156556 1257658 1225953 1324290 1319741
13732 1319741 1292225 1204321 1221464 1246187 1282306 1150881 1124440 1056676 964608 788337 823958
13721 823958 878203 801511 708157 607502 560625 575088 584189 494400 385266 285052 393699
13710 393699 557768 724870 793957 712047 463892 430859 565938 536931 629801 727757 505103
13699E05103n9050l9032k1065K8238n746J31056j014j03705m5522p2929J42866
13688D59200l4397j30267J94483K41622n6495j4543l2359j07629O1738J38067
13678G19420J92642J33272P3282o5966J12377J70735M5450J47646L02200J80820
13668B011878J47357K31302K52062M3760j03852k7943q4831P2113j5331j24987
13658B401528J9139r031j45870k87152l82255j63256l7400q3100k50591k23730
13648H38282r1637K1221q0855N1758q977j70792R6656K15963m690Q5175j80916
13637G71188j59214r1006n3216P6333L7863m7097K9580j45746K423L5125R3843
13626E50076J25178m1234j91076M3080J7022k01131l4566Q6357M3014k77m8160
$$ plain form
13699 505103 446053 407021 385956 414194 408448 539504 538490 434785 389263 316334 459200
13688 459200 424803 294536 489019 730641 674146 659603 627244 519615 581353 719420
13678 719420 912062 1045334 1118616 1052650 1165027 1335762 1381212 1528858 1831058 2011878
13668 2011878 2159235 2390537 2642599 2686359 2582507 2554564 2469733 2541846 2526515 2401528
13658 2401528 2420667 2411636 2265766 1978614 1596359 1433103 1395703 1312603 1062012 838282
13648 838282 746645 767866 687011 738769 729792 559000 655656 871619 866929 952104 771188
13637 771188 611974 520968 467752 544085 581948 534851 564431 418685 421108 456233 550076
13626 550076 675254 634020 442944 486024 503046 301915 267349 353706 396720 396443 348283
13615C48283j51764O8743K40279j7366k11209n6501P0885J26961k3110n1181j23705
13604B20315J12892K02244R6490j19715R2395l1361j60590r1276K1003R8585P0473
13593E11455M9827J25772J23689k6386n8831j74016n6281m0535j48432o1718M493
13582B49037Q8305P7023q4834N294Q3707r4902M2521R5843J21285M5558j02651
13571E26186j78876k2973J91154R7445r9913J13796J65653k5216q1588J07754
13561G93422O0461l7718j03779J03L8535K5072m6341k26177k1245J32262n7016
13550E57579j36518l2775R0550O673J54618Q3034m6374o1818j49938p6544l873
13539C84614R1577R1335r6083p912J0162J01792P2943J23601q4163k31700M0626
$$ plain form
13615 348283 196519 265262 505541 488175 276966 220465 291350 418311 395201 344020 220315
13604 220315 333207 535451 631941 512226 604621 573260 412670 321394 342397 440982 511455
13593 511455 561282 687054 810743 784357 725526 551510 495229 454694 306262 244544 249037
13582 249037 337342 414365 329531 334825 418532 323630 366151 461994 583279 628837 526186
13571 526186 347310 324337 515491 612936 513023 626819 792472 767256 685668 793422
13561 793422 853883 816165 712386 712489 751024 776096 729755 503578 482333 614595 557579
13550 557579 421061 388286 478836 485509 640127 723161 676787 614969 465031 388487 384614
13539 384614 476191 567526 471443 463531 473693 575485 648428 772029 687866 456166 496792
13528D96792J76666l3502l9566k4506J17271q2879m5355N095j07400J6329L2044
13517E10989J09487o905k5168j48555P1116J99248o4585j37837o4150J43441J7089
13506F04170j06559k3615n8680J4394Q2514O288P9042J10084n4405j15410n6737
13495D81086J9585J4385n4840L5283M3613L5071m5897O4889P6847L1131k1267
13484F79886P2541k4448J67825J04362m9346j24911j23193J69990M6645p0793
13474H48558j18409N4976q69J9036J2047L2278p9054j35855q7552J21816J04943
13463G71915J25266J06712j03830k14272p3548j02320j15880J86991J24275M4400
13453G49709r03r7080O2153J8813M2779O123O3234n4216j52543r0114O6689Q4455
$$ plain form
13528 496792 673458 639956 600390 575884 693155 610276 564921 570016 462616 478945 510989
13517 510989 620476 613571 588403 439848 510964 710212 645627 507790 443640 587081 604170
13506 604170 497611 473996 415316 429710 512224 518512 597554 707638 653233 537823 481086
13495 481086 500671 515056 460216 495499 539112 574183 528286 593175 670022 701153 679886
13484 679886 752427 727979 895804 1000166 950820 825909 702716 872706 919351 848558
13474 848558 730149 785125 784256 803292 815339 847617 768563 632708 545156 666972 771915
13463 771915 897181 1003893 900063 685791 612243 509923 394043 581034 705309 749709
13453 749709 748806 651726 713879 732692 775471 781594 844828 790612 638069 547955 614644 699099
13441F99099O2145K06998o644j02310O0074j8163K9582K3232k7660k08915J6294
13430G33732p1776k0691L3968N3915O2951J12499O034L6360L7625n2695k6334
13419I05588P0809J05124L7904j98695r0741q5900o2964K39665J03035r6153Q3037
13408A010709n8153r0863L6509o6446J03546N3993o0447o4769J57505o7210l6784
13397I17590R4080J52458N8383k7023j56154K963J15735j98334j22268N1466J13234
13386A002130J47304p7130m4085k6241j56324J40892K18286j5558R563j17926
13376A080911n5074l6896M1294Q8954J0778j10514P1537J08889J09693O1324K0677
13365A391573r9000o8470J12942k0552K6766k0743j3659j23214M7932P1227N4912
$$ plain form
13441 699099 761244 968242 961598 859288 919362 901199 930781 954013 926353 717438 733732
13430 733732 661956 641265 675233 729148 792099 904598 910632 946992 984617 931922 905588
13419 905588 976397 1081521 1119425 920730 829989 744089 681125 920790 1023825 927672 1010709
13408 1010709 952556 861693 898202 831756 935302 989295 928848 864079 1021584 954374 917590
13397 917590 1011670 1164128 1222511 1195488 1039334 1042297 1158032 959698 837430 888896 1002130
13386 1002130 1149434 1072304 1028219 1001978 845654 986546 1204832 1189274 1198837 1080911
13376 1080911 1025837 988941 1030235 1119189 1129967 1019453 1090990 1199879 1309572 1370896 1391573
13365 1391573 1292573 1224103 1337045 1316493 1343259 1322516 1308857 1185643 1233575 1304802 1359714
13354A359714J43138P1519J07015J81822n5452k52723q0094R7447Q4470L6666
13344A693522R8595p8942P4773M3031r2592r200o3417j4115P7167k7150r4885
13333A606787r3159M0115L4952M0507q1974j69697k3459j2684Q8419O4085K52849
13322A746741R7106r1866L0328L4980J70925q8703j99402n4605J30171M0378m6463
13311A769590k7405J55604K2985k17648r9713j5535O4294J94805j9397O2829J11893
13300B002302R3227j5490q8743o6703k8866o1472J6125l7203r9773M1207l4315
13289A720296M553m0008P0937j0338j48640o5354K4067J96136J09666K8687n1974
13278A838028o9558k0628k7325j6718Q061K2177Q1315Q4659P9624k5792M9677
$$ plain form
13354 1359714 1502852 1574371 1681386 1863208 1807756 1555033 1474939 1572386 1656856 1693522
13344 1693522 1792117 1713175 1787948 1830979 1738387 1729187 1665770 1651655 1728822 1701672 1606787
13333 1606787 1513628 1553743 1588695 1629202 1547228 1377531 1354072 1341388 1429807 1493892 1746741
13322 1746741 1843847 1751981 1782309 1817289 1988214 1899511 1700109 1645504 1775675 1816053 1769590
13311 1769590 1742185 1897789 1920774 1703126 1603413 1587878 1652172 1846977 1827580 1890409 2002302
13300 2002302 2095529 2080039 1991296 1924593 1895727 1834255 1850380 1813177 1713404 1754611 1720296
13289 1720296 1724849 1684841 1755778 1745440 1596800 1531446 1555513 1751649 1861315 1890002 1838028
13278 1838028 1768470 1747842 1720517 1703799 1711860 1734037 1815352 1900011 1979635 1953843 2003520
13267B003520j85290Q0641J13748J2131P0323m6793K510k3205j20570j28370o3930
13256A714715p8301J8841K11847J26415R1921J6536n3526n3166j45756P972L4309
13245A891807k7654j32326j29004j17673n2239K0673J03443J85073J05568k1858
13235A825810n0653L9484J9192r4548q6768j19616R2925K04268J2493n7279p1262
13224A714046J008O9067K3846n0724m4332J58710o2868j5745O5627K5442J01171
13213A985248o6347P7010J55285N9751j09770r1130m2113J5492o9350J76232M4706
13202B135014j40949q1261J64107p080j4117m6371k3561m5002L3745K25334J76920
13191B376779j7287k1249j02645j07856j27788P4771N4485M9539R6555J88880
$$ plain form
13267 2003520 1818230 1898871 2012619 2024750 2095073 2048280 2050790 2027585 1907015 1778645 1714715
13256 1714715 1636414 1655255 1867102 1993517 2085438 2101974 2048448 1995282 1849526 1857498 1891807
13245 1891807 1864153 1731827 1602823 1485150 1432911 1453584 1557027 1742100 1847668 1825810
13235 1825810 1775157 1814641 1833833 1739285 1652517 1532901 1625826 1830094 1842587 1785308 1714046
13224 1714046 1715054 1784121 1807967 1757243 1712911 1871621 1808753 1793008 1858635 1884077 1985248
13213 1985248 1918901 1995911 2151196 2210947 2101177 2010047 1967934 1983426 1914076 2090308 2135014
13202 2135014 1994065 1912804 2076911 2069831 2055714 2009343 1985782 1940780 1974525 2199859 2376779
13191 2376779 2359492 2338243 2235598 2127742 1999954 2074725 2129210 2178749 2275304 2464184
13181B464184m0774l2546j84405P9478O2061j2971O0143O5971M5555K5862J12804
13170B645362R3877L5422L1779M6170N8960R1505L091O508K7912L0481R146o6083
13158C014130J10826J58852N9722J1572p9263p2774J7519r0518J09978J98579
13148C438623J21573J53430p3843l2143l4536J22135L3161J40528Q2897q112P9342
13137D023055P1161o349r9241J06526O432N9130O241M8620M1625o6442Q3106P4370
13125D348234l8960M9053J56423L2304J28622O2909J03686J59892J34674J2581
13115E149418q6488m3865K39006J67272J08647m4951J31962J09531K53976K30943
13105F215451J63464J63495L08941K33230K37191J73637J83743K35905L65559
$$ plain form
13181 2464184 2423410 2390864 2206459 2285937 2347998 2335027 2395170 2461141 2506696 2532558 2645362
13170 2645362 2739239 2774661 2806440 2852610 2911570 3003075 3006166 3012674 3040586 3071067 3080213 3014130
13158 3014130 3124956 3283808 3343530 3355102 3275839 3203065 3220584 3130066 3240044 3438623
13148 3438623 3560196 3713626 3639783 3607640 3573104 3695239 3728400 3868928 3951825 3943713 4023055
13137 4023055 4094216 4087867 3988626 4095152 4101584 4160714 4166955 4215575 4257200 4190758 4273864 4348234
13125 4348234 4309274 4358327 4514750 4547054 4675676 4738585 4842271 5002163 5136837 5149418
13115 5149418 5062930 5019065 5258071 5425343 5533990 5489039 5621001 5730532 5984508 6215451
13105 6215451 6378915 6542410 6851351 7084581 7321772 7495409 7679152 7915057 8280616
13096H280616K87803L11510L58520L88989M27662M03902M83876N71223M73077
13087A1987178L71535M71627N15224O65136O34943M98971M01482M10398L43952
13078A6300446M11492L11834K84878K06050J70254K89294J27995N6251J3460o7197
13068A8104757m4942K01356K54333J42446J68709L6568J64174K08188J6463K04083
13058A9456135N16265M55509L84826M25770M89190M61501N26511N64930N23718
13049B3804355M94352N50411N99768N27789N25308M90268L52150L39901J68810
13040B7853112R7623k09404o1158j34207l10842l12728l66713m88411n66981n26415
13030B4973876l77090m03436l48254m72962n21485m64444m02258k71409l14680
$$ plain form
13096 8280616 8568419 8879929 9238449 9627438 10055100 10459002 10942878 11514101 11987178
13087 11987178 12358713 12830340 13345564 14010700 14645643 15144614 15546096 15956494 16300446
13078 16300446 16711938 17023772 17308650 17514700 17684954 17974248 18102243 18158494 18171954 18104757
13068 18104757 18059815 18261171 18515504 18657950 18826659 18863227 19027401 19235589 19252052 19456135
13058 19456135 19972400 20427909 20812735 21238505 21727695 22189196 22715707 23280637 23804355
13049 23804355 24298707 24849118 25448886 25976675 26501983 26992251 27344401 27684302 27853112
13040 27853112 27950735 27741331 27680173 27545966 27235124 26922396 26555683 26067272 25500291 24973876
13030 24973876 24596786 24193350 23845096 23372134 22850649 22386205 21983947 21712538 21397858
13021B1397858k34909k52558j07009j29371n7773j78277j04195M9171M0430J56938
13011B0580305L8775p2801J68301O3928L9205j46872m8162Q7235r1450k65844
13001B0352620k52128k52854l79468n05723l96958k62608l41629n13163m79864
12992A6968225l67233k82790m78758l94536l70704l32288j07869k04451l00256
12983A4129340l12733k73218j04185p1751R4353j03604Q013O2352J69160Q1162
12973A3678889N8269K4687O7819O4785J61434J33977K74203L76717L42210K14593
12963A5397583K75689N77009M99169N11353O81051O57053O48204P83234Q68142
12954B0898487R83030J241386J407305J564713J732317J909894K060563K188677
$$ plain form
13021 21397858 21162949 20910391 20803382 20674011 20616238 20437961 20333766 20382937 20423367 20580305
13011 20580305 20619080 20546279 20714580 20778508 20817713 20670841 20622679 20709914 20618464 20352620
13001 20352620 20100492 19847638 19468170 18962447 18565489 18302881 17961252 17448089 16968225
12992 16968225 16600992 16318202 15839444 15444908 15074204 14741916 14634047 14429596 14129340
12983 14129340 13816607 13543389 13439204 13367453 13461806 13358202 13366215 13428567 13597727 13678889
12973 13678889 13737158 13761845 13829664 13894449 14055883 14189860 14464063 14840780 15182990 15397583
12963 15397583 15673272 16250281 16749450 17260803 17941854 18598907 19247111 20030345 20898487
12954 20898487 21881517 23122903 24530208 26094921 27827238 29737132 31797695 33986372
12946C3986372K219827K251277K549989K819401K588569K483887K352930K111430
12938E3363682J766366J493502J331147J233220P76322N26051K72202Q1665l22714
12929F0521443n18269m72244m11445n03197m00262k24353j47640l0595M59003
12920E8272441R56266J171779J451120J862079K507570L055992L724262M217182
12912G7218691M924240N463699O196333P012911P632296Q031085Q184633P893220
12904A32557108P614265P234305O452667N510579M266088L034662J736651L24018
12896A68730343r00267k048899l288076m459264n325115o096538o347061o427034
12888A33838089o334277n736694n168286m605736l928008l152992k249770j621049
$$ plain form
12946 33986372 36206199 38457476 41007465 43826866 46415435 48899322 51252252 53363682
12938 53363682 55130048 56623550 57954697 59187917 59964239 60490290 60762492 60844157 60521443
12929 60521443 60003174 59530930 59119485 58616288 58216026 57991673 57844033 57813438 58272441
12920 58272441 59228707 60400486 61851606 63713685 66221255 69277247 73001509 77218691
12912 77218691 82142931 87606630 93802963 100815874 108448170 116479255 124663888 132557108
12904 132557108 140171373 147405678 153858345 159368924 163635012 166669674 168406325 168730343
12896 168730343 167830076 165781177 162493101 158033837 152708722 146612184 140265123 133838089
12888 133838089 127503812 121767118 116598832 111993096 108065088 104912096 102662326 101041277
12880A01041277r49747J23458P27711J411071K319484K996272L600270M538321
12872A15808117N301915N839638O350511O498893O508172O378337N816693M750994
12864A63253270L693206K434083J206017m7858j229242k739839m296256n340527
12856A56932854o379609p232230p813413q283080q307588q124661p666705p117258
12848I6008310o494144n789039m980076m429886l762937l106649k484507j968505
12840F2992567j528034j255671q30956m60617q7703J41158L61178L57760M73186
12831F0162868M62735N31377N76094J77825j31364j74393k52584p07471j205684
12822E9439403j361603j567044j685302k226687k544319k544403k725217k648799
$$ plain form
12880 101041277 100091530 100214988 100942699 102353770 104673254 107669526 111269796 115808117
12872 115808117 121110032 126949670 133300181 139799074 146307246 152685583 158502276 163253270
12864 163253270 166946476 169380559 170586576 170538718 169309476 166569637 162273381 156932854
12856 156932854 150553245 143321015 135507602 127224522 118916934 110792273 103125568 96008310
12848 96008310 89514166 83725127 78745051 74315165 70552228 67445579 64961072 62992567
12840 62992567 61464533 60208862 59377906 58917289 58829586 58970744 59331922 59689682 60162868
12831 60162868 60625603 61156980 61733074 61910899 61779535 61605142 61352558 60645087 59439403
12822 59439403 58077800 56510756 54825454 52598767 50054448 47510045 44784828 42136029
12814D2136029k658734k665684k475499k425569k321980k067201j877369j617861
12806B4026132j341981j394439j161046q53750q40430j055934j024358j003167
12798A5351027p94480q28018n91398m74422m92921m71888m29299m16027l96425
12789A0456149k77695l43574n05721n44863l36669k64845j00003j49064k54217
12780G679498j88294l14504k58749k35417k38365k88592j8396k34935k76449j49300
12770E476497j38972j41967o2393q1059j58402k02929o1592j11239j70183j46728
12760D201033j12902j26811o357Q425j97511j54618q6013j64643j17763j55277
12750C087563j5778K6274o2712N1234j29455o9929j27478m1539p7060r5868q6411
$$ plain form
12814 42136029 39477295 36811611 34336112 31910543 29588563 27521362 25643993 24026132
12806 24026132 22684151 21289712 20128666 19274916 18434486 17378552 16354194 15351027
12798 15351027 14556547 13728529 13137131 12662709 12169788 11697900 11268601 10852574 10456149
12789 10456149 10178454 9834880 9329159 8784296 8447627 8182782 8082779 7933715 7679498
12780 7679498 7491204 7176700 6917951 6682534 6444169 6155577 6137181 5902246 5625797 5476497
12770 5476497 5337525 5195558 5133165 5052106 4893704 4690775 4629183 4517944 4347761 4201033
12760 4201033 4088131 3961320 3954963 3963388 3765877 3611259 3525246 3360603 3242840 3087563
12750 3087563 3071785 3098059 3035347 3086581 2957126 2887197 2759719 2718180 2641120 2545252 2458841
12739B458841L158m6345M4857n3276k24044j49223j62556K5514Q2446n7186j27
12728A922059j0800k27921q7452Q0218J65853m5157p3566L9093K2149j52021M392
12717A636847J34776M9732o7026k34106p4484m8145O0197m0016j86640J6320p5912
12706A171543m8787p2893j04988P2407K16079O977j92377O7152j0212N394J83933
12695A294228j99935j14350q7483l5479m8021r930r410r6997j01414J55649o2763
12684F84095k6885o615j04472K3804K02617n4333k01299Q1285o3543l2322r4999
12673D07333L5778O7634J56172j2524o184j3189k7864m2587o4795J18397L8543
12662F56714k9863k6810q5541k3884p8229L2100O3734k4386j89131k09951P7849
$$ plain form
12739 2458841 2461999 2415654 2460511 2407235 2183191 2033968 1871412 1896926 1979372 1922186 1922059
12728 1922059 1911259 1683338 1595886 1676104 1841957 1796800 1723234 1762327 1784476 1632455 1636847
12717 1636847 1771623 1821355 1754329 1520223 1445739 1397594 1457791 1417775 1231135 1247455 1171543
12706 1171543 1122756 1049863 944875 1017282 1233361 1240338 1047961 1115113 1104901 1110295 1294228
12695 1294228 1094293 979943 892460 856981 808960 799030 789620 692623 591209 746858 684095
12684 684095 657210 650595 546123 569927 772544 718211 516912 598197 534654 502332 407333
12673 407333 443111 510745 666917 654393 648209 635020 607156 564569 499774 618171 656714
12662 656714 626851 600041 514500 490616 412387 444487 508221 483835 294704 84753 162602
12651A62602L5084O1998L7686J03826P9620m7955j28546j5140K8308K9690J35791
12640D82964J1598p5568K1859O2901k03160O9029M8726N4131o5249l0354o9082
12629C07795o6381q9271K7872P7347J17933J67611K8563R289p5194j56289q2923
12618B66352J47138K34267m457j44532j35172j53808j01800J21266J41209L2052
12608D02515m0412j65763q9864M8705R9393M4904j03288K5168J91092R8411N4048
12597E64909O6075j71743j88664j8420p297k7801N4398m5518K9760O6674N6619
12586C78992l7658p6151N1774N1348P6354j95471K2147K29075O5116j38573j43969
12575B82984l2112J3723J7696J7139J82428M4905n4712j2222O636j15589L3021
$$ plain form
12651 162602 197686 259684 297370 401196 480816 432861 304315 289175 317483 347173 482964
12640 482964 494562 418994 440853 503754 300594 369623 418349 472480 407231 376877 307795
12629 307795 241414 152143 180015 257362 375295 542906 571469 580758 505564 349275 266352
12618 266352 413490 647757 643300 498768 363596 209788 107988 229254 370463 402515
12608 402515 362103 196340 106476 155181 254574 299478 196190 221358 412450 510861 564909
12597 564909 630984 459241 270577 252157 244860 217059 271457 225939 255699 322373 378992
12586 378992 341334 265183 316957 368305 444659 249188 271335 500410 565526 426953 282984
12575 282984 250872 264595 282291 299430 481858 526763 472051 459829 466465 350876 383897
12564C83897L2538o2258n828l7156K9204J18076Q3296m4872q0345j0080j37565
12553B68907j43335L8756P3883J66502m4118j55031n2633J03939J58058R4734
12543E09662n3243r4543L4555j28878m4038P4101K27238J86063n1680j7200l8661
12532F03376k07664j07138j0582P1433K13187L9844j3192j1320n135o6947j50292
12521C55570j09639N7292J46646N7950m9808r3861j385j1828J00602l6473j81926
12510B33140n0943J92952J44146J7274q5995l6105P9986J07456j4156j86415J54602
12499E55942Q0802q0972p6804q553M0703Q6083o3672j54878O6281K10987m399
12488F51520J7815j8560k07026j6976o9234j25913J414J46921J03450O915q3982
$$ plain form
12564 383897 416435 354177 348349 311193 340397 458473 541769 496897 416552 406472 268907
12553 268907 125572 164328 238211 404713 360595 205564 152931 256870 414928 509662
12543 509662 456419 361876 396431 267553 223515 297616 524854 710917 659237 642037 603376
12532 603376 395712 288574 277992 349425 562612 602456 589264 577944 572809 505862 355570
12521 355570 245931 303223 449869 507819 458011 364150 362765 350937 451539 415066 233140
12510 233140 182197 375149 519295 536569 450574 414469 494455 601911 587755 401340 555942
12499 555942 636744 555772 478968 470415 511118 597201 533529 378651 444932 655919 651520
12488 651520 669335 650775 443749 426773 357539 231626 233040 379961 483411 490326 406344
12477D06344m7345j57063J86753J34021p6529l1070Q1277J1305p9051K36238J87473
12466H52353O20k02811j95024j35992L5491M2561N3486N5125l7112K3854J22783
12455F15334j5197n3613J16249P2486j56267R1805J90906N0690J05736k6595L2400
12444A023934o7060p7889m1010Q539L237R624l7959R2600j28777o8481J67420
12433H84178J39383o4265k08863j7860J66509o2640k02624j07325n7671o2887
12423D05935Q5142P7102L2335P1270k158j54332o2335J20624J40321R52j59318
12412E55538J21838J48603o5334m3759j2621K1785M1776J32518K5777O9180N6381
12401A051682n9579j44444j15591j36522j33916l29211n313Q8195K40509J41781
$$ plain form
12477 406344 358999 201936 388689 522710 446181 415111 496388 507693 428642 664880 852353
12466 852353 852973 650162 455138 319146 354637 397198 450684 505809 468697 492551 615334
12455 615334 600137 546524 662773 735259 578992 670797 861703 912393 1018129 991534 1023934
12444 1023934 956874 878985 837975 846514 849751 859375 821416 914016 785239 716758 884178
12433 884178 1023561 959296 750433 732573 899082 836442 633818 526493 468822 405935
12423 405935 491077 568179 600514 671784 669626 515294 452959 573583 713904 714856 555538
12412 555538 677376 825979 760645 716886 704265 726050 767826 900344 926121 995301 1051682
12401 1051682 992103 847659 732068 595546 461630 132419 127106 215301 455810 597591
12391E97591p725n6302l6633K7416q8569k73926p5350J09475Q9850J64285P1453
12380E21565q789q6910j77849M6798L584N7264K0962j5490R0438J02471R7860
12369F51904j29804k06002j53990M1960k5129k7194Q4708Q5540J0014L1603o5400
12358B98210k9643j15253j05389R479Q9640p4865j2520J37218o3193j82906J6977
12347c2245J89185R8620M8140L397j46342j052k92o6625J86106J05251q5792j84138
12335A14213j10856o1891p3265q842R5216Q0666m908K9034J01070J03113o8732
12324A94818m324m2280o8273j27330m7666L9331m4623O862J80933M8743j43995
12313g804K729N9103Q4294p4840k9547k7336r1538K9891N9298r4063J28046J4054
$$ plain form
12391 597591 589866 533564 496931 524347 435778 161852 86502 195977 285827 450112 521565
12380 521565 512776 425866 248017 294815 298399 355663 376625 361135 451573 554044 651904
12369 651904 522100 316098 162108 204068 178939 151745 236453 321993 332007 363610 298210
12358 298210 268567 153314 47925 57404 147044 72179 59659 196877 133684 -49222 -32245
12347 -32245 156940 255560 303700 307097 160755 159703 159411 92786 278892 384143 298351 114213
12335 114213 3357 -58534 -131799 -140641 -45425 35241 30333 59367 160437 263550 194818
12324 194818 190494 148214 79941 -47389 -95055 -55724 -100347 -93485 87448 136191 -7804
12313 -7804 -5075 54028 138322 63482 33935 6599 -84939 -55048 4250 -89813 38233 52287
12301E2287P104n5666p777O6908r623j55049R6732r6366q6952J17477J35206k3745
12289D0536o9979p8168J21637J22638j11121j83845L0392J05739n007k3879n9787
12278a10844p4654N3054J05672j49011k8173L16790R4813m8054j24342p0574N8980
12267B3657P5148n6579j14589j7290q0299K4083J9695j3990O570J5028r3517m8278
12255b60361K6302J05917R0384j51326N9904J67494k6699m1409o7535k1349k138
12244a20816L0317m9915j10692J6090l45R356Q5183M8009o8842j90174R4235R5608
12232a61986O216J4700J09375p9022j16350j2233L2379R2678J65144K0639r1793
12221b0253R7302k6611j71552j03415Q522K01454j1827l2052P6023O6920J01242
$$ plain form
12301 52287 59391 3725 -4052 62856 53233 -101816 -5084 -101450 -188402 -70925 64281 40536
12289 40536 -29443 -107611 14026 136664 25543 -158302 -127910 -22171 -27178 -51057 -110844
12278 -110844 -185498 -132444 -26772 -175783 -203956 112834 207647 159593 35251 -35323 23657
12267 23657 98805 42226 -72363 -89653 -169952 -145869 -126174 -140164 -133594 -118566 -212083 -260361
12255 -260361 -234059 -128142 -37758 -189084 -129180 38314 11615 -29794 -97329 -118678 -120816
12244 -120816 -90499 -140414 -251106 -235016 -235361 -226005 -140822 -92813 -161655 -351829 -257594 -161986
12232 -161986 -155770 -141070 -31695 -110717 -227067 -239300 -206921 -114243 50901 71540 -20253
12221 -20253 77049 50438 -121114 -224529 -216007 -14553 -26380 -58432 17591 84511 185753
12210A85753R006j37274p2043j22428r2959O6267M0394j9393L6725R140J49702
12199E2890J1969q4121q8608p542K21690Q9312L8168j25241m2032N0660n6045
12188F1100J7408k2583J30659J49021N5321p1134j78715l8482L1863O9398r8795
12177A05061P173j71488j02762Q1782K02556J32995R1713L2994j00789J15644
12167C94879q6551j38322l0920j1088L8904Q945P6187O1846R8010M0209m0716
12156D11383j86327m6550r752J12105j08624j8434j14304p5591J17122L6296j94955
12145g7631J241J68084J38951n5869J12322O848J46190l5j6953j101J22095R3727
12133F37869m3195J4543J02259L8937j9200J18490K65141M63225N51759O45469
$$ plain form
12210 185753 194759 57485 -14558 -136986 -229945 -163678 -123284 -142677 -105952 -96812 52890
12199 52890 64859 -19262 -107870 -115412 106278 195590 233758 108517 66485 117145 61100
12188 61100 78508 55925 186584 335605 390926 319792 141077 102595 134458 203856 105061
12177 105061 112234 -59254 -162016 -80234 122322 255317 347030 380024 279235 394879
12167 394879 308328 170006 139086 127998 166902 175847 252034 313880 411890 452099 411383
12156 411383 225056 178506 168754 280859 172235 153801 39497 -36094 81028 117324 -77631
12145 -77631 -76390 91694 230645 174776 287098 293946 440136 440101 423148 422047 544142 637869
12133 637869 594674 609217 711476 750413 731213 849703 1114844 1578069 2129828 2775297
12123B775297N47143k047j82243j81862j3550P6208L46015K33056J25263M0718
12113C763998l35536n99292n68729m64299m75712j79905n7508o335j8068k7527
12103A031087P2301p7653J6086Q8711m7100K015j81198j59875M3067J20112J69057
12092A076610P0749J19943j6829O2784J72366K14818K56669K51750L55439L55528
12082B919827Q08541J488163K104910J732172L62519k72616k11695j15122J16322
12073H933021N31871M06766M28578J52704n28144j171499j752575j787752j249815
12064C963155q61543n46001k66698k94909j14692j48252n8574J0896j59951P436
12054A530867J4551r6454k2751N9562m7273L0289L2972J62971K17841M1439J18097
$$ plain form
12123 2775297 3322440 3320393 3138150 2956288 2942738 3018946 3364961 3598017 3723280 3763998
12113 3763998 3428462 2829170 2260441 1796142 1320430 1140525 1083017 1076682 1058614 1031087
12103 1031087 1103388 1025735 1041821 1130532 1083432 1085447 904249 744374 787441 907553 1076610
12092 1076610 1147359 1267302 1250473 1313257 1485623 1700441 1957110 2208860 2564299 2919827
12082 2919827 3728368 5216531 7321441 9053613 9416132 9143516 8931821 8816699 8933021
12073 8933021 9464892 9871658 10300236 10452940 9924796 8753297 7000722 5212970 3963155
12064 3963155 3101612 2555611 2288913 1994004 1879312 1731060 1672486 1683382 1523431 1530867
12054 1530867 1545418 1448964 1426213 1485775 1438502 1468791 1501763 1664734 1882575 1924014 2042111
12043B042111J31800J04469J33897J10290L82903P80993J205612K186527J876052
12034H954654P35560j84440l69431n8852J5652K61978N67243M11828J5939m78519
12024I871612r24312j449127j831582j546715r64411n15037k95470k63403j95402
12015A886153R530L1421j47811j29798j41130o1483J8687k3554r6640k32436j8686
12004A094253K48324K2884J5051J41615k5371m7440l5679J3023J84724L2502J83540
11993A827426J90339M95442P02858M29080K00523J37097j5680q1923J137O8214
11983C954513J19442K4563j71921l29388n09479n47950l99973n17701k43889j06964
11973A271253j6514q3229k14068l8992p0814m465K3206j49172j56090L7941M1078
$$ plain form
12043 2042111 2173911 2278380 2412277 2522567 2905470 3686463 4892075 7078602 8954654
12034 8954654 9690214 9505774 9136343 9077491 9093143 9355121 9922364 10334192 10350131 9871612
12024 9871612 8947300 7498173 5666591 4119876 3155465 2640428 2344958 2081555 1886153
12015 1886153 1895683 1927104 1779293 1649495 1508365 1446882 1465569 1442015 1345375 1112939 1094253
12004 1094253 1342577 1365461 1380512 1522127 1496756 1449316 1413637 1426660 1611384 1643886 1827426
11993 1827426 2017765 2513207 3216065 3645145 3845668 3982765 3967085 3885162 3886299 3954513
11983 3954513 4073955 4098518 3926597 3597209 3087730 2539780 2139807 1622106 1378217 1271253
11973 1271253 1254739 1171510 957442 918450 847636 843171 866377 717205 561115 599056 640134
11962F40134M8883K7252n9997k3650k3799J41944J15087j52071o5386K41950N5449
11951I45796j69326r1561o3595N894M3129j23525p066N512m4729j04614M6594
11940D42509J65691K7999r7168L2521k4804j68551j24358P8814K21140J33352
11930F87145P4937J3526J39740N3464j47226k2671K10153Q9455N3506K9032j32735
11919A048326n188J31996n4204J20061n2230m0993j1956r0279j59916J3726l4968
11908H64375j22168r1639J40830Q8703j94945j29627j1027O4127n13P394m725
11897F10785K3525J6378R1251j5737J11044j8574o4618J75007J28754j3368M0134
11886A084581J5582j26834L4556n7692p0661j5900N6673J9178L8311L3070m3953
$$ plain form
11962 640134 689017 716269 656272 632622 608823 750767 865854 713783 648397 890347 945796
11951 945796 776470 684909 621314 627208 670337 546812 539746 545258 500529 395915 442509
11940 442509 608200 636199 539031 571552 546748 378197 253839 332653 553793 687145
11930 687145 762082 775608 915348 968812 821586 798915 1009068 1098523 1152029 1181061 1048326
11919 1048326 1043138 1175134 1120930 1240991 1188761 1147768 1135812 1045533 885617 899343 864375
11908 864375 742207 650568 791398 880101 685156 555529 544502 608629 608116 615510 610785
11897 610785 634310 650688 741939 726202 837246 818672 754054 929061 1057815 1044447 1084581
11886 1084581 1100163 973329 1007885 950193 879532 863632 920305 939483 977794 1010864 966911
11875I66911J52469j28746j39660J3158m8596J73401J05494Q2279P4308n6759
11865A194259M2940p6648J63361J63609l9454q9355j45103P381L4992M6918r475
11854A293425N1112R8088N9608J2223r8594k41795n0642K9041o9941j46830K5778
11843I61473J71535Q4923j62301J2027J19087P0580k2565J12942m9360L6727J20717
11832A455785P120j75152O3018J7954o8178J28802J45924n3491r642N2024J43043
11821A707207k4510n7942j47644j8847J17991O9741m4485r7433K37507O5059q3355
11810A723289r2741o6500m5704M5784M6539q8676J7631l1972p9057j42184n2792
11799A233617J27823L6178L3796N1182N2965L9959J80331j43247n8558K7969K75575
$$ plain form
11875 966911 1119380 990634 850974 864132 815536 988937 1094431 1176710 1251018 1194259
11865 1194259 1237199 1160551 1323912 1487521 1448067 1358712 1213609 1220990 1255982 1302900 1293425
11854 1293425 1344537 1442625 1502233 1514456 1415862 1174067 1123425 1152466 1082525 935695 961473
11843 961473 1133008 1217931 1055630 1067657 1186744 1257324 1234759 1347701 1298341 1335068 1455785
11832 1455785 1462905 1287753 1350771 1368725 1300547 1429349 1575273 1521782 1512140 1564164 1707207
11821 1707207 1682697 1624755 1477111 1458264 1576255 1645996 1601511 1504078 1741585 1806644 1723289
11810 1723289 1630548 1564048 1518344 1564128 1610667 1521991 1539622 1507650 1428593 1286409 1233617
11799 1233617 1361440 1397618 1431414 1482596 1535561 1575520 1755851 1612604 1554046 1582015 1857590
11788A857590J43556m6035j93600j09927j9919N6485J36149L4600M4815K1226
11778A924940l948o1376k0574m6381j47002j35956Q0268K2254j14214j20774J79253
11767A556490K13711J68201m5139l9773k4292L6130j14961j15484O693k4622M6717
11756A663671o267L6048M6201q9443r9216L5349N4064j63766j19946o0362J73623
11745A469956J9083m880R6846J83899N9323q0952j97465p9829J07807P8944N3730
11734A706462o3473j34490O7410j61466m5439p881o5937J32752J85443R7236p5152
11723A635465m98j0217k0139K6926O6772K3827J772O7276J02872K5335j6999o7075
11711A835317j7683n4211k31029j2155k9859M2035J05378p9821r518p607l1498
$$ plain form
11788 1857590 2001146 1955111 1761511 1651584 1631665 1688150 1824299 1858899 1903714 1924940
11778 1924940 1920992 1859616 1839042 1792661 1645659 1509703 1589971 1612225 1498011 1377237 1556490
11767 1556490 1770201 1938402 1893263 1853490 1829198 1865328 1750367 1634883 1641576 1616954 1663671
11756 1663671 1657404 1693452 1739653 1650210 1550994 1586343 1640407 1476641 1356695 1296333 1469956
11745 1469956 1489039 1484159 1581005 1764904 1824227 1743275 1545810 1465981 1573788 1652732 1706462
11734 1706462 1642989 1508499 1575909 1414443 1369004 1361123 1295186 1427938 1613381 1710617 1635465
11723 1635465 1634967 1624750 1604611 1631537 1698309 1722136 1723908 1791184 1894056 1919391 1902392 1835317
11711 1835317 1817634 1763423 1532394 1520239 1490380 1532415 1637793 1557972 1548454 1540847 1509349
11700A509349p7413K3891J1374J20893n6520j56964N8423o5205N410Q3290n6607
11689A399921k6117M6449l7776r5797J98228J55631o114L9117r077P4766J6778
11678A756009k1273m1641k11689r8236J45292L2772O5274O6867n6110j20936p7420
11667A438909j55629j66177R3863J65973q7441O6734m5874n7804K4210R1527j76848
11656A191443J9360P3243O971O6678p8493o0530Q6729J45570r0361q4718J02020
11645A377912M2701m60l425j28096O2235j7939l7204l0589p7972k5312k0104N8191
11633A199938J40262l6265q2420J1661r0048k8249p0915p1057r7078k0490K1578
11622H76917n8780M3642K9145m2313r2813j02535q4697k1243k4095N011P6764
$$ plain form
11700 1509349 1431936 1455827 1467201 1588094 1531574 1374610 1433033 1367828 1373238 1456528 1399921
11689 1399921 1373804 1420253 1382477 1286680 1484908 1640539 1634425 1673542 1664465 1739231 1756009
11678 1756009 1734736 1693095 1481406 1383170 1528462 1561234 1626508 1693375 1637265 1516329 1438909
11667 1438909 1283280 1117103 1210966 1376939 1289498 1356232 1310358 1252554 1276764 1368291 1191443
11656 1191443 1210803 1284046 1291017 1357695 1279202 1218672 1305401 1450971 1360610 1275892 1377912
11645 1377912 1420613 1420153 1416728 1288632 1350867 1332928 1295724 1265135 1187163 1161851 1141747 1199938
11633 1199938 1340200 1303935 1221515 1233176 1143128 1114879 1043964 972907 875829 855339 876917
11622 876917 818137 861779 890924 848611 755798 653263 568566 547323 523228 528239 605003
11611F05003o9769q5000L364P4501J62550M9630O1941j47714k0121J65299k2544
11600G77140m0692n0219J0104P2054k0277k4378p2623r1227L2236k7535l8929
11589E25654p5046K5887J23506q5498k6128R56k3778O8500r7202q1497j38386
11578B16968L8172p3073j8033J03556k4362N9748j30891j12124j05245J67620
11568A22336J58531M7404M750p1703k20847r1575R8875N0210J4379Q7477k7052
11557A72785q8511J79144J97339Q7974j57967j69666k0864k9961m4062l9963j3408
11546G2840O531o4503q2080K0507P4894M3471k7161p5968p0810J64935L46408
11535D09064J42226p8250k7074j06867k04006k57111m3062j0421J97811Q1972
$$ plain form
11611 605003 535234 450234 453598 528099 690649 740279 802220 654506 634385 799684 777140
11600 777140 736448 686229 696333 768387 748110 723732 651109 559882 592118 564583 525654
11589 525654 450608 476495 600001 514503 488375 489331 465553 534053 436851 355354 216968
11578 216968 255140 182067 164034 267590 243228 302976 172085 59961 -45284 122336
11568 122336 280867 328271 333021 261318 40471 -51104 47771 97981 112360 199837 172785
11557 172785 84274 263418 460757 548731 390764 221098 200234 170273 126211 86248 72840
11546 72840 79371 14868 -67212 -46705 28189 71660 44499 -31469 -102279 62656 409064
11535 409064 551290 473040 445966 339099 135093 -122018 -165080 -175501 22310 104282
11525A04282j5970m9987J9335r6961l3532O4749o0538Q745N4314o369k9856l497
11513d5285N1321J34539o5832o6792m3620J1911J42786p5843K3842P6571m6665
11502I6933n3531K4597J49082M0835Q727q1421j12320j00011J36995M2682Q1993
11491B34561j7692n0573j8808p8671l7506J08273K8325K5176J4125Q1962m7582
11480B41590k17013k9645J41770R4427k5919o2537l8810Q0427O2476j9602j24075
11469A03089j09589J6130m8475J27913J16308N2281J1962k6458p3061K4837q7637
11458A07300q6198J28885n3326m0375N2880N7586j594j0351n7442K1651j430K1095
11446A38681K5013r8947l3375K6025K7038n1464j9969q2009N5726M6512m3669
$$ plain form
11525 104282 88312 38325 57660 -39301 -72833 -8084 -68622 -59877 -5563 -11932 -41788 -45285
11513 -45285 6036 140575 74743 7951 -35669 -23758 119028 43185 67027 143598 96933
11502 96933 43402 67999 217081 257916 266643 185222 72902 -27109 109886 152568 234561
11491 234561 216869 166296 147488 68817 31311 139584 167909 193085 207210 289172 241590
11480 241590 24577 -5068 136702 231129 205210 142673 103863 184290 246766 227164 103089
11469 103089 -6500 9630 -38845 89068 205376 257657 269619 243161 170100 194937 107300
11458 107300 21102 149987 96661 56286 109166 166752 165158 154807 97365 119016 117586 138681
11446 138681 163694 64747 31372 57397 84435 32971 13002 -69007 -13281 33231 -10438
11435a0438r8105j45870p5066J80382J27134J8206Q9365N2269M453n1940k1137
11424F9253p2779j49890k6941J1388M9212M3016l9707P5818J87579j7720p7412
11413E1817n1138o8768N0190l8199Q6007m6726p3854L7429j7549L994J37044J68289
11401B38536j28257J34272J37481j15744K5427l5584m3795j37152r263J20823
11391A86744N2708j1797m972k6162j6916k05736p2818r2137j3597O272R4699N0452
11379e3260J46019l5302K5965R5388n9495j27774J11558l7263n5138n6667J05624
11368E9655K9500j64834k2182J11554J67785N4585k04432o827N0399J82382M1182
11357B98767l9615n5645K9945j3992m1427j00840q9479Q1117L3994q3470P9769
$$ plain form
11435 -10438 -108543 -254413 -329479 -149097 -21963 -3757 85608 137877 142330 90390 69253
11424 69253 -3526 -153416 -180357 -168969 -119757 -76741 -116448 -40630 146949 129229 51817
11413 51817 679 -68089 -17899 -56098 29909 -16817 -90671 -53242 -70791 -66797 70247 238536
11401 238536 110279 244551 382032 266288 291715 256131 212336 75184 65921 186744
11391 186744 239452 227655 222683 196521 179605 -26131 -98949 -191086 -204683 -198411 -103712 -53260
11379 -53260 92759 57457 83422 178810 119315 -8459 103099 65836 10698 -45969 59655
11368 59655 89155 -75679 -97861 13693 181478 236063 31631 24804 75203 257585 298767
11357 298767 259152 203507 233452 219460 178033 77193 -12286 68831 102825 19355 99124
11346I9124J01600J28798J7076j35231L2631J5277J8970K3718j1945K9734j35382
11335A84370m0571R0828J20737J10762o3179o9631k01587k1173j38986J16188
11325H7758K07677O8628k04153q1096L689Q0051l8227J9781q3662j36621Q5091
11314H916J19172K8221j5093j3204M7063n3351Q6132Q6038P4536j53237r012j23237
11302H2944j44477R7986j2911l1494L0544M8355Q4014M7417P9039K6417j16652
11291A91182p3905j22737m4772J07314N9182J34718L943L3376n4975l0135Q0637
11280B83828j61348k05678n7180o6075M6047K61087Q9286o2565p9972k2171l1319
11269f060Q0368j23074N6184Q3793J05486J17318o0771k3746N4404j1635j12576
$$ plain form
11346 99124 200724 329522 346598 211367 243998 259275 278245 301963 290018 319752 184370
11335 184370 143799 234627 355364 466126 402947 333316 131729 110556 -28430 87758
11325 87758 295435 364063 159910 78814 82503 162554 124327 144108 60446 -76175 8916
11314 8916 128088 156309 141216 128012 175075 121724 207856 293894 368430 215193 206181 82944
11302 82944 -61533 36453 23542 -7952 22592 70947 154961 202378 281417 307834 191182
11291 191182 117277 -5460 -50232 57082 116264 250982 254925 288301 233326 203191 283828
11280 283828 122480 -83198 -140378 -206453 -160406 100681 189967 127402 47430 25259 -6060
11269 -6060 74308 -48766 7418 91211 196697 314015 253244 229498 283902 272267 159691
11258A59691j26645r8791o954J25291K28255M0378K1958q862l9212l1086P8710
11247C42733j01659o9187l7293j75771K3483J51335J07334j79966j07595K00149
11237A53563J70915r8733l3711R1010n6994l0489k1195q986O8952R59j03790o670
11225A24831K1409O6335R4417J1291K0820M435l0709P6302l147j28281j2872J6646
11213B61477l3247r7801L9576L5342L320J21448N4170O8760J57300m340k02571
11202D03434j46952O1570M9514O6755l5312j77193k10251j7363O0325N0365K78162
11191C83054J21554j55813q1009M104O4989m3267K0465J75192L1812n1507q7463
11180C82111j39004o3227Q8859P1107K3234j14083Q0373Q7361O0239n49j81106
$$ plain form
11258 159691 33046 -65745 -72699 52592 280847 321225 343183 334321 295109 264023 342733
11247 342733 241074 171887 134594 -41177 -17694 133641 240975 61009 -46586 153563
11237 153563 324478 225745 192034 283044 226050 195561 174366 165380 234332 235291 131501 124831
11225 124831 146240 212575 306992 318283 339103 343538 312829 389131 385984 257703 244831 261477
11213 261477 228230 130429 170005 205347 208667 330115 384285 453045 610345 606005 403434
11202 403434 256482 318052 367566 434321 399009 221816 11565 -5798 54527 104892 383054
11191 383054 504608 348795 267786 271890 336879 293612 314077 489269 521081 469574 382111
11180 382111 243107 179880 268739 339846 363080 248997 329370 416731 476970 476421 295315
11169B95315j5874J47438k2374N2407n1630N6976o9649o2473J22882J00115L2864
11158E85997l2472m2960J7533l8236j10040N4857m5039r2575j12161J46376j8102
11147C13178J3937L6543n5205o2117k5152O3304N3858R2011q3973j78193n7887
11136A10304R5856m2499p5761n0935k1022P9627L7685K824R6139M005J62108n2841
11124C45490k1869K6729j0411L1510q1786j0969P8975j24876q769L1013l6006
11113B19031j07779M662j4222J615j20872J7902K4539J48017K6566j50101P7209
11102A26567N1367N3747K6956p1218R610l6396n0815m0244K9342P9443J54232
11091C32591J01144l0258m0135K3800l8044R244J06192n4270j31311j21671Q0357
$$ plain form
11169 295315 279441 426879 404505 456912 405282 462258 392609 330136 453018 553133 585997
11158 585997 553525 510565 528098 489862 379822 434679 389640 297065 184904 331280 313178
11147 313178 327115 363658 308453 246336 221184 284488 338346 430357 346384 168191 110304
11136 110304 206160 163661 87900 36965 15943 95570 133255 136079 232218 236223 398331 345490
11124 345490 323621 350350 339939 371449 289663 278694 357669 232793 224024 255037 219031
11113 219031 111252 115914 101692 103307 -17565 337 24876 172893 199459 49358 126567
11102 126567 177934 231681 258637 187419 197029 160633 109818 69574 98916 178359 332591
11091 332591 433735 403477 363342 387142 349098 358342 464534 410264 278953 157282 237639
11080B37639p8055q9106q6206J34334Q8556J44837M9399n6266O0092k583j00952
11069C01689o5585q7433r720Q7643N2813J79257n9940o9395l3844j9022K4551
11058C01014R4047N4671l4821l0619P8085j6586j19266j66003j29251O9676q9380
11047A1567q1475J77608J46451q4863L3604Q9714O4157J09452R9453k8979n6565
11036D80124P3732J8616Q3675o1333Q1650K26237r350k8352J65973K25320m6462
11025A209830k04689M193J9838j03551L5316J84451J38177q029J01507J01164
11015A478207j29211j54425L74J09411R9909K7040Q2104j014m9355n100j5198
11004A442742r5570k15301j65197Q4322j14244M5825J96333k7311k6749J03093
$$ plain form
11080 237639 159584 70478 -15728 118606 207162 351999 401398 345132 405224 402641 301689
11069 301689 236104 148671 138951 226594 279407 458664 398724 329329 295485 276463 301014
11058 301014 395061 449732 414911 384292 462377 445791 326525 160522 31271 100947 11567
11047 11567 -69908 107700 254151 169288 202892 292606 356763 466215 565668 536689 480124
11036 480124 553856 572472 656147 594814 676464 902701 893351 864999 1030972 1256292 1209830
11025 1209830 1005141 1009334 1029172 925621 960937 1145388 1283565 1275536 1377043 1478207
11015 1478207 1348996 1194571 1194945 1304356 1404265 1431305 1513409 1512395 1463040 1457940 1442742
11004 1442742 1347172 1131871 966674 1050996 936752 982577 1178910 1151599 1124850 1227943
10994A227943P501j25816j28191j0455r5930q4303N5820p8729J3827j87948j9734
10983E73985j00520q9554j8743j08187L1870J39876M337J60469R5170j74505j57972
10972C56226M0469J09929L2742R962K1287N4393j2197j59663j01867j18722j26179
10961A06380K44448k531N0772J03798J3203j48204l1071J88500P3604l00828r0881
10950B07190J11202k5632N732J65135P810J1041R475j24446o4564J52312O9395
10939E24650r8408n1305J60611p9631j17756o5999Q4266J92744k9185n6545J08196
10928E71638k9978j7409r0534m6659j20340n4675k1440L3214L8113J01662P0541
10917D34133J6183n3934l2127n5432k3295J36213K9343k8501M3664j54395p9232
$$ plain form
10994 1227943 1235444 1109628 981437 970982 875052 790749 846569 767840 781667 593719 573985
10983 573985 473465 383911 365168 256981 288851 428727 433064 593533 688703 514198 356226
10972 356226 396695 506624 539366 549328 570615 625008 612811 453148 351281 232559 106380
10961 106380 350828 348297 399069 502867 516070 367866 336795 525295 598899 298071 207190
10950 207190 318392 292760 298492 463627 471437 482478 491953 367507 302943 455255 524650
10939 524650 426242 374937 535548 455917 338161 272162 356428 549172 519987 463442 571638
10928 571638 541660 524251 433717 387058 266718 212043 190603 223817 261930 363592 434133
10917 434133 450316 396382 364255 308823 285528 421741 451084 422583 466247 311852 232620
10906B32620L9011J19928j29488K0708R692j19146M1177l1646R8773j5401M4879
10895C11107N9778J09696O0895k38293m4937K09220L9932j48827p9102j03252
10885A76217k645j11480J35076J24989k7089j07416M264J72939J09819J44006
10875F18680j03652k41245j3476J27679n3889q5386P0106O0405M4955K3525l8509
10864D09193j26134n6371K18176R1997m09k21504p6808J09521P9743J24844R6385
10853F48633j35523J09829J87630O4774k00216J7764N0453j05415o8313K4539
10843E94155j9831N5084J9854M1361J27279J00942k5058j31337j52604m0038J15591
10832F85398L9969l5049J36245M3475j78678n0356L6954p8054o0631J36133N4358
$$ plain form
10906 232620 271631 391559 262071 282779 292471 173325 214502 182856 281629 266228 311107
10895 311107 370885 480581 541476 303183 258246 467466 507398 358571 279469 176217
10885 176217 173572 62092 197168 322157 295068 187652 191916 364855 474674 618680
10875 618680 515028 273783 260307 387986 334097 248711 318817 379222 424177 447702 409193
10864 409193 283059 226688 444864 536861 536452 314948 238140 347661 427404 552248 648633
10853 648633 513110 622939 810569 875343 675127 692891 743344 637929 569616 594155
10843 594155 574324 629408 649262 690623 817902 918844 893786 762449 609845 569807 685398
10832 685398 725367 690318 826563 870038 691360 641004 677958 599904 539273 675406 729764
10821G29764n8484O3210m5989r0033q2213R0476r7425Q3846p1701R3255O1351
10810F76057p0983J5211J52625Q264j54005j0270n6038L2646j19705O9559J35547
10799F78908p2597j6253K3452L0777k8602m4854j8802P041j37122n984M4823j2964
10787D47823P8398l0366j35534P221J61150J48605P6914j72357m8602j6686n218
10776E11348J3937L4576n310J336K2438K10722J46689k50389j58632J26810P2078
10765G25603K03834o844o7156L8408l8489n1844j84783j15530J77112J42846Q0744
10754I03901j4844J21993N7191r9785J6201O164R4859P1364p7977q7041p3373
10743I18653j79711J41678J50053m4894q777J37820L3911L2800p031J29374J1619
$$ plain form
10821 729764 671280 734490 688501 598468 516255 606731 509306 593152 521451 614706 676057
10810 676057 605074 620285 772910 781174 627169 616899 560861 593507 473802 543361 678908
10799 678908 606311 590058 613510 644287 615685 570831 552029 559070 421948 415964 460787 447823
10787 447823 526221 495855 360321 367542 528692 677297 754211 581854 533252 516566 511348
10776 511348 525285 559861 554551 555887 578325 789047 935736 685347 526715 653525 725603
10765 725603 929437 922593 855437 893845 855356 803512 618729 503199 680311 823157 903901
10754 903901 889057 1011050 1068241 968456 984657 990821 1085680 1157044 1079067 992026 918653
10743 918653 738942 880620 1030673 985779 977002 1114822 1148733 1181533 1174502 1303876 1315495
10732A315495q2748L5957O5440K3224Q704j16744j38371J57848P0534O204l1190
10721A314353j2892Q884Q7688N9263M3398l7116J00923J15930n5222n6187J27652
10710A696674j74971p0565K28061r9755q2221Q1800J51617J82155J73509J4923
10700B101227j88554p1811M5203O5038o2704j05111q4280J12447l1722p3135L48
10689A706946J18022l6970o4069J74635J82086j5179j67268m7922J03429J12000
10679B065710J32461R7700l1290J58005R1569O7344j21675K1123l4312j50433
10669B296202L5088K03677J12163o990L3322J71956P9455j4705R2826j6025o3715
10658B923254N367L5227j0249j198J86450M9115O7798J71023M9196j08553J8718
$$ plain form
10732 1315495 1232747 1268704 1334144 1357368 1366072 1249328 1110957 1268805 1339339 1345543 1314353
10721 1314353 1301461 1310345 1398033 1457296 1500694 1463578 1564501 1680431 1625209 1569022 1696674
10710 1696674 1521703 1451138 1679199 1579444 1497223 1579023 1730640 1912795 2086304 2101227
10700 2101227 1912673 1840862 1886065 1951103 1888399 1783288 1699008 1811455 1779733 1706598 1706946
10689 1706946 1824968 1787998 1723929 1898564 2080650 2065471 1898203 1850281 1953710 2065710
10679 2065710 2198171 2295871 2264581 2422586 2514155 2581499 2459824 2480947 2446635 2296202
10669 2296202 2331290 2534967 2647130 2640140 2673462 2845418 2924873 2910168 3002994 2986969 2923254
10658 2923254 2928621 2963848 2953599 2952401 3138851 3187966 3255764 3426787 3475983 3367430 3386148
10647C386148K44235K85330J77979L03501K21370K22954K02608J12585J65476
10638E322186J72564L8744K00331K27320L47194M93955L54589K38021L32132L09642
10628H036678N53957P80183O80472O30040N87843P91332Q18866Q68211J124050
10619A4871632J327047J605989J948949K562661L113222L830065M739405N595081
10611C9594051N732222N403979M549075M028929M101129M454152N140563N901351
10603G8905451P003014Q208425R034213R139753Q061339N727441L364755K506057
10595A31950448K768975L944658N727603P568559R075109R608877R343226P840860
10587A87828315M430078L24503k402857k694364j604436L093K188878L881822
$$ plain form
10647 3386148 3630383 3915713 4093692 4397193 4618563 4841517 5044125 5156710 5322186
10638 5322186 5494750 5533494 5733825 5961145 6308339 6802294 7156883 7394904 7727036 8036678
10628 8036678 8590635 9370818 10051290 10681330 11269173 12060505 12879371 13747582 14871632
10619 14871632 16198679 17804668 19753617 22316278 25429500 29259565 33998970 39594051
10611 39594051 45326273 50730252 55279327 59308256 63409385 67863537 73004100 78905451
10603 78905451 85908465 94116890 103151103 112290856 120352195 126079636 129444391 131950448
10595 131950448 134719423 138664081 144391684 151960243 161035352 170644229 179987455 187828315
10587 187828315 192258393 192582896 190180039 187485675 185881239 185884332 188073210 191955032
10579A91955032L931318K664306J42921l265071p098919j0060027j0793286r253603
10571A58222671o951497m733508k917486j842679j654072k909629n268088p763862
10563A24181850r458607r983057r239521p701399o186267m791864l868798l540356
10555F9411981l707140m409101n250103n962210o059221n741446m758733l693007
10547B9831020l093938k507581j947882j519666j358475j179338j072615q88945
10539A6262580q02972p85793p27285o57886n45593n74754o47116m48234m50844
10530A0622103k68278k63589l84072m29312m24146k97485l42495k50276k40373
10521G722077k16716q4950j64284k32637j64193l45936k72242O575j94254k98829
$$ plain form
10579 191955032 195886350 198550656 198693577 195428506 188329587 178269560 167476274 158222671
10571 158222671 151271174 146537666 143620180 141777501 140123429 137213800 131945712 124181850
10563 124181850 114723243 104740186 95500665 87799266 81612999 76821135 72952337 69411981
10555 69411981 65704841 61295740 56045637 50083427 44024206 38282760 33524027 29831020
10547 29831020 26737082 24229501 22281619 20761953 19403478 18224140 17151525 16262580
10539 16262580 15459608 14673815 13946530 13288644 12743051 12168297 11521181 11072947 10622103
10530 10622103 10353825 10090236 9706164 9276852 8852706 8555221 8212726 7962450 7722077
10521 7722077 7505361 7420411 7256127 7023490 6859297 6513361 6241119 6247694 6053440 5754611
10511E754611k33497k70235j84186j88486j92864j46114j60968j41749j75786
10502D060726k51131k51767p7627J26558o0707l2602n4309k70337k73542j21389
10492B793873m6345m1788j62151j50112j66256r8354m4315r4533m7610l4429q9397
10481A818583K1551O1299n6400j60471j11904j5931M0805j29129k02579j03414
10471A162410n0643n8953O1326k1710m9602j35111L6267k3602N4566j8604j12597
10460H43747k19366Q223Q734K02320J63314r2542j64326j43384j8107j49573l0648
10449D08392J37776J9394r5267m1836o7414o5365j15529j40105L2167J26738O9941
10438B68892L4520K920j34719o4019J23716O6984l1760o8766O725J06694k4900
$$ plain form
10511 5754611 5521114 5250879 5066693 4878207 4685343 4539229 4378261 4236512 4060726
10502 4060726 3809595 3557828 3480201 3606759 3546052 3513450 3459141 3188804 2915262 2793873
10492 2793873 2747528 2705740 2543589 2393477 2227221 2128867 2084552 1990019 1942409 1907980 1818583
10481 1818583 1840134 1901433 1845033 1684562 1572658 1556727 1597532 1468403 1265824 1162410
10471 1162410 1111767 1052814 1114140 1092430 1042828 907717 943984 920382 974948 956344 843747
10460 843747 624381 632604 641338 843658 1006972 914430 750104 606720 588613 439040 408392
10449 408392 546168 565562 470295 428459 361045 295680 180151 40046 72213 198951 268892
10438 268892 303412 306332 171613 107594 231310 298294 266534 197768 204493 311187 286287
10427B86287l8673K44897J08207k5602j11570k46832p7901l3973k6460k956L6073
10416A11497L2333q1292J0644k2908L4034l8352j28878o21P6495J59698K3988
10405A76638q5692j51534J8341J38300P3852n7718o4022J9302O5121j6568n9584
10394E6436L8631o0964m6885q7481L3958m8393p8228o0832J28528q7996j16128
10383c29354l663J27153J5535K0366r7263p5996j33368M8141K5792j26885O7867
10372d61675J63810k5963n2928K37356J76081j39359k04451O6327M1480j76385
10362c75707N4716n380L5619J31558J5580q438O7692k4384k18906O1544Q5042
10351a81064k0017P3581r6949j2406J18962j9291k9353k2728j4424j16039n7261
$$ plain form
10427 286287 247614 492511 600718 575116 463546 216714 138813 104840 78380 75424 111497
10416 111497 143830 62538 73182 50274 84308 45956 -82922 -83543 -7048 152650 176638
10405 176638 90946 -60588 -42247 96053 169905 112187 48165 67467 132588 116020 56436
10394 56436 95067 34103 -12782 -100263 -66305 -114698 -192926 -253758 -125230 -213226 -329354
10383 -329354 -333017 -205864 -190329 -169963 -267226 -343222 -476590 -428449 -402657 -529542 -461675
10372 -461675 -297865 -323828 -376756 -139400 36681 -102678 -307129 -240802 -199322 -375707
10362 -375707 -320991 -326371 -290752 -159194 -143614 -152052 -84360 -108744 -327650 -266106 -181064
10351 -181064 -201081 -127500 -224449 -236855 -117893 -137184 -166537 -189265 -203689 -319728 -376989
10340c76989J25414M1198N299M2905n1604r1822K933q2567j24705N4562k506m3875
10328e01757n899n3320O271O8257J27812o6209Q666j6541O1084M694l1489J87542
10316b10889J13776l7094P9545O7494o5291M5990j76466O224J15884P749j53678
10305b06756j98997n7749n5521j13883j03639j09605R0448L6148M1216l7392N9347
10294f56383J92076K17932J4354m4273M1773r0021k0333o9172j22721k6232K22166
10283c40834K44648m7488O5925j02895j24457p5550J84683L5247o3601L9670J08712
10272g5940J08014R0536M0789k32279j89748n8193o6136J08133J05426p058j30504
10261c06960k2462L7331l5395m8149m4463J01856J20956J0792j97892k21618l9606
$$ plain form
10340 -376989 -251575 -210377 -205078 -162173 -213777 -305599 -302666 -385233 -509938 -455376 -457882 -501757
10328 -501757 -507656 -560976 -554705 -486448 -358636 -424845 -416179 -432720 -371636 -366942 -398431 -210889
10316 -210889 -97113 -134207 -54662 12832 -52459 -6469 -182935 -176711 -60827 -53078 -206756
10305 -206756 -405753 -463502 -519023 -632906 -736545 -846150 -755702 -719554 -678338 -715730 -656383
10294 -656383 -464307 -246375 -232021 -276294 -234521 -324542 -344875 -414047 -536768 -563000 -340834
10283 -340834 -96186 -143674 -77749 -180644 -305101 -380651 -195968 -160721 -224322 -184652 -75940
10272 -75940 32074 122610 163399 -68880 -258628 -316821 -382957 -274824 -169398 -176456 -306960
10261 -306960 -329422 -292091 -327486 -375635 -420098 -318242 -197286 -186494 -384386 -606004 -645610
10250f45610J2546N2312R1312J98749J54816L4648j2718j96536R3279L9998n2231
10239b29435Q224p827K8154j09497R2580P3925m1219j63524j32065M3423J44260
10228b93001l0631L7007J06057M9957p8443M7193j29314J1971j0184o4070K2682
10217c30776P6263J45437L9442n5481j62057j03712K3830J90899K29119m4250
10207H714j43273P6658p1684j64047m2581K6462K660j2351J89565P6383J0622
10196d2872k032K0424J67710O764R1569Q9934j67978m3049O9265Q9629m7691j27419
10184A04254m9392l7453J9326l5996j07806j03260R4021J6918p3200J07380N6224
10173h984m2605O7830M3482L2468p2767K714J16023J74059R7683J22834j7036
$$ plain form
10250 -645610 -633064 -580752 -489440 -290691 -135875 -101227 -113945 -310481 -217202 -177204 -229435
10239 -229435 -221211 -229038 -200884 -310381 -217801 -143876 -185095 -348619 -480684 -437261 -293001
10228 -293001 -323632 -286625 -180568 -130611 -209054 -161861 -291175 -279204 -289388 -353458 -330776
10217 -330776 -254513 -109076 -69634 -125115 -287172 -390884 -367054 -176155 52964 8714
10207 8714 -134559 -57901 -129585 -293632 -336213 -309751 -307091 -319442 -129877 -53494 -42872
10196 -42872 -44904 -24480 143230 149994 241563 331497 163519 120470 189735 279364 231673 104254
10184 104254 54862 17409 36735 739 -107067 -210327 -116306 -99388 -172588 -65208 -8984
10173 -8984 -51589 16241 59723 92191 19424 22138 138161 312220 409903 532737 515701
10162E15701m7936p6110j23540l8052j4108J33024K02743R9094p547J9145N2726
10151G15140p6056j62019l6154r446k0278J23909K35911m9098j60657J29796K069
10140F93117o6503r2179N9380m3424k9881P4681Q844j21836q7450J19624J523
10129E15896j3008n3055j37741j78438l9932J5197J2756m5359k0661q7691L7753
10118E717N866j7094M45J0260l5062J11184j8814q4494l3357J7207r4905j64479
10106b97526k6648J28718J02779o4206k7760P0707j80653m1745j0508l0221k4180
10095d01243J27244J38684O1469n0434p2944Q29m6190n8306l5329j12045k14620
$$ plain form
10162 515701 467765 391655 268115 230063 215955 348979 551722 650816 643269 662414 715140
10151 715140 639084 477065 440911 431465 411187 535096 771007 721909 561252 691048 693117
10140 693117 626614 534435 593815 550391 520510 595191 604035 482199 394749 514373 515896
10129 515896 502888 449833 312092 133654 93722 108919 121675 76316 55655 -32036 5717
10118 5717 11583 -5511 -5066 5194 -29868 81316 62502 -21992 -55349 -38142 -133047 -297526
10106 -297526 -324174 -195456 -92677 -156883 -184643 -113936 -294589 -336334 -346842 -377063 -401243
10095 -401243 -273999 -135315 -73846 -124280 -197224 -196395 -242585 -300891 -336220 -448265 -662885
$$ [...]
##END NTUPLES=NMR SPECTRUM
##END=
