##TITLE=Analysis number 321633
Compound Code cc 56113
Book Reference 483/48/4
Project Code adrs
Chemist Name mattw
##JCAMPDX= 6.0         $$ Bruker NMR JCAMP-DX V2.0
##DATA TYPE= NMR SPECTRUM
##DATA CLASS= NTUPLES
##ORIGIN= Bruker BioSpin GmbH
##OWNER= nmr
$$ XWIN-NMR		Version 3.5
$$ Fri Aug 18 14:18:04 2006 GMT Daylight Time (UT+1h)  MAYBRIDGE\nmr@NMR_250MHZ
##.OBSERVE FREQUENCY= 250.131544655141
##.OBSERVE NUCLEUS= ^1H
##.ACQUISITION MODE= SIMULTANEOUS (DQD)
##.ACQUISITION SCHEME= undefined
##.AVERAGES= 16
##.DIGITISER RES= 18
##SPECTROMETER/DATA SYSTEM= dpx250
##.PULSE SEQUENCE= zg30
##.SOLVENT NAME= CDCl3
##.SHIFT REFERENCE= (INTERNAL, CDCl3, 0, 16.522)
##AUDIT TRAIL= $$ (NUMBER, WHEN, WHO, WHERE, WHAT)
$$ ##TITLE= Audit trail, XWIN-NMR		Version 3.5
$$ ##JCAMPDX= 5.01
$$ ##ORIGIN= Bruker BioSpin GmbH
$$ ##OWNER= nmr
$$ C:\u/data/dgb/nmr/ADRS/1210/pdata/1/auditp.txt
$$ ##AUDIT TRAIL=  $$ (NUMBER, WHEN, WHO, WHERE, WHAT)
(   1,<2006-08-18 14:17:42.83 +100>,<MAYBRIDGE\nmr>,<NMR_250MHZ>,
      <created by zg, POWCHK disabled, PULCHK disabled
       configuration hash MD5:
       E2 DF 36 D8 04 B2 41 60 5A D7 A3 38 5A 4B D0 FE
       data hash MD5: 64K
       90 2E 14 A8 31 9B 83 0D F9 DC 0C 39 3A 57 31 E5>)
(   2,<2006-08-18 14:17:56.47 +100>,<MAYBRIDGE\nmr>,<NMR_250MHZ>,
      <Start of raw data processing
       ef LB = 0.3 FT_mod = 6 PKNL = 1 SI = 32K 
       data hash MD5: 32K
       97 71 03 8C 5A 7D 97 38 1F A4 9D 2B F3 57 30 3D>)
(   3,<2006-08-18 14:17:58.35 +100>,<MAYBRIDGE\nmr>,<NMR_250MHZ>,
      <apk 
       data hash MD5: 32K
       9A 39 C9 16 5F BD 6A BC D0 A5 B0 FB 8D 47 5F 04>)
(   4,<2006-08-18 14:17:59.16 +100>,<MAYBRIDGE\nmr>,<NMR_250MHZ>,
      <abs ABSG = 5 
       data hash MD5: 32K
       E2 46 2B F4 67 A2 16 BE 94 7A 4D 5A 32 B6 D3 9A>)
$$ ##END=
$$ 
$$ hash MD5
$$ 2E BF 31 1B 9E 20 00 44 53 B1 7B 36 1C D1 18 51
##$RELAX= 
##$RELAX= 
##$RELAX= 
##$RELAX= 
##$RELAX= 
##$RELAX= 
##$RELAX= 
$$ Bruker specific parameters
$$ --------------------------
##$DU= <C:\u>
##$EXPNO= 1210
##$NAME= <ADRS>
##$PROCNO= 1
##$TYPE= <nmr>
##$USER= <dgb>
##$AMP= (0..31)
100 100 100 100 100 100 100 100 100 100 100 100 100 100 100 100 100 100 
100 100 100 100 100 100 100 100 100 100 100 100 100 100 
##$AQSEQ= 0
##$AQ_mod= 3
##$AUNM= <au_zg>
##$AUTOPOS= <42 >
##$BF1= 250.13
##$BF2= 250.13
##$BF3= 250.13
##$BF4= 250.13
##$BF5= 500.13
##$BF6= 500.13
##$BF7= 500.13
##$BF8= 500.13
##$BYTORDA= 1
##$CFDGTYP= 0
##$CFRGTYP= 5
##$CHEMSTR= <none>
##$CNST= (0..31)
1 1 145 1 1 1 1 1 1 1 1 1 1 1 1 1 1 1 1 1 1 1 1 1 1 1 1 1 1 1 1 1 
##$CPDPRG= <>
##$CPDPRG1= <>
##$CPDPRG2= <>
##$CPDPRG3= <>
##$CPDPRG4= <mlev>
##$CPDPRG5= <mlev>
##$CPDPRG6= <mlev>
##$CPDPRG7= <mlev>
##$CPDPRG8= <mlev>
##$CPDPRGB= <>
##$CPDPRGT= <>
##$D= (0..31)
0 1 0 0 0 0 0 0 0 0.06 0 0 0 0 0 0 0.0002 0 0 0 0 0 0 0 0 0 0 0 0 0 0 
0 
##$DATE= 1155907061
##$DBL= (0..7)
120 120 120 120 120 120 120 120 
##$DBP= (0..7)
150 150 150 150 150 150 150 150 
##$DBP07= 0
##$DBPNAM0= <>
##$DBPNAM1= <>
$$ [...]
##$SUBNAM7= <"">
##$SUBNAM8= <"">
##$SUBNAM9= <"">
##$SW= 20.6930455092707
##$SWIBOX= (0..15)
0 0 3 0 0 0 0 0 0 0 0 0 0 0 0 0 
##$SW_h= 5175.983436853
##$TD= 65536
##$TD0= 1
##$TE= 296.16
##$TE2= 300
##$TE3= 300
##$TEG= 300
##$TL= (0..7)
0 120 120 120 120 120 120 120 
##$TP= (0..7)
150 150 150 150 150 150 150 150 
##$TP07= 0
##$TPNAME0= <>
##$TPNAME1= <>
##$TPNAME2= <>
##$TPNAME3= <>
##$TPNAME4= <>
##$TPNAME5= <>
##$TPNAME6= <>
##$TPNAME7= <>
##$TPOAL= (0..7)
0.5 0.5 0.5 0.5 0.5 0.5 0.5 0.5 
##$TPOFFS= (0..7)
0 0 0 0 0 0 0 0 
##$TUNHIN= 0
##$TUNHOUT= 0
##$TUNXOUT= 0
##$USERA1= <user>
##$USERA2= <user>
##$USERA3= <user>
##$USERA4= <user>
##$USERA5= <user>
##$V9= 5
##$VALIST= <valist>
##$VCLIST= <CCCCCCCCCCCCCCC>
##$VD= 0
##$VDLIST= <DDDDDDDDDDDDDDD>
##$VPLIST= <PPPPPPPPPPPPPPP>
##$VTLIST= <TTTTTTTTTTTTTTT>
##$WBST= 1024
##$WBSW= 4
##$XGAIN= (0..3)
0 0 0 0 
##$XL= 0
##$YL= 0
##$YMAX_a= 335572
##$YMIN_a= -570427
##$ZGOPTNS= <>
##$ZL1= 120
##$ZL2= 120
##$ZL3= 120
##$ZL4= 120
##$ABSF1= 16.522
##$ABSF2= -4.171173
##$ABSG= 5
##$ABSL= 3
##$ALPHA= 0
##$AQORDER= 0
##$ASSFAC= 0
##$ASSFACI= 0
##$ASSFACX= 0
##$ASSWID= 0
##$AUNMP= <proc_1d>
##$AZFE= 0.1
##$AZFW= 0.1
##$BCFW= 0
##$BC_mod= 0
##$BYTORDP= 0
##$COROFFS= 0
##$CY= 12.5
##$DATMOD= 1
##$DC= 0
##$DFILT= <>
##$DTYPP= 0
##$F1P= 14.0000005364418
##$F2P= -0.99999901652339
##$FCOR= 0.5
##$FTSIZE= 32768
##$FT_mod= 6
##$GAMMA= 0
##$GB= 0
##$INTBC= 1
##$INTSCL= 1
##$ISEN= 128
##$LB= 0.3
##$LEV0= 0
##$LPBIN= 0
##$MAXI= 10000
##$MC2= 0
##$MEAN= 0
##$ME_mod= 0
##$MI= 0
##$NCOEF= 0
##$NC_proc= -5
##$NLEV= 6
##$NOISF1= 0
##$NOISF2= 0
##$NSP= 0
##$NTH_PI= 0
##$NZP= 0
##$OFFSET= 16.522
##$PC= 1
##$PHC0= 144.8753
##$PHC1= 9.872847
##$PH_mod= 1
##$PKNL= yes
##$PPARMOD= 0
##$PSCAL= 4
##$PSIGN= 0
##$REVERSE= no
##$SF= 250.13
##$SI= 32768
##$SIGF1= 0
##$SIGF2= 0
##$SINO= 400
##$SIOLD= 32768
##$SREGLST= <1H.CDCl3>
##$SSB= 0
##$STSI= 32768
##$STSR= 0
##$SW_p= 5175.98343685301
##$SYMM= 0
##$S_DEV= 0
##$TDeff= 65536
##$TDoff= 0
##$TI= <Analysis number 999999
Compound Code 99
Book Reference 9
Project Code 9>
##$TILT= no
##$TM1= 0
##$TM2= 0
##$TOPLEV= 0
##$USERP1= <user>
##$USERP2= <user>
##$USERP3= <user>
##$USERP4= <user>
##$USERP5= <user>
##$WDW= 1
##$XDIM= 32768
##$YMAX_p= 563116974
##$YMIN_p= -255112
$$ End of Bruker specific parameters
$$ ---------------------------------
##NTUPLES= NMR SPECTRUM
##VAR_NAME=  FREQUENCY,     SPECTRUM/REAL,   SPECTRUM/IMAG
##SYMBOL=    X,             R,               I
##VAR_TYPE=  INDEPENDENT,   DEPENDENT,       DEPENDENT
##VAR_FORM=  AFFN,          ASDF,            ASDF
##VAR_DIM=   32768,         32768,           32768
##UNITS=     HZ,            ARBITRARY UNITS, ARBITRARY UNITS
##FACTOR=    0.157963299565203, 1,           1
##FIRST=     4132.6476996994, 0,             0
##LAST=      -1043.33573715361, 0,           0
##MIN=       -1043.33573715361, -255112,     0
##MAX=       4132.6476996994, 563116974,     0
$$ Real data points
##PAGE= N=1
##DATA TABLE= (X++(R..R)), XYDATA
$$ [...]
20315c8904J2635O236k1292j5229p935L3869O2957o69P959k9801m6295j6216J0126
20302d2559L2224M6280Q583j6227m8248j2408J7866p1354p928L8379j0244l2714
20290i8350J7080K4033j8817k4504M8163K4764m5810R600O0491O842j2722j1275
20278b0505k4558j0801q355j2654K9933L4422O0543P5712L0411l080k6537k9521
20266I5010k4354j7508m5043n9144J5434M3089j4763J8483L7611K8276l9904L140
20254D0327K079M192M582r662j6528K4295N616j1600k4252l241o3192L3244L4005
20241A9865j9003L607N8769J385K0547m3656m0437l8383j1895j4362K1301Q716
20229c3546o551p9717K7710N0549L8097k1563k4894M3833J0576J3338O7820K765
$$ plain form
20315 -38904 -26269 -20033 -41325 -56554 -64489 -30620 32337 31668 39627 9826 -36469 -52685 -42559
20302 -42559 -10335 35945 44528 28301 -19947 -32355 -14489 -85843 -93771 -55392 -65636 -98350
20290 -98350 -81270 -57237 -76054 -100558 -52395 -27631 -73441 -63841 -3350 3492 -9230 -20505
20278 -20505 -45063 -55864 -64219 -76873 -46940 -12518 48025 123737 154148 151068 124531 95010
20266 95010 70656 53148 8105 -51039 -35605 7484 -7279 11204 48815 77091 37187 40327
20254 40327 42406 46598 51180 41518 24990 49285 54901 43301 19049 15808 -47384 -14140 19865
20241 19865 862 4469 63238 64623 85170 41514 1077 -37306 -49201 -63563 -42262 -33546
20229 -33546 -40097 -119814 -92104 -41555 -3458 -25021 -49915 -6082 4494 17832 85652 88417
20217H8417n4445k8400K983j8492K8383j5916n1436j3032L5425k2800J6127K4528
20205h658j7701J1678L1671p030K2633J2526m0809m6465K2719K8823K1611j0954
20193B0044O594k0208l8632N377K7998M549j2881k3285J1701j987N8860N6408
20181I4538L8345m2019k6930q536j3454J2277r2l6952J4379K2944r885n1585K1059
20168A4089R823j1782l9305l7340J5460P0387M486J9091j0953k5441j1796q442
20156a1723O0401J8832j3523j1299J1336m7113l3631L9259l7921K9524L8488n2772
20144a0142k9333O3028K5463j0624l8008j0085N7042K7518o6768o8739m3348L5239
20132f8757J8861j1326l8722K3694M1801M9641L0809o3551n9099M5109L1365L1789
$$ plain form
20217 88417 33972 5572 8555 -9937 18446 2530 -48906 -61938 -26513 -49313 -33186 -8658
20205 -8658 -26359 -14681 16990 9960 32593 45119 4310 -42155 -19436 9387 30998 20044
20193 20044 26638 6430 -32202 -26825 1173 5722 -7159 -30444 -18743 -20730 38130 94538
20181 94538 132883 90864 63934 55398 41944 54221 54129 17177 31556 54500 44615 -6970 14089
20168 14089 23912 12130 -27175 -64515 -49055 21332 25818 44909 33956 8515 -3281 -11723
20156 -11723 48678 67510 53987 42688 54024 6911 -26720 12539 -25382 4142 42630 -10142
20144 -10142 -39475 23553 49016 38392 384 -9701 47341 74859 8091 -60648 -103996 -68757
20132 -68757 -49896 -61222 -99944 -76250 -34449 15192 46001 -17550 -76649 -31540 -175 31614
20120C1614j6346l2440k4149M1275L5138l8792j0477o230K8320K9928J9761R536
20108F7138l926k1154M4J2246m7148n7961L1968L1390J8202k0202n325J0594l0107
20095a4241l2582K4646l223j202K6799L1769j5284j9237j4045N3480J0408n3163
20083e875n783L1685R368M998N1323m437l6091n559J9527J7972L265k6012j508
20070E2873l45K479n5382j0369M2232M7154N4429o7965j00884k2408J7115k9499
20058g0570L9312K8755n4402m1868r795Q4615M7874N2373Q402m5900M5976k9172
20046E5600l0943K0597K5653j5789k9931r444K7128O425J614k170l8011o9248
20034e8519K1953K5566L2534k1543k9951O976k0394M0795P3667j571l6317k9072
$$ plain form
20120 31614 15268 -17172 -41321 -46 35092 -3700 -14177 -20407 7913 37841 57602 67138
20108 67138 63212 42058 42102 54348 7200 -50761 -18793 12597 30799 10597 5272 15866 -14241
20095 -14241 -46823 -22177 -25400 -26602 197 31966 16682 -2555 -16600 36880 47288 -5875
20083 -5875 -11658 20027 29395 34393 85716 81279 45188 39629 59156 77128 80393 54381 52873
20070 52873 52528 55007 -375 -10744 31488 78642 133071 65106 -35778 -58186 -41071 -70570
20058 -70570 -31258 -2503 -56905 -98773 -108568 -23953 23921 76294 84696 38796 84772 55600
20046 55600 24657 45254 70907 55118 25187 15743 42871 49296 50910 48740 10729 -58519
20034 -58519 -36566 -11000 21534 -9 -29960 -22984 -43378 -2583 71084 69513 33196 4124
20022D124n221q012j3289M1905L2739M0990M021O661n321l0827j16893j2931N2276
20009i778O1970m267K145j0913M559l591n36L6799k9400k4153N9391m2904j3928
19996B5394Q921O276k610m3809n6866j6377N3737J8782k5518J6750J5679J1963
19984A2322M1006L9J4569Q222j883p1415q3896l8293p991O3069m1807L9153P6960
19971A0055L8231n0433p436m154K144n388J5734K3385j646N3773k278l9716O0501
19958I2772l4258l8204O8239L9837o2095j8597O740l0764L2349L1131q531r893
19946F8726l274p3872k9044R324j9403q357R202J3276P411K9477K5940n6229n818
19933c2641Q3320l8632J2379L4525Q667m074j4303K969k3430L2588M6193J4345
$$ plain form
20022 4124 -1097 -9109 -22398 19507 52246 93236 97257 103918 98597 67770 -49123 -62054 -9778
20009 -9778 52192 47925 50070 39157 43716 40125 39589 76388 46988 22835 82226 39322 25394
19996 25394 34315 40591 37981 -5828 -62694 -79071 -25334 -6552 -32070 -15320 359 12322
19984 12322 53328 53367 67936 76158 74275 2860 -81036 -119329 -127320 -64251 -106058 -66905 10055
19971 10055 48286 -2147 -9583 -13737 -11593 -16981 -1247 22138 20492 74265 71987 32271 92772
19958 92772 58514 20310 88549 128386 66291 47694 54434 23670 56019 87150 78619 68726
19946 68726 65452 -8420 -37464 -28140 -47543 -55900 -46698 -33422 -26011 3466 29406 -26823 -32641
19933 -32641 50679 12047 24426 58951 67618 63544 49241 52210 28780 61368 107561 121906
19921A21906J470k3364J3730J1419n8657k9517n1601j0559N387N2107j301l1914
19909h94J2755q453l2799L2955N8519J8366m4846j4975l6530m6065j8495P4582
19897e880L0878L276M0321N5182k161k8593J8959m5510r745K2177m2770k6887
19885I247j1055L2787L7109p0581o4497L907P3236J4478M961P926n0054J5817
19873C281m0854j4267L8369m3931M438N511O8558N3081N0731K953m979n7633p3392
19860h134J5827m90M1105J4893K8112K720k1068l2436Q270M0949l6003K5766K3398
19847A02909m280j879k28l515o3891o8270L7419K8619q729L2995j2376k4476j4702
19834d04J9454N725O413L7771O061l1897k1271j4785J6760K2078k4572l679Q127
$$ plain form
19921 121906 123376 100012 113742 125161 66504 36987 -14614 -25173 -19786 32321 31020 -894
19909 -894 11861 3408 -29391 3564 62083 80449 35603 20628 -15902 -61967 -80462 -5880
19897 -5880 24998 28274 68595 123777 121616 93023 111982 66472 56727 78904 36134 9247
19885 9247 -1808 30979 68088 -2493 -66990 -63083 10153 24631 29592 37518 -12536 3281
19873 3281 -37573 -51840 -13471 -57402 -52964 -47453 21105 74186 124917 127870 122891 65258 -8134
19860 -8134 7693 7203 48308 63201 91313 94033 72965 40529 48799 89748 53745 79511 102909
19847 102909 98629 96750 96522 93007 29116 -39154 -1735 26884 18155 51150 38774 14298 -404
19834 -404 19050 24775 31188 68959 75020 43123 21852 7067 23827 45905 21333 17654 25781
19821B5781L3048q450k988k2777K8355Q193k4836l3374k5630p9213j7443L245
19809a16089J3494L6819P6889K6536J2908K5489j7457J3621j3341n160k0793j8947
19797A3969r192l6642j9709K3694R570j629j7033l6028l9988L4340N3328P9523
19785E4203L7438k7547j5616J3709M7512K5099p0944j9391m0909j5752L5306N9000
19773H2108o4159K0253L0247J8605m6918r854J6012l4207L0095n4926K8087M9698
19761F5041l3652j263M8130l427j0825l7994k7187l9136J9820L894k5456l07L3183
19748i179J8231j0670O070J152m2692J2188K4955J4259J1200L496j9197k0058
19736a0245j1385j4759L5485j0491k3395Q3947M5066J723j2359n4361M352K0326
$$ plain form
19821 25781 58829 50379 47391 24614 52969 61162 36326 2952 -22678 -101891 -119334 -116089
19809 -116089 -102595 -65776 11113 37649 50557 76046 58589 72210 58869 53709 32916 13969
19797 13969 4777 -31865 -51574 -27880 -18310 -19939 -36972 -73000 -112988 -78648 -25320 54203
19785 54203 91641 64094 48478 62187 109699 134798 63854 44463 3554 -12198 23108 82108
19773 82108 17949 38202 68449 87054 40136 30282 46294 12087 42182 -12744 15343 65041
19761 65041 31389 30126 78256 74829 64004 26010 -1177 -40313 -20493 -16599 -42055 -42362 -9179
19748 -9179 9052 -1618 4452 5604 -37088 -24900 55 14314 25514 29010 9813 -10245
19736 -10245 -21630 -36389 -904 -11395 -34790 49157 94223 95946 83587 29226 33578 53904
19724E3904n4534J8412O4447K853L9719K2846k6943m5815l3234k987o958m1486
19712i776J4280J7684k639P3067l1063k4876j5899M180P312Q117K0889p935J2560
19699F5901j9664j4409q300l2181j7135K5339M8031K8453N4777K7409j7024r3272
19687D7925n4966L2375J1458N744p706L4986k2153l4313M0575l2224l4476K1464
19675H689K5316p4603J4707j1760n903Q3492k4263n0539J1252K6497k8843O2543
19663C6585M6366o330J7183k275k9755k2437K3364L3268J1083l8964J3762r257
19651G2593J7402N4699J1157m2263j4503l269J9057M2605k0317n1948k5220p1606
19639a1613M226q163q192K9610P6949l1084m6039l2451p43J412l855M9645j2313
$$ plain form
19724 53904 -630 17782 82229 85082 124801 147647 120704 74889 41655 38668 31710 -9776
19712 -9776 4504 22188 19549 92616 61553 36677 20778 24958 32270 40387 61276 53341 65901
19699 65901 46237 31828 23528 -8653 -25788 -449 47582 76035 130812 158221 141197 47925
19687 47925 -7041 25334 36792 42536 34830 69816 47663 13350 53925 21701 -12775 8689
19675 8689 34005 -40598 -25891 -37651 -43554 39938 15675 -34864 -23612 2885 -25958 36585
19663 36585 82951 76621 93804 91529 61774 39337 62701 95969 107052 68088 81850 72593
19651 72593 89995 144694 155851 113588 99085 95816 114873 157478 137161 85213 59993 -11613
19639 -11613 -7387 -15550 -23742 5868 82817 51733 5694 -26757 -27500 -26088 -29943 19702 7389
19626G389N0526L6857l3058l6503m2240J5405L7585J2542K3450l2653k1857k7079
19614i636k3136L3358J7800m3732j5127J9645N1273P985R817L5388k8172n1188
19602D275n0226R657N7292n143r3938k4112M4658L0678J66o296K7578N3102M7354
19589I5045j5086k475Q539M8705n8707o0738J6804L9187p813k4105K9167m7064
19577B1459m1865j4961Q937O080P0388J2580n591O568J1292j2554J5218N3309
19565A30860j1345o4859k6899j0660K7870m9782R29m736K3887k06J5113L4342
19553F4514K9380l425j008L305J1905q368m584n164l8838j6735O732j0486P1101
19540I8329K1703j1608n1299k983o850p004N568m030J3399R418M2221M4974P067
$$ plain form
19626 7389 57915 94772 61714 25211 -17029 -1624 35961 48503 71953 39300 17443 -9636
19614 -9636 -32772 586 18386 -25346 -40473 -20828 30445 38430 48247 83635 55463 4275
19602 4275 -45951 -36294 20998 15855 -78083 -102195 -57537 -26859 -26693 -32989 -5411 47691 95045
19589 95045 79959 77484 86023 134728 76021 15283 32087 71274 63461 39356 68523 21459
19577 21459 -20406 -35367 -26430 -20350 50038 62618 57027 63595 74887 62333 77551 130860
19565 130860 119515 54656 27757 17097 44967 -4815 -3886 -8622 15265 15059 30172 64514
19553 64514 93894 90469 89461 92766 104671 96303 91719 86555 47717 30982 37714 27228 98329
19540 98329 120032 108424 57125 54142 47292 40288 45856 41826 55225 64643 106864 151838 158905
19527A58905l5434k5327m6912m2634J8537J7378j6195J4629L6672M182P739n4847
19515C6693j3363o796L1285J5069J1204R478k1097K6424r162l3925L12j882O5448
19502A09688K6372j1737l3077k5572m4707J451k5816n7573L5447M3042N969j3022
19490A0465L047P3443K9999p9140q0704J6382N3240J9786J1912j549k2942K8304
19478F2243m0127k9542L1323k2503n773j5574m2120K4325M2823K2807j699l2614
19466f431m5723M990K8498J6664Q5798p734j8916p320j4319j1455L0064K4491
19454G8607l1153j2192K4050o794j6794k4315O5082N1431k0635l9724k3847M1368
19442H5084K8989P229m9655q0168r234Q7052j212r310L736L7996k1507j2972k378
$$ plain form
19527 158905 123471 98144 51232 8598 27135 44513 28318 42947 79619 83801 91540 36693
19515 36693 23330 16534 47819 62888 74092 83570 62473 88897 79735 45810 46122 44240 109688
19502 109688 136060 124323 91246 65674 20967 22418 -3398 -60971 -25524 17518 23487 10465
19490 10465 13512 86955 116954 37814 -42890 -26508 26732 46518 58430 56881 33939 62243
19478 62243 22116 -7426 23897 1394 -4379 -19953 -62073 -37748 5075 27882 26183 -6431
19466 -6431 -52154 -47164 -18666 -2002 83796 76062 57146 49826 35507 24052 54116 78607
19454 78607 47454 35262 59312 52518 35724 11409 76491 127922 107287 67563 43716 85084
19442 85084 114073 121302 71647 -8521 -17755 69297 68085 58775 62511 100507 79000 66028 63650
19429F3650J0064l515m9502N053o322N4181K1985L8855L250J0993J0839o3463
19417I6068j07302j0396K64m1191P839k402p567j3498L5827O3698M8634N322m018
19404G1278K5630L2824k1429j604l081M8524K7934N375j6585L599k2456J115J4286
19391A65410J0192K9960L7911q4089k5652J141n4163q867L1757j9777K943n589
19379H1177J9114M3184O769l8146k9935L9098j9569k0906K1003k1311j2862M0862
19367A08478J3735K6077J5896k4901n2012K43K6448N991N160L97m5113j2175N8131
19354A26355J6384l1239l5562K1339L83M215k293P73r200n9117k3430Q455K0933
19341C7996M7162K1596l66j9338L0544k065N352l4209J0800J344k7783M66O4278
$$ plain form
19429 63650 73714 70199 20697 25750 19428 73609 95594 134449 137699 148692 159531 96068
19417 96068 -11234 -21630 -21366 -62557 -54718 -57120 -64687 -78185 -42358 21340 69974 75296 71278
19404 71278 96908 129732 108303 106699 103618 152142 180076 185451 168866 172465 150009 151124 165410
19391 165410 175602 205562 243473 159384 133732 134873 80710 71843 103600 83823 86766 81177
19379 81177 100291 143475 150244 112098 82163 121261 101692 80786 101789 80478 67616 108478
19367 108478 122213 148290 164186 139285 87273 87516 113964 119955 125115 125512 80399 68224 126355
19354 126355 142739 111500 75938 97277 97660 101875 99582 100355 91155 32038 8608 17063 37996
19341 37996 85158 106754 106388 87050 117594 115529 120881 86672 97472 98816 71033 71499 135777
19328A35777L3020k61j3319O028J0994P545m8530k645p5074L880p712P1247J2041
19315A32991j7234l0149O935P101K0213J792M7472K0374K604m1077l0086r235
19303A11701j5863K4007K9134l2456l5717Q144J8357q770L4607o441j3072k2970
19291I0661p7652o8500N2286O930m0987K4867J9118L6302R336P5453K745M961
19279A35520J0649l2090j1279K3293n2161j4272O7234M2248o3571k3557o587k932
19267G2495j4713k1687K2704K7042K1552J1612o772j7361l4732J7585M6697M0571
19255A64993j0874m5016Q681M4120Q0293r160n2753n6771K5837L9872j3040o5371
19243A10811k6369k4888n3905M0274N020N2687K6589P614M2285R14j0664l7229
$$ plain form
19328 135777 168797 168536 155217 161245 172239 179784 131254 128609 53535 57415 49703 120950 132991
19315 132991 115757 85608 92543 99644 119857 121649 169121 189495 192099 151022 120936 111701
19303 111701 95838 119845 148979 116523 80806 88950 107307 98537 133144 126703 113631 90661
19291 90661 13009 -55491 -3205 3725 -37262 -12395 6723 43025 52361 127814 130559 135520
19279 135520 146169 114079 102800 126093 73932 59660 126894 169142 105571 82014 75427 72495
19267 72495 57782 36095 58799 85841 107393 119005 112233 94872 60140 77725 124422 164993
19255 164993 154119 109103 117784 161904 242197 233037 180284 123513 149350 189222 176182 110811
19243 110811 84442 59554 5649 45923 50943 103630 130219 137833 180118 181032 170368 133139
19231A33139l3329q85P0799k0569n4555k1970k2273K2698O4249l92m043k2887
19219A09982k204J2762M2086O2994n5960o3861N05J2087M0642m3120m8756k1294
19207D5863Q063J6584K5784M532j4290J11086O3565J3786o3242r4119k3291L3121
19195A27442L5508L4586j9876o0020k4719l355J6829Q45L4817p381m7850M021
19183I0847j7266K85O4796M4226m9097l6447l6740L3727O5015K8634N473l6425
19171A57028k8065l0542K9288r426l0937n704K3681K3075J6580N5392O100K3307
19159B29777m771n5l4629k0307Q783J0888J043J1868K306j0583K1606L2209M4601
19146B92736L2982O2744J7183N329m9430M5214N1483J19415N7563O9969J12943
$$ plain form
19231 133139 99810 98925 169724 149155 94600 72630 50357 73055 137304 136912 132869 109982
19219 109982 107778 120540 162626 225620 169660 105799 106304 118391 159033 115913 67157 45863
19207 45863 53926 70510 96294 100826 86536 197622 261187 274973 211731 117612 94321 127442
19195 127442 162950 197536 177660 117640 92921 89566 106395 107240 142057 134676 86826 90847
19183 90847 73581 73866 138662 182888 133791 97344 60604 94331 159346 187980 193453 157028
19171 157028 128963 98421 127709 118283 87346 81642 105323 128398 144978 200370 206470 229777
19159 229777 225006 224951 190322 170015 178798 189686 190729 202597 204903 194320 215926 248135 292736
19146 292736 325718 388462 405645 410974 361544 406758 458241 577656 635219 705188 818131
19135H18131J19568K2776N2304J6153K2589k1133l1244j3990J0720L0537K0563
19124A046974l9901k4263L122L8324N5860k0988M687q7659j42809q5844k5009
19113G22494l9473m4183n9296n9206K420l7200o1437o3750K1572R4218j8997n0856
19101D06306j2503m1167p4558L3680N85l1426j4270q327j8370K107q255j474l4030
19088A98298n738l0346O5709J0575O750M6311M9802K379j3965r7206k3622N807
19076B14754n2904m1388K3439L9154J7213K8356p923m07k9727k569j9810K884
19064A71072m340k6276Q290L9010k7513j7540M0712P775J8067l6221k6597j380
19052A45059K5372M0038j5211m9122K713J0455K3406L9587J6160n7417P201M4627
$$ plain form
19135 818131 937699 960475 1012779 1028932 1051521 1030388 999144 985154 995874 1026411 1046974
19124 1046974 1007073 982810 985932 1024256 1080116 1059128 1063815 976156 833347 747503 722494
19113 722494 683021 638838 579542 520336 522756 485556 424119 360369 381941 476159 457162 406306
19101 406306 393803 352636 278078 311758 312343 280917 266647 258320 239950 242057 233802 232328 198298
19088 198298 192560 162214 227923 238498 245248 291559 341361 343740 329775 232569 208947 214754
19076 214754 161850 120462 143901 183055 200268 228624 220701 220294 190567 187998 168188 171072
19064 171072 166732 140456 148746 187756 160243 142703 183415 191190 209257 173036 146439 145059
19052 145059 170431 210469 195258 146136 148849 159304 182710 222297 238457 181040 188241 232868
19040B32868m051m805J9336Q642J5863q937o8422j1874k8792K9478J1980m672
19028A86614L1084l3171m863K8548O127l1575L150K1995n8656j2320l0368p59
19016A05806Q5775m6038k3784J5631K4198L0578l7411j6002M745J3273j2894N8044
19004B01921K9323j9719L023j3251P424j081k3092l7718j7758Q099J5656L017
18992A55844J821j734J9467J0554m1715J2320L2561O85j5705L4875K9850j4523
18980B24300p8493m1681K436N3981M7759j9978k7971m456L6518J460O727N8731
18968B59333K1412K7017j3332k5654J515k9622J4254K6904l3516l6348m2328L5009
18956B04644L4093m6692o1987K2834L6065l0014O096j0273K7911K5554l5669J301
$$ plain form
19040 232868 228817 224012 243348 251990 267853 258916 190494 178620 149828 179306 191286 186614
19028 186614 217698 184527 179664 208212 214339 182764 185914 207909 149253 136933 106565 105806
19016 105806 191581 145543 121759 137390 161588 192166 154755 138753 143498 156771 143877 201921
19004 201921 231244 211525 214548 201297 208721 207640 184548 146830 129072 137171 152827 155844
18992 155844 157665 155931 175398 185952 144237 156557 189118 189803 174098 208973 238823 224300
18980 224300 145807 104126 106562 160543 208302 188324 160353 155897 192415 193875 200602 259333
18968 259333 280745 307762 294430 268776 270291 240669 254923 281827 248311 211963 169635 204644
18956 204644 238737 192045 130058 152892 188957 158943 165039 154766 182677 208231 172562 173863
18944A73863J08869M7860k750m6389l0799p186N138p5966k1784M9283l1136j8261
18932A50742K0383J0410M4648J4316r013n4428l2704J2292L4879P2959K6135M6934
18920C37553N6652m8668l6605p0787L2186N476j0017k66j5360M041j7266M0121
18908B77060Q8089k2105k2219K6444K9710M679l5209J754P7608K6318R7930J39439
18896F89498J17641R1667L1130M7932P7031J7545N157n4302o5756k1402O232m2574
18884H99799k5949J1634J18896J53234O6929O7476j6151k010j3263m1390j07375
18873A111830j47188j48941j00423q391j2434l8841o0458m947K4706q7663p0396
18862D56854l088M9470k3561N877O888K6340p0678K43k2489m5561L236m4219r155
$$ plain form
18944 173863 282732 330592 327842 281453 250654 243468 248606 172640 150856 200139 169003 150742
18932 150742 171125 181535 226183 240499 231486 177058 144354 156646 191525 264484 290619 337553
18920 337553 394205 345537 308932 238145 270331 275807 265790 265524 250164 254205 236939 277060
18908 277060 365149 343044 320825 347269 376979 381658 346449 348203 425811 452129 550059 689498
18896 689498 807139 898806 929936 977868 1054899 1072444 1077601 1023299 957543 936141 942373 899799
18884 899799 873850 885484 1004380 1157614 1224543 1292019 1275868 1273858 1260595 1219205 1111830
18873 1111830 964642 815701 715278 706887 694453 655612 595154 590207 614913 527250 456854
18862 456854 453766 503236 479675 485552 492440 518780 448102 448345 425856 380295 383531 339312 330157
18849C30157o945j3027P5632L9051k0514o3895k7559K7106K0611M2134m6831r4935
18837B60985J1369L9617M6836r08J1475n6303O780L7507L885M3998K0568k1428
18825D04381o2870l8028m607p293J0611K9770M3711J6443l5648K0359L2455J5920
18813D25204J464n302o743k8679p610K1282L0162P8721K966k1145N7195j0763
18801E36752l0600k2742K6307L7366j6835l0096L5542L4737m3239j3753m6172
18790D67267k0422p717o694K3886k310K901M882m143j1856J7276J5096j4241K7909
18777D91834L7594n7522l2957L5484K2107L2635L2373O1775l8972j8838Q524N4456
18765F28493Q5173J4439Q391k1124m5221n8745n4819k609M5172m967m7916j1665
$$ plain form
18849 330157 323212 310185 385817 424868 404354 340459 312900 340006 360617 402751 355920 260985
18837 260985 272354 311971 358807 357899 369374 313071 319851 357358 361243 405241 425809 404381
18825 404381 341511 303483 298876 291583 302194 331964 375675 392118 356470 376829 409284 425204
18813 425204 426668 421366 414623 385944 378334 399616 429778 508499 511465 490320 547515 536752
18801 536752 506152 483410 509717 547083 530248 500152 535694 570431 527192 513439 467267
18790 467267 446845 439128 432434 456320 454010 456911 461793 457650 445794 463070 478166 463925 491834
18777 491834 529428 471906 438949 474433 496540 529175 561548 623323 584351 565513 574037 628493
18765 628493 713666 728105 736496 715372 670151 611406 556587 553978 599150 594183 546267 534602
18753E34602M7986m7271L1883p967n8657k8487K0641k95q113m4532j64Q568N7246
18740E05440P6324L3422n9084l4061L0592M702L1753j3144k9872P3400Q6338Q5674
18728G91484m3913n8308q80j6940M3357N8825k0902l4708l1992L8938N7117K4824
18716H06902J996l872L0664k811M7042M3926N0622O6791l3789k7039l9857q7807
18704H52768q7078m246K3732k9744l2452r773o168L137L229r428l0460j0470l1799
18691F31248k9824K8100Q8767J765J9815M6024K8398L1548K5393j697J6500M8718
18679I34755j341k1125l5952J10145M0784r881k5037k5224J9774P2084J43421
18668A202403O4842J25978J50464R1464O7476R6346J13253N5238k9435j20583
$$ plain form
18753 534602 582588 535317 567200 559233 500576 472089 492730 492435 484322 439790 439626 448194 505440
18740 505440 581764 615186 556102 522041 552633 557335 589088 575944 546072 619472 705810 791484
18728 791484 747571 689263 688383 671443 714800 773625 752723 718015 686023 724961 782078 806902
18716 806902 808898 805026 835690 832879 879921 923847 974469 1041260 1007471 980432 940575 852768
18704 852768 765690 761444 785176 755432 722980 713207 707039 710176 713405 703977 673517 663047 631248
18691 631248 601424 629524 718291 720056 739871 785895 814293 845841 871234 869537 886037 934755
18679 934755 933414 912289 876337 986482 1027266 1017385 992348 967124 986898 1058982 1202403
18668 1202403 1267245 1393223 1543687 1635151 1702627 1798973 1912226 1967464 1938029 1817446
18658A817446j06936o3122l2156k3907m5713Q438J1873k6739l6294q789J3167
18647A507268l6861N09K2210l9281N9130J5299k3078n2927p5181L1398N9838L933
18635A472257O3097Q207j8729M5176j2028N2980l517O470P4671Q4742N4455n4103
18623A773678n3689L0755Q1320Q0103K4574Q7519J07985Q0458O2676K9266r21
18612B303724M8033N3778K4926K41P9515J9078N8182K5356L4824K5278M7848R2760
18600B813543P0167M5483N4852J07387J56643J85771J24425J56529J79421J99276
18590D093497K18159K01799J67366J75410K01480J68597K13102K19630K34297
18581E893337K93813L43892L16197K97461L97078L73841M77987N76341O12467
$$ plain form
18658 1817446 1710510 1647388 1615232 1591325 1545612 1554050 1565923 1539184 1502890 1494101 1507268
18647 1507268 1470407 1470916 1493126 1453845 1512975 1528274 1505196 1452269 1377088 1408486 1468324 1472257
18635 1472257 1535354 1543561 1524832 1570008 1557980 1610960 1607443 1613913 1688584 1773326 1827781 1773678
18623 1773678 1719989 1750744 1832064 1912167 1936741 2024260 2132245 2212703 2275379 2304645 2303724
18612 2303724 2351757 2405535 2430461 2430702 2510217 2529295 2587477 2612833 2647657 2672935 2720783 2813543
18600 2813543 2883710 2929193 2984045 3091432 3248075 3433846 3558271 3714800 3894221 4093497
18590 4093497 4311656 4513455 4680821 4856231 5057711 5226308 5439410 5659040 5893337
18581 5893337 6187150 6531042 6847239 7144700 7541778 7915619 8393606 8969947 9582414
18572I582414O70232P11444P98276R40285J096465J323354J527323J727719K133425
18563B0510937K635262L267311M133390N492029P192463R537452J2509753J5376843
18555H0655440J6821948J6019567J3699267J0675218P633873M953211K081624
18548A52540148j187990l872977l486141K30236M755081P484030P369246N452101
18540A69283734K805507M1561k648779n850551r912395j3797426j5178676j3914707
18532A10828268j1825159j0011922q726921p633073o649769n772111m902195m224043
18524E1083075l689427l265814k853168k531674k299398k129786j901536j697951
18516C0714321j518097j403430j319511j174954j027140r45033r43203q65962
$$ plain form
18572 9582414 10252646 10964090 11762366 12702651 13799116 15122470 16649793 18377512 20510937
18563 20510937 23146199 26413510 30546900 36038929 43231392 52768844 65278597 80655440
18555 80655440 97477388 113496955 127196222 137871440 145505313 150458524 152540148
18548 152540148 151352158 147479181 143993040 144223276 148978357 156462387 163831633 169283734
18540 169283734 172089241 172130802 169482023 163631472 153719077 139921651 124742975 110828268
18532 110828268 99003109 88991187 80264266 72631193 65981424 60209313 55307118 51083075
18524 51083075 47393648 44127834 41274666 38742992 36443594 34313808 32412272 30714321
18516 30714321 29196224 27792794 26473283 25298329 24271189 23326156 22382953 21516991
18508B1516991q22522p52996p27316p35030p47753o68091o73199o14487n84519
18499A5191078n37140m93995m85890n07834m82276m41601m21323m34068l67788
18490A1019163l56906l78925l17992l15495l04799k52587k83853k81822k41085
18481H285699k33840k13833k45506k17838k13117j71599j33274j10264j36690
18472F609738k71302j89364j95918j50854j50177j63810j13376r5310j12329j23707
18462E043591j32487j00126p9681r4368j29335q5135n6382j29439r8111n0400
18452D088127k4070m5163m3780L489j07024l7084Q833J859l7803k9834m0878K8625
18440C765297N6998p1341m0744M2736m4512m1389n4013k6900k0819q0116j37925
$$ plain form
18508 21516991 20694469 19941473 19214157 18479127 17731374 17063283 16390084 15775597 15191078
18499 15191078 14653938 14159943 13674053 13166219 12683943 12242342 11821019 11386951 11019163
18490 11019163 10662257 10283332 9965340 9649845 9345046 9092459 8808606 8526784 8285699
18481 8285699 8051859 7838026 7592520 7374682 7161565 6989966 6856692 6746428 6609738
18472 6609738 6338436 6149072 5953154 5802300 5652123 5488313 5374937 5279627 5167298 5043591
18462 5043591 4911104 4810978 4731297 4636929 4507594 4422459 4366077 4236638 4138527 4088127
18452 4088127 4064057 4018894 3975114 3978603 3871579 3834495 3843328 3845187 3807384 3777550 3736672 3765297
18440 3765297 3822295 3750954 3710210 3752946 3708434 3667045 3613032 3586132 3565313 3485197 3347272
18429C347272j31437l9761j8919l2019r1227r3495r6929l5821l7111q9388m6639
18418B634526l3806q2201n3907p0968j57233j37947j11500k8913n2630m5870m4949
18407A814602m1186n4428n90j4353k1126k9447q986L3321P7605P2727M707m6342
18395A786504k4530L9383N0160o296j7422p048o3326j2060L8407M3343k9147m2700
18383A755268l959K5199J0370J16P5868K8731O5J6546j1324J8583K540J6748J3087
18370A947838K6996M1893N6008r576J1927j6388L3828K1517P7525P4283l416j1348
18358B251087M8851L9982J3442K9202P278N9927J07798N7851L8214J25190N4494
18347B833316Q2191J54898Q2926J29621J81906K20103K43234K90064L10286M49893
$$ plain form
18429 3347272 3215835 3176074 3157155 3125136 3033909 2940414 2843485 2807664 2770553 2681165 2634526
18418 2634526 2600720 2518519 2464612 2393644 2236411 2098464 1986964 1958051 1905421 1859551 1814602
18407 1814602 1773416 1718988 1718398 1704045 1682919 1653472 1644486 1677807 1755412 1828139 1832846 1786504
18395 1786504 1761974 1801357 1851517 1845221 1827799 1820751 1757425 1745365 1783772 1827115 1797968 1755268
18383 1755268 1751309 1776508 1786878 1786994 1862862 1891593 1891658 1908204 1896880 1915463 1918003 1934751 1947838
18370 1947838 1974834 2016727 2072735 2063159 2075086 2058698 2092526 2114043 2191568 2265851 2262435 2251087
18358 2251087 2299938 2339920 2353362 2382564 2389842 2449769 2557567 2615418 2653632 2778822 2833316
18347 2833316 2915507 3070405 3153331 3282952 3464858 3684961 3928195 4218259 4528545 4978438
18337D978438M55575L70198L14163K95007K86635K27543K97510K98216K93530
18328G816815L80469N68030P53588Q90072J055723J324411J609885J949422K464785
18319A8813200L103753L938670N180970P287286J0715460J5482189K0040434K2369082
18311A06931044K0542451J6363113J1227854O447821K915778j844225p038275
18304A55545561j2642352j3860706j0649191m427650K650219R230766J4160905
18297A40007552J5748862J3267375R342765M269324O17602l459166q527570j4686789
18289A56579955j9454616j9459426j6463057j2705268j0183827q645168p335191
18282F2333402o091487n018092m135121l441738k996424k655343k338440k035444
$$ plain form
18337 4978438 5434013 5804211 6118374 6413381 6700016 6927559 7225069 7523285 7816815
18328 7816815 8197284 8765314 9518902 10408974 11464697 12789108 14398993 16348415 18813200
18319 18813200 21916953 25855623 31036593 38323879 49039339 64521528 84561962 106931044
18311 106931044 127473495 143836608 155064462 161512283 164428061 162583836 155545561
18304 155545561 142903209 129042503 118393312 113965662 116615881 125846647 140007552
18297 140007552 155756414 169023789 178366554 182635878 183253480 179794314 171266744 156579955
18289 156579955 137125339 117665913 101202856 88497588 78313761 69668593 62333402
18282 62333402 56241915 51223823 47088702 43646964 40650540 37995197 35656757 33621313
18274C3621313j904645j670109j443692j216933j137171j064491r46942p69740
18266B3467590p29606p82249p46892p78797q78532q84771q11380p96325p70448
18257A6288590p04194o82314n98682n00635m63058l33084l01179l61886l91183
18248A1952375l33954l03950l69496l02471k52076j95231j93294j34668j44860
18239I722375j75548j17385j23911j24644j82659j62256r3859k4670J76J1725
18229H729344l3404N263J26272K01772L22017M83344O90365J090348J643384K411218
18219A5669923L453871M556587N357312N511350M894627L726464K127257M99207
18211D5796598j239694k733161l891272m361094m114777l457275k825104k278118
$$ plain form
18274 33621313 31716668 30046559 28602867 27385934 26248763 25184272 24237330 23467590
18266 23467590 22737984 21955735 21208843 20430046 19551514 18666743 17855363 17059038 16288590
18257 16288590 15584396 14902082 14303400 13802765 13339707 13006623 12705444 12343558 11952375
18248 11952375 11618421 11314471 10944975 10642504 10390428 10195197 10001903 9867235 9722375
18239 9722375 9546827 9429442 9305531 9180887 8998228 8835972 8742113 8717443 8717619 8729344
18229 8729344 8695940 8701203 8827475 9029247 9351264 9834608 10524973 11615321 13258705 15669923
18219 15669923 19123794 23680381 29037693 34549043 39443670 43170134 45297391 45796598
18211 45796598 44556904 41823743 37932471 33571377 29456600 25999325 23174221 20896103
18203B0896103j893239j575858j301917j048281p98339o78010n47705m58428l02178
18194A2292148k51385j67578o5634M5947K0308N6779K9164n180J1284M284L4829
18183A2004966J53338K71349L87164P16618R85159J265057J874295K682952L944246
18174B4285144N790857Q147142J0706520J3203933J5138792J5996776J5406622
18167A08675786J3076366R240914M116611j333860o314765r880786j2239072j3090173
18159I2251021j2569434j0838948q809336p170684o007026m916824l865755k954142
18151C5118872k271284j817367j544113j386148j123705r97898q27946o23328
18143B4527083n40163m93686l84994l72775m10644l99189k96530j61001N869J59113
$$ plain form
18203 20896103 19002864 17427006 16125089 15076808 14278469 13600459 13052754 12594326 12292148
18194 12292148 12040763 11873185 11807551 11853498 11873806 11930585 11959749 11954569 11965853 11970137 12004966
18183 12004966 12158304 12429653 12816817 13533435 14518594 15783651 17657946 20340898 24285144
18174 24285144 30076001 38223143 48929663 62133596 77272388 93269164 108675786
18167 108675786 121752152 130993066 135109677 133775817 127461052 117580266 105341194 92251021
18159 92251021 79681587 68842639 60033303 52862619 46855593 41938769 38073014 35118872
18151 35118872 32847588 31030221 29486108 28099960 26976255 25978357 25150411 24527083
18143 24527083 23986920 23493234 23108240 22735465 22324821 21925632 21629102 21468101 21473970 21633083
18133B1633083M48312Q74390J405385K077052L065697M639024P059856J0458103
18125E1660902J4617922J8281850J9524394J7702270J3763264Q936586M250135
18118A48737323k0728m795532r985382j3857300j4472645j2084631q573883n505488
18110G9441734k608772J070356O569040J3102775J3059630Q080809M686809n321121
18102A18081260o370176k141101K15887P59284K55067R35669K726043M870030
18094A19331963O245436P221362P721583O655909M091130J802950q02461l523059
18086A48744813m337146m277479m010721l593418k651064k162298k902631l912032
18078A20898024m905283o811976q008641q366275q602714q375342p558951o659556
$$ plain form
18133 21633083 22081395 22955785 24361170 26438222 29503919 34142943 41202799 51660902
18125 51660902 66278824 84560674 104085068 121787338 135550602 144487188 148737323
18118 148737323 148716595 143921063 133935681 120078381 105605736 93521105 84947222 79441734
18110 79441734 76832962 77903318 84472358 97575133 110634763 118715572 123402381 118081260
18102 118081260 111711084 109569983 109785870 110545154 110800221 111735890 114461933 119331963
18094 119331963 125577399 132798761 140520344 147176253 151267383 153070333 152267872 148744813
18086 148744813 144407667 140130188 136119467 132526049 129874985 127712687 124810056 120898024
18078 120898024 115992741 109180765 101172124 92805849 84203135 75827793 68268842 61609286
18070F1609286n665536m792464l947948l352288k819892k287103j847150j439834
18062C5457071j034070o36215j31061L09510P54248J184517J316690J551019J584532
18053D0356241J361545J051082R31118O53873O24108R58691J402779J806709K127407
18044E1273553K507925K402895J736913Q96994K08979r31274j715911j916274
18036E4463800j969229j964091j726107j367505j274351j441337j539317j945954
18028D1235909k281664k434731k579199k650917k488524k204593k039016j662753
18020B2894512j338020j174854j068394r12569p86393p72034p54194p32670p03676
18011A4651708o11716n38597n28924m63385m47405l47609l40492l33150l17110
$$ plain form
18070 61609286 55943750 51151286 47203338 43851050 41031158 38744055 36896905 35457071
18062 35457071 34423001 33786786 33655725 33965235 34719483 35904000 37220690 38771709 40356241
18053 40356241 41717786 42768868 43699986 44353859 44977967 45936658 47339437 49146146 51273553
18044 51273553 53781478 56184373 57921286 58818280 59027259 58095985 56380074 54463800
18036 54463800 52494571 50530480 48804373 47436868 46162517 44721180 43181863 41235909
18028 41235909 38954245 36519514 33940315 31289398 28800874 26596281 24557265 22894512
18020 22894512 21556492 20381638 19313244 18400675 17614282 16842248 16088054 15355384 14651708
18011 14651708 14039992 13501395 12972471 12509086 12061681 11714072 11373580 11040430 10723320
18002A0723320k99509k63737j07394j87898k82445j87342j16891j76755n5126
17993I046223n7140m9750p9157n0908L3010K36o3382N45L4350M4421N4918J07713
17981I021079J66861J61868J70668K08944L10508L11909K33990L49791M22987
17972A1358605M89074N67576O84908Q41857J108434J408595J884240K442174K933340
17963B3718803L630046M657462N351867N746256O358232P025901P318284P131214
17955G0938065P385965P058871O329842O463547P447939P287389O131428O564094
17947A25607140P799880P758460O502498N903310N135953K969132J205105O52939
17939A63534417m55095l503731n069233m450472m057945n326829o199725n874475
$$ plain form
18002 10723320 10423811 10160074 10052680 9864782 9582337 9394995 9278104 9101349 9046223
17993 9046223 8989083 8939333 8860176 8809268 8842278 8842514 8779132 8779677 8814027 8858448 8913366 9021079
17981 9021079 9187940 9349808 9520476 9729420 10039928 10351837 10585827 10935618 11358605
17972 11358605 11847679 12415255 13100163 13942020 15050454 16459049 18343289 20785463 23718803
17963 23718803 27348849 32006311 37358178 43104434 49462666 56488567 63806851 70938065
17955 70938065 78324030 85382901 91712743 98176290 105624229 112911618 119043046 125607140
17947 125607140 133407020 141165480 147667978 153571288 158707241 161676373 162881478 163534417
17939 163534417 163079322 159575591 154506358 150055886 145997941 140671112 134471387 128596912
17931A28596912o129070o319658o406245o531546p705600p849493p105782o603315
17923G3946203o739874o593344n750430m852060m283062l769047l218297k603972
17915C6136117k189621j868669j697601j521644j428189j454355j277635j140323
17907B3558080j131001j018834j035270r91452q98427q28240p22470o90855o79638
17898A5561893n79280n43386n29634m77652m46749m03953l53756k98550l31613
17889A1597320l04634l38270l25050k51634k52389l16881k48658k03730k03854
17880I152220j85176k14707j82963j20391n8871p9836m9972M4867M8937k1781
17870H332327M114N2634M7426J12425R3606J21248K24999K99248L00624L33856
$$ plain form
17931 128596912 122467842 116148184 109741939 103210393 95504793 87655300 80549518 73946203
17923 73946203 67206329 60612985 54862555 50010495 45727433 41958386 38740089 36136117
17915 36136117 33946496 32077827 30380226 28858582 27430393 25976038 24698403 23558080
17907 23558080 22427079 21408245 20372975 19381523 18483096 17654856 16932386 16241531 15561893
17898 15561893 14982613 14439227 13909593 13431941 12985192 12581239 12227483 11928933 11597320
17889 11597320 11292686 10954416 10629366 10377732 10125343 9808462 9559804 9356074 9152220
17880 9152220 8967044 8752337 8569374 8448983 8390112 8310276 8260304 8305171 8354108 8332327
17870 8332327 8336441 8389075 8436501 8548926 8642532 8763780 8988779 9288027 9588651 9922507
17860I922507L90212N10978N79479O26253O87211Q72999J165965J611615K160618
17851A8527837K801084L538726M457936N156538N465768N739659N789364N060839
17843E6537751M038555L600706L021628K477130K929744L751637M454059M892335
17835H5703545N412795N457599M291836K611396R61202r50850k826920l748170
17827I6912433l974687l926138l760218l161603k477277k568274k824445l015160
17819G1204631l813894m471873m544770m603426m588904m243180l634615l052660
17811C8251309k440338j848682j281702m88754Q8725N93818J288546K083978K545508
17802C8792408K749918L025284L149543K898820K429152K397386K044320J626714
$$ plain form
17860 9922507 10312719 10823697 11403176 12029429 12716640 13589639 14755604 16367219 18527837
17851 18527837 21328921 24867647 29325583 34482121 39947889 45687548 51476912 56537751
17843 56537751 60576306 64177012 67198640 69675770 72605514 76357151 80811210 85703545
17835 85703545 91116340 96573939 100865775 103477171 104438373 103487523 100660603 96912433
17827 96912433 92937746 89011608 85251390 82089787 79612510 77044236 74219791 71204631
17819 71204631 67390737 62918864 58374094 53770668 49181764 44938584 41303969 38251309
17811 38251309 35810971 33962289 32680587 32191833 32280558 32874376 34162922 36246900 38792408
17802 38792408 41542326 44567610 47717153 50615973 53045125 55442511 57486831 59113545
17794E9113545K008916K730100K983800K955743L329913L537153K838378J784910
17786H1282458Q25068l40609j627947k588910k850558k858529k940229k756364
17778F6144380k280293k116861k403176k461973k864234l554133l727665l690085
17770D3045960l781880l752575l357920k950737k668893k244537j878258j523222
17762B0887938j418849j217408j089233r63032p84002p32710p29367o75269n42512
17753A2735556n12832n16193m87382m71971m12929m09551m16654l22441l24463
17744H861140l17437l37638k94241l12136k87936k49253k37738k10700j76163
17735F437898j21790k04566j80908j08115j42460k11702j48885j32567q8730j4936
$$ plain form
17794 59113545 61122461 63852561 66836361 69792104 73122017 76659170 79497548 81282458
17786 81282458 82107526 81766917 80138970 77550060 74699502 71840973 68900744 66144380
17778 66144380 63864087 61747226 59344050 56882077 54017843 50463710 46736045 43045960
17770 43045960 39264080 35511505 32153585 29202848 26533955 24289418 22411160 20887938
17762 20887938 19469089 18251681 17162448 16199416 15415414 14682704 13953337 13278068 12735556
17753 12735556 12222724 11706531 11219149 10747178 10334249 9924698 9508044 9185603 8861140
17744 8861140 8543703 8206065 7911824 7599688 7311752 7062499 6824761 6614061 6437898
17735 6437898 6316108 6111542 5930634 5822519 5680059 5468357 5319472 5186905 5098175 5083239
17725E083239j46936j09601j40924q2252J81k647J9449m2084o0229q9686j24004
17714D304506j16658j20505j13737j35341j28665m3972m0028m1382n8391m6845
17704C458982Q147K1433m8730m9045m3359j5571q0694j44007j30348p2982q7682
17693B816144p5721m3283p3398j35816j02547r8012j44600j49410n8599j06615
17683A828143q7065n9624r2732p8127j012n9452r9178p9471r3027L370o471q4345
17671A091009j9637o1497m3057j14526k6170r3692l6201j232k6968j6318P0499
17660G22210o3499r8770m6527p010R5846N4281m7802K2716l152P0199R2602P2272
17648H63366K9363O1620J11273J4999L3026J7785m4477o2672p3224p4609o5687
$$ plain form
17725 5083239 4936303 4826702 4685778 4603526 4603707 4601060 4620509 4578425 4518196 4428510 4304506
17714 4304506 4187848 4067343 3953606 3818265 3689600 3645628 3605600 3564218 3505827 3458982
17704 3458982 3467129 3488562 3439832 3390787 3347428 3331857 3251163 3107156 2976808 2903826 2816144
17693 2816144 2740423 2697140 2623742 2487926 2385379 2287367 2142767 1993357 1934758 1828143
17683 1828143 1741078 1681454 1588722 1510595 1509583 1450131 1350953 1271482 1178455 1181825 1175354 1091009
17671 1091009 1071372 1009875 966818 852292 826122 732430 696229 694997 668029 651711 722210
17660 722210 658711 559941 513414 506404 602250 656531 608729 631445 628293 698492 791094 863366
17648 863366 892729 954349 1065622 1080621 1113647 1131432 1086955 1024283 951059 876450 810763
17637H10763p9137j00432J3147q3n8929q8538J0349j8156m429K381j3109k1831
17625D51996k3071l1692l7854j4056O918j8112L4479k4097l580J9760R217l1233
17613C38675o239m477j650j583Q9483N7707k4593j5136O3625R3201J6659M6610
17601F52282P2896R1360P0402O8477l5904J8044K7704p281o3046q9819l1263n092
17589G68760k8006o6207J596m2145p9102m0628R734N0081k3468j9189o9939m7673
17577D13814J6731q8456m0776k6318L3087L4277k6508m7079q6104o0053L5441
17566A58056M0435N0767O3879O022k9332j9075l1261J0258O7389J3986K676Q639
17554C42439J343J8921P1291J7170k1671J6515K2877K9473k285N0449J4643j7294
$$ plain form
17637 810763 731626 631194 644341 644258 585329 496791 507140 488984 484555 486936 473827 451996
17625 451996 428925 397233 359379 345323 352241 334129 368608 344511 340931 360691 369908 338675
17613 338675 332436 327959 326309 324726 414209 471916 447323 432187 495812 589013 605672 652282
17601 652282 725178 816538 886940 955417 919513 937557 965261 957980 894934 805115 773852 768760
17589 768760 740754 674547 676143 633998 554896 514268 524002 574083 550615 531426 461487 413814
17577 413814 430545 342089 301313 274995 308082 342359 315851 268772 182668 122615 158056
17566 158056 198491 249258 313137 319159 289827 270752 239491 249749 317138 331124 333800 342439
17554 342439 343782 362703 433994 451164 429493 446008 468885 498358 496073 546522 561165 543871
17542E43871l2988m327q627l1766j3556j4071j775J9086k6611m7631k4143k0815
17530C36647k7034J812k8886m7961n1131l6223o945O264j7696J5216j5675k0127
17518A08261l8313n3043O8398L3353J2410l3006j5946J8422n4955p5010J799K5714
17506a916m1589m1322p667R0757J8315K3240Q851j2226k1532M356K575O867j8826
17493I883k2589l9127j1531K859j7530M684L6790L8215K0034K8966j5546m5471
17481a0363J7980l4036p082K6563M0538q730N293l7244Q268M6058O1621J1960
17469A20826K4024o2667L2585J8095K0718K4849Q1001N1857q100P708N4113N8839
17457D23848Q3473K2662O793K08J894J22171L4085R1651N7008M571l693K9382
$$ plain form
17542 543871 510883 506556 497929 466163 452607 438536 436761 455847 429236 381605 357462 336647
17530 336647 309613 311425 282539 234578 183447 147224 140279 146543 128847 144063 128388 108261
17518 108261 69948 16905 85303 118656 131066 98060 82114 100536 45581 -29429 -27630 -1916
17506 -1916 -43505 -84827 -92494 -1737 16578 39818 48669 36443 14911 19267 21842 28709 9883
17493 9883 -12706 -51833 -63364 -60505 -78035 -73351 -36561 1654 21688 50654 35108 -10363
17481 -10363 7617 -26419 -33501 -6938 33600 24870 30163 -7081 1187 47245 108866 120826
17469 120826 144850 82183 114768 132863 153581 178430 259431 311288 303188 310896 365009 423848
17457 423848 507321 529983 536776 536984 538878 661049 695134 786785 843793 848364 844671 874053
17445H74053k2792M13K8507K4084K2101K9458K9739l467k0660r4680j19280r0786
17433F56690n8356l8332q1076p1425q018p4569n8395K6534j2472j13152o003O1445
17421B22871o532p1057J94j3420n5832k8928l1972l0178l716L1275J4271M1110
17409F8086l6581j18551J9710K2305n3977J2808L6237J5310L9554L9904r5695
17398e0890J5135k7353k37J5551K3615l6406J1895J1475r6325m2601L2452J1557
17386a32132K1198P3789N2317K2767j5451l3805q29o9097l552J4430P950N5813
17374f602K1547k9366k2204m1236l5781k7788L7918M7529k3538l4470L9895Q9921
17362A5825M638J3222k2311J2128j4308K1925j4506l4434k8382k6511K6598K2139
$$ plain form
17445 874053 851261 851674 880181 904265 926366 955824 985563 982096 961436 866756 747476 656690
17433 656690 598334 560002 478926 407501 399483 324914 266519 293053 280581 167429 161426 222871
17421 222871 216339 145282 145476 132056 76224 47296 15324 -14854 -18570 12705 26976 68086
17409 68086 31505 -87046 -67336 -45031 -99008 -86200 -49963 -34653 4901 44805 -50890
17398 -50890 -35755 -63108 -63345 -47794 -24179 -60585 -48690 -37215 -133540 -176141 -143689 -132132
17386 -132132 -110934 -37145 15172 37939 22488 -11317 -12146 -81243 -84795 -70365 -62415 -6602
17374 -6602 14945 -14421 -36625 -77861 -113642 -141430 -103512 -55983 -79521 -113991 -74096 15825
17362 15825 20463 33685 11374 23502 9194 31119 16613 -17821 -46203 -72714 -46116 -23977
17350b3977j138L6173L3610K8366j8426Q5260R7819M1324O4037k2019j5240k335
17338C03454L729k1106J7563J091R255M0343Q6309j4190l9705J6125M979m5613
17326C62234n147L119l1678J4752J4065j5280L1777j0124j7421n1227q7192l686
17314B04192o148m1883n4113n1205J1589P6965l0443J0313n9343k3457J4544L7687
17302H8698j4461n0748N0371O3940m6267l7349M0140M8453K0107L0489L8382K3080
17290B54835j159r83L6301O5575L5363K4258M0166j2862m8390o5991k3145K1172
17278C25140L934J2883l1988j1788p495l2499J1079m321n9016l4747o6173m3950
17266F1059j9652j732j6539n704m3991j3249L5571N8345P050J4582o46n745J709
$$ plain form
17350 -23977 -25115 11058 44668 73034 54608 139868 237687 279011 343048 321029 305789 303454
17338 303454 307183 286077 303640 304731 313986 354329 440638 426448 386743 402868 407847 362234
17326 362234 357087 360206 328528 343280 357345 342065 373842 363718 346297 295070 207878 204192
17314 204192 198044 156161 102048 50843 62432 139397 108954 119267 59924 36467 51011 88698
17302 88698 74237 23489 73860 137800 91533 54184 94324 142777 162884 193373 231755 254835
17290 254835 253676 252693 288994 354569 389932 414190 454356 441494 393104 327113 303968 325140
17278 325140 329074 341957 309969 298181 290686 258187 269266 264945 205929 171182 105009 61059
17266 61059 41407 39675 23136 17432 -26559 -39808 -4237 54108 61158 75740 75094 69349 71058
17253G1058j5052P187M0795Q079J0539J85j1677k5575l3554r6573l3097Q172k8784
17240i8297Q389Q861k5836J9409K2798J9415L3318L438m1671J1850L1951n448
17228a1823j6794j8528J7096J5040k2986L4624M5027J1613m1502n3990J1661j9262
17216d9824L9161P8j2443j4031P671K3754n749l5182j0824K6994K7896P124q1800
17203g7175q143K504K369o7669L6689J0829l7393N853k682J7713K4478J2379m317
17190h4565k0244L7614j472k704J5562N9302L0046j9358n0371q986m2050L2736
17178e4490K2507k4771j6650j5309K4230o928N87O4786M3522K606m0021k1917
17166b1848l3925k1893j9594j6157r070N4287k6656k6490J8605N3172L0450n3067
$$ plain form
17253 71058 56006 63193 103988 112067 122606 122791 111114 85539 51985 -44588 -77685 -69513 -98297
17240 -98297 -89908 -81047 -106883 -87474 -64676 -45261 -11943 -8505 -50176 -38326 -6375 -11823
17228 -11823 -28617 -47145 -30049 -15009 -37995 -3371 41656 53269 11767 -42223 -30562 -49824
17216 -49824 -10663 -10585 -23028 -37059 -29388 -5634 -11383 -46565 -57389 -30395 -2499 4625 -77175
17203 -77175 -85318 -82814 -80445 -148114 -111425 -100596 -137989 -132136 -134818 -117105 -92627 -80248 -84565
17190 -84565 -104809 -67195 -68667 -71371 -55809 3493 33539 14181 -36190 -45176 -87226 -54490
17178 -54490 -31983 -56754 -73404 -88713 -64483 -71411 -70824 -6038 37484 40090 69 -21848
17166 -21848 -55773 -77666 -97260 -113417 -122487 -68200 -94856 -121346 -102741 -49569 -19119 -72186
17154g2186n7388k5548K918J9171N2832K5331j967k3007k5877K4384M6893R69
17142c3475l0381K801J5499O370r719K3485k0600n529P8735M2807J469m1991j711
17129B7760j8762Q552J8666K3755r4425m1758N803M1029N4855j1801l0112O870
17117i568K0352l163J9020o765J6619N384L7417N1650J17490M3576P3176J03268
17105D68456N3670L5857O091p9681r9208m4064L8533J8832K4684Q1168J09014
17094F13352R4289J58745J09820L3099k3373n8293j44810j51152j14921l8652
17084D78104l0102M7015Q9938O1597M6623K7722L1409n5095r1010j00183l9588
17073D66430q7991j04009k3018m1401k9493M1141K8694r552J9134J5373m7300
$$ plain form
17154 -72186 -129574 -155122 -152204 -133033 -80201 -54870 -56837 -79844 -105721 -81337 -34444 -33475
17142 -33475 -63856 -61055 -45556 -39186 -48905 -25420 -46020 -51549 27186 69993 71462 29471 27760
17129 27760 8998 17550 36216 59971 -34454 -76212 -70409 -29380 25475 13674 -16438 -9568
17117 -9568 10784 7621 26641 19876 36495 41879 79296 130946 248436 292012 365188 468456
17105 468456 522126 557983 564074 484393 385185 341121 379654 398486 423170 504338 613352
17094 613352 707641 866386 976206 1009305 985932 927639 782829 631677 516756 478104
17084 478104 448002 495017 584955 646552 693175 720897 752306 697211 606201 506018 466430
17073 466430 378439 274430 251412 210011 180518 221659 250353 240801 259935 275308 228008
17062B28008k1079l1282N0995k421o7974p9851k6592Q984l3050n3065N050K9196
17050F919k0294M39L9129N1510k2651k2780J2770l8606J3965N4325o306q059l7761
17037B2600n692l446k4449R313p754l2118k3359k5249M0858K6950J3704O4397
17025E5755Q7243n955o7311m7758J562N578k3976j7720n709o2957J0379O6295
17013d574k771j9898k3986m3625k5761j8150L4366J3658M0885k0819Q1233K3075
17001C3633k5506m7827p2786r111n859m030O5502N4122l6402l1639j1628M495
16989h7036J7155k0744q824k2673L1576K7867K2457k1177j623M5193k515j9232
16977c9576J1459o542n6282J0884K1368M457o325m996L5762M6933l454n7773j3970
$$ plain form
17062 228008 206929 175647 226642 224221 156247 76396 49804 58788 25738 -27327 -22277 6919
17050 6919 -13375 -12936 26193 77703 55052 32272 45042 6436 20401 74726 68420 60361 22600
17037 22600 16908 13462 -10987 -1674 -9428 -41546 -64905 -90154 -49296 -22346 -8642 55755
17025 55755 142998 137043 69732 21974 23536 29114 5138 -12582 -18291 -81248 -70869 -4574
17013 -4574 -7345 -27243 -51229 -94854 -120615 -138765 -104399 -90741 -49856 -70675 10558 33633
17001 33633 8127 -39700 -112486 -121597 -127456 -131486 -65984 -11862 -48264 -79903 -91531 -87036
16989 -87036 -69881 -90625 -99449 -122122 -90546 -62679 -40222 -61399 -63022 -17829 -20344 -39576
16977 -39576 -28117 -34659 -90941 -80057 -58689 -54232 -60557 -65553 -29791 17142 13688 -44085 -58055
16964e8055N7436K0680K475m1919r196N4362j5787J7813K8846M4570Q113k1631
16952H7707j8479k8737q405j25801M241O5356k0505J959K1519R739m0034p758
16940e9198j0052j7890n124R859N8031k0271j0426J8267r969l2433m9462K9852
16928i8816N8505K0374k1219l318l5619M802M1831j7478L0278N1955L9343j511
16916F9127N156n312k7006l7697j5515p5214k187L3405j7375L331K2739L5514
16904a1034L2830K8206j5770K4329m2736k0457j2206k4979j3631m6116k985O5565
16892c8984k4148n1171M6584M6741P405N203j1633m1341N4480M6880M8236m0857
16880D7395j9265j9471J5820M2793l4225n65k5810o038j3804k2624k0494O701
$$ plain form
16964 -58055 -619 20061 22536 -19383 -28579 25783 9996 27809 56655 101225 109338 87707
16952 87707 69228 40491 32086 -93715 -89474 -24118 -44623 -42664 -21145 -11406 -51440 -59198
16940 -59198 -69250 -87140 -92264 -82405 -24374 -44645 -55071 -36804 -46773 -79206 -128668 -98816
16928 -98816 -40311 -19937 -41156 -44474 -80093 -75291 -33460 -50938 -20660 31295 70638 69127
16916 69127 74283 68971 41965 4268 -11247 -86461 -88648 -55243 -72618 -69287 -46548 -11034
16904 -11034 21796 50002 34232 58561 15825 -4632 -16838 -41817 -55448 -101564 -104549 -38984
16892 -38984 -63132 -114303 -67719 -20978 -13573 -8370 -20003 -61344 -6864 40016 88252 47395
16880 47395 28130 8659 24479 67272 33047 32482 6672 634 -13170 -35794 -56288 -49587
16868d9587Q8698j7965j2466K8272P344M604j2348j6388n8857L5675K7769J9729
16856D4480l2753o0559k6387K6332n082N9896K2990n5244j8837q696P85k9220
16844h2295m9398j3955L9213J6823l9548p387J8426Q0295Q5207m3662n8137k6082
16832h0500O010j373R701L8603j0716k1001J6088o983P839K0193l8406o59O8061
16819F857M3671l8022m4117k0849N7361K2526N2911J07693K6442o6673j6044M61
16807A32217J4359K2330j7443j6665q14L7936J331l8019L6561N6996o229n5139
16795A67421k2726M6090J8263n6810p0882j3708j8599K4054r722k7381O2860K8009
16783A26869M7333K938l0739j6009K4928O9106k4395l8024J473n4714l2908k8039
$$ plain form
16868 -49587 39111 21146 8680 36952 44296 48900 36552 20164 -38693 -3018 24751 44480
16856 44480 11727 -48832 -75219 -48887 -53969 5927 28917 -26327 -45164 -53860 -53075 -82295
16844 -82295 -131693 -145648 -106435 -89612 -129160 -136547 -118121 -37826 47381 3719 -54418 -80500
16832 -80500 -74490 -75863 -66162 -27559 -38275 -59276 -43188 -50171 -42332 -22139 -60545 -61204 6857
16819 6857 50528 12506 -31611 -52460 4901 27427 80338 188031 214473 147800 131756 132217
16807 132217 146576 168906 151463 134798 133984 171920 173251 135232 171793 228789 222560 167421
16795 167421 144695 190785 209048 152238 81356 67648 49049 73103 63381 36000 98860 126869
16783 126869 174202 177140 146401 130392 155320 224426 200031 162007 163480 108766 75858 47819
16771D7819L1781M1472m8814J0032J05821Q0343K24l0690k4523j686k976k1102
16759A87701O179l460k77l260m2045J3853N502K1658l2114m5885R26M8438M6367
16746B03583k3424j5095l9881l9419M5671N7263O200j5682j4826l6532j725m0036
16734H6097K3330L1015L4614j0475j8093J4084M5933P6376l391l2335l9822p1591
16722A35742k1067J30k2744l3178N1203L2478r220p1583O095p140N1700o487L8709
16709A44638M1789J7331q5422k7314n4789j3628O044M895J8641l039J4871k5204
16697C8813Q935O2878m223L2999Q229J0194j5562j00968l6535j3010L8309N4911
16685H4970P5435O7331O2847J7102j0314J3420j9991p0344J5047P1128K6935n2999
$$ plain form
16771 47819 79600 121072 72258 82290 188111 268454 268678 237988 213465 211779 208803 187701
16759 187701 193880 190420 190143 186883 144838 158691 164193 185851 153737 107852 108778 157216 203583
16746 203583 180159 165064 125183 85764 131435 188698 194898 179216 164390 127858 126133 86097
16734 86097 109427 140442 175056 164581 146488 160572 206505 282881 279490 247155 207333 135742
16722 135742 114675 114805 92061 58883 110086 142564 133344 61761 67856 60716 112416 105929 144638
16709 144638 186427 203758 118336 91022 36233 22605 28649 33544 52185 49146 64017 38813
16697 38813 47748 110626 106403 139402 147631 157825 142263 41295 4760 -8250 30059 84970
16685 84970 160405 227736 290583 307685 297371 310791 290800 220456 235503 306631 333566 280567
16673B80567k5534K9590O4970k131n6885l4049j9169M5774Q1427M050L3425J185
16661D03220L515L307n7791K6378j3551L5398L6355M2612P5162l9929p0145J1907
16649D56438K9445n409J2620M3980J4452J4300K810l0654o583Q375J8593n381
16637E52986R8467L7576n5345m5413l9579J7305M039N207N9886R2712K8911J0360
16625G67112j6072J4144l0304N241Q1592M4374J62r632L0042r040k6724L086n233
16612H48748M5095O9017M1458k6837J5164N169j4026j5789O849L7020K4119J1383
16600A047370J7705M1254p12M6654O8628K5366L6251J4034N2290O3363k880p609
16588A401714R483L9005Q1589J11695J4552N4628J24807Q3462J12517K09311K10595
$$ plain form
16673 280567 255033 284623 349593 347462 290577 256528 237359 283133 364560 368610 402035 403220
16661 403220 406735 410042 352251 378629 365078 400476 436831 479443 554605 514676 444531 456438
16649 456438 485883 480474 493094 537074 551526 565826 568636 537982 531399 539774 558367 552986
16637 552986 651453 689029 633684 588271 548692 565997 570036 575243 635129 727841 756752 767112
16625 767112 751040 765184 734880 740121 821713 866087 866249 856617 886659 877619 850895 853981 848748
16612 848748 893843 962860 1004318 977481 992645 997814 983788 967999 974848 1011868 1035987 1047370
16600 1047370 1065075 1106329 1105617 1152271 1220899 1246265 1282516 1296550 1348840 1412203 1409323 1401714
16588 1401714 1411197 1450202 1531791 1643486 1658038 1712666 1837473 1920935 2033452 2242763 2453358
16577B453358K74951K59208J68126J46122J37209J27940K24569K77523L59459
16568D428465M72890N47052O01809O19303O32285O85488Q50724R22289J165475
16559A0925780J527964J889889K541170L517535M840959O806169J0004913J4804091
16551E6858470J9585603J9331433J2815029L925717o897362j2785728r830428
16544H3002734m381632k06262L151010P638851J4572954K2069628K5773275K4370160
16536A75990718J8695940M651988q582942j5789996k1097967k0144741j4883986
16529A18839014r885932o134652k539191K440437Q790953J2709776R778349K502853
16521A36501607o824856j6020947j7195496j2851606r084543p493792o925052
$$ plain form
16577 2453358 2728309 2987517 3155643 3301765 3438974 3566914 3791483 4069006 4428465
16568 4428465 4901355 5448407 6050216 6669519 7301804 7987292 8838016 9760305 10925780
16559 10925780 12453744 14343633 16884803 20402338 25243297 32049466 42054379 56858470
16551 56858470 76444073 95775506 108590535 112516252 105618890 92833162 83002734
16544 83002734 78621102 78414840 81565850 89204701 103777655 125847283 151620558 175990718
16536 175990718 194686658 199338646 190755704 174965708 153867741 133723000 118839014
16529 118839014 108953082 102818430 100279239 102719676 111510629 124220405 133998754 136501607
16521 136501607 129676751 113655804 96460308 83608702 74524159 67030367 60105315
16514F0105315o213841n275038m399126l660481l175332k736210k230694j883509
16506C0531084j646390j528607j385132j266342j263391j164291j158375j040592
16498B0077964r48907q13913o80906o72061n66255n90116o13306o69167o09645
16489A3913688o15683n70696n01578m86433m68402m15683l56429l26544l53943
16480I818297l51679l45758k88918l32221l48109k64762k31727k50515j93848
16471G210760j76630j99147k21304k39189k36992j70169j41638j56609k15452
16462E453630j52355j08709j35161j86992j44920j35133j38892m9091n1046j54616
16452D196715j03451j17634j23690j37178q2125p431j09713j59176r5812j04741
$$ plain form
16514 60105315 53891474 48616436 44217310 40556829 37381497 34645287 32414593 30531084
16506 30531084 28884694 27356087 25970955 24704613 23441222 22276931 21118556 20077964
16498 20077964 19129057 18315144 17634238 16962177 16395922 15805806 15192500 14523333 13913688
16489 13913688 13298005 12727309 12225731 11739298 11270896 10855213 10498784 10172240 9818297
16480 9818297 9466618 9120860 8831942 8499721 8151612 7886850 7655123 7404608 7210760
16471 7210760 7034130 6834983 6613679 6374490 6137498 5967329 5825691 5669082 5453630
16462 5453630 5301275 5192566 5057405 4870413 4725493 4590360 4451468 4402377 4351331 4196715
16452 4196715 4093264 3975630 3851940 3714762 3632637 3625206 3515493 3356317 3260505 3155764
16442C155764q2333n7884o1388q7885j21354l7108l5943r8000n1685j9655j13194
16431B389335p1386n1091l5667n2995n4844j22754j18650n2353o0825j22348n1241
16420A595181n4962q6633q5589j11346j2481k8682q2870q719j0083p4008q7048
16409I52760p4965p8977n7466n7952j3160j08578k7846K7660j4477n5675L8786
16398E30110L1454k0891M2800L6439k4165o0478o9225J691O480j8127m4280L2675
16386D44483N0827j3739m250m2230n4072K8392k9237l6698k3049M1859J8661L8941
16374D19888K1459m4901k5352l6956j0244j202J9166K9466j0370j2797L4820j02
16362C82875l7638j1584J788o9726n0673O9854L6907M2732Q470J4465j4337l220
$$ plain form
16442 3155764 3073431 3015547 2954159 2866274 2744920 2707812 2671869 2573869 2522184 2502529 2389335
16431 2389335 2317949 2266858 2231191 2178196 2123352 2000598 1881948 1829595 1768770 1646422 1595181
16420 1595181 1540219 1453586 1367997 1256651 1244170 1215488 1132618 1123899 1113816 1039808 952760
16409 952760 877795 798818 741352 683400 670240 561662 533816 561476 546999 491324 530110
16398 530110 561564 540673 583473 619912 595747 535269 466044 467735 474215 456088 411808 444483
16386 444483 495310 481571 477321 435091 381019 409411 380174 343476 320427 362286 380947 419888
16374 419888 441347 396446 371094 334138 323894 322692 341858 371324 360954 348157 382977 382875
16362 382875 345237 333653 335441 265715 215042 284896 321803 364535 373005 387470 373133 369913
16350C69913m654l080m2721M3561l6589n4270p604M1205J1568k231j1266l5142
16338B68690o6763J1471M7795K4157M3539k7353j0758k4984l2095q176K3680J6346
16326B65549l250K2159j4470k5621L0822M1903j9673k2769P159P686M0474n824
16314C24145l5594K6511K5697m6943O053K2879o2408K122L4914r543J5133o48
16302C02318j1128K5471M7018K0863k1709k6204l5212l2849J7826L5895M1408
16291C63697l848k5677K6088L1490j5115l8578q515L8496O2349k9375l7877k9143
16279C33992L2140J2232n4674p1576l3230j0690K0068N4665m0984J516O5935M3965
16267C53359k3123p068N4664m1888n0918J227J9936K1533L3280m069L0761K4689
$$ plain form
16350 369913 365259 362179 319458 363019 326430 272160 264556 305761 317329 315098 303832 268690
16338 268690 201927 213398 261193 285350 328889 301536 290778 265794 233699 225523 249203 265549
16326 265549 262299 284458 269988 244367 275189 317092 297419 274650 281809 289495 329969 324145
16314 324145 288551 315062 340759 293816 299869 322748 260340 262462 297376 287833 302966 302318
16302 302318 291190 316661 363679 384542 362833 336629 301417 268568 286394 322289 363697
16291 363697 359849 334172 360260 391750 376635 338057 329542 368038 430387 401012 363135 333992
16279 333992 366132 378364 323690 252114 218884 208194 228262 282927 241943 243459 309394 353359
16267 353359 330236 323168 377832 335944 285026 286253 306189 327722 361002 356933 387694 412383
16255D12383K1928k2841j1870K5597j1017J7143j0398k0621J5408j9268l9672
16244C56772m0482L0275J5647N6999P2293j1380k3628J4870o737P661J6855M3818
16232E32963m439J2588J5430L9429k0981j4721j4553K247j3475P470K3128J312
16220E66398k5972l5339J3674j033J14488L0697j6855n0397N5416J0148n0656
16209F10569l1621M9171m7037n6784k8158j1671M8201O1496j16216l2921O8743
16198E13772J3001j1934J598Q470L4704K3681j0763k6197o1449l884k7207L8582
16186D92374L8253M6108j252m2265l4383n0962j4716Q1271M2613l9247j469K6886
16174E43211p256q560o9699p9736o691k6405J8825M3499k9349j8373Q1716l2431
$$ plain form
16255 412383 434311 411470 399600 425197 414180 431323 420925 400304 415712 396444 356772
16244 356772 316290 346565 362212 419211 491504 480124 456496 471366 464629 472290 489145 532963
16232 532963 528524 541112 556542 595971 574990 560269 545716 547963 534488 541958 565086 566398
16220 566398 540426 505087 518761 517728 632216 662913 646058 595661 651077 661225 610569
16209 610569 578948 628119 581082 524298 496140 484469 532670 594166 477950 445029 513772
16198 513772 526773 514839 516437 524907 559611 583292 572529 546332 484883 480999 453792 492374
16186 492374 530627 576735 575483 533218 498835 447873 433157 514428 557041 517794 516325 543211
16174 543211 535955 527395 457696 377960 371269 344864 363689 407188 377839 359466 441182 408751
16162D08751r083P5973o8157N545L4940p259M659j4424r011k6683n4251L7435
16150C78435M8470J379l4169n614o316n868o6099j2594m5721m4743J6739j1355
16138B12544N4999l0199m6762L4260L2169L9193j022p2982k3007l4045K4290k361
16126A87077k2979K7972N66J5665j0196l7290j771L4117l4907k9702m1508j0855
16114G6189L588L4929N0072m448Q912k2684n640k9543L5224k4277J4947K7582
16102A64851o0194q2138r410K740L0449P320M2465N766k277q6209l0018J6625
16090c0K4739k0631K7029K6524J9372K6150j0735r720o260q171J3581P24J4890
16077I7462J5077J9804k2002j7121j093k9675J5106K4272J7012j5955n2029k4301
$$ plain form
16162 408751 399668 475641 407484 413029 447969 440710 445369 430945 421934 395251 341000 378435
16150 378435 426905 428284 394115 388501 382185 376317 310218 297624 251903 207160 223899 212544
16138 212544 267543 237344 190582 224842 257011 296204 295182 222200 199193 165148 189438 187077
16126 187077 164098 192070 192636 208301 198105 160815 159044 193161 158254 128552 87044 76189
16114 76189 79777 114706 164778 160330 169242 146558 140918 111375 146599 122322 137269 164851
16102 164851 104657 22519 13109 15849 46298 53618 96083 101849 99572 13363 -16655 -30
16090 -30 24709 4078 31107 57631 77003 103153 92418 82698 76438 68267 81848 82572 97462
16077 97462 112539 132343 110341 93220 92127 62452 77558 101830 118842 102887 50858 26557
16065B6557K4874M095k0808K6858N7152k9484n5317R432J0263m874J5350J5844
16053G9942M1822l2578m4499P331N1361n903K9309r02k3720k1954k9664k3444
16041B7101J073j590k2566L4079L6062N4951K2484o3731m5768K2146J3887L9438
16029A17566L7244J1246m1828k3659l2474m3176o395O2452k5411n7191L3689O4824
16017I6887P716J4436l6365o1279K4491n705j659n049j1758N3823O5903j773n8331
16004H1337O657K5408J4111N376j171J1597O229m0503k2771K5051K3397K5271
15992A59989j6521j1391O7800Q4768J35249J10992R4820k6096j3632k5793J080
15981E61265m7643K9400L2215N4621M5030N6163J30537R1519N0631q153j6946
$$ plain form
16065 26557 51431 55526 34718 61576 118728 89244 33927 43359 53622 48748 64098 79942
16053 79942 121764 89186 44687 52018 103379 97476 126785 125883 102163 80209 50545 27101
16041 27101 28174 26584 4018 38097 74159 129110 151594 87863 42095 64241 78128 117566
16029 117566 154810 166056 124228 100569 68095 24919 18524 80976 55565 -1626 32063 96887
16017 96887 104603 119039 82674 21395 45886 40181 38522 33473 21715 75538 141441 139668 81337
16004 81337 87994 113402 127513 132889 131718 143315 149544 109041 86270 111321 134718 159989
15992 159989 143468 132077 199877 284645 419894 530886 625706 599610 585978 560185 561265
15981 561265 513622 543022 575237 629858 674888 731051 861588 953107 1003738 995585 978639
15970I78639o1567j25225j22750r64n7100k9903K590l6071R4525J07050N1184
15959H00408p5889r4561r5104r5333o4193p117l7303m7364o4086o158m4051l93
15947A68856L2009r561O599J9685k8132l8457j5617n2928l6481m007K0449M8673
15935A11088l0531j8610K0575K2159l9820j3796L4066K3302j1837N379p3781k5209
15923B985L6973L9463K7970K4988L5727o7836J1423M2204n5610m8868n7070k823
15911a0474l2426K9491M718m0205n3724K9696M2919j3563K7772M3109L6295m5051
15899A8557j7948j1416l7734k0762j1568K8879L1578J3452L1493L6188k6403q701
15887B5615K2904M01k2528N7461o554p0454M66J5358J7118R146j4601K0801L6785
$$ plain form
15970 978639 917072 791847 669097 668133 611033 581130 583720 547649 642174 749224 800408
15959 800408 724519 629958 534854 439521 375328 368211 330908 283544 219458 213300 169249 168856
15947 168856 200865 191304 197903 217588 189456 150999 135382 82454 45973 41966 62415 111088
15935 111088 80557 61947 82522 104681 64861 51065 85131 108433 96596 101975 28194 2985
15923 2985 39958 79421 107391 132379 168106 100270 111693 153897 98287 49419 -7651 -10474
15911 -10474 -42900 -13409 -8691 -48896 -102620 -72924 -30005 -43568 -15796 27313 63608 18557
15899 18557 609 -10807 -48541 -69303 -80871 -51992 -20414 -6962 24531 60719 34316 25615
15887 25615 48519 48920 26392 83853 77299 6845 7311 22669 39787 48933 34332 55133 91918
15874I1918P093K1733l8734m8255M0223k791j2729p588n5673k445J312j9611N088
15861b0459M1930M9292k9341o808J6340j0153k7081j1858K2333R796k2642j7242
15849e893l0518m9789R299O7691J3797o0545m7717L2458O0810L9833K2850o4271
15837a1995K0775M3628j670M98l6842p2433J8264K1839J1734m811j3423L3564
15825I128m5397p454L3860P4608M7276p8927o3018P738J1934O035J9288R790j922
15812B2939J3360j7188n7155K8276K2114K7576o5413l8972K4670j5157n3675k5059
15800a33684J1293N495O2636L5682m2811O2928L6834k0865k2195k2550o0652L2567
15788e5322N8752J018o1848L6741J8959n7965l5262J0281L0135j0888K1321L2171
$$ plain form
15874 91918 99011 120744 82010 33755 73978 71187 58458 50870 -4803 -7248 -5936 -25547 -20459
15861 -20459 21471 70763 41422 34614 50954 40801 13720 1862 24195 33991 11349 -5893
15849 -5893 -36411 -86200 -76901 -9210 4587 -55958 -103675 -71217 -10407 29426 52276 -11995
15837 -11995 8780 52408 50738 51236 14394 -58039 -39775 -17936 -6202 -11013 -24436 9128
15825 9128 -36269 -43723 -9863 64745 112021 33094 -29924 -22186 -10252 -4217 15071 24861 22939
15812 22939 36299 19111 -38044 -9768 12346 39922 -25491 -64463 -39793 -54950 -108625 -133684
15800 -133684 -122391 -116896 -54260 -18578 -61389 1539 38373 17508 -4687 -27237 -87889 -55322
15788 -55322 3430 4448 -57400 -20659 -1700 -59665 -94927 -84646 -54511 -65399 -44078 -11907
15776a1907k171m8200k738K5986M5595n7309k440K303J0552L1732M0657J8293
15764E0353r690l4927N1192L3421n5992n6796j0759k9084N614l9724J069o065
15752a01388J7859O5465l0322m9895k0430K7872M4880M8897O50L4221j7985r9626
15740g9802l7924N5171N5738q491q248K062l8349o179M6985j3946j778J05206
15728G0445P2360n3444k6615L0595q96k5m8145M589n8492J2241J4138J6361L7957
15715G1069L4272j222M3105L0847N4192o7862n5282k2697p2554K8470K2240n8422
15703F156m9858J3402N1349L802m9296R334O5917K7973J8898l5219q5747J096
15691b2193j3342M9364j1629R116m8294n9381l473M0531L0955K8222M661L5115
$$ plain form
15776 -11907 -14078 -62278 -65016 -39030 6565 -50744 -53184 -50881 -40329 -8597 32060 50353
15764 50353 40663 5736 56928 90349 34357 -22439 -33198 -62282 -56668 -96392 -95323 -101388
15752 -101388 -83529 -18064 -48386 -98281 -118711 -90839 -45959 2938 3588 37809 19824 -79802
15740 -79802 -117726 -62555 -6817 -15308 -23556 -21494 -59843 -66022 -19037 -32983 -34761 70445
15728 70445 142805 89361 62746 93341 92445 92420 44275 48864 -9628 2613 16751 33112 71069
15715 71069 105341 104119 147224 178071 232263 164401 109119 86422 13868 42338 64578 6156
15703 6156 -43702 -30300 21049 24851 -24445 -15111 50806 78779 97677 62458 -23289 -22193
15691 -22193 -35535 13829 2200 11316 -36978 -96359 -99832 -59301 -28346 -124 4537 39652
15679C9652k3986L763L8754K4033k9799j5024j2650j4805j8852L9271J3712k9262
15667A4807k8383q116J5628p225N4082q449o7031n3131L7645J4814K6571m6562
15655e5350P7588L8309n0333o2464k4008L1764P85K5347J9665j1492K1887K41
15643A1939J3749l572m7579k767J4564K3882K7866o50K2913k1563J5629j6763
15631C7648k2609O0836K6282l1952k3038j0059l9623Q181J3038j4091p241K1568
15619A8940K5264Q750M4018k6344j4482p835L2762m2973p8833l6569O59K4365
15607e2278P4481P8833L2519o2119l5978J4848K0866l4072k4951j1244m5695m8366
15595i3156j6033O1691M8479J0764m8652m490L272l5185l8878o575J101J0643
$$ plain form
15679 39652 15666 19429 58183 82216 52417 37393 24743 9938 -8914 30357 44069 14807
15667 14807 -13576 -21692 -6064 -13289 40793 32344 -34687 -87818 -50173 -35359 -8788 -55350
15655 -55350 22238 60547 10214 -52250 -76258 -44494 -43709 -18362 1303 -10189 11698 11939
15643 11939 25688 22116 -25463 -28230 -13666 10216 38082 37432 60345 38782 54411 37648
15631 37648 15039 75875 102157 70205 47167 37108 -2515 5666 18704 4613 -2628 18940
15619 18940 44204 52954 96972 70628 56146 48311 81073 38100 -40733 -77302 -76643 -52278
15607 -52278 22203 101036 133555 71436 35458 50306 71172 37100 12149 905 -44790 -93156
15595 -93156 -109189 -47498 981 11745 -36907 -41397 -38125 -73310 -112188 -118763 -117662 -107019
15583a07019L7251L2225M8806L1591j4452p3250r468M0928M096o647n259k021
15571b3219j0706k7717m1538M6607n49K9789m0066L2861J7293j2167J9574M9561
15559C9723L8198l8694n8947j6813n39M1933L2277L5032M561q9270l9319J570
15547e0288J2440q419M6232Q853J0638J0277o627O598k091k6195J1256M4012J942
15534E8628k5589k5413l3890k5096K459k028L1466N1540N604J9469j1286n0529
15522d665L473L2991L5444Q955j0984j6732m786J0513j0917M6848N6775l8260
15510A08655j7227j2269K996N235l9443p4923R002N6780M7803n362P25K9204r944
15497A01232m4299m5876l5387l6782q266K2573K9975P9742K7769k3146P78j5110
$$ plain form
15583 -107019 -69768 -37543 11263 42854 28402 -44848 -54316 -13388 -9292 -15939 -21198 -23219
15571 -23219 -33925 -61642 -103180 -56573 -57122 -27333 -67399 -34538 -17245 -29412 -9838 39723
15559 39723 77921 39227 -19720 -36533 -37072 4861 37138 72170 76731 -12539 -51858 -50288
15547 -50288 -37848 -46267 -35 8818 19456 29733 23106 29704 27613 1418 12674 56686 58628
15534 58628 33039 7626 -26264 -51360 -48901 -50929 -19463 32077 37681 57150 45864 -4665
15522 -4665 -1192 31799 67243 76198 65214 48482 43696 54209 43292 90140 146915 108655
15510 108655 91428 79159 82155 87390 47947 -26976 -17974 38806 86609 81247 81972 111176 101232
15497 101232 56933 11057 -24330 -61112 -69378 -46805 -16830 62912 90681 67535 68313 53203
15485E3203j9738p4989j646O1521p546q149R091l4105L6K3007l1416J7673m705
15472a7763l9410L5352L2221M692N246L9366K2057K68M7945L4759J7904N6139
15460B38776L4394Q8715N0485P8477R3883J18705J86033K25449K57485K73393
15450A645795L62825K91418K88042J61507J41442J15279Q642j07816j54635k57452
15440B495047k59558k02059k32431k71401k51500j04048r5329j17072q4029o9206
15430H08414q3374p7073m2128n1863l5489m0728J9416J0457N5066L5493J337o6527
15418E33001o7761p3294l0646K7023m2434o0488L435Q799N997L337k4314l4019
15406B48636J1681j0911k7807M7384L91R931L258q9300l9916j6012J3794n779
$$ plain form
15485 53203 33465 -41524 -43170 18351 10805 2656 11747 -22358 -22322 685 -30731 -13058 -17763
15472 -17763 -57173 -21821 10400 15092 20338 59704 81761 82029 129974 164733 182637 238776
15460 238776 273170 361885 412370 490847 584730 703435 889468 1114917 1372402 1645795
15450 1645795 2008620 2300038 2588080 2749587 2891029 3006308 3014950 2907134 2752499 2495047
15440 2495047 2235489 2033430 1800999 1529598 1278098 1174050 1078721 961649 877620 808414
15430 808414 725040 647967 605839 553976 518487 477759 497175 507632 562698 598191 599528 533001
15418 533001 465240 391946 361300 388323 345889 285401 288836 297635 303632 306969 282655 248636
15406 248636 260317 249406 221599 268983 269374 279305 282563 193263 153347 137335 151129 145350
15394A45350K5676k4534k2602k7365o4326l0116J7721J0003k0735K5339L7562
15383G1973J2110m1779k5747J922Q0845N6356L7616j7877r164L2210J3962k888
15371B09539K420J9483m1539m5035m1411J5948r555K1369q801o3743M0232M3465
15359A42372J4607j2958l8516K9921L1063k0288K3307k4973j4558R466L0188n1462
15347A18169m3249K1439k0269j1272K1072L8502L8732o526l6087q774j2868J9108
15335A17977J0861M2559k7056m6537o368Q128R152l4648m3957O0103j4115m2709
15323C3390n6491J5301P456n7124K7570l0244o3839p189j4075M396l6527n3570
15311b30946J0534J098K0275L7504L6593M2295k3981K832K6675K7979m7102k4874
$$ plain form
15394 145350 171026 146492 123890 96525 32199 2083 19804 29807 9072 34411 71973
15383 71973 84083 42304 16557 18479 99324 155680 193296 175419 166255 198465 212427 209539
15371 209539 211959 231442 189903 144868 103457 119405 109850 131219 122418 58675 98907 142372
15359 142372 156979 144021 105505 135426 166489 146201 169508 144535 129977 139443 169631 118169
15347 118169 74920 96359 76090 64818 85890 124392 163124 156598 120511 111737 98869 117977
15335 117977 128838 171397 144341 97804 91436 99564 108716 74068 30111 90214 76099 33390
15323 33390 -23101 -7800 -344 -57468 -29898 -60142 -123981 -131170 -145245 -140849 -177376 -230946
15311 -230946 -220412 -219314 -199039 -161535 -124942 -82647 -106628 -103796 -77121 -49142 -96244 -121118
15299a21118K4904K6499J5776m045K1813N3207L2998J7360M0332M521L6436R428
15287A58111o700j8754l6323O599R294K2955j5245j6766P406J3904K0563j6519
15275A28525j0856J8755Q821N7437O7862n741K98P09K9418K9288K059L6779L2609
15262C95963J1999K9343m23l2046K6584r205J0274m0310k1474n9163K6686J8528
15250C56756l2446j9482j98K3492l128l8824j03177j3768N7347L2810l5733m8582
15238A75067j6474L9972L0042O2720l8861k9930k4544J4316K3889J8564k7202
15227B27559L532K2549k4474L237L7106j8889k1442j2989k8392M3570J3100J4539
15215B59006J4553K5195J6382L093k1676J198M7132j8538j9140J8470l6368o9805
$$ plain form
15299 -121118 -96214 -69715 -53939 -57984 -36171 17036 50034 67394 107726 112247 148683 158111
15287 158111 151411 132657 96334 102933 112227 135182 119937 103171 110577 124481 145044 128525
15275 128525 117669 136424 145245 202682 270544 264803 265101 265810 295228 324516 326575 363354 395963
15262 395963 407962 437305 436882 404836 431420 422215 432489 392179 370705 311542 338228 356756
15250 356756 324310 304828 304630 328122 324994 286170 182993 169225 226572 259382 223649 175067
15238 175067 158593 198565 228607 291327 252466 222536 197992 212308 236197 254761 227559
15227 227559 231091 253640 229166 232403 269509 250620 229178 216189 187797 231367 244467 259006
15215 259006 273559 298754 315136 318229 296553 297751 344883 326345 307205 325675 289307 219502
15203B19502K4087Q4944L3614K2680m2030L470K1783l6447j7181M383o8657k0551
15191B29597K1945M3903k9397J0882N43J8052R282N9263J9913k9032N9917o278
15179D08590r3665k1933K9934K9981p9877l3202N5511K6499m9588k2109N9333
15168C09474J9010m8005n8297k502l7420L4669J6699n1489k3834R621j8688O6329
15156B15567P5315M9503P7394O725J194l1808Q692k382o864k8808P200Q5440Q2598
15143E39766R6471M5423j9030N6475N2228K1788M3531J12492N8506L1648L84j028
15131A038654L1774K0367n7313q3820o8185P7901N3078J9712m7600K3073J6625
15120A024266q78k2168q507q31J7739O5874L9685m4083J0805O0996L4192k1900
$$ plain form
15203 219502 243589 328533 362147 384827 342797 346267 368050 331603 314422 318805 250148 229597
15191 229597 251542 295445 266048 276930 277473 295525 304807 364070 383983 354951 414868 408590
15179 408590 314925 292992 322926 352907 273030 239828 295339 321838 272250 250141 309474
15168 309474 328484 280479 222182 219680 182260 216929 233628 182139 158305 167926 149238 215567
15156 215567 290882 340385 417779 424504 425698 393890 402582 400200 393336 364528 371728 457168 539766
15143 539766 636237 681660 662630 719105 771333 793121 836652 949144 1007650 1039298 1039682 1038654
15131 1038654 1070428 1090795 1033482 949662 881477 959378 1012456 1032168 984568 1007641 1024266
15120 1024266 1023388 1001220 992713 991882 1009621 1075495 1115180 1071097 1081902 1142898 1177090 1155190
15108A155190N26N0966L8855N15n3556j0550M7810P3063N3915L9240L4171N1873
15096A482018L7025l9911L3711N7801K8062N4588P6353N713m6323R268m075Q7204
15084A781434J8202o5311n1211l0679k0996L3059L2030k7535m8781Q344Q6839
15073A715395Q7638J23943L3601N5536P7288P7419O7302O6302N2653J09579O7942
15062B534598M4517J38230J14032J5360J3270L7422M6678R3195M8313R01K2165
15051C108681R0641J52349J43598J53299J16765J51401K20737J92522J80625K77225
15041D787843L46996M54741M55253M73142O11835O78151P93933R09795J059542
15032A0571231J239761J476978J826514K122584K417050K780199L228844L753935
$$ plain form
15108 1155190 1155716 1206682 1245537 1246052 1192496 1181946 1229756 1302819 1356734 1395974 1430145 1482018
15096 1482018 1519043 1479132 1512843 1570644 1598706 1653294 1729647 1735360 1689037 1698305 1694230 1781434
15084 1781434 1799636 1734325 1683114 1652435 1631439 1664498 1696528 1668993 1620212 1628556 1715395
15073 1715395 1803033 1926976 1960577 2016113 2093401 2170820 2238122 2304424 2357077 2466656 2534598
15062 2534598 2579115 2717345 2831377 2846737 2860007 2897429 2944107 3037302 3085615 3086516 3108681
15051 3108681 3199322 3351671 3495269 3648568 3765333 3916734 4137471 4329993 4510618 4787843
15041 4787843 5134839 5589580 6044833 6517975 7129810 7807961 8601894 9511689 10571231
15032 10571231 11810992 13287970 15114484 17237068 19654118 22434317 25663161 29417096
15024B9417096M275069M924646N756013O998260Q746977J1415376J5820828K2319077
15016A09673342L1033445M0859262N0439026N8030300O2273228O2032366N6880639
15009D71221608M6654118L1709356J3531892n131951k1707473l4617730m3217735
15002D58442085m7468191m8019876m5639648m1073914l5247123k9275931k4169142
14995A87548260k0223919j7078843j4542856j2313505j0407352q902979p659515
14988I6419291o530284n518590m607983l794786l202360k640877k268924k132963
14980F5722524k079567k137549k350977k585161k688617k704381k745155k760939
14972D5670178k570983k318645k071367j837605j748688j571277j383500j306732
$$ plain form
15024 29417096 33692165 38616811 44372824 51371084 60118061 71533437 87354265 109673342
15016 109673342 140706787 181566049 232005075 290035375 352308603 414340969 471221608
15009 471221608 517875726 549585082 563116974 557985023 536277550 501659820 458442085
15002 458442085 410973894 362954018 317314370 276240456 240993333 211717402 187548260
14995 187548260 167324341 150245498 135702642 123389137 112981785 104078806 96419291
14988 96419291 89889007 84370417 79762434 75967648 72765288 70124411 67855487 65722524
14980 65722524 63642957 61505408 59154431 56569270 53880653 51176272 48431117 45670178
14972 45670178 43099195 40780550 38709183 36871578 35122890 33551613 32168113 30861381
14964C0861381j169145j163150j103057j030255j057788r59019r63423r69768
14956B2445776q78583q34341q25221p68245o86176o62798n86454n51385m74455
14947A6178118m93161n06434m78758m36679l21240l32503l51064l28565l25545
14938A2604169k63369l33111l14910l40902l36733k86169l41434l05423l46978
14929I735140l46683l45469l15160k92864k36504k52084k26553k22768j98344
14920G298711j41883j39372j60515j53432q4411j30590r5966j12453q0514j05574
14910F094001q2128q4183j06867q3378j28380j33314j18405j40691j45471k15829
14900D855355k27429j97215j39182j71840k38244j54651j63065k03962j70556
$$ plain form
14964 30861381 29692236 28529086 27426029 26395774 25337986 24378967 23415544 22445776
14956 22445776 21567193 20732852 19907631 19139386 18453210 17790412 17203958 16652573 16178118
14947 16178118 15684957 15178523 14699765 14263086 13941846 13609343 13258279 12929714 12604169
14938 12604169 12340800 12007689 11692779 11351877 11015144 10728975 10387541 10082118 9735140
14929 9735140 9388457 9042988 8727828 8434964 8198460 7946376 7719823 7497055 7298711
14920 7298711 7156828 7017456 6856941 6703509 6619098 6488508 6392542 6280089 6199575 6094001
14910 6094001 6011873 5927690 5820823 5737445 5609065 5475751 5357346 5216655 5071184 4855355
14900 4855355 4627926 4430711 4291529 4119689 3881445 3726794 3563729 3359767 3189211
14891C189211j88205j44966r8110j37999j06532r5894j23705j04950p2315j02899
14881B013636o8349o8735j30427r4604l9715n6622j12290q0218n4227j3777J7863
14870A312535j2922o8772p2029l8173J6805q1331q3494J455M718q797M707L4807
14858A009509J981J6657N9455J7165l1330m6275L7768J8737j9618l2697j22699
14847I08653j4690r011l7039k2631K2277J7777m7824q0087l4797k981J3105m313
14835G08439k3933J4422K5452P528m1679J259l0485k3565l6608k2091N304n216
14823E78827l1263M0494l1798m7154M3297P511NL2245j6085k6864K5336o573l2979
14810E34999K6815k3801l2530j3555J964L584J7628l696J72L4474L2891o1034
$$ plain form
14891 3189211 3001006 2856040 2757930 2619931 2513399 2417505 2293800 2188850 2116535 2013636
14881 2013636 1945287 1876552 1746125 1651521 1611806 1555184 1442894 1362676 1308449 1294672 1312535
14870 1312535 1299613 1230841 1158812 1120639 1137444 1056113 972619 974074 978792 969995 974702 1009509
14858 1009509 1011490 1028147 1087602 1104767 1073437 1027162 1064930 1083667 1064049 1031352 908653
14847 908653 893963 884952 847913 825282 847559 865336 817512 737425 702628 699647 712752 708439
14835 708439 684506 698928 724380 731908 690229 691488 661003 637438 600830 578739 584043 578827
14823 578827 547564 588058 556260 509106 552403 559914 559919 592164 576079 549215 574551 567978 534999
14810 534999 561814 538013 505483 491928 493892 497476 515104 511408 511580 546054 578945 517911
14798E17911j0797J6102j9356j0760P2283m4048l7222m6623M109L952J2832R429
14786D67812l3053m3135p230j77k2856L9519Q5309j8049p1939L1568N2052L4001
14774E13822o6031n5817J6841K0537L9384M2442L0569J2724j3793m1263l0781
14763D68634N1315P6587j8606l2989n4878o0314n4721k6299n1747l6174J1924
14752B72732P1728p803p678l6584k6946J0247m6156k1553l6640L0281N047q061
14740A98614k9229m6748l7689K2171N3081L7743k7490m7462k4021l1350l9364
14729B8256M736N2885l3823J2889J461j2568k1989M400M6125j1271o6999k202
14717A900M3435L2648L8289M0614k1674j7079N7830N8865l3699J011J9845J5179
$$ plain form
14798 517911 507114 523216 503860 493100 565383 521335 484113 437490 441599 445551 458383 467812
14786 467812 434759 391624 384394 384217 361361 400880 486189 468140 396201 427769 479821 513822
14774 513822 447791 391974 408815 429352 468736 511178 541747 554471 540678 499415 468634
14763 468634 519949 596536 577930 544941 490063 429749 375028 348729 296982 260808 272732
14752 272732 344460 336657 328979 292395 265449 275696 229540 207987 171347 201628 206675 198614
14740 198614 169385 122637 84948 107119 160200 197943 170453 122991 98970 67620 28256
14729 28256 32992 85877 52054 64943 66404 53836 31847 36247 82372 71101 4102 1900
14717 1900 45335 77983 116272 156886 135212 118133 175963 234828 201129 202140 221985 237164
14705B37164K8001j0689j581K4662K639K9767m154j538k5936m664N991j651l6231
14692B41780m7669o3315p1555j3523K04p002k673m703J2217j7689K6683M9431
14680A02186K5175Q699L1197L7574J7395m4142R83j3216j7287l8004l4362k8727
14668D7471m0256J2356k6860q619M9327M1288j5193l6387k4138L912j8308M1852
14656B6445k4325o5759L8347R3770K4693j5925K2212l4836l6128k8883p17P931
14644F825N159k768k2576L0652n0574Q180L3485l6695m4516L3872L2235o2911
14632f9632o4970K8898P0398L4341k6629J7966O412K6964K3370k9296j5141L4891
14620C7572L8874k5788l6005J8065M873o8879k2739L5235K3656k9162j915j772
$$ plain form
14705 237164 265165 254476 252895 277557 280196 309963 305809 304271 278335 273671 279662 278011 241780
14692 241780 194111 130796 59241 45718 45922 38920 36247 31544 43761 26072 52755 102186
14680 102186 127361 136060 167257 204831 222226 178084 179067 165851 148564 110560 76198 47471
14668 47471 7215 19571 -7289 -15908 33419 74707 59514 23127 -1011 2901 -15407 26445
14656 26445 2120 -63639 -25292 68478 93171 77246 99458 64622 28494 -389 -1106 6825
14644 6825 11984 9216 -13360 17292 -33282 -25102 8383 -28312 -72828 -38956 -6721 -69632
14632 -69632 -134602 -105704 -35306 -965 -27594 -9628 -3216 23748 47118 17822 2681 37572
14620 37572 76446 50658 14653 32718 37591 -31288 -54027 -18792 4864 -24298 -26213 -27985
14608b7985r502n1227l915K18m129M1241M9633Q481k1692L6331J7957M128J3689
14595E3228p8n6140l85l891j4681K1507j6262j8966p734O5560k37l6546K0135
14582E510K5090K0678R921j9153J15181J04033M1058J03916P2716N8598J10381
14571F47929K13635K53894K96552K69763L05160L66050K46073J79386J38378P7881
14561B994701q0421j77719j97473k24615j97241k78059k35292k09579j03398j35812
14551A155092j35176r7582l3190j16334j10819o1946o5357o8741k8286m713q4393
14540C48555j8057P5436m3959l4496K0461k413N043L4832l2179l8337Q688m608
14528C18966m0323k2793L48k3878m4935k7741j5431K577L1751M0424k7056r1313
$$ plain form
14608 -27985 -37487 -88714 -92629 -92411 -96540 -55299 -5666 2815 -18877 17454 35411 39539 53228
14595 53228 53150 -2990 -3375 -7266 -21947 -440 -16702 -35668 -43402 22158 21921 -14625 5510
14582 5510 30600 51278 61199 42046 157227 261260 302318 406234 478950 537548 647929
14571 647929 861564 1115458 1412010 1681773 1986933 2352983 2599056 2778442 2916820 2994701
14561 2994701 2914280 2736561 2539088 2314473 2117232 1839173 1603881 1394302 1290904 1155092
14551 1155092 1019916 922334 889144 772810 661991 600045 534688 465947 437661 432948 348555
14540 348555 330498 405934 361975 327479 347940 345527 350570 385402 353223 314886 323574 318966
14528 318966 278643 255850 256198 232320 187385 159644 144213 146790 178541 218965 191909 100596
14516A00596m7276N3920J9950q307M725k8505J7881L6061J2156j0796j8125j7500
14504A14780j9139j9892j8564J34n3975k0256J1589L0864l190j017J3524L7046
14492G1904p0200M092L0122o9114L9358J8708J9248M360n8804l9071J2207J8447
14480a8743j0631P0R37J4071p666j1331Q2911J9328j2854k5358p6097k5433j6814
14467h7610R92Q354J5752M5494K3573l2081P195O861j8562M1446m285r759q928
14454a1558n519n4926K0302P026J6189J3401j5711J250n156k3864J6977L3760
14442g829J3227m1688k8092K1834P009j4995m3232l1343L6954N0860P3698M0925
14430G7328p100L8394j3487j8262k4015j5727K5782n4685k180p390n3794L0639
$$ plain form
14516 100596 53320 107240 127190 118883 123608 95103 112984 149045 161201 150405 132280 114780
14504 114780 95641 75749 57185 57319 3344 -16912 -5323 25541 22351 21334 34858 71904
14492 71904 1704 5796 35918 -33196 6162 24870 44118 48478 -10326 -49397 -37190 -18743
14480 -18743 -29374 -29304 -28367 -14296 -21962 -33293 49618 68946 56092 30734 -45363 -70796 -87610
14467 -87610 -86618 -78264 -62512 -17018 6555 -25526 -18331 -11470 -30032 11414 7129 -2630 -11558
14454 -11558 -17077 -72003 -51701 -44675 -28486 -15085 -30796 -29546 -34702 -58566 -41589 -7829
14442 -7829 5398 -36290 -64382 -42548 -35539 -50534 -93766 -125109 -88155 -37295 36403 77328
14430 77328 70228 108622 95135 76873 52858 37131 62913 8228 6048 -1342 -55136 -24497
14418b4497k3265J6828M6665J7891p367J8492o2010k6023l6338o940m05J6909
14406g0060O8050N410K4093j5792j6427l1750j5687N2640j8334k324l6230L0086
14394b6325P0842J0124m4276n1974q553N44m191L1344m2023o1293K6133k6207
14382a25855k0215L8479M2839J4228J472m0453P983K4896K3743o617k9297K3172
14370d5625L6827l454o450R874n764k3230N788k0707l046k6594P559r171O0579
14357b3414P529j879k0975n1253j044p021N2574Q5814j7182j7534l6346k8986
14345e9717k6169J8042J1210K4365K5643k1730M00m6022l341L476K3643k6686
14333g6886l8712P13Q7085J8071J0643J9213K5905J1972j5311p997o8791p6500
$$ plain form
14418 -24497 -47762 -30934 15731 33622 26255 44747 -17263 -43286 -79624 -86564 -86969 -70060
14406 -70060 -2010 3400 27493 11701 -4726 -36476 -52163 477 -17857 -20181 -56411 -26325
14394 -26325 44517 54641 10365 -41609 -50162 -49618 -53809 -22465 -64488 -125781 -99648 -125855
14382 -125855 -146070 -107591 -64752 -50524 -49052 -89505 -81522 -56626 -32883 -39500 -68797 -45625
14370 -45625 -8798 -12252 -18702 -8828 -14592 -37822 -32034 -52741 -55787 -82381 -74822 -83993 -23414
14357 -23414 -15885 -17764 -38739 -89992 -91036 -98057 -45483 40331 23149 5615 -30731 -59717
14345 -59717 -85886 -67844 -56634 -32269 -6626 -28356 -27956 -73978 -77319 -73843 -50200 -76886
14333 -76886 -115598 -114885 -27800 -9729 914 20127 46032 58004 42693 34696 -34095 -110595
14321a10595n0835K0595M2053L6041J7980l6783J0315J0987m8663l3355J4073
14310a28187J9856M6798J7347K055j7318k6202M3738J2393l8156l9808K968M8769
14298e5747R817N1819L3657K7722M966l0995k4413k5961l3036m0493j0434K0780
14286g2318J2257J2943j3156j9693q222O1245J2139j3805m0261j8374L8106P9520
14274C0381r072n0874K8691P899J574j0673k7601J2623J1665p791J6497j9867
14262a6548j6412m1163K9601J1505q0348p6711L2359M8187J9467O247K8165m2856
14250i8507j6971K0380L3920J6523K9402o051K1039p071K0207p205m4460J7502
14238b1292L1875j2728k8531Q867L072q734O368j642k5219J8275L8999j4288k6537
$$ plain form
14321 -110595 -161430 -140835 -98782 -62741 -44761 -81544 -71229 -60242 -108905 -142260 -128187
14310 -128187 -108331 -61533 -44186 -42131 -59449 -85651 -41913 -29520 -67676 -107484 -104516 -55747
14298 -55747 -45930 5889 39546 67268 72234 41239 16826 -9135 -42171 -82664 -93098 -72318
14286 -72318 -60061 -47118 -60274 -79967 -88189 -26944 -14805 -28610 -68871 -87245 -49139 30381
14274 30381 21309 -29565 -874 7025 8599 -2074 -29675 -17052 -5387 -13178 3319 -16548
14262 -16548 -32960 -74123 -44522 -33017 -113365 -190076 -157717 -109530 -90063 -83816 -55651 -98507
14250 -98507 -115478 -95098 -61178 -44655 -15253 -21304 -265 -7336 12871 5666 -38794 -21292
14238 -21292 10583 -2145 -30676 -21809 -18737 -27471 -21103 -22745 -47964 -29689 9310 -4978 -31515
14225c1515m8276n100K8343P0702M4370l0935l8619J8686K0851n815n590n4286
14213c7184q3696n2155m9023L908P3291N2329M5658J9886J7782m5262l0152J6900
14201f7718P4628K9672o4581l0330L0946J6906n7358j4697M8698K5062M9291J3118
14189E3637m4332j0244l8087l0417j7968j3326J456K300N0830K3650J8187n595
14177i909O796Q673l0481k7610J3349j2139J2320M9679j9159k2662J7696M012
14165i435N2815K0868k8737j018K999J7752j7915J9395L5737P267o0747l3070
14153E911L1467m1301n4399J5983O05L723l491O8873J7915L1406j1497m1610L7285
14140F0870M1144j3484j1934o2289k9707l3342L0449N449l9084P541k9864L5846
$$ plain form
14225 -31515 -79791 -84891 -56548 14154 58524 27589 -11030 7656 28507 22692 17102 -37184
14213 -37184 -120880 -173035 -222058 -218150 -144859 -92530 -46872 -26986 -9204 -54466 -84618 -67718
14201 -67718 6910 36582 -27999 -58329 -27383 -10477 -67835 -82532 -33834 -8772 40519 53637
14189 53637 9305 -939 -39026 -69443 -87411 -100737 -99281 -96981 -46151 -22501 -4314 -9909
14177 -9909 -3113 5560 -24921 -52531 -39182 -51321 -39001 10678 -8481 -31143 -13447 -9435
14165 -9435 43380 64248 35511 34493 37492 55244 37329 56724 92461 99728 38981 5911
14153 5911 37378 -3923 -58322 -42339 -41734 -38011 -41502 27371 45286 76692 65195 23585 60870
14140 60870 102014 88530 76596 14307 -15400 -48742 -18293 -12844 -51928 -44387 -74251 -38405
14128c8405M6199P453K7956k5625m9733k8882O658k4247l4288k0345N0621R574
14116g3064j256k6180L6401O9237j9073j8174L5425M6991P5966q8453k9751R494
14104A7563m0155m5499o0556m1563N9628L5534m4555m881O0843L7671k0565o0284
14092a06819n532P7515J4455j3898J8464j983L3844j4960n6181j5638l5434J8680
14080h7487P1025M5868k066J5413p8322o6527R3783q005k6947J5803L5515O397
14068A4450m7000Q287k3596K163J392j5683k4706K387M6477O9935O2752J1788
14056A08646n9271k9289l2857j7008M076m2636L6971K6477Q50n0138K2111O1268
14044B9200k0771l1273K978m3622j9101J0276J1545O3204j1362m6608k3347r612
$$ plain form
14128 -38405 7794 15247 43203 17578 -32155 -61037 -54379 -78626 -112914 -133259 -82638 -73064
14116 -73064 -74320 -100500 -64099 5138 -13935 -32109 3316 50307 126273 37820 8069 17563
14104 17563 -22592 -68091 -128647 -170210 -110582 -75048 -119603 -124484 -63641 -25970 -46535 -106819
14092 -106819 -112351 -34836 -20381 -34279 -15815 -17798 16046 1086 -55095 -70733 -106167 -87487
14080 -87487 -16462 29406 27340 42753 -35569 -102096 -8313 -16318 -43265 -27462 8053 14450
14068 14450 -32550 -24263 -47859 -45696 -44304 -59987 -84693 -82306 -35829 34106 96858 108646
14056 108646 49375 20086 -12771 -29779 -25703 -68339 -31368 -4891 -4041 -54179 -32068 29200
14044 29200 8429 -22844 -19866 -63488 -82589 -72313 -60768 2436 -8926 -55534 -78881 -88493
14032h8493k3713p540K9793J0569k7351n396J8281k541K6948l4024k495K2101
14020h3861M444K7553p720j3326l267l66L9258m5570O359m562j6497L4204N6130
14007g221K024r372m3032j8003N8922J3968J4870o1577K7765K2951m12K8289N7242
13994H6414Q7058M7233k7709k0712N8472M8833O8648J01022l688m0839m4444n4135
13982C06153K5566L2123m3790o5895p5131o3929q5783l1704J1105l5070N5589
13971B9234J1352r755k2683P872J0365K1042M1417J5918k4189Q386p0498K5446
13959D3907L2297q719K5060k5608q4454M0616O9101p286p8857J5171N8926j9315
13947F0839k9098j0631n0464K802L1987k2071j028N4836J0130O824n1752M97N5377
$$ plain form
14032 -88493 -112206 -119746 -89953 -79384 -106735 -112131 -93850 -96391 -69443 -103467 -105962 -83861
14020 -83861 -79417 -51864 -59584 -72910 -76177 -76543 -37285 -82855 -76496 -81058 -97555 -63351 -7221
14007 -7221 -5197 -14569 -57601 -75604 -16682 -2714 12156 -49421 -21656 1295 883 29172 86414
13994 86414 173472 220705 192996 172284 230756 279589 348237 449259 445571 404732 360288 306153
13982 306153 331719 363842 320052 254157 179026 115097 29314 -2390 8715 -26355 29234
13971 29234 40586 30831 8148 16020 26385 47427 88844 104762 80573 88959 18461 43907
13959 43907 76204 67485 92545 66937 -17517 23099 92200 84914 6057 21228 80154 60839
13947 60839 31741 21110 -29354 -26552 5435 -16636 -17664 37172 47302 54126 2374 2871 58248
13934E8248N0500J36250J49613J66212R5234R1981J35288J11497R3151L324n4012
13923A037286r4158p9355j76831q6738n9117p7604r4598q7765q2086p0898P780
13912A35916L4485q159l3292J74k2492N486k2j2164j7572j008l9414k2730N9182
13899G8390J4415J5163K5353l3709k7331K7459J6509K4198o5341n6595N4919M2649
13887A16079n7737l9055K8074j4619o2802o157L7587P9653J7801p3562j0192J9824
13875C4894L3167k1120q809J0471l7801k0115j0570j3494r346J7486L4382j3484
13863d339N234K6883K819l8586o0307M3938L6497K3594j1485m4828j103l527K9707
13850D497j9414j6192k1906K1473N406P46N466j8931O767K6943L874m1143l5970
$$ plain form
13934 58248 108748 244998 394611 560823 656057 748038 883326 994823 1087974 1091298 1037286
13923 1037286 943128 863773 686942 600204 541087 463483 368885 281120 199034 128136 135916
13912 135916 170401 162242 128950 129124 106632 112118 112096 99932 82360 81352 41938 19208 78390
13899 78390 92805 107968 133321 99612 72281 99740 116249 140447 75106 18511 73430 116079
13887 116079 58342 19287 47361 32742 -30060 -36217 1370 81023 98824 25262 15070 34894
13875 34894 68061 46941 38132 48603 10802 -9313 -19883 -33377 -42723 -25237 9145 -4339
13863 -4339 895 27778 30597 -7989 -68296 -24358 12139 35733 24248 -20580 -21683 -25210 4497
13850 4497 -14917 -31109 -53015 -31542 -26136 -25390 -19924 -38855 -32088 -5145 -1271 -42414 -78384
13837g8384K6254J9606K7431n895j2824M2644n944m2303k4267k6630k5324M5610
13825f0026J9973N8782N8176l0061m9075o0225k1566N7048k1960l0467N5822R1236
13813F7657O1656n0291o8430m4975L381k6292l4430l1256K050Q60J4955M4770
13801f0345k803J6082n7797j8650K7811M3533L4417o243j0784k1798j1223N0666
13789a7134Q1172j5497r0277k7725m3877R846n576L7650J852J6036m3505l9852
13777a36887J1593N5752J8529K968j494M770J9898l1501j0967k3713j7372J3158
13765i5266K1049j3052K9657M9284k581o2792k966o445O147L2891k3701j3416
13753h1191J0955L4530L6498J510J7070k4864j4812N172K6503m215k6568k4739
$$ plain form
13837 -78384 -52130 -32524 -5093 -10988 -23812 18832 12888 -29415 -53682 -80312 -105636 -60026
13825 -60026 -40053 18729 76905 46844 -2231 -62456 -84022 -26974 -48934 -79401 -23579 67657
13813 67657 129313 79022 10592 -34383 -31002 -57294 -91724 -122980 -120930 -120070 -105115 -60345
13801 -60345 -63148 -47066 -104863 -123513 -95702 -52169 -17752 -23995 -34779 -56577 -67800 -17134
13789 -17134 64038 48541 -41736 -69461 -113338 -103492 -109068 -71418 -69566 -53530 -97035 -136887
13777 -136887 -125294 -69542 -51013 -48045 -49539 -44769 -24871 -56372 -67339 -91052 -108424 -95266
13765 -95266 -74217 -87269 -57612 -8328 -10909 -73701 -76667 -83112 -76965 -44074 -67775 -81191
13753 -81191 -70236 -35706 792 2302 19372 -5492 -20304 -15132 11371 7156 -19412 -44151
13741d4151J277N7940j4806J6132k1519k9614l6951j1387m295N9867J4990J1497
13729a020J7997Q9733K8549O899l8913j0075j2525k003m2881j9789L4325p554
13717D2743m3475l0417j9309L2441J7246J6106p550l9036k2803o4507r701K283
13705a25979K8965J8478m3511j3031K6920N4249m328N660l7265l2975L6294n311
13693i1834n382P0321K1942L3054J7211m0297o7063o516L47K447j3912M1939Q0145
13680D2402n8156m8391J7884N3123J2000o2538L0073l8813O752j3160j8149l5072
13668a12045k8732J623M3928N3737k9296k2823J4825J3517N4082M2761J8116k5445
13656B4248M303L23J6442j6193n9445J3549n645n0997m3653K7135Q5456N6711
$$ plain form
13741 -44151 -42874 15066 260 16392 -5127 -34741 -71692 -83079 -87374 -27507 -12517 -1020
13729 -1020 16977 106710 135259 142158 103245 93170 80645 78642 35761 15972 50297 42743
13717 42743 -732 -31149 -50458 -18017 -771 15335 7785 -31251 -54054 -118561 -128262 -125979
13705 -125979 -97014 -78536 -122047 -135078 -108158 -53909 -58237 -52577 -89842 -122817 -86523 -91834
13693 -91834 -97216 -26895 -4953 28101 45312 5015 -62048 -68564 -68217 -65770 -79682 -37743 42402
13680 42402 -15754 -64145 -46261 6862 18862 -43676 -13603 -52416 -45664 -58824 -76973 -112045
13668 -112045 -140777 -139154 -95226 -41489 -70785 -93608 -78783 -65266 -11184 31577 49693 24248
13656 24248 28551 28874 45316 29123 -30322 -16773 -22418 -73415 -117068 -89933 -4477 52234
13644E2234K7832J3874m4527o8602K2244l2710j4333J8789j0713J2895l408K4593
13632a832P6047L7918m0228j7538o431l2792k5011P7181J3436j6587J3440j0069
13620F7534O526k0042j0745n134m4931j7155K8379P6583K2374j1934J6858J3812
13608A22125j0294j5442m3200j4055R306M6794L2047p4860n6895Q3998j61r2210
13596a2847P193L2684N5573J2714j27L1018O4122M0084M3947O813j2884M4008
13584C12298P0171M1256j0558L7073K7402N7437M6666K5641Q1506N7553O9665
13573H16110J31358J03161J11155R3657J44653K67513K63811L16035L56277M58693
13563C062423N09261N57628N41145M22820L28823K41239l6012j68475k65294l10317
$$ plain form
13644 52234 80066 93940 49413 -19189 3055 -29655 -43988 -25199 -35912 -23017 -26425 -1832
13632 -1832 74215 112133 71905 54367 47936 15144 -9867 67314 80750 64163 77603 67534
13620 67534 74060 54018 43273 38139 -6792 -23947 4432 81015 103389 91455 108313 122125
13608 122125 111831 96389 53189 39134 48440 95234 127281 52421 -4474 79524 79363 -12847
13596 -12847 -5654 27030 82603 95317 95190 126208 190330 230414 274361 281174 268290 312298
13584 312298 382469 423725 413167 450240 477642 535079 581745 607386 688892 746445 816110
13573 816110 947468 1050629 1161784 1255441 1400094 1667607 1931418 2247453 2603730 3062423
13563 3062423 3571684 4129312 4670457 5093277 5422100 5663339 5627327 5458852 5193558 4883241
13553D883241l61587m66030n12489l83551l30713k89127k62071k29885j99338
13544A848450j94656j17825m6560o9502n4746m5923k713J0035j8299R867L9306
13533A357434R3107J09201J26812K55489M02569L75368M28677M93516N47962M54225
13523D644360M07046K57408J26775j10340j44798k05051l40884m32231m28709
13514C773576m18122m29357l55860k78776k17932k10013j71734k20616j32648
13505A338518r4079j58507o2375l5270o2348o0983n289N405J1875n2885q6718
13494G37344q8806p9190q734M4362m7291j6497k4990K8515l1091o8266o140j2493
13482D26723j0922j4896k8906l4842K9961o054p8078M3376j323M1041q721j13028
$$ plain form
13553 4883241 4521654 4055624 3543135 3159584 2828871 2539744 2277673 2047788 1848450
13544 1848450 1653794 1535969 1489409 1419907 1365161 1319238 1316525 1326560 1308261 1318128 1357434
13533 1357434 1450541 1559742 1686554 1942043 2344612 2719980 3148657 3642173 4190135 4644360
13523 4644360 5051406 5308814 5435589 5325249 5180451 4975400 4634516 4202285 3773576
13514 3773576 3355454 2926097 2570237 2291461 2073529 1863516 1691782 1471166 1338518
13505 1338518 1244439 1085932 1023557 988287 925939 864956 859667 865072 876947 824062 737344
13494 737344 648538 569348 560614 604976 557685 541188 516198 544713 513622 445356 439216 426723
13482 426723 415801 400905 371999 337157 367118 361064 282986 326362 325039 366080 357359 244331
13470B44331n442m0555o2846k0172O5544J5953J6087Q689n7035n8856J096N9879
13458A66673l7549j3976k1516l853M085P12K6049N7045O085J2521j5408k4913
13446A55955p235l506K0012N159k0997J6839O429k0358l285l1748m4799n054L0851
13433I8263k8588K152m335l4473J1820J6436R951k7140j1094m917n624L1836M4208
13420I8495J1596J155n5778J4485j6566m4577L6771N6773K2479L2996R006k0597
13408A46238k6036K486r6080j4053M9934k3023j6948n0909J0697K5993Q892j851
13396A5340j6281o907O7008L1178J9351o2930l2061L0729K2178L8430k8962j5788
13384F1285k7530j5208j2218K9217k5064K6125k092n5853n2408J5394L6803L8146
$$ plain form
13470 244331 238889 198334 135488 115316 180860 196813 212900 221589 164554 105698 106794 166673
13458 166673 129124 115148 93632 89779 93864 94576 120625 177670 183755 196276 180868 155955
13446 155955 148720 145214 165226 170385 149388 166227 172656 152298 149013 117265 72466 67412 98263
13433 98263 69675 71827 67492 33019 44839 61275 71226 44086 32992 28075 22451 54287 98495
13420 98495 110091 111246 55468 69953 53387 8810 45581 102354 124833 157829 166835 146238
13408 146238 120202 122688 26608 12555 62489 39466 22518 -28391 -17694 8299 17191 15340
13396 15340 -941 -7848 59160 90338 109689 46759 14698 45427 67605 106035 77073 61285
13384 61285 33755 18547 6329 35546 10482 36607 34515 -21338 -73746 -58352 -21549 16597
13372A6597M0859Q761l373l8552k8780l152K8066L1013P9310N3326r665q0164
13360I4246r749j0689l5086j1461L9272l1441j9463l9247L6712N2239R790l8688
13348C6435n5491j5622L7631K3289j9712l6016L2816J8359M9858J4233L5595r144
13336A12231K3557k6537q6K3740j0207n6547o9211M934k8759M128N9024L9217
13324G5484K336Q363k0802j0864J6180j6016l4464k0488J7579j0385k268j558
13312C097K9930L7784j4470o3895r0526L463R34L6964M2101q421k8426N175P885
13299c8405K2625m3072m5341j0233M8511l979M1543L0734k0782o4029N487K5169
13287e1772M0892Q9817n8074l794L9985o4969m7202L2434K1052K5533Q085J7436
$$ plain form
13372 16597 57456 66217 62844 24292 -4488 -7640 20426 51439 130749 184075 174410 94246
13360 94246 84497 73808 38722 27261 66533 35092 15629 -23618 13094 65333 75123 36435
13348 36435 -19056 -34678 2953 26242 6530 -29486 3330 21689 71547 85780 121375 112231
13336 112231 135788 109251 109165 132905 122698 66151 -3060 1874 -26885 -22757 36267 75484
13324 75484 77820 86183 65381 54517 70697 54681 20217 -271 17308 6923 4655 3097
13312 3097 33027 70811 56341 -7554 -98080 -94617 -93683 -56719 -14618 -23039 -51465 -46290 -38405
13299 -38405 -15780 -58852 -104193 -114426 -65915 -69894 -28351 2383 -18399 -82428 -76941 -51772
13287 -51772 -10880 78937 20863 17069 57054 -7915 -55117 -22683 -1631 23902 31987 49423
13275D9423k1327L8413L9961m9427k3037J5414k2477l5499m997K2814J4649k5543
13263a633J0799l078k0937O425m3990j7282P994L4545k8193j0100M7734L50j5497
13250c2863k0473j296K8708o973M65P7210K9401k9093o804k9756k8770M6878l1367
13237d733r029J4263j0343K7675J0319o759k9074l2755J4535O513K1779N6561
13225E8952J1156j0912J2035m6102l8686J4386j2919m7243Q2L565O1880N6368
13213F2562N517j5841j9412L2811k0198J121J2154o0505j1584L0630K4886k1454
13201B0687J9758Q782J1181J8551L296o7602j9946M2280N086j2923J1400k028
13189C8522k870L1619K5575L492J3757L7966k8833p0361j7673Q978J941j0966
$$ plain form
13275 49423 28096 66509 106470 57043 34006 49420 26943 -8556 -13553 9261 23910 -1633
13263 -1633 9166 6088 -14849 -8424 -52414 -69696 -61702 -27157 -55350 -65450 -17716 -17366 -32863
13250 -32863 -53336 -54632 -25924 -32897 -32432 44778 74179 45086 38282 8526 -20244 26634 -4733
13237 -4733 -13762 501 -9842 17833 28152 21393 -7681 -40436 -25901 -19388 2391 58952
13225 58952 70108 59196 71231 25129 -13557 829 -12090 -59333 -59251 -55686 6194 62562
13213 62562 68079 52238 32826 65637 45439 46560 58714 -1791 -13375 17255 42141 20687
13201 20687 40445 49227 60408 78959 82255 14653 -5293 36987 42073 29150 40550 38522
13189 38522 35652 67271 92846 96338 110095 148061 119228 48867 31194 40172 42113 31147
13177C1147L023j1230Q715R8142J6318r0370o3679m0764k4549j1720L0264Q9449
13165C4746j7993m9793J1641L1534L6246r584m8865K1240Q18l091K5836N2046
13153H4781L1192p6493j9937M6606m225l1512L6275L8210l3446l0104j4768J9475
13141D6054k538K5650J7066k1549J3616j0701L8612o2811r8051q502L5248O3132
13129C5226O9997N829J2312m0715o142P103K6633K52M5164M3746O791M5117N2233
13116C03546n108J1099L5826J09046J23189J09872J56899K21474K58256L05414
13106A629513K66014L11136K79047J86538J05259K9694n4177j21337j93958k16789
13096B220940j85484k46677k22325j72714j47092j17161r3092j30739j10051j09932
$$ plain form
13177 31147 34170 22940 31655 129797 146115 55745 -7934 -48698 -73247 -84967 -54703 34746
13165 34746 16753 -33040 -21399 10135 46381 36797 -12068 9172 9990 6899 32735 84781
13153 84781 115973 39480 19543 66149 61924 30412 66687 104897 71451 41347 26579 46054
13141 46054 43516 69166 86232 64683 78299 67598 106210 43399 -54652 -63154 -27906 35226
13129 35226 105223 111052 123364 82649 76507 83610 110243 110495 155659 199405 206196 251313 303546
13116 303546 298438 309537 345363 454409 577598 687470 844369 1065843 1324099 1629513
13106 1629513 1895527 2206663 2485710 2672248 2777507 2807201 2753024 2631687 2437729 2220940
13096 2220940 2035456 1788779 1566454 1393740 1246648 1129487 1036395 905656 795605 685673
13086F85673n8772N834m0740n5079k9781n0933k5715j7477j1887J7056l8376o7757
13074C12046O833L412K0952n7626l7355l2346n0981m027J1942R483r469l8267
13062A34597J916L5108K3243j6488j9410J2453m1849L57K7796j7166L9652j5821
13050A64388j3408q199p678J0250o08O88M5376K836k1309l6622J5395j8882K7159
13037A59386K2340k396m75P493k3127k1436J3792J0233m0963N732K6596K5934
13025A83109J4660k6053k0682J0893Q428l335k2858R248k0808p815k5911M1808
13013A40684j7901N183j4759m1990l1958j9759P0090n7424k4594K3789J2890L356
13001D7607L3654P345j903K9975m8932K1680J5093m1921l6603k4114m0481j2754
$$ plain form
13086 685673 626901 632735 591995 536916 507135 456202 430487 413010 401123 418179 379803 312046
13074 312046 318879 322291 343243 285617 248262 215916 164935 160908 172850 182333 172864 134597
13062 134597 136513 171621 194864 178376 158966 171419 129570 129927 157723 140557 180209 164388
13050 164388 150980 142781 135103 145353 144745 145433 190809 193645 172336 135714 151109 132227 159386
13037 159386 181726 179330 178855 186348 163221 141785 155577 165810 124847 130579 157175 183109
13025 183109 197769 171716 151034 161927 170355 167020 144162 153410 132602 124787 98876 140684
13013 140684 122783 127966 113207 71217 39259 19500 89590 32166 7572 31361 44251 47607
13001 47607 81261 88606 86703 116678 67746 89426 104519 62598 25995 1881 -38600 -51354
12989e1354j0626k6089m3419l6888J1952K050n275l2264m234j1932J6138Q3790
12977a08151J7198k9829k6933K7472L5926L847K1799O7964n784R453L2396Q464
12965E3822Q077O8620N6252q232L2111j8155K1327l468n834l3487j0479j2742
12953A47812n8161K2698K6977l897K8405L096j8030n515Q6797j9636k4506M0686
12941B26726m794l4286N3004Q1138N5509J358k8336L4931M3562N365j6895L8049
12929D55331Q848l976j7216J6931k5239k8859j8866m1954j02702l206K8302K0498
12917B87892P940o7043l2496P8756J160o3778k2575K1659O965K662j4201k063
12905B04878P330k5919j2850M7215k1323j504l3137m8030O208M5974M2069M965
$$ plain form
12989 -51354 -61980 -88069 -131488 -168376 -156424 -154374 -159649 -191913 -196147 -208079 -191941 -108151
12977 -108151 -90953 -120782 -147715 -120243 -84317 -80470 -58671 9293 3509 12962 45358 53822
12965 53822 61899 130519 186771 178539 210650 192495 213822 210354 204520 171033 160554 147812
12953 147812 89651 112349 139326 135429 163834 166930 148900 143385 230182 210546 186040 226726
12941 226726 221932 187646 240650 321788 377297 378655 350319 385250 428812 434177 417282 455331
12929 455331 464179 460203 442987 459918 434679 405820 386954 345000 242298 239092 267394 287892
12917 287892 295832 228789 196293 275049 276209 212431 189856 211515 218480 221142 206941 204878
12905 204878 212208 186289 173439 220654 199331 197827 164690 116660 122868 168842 210911 215876
12893B15876O46N8989N0175M6490J5596M5408J2807j5222k5104m0150L1838K1228
12881D18577n8296n0951k8787M4643j5583K641J441K9495K1532J9422K6207j1882
12869C98459k1166j770l4307J057J6423L65j9635k3485n8280N465K6369l1620
12857B57875k7461M2126K2844j6989k4868K30M4210L5474k0901K5349l3352o5535
12845B39002m8299J1773Q3585J3412k3994K532j2386k6422J0472L7972n4121o1515
12833A72011J2296k2624M3332j079j6027j3744L2083Q4361M9289N2974K7101j5261
12821D04712L470P49P044L3912K8664K2776O7353J5880J4349O4804L6249K8087
12809G28049J19453Q1047R1767J12872O2074L8091O155k2511o8252q6093r944
$$ plain form
12893 215876 216522 275511 325686 372176 387772 433180 445987 430765 405661 365511 397349 418577
12881 418577 360281 309330 280543 325186 309603 312244 313685 343180 364712 384134 410341 398459
12869 398459 377293 375523 341216 342273 358696 359061 339426 315941 257661 263126 289495 257875
12857 257875 230414 272540 295384 278395 253527 253757 297967 333441 312540 337889 304537 239002
12845 239002 190703 202476 286061 299473 275479 278011 265625 239203 249675 287647 233526 172011
12833 172011 184307 161683 205015 203936 187909 174165 206248 290609 339898 392872 419973 404712
12821 404712 408182 408931 415975 449887 478551 501327 568680 584560 598909 663713 699962 728049
12809 728049 847502 928549 1020316 1133188 1195262 1233353 1239508 1216997 1148745 1062652 1052708
12798A052708L2021j733O4866P1909R1952M2783q4742p2078o6336N951o34L5841
12786A172508k9955j7509J2728K1975K7736J8546J440j0158n806k0073j5072J7286
12774A173646N7524N0500Q8353Q3404l120j6762M7117M5085P2773P4069N4198
12763A726787P0711M9515k0725m9548p267M7764M8692K5976j6209Q064N201j3837
12751A875124N609j8687n8563o1447J2779N9697N4437L1772O1132R5216R7920
12740B154989P6873J04071J49109L6197O1030N0537R5357J38189R4116R4884L6078
12729C091430Q0474P6719R4379J13167J21236J31135J40105J47316Q3037J73567
12719D252565J73859K24776K42995K60250K33735L01093L47887L72699N03507
$$ plain form
12798 1052708 1084729 1082996 1147862 1219771 1311723 1354506 1269764 1197686 1131350 1137301 1136667 1172508
12786 1172508 1142553 1125044 1137772 1159747 1187483 1206029 1207469 1197311 1191505 1171432 1156360 1173646
12774 1173646 1231170 1281670 1370023 1453427 1450307 1433545 1480662 1525747 1598520 1672589 1726787
12763 1726787 1797498 1847013 1826288 1776740 1769473 1817237 1865929 1891905 1875696 1883760 1888961 1875124
12751 1875124 1880733 1862046 1803483 1742036 1754815 1814512 1868949 1900721 1961853 2057069 2154989
12740 2154989 2231862 2335933 2485042 2521239 2582269 2632806 2728163 2866352 2960468 3055352 3091430
12729 3091430 3171904 3248623 3343002 3456169 3577405 3708540 3848645 3995961 4078998 4252565
12719 4252565 4426424 4651200 4894195 5154445 5388180 5689273 6037160 6409859 6913366
12710F913366N62934N57357N68018P13200R32858J036987J087886J289931J528263
12701A5190800J741162J961626K245797K720269L168482L614193M202580M790667
12693C9635576N545981O587000Q025616J0126788J3332479J7962694K4268556
12686A25484690L2028362M0063612M7105065N2260475N4450667N2608840M6601993
12679D50603704L6756475K3369604P809103p429303k0813209l1748427l9043426
12672D19504521m1876515m1573008l9664771l6377488l1683934k6777592k2392912
12665A79158301j8850079j6034424j3637325j1690414j0109197q768267p711091
12658I2357504o721371n937186n316395m694318m148520l706740l289363k930685
$$ plain form
12710 6913366 7476300 8033657 8601675 9314875 10247733 11284720 12372606 13662537 15190800
12701 15190800 16931962 18893588 21139385 23859654 27028136 30642329 34844909 39635576
12693 39635576 45181557 51768557 59794173 69920961 83253440 101216134 125484690
12686 125484690 157513052 197576664 244681729 296942204 351392871 404001711 450603704
12679 450603704 487360179 510729783 518538886 511109583 490296374 458547947 419504521
12672 419504521 377628006 336054998 296390227 260012739 228328805 201551213 179158301
12665 179158301 160308222 144273798 130636473 118946059 108836862 100068595 92357504
12658 92357504 85636133 79698947 74382552 69688234 65539714 61832974 58543611 55612926
12650E5612926k654591k467724k389275k156967k008942j881275j796144j708004
12642C8550004j557698j377630j300222j246932j129058j169815j041839j000429
12634B8726381r80794r57828r08061r09366q90697r21161q49062q63692q44200
12625B0601520p15087o58682o12773n98033n66106n54743n31371m50927m43544
12616A5470254l68184l84494l59782l04206k57368k91115l41425l07976k72721
12607A2582983j72236j87232k17803k22892j50867q8153j40383k06120l11451
12598A0885846l21840k58198l03746l60223l48315k81153k79477l16218k97667
12589H119009k71460j93430j89814j89823j94313j32292j17477j26992q3769j73929
$$ plain form
12650 55612926 52958335 50490611 48101336 45944369 43935427 42054152 40258008 38550004
12642 38550004 36992306 35614676 34314454 33067522 31938464 30768649 29726810 28726381
12634 28726381 27745587 26787759 25879698 24970332 24079635 23158474 22309412 21445720 20601520
12625 20601520 19886433 19227751 18614978 18016945 17450839 16896096 16364725 15913798 15470254
12616 15470254 15102070 14717576 14357794 14053588 13796220 13505105 13163680 12855704 12582983
12607 12582983 12410747 12223515 12005712 11782820 11631953 11543800 11403417 11197297 10885846
12598 10885846 10564006 10305808 10002062 9641839 9293524 9012371 8732894 8416676 8119009
12589 8119009 7847549 7654119 7464305 7274482 7080169 6947877 6830400 6703408 6619639 6445710
12579F445710j05732n0110j61047j48572j32963r2404j43228j92772j64773j76225
12569E077884j56895q5884q8162p6799j05946p2456j39162q6399o3467j66618
12559D036096j90895j80476j37576j68541j99723j09832j12958r5803j5328k753
12549B822211M3915J15182Q8025P2328K6485k4212k7599m6118j10860j85894j38674
12538B634789j03577j03192j14710j18759n8834j22044m8483j1635K0163m152
12528A969566O864j09290j22711J2441N20p327q2483n3773L0405l3942o4483j02033
12516A443754j7513m6516m0559j7403l9830p3177j800L2688l4480J2800K3334
12505A241298j6543m5470l484n5677k7181Q3756J23637L3422N8484O8680Q5488
$$ plain form
12579 6445710 6339978 6289868 6128821 5980249 5847286 5754882 5611654 5418882 5254109 5077884
12569 5077884 4920989 4835105 4746943 4670144 4564198 4491742 4352580 4266181 4202714 4036096
12559 4036096 3845201 3664725 3527149 3358608 3158885 3049053 2936095 2840292 2824964 2822211
12549 2822211 2866126 2981308 3069333 3141661 3168146 3143934 3116335 3070217 2959357 2773463 2634789
12538 2634789 2531212 2428020 2313310 2194551 2135717 2013673 1965190 1953555 1973718 1969566
12528 1969566 1976430 1867140 1744429 1756870 1757390 1750063 1667580 1613807 1644212 1610270 1545787 1443754
12516 1443754 1426241 1379725 1339166 1321763 1281933 1208756 1206956 1239644 1205164 1217964 1241298
12505 1241298 1224755 1179285 1175801 1120124 1092943 1176699 1300336 1333758 1392242 1460922 1546410
12494A546410J23440J26139J61012J34884N5780P7603J13500J0126l5923j18055
12484B194916j20158p9553o1197r7955j60461q6172j13898q4489k5846k5482n0456
12473A289249p3043m2918p5977j05713n5196K412l4182o3450j0770J8764m850
12462H44326m4794n5707N1025K4171k8756N825J3363J5697K1962R712k6067J1338
12450H42095k7606n9293O7285K9122K3522M1034O433k1121l7048k8215k1481M2985
12438H57712j7629k1131J9203j335k6397q605o730K9909j4616k0415L6771J3272
12426H40009K5014K0435J7541L8170J45463J75882R4084N9886o7042n7421j08730
12415A183291j33634j04261o1729r3326l7792k7995n6081l1222K1367j2244j08127
$$ plain form
12494 1546410 1669850 1795989 1957001 2091885 2147665 2225268 2338768 2348894 2312971 2194916
12484 2194916 2074758 1995205 1934008 1836053 1675592 1589420 1475522 1391033 1365187 1339705 1289249
12473 1289249 1216206 1173288 1097311 991598 936402 938814 904632 841182 830412 849176 844326
12462 844326 799532 743825 794850 819021 790265 796090 809453 825150 847112 856824 830757 842095
12450 842095 814489 755196 822481 851603 875125 916159 922592 901471 864423 836208 814727 857712
12438 857712 840083 818952 838155 836820 810423 801818 795088 824997 810381 789966 826737 840009
12426 840009 865023 885458 902999 941169 1086632 1262514 1356598 1416484 1349442 1292021 1183291
12415 1183291 1049657 945396 883667 790341 752549 724554 668473 637251 658618 646374 538247
12404E38247l2466j6196m478j0166o0821j8391l6054q4017m6950K4647k1485M2105
12392B73975j92J1112K4620J6645j304L4912K9023O0602K7504p713L617l0938
12380D41863o1333j2719R238l4618j9126L9062R0330L9039m682q525J4579k4319
12368D68789l1304o7566o3059j7796K4661k6588k4072q573r973n7760q330L4834
12356B13263L5311J1478l1517Q976l133j381N2508k9451m4192p2077r446k3069
12344A07270K2742K3380P1652M6743m6517m5522j0439k1886j5219k1334K5948
12333A36818J3468j0240l1141o343N0766j6736j2005O865K6964L4862j0345m9781
12321A33152k7089l2648k1037L4076Q1434L7120K3513m137n3210o870O4724Q20
$$ plain form
12404 538247 505781 489585 485107 474941 414120 395729 359675 275658 228708 253355 231870 273975
12392 273975 273783 284895 309515 326160 324856 359768 388791 449393 476897 469184 472801 441863
12380 441863 380530 367811 377049 342431 323305 362367 452697 491736 487054 478529 493108 468789
12368 468789 437485 369919 306860 289064 313725 287137 263065 254492 244519 186759 178429 213263
12356 213263 248574 260052 228535 237511 234378 232997 285505 256054 211862 139785 130339 107270
12344 107270 130012 153392 225044 271787 225270 179748 169309 147423 132204 110870 136818
12333 136818 150286 140046 108905 102562 153328 136592 124587 131452 158416 193278 182933 133152
12321 133152 106063 73415 52378 86454 167888 205008 228521 224384 171174 164304 229028 229848
12309B29848m2960j097j7841l5295L360K2737M3349j7293q5115l519N5573O6355
12297B18102p592j9045q399j1537j3557m1301k9966P112o093P389p763L6540N9720
12284A83610M4352j5516j08210K3263L7640k2071k7972O074R3240N677l1773O982
12272A95296k1975l6868l6954j5831P2798K4256N6255L4774K7592M1198N1159
12261C91700O2204J7213K5589K9815J15567J42928K37750L21529K74220K46070
12251A864585K34729K41783J83312J65799O4633p6307m6840j07594j96488k17739
12241B109873k61567k01003j93953j87193j45970j33028j06505j03190o3353l6393
12231F77718k3773O514m9227k5188n7030k6202j4372o1784o669K5642k7521q722
$$ plain form
12309 229848 186888 185791 167950 132655 136015 158752 202101 184808 99693 96174 151747 218102
12297 218102 210510 191465 183066 171529 157972 116671 86705 93817 87724 95113 87350 123890 183610
12284 183610 227962 212446 104236 127499 165139 143068 115096 121170 214410 220087 188314 195296
12272 195296 173321 136453 99499 83668 156466 180722 236977 271751 299343 340541 391700
12261 391700 453904 471117 496706 526521 642088 785016 1022766 1344295 1618515 1864585
12251 1864585 2099314 2341097 2524409 2690208 2754841 2678534 2631694 2524100 2327612 2109873
12241 2109873 1848306 1647303 1453350 1266157 1120187 987159 880654 777464 714111 677718
12231 677718 653945 660459 611232 586044 529014 502812 488440 426656 419987 445629 418108 409386
12219D09386l1869n3679j7283M5644m4743J4193J7482j1490l3940k7658K9185
12208B95228M7986l9987m3362o59L7688j2091o7064j1865L0355L4179Q086k8388
12196B50106k8442j9055k7498Q744M617k0242o5322k7055m491O5983J285m9429
12184H9201j2393J3245r146l6817K9445O4891j3577P998j68k3873k4098p738M4181
12171A21151Q8725j0641l5801J2416p862l6609M417p054L2217m8432q2644k8005
12159A878P0585m071k612j2653j4601M119L4546j5424R6763Q521k3188O101J2821
12146A62785M511K4671j6756m5407P306n6331p8989j4748K2089J3370K2325M3661
12134H8487L6096j3211k5366m9438P896K1346n6451p180J817j9122j6259M8794
$$ plain form
12219 409386 377517 323838 306555 352199 307456 321649 339131 327641 293701 266043 295228
12208 295228 343214 303227 259865 259206 296894 284803 217739 205874 236229 270408 278494 250106
12196 250106 221664 202609 175111 183855 188472 168230 102908 75853 71362 137345 138630 89201
12184 89201 76808 90053 80907 44090 73535 138426 124849 132847 132679 108806 84708 76970 121151
12171 121151 209876 199235 163434 175850 167988 131379 135796 128742 160959 112527 29883 1878
12159 1878 72463 68392 65780 53127 38526 42645 77191 61767 158530 167051 143863 149964 162785
12146 162785 167296 191967 175211 129804 137110 80779 1790 -12958 9131 22501 44826 88487
12134 88487 124583 111372 86006 36568 44464 65810 9359 2179 3996 -15126 -31385 17409
12122A7409J10525j2181l8261m659j9943R853q900R63J608l9338j010j8310o888
12109i132L5106K7797m9498k2160J4030M1023L5314J5966P897n4141k9879O523
12097A8846Q2379l6949m9134r39R612K2537L3061J912k7093l078j978L7368R512
12084I6056k1346n057j2359k2905K4170N0244l1890p1982j1363L4420J5205J2572
12072E5765k9286k8547N2509Q4979j838r259p982o186n6298n9065K898K14M3221
12059D1125n054k1335J549N0995j9640j7014K6354m3545k7247j4944l3942M2686
12047b0012P1656p304j5054k3862n9714j7360Q523M8396M4235K3808q588L564
12035D8288N939L6101k9495k1347j2317M4302K0400l3531m2801Q731j1828r340
$$ plain form
12122 17409 127934 115753 77492 72833 52890 62743 53843 54806 56414 17076 16066 -2244 -9132
12109 -9132 25974 53771 4273 -17887 -3857 37166 72480 88446 96343 42202 12323 18846
12097 18846 101225 64276 15142 14203 23815 46352 79413 81325 54232 51154 49176 86544 96056
12084 96056 74710 69653 57294 34389 58559 108803 76913 4931 -6432 27988 43193 55765
12072 55765 26479 -2068 50441 135420 133582 124323 116341 110155 53857 -5208 -2310 -2096 41125
12059 41125 36071 14736 16285 67280 47640 30626 56980 13435 -13812 -28756 -62698 -20012
12047 -20012 51644 44340 29286 5424 -54290 -71650 -63127 -14731 29504 53312 44724 48288
12035 48288 54227 90328 60833 39486 27169 71471 91871 58340 15539 24270 12442 3102
12023C102J5018k0257j8123K28j8055K537j0947k9440M9793O3418O895n1206r622
12010a6659O1245j4984j718l056j8090o6581o72P684M3521K0835L3264m4621k4736
11997b4568j1231N952K5152J272o140N8408M445o9762k7676P8031M8700Q0423
11985A63006J0791n0405j8623j8340J3950M151n8857K2893L7301K6438N566j6592
11973A21279j2046m5329l168L338K600N5962l1017K049k0444K336k4764m2464
11961H332l2302J7741j9145l0924L5035l192o278p41j3629N893O4440K2157k7150
11948B0237j2921j9779k0637K2410P7105p243n8532n2686l8213K0368R348K2003
11936c8540J0981K4612K7267J9767l3202m0366J0956J0893k5789k4292j588j8523
$$ plain form
12023 3102 18120 -2137 -20260 -20032 -38087 -35550 -46497 -75937 -26144 37274 44169 -7037 -16659
12010 -16659 44586 29602 27884 24828 6738 -59843 -60515 -52831 -9310 11525 44789 168 -24568
11997 -24568 -35799 -29847 -4695 -3423 -9563 48845 53290 -16472 -44148 33883 82583 163006
11985 163006 173797 123392 104769 86429 100379 104530 45673 68566 105867 132305 137871 121279
11973 121279 109233 63904 60736 64074 66674 122636 91619 93668 73224 75560 50796 8332
11961 8332 -23970 -6229 -25374 -56298 -21263 -24455 -30733 -31474 -45103 -39210 25230 47387 20237
11948 20237 7316 -12463 -33100 -10690 66415 59172 640 -52046 -90259 -69891 -60543 -38540
11936 -38540 -27559 -2947 24320 44087 10885 -29481 -18525 -7632 -33421 -57713 -59301 -77824
11924g7824O8167M5405m2746k8481K1560m307K1481L4888r303l9098N855K2778
11912A8375K0355L996l6858m0720M7364L4887K417k3644j0619j2892o0036l838
11900f1213M0487N5040L5329o1155L178N9774k3821n3728k6027J2136M1992M6101
11888F8093l3938q0777o3016k9587N3894J7442K4699O4512K9904N7756K1934j6050
11876A14866k4206n4358k0844j7992J4886j6596k6741J1472k6640j4295L5010
11865b5438m0737J2672M8533O8200m5461k6781q886K8301J3601J2231k8388k2185
11853a4338M0316n623J4340m0263j9458m0508J7366N5321p557k7851m4521Q977
11841f3799P837m350K9683K1894j3548K0607J0598j5626l6871l4646N6861J4151
$$ plain form
11924 -77824 -9657 35748 -6998 -35479 -13919 -18226 3255 38143 28840 -10258 -4403 18375
11912 18375 38730 42726 5868 -34852 12512 47399 49816 26172 15553 2661 -57375 -61213
11900 -61213 -20726 34314 69643 8488 11666 71440 47619 -6109 -32136 -20000 21992 68093
11888 68093 34155 -46622 -109638 -139225 -85331 -67889 -43190 21322 51226 108982 130916 114866
11876 114866 90660 36302 15458 -2534 12352 -4244 -30985 -19513 -46153 -60448 -25438
11865 -25438 -66175 -53503 -4970 63230 17769 -9012 -17898 10403 24004 36235 7847 -14338
11853 -14338 25978 20355 34695 -5568 -25026 -65534 -48168 7153 -404 -28255 -72776 -63799
11841 -63799 -55962 -60312 -30629 -8735 -22283 -1676 8922 -6704 -43575 -78221 -21360 -7209
11829g209j049k9323l3459k5347k5393J3333N5385L2443K0721K2947k8224o3833
11817f9008K4054L0381l9604j7543o207j5478L0293M3601K8557K6261p8439m2877
11805h6009n3366L358K2634N4248J0869j9496k9449L1700L3666M4862k3662l9747
11793e0392j5886k6505k1419K7020j9277j4982M1216J0771j6213k4307k6298J05716
11781c0556R5643J1434k7705l0206R932m8196j4384M5484p8364p2721k9478N1399
11769a17718Q3497J5979K5824J7084o2474m8926O0519P5127l5865l6891m1207
11758f5051K1769P4059j2386k3663p322o1620l2239M1668L9667l9620l6184N3689
11746d7233N4432K5661M6345J329J703L74l9022J1182M9911r933p1636n5755k0420
$$ plain form
11829 -7209 -8258 -37581 -71040 -96387 -121780 -108447 -53062 -20619 102 23049 -5175 -69008
11817 -69008 -44954 -14573 -54177 -71720 -77927 -93405 -63112 -19511 9046 35307 -43132 -86009
11805 -86009 -139375 -136017 -113383 -59135 -48266 -67762 -97211 -65511 -31845 13017 -10645 -50392
11793 -50392 -66278 -92783 -114202 -87182 -106459 -121441 -80225 -69454 -85667 -109974 -136272 -30556
11781 -30556 65087 76521 48816 18610 28542 -19654 -34038 11446 -66918 -139639 -169117 -117718
11769 -117718 -34221 -18242 7582 24666 -37808 -86734 -26215 48912 13047 -23844 -65051
11758 -65051 -43282 30777 18391 -5272 -12594 -74214 -106453 -64785 -25118 -64738 -100922 -47233
11746 -47233 7199 32860 79205 80534 82237 82611 43589 54771 104682 94749 23113 -32642 -53062
11733e3062o5526J1308L7905j765j4618L3201p804K798p044j4699K2561Q995j8517
11720f6267M9255O617k5962L9412m2423q057P931J9008K3550k990k4525j0137
11708c4588m037L9974M8794j1057R012q033r661K656k6753o882k8974q889k6347
11695f4785J5177J0391l2804K5597N2494j77k7655o635k6810j4624j0115L0317
11683d9629M014J7871L609M5292j018q4199l6200K922L3970K434l0164J7534R24
11670g2640M7160J9303j320j1037N18J14R270j8914O422K0553K3015J742k3479
11657G07m4710k5977k7524K0118M3432P4936K4409k2803n1738p4353L6513r91
11645d7981k4669l2616l9722K8061M0768J1458m1893r092J8337P8774j4742K5797
$$ plain form
11733 -53062 -118588 -107280 -69375 -71140 -85758 -52557 -60361 -57563 -64607 -79306 -56745 -47750 -66267
11720 -66267 -17012 -10395 -36357 3055 -39368 -47425 -39494 -20486 3064 74 -24451 -34588
11708 -34588 -38625 1349 50143 39086 48098 40065 30404 33060 6307 -575 -29549 -38438 -64785
11695 -64785 -49608 -39217 -72021 -46424 6070 5893 -21762 -28397 -55207 -69831 -79946 -49629
11683 -49629 -45615 -27744 -24135 21157 20139 -64060 -100260 -97338 -63368 -60934 -91098 -73564 -72640
11670 -72640 -25480 -6177 -7497 -18534 -18016 -17902 -8632 -27546 -21124 -571 22444 24186 707
11657 707 -44003 -69980 -97504 -77386 -33954 40982 65391 42588 -9150 -83503 -46990 -47981
11645 -47981 -72650 -105266 -144988 -116927 -76159 -64701 -106594 -115686 -97349 -18575 -33317 -7520
11633g520j2134L9991M66o2136J0085j6321K267l154K6172J738l8539k590j154
11620f2829K2603L248L2393j7705n0088k067J49K956N2788k674j1758q757j0114
11607e1855l5311k293o1345j200O3646L867J916K5649O970L5911j9003j3119L3888
11594a2279j2411m1330J5210j043j029J6071q537j0361n3686k4926N4466M1671
11582c8184j8612K2842j5102P579L7792M1961l8733M826L4827K7571p3515n8548
11570f5296N1747k6082n4685N0546O102L1983L2755k7727k4146o8038k3369m368
11558a20578J4776o31L4107k5725L0752M8141O5717j6379l0550l8598J631k8819
11546f6156j4051L1972j1792O194N3864J8319r38Q538k5686n8276l6934Q200O4506
$$ plain form
11633 -7520 -19654 20337 20803 -41333 -31248 -47569 -45302 -48456 -22284 -20546 -59085 -61675 -62829
11620 -62829 -40226 -36978 -4585 -22290 -72378 -74445 -74296 -71340 -18552 -21226 -32984 -41741 -51855
11607 -51855 -87166 -89459 -150804 -152004 -88358 -84491 -82575 -56926 -49956 -14045 -33048 -46167 -12279
11594 -12279 -24690 -66020 -50810 -51853 -52882 -36811 -45348 -55709 -109395 -134321 -79855 -38184
11582 -38184 -56796 -33954 -49056 -41477 -3685 38276 -457 4369 39196 66767 -6748 -65296
11570 -65296 -13549 -39631 -94316 -43770 -37668 -5685 27070 -657 -24803 -92841 -116210 -120578
11558 -120578 -105802 -106433 -72326 -98051 -67299 -19158 46559 30180 -370 -38968 -37337 -66156
11546 -66156 -80207 -48235 -60027 -53833 31 18350 17412 25950 264 -58012 -94946 -86746 -22240
11533b2240L7351q852p363k0990k2117K2843M4839M550n2870J1617N3119J1070
11521E0957j9629o6232L980n0892m4474q208K6334k018N8090M4952n7641r7512
11509a62293Q846R520k0099L5868N0300P5J0990K4052L9014n006n9463q315K9545
11496d6966J0950n6707Q56J4753n518K748O1394R723J2552J5320J1537o2622m8795
11483h0775l0898m453k4619L7547Q5577J821j1802k3438P155k6954n990K9469
11471d7360K3614J677k3512j1139J0362K9232j200N5696l486J704K317l9113k1613
11458b2821p828p0577l2596O5629K0309J6068l8451p0147l285N2082L2423l0330
11446h9524K0268K8515M8302m285l0530m2483j2063M0954k077k9424L607l8122
$$ plain form
11533 -22240 15111 6259 -1104 -22094 -44211 -21368 23471 28021 -24849 -13232 39887 50957
11521 50957 31328 -34904 -30924 -81816 -126290 -134498 -108164 -110182 -52092 -7140 -64781 -162293
11509 -162293 -153447 -143927 -164026 -128158 -77858 -77783 -66793 -42741 -3727 -8733 -68196 -76511 -46966
11496 -46966 -36016 -92723 -91867 -77114 -82632 -79884 -18490 -8767 3785 19105 30642 -31980 -80775
11483 -80775 -111673 -116126 -140745 -103198 -17621 -15800 -27602 -51040 -43885 -70839 -76829 -47360
11471 -47360 -23746 -22069 -45581 -56720 -46358 -17126 -18326 37370 33884 35588 37905 -1208 -22821
11458 -22821 -30649 -101226 -133822 -68193 -47884 -31816 -70267 -140414 -143699 -91617 -59194 -89524
11446 -89524 -69256 -40741 7561 3276 -27254 -69737 -81800 -40846 -42923 -72347 -68740 -106862
11434a06862j1446K290K8098J6753N0189J786j2103m583L3859L9331J2666J6931
11422F6909l5254o0733j9239j735J2953j4575o926o323l3018j4268M1305K9819
11410d1085L366n0133K5040k9013r167K0902L8370J0032K031P090j4736q626l0800
11397g6729l5121N3901P7539R820O279M305n1439k8357L9073M1977q701l6983
11385d436K6033J4192p2538j0654j8222M7739J1444K7523m4962q8998n9366K3858
11373a48387L924J9335K2292o13M3050J6798l090m1645j1422J3972o090N2967
11361c8909K7175l1847J5484K351j9778j2415j4129R018L8489K8767K8163j576
11349C0793k3080n6156l8366K6005j6598m5882k3752L2269Q3943O6983r931l3749
$$ plain form
11434 -106862 -118308 -116018 -87920 -71167 -20978 -19192 -31295 -35878 -2019 37312 49978 66909
11422 66909 31655 -29078 -48317 -50052 -37099 -51674 -58600 -64923 -97941 -112209 -70904 -41085
11410 -41085 -37719 -87852 -62812 -91825 -100992 -80090 -41720 -31688 -29657 -22567 -37303 -45929 -76729
11397 -76729 -111850 -57949 19590 29410 35689 39994 -11445 -39802 -729 41248 32547 -4436
11385 -4436 21597 35789 -36749 -47403 -65625 -17886 -6442 21081 -23881 -112879 -172245 -148387
11373 -148387 -144463 -125128 -102836 -103449 -60399 -43601 -46691 -88336 -99758 -85786 -91876 -38909
11361 -38909 -11734 -43581 -28097 -25746 -45524 -57939 -72068 -63050 -24561 4206 32369 30793
11349 30793 7713 -48443 -86809 -60804 -77402 -123284 -147036 -114767 -30824 36159 26228 -7521
11337g521j5851Q515K1023K1755p9619p7243r338L3161K1156L3562O5360P9163
11325I4123k2221o2361l7387J6384P609l8478m3708L0820J3055j9589o909K435
11313f6227k4347J7663Q330p941M6200j8255q644o6018O2816K5316l0260O854
11301e4513k4509k2135L2942M1958K1867J0523m078j6892q384K7386M6737K4770
11289G5672K2992p859k4954k6599k7392K2693j1202J9392N027n8303r7980M7472
11277f1041O4516Q4690k895j03659n5085J5846J4881l3363l007M5815L480n7390
11265h7212k1023Q75j8664p516L4860O458M7493R2094k7452J2055K7803P687m0838
11252B6620k4320m5215k769j2169k7906l6334K2875j1665n8916k4492l596R6325
$$ plain form
11337 -7521 -23372 -14857 6166 27921 -51698 -128941 -138279 -105118 -83962 -50400 14960 94123
11325 94123 71902 9541 -27846 -11462 -3853 -42331 -86039 -55219 -42164 -61753 -68662 -66227
11313 -66227 -90574 -72911 -64581 -72522 -26322 -44577 -53221 -119239 -56423 -31107 -61367 -54513
11301 -54513 -79022 -101157 -68215 -26257 -4390 6133 2055 -14837 -23221 4165 50902 75672
11289 75672 98664 90805 65851 39252 11860 34553 23351 42743 47770 -10533 -108513 -61041
11277 -61041 3475 88165 85270 -18389 -73474 -57628 -42747 -76110 -79117 -33302 -29822 -87212
11265 -87212 -108235 -107360 -126024 -133540 -98680 -92222 -44729 47365 19913 31968 59771 67458 26620
11252 26620 2300 -42915 -45684 -57853 -85759 -122093 -99218 -110883 -169799 -194291 -197887 -101562
11240a01562O1403L9943k5504o7234k6583l2943j3069N7673N1848k1267q233J0319
11228g5209o991M5508L59J6366j5555n2367J6761m3578m9479M901M6264N847J6020
11215i1153K5784N3795M6966n858k5875l6726N164l286K3662k1604m1800L2677
11203c8254O932j3772k625L250j8516K9623N0978k3940j4201J6819Q24l1755j1314
11190d5951L3481L1648m2272k8274m2828m8836M5494M0352J8548L5476J7680K789
11178A7307j5247j5274O4777q811j03849p3611K9755K5332L4942L9904O7265n8246
11166D244j895M9285L7809k8837q5678l1232K8268K7445J2559o0785M2380L1290
11154B4853n8563k4610R186O7218M7404L6807N9046q093l6764o3000m5743J6744
$$ plain form
11240 -101562 -40159 -216 -25720 -92954 -119537 -152480 -165549 -107876 -56028 -77295 -85528 -75209
11228 -75209 -82200 -36692 -36333 -19967 -35522 -87889 -71128 -114706 -164185 -159284 -113020 -107173 -91153
11215 -91153 -65369 -11574 35392 29534 3659 -33067 -27903 -31189 -7527 -29131 -70931 -38254
11203 -38254 -31322 -45094 -47719 -44469 -62985 -33362 17616 -6324 -20525 -3706 -2882 -34637 -45951
11190 -45951 -12470 19178 -23094 -51368 -94196 -143032 -97538 -57186 -38638 -3162 14518 17307
11178 17307 2060 -13214 51563 42752 -61097 -134708 -104953 -79621 -44679 -4775 62490 4244
11166 4244 2349 51634 89443 60606 -25072 -56304 -28036 -591 11968 -48817 -6437 24853
11154 24853 -33710 -58320 -49134 18084 65488 102295 161341 153248 116484 53484 7741 24485
11142B4485q817q1424j1652K6414L2893J4177r585K6600J31067J880o6399j02010
11130b2371L121O0935K5102K3642k4643o6209Q161M2198n889k4185l5659p5068
11118i0865k9438P7425J6987r691K7828j7778k2220o2862K0731N8650M7018Q796
11106B4581l946l3957n2413K9316K8911j909k0183j5565k1989K2257K3361L2872
11094A1336k9461k6380P9090O9405J7185N224K5680L8792J0676l5565J0467L3796
11082B10245l8522m0305l3786L0839O0658j5300K9410m015r2646k3266K0169l4369
11070F9112k6490j6805K7263L4160q603o6279p1103r764K6286J6846J1722l4459
11058d8114k0622M1495k9999l6171J4406K8069P017l9261K425P8922Q0085N5908
$$ plain form
11142 24485 15668 -65756 -77408 -50994 -18101 -3924 -13509 13091 144158 146038 79639 -22371
11130 -22371 -19250 41685 66787 90429 65786 -423 7738 49936 44047 19862 -15797 -90865
11118 -90865 -120303 -42878 -25891 -35582 -7754 -25532 -47752 -110614 -89883 -31233 15785 24581
11106 24581 20635 -13322 -65735 -36419 -7508 -9417 -29600 -45165 -67154 -44897 -21536 11336
11094 11336 -18125 -44505 34585 103990 121175 126399 152079 190871 201547 165982 176449 210245
11082 210245 171723 131418 97632 128471 189129 173829 203239 199224 106578 83312 103481 69112
11070 69112 42622 25817 53080 87240 78637 12358 -58745 -68509 -42223 -25377 -13655 -48114
11058 -48114 -68736 -27241 -57240 -93411 -79005 -50936 -43919 -83180 -80755 -1833 78252 134160
11046A34160N3119N8234l0307n667l7660n9033m5744l2497J9618L0842o374J7023
11034I5714q403j098l3780j1569J6070k4502m4279M0460J7943q219j1080l325
11022B3932m8901L5052K1244N241K105K7J656M6645m509n4688m5742l9893J1278
11009d6553J4596M1745R74L8804M7172k6522k7179L9150O863j5527l8182J0921
10997D6262P285l8267l3680J0751Q04j3383L1258n067l7679l0933l9345q879N1782
10984e9091J0393J2135j8660K0403M1455J8288q522j5913j9785O210j9358j6381
10972d8826M1122m2J8707M1955j973j0097K795m6539l5638j7526L2354M1149K1509
10959C8950n2921k0996l870L1520J3356J8948n586k6062m1972N291M2970m9873
$$ plain form
11046 134160 187279 245513 215206 209539 171879 112846 67102 34605 54223 85065 78691 95714
11034 95714 87311 86213 52433 40864 56934 32432 -11847 28613 46556 38337 27257 23932
11022 23932 -24969 10083 31327 36568 38673 38700 40356 87001 82492 27804 -17938 -57831 -46553
11009 -46553 -31957 9788 10762 49566 96738 70216 43037 82187 89050 73523 35341 46262
10997 46262 53547 15280 -18400 -7649 -6845 -20228 11030 5963 -31716 -62649 -101994 -110873 -59091
10984 -59091 -48698 -36563 -55223 -34820 6635 24923 16401 488 -19297 -13087 -32445 -48826
10972 -48826 -7704 -7746 10961 52916 50943 40846 43641 -2898 -38536 -56062 -23708 17441 38950
10959 38950 -13971 -34967 -38837 -7317 6039 24987 19401 -6661 -48633 -43342 -372 -50245
10947e0245M3213L8821j9781k0277l6956o6710k162K3145M7367L1224J8981j5188
10935h568l7963j2466K07K0255K863j5883j062L0345J4507q31M7903p121k0280
10922A1906n9716J3186K3907K753J3826J5152O2206k9841j09040J9561O2277o6327
10910d0150j9939K9207K0595L3362P671l0775l2267N5684j2378p611k6603K5199
10898A995m103J4858k9099L7939R210r044j5193m3706J4276N5270M8998J5589
10886I6990j2956n927j7292k5317P271j7351k3573j2312j6478p6338k3696R7537
10874b9442q568l0637K9196p124J095K3081J0600J4887J5545k0550n3238R200
10862d5955j8l8258n6597L1330O3657J6557k0281K2866N5712M9830K0367j0423
$$ plain form
10947 -50245 -7032 31789 12008 -8269 -45225 -111935 -114097 -90952 -43585 -12361 6620 -8568
10935 -8568 -46531 -58997 -58790 -38535 -35672 -51555 -52617 -22272 -7765 -8596 39307 32186 11906
10922 11906 -47810 -34624 -10717 -7964 5862 21014 83220 53379 -55661 -36100 26177 -40150
10910 -40150 -60089 -30882 -10287 23075 30746 -29 -32296 23388 11010 3399 -23204 1995
10898 1995 -2108 12750 -16349 21590 30800 21756 6563 -37143 -22867 32403 81401 96990
10886 96990 84034 78107 60815 35498 42769 25418 1845 -10467 -26945 -103283 -126979 -29442
10874 -29442 -38010 -68647 -39451 -46575 -45480 -22399 -11799 3088 18633 -1917 -55155 -45955
10862 -45955 -45973 -84231 -140828 -109498 -45841 -29284 -49565 -26699 29013 78843 99210 88787
10850H8787L794K5006k9598J1626N7074J2252J7099N3278O4527L1620l6423p6306
10838B22736l8557L878k0082j857r6305k1651m4537n1447l6647l5162L1424P2031
10826a6176J4093j6233l3823j0765j3606j4403J0996N5296j7362m7079L8126N8692
10814G756M4047j3681k6085l3701J7101L3840O2450o636p444O10J3401j408m02
10801H9848J2295M9522J30762J08088K6440m1941p5418q3700p6042k5941p6873
10790C7040q322J6662l4645k0238o834q68k3676l536K9793N7641n5578l1902K0744
10777b3719L3913l4810p7496j0963O0992L202k7347J1050P872j5839L1615J4220
10765b7310J240Q893k4229k686N0688J7693j7021k4143K3234J5979n006L3002
$$ plain form
10850 88787 92581 117587 87989 99615 156689 168941 186040 239318 303845 335465 299042 222736
10838 222736 184179 188057 167975 166118 69813 48162 3625 -47822 -84469 -119631 -88207 -16176
10826 -16176 -2083 -18316 -52139 -62904 -76510 -90913 -79917 -24621 -41983 -89062 -50936 7756
10814 7756 51803 38122 12037 -21664 -4563 29277 91727 85091 77647 78257 91658 90250 89848
10801 89848 102143 151665 282427 390515 416955 375014 299596 215896 139854 113913 37040
10790 37040 28718 45380 10735 -9503 -16337 -17205 -40881 -44417 -14624 43017 -12561 -44463 -23719
10777 -23719 10194 -24616 -102112 -113075 -52083 -48881 -76228 -65178 -57306 -73145 -41530 -27310
10765 -27310 -26070 -17177 -41406 -44092 6596 24289 7268 -16875 6359 22338 17332 50334
10753E0334P5857K93K935m7263j5859M7961L9657p503J3085N624p6087l9522J9865
10740F9377j2845p8834k4469M2072L7000L7976K063m2840l9679k4927q815J4634
10728b9287k6447l801J2961r115k9162J6401j060m626M1184J2725J2861K3746
10716A6380n8524j0406Q791L3772N4046K6771J9941k3521r5123l2993J4200o364
10704e3030M549J9960j7640n7346q412L1984K1085j3206l7305M8786J6781J2276
10692c1518J7153q737j3853K207k5806L868j6422l1233o970K3018J5288K607j6026
10679h6424J0490K6659N1014L7923k408K5006k8546N398j7226K5154J0887m0356
10667A7571o220L6039K3008n5095l1266L551M5936K4902p582k8886r229n547k1006
$$ plain form
10753 50334 126191 126484 129419 82156 66297 114258 153915 146412 159497 165121 89034 49512 69377
10740 69377 56532 -22302 -46771 -4699 32301 70277 72340 29500 -10179 -35106 -43921 -29287
10728 -29287 -55734 -59535 -46574 -55689 -84851 -68450 -69510 -74136 -32952 -20227 -7366 16380
10716 16380 -42144 -52550 -43759 -9987 44059 70830 90771 67250 -27873 -60866 -46666 -53030
10704 -53030 -48481 -28521 -46161 -103507 -111919 -79935 -58850 -72056 -109361 -60575 -43794 -31518
10692 -31518 -14365 -23102 -36955 -34748 -60554 -56686 -73108 -104341 -111311 -88293 -73005 -70398 -86424
10679 -86424 -75934 -49275 1739 39662 37254 62260 33714 39112 21886 47040 57927 17571
10667 17571 11351 47390 70398 15303 -15963 -12412 33524 58426 50844 21958 12729 7182 -13824
10654a3824L5171K4197j8004l1013j6748L751j2421R906L8878j1010j1822l3044
10642c5983N8956L8713k8701k8861n7212N3997J6246j3526l8903l4942M3466J9772
10630f978j4822J8127K5165K9213L2575r051j8696k440l1234Q003M2493J4686
10618H7041m3569k6504R672J2182m5209K053N176j1407l7167k5433P219Q305M1169
10605a6472O1062l5354k5388J2020M0233N2411K214l7371m5405l099L2123J9582
10593E6556k4225K5607K1919o5249p0078K8091M7395J2375R637K0908k7437L0372
10581F5871O1348k2936K6416l5781m3844n5682r323Q8802Q573K0516J03176J493
10569B08629k9462J4164J4245q8515n5794J7244k6529m3469J089j1324l7966m8874
$$ plain form
10654 -13824 21347 45544 27540 -3473 -20221 -16470 -28891 -18985 19893 8883 -2939 -35983
10642 -35983 22973 61686 32985 4124 -53088 909 17155 3629 -35274 -70216 -26750 -6978
10630 -6978 -21800 -3673 21492 50705 83280 74229 55533 53093 21859 29862 72355 87041
10618 87041 43472 16968 26640 38822 -6387 -4334 842 -10565 -47732 -73165 -65946 -57641 -16472
10605 -16472 44590 9236 -16152 -4132 36101 88512 90726 53355 7950 4851 36974 56556
10593 56556 32331 57938 79857 14608 -55470 -27379 20016 32391 42028 62936 35499 65871
10581 65871 127219 104283 130699 94918 51074 -4608 -13931 74871 83444 103960 207136 208629
10569 208629 179167 193331 207576 119061 63267 80511 53982 10513 11602 278 -37688 -86562
10557h6562N1781N6068k464k9832Q1021n1606p8883l3449J064K5098j8143J3822
10545g2085O7707k725n538O052L569J042L4850M1989L7671p074r5068l0566N069
10532a5107L2161M9908M423J0155N0482k3758l8184m0206K1018j7031o5239n8473
10520h9851j5921O3845J729K396K0016l019J7447k1740q944q374l4314j7848K3559
10507g1019M7036l2863K6646M2181O4122k8602m6327j7101J7736N1978k7889m359
10495B1539M979J0186O5298M7735l990o4146o563o312L867L8695Q30k3554m4468
10482D4096K1449J1335L933J2526r968O419K1746k5485O761M0950k639j1684l9572
10469G9867j6955M863l6669M3918K9431l4497O5510K7262j8681N1225R9787J05369
$$ plain form
10557 -86562 -34781 21287 18823 -11009 70012 18406 -60477 -93926 -92862 -67764 -85907 -72085
10545 -72085 -4378 -7103 -12641 -6589 -3020 -1978 32872 74861 112532 105458 10390 -20176 -15107
10532 -15107 17054 66962 71385 81540 132022 108264 70080 29874 50892 33861 -31378 -89851
10520 -89851 -105772 -41927 -40198 -37802 -17786 -20805 -3358 -25098 -34042 -42416 -76730 -94578 -71019
10507 -71019 -23983 -56846 -30200 11981 76103 47501 1174 -15927 1809 53787 25898 21539
10495 21539 26518 36704 102002 149737 145747 81601 75038 68726 72593 111288 112118 88564 44096
10482 44096 65545 76880 80813 93339 83371 89790 111536 86051 92812 133762 131123 119439 79867
10469 79867 62912 67775 31106 75024 104455 69958 135468 162730 144049 195274 295061 400430
10457D00430N7735J11703J36795K06996L55836N19688N88551M22861J89358k42829
10447B747124m81317m29194l18635j94560j44616j40235j43554j37014p2046n3186
10437F32767o9845m4646o3725k9455l230o357p1473q1520o776K7990p4120j2962
10425A96648l0645k837o8375J0201L6362M8055K7270R212l2208p9351n7326j3721
10413D3285J7641j4895j1650p352l844k9175k0720j745L1531L9604K1974J7213
10401H1867k5586J4307N789j5652j6422Q017k1613k5732j3014O0639K3582J6094
10389I2276P590J7l2267j09142Q581J8919K117J3992l7643J4884q915L3085j7138
10376a3644l8166L9579o779r028N541K2232N625l6499k5908j2707l3042K4269
$$ plain form
10457 400430 458165 569868 706663 913659 1269495 1789183 2377734 2800595 2989953 2747124
10447 2747124 2265807 1836613 1517978 1323418 1178802 1038567 895013 757999 685953 632767
10437 632767 562922 518276 454551 425096 421866 415509 344036 262516 255740 283730 209610 196648
10425 196648 166003 163166 94791 104992 141354 189409 216679 225891 193683 114332 57006 43285
10413 43285 60926 46031 34381 27029 23185 -5990 -26710 -28455 3076 42680 64654 81867
10401 81867 56281 70588 76377 60725 44303 52320 30707 4975 -8039 52600 76182 92276
10389 92276 99866 99883 67616 -41526 -32945 -14026 -11909 2083 -35560 -20676 -29591 3494 -13644
10376 -13644 -51810 -12231 -19010 -28038 -22497 -265 5360 -31139 -57047 -69754 -102796 -78527
10364g8527J5732M2393Q210j1896m4690K2126n528K3660L1439j502K6208j2677
10352A4948n3829P195K5887N8617N26j4270L0731P768m4567n3969l5557K8633
10340b7887M356R683m4595n7223O614r666L9669K2268j401N0927J0693K2745r086
10327A7097l4694J7015M0932N570J9744l505k9698L6100J2724j6783j4347j8725
10315C1430R78M0972k286k1203Q982k9544k2609O006L4155K4630K8039J1372l0209
10302H0713n9918m4490k3307l088N9870J7279k1760k0183l5108k5564k7565L9245
10290f3876N2682l7724p862N1431J3119l1519L1989n218l1016O4637K0397k5625
10278C1415k7106l3161n3794l0132L1845L3391j9240n304j2063K9228K4971j1754
$$ plain form
10364 -78527 -62795 -20402 -12192 -24088 -68778 -46652 -52180 -28520 2919 1417 27625 14948
10352 14948 -38881 -31686 -5799 52818 53344 39074 69805 77573 33006 -20963 -56520 -27887
10340 -27887 -23531 -13848 -58443 -115666 -109052 -118718 -79049 -56781 -58182 -7255 3438 26183 17097
10327 17097 -17597 -582 40350 45920 65664 62159 32461 68561 81285 64502 50155 31430
10315 31430 32408 73380 71094 49891 58873 29329 6720 12726 46881 71511 99550 110922 80713
10302 80713 20795 -23695 -47002 -50090 9780 27059 5299 -14884 -49992 -75556 -103121 -63876
10290 -63876 -11194 -48918 -56780 -5349 7770 -23749 8240 3022 -27994 36643 57040 31415
10278 31415 4309 -28852 -82646 -112778 -80933 -47542 -66782 -72086 -84149 -54921 -29950 -41704
10266d1704j6183k5174K8078L4063L0456J4911L8181j8367j2339J6190j5264l5439
10254b591O700K6968r504j4609l1356R764l916M0631k3536n4680n427J0058J9813
10241c1685L3007j3590M2880q623m4110j1221O3121l576J9983P172J9645j8998
10229E4005M7094L6399J9709P4456l676o1059o525J5515l4789l4817l2635O400
10217H0077J7415J5707j6181o1335k3054N3289k7716l6362j8562N4424J4634j2540
10205C9796j8165K1061K2152o0613o8259P094q643N3167K5689k83K7540L797l4538
10192I795k7065l2460J3250N6049o956J9379N6128k0972O389L0770O1460J6725
10180A82492q1341j10994l8384j3570j4904N4433N6264R214j5890j6297L1439
$$ plain form
10266 -41704 -57887 -83061 -54983 -20920 9536 24447 62628 44261 31922 48112 32848 -2591
10254 -2591 4109 31077 21573 6964 -24392 -14628 -18544 22087 -1449 -56129 -61556 -51498 -31685
10241 -31685 1322 -12268 30612 21989 -22121 -33342 29779 26203 46186 53358 73003 54005
10229 54005 101099 137498 157207 231663 227987 166928 160403 175918 141129 106312 73677 80077
10217 80077 97492 113199 97018 35683 12629 65918 38202 1840 -16722 37702 52336 39796
10205 39796 21631 42692 64844 4231 -64028 -56934 -65577 -12410 13279 12996 40536 44333 9795
10192 9795 -17270 -49730 -36480 19569 12613 31992 88120 67148 73537 104307 165767 182492
10180 182492 101151 -9843 -48227 -61797 -76701 -22268 33996 43210 27320 11023 42462
10169D2462M7483L2452n6352o1334k8664k1219j0910J6777l3840j4895L3521L0858
10157b3661K0348K1586L3321M2749L498L0827k5161K4922j3022L6482J9293l5570
10145A35612k9452k5650J078L3437Q269r4498n2469m5205m0936p982K4423R291
10133h4082K3953P3338o525j2783J9192k2386J0156L2109L145o802j9939k5257
10121a5881j885k2340M2263L4372J5737R031J0475P350J02045Q5732N4424j8967
10109C02356r8466m6666m838L207j0825J669K7694J9635l2601n5594N8734j2394
10097A51911n7907L561k895l2201P510J6609k4210k5887Q18P534l6577P06k3249
10084a4277j3027L2516k774n06j796O622j5574r2659M2554N8940m1148l1306J5621
$$ plain form
10169 42462 89945 122397 66045 4711 -23953 -45172 -56082 -39305 -73145 -88040 -54519 -23661
10157 -23661 -3313 18273 51594 94343 97841 128668 103507 128429 115407 151889 171182 135612
10145 135612 106160 80510 81588 115025 123294 28796 -23673 -68878 -109814 -117796 -93373 -84082
10133 -84082 -60129 13209 6684 -6099 13093 -9293 863 32972 36117 29315 9376 -15881
10121 -15881 -17766 -40106 2157 36529 52266 61297 71772 79122 181167 266899 321323 302356
10109 302356 203890 157224 152386 155593 144768 146437 174131 193766 161165 105571 164305 151911
10097 151911 94004 97565 94670 62469 69979 86588 62378 36491 37309 44843 8266 8972 -14277
10084 -14277 -27304 5212 2438 1932 136 6758 -8816 -101475 -58921 19 -41129 -72435 -56814
10071e6814M3110Q2299K5904K3015P5183l6945K5004j3011m2851k2366r644m2975
10059D9909j2687j1760K8897P6101J932m9893r3380q562J6058J04L048m8154n5076
10046a03463k3087O8526Q5666L8972j703P472N9070l9212o0268n8854J948M2963
10034A8030L7939M5665L0076J2031k3239J06Q0054J05740J49647K01534L75520
10023A033103N79298M17449K16932K5807m99217m92533k22130j16182j27932j20588
10013F94007j46379p8475p8683l9859n6105k720K0939j4413o7182o2511l8993
10002A29626P030k4008l2736o8499N3832K3827k846m6762J8489N9003K2214n7633
9990H1537m6810j8789m2117l5988Q8325q883K6080O1268k9122j06323L733J5207
$$ plain form
10071 -56814 -13704 68595 94499 117514 192697 155752 180756 167745 124894 102528 92884 49909
10059 49909 37222 25462 54359 130460 132392 82499 -10881 -19443 -3385 -3281 -233 -48387 -103463
10046 -103463 -126550 -58024 27642 66614 64911 72383 131453 92241 31973 -26881 -24933 18030
10034 18030 55969 101634 131710 143741 120502 120608 200662 306402 456049 657583 1033103
10023 1033103 1612401 2029850 2246782 2272589 1773372 1280839 1058709 942527 814595 694007
10013 694007 547628 469153 390470 350611 294506 291786 312725 298312 231130 168619 129626
10002 129626 136656 112648 79912 11413 65245 89072 86226 39464 57953 116956 139170 81537
9990 81537 34727 15938 -26179 -62167 26158 17275 43355 104623 75501 -30822 -27089 -11882
9978a1882L3178k903l4372j2500M010K5011J4136K1428O2482l4625p696K2112
9966G8379J393k4690K5493n8316o5174J7614M181n821J8753o531j4928K9093P2885
9953G2331K2174l5654o4691L3485L108l1937n11J3224Q484k224K843J2709L1682
9940F5023N9905l8336n7390J1428Q952k9879M45P658k3869J3820K1678o0729J9109
9927b185n7143n8901j3802M8925K485k0826K6164L2467J6115J835M6699m7497
9915b5664J8069K465K36l4389J2268M4694J2931k6241N3082Q6892l1754Q306P4949
9902A95844P2618O5588N1051N4541J00721M4930L1280J9371L2011K6509N7094
9891G51558R3030J01008J07968M3828k1753q0133j10579m6036l4356j218M1472
$$ plain form
9978 -11882 21296 18393 -15979 -28479 -24469 542 14678 36106 98588 63963 56267 78379
9966 78379 79772 55082 80575 22259 -42915 -25301 -21120 -26941 -8188 -14719 -29647 -554 72331
9953 72331 94505 58851 -5840 27645 30753 -1184 -1695 11529 20013 17789 20632 33341 65023
9940 65023 124928 86592 29202 40630 49582 19703 20148 27806 3937 17757 39435 -21294 -2185
9927 -2185 -59328 -118229 -132031 -83106 -80621 -101447 -75283 -42816 -26701 -24866 21833 -25664
9915 -25664 -7595 -5130 -4894 -39283 -27015 17679 30610 4369 57451 144343 112589 120895 195844
9902 195844 268462 334050 385101 439642 540363 585293 616573 635944 667955 694464 751558
9891 751558 844588 945596 1053564 1097392 1075639 995506 884927 838891 804535 803317 844789
9880H44789L4204Q515p6655n5178n7457m2579r2938n3161o711K8534q3243q4264
9868C63856n0509q508l3385k4115J8591n063L4951j7535p0225K2505L306K9451
9856B63320L352k2258J4369N8666J8206j1033k743m7844n1035k5358P5381J1601
9844B84624l2866m7658m5089j6104m9238K6310M3692K9100P428k6916J4682O303
9832A94268j6678l4345j9875q504K0873J4178K3679k0804o5955K2935M2735j9153
9820A33354l2200l7804J0461m2783l5617J6568L478O6248P224m0056O546m4990
9808A0429K9056L676J569K5014j28J7270Q030j4440l1566M4121N6545R687k0822
9795A38441n2851k2174N503j1088l1408j877L0323R267k0795m2887M3478O8008
$$ plain form
9880 844789 878993 887508 810853 755675 698218 655639 562701 509540 502829 531363 448120 363856
9868 363856 313347 304839 271454 247339 265930 260867 295818 278283 208058 230563 233869 263320
9856 263320 266672 244414 258783 317449 335655 324622 321879 274035 223000 197642 273023 284624
9844 284624 251758 204100 159011 142907 93669 119979 163671 192771 200199 173283 187965 194268
9832 194268 177590 143245 123370 114866 135739 149917 173596 152792 86837 109772 152507 133354
9820 133354 101154 63350 73811 31028 -4589 11979 15457 81705 88929 48873 55419 10429
9808 10429 39485 43161 44730 69744 69616 86886 94916 80476 48910 93031 149576 159263 138441
9795 138441 85590 63416 68919 57831 26423 24546 54869 64136 43341 454 43932 111940
9783A11940L6466K3422k6122j1389r589M017Q798L3894J01333Q8897P4019J6695
9771D52381J9314J15134J42490J62360J54885J0661m0880J8553R2012M1079J27868
9760A295857J30891K10905L31297N01969P15509J117181J716718K526966L378841
9751A1926134L964261L645732K375673M28531j486648k632783k759772k410004
9743A3051124j914067j625310j402053j154414r36027p99313n95065n50869m26217
9734C647789l64755k34911j83760k23896j84756j25051j30515j70716j96150j30440
9724A702839l0557K436o6157q2490r4801q8134q778k8027p4529l4271q939l8439
9712A150153o5990p2600j14646m6187k898j4993L312k5274n1622j7412q159O561
$$ plain form
9783 111940 148406 171828 145706 134317 124728 128745 137543 171437 272770 361667 435686 452381
9771 452381 471695 586829 729319 891679 1046564 1057225 1016345 1034898 1126910 1167989 1295857
9760 1295857 1426748 1637653 1968950 2470919 3186428 4303609 6020327 8547293 11926134
9751 11926134 15890395 19536127 21911800 22340331 20853683 18220900 15461128 13051124
9743 13051124 11137057 9511747 8109694 6955280 6019253 5219940 4624875 4074006 3647789
9734 3647789 3283034 3048123 2864363 2640467 2455711 2330660 2200145 2029429 1833279 1702839
9724 1702839 1672282 1674718 1608561 1526071 1431270 1343136 1334358 1306331 1231802 1197531 1188592 1150153
9712 1150153 1084163 1011563 896917 850730 847832 832839 836151 810877 759255 741843 733684 740245
9700G40245j6020J9632p6973q2312l7991K8844j0822M485k7220j3635l8145l7079
9688D53009K1950M6833J5293o2001r29K9613L0621m8501n3239l9865R170j292
9676D00662L5206P223m7480L1170L410j9288l3782k705k7222L0551m0512l8199
9664B99034J1651L7481k8342l4265L4043J7624n0529m6612J9012L8642j9932J7027
9652B94834M3387m8172K9753M7429p67m6749n2259k4704K9556P2809K3564m8258
9640C20423K715K3937M1618M4666P971p210J1940K9070O7886J22251R5861J02276
9628H63404J26472J56576J14083J19569P4109n420p1132q2996j39025j06674l2740
9617A016226r5920j35450j09014r9724k5860k7586q5342n6548l9020j420N1222
$$ plain form
9700 740245 724225 743857 666884 584572 546581 575425 564603 569088 541868 528233 490088 453009
9688 453009 474959 521792 537085 475084 474155 503768 534389 485888 432649 392784 401954 400662
9676 400662 435868 443091 395611 426781 430191 410903 377121 374416 347194 377745 337233 299034
9664 299034 310685 348166 319824 285559 319602 337226 286697 240085 259097 297739 277807 294834
9652 294834 338221 290049 319802 367231 366464 319715 267456 242752 272308 345117 368681 320423
9640 320423 323138 347075 388693 433359 441330 434120 446060 475130 543016 665267 761128 863404
9628 863404 989876 1146452 1260535 1380104 1454213 1448793 1377661 1294665 1155640 1048966 1016226
9617 1016226 920306 784856 675842 576118 550258 522672 437330 380782 341762 340342 391564
9606C91564l8983l6945m8913n4085k5860L1240L3630K7923j1096L8670J480m4743
9594B63882j9259m9594o7644K391l1572L0133M4853l2863P127O0913l9359l2446
9582A36562J000M7468J1069j4492l0191k7679P206J1440l5300m890K7209k060
9570A27342j2025j0497n063n8596q816L7241k878m5525l2007N4537n797k6170
9558A1746J2179J0255j7921J3732o680m5900j0880O7877J3539J9450N6702j708
9546A22391m8836k7949m6046R028k0085J4315R294M0298L9802m0739m0887K2922
9534C3508j4409n148J3157L7474Q5682m9218o1334l1783k4507J5273L3721J031
9522C3447K0273K4553Q109j4697l2153R832K2907K1133j7716j7771m0845L7863
$$ plain form
9606 391564 352581 315636 266723 212638 186778 218018 251648 279571 268475 307145 308625 263882
9594 263882 244623 195029 127385 129776 98204 128337 173190 140327 147454 208367 169008 136562
9582 136562 137562 185030 196099 181607 151416 123737 130943 142383 107083 102193 129402 127342
9570 127342 115317 104820 99757 41161 32345 69586 66708 21183 -10824 43713 37916 11746
9558 11746 23925 34180 16259 29991 23311 -22589 -33469 34408 47947 67397 124099 122391
9546 122391 73555 45606 -440 8588 -11497 2818 12112 52410 92212 51473 10586 33508
9534 33508 19099 13951 27108 64582 150264 101046 39712 7929 -16578 -1305 32416 33447
9522 33447 53720 78273 86382 71685 39532 49364 72271 93404 75688 57917 17072 54935
9510E4935j9731J0213L67M3346L5897q0630n8323j4265N1799N6731l3764k8512
9498A8063k0553o96L0737m2276K1769l2828O4641r176p7300l9824K8255M0402
9486a8786j0371M4331L5762Q493l2049k5071m114j7576J9185r21L7291O6358K4482
9473A27014l677n3097k7836L4849j5718m4961Q722N6964P36k4805J0306K1557
9461I0054q564j8228j5M002j796L154K5164j2556k6990j9451L3718K4377j8957
9448G3912l5402J4578J5071q2606n2292L3050n9157m101M5300J5968k6236M9121
$$ plain form
9510 54935 35204 45417 45784 89130 125027 44397 -13926 -28191 23608 80339 46575 18063
9498 18063 -2490 -3186 27551 -14725 7044 -25784 38857 29681 -47619 -87443 -59188 -18786
9486 -18786 -29157 15174 50936 59429 27380 2309 -1805 -19381 -196 -1117 36174 102532 127014
9473 127014 123337 70240 42404 77253 61535 16574 25296 82260 82996 58191 68497 90054
9461 90054 81490 63262 63247 67249 65453 68607 93771 81215 54225 34774 68492 92869 73912
9448 73912 38510 53088 68159 -14447 -66739 -33689 -92846 -96947 -51647 -35679 -61915 -12794
$$ [...]
##END NTUPLES=NMR SPECTRUM
##END=
